##TITLE=Coffee green (TOSA01 0.1000g + 1.5mL buffer 50/50,  450uL extracto + 50uL (D2O+TMS))
without heating, vortex and centrifuged, temperature 0oC.
##JCAMPDX= 6.0         $$ Bruker NMR JCAMP-DX V2.0
##DATA TYPE= NMR SPECTRUM
##DATA CLASS= NTUPLES
##ORIGIN= Bruker BioSpin GmbH
##OWNER= Administrator
$$ 1.72 TOPSPIN		Version 2.1
$$ 2012-05-22 17:20:02.811 -0700  Administrator@X
$$ Compression mode = diff/dup
##.OBSERVE FREQUENCY= 400.13188211
##.OBSERVE NUCLEUS= ^1H
##.ACQUISITION MODE= SIMULTANEOUS (DQD)
##.ACQUISITION SCHEME= undefined
##.AVERAGES= 64
##.DIGITISER RES= 22
##SPECTROMETER/DATA SYSTEM= spect
##.PULSE SEQUENCE= noesygppr1d
##.SOLVENT NAME= H2O+D2O
##.SHIFT REFERENCE= INTERNAL, H2O+D2O, 1, 14.98001
##AUDIT TRAIL= $$ (NUMBER, WHEN, WHO, WHERE, PROCESS, VERSION, WHAT)
$$ ##TITLE= Audit trail, TOPSPIN		Version 2.1
$$ ##JCAMPDX= 5.01
$$ ##ORIGIN= Bruker BioSpin GmbH
$$ ##OWNER= Administrator
$$ $$ Z:/data/jwist/nmr/11-coffee-green-origin/12/pdata/1/auditp.txt
$$ ##AUDIT TRAIL=  $$ (NUMBER, WHEN, WHO, WHERE, PROCESS, VERSION, WHAT)
(   1,<2011-10-06 15:03:06.612 -0500>,<Administrator>,<TOPSPIN>,<go>,<TOPSPIN 2.1>,
      <created by zg
	started at 2011-10-06 14:54:11.815 -0500,
	POWCHK enabled, PULCHK disabled,
       configuration hash MD5:
       DA 63 81 1B EF 4C B5 72 B4 DF EA D9 B4 DB 4C 08
       data hash MD5: 64K
       4F 20 90 09 6E B7 BC B8 C0 BF 87 A1 BD F2 65 09>)
(   2,<2011-10-07 09:00:57.905 -0700>,<Administrator>,<X>,<proc1d>,<TOPSPIN 2.1>,
      <Start of raw data processing
       efp LB = 0 FT_mod = 6 PKNL = 1 PHC0 = 0 PHC1 = 0 SI = 32K 
       data hash MD5: 32K
       0D A0 66 AB 5D 42 F4 6F 4B BE 11 BD DA 88 41 A4>)
(   3,<2011-10-07 09:00:58.155 -0700>,<Administrator>,<X>,<proc1d>,<TOPSPIN 2.1>,
      <pk PHC0 = 22.12646 PHC1 = 0 
       data hash MD5: 32K
       D9 05 30 3D 7D EC 52 03 C6 66 09 1F 45 DA BC 4A>)
$$ ##END=
$$ 
$$ $$ hash MD5
$$ $$ FB F3 1B 23 CC D8 0D 47 07 42 2A 52 A2 1B AB C0
##$RELAX= 
##$RELAX= 
##$RELAX= 
##$RELAX= 
##$RELAX= 
##$RELAX= 
$$ Bruker specific parameters
$$ --------------------------
##$DU= <Z:>
##$EXPNO= 12
##$NAME= <11-coffee-green-origin>
##$PROCNO= 1
##$TYPE= <nmr>
##$USER= <jwist>
##$ACQT0= -8.12917621438668
##$AMP= (0..31)
100 100 100 100 100 100 100 100 100 100 100 100 100 100 100 100 100 100
100 100 100 100 100 100 100 100 100 100 100 100 100 100
##$ANAVPT= -1
##$AQSEQ= 0
##$AQ_mod= 3
##$AUNM= <au_prof>
##$AUTOPOS= <>
##$BF1= 400.13
##$BF2= 400.13
##$BF3= 400.13
##$BF4= 400.13
##$BF5= 400.13
##$BF6= 400.13
##$BF7= 400.13
##$BF8= 400.13
##$BYTORDA= 0
##$CFDGTYP= 0
##$CFRGTYP= 9
##$CHEMSTR= <none>
##$CNST= (0..63)
1 1 145 1 1 1 1 1 1 1 1 1 1 1 1 1 1 1 1 1 1 1 1 1 1 1 1 1 1 1 1 1 1 1 1
1 1 1 1 1 1 1 1 1 1 1 1 1 1 1 1 1 1 1 1 1 1 1 1 1 1 1 1 1
##$CPDPRG= <>
##$CPDPRG1= <>
##$CPDPRG2= <>
##$CPDPRG3= <>
##$CPDPRG4= <mlev>
##$CPDPRG5= <mlev>
##$CPDPRG6= <mlev>
##$CPDPRG7= <mlev>
##$CPDPRG8= <mlev>
##$CPDPRGB= <>
##$CPDPRGT= <>
##$D= (0..63)
$$ [...]
##$TP= (0..7)
150 150 150 150 150 150 150 150
##$TP07= 0
##$TPNAME0= <>
##$TPNAME1= <>
##$TPNAME2= <>
##$TPNAME3= <>
##$TPNAME4= <>
##$TPNAME5= <>
##$TPNAME6= <>
##$TPNAME7= <>
##$TPOAL= (0..7)
0.5 0.5 0.5 0.5 0.5 0.5 0.5 0.5
##$TPOFFS= (0..7)
0 0 0 0 0 0 0 0
##$TUNHIN= 0
##$TUNHOUT= 0
##$TUNXOUT= 0
##$USERA1= <user>
##$USERA2= <user>
##$USERA3= <user>
##$USERA4= <user>
##$USERA5= <user>
##$V9= 5
##$VALIST= <valist>
##$VCLIST= <CCCCCCCCCCCCCCC>
##$VD= 0
##$VDLIST= <DDDDDDDDDDDDDDD>
##$VPLIST= <PPPPPPPPPPPPPPP>
##$VTLIST= <TTTTTTTTTTTTTTT>
##$WBST= 2048
##$WBSW= 25
##$XGAIN= (0..3)
0 0 0 0
##$XL= 0
##$YL= 0
##$YMAX_a= 5792918
##$YMIN_a= -2403298
##$ZGOPTNS= <>
##$ZL1= 120
##$ZL2= 120
##$ZL3= 120
##$ZL4= 120
##$ABSF1= 0
##$ABSF2= 0
##$ABSG= 0
##$ABSL= 0
##$ALPHA= 0
##$AQORDER= 0
##$ASSFAC= 0
##$ASSFACI= 0
##$ASSFACX= 0
##$ASSWID= 0
##$AUNMP= <proc_prof1d>
##$AXLEFT= 0
##$AXNAME= <>
##$AXNUC= <1H>
##$AXRIGHT= 0
##$AXTYPE= 0
##$AXUNIT= <>
##$AZFE= 0.1
##$AZFW= 0.1
##$BCFW= 0
##$BC_mod= 0
##$BYTORDP= 0
##$COROFFS= 0
##$CY= 15
##$DATMOD= 1
##$DC= 0
##$DFILT= <>
##$DTYPP= 0
##$F1P= 0
##$F2P= 0
##$FCOR= 0.5
##$FTSIZE= 32768
##$FT_mod= 6
##$GAMMA= 0
##$GB= 0
##$INTBC= 1
##$INTSCL= 1
##$ISEN= 128
##$LB= 0
##$LEV0= 0
##$LPBIN= 0
##$MAXI= 10000
##$MC2= 0
##$MEAN= 0
##$ME_mod= 0
##$MI= 0
##$NCOEF= 0
##$NC_proc= -6
##$NLEV= 6
##$NOISF1= 0
##$NOISF2= 0
##$NSP= 0
##$NTH_PI= 0
##$NZP= 0
##$OFFSET= 14.98001
##$PC= 1
##$PHC0= 22.12646
##$PHC1= 0
##$PH_mod= 1
##$PKNL= yes
##$PPARMOD= 0
##$PPDIAG= 0
##$PPIPTYP= 0
##$PPMPNUM= 2147483647
##$PPRESOL= 1
##$PSCAL= 4
##$PSIGN= 0
##$PYNMP= <proc.py>
##$REVERSE= no
##$SF= 400.13
##$SI= 32768
##$SIGF1= 0
##$SIGF2= 0
##$SINO= 400
##$SIOLD= 32768
##$SPECTYP= <>
##$SREGLST= <1H.CDCl3>
##$SSB= 0
##$STSI= 32768
##$STSR= 0
##$SW_p= 8223.68421052632
##$SYMM= 0
##$S_DEV= 0
##$TDeff= 65536
##$TDoff= 0
##$TI= <>
##$TILT= no
##$TM1= 0
##$TM2= 0
##$TOPLEV= 0
##$USERP1= <user>
##$USERP2= <user>
##$USERP3= <user>
##$USERP4= <user>
##$USERP5= <user>
##$WDW= 1
##$XDIM= 32768
##$YMAX_p= 466135261
##$YMIN_p= -191724622
##$CURPLOT= <Network HP LaserJet P1505>
##$CURPRIN= <$Network HP LaserJet P1505>
##$DFORMAT= <normdp>
##$LAYOUT= <+/1D_H.xwp>
##$LFORMAT= <normlp>
##$PFORMAT= <normpl>
##$SURQMSG= 1
$$ End of Bruker specific parameters
$$ ---------------------------------
##NTUPLES= NMR SPECTRUM
##VAR_NAME=  FREQUENCY,     SPECTRUM/REAL,   SPECTRUM/IMAG
##SYMBOL=    X,             R,               I
##VAR_TYPE=  INDEPENDENT,   DEPENDENT,       DEPENDENT
##VAR_FORM=  AFFN,          ASDF,            ASDF
##VAR_DIM=   32768,         32768,           32768
##UNITS=     HZ,            ARBITRARY UNITS, ARBITRARY UNITS
##FACTOR=    0.250966925370066, 1,           1
##FIRST=     8223.43324360095, 181044,       -230276
##LAST=      0,             59320,           -162840
##MIN=       0,             -191724622,      0
##MAX=       8223.43324360095, 466135261,    0
$$ Real data points
##PAGE= N=1
##DATA TABLE= (X++(R..R)), XYDATA
$$ [...]
19628A744614P3484j43817m381m5377j5577o0173O5737j1649j89478p081K1751
19617A428053J33380P894J07410l72709l3633L12588l04627J71997j9170J6838
19607A448021q3391K8078j39038K40203j51259j71980J42108J3780r1145K9696
19597A265073L695n6826J34925n6789M433J41959j32207J46372j52074P5214p6875
19586A296900N1753p4193j96013K45692j13572O836o2451K31649o5793k90436
19576A030372L72245l89646L53345r7742Q9246j19147O4227K4994j27978p9284
19566A120632j0604J81025j05525j6643m1449J10359J28760r2278O6505k2437
19556A318345k347q1352P5663J10694M8702l99565L88258k67044n6391J29932
$$ y = [1744614, 1818098, 1674281, 1669900, 1624523, 1608946, 1548773, 1614510, 1602861, 1413383, 1406302, 1428053, 1561433, 1569327, 1676737, 1304028, 1270395, 1582983, 1278356, 1450353, 1431183, 1448021, 1364630, 1392708, 1253670, 1493873, 1342614, 1170634, 1312742, 1326522, 1235377, 1265073, 1268768, 1211942, 1346867, 1290078, 1294511, 1436470, 1304263, 1450635, 1298561, 1373775, 1296900, 1348653, 1274460, 1078447, 1324139, 1210567, 1217403, 1154952, 1386601, 1320808, 1030372, 1402617, 1012971, 1366316, 1268574, 1357820, 1238673, 1302900, 1327894, 1199916, 1120632, 1110028, 1291053, 1185528, 1168885, 1127436, 1237795, 1366555, 1274277, 1340782, 1318345, 1315998, 1234646, 1310309, 1421003, 1469705, 1070140, 1458398, 1191354, 1134963, 1264895]
19546A264895L6238k18221K22872n5136k5414J56291j22470J17166J34498l05103
19536A205616K37960N2924l46522q1730M9336K64724j62335N1454M6539j458k25199
19525A091309J32843q9175J56093L5721n2484R0005k63569M3987J54507k54422
19515A044815R1118R7558M4186j38745K34718k67701L05928j78189K1310o7330
19505A187668k5468J60149j14761o2334o0270L7344Q2049J30615k57488O4540
19495A142044P7595j54990J20102R1764Q82q5125k16167N19980k81894j00562
19485A113629J72461J83433l04656q3452J09934r7922N5405K22449o05202K23518
19475I89597j20676J8005L7145j80498J99258k83453K84096K00727k38826O0863
$$ y = [1264895, 1301133, 1082912, 1305784, 1250648, 1225234, 1381525, 1259055, 1376221, 1510719, 1205616, 1443576, 1496500, 1149978, 1068248, 1117584, 1382308, 1219973, 1271427, 1317966, 1316508, 1091309, 1224152, 1134977, 1291070, 1326791, 1274307, 1364312, 1100743, 1144730, 1299237, 1044815, 1135933, 1233491, 1277677, 1138932, 1373650, 1105949, 1411877, 1233688, 1254998, 1187668, 1162200, 1322349, 1207588, 1145254, 1084984, 1122328, 1204377, 1334992, 1077504, 1142044, 1219639, 1064649, 1184751, 1276515, 1277397, 1192272, 976105, 1496085, 1214191, 1113629, 1286090, 1469523, 1164867, 1081415, 1191349, 1093427, 1148832, 1371281, 766079, 989597, 868921, 886926, 924071, 743573, 942831, 659378, 943474, 1144201, 905375, 966238]
19465I66238J1876o7492k2086j12374l333J10032m4559j39458J93388j23921j58404
19454F09907K68534l7252K34290m15668J01366p1848K83234J3215k1656j44881
19444H19241J22970r9435J19398r5365J69440k09411K36831l47154J15331J28971
19434I60817r7651k34520L45613J44350l41583N328M8047K1193L6196J58410l26891
19423G19309L0805K57205j37266L7740j52014J17271l6972j48478K27458k17386
19413F97672K82023j56278K21779l05887J07428Q560p5420N8495r8330N6345J1192
19402H07579k07288L17367j37432Q655M0338m5292K21285j99361p4884K92198
19392A023165k9890L5229k10034R2720k09569M08324k16712o1412P9064q3872
$$ y = [966238, 978114, 910622, 888536, 776162, 772829, 882861, 838302, 698844, 892232, 768311, 609907, 878441, 841189, 1075479, 659811, 761177, 689329, 972563, 985778, 964122, 819241, 942211, 842776, 962174, 866809, 1036249, 826838, 1063669, 716515, 831846, 960817, 863166, 628646, 974259, 1118609, 777026, 782354, 830401, 851594, 887790, 1046200, 719309, 750114, 1007319, 870053, 907793, 755779, 873050, 836078, 687600, 915058, 697672, 979695, 823417, 1045196, 739309, 846737, 855297, 779877, 838372, 740042, 796387, 807579, 600291, 917658, 780226, 788881, 829219, 783927, 1005212, 805851, 730967, 1023165, 993275, 1028504, 818470, 911190, 701621, 1109945, 893233, 831821, 910885, 827013]
19382H27013M21734m07381J02665j69371j47295Q4731J8674K71058p2940j37634
19372G91254L18693J1563l58657m9695J99198J37766k24641K2188j57869J13419
19362H03219r6939Q7045N0517q1604J36256j71309j035K30788j14724J00877j40927
19351H02164Q2360R8437k9333k82220R7991L8187j57972k0352L38860R7597k04492
19340H61227J02136K13317k39254m160l2841J93225j2493J85361k28035J06747
19330A145230n0589j27071M7947j65456n053R8682q3598R1429J19575M3159j28890
19319I85365j18812J09451L0307k49076Q5384R2763N7538l26563K61522k80574
19309F47305L12888k48597K57159l22743P8829K23825l00014J44507K6149m6530
$$ y = [827013, 1248747, 841366, 944031, 774660, 627365, 712096, 730770, 1001828, 928888, 791254, 1109947, 1121510, 762853, 713158, 912356, 1050122, 825481, 847669, 689800, 803219, 706280, 793325, 843842, 762238, 898494, 727185, 726150, 956938, 842214, 943091, 802164, 884524, 982961, 953628, 671408, 769399, 807586, 649614, 629262, 968122, 1065719, 861227, 963363, 1176680, 937426, 933266, 900425, 1093650, 1081157, 1266518, 1038483, 1145230, 1094641, 967570, 1015517, 850061, 845008, 943690, 860092, 951521, 1071096, 1114255, 985365, 866553, 976004, 1006311, 757235, 842619, 935382, 992920, 666357, 927879, 647305, 960193, 711596, 968755, 646012, 724841, 948666, 648652, 793159, 819308, 772778]
19299G72778J0458j8656C59934K52239k6460J23097j3090j96399L65323l61287
19289E03357N82811m20982p7533J59352K27473l03734J60150o3915J11978l13992
19279E64965K36627n917M9170p5090n7328M8319k89435L17209l0448m757J70357
19268I23672k94891J80725o7228N9430J33580k68847K36157k54861r217K71603
19258I10123j13045J5210j14088J51345j49528K93397p0295j02458j3045k1396
19248G86220j05674l4589K15015j45952J15030O4526J30280P2102N23576K14891
19238A835425j192K36898j9656l08304j39894j99435l68964k63892J07086M0097
19228I18169j76539m6743N4344J1065j2023q2689M15425E22452N61556n40664
$$ y = [772778, 783236, 764580, 359934, 612173, 585713, 708810, 695720, 499321, 864644, 503357, 1086168, 665186, 587653, 747005, 974478, 670744, 830894, 766979, 878957, 564965, 801592, 795675, 844845, 769755, 712427, 760746, 471311, 788520, 758072, 753315, 923672, 628781, 809506, 742278, 801708, 935288, 666441, 902598, 647737, 638520, 910123, 797078, 812288, 698200, 849545, 700017, 993414, 923119, 820661, 807616, 786220, 680546, 645957, 860972, 715020, 830050, 894576, 1024856, 1096958, 1620534, 1835425, 1834233, 2071131, 2051475, 1743171, 1603277, 1403842, 1034878, 770986, 878072, 918169, 741630, 694887, 749231, 760296, 748273, 665584, 1081009, 522452, 1084008, 543344]
19218E43344J41647j30644K87475j07034j34671J05583J21913M949k06845L9218
19208F64935R5399j50087Q1330K93211l98672J20054K9389O8329P8091j7122k7929
19197H36928P4866j61613o2689L3154l4555j1560J25265m0060j01660L41121j1071
19186I88126p709k41941l7590J70727K87850l2949j98597N0354L09690m37867
19176H50094J29113p675M0362j53244j82741K48218J53867k79826K18586J05004
19166A121758k11833J97678R9807k39843J75506k01840J2513L08713k31944m0488
19156I90027n1890k71081J20900J96106j13665o2978J22627j82547p0088K99965
19146I77376p6344J49594o8477J95766k38301K2554K2143j3845R220l3939n9046
$$ y = [543344, 684991, 554347, 841822, 734788, 600117, 705700, 827613, 832562, 625717, 664935, 760334, 610247, 691577, 984788, 586116, 706170, 735559, 803888, 881979, 864857, 836928, 911794, 750181, 687492, 720646, 686091, 674531, 799796, 759736, 658076, 999197, 988126, 980417, 738476, 700886, 871613, 1159463, 1126514, 927917, 978271, 1287961, 850094, 979207, 971532, 1011894, 858650, 675909, 924127, 1077994, 798168, 1016754, 1121758, 909925, 1107603, 1207410, 967567, 1143073, 941233, 953746, 1262459, 1030515, 990027, 938137, 667056, 787956, 984062, 870397, 807419, 930046, 747499, 677411, 977376, 901032, 1050626, 982149, 1177915, 939614, 962168, 984311, 970466, 979686, 945747, 886701]
19135H86701Q9299N5672R1575l17064J35805J3360K00053n2482N6515j73232J09673
19124A095875J6428L17800O8215j21263K13930K4226j88510N14285j56196M59446
19114B244236K21910P9596N82071M38992K56122N01141j59791J12914l54296k85080
19104C637815n08304l09065o29963K01287m66760r8886j53274J36821M2409n54741
19094A297339J56593O1546j06894K58297l05139J84519r9499N80283j50266N61840
19084B438619p0932N77798J57136L00438M26633J77758q3627N3203k9634j51519
19074C795873k03415J37859J97989M6283m2791m26237j96596k90051l32168o41204
19064B045542l2380J04275j58784j74923J0209J58317k35819p2867J19932L61920
$$ y = [886701, 976000, 1031672, 1123247, 806183, 941988, 955348, 1155401, 1102919, 1159434, 986202, 1095875, 1112303, 1430103, 1498318, 1377055, 1590985, 1615211, 1426701, 1940986, 1784790, 2244236, 2466146, 2545742, 3127813, 3566805, 3822927, 4324068, 4164277, 4277191, 3922895, 3637815, 3129511, 2820446, 2190483, 2391770, 1925010, 1826124, 1672850, 1809671, 1852080, 1297339, 1453932, 1515478, 1408584, 1666881, 1361742, 1546261, 1446762, 2027045, 1876779, 2438619, 2367687, 2945485, 3102621, 3403059, 3829692, 4007450, 3923823, 3977026, 3947392, 3795873, 3592458, 3730317, 3928306, 3974589, 3931798, 3505561, 3308965, 3018914, 2686746, 2045542, 2013162, 2117437, 1958653, 1783730, 1793939, 1952256, 1716437, 1643570, 1763502, 2125422]
19054B125422j14389P136P2393J75330L93126J74485N45584L55821M94216K71989
19044D501113l0798j67284k61536m51688n63983n29230k41338r3437k61488k09443
19034A690888J03662P8474l03450L07084k85805J52045J09563k7096K40018m9748
19024B015635L59520K5168L06007K13301O37512J44608N16272K85591J43834L05775
19014D953223J00694j02849L98297L03257J90392M26694Q00134J98111O38237
19005G906190R38236R60753J237270K206440J642369K030846K096973J101925
18997B0121002O69167m16469j564256j877856k359304k358504k229737j764253
18989H219790j294818j066821o51898p87011l91176m46944m40297k56649o5373
$$ y = [2125422, 2011033, 2018169, 2090562, 2265892, 2659018, 2833503, 3379087, 3734908, 4229124, 4501113, 4470315, 4303031, 4041495, 3589807, 3025824, 2496594, 2255256, 2161819, 1900331, 1690888, 1794550, 1873024, 1569574, 1876658, 1590853, 1742898, 1852461, 1825365, 2065383, 2015635, 2375155, 2400323, 2706330, 2919631, 3557143, 3701751, 4218023, 4503614, 4647448, 4953223, 5053917, 4951068, 5349365, 5652622, 5843014, 6269708, 7069842, 7267953, 7906190, 8844426, 9805179, 11042449, 13248889, 14891258, 16922104, 19019077, 20121002, 20790169, 20373700, 18809444, 16931588, 14572284, 12213780, 9984043, 8219790, 6924972, 5858151, 5206253, 4419242, 4028066, 3581122, 3140825, 2884176, 2818803]
18980B818803l52437j13705l48035K75581m72650l9344J14905j6622M4863j85503
18970A725856r1919J29083l41288J63771l1064J03852J14157k29836L31702j93634
18960A680680J39436Q5882q5360j28148J93209J81152j95478l176J79130K92525
18950B339852J41167J25051K15174K60143Q4020M06721K81619Q70644R53468R18963
18940F596822J655536J613104J665791K493724K164551J513114P47142N66808
18932A9016592q43301j806105j820070k330376k083251k053679j343907j056472
18924E679431j069160m84290o06273n54683j38455m11423j23210l80362k60577
18915A650998M5161m32474N2447j12830m0421K28732j80125k31818Q0594l4652
$$ y = [2818803, 2466366, 2352661, 2004626, 2280207, 1807557, 1768213, 1883118, 1866496, 1911359, 1725856, 1633937, 1763020, 1421732, 1585503, 1554439, 1658291, 1772448, 1542612, 1874314, 1680680, 1820116, 1905998, 1820638, 1692490, 1885699, 2066851, 1871373, 1868197, 2047327, 2339852, 2481019, 2606070, 2821244, 3081387, 3165407, 3572128, 3853747, 4724391, 5677859, 6596822, 8252358, 9865462, 11531253, 14024977, 16189528, 17702642, 18449784, 19016592, 18173291, 16367186, 14547116, 12216740, 10133489, 8079810, 6735903, 5679431, 4610271, 4125981, 3519708, 2965025, 2826570, 2415147, 2291937, 1911575, 1650998, 1696159, 1263685, 1316132, 1203302, 1162881, 1391613, 1211488, 979670, 1060264, 1025612]
18905A025612j34191J16504J37544k53625J02615k341k36777J30584k7697j5842
18895H42386K5679q7353k27679J68286K39106j69302j18135o6367J90572k3001
18885G74192j14041r3836L08557l26196Q2178M6558K1988K3001j64935J38821
18875F96287r5061J35556j65986J45493k06948J63551K8149r0607P2938O220q356
18864F81236j00258o2434O3112o0024J9700o4338L31169j17848j94972J55124
18854F50467N2647k53031K87457J50677o7373k41614n0900q7290M77560m23381
18844D95219J89187L7136j36572j61736O4126K30128K0385j04555p0143L4573
18834E97748J72475j50054K33113l16061J40419M5692l16288P9974O9419J26673
$$ y = [1025612, 891421, 1007925, 1145469, 891844, 994459, 992118, 755341, 885925, 858228, 842386, 868065, 780712, 553033, 721319, 960425, 791123, 672988, 606621, 797193, 774192, 660151, 566315, 874872, 548676, 630854, 677412, 699400, 722401, 557466, 696287, 601226, 736782, 570796, 716289, 509341, 672892, 701041, 610434, 683372, 689592, 681236, 580978, 518544, 581656, 521632, 541332, 476994, 808163, 690315, 495343, 650467, 703114, 450083, 737540, 888217, 820844, 579230, 528330, 441040, 918600, 495219, 684406, 721542, 584970, 423234, 487360, 717488, 737873, 633318, 563175, 597748, 770223, 620169, 853282, 537221, 677640, 723332, 407044, 487018, 556437, 683110]
18824F83110k6165j33189O8330j48578J90666j5665r7799K61789j49886P6671
18814G09284k43882J69714j05929P9023J33698M7868m8214n2004j05592J11152
18804F95118Q0431j28534p6560Q334M56130k55508k5613J41075j92104j277j8641
18793F82851q4441j03266L57404K8709j47069j12371L07494p6208j16991K65055
18783A001167j14256j18959j0449p438J48010K6594j00688l8884O589J6259l9632
18772G68313j41599J20830j22524K72537j59519j59401Q509K10672k29267k50971
18762C17580K89196R7828J04955p9766J14457j00746P775j76804r145R3277R6471
18751G55078k37561K32232K3314k40126K5118J71592J2102k70875K16963K03394
$$ y = [683110, 656945, 523756, 592086, 443508, 634174, 618509, 520710, 782499, 632613, 709284, 465402, 635116, 529187, 608210, 741908, 789776, 741562, 689558, 583966, 695118, 775549, 647015, 570455, 578789, 1034919, 779411, 753798, 894873, 702769, 701492, 682851, 598410, 495144, 852548, 881257, 734188, 621817, 929311, 853103, 736112, 1001167, 886911, 767952, 757503, 750065, 898075, 924669, 823981, 785097, 791686, 807945, 768313, 626714, 747544, 625020, 897557, 738038, 578637, 587146, 797818, 568551, 317580, 606776, 704604, 809559, 729793, 844250, 743504, 751279, 574475, 565330, 658607, 755078, 517517, 749749, 773063, 532937, 558055, 729647, 741749, 470874, 687837, 891231]
18741H91231j94756J12014j3424k12514r2737L01474k69152J81442k7526j12689
18731E63363J2966J79428C64197Q9190L94886k94658k49740M43889p2687j67043
18721E08034L03362R3530j68911r6196M27637k72711k777j52374J84391j82978
18711F41007J53195q9879l5213R5406k39570P1132P485K11995j19076M4028l9463
18700G01047q1113j8930J36042j49490n1951K2141J15442l33474M75530p955j37283
18689F70006P7139O5679j3841J0468N4953k63530N6828K35850j38899j0233J8707
18678G63127m5994j0984N2958M3049J0745j90331L75742k54435m0423J81156P1377
18667I55987k50588p1521K4355j33926L28571o7222j02725K7450j30880j2864
$$ y = [891231, 696475, 808489, 795065, 582551, 489814, 791288, 522136, 703578, 676052, 563363, 576329, 755757, 364197, 453387, 848273, 553615, 303875, 747764, 675077, 508034, 811396, 904926, 736015, 639819, 1067456, 794745, 791968, 639594, 823985, 641007, 794202, 704323, 669110, 764516, 524946, 596078, 603563, 815558, 696482, 740510, 701047, 619934, 601004, 737046, 587556, 535605, 557746, 673188, 339714, 815244, 807289, 670006, 747145, 812824, 798983, 809451, 864404, 600874, 657702, 893552, 754653, 744420, 763127, 717133, 706149, 759107, 802156, 812901, 622570, 998312, 743877, 703454, 884610, 955987, 705399, 633878, 658233, 524307, 852878, 785656, 682931, 710381, 579501, 566637]
18657E66637K9023n6606O4717J85316q4618q9192j04338J73680r0364O2538k55089
18646D01704q0787K00566K32967k00528j4795j8375k7911N1271P5436k75292J82070
18635E26326J14124j18018O4667L5928r9509K61458k59571M9410m3965M1247Q3309
18624F55406C19490K37715J85309m7745Q2430k56117K80478l2092j39676o8191
18614E61601m6250L0844M9540P576J43904n2018o9277k68100M80354j68672R5061
18603G64563j15678L8308l5308j42178K50593M8237k14720J09150J22113k32970
18593E92110J53846l4958Q6558l9991j78307K58300l5766j05681j5820m0375K15587
18582H55503k91540K79658j50683j2569l3694K130N2386j20912Q9279Q5310j85690
$$ y = [566637, 595660, 539054, 603771, 789087, 704469, 615277, 510939, 684619, 594255, 656793, 401704, 320917, 521483, 754450, 553922, 539127, 520752, 492841, 544112, 619548, 344256, 526326, 640450, 522432, 587099, 623027, 523518, 784976, 525405, 574815, 530850, 572097, 655406, 319490, 557205, 742514, 694769, 777199, 521082, 801560, 769468, 629792, 561601, 515351, 546195, 595735, 603311, 747215, 695197, 625920, 357820, 838174, 669502, 764563, 648885, 687193, 651885, 509707, 760300, 808537, 593817, 702967, 825080, 592110, 745956, 710998, 797556, 757565, 579258, 837558, 801792, 696111, 680291, 639916, 855503, 563963, 843621, 692938, 680369, 646675, 648805, 701191, 580279, 669558, 754868, 569178]
18571E69178J37240J5160k1425j93363J10430m4492O4331j5242N6561M097q6627
18560E95848p8052J14210J24026k46974N1985P0815P2378j6362n2391J15473k90736
18549D60220P8359J58195k04939J1613P6404l7537J02822K3525j40778R7405n0868
18538E74421j23599j63515K42536J62132k75632Q6798j10196J79498k6975J0891
18528E56359J53205J77515k94172n8811l7984J18468p2918j39574K13456n3179
18518E62365J63241j18362k5506K43473o9692k34661j30025J90743m2278M0030
18508E79328J50237m789j13417J00706j71830Q5327k59472K92084J09546j63079
18498F04641k01284N4959J08800n0996K49139N4911j83732K0516J5837B61781
$$ y = [569178, 706418, 721578, 700153, 506790, 617220, 572728, 637059, 621817, 678378, 682475, 595848, 517796, 632006, 756032, 509058, 561043, 631858, 704236, 687874, 635483, 750956, 460220, 538579, 696774, 491835, 503448, 579852, 542315, 645137, 668662, 527884, 625289, 574421, 450822, 287307, 529843, 691975, 416343, 503141, 392945, 572443, 545468, 556359, 709564, 887079, 592907, 534096, 496112, 614580, 541662, 402088, 615544, 562365, 725606, 607244, 581738, 825211, 755519, 520858, 390833, 581576, 539298, 579328, 729565, 724776, 611359, 712065, 540235, 625562, 366090, 658174, 767720, 604641, 403357, 458316, 567116, 516120, 765259, 820170, 636438, 656954, 672791, 261781]
18487E77867p1090J29066q5364K28475Q053k8370l07702K04286J20624K0093j12536
18476F83402m9612R4655J08840k06969J41777j67965Q344j6801L91060j62145
18466H24586j34034R296J37127L2680j27547o6049K27687k89897K72220M7297
18456I33366j21398R1369q0172N6139J4667J1851m6314q5236j631p0593k61291
18445D40757M8150K2568k18092L35132O8191j8405J49401K7280q1202r3098J90302
18434H70984L2867l1460j87849L3664r4982R4714L62255l64602J98055k74242
18424F39404J03187J6570j34960L9025K4722l13264Q6542j13304K17074J91394
18414G56390k07080j49455L15812k90055R6905K2880j01362j99861M99717K4401
$$ y = [577867, 506777, 635843, 550479, 778954, 787007, 758637, 450935, 655221, 775845, 795938, 683402, 633790, 728445, 837285, 630316, 772093, 604128, 612472, 595671, 986731, 824586, 690552, 699848, 836975, 869655, 742108, 676059, 903746, 613849, 886069, 933366, 811968, 903337, 823165, 879304, 893971, 905822, 859508, 774272, 772641, 702048, 440757, 488907, 511475, 293383, 628515, 696706, 678301, 827702, 854982, 773780, 680682, 870984, 903851, 872391, 684542, 718206, 623224, 717938, 1080193, 715591, 913646, 639404, 742591, 759161, 624201, 663226, 687948, 374684, 461226, 347922, 564996, 756390, 549310, 399855, 715667, 425612, 522517, 545397, 444035, 244174, 743891, 768292]
18404G68292l65898J37594J77266k63851L203J08903R7488j39281p564J79779
18394F95931j17178j11100J1961p0545K5923j54040K31618J30675j16481l3329
18384D93435j26227M0949J67266p8022l2366Q0638o8360j1223R1708j32446J98394
18373F23746j52255J3335R7513K5071l2555Q7947k5398J22960k39136r0274M7388
18362D78342q2064N16571k05599j37945J81779l24207K95718n4750j95857M25993
18352H97981k55099M2666L43442k83613j60755K86632k52504P2692r5659J32891
18342G28674l07533K27276j96965K01225j16902j02542J31039K27833l02871J89414
18332F78648j4657q5440Q8419j27463k51341K56377j21473L60523K7208j35933
$$ y = [768292, 402394, 539988, 717254, 453403, 456606, 565509, 662997, 523716, 516152, 695931, 578753, 467653, 479614, 409069, 434992, 280952, 512570, 643245, 526764, 493435, 367208, 408157, 575423, 497401, 465035, 545673, 477313, 466090, 557798, 425352, 623746, 471491, 484826, 582339, 607410, 574855, 662802, 637404, 760364, 521228, 430954, 478342, 396278, 912849, 707250, 569305, 751084, 426877, 722595, 667845, 471988, 897981, 642882, 685548, 1028990, 745377, 584622, 871254, 618750, 691442, 595783, 728674, 421141, 648417, 451452, 652677, 535775, 433233, 564272, 792105, 489234, 678648, 663991, 578551, 666970, 539507, 288166, 544543, 423070, 783593, 810801, 674868]
18322F74868o8094L2098J52729J66072l02310J15013j11261M4162J1080N8413
18312G72770k59277J33436j36123K62097C80529K03435j63867M6532J65299n2137
18302E79791k5407L9281B52970K95721r078o8317J33294o801j16039Q9191j53676
18291D17265N2221L3622K253q2956P7787j97480M31790j62862J51332j18229j79240
18280D25503K27956k0157k7340j984L5729j88874Q9576j07192M1336R5235O9430
18269F39218O3009k19941M5373K00289N2612l16662L6275J60082J25233l15674
18259D69814K93050j05181J60762k34860K85381k14723K317L565K7185p9055L0749
18248F39004j25675J70361j39844K59200j02237j12961k8543N0412j89050J32277
$$ y = [674868, 606774, 638872, 791601, 957673, 655363, 770376, 659115, 703277, 714357, 772770, 513493, 646929, 510806, 772903, 380529, 583964, 420097, 466629, 631928, 579791, 554384, 593665, 252970, 548691, 539613, 471296, 604590, 597789, 481750, 570941, 417265, 469486, 503108, 505361, 422405, 500192, 302712, 734502, 571640, 722972, 604743, 425503, 653459, 633302, 605962, 603978, 639707, 450833, 540409, 433217, 474553, 569788, 639218, 702227, 482286, 527659, 727948, 780560, 463898, 500173, 660255, 785488, 469814, 762864, 657683, 818445, 583585, 868966, 654243, 656560, 660125, 687310, 608255, 639004, 513329, 683690, 543846, 803046, 700809, 587848, 559305, 609717, 420667, 552944]
18238E52944m1843p1551N1674j18845M85956j90304p9421k05219L67239j97918
18228E52712o8297j52043K40529N9148p1193k7993J14219K9215m425p3318K0071
18217F18625J50990j40876j64896Q6088M1683R7337j56692q4967j45823J14848
18207D16317K4199K57290l04658L06586M1274j12153J97071j10165J67765n761
18197H77765l39129M7471l1434L68369k94992k35521L33705Q769j64689J00664
18187F70978k11275K02630L1562o781m7718N9993p4858l8446J5717r197K48509
18176H41114k86925P059K03187j08409J9030n431J8099j12076K3883Q8878j36232
18165E52177J8880M0755l8889j21879J98923j83710J60014m8686J26965k1180
$$ y = [552944, 511101, 439550, 491224, 372379, 858335, 668031, 588610, 383391, 750630, 552712, 484415, 332372, 572901, 632049, 560856, 532863, 647082, 676297, 671872, 598554, 618625, 769615, 628739, 463843, 549931, 591614, 688951, 532259, 447292, 301469, 416317, 440516, 697806, 393148, 699734, 741008, 628855, 825926, 715761, 883526, 877765, 538636, 586107, 554673, 923042, 628050, 392529, 726234, 735003, 570314, 670978, 459703, 662333, 693895, 687114, 639396, 699389, 624531, 586085, 601802, 592605, 841114, 554189, 561248, 764435, 656026, 675056, 669625, 687724, 575648, 599531, 688409, 552177, 571057, 611812, 572923, 451044, 649967, 466257, 626271, 577585, 704550, 683370]
18155F83370r9557Q3895Q9386k61868J33776J40675j89629J07276n887j3525k09686
18144D58226K81198q1715j70028J55961l4584M2901J36029m5258k3404k47405
18134D71921Q8519J88502r4187j11421k9119Q5506L42194j17193m8484j19939
18124F56299O5858J17766k58822P9189J77220j04957k25000M51942k65989j82416
18114E11090R1896k9682K05458j67415M6790o6457J17969C01190M08894k44929
18104D65155n249J72861j17638J76142k02318j79074K70632r7778J21810J8744
18094F23287j18526J24277j31355l8444J29150J3384L1168j51513j40418K33880
18084E74890j96950K07895k852k25099K57862O9130j65748K56973k95360K62254
$$ y = [683370, 583813, 667708, 757094, 495226, 629002, 769677, 580048, 687324, 681437, 667912, 458226, 739424, 657709, 487681, 643642, 609058, 651959, 787988, 742730, 719326, 471921, 560440, 748942, 654755, 543334, 514215, 599721, 941915, 824722, 776238, 656299, 722157, 839923, 581101, 660290, 837510, 732553, 507553, 959495, 693506, 511090, 602986, 573304, 778762, 611347, 658137, 591680, 709649, 301190, 710084, 465155, 459906, 632767, 515129, 691271, 488953, 309879, 580511, 482733, 604543, 623287, 504761, 629038, 497683, 459239, 588389, 601773, 632941, 481428, 341010, 574890, 377940, 585835, 582983, 357884, 615746, 684876, 519128, 776101, 480741, 742995]
18074G42995k09262j44720J3207L39985j80001N0981K1167q3344j92074J07260
18064D66194J22527n8016j53895K67358k09546j180r4173N8867K40571l09009
18054C29698J50295J58127n7709B17102L21534o3181q399R0884j84418j13103
18044B60419M41510o2391j33769j65952K01909O8647n8877A93920J57808K40320
18034E92048j61761m1804N434L6577J36478j16267J50603j57284j33284J21857
18024D32597p777R1934o0581r0840j34819L00003N127j15780r5793J77999O9443
18013E71513j0945m7920o1521B23597K08050M6341p8899J75294r6203o131l296
18002D68753J7831n8221J15501j04298K70111j66994k4638Q5175q6621n3386J4905
$$ y = [742995, 533733, 389013, 402220, 742205, 562204, 613185, 634352, 551008, 358934, 466194, 588721, 530705, 376810, 644168, 434622, 433442, 339269, 398136, 638707, 329698, 479993, 638120, 580411, 217102, 538636, 475455, 467056, 557940, 373522, 260419, 701929, 639538, 505769, 339817, 541726, 610373, 551496, 193920, 351728, 592048, 430287, 388483, 393917, 430494, 566972, 450705, 601308, 444024, 310740, 432597, 424820, 516754, 456173, 365333, 230514, 530517, 535644, 419864, 324071, 502070, 571513, 560568, 512648, 451127, 223597, 431647, 477988, 399089, 574383, 478180, 472049, 468753, 486584, 428363, 543864, 439566, 709677, 542683, 518045, 603220, 516599, 463213, 478118]
17991D78118p7427N31L47954k58039J24979j33667Q3940L5475j63683J9011j82143
17980B75049L8504K66122k384p7850J1497M1079m5811M602p2333O0284l4550o7875
17968C96334k7627J19790J55860m971P68J28078j65589O8066j80431M7483j17368
17957D20393n0837K83918B45410N19743k26928O4371j02123m4813K42817k7570
17947F70907j26669P4990J89173j89041j25611q8058J87624r964j84852P8446
17937D76945j1097K10516l21889J78821L13317l03534j1282m5051J18647k37485
17927C67908K74060l9034j21661J46877K8632j46440K6881K9717p1045J52249
17917F48144K2537O7365J25459l27792n8446j21351L04650J7581j80137J73354
$$ y = [478118, 400691, 401222, 749176, 491137, 616116, 482449, 566389, 601864, 438181, 457192, 275049, 313553, 579675, 577291, 499441, 510938, 552017, 506206, 510808, 438475, 498759, 464209, 396334, 368707, 488497, 644357, 639386, 640154, 768232, 602643, 670709, 490278, 537761, 420393, 369556, 653474, 245410, 765153, 538225, 602596, 500473, 455660, 698477, 670907, 544238, 619228, 808401, 619360, 493749, 405691, 593315, 583351, 398499, 476945, 465848, 676364, 354475, 533296, 846613, 543079, 531797, 486746, 605393, 367908, 641968, 602934, 481273, 628150, 656782, 510342, 537223, 566940, 495895, 648144, 670681, 738046, 863505, 535713, 477267, 355916, 660566, 678147, 498010, 671364]
17907F71364j11198q0711R6266p7418J12393k29054M29217k90106R5964k96761
17897C19956K23218l4817L1684L08325l21979O9904n9433J98234k84230l2195
17887D18667P0507K0618L76745k32269k63255J32535o38J58394j93391J12167
17877F00080R2357k0752j72669K15491J9425j04167J02694L1293m6565M3802j40711
17866F20278R9510j70899k7303Q9536j6348N8758k83553L02292j86005L43203
17856H29469k10448j07648J58137p8258K4524K48867l98784K01495K3175j96149
17846D94380K7244J35826j60876L53078k11389p570J31594j69983N66L55537j36007
17835H12400k48485k3084K45255l18017K16912r9927K08912j83488J40525J43308
$$ y = [671364, 560166, 479455, 575721, 498303, 610696, 381642, 810859, 520753, 616717, 319956, 543174, 508357, 540041, 848366, 526387, 596291, 536858, 735092, 450862, 418667, 489174, 509792, 886537, 654268, 391013, 523548, 522910, 681304, 487913, 600080, 692437, 671685, 499016, 714507, 733932, 629765, 732459, 763752, 717187, 760989, 620278, 719788, 548889, 521586, 611122, 594774, 653532, 369979, 672271, 486266, 829469, 619021, 511373, 669510, 591252, 615776, 864643, 465859, 667354, 690529, 494380, 521624, 657450, 496574, 849652, 638263, 630693, 762287, 592304, 592870, 948407, 812400, 563915, 540831, 786086, 468069, 684981, 585054, 793966, 610478, 751003, 894311]
17825H94311D35927J35287J74182j29385J98686p7707J84839k11894K10377Q919
17815I29231J14447K32162j50749O7303j55226L3167j44451J85914l4028Q443
17805A086213j53188n5939k35583K89992l044M9357K07516j4928J70861j93752
17795A147505n5008M9350l22858J45792k67099J50499q5004J12320R0175l25377
17785F40295M1839N6446k39214J43624k4460J27539k04338K28106j01517j69021
17775D99299J94360k39247L34305l7932N6148j77739M2817j21052j75738K88305
17765F63526o0009L6641N6919k53684J33452Q6754o6441r0756K26756r2698j2001
17754F28459P8986J42467l57416K75031m5449q06p7090K7230j9222O5424m4500
$$ y = [894311, 435927, 571214, 745396, 616011, 814697, 736990, 921829, 709935, 920312, 929231, 1043678, 1275840, 1125091, 1192394, 1037168, 1070335, 925884, 1111798, 1077770, 1086213, 933025, 877086, 641503, 931495, 928451, 977808, 1185324, 1170396, 1341257, 1147505, 1092497, 1141847, 818989, 964781, 697682, 848181, 763177, 875497, 965672, 640295, 682134, 738580, 499366, 642990, 618530, 746069, 541731, 769837, 668320, 499299, 693659, 454412, 788717, 750785, 806933, 629194, 672011, 550959, 375221, 663526, 603517, 640158, 697077, 443393, 576845, 663599, 597158, 506402, 733158, 640460, 628459, 707445, 849912, 492496, 767527, 722078, 721272, 644182, 671412, 652190, 717614, 673114]
17743F73114K1473N0684k93109K10826P1313j62157L1257J14389K6923K7079k50089
17732E21703N3914Q2945J10171j82918M3827J16403j86838K52855j09205j95684
17722E07173K68654k36791J40400J52384l2972j44221k21250N30052k32824J4245
17712G44850j59934J26786k1724N8646M3325j37220K05992l62490p4422J64756
17702E88565J34664j89662L14511j09788J4545M5419l82359K13550P1069O6880
17692G67394j50591L4362m435O2619m3035J4038N5492j5667K10512j71155J096
17681G60630k8583n1433J227q1570K59208o0811O0821j34877J18027o1790O2816
17670H43665J09681l40941L8046J4049P4909J9562K5253J941M941J27487K27908
$$ y = [673114, 694587, 745271, 452162, 662988, 734301, 572144, 603401, 717790, 744713, 771792, 521703, 575617, 658562, 768733, 585815, 629642, 746045, 559207, 812062, 702857, 507173, 775827, 539036, 679436, 831820, 798848, 654627, 433377, 963429, 730605, 744850, 584916, 711702, 689978, 748624, 791949, 654729, 860721, 498231, 423809, 588565, 723229, 533567, 848078, 738290, 752835, 798254, 415895, 629445, 700514, 767394, 616803, 651165, 646730, 709349, 666314, 680352, 735844, 720177, 930689, 759534, 760630, 732047, 680614, 681841, 600271, 859479, 798668, 859489, 724612, 842639, 780849, 843665, 953346, 612405, 650451, 664500, 739409, 758971, 784224, 786165, 791106, 918593, 1146501]
17659A146501m61510K31647j62890P2953n8210J65429j53244J66037j41313O5599
17649H70999J837Q1575p8127j83599J37288J63107J09645l73383Q0389J93154
17639A002885J27026l7648k32659R752N5177J63887j22514N5282j07219J08990
17629A022959k75027K28191J33545k53224J88058j24669J1203P674K07118K3076
17619A168904k46919J98932J47128k56784k3893L8164R6850J53539j87308l5389
17609A053224j7452M4026M6452J20000l7887j69928M5786n4990K11831j50405
17599A090657J63381Q841m2943r7402q7906Q9108o3958J11808j6910k461R117
17588A161332j10760m4006J15960K97645k97844N9870L31417m9458l34911R3447
$$ y = [1146501, 684991, 916638, 753748, 826701, 768491, 933920, 780676, 946713, 805400, 870999, 872836, 954411, 876284, 692685, 829973, 993080, 1102725, 729342, 809731, 1002885, 1129911, 1092263, 859604, 869356, 924533, 1088420, 965906, 1021188, 913969, 1022959, 747932, 976123, 1109668, 856444, 1044502, 919833, 931036, 938710, 1145828, 1168904, 921985, 1120917, 1268045, 1011261, 987368, 1025532, 1122382, 1275921, 1088613, 1053224, 1035772, 1079798, 1126250, 1246250, 1208363, 1038435, 1084221, 1029231, 1241062, 1090657, 1254038, 1262879, 1219936, 1122534, 1034628, 1123736, 1059778, 1171586, 1154676, 1152215, 1161332, 1050572, 1006566, 1122526, 1420171, 1122327, 1182197, 1513614, 1464156, 1129245, 1222692]
17578A222692J23659j87437J07146K48891j45870k3818j22230R3030K71309N8849
17568A646221k51087o7308q2731K73214k21508j17707j28732J83489l8465j94682
17558A000704J47907L13943n9934l48431K26117k70066K44956J7164j12927O390
17548A165823j8379K46304j8129q2871j22153J17193K59424q2592K75434j54111
17538A585943J29795j17245k77087l1566K58015k41430K27219m4970k25548K11534
17528A474660k5424K73164j38126j90675L30165m81817J67604K77811j21994J47111
17518A712479o5341j86633K56930O2225k14305O32625j31873J30093r0677K07029
17508B312552J90197J88941Q3372n134j54206K05100o2421j28833K47682j46580
$$ y = [1222692, 1346351, 1158914, 1266060, 1514951, 1369081, 1345263, 1223033, 1316063, 1587372, 1646221, 1395134, 1327826, 1245095, 1518309, 1296801, 1179094, 1050362, 1233851, 1195386, 1000704, 1148611, 1462554, 1402620, 1054189, 1280306, 1010240, 1255196, 1272360, 1159433, 1165823, 1147444, 1393748, 1375619, 1292748, 1170595, 1287788, 1547212, 1464620, 1740054, 1585943, 1715738, 1598493, 1321406, 1289840, 1547855, 1306425, 1533644, 1488674, 1263126, 1474660, 1449236, 1722400, 1584274, 1393599, 1723764, 1241947, 1409551, 1687362, 1565368, 1712479, 1647138, 1460505, 1717435, 1779660, 1565355, 2197980, 2066107, 2196200, 2105523, 2312552, 2502749, 2691690, 2775062, 2769928, 2615722, 2820822, 2758401, 2629568, 2877250, 2730670]
17498B730670J91473L56992J27657L20147M26881N21416L34910N45944P23748
17489F279838K70141J021999J353063K165759L938775O999592J0371966J4244793
17481D6645926J8098589J8420772J5400497R300303K386085m992006j1896160
17474I3364006j7505613j8327914j5039010r885815m117715J314882O148757J1300928
17466D7252506J5403739J7530641J6457902J0702021L966616l474658j0738476
17459I7100291j7110754j9973846j8500764j3597635r580221n652034l335255
17452I349782j867516j109125j219441m31805n60057l78486L29k60545N196j26828
17442C401504J74731k74862M3372J01237j57376j734k56296j82629J13518j05165
$$ y = [2730670, 2922143, 3279135, 3406792, 3726939, 4153820, 4675236, 5010146, 5556090, 6279838, 6549979, 7571978, 8925041, 11090800, 15029575, 22029167, 32401133, 46645926, 64744515, 83165287, 98565784, 107866087, 110252172, 105260166, 93364006, 75858393, 57530479, 42491469, 32605654, 28487939, 29802821, 35951578, 47252506, 62656245, 80186886, 96644788, 107346809, 111313425, 107838767, 97100291, 79989537, 60015691, 41514927, 27917292, 18337071, 12685037, 9349782, 7482266, 6373141, 5153700, 4721895, 4161838, 3783352, 3783681, 3523136, 3528332, 3401504, 3576235, 3301373, 3344745, 3445982, 3288606, 3286872, 3030576, 2847947, 2961465, 2856300]
17432B856300l2195J1394K41143J5600o7119R0982l42741K90911j97639n6055
17422B810581k00164k29666j10956k82460L06716r7474j1415O7758j04539K9970
17412B178351L7247j04519J73894j38886K25709l01597J20414J73210Q4706J54030
17402B602559P001K65620j17977L13754j11550K86004j1785K91466M30332J60525
17392D115949R9872N59078L33828L92938L57542K93658M12655K84649K40801K33661
17382G324631l5526q4684n66530J0919l21372k40583o3908K79613k38526q6818
17372E977216K88912K16779J78128M55454M72063J97202L18296J68743J08252
17363H381045O8579N7762l77411J78966o7514k30567k92541L03723L68816P9208
$$ y = [2856300, 2824105, 2835499, 3076642, 3092242, 3025123, 3116105, 2773364, 3064275, 2866636, 2810581, 2610417, 2380751, 2269795, 1987335, 2294051, 2196577, 2185162, 2252920, 2148381, 2178351, 2215598, 2111079, 2284973, 2146087, 2371796, 2070199, 2190613, 2363823, 2448529, 2602559, 2609560, 2875180, 2757203, 3070957, 2959407, 3245411, 3233626, 3525092, 3955424, 4115949, 4215821, 4774899, 5108727, 5501665, 5859207, 6152865, 6565520, 6850169, 7090970, 7324631, 7289105, 7204421, 6637891, 6648810, 6327438, 6086855, 6022947, 6302560, 6064034, 5977216, 6266128, 6482907, 6661035, 7116489, 7588552, 7785754, 8104050, 8272793, 8381045, 8449624, 8507386, 8129975, 8308941, 8241427, 8010860, 7718319, 8022042, 8390858, 8470066]
17353H470066K61042J42858L05589N82362O72426L28269Q77344L98065P12070
17344A2750091L47153L69317L70551L25137N2785k94115j10538p12644j07207
17335A2990530l77432p5591k42284p8388L5754J0880K80321O47410K94138L76829
17325A3862167K20719N03251L38694K19508k03550N20330j40599J27525J09885
17316A5557930q7028m2656Q7646j69728J90331k53268K8283K84930L0830J09450
17306A5736720K26930M21162j37028N43857m1946L00661j51219J99736m16890
17297A6681983m93492J65721n89756l0509k06282k04511j20383J83906K60378
17288A5647055J93180K28981J84655K04191N1260k70515r7587n28464p45396o16254
$$ y = [8470066, 8731108, 8873966, 9179555, 9761917, 10434343, 10762612, 11639956, 12038021, 12750091, 13097244, 13466561, 13837112, 14162249, 14215034, 13920919, 13810381, 13097737, 12990530, 12613098, 12537507, 12295223, 12216835, 12252589, 12263469, 12543790, 13191200, 13485338, 13862167, 14082886, 14586137, 14924831, 15144339, 14940789, 15461119, 15320520, 15448045, 15557930, 15470902, 15428246, 15515892, 15346164, 15536495, 15283227, 15311510, 15596440, 15627270, 15736720, 15963650, 16384812, 16247784, 16791641, 16749695, 17050356, 16899137, 17098873, 16681983, 16188491, 16354212, 15764456, 15733947, 15527665, 15323154, 15202771, 15386677, 15647055, 15840235, 16069216, 16253871, 16458062, 16509322, 16238807, 16141220, 15612756, 14867360, 14251106]
17278A4251106j056352j020655o98653r70115m85849p38132q43126m95859m48047
17269G494318j43137l65624l75354P2665m09004J03652j05803j83630R5281o5361
17259F118003r0737L02983k56906j33540k96925j89660k7104m51238N9738J94902
17249E229516k46740r8109k09730j06845J52627j53822L28749l19237l3364J78383
17239D721428j41069Q3491k80016k28603K1904P0337n04295p9767k7054o956K0932
17228C650332j31186J6925J8399k83003R9400R3410k35853L6444Q9148J29745
17218C483761j3870L3902j9913N3881P8075j35429J94396k55776j50467L04789
17208C573349r0526j47575k29014M627l6782J82j29314k28988N5669P0232j74990
$$ y = [14251106, 13194754, 12174099, 11475446, 10505331, 10019482, 9281350, 8438224, 7942365, 7494318, 7351181, 6985557, 6610203, 6682868, 6273864, 6377516, 6271713, 6088083, 6183364, 6118003, 6027266, 6330249, 6073343, 5939803, 5642878, 5453218, 5426114, 4974876, 5034614, 5229516, 4982776, 4884667, 4674937, 4568092, 4720719, 4566897, 4895646, 4576409, 4543045, 4721428, 4580359, 4663850, 4383834, 4155231, 4177135, 4247472, 3743177, 3663410, 3636356, 3629400, 3650332, 3519146, 3536071, 3554470, 3271467, 3370867, 3464277, 3228424, 3264868, 3354016, 3483761, 3469891, 3503793, 3483880, 3537761, 3615836, 3480407, 3674803, 3419027, 3268560, 3573349, 3482823, 3335248, 3106234, 3110861, 3074079, 3074261, 2944947, 2715959, 2771628, 2841860, 2666870]
17197B666870P8741j35712l5944j95282j93185M99270m76999Q2487l4228j14892
17187B141126P3271j03234K32403k00080J61753l80966K21082J03290q2113m6881
17177B119651N2295J06461J22545q782j7807J57390J47108j36398K70574o6884
17167B746153j46850q5127K0393J66495m7516p2734J41468K27320l55836K65473
17157B859239j16116K6669N7034P1822K39911k0337K54522k67950J3923k66560
17147B852157j51106L05466o6257j08809Q8742k17956K69334l9238R3919n3787
17137B972465J39924J30071j02620J86774j95063m800j84893k42515J10128k63862
17127B545609L44393k71685M1563K0932O0471m5365R1305k6252J16798j02332
$$ y = [2666870, 2745611, 2609899, 2573955, 2378673, 2185488, 2684758, 2207759, 2290246, 2256018, 2141126, 2214397, 2111163, 2343566, 2143486, 2305239, 1924273, 2145355, 2248645, 2166532, 2119651, 2171946, 2278407, 2400952, 2392170, 2374363, 2531753, 2678861, 2542463, 2813037, 2746153, 2599303, 2514176, 2534569, 2701064, 2653548, 2580814, 2722282, 2949602, 2593766, 2859239, 2743123, 2769792, 2826826, 2898648, 3138559, 3118222, 3372744, 3104794, 3118717, 2852157, 2701051, 3006517, 2940260, 2831451, 2920193, 2702237, 2971571, 2932333, 3026252, 2972465, 3112389, 3242460, 3139840, 3326614, 3131551, 3126751, 2941858, 2699343, 2809471, 2545609, 2890002, 2618317, 2659880, 2680812, 2741283, 2695918, 2787223, 2760971, 2877769, 2775437]
17117B775437L6531o2343N0418O21m1964j42573J01169J35685J42927j26366K8417
17106B897959J61401K69749k87292j37371K52640l32487j03680L1575k88211l1050
17096B433233P0555n14631K30515m56983J81099M9105k10239j19990K08468n45397
17086A325735M2134M0876K03435k07901r5572n887R7467N0152j65618Q2891J57798
17075A525510k84724K09183n7908P0461j9184k37711K02571N5958p1256j57872
17065A235028J18268q4983o4182K87167n7220l85r3020J75295J2397K55966J85527
17054A969858K7884M85321J23056N24342j49972M33232j79274n0354q6668J59886
17044C257311j3653k70256K66037J0745J94816J22504j17612J16643j5947J35395
$$ y = [2775437, 2811968, 2749625, 2800043, 2800664, 2758700, 2616127, 2717296, 2852981, 2995908, 2869542, 2897959, 3059360, 3329109, 3041817, 2904446, 3157086, 2824599, 2720919, 2752494, 2464283, 2433233, 2503788, 1989157, 2219672, 1762689, 1943788, 1992893, 1782654, 1662664, 1871132, 1325735, 1367869, 1408745, 1612180, 1404279, 1308707, 1302820, 1400287, 1450439, 1284821, 1367712, 1525510, 1240786, 1449969, 1392061, 1462522, 1443338, 1205627, 1408198, 1464156, 1392900, 1235028, 1353296, 1268313, 1204131, 1491298, 1434078, 1433693, 1340673, 1515968, 1528365, 1784331, 1969858, 1997742, 2483063, 2606119, 3130461, 2980489, 3413721, 3234447, 3184093, 3097425, 3257311, 3243658, 2973402, 3239439, 3250184, 3445000, 3567504, 3449892, 3566535, 3550588, 3685983]
17034C685983j90442j73405k34791l60401k25246o7133n36433J90756m39410R9580
17024A749058M2393j00921P7151l85328K88481j97498J52765n6687k28966m0100
17014A300348K15282k27146k13007K49511j53852J0064K59209k52388J72659j99839
17004A160841J16795k0899J18380l32600K43566J6477r9330N4977k30822K74816
16994A302201r990J76344j85345K19766m28979j7052P4567N0908J11228J32102
16984A425750l49025K27623Q0537M2756n5850R4695J42881q8906M9419j98896
16974A370984L3771J18412k1178J4789J54844J852J69451J08547J637L5572J25234
16963B113915M734L96321l04220J35433J45309J44759P3379q5851o3912l9908
$$ y = [3685983, 3495541, 3322136, 3087345, 2726944, 2501698, 2434565, 1898132, 2088888, 1649478, 1749058, 1791451, 1690530, 1767681, 1382353, 1670834, 1473336, 1626101, 1569414, 1340448, 1300348, 1515630, 1288484, 1075477, 1324988, 1171136, 1181200, 1440409, 1188021, 1360680, 1160841, 1277636, 1256737, 1375117, 1042517, 1286083, 1302560, 1203230, 1258207, 1027385, 1302201, 1292211, 1468555, 1283210, 1502976, 1073997, 1056945, 1131512, 1182420, 1293648, 1425750, 1076725, 1304348, 1384885, 1427641, 1371791, 1466486, 1609367, 1520461, 1569880, 1370984, 1404755, 1523167, 1501989, 1516778, 1671622, 1673474, 1842925, 1951472, 1953109, 1988681, 2113915, 2118649, 2514970, 2210750, 2346183, 2491492, 2636251, 2709630, 2623779, 2559867, 2519959]
16953B519959M2253L56596k34687l29455R9438j42752j83383K26966j06811k57226
16943A990898K0521k91368l260j88333K30904j08997j99565q8696q5889J85J25793
16932A402193k12810j45056J19747J03863J04836J7025k27272L2209M4646k06634
16922A032747j17796J47727J4112J02129l01539L18733j9458k00079J19080K9446
16912A125102j26919j01407R9515q8321P4287j34091J36406j92249J94481m7914
16902I38890J42775k264j48747l667j04372J82371k07246O7304Q2209R8181k51152
16891G94282J06255k20555K72000J20058j35685m4693j94748J58220J55374l23709
16881F86799L11580j81361P4426k9433N0818K7244R2227k12506J18930J25955
$$ y = [2519959, 2562212, 2918808, 2684121, 2354666, 2454104, 2311352, 2127969, 2354935, 2248124, 1990898, 2011419, 1720051, 1716791, 1528458, 1759362, 1650365, 1450800, 1362104, 1276215, 1276400, 1402193, 1189383, 1044327, 1164074, 1267937, 1372773, 1389798, 1162526, 1194735, 1239381, 1032747, 914951, 1062678, 1076790, 1178919, 877380, 1196113, 1176655, 976576, 1095656, 1125102, 998183, 896776, 996291, 907970, 982257, 848166, 984572, 792323, 986804, 938890, 1081665, 1079401, 930654, 926987, 822615, 1004986, 797740, 865044, 947253, 1045434, 794282, 900537, 679982, 951982, 1072040, 936355, 891662, 696914, 855134, 1010508, 686799, 998379, 817018, 891444, 862011, 912829, 940073, 1032300, 819794, 938724, 1064679]
16871A064679n6538j24874p1512N5715J79774j52046K28386k87175K6263K91619
16861A154291l74025K64361J39937m68800K74422k21768K73484M1592j21878N0064
16851A011680j50294j4126L71943j9973k34418j07525N4223J20842j81960K67
16841H50659N6107j61213K22767j33364l4100L58492K8920k80284J71207J61682
16831A240873j23763r3681L13540j46438K7473j45017P036P0633R5095k4054J86459
16820A408156P924J45832J9356K75472j96631R6656M5324J26564J1227J91580
16810B131460k61631J72187j2606j53486j88491J41187j06579O1707K359p6048
16800A710059M3228J888P3747q506j72296k7005k10743L04774l35093p9959J14084
$$ y = [1064679, 1008141, 883267, 811755, 867470, 1047244, 895198, 1123584, 836409, 862672, 1154291, 780266, 1044627, 1184564, 715764, 990186, 768418, 1041902, 1083494, 961616, 1011680, 861386, 847260, 1219203, 1199230, 964812, 857287, 911510, 1032352, 850392, 850659, 906766, 745553, 968320, 834956, 800856, 1159348, 1188268, 907984, 1079191, 1240873, 1117110, 1023429, 1336969, 1190531, 1218004, 1072987, 1080023, 1150656, 1245751, 1221697, 1408156, 1416080, 1561912, 1581268, 1856740, 1660109, 1756765, 1802089, 1928653, 1939880, 2131460, 1869829, 2042016, 2029410, 1875924, 1687433, 1828620, 1722041, 1783748, 1786107, 1710059, 1753287, 1755175, 1828922, 1820416, 1648120, 1621115, 1410372, 1715146, 1380053, 1300094, 1414178]
16789A414178r0470k36934k01334M6908J7899o1249J2397l1672k1688m03867N33298
16778I77466k76253P4536N7893J20915R5060k81539q2814L55970r4539l6493j99852
16767G10350J29435R6695n8055J11558j17868o0511K6570J51524j49218L12280
16757A152760p1267j76833r0040l0985J38892Q8077P170j83793J68830o4083J22985
16746A061713j23138J8138k73976K81862n2181j8176m899j29455M8806K89205
16736A097899j51313L861j67456J52861O0166L6239k82907K2274M5614K19106
16726A036344k55357R2945J5872j6874J03722K605K56650m60479K26449K1016
16716A022893Q4728j92184K14008K19486j86110j7013k53536J83504o6878L36047
$$ y = [1414178, 1323708, 1086774, 885440, 932348, 950247, 888998, 901395, 869723, 848035, 444168, 977466, 701213, 775749, 833642, 954557, 1049617, 768078, 685264, 1041234, 946695, 910202, 710350, 839785, 936480, 878425, 989983, 872115, 811604, 838174, 989698, 840480, 1152760, 1081493, 904660, 814620, 783635, 922527, 1010604, 1017774, 833981, 1002811, 938728, 1061713, 938575, 956713, 682737, 964599, 912418, 894242, 889343, 759888, 808694, 1097899, 946586, 950447, 782991, 935852, 996018, 1032257, 749350, 771624, 817238, 1036344, 780987, 873932, 889804, 872930, 976652, 979257, 1235907, 775428, 1001877, 1022893, 1107621, 915437, 1129445, 1348931, 1162821, 1145808, 892272, 1075776, 1008898, 1344945]
16706A344945j26232J69483K03637J3110L75141p9334r0785o6639k37115J2505
16696A518716J38669r6501J4704O4677j87810Q3889L80158o2574j80089K26997
16686A900836k54658J76371j33272r4012n8095l15851J70249j02461N7939j47328
16676A199718K1401j5822l3158M902j14847K75714K3135J42938J3533J06883L66097
16665A990494m1789M444j8928p7795J460k43677j38613K47199P5268q7741J53761
16654A864083K41899m22611K45758m8774j21541R327K9627m30427R3815m4450
16644A416706m79158J89340k98587K60588k3367k5587r4235m5019K23440k11364
16634I12757j67488M79989k98013J60222J33080k50199N9185L53072l60782k4020
$$ y = [1344945, 1218713, 1388196, 1591833, 1604943, 1980084, 1900750, 1809965, 1743326, 1506211, 1518716, 1657385, 1560884, 1575588, 1640265, 1452455, 1536344, 1916502, 1853928, 1673839, 1900836, 1646178, 1822549, 1689277, 1595265, 1537170, 1221319, 1391568, 1289107, 1347046, 1199718, 1221119, 1205297, 1172139, 1177041, 1062194, 1337908, 1361043, 1503981, 1517514, 1624397, 1990494, 1948705, 1953149, 1934221, 1856426, 1857886, 1614209, 1475596, 1722795, 1798063, 1710322, 1864083, 2105982, 1683371, 1929129, 1880355, 1758814, 1768141, 1797768, 1367341, 1461156, 1416706, 937548, 1126888, 828301, 1088889, 1065522, 1039935, 945700, 900681, 1124121, 912757, 745269, 1225258, 927245, 1087467, 1220547, 970348, 1029533, 1382605, 1021823, 997803]
16624I97803P0258J60355k25346J30764n5795j54841K98817l38102R4308K03791
16614A182012j67960Q4696k7954N9904q05L63907l43756J6553K27667r1253j34801
16603A168210o9338J38845m4398j47626J86311M6740k9299K32989r0940j58521
16593A232973O8564N2149J03225l34732L29524O8349l69998n1432M07536j17493
16583A388665k11142r0496J34640M2187n4184j29615J28108q2414M7237J2608
16573A185594O0759j58939R3824K67147j03248k01292L39527p3643M2034L1847
16563A483610q8353J40393Q5046j5241J24274J05653P0662j86671l7760j58268
16553A523345J22966j84054M66979m06739k6036J9353J59252o635j40942P2203
$$ y = [997803, 1068061, 1228416, 1003070, 1133834, 1078039, 923198, 1222015, 883913, 978221, 1182012, 1014052, 1098748, 1070794, 1130698, 1129893, 1493800, 1150044, 1166597, 1394264, 1303011, 1168210, 1098872, 1237717, 1193319, 1045693, 1232004, 1278744, 1249445, 1482434, 1391494, 1232973, 1301537, 1353686, 1456911, 1122179, 1451703, 1520052, 1150054, 1098622, 1506158, 1388665, 1177523, 1087027, 1221667, 1263854, 1209670, 1080055, 1208163, 1125749, 1172986, 1185594, 1246353, 1087414, 1181238, 1448385, 1345137, 1143845, 1483372, 1409729, 1451763, 1483610, 1395257, 1535650, 1620696, 1605455, 1729729, 1835382, 1906044, 1719373, 1681613, 1523345, 1646311, 1462257, 1929236, 1522497, 1496461, 1515814, 1675066, 1668431, 1527489, 1599692]
16543A599692K34907j08666l3795K03764r1005k8395j12002L23899j11442J05646
16533A982603L2507M6604O8543j19860M8757K5564n3250J23223m55121J99055
16523A898625R9304K30810k70886J78933m47377N14460k74867P953J06056k66222
16513A776789q8633L1183J23580j85722K4973o9744N6133j69171q3118j98883
16503A217387N3719j57834M2370j18844L04375l2800o8394j22039O1860r4935
16493A084865K09288o0377l9104o1322L15306J88101L867L71469K34978J82533
16483B429604L20818r5154L37134J95376L70083k71135K15488M21159l36285J36799
16473C723887K27426k01986L00590R8726P05q9261N43749k04371K41027J71532
$$ y = [1599692, 1834599, 1725933, 1692138, 1895902, 1804897, 1776502, 1664500, 1988399, 1876957, 1982603, 2015110, 2061714, 2130257, 2010397, 2059154, 2084718, 2031468, 2154691, 1699570, 1898625, 1997929, 2228739, 1957853, 2136786, 1689409, 2203869, 1929002, 1936955, 2043011, 1776789, 1688156, 1719339, 1842919, 1657197, 1682170, 1612426, 1668559, 1499388, 1416270, 1217387, 1271106, 1113272, 1155642, 1036798, 1341173, 1308373, 1239979, 1117940, 1179800, 1084865, 1294153, 1233776, 1194672, 1133350, 1448656, 1636757, 1640624, 2012093, 2247071, 2429604, 2750422, 2655268, 2992402, 3187778, 3557861, 3286726, 3502214, 3923373, 3587088, 3723887, 3951313, 3749327, 4049917, 4148643, 4149348, 4060087, 4603836, 4399465, 4640492, 4812024]
16463D812024Q0340L42608j19901N23984K01586L96258J15293M17808L20820M65708
16453G556528N01475N76986R86172R54796R12023J474828J629991J579412J770056
16444A7942267J688834K278002K381658K518080L076255L287862L962589L980861
16436D1116408M645652N479490O151534P077469Q306636R837227J0582393J0591937
16428A03788746R398690Q148558P997211Q208129P969341Q318710P926706O407591
16420A68163682N151826L090432K733845K310455J497441J023589N58183m70938
16412A84058515j273450k439228l469060m082656m600674n493435o159144o533817
16404A50007051p504797q104169r030878r672130j0341376j1537808j1362970
$$ y = [4812024, 4892364, 5234972, 5115071, 5639055, 5840641, 6236899, 6352192, 6770000, 7090820, 7556528, 8058003, 8634989, 9621161, 10575957, 11487980, 12962808, 14592799, 16172211, 17942267, 19631101, 21909103, 24290761, 26808841, 29885096, 33172958, 37135547, 41116408, 45762060, 51241550, 57393084, 64470553, 72777189, 82614416, 93196809, 103788746, 113187436, 121335994, 129333205, 137541334, 145510675, 153829385, 161756091, 168163682, 173315508, 176405940, 179139785, 181450240, 182947681, 183971270, 184529453, 184058515, 182785065, 180345837, 176876777, 172794121, 168193447, 162700012, 156540868, 150007051, 142502254, 134398085, 125367207, 115695077, 105353701, 93815893, 82452923]
16397H2452923j1350216j1715684j2179229j3844230j5899624a800331k4584318
16390b6384649k9026136l0440679k5523271j9405428j4620397j2838202j2778320
16383a71017082j1655601p648627j403312P342234J6008711K3235491K8909241
16376a16228945L2042212L2064560b3689195a316571A4837043J0532609N944712
16369C1314364K589999O32238p81794j037567j680780k161140k262994k365623
16361B4246703k241220k319678k414562k251099k126059j751563j599317j463050
16353H080155j376188j044927q87344o58001n70307j95676l82688J79020j75862
16344B968182Q0526k64793J6810k12650O3748j36114k65012m2232O8322j76692
$$ y = [82452923, 71102707, 59387023, 47207794, 33363564, 17463940, -1800331, -26384649, -55410785, -85851464, -111374735, -130780163, -145400560, -158238762, -171017082, -182672683, -190321310, -191724622, -184382388, -168373677, -145138186, -116228945, -84186733, -52122173, -23689195, -1316571, 14837043, 25369652, 31314364, 33904363, 34536601, 33754807, 32717240, 31036460, 28875320, 26612326, 24246703, 22005483, 19685805, 17271243, 15020144, 12894085, 11142522, 9543205, 8080155, 6703967, 5659040, 4771696, 4113695, 3543388, 3347712, 2965024, 3144044, 2968182, 3048708, 2783915, 2800725, 2588075, 2651823, 2515709, 2250697, 2208465, 2276787, 2100095]
16334B100095K55472n1089m1283k97079J65745o4872j48388k49086n5728m7462
16324A566325m08333r1025K26315m6193K29852j91170M38172J79371k86900K35141
16314A851555j4704k8969q7181K04291m09240k66672o5443m43883K64311l17661
16304F86404j09611k3157M3474j46982J67605k05203R6131j79556J85689K6950
16294E41744j51439J85045B19554J02139N6648J54908p3888p5142J21842J2753
16284E18814L53596q6703J5943N9975Q6911j08213j61138k4774J33901k14327
16274E73985m4127K86594J62589Q0142J66079J23087l31741L08400n1329O4966
16264A338645k99815J23920l42504L28730j12797j8314o2681k55073N7660p2623
$$ y = [2100095, 2355567, 2304478, 2263195, 1966116, 2131861, 2066989, 1918601, 1669515, 1613787, 1566325, 1157992, 1066967, 1293282, 1247089, 1476941, 1285771, 1723943, 1903314, 1616414, 1851555, 1836851, 1807882, 1720701, 1924992, 1515752, 1249080, 1183637, 739754, 1004065, 686404, 576793, 553636, 597110, 450128, 617733, 412530, 508661, 329105, 514794, 541744, 390305, 575350, 219554, 321693, 378341, 533249, 459361, 384219, 506061, 518814, 872410, 785707, 801650, 861625, 948536, 840323, 679185, 654411, 788312, 573985, 529858, 816452, 979041, 1059183, 1225262, 1348349, 1016608, 1325008, 1273679, 1338645, 1038830, 1162750, 820246, 1148976, 1036179, 1017865, 955184, 700111, 757771, 685148]
16254F85148o3194J95539j3098k71480K16777j81319P2657J3930k08592L64513
16244H10881n3053L7261J89785K0464M3870j16249J83547N8485j47822j26331
16234I00838J84024k8823l14411j67951K57790o52j03922j42329J47800j06481
16224F25883r440J33099p6270K02218J79026l06823K15213j92337K54465j666
16214A023368N3397K64873j53423j42899K6193l137j66888L6868K31519j54929
16204A014942n8490K32892j59365J36948J42844k87207j06982K08480L9019j95986
16194I67095J55495j41672L65128j51492k6604M9950p0686K2886n9920j52283
16184I57897j1471M4650K18274k49058k147q8277P8773M8444k3024j29158O0531
$$ y = [685148, 621954, 817493, 804395, 532915, 749692, 568373, 641030, 654960, 446368, 810881, 757828, 795089, 984874, 1005338, 1049208, 932959, 1116506, 1174991, 1027169, 900838, 1084862, 1056039, 741628, 573677, 831467, 830815, 726893, 584564, 732364, 625883, 616443, 749542, 673272, 875490, 1054516, 747693, 962906, 770569, 1025034, 1023368, 1076765, 1341638, 1188215, 1045316, 1071509, 1068372, 901484, 938352, 1169871, 1014942, 956452, 1189344, 1029979, 1166927, 1309771, 1022564, 915582, 1124062, 1163081, 967095, 1122590, 980918, 1346046, 1194554, 1167950, 1217900, 1147214, 1170100, 1110180, 957897, 946426, 991076, 1209350, 960292, 958145, 869868, 948641, 997085, 974061, 844903, 905434]
16173I05434K57296k06621j10332K89303j38463k7205k69407K15258q0618j6673
16163H17972j77511J83271k34209K86373j10959K888q1193P091K21590m225j85898
16152G25190J59496o8276P6562j01719j18944j3892K6562K9053k41759J83279
16142F55552J02956j73498K81301j42829l7177M9112j12733K77821k85567m9764
16132E65174J94262o9936K79724j38112R3276l0189O0049k44119J04347j94979
16122F19497K88324j39290J64398R8281j84927j7784n4762K87716j00497P9413
16112A040369k44893L21829p1772k16975J77629j7335j27801K51540O9236j3051
16102A168776q0590J1663j11506M1219J28864j8504q6574j39384J63738P3649
$$ y = [905434, 1162730, 956109, 845777, 1135080, 996617, 969412, 700005, 915263, 834645, 817972, 640461, 823732, 589523, 875896, 764937, 767825, 686632, 693723, 915313, 911088, 725190, 884686, 816410, 892972, 791253, 672309, 658417, 684979, 714032, 472273, 655552, 758508, 585010, 866311, 723482, 686305, 735417, 622684, 900505, 614938, 565174, 759436, 689500, 969224, 831112, 924388, 894199, 954248, 710129, 814476, 619497, 907821, 768531, 932929, 1031210, 846283, 828499, 773737, 1061453, 960956, 1040369, 795476, 1117305, 1045533, 828558, 1006187, 988852, 861051, 1112591, 1181827, 1168776, 1088186, 1099849, 988343, 1029562, 1158426, 1139922, 1053348, 913964, 1077702, 1151351]
16092A151351p5862J52629m7855m4811J7870J33735j68185p7039L07679l29109
16082A020403K65988J00238q1138J55106j54173l16860L19645j81624K11978L3521
16072A373084N9817k61482J68038l0928O9831K08164j32548M9125J861J48272
16062A653234k53837P0228m8686J10753n8718J152J91857m316K0819m9531K98992
16051A931947O0820j18241P9485J47266l03287K12984l93017K21101k7934k23431
16041A587693P542J8190j1760m8273J85413j42066J36035k32132q621N398K67710
16030A765129J10775M0958j32543Q1858j17835J29860k2536k406J16815J51234
16020B121309Q160O3438R5118o7482p4355R0728J36008j68639p1002n1534K5985
$$ y = [1151351, 1075489, 1228118, 1180263, 1135452, 1153322, 1287057, 1118872, 1041833, 1349512, 1020403, 1286391, 1386629, 1305491, 1460597, 1306424, 989564, 1309209, 1127585, 1339563, 1373084, 1432901, 1171419, 1339457, 1308529, 1378360, 1586524, 1453976, 1503101, 1504962, 1653234, 1399397, 1469625, 1420939, 1531692, 1472974, 1474126, 1665983, 1661667, 1682486, 1632955, 1931947, 1992767, 1874526, 1954011, 2101277, 1797990, 2010974, 1617957, 1839058, 1811124, 1587693, 1595235, 1613425, 1601665, 1553392, 1738805, 1596739, 1732774, 1500642, 1492021, 1497419, 1765129, 1875904, 1916862, 1784319, 1866177, 1748342, 1878202, 1855666, 1853260, 1970075, 2121309, 2129469, 2192907, 2288025, 2220543, 2146188, 2236916, 2372924, 2204285, 2133283, 2081749, 2107734]
16009B107734q2597K87954j77975N1081k40791j5792J89323j3911J41082K20480
15999B466588l10179Q809l0162j64099Q5184j14524K83323j33659P7694P3919
15989B242894k75038K57120j00044l8308K66206j07285L72094j29087l11732J77109
15979B353929p916J10892k03222N3801J05479j78806L3016r8686K14012O2191
15969B444690j4442n3261j40126L10928q8581k31763J76465o6808J29780j92924
15959B273958M8370q3906M9999R1924r6342j09334J6282J18572J68367k59147
15949B218743p6884K35531J68963k70233L09346l6128j67079L60884l94597J72324
15939B520870Q010K34840j27699j96844K43615J68991j57318J00471j16443J47216
$$ y = [2107734, 2025137, 2313091, 2135116, 2186197, 1945406, 1929614, 2118937, 2105026, 2246108, 2466588, 2156409, 2165218, 2135056, 1970957, 2056141, 1941617, 2224940, 2091281, 2168975, 2242894, 1967856, 2224976, 2124932, 2086624, 2352830, 2245545, 2617639, 2488552, 2176820, 2353929, 2346013, 2456905, 2253683, 2307484, 2412963, 2234157, 2267173, 2168487, 2382499, 2444690, 2430248, 2376987, 2236861, 2547789, 2459208, 2227445, 2403910, 2337102, 2466882, 2273958, 2322328, 2238422, 2288421, 2380345, 2284003, 2174669, 2190951, 2309523, 2477890, 2218743, 2141859, 2377390, 2546353, 2276120, 2585466, 2549338, 2382259, 2743143, 2348546, 2520870, 2528880, 2763720, 2636021, 2439177, 2682792, 2851783, 2694465, 2794936, 2678493, 2825709]
15929B825709Q8595k8283J84062J34023J97092J76547J78018o1681N74766j09848
15919D159000J98706N45341M17399M78294N95260P00573J008598J642527K054190
15910A1799888K876195M070041N686118P530910Q733959R777518R249465P416523
15902F7140617M686279J316162l153483o197769q889931j0085459r665153q392696
15894B6758567o283625m851483l106606k245585k042599r89100j072026q80130
15886E287413l10791n27214m26289l31459j94590j38547k22665q8621j15283k16567
15876B715387J00893j50848j80469K74769m7395k9166J6296K51570l70948M5778
15866B625867j8491r2762J27978j51297N5714J36204l42762J75533j74015j59987
$$ y = [2825709, 2914304, 2886021, 3070083, 3204106, 3401198, 3577745, 3755763, 3694082, 4268848, 4159000, 4357706, 4903047, 5320446, 5798740, 6394000, 7094573, 8103171, 9745698, 11799888, 14676083, 18746124, 24432242, 31963152, 40697111, 50474629, 59724094, 67140617, 71826896, 73143058, 69989575, 63791806, 54901875, 44816416, 35151263, 26758567, 20474942, 15623459, 12516853, 10271268, 8228669, 7239569, 6167543, 5287413, 4976622, 4449408, 4023119, 3691660, 3497070, 3358523, 3135858, 3047237, 2931954, 2715387, 2816280, 2665432, 2484963, 2759732, 2712337, 2683171, 2699467, 2951037, 2580089, 2625867, 2607376, 2514614, 2642592, 2491295, 2547009, 2683213, 2340451, 2515984, 2341969, 2181982]
15856B181982J10445P8696o170k78338J50522j03286L0030j804o5314J29537q7047
15845B139253J16764p7735j01868N2150k12880J81208p1410J54354N32004j45371
15835B566469J49094k37042J72330J0396j84744P5939J96175l74821k596J38137
15825B509337l03369K18877l15912J77470k01340J04180p7665J05300j60128R0901
15815B147651J75015j46476J46804J32514n1044j6796j32513L3204R7090K97802
15805B683251j97802j37604Q9245m3430K26159L4235j0465P0189K22654o5517
15795B870915j10309J48788K27347J16461p658m8743J13315N8609O8862m569k0528
15784C412490K00209O7846j51174J04284L22876J63506O0195R1155K4876L34957
$$ y = [2181982, 2292427, 2371123, 2364953, 2086615, 2237137, 2133851, 2163881, 2162077, 2096763, 2226300, 2139253, 2256017, 2178282, 2076414, 2128564, 1915684, 2096892, 2025482, 2179836, 2711840, 2566469, 2715563, 2478521, 2650851, 2661247, 2476503, 2552442, 2748617, 2373796, 2371200, 2509337, 2205968, 2424845, 2108933, 2286403, 2085063, 2189243, 2111578, 2216878, 2056750, 2147651, 2322666, 2176190, 2322994, 2455508, 2404464, 2387668, 2255155, 2288359, 2385449, 2683251, 2485449, 2347845, 2437090, 2393660, 2619819, 2654054, 2643589, 2713778, 2936432, 2870915, 2760606, 2909394, 3136741, 3253202, 3245544, 3196801, 3310116, 3368725, 3437587, 3433018, 3412490, 3612699, 3680545, 3529371, 3633655, 3956531, 4120037, 4180232, 4271387, 4296263, 4631220]
15774D631220o6510K76268m49515J63900m7547o6490N3158L2933k34298K25501
15764D518620K6848K63257J3110J31607J52136j83191K71875j30572J54981q3252
15754E135419J6775M9304M2363m3014J43985K31329p5912Q4489K91857k1482L90491
15743F245604K04963m7219N45064K27223K00193P6296K28660j02063J57241K37096
15733G973058m42352Q1011J82286j24319K71294P5513R7452m0000K12112j09999
15723H176056l53956l57043l13596l72975j78571M2088L4737L42942J73153k9664
15713G163171O441m7962l7456R2256j70981j75242K09567O3449J97937L91853
15703G693033K26163J2853M20389K23274J45906J00994J77552K34870k08613L50428
$$ y = [4631220, 4564710, 4840978, 4391463, 4555363, 4507816, 4441326, 4494484, 4527417, 4293119, 4518620, 4545468, 4808725, 4821835, 4953442, 5105578, 4922387, 5194262, 5063690, 5218671, 5135419, 5152194, 5201498, 5243861, 5200847, 5344832, 5576161, 5500249, 5584738, 5876595, 5855113, 6245604, 6450567, 6403348, 6948412, 7175635, 7375828, 7452124, 7680784, 7578721, 7735962, 7973058, 7530706, 7611717, 7794003, 7669684, 7940978, 8016491, 8113943, 8073943, 8286055, 8176056, 7822100, 7465057, 7151461, 6778486, 6599915, 6642003, 6676740, 7019682, 7192835, 7163171, 7169612, 7121650, 7084194, 7176450, 7005469, 6830227, 7039794, 7103243, 7301180, 7693033, 7919196, 7932049, 8352438, 8575712, 8721618, 8822612, 9000164, 9235034, 9026421, 9376849]
15693I376849L07001J29476l58316j02436L08054k16782j21419l35139j61354
15684H825934k00018K25685j79376j39485L9845J1993k2050n7624k40134k21122
15674H043648j54359j66690l98685j0194l6037R562j45233Q9629j02460j6011
15664G113170M7487l3461K86426R7181M61221P2953L19586M09693K92550N40281
15654I607087K42379P50815N00079N42657N97965P17692P91535L98149M76074
15645A4624432L46769N29781L42171M63907M71502N93635J027755P84757J011152
15636B0195861R84030Q83303O62567J78799J30770m48439l40310n07881k37260
15627B1501440m38120k79154J27316N35083J26392o1093r8232m26687n04850r55060
$$ y = [9376849, 9683850, 9813326, 9455010, 9352574, 9660628, 9443846, 9322427, 8987288, 8825934, 8625916, 8851601, 8672225, 8532740, 8572585, 8584578, 8562528, 8504904, 8264770, 8043648, 7889289, 7722599, 7323914, 7313720, 7277683, 7287245, 7142012, 7231641, 7129181, 7113170, 7160657, 7127196, 7413622, 7510803, 7972024, 8044977, 8364563, 8774256, 9066806, 9607087, 9849466, 10600281, 11100360, 11643017, 12240982, 12958674, 13750209, 14148358, 14624432, 14971201, 15500982, 15843153, 16307060, 16778562, 17372197, 18399952, 19184709, 20195861, 21179891, 22063194, 22725761, 22904560, 23035330, 22586891, 22246581, 21738700, 21501440, 21063320, 20784166, 20911482, 21446565, 21572957, 21511864, 21413632, 20986945, 20482095, 19527035]
15617A9527035r89880j176055r45734p62107r73584o08767j80583m79017j0262
15608A3401046m69731j06806n59770l01948k45525n28066r5594k17875n6539j52327
15598A0666865j8801K17148k2672j69059N48551K66639P98652J387653K894548
15589A6569524N783818J0061696J5073995K0821340K2378027J4698290O442773
15582A11829463J886344n315370j7568117k4045171k1282028j5502749r087885
15575B0914487n212487k865585j414010r50822j055036L9124m4239k76370K99207
15566I434269K51374M48431J57993L45325k25526L32672K25401M94302O28514
15557A2092755J188773K468622M209347Q940179J4880736K1688733K8571774K7618702
$$ y = [19527035, 18537155, 17361100, 16415366, 15653259, 14679675, 14070908, 13890325, 13411308, 13401046, 12931315, 12824509, 12264739, 11962791, 11717266, 11189200, 11093606, 10875731, 10819192, 10666865, 10648064, 10865212, 10842540, 10673481, 11222032, 11488671, 12287323, 13674976, 16569524, 22353342, 32415038, 47489033, 68310373, 90688400, 105386690, 111829463, 113715807, 108400437, 90832320, 66787149, 45505121, 30002372, 20914487, 15702000, 12836415, 11422405, 10471583, 9416547, 9455671, 9411432, 9135062, 9434269, 9685643, 10134074, 10292067, 10637392, 10411866, 10744538, 10969939, 11464241, 12092755, 13281528, 15750150, 19959497, 28899676, 43780412, 65469145, 94040919, 121659621]
15549A21659621J6168461N901884K38534j1222455k6497019l1564011k6158634
15542D8526381j7573409j0650870n434108l080530j928027j432002o56938n66948
15534G203549l57860r8393k89460k13671k10656j33117p4431k65787m8984k20116
15524E291074q80o67643J12680r1012j86711N8441p7383p0997k27346L03661J36590
15513D580474l07369K23832M6653J29054K80181n0693L27871l33738N4267J51901
15503E102433l74095P162L0863j99439j24093j92075r7738K03974k91297N11143
15493D576838j54423j93523M75586N4315j37922K91252k13767M0239J47162O3266
15483D949023O50558J12198N42801r3453N55663j65317J76740M1653j33853j37969
$$ y = [121659621, 137828082, 143729966, 143968500, 132746045, 106249026, 74685015, 48526381, 30952972, 20302102, 14867994, 11787464, 9859437, 8427435, 7770497, 7203549, 6845689, 6747296, 6457836, 6244165, 6033509, 5900392, 5825961, 5560174, 5511190, 5291074, 5290194, 4622551, 4735231, 4644219, 4457508, 4515949, 4438566, 4367569, 4140223, 4443884, 4580474, 4273105, 4496937, 4543590, 4672644, 4952825, 4902132, 5230003, 4896265, 4950532, 5102433, 4728338, 4735500, 4766363, 4566924, 4442831, 4250756, 4153018, 4356992, 4065695, 4576838, 4422415, 4228892, 4704478, 4758793, 4620871, 4912123, 4698356, 4738595, 4885757, 4949023, 5599581, 5711779, 6254580, 6161127, 6716790, 6551473, 6728213, 6769866, 6636013, 6498044]
15473F498044l34761K49212K47569N96041M17203J342439J062726O45594Q14093
15464A1538160L07084K98295o40130m55008o47705o93046p35777L2804J27843
15455I132520K45135R39867N20457R10357P31173N66079J200m08691p59692n00365
15445A1378040j122572p27959m96361j81514J6534L41178L42478k8330N08509
15436A0030003N3042j19549m20606O9189o05478n91052k89597l74771l93884P3306
15426G430603l37576j09397J623k370j85122m01998j63129l73945l51923J48807
15416E655573k36187j0702m07030p2874k01660K12011J64116j883q8077J50857
15406E164144l69933K68177n615L2284J93251M5372K26393R9651p5391R1689J1791
$$ y = [6498044, 6163283, 6412495, 6660064, 7256105, 7673308, 9015747, 10078473, 10724067, 11538160, 11845244, 12143539, 11503409, 11048401, 10400696, 9707650, 8971873, 9004677, 9132520, 9377655, 10317522, 10837979, 11748336, 12479509, 13045588, 13046788, 12638097, 11878405, 11378040, 10255468, 9527509, 9031148, 8849634, 8866168, 9207346, 9549824, 9521494, 10030003, 10083045, 9963496, 9542890, 9612079, 9006601, 8415549, 8125952, 7751181, 7357297, 7430603, 7093027, 6983630, 6985253, 6982883, 6797761, 6395763, 6232634, 5858689, 5506766, 5655573, 5419386, 5408684, 5001654, 4928780, 4727120, 4939131, 5103247, 5101364, 5013287, 5164144, 4794211, 5062388, 5056773, 5089057, 5282308, 5327680, 5554073, 5653724, 5578333, 5670022, 5681813]
15395E681813M0004N2207O8621l5521M4106j40920K53333r0037J34607M2385L38454
15384F389052j34816O3473J31136O2813L5515O4271M4228k10867K54243j36674
15374F562374N449N4838M6352j65831K1311P4161m2034p782J66781J65833M7389
15363F928841L19813N6485L42692L88207L3695K5421K37373j00753M99738j43308
15353H588204M10411P4265O50435J12982R05543J150738K018535L779957O172230
15344B3863300R164336J1681962J1668343Q565346L643859P47737m116184r765869
15336E5452830j2508848j0683410p673281m231879k511206r17370p23725m14692
15328A5788419m70786j97578j013585m35907n91209K65572k86611N70210J54234
$$ y = [5681813, 5721817, 5774024, 5842645, 5807124, 5851230, 5710310, 5963643, 5873606, 6008213, 6050598, 6389052, 6254236, 6317709, 6448845, 6511658, 6547173, 6611444, 6655672, 6444805, 6699048, 6562374, 6567823, 6622661, 6669013, 6503182, 6524493, 6598654, 6556620, 6548838, 6715619, 6881452, 6928841, 7248654, 7305139, 7647831, 8036038, 8069733, 8095154, 8332527, 8231774, 8731512, 8588204, 8998615, 9072880, 9723315, 9836297, 10741840, 11892578, 13911113, 17691070, 23863300, 33027636, 44709598, 56377941, 64943287, 68587146, 69334883, 65218699, 55452830, 42943982, 32260572, 24587291, 20355412, 17844206, 16926836, 16203111, 15788419, 15317633, 15120055, 14106470, 13670563, 13079354, 13344926, 13058315, 13628525, 13782759]
15319A3782759M91328O58635K85192P18899J715559L010115N576362R400517J4327081
15310D9966447J8966938K1413051J8445325J2412092M944725l552203j2601716
15303A09994659k0294708k2492402j9724657j4043061q562025n250576k776210
15296A6851020j670539j140904l57551n86667L91j20298N2814J27161j14238J2731
15286A3053920l80920k18769j51127j74924M96033N27669J138294K668053M064286
15277B1022515O704011R363659J1277734J0566593O250389K360853n04179n565229
15269F1476346j0400271j2223005r935167o754434m454950k245650j723025r12604
15261A2827240j046526r94329p56444r38454m02152j92842L39822K15583Q4708
$$ y = [13782759, 14274087, 14932722, 15217914, 15936813, 17652372, 20662487, 26238849, 35639366, 49966447, 68933385, 90346436, 108791761, 121203853, 126148578, 122596375, 109994659, 89699951, 67207549, 47482892, 33439831, 24877806, 19627230, 16851020, 15180481, 14039577, 13682026, 13095359, 13095750, 12975452, 13028266, 13155427, 13041189, 13053920, 12673000, 12454231, 12303104, 12128180, 12624213, 13151882, 14290176, 16958229, 21022515, 27726526, 37090185, 48367919, 58934512, 65184901, 67545754, 67041575, 61476346, 51076075, 38853070, 28917903, 22163469, 17708519, 15462869, 13739844, 12827240, 11780714, 10786385, 10029941, 9091487, 8689335, 8496493, 8836315, 9051898, 9136606]
15252I136606O69757K22686K54135K29133m91833K38568J58287j68549r7324n61498
15242I589968j69624n34705m14057l67904j28522J4530R1286J33854L61046L42365
15232H918237P37612O39246L12802M91062J05149L4613k65141k48620n23974o88095
15222I512891m29872k55202k06328k2525K3556r9531K71072M68987L03209O66263
15212A0232520R07501J14138K26418n98647r8939m50038m79462p59163n00679
15203H593649o01621n89498j26142m54664Q8569k64507j08616J08585m61883K03768
15193F387640N4486p1870j33925J55834K79537N4953L07252K79172j29665j54135
15183G029279R8215q1148j01015K32631r1241K06008L02853J36781K28731p6490
$$ y = [9136606, 9806363, 10029049, 10283184, 10512317, 10020484, 10259052, 10417339, 10248790, 10151466, 9589968, 9420344, 8885639, 8471582, 8103678, 7975156, 7989686, 8080972, 8214826, 8575872, 8918237, 9655849, 10295095, 10607897, 11098959, 11204108, 11238721, 10973580, 10724960, 10200986, 9512891, 9083019, 8827817, 8621489, 8598964, 8622520, 8522989, 8794061, 9263048, 9566257, 10232520, 11140021, 11254159, 11480577, 10881930, 10782991, 10332953, 9853491, 9094328, 8593649, 7992028, 7402530, 7276388, 6821724, 6910293, 6645786, 6537170, 6645755, 6183872, 6387640, 6442126, 6370256, 6236331, 6392165, 6671702, 6726655, 7033907, 7313079, 7183414, 7029279, 7127494, 7046346, 6945331, 7177962, 7086721, 7292729, 7595582, 7732363, 7961094, 7884604]
15173G884604L09064j73926q7964O1952m42900L69080j90829j5330n5891K79419
15163G937279j31468M9380N9075L20827l7276K51465m8266N37525l8973J48795
15153I048363Q3606j76623Q9396p4297N4053l77048L2275j15697Q374K74457L2484
15142H879343m32292J10935L4234J755k07547K27241N6623o8906J69291j68574
15132H602103k62300J49354k62008Q2197L58729l15903P6680J25228m7803M5424
15122H551701m1385J12259m27250j14282K73859m36078J29721j27038J48434n7808
15112H012133J38125l32749J50630K7112Q0856K47429K07448J78619L48280J1831
15102I069714n7781L06373K86746L79194J45348K56788J19141L79674J21475O15497
$$ y = [7884604, 8193668, 8019742, 7931778, 7993730, 7550830, 7919910, 7729081, 7713751, 7657860, 7937279, 7805811, 7855191, 7914266, 8235093, 8197817, 8449282, 8401016, 8938541, 8899568, 9048363, 9131969, 8955346, 9044742, 8970445, 9024498, 8647450, 8679725, 8564028, 8572402, 8846859, 8879343, 8447051, 8557986, 8592220, 8593975, 8386428, 8613669, 8670292, 8601386, 8770677, 8602103, 8339803, 8489157, 8227149, 8309346, 8668075, 8352172, 8428852, 8554080, 8506277, 8551701, 8510316, 8622575, 8195325, 8081043, 8354902, 7918824, 8048545, 7921507, 8069941, 8012133, 8150258, 7817509, 7968139, 7995251, 8076107, 8323536, 8530984, 8709603, 9057883, 9069714, 9011933, 9318306, 9605052, 9984246, 10129594, 10386382, 10505523, 10885197, 11006672, 11622169]
15092A1622169K74999R67562J339587J905080L208409L953910M410609M048573
15084C1730898K479094J442345L845j846369l539919l547160l209399j958878
15076B1554457m49270J002320J919513L582401M342987M403025L227277J656360
15068D1239070N29468j241359l088450l545456k016235l66763K606849N661447
15060C9778571P680003O911467L702840K603134J382614j770468m075138l746089
15052E2466934j416505m05619J200136J571727K622560K978438M054485M157901
15044F7230057K968600K131691R82110l14538j777145k775062k410936j942119
15036F4092658j955604j521964k063044k398675j190528K40854K580046N074820
$$ y = [11622169, 11897168, 12864730, 14204317, 16109397, 19317806, 23271716, 27682325, 31730898, 34209992, 35652337, 35656182, 33809813, 30269894, 26722734, 23513335, 21554457, 21105187, 22107507, 24027020, 27609421, 31952408, 36355433, 39582710, 41239070, 41768538, 40527179, 37438729, 33893273, 31877038, 31510275, 34117124, 39778571, 47458574, 54370041, 58072881, 60676015, 62058629, 60288161, 56213023, 52466934, 51050429, 50644810, 51844946, 53416673, 56039233, 59017671, 63072156, 67230057, 70198657, 72330348, 73312458, 72997920, 71220775, 68445713, 66034777, 64092658, 62137054, 60615090, 58552046, 56153371, 54962843, 55203697, 57783743, 62858563]
15028F2858563P102800Q571470R219311O827424M069548K285071m56080l917272
15020I6560835n849987o382808n174385l774610j958614n03740Q51727K153106
15012G5921524K261362J521932l41677j445591k513219n053494n877672n480927
15004E8992238m051857l543181k741135k115333j114468N50878J119616K855422
14996D9952180L059381L602062L056371J727428L35757n80500j814173l131845
14988E6206661l625320k516842j187318M04781J706950K446390K200164J701850
14980E7337316J027454j37940k747911m739652m354414m402179l981439m099211
14972C3902024l132648k037367j242789l57355M9418K43948P27864O49871R40305
$$ y = [62858563, 69961363, 78532833, 87752144, 94579568, 98649116, 100934187, 100478107, 96560835, 90710848, 84328040, 79153655, 75379045, 73420431, 72916691, 73768418, 75921524, 78182886, 79704818, 79363141, 77917550, 75404331, 70350837, 64473165, 58992238, 54940381, 51397200, 48656065, 46540732, 45426264, 45977142, 47096758, 49952180, 53011561, 56613623, 59669994, 61397422, 61733179, 61152679, 59338506, 56206661, 52581341, 50064499, 48877181, 49281962, 50988912, 53435302, 55635466, 57337316, 58364770, 58226830, 55478919, 50739267, 46384853, 41982674, 38001235, 33902024, 30769376, 28732009, 27489220, 27131865, 27181283, 27425231, 28153095, 28802966, 29743271]
14963B9743271N81038J138363R90076J484504J735212K204355L228663N151644
14955D6257126P540616J1524611J6822521K2352242K8857826L5959230M1472235
14948B10786407M3331336M5722012M6678057M2104798L3849551K6306226J7356874
14941D66135261l80528k0318768l1539486l7276734m2592028m3574247l6671433
14934B53782037k6844555j7445501j0825084r806424j1786816j4439557j5187547
14927A47446553j4618717j3195755j1788747j0418733p321694m187000J6276K467595
14919H8399778K022420k18361k526891n053510r800256j3007608j3195306j1019114
14911C5601152p837804n068921l424727j798812j625140p69201j35634k12397
$$ y = [29743271, 30324309, 31462672, 32452748, 33937252, 35672464, 37876819, 41105482, 46257126, 53797742, 65322353, 82144874, 104497116, 133354942, 169314172, 210786407, 254117743, 299839755, 346517812, 388622610, 422472161, 448778387, 466135261, 465754733, 445435965, 413896479, 376619745, 334027717, 290453470, 253782037, 226937482, 209491981, 198666897, 188860473, 177073657, 162634100, 147446553, 132827836, 119632081, 107843334, 97424601, 90102907, 85915907, 85932183, 88399778, 90422198, 90203837, 87676946, 82623436, 72823180, 59815572, 46620266, 35601152, 27763348, 22694427, 19269700, 17470888, 15845748, 15076547, 14940913, 14728516]
14903A4728516M37322R70592J166618J228344J639292J905425J865356J823509
14895B5764974K686310M621651O304054P744092P258860N097766K620189j28759
14887F1969137m086028p346967r443324q987033p213823m189457k648234j649117
14879A6405154o98035k46973M4796J19858O69149R73679J193043J620836J247484
14870B1328991J013177N59854J42185n06556q47776r08141o73624K19317P23477
14861B1050904J189919K339339L966609N874113R023862J2845133J5612012J6200535
14853H8102426J4709293J3067053P227083k69794p744421j2700118j4971813j6506240
14845G0913469j5927318j3082374r204416o100255l828495k661543j631102j195787
$$ y = [14728516, 15165838, 16136430, 17303048, 18531392, 20170684, 22076109, 23941465, 25764974, 28451284, 33072935, 39376989, 47121081, 54379941, 59477707, 62097896, 61969137, 57883109, 50536142, 41092818, 32105785, 24891962, 20702505, 18054271, 16405154, 15707119, 15460146, 15504942, 15624800, 16293949, 17267628, 18460671, 20081507, 21328991, 22342168, 22902022, 23044207, 22537651, 21689875, 20781734, 20108110, 20327427, 21050904, 22240823, 24580162, 28546771, 34420884, 43444746, 56289879, 71901891, 88102426, 102811719, 115878772, 123105855, 122836061, 115091640, 102391522, 87419709, 70913469, 54986151, 41903777, 32699361, 26599106, 22770611, 20109068, 18477966, 17282179]
14837A7282179p07413k71107m29057l12035J45450k50188j72769J51275K71453
14828A5707788K94572L54097Q21111R54319P42832J074803J104838J657586L241157
14819B5953103M709496P297459J0445854J2531693J2238586R098964M225634m78568
14811H6022221o359073j1553877j3970216j4289798j0662132o863794m435212
14804A7888119k239395j484724j058130r72449l83217j42511l08434n20126j54239
14795A0624894n77160m38642k99854o63608J09002l70908p1985m66342J15871
14786G961268j36089L90294n1897l6617L45909J11872M09009O44278P36627J025210
14776A1399864J130830J276943O10131O4714J51710p52798j415363j174101j191064
$$ y = [17282179, 16574766, 16303659, 15874602, 15562567, 15708017, 15457829, 15285060, 15436335, 15707788, 16002360, 16356457, 17177568, 18131887, 18874719, 19949522, 21054360, 22711946, 25953103, 30662599, 37960058, 48405912, 60937605, 73176191, 82275155, 86500789, 86022221, 79663148, 68109271, 54139055, 39849257, 29187125, 22323331, 17888119, 15648724, 14164000, 13105870, 12133421, 11750204, 11607693, 11299259, 10779133, 10624894, 10047734, 9609092, 9309238, 8645630, 8754632, 8383724, 8311739, 7845397, 7961268, 7825179, 8215473, 8163576, 8126959, 8472868, 8584740, 8993749, 9638027, 10374654, 11399864, 12530694, 13807637, 14417768, 14482482, 14634192, 13881394, 12466031, 11291930, 10100866]
14767A0100866o41620q58863j87274K5131n3016L52536o3538M84281o1620N22695
14757I619578J94094N21304K52595L93857J44743K2949J26282j17421j15618j29931
14747A0912432K39624Q7883O1940J78930M21490O42193L33238Q44183Q58646J126000
14737A5706559J241907J768472K600584K911774M233374O156693R205607J3903867
14729E7728837K1133753L1057912M2477445N1819661N4890448M9559520L8334772
14722C47002348J9471189o591031k9340620m6087202n5301819n5980278m7921044
14715A25251543l6100707k4823375j6443324j0564913p047019m766550k989449
14708B2516206k636304j848905j468911j026628j346598j318539r29631q22177
$$ y = [10100866, 9459246, 8600383, 8413109, 8438240, 8385224, 8737760, 8674222, 9158503, 9096883, 9619578, 9813672, 10334976, 10587571, 10981428, 11126171, 11149120, 11275402, 11157981, 11042363, 10912432, 11152056, 11239939, 11301879, 11480809, 11902299, 12544492, 12877730, 13721913, 14580559, 15706559, 16948466, 18716938, 21317522, 24229296, 28462670, 34619363, 43824970, 57728837, 78862590, 109920502, 152397947, 204217608, 259108056, 308667576, 347002348, 366473537, 359882506, 330541886, 284454684, 229152865, 173172587, 125251543, 89150836, 64327461, 47884137, 37319224, 30272205, 25505655, 22516206, 19879902, 18030997, 16562086, 15535458, 14188860, 12870321, 11940690, 11118513]
14700A1118513r69335l57762m85140n32657p49424p4410j59321M2535p3982J10474
14690G869491K49959j22013n8857K94155j34195j50529O9933N6299P8814Q7715
14680H240772J20837J55913J07146M39652K29256P39191R22402J482181M70462
14671A2907812M98368J29397n86403j238255j649637j264353q18659q54021j34531
14662F989718O52095M18308l9396K36228k76446l91079o33353m73918l70651p3300
14652F038206j7945M4200J43054j52212j3662N0756K39187J70414L98103J14251
14642G014352K40802J45622q0846o6934M580J76125L04183M11580O79867O09599
14632I438930N44532L14099N1116l43408p92996j046150p79278j071227p24897
$$ y = [11118513, 10149178, 9791416, 9306276, 8773619, 8024195, 7949785, 7790464, 7832999, 7759017, 7869491, 8119450, 7997437, 7938580, 8232735, 8098540, 7948011, 8017944, 8074243, 8153057, 8240772, 8361609, 8517522, 8624668, 9064320, 9293576, 10032767, 10955169, 12437350, 12907812, 13406180, 13535577, 12949174, 11710919, 10061282, 8796929, 7978270, 7124249, 6989718, 7641813, 8060121, 8020725, 8256953, 7980507, 7589428, 6956075, 6482157, 6111506, 6038206, 6020261, 6064461, 6207515, 6055303, 6041641, 6092397, 6331584, 6501998, 6900101, 7014352, 7255154, 7400776, 7319930, 7252996, 7257576, 7433701, 7737884, 8149464, 8829331, 9438930, 9983462, 10297561, 10348677, 10005269, 9212273, 8166123, 7386845, 6315618, 5590721]
14623E590721l48890k11532J40914q433k32574j62638j18239n13468K50598m6066
14613D340393j67871k68919L36695n7944k23343j42815j48023q8171k10742o1565
14603C307695k4587K0675M9794L21724M15022L95580Q40985N70039R80897N81184
14593G459008N66766J5214n53795m57042o64713q43885p50938n23986m6364l06061
14583C894204j09078K39191J10378j15388J53947j12359K75704k62349L06357
14574D380607j11579L22798O7786J27746j2863K6635N48734J50837K12144Q90744
14564F603589N17231J387904O99728J173807K110816M023265O119921R225575
14556C1861836J2312365J3086899R269478M187231J329373l664359r772652j3294894
$$ y = [5590721, 5241831, 5030299, 5171213, 5162780, 4930206, 4767568, 4649329, 4135861, 4386459, 4340393, 4172522, 3903603, 4240298, 4182354, 3959011, 3816196, 3668173, 3580002, 3369260, 3307695, 3283108, 3303783, 3353577, 3675301, 4090323, 4485903, 5326888, 5896927, 6877824, 7459008, 8025774, 8040988, 7487193, 7030151, 6365438, 5521553, 4770615, 4246629, 4200265, 3894204, 3785126, 4024317, 4134695, 4019307, 4173254, 4060895, 4336599, 4074250, 4380607, 4269028, 4591826, 4659612, 4787358, 4774495, 4801130, 5349864, 5500701, 5712845, 6603589, 7120820, 8508724, 9208452, 10382259, 12493075, 16516340, 22636261, 31861836, 44174201, 57261100, 66530578, 70717809, 72047182, 68382823, 58610171, 45315277]
14548D5315277j2053480q459215m709573j477144J684625M572698P942814J1692634
14540D4508636J3536740J1531146O070591K412170j872401q087208j3661241j4177797
14532D0260636j1670531p880328m546859j490483p77976K16162K45288M02628
14524A4758537q1675J57849l10664k9749O66413K527497N092418P701995R753624
14515D0236245Q759712N734331K241076J86333m199435q504729r411029p805696
14507B7236808m405156j745761M58408K407076M312274O554058P973442Q432434
14499E1223583O294370K376366J87673l059134p167500j0427139r558618o815864
14491B3053737m536150k330114j785198j385475r60244j301767j188926j630241
$$ y = [45315277, 33261797, 24802582, 20093009, 18615865, 20300490, 24873188, 32816002, 44508636, 58045376, 69576522, 75647113, 78059283, 76186882, 68099674, 54438433, 40260636, 28590105, 20709777, 16162918, 14672435, 13894459, 14110621, 14355909, 14758537, 14676862, 14834711, 14524047, 14494298, 15160711, 17688208, 22780626, 30482621, 40236245, 48995957, 54730288, 56971364, 57157697, 52958262, 44453533, 35042504, 27236808, 22831652, 21085891, 21544299, 23951375, 28263649, 34817707, 42791149, 51223583, 57517953, 59894319, 60081992, 57022858, 49855358, 39428219, 29869601, 23053737, 18517587, 16187473, 14402275, 13016800, 12056556, 10754789, 9565863, 7935622]
14483G935622j239738j110291l84771p93133r1601r6265K21627k24791K80483
14474D497142l19909j30995J14060N0571K38968M43109P71218Q76708K42436K37916
14464G021224o8672o4909o26698o09280j98032M5144L23399R00332Q07808L02835
14454G833151L22314j76506K8974n04992p96837l23336l24088m6873l1055j48033
14444E832719M86403N25997M07510J66407P35604L6086K51171K27862J5800L7211
14434H722770J79419M19753K57287P71825J186961J826492L040362M359967O816367
14425B7581203Q772416R598231Q670359O109569K878728p78071m739854p730329
14417E0362252r328754q797795o844227n161775l690872k735207j851105j300547
$$ y = [7935622, 6695884, 5585593, 5200822, 4407689, 4316088, 4219823, 4441450, 4216659, 4497142, 4177233, 4046238, 4160298, 4210869, 4449837, 4892946, 5664164, 6540872, 6783308, 7021224, 6952552, 6887643, 6260945, 5651665, 5453633, 5498777, 5822176, 6722508, 7530316, 7833151, 8155465, 7978959, 8007933, 7502941, 6706104, 6382768, 6058680, 6011807, 5980752, 5832719, 6319122, 6845119, 7252629, 7419036, 8154640, 8190726, 8441897, 8669759, 8685559, 8722770, 8902189, 9321942, 9579229, 10351054, 11538015, 13364507, 16404869, 20764836, 27581203, 36353619, 45951850, 54622209, 60731778, 63610506, 62832435, 58092581, 50362252, 41033498, 32235703, 25391476, 20229701, 16538829, 13803622, 11952517, 10651970]
14409A0651970q72120m64630k31543p6374l88863J43528M7254L39053k44826r6402
14399H807047M13064J25815P80525M97261J028174J788838K539188M417144O630454
14390B7027510R677839J3264109J5026785J5620015J3339093Q440293K026164
14383A04421808l444508j0309046j4541523j5857129j4453937j1647934q762905
14376B5404826n397238m109043k423122j528528j220959l99204m08781m86958
14368I430993M8097k6384m92304J46707K0108k79381L39294K81529L55677Q34609
14358A0658945O98780J437469J990958K809819L777740N301144O519307P372465
14350D0566627P690702P360799N255896M150987K529801J234537J262008K118289
$$ y = [10651970, 9779850, 9315220, 9083677, 9007303, 8618440, 8761968, 8809222, 9148275, 8903449, 8807047, 9220111, 9345926, 10126451, 10623712, 11651886, 13440724, 15979912, 20397056, 27027510, 36705349, 49969458, 64996243, 80616258, 93955351, 102395644, 104421808, 100977300, 90668254, 76126731, 60269602, 45815665, 34167731, 25404826, 20007588, 15898545, 13475423, 11946895, 10725936, 10326732, 9917951, 9430993, 9479090, 9452706, 8960402, 9107109, 9127217, 8847836, 9187130, 9468659, 9824336, 10658945, 11357725, 12795194, 14786152, 17595971, 21373711, 26674855, 33194162, 40566627, 48257329, 55618128, 60874024, 65025011, 67554812, 68789349, 70051357, 72169646]
14342G2169646L324363L854406L000958K510472n8349k162587m363671o791562
14334G1483676q517497p536332o523724o580145n433417m165975m658758n372965
14326B2694863n187392l693223k621117j631437j161389j020101n75438n93605
14318F211161n55203l83265m92486l79039j28757k67728k57177j15505j24577
14309C507424L7878j03448m6297P8224j77573j86278o8385k76643O975p5102M1373
14298B738148J67489j84573R8449O349k1488j28945j78410m5448k298p6119r2379
14287B280775O8361P6150M7726J15080j64521q9599M537R3181P094R4129L4230
14276B567143n1872J12141k02567L35456K41108R9591n42421K23888j70003K73564
$$ y = [72169646, 75494009, 79348415, 82349373, 84859845, 84801496, 82638909, 78275238, 71483676, 62966179, 55429847, 48906123, 42325978, 36892561, 32726586, 28067828, 22694863, 17507471, 13814248, 11193131, 9561694, 8400305, 7380204, 6804766, 6211161, 5655958, 5272693, 4780207, 4401168, 4272411, 4004683, 3747506, 3632001, 3507424, 3545302, 3441854, 3395557, 3473781, 3296208, 3109930, 3041545, 2764902, 2771877, 2696775, 2738148, 2905637, 2721064, 2819513, 2825862, 2804374, 2675429, 2497019, 2451571, 2449273, 2373154, 2280775, 2349136, 2425286, 2473012, 2588092, 2423571, 2333972, 2338509, 2431690, 2438784, 2532913, 2567143, 2515271, 2627412, 2424845, 2760301, 3001409, 3101000, 2558579, 2782467, 2612464, 2886028]
14266B886028l28676M6096m9497k76376K64257j53164q8418M02044j98145j99713
14256B304436M1604L5942m02863K45691J03269k87021J75270j89898J40141o8489
14246B098082m6150r7507j0448m4815J18331p1679k11497Q0257K911R0676L62878
14235B271039P952n4147J92259l3987l5056k43106l7690P3142r6058n5856o064
14224A982428l5509r348J31702l7190J36641k72605j2688L03291j59756J30945
14214B157911R4119M19133O5398m0881J02849R4134l3785K7273N15515O80326
14204D081992O45066K11872N0359L12107n23710r12824r03473n53652m39077j32383
14194A836277j08301q4451N80333m42560J97593O521J98510P032j39376J39638
$$ y = [2886028, 2557352, 2603448, 2553951, 2277575, 2541832, 2388668, 2300250, 2702294, 2504149, 2304436, 2346040, 2381982, 1979119, 2224810, 2328079, 2041058, 2216328, 2026430, 2166571, 2098082, 2051932, 1954425, 1943977, 1899162, 2017493, 1945814, 1734317, 1814574, 1817485, 1908161, 2271039, 2278991, 2224844, 2417103, 2383116, 2348060, 2104954, 2067264, 2140406, 2044348, 1988492, 1982428, 1946919, 1937571, 2069273, 2032083, 2168724, 1896119, 1883431, 2186722, 2026966, 2157911, 2252030, 2671163, 2736561, 2695680, 2798529, 2892663, 2858878, 2886151, 3401666, 4081992, 4727058, 4938930, 4989289, 5301396, 4777686, 3864862, 2961389, 2407737, 1968660, 1836277, 1727976, 1643525, 2223858, 1781298, 1978891, 1985412, 2183922, 2190954, 2051578, 2191216]
14184B191216j35445j00507l26441K62645J00028J03869j34866M35720K39929
14175B636148J21692M96101j36407k3258k39640j88037J450j68021l41425o5606
14165B092997k26944L08273m92682K79605l38901M43014k98857J33620J37546
14156B037671R2340K80629j93907K1275j98932K5302k3378K52110j59278J80630
14146B314462j61333K8010J60200L217N05899K68130K63625Q57670Q33873J105803
14136F179556J349837P52630O06556K20595j66550o56534r56842j108655r20877
14127E299716q81084n56599n84452l20068k27283k47475K49634J97353J60486
14118C090228K51921L78753K31676N365j5439P8484l48540m95031o5177k60375
$$ y = [2191216, 2055771, 1955264, 1628823, 1891468, 1991496, 2095365, 1960499, 2396219, 2636148, 2757840, 3253941, 3117534, 3094276, 2854636, 2666599, 2668049, 2500028, 2158603, 2092997, 1866053, 2174326, 1681644, 1961249, 1622348, 2065362, 1766505, 1900125, 2037671, 2130011, 2410640, 2216733, 2238008, 2039076, 2064378, 2041000, 2293110, 2133832, 2314462, 2153129, 2181139, 2341339, 2344556, 2850455, 3118585, 3382210, 4239880, 5073753, 6179556, 7529393, 8282023, 8888579, 9109174, 8942624, 8286090, 7329248, 6220593, 5299716, 4418632, 3862033, 3277581, 2957513, 2730230, 2482755, 2732389, 2929742, 3090228, 3342149, 3720902, 3952578, 3957943, 3942504, 4020988, 3672448, 3177417, 3112240, 2851865]
14108B851865n9208r0143k46925J62635l2864J79320j73207o91K5897J79792N1549
14097B848020N22525Q07476N47983M81476M18674m0344m9863K9132k86384k80518
14087D998177k54293J88627j45946L41845L81724P47011R39062P49206N94091
14078H539504R11202P26743Q70390K85515J011763J081299J828205K659174L383537
14069B1297332N080196O789983P892994R760914J0278945R053717O718172L804451
14061H0676704R00240k147414n913864r303628j0540779j0096523q941280p060288
14053B7573168n095845m275008k996874k469142j796433j509519j071105p81144
14045G578098m13705k20977m57921L45762l17704J30739m42020m24796n37565
$$ y = [2851865, 2792657, 2702514, 2455589, 2618224, 2585360, 2764680, 2591473, 2590782, 2616679, 2796471, 2848020, 3370545, 4178021, 4726004, 5207480, 5626154, 5585810, 5535947, 5565079, 5278695, 4998177, 4743884, 4932511, 4786565, 5128410, 5510134, 6257145, 7196207, 7945413, 8539504, 9450706, 10177449, 11047839, 11333354, 12345117, 13426416, 15254621, 17913795, 21297332, 26377528, 33167511, 41060505, 50821419, 61100364, 70154081, 76872253, 80676704, 81576944, 79429530, 73515666, 64212038, 53671259, 43574736, 34633456, 27573168, 22477323, 18202315, 15205441, 12736299, 10939866, 9430347, 8359242, 7578098, 7164393, 6943416, 6485495, 6831257, 6513553, 6644292, 6202272, 5777476, 5239911]
14036E239911l33189n41788n82277O8748m13824k18482l98619p0605l8695J62063
14026B873243l07814m1474K29750n59613K23995k21414K42993k53373J998P1223
14016B259514o5951M3519r9285m8131K63207k58466P2492n6812J56438J36610
14006B403135n04387J24428L14131p8824l04810k11101L8931J77043l2347Q7180
13996B013379J14398p8733K04659k99828K12625L80141n2720K21773M64422N58826
13986C738942Q09768P99882J332323J618668J550006J427501P80576Q84979j95715
13977A2746930r64072j514081j813773j674079j174299o93118q35739L6669o64753
13968C449685K15151J01331j74024k50865j60207j00195l10029k61289l256o9819
$$ y = [5239911, 4906722, 4364934, 3782657, 3851405, 3437581, 3219099, 2820480, 2749875, 2711180, 2873243, 2565429, 2523955, 2753705, 2194092, 2418087, 2196673, 2439666, 2186293, 2188291, 2259514, 2193563, 2237082, 2137797, 2089666, 2352873, 2094407, 2166899, 2110087, 2266525, 2403135, 1898748, 2023176, 2337307, 2258483, 1953673, 1742572, 1781503, 1958546, 1926199, 2013379, 2127777, 2049044, 2253703, 1953875, 2166500, 2546641, 2493921, 2715694, 3180116, 3738942, 4548710, 5348592, 6680915, 8299583, 9849589, 11277090, 12057666, 12942645, 12746930, 11782858, 10268777, 8455004, 6780925, 5606626, 4913508, 4077769, 4114438, 3449685, 3664836, 3766167, 3592143, 3341278, 3181071, 3080876, 2770847, 2509558, 2506302, 2436483]
13958B436483k21623J72641k32861j57084j21860L0314m1627J63237k87641L12978
13948B052957J85408L20232p6884J76503L75648k14236L42828J65656N92852J069891
13938D990855J922928K149233K678296K458931K501535J634149K97456n18496
13930A8114887k005929k655324k346432k882688k023553j486135j157973n00936
13922C055917m11468m60956j44616j87611k42490n9632n7364K44790j42950J8213
13912A611833j19275K20538q0631k0724k11789N0716j68397P8912J37982j00101
13902A399064n5107K02987O9387l6924k13863j63507L40024j53055o4442j3332
13892A311232K44869k97924L4596N2940l5571m9577m1182K47645L2414J8202K6809
$$ y = [2436483, 2214860, 2387501, 2154640, 1997556, 1875696, 1906010, 1864383, 2027620, 1739979, 2052957, 2238365, 2558597, 2481713, 2658216, 3033864, 2819628, 3162456, 3328112, 3920964, 4990855, 6913783, 9063016, 11741312, 14200243, 16701778, 18335927, 18633383, 18114887, 16108958, 13453634, 11107202, 8224514, 6200961, 4714826, 3556853, 3055917, 2644449, 2183493, 2038877, 1851266, 1608776, 1549144, 1491780, 1736570, 1593620, 1611833, 1492558, 1713096, 1632465, 1611741, 1399952, 1450668, 1282271, 1361183, 1499165, 1399064, 1343957, 1546944, 1616331, 1579407, 1365544, 1202037, 1542061, 1389006, 1324564, 1311232, 1556101, 1258177, 1292773, 1345713, 1310142, 1260565, 1219383, 1467028, 1499442, 1517644, 1544453]
13881A544453m5795J04057l88318m7413L45279k39663K65735k13904K06671k70114
13871A260988J82825j56110P6461j85572J03279K67528l3856j50739j93567J56444
13861A327681q477J75865J50093j02628J5548K8365k11001j42675K89948J39154
13851A661873l26417n9966n4575K77162P9473j68141J31587k80504M3474J29637
13841A433603r4012J35142k30250n972K35688k13379j96828L07800J12761j93381
13831A291172j9883j1277j46606L28473q8849J74357j5254k24799J68245j39646
13821A315933l50258M40317r8659M8324J83056m44762J74957l8911L27320l95427
13811A161890L0782r9571K71949m19876L40682K8946L0993j53128Q0969k3760
$$ y = [1544453, 1498658, 1602715, 1214397, 1166984, 1512263, 1272600, 1538335, 1324431, 1531102, 1260988, 1443813, 1287703, 1364164, 1178592, 1281871, 1549399, 1515543, 1364804, 1171237, 1327681, 1319204, 1495069, 1645162, 1542534, 1558082, 1586447, 1375446, 1232771, 1522719, 1661873, 1335456, 1275490, 1220915, 1498077, 1577550, 1409409, 1540996, 1260492, 1303966, 1433603, 1339591, 1474733, 1244483, 1238511, 1474199, 1260820, 1063992, 1371792, 1484553, 1291172, 1271289, 1260012, 1113406, 1441879, 1353030, 1527387, 1512133, 1287334, 1455579, 1315933, 965675, 1405992, 1307333, 1355657, 1538713, 1093951, 1268908, 1229997, 1557317, 1161890, 1192672, 1093101, 1365050, 945174, 1285856, 1314802, 1345795, 1192667, 1273636, 1249876]
13801A249876J98140m9646p4860P7487K2599j69373P6986m1669o4644J63233k18517
13790A169612K0969K1122K507J24780k74875K51899j57074Q2340N5741k9309P873
13779A275585P0030R1616K63231k27978L9686J79392k05293J31679j71886O7425
13769A513487P0907j52080j83845K02473l53887J46950O0629j55886J52172n1412
13759A249508J42042k09122R5683k85243L99052q5789J58908k41055K20468J30876
13749A575328L6069k61678K35966j69207J01736j21394J84195j52890L5673J16048
13739A579846k8505P9942j88014K49791O6582q5395R0358j68945J46877j48502
13729A594035O3694J35591n2258J99956j75777J04588j96679Q9667J43298J578
$$ y = [1249876, 1448016, 1398370, 1323510, 1400997, 1423596, 1254223, 1331209, 1289540, 1224896, 1388129, 1169612, 1190581, 1211703, 1214210, 1338990, 1064115, 1316014, 1158940, 1241280, 1297021, 1267712, 1275585, 1345615, 1437231, 1700462, 1472484, 1512170, 1691562, 1486269, 1617948, 1446062, 1513487, 1584394, 1432314, 1248469, 1450942, 1097055, 1244005, 1304634, 1148748, 1300920, 1249508, 1391550, 1182428, 1278111, 992868, 1391920, 1306131, 1465039, 1223984, 1444452, 1575328, 1611397, 1349719, 1585685, 1416478, 1518214, 1396820, 1581015, 1428125, 1463798, 1579846, 1551341, 1631283, 1443269, 1693060, 1759642, 1674247, 1764605, 1595660, 1742537, 1594035, 1657729, 1793320, 1741062, 1941018, 1765241, 1869829, 1673150, 1762817, 1906115, 1907693]
13719A907693j23458J32269j26678K62386J33192j52568J0180J56388P4809o1770
13709B212443o611O690J05901j71467k2136K68802k99671M422k970j02155M3996
13698B037244l16357K71144Q9639j03324J59160q7739L97602J69232m3090k4271
13688B549240K07923j46670k13825n0143r2104k69178k5217j48805L52567m45372
13678A718416J43899K26644k16795k19424M0195J04356n4072L586m2541P1443
13668A775707l2000K00076n301Q0495J94402j08466O11957j90648K52291l7170
13658B741343k17737J90419k40216J14135k77621l6627k49965N2711l9723j43439
13648A893280J31310k86862j8348K98032n9871j93050j5627N9811k6959J59508
$$ y = [1907693, 1784235, 1916504, 1789826, 2052212, 2185404, 2032836, 2043016, 2199404, 2274213, 2212443, 2205832, 2212522, 2318423, 2146956, 2124820, 2393622, 2093951, 2098373, 2095403, 1993248, 2037244, 1720887, 1992031, 2081670, 1978346, 2137506, 2049767, 2447369, 2616601, 2573511, 2549240, 2757163, 2610493, 2396668, 2346525, 2254421, 1985243, 1960026, 1811221, 2163788, 1718416, 1862315, 2088959, 1872164, 1652740, 1692935, 1797291, 1743219, 1746805, 1704264, 1775707, 1743707, 1943783, 1938482, 2018977, 2213379, 2104913, 2716870, 2526222, 2778513, 2741343, 2523606, 2714025, 2473809, 2587944, 2310323, 2273696, 2023731, 2076442, 2036719, 1893280, 2024590, 1737728, 1719380, 2017412, 1957541, 1764491, 1748864, 1808675, 1781716, 1941224]
13638A941224J06731j84017Q9267j2800J41748M47839n0320J03226J77039j03869
13628B656068j97654Q880j86934k19147O4107n10761N8608O9138J82922j72750
13618A752477j74422K88773l94147L29509j75277K35064q8105M3112q021o2499
13608A746464K55852k57759L31622L59082k08312o8881n0351k67163L2730l3513
13598A839771j37075Q1298k85393K65255j32611J44296R3455N6235K06156p0722
13588B060665j14348J81701j49032M583j58885N0927j94283l78575N05840l79367
13578A429226K10435j38464J53590J53346k26040M8897j73592J65103j05048J07510
13568A624963q6419j67514K02191r5387L86654j58004m9955k616N6433J05107
$$ y = [1941224, 2047955, 1863938, 1953205, 1940405, 2082153, 2529992, 2479672, 2582898, 2759937, 2656068, 2458414, 2467294, 2280360, 2061213, 2125320, 1614559, 1673167, 1742305, 1925227, 1752477, 1578055, 1866828, 1472681, 1802190, 1626913, 1861977, 1773872, 1816984, 1808963, 1746464, 2002316, 1744557, 2076179, 2435261, 2226949, 2158068, 2107717, 1840554, 1873284, 1839771, 1702696, 1783994, 1498601, 1763856, 1631245, 1775541, 1868996, 1925231, 2131387, 2060665, 1946317, 2128018, 1978986, 1983569, 1824684, 1875611, 1681328, 1302753, 1808593, 1429226, 1639661, 1501197, 1654787, 1808133, 1582093, 1630990, 1457398, 1622501, 1517453, 1624963, 1538544, 1371030, 1573221, 1477834, 1864488, 1706484, 1656529, 1653913, 1710346, 1815453]
13558A815453j48201k39669q8554K55907N5460r4338j6214J87102k68285J4981
13548A473642L5938j52362K46141j73136J40122K50984L42298L033J06838J20517
13538B394015J3348J64282k60801k16462k32850P6599n07609K45465k04297O1265
13528A532955n0432K04760R6527J25105K06733P2015J31921Q7385L9465l88136
13518B058298J5902j78491j24642j34174j37153j70343L05839j57873k72678J70360
13508A375045j4357k79121K46609J6737j30033J3689P227J1320p6906J83409k35140
13497A118479K41328j44509P6758j7913L7251K5396K4125j2169l10237N64039
13487A602548k44903l9655J04730j3393q3793L5372O7568q6010Q1160j00786l5985
$$ y = [1815453, 1667252, 1427583, 1339029, 1594936, 1650396, 1556058, 1539844, 1726946, 1458661, 1473642, 1509580, 1357218, 1603359, 1430223, 1570345, 1821329, 2163627, 2166660, 2273498, 2394015, 2407363, 2571645, 2310844, 2094382, 1861532, 1938131, 1430522, 1675987, 1471690, 1532955, 1482523, 1687283, 1783810, 1908915, 2115648, 2187663, 2319584, 2406969, 2446434, 2058298, 2074200, 1895709, 1771067, 1636893, 1499740, 1329397, 1635236, 1477363, 1204685, 1375045, 1360688, 1081567, 1328176, 1344913, 1214880, 1228569, 1235796, 1247116, 1170210, 1353619, 1118479, 1359807, 1215298, 1292056, 1274143, 1311394, 1336790, 1360915, 1348746, 1038509, 1602548, 1357645, 1317990, 1422720, 1409327, 1325534, 1360906, 1428474, 1342464, 1423624, 1322838, 1286853]
13476A286853N7788l2398p7318j67884M2186p3202K65661n7922R8706j32134Q1454
13465A291790o480L3578J58939o8717k4145l08158J10873L07816q2807l1133O1585
13454A443141K66850j09685K68588J69629N0140L77825k9205J33217k16896j26286
13444B227318J53166j89950m70104j5363K1921j72996j94732J17528q7138P7328
13434A466978L0979k58444J47564j25203K44652r6598j69963K19945N6591k91104
13424A225397L58605R6982J04012K90733R1922K08467j1287J93290m0148O0759
13414B578732j63569j78945j68938k11330j29439N8202j81200Q3906J94561j95939
13404A686041o8520n5121J00008R7162k31852j42255K13922M2791k41084L7152
$$ y = [1286853, 1344641, 1312243, 1234925, 1067041, 1109227, 1036025, 1301686, 1243764, 1342470, 1210336, 1291790, 1285310, 1318888, 1477827, 1409110, 1384965, 1076807, 1187680, 1495496, 1412689, 1381556, 1443141, 1709991, 1600306, 1868894, 2038523, 2088663, 2466488, 2437283, 2570500, 2353604, 2227318, 2380484, 2190534, 1720430, 1705067, 1726988, 1553992, 1359260, 1476788, 1389650, 1466978, 1497957, 1239513, 1387077, 1261874, 1506526, 1409928, 1239965, 1459910, 1516501, 1225397, 1584002, 1680984, 1784996, 2075729, 2167651, 2376118, 2364831, 2558121, 2517973, 2578732, 2415163, 2236218, 2067280, 1855950, 1726511, 1784713, 1603513, 1687419, 1881980, 1686041, 1617521, 1562400, 1662408, 1759570, 1527718, 1385463, 1599385, 1642176, 1401092, 1438244]
13394A438244r6524L01265K05516p0523N8374K36713L4088k39597M74879k10717
13384B131718j00464j09643L85589K08682j2134J63895k14716q9952Q1928j58024
13374B286879j82705j44997j18187M3293o4396L36752j40838N5480K15049l39604
13364A946726K26316o1232J43410J819j33662R7903k10312l6158k07718L06208
13354B073300j73227M60488J75124j51016K05109l1477k1040o5988r0045k01569
13344B179659L1096l621n675j32355n9567K18081j36465O7765o1411J81047l27243
13333A951311L56862k05590j02525K13497l7858J83902o2330j38488N8297J57604
13323B374682j31902j67765K15671J23056o6912j34323K87908k31311J54930K79025
$$ y = [1438244, 1341720, 1642985, 1848501, 1777978, 1836352, 2073065, 2107153, 1867556, 2342435, 2131718, 2031254, 1921611, 2307200, 2515882, 2503748, 2667643, 2452927, 2362975, 2444903, 2286879, 2104174, 1959177, 1840990, 1884283, 1819887, 2156639, 2015801, 2071281, 2286330, 1946726, 2173042, 2111810, 2255220, 2257039, 2123377, 2221280, 2010968, 1974810, 1767092, 2073300, 1900073, 2360561, 2535685, 2384669, 2589778, 2558301, 2537261, 2471273, 2381228, 2179659, 2210755, 2207134, 2201459, 2069104, 2009537, 2227618, 2091153, 2158918, 2097507, 2278554, 1951311, 2308173, 2102583, 2000058, 2213555, 2175697, 2359599, 2297269, 2158781, 2217078, 2374682, 2242780, 2075015, 2290686, 2413742, 2346830, 2212507, 2500415, 2269104, 2424034, 2703059]
13313B703059j429Q38L43855J86871j36769J15330j59875j7432k856K2840j01222
13302B953210k75815K45585L7594O5924K23973k2292J81921J54107j636R3219
13292C655790j48601L9300J04843j55179j71050o2371p0357m42J51544P2163k60846
13281C154794K62650M2893k6110K0284J11127R8066J53974J32661j96621j8646
13271C735072K27176O156O2194Q9936J35585k45891L69107J02557k11979J84770
13261D454683K71671P9341n4664J5392J99560j02229K97696k14753N10624j23097
13251E334224M26877K56230L57544Q1941L032L87635J7055M61730K02940Q6642
13241G615850K62758J33724q0791K31190J9198M0080J113M8338J10360J05953
$$ y = [2703059, 2701630, 2702468, 3046323, 3233194, 3096425, 3211755, 3051880, 3034448, 3031592, 3054432, 2953210, 2677395, 2922980, 2960574, 3026498, 3250471, 3228179, 3410100, 3564207, 3562571, 3655790, 3507189, 3546489, 3651332, 3496153, 3325103, 3262732, 3192375, 3191933, 3343477, 3415640, 3154794, 3417444, 3460337, 3434227, 3454511, 3565638, 3663704, 3817678, 3950339, 3753718, 3735072, 3962248, 3968404, 4030598, 4120534, 4256119, 4010228, 4379335, 4481892, 4269913, 4454683, 4726354, 4805695, 4751031, 4766423, 4965983, 4863754, 5161450, 4946697, 5457321, 5334224, 5761101, 6017331, 6374875, 6456816, 6459848, 6847483, 6864538, 7326268, 7529208, 7615850, 7878608, 8012332, 7931541, 8162731, 8181929, 8222009, 8223122, 8271460, 8381820, 8487773]
13231H487773R0732K2237J67913K12523L46583K68701K79352J13749N55018L08205
13221A0852786L7483O33312r0022L33040J16345K11515K21752r7821n40374N74249
13211A2252265n74927m44038Q6921m11006m04003j19033j48090p9956l44029j68725
13201I645379j78498J46648m32709M75333j13760n2177k82997O4259J23433l3954
13191I360957l14563k75039M8118l55633k15614m40810n4801l00664k18535k74349
13181F959067k53090J5283k42500l68333j18284k64741k87053J41090k74337q6499
13171E220603j11868j25106J21381J2348r8802m6193J14551K06426r4617M1461
13161E240184J61188J93905O20309M1000M67685M00599K49678J49564J0834j5796
$$ y = [8487773, 8578505, 8600742, 8768655, 8981178, 9327761, 9596462, 9875814, 9989563, 10544581, 10852786, 10890269, 11523581, 11433559, 11766599, 11882944, 12094459, 12316211, 12218390, 11678016, 12252265, 11677338, 11233300, 11320221, 10909215, 10505212, 10386179, 10238089, 10158133, 9814104, 9645379, 9466881, 9613529, 9180820, 9656153, 9542393, 9490216, 9207219, 9271478, 9394911, 9360957, 9046394, 8771355, 8819473, 8463840, 8248226, 7807416, 7752615, 7451951, 7233416, 6959067, 6705977, 6721260, 6478760, 6110427, 5992143, 5727402, 5440349, 5581439, 5307102, 5220603, 5108735, 4983629, 5105010, 5117358, 5018556, 4972363, 5086914, 5293340, 5198723, 5240184, 5401372, 5595277, 6215586, 6256586, 6724271, 7124870, 7374548, 7524112, 7534946, 7519150]
13151G519150k86301j09007P2219l1400j63878P485j91413K41722j27740J28413
13141G059250k24303k69981J25121k42449n96449q8867o54698j34813m51847j32527
13131D388437k47504j51305q3414M0666l24073K56985M3901J52893j57633J58429
13121D077382n406j23928j42050k60849R8061n2557l85507J69238j60800J74632
13111C388216l21071J73457j25916J17397o3185J89692l3431J46627J08140P8911
13101C658837J77017L73213m0233N1478O94858L27754M80988L83555N44123L10286
13091F961876K06291M25417J50603k33355k5506l26870k8818J79774p4070k224
13081G233118j43592n197r9705q6780m12395n38552m09082k09084n36015m19695
$$ y = [7519150, 7232849, 7123842, 7196061, 7164661, 7000783, 7008268, 6816855, 7058577, 6930837, 7059250, 6834947, 6564966, 6690087, 6447638, 5851189, 5762322, 5107624, 4972811, 4520964, 4388437, 4140933, 3989628, 3906214, 3946880, 3622807, 3879792, 3923693, 4076586, 3918953, 4077382, 4071976, 3948048, 3805998, 3545149, 3643210, 3590653, 3205146, 3374384, 3213584, 3388216, 3067145, 3240602, 3114686, 3232083, 3168898, 3358590, 3325159, 3471786, 3579926, 3658837, 3835854, 4209067, 4168834, 4220312, 4915170, 5242924, 5723912, 6107467, 6651590, 6961876, 7168167, 7593584, 7744187, 7510832, 7485326, 7158456, 7129638, 7309412, 7235342, 7233118, 7089526, 7084329, 6984624, 6897844, 6485449, 5946897, 5537815, 5328731, 4792716, 4373021]
13071D373021k92208k93490r6825r7679k25998j70018j6471R3014j65061m5780
13061C062505J12602J12894K0055R1388l4746p8663K35322j71592N2191J52584
13051C554540j20744m488n665k3375j41939J31730N3260k29218J36199j10961
13041C239339J62796r6175L6285K42468o2062j057J87488r6534J34254L4427J7170
13030C798399j65030K71105K4645r3958J14221O7337o7184P6681M64240k69129
13020D221327J00880J27086j53136P5274k99941M75310l06439M57190j58678p3382
13010D465491J14308J07469L5714K17412j68826J63965p7875P3560j587L25951
13000E255582j19157L02013j93543K4526j02344K17212Q8647J04020k88620K93711
$$ y = [4373021, 4080813, 3787323, 3690498, 3592819, 3366821, 3196803, 3180332, 3273346, 3108285, 3062505, 3175107, 3288001, 3308056, 3399444, 3364698, 3286035, 3521357, 3349765, 3401956, 3554540, 3433796, 3429308, 3423643, 3400268, 3258329, 3390059, 3443319, 3214101, 3350300, 3239339, 3402135, 3305960, 3342245, 3584713, 3522651, 3521594, 3709082, 3612548, 3746802, 3781229, 3798399, 3633369, 3904474, 3929119, 3835161, 3949382, 4016719, 3949535, 4026216, 4490456, 4221327, 4322207, 4449293, 4296157, 4371431, 4071490, 4546800, 4240361, 4697551, 4538873, 4465491, 4579799, 4687268, 4722982, 4940394, 4771568, 4935533, 4857658, 4931218, 4929631, 5255582, 5136425, 5438438, 5244895, 5269421, 5167077, 5384289, 5472936, 5576956, 5288336, 5582047]
12990E582047M05716j37579k27092o9738j47068J7299M59467l62583K252j0022
12980E512699J23692M6471k67784P0047J6472m0879J77879k12810k19252j44610
12970E061925J72696M0079j06413k97231J53795j06248K47507J61191l89103L57042
12960E295240o5220p6215k08954l2653m0778J55362J84665l1497P3888k53614
12950E000224J85747n7910j49061J83150O5201K826l31127k7574L44076l33626
12940D881926K9186r4294J05487p8890J20814p2164K68263j73013N8925J78949
12930E225189J1667J65338k38014J41299P7609l68886k3602R830j06330j36508
12920D757592k10490L77797j7227k36224J57953k64310K01502l43182j93285J53670
$$ y = [5582047, 5987763, 5850184, 5623092, 5553354, 5406286, 5423585, 5883052, 5520469, 5522721, 5512699, 5636391, 5682862, 5415078, 5485125, 5501597, 5460718, 5638597, 5425787, 5206535, 5061925, 5234621, 5274700, 5168287, 4871056, 5024851, 4918603, 5166110, 5327301, 4938198, 5295240, 5230020, 5153805, 4944851, 4912198, 4871420, 5026782, 5211447, 5179950, 5253838, 5000224, 5185971, 5128061, 4979000, 5162150, 5227351, 5230177, 4899050, 4871476, 5215552, 4881926, 4911112, 4816818, 4922305, 4843415, 4964229, 4892065, 5160328, 4987315, 5046240, 5225189, 5236856, 5402194, 5164180, 5305479, 5383088, 5014202, 4990600, 5000430, 4894100, 4757592, 4547102, 4924899, 4907672, 4671448, 4829401, 4565091, 4766593, 4423411, 4230126, 4383796]
12910D383796k01075l09101K49668l23533J53367n5516j72215K26725r6504j72113
12900C683499n2313j33911J98209k96526j38488j46017M08107l20995l0392p0077
12890C101096J10484o3420L85K4749J74378J12052q5755l0320j7821K5523n1084
12879C300267j2570R7426k00274j46780K9799J2027l0645K369j9229o2318j99914
12868B770158j06217L4111q5811P9266J10850o2684J89066j20857J9633j56882
12858B670633J25043j58702O8800J02666M2271J39606m51197J95932p9783J74894
12848B830163k20297L54353k49437k04387J14778K37074j25766p9227J4593n2638
12838B619209r0213J07119j21850K8360K00072O2460j62955o5354J72165m4941
$$ y = [4383796, 4182721, 3873620, 4123288, 3799755, 3953122, 3897606, 3725391, 3952116, 3855612, 3683499, 3631186, 3497275, 3695484, 3398958, 3260470, 3114453, 3522560, 3201565, 3171173, 3101096, 3211580, 3148160, 3148545, 3173294, 3347672, 3459724, 3373969, 3343649, 3325828, 3351351, 3300267, 3287697, 3385123, 3184849, 3038069, 3067868, 3079895, 3049250, 3051619, 3032390, 2970072, 2770158, 2663941, 2698052, 2612241, 2691507, 2802357, 2739673, 2928739, 2807882, 2827515, 2670633, 2795676, 2636974, 2705774, 2808440, 2850711, 2990317, 2539120, 2735052, 2655269, 2830163, 2609866, 2964219, 2714782, 2510395, 2625173, 2862247, 2736481, 2657254, 2671847, 2619209, 2528996, 2636115, 2514265, 2542625, 2742697, 2805157, 2642202, 2576848, 2749013, 2704072]
12828B704072L872k8083p5777P9026j45406K70797j21703J45627k38935J31128
12818B724618k58419O0416K22770j58368J88063l47259P3923j1825L92487k31439
12808B654967q0624J49892k8270L5267l21829K23935l6139J13925O324J26274
12798B843722j55400Q6593k33419J72311J46110k00227q4751L00396j71404n0133
12788B653798K67549j20726J22484K1561k6346j08547O9747j10432l1914J88844
12778B926018o7288j37882J25058r3155L2649k47856L02038P9019l47853K59418
12768B830166n3624J82490Q1235j73718K04557j41865R3289j72516j01964M4538
12758B792588K63673j53191k30935l0964L10344K6517J98897k95903k13992K96957
$$ y = [2704072, 2707944, 2679861, 2604084, 2683110, 2537704, 2808501, 2686798, 2832425, 2593490, 2724618, 2466199, 2526615, 2749385, 2591017, 2779080, 2431821, 2505744, 2493919, 2886406, 2654967, 2574343, 2724235, 2695965, 2731232, 2409403, 2633338, 2597199, 2711124, 2717448, 2843722, 2688322, 2774915, 2541496, 2713807, 2859917, 2659690, 2574939, 2875335, 2703931, 2653798, 2921347, 2800621, 2923105, 2944666, 2918320, 2809773, 2879520, 2769088, 2737174, 2926018, 2858730, 2720848, 2845906, 2752751, 2785400, 2537544, 2839582, 2918601, 2570748, 2830166, 2776542, 2959032, 3040267, 2866549, 3071106, 2929241, 3022530, 2850014, 2748050, 2792588, 3056261, 2903070, 2672135, 2641171, 2951515, 2978032, 3176929, 2881026, 2667034, 2963991]
12748B963991j36351j63150L7010J13735P4520j18752m9118L64199j43902k0726
12738B921456K11703j21708p1668J77422Q717o1575m5476p2603k4370q6420K63261
12727C098739p4908j08287L30230n3457k31807J54485m6658J0087m6144Q2266
12717C114546R7743n3948l9692k7812K38540k44645J75385J65190r1665r5561
12707C238081K36815j36409N3647K112J38312K65519k2708Q5105J36260q6894
12697C909840L28328R8172R4911K75180J60241J83235L96776L85554L43767L66228
12687F542232O33869L80831M59653j61698r0125r9812o34787n19237o32917p52434
12677E125575k99841k03605p2769k7336l48641K49694k00832M39846n1631k39017
$$ y = [2963991, 2827640, 2664490, 2701500, 2815235, 2889755, 2771003, 2721885, 3086084, 2942182, 2921456, 3133159, 3011451, 2939783, 3117205, 3125922, 3064347, 3018871, 2946268, 2921898, 2835478, 3098739, 3023831, 2915544, 3245774, 3192317, 2960510, 3114995, 3068337, 3078424, 3032280, 3114546, 3212289, 3158341, 3118649, 3090837, 3329377, 3084732, 3260117, 3425307, 3333642, 3238081, 3474896, 3338487, 3392134, 3394246, 3532558, 3798077, 3775369, 3860474, 3996734, 3909840, 4238168, 4336340, 4431251, 4706431, 4866672, 5049907, 5446683, 5832237, 6176004, 6542232, 7176101, 7556932, 8016585, 7854887, 7764762, 7664950, 7030163, 6510926, 5878009, 5125575, 4825734, 4622129, 4549360, 4522024, 4173383, 4423077, 4222245, 4662091, 4610460, 4371443]
12667D371443O0265J79192k06479J57733K10111K42690N4577J105l81943O6150
12657D754844K85040J02929k54097N39969J48988N14770J9158L24394O6069M73804
12647F975868j98614L02994k71494m4751k74511k15031o2441Q8039L15857p2082
12637F543834M6628L10631l69510L28749j05666K72404j1414J58294K79949J16238
12627G570137J31235q5157K9346k25966m11189k45976j74352l45800k71144k99621
12617E671513j93216k53174l48538k3546K77460k14549L21642N02642N96483N28191
12607F864908L48314O75934M52195P08612n7301K32404n02532j60606n51155n15813
12597G494960o23797m85620n73375n2708l16653n2235J96850K43295R2640K96309
$$ y = [4371443, 4431708, 4610900, 4404421, 4562154, 4772265, 5014955, 5069532, 5070637, 4688694, 4754844, 5039884, 5142813, 4888716, 5428685, 5577673, 6092443, 6111601, 6435995, 6502064, 6975868, 6777254, 7080248, 6808754, 6764003, 6489492, 6274461, 6212020, 6300059, 6615916, 6543834, 6590462, 6901093, 6531583, 6860332, 6754666, 7027070, 7015656, 7173950, 7453899, 7570137, 7701372, 7616215, 7645561, 7419595, 7008406, 6762430, 6588078, 6242278, 5971134, 5671513, 5478297, 5225123, 4876585, 4853039, 5130499, 4915950, 5237592, 5740234, 6336717, 6864908, 7213222, 7889156, 8341351, 9049963, 8992662, 9225066, 8722534, 8561928, 8010773, 7494960, 6871163, 6385543, 5812168, 5759460, 5442807, 5390572, 5587422, 5830717, 5923357, 6219666]
12587F219666P9025J34797J32573N2323l69823l8117l19081J16061R2860K59077
12577F359361R2845K17758N65886J56551M82722m18923k93694j89112p56785m44442
12567E772167o54578r3804j98606O6294l14195K8011J17281K18262k7350k56385
12557D657097K50504J48396l20130J94768p8898k40475J38469n0500J21455K28966
12547E049652j46920m2880J47956m8021M0747l3249j13502K90421o1801J90445
12537E272848K04141M1103L053n0404j36660j29001p3429j95900j43601p0361
12527D721789R7328n3314K6107K66014p9161m2424K34607L7053q9717p6284m8558
12516D993440M13731j96119J94193j0352K52076L31858P3900M33277P8575L51275
$$ y = [6219666, 6298691, 6433488, 6566061, 6618384, 6248561, 6210444, 5891363, 6007424, 6100284, 6359361, 6452206, 6669964, 7235850, 7392401, 7875123, 7456200, 7162506, 6973394, 6216609, 5772167, 5117589, 5023785, 4825179, 4891473, 4577278, 4605289, 4722570, 4940832, 4913482, 4657097, 4907601, 5055997, 4735867, 4930635, 4851737, 4611262, 4749731, 4699231, 4820686, 5049652, 4902732, 4859852, 5007808, 4959787, 5000534, 4967285, 4853783, 5144204, 5082403, 5272848, 5476989, 5518092, 5521145, 5470741, 5334081, 5205080, 5131651, 4935751, 4792150, 4721789, 4819117, 4765803, 4791910, 5057924, 4978763, 4936339, 5170946, 5207999, 5118282, 5041998, 4993440, 5407171, 5211052, 5405245, 5394893, 5646969, 5978827, 6052727, 6486004, 6564579, 6915854]
12506F915854P0416j0557k71107k29341m77301J56124n78089k4624j53353K1153
12496E419175R6500J8565m3502k1632K3097P6945K587k02865K84847Q9608J29414
12485E872739m03731L77324j96681L70436k3862K14742J84418K47522J109o1566
12475F582450J01765l56377n4115k78027o2516j48003j34880L29685J46920j88193
12465E938709J84389J86273j63226K24622P6867l509J45210n5320Q8178R8424
12455F720617J05024J48050K63619k7853K49753J71973O8235J97928L92763K66165
12445H556274J36013N63390R0620N29601L12814M37233L52699J15460M39452K08039
12435A1741595J22195L7701q6880J51309j08936J73668j41247O7661j59817J65219
$$ y = [6915854, 6986270, 6975713, 6704606, 6475265, 5997964, 6154088, 5575999, 5551375, 5398022, 5419175, 5515675, 5534240, 5490738, 5469106, 5492203, 5569148, 5571735, 5368870, 5653717, 5743325, 5872739, 5469008, 5846332, 5649651, 6020087, 5996225, 6210967, 6395385, 6642907, 6644016, 6582450, 6684215, 6327838, 6273723, 5995696, 5933180, 5785177, 5650297, 5979982, 6126902, 5938709, 6123098, 6309371, 6146145, 6370767, 6447634, 6444125, 6589335, 6534015, 6622193, 6720617, 6825641, 6973691, 7237310, 7209457, 7459210, 7631183, 7699418, 7897346, 8290109, 8556274, 8692287, 9255677, 9346297, 9875898, 10188712, 10625945, 10978644, 11094104, 11533556, 11741595, 11863790, 11901491, 11814611, 11965920, 11856984, 12030652, 11889405, 11957066, 11797249, 11962468]
12425A1962468K16709k5521Q1404K94027k96144M23787L80000J59261M85836K89583
12415A3971410Q67928L67019P56511N77242N69992N44545N61239M46967K02972
12406A8865825J24505k0240k47722k73045m42719k69162l97313k82042n43748
12397A6514339l99890k96478l16556j22043j43383j75498k13586J22241L10693
12388A5279839J48592R4294M32886L38851N14799K52045N89302M52774L5167R8501
12378A8237050M43017O7779R8685l9102k76048m6265r8964k37227l34167q991
12368A7805767k80284k91164l07803Q9498m16070r1766j76861q0071m53601j63036
12358A5634609m53793J6050m12196K14012k53222l56418J51322l97956l52079
$$ y = [11962468, 12179177, 12153656, 12235060, 12529087, 12232943, 12656730, 13036730, 13195991, 13681827, 13971410, 14839338, 15206357, 15962868, 16540110, 17110102, 17654647, 18215886, 18662853, 18865825, 18990330, 18970090, 18722368, 18449323, 18006604, 17737442, 17340129, 17058087, 16514339, 16114449, 15817971, 15501415, 15379372, 15235989, 15060491, 14846905, 14969146, 15279839, 15428431, 15522725, 15955611, 16294462, 16809261, 17061306, 17650608, 18103382, 18138549, 18237050, 18680067, 18747846, 18846531, 18807429, 18531381, 18485116, 18386152, 18148925, 17814758, 17805767, 17525483, 17234319, 16926516, 17016014, 16599944, 16508178, 16331317, 16251246, 15797645, 15634609, 15180816, 15196866, 14784670, 14998682, 14745460, 14389042, 14540364, 14142408, 13790329]
12349A3790329L47384l97297j22853k00112j55493j59864j49588k0537j48234
12340A2783735q3595M77352L51341R3644K4546K70522K27712N43640J2726J67500
12330A4869123O79095R6102M14499L34668j5668N43637J2012J43391J63031J09508
12320A7349398N2651K65713j5410L1683j10803O5223p7438q5482l6714J33521
12310A7572342j7896M6536K29187L28165J98384K20503L60477M99157K63045K45724
12300A9945624K57300j0830j7854J1740m23102n41423p54944n68409n54732K9626
12290A7372996j78538p9688m63712j19847J10570n07285n5920p26360k84989m78968
12280A4588259n88645k18867m21299n33384m61950L5274l38621k3674l53010k9418
$$ y = [13790329, 14137713, 13740416, 13617563, 13417451, 13261958, 13102094, 12952506, 12931969, 12783735, 12700140, 13177492, 13528833, 13622477, 13647023, 13917545, 14145257, 14688897, 14701623, 14869123, 15548218, 15644320, 16058819, 16393487, 16377819, 16921456, 16933468, 17076859, 17239890, 17349398, 17402049, 17667762, 17652352, 17684035, 17573232, 17638455, 17561017, 17475535, 17438821, 17572342, 17554446, 17600982, 17830169, 18158334, 18356718, 18577221, 18937698, 19436855, 19699900, 19945624, 20202924, 20192094, 20174240, 20185980, 19762878, 19221455, 18466511, 17898102, 17343370, 17372996, 17194458, 17114770, 16651058, 16531211, 16641781, 16134496, 16078576, 15352216, 15067227, 14588259, 13999614, 13780747, 13359448, 12826064, 12364114, 12399388, 12060767, 12037093, 11684083, 11654665]
12270A1654665m0753j40974j78319J96347q6844k33963Q8757p4723N5321K98029
12260A1537543j09154j89378P2183k6185m2562J22641N7915L45514K61991M48848
12250A2479356M14474M98070O89931M83709P82915R69055P51024J082569J035614
12241A9186717R42483J015186L94101K92337j11116L0256l69914k39723k00216
12232B0940111j50372m99m7028M5989K4498m14729j30970o61014p96379j249054
12222A7560553m32105q39843j284681l99455j052497o40537n80214m89021n8778
12213A1783422l35004k09524M839j76829l77805r0195l11869l95913k47784M344
12203I647682k57086K62355j45721J42066j05906Q5892J75240k50705J76130k60206
$$ y = [11654665, 11613912, 11472938, 11294619, 11490966, 11404122, 11170159, 11258916, 11184193, 11239514, 11537543, 11428389, 11239011, 11311194, 11285009, 11242447, 11365088, 11423003, 11768517, 12030508, 12479356, 12893830, 13391900, 14081831, 14565540, 15348455, 16317510, 17068534, 18151103, 19186717, 20129200, 21144386, 21538487, 21830824, 21719708, 21749964, 21380050, 21140327, 20940111, 20789739, 20789240, 20742212, 20788201, 20812699, 20397970, 20267000, 19605986, 18809607, 17560553, 17128448, 16288605, 15003924, 14604469, 13551972, 12911435, 12331221, 11842200, 11783422, 11448418, 11238894, 11243733, 11066904, 10689099, 10598904, 10287035, 9891122, 9643338, 9647682, 9390596, 9652951, 9507230, 9649296, 9543390, 9629282, 9804522, 9553817, 9729947, 9469741]
12193I469741J29250L3704j29367J79867K09874K22829L3609L23336M60747J17962
12183A1051552j63896L10990L02972K04118K7540j1464N24482k20046k71341L3038
12173A1787945k43117k06159M03314j86996j7500J44737J79759M43791J19181
12164A2424955Q4843K7662J97084M73145M34447R46809O26074Q01795L82043P876
12154A6406733j50680m73571n41899m78568m8769j27468J49386L51996M34574
12145A5521734N40462L67961M01390L59898J29553J35152R0114L89947L45376
12136A8281587L65338M98312J029287Q07239J092800J234918J242971J591716
12128B6144168J756955J866997J894304J779916J591901J486252J077038J036798
$$ y = [9469741, 9598991, 9632695, 9503328, 9683195, 9893069, 10115898, 10149507, 10472843, 10933590, 11051552, 10887656, 11198646, 11501618, 11705736, 11733276, 11721812, 12246294, 12026248, 11754907, 11787945, 11544828, 11338669, 11741983, 11554987, 11537487, 11682224, 11861983, 12305774, 12424955, 12509798, 12537460, 12734544, 13207689, 13642136, 14588945, 15215019, 16016814, 16398857, 16406733, 16256053, 15782482, 15240583, 14762015, 14713246, 14585778, 14735164, 15087160, 15521734, 16062196, 16430157, 16831547, 17191445, 17320998, 17456150, 17546264, 17936211, 18281587, 18646925, 19145237, 20174524, 20981763, 22074563, 23309481, 24552452, 26144168, 27901123, 29768120, 31662424, 33442340, 35034241, 36520493, 37597531, 38634329]
12120C8634329M59773M65260k23817Q5271k19947k09115j67164j08731k43102
12111C8472757m87046o43613o58531o64754j20784k64697O3033K3653N06188L00447
12101C6526653L46223L56411Q32774P13403L15588m2463k21286m56633j116894
12092C7253776j265793j088835j230759k15868o08875L78916N63513Q04986J087730
12083C5678791P03649M99564R1643q9521Q6068p7861j29867P0015L22716J81895
12073C7337092j47373M29449j6238k11943l79142j22105m46532j064556j119745
12064C4258907j100509r73775j315921j232462p75130p04511q71691m60352n24170
12055B6300386l25355j72648q15132m04602j43307n09932p01319k67452m36510
$$ y = [38634329, 39094102, 39559362, 39335545, 39420816, 39200869, 38991754, 38824590, 38715859, 38472757, 37985711, 37342098, 36683567, 36018813, 35898029, 35633332, 35696365, 35720018, 36226206, 36526653, 36872876, 37229287, 38062061, 38775464, 39091052, 39048589, 38827303, 38370670, 37253776, 35987983, 34899148, 33668389, 33452521, 32843646, 33222562, 33786075, 34591061, 35678791, 36382440, 36882004, 36973647, 36884126, 36970194, 36892333, 36762466, 36832481, 37155197, 37337092, 37189719, 37619168, 37602930, 37390987, 37011845, 36889740, 36443208, 35378652, 34258907, 33158398, 32184623, 30868702, 29636240, 28861110, 28156599, 27284908, 26824556, 26300386, 25975031, 25802383, 24987251, 24582649, 24439342, 23929410, 23228091, 22960639, 22524129]
12046B2524129j58073o05538j5177m56221l04009m87721k97869q4476p10633p07499
12036A8696913k76231o19675j31398n14147j20494j65472l4691M20317J04968
12027A7360090J16280M13398M94815o5263M3173O8074j96598m86558q71561n07218
12017A6368632l52944l85677j85547l45396k29798j11998k67322k50821o23463
12008A3615666l14621o59166l65312l3183j77575J77823P26450J63462r9774J28677
11998A3162447K39680k82387J21320o55991m03726k99188n17993o46697m31554
11989A0285911M0073J44692K93635j20516O6586j62875n89945l18423k82402n86053
11979H770683m40028k13260l92805l4469Q5759n9928k47163k21838K40699k30398
$$ y = [22524129, 22366056, 21760518, 21745341, 21289120, 20985111, 20497390, 20199521, 20115045, 19404412, 18696913, 18420682, 17801007, 17669609, 17155462, 17034968, 16869496, 16834805, 17255122, 17360090, 17476370, 17889768, 18384583, 18319320, 18362493, 18430567, 18233969, 17747411, 16875850, 16368632, 16015688, 15630011, 15444464, 15099068, 14869270, 14757272, 14489950, 14239129, 13615666, 13301045, 12641879, 12276567, 12243384, 12065809, 12243632, 12970082, 13133544, 13033770, 13162447, 13402127, 13119740, 13241060, 12585069, 12181343, 11882155, 11364162, 10717465, 10285911, 10325984, 10470676, 10764311, 10643795, 10710381, 10547506, 9957561, 9639138, 9356736, 8770683, 8330655, 8117395, 7724590, 7690121, 7775880, 7715952, 7468789, 7246951, 7487650, 7257252]
11969G257252j76902j24071l89906j6272j94379j91581L5054l8966k22910P4930
11959F012249l1771L68326n0133k522N53449j7184K60298n6895k54539L20449
11949G101727n1790l00184K0964j89170K59797K74691J27874m3245K44136N19198
11939G963998j72847L36194l49418K57555q8737K06526l31516j79618J2726J64466
11929G819329j65329L55013p8927P7754j77086n8817l57915l23507j1024n04020
11919F575471M8823J40467l36635n5568o5854j05731j86971J79034R7881k51873
11909F039044N97944L29323O71366J657205J339459J143440K92214J89683l39335
11900A1920343j388313j893809j618868o92994n54343k63298k04411J48183r5042
$$ y = [7257252, 7080350, 6956279, 6566373, 6550101, 6355722, 6164141, 6199195, 6160229, 5937319, 6012249, 5980478, 6348804, 6298671, 6296149, 6849598, 6832414, 7092712, 7035817, 6781278, 7101727, 7049937, 6749753, 6770717, 6581547, 6841344, 7116035, 7243909, 7200664, 7444800, 7963998, 7791151, 8127345, 7777927, 8035482, 7946745, 8153271, 7821755, 7642137, 7654863, 7819329, 7654000, 8009013, 7930086, 8007840, 7830754, 7771937, 7414022, 7090515, 7079491, 6575471, 6624294, 6764761, 6428126, 6372558, 6306704, 6200973, 6014002, 6193036, 6290917, 6039044, 6636988, 6966311, 7637677, 9294882, 10634341, 11777781, 12069995, 12259678, 11920343, 10532030, 8638221, 7019353, 6326359, 5772016, 5508718, 5304307, 5452490, 5357448]
11891E357448J12421O8500P5365L02845L17670L18480P00220O99811O22226Q03995
11881I378981P92338J57475N79435l87288o51944j79893r34065n14606n99494
11872G640939m57738m51717k41261l60420k99893n58763J70132k95029k5930n8081
11862E062239o2087l09828J20270O7220k08431j67587K82181Q891N8795o389J9933
11851D865207J74203r3736J21306n4102K55003O4125N22933J67952L60145M81874
11841F864910P26542L54590Q08067N97251r5288J62232l60309l19388n02724l06715
11831G929168m43958j39639M95179P3655j5639J85555k49431m62766n36071n77867
11821F258186n46517o73122k57356l21333p2145K59587m40452R6502l23247K68575
$$ y = [5357448, 5469869, 5538369, 5613734, 5916579, 6234249, 6552729, 7252949, 7952760, 8574986, 9378981, 10171319, 10328794, 10908229, 10520941, 9868997, 9689104, 8755039, 8240433, 7640939, 7183201, 6731484, 6490223, 6129803, 5829910, 5271147, 5441279, 5146250, 5120320, 5062239, 5000152, 4690324, 4810594, 4877814, 4669383, 4501796, 4783977, 4792868, 4851663, 4845274, 4865207, 5039410, 4945674, 5066980, 5012878, 5267881, 5332006, 5854939, 6022891, 6383036, 6864910, 7591452, 7946042, 8754109, 9351360, 9256072, 9418304, 9057995, 8738607, 8235883, 7929168, 7485210, 7345571, 7840750, 7914405, 7898766, 8084321, 7834890, 7372124, 6836053, 6258186, 5711669, 5038547, 4781191, 4459858, 4387713, 4647300, 4206848, 4303350, 3980103, 4248678]
11811D248678j20342q9776n603j24861k6034k2420k4783M9949j8758L9062L859
11800C908971O1153N3828j59867L06724K2987j16608O0356m8457P7757J58413
11790D325257L43566J23798L47182P28350L76313L98563J16374L98759j02092
11781G056070l26360n07161o12202q56628k76231p2232l53425j75945N5660m76441
11771C455105J39688k48672p5748P0770M2311R0565l03660K30724p6003j4115
11761C310965J27929j01711P8932j43965l25616K43838k69716J17434O2509M1225
11751C141824o317l6003K81014l9389J54936k01088Q5899l02838K88387k47311
11741C119114k37383j959J32732P6363k24610K73843j81110J999K0362O5115J62110
$$ y = [4248678, 4128336, 4038560, 4032957, 3908096, 3882062, 3859642, 3834859, 3884808, 3866050, 3905112, 3908971, 3970124, 4023952, 3864085, 4170809, 4193796, 4077188, 4137544, 4089087, 4166844, 4325257, 4668823, 4792621, 5139803, 5868153, 6244466, 6643029, 6759403, 7158162, 7056070, 6729710, 6222549, 5610347, 4753719, 4477488, 4405256, 4051831, 3875886, 3931546, 3455105, 3594793, 3346121, 3270373, 3341143, 3383454, 3474019, 3170359, 3401083, 3325080, 3310965, 3438894, 3337183, 3416115, 3272150, 2946534, 3190372, 2920656, 3038090, 3100599, 3141824, 3135507, 3099504, 3380518, 3341129, 3496065, 3294977, 3380876, 3078038, 3366425, 3119114, 2881731, 2879772, 3012504, 3088867, 2864257, 3138100, 2956990, 2958989, 2979351, 3044466, 3206576]
11730C206576m51501J94704q2633p0547J1307L6380J39388j68982l3363L02433
11720C083762m9518m2183k4090q8194n6344n9917K46016l6827j98142K22804J4084
11709C011451k17705J56294k06829j54623L12094j37391K61928K2646Q054O3854
11699C119773m8359n9476n8167J47966k24416K15017J85982k39093j02127M49149
11689C386249J3339k93146L3417M37518k75691J55918J27103j63480J35460P061
11679C563748J13568J38620k16066M7889P9391O7855R501R2957k43064K75407
11669C929806k23025j0286n3009L25943k65506p1779J83385L4001N1673j02607
11659C798596J8384n1835m6671j40012Q4727R7855k581o2702j26461j3742K5512
$$ y = [3206576, 2755075, 2949779, 2867146, 2796599, 2807906, 2844286, 2983674, 2814692, 2781329, 3083762, 3034244, 2992061, 2967971, 2879777, 2823433, 2763516, 3009532, 2972705, 2774563, 2997367, 3011451, 2793746, 2950040, 2743211, 2588588, 2900682, 2763291, 3025219, 3047865, 3055919, 3119773, 3071414, 3011938, 2953771, 3101737, 2877321, 3092338, 3278320, 3039227, 2937100, 3386249, 3399588, 3106442, 3139859, 3577377, 3301686, 3457604, 3584707, 3421227, 3556687, 3563748, 3677316, 3815936, 3599870, 3647759, 3727150, 3795005, 3804506, 3897463, 3654399, 3929806, 3706781, 3696495, 3643486, 3969429, 3703923, 3632144, 3815529, 3849530, 3901203, 3798596, 3816980, 3765145, 3718474, 3578462, 3663189, 3761044, 3758463, 3695761, 3569300, 3555558, 3581070]
11648C581070N5832L8777j15789K6629j69385R959n8007o9700j45950L67927j32827
11637C388536K0103O1762J1795r8851R9760J55202l06181j72093J00703o0322
11627C200414l7408M71646l70862J65652k78580J25479j60372R6682J11331k37592
11617C086390R8225p2486J92630j0554M748P6335j13271J09816j1900J21683j13426
11606C368190o6280Q7240J54299Q9255l34199P8753J05632J24610L1797j92566
11596C446731J30403R1623k01012J2603O8635J36580k26772j67627K26999L6273
11586C554436J0301n8281j32395K07209r1545J25604K69009l66985J06754J61105
11576C785212l86578L20974J03232r9795M8908j08046J38620k14861L74536l27277
$$ y = [3581070, 3636902, 3675679, 3559890, 3586519, 3417134, 3427093, 3369086, 3299386, 3153436, 3521363, 3388536, 3408639, 3470401, 3482196, 3383345, 3483105, 3638307, 3332126, 3160033, 3260736, 3200414, 3163006, 3634652, 3263790, 3429442, 3150862, 3276341, 3115969, 3212651, 3323982, 3086390, 3184615, 3112129, 3304759, 3294205, 3298953, 3375288, 3262017, 3371833, 3359933, 3481616, 3368190, 3301910, 3389150, 3543449, 3632704, 3298505, 3377258, 3482890, 3607500, 3639297, 3446731, 3577134, 3668757, 3467745, 3480348, 3548983, 3685563, 3458791, 3291164, 3518163, 3554436, 3564737, 3506456, 3374061, 3581270, 3489725, 3615329, 3884338, 3517353, 3624107, 3785212, 3398634, 3719608, 3822840, 3723045, 3771953, 3663907, 3802527, 3587666, 3962202, 3634925]
11566C634925J83732j88579J08003N9312k99803K4911K10097k8901J96977j14760
11556C785914J24446r2971J51019R916n7912m3542J07475l51058M8285M08162
11546D089734l53454K12164j82333m1670j06143J49659k1671k59629K55397l17846
11536C424208K11543J21970o4618J17270j11173K37485l36768O238L06727l06813
11526C606069n0453k5234J69931L3225j90073P0735L33186J8176l74376J45000
11516C736186j02212J56612J09774m9027R0973j69671J91800Q6062L0005J98303
11506D278805k80182K32450J9531k61779K17422j95899J50470J703L2267J21634
11496D316422j4562q9885p8047r9841J4362J50045k37362J11256J34683J73249
$$ y = [3634925, 3818657, 3630078, 3738081, 3797393, 3497590, 3522501, 3732598, 3703697, 3900674, 3785914, 3910360, 3817389, 3968408, 3978324, 3920412, 3876870, 3984345, 3633287, 3681572, 4089734, 3736280, 3948444, 3766111, 3724441, 3618298, 3767957, 3746286, 3486657, 3742054, 3424208, 3635751, 3757721, 3693103, 3810373, 3699200, 3936685, 3599917, 3606155, 3912882, 3606069, 3555616, 3530382, 3700313, 3733538, 3543465, 3614200, 3947386, 3965562, 3591186, 3736186, 3633974, 3790586, 3900360, 3851333, 3942306, 3772635, 3964435, 4050497, 4080502, 4278805, 3998623, 4231073, 4250604, 3988825, 4206247, 4010348, 4160818, 4162521, 4194788, 4316422, 4301860, 4211975, 4133928, 4034087, 4048449, 4198494, 3961132, 4072388, 4207071, 4380320]
11486D380320R3398m6659m9408J16131r1168K00010j8609n1200J12309k428p4338
11475D568358k5153J24070l430r2826J35731J03867m27l73919J60320j08638j23231
11464D364722J00851n2426o6035K41426O53r1253j88613J65397Q3376k89731m3357
11453D225010K28360j88208r247J70522n7528K30584o4051R2512J32414n7433
11443D702935J13014K2239j20512L58393j97062K67933j19479K5458J6540L23906
11433E393365k09779J51315J54833J74146r9167j0475J91158P2445p0028n1291
11423E696522L37196j8814p4543j54665J93739O0963j78100L28729k8557j80455
11413E982015J26732J57822K335P1743K47683j02599M12911Q389j56729K53402
$$ y = [4380320, 4473718, 4427059, 4377651, 4493782, 4402614, 4602624, 4584015, 4532815, 4645124, 4642696, 4568358, 4543205, 4667275, 4663845, 4571019, 4706750, 4810617, 4810190, 4436271, 4596591, 4487953, 4364722, 4465573, 4413147, 4347112, 4588538, 4589191, 4497938, 4309325, 4474722, 4558098, 4268367, 4225010, 4453370, 4265162, 4255915, 4426437, 4368909, 4599493, 4535442, 4627954, 4760368, 4702935, 4815949, 4838188, 4717676, 5076069, 4879007, 5146940, 5027461, 5052919, 5069459, 5393365, 5183586, 5334901, 5489734, 5663880, 5564713, 5554238, 5745396, 5817841, 5747813, 5696522, 6033718, 6014904, 5940361, 5785696, 5979435, 6040398, 5862298, 6191027, 6162470, 5982015, 6108747, 6266569, 6268904, 6340647, 6588330, 6485731, 6898642, 6907031, 6750302, 7003704]
11403G003704J71719O8682O0431J56820J26792K44117J7990K02663J39012j86625
11393H005305N15565q6997j6576O05170P546j3312M56005p0096N3875J26620K01994
11382I785099J79356O0880p3403K73962K21975K18287K7792J29212L1083K8810
11372A0883053P9837K07926J85782J61141k5857L2061J4303O4124p770L45358
11362A1939958k03966k1292L84677j71714P3034N6903O2838k03929R2941J23297
11352A2132747J32019j38222K9136J3961K79654j03679q1213L6283m8858jJ08966
11341A2360793j45463N3518k40673q2536N9458k4119k68156P0012r9977k00597
11331A1482260L668R4667k14271k21955k1792l83330l8789j76437N359k78863
$$ y = [7003704, 7175423, 7244105, 7304536, 7461356, 7588148, 7832265, 7850255, 8052918, 8191930, 8005305, 8520870, 8433873, 8417297, 9022467, 9030013, 9016701, 9472706, 9402610, 9456485, 9583105, 9785099, 9964455, 10025335, 9951932, 10225894, 10447869, 10666156, 10693948, 10823160, 10854243, 10883053, 10962890, 11170816, 11356598, 11517739, 11491882, 11523943, 11538246, 11602370, 11594600, 11939958, 11735992, 11714700, 12099377, 11927663, 12000697, 12057600, 12120438, 11916509, 12009450, 12132747, 12264766, 12126544, 12155680, 12169641, 12449295, 12345616, 12264403, 12300686, 12251828, 12251827, 12360793, 12215330, 12268848, 12028175, 11945639, 12005097, 11980978, 11712822, 11782834, 11682857, 11482260, 11485928, 11580595, 11366324, 11144369, 11122577, 10739247, 10700458, 10524021, 10529380, 10250517]
11321A0250517m5774j64891k86551Q844j15657k48080j38366p376k09497k28988
11311H814181j01295j20313l02328j2338j72548l15285m9813l50487j26557o7678
11301G195539l11188J9213o0872k96230J8916k83283j24753p8165n9542j32120
11291E887515j10856k90001J25665o2425n9869k63655q7844p0937o7018k97000
11281D703575J81420l98364L0366J03582j74368J02991j88954N3817k87300J60220
11271D286985k97084K58789k94052O8624j2821P324j33355j48457J39243j44151
11261C731045K9882n1401j84894M2116Q8102k5547l57726O3697J04238J58607
11251C598119l1370l34580M23647k99160P6878k27992P86K44936q8847l4304J72827
$$ y = [10250517, 10204743, 10039852, 9753301, 9762145, 9646488, 9398408, 9260042, 9252666, 9043169, 8814181, 8712886, 8592573, 8290245, 8277907, 8105359, 7790074, 7740261, 7389774, 7263217, 7195539, 6884351, 6903564, 6842692, 6546462, 6565378, 6282095, 6157342, 6079177, 6019635, 5887515, 5776659, 5486658, 5612323, 5549898, 5490029, 5226374, 5138530, 5067593, 5000575, 4703575, 4884995, 4486631, 4516997, 4620579, 4446211, 4549202, 4360248, 4414065, 4126765, 4286985, 3989901, 4248690, 3954638, 4023262, 4010441, 4017765, 3884410, 3735953, 3875196, 3731045, 3760927, 3709526, 3524632, 3566748, 3654850, 3629303, 3271577, 3335274, 3439512, 3598119, 3566749, 3232169, 3655816, 3356656, 3433534, 3205542, 3206328, 3451264, 3362417, 3328113, 3500940]
11240C500940L4218j61407j19313N4827r7388K11615j33926J25791j61171K47265
11230C501451j98751p8749P4237J06835Q9795N89K23202J94303Q47611N35977
11220E296500R62157P06013J99291J60199n3651k57462r61698j034731n62271
11211D454347n38496j84637k49865m6371r4075K6196J4648m1348L1827l3323n0284
11200C288619K0102r7243L86578N8431o0323J8425P05779M21896O47650R47220
11190F337134Q29424J88392L7374l2455n59611q28823p98259m63074k90559p06161
11180C713382j1630O0639l38770o0439L85935j27537J80518k9410J92938l85352
11170C580274K09215o9013K4311J03375j39659K21389m4907R7845k35020M2858
$$ y = [3500940, 3535158, 3373751, 3254438, 3309265, 3211877, 3423492, 3289566, 3415357, 3254186, 3501451, 3302700, 3223951, 3298188, 3405023, 3494818, 3495407, 3718609, 3912912, 4760523, 5296500, 6258657, 6964670, 7163961, 7324160, 7270509, 7013047, 6051349, 5016618, 4454347, 3915851, 3731214, 3481349, 3434978, 3340903, 3367099, 3381747, 3340399, 3372226, 3338903, 3288619, 3308721, 3211478, 3598056, 3656487, 3596164, 3614589, 4320368, 4742264, 5389914, 6337134, 7166558, 7354950, 7392324, 7359869, 6800258, 5971435, 5173176, 4710102, 4419543, 3713382, 3701752, 3762391, 3423621, 3363182, 3749117, 3621580, 3802098, 3772688, 3965626, 3580274, 3789489, 3720476, 3744787, 3848162, 3708503, 3929892, 3884985, 3982830, 3747810, 3790668]
11160C790668R9252k01078K75790J31711k08002r672k17653M59646j53944j80730
11150C785988N5079K76660L2596R8431m62672J55058j6851J12647n2197p7359
11140C907380J49335J34660j78222K39666q9794J64358j79844J86626J53912k842
11130D485235j07667M4304k151Q9175K7866k58219K09515K03072j5276j49244
11120D526610J30055K51141l60625M04753j70962p5087K544K97338l43694J75077
11110D837150j13390k0865R1890r698n2193j637n2186J09835l0550Q936L24969
11099E092261m71756N0405P9333j19767k1035J13125n9256n0734M6447k9746L5544
11088D664821j34960r0903J74974j45090P5828J999k1614p852k44871L9722M84324
$$ y = [3790668, 3889920, 3688842, 3964632, 4096343, 3888341, 3878669, 3661016, 4120662, 3966718, 3785988, 3841067, 4117727, 4150323, 4248754, 3786082, 3941140, 3924289, 4036936, 3984739, 3907380, 4056715, 4191375, 4013153, 4252819, 4163025, 4327383, 4147539, 4334165, 4488077, 4485235, 4377568, 4421872, 4419721, 4508896, 4536762, 4278543, 4488058, 4691130, 4675854, 4526610, 4656665, 4907806, 4547181, 4951934, 4780972, 4705885, 4708429, 5005767, 4662073, 4837150, 4723760, 4702895, 4794785, 4785087, 4732894, 4731257, 4679071, 4788906, 4758356, 4767292, 5092261, 4620505, 4670910, 4750243, 4630476, 4609441, 4722566, 4663310, 4612576, 4659023, 4629277, 4664821, 4529861, 4438958, 4613932, 4468842, 4544670, 4546669, 4525055, 4517203, 4272332, 4312054, 4796378]
11077D796378k35434J15579n4071K716j49565K71549k73227K82014J17609j40606
11067D732942L06531k3277Q7175q643j2194J11340J29802o5502J9309L2736J95514
11056E505733K07064J34325j18142Q9316J07712j03265Q2260j20182K29050K5972
11046F039843J03621K26510r7074O4384L1889J3250L20029J25155k01435K17627
11036F843799j14154R3729K37113K15072J59199K4738K10785J34415J65756L44588
11026H315040M07041K91879J36512J94489J06887K44513L48455K35755J84210
11017A0464781N14216j45052J71176J57045O0114K79619J2734j34272L22400m6026
11007A1656735N8123M47650J56423P5386L00566K43564M02338K96603O6605M22682
$$ y = [4796378, 4560944, 4676523, 4622452, 4625168, 4475603, 4747152, 4473925, 4755939, 4873548, 4732942, 5039473, 5016196, 5103371, 5094728, 5082534, 5193874, 5323676, 5258174, 5277483, 5310219, 5505733, 5712797, 5847122, 5728980, 5818296, 5926008, 5822743, 5905003, 5784821, 6013871, 6039843, 6143464, 6369974, 6272900, 6337284, 6369173, 6382423, 6702452, 6827607, 6626172, 6843799, 6729645, 6823374, 7060487, 7275559, 7434758, 7459496, 7670281, 7804696, 7970452, 8315040, 8722081, 9013960, 9150472, 9344961, 9451848, 9696361, 10044816, 10280571, 10464781, 10978997, 10833945, 11005121, 11162166, 11222280, 11501899, 11514633, 11380361, 11702761, 11656735, 11714858, 12162508, 12318931, 12394317, 12694883, 12938447, 13340785, 13637388, 13703993, 14126675]
10997A4126675K35607M75293L77967K47415L71840J35001L09773K19541K94554
10988A6793666L66604J7501J39742J72444L3074J37196K76602K90270N48123K98388
10978A9073610N33105K92319K69804L18658P6401K17831J14312R0414J82274N73183
10968B1741911L55821L50837N68697L74429M49199R7046O62862J77577N84402
10959B5362781M60061K03754N19314L94624L91969M02921P13096N29664N51872
10950B9530056R47363K70049O68212N33190M91812N20916M18927R06652O52589
10941C4939766N46637Q13782N89944O74258R14313P62594O20862P55063M95727
10932D1112946R79561P18529R18055Q59912Q02674P06609J076986J297966R43231
$$ y = [14126675, 14362282, 14837575, 15215542, 15462957, 15834797, 15969798, 16279571, 16499112, 16793666, 17160270, 17177771, 17317513, 17489957, 17523031, 17660227, 17936829, 18227099, 18775222, 19073610, 19606715, 19899034, 20168838, 20487496, 20563897, 20781728, 20896040, 20986454, 21168728, 21741911, 22097732, 22448569, 23017266, 23391695, 23840894, 23937940, 24600802, 24778379, 25362781, 25822842, 26026596, 26545910, 26940534, 27332503, 27735424, 28448520, 28978184, 29530056, 30477419, 30747468, 31415680, 31948870, 32440682, 32961598, 33380525, 34287177, 34939766, 35486403, 36300185, 36890129, 37564387, 38478700, 39241294, 39862156, 40617219, 41112946, 42092507, 42811036, 43729091, 44589003, 45391677, 46098286, 47175272, 48473238, 49416469]
10923D9416469J319357J089348J123645R46477J318453M63186Q14966K95782O90949
10914E7478632M30969K27310M58539L78752J56881M2937K17441R9966j92176K35486
10904E9534737j91281J31588j88089J43841q141J64246J29050J82932L20018K05952
10894F0424853M37789M70973N24014K44864P23787P20450P52024R17058J082720
10885F6298532J449672J284259J398496J855943J579068K352242K594634L011677
10877H1824523K935592L579144M200831M287539M676423N302993N139547N503392
10869A17449984N421252M747548M329713L742398K442807J795218L24180n90974
10861A39662126j815324k607954l640842m302398n004720n157547n078745n871003
$$ y = [49416469, 50735826, 51825174, 52948819, 53895296, 55213749, 55676935, 56491901, 56787683, 57478632, 57909601, 58136911, 58595450, 58974202, 59131083, 59174020, 59391461, 59491427, 59299251, 59534737, 59343456, 59475044, 59286955, 59430796, 59422655, 59586901, 59715951, 59898883, 60218901, 60424853, 60862642, 61333615, 61857629, 62102493, 62826280, 63546730, 64298754, 65215812, 66298532, 67748204, 69032463, 70430959, 72286902, 73865970, 76218212, 78812846, 81824523, 84760115, 88339259, 92540090, 96827629, 101504052, 106807045, 111946592, 117449984, 122871236, 127618784, 131948497, 135690895, 138133702, 139928920, 140253100, 139662126, 137846802, 135238848, 131598006, 127295608, 122290888, 117133341, 112054596, 106183593]
10853A06183593n421934n462494n200613n412841m903360m917137m161210m760338
10845F5943666l762999l930012l208667l438034l150597l123710k396923k259909
10837D0672815k586437k157255j849858j772909j695072j323214j554137j318762
10829B6415171j257725j488528q32813j113331j027710q72550q06711p78245o24938
10820A7612620r21299m27186o00065m25734l76728n07181l05009k78441k33745
10811A3537232k19571k71127n35034k28844l45024o75822m11324k15203m75659
10802A0159624k31779m10312k97282j99837k96193j27166m01036j35839j97987
10793G862193l70661p0244k61666J96958k14818M8617m47275R8319k87823j23390
$$ y = [106183593, 100761659, 95299165, 90098552, 84685711, 79782351, 74865214, 70704004, 65943666, 62180667, 58250655, 55041988, 51603954, 48453357, 45329647, 42932724, 40672815, 38086378, 35929123, 34079265, 32306356, 30611284, 29288070, 27733933, 26415171, 25157446, 23668918, 22836105, 21722774, 20695064, 19822514, 19015803, 18237558, 17612620, 16691321, 16264135, 15664070, 15238336, 14861608, 14354427, 14049418, 13770977, 13537232, 13317661, 13046534, 12511500, 12282656, 11937632, 11261810, 10850486, 10635283, 10159624, 9927845, 9517533, 9220251, 9020414, 8724221, 8597055, 8196019, 8060180, 7862193, 7491532, 7421288, 7159622, 7356580, 7141762, 7190379, 6743104, 6841423, 6553600, 6430210]
10783F430210j93143R7204p301l24136j77646L6280k19390k72597J43289l7126
10773E475644l68935K04074q5352k64804k11637k124K31719l94277q5203K70012
10763D769117l38208K13915o4752j30952j54543J48245p4039J8174j97678J46787
10753D336066J4938O1603J75488l61088P4907J6610j11053J32254l79871l1018
10743C928836k43057K24267k64800p7985J92105p9072j08958O362q7080k82398
10733C208220J40484M5834P8678J75378J04058J00845k08790J89101J1267j86038
10723C659037L4202j12041j0992N7754L2056J06957J2622l93160L1190J18884
10713C536509j02612N9038L4467M9801O0303q5474N1874m6181p0946J66223k39164
$$ y = [6430210, 6237067, 6334271, 6326970, 6002834, 5825188, 5861468, 5642078, 5369481, 5512770, 5475644, 5106709, 5310783, 5225431, 4960627, 4748990, 4746866, 4978585, 4584308, 4499105, 4769117, 4430909, 4644824, 4580072, 4449120, 4294577, 4442822, 4368783, 4386957, 4189279, 4336066, 4351004, 4412607, 4588095, 4227007, 4301914, 4318524, 4207471, 4339725, 3959854, 3928836, 3685779, 3910046, 3645246, 3567261, 3759366, 3680294, 3571336, 3577698, 3490618, 3208220, 3348704, 3394538, 3473216, 3648594, 3752652, 3853497, 3644707, 3833808, 3845075, 3659037, 3693239, 3581198, 3570206, 3627960, 3660016, 3766973, 3779595, 3386435, 3417625, 3536509, 3433897, 3492935, 3527402, 3577203, 3637506, 3552032, 3603906, 3557725, 3486779, 3653002, 3413838]
10702C413838J51279j58711K51283j34590j54389j23648q8007K7345o0714M9591
10692C173277k86810L78284j68349l4112J2778K21140j31695J58317r5668J3363
10682C240525j64759p1126o8695P0818N4159L1169R5830j79390K13006L0408m56421
10671B795524J20282p6079o369O1071k14232j84358L19482Q3274j25842J84430
10661B957183m41870P8933k34278K05181k0314k03830K13340J20143j79737J32786
10651B627537K5123m6464k3189m4270o0826J60304K18943l99061J43513k42160
10641B359450l5445j0455j58294J98109j7907J39872j21045K7056j21216j70101
10631B090024K76012q2326k33916J84457k0707J47348j68519M3884n7527K85039
$$ y = [3413838, 3565117, 3406406, 3657689, 3523099, 3368710, 3245062, 3157055, 3184400, 3123686, 3173277, 2886467, 3264751, 3096402, 3062290, 3075068, 3296208, 3164513, 3322830, 3227162, 3240525, 3075766, 3004640, 2935945, 3006763, 3060922, 3092091, 3187921, 3008531, 3221537, 3251945, 2795524, 2915806, 2839727, 2833358, 2894429, 2680197, 2495839, 2815321, 2898595, 2772753, 2957183, 2515313, 2594246, 2359968, 2565149, 2544835, 2341005, 2554345, 2674488, 2494751, 2627537, 2652660, 2606196, 2583007, 2538737, 2477911, 2638215, 2857158, 2458097, 2601610, 2359450, 2324005, 2313550, 2155256, 2353365, 2335458, 2475330, 2354285, 2381341, 2260125, 2090024, 2366036, 2283710, 2049794, 2234251, 2213544, 2360892, 2192373, 2236257, 2178730, 2463769]
10621B463769j94111J06316m29672J47674K09107j0335r2184r7344j5137K825
10611B090908q7903J59848L53883k69852l286p9578n9605r6334J18552k7095R2605
10600B192143k31492k181L05179j53310K1898o2617J6172q5296L09975n01385
10590A809086L07825j21893m1506J68409j71179N4875J70611P6672j44300L05458
10580B414058l21825Q4189K103N005p8077o5990K96158m36205J99782j40356J20753
10569B079595q8724j27020p242M942o6649N6839j86864j8498m2791J30260j34876
10558A598972J52639m9813j35169J74078l788k11472q3256L87763p8197j00895
10548A650862j78634N2628j0705Q4338l5534m3524Q7502j00882k696P1258j9770
$$ y = [2463769, 2269658, 2375974, 1946302, 2093976, 2303083, 2292748, 2200564, 2103220, 2088083, 2090908, 2003005, 2162853, 2516736, 2246884, 2243598, 2164020, 2104415, 2008081, 2126633, 2099538, 2192143, 1960651, 1958470, 2263649, 2110339, 2132237, 2069620, 2085792, 2000496, 2310471, 1809086, 2116911, 1995018, 1953512, 2121921, 1950742, 2005617, 2176228, 2252900, 2108600, 2414058, 2092233, 2176422, 2178525, 2183530, 2105453, 2039463, 2335621, 1899416, 2099198, 1958842, 2079595, 1990871, 1863851, 1856609, 1861551, 1794902, 1851741, 1664877, 1646379, 1603588, 1733848, 1598972, 1751611, 1701798, 1566629, 1740707, 1736919, 1525447, 1442191, 1829954, 1751757, 1650862, 1472228, 1524856, 1514151, 1598489, 1562955, 1519431, 1606933, 1506051, 1503355, 1574613, 1554843]
10537A554843L6025r3854N5913n9193J31865K54845l0307p935k31361n803K1757
10526A626795K08157J288o6639R491J54296J2332P9943j7596J75541K47249K2594
10515B453451K56593k22649R3449n2993N8483m16743k58682K8330R5541k30790
10505A803990N1444K05730l51525K35090j03235J24643J1683K22347l0221j45215
10495B024731J57312J884j72047L4942L88610l3462N0070J9595L30432r1143J67856
10484B878780j11407j92617k41152m5439k88934L34081l07245L04936j53881j01140
10474B075982J78992j5508p0340K1366J56138k67263J95996R9420K0566j49995
10464B245354M58735j59076M65285l20650J55256l1434k5894l69017J73406J37173
$$ y = [1554843, 1590868, 1497014, 1552927, 1493734, 1625599, 1880444, 1850137, 1842202, 1610841, 1605038, 1626795, 1834952, 1836240, 1769601, 1779092, 1933388, 1945720, 2025663, 2008067, 2183608, 2430857, 2453451, 2710044, 2487395, 2580844, 2527851, 2586334, 2169591, 1910909, 1939239, 2034780, 1803990, 1855434, 2061164, 1709639, 1944729, 1841494, 1966137, 1977820, 2200167, 2169946, 2024731, 2182043, 2183927, 2011880, 2046822, 2435432, 2401970, 2452040, 2471635, 2802067, 2710924, 2878780, 2767373, 2574756, 2333604, 2288165, 1999231, 2333312, 2026067, 2331003, 2177122, 2075982, 2254974, 2239466, 2169126, 2190492, 2346630, 2079367, 2275363, 2374783, 2395349, 2245354, 2704089, 2545013, 3010298, 2689648, 2844904, 2813470, 2787576, 2418559, 2591965, 2729138]
10454B729138p6725L96710j61182j0701K63380M6083l9907K2529j91732L8950
10444C016543j09080r1630j86867j07294n7700J46405J51879K58490K04365K13509
10434C438620M0875J16931O4572k23325k70193l70261k27656J17385k11760j82959
10424B292229j50933r4776J07996N3019J82989J29788k42939L39962k70304K5686
10414B372717J39609J54221j01390K8267L79569L8333L84331M32218K59655K63487
10404D351017L58113K12420K41976l57921J09391N8545q5145K30933K00949J49675
10394E469953L59739O52745K32839O1585M13486J81563K79510j41905j07111j04021
10384G298383Q5059m40671o874k71667j04273M1202j9800K31368p1281M1948J04623
$$ y = [2729138, 2652413, 3049123, 2887941, 2877240, 3140620, 3186703, 3146796, 3169325, 2977593, 3016543, 2907463, 2815833, 2628966, 2521672, 2463972, 2610377, 2762256, 3020746, 3225111, 3438620, 3479495, 3596426, 3660998, 3437673, 3167480, 2797219, 2569563, 2686948, 2475188, 2292229, 2141296, 2046520, 2154516, 2207535, 2390524, 2520312, 2277373, 2617335, 2347031, 2372717, 2512326, 2666547, 2565157, 2593424, 2972993, 3011326, 3395657, 3827875, 4087530, 4351017, 4709130, 4921550, 5163526, 4805605, 4914996, 4973541, 4888396, 5119329, 5320278, 5469953, 5829692, 6482437, 6715276, 6776861, 7190347, 7371910, 7651420, 7509515, 7402404, 7298383, 7383442, 6942771, 6935897, 6664230, 6559957, 6601159, 6581359, 6812727, 6741446, 6783394, 6888017]
10373F888017m93464J55433M6509Q4184Q7406j1429N29380J43150m9859K24515
10363G603842k27838k8964l02352K31001l17937j90229l55462Q1046o7294n42507
10353E883306J0722J53398k61183k81208R2507l73279k76536j50634R5825k77137
10343D615781K7750j15199o8624j30759J59892p0249K18292j16353J31436J65267
10333D817234l3793K62692m00318K30299J2205l46831n0632l0145p0959K67712
10323D657464j15935J84457M3821J11467j33503j50884J77027r1769P2895j55361
10313D599679K51438J3469j28934K45930P6119R4104J83175J83675M5838m8511
$$ y = [6888017, 6394553, 6549986, 6596495, 6680679, 6768085, 6756656, 7286036, 7429186, 7379327, 7603842, 7376004, 7347040, 7044688, 7275689, 6957752, 6767523, 6412061, 6493107, 6425813, 5883306, 5894028, 6047426, 5786243, 5505035, 5597542, 5224263, 4947727, 4797093, 4892918, 4615781, 4643531, 4528332, 4459708, 4328949, 4488841, 4418592, 4636884, 4520531, 4651967, 4817234, 4783441, 5046133, 4645815, 4876114, 4888319, 4541488, 4490856, 4460711, 4389752, 4657464, 4541529, 4725986, 4769807, 4881274, 4747771, 4596887, 4773914, 4682145, 4755040, 4599679, 4851117, 4864586, 4735652, 4981582, 5057701, 5151805, 5334980, 5518655, 5564493, 5515982]
$$ [...]
##END NTUPLES=NMR SPECTRUM
##END=
