##TITLE=Coffee green (TOSA01 0.1000g + 1.5mL buffer 50/50,  450uL extracto + 50uL (D2O+TMS))
without heating, vortex and centrifuged, temperature 0oC.
##JCAMPDX= 6.0         $$ Bruker NMR JCAMP-DX V2.0
##DATA TYPE= NMR SPECTRUM
##DATA CLASS= NTUPLES
##ORIGIN= Bruker BioSpin GmbH
##OWNER= Administrator
$$ 1.72 TOPSPIN		Version 2.1
$$ 2012-05-22 17:20:25.998 -0700  Administrator@X
$$ Compression mode = diff/dup
##.OBSERVE FREQUENCY= 400.13188176
##.OBSERVE NUCLEUS= ^1H
##.ACQUISITION MODE= SIMULTANEOUS (DQD)
##.ACQUISITION SCHEME= undefined
##.AVERAGES= 64
##.DIGITISER RES= 22
##SPECTROMETER/DATA SYSTEM= spect
##.PULSE SEQUENCE= noesygppr1d
##.SOLVENT NAME= H2O+D2O
##.SHIFT REFERENCE= INTERNAL, H2O+D2O, 1, 14.97914
##AUDIT TRAIL= $$ (NUMBER, WHEN, WHO, WHERE, PROCESS, VERSION, WHAT)
$$ ##TITLE= Audit trail, TOPSPIN		Version 2.1
$$ ##JCAMPDX= 5.01
$$ ##ORIGIN= Bruker BioSpin GmbH
$$ ##OWNER= Administrator
$$ $$ C:\Bruker\TOPSPIN/data/jwist/nmr/11-coffee-green-origin/191/pdata/1/auditp.txt
$$ ##AUDIT TRAIL=  $$ (NUMBER, WHEN, WHO, WHERE, PROCESS, VERSION, WHAT)
(   1,<2011-10-06 20:42:24.644 -0500>,<Administrator>,<TOPSPIN>,<go>,<TOPSPIN 2.1>,
      <created by zg
	started at 2011-10-06 20:33:29.550 -0500,
	POWCHK enabled, PULCHK disabled,
       configuration hash MD5:
       DA 63 81 1B EF 4C B5 72 B4 DF EA D9 B4 DB 4C 08
       data hash MD5: 64K
       0E 3E 93 B0 20 E3 8C C5 02 0B 8D 0E 7E 13 2E DB>)
(   2,<2011-10-06 20:44:08.909 -0500>,<Administrator>,<TOPSPIN>,<proc1d>,<TOPSPIN 2.1>,
      <Start of raw data processing
       efp LB = 0 FT_mod = 6 PKNL = 1 PHC0 = 0 PHC1 = 0 SI = 32K 
       data hash MD5: 32K
       ED ED C1 A9 E2 E8 0C 93 3E A8 2A D4 3E 8C 7C D3>)
(   3,<2011-10-06 20:44:09.628 -0500>,<Administrator>,<TOPSPIN>,<proc1d>,<TOPSPIN 2.1>,
      <pk PHC0 = 25.38391 PHC1 = 0 
       data hash MD5: 32K
       AB E5 FA EC E9 90 74 E6 6C 15 B7 94 09 9B D6 96>)
$$ ##END=
$$ 
$$ $$ hash MD5
$$ $$ 23 BE 03 7A 68 4D 8B D6 92 11 07 66 40 58 A2 A5
##$RELAX= 
##$RELAX= 
##$RELAX= 
##$RELAX= 
##$RELAX= 
##$RELAX= 
$$ Bruker specific parameters
$$ --------------------------
##$DU= <Z:>
##$EXPNO= 191
##$NAME= <11-coffee-green-origin>
##$PROCNO= 1
##$TYPE= <nmr>
##$USER= <jwist>
##$ACQT0= -8.15171882157293
##$AMP= (0..31)
100 100 100 100 100 100 100 100 100 100 100 100 100 100 100 100 100 100
100 100 100 100 100 100 100 100 100 100 100 100 100 100
##$ANAVPT= -1
##$AQSEQ= 0
##$AQ_mod= 3
##$AUNM= <au_prof>
##$AUTOPOS= <>
##$BF1= 400.13
##$BF2= 400.13
##$BF3= 400.13
##$BF4= 400.13
##$BF5= 400.13
##$BF6= 400.13
##$BF7= 400.13
##$BF8= 400.13
##$BYTORDA= 0
##$CFDGTYP= 0
##$CFRGTYP= 9
##$CHEMSTR= <none>
##$CNST= (0..63)
1 1 145 1 1 1 1 1 1 1 1 1 1 1 1 1 1 1 1 1 1 1 1 1 1 1 1 1 1 1 1 1 1 1 1
1 1 1 1 1 1 1 1 1 1 1 1 1 1 1 1 1 1 1 1 1 1 1 1 1 1 1 1 1
##$CPDPRG= <>
##$CPDPRG1= <>
##$CPDPRG2= <>
##$CPDPRG3= <>
##$CPDPRG4= <mlev>
##$CPDPRG5= <mlev>
##$CPDPRG6= <mlev>
##$CPDPRG7= <mlev>
##$CPDPRG8= <mlev>
##$CPDPRGB= <>
##$CPDPRGT= <>
##$D= (0..63)
$$ [...]
0 120 120 120 120 120 120 120
##$TP= (0..7)
150 150 150 150 150 150 150 150
##$TP07= 0
##$TPNAME0= <>
##$TPNAME1= <>
##$TPNAME2= <>
##$TPNAME3= <>
##$TPNAME4= <>
##$TPNAME5= <>
##$TPNAME6= <>
##$TPNAME7= <>
##$TPOAL= (0..7)
0.5 0.5 0.5 0.5 0.5 0.5 0.5 0.5
##$TPOFFS= (0..7)
0 0 0 0 0 0 0 0
##$TUNHIN= 0
##$TUNHOUT= 0
##$TUNXOUT= 0
##$USERA1= <user>
##$USERA2= <user>
##$USERA3= <user>
##$USERA4= <user>
##$USERA5= <user>
##$V9= 5
##$VALIST= <valist>
##$VCLIST= <CCCCCCCCCCCCCCC>
##$VD= 0
##$VDLIST= <DDDDDDDDDDDDDDD>
##$VPLIST= <PPPPPPPPPPPPPPP>
##$VTLIST= <TTTTTTTTTTTTTTT>
##$WBST= 2048
##$WBSW= 25
##$XGAIN= (0..3)
0 0 0 0
##$XL= 0
##$YL= 0
##$YMAX_a= 5626067
##$YMIN_a= -2483206
##$ZGOPTNS= <>
##$ZL1= 120
##$ZL2= 120
##$ZL3= 120
##$ZL4= 120
##$ABSF1= 0
##$ABSF2= 0
##$ABSG= 0
##$ABSL= 0
##$ALPHA= 0
##$AQORDER= 0
##$ASSFAC= 0
##$ASSFACI= 0
##$ASSFACX= 0
##$ASSWID= 0
##$AUNMP= <proc_prof1d>
##$AXLEFT= 0
##$AXNAME= <>
##$AXNUC= <1H>
##$AXRIGHT= 0
##$AXTYPE= 0
##$AXUNIT= <>
##$AZFE= 0.1
##$AZFW= 0.1
##$BCFW= 0
##$BC_mod= 0
##$BYTORDP= 0
##$COROFFS= 0
##$CY= 15
##$DATMOD= 1
##$DC= 0
##$DFILT= <>
##$DTYPP= 0
##$F1P= 0
##$F2P= 0
##$FCOR= 0.5
##$FTSIZE= 32768
##$FT_mod= 6
##$GAMMA= 0
##$GB= 0
##$INTBC= 1
##$INTSCL= 1
##$ISEN= 128
##$LB= 0
##$LEV0= 0
##$LPBIN= 0
##$MAXI= 10000
##$MC2= 0
##$MEAN= 0
##$ME_mod= 0
##$MI= 0
##$NCOEF= 0
##$NC_proc= -6
##$NLEV= 6
##$NOISF1= 0
##$NOISF2= 0
##$NSP= 0
##$NTH_PI= 0
##$NZP= 0
##$OFFSET= 14.97914
##$PC= 1
##$PHC0= 25.38391
##$PHC1= 0
##$PH_mod= 1
##$PKNL= yes
##$PPARMOD= 0
##$PPDIAG= 0
##$PPIPTYP= 0
##$PPMPNUM= 2147483647
##$PPRESOL= 1
##$PSCAL= 4
##$PSIGN= 0
##$PYNMP= <proc.py>
##$REVERSE= no
##$SF= 400.13
##$SI= 32768
##$SIGF1= 0
##$SIGF2= 0
##$SINO= 400
##$SIOLD= 32768
##$SPECTYP= <>
##$SREGLST= <1H.CDCl3>
##$SSB= 0
##$STSI= 32768
##$STSR= 0
##$SW_p= 8223.6842105263
##$SYMM= 0
##$S_DEV= 0
##$TDeff= 65536
##$TDoff= 0
##$TI= <>
##$TILT= no
##$TM1= 0
##$TM2= 0
##$TOPLEV= 0
##$USERP1= <user>
##$USERP2= <user>
##$USERP3= <user>
##$USERP4= <user>
##$USERP5= <user>
##$WDW= 1
##$XDIM= 32768
##$YMAX_p= 424305548
##$YMIN_p= -357584
##$CURPLOT= <Network HP LaserJet P1505>
##$CURPRIN= <$Network HP LaserJet P1505>
##$DFORMAT= <normdp>
##$LAYOUT= <+/1D_H.xwp>
##$LFORMAT= <normlp>
##$PFORMAT= <normpl>
##$SURQMSG= 1
$$ End of Bruker specific parameters
$$ ---------------------------------
##NTUPLES= NMR SPECTRUM
##VAR_NAME=  FREQUENCY,     SPECTRUM/REAL,   SPECTRUM/IMAG
##SYMBOL=    X,             R,               I
##VAR_TYPE=  INDEPENDENT,   DEPENDENT,       DEPENDENT
##VAR_FORM=  AFFN,          ASDF,            ASDF
##VAR_DIM=   32768,         32768,           32768
##UNITS=     HZ,            ARBITRARY UNITS, ARBITRARY UNITS
##FACTOR=    0.250966925370065, 1,           1
##FIRST=     8223.43324360093, 99931,        -140878
##LAST=      0,             -66681,          -234087
##MIN=       0,             -357584,         0
##MAX=       8223.43324360093, 424305548,    0
$$ Real data points
##PAGE= N=1
##DATA TABLE= (X++(R..R)), XYDATA
$$ [...]
23456 244235 306390 109100 445524 164281 179641 149208 359380 307824 221079 121914 376448
23445 376448 167539 256415 78827 76245 298301 276174 245711 205661 263435 21124 232416
23434 232416 483855 376286 306836 200013 298054 258180 360667 381804 222087 183985
23424 183985 215064 179737 27170 210224 316830 253668 267835 258771 224432 132024 182434
23413 182434 141979 456969 366433 274455 261593 293567 340479 135950 352554 245602 553093
23402 553093 370131 479473 500530 364473 407632 489057 289268 412166 289182 298098
23392 298098 287447 362865 285134 397964 758071 864747 735389 722501 755186 976438
23382 976438 990469 1143321 1488094 1823677 2287610 2959469 3675625 4812335 5927402
23373 5927402 7321978 8812799 10675917 12704061 14711438 16597458 18479080 20132464
23365 20132464 21738821 22805589 23511010 23710800 23912500 22808680 22117221 20419381 18764072
23356 18764072 16565045 14524318 12333141 10540401 8833478 7051618 5455830 4309647
23348 4309647 3134191 2346103 1757968 1357230 1065830 966027 799915 670664 555733
23339 555733 862847 552253 131796 602335 300130 305791 174702 103830 308504 287042
23329 287042 335114 144136 243370 484761 367853 271927 423416 100605 433612 333865
23319 333865 204517 494580 131020 95582 413509 51829 242290 250619 150534 218235
23309 218235 203515 145416 421841 271261 333008 264491 336068 250392 504737 92796 316407
23298 316407 172555 -62720 67518 381758 237865 236433 243115 -23096 293470 394358 434127
23287 434127 478227 441027 121956 451345 376510 332536 317556 195757 435955 396543 157239
23275 252631 196924 -8046 428960 366639 169058 184170 89673 331201 -110149 328055 346757
23264 346757 282869 87273 229239 50920 -8528 445942 391546 -39092 289123 322108 432964
23253 432964 344442 424705 -87 306719 227733 256533 227972 443373 530913 95443 191424 226168
23241 226168 167813 384785 102109 293500 167039 32283 186426 347492 239263 56057
23230 -9904 247696 242861 216212 156109 405492 224298 122288 372207 184853 -33238 126731
23218 243959 431890 377496 -1667 279134 201885 264101 143416 314244 156619 298270
23208 298270 157111 214557 284117 141686 63893 260926 377763 318526 75937 396324
23198 396324 300355 285309 240771 298257 379766 29609 146112 59360 164272 187283 88362
23186 219574 97659 132223 -78857 215706 132827 61894 267544 411832 96332 400539 31875
23174 312672 266105 253911 73843 227494 82152 365729 69761 288736 316034 224102 247289
23163 247289 195360 246106 123299 189779 194064 446606 329268 215520 168422 217675 359020
23152 359020 169997 102981 63298 293504 407195 -36429 87583 44286 303787 303880 370615
23141 370615 249206 149666 206372 301979 249096 358371 282550 165982 120886 163835 404583
23130 404583 166099 217947 415814 213362 38639 -92458 227465 99452 185589 344304
23120 344304 139062 439236 192261 402781 218950 225020 371458 150651 203705 404583
23110 404583 348989 212388 251290 163918 270865 263939 6520 379324 238400 404905 363366
23099 363366 300084 469199 129748 285802 55947 524761 141286 343161 290788 146832
23089 146832 375184 244669 191683 278017 314037 473816 487131 285294 345771 234108
23079 234108 154470 252626 316688 252590 307429 430050 408492 239719 410043 228911 302653
23068 302653 318543 398620 226335 243672 204885 506592 444227 281984 349659 602172 142481
23056 532825 396643 374051 398311 437331 170278 380324 412642 377389 357710 377632 220692
23045 220692 386671 437701 284893 418408 332035 269227 416020 308132 414688 205847
23034 416391 298132 264576 257149 456882 438922 161449 354498 102238 266457 192839
23024 192839 351196 297157 468476 327253 278999 391152 8657 408548 177893 211321
23014 211321 306841 282218 163964 226493 105139 221023 234088 353685 301953 82077 356940
23003 356940 431917 222555 262080 259991 185580 512583 434945 539168 483211 376847 522415
22992 522415 414012 327079 449192 280678 518257 438325 470372 506409 171580 507578
22982 507578 625197 262731 418794 498794 738637 509651 744525 448113 882963 668604
22972 668604 624535 647319 776355 534981 590439 434488 515967 651463 754137 825036
22962 825036 871094 906317 800525 972784 958186 1205912 1294492 1693365 2020586 2781403
22952 2781403 3397409 4051708 5089938 5902462 7243566 8456186 9565914 10781979 11570999
22943 11570999 12148832 12504877 12740683 12783065 12950035 12444208 11555641 10363069 9028999
22934 9028999 8444251 7234740 5911192 5365017 4398534 3513342 3554288 2969453 2791581
22925 2791581 2741870 3065117 3204514 4056156 4505226 5744740 7101653 8465623 9869706
22916 9869706 12024394 13718030 15718596 17447424 19315644 20366823 21455085 22203634
22908 22203634 22409051 22393542 21906826 21057264 19652440 17975930 16718120 14905509 13178294
22899 13178294 11806931 10127203 8720742 7729794 7187737 6990798 6854897 6796442 7049022
22890 7049022 7448577 8011220 8518655 9200653 9373982 9825817 10212017 10017731 10072690 9763846
22880 9763846 9622654 8994176 8405785 7830885 7002658 6407612 5752589 4910417 4119090
22871 4119090 3696464 3095224 2830486 2318218 2056266 1804891 1648010 1374060 1275507 1049662
22861 1049662 1127154 937833 782163 685076 797444 855668 797107 758633 639246 725327
22851 725327 488099 644278 545436 714692 447426 403924 331389 428114 432526 333142 541863
22840 541863 407881 595612 600822 386243 411111 387964 511813 510958 333034 198234 225397
22829 225397 386199 311389 351131 214012 386089 501065 451594 495919 450444 418655 362690
22818 362690 149137 495473 292830 358720 526156 122899 362972 425817 315701 582148
22808 582148 432238 384435 247369 418501 270784 196776 317075 388845 515954 411247
22798 411247 200293 127439 259960 452445 316972 275427 310263 239946 121190 372001
22788 372001 551818 286564 415096 437131 551344 241855 142112 307666 288978 240761
22778 240761 208749 284211 322378 209085 329419 256301 187880 326244 398767 266330 229034
22767 229034 314425 293382 212834 295640 359544 108017 478698 198742 396944 218396
22757 218396 207734 -72961 438752 562201 427303 242294 428733 153758 130039 258903
22747 258903 153833 155555 139329 253550 113936 381690 308624 338287 344629 256594 329922
22736 329922 522577 432966 164923 -57806 208242 476280 415838 331485 423279 182806
22725 345941 435901 56881 259119 420416 429979 322951 304942 187665 17428 242660 156815
22714 156815 87755 234625 297748 105233 294071 381043 249366 440611 248752 241346
22704 241346 372868 427905 195268 144184 170103 113491 338935 157080 247203 66635 231394
22693 231394 273993 185403 218720 301544 278131 418633 254793 251856 283662 107690 314024
22682 314024 401823 156411 383248 311152 129864 10004 339112 205286 241359 356563
22672 356563 244034 269829 11753 173495 316487 153306 336525 233730 246878 133202
22662 133202 157536 271188 209557 331289 460406 306219 322106 321767 361188 404665 230516
22651 230516 472775 -5461 377439 421523 240864 463865 287256 319692 321752 132495 346666
22640 346666 401444 302407 284656 312928 317999 368535 323211 505278 98141 448165 423601
22629 423601 479385 542351 382041 253525 325676 458817 241334 265548 263115 -26965 422274
22617 224367 497225 417939 88209 121724 444338 450869 245888 365238 395644 332485 300529
22606 300529 323788 303008 320134 313442 563003 401917 323967 431427 220998 493393 615123
22595 615123 282035 463821 522752 537125 316333 371165 424315 577884 377347 596057
22585 596057 480601 399179 325960 357349 349285 357187 381269 415845 204585 443744 102475
22573 259708 559249 291121 430483 568901 475533 236999 392155 396944 387871 623371
22563 623371 409148 173274 376159 489945 582424 376667 323770 398232 254407 321449
22553 321449 370961 260048 436051 323826 506817 295511 363830 517711 423046 256015
22543 256015 408530 407874 503050 359866 351466 434034 440035 513702 535398 498299 433225 378196
22531 378196 422159 479101 431788 363789 351101 516639 308042 331029 328933 292290 460078
22520 460078 527801 433452 690438 479093 311656 368610 444863 398992 450002 464311 330510
22509 330510 622398 258089 307830 439995 455290 496028 484034 639203 399299 343788
22499 343788 576317 466927 465199 325900 323941 355487 274435 307997 500390 409128 465234
22488 465234 446585 468513 303276 488787 268205 616751 505166 389962 357998 465940
22478 465940 407207 372903 369996 160409 456403 288689 411854 451597 283143 576647
22468 576647 376750 279244 738846 384362 456835 223572 248741 283957 310871 475305
22458 475305 389033 290972 503557 741728 258988 313397 580938 433328 437510 594119
22448 594119 410925 508223 378745 409994 521214 384743 394750 561875 576781 446787
22438 446787 485454 176426 343734 381445 476875 194485 240291 400506 473155 164382
22427 376010 210031 158131 380562 359465 396224 404674 400388 308063 311990 533187 444551
22416 444551 209095 385458 284392 291028 265465 595954 419882 505387 359180 287328
22406 287328 264197 360846 241987 459756 444490 671565 369467 440738 243184 365309
22396 365309 296886 384029 204160 451891 474814 477311 533430 560202 246101 360258 101449
22384 418802 346688 388991 343733 156339 365311 630724 435374 554647 432158 462068
22374 462068 369778 380410 442312 527813 263681 520580 526008 529279 502237 425714 324311
22363 324311 424228 369645 614289 483118 344859 649847 308120 425707 452611 502682
22353 502682 465284 520525 627566 671423 429487 644634 426456 605326 552569 617222
22343 617222 405406 601855 551795 580477 516100 471765 441197 534144 726771 565916 456020
22332 456020 930721 946126 1289248 927162 1137263 1187927 1022966 1077374 944436 1078634
22322 1078634 1036635 608866 588556 470674 579150 584014 813358 664174 559789 696535
22312 696535 521839 699044 559408 523992 777819 655164 682358 544372 629384 648111
22302 648111 555076 684689 746326 728268 351597 613674 807162 675368 612372 608267 593256
22291 593256 453477 366896 615101 471274 728700 576811 784782 461007 610382 634911
22281 634911 194404 466957 767706 587912 628364 499306 511071 650522 748531 568784
22271 568784 567850 552530 546829 536328 625513 835410 673723 482701 479685 621061 463652
22260 463652 649403 572288 531701 424656 610826 561350 897502 346209 548207 508565
22250 508565 466639 587004 489288 555003 510801 652315 670968 629193 417963 455515 800420
22239 800420 644090 670133 515190 527589 382522 516406 596798 687530 557282 509932
22229 509932 582108 549478 493859 560210 501209 427721 530143 704458 599257 490835 502075
22218 502075 471459 785306 604354 427114 826840 554724 604082 625959 686782 655370
22208 655370 725203 636089 481593 789856 673170 572729 553098 520655 576868 727474
22198 727474 651233 642636 640244 658229 790791 741128 719697 646669 642199 688811 718954 562048
22186 562048 384179 630307 565555 766677 811203 610902 637702 763861 665468 552336
22176 552336 632886 497633 749412 797240 405374 666331 464085 413309 537646 744232
22166 744232 557949 742660 748530 599877 786700 614611 657969 648155 430171 503595 673877
22155 673877 670591 535754 670617 656000 462167 546854 659206 607725 532927 686499 678372
22144 678372 499192 857006 556335 711387 527068 596489 582939 705606 674193 647469
22134 647469 646070 666512 712131 557019 555773 610293 677368 564398 272432 754505 587598
22123 587598 579390 575630 510288 674402 566697 837830 779750 750715 400684 489566 619929
22112 619929 413488 585839 840741 610137 447518 717993 648497 764051 622927 610937
22102 610937 478424 578460 299785 690304 700366 424689 417258 645037 687417 627596
22092 627596 446975 680003 607429 690346 701456 707715 822637 780194 583551 746724 602075
22081 602075 420705 784066 733342 567414 686189 748555 831168 613361 764936 875787
22071 875787 611751 769676 875475 554949 680982 571311 543306 709282 840938 595247
22061 595247 683618 846571 656297 682631 704720 643603 814026 937707 608286 731305
22051 731305 642226 630078 582858 660244 468180 653189 616908 708646 840927 573963 740259
22040 740259 532848 691999 598258 622804 871411 522125 753606 649211 830197 622786
22030 622786 802655 709931 706850 740007 582725 718901 974748 610103 520097 636834
22020 636834 711147 853494 697314 799778 667194 840306 833331 581845 624418 651782
22010 651782 720316 816537 722219 769033 520184 751324 395337 753518 593461 781007
22000 781007 703461 799225 578786 787368 763125 820581 577949 762222 665809 819541
21990 819541 513258 791439 667620 800013 806344 773524 1028293 658011 613269 883822
21980 883822 704658 823933 686672 700919 791119 705890 908646 580853 687427 823584
21970 823584 954779 775501 761671 749249 800518 721011 742509 719992 616917 722852 754051
21959 754051 573630 738443 748441 675792 557048 699977 861096 830935 916296 800035
21949 800035 684001 924934 754999 1056031 756472 742504 827104 689802 866319 620509
21939 620509 666847 820432 650613 602770 526642 704697 902285 706874 797870 909244
21929 909244 652257 631369 845860 756540 655654 744909 790798 893696 714458 595890
21919 595890 768397 748525 803999 678706 946869 830792 538432 603488 891261 765975
21909 765975 707087 621645 919702 737674 883253 959724 821879 698781 811306 797619
21899 797619 625587 945145 659446 783933 761615 563344 964073 597697 840174 767068
21889 767068 756960 633368 814254 1078118 791958 770845 551700 647288 660208 843941
21879 843941 798641 780455 884952 752806 729283 798730 799113 582151 759231 710410 728664
21868 728664 833063 764506 1001709 723923 809907 861146 839430 474457 615157 906974
21858 906974 1020479 819003 600349 895239 1001779 699150 607561 956472 1119383 857947
21848 857947 868373 760338 624670 827511 693233 799399 533127 874442 878112 683577
21838 683577 869543 857815 845737 492363 712941 842970 1039697 709098 886077 680872
21828 680872 796375 503599 706645 635540 625500 975293 820447 547384 625510 520234
21818 520234 702277 619715 664083 892013 925267 660542 631873 648799 749249 835396 790385
21807 790385 1011989 606226 699660 645359 886125 853270 850594 1065546 672027 567962
21797 567962 699095 981130 814645 804570 691323 578234 650576 655010 689582 780958 655091
21786 655091 703441 786498 678847 708360 659409 718290 745272 709280 804989 840120 763793
21775 763793 482801 563581 994152 1019614 814097 1146803 908572 836439 854545 1073000
21765 1073000 849526 1029062 998997 836591 1158662 1318935 1385830 1493128 1405648 1672101
21755 1672101 1675694 1762060 2032311 2153093 2481899 2876091 3465586 3644053 4242170 4685058
21745 4685058 5425417 5708798 6047535 6665909 6496751 6780809 6898522 6363596 6439690 6082902
21735 6082902 5649294 5564642 4730085 4396530 4127338 4037228 3941934 3909481 4098321 4150634
21725 4150634 4375933 4916678 5314623 5988290 6360267 6986358 7647702 8443736 8713925
21716 8713925 9199328 9516984 10002706 10132136 10217604 10095636 9732912 9646149 9252841 8734039
21706 8734039 8226730 7311775 7102635 6230580 5940620 5303230 4791741 4468784 4036981
21697 4036981 3835665 3734163 3887201 3950271 3927648 4097903 4391529 4837057 5088059 5315835
21687 5315835 5936534 5905066 6103079 6064444 5998333 5819873 5882351 5241818 4603395 4001870
21677 4001870 3691719 3271866 2836699 2204346 2049642 2019985 1615161 1743713 1478451 1342905
21667 1342905 1465301 1218592 1065244 1224991 1047461 1063054 932960 929808 895244 1019238
21657 1019238 872399 1056635 988785 1103285 936227 939667 1037960 811782 549566 777067
21647 777067 853087 803805 800956 680751 536257 636533 551596 693725 622400 883013 830708
21636 830708 666535 582807 866912 702554 759852 837187 757998 671580 820988 663610
21626 663610 742534 758612 777843 731383 569851 751391 700852 803032 832257 686459 743129
21615 743129 613251 701821 828248 810310 657697 802645 822641 521125 803608 668169
21605 668169 746209 616440 893467 641444 877064 623661 737423 754669 834236 573866
21595 573866 699749 700178 607768 762294 537561 850419 643859 543783 596998 601916 891621
21584 891621 1029499 636369 616670 654090 691396 826568 531909 675505 824528 676625
21574 676625 847955 619456 714061 780534 875613 725895 683094 640910 710014 731277 608801
21563 608801 522365 713889 640721 768407 749671 671082 520896 646829 527725 686236
21553 686236 587622 736899 589874 626605 410586 744636 510898 692633 738049 714400
21543 714400 628976 714870 695714 638134 913708 727137 534680 740765 536353 775744
21533 775744 595886 689257 789015 674726 784461 777408 769556 712450 734924 847940 679440
21522 679440 502415 653140 628960 976079 684770 790782 739596 743400 772474 1048222
21512 1048222 572923 1038604 700474 760120 945283 1016812 860438 933517 709428 1005311
21502 1005311 976606 676368 808229 810025 811539 1160425 830677 849017 858412 670942 913075
21491 913075 680640 809590 867141 718647 811570 1003769 610253 895941 898592 695769
21481 695769 771044 683032 798341 956222 931881 676740 849921 1069992 727049 953868
21471 953868 1063250 756704 767845 936423 883326 1023908 716179 774389 878868 946518
21461 946518 926538 1058541 955230 987506 747807 779674 891296 870998 923325 871242 796501
21450 796501 660889 1029334 709416 776682 890941 1114511 874943 776359 672427 775870
21440 775870 983082 1046690 865216 773567 817135 1055254 845346 906138 886248 1143746
21430 1143746 914917 915565 927861 971279 1005673 918184 718125 729137 952062 623874 712333
21419 712333 893763 999389 797701 985433 846515 862690 1019073 933747 928363 997279
21409 997279 930407 968513 1097318 1077851 926552 750292 1085569 894248 893484 901184 734574
21398 734574 919804 1037572 808173 835319 697990 950617 820392 819564 915525 726321
21388 726321 1009007 659188 892331 1032211 837890 975354 1045411 767919 923903 1181603
21378 1181603 1000711 885076 1020500 993464 980628 1044066 1196583 1019629 1045860 1123624
21368 1123624 964941 1115610 959690 1029744 1128381 1081413 1245353 1228086 1183521 1284583
21358 1284583 1361201 1101874 1166890 1025729 1313993 1224749 1252296 1255220 1292970 965941 1406818
21347 1406818 1464111 1518176 1476362 1528633 1367269 1570727 1657584 1610535 1699174 1601811 1719385
21336 1719385 1787301 1927922 2084561 1920354 1905272 2175376 2304508 2368147 2462456 2548809
21326 2548809 2724681 2936373 2885588 3183464 3442226 3582250 4155571 4421909 4469582 4896444
21316 4896444 5702392 5993010 6450986 7097057 7991931 9039863 9457962 10399907 11299567
21307 11299567 12448672 13022876 13534311 14253901 14533056 14701533 14746016 14494658 13910848
21298 13910848 13265135 12621002 11518764 10634353 9928754 8452337 8015283 7207509 6556717
21289 6556717 5930503 5536657 4881064 4723946 4063429 3938802 3490882 3524919 2978101 3017419
21279 3017419 2882170 2442218 2492928 2314393 2297883 2181113 2182321 1998127 1770121 1820473
21269 1820473 1963443 1827144 1627198 1433276 1620760 1494716 1555259 1415966 1336717 1348038
21259 1348038 1310120 1148582 1182342 1335732 1197024 1245111 1342072 1081422 976879 1074677
21249 1074677 1131912 1014617 1180140 870528 932383 1158741 1017671 1030043 1090026 992481
21239 992481 956589 1034739 1039291 1104979 1002325 954451 911110 1148813 862822 1145195 1041006
21228 1041006 987112 1068723 824687 844846 894837 887118 876749 945488 757261 1106412 791445
21217 791445 910420 1018883 1022017 944470 862457 1025246 793057 1064621 863692 864789 1026988
21206 1026988 879921 910681 905434 1216165 989232 827976 1110833 1255955 837157 839692
21196 839692 849506 921931 1171388 1138042 1007270 1065070 930193 1203676 1235243 996324 1260703
21185 1260703 1273480 1155169 1171956 1143628 1281575 987035 1109312 983619 1004212 977476
21175 977476 888975 909676 942358 985456 1016000 1079498 985200 821526 513647 726706 975680
21164 975680 784821 815570 920333 948720 926942 999921 876759 894919 866976 1011827 1005896
21153 1005896 1007505 923996 948806 898455 855345 967555 1020912 926691 968209 1240343 1226167
21142 1226167 1244896 1054413 1312374 1299465 1284668 1448066 1295987 1095851 1213711 960966
21132 960966 1018054 1045989 1267554 1126134 892951 1165733 1062250 1298524 1238078 1039768
21122 1039768 1002357 1218841 1217555 1232833 1249025 1494098 1267451 1254018 1103034 1290263
21112 1290263 1218231 1227933 1183672 1442874 1114708 997175 1087485 1275048 1310752 1261279 1232138
21101 1232138 1117047 1252637 1259031 1083597 1158673 1380856 1025473 1130206 1139657 1114547
21091 1114547 1168926 1426118 1378643 1296033 1397926 1462163 1696732 1918715 2102864 2318456
21081 2318456 2787586 3199488 3527214 3757581 3913998 4027546 3973363 4209529 3602490 3528640
21071 3528640 3307169 2851616 2561452 2218845 2002495 2018733 1833528 1919019 1914304 2007757
21061 2007757 1935247 2288400 2283133 2483350 2960035 2733232 3082548 3228731 3327450 3662897
21051 3662897 3547583 3845523 3703641 3634804 3329239 2950335 2593686 2491389 2498917 2110693
21041 2110693 2267189 1883591 2029147 1829355 2095285 2122587 1965517 1916388 2001458 1930079
21031 1930079 1981509 1936363 2218201 2098708 1995360 2053715 1980894 2134423 2090451 2353382
21021 2353382 2699485 2755637 3300423 3342146 3813741 4147166 4432248 4679430 4910413 4905867
21011 4905867 4980271 5058461 4935669 4785731 4603423 4298931 4168539 4102105 4461457 4823223
21001 4823223 5513211 6100627 7241795 8216744 9435201 10748764 12410245 14443457 16540878
20992 16540878 18228042 19947807 20751876 21407109 21704589 21434153 20911090 19346059 17708051
20983 17708051 15240238 12812242 10781953 8907872 7391025 6252386 5314947 4426789
20975 4426789 4316028 3648660 3584337 3227145 3008648 3039489 2626462 2803403 2605580 2277525
20965 2277525 2372874 2268531 2298396 2127765 2249783 2244445 2277184 2172148 2061847 2044380
20955 2044380 2010130 2262551 2096696 2169355 2053955 2362208 2211436 2574630 2489871 2318933
20945 2318933 2653033 2573075 3185623 3178718 3212686 3423106 4187129 4665606 5384962 5902906
20935 5902906 6935128 8346945 9621374 10987501 13071136 14801021 16515600 18227083
20927 18227083 19456464 20212650 20410838 20282661 19972758 18600279 17598635 15163396 12939482
20918 12939482 10720206 8992851 7326618 5991891 5088424 4302627 3707767 3488463 3319063
20909 3319063 2678907 2579435 2305152 2211697 2253494 1905132 1941089 1925863 1829051 1549849
20899 1549849 1419398 1649210 1550544 1352284 1312649 1423172 1600008 1230105 1255331 1343026
20889 1343026 1208446 1441492 1281071 1177562 1434464 1398232 1384261 1439289 1171419 1263273
20879 1263273 1474523 1359230 1274917 1509840 1236477 1516849 1553052 1678275 1379944 1274778
20869 1274778 1502644 1590583 1310152 1437031 1618245 1760652 1640694 1496865 1692626 1758697
20859 1758697 1378510 1814214 1362532 1487841 1392218 1528832 1375273 1281752 1414236 1162548
20849 1162548 1326895 1446507 1528627 1418849 1451826 1382019 1336000 1489080 1225716 1365089
20839 1365089 1408717 1450917 1400249 1623866 1367246 1538503 1592865 1803930 1525316 1659572
20829 1659572 1824135 1686442 1531777 1663719 1623131 1672077 1647821 1563317 1303610 1267806
20819 1267806 1406027 1543219 1261481 1430035 1268339 1243523 1332170 1130831 966104 1089484
20809 1089484 1186662 1109695 1315999 1252176 1282119 1248423 1360813 1128769 1265035 1357722
20799 1357722 1374691 1411229 1262736 1274508 1566015 1264981 1379085 1331752 1526397 1320018
20789 1320018 1224409 1390122 1490076 1430634 1439104 1319761 1417794 1416026 995599 1218917 1164005
20778 1164005 1095809 1196485 1041997 1318632 1253988 1146186 1420636 1256767 1116588 1464299
20768 1464299 856238 1060943 1302238 1125759 1160983 829076 1212915 1220658 1243663 1318384
20758 1318384 1309638 1144181 1192251 1245164 1315535 1384869 1222992 1299608 1293071 1391265 1180194
20747 1180194 1196971 1152904 1211358 1166916 1207030 1333072 1363334 1240262 1225533 1136371 1259439
20736 1259439 1115195 1464367 1258250 1373902 1250739 1234838 1181754 1252415 1194638 1258962
20726 1258962 1315247 1398263 1032398 1040845 1363836 1213594 1147651 1308902 1227500 1175148 1275879
20715 1275879 1142780 1256175 1285360 1387114 1580356 1230261 1033877 1288361 1262165 1136724
20705 1136724 1240084 1221589 1109874 1012495 938117 1040517 1363407 1006436 1341270 1424106
20695 1424106 1126971 1089832 1002581 1207192 1027079 1173494 1236350 1169486 1166338 1069326 1279009
20684 1279009 1206493 1219910 1380312 1240007 1462574 1514730 1469271 1437506 1223213 1404691
20674 1404691 1578018 1467389 1275908 1496956 1195721 1233215 1168222 1407208 1134580 1087435
20664 1087435 1277376 1046955 1016434 1190768 1141212 1017919 1225235 1323405 996444 1180687
20654 1180687 1403538 1295897 1264813 1556123 1551277 1302800 1329300 1661578 1362860 1420057
20644 1420057 1142875 1193859 1239820 1432554 1216998 1182954 1200160 1250684 1055825 1362594
20634 1362594 1135507 1038142 1374691 1069213 1056108 1242789 1148842 1273704 1306032 1159516
20624 1159516 1174229 1263727 1285835 1206913 1331508 1157149 1298592 1319116 1217632 1318976
20614 1318976 1310847 1301398 1145478 1091246 1155113 1102254 1137328 1115355 1047012 914232 1254564
20603 1254564 1073857 1020515 1264445 1153054 1150681 1057343 997179 1218813 925015 845678
20593 845678 887009 1057485 1148822 1085017 1070112 1141231 1099660 940083 1131208 1228714 1084467
20582 1084467 909242 911930 1073038 1108633 1184943 1018586 1156350 1165105 1121797 1018212 1179249
20571 1179249 916132 1088518 1214399 1010977 1066111 1242944 1082646 1018292 1271161 1204674
20561 1204674 1085788 1149137 1097553 1320996 1311479 926551 1237914 1388966 1215756 1350231
20551 1350231 1204008 1062095 1125894 1286769 1311338 1199402 1113099 1275253 1350934 1410176
20541 1410176 1262170 1534819 1328294 1333728 1648816 1427641 1357674 1602649 1657544 1577027
20531 1577027 1586385 1349995 1246335 1321856 1416349 1538773 1477886 1633842 1536800 1522676 1085220
20520 1085220 1433075 1317142 1505901 1468167 1650833 1510701 1289786 1196709 1325553 1327231
20510 1327231 1492407 1548707 1519711 1545031 1504928 1461759 1463592 1721423 1435035 1265244 1566288
20499 1566288 1390942 1452143 1544918 1417075 1516361 1386191 1492247 1507741 1350668 1695105
20489 1695105 1300123 1398877 1510483 1469566 1668577 1401399 1709173 1706196 1481343 1313099
20479 1313099 1376769 1619063 1360723 1395252 1437339 1315552 1208471 1538352 1483107 1558229
20469 1558229 1456479 1371877 1259750 1484464 1224872 1286614 1375981 1336712 1341760 1203470
20459 1203470 1310898 1215423 1126469 850857 1200170 1321490 1312426 1404920 1240990 1354777
20449 1354777 1152987 1328468 1476398 1431243 1354122 1716202 1419558 1547195 1481279 1588617
20439 1588617 1524070 1661978 1445619 1644033 1540220 1626460 1465854 1625618 1629844 1297139
20429 1297139 1503191 1481098 1547160 1417635 1402039 1403287 1513999 1474144 1479941 1346810 1252397
20418 1252397 1115410 1396233 1276812 1244964 1538880 1291681 1391331 1486396 1649509 1449884
20408 1449884 1566506 1300966 1326555 1368771 1714243 1580216 1506057 1607920 1564292 1589006
20398 1589006 1379724 1745853 1457590 1637292 1617563 1396863 1632062 1556772 1654982 1574742
20388 1574742 1684436 1591713 1821133 2147009 1863205 1780962 1754665 1897779 2102104 2010491
20378 2010491 1915454 2069612 2136298 2116633 2005872 1976454 1764913 1923938 1757989 1893405
20368 1893405 1648009 1434628 1927458 1721720 1719672 1740437 1749342 1585152 1719200 1473726
20358 1473726 1735163 1721419 1595278 1628507 1851156 1556960 1843619 1676449 1829551 1486696
20348 1486696 1964761 1933208 1853915 1859040 2162823 2065356 2370478 2452254 2869222 2878222 3190024
20337 3190024 3576881 3827548 3903382 4393294 4351142 4614347 4826681 4846492 4989818 4979879
20327 4979879 4838931 4705370 4609897 4283287 4182963 3990485 3272783 3221753 3193929 2907560
20317 2907560 2655261 2486407 2496588 2456774 2340438 2509497 2320709 2417101 2147904 2338340
20307 2338340 2101333 2294118 2181182 2259158 2293910 2089769 2009273 2397421 2007222 1801305
20297 1801305 1580746 1865120 2065816 1841249 1804649 1749245 1702276 1946120 1608771 1800831
20287 1800831 1877855 1856836 1971495 1739762 2104549 1913686 2064182 1977298 2311907 2126733
20277 2126733 2185872 2152797 2297257 2361314 2366954 2500587 2472467 2349793 2594402 2577678 2858081
20266 2858081 3074897 2967583 3257657 3691357 4043393 4322338 4696479 4974237 5381281
20257 5381281 6067559 6762011 6871349 7536920 7808702 7986644 8142328 8135625 8371503 8501278
20247 8501278 8745510 8492980 8343501 7852107 7728845 7328820 6782978 6665842 6239950
20238 6239950 6202018 6048516 5800199 5356437 5093069 5113695 5407372 5351989 5659127 5849885
20228 5849885 6426831 6775856 7299889 8195850 9039038 10373040 11518956 13037506 14674000
20219 14674000 16236149 18123302 19944666 21392999 23105520 24622529 25787376 26678965
20211 26678965 27701225 27953739 27897406 27473387 26777432 25566914 24431826 23273595 21673023
20202 21673023 19386627 17632069 15834277 13762097 12099109 10355900 9123894 8101532
20194 8101532 7296326 6480055 6159909 5982825 5347694 5155080 4967422 4817681 4977649
20185 4977649 4796085 4886031 4745036 4674336 5017110 4685323 4765743 4631269 4569509 4263883
20175 4263883 4457595 4335737 4098889 4286447 4355145 4092890 4500972 4063382 4314424 4307235
20165 4307235 4552805 4590513 4887361 4863535 5086362 5291102 5116739 5328286 5350343 5066722
20155 5066722 5165237 4913259 4930074 4749806 4755577 4522904 4287770 4151482 3905758 3707001
20145 3707001 3643472 3709749 3567938 3456824 3517259 3484366 3659586 3849554 4159479 4557362
20135 4557362 4999598 5163418 6234100 6556445 7169452 8159719 9143789 10371846 11397522
20126 11397522 12310560 13425531 14418249 15319792 16084903 16527773 17099222 16664909 16743897
20117 16743897 16499121 15750113 15019716 14341594 13602067 12687369 11862846 10827695 9828480
20108 9828480 8770462 8218283 7580131 7041352 6679920 6361925 6479215 6446166 6773238
20099 6773238 6866182 7521214 7993479 9105712 9822254 10865442 11891163 12966724 14163805
20090 14163805 14755488 15975490 16582495 17069706 17322501 17370447 17143961 16720352 15846269
20081 15846269 15225685 14316727 13514780 12753147 11405299 10245899 9170886 7708647 6950610
20072 6950610 6013797 5264537 4929706 4352806 3852129 3529426 3243068 3009230 2917925 2841875
20062 2841875 2596837 2461446 2679967 2544114 2426915 2229796 2237385 2014257 2023764 2083466
20052 2083466 2033190 2198559 2011019 1828867 1712294 1945886 1721150 1963400 1789420 1651885
20042 1651885 1747598 1941187 1697284 1645493 1728353 1743700 1681044 1567728 1513424 1319886
20032 1319886 1418171 1473727 1684519 1467508 1414374 1583170 1666589 1572287 1557396 1505719 1508771
20021 1508771 1299845 1516383 1322768 1650168 1588119 1477004 1575973 1505924 1424481 1382163
20011 1382163 1388299 1553936 1586791 1564088 1276368 1465169 1510488 1392763 1427694 1325712
20001 1325712 1216960 1252138 1562511 1545005 1477657 1395424 1566888 1593421 1455194 1358246
19991 1358246 1652930 1716332 1607836 1630455 1464638 1748049 1648015 1500826 1624959 1540458
19981 1540458 1625607 1371819 1379593 1907805 1815126 1622978 1564516 1711413 1629827 1647563 1590687
19970 1590687 1642615 1630356 1941885 1900864 1820724 1778388 1830586 1748791 1860611 1952315 1854286
19959 1854286 1785162 1852605 1721222 2081173 2001385 1822452 2244338 1690423 1975147 2133272
19949 2133272 2153725 1923827 2065677 1842893 2108931 2031818 1996288 2057680 2040653 1979316
19939 1979316 2012458 1956802 2290605 2044142 2079123 2047266 2028582 2031025 1994501 1706537 1833139
19928 1833139 2016788 2024067 1998912 1969742 2088933 1794713 1952192 2104652 2146111 2124060
19918 2124060 2209099 2085101 2123841 2080519 2180641 2060166 2028502 2638539 2348855 2108400
19908 2108400 2377300 2584222 2255387 2424023 2429393 2722790 2401335 2694977 2538533 2701807
19898 2701807 2787138 2928418 2946259 3134978 3217545 3363390 3675738 3562142 3857059 4114065
19888 4114065 4172771 4486052 4374855 4983107 5034047 5612725 5874836 6607218 7234194 7695704
19878 7695704 8509228 9304626 9991328 10448868 11276445 12324345 12700897 13588161 14471820
19869 14471820 15167076 15722943 16984309 18005552 18785152 19852357 20598864 21251705 21829623
19860 21829623 21701835 20961246 20122027 19069880 17899585 16100449 14651865 13478372
19852 13478372 12136581 11244415 10531571 10107374 9781534 9868179 10007511 10235032 10270660
19843 10270660 10727782 11310789 11437017 12036739 12379127 12941040 13073850 13626549 14417104
19834 14417104 14963903 15720867 16370472 17213884 17341911 17882845 17665797 17620798 16754477
19825 16754477 16134597 14512166 13405409 12176185 10533404 9115233 8405267 7272858
19817 7272858 6451285 5754104 5309394 4982601 4644723 4364429 4131073 3894179 3862164 3870396
19807 3870396 3700727 3556286 3342821 3329678 3420037 3163866 2974993 2798329 2827684 2832813
19797 2832813 2611483 2550453 2846514 2556473 2351360 2419513 2418754 2468025 2355804 2176102
19787 2176102 2357578 2162637 2303917 2311896 2096660 2047558 2155031 2424254 2079080 2446583
19777 2446583 2021381 2123321 2159608 2099012 1973775 2309320 2374079 2247269 2112401 2146312
19767 2146312 2214647 2030065 2014233 2184745 2114363 2058848 2268138 2089847 2058664 1915679
19757 1915679 1842125 2075000 1842686 2203939 2027471 1993731 1892231 1979579 2163832 2054054
19747 2054054 1787339 1954994 1888017 1738196 1811977 2027206 1665337 1782614 1790416 1864307
19737 1864307 1946544 1760026 1989680 2026317 1965481 1987172 1810286 1704527 1835098 1996181
19727 1996181 1755048 1832747 1828699 1867564 1781994 1775079 1650547 1861433 1754254 1817480 1590279
19716 1590279 1900446 1853310 1722520 1836366 1638606 1714347 1813071 1814106 2010726 1745670
19706 1745670 1742976 1863633 1711319 1847396 1830637 1769289 1852118 1819354 1905540 1706438 1682602
19695 1682602 1886318 1777225 1868280 1587531 1929502 1492641 1709854 1539507 1782745 1576597
19685 1576597 1926966 1699140 1583096 1693905 1571769 1789553 1656583 1713696 1638951 1754523
19675 1754523 1506884 1720030 1734168 1636839 1780365 1718120 1698281 1653281 1621275 1626455 1605396
19664 1605396 1753458 1535064 1753872 1652489 1525085 1659432 1685468 1648974 1597724 1477454
19654 1477454 1652263 1710304 1606515 1474898 1580709 1584194 1624706 1553532 1541611 1497154 1659699
19643 1659699 1721010 1639712 1709249 1818599 1500831 1606950 1767787 1673068 1610650 1632859
19633 1632859 1472097 1702348 1634966 1701023 1551437 1693164 1621027 1338710 1536498 1351761
19623 1351761 1555144 1211311 1316359 1375041 1426539 1429667 1335627 1503010 1191897 1160809
19613 1160809 1219209 1307832 1233446 1287576 1448248 1223328 1570905 1342930 1506138 1287864
19603 1287864 1534010 1122574 1304966 1176804 1426627 1397767 1510330 1391021 1279489 1403347
19593 1403347 1197028 1191960 1145270 1300554 1115292 1087472 1305797 1346145 1206933 906934
19583 906934 1137418 1410885 1306708 1365603 1149867 1002207 1407829 1277557 1318934 1173390
19573 1173390 1111801 1235992 1261279 1162947 1282896 1302236 1169802 1378145 1074202 1184163
19563 1184163 1337668 1038317 1310273 1094579 1110357 1168288 1126744 1123906 1154423 1110126 1371290
19552 1371290 947684 1241929 1099576 1069331 1221045 1348860 1230820 1210818 1372295 1135510
19542 1135510 1141746 1034680 1459027 1022289 971395 1261563 1347432 1134386 1021898 1043945
19532 1043945 1161882 1004351 1143731 1302466 1048424 1411200 1173098 957032 1039798 1213535
19522 1213535 1060425 1260289 1215527 1216065 1021122 1240425 1094772 1305424 1273295 1207865
19512 1207865 968566 1130751 1417468 1151222 1165093 1252004 1145188 1029955 1069666 1124730
19502 1124730 958057 1227795 1063641 1048180 1202604 1001287 1140999 1103529 1028800 1083324
19492 1083324 1108395 1307485 1088908 1086607 1160709 1302117 1047329 984201 1032813 1042479 786651
19481 786651 956057 1120036 914627 1191522 989872 908938 861900 1123300 1040344 952430
19471 952430 831998 1035593 1026323 711416 837160 826902 892572 865880 915980 787899 700659
19460 700659 543396 694898 816570 776975 747837 507466 495707 801950 687753 795895
19450 795895 926401 824664 675887 867730 986692 916453 930930 587587 945901 884776
19440 884776 797340 938233 831876 844149 907130 774014 713412 833166 870807 952305 903741
19429 903741 763140 991136 751126 772557 628624 554969 606998 878358 834970 739272
19419 739272 672047 776341 827515 825609 757362 760132 820491 541002 779524 938456 851882
19408 851882 567219 662872 635288 906853 750942 728688 772235 558189 663561 727636
19398 727636 800247 749631 778800 943255 928361 721036 970761 875444 618925 795911
19388 795911 557885 806579 747701 816388 670653 858304 816271 863675 986864 758856
19378 758856 705090 749315 705474 948583 824157 809387 763630 771405 1015389 738221 813647
19367 813647 758766 862926 953948 895438 777987 581900 627462 973090 590565 953329
19357 953329 622160 683489 889170 1073094 1051329 861593 996003 630779 775180 979551
19347 979551 1025833 1136649 926944 1013716 1212144 909695 1132211 968481 1066270 918667
19337 918667 1128313 893803 1038286 1035014 899973 898588 880394 1235455 708112 1159841
19327 1159841 980242 955475 807835 930191 754059 1014661 1194098 820493 797131 733315
19317 733315 901949 701335 777284 698586 427517 704861 574878 742028 597094 727635
19307 727635 706073 668847 579070 659180 734567 679205 717436 550056 581105 739914 576956
19296 576956 531029 621477 467315 428478 602021 615664 809710 673385 763540 640298
19286 640298 877658 622509 822924 571859 680015 693380 543289 739610 687509 786289
19276 786289 428729 497622 846656 640935 693337 714121 689186 817045 810513 605216 655004
19265 655004 847151 947588 757083 802837 682113 963993 925014 771448 684172 820587
19255 820587 721677 885938 590304 867848 897534 756758 665801 703246 650338 584329 856672
19244 856672 1122923 1241119 960309 1118674 1109654 1175064 988245 1171506 1189921 1095396
19234 1095396 918017 870351 674277 715829 573096 683542 899997 799126 729522 716162
19224 716162 533993 510689 664324 657740 586581 677999 711976 609804 481295 524811 727962
19213 727962 609004 754871 764889 753254 516720 504670 687787 503698 585621 587336 766512
19202 766512 600077 541565 595251 745764 908359 758996 783589 630833 902454 734504
19192 734504 663813 865116 851350 700138 887412 876180 1003352 984244 958597 1133066
19182 1133066 1010763 1167849 874182 951809 877094 728012 882206 915350 971575 856993
19172 856993 823677 891697 977829 916617 1026070 948178 1109872 1141741 833776 1014720 837181
19161 837181 1104872 946556 1157703 941663 633520 983524 772002 1005965 794453 903947
19151 903947 999829 1134114 755047 1011975 866725 894720 887530 999226 1022790 829840
19141 829840 1022211 979417 960717 964412 894526 1159356 1063058 1049292 1241405 886088 911666
19130 911666 956452 1214616 1194566 1259297 1518870 1350542 1678668 1377160 1618337 1617185
19120 1617185 1874284 1714879 2296527 2606949 2893971 3124482 3354424 3712926 3823923
19111 3823923 3906083 3859446 3947361 3839785 3545536 3058064 2663581 2413120 1894646 1703018
19101 1703018 1816410 1748451 1562653 1478901 1338094 1381769 1525962 1565373 1276889 1523675
19091 1523675 1665289 1601649 2109629 2305095 2720392 2995551 3502601 3584412 3597025 3924608
19081 3924608 4435456 4390180 4505137 4489403 4320831 4137957 4007303 3838859 3446295 3464992
19071 3464992 3057589 2882837 2462135 2435395 2084516 2001470 1870525 1893333 1607831 1517516
19061 1517516 1765120 1762547 1735971 1755296 1663827 1846717 2116027 2505480 2798574 3093693
19051 3093693 3446940 3701087 3778963 3836268 4016049 3865182 4071935 4018706 3523984 2674852
19041 2674852 2465504 2132429 1931113 1743828 2064825 1738384 1684965 1933477 1906172 1924610
19031 1924610 2224515 1810745 2203983 2161637 2411513 2606147 2697026 3472784 3619378 3959781
19021 3959781 4305347 4303816 4946535 5491234 5826764 6208531 6519718 6492985 6745297 6908282
19011 6908282 7352641 8130266 9373416 10062449 11529311 13125696 14589544 16040140 17416757
19002 17416757 18179838 19094862 19501408 19383775 18777001 17267544 15692024 13605768 11569540
18993 11569540 9577019 8081216 6561748 5651728 4685826 4199813 3800883 3378352 3056913
18984 3056913 2892356 2771678 2245868 2391837 2164710 1956182 2183841 1739008 1866703
18975 1866703 1898359 1755228 1509119 1874108 1561059 1705613 1748194 1682304 1818124 1563318
18965 1563318 1869105 1740883 1648065 1910366 1848951 1858743 2035086 1722978 2296573 2137740
18955 2137740 2394528 2731542 2503445 2939804 3192617 3381148 3783353 4563022 5067777
18946 5067777 6049158 6870520 8301176 9803008 11645105 13214038 14736201 15922835
18938 15922835 16916697 17586905 17727086 17511411 16484007 15268937 13492424 11466967 9714204
18929 9714204 7902173 6468093 5356695 4448231 3789573 3296259 2966804 2616736 2265083
18920 2265083 2095184 1891091 1540274 1581355 1464260 1277063 1182347 1272300 1004782 1232497
18910 1232497 1049657 1217715 1188920 937196 981945 1155344 1029552 753088 847122 756120
18900 756120 966182 755948 801067 614241 889667 545982 788113 574280 681847 808798
18890 808798 720258 753267 573403 703848 609908 588475 416380 669746 659009 948233
18880 948233 582216 793714 554569 762498 764481 616133 553893 793069 621145 772225
18870 772225 734743 584650 675667 586546 510902 505811 556131 681476 472305 664170 741909
18859 741909 459783 535865 570866 621616 664837 592138 707526 528700 514655 743966 388058
18848 388058 445687 620925 753993 831802 625186 598645 744892 679349 682603 728983 604719
18837 604719 548650 624110 763989 542258 557856 618576 594143 689162 727678 704466 700995
18826 700995 389233 635592 307158 758557 605521 616311 879058 566311 567029 885383
18816 885383 656421 713598 504467 605957 620326 650911 675131 436303 630687 644980
18806 644980 662514 695691 500274 680270 480999 470857 769793 765981 820507 707450 633563
18795 633563 819133 912958 724900 793859 567193 841682 973013 976861 905409 705437
18785 705437 990399 1014787 713856 939305 920552 745277 609162 875005 669016 766045
18775 766045 889449 882078 837130 634254 606359 690609 819958 580078 598866 607491 638544
18764 638544 688116 764784 586680 541212 810495 604517 624437 655918 407234 673459
18754 673459 532638 535606 661626 739715 605296 699654 563256 604433 482928 459573 558555
18743 558555 621680 555944 642831 587466 691469 679879 799867 706837 725588 608521 528024
18732 528024 533513 616457 612031 469590 745557 579780 749185 634210 699972 552534 564671
18721 564671 625811 733272 437726 685558 690205 737384 664746 652487 764596 601009 579595
18710 579595 841912 617894 643270 596065 703656 747056 360680 641336 670607 647116
18700 647116 1086079 662836 592602 577342 649151 572301 428972 507095 629480 717530 717542
18689 717542 835731 781267 469766 655693 743419 950952 872089 715905 679325 749905
18679 749905 810772 496233 748179 907601 726000 874161 719147 651101 741513 633266
18669 633266 562538 788841 619645 623617 623295 666547 756903 632668 721459 624231 512341
18658 512341 585076 651120 407429 824426 658275 525531 438881 856809 562421 410902
18648 410902 413733 548230 588668 610619 766644 615184 566386 532442 805501 609408 671511
18637 671511 352102 531775 391927 788364 491027 372244 705046 408053 401647 704337
18627 704337 506430 403729 485985 506054 482624 593799 593819 323828 609893 680537 546714
18616 546714 473624 616023 541754 405742 510295 569351 608233 701334 704602 610209 501897
18605 501897 852690 865087 736250 535384 817867 673588 750276 752051 749148 778407 630558
18594 630558 739928 585373 793497 607128 824209 645995 591288 759662 690920 535474
18584 535474 432440 701232 821285 639145 722137 607900 845217 710264 566838 703125
18574 703125 595280 644389 615400 515356 641100 409798 844075 510966 522467 450698
18564 450698 571778 688735 674598 602343 360350 699018 423637 555478 276022 772990
18554 772990 560862 303651 451070 613487 443385 568163 739624 624116 517587 526035
18544 526035 466767 551924 538734 468955 592602 587599 183727 403437 485745 630805 557888
18533 557888 495389 472894 582150 601900 376601 252264 577677 481023 525460 492826 395644
18522 395644 421892 619762 581713 370397 467736 627898 455012 605477 518824 463721
18512 463721 517268 548604 577623 595052 658639 668321 606354 592680 802505 449850 383088
18501 383088 521275 674747 469118 700023 471735 712773 526021 776759 620550 680517
18491 680517 817131 579686 649170 529259 373858 600687 677516 533666 693785 537949
18481 537949 517753 561858 645457 274738 643846 475284 561005 647092 635888 711647 695509
18470 695509 691448 493874 898414 767463 791738 791360 719047 902309 676334 952972 936262
18459 936262 585568 675984 886271 888527 745366 800532 572791 517322 521840 525732 605741
18448 605741 473404 545886 602289 391146 687920 659300 600760 780581 639739 869014
18438 869014 838408 470701 607831 472520 806466 777409 555259 751644 741785 745827 730524
18427 730524 546376 797984 598661 610812 503553 323485 418161 685690 590273 545005
18417 545005 666975 385700 382380 392819 586930 343886 446871 823790 396610 484104
18407 484104 568365 619010 514621 449271 658515 262213 439729 630942 285746 423268
18397 423268 251550 578836 373639 586166 399079 596261 599061 603534 464542 568597
18387 568597 523305 496905 749750 403681 478594 304424 512270 684663 657218 508517
18377 508517 494557 634448 542019 544107 579614 544645 554415 534413 534634 718713 613094 645129
18365 645129 775083 597079 636799 668345 696707 493410 511732 779199 588649 630740
18355 630740 843625 682160 710139 772644 774040 828161 579762 665873 887121 602217 570198
18344 570198 538023 796693 584359 459558 554311 441135 562231 316559 659753 683160
18334 683160 594311 702489 467237 515823 455674 554854 664918 472657 603663 623568
18324 623568 558536 658814 800699 376495 664751 475653 649649 639325 424688 591922
18314 591922 633801 422007 669169 554673 703576 744359 633951 381261 289526 607884
18304 607884 456142 426262 560267 412305 480368 425198 309376 546792 482081 404051
18294 404051 580163 432156 473838 543806 497296 371164 464193 459850 349445 545764 321366
18283 321366 343573 598007 517833 421927 770356 509424 484807 505274 304360 538012
18273 538012 451922 470704 514422 586318 471787 702833 765854 665048 405540 690281
18263 690281 750683 641112 354692 354465 622997 692210 596341 385386 477852 479946 696328
18252 696328 513467 614597 462263 408316 781957 671034 561440 586292 613578 228001
18241 441267 454871 525783 483049 620051 402356 537656 402392 412352 581467 589541 433920
18230 433920 488516 468443 543406 557678 719109 310945 651380 548690 441210 616833
18220 616833 551121 618172 570038 663603 680818 331688 630727 310979 504774 480543 486993
18209 486993 547197 532869 713276 489120 479556 444885 598892 554840 701377 610984 393560
18198 393560 626623 710477 604406 472369 686530 492105 595144 746088 430272 314515
18188 314515 816608 586975 697132 685292 602048 441369 650269 637058 632589 619367 679689
18177 679689 527532 557292 792656 524917 600636 578231 574774 776083 603941 571277 573843
18166 573843 465056 728107 815601 542579 432017 609087 564137 717705 818460 250953
18155 526478 848944 645466 622111 806814 645324 666610 590075 589898 536988 694863 639252
18144 639252 543678 798088 881713 476079 435522 655070 686226 688796 641881 310172 589184
18133 589184 688886 581423 747234 559847 704567 601161 441709 760948 492961 411650
18123 411650 582812 475315 672968 517862 546148 410969 525327 689645 652403 395857
18113 395857 469836 369684 558072 578301 700607 487028 700274 631986 444398 513750
18103 513750 601738 569267 338348 575195 558334 806196 504885 697996 434021 270734
18093 270734 652715 497676 585962 510426 351832 407662 378449 663032 486547 699324
18083 699324 578983 571136 731456 623246 468850 481554 349643 342490 297286 337130 490142
18072 490142 508881 618425 614448 418766 595822 529564 697881 617464 298863 363499 401653
18061 401653 509314 372606 457327 573143 545488 497145 357155 355663 362535 507464 585593
18050 585593 363299 270915 749671 370390 570815 612121 253450 449406 566761 656949
18040 656949 363808 390884 232073 275561 809956 406282 216746 579488 479463 505552
18030 505552 495158 535114 441937 566303 178028 575988 460572 452929 579508 516267 544422
18019 544422 493382 376490 390388 410062 665483 256935 398141 499236 313781 494400
18009 494400 428488 465940 352661 587673 683947 543939 442252 273359 315081 717580
17999 717580 389600 569486 598514 417344 700594 452597 532159 270026 713860 653831
17989 653831 475577 383145 357112 374473 484591 454283 450108 282640 652745 622299 505726
17978 505726 444230 618101 411323 440914 562780 488823 516092 594964 402906 472954 379343
17967 379343 478495 518303 481090 475492 466139 367776 466153 290954 428823 541044 423634
17956 423634 376545 532475 580597 393004 516922 403951 512758 386128 419816 455990
17946 455990 555771 695296 406694 464432 437197 348534 612056 671632 464075 354259
17936 354259 408904 334700 755572 522705 596233 495599 369617 532182 415814 471800
17926 471800 411606 587392 653312 503145 575407 568364 577978 858106 621414 723309 564717
17915 564717 451247 449636 541019 553899 632471 632239 596417 612579 442402 643455 429406
17904 429406 593802 370390 440146 628620 545770 372764 478318 389622 622629 722398
17894 722398 463654 496623 547673 738469 554655 615267 545585 447084 681003 615299 638356
17883 638356 578469 465619 500172 508226 874870 247754 720528 470705 723455 621383
17873 621383 572449 551527 771291 553618 713201 617555 788593 502435 510987 583868 324000
17862 324000 557453 680170 612677 618621 532482 652863 652682 380580 396852 637730 317616
17850 631145 767797 341319 366750 368062 666164 597096 892756 588766 561936 354719
17840 354719 607078 648523 464828 615376 485909 700176 808194 658445 622777 639126
17830 639126 620488 581950 561176 717146 593864 651141 792253 837370 498302 605707
17820 605707 789994 527636 818954 988839 915692 1036529 1055698 1053554 890379 1212896
17810 1212896 1142511 874688 975773 1064355 1006099 797836 926981 858666 892625 785075
17800 785075 892197 929026 782224 987197 799730 1007056 795563 1022962 923427 826955
17790 826955 843303 723711 644410 753938 564335 537480 579395 640154 886322 569625
17780 569625 639629 464005 679325 564637 642956 839981 636289 637706 753358 594295
17770 594295 599606 483926 566263 584446 759582 410687 492325 472086 806642 781506 399302
17759 399302 710020 607207 584633 805885 463458 766400 478207 408342 578196 652422
17749 652422 565945 817348 743418 747099 704848 475075 643524 446573 852772 496262
17739 496262 681394 496674 465529 590628 500858 450938 684353 704715 756119 821688 413989
17728 413989 502884 648166 792667 688726 648380 775206 587354 806961 532041 610654
17718 610654 724972 795699 895991 773167 826589 521440 743301 445760 383088 721945
17708 721945 640369 652964 628605 493076 567929 567262 607182 579146 1049793 498640 712869
17697 712869 787070 496238 688646 707053 751277 606141 622810 636618 816777 520949
17687 520949 572315 647148 678166 708578 842932 730088 536756 611789 572792 677940 612310
17676 612310 659197 622852 729310 792739 534072 714173 691297 515871 656657 646079
17666 646079 762695 681613 830144 700627 701429 822550 784479 806924 789674 837099 933104
17655 933104 669508 739559 763630 905260 577524 670888 769166 846831 1058929 779557
17645 779557 849047 796643 791886 795265 675054 807693 812519 840101 953804 1028544 1026268 855313
17633 855313 859529 767762 1010470 875660 919656 1008905 874872 1080727 834681 899021 969327
17622 969327 1139634 839006 1007840 997437 1249331 1153494 1044237 1115876 1200775 1136401
17612 1136401 1247446 1094526 930157 1142561 1177961 1372367 1182317 1101628 1060907 1149965
17602 1149965 1014908 1005417 1113754 1246063 1128129 1075808 1124680 1056037 1223915 1079049
17592 1079049 1167409 1204302 1309736 1058160 1238262 1204989 1090945 1482312 1292807 1214192
17582 1214192 1318652 1329931 1224307 1275085 1257050 1390507 1254528 1651997 1645380 1422964
17572 1422964 1443744 1433972 1376515 1243480 1404795 1135687 1241376 1178422 1346135 1270216
17562 1270216 1294967 1093672 1190609 1280715 1364126 1110921 1163304 1287789 1126181 1231796
17552 1231796 1576549 1320702 1346967 1288714 1310225 1613927 1607376 1545052 1671186 1454787
17542 1454787 1675187 1296749 1328124 1364485 1413677 1407539 1427367 1425520 1456344 1345051 1359175
17531 1359175 1361387 1295064 1553427 1687787 1781659 1505812 1646366 1550307 1535917 1603418 1609761
17520 1609761 1438401 1590183 1461867 1472352 1597005 1689068 1975174 2178368 2271016 2299240
17510 2299240 2271405 2567110 2523912 2356542 2660076 2795561 2790313 2861131 2766122 2809212 2892080
17499 2892080 3071293 3322736 3772574 3860865 4339292 4792287 5182156 5950382 6734016 7775996
17489 7775996 9683998 12655212 18014522 25978949 36364302 48416097 60263448 69747821
17481 69747821 77125438 82499292 86142192 88262308 87688991 83029545 74232535 62336395
17473 62336395 50308508 42122197 39999936 43384726 51786411 61896861 71227209 78327617
17465 78327617 83189112 86371121 87991386 87425770 83422008 74551010 61867835 46400339
17457 46400339 32343230 21430179 13855671 9531443 7209173 5602342 4950582 4493040
17449 4493040 3980115 3496048 3587124 3501890 3549394 3319447 3519501 3283551 3342816 3355823
17439 3355823 3262587 2904419 2899645 2747935 2896686 2581310 2587023 2564944 2607151 2889718 2927464
17428 2927464 2949359 2906403 2967169 2780968 2848791 2697470 2571573 2205627 2254387 2384530
17418 2384530 2292161 2186106 1937593 2078516 2126663 2082566 2303786 2346197 2043612 2178730
17408 2178730 2398359 2524743 2530782 2631863 2824899 2573505 2952798 3072104 3087797 3353837
17398 3353837 3274375 3788106 3982443 3984070 4637013 4770294 5305572 5704613 6204252 6371177
17388 6371177 6705768 7173715 7145768 7320923 7612502 7172106 6785826 6773093 6705813 6189584
17378 6189584 6353468 6257738 6336058 6217852 6557323 6827231 7094297 7329010 7846450 8001448
17368 8001448 8273334 8639773 8616781 8581502 8889249 9065571 8901384 8461191 8436596 8704108
17358 8704108 8506965 8798882 8806395 9033456 9459710 9911992 10511588 10851690 11370795 12187406
17348 12187406 12549171 13211695 13542640 14017266 14235694 14440914 14364116 14340472 14153300 14025161
17338 14025161 13905783 13337485 13219496 13089750 12874518 13104258 13193367 13492691 13758986
17329 13758986 14047508 14701954 15178058 15622310 15662049 16064943 16413828 16394962 16609656 16652742
17319 16652742 16784278 16616887 16379235 16327284 16248432 16304584 16160837 16127793 16075398 16050781
17309 16050781 16177462 16157439 16155477 16667467 16749254 16976382 17085157 16987752 16970115 17023826
17299 17023826 16959205 16499021 16429296 16306504 15877108 15780424 15930798 15736706 15897116 16015485
17289 16015485 16209537 16178164 16126433 16015226 15831668 15504769 14752440 14329401 13580281 13085514
17279 13085514 12126591 11146420 10293856 9419700 9018365 8238129 7599061 7447081 6857295
17270 6857295 6836119 6514283 6400612 6218711 6086098 6232984 6074052 5981928 5969881 5874770
17260 5874770 5719914 5750221 5685928 5315339 5132077 5249514 4957078 4718917 4924470 4636124
17250 4636124 4591967 4548182 4819743 4437407 4473304 4522836 4175926 4357220 4349327 4311961 4303722
17239 4303722 4138787 3978073 3803316 3803969 3516785 3383025 3341913 3388920 3222353 3080827
17229 3080827 3111243 3310658 3544556 3216722 3218659 3445341 3116735 3454587 3474345 3526140
17219 3526140 3444848 3209979 3349397 3338615 3612118 3339219 3457676 3246675 3446279 3181062
17209 3181062 2920274 2893811 2972264 3067703 2843287 2849365 2782087 2615697 2908510 2600227
17199 2600227 2612805 2509575 2323625 2472043 2366920 2282869 2223864 2317501 2284825 2128919
17189 2128919 2040316 2121417 2321447 1964587 2063261 2140143 2075747 2295413 2213112 2105700
17179 2105700 2267612 2311566 2389391 2289661 2543111 2484176 2416917 2506565 2447959 2523219 2411863
17168 2411863 2659747 2539903 2415627 2682573 2678863 2642071 2768498 2493647 2823742 2582826
17158 2582826 2881454 2758538 2733973 3156847 3047576 2997200 3101257 3205045 3044362 3007448
17148 3007448 2946081 2630247 2756732 2999863 2686717 2908291 3003515 2903510 2868805 3039725
17138 3039725 3012349 3086816 3069887 2723392 3001849 2659022 2828922 2691345 2420346 2425122
17128 2425122 2592181 2438852 2524637 2551564 2736116 2566247 2781757 2629330 2491332 2694583
17118 2694583 2672529 2507198 2456092 2540737 2655069 2537161 2537403 2898485 2810474 2640777 2790947
17107 2790947 2878841 2980192 2816873 2715394 2777962 2545126 2568519 2508301 2256226 2283198
17097 2283198 2019269 2168880 2043291 1698992 1573670 1811958 1423430 1436733 1187568 1412508
17087 1412508 1125954 1195517 1255500 1386621 1052569 1221882 1185112 1027447 1130351 1264295
17077 1264295 1375294 1281146 1234519 1362969 1147668 1138301 1250032 1079748 1308738 1085421
17067 1085421 1063074 1226204 983520 1198402 1330922 1367029 1576250 1427739 1579449 1698226
17057 1698226 1853212 1753744 2261787 2620539 2447844 2481611 2894937 2901042 2948678 3038665
17047 3038665 3057637 2972856 2965624 3098434 3055316 3056021 3191286 3328242 3249638 3074081 3138650
17036 3138650 3168569 2883969 2973103 2785570 2552081 2458900 2128629 2122250 1986075 1757609
17026 1757609 1846780 1628656 1522772 1723775 1372075 1302866 1410393 1335229 1256203 1049760
17016 1049760 1025168 1050473 1087292 887803 1213671 1234945 1064644 928734 961920 1138799
17006 1138799 1001697 1090968 880184 1174946 897947 908318 1197373 1087036 955295 898619
16996 898619 1329322 1066444 1251147 1215715 1282186 973930 1078421 1135497 1070424 1150118
16986 1150118 1202113 1342665 1145952 1394984 1173970 1303096 1176448 1357020 1463813 1541912
16976 1541912 1394215 1414465 1389584 1506438 1599107 1460453 1719154 1581339 1835231 1681947
16966 1681947 1632679 1810693 1849721 2064721 2206697 2202640 2396090 2285624 2456992 2419434
16956 2419434 2487346 2304676 2390410 2334488 2442445 2235869 1918491 2279923 1953778 1899698
16946 1899698 2080615 1932556 1803941 1746594 1720514 1437947 1402349 1341579 1426783 1310760
16936 1310760 1342173 1321129 1185952 1088791 885928 1223145 1000119 1227656 1132613 1106744
16926 1106744 1047878 1036836 1030733 1059466 880174 1242945 740842 1036116 1014850 931876 749093
16915 749093 1132454 774381 998531 951929 804574 877047 973476 646877 775414 841043
16905 841043 889404 854817 671079 614930 703877 826814 1031409 660090 813660 752139
16895 752139 621812 797285 921025 820020 781134 1030873 535301 785244 880632 706393
16885 706393 731184 1003896 495719 744265 808706 750346 878197 920761 689028 711119
16875 711119 650832 832579 838638 670382 805651 689182 749583 607610 796725 892858
16865 892858 701078 941178 802696 917912 623193 761908 803899 753651 980444 660735
16855 660735 803545 891036 779259 710636 827882 840370 802092 961584 914758 645274
16845 645274 582031 570249 726825 844059 980319 900576 581288 635201 956438 720756
16835 720756 824557 1031662 891720 785980 1033157 1062681 1005958 1013300 942824 1059714
16825 1059714 1031907 1310815 1028652 1188086 1181398 1300052 1407231 1497193 1697067 1665366
16815 1665366 1667126 1723518 1811658 1603591 1621082 1809163 1783190 1519859 1710233 1568483
16805 1568483 1601198 1674322 1620768 1481424 1715098 1627272 1355313 1606197 1483627 1539448
16795 1539448 1349068 1264021 1257122 1278970 1281549 920988 977313 792294 996769 783499 634441
16784 634441 657033 716860 659320 1080956 706843 813551 608237 689689 720650 503022
16774 503022 724030 785201 782234 587321 663125 715260 715035 866335 515440 615327 828592
16763 828592 684165 847465 640212 730059 792809 516311 710377 384083 676521 445292
16753 445292 561830 610695 809050 582755 781486 681604 758966 639876 684415 956208
16743 956208 267274 759498 806424 745491 736375 702969 824581 920573 663448 787677 538244
16732 538244 826917 959570 833486 844551 828199 686774 1004891 612942 1035027 827343
16722 827343 940264 860827 1015033 756576 771874 737802 717120 793768 866317 871318 1045235
16711 1045235 1150812 1125195 1274011 1105085 1215595 1094918 1305902 1447608 1516240 1761201
16701 1761201 1370728 1557865 1573813 1553517 1270397 1313206 1500800 1495120 1344325 1411194
16691 1411194 1314239 1550248 1394698 1397352 1424436 1225977 1266707 1235143 1035143 1225535
16681 1225535 1297262 1127074 970226 853608 991663 1124961 974670 1103960 1054778 1168541
16671 1168541 1389531 1416415 1157905 1575521 1514443 1349597 1409995 1215594 1549790 1368880
16661 1368880 1454159 1491045 1460203 1265024 1433837 1498628 1380426 1415946 1367773 1368459 1400487
16650 1400487 1633593 1403202 1129253 1185748 1071100 1031076 720432 885334 749087 969630
16640 969630 709885 728227 693659 795318 635506 674181 800535 753825 688214 546480
16630 546480 779382 755703 799586 761093 880685 582034 913639 621049 688544 884798
16620 884798 861313 656693 647419 790822 662518 663313 774724 773098 794005 634069 614718
16609 614718 925624 1066186 741735 898522 783548 983759 772943 1123467 942258 1036630
16599 1036630 1109678 868263 891863 1055689 957602 1112304 992836 826469 825606 1030037
16589 1030037 999284 1263749 841862 801625 1129790 1042763 1061696 1004252 827651 1052096
16579 1052096 1017799 802891 835899 696324 962035 880309 736157 890312 624304 678886
16569 678886 965633 778868 918700 1044836 671133 770433 954511 934575 1101770 994258
16559 994258 1074456 1231983 904323 1108111 1014865 749350 1028133 966744 832264 1004734
16549 1004734 1048669 990618 902440 890550 1053177 979930 942851 874972 984841 834046 901417
16538 901417 798584 921540 787835 862753 666530 798575 916922 647976 875758 1097700
16528 1097700 1026081 854392 689029 671164 696054 608372 692056 611641 612241 829573 823841
16517 823841 545465 579484 503843 513765 626375 689575 696902 797063 769743 873362 758224
16506 758224 580850 622530 672754 739249 661093 948172 959546 692660 875049 953815 714160
16495 714160 1055625 856348 947773 1088487 1203921 1270814 1324005 1250107 1311512 1592930
16485 1592930 1471691 1649067 1596577 1395864 1352168 1131774 1343354 867199 982200 1115340
16475 1115340 946530 963314 1183586 1026998 1295199 1166749 1072174 1160385 568983 1053865
16465 1053865 1024760 623120 953469 786958 726034 761359 815114 833733 675441 863813
16455 863813 1270984 1118569 1114203 1235201 1125955 1136042 1232319 1371111 1165408 966382
16445 966382 996165 962412 870043 609762 648959 506498 792459 782466 1168230 831213 1078220
16434 1078220 1549729 1489267 1489243 1636877 1951450 1803477 1569395 1899873 1553639 1665277
16424 1665277 1821995 1626569 2012881 2271237 2645525 3040252 3516220 4202521 5035735
16415 5035735 5891997 6499495 7529424 8618195 9889673 11090977 12738322 14435628
16407 14435628 15954101 17568702 19050337 20975254 22694462 24481151 26546415 28579694
16399 28579694 30462300 33075824 36373260 40991733 46127465 52387363 61677907 73333958
16391 73333958 84496089 92915465 94842194 89526477 79402803 68231941 57747429
16384 57747429 49588246 45777102 45826123 48490377 53550397 57344398 55463534 48348551
16376 48348551 40558763 34670123 30485436 27599813 25433021 23667145 22277037 20652381
16368 20652381 19340736 18174853 16709938 15463441 14388476 13200768 11999230 11080758
16360 11080758 10288688 9316766 8653148 8232553 7731353 7013581 6546688 6252953 5956966
16351 5956966 5449706 5295851 4852737 4473369 3959772 3832156 3334889 3180832 2411745
16342 2411745 2369852 1916125 1467325 1106616 1245913 1138501 1126536 1326828 960886 931539
16332 931539 930771 920573 722520 635485 723546 711439 814501 1001815 737880 462777 466237
16321 466237 404788 391876 388109 515175 310949 293266 504165 628494 695351 348537 728090
16310 728090 696242 739204 669536 813496 713643 832861 689265 562201 518497 858528
16300 858528 672086 557223 782539 949107 1022919 1081179 1122799 1005103 1108446 1124456
16290 1124456 957444 914372 962777 926296 968801 1104936 944510 1353436 1119411 1033045
16280 1033045 991707 1159973 1215825 1167514 1167746 860719 856623 910366 674573 919174 925553
16269 925553 883968 845735 730912 840859 1044602 948811 816485 800989 739570 763014 682980
16258 682980 673294 752587 802750 629502 785231 979608 898681 931336 1033224 922911 1116274
16247 1116274 1012152 833147 944022 1179240 924572 960297 763767 886721 941105 887964
16237 887964 1047957 1393186 1240491 1201991 1158167 977606 892026 847891 966869 697418
16227 697418 986805 627122 609246 882260 587320 597868 721671 580862 905019 818052
16217 818052 694028 956459 855287 954011 902613 893651 834346 988119 880975 1030559
16207 1030559 961831 911091 849132 932015 795881 1169936 802787 984630 704276 1005030
16197 1005030 887158 850697 956446 884053 929460 990693 848834 942287 858239 1238212
16187 1238212 964051 1174764 864049 957025 1044658 735282 937017 1059806 1095241 922818
16177 922818 1006069 779882 702522 856838 677546 477199 861571 498675 861086 445666
16167 445666 627228 753353 891463 615099 481468 661977 780049 775126 758792 632662
16157 632662 919786 715001 875005 775466 739052 871198 774055 685411 645136 880292
16147 880292 712273 745920 989217 898888 1067186 775268 765300 673989 810145 810376 625499
16136 625499 854517 1000463 583029 772772 831566 987273 946344 920160 888825 874956
16126 874956 1047252 779133 781769 687589 775860 1013820 947703 798570 922325 807867
16116 807867 903987 811339 772151 797691 832143 737341 787436 907628 897818 968146 1053629
16105 1053629 925250 942294 1279581 1053348 1018601 1083881 948926 1035674 959244 984436
16095 984436 968859 766093 1170649 848852 998237 1049553 1038036 1296270 1423212 921320
16085 921320 911358 1012373 1207324 1308666 1165290 1258878 1069156 1096977 1305324 1118205
16075 1118205 1450662 934078 1449000 1196339 1251604 1394927 1267106 1399211 1283962 1180005
16065 1180005 1292051 1466980 1546085 1468128 1483873 1533675 1144457 1481375 1393591 1446281
16055 1446281 1629759 1506875 1732432 1444486 1655058 1596049 1853992 1762245 1615573 1629783
16045 1629783 1936931 1565204 1818543 1726005 1710436 1394896 1631528 1732446 1778274 1591624
16035 1591624 1747244 1505382 1625191 1721204 1628039 1822955 1677842 1833296 1784173 1835975
16025 1835975 1826025 1847155 2096495 1776160 1995926 2101533 2069240 2161021 2139388 1959731
16015 1959731 2091093 2132498 2043897 2291375 2028312 2243091 1958394 2249543 1982924 2144570
16005 2144570 2128350 2163432 1867374 2139649 1885481 2164266 2189740 2119955 1985178 1934576
15995 1934576 2060801 1897688 1924158 1744759 2094398 1974718 1858732 1849002 1817360 1979743
15985 1979743 1977865 2401690 2077151 1951628 2279539 2198038 2236784 2262291 2088698 2191830
15975 2191830 2149118 2232512 2266330 2237304 2325529 2125736 2042151 2214080 2099933 2138463 2323820
15964 2323820 2192950 2053707 2338216 2257791 2245489 2350366 1969480 1986081 1980604 2119489
15954 2119489 2195736 2059467 2278836 2157702 2010770 2050938 2307787 2239593 1994659 2380900
15944 2380900 2361054 2410257 2327649 2352298 2186667 2328749 2306947 2496573 2541385 2413882
15934 2413882 2688160 2729057 2580797 2729255 2628368 2828604 2973484 3051037 3116035 3184269
15924 3184269 3410335 3444202 3733328 4117775 4051627 4652338 5137091 5599991 6506068 7613265
15914 7613265 9064468 11239833 14622744 18574207 24053310 30352039 37212144 43650152
15906 43650152 49714706 54612718 58339264 60411692 60673935 59057558 55020083 49237592
15898 49237592 41410318 33277299 25519908 19443985 14775242 11175178 9063931 7111072
15890 7111072 6305996 5343826 4887940 4256701 3813535 3606433 3506477 2934751 3061912 2679681
15880 2679681 2733780 2780766 2736238 2527222 2633162 2392053 2440159 2330602 2752470 2740131
15870 2740131 2673671 2573352 2567618 2657839 2541513 2433396 2380157 2318858 2217303 2406109
15860 2406109 2213731 2143698 2122842 2061374 2064679 2304879 2033007 1980033 2118807 2145029 2367882
15849 2367882 1944941 1966198 2177039 2107817 2228641 1816785 2000267 1927011 2261262 2104771
15839 2104771 2069371 2452046 2479352 2567443 2568885 2456066 2583092 2625650 2266105 2439176
15829 2439176 2556630 2330357 2138589 2039170 2208461 2451486 1998863 1911732 1997102 2210898
15819 2210898 1999805 2039914 2309870 2191945 2164063 2107224 2222699 2359838 2367746 2160010
15809 2160010 2331543 2440170 2260187 2216131 2343862 2393353 2333271 2382906 2350133 2637958
15799 2637958 2638588 2674502 2582188 2688140 2998918 3108238 2876669 3420623 3220573 3186977
15789 3186977 3193145 3298102 3391553 3383872 3383153 3681039 3797323 4025560 3960983 3823754 4386190
15778 4386190 4164786 4179650 4071632 4485866 4466454 4595678 4496733 4657247 4248930 4609418
15768 4609418 4205287 4267085 4434805 4799067 4783330 4727137 4886818 5089606 4897510 4956705
15758 4956705 4762574 4865432 5116230 4969980 5012807 5130879 5040997 5096415 5274002 5312131
15748 5312131 5545224 5568444 6031807 6164606 6269345 6569177 7044057 6906180 7052998 7242221
15738 7242221 7225525 7515404 7485849 7501092 7551483 7510598 7626880 7347778 7649816 8070326
15728 8070326 7692875 7566542 7510590 7425888 7333513 7297357 7047022 6863375 6741664 6653355
15718 6653355 6640319 6858270 6533183 6942353 6758465 6768960 7109179 7068312 6907771 6919943
15708 6919943 7048923 7177879 7146582 7696479 7634262 8076737 8354077 8543698 8677495 8809044
15698 8809044 8866046 9148397 9090671 9040336 9428827 9457356 9306091 9253098 8943002 9019243
15688 9019243 8823094 8785133 8691809 8523499 8548313 8426161 8345121 8532693 8512437 8320729
15678 8320729 8088408 7876090 7758149 7462114 7406102 7352304 7181280 6799214 7161122 6825865
15668 6825865 6911528 7096419 7138774 7106160 7244092 7372471 7465006 7868547 8243719 8761131
15658 8761131 9071138 9700643 9996079 10670942 11074597 11656506 12188646 12524003 13367221
15649 13367221 13858350 14280045 14986924 15641903 15988033 16736519 17193052 17615021 18680746
15640 18680746 19435820 20084851 20908561 21424061 21974435 22625170 22647331 22675317 22556680 22357319
15630 22357319 22238749 22010166 21840933 21337154 21459666 21493195 21451751 20997234 20818316 20610990
15620 20610990 19853895 19019712 18352204 17319642 16737783 15959670 14933028 14326609 13762549
15611 13762549 13420239 12965660 12816352 12328422 11929298 11738638 11490287 11278401 11126820
15602 11126820 10695565 10654556 10420796 10399882 10531248 10828934 11028228 11644868 12405164 14954641
15592 14954641 19378001 27986577 39704166 53953327 65529757 73256774 78870863 82940650
15584 82940650 85624852 87523909 87456268 82442788 68168486 50418740 35118948 22587605
15576 22587605 15579070 12135480 10426256 9740811 9322102 9068341 8750518 8967532 9223577
15567 9223577 9305997 9466065 9902345 10000585 10197015 10757012 11286887 12299734 14126502
15558 14126502 17483951 24867700 37009648 53442969 71874573 85459393 94816413
15551 94816413 101254675 106016279 109318871 111205453 109882410 100407110 79304374 56350350
15543 56350350 36860223 22008616 14494437 10738914 8985882 7849786 7180462 6750588
15535 6750588 6455978 5963674 5844145 5998377 5698416 5410736 5548914 5309911 5037184
15526 5037184 5031297 4717207 4652128 4412248 4408016 4160065 4126865 4090051 4083766 4048629 4077769
15515 4077769 4275508 4183959 4288788 4501347 4608840 4535054 4632258 4713248 4638437 4796416
15505 4796416 4620363 4627346 4585599 4302738 4536796 4269451 4288397 4323025 4229431 4141523 4297943
15494 4297943 4234799 4248793 4403745 4296745 4535179 4628975 4829195 4987232 4901304 5263980
15484 5263980 5489189 5610342 5738598 6249355 5896087 6155890 6275568 6291400 6338334 6393850
15474 6393850 6499612 6758303 7369433 7857095 8389961 9184231 9842675 10452602 10426487 10807824
15464 10807824 10734889 10756380 10335219 10322488 9543345 9377957 9369610 9390360 9935217 10322760
15454 10322760 10898591 11280034 11541118 11637867 11681983 11249402 10913985 10758222 10105877 9677600
15444 9677600 9249195 9135668 9127316 8884863 9054631 9107575 9046352 8945281 8858804 9084311
15434 9084311 8491207 8333773 7972147 7991707 7433760 7192201 7020047 6603990 6609036 6523411
15424 6523411 6340353 6377148 6205925 5972522 5792621 5400012 5288646 5221144 5087113 5094001
15414 5094001 5087997 5016692 4781605 4956434 4776748 4780651 5179139 4927611 5051316 5045774 5149937
15403 5149937 5003652 5183670 5428167 5170336 5472512 5652754 5470993 5742214 5729661 5627253
15393 5627253 5831639 5952975 5834735 5880477 5833798 5815829 6161291 6383105 6303781 6170551
15383 6170551 6518478 6649737 6394902 6548337 6582473 6278820 6480503 6342334 6209217 6346836
15373 6346836 6431439 6583353 6479778 6686122 6368602 6656981 6846884 6771316 7237006 7101765
15363 7101765 7565740 7588887 7732110 7744336 7914235 8322762 8465689 8281916 8891550 8941970
15353 8941970 9265867 9787792 10824754 12217016 15639369 20688104 27544482 35351094
15345 35351094 41656217 46180553 49911501 52293943 54092211 55362510 55349675 51945989
15337 51945989 44739272 35925570 28162355 21610794 17987252 16219830 15363471 14599324
15329 14599324 14423684 14103910 13992842 13805788 13040198 13292649 13368283 13442150 13750341 14291736
15319 14291736 15140247 16618027 19184408 23730380 30963540 41924898 55226112 68141470
15311 68141470 78830300 87277181 92901106 96460102 98913754 98892063 95070496 84774647
15303 84774647 69466790 52915865 37733495 26815832 19916332 16337804 14747947
15296 14747947 13663109 13220044 12961740 12652439 12604601 12555007 12479133 12526106 12716252 12423449
15286 12423449 12441874 12567849 12896336 13749669 15565677 18770207 24167296 30974487 38190705
15277 38190705 43792453 47492852 50247471 52177126 53687216 54142446 52969858 48742861
15269 48742861 40695981 31905450 24190739 18116692 14548729 13145275 11895534 10913979
15261 10913979 10268877 9540236 9074564 8990180 8825839 8705446 8968158 8944448 9430006 9365696
15251 9365696 9760750 10137649 10212615 9920367 9651003 9412250 9430337 9243497 9067107 8445953
15241 8445953 8533546 8190059 8106875 7983886 8245868 8393967 8715537 9263119 9590097 9811177
15231 9811177 9937551 10107902 10570329 10457220 10303689 10081474 9834486 9321831 8920677
15222 8920677 8418663 8365745 8259704 8530023 9063890 9027673 9428131 9685079 10181969 10289211
15212 10289211 10405550 10560553 10395341 10099194 9678475 9375571 8869207 8395722 7967376
15203 7967376 7262669 7220819 6757790 6623534 6553872 6383638 6263872 6235069 6242296 6183931
15193 6183931 6241334 6362012 6337225 6434196 6797284 6706198 6860874 6886267 6889287 6798176 7066301
15182 7066301 6990954 7096572 7188187 7404660 7327033 7498788 7443674 7611640 7610261 7852065
15172 7852065 7902478 7693060 7828960 7683463 7443512 7643817 7767059 7458857 7791282 7750155
15162 7750155 8014909 8085533 8279965 8243988 8191347 8513255 8895100 8778651 8637522 8758917
15152 8758917 8590770 8636863 8590793 8736042 8332033 8362283 8352589 8209933 8479578 8274095
15142 8274095 8364113 8403192 8257768 8660311 8299532 8108856 8203380 8062603 8047944 8137777
15132 8137777 8061726 8017732 8115242 7840845 7876688 8025075 8139565 8293153 7960010 8095531
15122 8095531 7998487 7895593 8143221 7670864 7680069 7570334 7716085 7671871 7946246 7975918
15112 7975918 7914420 7995817 8086387 7895206 8130944 8144546 8567517 8683058 8890985 9153444
15102 9153444 9348512 9468727 9768268 9890382 10243466 10373476 11070395 11269591 12306688
15093 12306688 13104813 14634071 17006385 19815268 22715312 25266546 27148493 28845369
15085 28845369 29740892 30501901 30931259 30999096 29528024 27614779 25431474 24138968 24128190
15076 24128190 25890334 28454248 30637289 32647100 34102482 35395335 36500138 37060792
15068 37060792 37785113 37714221 37546406 38204436 40079407 42565893 44838793 46918741 49666484
15059 49666484 52051136 55090554 58266213 60197904 60225415 56983481 54376119 53135649
15051 53135649 54222834 57448088 61073689 64072979 65918595 67048802 68142059 70228718
15043 70228718 72363142 74124454 73898975 72021349 69138308 66818745 65387710 65229657
15035 65229657 66354748 67272917 68804056 71889419 76182241 82086365 87999115 92292348
15027 92292348 95443481 97325582 98075960 97998001 96841845 94023498 87748220 80892779
15019 80892779 74886663 70424132 68201352 67659014 67740223 67521374 67551750 67832877 68223097
15010 68223097 68056817 67369359 64832838 60868577 56505501 52624743 49848830 48386093
15002 48386093 47475722 47602781 48280900 49707163 51407588 53157121 54704330 56082890
14994 56082890 57046449 57442366 56921547 55957978 54555651 53264688 52729371 52673426 52315664
14985 52315664 52304875 52228256 52491087 53193190 53120108 52827366 51177493 47766392 43795192
14976 43795192 39910635 37028460 34017961 31448507 29339943 27997167 26972630 26725166
14968 26725166 27277309 27940782 28897185 29885912 30879052 31884929 33163827 34974234 38054952
14959 38054952 42355093 48527837 57420874 69954567 86754812 108416414 134835670
14952 134835670 165225889 199382864 237099562 276451566 315757948 354138413 388594595
14945 388594595 412813666 424010273 424305548 416482663 401204059 381560386 358514344
14938 358514344 330950073 296897730 260352914 227960625 203093232 186190270 175388494
14931 175388494 165347053 153483856 140349880 126660188 114852886 106028760 99998605
14924 99998605 95970136 92745046 88559811 83947485 79905338 76325076 73279879 69675059
14916 69675059 64856829 56854520 46827076 36683672 28170802 22096592 18321753 16341498
14908 16341498 15182772 14688365 14381754 14810730 15353031 16146884 17736697 18590001 20583212
14899 20583212 22241561 25179090 29231546 34509001 40029673 44556592 47699611 49397633
14891 49397633 50420710 50950698 50782320 49758935 46727314 40934021 33784643 27101202
14883 27101202 21726387 18335482 16376233 15287964 15296469 15291477 16328622 17092461 18253672
14874 18253672 18955356 19482503 20039636 20393351 20740975 21285724 21466752 21773781 21380471
14865 21380471 21090925 21032986 22603561 25508741 30610517 38065799 47121835 57456058
14857 57456058 68037375 78599116 88268159 95986333 101614487 104321096 104022565 99609318
14849 99609318 91770946 81551425 69394724 56567166 44158752 34399292 27261783
14842 27261783 22447815 19706352 18126058 16800381 16160128 15587031 14907110 15124776 15277917
14833 15277917 15258964 15133913 15406896 15527254 16139954 16626779 17208886 18140250 19215472
14824 19215472 20736011 23190987 27378148 33407162 41382019 50015414 57066195 62424507
14816 62424507 66093935 68301234 69714155 69605518 68178597 62776271 53791020 42963725
14808 42963725 32499536 24126267 18467937 15138664 13453919 12595242 11683807 11166167
14800 11166167 10799405 10236978 9996108 9699139 9444514 9109247 8756366 8345549 8235300
14791 8235300 7994789 7991186 7576002 7722371 7561655 7710509 7864662 8049437 8312739 8922549
14781 8922549 9271829 10178312 11005024 11604002 12163070 12447627 12742703 12777301 12740323 12553606
14771 12553606 11846258 11177110 10326609 9374483 8957421 8649119 8553647 8584640 8682433 8842172
14761 8842172 8980440 9180341 9696885 10173279 10476598 10449207 10478061 10671282 10858855 10907755
14751 10907755 11190007 10861784 11130485 11017207 11026055 11523940 11656183 12312515 12939914 13439819
14741 13439819 14386893 15444164 16776801 18754606 21320642 24533507 29522022 36895522
14733 36895522 47979193 64628905 89182935 120732894 157120520 193962098 228644886
14726 228644886 257459622 279093716 293214065 300934778 299761045 285820159 258989009
14719 258989009 222068299 178132066 134528480 97062451 68827883 49346318 37137004
14712 37137004 29894488 24527485 21092077 18137012 16222110 14804287 13885363 12798483
14704 12798483 11880329 10980867 10330410 9257953 8855270 8196436 7982425 7761201 7550786
14695 7550786 7580487 7555875 7459894 7341098 7280334 7285372 7690090 7745597 7440197 7732592 7624228
14684 7624228 7913228 7931220 7720101 8247593 8332413 8793967 9524297 9961620 11011229 11148568
14674 11148568 11574786 11716842 11552637 11472801 11212079 10915894 10284018 9407962 8478636
14665 8478636 7798273 7408133 7149767 7106211 7025288 7069556 7146924 6980936 6686716 6498245
14655 6498245 6244576 5988982 5827859 5792225 5887296 6048781 6016292 6419147 6432855 6515921
14645 6515921 6444009 6581354 6894318 7127880 6945021 7408791 7523410 7884828 7933080 8550850
14635 8550850 8550625 8902358 8994937 9058469 8836639 8705392 8328195 7461188 6973038 6376528
14625 6376528 5669462 5058408 4899594 4527981 4664121 4531420 4495789 4588490 4288668 3969758
14615 3969758 3993450 3724933 3824558 3871169 3702292 3529202 3841967 3296700 3493466 3375828
14605 3375828 3441209 3457388 3389908 3848298 4304558 4807427 5019197 5608160 6058269 6497856
14595 6497856 6747802 6798022 6916826 6770376 6505353 5885228 5552618 4755595 4323443 4066349
14585 4066349 3800195 3768092 3711707 3827392 3719141 3721621 3733085 4189161 3891303 4148991
14575 4148991 4177645 4176107 4506710 4677180 4790815 4956339 5392774 5794154 6448560 6969928
14565 6969928 7851501 8789033 10415388 13869671 19031765 26509255 34807275 42033754
14557 42033754 47208998 50716453 53254628 55452102 57017485 57295698 54496369 47743931
14549 47743931 38247026 30590854 25771059 25369923 29513354 36632028 44865484 50892713
14541 50892713 55372807 58434724 60350048 61733844 61628308 59636686 53680249 43521792
14533 43521792 33647443 24875672 18686732 15547248 14109318 13412722 13253095 13522978
14525 13522978 13821130 14523242 15860208 17670751 21399459 26078686 31833283 36295822
14517 36295822 39562314 42175560 44100557 45339332 46474650 46717268 43916116 38335821
14509 38335821 32074436 27302279 24904387 26265767 30353997 35835776 41073650 44479797
14501 44479797 46564432 48419050 49233895 49223967 48555408 45853118 40625875 32841661 25847180
14492 25847180 20149319 15675768 13434240 11785129 10524268 9654514 8686822 7620648
14484 7620648 6580716 5783299 4863265 4577842 4220160 4054975 3851142 4165496 3876375
14475 3876375 4023037 4195196 4342064 4935307 5050238 5401426 5620893 5853394 6053991
14466 6053991 5891608 6193916 6444981 6589659 6248901 6281345 6330659 6598629 6696800 6900594
14456 6900594 7168479 7072350 7363762 7440341 7189677 7019770 6538167 6229530 6168476 6067782
14446 6067782 6263521 6778870 6810396 7052630 7712231 7973921 8154114 8395947 8662569 8741931
14436 8741931 8944289 9382827 9903704 10809613 11867683 14542071 18281402 23371236 29457644
14427 29457644 35674172 41314764 45817530 48936933 51541807 53035377 53313525 51359898
14419 51359898 47338633 40441498 33377367 26287024 20892913 16598210 13832744 11981245
14411 11981245 10844317 10018959 9108028 9079439 8756888 8830031 8667579 8707944 8548270 8827388
14401 8827388 8978293 9559412 9775446 10580971 11993749 14034810 17484683 22709359 30500820
14392 30500820 39780777 50388448 61038806 69979533 77156355 82199444 85707791 87074816
14384 87074816 85629435 80574046 72043037 60060831 47522987 36370802 27372223 20766811
14376 20766811 16557246 13569820 11787262 10859738 10137436 9655979 9333796 9136892 9069726
14367 9069726 9058995 8983122 9123060 9283226 9482021 10121435 10543929 12037418 13272765
14358 13272765 15660538 18485329 22654814 27609115 33154851 39281929 45383043 50862185
14350 50862185 56517633 62833847 68909235 75728429 81656710 85520445 87079726 87344988
14342 87344988 86190288 84930769 83335775 80474366 76361705 70294428 62117460 52948293
14334 52948293 44766200 37605345 32119216 27883404 25125864 22400728 19514268 16088037
14326 16088037 12711085 10084493 8078430 6914655 6270609 5627236 5303974 4742384 4299057
14317 4299057 4092373 4004611 3400007 3651884 3304257 3200215 3261616 3230165 2849617 3010619
14307 3010619 2703831 3067285 2789602 2757836 2500030 2594959 2586366 2579309 2473043 2669888
14297 2669888 2343400 2509446 2620882 2237789 2304579 2196316 2281896 2270687 2136594 2216681
14287 2216681 2147969 2376815 2062604 2230152 2426643 2263166 2310214 2264101 2335467 2278060
14277 2278060 2562658 2531676 2437215 2587910 2548617 2568215 2687876 2505874 2364194 2662571
14267 2662571 2701659 2505313 2245694 2436700 2209385 2545766 2313118 2468458 2213578 1856392
14257 1856392 2189448 2011486 2202555 2003048 2057642 2006008 1803224 1985648 1933127 1688437
14247 1688437 1966322 1520174 2094772 1888831 1956209 1874923 1809627 1793054 2069745 1787794
14237 1787794 1802125 2142645 1984099 2070175 1871013 2136705 1966448 1878661 1652775 1873892
14227 1873892 1788503 1780007 1748564 1739429 1859604 1620300 1798196 2098600 1996994 2158009
14217 2158009 2098696 2184837 2366509 2285433 2366117 2296934 2726987 2680926 3326001 3679235
14207 3679235 3889089 3798142 3645513 3733176 3778626 3805376 3954872 3795106 3177613 2516033
14197 2516033 2113546 1747617 1633207 2073665 1893781 1958152 1784213 1846930 2031498 1964618
14187 1964618 2015278 1828364 1899004 1946679 1979581 1938043 1880105 2420011 2160534 2456027
14177 2456027 2507361 2595762 2780722 2823498 2637371 2719819 2702075 2372554 2222455 1835233
14167 1835233 2100510 1847129 1778413 1847623 1711601 1737170 1594043 1827812 2201725 2069254
14157 2069254 2038921 2057657 1997399 2148822 1986662 2055297 2140430 2256122 2028307 2227920
14147 2227920 2065258 2441101 2355344 2716851 2835566 3623687 4474964 5148081 5834129 6680333
14137 6680333 7082136 7526666 7937936 8081894 7853178 7553131 7133545 6164126 5140505
14128 5140505 4601654 3799008 3489891 3172611 2806637 2848174 2626887 3220986 3300838 3082432
14118 3082432 3317807 3400696 3530720 3597789 3433930 3498116 3375819 3165378 2914437 2777673
14108 2777673 2542332 2341380 2345856 2370208 2632409 2639288 2618515 3119517 3197939 3282678 3920821
14097 3920821 4253266 4497382 4685201 4950661 5360508 5382178 5275025 5316491 5140804 5011984
14087 5011984 5100077 5529711 5896074 6375321 6774720 7453157 8130664 8634365 9646590
14078 9646590 10332978 11728791 13111221 14743422 16941218 20292371 25031251 31503504
14070 31503504 39199756 47853413 56249877 63509740 69039196 73383177 76055506 77345257
14062 77345257 76071821 72520349 65584547 56211102 46079110 36789901 28749097 22746027
14054 22746027 18209267 15213212 12574394 10565495 9120762 8125970 7352197 6934243
14046 6934243 6641237 6131779 6023913 5798014 5447231 5569813 5576114 5076478 4619027 4351726
14036 4351726 4076145 3493370 3365837 3096178 2643958 2859141 2571256 2623754 2386144 2350418
14026 2350418 2229952 2357112 2216334 2310072 2122873 2056511 2213708 1980213 2156928 1794718
14016 1794718 1880717 1939697 2038792 2327666 2081864 2125977 1934958 2101082 2165149 2076911
14006 2076911 1922443 2252712 2024049 1905743 2096188 1823116 1948584 1638284 1869305
13997 1869305 1974542 2069451 1874247 2237218 2147149 2750662 2900599 3108411 3748432 4363802
13987 4363802 5552786 6200429 7769568 8901623 9653795 10193832 10511079 10636647 10861774
13978 10861774 10388257 9733228 8336313 6957117 5916447 5031509 4485330 3991892 3577232
13969 3577232 3455265 3219467 3054054 3068248 3081341 3060081 2866049 2451481 2569998 2283591
13959 2283591 1997090 2131501 2261280 1760894 1896141 2097144 1986535 1873085 2072827
13950 2072827 2187071 2379819 2434274 2155452 2668594 3014762 3255741 4079375 5099814
13941 5099814 6414106 8222286 9433840 11368248 12805199 14336143 15283085 15915920
13933 15915920 15991130 15085600 13897315 12055769 10095783 8053686 6112825 4461650
13925 4461650 3416883 2582279 2245341 2160637 1785038 1756009 1613364 1744951 1348937 1591020
13915 1591020 1773740 1662488 1340217 1431849 1291982 1436318 1516227 1358134 1477506 1077823
13905 1077823 1273247 1409706 1176559 1221105 1379391 1095172 1361586 1270676 1349043 1293791
13895 1293791 1394487 1273028 1257936 1376319 1218616 1095938 1112111 1333447 1316078 1406710
13885 1406710 1442523 1279453 1353848 1327519 1308304 1409123 1315844 1278046 1080285 1194375
13875 1194375 1431066 1198869 1294724 1446762 1222670 1342384 1471977 1395169 1428416 1521654
13865 1521654 1239722 1376538 1406710 1445069 1702860 1628038 1548755 1439516 1484138 1493953 1557013
13854 1557013 1299790 1344643 1187929 1395319 1283174 1527639 1498938 1624971 1368140 1246050
13844 1246050 1485670 1244649 1047394 1292630 1366944 1417610 1173530 1469038 1202363 1457453
13834 1457453 1264934 1359251 1286622 1258214 1086195 1401648 1313155 1412119 1125548 1144058
13824 1144058 1260991 1338513 1166426 1257245 988631 986821 1258723 1203039 1056703 1064096 979251
13813 979251 1155368 1037685 1233497 1364894 1181782 1296999 1277428 1259736 1389145 1206860
13803 1206860 1186067 1293516 1243797 1381656 1176088 1183761 1459720 1358723 1133021 1232791
13793 1232791 1120428 1275845 1360360 1137742 1353072 1282960 1247885 1332771 1097825 1251434
13783 1251434 1319551 1380661 1396156 1421496 1497336 1345882 1839238 1670231 1503625 1454913
13773 1454913 1520436 1672020 1692930 1376602 1384938 1197925 1057291 1202374 1132313 1289281
13763 1289281 1294186 1256325 1321688 980880 1147075 1228432 1378579 1267754 1289425 1175810
13753 1175810 1226984 945901 1182984 1452208 1457102 1400421 1419938 1468213 1349027 1402247 1605944
13742 1605944 1571507 1550518 1455053 1745863 1624552 1477757 1491273 1749926 1688271 1653619
13732 1653619 1582835 1529927 1589639 1625915 1766892 1581163 1520134 1909760 1724115 1818021
13722 1818021 1769567 2014222 1926048 1999355 2020666 2038425 2035264 1886406 2039119 2119831 2196112
13711 2196112 2193435 2221715 2332349 2124488 2128550 1835093 2141118 2119429 2070278 1944500 2105237
13700 2105237 2112706 1849641 1792870 2092202 2309405 2278937 2410185 2648610 2438814 2294735
13690 2294735 2480494 2463446 2524040 2254676 2288967 2008937 1933328 1678689 1957002 1775450
13680 1775450 1784918 1893997 1549759 1855723 1747980 1725144 1770413 1850960 1715638 1813718
13670 1813718 2246736 1880741 2007665 1832855 2257773 2191391 2411257 2324496 2420792 2672189
13660 2672189 2753740 2646141 2494526 2509737 2188389 2103442 2071999 2135769 1990879 2014054
13650 2014054 1913881 1971053 1916420 1914579 1818470 1747080 1735982 1633536 1832400 2002142 1789995
13639 1789995 1909913 1952281 2198210 2223655 2458816 2168460 2378890 2242080 2346270 2523361
13629 2523361 2385992 2051212 2233242 2125480 1849948 1669058 1903298 1525344 1362586
13620 1362586 1710690 1471927 1625009 1573504 1599854 1606544 1918929 2013934 1989218 2008794 1875702
13609 1875702 1831619 2060575 1817240 2010210 1973060 1866255 2313302 1918150 2077827 2085112
13599 2085112 1782220 2062921 1790109 1937025 1686327 1840244 1862366 1774063 1797272 1757536
13589 1757536 1893231 1842410 1951109 1793226 1709839 1922557 1893355 1559627 1720241 1683501
13579 1683501 1779110 1536449 1517145 1425631 1419891 1573077 1530023 1496128 1384997 1508136 1387810
13568 1387810 1545637 1308158 1687701 1470598 1462227 1394758 1531041 1487129 1695742 1224579
13558 1224579 1599928 1607581 1595245 1350545 1453271 1132195 1347768 1581448 1348318 1505415
13548 1505415 1424454 1670770 1609095 1949346 2078724 2233780 2073090 2042350 2288054 2033546
13538 2033546 2520210 2180268 2031871 1848315 1708999 1938007 1584909 1780682 1556330
13529 1556330 1813078 1664700 1868416 1845335 2170301 2279917 2276256 2146090 2306770 2242681
13519 2242681 2269552 1857821 1884749 1630883 1531725 1404284 1481600 1126760 1369169 1271679
13509 1271679 1283729 1208559 1404153 1278013 1281379 1273558 1138463 1264786 1227020 1290529 1292217
13498 1292217 1074067 1288700 1485475 1311764 1377210 1291841 1398903 1186843 1333826 1374273
13488 1374273 1387340 1323456 1227896 1281454 1281400 1379683 1434190 1234094 1266942 1318969 1249528 1150571
13476 1150571 1401535 1335859 1360533 1196510 1201389 1421237 1507819 1317546 1189624 1169834
13466 1169834 1180777 1491461 1513999 1373842 1292625 1373554 1466294 1378599 1521678 1578764 1469036
13455 1469036 1703534 1783819 1950446 2077443 2323581 2114595 2307044 2149032 2064080 2173906
13445 2173906 2080540 1919275 1932277 1813834 1530254 1500649 1505837 1461606 1343674 1642949
13435 1642949 1379018 1377296 1513049 1373661 1519924 1513352 1494443 1451056 1249284 1630793
13425 1630793 1798234 1679788 1973300 2006523 2268917 2166905 2161170 2560376 2274067 2348783
13415 2348783 2231645 2000835 2209891 1823060 1579489 1595042 1535765 1603724 1590000 1657491
13405 1657491 1591700 1648330 1472376 1737919 1665569 1599933 1592135 1532410 1877062 1704762 1640741
13394 1640741 1746600 1787675 1821553 2041321 2025737 2098955 2165624 2033703 2207870 2244484
13384 2244484 2246396 2423195 2345514 2264477 2477851 2416821 2338336 2428223 2074949 2237552 1875727
13373 1875727 1969002 2051879 2216706 1977188 1887936 2001234 2173731 2098208 1921266 2094465
13363 2094465 2225656 2242312 2343636 2337638 2195864 1902776 2128956 2241595 2383592 2161047
13353 2161047 2382412 2315869 2386577 2411005 2255581 2386021 2091915 2152359 2248386 2036164
13343 2036164 2041712 1993532 2169848 2044103 1972520 2006669 2042504 2170344 2128469 2271861 2176830
13332 2176830 2210528 2149757 2169639 2175218 2206184 2277463 2203339 2094035 2104164 2046025 2426275
13321 2426275 2118013 2556646 2535149 2381605 2618914 2854035 2657257 2715668 2973467 2848071
13311 2848071 3012313 2950355 3158738 2867552 3101404 2952026 3043149 2898107 3018313 3043455
13301 3043455 3227523 3311333 3320734 3362939 3449105 3519346 3535767 3513497 3619166 3427748 3618472
13290 3618472 3534973 3553185 3677494 3526566 3462050 3569385 3439928 3625841 3606424 3692271
13280 3692271 3762028 3766695 3969054 3814903 3886486 3987380 4171423 4045347 4083682 4347558
13270 4347558 4139386 4332721 4448404 4466335 4634482 4591637 4729154 4633526 4780796 4975665
13260 4975665 4844685 5197767 5259599 5281709 5799153 5824709 6116251 6223387 6454226 6603557
13250 6603557 6841099 7125317 7354562 7247525 7291987 7733478 7897932 7928206 7958137 8261241
13240 8261241 8287513 8425883 8470138 8455915 8554042 8630753 8789835 9091704 9136085 9277962
13230 9277962 9355278 9998484 10009556 10325413 10751771 10914527 11262100 11580424 11962504 12111854
13220 12111854 12138703 12235456 12243160 12185147 11818380 11747005 11610499 11517752 11271748 11090133
13210 11090133 10622942 10608045 10352472 10342530 10062031 9972624 9775144 9664300 9650871 9461447
13200 9461447 9488850 9587824 9442258 9266581 9275099 9242839 9005988 8753846 8783890 8595846
13190 8595846 8198323 8096100 7857008 7613293 7296782 6794781 6801941 6473879 6332256 6074480
13180 6074480 5997188 5821045 5633473 5371926 5490025 5241256 5238281 5311388 4918013 5030799
13170 5030799 4829307 4947562 5010409 5291797 5067761 5306385 5417814 5624260 5482210 6103227
13160 6103227 6328941 6622250 6581270 7094930 7369630 7434308 7335753 7407040 7482680 7210829
13150 7210829 7368518 7232169 7255408 7041321 7030774 7039519 7125996 6830197 6647564 6373831
13140 6373831 6134399 5835265 5682660 5484341 4964833 4705176 4465729 4104689 4046522 4107702
13130 4107702 4035952 3881053 3892866 3931509 3860645 4011924 3747379 4013273 3653282 3642279
13120 3642279 3710508 3652308 3645137 3319013 3149612 3091773 3381332 3420029 3444288 3143934 3184913
13109 3184913 3231180 3421381 3255334 3292270 3749634 3721177 3814140 4088682 4393921 4578667
13099 4578667 4644381 4953485 5728411 5846565 6459815 6884946 6781457 7121477 7217259 7496717
13089 7496717 7551489 7343362 7511036 7411202 7335196 7044085 7182166 6903509 6826822 6657797
13079 6657797 6394122 6214958 5789082 5449392 5205726 4883280 4130116 4112706 3865752 3755124
13069 3755124 3539536 3280526 3332192 3429743 3080788 3042677 3241006 3161852 3200074 3265667
13059 3265667 3463592 3093725 3234081 3565703 3463740 3700274 3443005 3034984 3323429
13050 3323429 3312426 3536816 3199980 3091887 3218021 3372507 2971445 3329187 3295855 3151236
13040 3151236 3165969 3488341 3457049 3461133 3550622 3697364 3709227 3662280 3766999 3749751 3980538
13029 3980538 3883080 3649221 3954496 3844447 3894169 4095793 4013406 4083646 4258827 4155260
13019 4155260 4463299 4345494 4210158 4357327 4486328 4390423 4913287 4683769 4585285 4896193
13009 4896193 4649543 4945446 4744981 4877530 4921313 4921182 4979435 4878987 5171821 5029688
12999 5029688 5183451 5108470 5193448 5294200 5556992 5524820 5447906 5476071 5652805 5548846
12989 5548846 5537084 5578203 5766380 5598857 5470104 5711243 5509165 5676711 5761197 5408396
12979 5408396 5325490 5499567 5460129 5495896 5472570 5420241 5318564 5153073 5041377 5329735
12969 5329735 4948494 5080618 5094458 5095486 5099547 5082172 4982093 4824798 4901162 4902273 4961636
12958 4961636 4815349 4821289 5023302 4948987 5084195 5062648 5270125 5058333 5034915 4898776
12948 4898776 5154371 5202873 4979491 4994335 5025055 5170794 5132607 5045098 4923529 5159243
12938 5159243 5094943 4912088 5176605 5205525 5060885 5235164 5099119 5306810 5389439 5235668
12928 5235668 5399030 5144528 5026743 5055211 4847067 4805018 4868487 4809509 4689208 4485489
12918 4485489 4773438 4642262 4659092 4404533 4527262 4235476 4271459 4381113 3954792 4036072
12908 4036072 3886380 3875626 3895240 3729478 3616197 3914298 3657601 3907740 3505026 3572087
12898 3572087 3496318 3657502 3301456 3412494 3195743 3196048 3274200 3284226 3322285 3380512 3250805
12887 3250805 3203007 3375487 3233094 3178857 3499075 3343516 3431477 3248020 3207685 3157883
12877 3157883 3206103 2996706 3171576 2860130 2934592 2757550 3026397 2897177 2765113 2772116
12867 2772116 2877660 2772981 2710397 2697957 2545483 3174594 2590332 2721005 2741954 2771613
12857 2771613 2750899 2844776 2453317 2493120 2632807 2671245 2593984 2575582 2547097 2478219 2596850
12846 2596850 2781110 2776503 2705070 2557484 2721353 2652002 2574897 2601565 2791497 2505592
12836 2505592 2248438 2701484 2666667 2636313 2717768 2696346 2683064 2606652 2642203 2636545 2737966
12825 2737966 2681129 2683450 2761274 2895320 2558948 2449001 2562638 2598860 2480237 2707612
12815 2707612 2648713 2616313 2625285 2342811 2628668 2412913 2616734 2639259 2625431 2486973
12805 2486973 2706232 2656582 2751855 2729282 2651011 2808354 2733796 2645331 2696653 2677889 2940715
12794 2940715 2787601 2757150 2830763 2609016 2905208 2963409 2596901 2602663 2673026 2798583
12784 2798583 2609600 2696091 2836307 2652827 2819012 2831940 2933264 2710422 2472328 2761936
12774 2761936 2776451 2801815 3022930 2826781 2688115 2968402 2899228 2878007 3013371 2901973
12764 2901973 3004144 2966164 2852254 2839112 3147495 2958415 2886576 2851567 2842370 2910276 3016775
12753 3016775 2728489 2454468 3070750 2992945 2700057 2987376 2828137 2816629 2876460 2925581
12743 2925581 2861073 2747405 2944777 2849941 3070492 2695009 2949425 3025919 2921168 2842954
12733 2842954 2889742 3017828 2929057 2870979 2989449 2833444 2962999 2812659 2860053 2933022
12723 2933022 2884658 2984456 3179915 3175900 3046218 3165935 3088906 3031782 3148610 2881441
12713 2881441 3407466 3266247 3266661 3317450 3264170 3247924 3395900 3498376 3574125 3537333 3843828
12702 3843828 3864479 3844953 3767699 4135642 4184029 4382826 4988817 5183091 4920918 5468621
12692 5468621 5618312 6046720 6453594 7076228 7096889 7284491 7118814 7202564 6741311 6849513
12682 6849513 6837555 6149173 5822270 5364494 5192963 4595800 4393665 4200665 4385209 4413324
12672 4413324 4164227 4456492 4633548 4536048 4670165 4534269 4686965 4652650 4610958 4909732
12662 4909732 4944207 4959988 4706045 4973874 5507276 5238209 5542391 5653481 5632992 5992498
12652 5992498 6228509 6395301 6606843 6561466 6485138 6844745 6799694 6579021 6570432 6475754
12642 6475754 6496993 6433255 6244278 6433505 6649235 6921309 6858696 7250670 7004592 7113286
12632 7113286 7133395 7207337 7547655 7369957 7200039 7375586 7358857 7220166 6761891 6633767
12622 6633767 6288088 6005930 5585359 5469366 5578428 5196258 5116180 5298031 5099009 5475013
12612 5475013 5987859 6001768 6389329 7019502 7583080 7876358 8294792 8378642 8587326 8517605
12602 8517605 8576766 8119984 7624461 7184294 7113269 6571523 5970726 5960001 5686948 5671104
12592 5671104 5717326 5789421 6307148 6176084 6101025 6427393 6361803 6475799 6236834 6231136
12582 6231136 6141561 6265521 6406778 6651841 6721859 6897889 7084352 7145227 7252818 7027380
12572 7027380 6907136 6684586 6222459 5660816 5255221 5196412 4891692 4637469 4781013 4685203
12562 4685203 4804532 4767587 4888559 4824018 4929492 4772672 4909011 4834035 4710931 5080075
12552 5080075 4865683 5171971 5010542 4876105 4836777 5002586 5284148 5011134 5005771 4993282
12542 4993282 5376614 5051677 5296283 5412232 5251782 5441849 5499307 5349575 5125958 5231858
12532 5231858 5038951 5047340 4793729 5006590 4885852 4749877 4979158 4963801 5098178 5133412
12522 5133412 4993034 5186592 5084000 5274502 5163682 5091416 5245476 5294491 5611387 5843288
12512 5843288 6185673 6186747 6578408 6607451 6462690 6575115 6927791 6445387 6691096 6276043
12502 6276043 5996350 5805352 5659722 5519281 5393541 5465242 5482743 5708805 5609460 5470534
12492 5470534 5668395 5644351 5697919 5803761 5624831 5818759 5734480 5758944 5866927 6093387
12482 6093387 6219312 6544932 6441469 6379470 6579440 6859935 6776832 6539261 6424780 6344164
12472 6344164 6131885 6047777 6207304 6210087 6099335 6000714 6463584 6594920 6626220 6546849
12462 6546849 6540951 6678019 6745703 6865929 6881133 7425822 7301843 7348845 7595043 7842983
12452 7842983 8215653 8261240 8656063 8823069 9052286 9380459 9786640 9987531 10312397 10821538
12442 10821538 11006704 11491390 11548888 11821325 12007294 12126963 12041242 12102531 12177558 12227813
12432 12227813 11890513 12016005 12315414 12120140 12061636 12462888 12522829 12959150 13039119 13192898
12422 13192898 13263421 13799984 14213680 14653997 15462635 15996821 16341735 16850950 17271854
12413 17271854 17966577 18443012 18754526 19028886 19322455 18982314 18972320 18710895 18289291 17846062
12403 17846062 17644996 17100335 16722069 16512116 15792971 15700153 15443506 15142193 15145966 15153294
12393 15153294 14999890 15166051 15402649 15556562 15981823 16613398 16748981 17247637 17517773
12384 17517773 17823725 18408434 18460181 18748034 18837313 18765198 18915760 18831134 18726873 18531233
12374 18531233 18368628 18036153 18119378 17567402 17296690 17151449 16983761 16988534 16761327 16553740
12364 16553740 16406054 16225073 15817479 15674937 15795258 15437698 15252703 15057310 15108707
12355 15108707 14635765 14841300 14596287 14140682 14029293 13910739 13821406 13427197 13174852
12346 13174852 13195130 13079449 12981966 13006555 13159024 13163039 13636415 13576284 13974280 13953409
12336 13953409 14451647 14765125 15066720 15373080 15858949 15931816 16312554 16451468 16732656
12327 16732656 17130946 17299344 17672765 17802908 17887405 17975510 18132625 18167103 18157029 18192034
12317 18192034 18139146 18006379 18185253 18123165 18257977 18257340 18571738 18316902 18579289 18740166
12307 18740166 19497798 19433836 19721854 20188529 20340306 20417505 20590981 20567618 20375558 20296139
12297 20296139 19858655 19414994 19111356 18645089 18003654 17835290 17522449 17264018 17036482
12288 17036482 16512206 16676101 16316849 15846861 15630361 14839291 14461875 14154395 13496862
12279 13496862 13337212 12750375 12546310 12255433 11937481 12078185 11763431 11399534 11213007
12270 11213007 11372451 11342023 11371488 11397076 11483477 11174412 11093044 11051676 11438953 11156586
12260 11156586 11166442 11217777 11372853 11615003 11570731 11910015 12308724 12421151 12738583 13208027
12250 13208027 14057156 14655247 15470389 16571394 17115777 18333569 18942491 19813248 20668150
12241 20668150 21365569 21834225 22287923 22493762 22469205 22363975 22026272 21784965 22076807
12232 22076807 21531856 21284779 21405147 20909784 20491467 20182470 19545269 18910444 17920312
12223 17920312 16973645 16174367 15403557 14402601 13545841 12958482 12347503 12038717 11574445
12214 11574445 11233924 11074323 10860216 10594241 10224034 10268749 10039368 9960953 9831781 9364543
12204 9364543 9308483 9568037 9422011 9298440 9241758 9350736 9387839 9525802 9503861 9409554
12194 9409554 9348424 9419509 9664092 9757447 10029912 10181955 10480665 10432427 10709305 10909589
12184 10909589 10908743 11432892 11393567 11557154 11778345 11402075 11459295 11736314 11564274 11419324
12174 11419324 11414647 11535215 11727610 11629410 11463992 11820740 11803363 11846010 12376396 12510464
12164 12510464 12893585 13505883 13720044 14317317 14593533 14782378 15366381 15392901 15540395
12155 15540395 15777178 15697139 15839187 15286552 15413342 14920384 15127577 15127015 15817716 16296977
12145 16296977 16618044 16807294 17251999 17717781 18327639 18429005 18793423 19419480 19964856
12136 19964856 20665488 21647576 22590262 24093731 25534118 26969728 28707156 30636959
12128 30636959 32492014 33920395 35613049 37134030 38285381 39260512 39996826 40661858
12120 40661858 41040437 41244840 41084980 41060403 40681877 40125329 39705693 39514726 38744152
12111 38744152 38726179 38457105 38239551 37673278 37502794 37598048 37606683 37685519 38207626 38492711
12101 38492711 38833354 38852951 38875287 38913196 38272308 37945478 37530211 36840820 35987047 35402351
12091 35402351 34701174 34460827 34453329 34475853 35001120 35395288 36004405 36746800 37394190 37722435
12081 37722435 38128362 38404662 38424317 38412282 38222846 38335636 38241216 38436062 38249649 37914866
12071 37914866 37505451 37185322 36185883 35687416 34582560 33679386 32616029 31520951 30481393
12062 30481393 29427596 28623116 27677595 27244489 26582818 26000075 25936621 25286018 25279902 24754998
12052 24754998 24259013 23866294 23479155 22917216 22501007 22043105 21748336 21340910 21042063
12043 21042063 20501320 19908539 19813141 19429974 18715024 18411715 18052957 17403746 17186682
12034 17186682 17053652 17131882 16976825 16983854 17385007 17294010 17577144 18189936 17886340 18291627
12024 18291627 18154577 17854105 17558492 17122595 16602297 16126726 15866085 15391869 14789562
12015 14789562 14697176 14138359 13959129 13518006 13353183 12974840 12846819 12331459 12177553
12006 12177553 11960658 11807897 12033219 12076381 12271854 12547512 12514464 12508498 12343733 12020118
11996 12020118 11746195 11415658 11112715 10819122 10760304 10298916 10181690 10084624 9848733 9732745
11986 9732745 9434542 9444952 9261271 9033491 9048386 8440867 8255553 7908549 7347147 7511244
11976 7511244 7359148 7253202 7083207 7140714 6924316 6788121 6701594 6729040 6524511 6562511
11966 6562511 5917921 5983895 5973362 5741579 5877838 6022811 6031016 6153284 6521853 6337574
11956 6337574 6462005 6406195 6778952 6527421 6702590 6800189 6754620 6746016 6384736 6674766
11946 6674766 6508766 6788868 6905404 6967462 7436493 7583298 7556927 7829413 7892221 7604915
11936 7604915 7624461 7883134 7663390 7839622 7693176 7675584 7781837 7687329 7508494 7636072
11926 7636072 7443192 7508268 7318825 7040038 6777643 6556401 6644625 6288670 6128944 6064192
11916 6064192 6124654 5831930 6063897 6024392 6277301 6586846 7293242 8188147 9292772 9339014
11906 9339014 9796391 9957041 10151879 10262686 10164533 9997754 8994183 7659078 6654675
11897 6654675 5845737 5149529 4969464 5018408 4997352 5465246 5528309 5520953 6095361 6388375
11887 6388375 6955881 7238237 8074818 8825318 8905930 9254206 9569924 9770691 9719453 9495983
11877 9495983 9096215 8594627 7832185 7238179 6987916 6577657 6112113 5966401 5637739
11868 5637739 5337440 5428057 5171757 4895294 4899734 4598428 4851640 4636090 4597611 4623927
11858 4623927 4598215 4492704 4459806 4702395 4713686 4760540 4705101 4949114 5039321 5068271 5276756
11847 5276756 5580282 5885091 6465375 6822671 7350884 7649356 7776534 8379225 8355843 8498751
11837 8498751 8621224 8524871 8548505 8340390 8298877 7747997 7549528 7427692 7463592 7338766
11827 7338766 7176994 7025819 6861374 6513197 6042448 5688430 4982319 4715875 4482862
11818 4482862 4236243 4108266 3989709 4159362 4170647 3845741 3833683 3941830 3818229 3858355
11808 3858355 3692392 3684267 3862388 3848006 3975231 3742843 3624755 3812124 3936949 3827562
11798 3827562 3920471 3915810 3746230 4149648 3879873 4277838 4784228 4926482 5256120 5671299
11788 5671299 5881547 6024786 6387319 6323383 6579155 6368840 5978383 5642166 5425442 5021180
11778 5021180 4392836 4168439 3808896 3783829 3570429 3358369 3656776 3517649 3235436 3280744
11768 3280744 3305564 3280210 3337988 3410054 3388851 3177251 3209977 3416456 3138301 2863659
11758 2863659 2984833 3212938 3298041 3186021 3087814 3092697 3155146 3340223 3134854 3001868
11748 3001868 3079079 3256174 3175720 2973310 3158796 3150957 3204589 3076240 2818277 2817830 2874801
11737 2874801 2678256 2896948 2730387 2838209 2784678 2702535 2986523 2743544 2908802 2642424
11727 2642424 2750073 2794139 2532706 2882920 2837142 2787465 2866425 2687420 2584106 2900864
11717 2900864 2601774 2839808 2710017 2803184 2997985 2691517 2993650 2587796 2782971 2882633
11707 2882633 2760906 2908621 2740037 3099588 2859784 2995010 2774864 2920473 2893203 2977715
11697 2977715 3027985 3193891 3227557 3261232 3000152 3024485 3269382 3321449 3472194 3473564 3076867
11686 3076867 3290851 3453819 3546563 3441568 3614177 3595185 3576312 3558934 3900833 3801198
11676 3801198 3815933 3736006 3752903 3786286 3894635 3598645 3506458 3786943 3739005 3985384
11666 3985384 3807099 3494022 3506809 3748070 3747953 4036594 3792658 3483561 3929046 3796774
11656 3796774 3475859 3620964 3658101 3475818 3599773 3456717 3528633 3779407 3464993 3414267
11646 3414267 3436161 3324937 3335492 3346527 3705477 3275190 3471903 3367651 3423263 3544779
11636 3544779 3353328 3545960 3202309 3235680 3436398 3425102 3355877 3334055 3198126 3345938
11626 3345938 3315800 3156347 3166380 3206479 3270855 3289860 3194973 3359176 3177367 3121337 3313306
11615 3313306 3404268 3303565 3312864 3247961 3279870 3341078 3342391 3351250 3286286 3449330 3499123
11604 3499123 3440746 3350261 3533617 3429784 3466214 3361133 3660910 3558124 3541004 3555179
11594 3555179 3405285 3382457 3334529 3570968 3498692 3665099 3437906 3714829 3562916 3424627
11584 3424627 3485005 3419446 3545355 3734613 3799559 3888286 3652037 3580778 3772770 3818606
11574 3818606 3923499 3885438 3806511 3896382 3756117 3839562 3604150 3950156 3837492 3696171
11564 3696171 4029265 3739826 3689419 3874205 3985536 3767963 3962063 4089272 3822575 3932156
11554 3932156 4129319 3865156 3777309 4049291 3778934 3949113 3886420 3760047 3685015 3781463
11544 3781463 3665640 3831654 3656312 3762066 3583156 3664996 3603153 3642218 3712877 3756637
11534 3756637 3708675 3740122 3572035 3471340 3681204 3852822 3441794 3671976 3621843 3594220
11524 3594220 3719067 3794556 3755800 3831359 3491561 3874054 3785072 3839574 4059427 3845302
11514 3845302 4049467 3934206 4319722 4313780 3974975 4261244 4007106 4366748 4211451 4202250
11504 4202250 4060378 4085210 4393387 4216716 4494005 4283883 4049929 4278773 4078628 4084838
11494 4084838 4357638 4198186 4011499 4373553 4223812 4460982 4105392 4480965 4500204 4399657
11484 4399657 4499037 4441889 4741891 4702476 4737208 4685187 4524904 4666740 4687596 4913153
11474 4913153 4926705 4612348 4826456 4822125 4575897 4519670 4727021 4598842 4404904 4433068
11464 4433068 4763900 4526974 4493829 4421948 4429783 4677147 4463595 4381810 4532764 4589222
11454 4589222 4574184 4713974 4559051 4458685 4684323 4771929 4550985 5040869 4606483 4965001
11444 4965001 4935571 4971325 4852563 5157781 5251791 5471034 5334589 5414469 5592662 5516891
11434 5516891 5692809 5784354 5678629 5648108 5748791 5785010 5855703 5855933 5958631 5977185 6158664
11423 6158664 5933044 6183739 5972736 6122331 6305112 6165143 6337386 6471985 6583576
11414 6583576 6539196 6742859 6891092 6597899 7009059 6873021 7199613 7106740 7412439 7572221
11404 7572221 7604701 7633862 8130295 8068420 8148192 8227257 8341105 8544581 8745290 9033581
11394 9033581 9105688 9251142 9150971 9540714 9630324 9684339 9853705 9922800 10110692 10266810
11384 10266810 10269525 10687319 10897739 10740033 10978001 11074759 11333106 11361598 11409479 11496320
11374 11496320 11392829 11591983 11681375 11657733 11932748 11997673 11832753 11908998 12220905 12444772
11364 12444772 12223277 12431535 12248547 12354614 12556108 12489137 12400757 12599109 12723692 12425895
11354 12425895 12764132 12540632 12710913 12854749 12712844 12834698 12483478 12645950 12619529
11345 12619529 12445662 12438383 12494622 12362945 12251684 12318059 12164111 12153096 12115551 12108874 11873755
11334 11873755 11680307 11416224 11244995 11243958 11352659 11204909 10789519 10727707 10542727 10401528
11324 10401528 10598513 10068558 10126498 9863844 9521754 9914640 9258084 9343221 9352746 9210758
11314 9210758 8950931 8759311 8575665 8674191 7858708 7944980 7680133 7629198 7675026 7306461
11304 7306461 7280703 6878823 6701178 6619236 6712135 6396086 6231472 6241417 6242619 6069086 5715763
11293 5715763 5735179 5384429 5457939 5540818 5478428 5318043 4932364 5192601 4958637 4669991
11283 4669991 4681687 4691366 4481970 4606481 4355393 4391934 4373797 4257502 4267756 4087073
11273 4087073 4263687 3943470 4221384 3974702 3926261 3927771 3748795 3712500 3916396 3726310
11263 3726310 3817797 3652100 3699015 3512065 3735410 3861472 3650365 3438273 3427811 3480923
11253 3480923 3490694 3496831 3374342 3387795 3141438 3335917 3485338 3380955 3424966 3483632 3354187
11242 3354187 3594460 3145221 3181647 3659956 3327968 3576549 3450819 3265513 3507016 3325770
11232 3325770 3229326 3383729 3371245 3493619 3445408 3735517 3823326 4402158 4991098 5482340
11222 5482340 5674957 5950855 6079116 6580813 6531741 6598526 6694691 6000181 5527403 5088767
11212 5088767 4203583 3870757 3508150 3457281 3656600 3415585 3483465 3269137 3457321 3495747
11202 3495747 3247531 3524534 3750826 3621342 3808894 4021085 4699280 5296585 5721260
11193 5721260 6127043 6323947 6498207 6671514 6760559 6621937 6629238 6205601 5663674 4780003
11183 4780003 4587588 4018802 3819892 3839744 3820866 3897811 3867351 3692552 3881457 3815039
11173 3815039 3820341 3787973 4059272 3953052 3942892 3630408 3871687 3813194 3680679 3895781
11163 3895781 3899200 3866200 3707364 3962579 4022212 4046007 4060006 4003467 4041588 4026645 4085652
11152 4085652 4016808 4074322 3995354 4138998 3997019 3966736 4182822 4111592 4085094 4203777
11142 4203777 4016070 4368448 4402634 4509747 4166250 4306341 4358801 4123660 4285895 4439726
11132 4439726 4509935 4398005 4533824 4486641 4530507 4640268 4694895 4869090 4766873 4904866
11122 4904866 4854594 4836539 4848536 5038165 4763447 4918806 4962290 4580136 5134953 4817308
11112 4817308 4907525 5078766 5094496 5079921 4697148 5065254 4897672 4800210 5001443 5065094
11102 5065094 4890729 4897828 4843581 5028499 4882996 4707073 4932855 4954584 4707107 4737250
11092 4737250 4862415 4749554 4738879 4735008 4799979 4872692 4784571 4866822 4890525 4831646 4776747
11081 4776747 4969760 5043295 4858063 4946917 4879368 5183217 5119274 5318199 5194424 5245441
11071 5245441 5264268 5071036 5415127 5495236 5478534 5429860 5439060 5699143 5876091 5905962 5944549
11060 5944549 5987887 6208589 6226109 6385536 6435392 6116525 6498842 6726570 6470153 6726830
11050 6726830 6641527 6718373 6729616 6820069 6931684 6902956 6824453 7060816 7170899 7334867
11040 7334867 7533364 7521271 7662007 7322970 7841718 8153648 8168904 8584309 8808881 8947162
11030 8947162 9191254 9487224 9452313 9992185 9755752 10202890 10431779 10821250 11044016 11386168
11020 11386168 11598153 11395008 11850601 12027286 12005082 12384049 12593145 12388620 12717215
11011 12717215 12674140 12972954 13003280 13475304 13291843 13771754 14021328 14284739 14738366 14967947
11001 14967947 15084108 15511208 15880189 16293854 16593285 17284567 17317583 17470465 17863249
10992 17863249 18173699 18114199 18472111 18637059 18894941 18847914 18987221 19607976 19624124 20194474
10982 20194474 20301679 20553400 20904474 21274068 21684116 22223782 22337621 22859413 22793911
10973 22793911 23327969 23560152 23758670 24123269 24641101 24806452 25117204 25718633 26143613
10964 26143613 26455389 27164068 27092883 27944709 28268053 28957347 29351154 30042821 30392735
10955 30392735 30925689 31736569 32281143 33278954 33606950 34396467 35038723 35707158 36467860
10946 36467860 37265630 37627583 38083630 38784473 39550994 40393126 41108181 41663293 42750530
10937 42750530 43510035 44038798 44793358 45696978 46784107 47612484 48509604 49667181 50379246
10928 50379246 51648127 52372878 53646965 54672596 55784673 56696721 57697434 58615016
10920 58615016 59390466 60011575 60564658 60992294 61595256 61771960 61704928 61986868 61912339 62008836
10910 62008836 61840327 62105484 62015717 61911473 61909092 62175165 61958882 62019245 62259348 62583914
10900 62583914 62641871 63001332 63333472 63785349 64051292 64755693 65342411 66202590 66922086
10891 66922086 67792615 68776915 70152054 71364628 72908264 74677437 76437851 79006387
10883 79006387 81273309 84305815 87347887 90638500 94766060 98644119 103537135 108299983
10875 108299983 113188119 118547731 123374671 127878213 132296999 136011995 138696262 140295531
10867 140295531 141528169 141349036 140311932 138175376 135187049 131193554 126642571 121775771
10859 121775771 116288708 110593051 105189813 99415289 93537558 88436578 82791422 77915972
10851 77915972 73035202 68919954 64302285 60352294 56418845 52968000 49819849 46853251
10843 46853251 44200696 41452738 39136913 36775269 34629601 32727736 31396811 29524716
10835 29524716 28105943 27021460 25418216 24376567 23664603 22311156 21494220 20516787
10827 20516787 19643682 18797655 18220182 17652401 16609646 16297503 15808493 15365511 14845321
10818 14845321 14278300 14168862 13936127 13746681 13638737 12845223 12704306 12519215 12122102
10809 12122102 11739144 11298232 10938958 10780750 10297542 9958362 9551635 9363004 9109737
10800 9109737 8659070 8430923 8373617 8135127 8002458 8038264 7578818 7494474 7152339 7094564
10790 7094564 6998646 7014165 6537636 6914102 6448264 6536681 6488805 6195150 6301173 6197320
10780 6197320 6082834 6101490 5745730 5956720 5642448 5344348 5337251 5262698 5335518 4933550
10770 4933550 4966954 5046027 4921880 4586259 4693110 4764560 4560991 4662832 4634892 4814718
10760 4814718 4549574 4481391 4452671 4435891 4485719 4674318 4403517 4442255 4431050 4332826 4402572
10749 4402572 4430592 4095519 4037947 4048486 4052772 3976025 3763411 3634285 3682573 3736248 3755470
10738 3755470 3728608 3685419 3663512 3848028 3752925 3939778 4283364 3886751 3951448 4049237
10728 4049237 4061931 4161390 4227259 4215018 3946336 3695154 3722985 3649630 3908333 3874072 3701872
10717 3701872 3425685 3577988 3465875 3669889 3557801 3461113 3473920 3800722 3611760 3467734
10707 3467734 3732156 3772270 3727243 3528867 3772529 3473252 3608689 3538373 3376090 3218194
10697 3218194 3418411 3344374 3096867 3131086 3099533 2957754 3069948 3461621 3229699 3010570
10687 3010570 3083757 3258404 3335368 3053123 3139426 3082046 3132335 3241704 3225540 3092976
10677 3092976 3213643 3198136 3163614 2855702 3145779 2612590 2908678 2899247 2758975 2849399
10667 2849399 2862671 2713587 2607067 2632543 2653437 2926554 2567590 2756731 2362854 2490359
10657 2490359 2428081 2773635 2631514 2494310 2537075 2427589 2487872 2682648 2504159 2539996
10647 2539996 2589963 2506384 2561938 2678949 2278083 2270236 2516674 2361762 2081927 2590442
10637 2590442 2230734 2183142 2258316 2121299 2200131 2018527 2389684 2354339 2010655 2142208
10627 2142208 2240972 2235725 2234684 2144435 2162160 2166611 2228364 2225770 2131682 2201145 2302873 2337333
10615 2337333 2190407 2140886 2000146 1984154 1948483 2361574 2169796 2386740 2295368 2298252
10605 2298252 2229495 2031238 2276069 2226418 2151621 2044053 2121413 1955192 2066959 2166862
10595 2166862 2040064 1786451 2212083 2037562 2175511 1828648 2135520 2091949 2031609 1908672
10585 1908672 2209760 1993249 2279057 2238668 2058125 2128796 2017318 2102334 2133120 1930908
10575 1930908 2107512 1966273 1874737 1912481 1771218 1606968 1785240 1845201 2025945 1703191
10565 1703191 1795907 1776861 1566335 1538953 1562145 1678283 1677150 1574464 1695083 1648911 1864431
10554 1864431 1849087 1539330 1553672 1539389 1459234 1572428 1284325 1663970 1559644 1562657
10544 1562657 1483102 1517500 1569512 1506440 1641867 1485426 1654171 1477935 1810697 1697109
10534 1697109 1597712 1736828 1592005 1679000 1778503 1677754 1687274 1920593 1637254 1762765
10524 1762765 1680750 1908421 1897076 1913329 2168442 2087076 2266964 2418056 2466022 2413523
10514 2413523 2464940 2435214 2433624 2175959 2197970 2116018 1854633 1939844 1708423 2108602 2234157
10503 2234157 1975539 2227439 2034323 2112482 1840828 2126804 2129908 2255183 2027394 2380317
10493 2380317 2086059 2355739 2229593 2503456 2415802 2577176 2406415 2479549 2345356 2711819
10483 2711819 2585552 2278087 2323250 2184430 2445896 2225195 2253523 2172577 2172660 2161194 2246047
10472 2246047 2233874 2261966 2368312 2465290 2299425 2328929 2543994 2417757 2758260 2807746
10462 2807746 2616399 2955801 2936895 2863968 2841219 2918923 2913061 3013679 2805191 2945006
10452 2945006 3200718 3023772 2991502 2810138 2734352 2844564 2731431 2529279 2549796 2791688
10442 2791688 2565403 2688154 2769451 2945881 2936375 3169448 3093206 3556775 3251565 3178666
10432 3178666 3260536 3272157 3034833 2646126 2655341 2137990 2254955 2176123 2378428 2139928
10422 2139928 2364012 2524004 2555810 2453132 2558241 2541810 2572201 2366204 2753279 2783303
10412 2783303 2996885 3137948 3432420 3748467 4019617 4134532 4628048 4570681 4948210 5230208
10402 5230208 5098676 5077247 5252885 5411653 5552400 5672080 5991157 6324190 6386581 7095402
10392 7095402 7174212 7303728 7450069 7927880 7677038 7330600 7295711 7406630 7338190 6813403
10382 6813403 6885731 6728540 6787052 6920309 6677425 6596314 6567397 6644799 6914023 6929598
10372 6929598 7008336 7020804 7184687 7059432 6948286 7432837 7708805 7709788 7343680 7238355
10362 7238355 7202789 7191442 6914523 7055814 6759699 6618386 6523826 6061655 5809421 5768033
10352 5768033 5749590 5530931 5499487 5305811 5109458 5084530 4803461 4735187 4601294 4901428
10342 4901428 4733489 4484147 4816191 4522942 4754269 4888158 4729943 4773730 5079951 5066979
10332 5066979 4704805 4864195 4859362 4655900 4642094 4582235 4714788 4730866 4876675 4810284
10322 4810284 4958967 4833004 4973234 4873423 4800017 4906881 4926902 4907161 5123317 5158254
10312 5158254 5133850 5224491 5134153 5433192 5607370 5856167 5514606 5555707 5576840 5752648
10302 5752648 5801436 5752397 5840413 5849019 5953798 5672155 6093223 6171593 6160217 6421414 6719489
10291 6719489 6813650 7521603 7666390 8082404 8434253 8963318 9269308 10126534 10690076 11090233
10281 11090233 11557440 11829138 12648735 13206385 13598086 14290667 14638527 14996851 15500833
10272 15500833 16097802 16250481 16672225 17232900 17909994 18423210 19093682 19623835 20077072
10263 20077072 20702396 21481577 22060495 22693666 23504294 24169476 24912520 25449246 26102194
10254 26102194 26554626 27162731 27520773 27503467 28103657 27912886 27987619 28128667 28233742 28581077
10244 28581077 28512474 28531552 28679905 28513488 28615923 28566470 28130162 27728952 27033536 26320484
10234 26320484 25477082 24636919 23955780 23148245 22463495 22035731 21503254 20773727 20347386
10225 20347386 20180551 19599359 19276820 18693895 18344718 18116141 17628711 17076766 16900717
10216 16900717 16466842 16545754 16145084 15996719 15506154 15193957 14703682 14247418 13771707
10207 13771707 13381366 12629154 11978981 11494688 10611684 10164184 9521329 8922103 8776810
10198 8776810 8397397 7980291 7355977 7167131 6755536 6547869 6446869 6321594 6039934
10189 6039934 5651062 5413585 5428039 5427326 5328659 5009510 5125887 4894956 4755895 4840084
10179 4840084 4854572 4346042 4535887 4355634 4307380 4177723 4259796 4302226 4139048 3852281
10169 3852281 3895759 3865072 3656963 3804165 3891900 3467079 3594983 3355370 3617435 3621792
10159 3621792 3570568 3507955 3630260 3578363 3415205 3570163 3429353 3494063 3098457 3431749
10149 3431749 2909889 3461131 3323545 3179201 3041225 3189134 3258848 3324728 3182545 3034903
10139 3034903 2936729 2983143 3261241 3061886 2851906 3016260 3083067 2725040 3111839 2849591
10129 2849591 2904651 2983606 2836394 2712968 2707672 2792431 2792014 2721077 2547194 2806873 2660039
10118 2660039 2649206 2639961 2567887 2795460 2858261 2762408 2529503 2733064 2612011 2665215 2707337
10107 2707337 2509030 2829407 2527533 2730291 2739825 2786355 2617254 2760082 2683283 2781433
10097 2781433 2694330 2724679 2864954 2819164 2634198 2934006 2631999 2832387 2588009 2757346
10087 2757346 2964347 2742382 2827448 2593786 2869936 2641983 2570016 2580842 2786171 2508390
10077 2508390 2488270 2258523 2586981 2441871 2367350 2373948 2639223 2435268 2360899 2598896
10067 2598896 2655283 2507925 2226165 2510908 2335885 2334343 2500566 2561812 2290775 2501479
10057 2501479 2498607 2544559 2684425 2564391 2329330 2421493 2257016 2440007 2466734 2565930
10047 2565930 2544451 2404257 2339790 2336756 2431315 2174283 2338259 2480312 2352552 2208349
10037 2208349 2274313 2171757 2111738 2428294 1932688 2118367 2158408 2364386 2033098 2146079
10027 2146079 1915905 1922282 1918739 1893801 1748373 1921424 2035546 2074782 1730737 2028014
10017 2028014 1939919 1849558 1874905 1749558 1964368 1979526 2082650 1988848 1759586 1867397
10007 1867397 1752765 2126361 1664070 1834908 1948752 1749641 1732763 1674864 1812573 1810879
9997 1810879 1902080 1591533 1751132 1648143 1742876 1780877 1376924 1844729 1701473 1515918
9987 1515918 1744905 1723186 1463559 1348989 1552104 1510145 1460509 1256718 1335637 1388602
9977 1388602 1585558 1455772 1529752 1300594 1321016 1257019 1504384 1148725 1146422 1235387 1441694
9966 1441694 1266008 994710 1435852 1231610 1473724 1318024 1103822 1104611 1193318 1214652
9956 1214652 1323302 1165921 1255152 1099002 1015134 1185106 1116226 1127404 874310 1124819
9946 1124819 1044080 1043407 1089028 925284 1184797 1118066 1022841 1040790 849594 1207538 904793
9935 904793 887474 847560 780798 834934 1087706 1025648 960321 850992 840847 878883 1027683
9924 1027683 917031 877922 922735 1025557 1061492 761871 772017 827131 853361 1268651 653995
9913 653995 799147 914449 808472 830417 892511 798768 849033 654453 1075796 803048
9903 803048 722010 847068 815055 808680 998715 805814 714717 788302 1033704 835543 944126
9892 944126 966800 791452 815103 881311 691316 984246 772303 794892 857509 776150 736380
9881 736380 685257 1018007 810024 1004144 651701 802607 803623 840488 805585 596429 816412
9870 816412 677983 823648 623093 831878 760822 827902 708167 755076 781541 829823 615934
9859 615934 883147 790142 820267 816859 781205 758844 780458 784503 630138 1020497 944552
9848 944552 707910 775851 758429 754437 621600 783459 843453 859904 734437 757271 916921
9837 916921 1059143 850820 1011109 611134 698399 812554 599097 835843 538649 784418
9827 784418 799114 653195 884521 791320 703502 738847 560256 823365 587672 797231
9817 797231 819772 827799 627489 804495 902447 632110 664141 681960 785086 734522 677527
9806 677527 636650 911823 956383 712518 659959 676743 650363 560139 854508 686333 594159
9795 594159 829040 522102 563890 873861 934617 625578 652353 453295 698539 592524
9785 592524 448814 753835 512921 606276 616032 581173 603037 455741 621990 672543 665586
9774 665586 901644 726596 549430 848701 530906 457657 711091 769755 448575 558910
9764 558910 597771 527005 543137 595617 719134 567443 589396 593073 805668 363806 447091
9753 447091 577317 688097 600926 625920 611174 395307 437006 558432 670820 568822
9743 568822 405163 424954 469185 454084 448038 535063 390057 411430 624599 664974 333102
9732 333102 474283 597134 392587 449399 440732 537091 427377 506270 222307 457672 212404
9720 450121 456477 216335 344175 523512 328020 406249 472701 273739 527208 387896
9710 387896 566797 315536 493970 435200 385767 330647 229721 567270 391026 289426
9700 289426 566118 336649 208094 330782 466762 220866 356245 441592 322786 577049
9690 577049 403650 491974 563995 292883 405432 542826 228717 300070 179885 277894
9680 277894 598590 369855 391296 414372 383080 188428 321105 496621 508336 438741 211263
9668 419351 304718 51066 225914 272703 270575 446654 504460 422784 167540 202541 383100
9657 383100 426046 495522 354299 315993 354823 413188 285406 305000 264887 371486 374825
9646 374825 352520 277320 610203 274509 372317 405909 297159 453164 466638 415174 489183
9635 489183 266694 396028 396192 101481 174885 227023 334931 564162 474552 247290 219838
9624 219838 225332 464159 95725 348746 198218 407664 431374 573663 346488 321509 350487
9613 350487 483465 146579 247635 282267 294060 465477 255862 507922 303037 346136
9603 346136 523942 403077 525707 167565 380255 446520 233899 382297 340701 548202
9593 548202 380001 476792 275645 296152 239716 206456 224772 168998 331136 538444 462341
9582 462341 513846 398771 519787 411182 283337 255519 300265 273148 25709 82423 233252
9571 233252 253121 396316 337184 260437 228402 111806 303770 194841 143614 393858 347616
9560 347616 386995 381997 464642 203322 363790 266768 388437 432842 269305 364701 154354
9548 279901 255923 241582 175110 396458 431159 315949 250597 288737 365413 277653 419249
9537 419249 63494 149799 349091 442958 443684 506852 224940 370069 103777 376392 165751
9525 215807 177226 294140 219093 73095 174570 261872 18536 460394 354703 320235 201756
9514 201756 212291 337031 368995 426468 158911 64134 275931 411923 279755 209206 387652
9503 387652 204201 46704 235454 494706 194335 247046 90651 191467 516554 384014
9493 384014 350637 109691 189001 278501 292495 66566 253547 380110 349281 309642 102200
9481 330738 271881 333272 273232 209066 228937 361804 329664 146577 216833 345600 -14521
9469 312766 183744 258112 372799 208954 626573 306039 298256 123971 106930 234085
9459 234085 179431 242642 278545 317266 197224 171681 42578 108440 207677 -30098 261653
9447 174433 169523 275610 343033 507046 -58988 270472 248523 395058 38208 313931 81811
9435 144786 284252 392802 333737 132167 -26448 -79701 350495 343438 132016 217336 99214
9423 11343 342443 279576 356912 187362 158825 29589 211350 136214 245665 370205 87709
9411 55732 272169 297062 166600 357138 -57013 466259 450613 332933 64570 34341 -58650
9399 98883 328624 136996 64135 267561 235700 177386 279183 42992 164241 98434 331877
9388 331877 355922 261213 271147 140753 232926 308408 106942 114133 387875 14876 85760
9377 85760 -19074 374060 322290 41502 220918 282428 175751 84993 78316 33152 508417
9366 508417 40116 216784 194270 91416 104030 1008 190110 267910 -51928 139226 173046
9355 173046 56566 293516 78510 137385 61953 294911 183288 129790 210716 191491 140500
9344 140500 338589 184943 76378 182753 334875 367986 334139 137441 372255 214440
9334 214440 229847 27575 137843 111795 220652 307032 155327 189896 231213 254437 18554
9322 -9203 177479 458938 212241 55114 254551 335654 358779 252620 142744 -90042 175059
9310 193671 293180 238396 379458 210865 76371 296070 -32391 261658 -50873 421650 340554
9299 340554 148696 -35251 342026 169604 235359 96113 168306 204859 181255 431352 205761
9287 58029 313590 109964 130699 207293 44426 115493 254952 270300 400762 313446 35224
9275 287040 119701 -70403 285456 323976 173872 -35930 113322 135770 234446 169141 -11815
9263 89443 392304 56056 49661 188476 208272 61393 159305 152562 106246 -74266 211579 -106758
9250 39365 313668 195386 174979 130861 264493 47165 23985 573260 184080 355399 105556
9238 228233 78752 222900 215385 -8438 211692 203956 68532 252170 233980 233195 432538 166653
9225 10185 220419 367952 -160389 88821 249989 222434 117840 183095 54347 358948 185223
9214 185223 164757 85697 -65034 157379 210074 101268 62216 185690 305711 346323 74350
9202 269921 -35429 92950 43463 413635 85867 136187 199958 146763 146374 221992 22744 113446
9190 113446 200540 -44546 23437 157276 189142 205257 188062 115613 99391 -54107 -70701
9179 -70701 419555 428496 7989 126003 9955 164543 306094 77409 74313 343953 3713 186295
9167 186295 151030 251282 280435 -151258 424551 48721 168667 184131 54075 267625 218390
9156 218390 261396 17824 140674 89596 201816 323579 365128 281764 104382 128262 452762
9145 452762 160898 282735 392806 173152 50960 227483 412004 100745 132140 124988
9135 124988 325932 81681 402621 169000 13990 201237 34120 184649 292956 228270
9125 228270 90758 156463 -31007 297728 217100 200349 29690 143349 205604 339939 104417
9113 16293 97382 240357 84900 255329 -85489 242280 317376 7328 185977 -59879 291393
9101 475998 129640 187131 213842 248960 392944 321880 187064 431048 231162 207705 103772
9089 219434 205976 283087 112538 266161 354944 60798 144717 425038 333245 254381 278079
9078 278079 297554 176607 261605 318988 223745 58202 373307 199200 111037 185287 117838
9067 117838 74374 216769 194493 108333 435284 302696 340119 7924 218906 151332 261067
9056 261067 172415 241119 130766 17130 380656 247815 111290 317263 93364 18542 245145
9045 245145 161715 417938 145980 67849 224513 230648 386219 223526 178098 -6648 410259
9033 276024 339883 110740 280238 208428 151437 211359 248803 56050 202177 35580 238995
9022 238995 257683 -7260 279629 192848 210154 347990 311879 68053 349644 50310 261327
9011 261327 352557 331723 188660 -89799 566892 158933 55720 272158 262969 96878 -49467
8999 369326 97788 20640 160072 40811 38805 175529 364214 241369 123208 329931 93518
8987 256120 316168 140971 -97973 370264 209606 58371 117778 -80676 433033 220478 353615
8976 353615 134432 260575 296923 229765 140915 128662 -17071 -43217 345122 172799 127571
8965 127571 270714 311974 173691 202487 122445 111727 48952 71240 190775 94820 297052
8954 297052 340887 171651 210239 74731 61346 66568 123475 116060 48158 363707 160499
8942 181359 148684 171180 92870 5108 180190 70706 -27846 114951 297216 216768 179693
8931 179693 367275 186857 129866 207623 367943 269660 203799 353318 162832 311851
8921 311851 260894 357065 18682 318755 322889 255430 226646 340998 152505 292697 371968
8910 371968 -25448 73268 145805 179615 359417 311265 254925 315939 112946 247105 249374
8899 249374 368225 248845 220036 352088 498191 314275 104464 275953 440772 367528
8889 367528 488700 353197 218350 493383 95150 198527 178784 315206 589706 424423
8879 424423 688013 519939 397186 401192 223826 349946 215886 540699 365286 505456
8869 505456 303149 489690 274302 311192 250693 240137 160203 346973 442651 481988 476244
8858 476244 120309 306751 126704 18700 55329 172641 176582 317217 533073 276180
8848 276180 150511 324258 321693 371649 123716 227847 205977 291385 67831 46470 410221
8837 410221 190795 397372 231942 52375 38411 299433 202725 301859 67340 277130 225045
8826 225045 213730 224487 159178 210302 70053 183154 209362 320812 184209 226587 7718
8814 154003 33886 155616 207495 -22094 170540 242104 46071 346534 319473 284265 30326
8802 43962 308004 169822 140882 256310 208652 86822 131206 247642 201350 149111 233645
8791 233645 367831 274347 61814 219149 67708 267905 128388 177213 -17886 172437 34055
8779 201329 20501 293769 47748 177210 464180 390698 126776 95776 268427 220107 21053
8767 308666 -32155 167828 224341 129746 346028 165272 43274 411875 161163 -158288
8756 106645 154783 103464 137279 70677 323997 287951 -157841 -34227 206824 -2922 238559
8744 184588 150951 -51419 -99067 229692 124495 94405 71894 99871 283215 126383 218473
8733 218473 212330 111935 91674 121973 178969 245904 -79019 34067 560221 211886 150180
8722 150180 64056 178950 74645 195155 413446 274040 30720 117439 35221 178861 11152
8710 185752 -73989 -25495 251439 133858 23932 81214 233134 121125 187180 178678 43214
8698 -33202 105281 1160 180669 242162 382743 177654 -3582 -35801 83603 33252 293787
8687 293787 151186 19507 26691 -95060 303769 258330 145575 -28355 200225 233170 -126011
8675 -77234 403973 277989 205960 164248 214444 3449 74633 270134 384436 -57106 266444
8663 89234 -19744 109 -42290 86007 64424 23090 251234 29115 11455 -119701 54749 212987
8651 212987 267786 205966 75993 164929 39566 191903 237401 4411 -9264 64027 -171138 136370
8638 171132 246564 59107 -17610 46598 211428 40355 232094 175965 134858 210932 -131093
8626 432407 27253 -7626 277220 118338 36270 -6575 308602 78125 105525 -87540 -26273
8614 40119 36968 228497 -37956 279426 48700 -20899 39747 9448 69357 -206901 158916
8602 150242 29022 -167909 -29332 24389 48817 104798 8029 243838 91613 31972 273775
8591 273775 19421 177555 122792 259031 101388 241567 12938 205751 -100217 108728
8580 77355 270130 190326 164951 292067 321329 220390 132512 182553 81794 127935 258438
8569 258438 73164 34154 63455 179583 426373 315978 81093 304496 -27811 5713 -63159
8557 195994 156261 364655 91979 57342 242652 34439 12000 187699 -85395 160621 118589
8546 118589 50975 340417 291854 50872 78611 184972 35132 65320 73142 130279 200329
8535 200329 242201 270493 107294 145740 -115040 227172 82342 184754 219535 344183 27736
8523 145398 304139 165153 142801 162580 131074 296940 -125979 229809 40554 -48056 258704
8511 48762 193266 257875 266775 -43697 24648 119618 100522 191411 14971 31445 125055 247339
8499 247339 21158 402469 75371 152929 117071 -52838 252984 140112 147581 8524 96733
8488 96733 160963 63608 210509 205129 -9462 -34664 211531 232770 225139 -3259 11377 64363
8476 64363 70634 121462 125728 53122 208303 74358 278430 99484 54240 91551 209492 -81506
8463 228028 427054 13590 212125 180326 208001 -9787 -118504 -69094 127996 199606 11542
8451 57019 -11953 244079 356329 124882 55156 -12190 -70567 196826 182724 54536 58126
8440 58126 123460 -18961 402338 -149581 129752 224045 -67909 126947 269496 188997 205438
8429 205438 19377 243561 212422 87825 70249 225037 306872 -7146 52545 198079 184158
8418 184158 387301 -190907 116428 194591 62709 -70705 237546 35759 2785 80978 56323
8407 56323 282504 224809 24347 499 -3775 152424 33692 -188024 -4847 -30943 228252 132036
8395 132036 240938 11198 -206199 60024 162356 242016 182335 40539 174042 170187 142244
8384 142244 128394 79046 65919 106612 9471 63517 98678 118552 237875 110258 171581
8373 171581 119164 195825 -47201 180691 66607 154029 156017 305835 309692 309388 -40837 125317
8360 225637 161860 -17345 66106 156396 -31755 24013 119726 102616 -105278 25399 -127836
8348 47306 -4652 235651 176744 156587 -6297 315745 144487 24715 279058 264294 -21684
8336 259996 99937 174812 -175594 78297 400288 186846 65229 140490 -103178 17127 -168673
8324 49172 -80349 121104 17959 20329 374549 105710 74535 149754 61746 184058 223162
8313 223162 61698 -112053 -15973 156247 -45463 21882 106878 17387 77561 148110 75282
8302 75282 141210 37894 169325 -180787 16057 216642 122311 -33419 5133 123056 -252238
8290 264227 144004 205165 264502 -160058 25417 -85766 20404 269106 -99697 323242 -58736
8278 207522 143181 18018 23142 25282 78763 24740 -51818 119497 245885 79250 142373 -164729
8265 337636 350384 172109 134532 117725 233193 205830 73889 138021 38823 -130727 -162304
8254 -162304 66324 122990 186771 242848 224527 -71080 40299 91064 131965 -48356 41435 -13024
8241 49722 44316 -38723 34897 43799 20691 52461 236641 28651 -12970 3557 -5990 126889
8228 161800 58942 -50843 78075 32023 287782 214635 17955 53914 46981 160674 207714
8217 207714 59477 -10872 50143 31740 95491 188421 30214 146609 104510 139551 -22869
8205 -31111 57530 12131 -7171 -13314 50715 29414 123112 313025 151909 74217 -59603 76288
8192 75850 190111 119370 -188294 65323 122405 -3376 20620 -92081 177514 -131464 38974
8180 148227 -25565 -19911 -98519 134445 96026 -34412 111670 349959 196608 37983 147383
8169 147383 100572 -1595 96509 80638 237217 109319 42692 82118 226679 106904 238421
8158 238421 97660 249595 -40087 366514 95321 133192 166748 8090 -81833 43898 -44835
8146 230998 123279 -12618 62263 -97512 175198 -84306 232977 12435 102390 108809 149656
8135 149656 177355 11077 -42416 145345 280124 216944 140475 71901 -91540 -63186 155727
8123 62596 108892 182711 128382 158134 68031 139514 -110882 287694 35110 213076 143933
8112 143933 253833 347877 -108872 66599 98570 190013 265745 25114 305531 -189658 -51339
8100 154851 -38090 113227 17687 72524 17943 235828 -84453 39515 253132 91986 -3015
8088 -81095 31325 147801 52289 108084 97784 2240 -28835 66915 170809 111933 -145278
8076 118719 284232 28695 -58172 266832 -13900 49277 112093 81355 226950 -19379 34528
8064 -119922 63972 82485 99692 211883 225234 37162 28743 26650 71536 -42952 222535 40779
8051 240823 118762 249068 137374 -49577 83671 -20051 208873 63466 131012 88919 115179
8040 115179 -20130 -85745 36568 -5342 -17431 274884 183623 32225 -18088 128052 -9935 -224046
8028 -224046 -111313 135456 -189938 141710 10383 257852 72275 -276172 281531 41343
8017 143918 116716 59571 319217 234127 -62010 216961 202323 -109859 28530 120741 151658
8006 151658 34953 71183 65405 -60981 165882 118310 209278 221110 63895 -112749 142249
7994 33844 9317 375929 38891 260645 293924 75 37561 53305 10334 138003 133874 318989
7982 318989 200556 289387 169043 -80816 -72848 -176303 158679 -2249 -15702 87530 289059
7971 289059 142859 -72635 13511 125858 63298 168759 178978 247988 -10946 170248 224305
7960 224305 171054 79161 129483 139492 322143 212206 169354 92296 137478 218391 112795
7949 112795 -24496 85257 155943 -72702 123932 263747 166697 -19484 -42325 56068 204698
7938 204698 -116349 55142 233514 -82423 147596 -18906 251114 32879 127450 124519 -877
7926 114561 -54488 306920 109426 -25687 56378 -24107 198133 175795 -63546 8872 74242
7915 74242 16117 -56593 -80924 35762 30936 172982 231634 -453 120062 93767 92039 24435
7902 -23464 173624 190190 -27341 109045 272613 240539 -23022 185122 97815 7848 143955
7891 143955 -34923 93316 -275957 268901 218681 -71539 174623 -117645 191416 284891 -30541
7879 154124 -75136 -69199 -100481 140182 87165 125142 -60446 323526 142522 -171129 274625
7867 175603 137471 34751 151822 163917 172579 59010 -25142 -83763 132862 34429 57041
7856 57041 -212808 1255 69207 59832 1630 188099 -126114 169336 219190 321153 -186816
7844 221761 96899 27815 1856 -5389 67960 184221 104396 59914 230793 68443 189872
7833 189872 -67788 -92865 118803 -21743 -29800 173126 209564 -9119 -219781 183668 243674
7822 243674 -18444 91699 44277 62732 193362 173829 -3137 -23012 -5978 -139598 56146 139461
7810 139461 -79698 18515 75139 66276 46462 164705 -63751 90594 67984 127562 205652 -109548
7797 133155 65544 159112 55657 -166528 45567 21652 126387 -152786 136294 227098 70579
7785 196326 54724 136591 208595 -92815 -121239 17979 68040 311000 75154 -209534 -37319
7773 150273 330497 28241 211936 28619 253932 172484 158129 264167 -171590 14070 180483
7762 180483 139004 214056 114464 108277 40965 41522 92056 159408 -11942 275471 -29255 -89737
7750 -89737 326453 -31933 -56892 -179098 212667 99424 217178 66272 -26780 55271 190705
7739 190705 262171 216226 86650 21504 168524 202495 107307 -324 222111 -107547 9318 -83950
7726 16731 97336 3506 20099 45385 121177 -83065 -201704 -10890 125603 158612 134356 14394
7713 92274 57832 94437 86217 353619 -10357 55342 182995 7595 150244 1928 20455 243966
7701 243966 -38680 -108293 120556 153677 52888 180634 181222 -91334 -109568 185296 244491
7690 244491 -19862 116670 121577 118770 -42624 205924 98193 227517 257064 181829 43535
7678 152863 46151 223128 92401 -3574 220503 78968 -55694 167280 69225 95702 -145987
7666 112515 -51209 142171 202163 126077 248738 169165 54049 24470 44965 -71936 192272
7654 307 -222804 9619 66469 114007 16916 291311 -140024 133776 153521 2556 246061 -67219
7641 300185 10973 82858 129194 40470 7331 177111 -28141 -166044 -56955 -142280 92653
7629 -132471 116444 30925 21345 61398 103302 -130943 91445 -31483 80650 186418 -149680
7617 200807 34384 91085 242713 -76887 52486 149241 108036 -55250 8914 119654 84070
7606 84070 -90595 118421 279894 78617 80709 165515 57444 21126 180493 75774 60767
7595 60767 -72079 98930 222356 -2468 88598 187618 155904 176120 -213858 81941 72418 -22655
7582 156782 -95530 -3747 -91377 -128173 25749 -82046 189221 64339 49565 97172 -177047
7570 60595 47106 137338 -37640 233869 187013 -158712 10160 140650 97889 -29239 68595
7558 37429 -79376 69411 -21651 163137 24611 61078 143469 -7011 -34206 -62733 153404 213990
7546 213990 128192 179645 -50406 -62447 86519 -43334 48834 -42692 20341 12397 265505 -35945
7533 -39659 -30828 50930 745 -77077 198156 63875 -37570 179029 84316 -25077 44680 194855
7521 194855 221522 50196 28921 107337 137462 93603 114285 118314 -95520 171430 49151 52548
7509 52548 -28014 154354 -37932 122312 -96117 328338 -18804 86131 76508 -97950 -15151
7497 22874 108875 366820 58833 176429 255569 40399 -66774 184260 105622 291051 64765
7485 86852 11619 82265 124980 -106886 295981 202621 154514 186034 93145 133376 207154
7474 207154 -87991 -1195 -8846 101894 -75943 -67042 -105890 64744 -32215 -36995 -10963 285395
7461 46232 13107 -83243 -87573 244430 381582 -13720 -59568 196575 325752 207523 -61372
7449 22363 -47526 99429 119447 103189 31517 -3434 122047 -31835 -7590 -55614 -1858 67593
7436 35322 141451 141594 67362 167021 137286 164072 171230 -29156 217583 94281 98859 -31030
7423 35728 45674 208424 -17805 73531 55602 -104692 -84507 -49176 -3603 173216 282804
7412 282804 -53576 -2892 -130903 30034 52100 -9154 80001 -22124 -271020 -116786 167654
7400 35638 14345 177598 203803 -200575 -118038 52937 248394 48250 151948 89702 -3903
7388 5296 144979 117209 319978 83190 91346 -135237 79405 265654 89807 322987 166924
7377 166924 -25142 191144 -21764 -34572 91091 119289 -98669 61679 -37398 -69441 34598
7365 -59316 -56833 4839 287791 5860 69197 -11911 -155695 128515 -53121 73775 -114054 136073
7352 73525 -31007 -9769 24193 112871 140362 -2140 29880 35460 -38400 164056 152192 -26933
7339 -23417 -7866 197733 9732 92836 -69071 79031 22261 14178 104591 63467 74905 109801
7327 109801 -113346 124053 8076 13338 72987 38920 80953 205619 29358 -25019 115497
7315 97718 60843 185793 171131 83733 42908 -59261 48793 -83281 -65672 146851 50077
7303 195346 -164521 -10416 -33013 18077 94497 15441 85904 -7572 50173 90154 81756 217588
7291 217588 213506 100625 -6253 21125 1740 -170617 105560 188990 4352 208807 153492 -69308
7278 16405 82472 180733 -51947 59864 173607 -41010 38965 -175955 -111446 215502 -50975
7266 124693 24163 -187587 21886 121432 234815 -143056 115718 -29899 103179 18983 183665
7255 183665 -220810 24107 -11547 117099 236628 101520 -30628 145850 7471 75340 -57682
7243 -210565 65981 30688 -76377 -16992 121227 -65506 44602 138091 143158 274273 210193
7232 210193 29547 -20931 135351 -25446 -29060 -76045 90281 33712 22451 150793 64369
7220 120334 160270 281864 -142055 230344 -211183 -30227 -24912 -15537 74985 195692 116210
7209 116210 202058 4699 317678 84871 40479 158698 150551 12869 142467 -10336 -105506
7198 -105506 43845 360509 -49841 -99125 -11673 -42165 239631 15703 -104443 -143766 -12436
7186 234143 141853 187397 299016 -150689 197654 153330 86866 206027 -111062 -74654 -58379
7175 -58379 144018 223971 59202 268418 163577 139524 80337 34599 83277 59068 64828
7164 64828 -20551 -203041 -123014 145089 119371 -14158 -69079 53566 98142 115597 -129331
7152 102812 -26879 12274 -26770 43861 -62434 20098 -66682 -21673 28398 182171 16251
7140 -44297 -146494 126623 40331 103929 58326 239466 -55534 39697 257355 200574 99766
7128 131817 -86915 -71757 94165 -61673 7142 54014 -5734 38015 -27219 105143 31018 -87910
7115 406195 180592 -181544 -10944 11820 263686 181278 90567 69375 34162 -182435 -57142
7103 -33528 45833 242778 96119 32720 -152506 34402 251021 194309 -9964 92915 30088
7091 -137939 -41910 221868 -115761 194670 169467 94117 143442 162320 42733 161803 141939
7080 141939 132035 70019 -192648 18536 157450 137441 -38678 128734 26282 -41580 218188
7068 -20707 -94156 113391 177840 929 -65204 -156367 -20429 -10281 371630 258070 27218 -70389
7055 267034 -13071 287919 177292 136266 126787 276106 9251 120382 41496 -126914 131564
7043 172753 95334 97725 112202 230920 -82722 190839 -17645 132193 180641 203131 136778
7032 136778 125888 -68634 -80388 -202928 99964 72813 -16234 259665 -208772 7446 57128
7021 57128 20861 -10492 296500 -178495 -14317 -19562 290651 106333 -53874 6325 62202
7010 62202 60805 273607 -60682 89691 186518 -150059 124030 -176697 165256 -12744 -60266
6999 -60266 186580 53755 -24408 -130996 -117079 -4630 18184 121346 -125741 143639 -144176
6987 -112417 132321 190746 37894 143225 124726 -33971 235810 -57599 -8986 154628 -40925
6975 52856 -1708 -111963 84001 -39660 11447 184486 48645 7184 -85689 42450 119113 101950
6963 101950 311024 1884 101424 -209361 23190 77838 64692 81464 139161 -10640 196239
6951 -53168 7617 222899 3518 95534 68422 137561 -18466 -27962 -51795 65284 85104 21889
6938 227900 -112596 -181908 22859 143629 24363 187010 -3649 -138161 -63835 1946 45102
6927 45102 160417 82912 -64076 -68579 15511 87203 168978 128613 106170 142808 -45831 -210420
6915 -210420 12586 105036 -6686 -83687 57318 215642 -133456 31289 324570 61467 -30413
6903 177031 186748 -106758 77638 -38921 249422 -57177 -24465 5385 -18429 182742 79399
6891 70108 -48770 123574 118030 114349 144654 116067 17729 88102 -9804 -148614 138097 163573
6879 163573 87701 -62942 -1789 -212621 27386 -19957 -120567 223254 77638 -86347 -70952
6868 -70952 105773 292231 11941 176020 48468 270964 150339 14651 108292 57499 25179
6856 148221 87717 -65208 245054 -133096 186304 85208 166943 75043 145293 93146 -170268
6844 -49048 77318 244842 80431 19403 40464 7848 62796 84269 149453 -116512 353339
6832 -216173 -43978 82241 230944 110070 -49468 -7226 75492 132207 5555 101950 17772 286269
6820 286269 163574 -17094 -158173 99410 170594 57687 62601 378398 -85319 90659 -28385
6808 -27631 161804 147053 -192093 -28817 -111819 61144 52934 66518 370623 210390 -150063
6796 10866 30342 148834 -214606 17016 187608 177261 108685 -29862 75249 149839 32416
6784 -137644 -98251 -8123 53436 -85006 -118988 131387 95896 124998 162459 -90472 -31608 20959
6771 132316 115593 -112209 114595 195413 -28651 -321666 -146539 61789 133636 150561 -22376
6759 128613 228260 10854 274939 -55468 -116924 -73945 114823 27447 -64227 -61332 245883
6747 -18113 -32171 30193 68510 -24929 -13621 82730 51985 206717 21062 -50442 -11256 27154
6734 164965 179851 139135 -193173 2359 167224 224490 -90460 73403 -85169 131543 -13751
6722 136887 41293 165594 167876 -48723 -50712 89980 23872 75854 102448 -89215 97325 -37738
6709 -196909 240214 72152 65682 17159 140415 46061 21595 103848 313937 112263 114252
6698 114252 345167 -62640 37414 -2963 -154320 119974 -117507 10299 -154120 59570 176954
6687 176954 64993 -92556 15461 -109212 -18646 127795 70619 34604 291277 78406 251509
6676 251509 -26311 -147600 108393 -129407 18098 124386 136332 45096 -69938 -54889 127268
6664 203512 295981 132965 -97375 -117478 46173 -40908 -38214 97065 -83704 71990 70500 29390
6651 65732 -80051 25099 125127 -34256 107169 -28233 128738 74581 -76383 -12747 174864
6639 145725 155425 -116026 122302 48034 -196323 -41151 -197579 130608 93236 48625 64577
6628 64577 -56235 35026 -62043 123003 267570 -151304 -57914 146722 -4571 -21013 188932
6616 154783 -133734 92397 91261 173673 214953 143774 -43212 -64715 -41586 90327 108650 26799
6603 -4487 238622 34335 -97313 -57969 58377 28472 76562 4691 155484 -21645 100960 46851
6590 144087 -46600 233672 126404 68709 14050 166588 141151 159928 15360 154480 75779
6578 133194 46748 143729 -288569 47308 88878 324134 -2479 32161 132155 140029 22830 -129247
6565 -49216 172567 69637 -149024 30411 -31385 106027 -15111 161161 120813 30084 -174155
6553 -43620 22817 51163 -34053 -75352 -93951 144309 35435 -156039 116277 16216 35941
6542 35941 121081 68545 9747 247528 -29158 215076 -4912 44619 53236 268071 144616 162950
6530 162950 -33344 -173205 83558 -53936 -31727 293106 103509 -2692 40893 112393 108627
6519 108627 92914 47820 65070 -211203 34384 -152110 266677 130151 -61392 -104201 46039
6507 179132 167326 165947 152871 129713 12613 29943 -13362 -84819 8057 320309 -29856 40434
6494 -3848 127382 352702 9436 6061 117571 114941 55805 119430 -10163 -145451 70811 53942
6482 53942 92369 274350 138154 119358 -49524 76822 50963 86398 -31990 -44131 132497
6470 -107083 309291 -83661 327415 46346 57000 -207556 17069 96264 221583 200047 159702
6459 159702 -147184 20177 43272 6941 181254 15085 76505 21315 97808 -65910 162275
6447 297790 16282 202079 35439 175550 91422 11439 -5692 -161920 110613 -249353 32421
6435 -114168 -10005 208125 7110 -119027 31333 -38191 -70800 -293922 80830 7138 53105
6424 53105 156472 51895 -47741 -82472 -19702 -137318 166301 180533 -127822 -12514 173848
6412 -55149 12374 29588 203810 277705 -102345 310242 -38706 55199 209160 155695 -252686
6400 32174 45556 -37249 74638 144694 188675 142017 -37077 61367 22987 -116021 123806
6388 232983 -31014 -13552 -80705 -3363 39191 238001 -22131 -1016 37342 70842 -83137 35441
6375 86186 130973 91667 74155 -24670 139374 -6155 182867 87141 303813 136489 190789
6364 190789 44952 294641 80078 298089 35935 -28570 -57381 -47120 247741 40435 179163
6353 179163 -38929 73354 -116646 76466 834 83925 143244 57395 10250 187203 -124895
6341 216258 34096 -59600 184714 71015 144140 27721 32863 -27886 141552 30940 159515
6330 159515 269696 218214 -115068 -3139 137972 -49511 -137307 54472 101448 -264541 69653
6318 52236 -34974 91520 108944 189613 89861 29616 223363 82785 109649 -85277 143674
6306 200970 -24545 115586 83655 -28084 -201620 -514 -7701 -165020 150580 276842 155180
6295 155180 -11064 -22412 -124831 23078 -64091 127631 -238206 6446 -32317 -39920 487 165575
6283 165575 221991 -79975 828 318824 139209 84241 73642 -125620 101708 348497 33883
6271 63152 -7282 74857 42552 -72467 45864 46944 13803 -20037 228329 -124975 85717 181864
6259 181864 104027 -18627 67 30639 54820 165220 147615 212255 52843 241397 -57929 -60941
6247 -60941 -8986 246027 202860 14661 183266 -379 6423 -24821 34985 -59959 102240 147850
6235 147850 183338 -38257 -85209 -34238 -33327 25137 218994 133162 448235 192131 54246
6223 -24429 45387 87698 65745 25750 -63450 69663 60284 242809 -132558 256054 34653
6211 -41346 -218177 60168 19161 23391 57850 -24837 -49501 -134508 30601 78800 66151 88649
6199 88649 8300 125050 97625 -75442 -46459 264772 133914 -2122 -206652 105061 354671
6188 354671 266597 36671 -39475 202807 59279 -49210 -108803 69096 164062 -159694 71567
6176 23031 51244 -57004 -22654 -164346 29286 -91026 -62586 -35596 71721 70932 107813 240203
6164 240203 30153 133337 -12945 -171522 -63284 297792 245402 139028 207897 -14238 103730
6152 171202 -86502 -119961 99898 81051 223413 102360 12471 149422 -87918 143548 146302
6141 146302 -3688 -4947 31333 -16777 -67224 -136015 178001 17185 207070 118908 234745
6130 234745 111951 -240613 -110412 24056 -77436 -40076 53309 118464 159099 -25812 197859
6118 135284 53018 5966 -33975 137840 -19421 -19339 252873 152429 -47215 316878 -193957
6106 120462 141876 153067 -12592 208009 104292 -156335 -59707 2875 81880 138281 135139
6095 135139 -103600 -129766 304514 -24304 -86617 -105249 301276 -10092 353316 53043 -174652
6083 -69156 -112455 -156194 14360 53387 -8232 -236200 -14462 209975 311552 -158071 -26266
$$ [...]
##END NTUPLES=NMR SPECTRUM
##END=
