
##TITLE=AC1001_LAOS_6278554_7pEHoew2PJ
##JCAMPDX= 6.0         $$ Bruker NMR JCAMP-DX V2.0
##DATA TYPE= NMR SPECTRUM
##DATA CLASS= NTUPLES
##ORIGIN= BRUKER
##OWNER= Administrator
$$ 1.72 TOPSPIN		Version 2.1
$$ 2012-06-03 15:20:58.437 -0500  Administrator@TOPSPIN
$$ Compression mode = diff/dup
##.OBSERVE FREQUENCY= 400.13188235
##.OBSERVE NUCLEUS= ^1H
##.ACQUISITION MODE= SIMULTANEOUS (DQD)
##.ACQUISITION SCHEME= undefined
##.AVERAGES= 8
##.DIGITISER RES= 22
##SPECTROMETER/DATA SYSTEM= spect
##.PULSE SEQUENCE= zg30
##.SOLVENT NAME= COFFEE_meoh
##.SHIFT REFERENCE= INTERNAL, COFFEE_meoh, 1, 14.98061
##AUDIT TRAIL= $$ (NUMBER, WHEN, WHO, WHERE, PROCESS, VERSION, WHAT)
$$ ##TITLE= Audit trail, TOPSPIN		Version 2.1
$$ ##JCAMPDX= 5.01
$$ ##ORIGIN= Bruker BioSpin GmbH
$$ ##OWNER= Administrator
$$ $$ C:\Bruker\TOPSPIN/data/COFFEE/nmr/AC1001_LAOS_6278554_7pEHoew2PJ/10/pdata/1/auditp.txt
$$ ##AUDIT TRAIL=  $$ (NUMBER, WHEN, WHO, WHERE, PROCESS, VERSION, WHAT)
(   1,<2012-06-03 15:20:50.312 -0500>,<Administrator>,<TOPSPIN>,<go>,<TOPSPIN 2.1>,
      <created by zg
	started at 2012-06-03 15:19:43.828 -0500,
	POWCHK enabled, PULCHK disabled,
       configuration hash MD5:
       D5 CA 7A 23 FE 6B EE E2 50 67 74 61 24 F7 5E 3B
       data hash MD5: 64K
       9B 84 CC E8 F6 7C 5C C8 AA B8 60 C2 21 AE 0F AE>)
(   2,<2012-06-03 15:20:54.234 -0500>,<Administrator>,<TOPSPIN>,<proc1d>,<TOPSPIN 2.1>,
      <Start of raw data processing
       efp LB = 0 FT_mod = 6 PKNL = 1 PHC0 = 0 PHC1 = 0 SI = 32K 
       data hash MD5: 32K
       6C 11 00 35 E3 1A 80 0A 64 10 E0 5C 86 C2 36 0D>)
(   3,<2012-06-03 15:20:54.625 -0500>,<Administrator>,<TOPSPIN>,<proc1d>,<TOPSPIN 2.1>,
      <pk PHC0 = 209.8279 PHC1 = 0 
       data hash MD5: 32K
       E6 A0 28 C3 43 3F 0B 8D 62 55 B4 88 A9 52 C6 4E>)
(   4,<2012-06-03 15:20:54.687 -0500>,<Administrator>,<TOPSPIN>,<proc1d>,<TOPSPIN 2.1>,
      <abs ABSG = 1 
       data hash MD5: 32K
       79 8D BA BA 6A 29 86 5F 01 55 C3 89 D4 68 9B 44>)
(   5,<2012-06-03 15:20:54.703 -0500>,<Administrator>,<TOPSPIN>,<proc1d>,<TOPSPIN 2.1>,
      <abs ABSG = 2 
       data hash MD5: 32K
       E4 FB D5 E0 9D E4 F5 5D 85 D2 40 2A 37 AD 6B C8>)
(   6,<2012-06-03 15:20:54.734 -0500>,<Administrator>,<TOPSPIN>,<proc1d>,<TOPSPIN 2.1>,
      <abs ABSG = 3 
       data hash MD5: 32K
       53 A3 18 49 81 AA F3 59 94 5F 89 34 13 71 EB D9>)
(   7,<2012-06-03 15:20:54.765 -0500>,<Administrator>,<TOPSPIN>,<proc1d>,<TOPSPIN 2.1>,
      <abs ABSG = 4 
       data hash MD5: 32K
       52 06 6D 1E 87 56 9D B7 8E 4B 60 33 CB 51 94 74>)
(   8,<2012-06-03 15:20:54.796 -0500>,<Administrator>,<TOPSPIN>,<proc1d>,<TOPSPIN 2.1>,
      <abs ABSG = 5 
       data hash MD5: 32K
       E4 69 3D 49 60 56 03 C8 9E 28 0C 11 50 32 69 2A>)
$$ ##END=
$$ 
$$ $$ hash MD5
$$ $$ F3 18 0D 33 F5 17 7C FB 1B 49 99 CC 00 15 EA FF
##$RELAX= 
##$RELAX= 
##$RELAX= 
##$RELAX= 
##$RELAX= 
##$RELAX= 
##$RELAX= 
$$ Bruker specific parameters
$$ --------------------------
$$ [...]
##$TP= (0..7)
150 150 150 150 150 150 150 150
##$TP07= 0
##$TPNAME0= <>
##$TPNAME1= <>
##$TPNAME2= <>
##$TPNAME3= <>
##$TPNAME4= <>
##$TPNAME5= <>
##$TPNAME6= <>
##$TPNAME7= <>
##$TPOAL= (0..7)
0.5 0.5 0.5 0.5 0.5 0.5 0.5 0.5
##$TPOFFS= (0..7)
0 0 0 0 0 0 0 0
##$TUNHIN= 0
##$TUNHOUT= 0
##$TUNXOUT= 0
##$USERA1= <user>
##$USERA2= <user>
##$USERA3= <user>
##$USERA4= <user>
##$USERA5= <user>
##$V9= 5
##$VALIST= <valist>
##$VCLIST= <CCCCCCCCCCCCCCC>
##$VD= 0
##$VDLIST= <DDDDDDDDDDDDDDD>
##$VPLIST= <PPPPPPPPPPPPPPP>
##$VTLIST= <TTTTTTTTTTTTTTT>
##$WBST= 2048
##$WBSW= 25
##$XGAIN= (0..3)
0 0 0 0
##$XL= 0
##$YL= 0
##$YMAX_a= 505467
##$YMIN_a= -612613
##$ZGOPTNS= <>
##$ZL1= 120
##$ZL2= 120
##$ZL3= 120
##$ZL4= 120
##$ABSF1= 14.98061
##$ABSF2= -5.57192
##$ABSG= 5
##$ABSL= 3
##$ALPHA= 0
##$AQORDER= 0
##$ASSFAC= 0
##$ASSFACI= 0
##$ASSFACX= 0
##$ASSWID= 0
##$AUNMP= <proc_prof1d_extract_pilot.lims>
##$AXLEFT= 0
##$AXNAME= <>
##$AXNUC= <1H>
##$AXRIGHT= 0
##$AXTYPE= 0
##$AXUNIT= <>
##$AZFE= 0.1
##$AZFW= 0.1
##$BCFW= 0
##$BC_mod= 0
##$BYTORDP= 0
##$COROFFS= 0
##$CY= 15
##$DATMOD= 1
##$DC= 0
##$DFILT= <>
##$DTYPP= 0
##$F1P= 0
##$F2P= 0
##$FCOR= 0.5
##$FTSIZE= 32768
##$FT_mod= 6
##$GAMMA= 0
##$GB= 0
##$INTBC= 1
##$INTSCL= 1
##$ISEN= 128
##$LB= 0
##$LEV0= 0
##$LPBIN= 0
##$MAXI= 10000
##$MC2= 0
##$MEAN= 0
##$ME_mod= 0
##$MI= 0
##$NCOEF= 0
##$NC_proc= -8
##$NLEV= 6
##$NOISF1= 0
##$NOISF2= 0
##$NSP= 0
##$NTH_PI= 0
##$NZP= 0
##$OFFSET= 14.98061
##$PC= 1
##$PHC0= 209.8279
##$PHC1= 0
##$PH_mod= 1
##$PKNL= yes
##$PPARMOD= 0
##$PPDIAG= 0
##$PPIPTYP= 0
##$PPMPNUM= 2147483647
##$PPRESOL= 1
##$PSCAL= 4
##$PSIGN= 0
##$PYNMP= <proc.py>
##$REVERSE= no
##$SF= 400.13
##$SI= 32768
##$SIGF1= 0
##$SIGF2= 0
##$SINO= 400
##$SIOLD= 32768
##$SPECTYP= <>
##$SREGLST= <1H.CDCl3>
##$SSB= 0
##$STSI= 32768
##$STSR= 0
##$SW_p= 8223.68421052632
##$SYMM= 0
##$S_DEV= 0
##$TDeff= 65536
##$TDoff= 0
##$TI= <>
##$TILT= no
##$TM1= 0
##$TM2= 0
##$TOPLEV= 0
##$USERP1= <user>
##$USERP2= <user>
##$USERP3= <user>
##$USERP4= <user>
##$USERP5= <user>
##$WDW= 1
##$XDIM= 32768
##$YMAX_p= 460461956
##$YMIN_p= -693019
##$CURPLOT= <Network HP LaserJet P1505>
##$CURPRIN= <$Network HP LaserJet P1505>
##$DFORMAT= <normdp>
##$LAYOUT= <+/1D_H.xwp>
##$LFORMAT= <normlp>
##$PFORMAT= <normpl>
##$SURQMSG= 1
$$ End of Bruker specific parameters
$$ ---------------------------------
##NTUPLES= NMR SPECTRUM
##VAR_NAME=  FREQUENCY,     SPECTRUM/REAL,   SPECTRUM/IMAG
##SYMBOL=    X,             R,               I
##VAR_TYPE=  INDEPENDENT,   DEPENDENT,       DEPENDENT
##VAR_FORM=  AFFN,          ASDF,            ASDF
##VAR_DIM=   32768,         32768,           32768
##UNITS=     HZ,            ARBITRARY UNITS, ARBITRARY UNITS
##FACTOR=    0.250966925370066, 1,           1
##FIRST=     8223.43324360095, 24985,        -62011
##LAST=      0,             -1320,           -50638
##MIN=       0,             -693019,         0
##MAX=       8223.43324360095, 460461956,    0
$$ Real data points
##PAGE= N=1
##DATA TABLE= (X++(R..R)), XYDATA
$$ [...]
$$ plain form
19528 -186068 194454 90579 6185 -29759 -281373 191167 -245791 -53391 -42828 11047 22579
19517 22579 -182376 -267101 55672 -345828 -127685 153222 89985 -53712 -220173 -80762 65764
19505 188322 -190030 116348 -9588 -59195 -99228 -78468 174034 -181436 -46731 -248814 -176078
19494 -176078 55127 235520 -22145 -281376 -223576 -213456 -62756 15466 -31975 205337 -84504
19482 4111 -120746 19983 119870 -34113 -6583 62040 -281819 -285705 -251093 -277039 17574 98224
19470 98224 97276 135683 -335831 -158414 -97890 -94431 13424 72021 -151276 -96888 -141362 305950
19457 -140191 -137298 68135 -335295 -206799 -187519 380806 64822 34195 -227676 -174281 331209
19445 -111719 185909 10542 -306598 -72198 -228091 -119449 -71047 -75782 -182878 85848 86813
$$ packed form
19528a86068A94454I0579F185b9759k51614A91167b45791e3391J0563A1047J1532
19517B2579a82376q4725E5672c45828a27685A53222o3237e3712j66461h0762F5764
19505A88322a90030A16348i588m9607m0033K0760A74034a81436d6731k02083P2736
19494a76078E5127J80393b2145k59231N7800J0120f2756A5466c1975B05337h4504
19482D111a20746A9983R9887c4113f583F2040b81819l886L4612k5946A7574Q0650
19470I8224r48L8407c35831a58414O0524L459A3424N8597a51276N4388m4474C05950
19457a40191K893F8135c35295J28496J9280C80806F4822l0627b27676N3395C31209
19445a11719A85909A0542c06598g2198j55893J08642M8402m735j07096H5848R65
$$ plain form
19434 86813 223096 21055 222313 89928 137153 -196982 -527722 -54222 -261942 -111006
19423 -109596 -264749 -38328 -21780 -46522 -3277 60321 182003 308460 -243598 -98064 3838
19411 76210 226118 -178761 79068 -4461 -5291 277831 -244068 -231645 -103075 176803 -149024
19399 172629 5421 -132811 -164312 21958 -27853 -95318 -290147 -135417 -288699 364040 85811
19387 -67161 -83099 270977 -34350 -259066 -28405 -176753 321364 42040 -17127 -207582 -190280
19376 -190280 170954 -14552 -41761 -97960 -274596 198974 -184317 137943 -218949 -150127
19366 -150127 -31035 -69481 -165906 88604 -56322 -159564 -83202 -63801 -93080 -214447 -61096
19354 -168923 40720 267559 10695 129748 -80656 -242311 182258 -228392 305234 -80844
$$ packed form
19434H6813J36283B1055K01258H9928M7225a96982l30740e4222k07720a11006
19423a09596j55153c8328J6548k4742c277F0321J21682J26457b43598i8064C838
19411G6210J49908a78761G9068d461q30B77831b44068J2423a03075A76803a49024
19399A72629E421a32811l1501B1958b7853o7465j94829a35417j53282C64040H5811
19387f7161j5938B70977c4350k24716b8405j48348C21364D2040a7127j90455J7302
19376a90280A70954a4552k7209n6199j76636A98974a84317A37943b18949O8822
19366a50127c1035l8446r6425H8604e6322j03242P6362J9401k9279j21367f1096
19354a68923D0720K26839A0695J19053h0656j61655A82258b28392C05234h0844
$$ plain form
19343 52462 285486 -92805 -984 31872 -11748 -188672 -112638 -59380 38909 -284482 -113671
19331 -241295 -112433 -110795 1434 3840 -461134 -136702 -219107 126660 -119106 44700 -88623
19319 -150561 163608 38899 -378156 -249794 -208969 -302376 -82934 216727 8986 -167825 -188791
19308 -188791 -58001 3713 -85311 29054 -51516 161599 -100211 257853 175119 59096 106994
19297 106994 103609 215495 -251721 -223699 168114 -95554 114784 9551 -312182 -251175 -129827
19286 -129827 -64086 -374435 -280610 -122592 -47829 23311 161344 46408 -163641 177461
19275 246870 99383 24077 -239917 -479044 14352 -186783 184483 -77254 -122488 262315
19264 167930 -19898 -246358 -350378 153937 69558 223927 -154364 178658 -10919 -157340
$$ packed form
19343E2462K33024i2805i84C1872a1748j76924P6034N3258C8909b84482a13671
19331b41295a12433J638A434K406d61134a36702q2405A26660a19106D4700h8623
19319a50561A63608C8899c78156J28362M0825r3407h2934B16727H986a67825k0966
19308a88791e8001C713h5311B9054e1516A61599a00211B57853q2734E9096M7898
19297A06994l385J11886b51721K8022A68114i5554A14784I551c12182O1007J21348
19286a29827f4086l10349R3825a22592d7829B3311J38033D6408a63641A77461
19275B46870I9383B4077b39917k39127A4352a86783A84483g7254m5234B62315
19264A67930a9898k26460j04020A53937F9558J54369a54364A78658a0919j46421
$$ plain form
19254 -157340 -99843 300162 154631 -217139 156920 -142154 -165875 59281 -228346 -108028
19243 58206 296503 -225245 184863 282237 -180516 34317 117662 -115416 87720 -243160
19232 -168721 -160603 -76403 102780 -118094 -176880 -98697 -45721 -4759 35667 -31888 -244742
19221 -244742 -176196 -118084 -36509 -209401 -280433 -133020 -50511 461797 -188809 -50919 -29251
19210 -29251 -109652 97113 7764 164264 120963 43947 -167125 -102289 90597 -39540 -170513
19199 -170513 -234907 358812 -79946 -141239 -191060 170382 -37941 -21788 -36734 90855 -4023
19187 -40006 -313903 -148269 92695 -49814 -166839 -111535 52430 248895 231944 53349 -156169
19175 283826 163265 -12517 -3629 -60038 70937 5931 -238203 -449433 -279907 -13677 -250824
$$ packed form
19254a57340N7497C00162j45531b17139A56920a42154k3721E9281b28346a08028
19243E8206K38297b25245A84863R7374a80516C4317Q3345a15416H7720b43160
19232a68721Q118g6403A02780a18094n8786P8183d5721d759C5667c1888k12854
19221b44742O8546N8112c6509j72892p1032a33020e0511D61797a88809e0919K1668
19210b9251q0401I7113G764J56500m3301D3947a67125O4836I0597c9540j30973
19199a70513o4394C58812g9946o1293m9821A70382c7941J6153j4946I0855d023
19187d0006k73897a48269I2695d9814j17025N5304E2430J96465j6951E3349a56169
19175B83826j20561a2517c629n6409G0937E931b38203k11230J69526a3677k37147
$$ plain form
19164 -250824 32539 157070 -215729 -38717 46343 81926 -74216 -381185 -74475 55332 113668
19153 113668 -128382 247344 47903 -148055 -103694 245097 141189 18945 21219 -142793
19142 -93129 -322817 -210775 190641 -383650 -97626 -233107 145654 123328 -137497 -182907
19132 -182907 64042 -122302 71890 162645 -485113 -26499 -21564 66053 22244 -103700 -150447
19121 -150447 -65685 206748 176312 -182969 -152649 158865 63225 -124153 -179323 406711
19110 -11023 -114059 -18761 9383 347492 -313221 -153981 -86517 -3731 -116201 41867 -133262
19098 -251270 -28109 -133417 209006 -249129 8624 247380 43451 31722 92128 100306 216017
19087 216017 -17183 -157621 27386 127622 -340958 -481929 -21371 -202145 31010 -245067
$$ packed form
19164b50824C2539J24531b15729c8717D6343L5583g4216l06969g4475E5332N8336
19153A13668a28382B47344D7903a48055M4361B45097j03908A8945K274a42793
19142i3129k29688J12042A90641c83650i7626j35481A45654k2326a37497m5410
19132a82907F4042a22302G1890R0755d85113b6499M935F6053B2244a03700m6747
19121a50447f5685B06748l0436a82969L0320A58865F3225a24153n5170D06711
19110a1023j03036a8761I383L38109c13221a53981O7464c731j12470D1867a33262
19098b51270b8109j05308B09006b49129H624K38756D3451j1729O0406Q178J15711
19087B16017a7183j40438B7386J00236c40958j40971b1371j80774C1010b45067
$$ plain form
19076 -351038 79095 -138149 -30236 80241 -404064 440237 -164858 -11811 166976 64743
19065 118189 273236 -11187 143665 -71634 -365900 -229804 -47110 200227 32230 -422794
19054 313545 117728 -49812 -213765 -300859 -61260 -271240 -426561 217668 200583 -345997
19043 -390872 -366901 -77898 -19746 101410 -22749 -331580 -61942 -476239 -48132 -139065 -44362
19031 139584 -120217 -58848 118169 45972 22572 -8616 -153918 122693 93494 137799 145861
19020 145861 -153050 218336 -275403 -276021 76899 129406 -21069 -141428 -170198 -13279 -60226
19009 -60226 -10899 60618 -85957 -311508 128371 216845 -10844 -151958 -266227 -106592 -209590
18998 -209590 253586 24369 -190833 -71120 -295941 126843 -59390 -61766 26150 254297 217791
$$ packed form
19076c51038G9095a38149c0236H0241d04064D40237a64858a1811A66976F4743
19065A18189J55047a1187A43665g1634k94266J36096d7110B00227C2230d22794
19054C13545A17728d9812j63953q7094f1260k09980j55321B17668j7085c45997
19043c90872K3971g7898a9746A01410b2749l08831f1942m14297d8132r0933d4362
19031A39584a20217e8848A18169D5972B2572h616j45302A22693k9199M4305Q062
19020A45861a53050B18336b75403o18G6899N2507b1069j20359k8770a3279m6947
19009f0226a0899F0618h5957k25551A28371Q8474a0844j41114j14269a06592j02998
18998b09590B53586B4369a90833g1120k24821A26843e9390k376B6150K28147l6506
$$ plain form
18987 217791 -116615 -143096 -40478 153767 -77561 67507 -43671 -526995 -42918 -115777 -115213
18976 -115213 -11524 58340 113238 -155177 186437 111569 37816 -123363 -161202 -287905 47253
18964 -186129 144390 31164 221692 -372762 -204313 11986 -475118 -54126 51146 -125131
18953 144092 -21232 47600 -127045 243548 -77272 -11383 -441708 32560 168747 -192276
18942 -35000 -199741 -157714 53704 -47498 43505 79592 72879 77375 -123959 278479 -50944
18930 -46630 21357 -243890 -87073 -177346 184663 1904 91967 -196008 80242 -266361 61542
18918 141572 -86287 -275294 -112193 -82060 -88796 -239952 -99403 -27840 -120459 89456 -274340
18906 -12986 -12827 106585 -12162 -185065 100026 336221 53220 -84549 -29235 -280986 -135248
$$ packed form
18987B17791a16615k6481d0478A53767g7561F7507d3671m83324d2918p2859N64
18976a15213a1524E8340N4898a55177A86437p4868C7816a23363l7839j26703D7253
18964a86129A44390C1164J90528c72762J68449A1986d75118e4126E1146a25131
18953A44092b1232D7600a27045B43548g7272a1383m30325C2560J36187a92276
18942c5000j64741M2027E3704d7498D3505L6087o713M496a23959B78479e0944
18930d6630B1357b43890h7073r0273A84663A904R0063a96008H0242b66361F1542
18918A41572h6287j89007a12193L0133o736j51156i9403b7840r2619H9456b74340
18906a2986J59A06585a2162j72903A00026K36195E3220h4549b9235k51751a35248
$$ plain form
18894 -65874 -60542 -152406 -15181 -257038 -129876 32184 -70663 163742 115793 -161600 -297560
18883 -297560 161030 -194216 142109 -105137 -147380 28959 -58946 108896 214394 -224298
18872 -176640 -14714 -28034 -318424 -77959 -61016 -183168 -30920 -293183 36694 -141785 -163168
18861 -163168 -145051 -392824 -249290 141656 148582 -237162 215328 -39103 -356231 -215094
18851 -215094 -237306 72172 -293346 -277364 113871 -133438 -27060 393182 -194537 165515
18840 20602 -342530 13874 51449 -415648 138096 282726 239853 -263977 -250934 -15864 -49228
18829 -49228 -55469 -74304 -23431 -170254 55554 148902 -22314 -187905 115434 6284 -366015
18817 -191551 169459 154807 72469 -83117 364485 -122616 -386591 216727 113879 -190832
$$ packed form
18894f5874N332r1864a5181k41857J27162C2184g0663A63742m7949a61600j35960
18883b97560A61030a94216A42109a05137m2243B8959e8946A08896J05498b24298
18872a76640a4714j3320k90390g7959J6943j22152c0920k62263C6694a41785k1383
18861a63168J8117k47773J43534A41656O926b37162B15328c9103l17128J41137
18851b15094k2212G2172b93346J5982A13871a33438b7060C93182a94537A65515
18840B0602c42530A3874L7575d15648A38096J44630m2873b63977J3043a5864l3364
18829d9228o241j8835b3431j46823E5554R3348b2314j65591A15434F284c66015
18817a91551A69459j4652G2469h3117C64485a22616k63975B16727j02848a90832
$$ plain form
18806 -26023 -31905 -36152 4730 71622 41562 -108664 37126 26179 101350 66413 -95759 49247
18793 48081 15066 465933 -56892 40205 -101961 -206578 135779 -87833 217399 -59074 -385563
18782 -385563 293721 -52661 -22255 -43153 -43770 117766 -116847 -166426 236529 33204 102050
18771 102050 -3753 -300792 54719 -182690 82495 -164240 -110495 -277756 34840 95320 150523
18760 150523 -86487 37402 -181987 -176519 126771 147035 -7955 -117837 -7725 -154677 -311045
18749 -311045 77745 -92787 -59820 228398 -191810 251809 -171547 -232003 -199554 -19083 -45250
18738 -45250 -93494 -162061 30549 -23705 -29137 -120896 -113905 -47710 -111337 -148324 49214 -20261
18725 -29403 4188 -203554 -259955 -155058 -267114 -106714 -43412 -104831 -148275 -385603 174395
$$ packed form
18806b6023n882m247D730O6892l0060a08664C7126j0947P5171l4937i5759D9247
18793D8081A5066M50867e6892D0205a01961j04617A35779h7833B17399e9074l26489
18782c85563B93721e2661b2255k0898o17A17766a16847m9579B36529C3204O8846
18771A02050c753k97039E4719a82690H2495a64240N3745j67261C4840O0480N5203
18760A50523h6487C7402a81987N468A26771K0264g955j09882g725j46952j56368
18749c11045G7745i2787L2967B28398a91810B51809a71547o0456L2449a9083k6167
18738d5250m8244o8567C0549b3705n432r1759O991d7710o3627l6987D9214b0261
18725b9403D188b03554n6401J04897j12056a06714d3412o1419m3444k37328A74395
$$ plain form
18713 121985 -159664 -53650 28189 -4928 -327964 137740 101605 173699 309977 -56935 20482
18701 95632 16903 330173 -318724 -95420 -106426 -8295 223637 -100044 260630 184476 226502
18690 226502 -92730 -145466 -13094 -101862 204781 -200799 78187 -436378 34610 -144915 4468
18678 195935 -311829 174256 74986 19282 78263 -170237 -404057 89153 110062 -34219 73827
18666 79526 -10844 -100496 111695 15183 -245630 -291744 83743 -16406 -132738 -87389 -147572
18655 -147572 -36772 846 93956 -327942 -135653 -13978 -185147 104523 -99114 -37406 -86428
18644 -86428 -8659 52953 -162351 450961 -37046 32004 -202122 -167093 -130923 -337146 -22509
18632 116476 -3042 118176 -148316 -128708 -135454 -167643 -221612 140988 -106630 -1040 36812
$$ packed form
18713A21985a59664e3650B8189d928l23036A37740l6135P2094J36278e6935B0482
18701I5632A6903L13270c18724i5420j1006h295B23637a00044B60630p6154M2026
18690B26502i2730n2736a3094q8768B04781b00799G8187d36378C4610a44915D468
18678A95935c11829A74256G4986A9282N8981a70237k33820H9153K0909c4219G3827
18666G9526a0844q9652A11695A5183b45630m6114H3743a6406j16332M5349o0183
18655a47572c6772H46R3110c27942a35653a3978j71169A04523i9114c7406m9022
18644h6428h659E2953a62351D50961c7046C2004b02122L5029L6170k06223b2509
18632A16476c042A18176a48316J9608o746l2189n3969A40988a06630a040C6812
$$ plain form
18620 -255811 158335 62791 -341831 -39304 -7744 -158839 35849 -258309 -16597 58723 371546
18609 371546 -13461 -8273 -317225 57260 35701 -381715 -238454 -112799 177203 62609 -57429
18597 -9902 302277 -311682 207190 -264791 -360001 -338653 -16182 3318 -149388 37562 -58325
18585 11456 10294 226804 -90488 13541 -360348 134919 -44785 -82253 -124372 65885 -201016
18573 203715 -349069 -247877 194596 294965 -168250 24373 -187271 -181480 -210800 122592
18562 -18793 64886 116937 84563 -87840 -158936 -103623 -95290 -190329 -20004 231719 -187398
18550 -248900 -243866 -79699 -237926 119540 -65852 -161025 -153901 3768 -153719 -64609 -145376
18539 -145376 -126330 -190726 -128611 -142743 -229581 72895 -130535 7150 -62435 -39385 -372203
$$ packed form
18620b55811A58335F2791c41831c9304g744j51095C5849b58309a6597E8723L12823
18609C71546a3461N188l08952E7260k1559c81715J43261a12799A77203F2609e7429
18597i902C02277c11682B07190b64791r5210K1348a6182C318a49388C7562e8325
18585A1456j162K16510i0488A3541c60348A34919d4785l7468m2119F5885b01016
18573B03715c49069J01192A94596J00369a68250B4373a87271N791k9320A22592
18562a8793F4886N2051l2374h7840p1096N5313Q333r5039b0004B31719a87398
18550b48900N034g9699j58227A19540f5852r5173P124C768a53719f4609q0767
18539a45376J9046o4396O2115j4132q6838G2895a30535G150f2435K3050l32818
$$ plain form
18528 -372203 -174314 -13435 -132501 6916 36618 2090 -213206 259143 -314351 -166316 266096
18516 -100552 -347238 53510 -142468 -206683 -261667 142370 215924 -166640 5083 316170 -11794
18504 303164 -189429 115944 -94211 -67568 -10057 -49423 60030 209525 -188185 -34396 -177446
18493 -177446 -14420 -45377 46719 160432 -191415 -20253 -167606 251152 128775 222954
18483 222954 -254828 307850 -214289 50283 48943 -124042 -67174 -333900 80470 -2429 173412
18471 143467 -2852 -100776 -65221 23853 -172598 -399618 -148310 -7337 107516 63210 -478160
18459 363164 -315204 -34277 -151592 195811 -229770 -255085 -352544 373219 -303407 -113509
18448 -29179 39062 -85644 214359 -281163 -44947 214687 54962 119840 -38343 152786 116371
$$ packed form
18528c72203a74314a3435j19066F916K9702B090b13206B59143c14351J48035B66096
18516a00552k46686E3510a42468o4215n4984A42370P3554a66640E083L11087a1794
18504C03164a89429A15944i4211K6643a0057l9366F0030J49495a88185c4396j43050
18493a77446a4420l0957D6719J13713a91415b0253j47353B51152j22377R4179
18483B22954b54828C07850b14289E0283j340a24042N6868k66726H0470b429A73412
18471A43467b852r7924L5555B3853a72598k27020a48310g337A07516m4306d78160
18459C63164c15204c4277j17315A95811b29770k5315r7459C73219c03407a13509
18448b9179C9062h5644B14359b81163d4947B14687E4962O4878c8343A52786l6415
$$ plain form
18437 116371 98119 6170 -283103 47869 -167876 49216 -120695 208107 63561 -409406 83616
18425 -244063 -43184 -5299 -151208 46791 34542 -376466 81202 -205524 -8680 -61843 -124999
18414 -124999 244608 51423 -138081 -211614 -76170 -107287 47268 -56890 403985 60022 -158350
18402 2235 167334 -151872 -98335 -26368 39362 -15671 150054 268243 -223720 -284761 -216454
18391 -216454 51497 -145376 -191207 111570 -115437 -151952 308347 -153664 -120719 -221773
18381 -221773 -10603 -26380 -55836 126021 76612 -245961 -222054 34146 -27345 -262293 -127643
18369 -278798 56609 228446 106108 -234300 -204816 -74179 -42914 24543 -53128 -154182 560668
18357 5200 107962 110213 -352484 107536 227400 -65502 -408755 -61117 -132034 -164814 162977
$$ packed form
18437A16371j8252F170b83103D7869a67876D9216a20695B08107F3561d09406H3616
18425b44063d3184e299j45909D6791j2249c76466H1202b05524h680n3163o3156
18414a24999B44608E1423a38081p3533g6170l1117D7268e6890D03985F0022a58350
18402B235J65099a51872N3537b6368C9362a5671A50054J18189b23720o1041O8307
18391b16454E1497a45376m5831A11570a15437l6515C08347a53664L2945j01054
18381b21773a0603j5777k9456A26021m9409b45961K3907C4146b7345k34948a27643
18369b78798E6609J71837A06108b34300K9484g4179L1265B4543e3128j01054E60668
18357E200J02762K251c52484A07536J19864f5502l43253f1117p0917l2780A62977
$$ plain form
18345 196463 -147231 48394 -7255 -268292 3016 -55240 63977 -449780 -40072 -8670 182178
18333 -310379 -172699 179887 100264 294545 105699 260866 -346007 66474 2243 -76941
18322 -267812 -261260 -221891 -271868 153856 71941 101491 241740 -134726 10248 -21266 -99172
18311 -99172 144476 227637 25914 -125523 271383 -88479 -141293 -90085 -16359 244814 207924
18300 207924 -12870 19788 447478 218957 -4584 -181101 -168351 -229191 -26101 -196248 57033
18288 6022 207140 34603 -9187 -204233 -99446 193173 -163469 -219404 -71708 -145271 -227369
18277 -227369 223624 -37362 60085 -71967 126713 -190153 -266092 127898 -3371 -127609 -227838
18266 -227838 170153 -22733 127602 218057 178072 -126052 346551 -108983 13754 103027
$$ packed form
18345A96463a47231D8394g255k61037C016e5240F3977d49780d0072h670A82178
18333c10379J37680A79887p9623J94281A05699J55167c46007F6474B243g6941
18322b67812O552L9369m9977A53856G1941K9550J40249a34726A0248b1266p7906
18311i9172A44476Q3161B5914a25523B71383h8479n2814N1208a6359B44814l6890
18300B07924a2870A9788M27690B18957d584j76517J2750o0840b6101j70147E7033
18288F022K01118C4603i187j95046i9446A93173a63469n5935g1708p3563q2098
18277b27369B23624c7362F0085g1967A26713a90153p5939A27898c371j24238j00229
18266b27838A70153b2733A27602R0455l9985a26052C46551a08983A3754Q9273
$$ plain form
18256 103027 165078 -243566 -164895 -128796 -175111 -65440 2043 -73533 87494 -44552 427388
18244 -289433 -344356 54819 -138807 -293960 57493 6366 -29686 -99037 61173 -19101 79575
18232 56456 166434 24188 -220961 48454 -73771 126298 279052 -61082 123697 235850
18222 235850 -50755 206677 80192 -335804 -64738 -20912 -97850 -19182 -291242 -403736 355825
18210 -278197 102548 55745 25206 -24735 -146417 -317197 122845 -78170 -177980 -85643 -104969
18199 -104969 -87439 67214 -245558 36120 -227627 12700 -274897 -92271 -17095 -84375 -265801
18188 -265801 -130711 -106946 -228052 -159700 -75267 10183 -24832 -33706 -174094 -13051 -216960
18177 -216960 -67317 -119456 256350 -69441 -13989 306622 -53594 -96518 -33006 297 53968
$$ packed form
18256A03027O2051b43566P8671L6099m6315f5440B043g3533H7494d4552D27388
18244b89433n4923E4819a38807j55153E7493F366b9686o9351F1173a9101G9575
18232E6456J09978B4188b20961D8454g3771A26298J52754f1082A23697J12153
18222B35850e0755B06677H0192c35804f4738b0912p6938a9182k72060j12494C55825
18210b78197A02548m6803B5206b4735j21682j70780A22845g8170r9810h5643j9326
18199a04969J7530F7214b45558C6120b27627A2700b74897i2271a7095o7280j81426
18188b65801a30711K3765j21106O8352g5267A0183b4832q874j40388a3051k03909
18177b16960f7317n2139B56350f9441a3989C06622e3594m2924c3006B97N3671
$$ plain form
18166 53968 45931 -338968 38085 -261761 208977 -129598 -136281 -139351 89393 -29668 -80304
18155 -80304 -96976 -192525 -500089 -99667 69178 -91027 29438 189498 -251105 15367 -369031
18143 285025 193593 152099 106514 -173925 -94500 -9856 324025 -80139 -338633 112301 51561
18131 37797 -130285 -283074 -125825 42604 -87732 -133819 -224209 -257720 141619 62453 -74814
18119 131542 -158543 208849 32243 -75734 112068 168616 130211 -367865 -149258 -123398
18109 -123398 -157760 -37025 -158305 -112867 -18703 -116921 -32122 171759 -535059 205975 -129235
18097 -184993 -58347 -53811 300074 -112935 63967 -142666 -145480 -16365 -199096 52433 -254056
18085 134589 -13864 168626 -65796 -8757 -250252 64793 -295247 -81243 -9288 127612 -85733
$$ packed form
18166E3968q037c38968C8085b61761B08977a29598o683l070H9393b9668n0636
18155h0304j6672r5549l07564i9667F9178i1027B9438J60060b51105A5367c69031
18143B85025r1432m1494m5585a73925P9425i856C24025h0139k58494A12301E1561
18131C7797a30285j52789a25825D2604h7732m6087r0390l3511A41619F2453g4814
18119A31542a58543B08849C2243g5734A12068N6548l8405c67865a49258K5860
18109a23398l4362c7025j21280M5438a8703r8218c2122A71759e35059B05975a29235
18097a84993e8347M536C00074a12935F3967a42666k814a6365j82731E2433b54056
18085A34589a3864A68626f5796h757k41495F4793b95247h1243i288A27612h5733
$$ plain form
18073 37949 -22170 97243 -137660 -24010 -186751 -61144 -6328 225705 -269839 -5019 65278
18061 99021 -288521 212688 99259 127462 -29732 40425 -50953 -166162 -353540 257626 253902
18050 253902 -63169 -225060 47290 10326 -174345 25588 -135269 -130341 -132843 -147905 -56483
18038 70728 76290 27198 139003 10468 -2076 -23948 -48923 300952 -14477 -12636 -199713 -238466
18026 -238466 -106047 -163514 -31911 -157689 -5093 -41026 148793 214979 -27521 40759 49872
18015 49872 294296 -101777 -61937 32599 84868 70707 -301590 -65150 11845 29573 -64797
18003 78665 257808 -208978 -141847 -20143 -56128 -24753 -258178 -5117 288229 47683 -274392
17991 -74655 48474 -18110 19631 -75394 -102403 -7551 -119789 22898 25888 -83769 -142603 -56229
$$ packed form
18073C7949b2170I7243a37660b4010j62741f1144f328B25705b69839e019F5278
18061I9021b88521B12688I9259K8203b9732D0425e0953j15209j87378B57626l724
18050B53902f3169j61891D7290A0326a74345B5588a35269M928k502j5062e6483
18038G0728N562B7198J11805A0468b076k1872k4975C00952a4477J841j87077l8753
18026b38466a06047n7467c1911j25778e093l5933A48793O6186b7521D0759R113
18015D9872K44424a01777L9840C2599N2269j4161c01590f5150A1845J7728f4797
18003G8665J79143b08978O7131b0143l5985b4753k33425e117B88229D7683b74392
17991g4655D8474a8110A9631g5394k7009g551j12238B2898K990h3769n8834e6229
$$ plain form
17978 -11322 -109620 272154 -261144 -281924 -94037 -132381 -111325 66675 284803 -197165 -126257
17967 -126257 -265976 271886 -52629 9482 -56379 345366 69975 169881 245461 -104511 -48364
17955 -127607 141846 -202032 33136 -341773 -129978 272334 -24180 -15476 19658 -91621 -379843
17944 -379843 -6638 34141 326265 -30441 -2330 110259 75512 -68769 -46771 -207832 21270
17932 21113 116457 73712 -45646 29897 -138142 -105132 128768 36150 43327 -112570 -89531
17921 -89531 -200989 15616 166238 -67804 84572 -124112 -215838 264188 68380 153329 126960
17910 126960 237154 279889 -22314 124152 692 -103631 274370 -6273 -41514 247401 259089
17899 259089 -311669 -28493 -236075 254924 -203050 -169897 -111600 -73921 -148648 -243117 314267
$$ packed form
17978a1322r8298B72154b61144k0780i4037l8344K1056F6675K18128a97165P0908
17967a26257j39719B71886e2629I482e6379C45366F9975R9906P5580a04511d8364
17955a27607A41846b02032C3136c41773a29978B72334b4180Q704A9658i1621k88222
17944c79843f638C4141K92124c0441b330A10259l4747f8769K1998j61061B1270
17932B1113R5344m2745d5646B9897a38142L3010A28768C6150P177a12570K3039
17921h9531j11458A5616J50622f7804H4572a24112r1726B64188F8380Q4949k6369
17910A26960J10194M2735b2314A24152F92a03631B74370f273l5241B47401J1688
17899B59089c11669b8493k07582B54924b03050L3153N8297L7679p4727r4469C14267
$$ plain form
17887 -418329 157279 55560 -20129 37511 -212717 60022 -3034 -158281 192 176460 84375
17875 65985 -51301 161927 174296 25010 358796 -60804 325 -260199 101567 -19662 427710
17863 -31714 -57735 -145775 89320 -84224 -233065 362420 56801 77386 175632 -38452 -67747
17852 -67747 -329947 89461 153030 -284233 -325038 -88589 -13505 -91276 119729 239080 -338364
17840 -187281 -3214 51441 52793 -121599 -246216 72 -209373 -23354 265732 -6217 -15353 -179806
17828 -179806 347933 346305 24416 296228 -375209 -101065 -105160 359545 70277 -41619 -53867
17817 -53867 -110821 -77709 -194694 -85859 446730 -295416 -74017 -505 -7828 -181384 149635
17805 -192460 22294 -22659 88873 -201242 -43472 -117791 32591 -58359 -87536 128856 -65319
$$ packed form
17887d18329A57279E5560b0129C7511b12717F0022c034j55247A92J76268H4375
17875F5985e1301A61927J2369B5010L33786f0804C25b60199A01567a9662D27710
17863c1714k6021q8040H9320h4224j48841C62420E6801K0585R8246c8452k9295
17852f7747k62200H9461O3569b84233m0805h8589a3505p7771A19729J19351c38364
17840a87281c214E1441J352a21599j24617G2b09373b3354B65732f217r136j64453
17828a79806C47933j628B4416K71812c75209a01065m095C59545G0277d1619j2248
17817e3867n6954L3112j16985h5859D46730b95416g4017e05p323j73556A49635
17805a92460B2294b2659H8873b01242d3472p4319C2591e8359k9177A28856f5319
$$ plain form
17793 -33009 200357 213977 21625 45811 -44295 206829 -5142 -204321 -58072 160225 -153506
17781 37526 -30246 194573 -367339 102623 -101097 78767 121397 -129899 -112205 19564 -278803
17769 -178966 12088 335698 -77435 251854 -143949 -171588 -347261 365117 -36096 -90112
17759 -90112 14627 -224165 21509 25961 -64696 -84028 -142537 222317 9729 146176 -148200
17747 153720 330959 -56619 202514 273975 -29858 108351 183838 59775 -112393 -71522 230640
17735 3262 167660 58346 275337 18858 -327177 19797 -57552 7755 130264 93685 -252949
17723 169292 24098 -127800 -166358 -160154 145110 -182088 -66009 68623 87649 -135682 113815
17711 -95013 59688 -286451 -70463 -425424 226567 -50315 11279 -9675 223673 -354807 180829
$$ packed form
17793c3009B00357J3620B1625K4186d4295B06829e142j99179e8072A60225a53506
17781C7526c0246A94573c67339A02623a01097G8767M2630a29899J7694A9564b78803
17769a78966A2088L23610g7435B51854a43949k7639j75673C65117c6096n4016
17759i0112A4627b24165B1509M452f4696j9332n8509B22317I729J36447a48200
17747A53720J77239e6619B02514P1461b9858A08351P5487E9775a12393M0871B30640
17735C262J64398E8346K16991A8858c27177A9797e7552G755J22509l6579b52949
17723A69292B4098a27800l8558O204A45110a82088f6009F8623J9026a35682A13815
17711i5013E9688b86451g0463l54961B26567e0315A1279i675B23673c54807A80829
$$ plain form
17699 135522 -272344 -4045 -74196 326139 -155412 -138922 -18703 -194808 -121843 -46393 74643
17687 -122977 -37498 -35527 -80316 -26066 -94592 325299 -56179 -60223 7344 416080 -71879 34811
17674 -106946 75630 171169 -106184 63535 21021 222896 -175395 -117992 149476 380416
17664 380416 -56651 -67809 -22911 310191 -150159 -267350 -181082 -85308 104149 388567
17654 388567 -459035 -26881 19676 94327 179836 -30189 -125055 249159 654199 299085 122462
17642 281876 139851 -53014 -385126 -67504 -404249 -84366 -248116 175288 -44528 -52548 -324776
17631 -324776 -295417 66255 -80942 64581 9772 206114 299730 -61191 -112141 -315251 27360
17619 13333 137525 -95212 -62519 -212747 56240 200019 -84142 -95036 -65489 393210 22762
$$ packed form
17699A35522b72344d045p0151C26139a55412J6490a8703j76105P2965d6393G4643
17687a22977c7498J971m4789b6066o8526C25299e6179m044G344M08736g1879C4811
17674a06946G5630R5539a06184F3535B1021K01875a75395N7403A49476K30940
17664C80416e6651j1158b2911C10191a50159j17191Q6268h5308A04149K84418
17654C88567d59035b6881A9676P4651Q5509c0189r4866B49159M05040B99085A22462
17642B81876A39851e3014l32112f7504l36745h4366j63750A75288d4528q020k72228
17631c24776K9359F6255h0942F4581I772J96342R3616f1191n0950k03110B7360
17619A3333J24192i5212L2693j50228E6240J43779h4142j0894K9547C93210B2762
$$ plain form
17607 -284906 49820 -439970 20234 46384 -16608 -220106 75652 -84076 147980 -31965 -59903
17596 -59903 277818 175539 78318 -361410 144799 45273 -23415 177383 -100839 289555
17585 173410 90485 110737 181839 -127499 222828 191512 -82377 75292 62224 -311898 431700
17573 162685 86376 103756 -121551 33810 269745 205224 -290853 36679 196734 143856 -74286
17561 634 180602 168921 60536 -161675 -225057 196556 74403 290351 -46632 -131036 245359
17549 112636 1756 -152157 20780 -44437 126572 304218 -86485 196138 305540 208528 250566
17538 250566 192454 361795 236548 200422 179423 276911 86388 309368 180885 6915 55887
17527 55887 -36937 -44084 -36709 126295 40569 281655 23143 -9167 -4867 226784 107466 636950
$$ packed form
17607b84906D9820d39970B0234K6150a6608k03498G5652h4076A47980c1965k7938
17596e9903B77818j02279G8318c61410A44799D5273b3415A77383a00839B89555
17585A73410q2925K0252P1102a27499B22828l1316h2377G5292j3068c11898D31700
17573A62685p6309J7380a21551C3810K35935o4521b90853C6679J60055n2878g4286
17561F34J79968j1681F0536a61675o3382A96556G4403K15948d6632q4404B45359
17549A12636A756a52157B0780d4437A26572J77646h6485A96138J09402r7012M2038
17538B50566n8112J69341j25247l6126k0999R7488H6388K22980j28483F915M8972
17527E5887c6937p147P375A26295D0569K41086B3143i167M300B26784A07466N29484
$$ plain form
17515 636950 52134 -75926 60888 233449 -17416 220392 -98570 18099 290 213516 222110
17504 222110 46604 426772 164443 -11584 24079 -277178 -74708 62772 227715 265595 -256258
17492 -142414 419615 -133047 -164938 192740 -59197 196101 396104 -121836 70746 138405
17482 138405 7608 -31597 281884 7343 55439 74727 -80416 -88763 300642 1765 -22519 -24907
17470 -24907 278096 440894 105003 228795 -427218 42419 12713 205897 -204373 92587
17459 -20292 234379 274962 63501 -5493 130925 -54960 105933 252826 -47978 155096 107144
17448 107144 27037 39099 25743 275871 -54721 -208405 -21518 -14741 86047 398985 218857
17437 218857 301428 14840 162086 36625 148251 399872 360871 53796 196651 -5435 414254
$$ packed form
17515F36950E2134g5926F0888J72561a7416B20392i8570A8099B90K13226Q594
17504B22110D6604L80168A64443a1584B4079b77178g4708F2772J64943L7880b56258
17492a42414D19615a33047l1891A92740e9197A96101K00003a21836G0746O7659
17482A38405G608c1597B81884G343M8096J9288h0416q347C00642A765b2519k388
17470b4907B78096J62798A05003J23792d27218D2419A2713J93184b04373I2587
17459b0292B34379M0583F3501e493A30925e4960A05933J46893d7978A55096m7952
17448A07144B7037J2062j3356K50128e4721j53684b1518O777H6047L12938j80128
17437B18857Q2571A4840J47246C6625J11626K51621l9001E3796J42855e435D14254
$$ plain form
17425 -788 118651 173268 40877 123476 334405 341283 358003 217435 255280 157707 275019
17414 275019 110485 118220 339536 -61530 644300 490548 -46456 31961 103246 211048 337438
17403 337438 234191 356701 127578 229364 284998 217337 339518 195526 112375 41605
17392 393507 -61071 345891 -135024 -8719 15394 122342 418932 -41545 111740 162375 1688
17380 225221 434196 202366 -22391 187492 91381 76775 130192 405556 -202213 -158106
17370 -158106 526480 103282 247259 284954 36338 -4455 163987 54725 97493 87254 247793
17359 247793 -199856 304135 -25784 452234 213649 28999 10557 272233 226638 130541
17349 130541 64808 240002 -9110 149341 252115 -59129 13236 217019 172644 194088 152171
$$ packed form
17425g88A18651N4617D0877Q2599K10929O878J6720j40568L7845r7573J17312
17414B75019A10485P735K21316f1530F44300j53752d6456C1961P1285J07802J26390
17403C37438j03247J22510A27578J01786N5634o7661J22181j43992q3151D1605
17392C93507f1071C45891a35024h719A5394J06948K96590d1545A11740N0635A688
17380B25221K08975B02366b2391A87492I1381j4606N3417K75364b02213M4107
17370a58106E26480A03282J43977L7695C6338d455A63987E4725M2768j0239J60539
17359B47793a99856C04135b5784D52234B13649B8999A0557K61676m5595r6097
17349A30541F4808J75194i110A49341J02774e9129A3236K03783m4375K1444m1917
$$ plain form
17338 152171 55004 79739 -264003 120952 108517 211117 -174444 -53532 212307 314808
17328 314808 256308 -104154 267258 81052 317096 253286 144861 37981 131049 356100
17318 356100 301155 264892 13490 145464 214426 76040 -96919 262936 237017 300639 45213
17306 205443 -159578 167154 113918 -128776 309648 24477 257922 -86028 -17664 -215595
17296 -215595 198893 -19851 175695 134392 349387 279670 371750 69258 -92920 500875 439536
17285 439536 -1905 137489 -56536 -44034 39987 317165 93373 -54722 268760 49641 140033
17274 140033 267412 209619 278620 -219568 38269 252400 346160 105297 229190 147422
17264 147422 152279 52132 37515 246446 27992 -53172 232847 306988 -95319 83100 99569
$$ packed form
17338A52171E5004K4735b64003A20952j2435J02600a74444e3532B12307J02501
17328C14808n8500a04154B67258H1052K36044o3810j08425C7981R3068K25051
17318C56100n4945l6263A3490J31974O8962G6040i6919B62936k5919O3622D5213
17306B05443a59578A67154n3236a28776C09648B4477K33445h6028a7664j97931
17296b15595A98893a9851A75695m1303K14995o9717R2080F9258i2920E00875o1339
17285D39536a905A37489e6536J2502C9987K77178I3373e4722B68760D9641R0392
17274A40033J27379n7793O9001b19568C8269K14131R3760A05297J23893q1768
17264A47422M857E2132j4617K08931B7992e3172B32847P4141i5319H3100J6469
$$ plain form
17253 99569 291804 -46359 -9343 49683 -131013 86694 352816 2348 88112 220415 193647
17242 193647 -69661 95094 57497 476520 164019 234492 137038 186828 213073 -92933 -24582
17230 -161167 195397 302073 104678 -28169 2099 -36309 593413 71805 129866 304107 99572
17218 493941 519855 435903 193868 67095 -51537 403014 341372 307397 269442 -113689 548597
17206 302606 398307 313992 320795 317395 -33910 206037 68543 145749 454878 227163 284029
17195 284029 443509 27155 394457 233766 364674 227220 214808 89742 525444 246769
17184 488213 399190 106184 462997 162397 8670 515937 374378 356704 288491 207262 73217
17172 295980 435782 564279 550202 439442 44335 427697 220329 161762 108843 238714
$$ packed form
17253I9569J92235d6359i343D9683a31013H6694K66122B348Q5764J32303k6768
17242A93647f9661I5094l7597M19023A64019P0473r7454M9790K6245i2933b4582
17230a61167A95397J06676A04678b8169B099c6309E93413G1805N8061J74241I9572
17218D93941K5914q3952A93868F7095e1537D03014o1642l3975l7955a13689E48597
17206C02606R5701q4315O803l400c3910B06037F8543P7206L09129B27163N6866
17195B84029J59480B7155L67302j60691J30908j37454j2412H9742M35702B46769
17184D88213q9023A06184L56813A62397H670N07267j41559j7674o8213q1229G3217
17172B95980J39802J28497j4077j10760D4335L83362k07368n8567n2919J29871
$$ plain form
17162 238714 417763 337641 545123 405773 -103102 442527 356374 472489 339310 359205
17152 359205 204403 376801 272659 272779 82343 381020 -8975 55716 612902 173795 148706
17141 148706 126117 -162033 482161 241744 276275 365824 192550 58102 309003 319237
17131 319237 520525 598969 437232 455289 371986 79422 192067 225037 103019 631438
17121 631438 15438 483276 268460 255137 10823 373198 149137 324469 -231786 311056
17110 256792 313269 186872 442140 268123 399729 -356379 299640 422193 311671 21954
17099 252149 376305 26605 465461 132815 207853 398530 276678 267775 642283 487857
17089 487857 209538 167742 274997 212839 199770 465631 132980 554554 362718 268985
$$ packed form
17162B38714J79049q0122K07482j39350a03102D42527q6153J16115j33179J9895
17152C59205j54802J72398j04142J20H2343K98677h975E5716N57186A73795k5089
17141A48706k2589a62033D82161k40417L4531Q9549j73274E8102K50901J0234
17131C19237K01288P8444j61737J8057q3303G9422J12645L2970A03019N28419
17121F31438A5438M67838k14816j3323A0823L62375A49137J75332b31786C11056
17110B56792N6477j26397K55268j74017J31606c56379B99640J22553j10522B1954
17099B52149J24156B6605M38856A32815P5038J90677j21852q903L74508j54426
17089D87857B09538m1796J07255o2158j3069K65861A32980M21574j91836r3733
$$ plain form
17079 268985 220472 399763 465864 498450 382469 141604 385387 158849 415264 263655
17069 263655 513625 340822 479568 497424 579986 312310 133809 395081 490024 419641
17059 419641 423682 639960 172332 623844 590408 422048 482578 613597 597860 101540
17048 666063 109876 280687 110278 568469 410346 263067 400622 812256 655819 293032
17037 158854 454108 448960 634322 452942 303822 608009 359156 634279 562169 459017
17027 459017 514226 523294 542956 600733 881780 749982 911870 254498 561528 654879 623787
17016 623787 397056 628264 690399 419472 587520 552156 552971 375934 548844 665621
17006 665621 649914 902342 291850 1042004 626518 395777 558604 792112 436279 739593
$$ packed form
17079B68985m8513J79291O6101L2586j15981A41604K43783A58849K56415j51609
17069B63655K49970j72803J38746J7856Q2562k67676A33809K61272R4943p0383
17059D19641M041K16278A72332M51512l3436j68360O0530J31019j5737A01540
17048F66063A09876J70811A10278M58191j58123j47279J37555M11634j56437B93032
17037A58854K95254n148J85362j81380j49120L04187k48853K75123p2110j03152
17027D59017N5209R068J9662N7777K81047j31798J61888B54498L07030R3351l1092
17016F23787k26731K31208O2135k70927J68048l5364Q15j77037J72910J16777
17006F65621j5707K52428B91850P50154m15486k30741J62827K33508l55833L03314
$$ plain form
16996 739593 601320 818314 714063 753940 479118 667172 691464 449208 762702 625716
16986 625716 280470 637118 1112768 500155 869622 897894 689451 808179 835916 805141
16976 805141 650034 756580 745331 531183 778950 883096 871665 924485 637584 696479
16966 696479 817957 984890 606466 679252 896212 1067529 581174 705722 771794 1153819
16956 1153819 590617 1006183 883511 765122 855636 1022617 862531 840417 1026304 1239879
16946 1239879 1096556 676420 846225 1036023 823824 967019 1109016 1093419 1104880 986050
16936 986050 1180540 1148122 1324630 938388 934776 1212228 1045384 907794 1323274 1159369
16926 1159369 1042046 990031 996190 1002633 1472995 1412453 1151505 1335137 1288936 1350988 1002822
$$ packed form
16996G39593j38273K16994j04251L9877k74822J88054K4292k42256L13494j36986
16986F25716B80470L56648M75650E00155L69467K8272k08443J18728K7737l0775
16976H05141j55107J06546j1249k14148K47767J04146j1431N2820k86901N8895
16966F96479J21478J66933l78424P2786K16960J71317m86355J24548O6072L82025
16956A153819n63202M15566j22672j18389R0514J66981j60086k2114J85887K13575
16946A239879j43323m20136J69805J89798k12199J43195J41997j5597J1461j18830
16936I86050J94490l2418J76508l86242l612K77452j66844j37590M15480j63905
16926A159369j17323n2015O159O443M70362o0542k60948J83632m6201O2052l48166
$$ plain form
16915 1002822 1393145 1226439 1355813 1150165 1284314 1550751 1275782 1408452 1400070 1308435
16905 1308435 1153338 1472949 1403126 1493054 1656196 1470958 1567191 1370507 1368094 1588820
16895 1588820 1561839 1549508 1215524 1716221 1617426 1379645 1902136 1682736 1626744 1712640
16885 1712640 1794587 1702178 2055202 1782117 1550749 2059429 1707880 1884862 1902609 1697066
16875 1697066 1961058 1868066 2453435 1909305 2015059 2202962 2076634 2179149 2320314 2133233
16865 2133233 2741421 2415127 2359895 2489946 2585733 2285621 2491112 2700320 2540365 2713282
16855 2713282 2784464 2653965 2863121 2814477 2685144 2839064 3002063 2781510 3016153 2788734
16845 2788734 2984041 3080422 3167627 3001944 3094211 3368491 3428700 3186855 3584053 3317322
$$ packed form
16915A002822L90323j66706J29374k05648J34149K66437k74969J32670q382r1635
16905A308435j55097L19611o9823Q9928J63142j85238R6233j96684k413K20726
16895A588820k6981j2331l33984N00697r8795k37781N22491k19400n5992Q5896
16885A712640Q1947r2409L53024k73085k31368N08680l51549J76982J7747k05543
16875A697066K63992r2992N85369n44130J05754J87903j26328J02515J41165j87081
16865B133233O08188l26294n5232J30051R5787l00112K05491K09208j59955J72917
16855B713282P1182j30499K09156m8644j29333J53920J62999k20553K34643k27419
16845B788734J95307R6381Q7205j65683R2267K74280O0209k41845L97198k66731
$$ plain form
16835 3317322 3519254 3515784 3571933 3559342 3577513 3918112 3761146 3892234 4040676 3955145
16825 3955145 3811089 4227479 4000733 4451517 4436749 4605970 4646574 4768916 4651909 4858555
16815 4858555 4697469 4890234 5032190 5200160 5245813 5260787 5224899 5409019 5419192 5828926
16805 5828926 5806822 5792394 6024348 6288430 6241294 6466261 6599121 6608627 7005511 7183408
16795 7183408 7221349 7387089 7551614 7643443 8250234 8148713 8316180 8333568 8610614 8867781
16785 8867781 8959844 9230689 9653893 9843964 10176605 10074580 10514854 10747888 11375836 11248640
16775 11248640 11899662 12050284 12301726 12854888 13291688 13863933 13904497 14558212 15024656
16766 15024656 15281730 16267265 16437315 17249678 17565450 18386895 18813912 19362889 19952097
$$ packed form
16835C317322K01932l470N6149j2591J8171L40599j56966J31088J48442q5531
16825C955145j44056M16390k26746M50784j4768J69221M0604J22342j17007K06646
16815D858555j61086J92765J41956J67970M5653J4974l5888J84120J0173M09734
16805E828926k2104j4428K31954K64082m7136K24967J32860R506L96884J77897
16795G183408L7941J65740J64525R1829O06791j01521J67467J7388K77046K57167
16785H867781R2063K70845M23204J90071L32641j02025M40274K33034O27948j27196
16775A1248640O51022J50622K51442N53162M36800N72245M0564O53715M66444
16766A5024656K57074R85535J70050Q12363L15772Q21445M27017N48977N89208
$$ plain form
16757 19952097 20671146 21911105 22775141 23588130 24134549 25119946 26265565 27609834 28608352
16748 28608352 29817381 30753823 32376194 33921918 35436676 36695377 38475266 40779800
16740 40779800 42684655 44672330 46796361 49253390 51897821 54391184 57278647 60490542
16732 60490542 63742804 67450741 70935641 74974299 79050302 83208303 88467183 93362579
16724 93362579 98477938 103773560 109330521 115148845 121369695 126788838 132652178 139002970
16716 139002970 144786083 150572074 155392122 160503084 164524100 168214105 171197895 173125499
16708 173125499 174011092 174144236 172735513 170868810 168127637 164573357 160506966 155434340
16700 155434340 150135907 144611325 138502225 132654431 126413495 120404711 114746227 108704760
$$ packed form
16757A9952097P19049J239959Q64036Q12989N46419R85397J145619J344269R98518
16748B8608352J209029R36442J622371J545724J514758J258701J779889K304534
16740D0779800J904855J987675K124031K457029K644431K493363K887463L211895
16732F0490542L252262L707937L484900M038658M076003M158001N258880M895396
16724I3362579N115359N295622N556961N818324O220850N419143N863340O350792
16716A39002970N783113N785991M820048N110962M021016L690005K983790J927604
16708A73125499Q85593J33144j408723j866703k741173l554280m066391n072626
16700A55434340n298433n524582o109100n847794o240936o008784n658484o041467
$$ plain form
16692 108704760 103270178 97807544 92532167 87594785 82712885 78339419 74336227 70043227
16684 70043227 66175881 62893099 59671159 56493012 53648511 50889521 48454646 45745493
16676 45745493 43492022 41733397 39547196 37809040 36198986 34487765 33021516 31609144
16668 31609144 30229174 28963361 27536141 26417106 25687953 24651275 23604324 22906523
16660 22906523 21600839 20933783 20196703 19322942 19043533 18154164 17584429 16816586 16611162
16651 16611162 15808812 15272870 14906678 14486222 13779763 13619030 13114137 12620691 12220869
16642 12220869 11807318 11344263 11296705 10882182 10766529 10200088 10077576 9876963 9644736
16633 9644736 9262317 9191694 8886099 8452717 8377605 8271667 8121263 7524793 7621487 7393393
$$ packed form
16692A08704760n434582n462634n275377m937382m881900m373466m003192m293000
16684G0043227l867346l282782l221940l178147k844501k758990k434875k709153
16676D5745493k253471j758625k186201j738156j610054j711221j466249j412372
16668C1609144j379970j265813j427220j119035p29153j036678j046951o97801
16660B2906523j305684o67056p37080q73761k79409q89369n69735p67843k05424
16651A6611162q02350n35942l66192m20456p06459j60733n04893m93446l99822
16642A2220869m13551m63055m7558m14523j15653n66441j22512k00613k32227
16633I644736l82419p0623l05595m33382p5112j05938j50404n96470R6694k28094
$$ plain form
16623 7393393 7209482 6905332 6977125 6938929 6577065 6119944 6253994 6155087 5866671 5913637
16613 5913637 5816089 5631380 5478529 5596172 5337177 5494351 5319092 4735039 4957834 4802988
16603 4802988 4505528 4831472 4647296 4551424 4420559 4092723 4578210 4048475 4074168 4417125
16593 4417125 3819259 3923054 4111748 3774633 3972483 3908049 3837637 3825297 3224066 3511255
16583 3511255 3487343 3558340 3414416 3295779 3027322 2978857 3173973 2906545 2655745 2630002
16573 2630002 2923535 2946831 2729593 2659036 3040943 2868022 2447959 2599952 2535706 2383436
16563 2383436 2558611 2370966 2336004 2581501 2099492 1899112 2012044 2279696 2230297 2142311
16553 2142311 2179152 2214593 2050788 2164764 2013934 2137110 1902187 1769398 1933250 1699463
$$ packed form
16623G393393j83911l04150P1793l8196l61864m57121J34050r8907k88416M6966
16613E913637r7548j84709j52851J17643k58995J57174j75259n84053K22795j54846
16603D802988k97460L25944j84176r5872j30865l27836M85487n29735K5693L42957
16593D417125n97866J03795J88694l37115J97850o4434p0412j2340o01231K87189
16583C511255k3912P0997j43924j18637k68457m8465J95116k67428k50800k5743
16573B630002K93533K3296k17238p0557L81907j72921m20063J51993o4246j52270
16563B383436J75175j87645l4962K45497m82009k00380J12932K67652m9399q7986
16553B142311L6841L5441j63805J13976j50830J23176k34923j32789J63852k33787
$$ plain form
16543 1699463 1961954 1745939 1583574 1819063 1809097 1951209 1586808 1762255 1663912 1839661
16533 1839661 1832466 1657186 1495414 1586160 1692256 1838270 1595514 1544280 2008638 1507526
16523 1507526 1365626 1280999 1527741 1267732 1132998 1531074 1540115 1541914 1179855 1380208
16513 1380208 1326787 1343999 1311654 1310525 1252238 1218668 1143372 1283695 1312118 1059437 1438412
16502 1438412 1160611 1332192 1313249 1176098 1248840 1171057 1078041 1117109 1115023 896277 1020070
16491 1020070 1120071 916991 1020080 1101418 1218245 788480 992549 905646 1062560 833850
16481 833850 928577 703900 832816 853707 1021028 922085 1292370 981461 938333 539768
16471 539768 717436 686019 830023 718731 1051894 517345 836208 728689 1071166 1007194
$$ packed form
16543A699463K62491k16015j62365K35489r966J42112l64401J75447r8343J75749
16533A839661p195j75280j61772R0746J06096J46014k42756n1234M64358n01112
16523A507526j41900q4627K46742k60009j34734L98076R041J799l62059K00353
16513A380208n3421J7212l2345j129n8287l3570p5296J40323K8423k52681L78975
16502A438412k77801J71581j8943j37151P2742p7783r3016L9068k086k18746J23793
16491A020070J00001k03080J03089Q1338J16827m29765K04069q6903J56914k28710
16481H33850R4727k24677J28916K0891J67321r8943L70285l10909m3128l98565
16471E39768J77668l1417J44004j11292L33163E17345L18863j07519L42477o3972
$$ plain form
16461 1007194 826719 851405 948198 956498 806318 627535 872513 857077 506787 892652
16451 892652 594810 348768 844649 605973 668720 732101 613188 914089 779842 443875
16441 443875 570629 431801 712563 580874 487210 496415 769621 651528 424248 750677
16431 750677 794668 594079 588774 665389 966125 546074 634175 622300 702792 545304 735374
16420 735374 361214 350467 780755 760016 636580 686410 1129971 333631 633510 608564
16410 608564 706433 559314 369611 428475 403218 777999 61213 648657 688840 818234
16400 818234 209918 543229 549991 564503 374851 389575 440554 340842 274518 423374 481013
16389 481013 428671 305568 370509 148723 760294 877594 315952 437989 483660 384282
$$ packed form
16461A007194j80475K4686R6793Q300j50180j78783K44978j5436l50290L85865
16451H92652k97842k46042M95881k38676O2747O3381j18913L00901j34247l35967
16441D43875J26754j38828K80762j31689r3664R205K73206j18093k27280L26429
16431G50677M3991k00589n305P6615L00736m20051Q8101j1875Q0492j57488J90070
16420G35374C61214j0747M30288k0739j23436M9830M43561C33631K99879k4946
16410F08564R7869j47119j89703N8864k5257L74781F1213N87444M0183J29394
16400H18234B09918L33311O762J4512j89652J4724N0979r9712o6324J48856N7639
16389D81013n2342j23103O4941A48723O11571J17300C15952J22037M5671r9378
$$ plain form
16379 384282 246781 458857 219348 193464 624111 512564 552976 393770 364049 575030
16369 575030 246276 253640 374929 431816 569846 482103 414586 398959 336488 428352 547398
16358 547398 292976 261137 186897 639914 162894 333467 79680 429351 167260 505409
16348 505409 261640 256478 279061 404348 287668 265150 242741 303646 328127 239250 263017
16337 263017 341903 348251 279695 333397 127962 365057 281504 457215 317981 353881 275298
16326 275298 540422 445612 98885 181826 307031 404778 208378 242849 101320 230203
16316 230203 508313 400542 449421 305034 669696 334636 305473 11281 122385 149300
16306 149300 243717 143159 224674 251873 434989 374008 51517 21518 269309 275171 243723
$$ packed form
16379C84282j37501K12076B19348k5884M30647j11547M0412j59206k9721K10981
16369E75030B46276P364J21289N6887J38030q7743o7517j5627o2471R1864J19046
16358E47398k54422l1839p4240M53017A62894J70573G9680L49671A67260L38149
16348E05409k43769n162K2583J25287j16680k2518k2409O0905K4481q8877K3767
16337B63017P8886O348o8556N3702A27962K37095q3553J75711j39234L5900p8583
16326B75298K65124r4810I8885Q2941J25205R7747j96400L4471A01320J28883
16316B30203K78110j07771M8879j44387L64662C34636k9163A1281J11104K6915
16306A49300R4417j00558Q1515K7199J83116o0981E1517B1518K47791N862l1448
$$ plain form
16295 243723 218291 165216 746541 320471 379762 203189 74641 509585 272639 302696
16285 302696 -31195 310676 239438 365825 -143047 349627 357543 469807 -20487 149929
16274 289203 214615 298143 711034 250147 491022 119955 162114 72053 538088 -206675
16263 314065 -88307 250441 -37375 501859 102045 289122 154112 64398 347753 228093
16253 228093 186048 186289 -14510 -44388 389886 183042 242972 28207 212186 220483 32868
16241 74324 57643 130305 128607 81648 253668 156828 444562 140661 298731 2078 268619
16230 268619 128378 100192 467233 460445 -25826 -41199 47607 465763 402834 82545 84008
16219 84008 174769 323074 85471 38162 54665 148367 95238 -239202 283417 8633 217818
$$ packed form
16295B43723k5432n3075N81325C20471N9291j76573G4641M34944k36946L0057
16285C02696c1195C10676p1238J26387a43047C49627P916J12264b0487A49929
16274B89203p4588Q3528M12891B50147K40875A19955M2159G2053M66035b06675
16263C14065h8307B50441c7375E01859A02045J87077j35010F4398K83355j19660
16253B28093m2045K41a4510k9878C89886A83042N9930B8207J83979Q297C2868
16241G4324j6681P2662j698m6959J72020r6840K87734A40661J58070B078K66541
16230B68619A28378k8186L67041o788b5826j5373D7607M18156o2929H2545J463
16219H4008R0761J48305H5471C8162J6503R3702n3129b39202B83417H633K09185
$$ plain form
16208 217818 -203553 142286 210892 151087 324388 -114246 126116 356810 -126685 297272
16197 311008 185263 246735 64102 223018 510782 218448 -14773 74041 415065 113621
16186 -5965 16801 340793 211488 5472 387593 11856 89677 -72819 50756 431298 251809
16175 251809 -181449 -41812 291171 117518 -74052 463735 -61420 -144429 -46643 -64582 -10949
16163 -145231 424935 151411 167325 250717 -163139 -63232 307368 96634 155849 150537 -317310
16151 153197 -22763 33823 135096 -753 301883 -42696 231506 41913 497309 151883 -32723
16139 45831 336878 -159763 328233 194743 -8678 -17962 -113916 114582 -228374 371971 42419
16127 118535 -70562 -158257 70189 -47094 -133715 196529 -128819 223888 442304 190435
$$ packed form
16208B17818b03553A42286O8606n9805J73301a14246A26116K30694a26685B97272
16197C11008j25745O1472F4102J58916K87764B18448a4773G4041L41024A13621
16186e965A6801L23992j29305E472L82121A1856P7821g2819E0756L80542j79489
16175B51809a81449d1812B91171A17518g4052D63735f1420q3009d6643j7939a0949
16163a45231D24935A51411J5914Q3392a63139f3232C07368I6634N9215n312c17310
16151A53197b2763C3823J01273g53C01883d2696B31506D1913M55396A51883c2723
16139D5831K91047a59763C28233j33490h678r284r5954A14582b28374C71971D2419
16127A18535g0562q7695G0189d7094q6621A96529a28819B23888K18416A90435
$$ plain form
16116 50938 178369 111325 84949 124400 92156 -169738 -47244 229907 59475 332526 -35685
16104 132463 -26617 -1303 314179 -254975 201511 250918 -13953 -53862 1789 -122661 189320
16092 -55081 105917 -398316 29599 -150991 -102105 -38034 151071 47865 172402 -136391
16081 261595 42488 -170133 33221 -90077 -47342 -148786 -48121 141987 -37140 -88944 -27142
16069 232968 210447 51697 -27145 -64343 95830 22358 75279 133548 -70724 -201010 -89213
16057 154316 71273 75345 -319661 160088 -35267 159214 -203803 -84659 -65378 162230 3015
16045 74996 221356 124681 -356044 384458 196581 -39438 221856 -371836 -132520 117366
16034 55064 -31305 -178659 -255229 151258 160715 27149 -175991 -256135 305981 -109682 -189767
$$ packed form
16116E0938J27431o7044k6376L9451l2244a69738d7244B29907E9475K73051c5685
16104A32463b6617a303C14179b54975B01511M9407a3953l9909A789a22661A89320
16092e5081A05917c98316B9599a50991M8886c8034A51071D7865J24537a36391
16081B61595D2488a70133C3221i0077M2735j01444d8121A41987c7140n1804b7142
16069B32968k2521E1697b7145l7198I5830B2358N2921N8269g0724j30286h9213
16057A54316G1273M072c19661A60088c5267A59214b03803h4659J9281A62230C015
16045G4996J46360r6675c56044C84458j87877c9438B21856c71836a32520A17366
16034E5064c1305j47354p6570A51258R457B7149a75991q0144C05981a09682q0085
$$ plain form
16023 -189767 121434 -663033 35151 -123323 80870 79543 -47279 -3283 181329 -295873 180279
16011 297103 -12144 251702 -212713 36101 -17892 378617 203881 -43352 -375631 -148177
16000 195149 -182570 -48563 -275983 -9817 -110616 157863 -175227 156075 5440 -88475 52049
15988 -36813 124988 72154 102909 25543 -45897 -89863 -61500 -156630 -147494 2456 107245 190526
15976 190526 -21480 199011 -123566 128732 145351 201215 -144643 52466 155273 286902
15966 286902 -86836 626583 98290 183774 150521 -4154 -156439 106373 -32807 -57661 94818
15954 30011 5056 -8624 238735 -207947 136985 -74558 173071 300218 67681 53735 388847
15943 388847 126563 -499783 54420 973 202037 -192070 328986 -110373 -112505 20529 -140456
$$ packed form
16023a89767A21434f63033C5151a23323H0870j327d7279c283A81329b95873A80279
16011B97103a2144B51702b12713C6101a7892C78617j74736d3352l32279a48177
16000A95149a82570d8563k27420i817j00799A57863a75227A56075E440h8475E2049
15988c6813A24988n2834L0755B5543d5897m3966K8363r5130R136B456J04789Q3281
15976A90526b1480A99011a23566A28732J6619N5864a44643E2466J02807J31629
15966B86902h6836F26583I8290Q5484l3253d154j52285A06373c2807k4854I4818
15954C0011E056h624B38735b07947A36985g4558A73071J27147F7681j3946L35112
15943C88847A26563d99783E4420I73K01064a92070C28986a10373k132B0529a40456
$$ plain form
15931 -111981 196969 189420 115483 -221751 -233768 373763 -209968 -188512 228392 -11883 -340120
15920 -340120 225475 -57891 2986 -89990 103902 -143398 -92299 -185773 -107614 -34907 -117979
15909 -117979 -30214 -172767 -138303 60487 -59219 124686 41325 -147941 -127769 91577 -105110
15897 6592 -70878 -102680 -141164 -267886 -372099 -11146 -201048 43345 310604 84103 -153157
15885 119191 -126618 -82642 47717 -335762 -57384 -202093 106691 -348135 -43701 55964
15874 -35242 31909 -79744 -66732 -214498 -268035 -94837 -1985 56917 50699 147 14929 95119
15862 95119 -44809 -87260 113527 -174778 -173453 351962 -312989 -167586 -176446 235361 33775
15850 -119040 -214960 -469472 164847 220518 -111288 346274 31974 -227333 58067 -33457
$$ packed form
15931a11981A96969p549p3937b21751j2017C73763b09968K1456B28392a1883l28237
15920c40120B25475e7891B986h9990A03902a43398N1099r3474P8159c4907q3072
15909a17979c0214j42553L4464F0487e9219A24686D1325a47941K0172I1577a05110
15897F592g0878l1802l8484j26722j04213a1146j89902D3345K67259H4103a53157
15885A19191a26618M3976D7717c35762e7384j44709A06691c48135d3701E5964
15874c5242C1909g9744J3012j47766n3537i4837a985E6917o218A47J4782Q0190
15862I5119d4809m2451A13527a74778J325C51962c12989J45403q860B35361C3775
15850a19040r5920k54512A64847N5671a11288C46274C1974b27333E8067c3457
$$ plain form
15839 71892 230262 -95702 66665 201222 955 58518 -39220 357037 207835 94087 196082
15828 196082 -6712 -178561 -205296 -432714 222941 -142675 381242 -139756 215245 -198300
15817 -1618 11185 -71484 111412 68322 -268077 -63264 165064 -55877 84028 -55237 -26107
15805 248466 19607 -169356 -177026 10845 -50552 -74803 -62863 -17470 -53599 -39256 -263195
15794 -263195 -98334 -223189 15994 121134 -1560 174771 -54880 -138069 256230 -264059 130076
15782 -82184 30619 -232188 -108973 -45269 -165452 87599 -15612 -94183 -46385 -357268 230436
15770 -259398 -1676 -170830 438496 -45899 -63893 -320797 8500 -180682 117433 -177608 233498
15758 -215404 -44254 -196160 -206055 -372237 -105235 126860 -169005 -326157 239936 133812
$$ packed form
15839G1892J58370i5702F6665J34557I55N7563c9220C57037j49202I4087J01995
15828A96082f712j71849k6735k27418B22941a42675C81242a39756B15245a98300
15817a618A1185g1484A11412m3090b68077f3264A65064e5877H4028e5237b6107
15805B48466A9607a69356p670A0845e0552k4251J1940a7470l6129J4343k23939
15794b63195i8334j24855A5994J05140a560A74771e4880q3189B56230b64059A30076
15782h2184C0619b32188a08973d5269j20183H7599a5612p8571d6385l10883B30436
15770b59398a676j69154D38496d5899j7994k56904H500a80682A17433a77608B33498
15758b15404d4254j51906r895j66182a05235A26860a69005j57152B39936j06124
$$ plain form
15748 133812 -112260 -65589 229373 -24399 -354485 -84920 -308732 69806 70950 80163 -219351
15736 -239318 219863 361313 -319693 35402 -11677 3133 213625 12694 77123 90365 -203208
15724 -32256 -25763 189616 176517 80587 -113661 28873 -11210 156130 -20028 -80495 68911
15712 161611 15070 139546 15037 161442 -7738 -107910 223103 -52163 -42585 165500 90772
15701 90772 120865 400611 127657 -218600 189723 46570 -88636 233458 60955 -216693
15690 92527 -301686 -58595 -254738 152713 256607 -15787 -102988 -229142 -164005 229575
15679 -14912 -28855 -128318 -50794 176830 -14419 -114440 -41749 172321 -42704 -259311 174312
15667 -260326 -265993 231865 -125313 -25597 -103874 -99792 -203997 266111 -114938 -330190 -262542
$$ packed form
15748A33812a12260M6671B29373b4399l30086h4920k23812F9806J144R213b19351
15736b39318B19863J41450c19693C5402a1677C133K10492A2694O4429J3242b03208
15724c2256O493A89616j3099H0587a13661B8873a1210A56130b0028o0467F8911
15712A61611A5070J24476A5037J46405g738j00172B23103e2163R578A65500p4728
15701I0772L0093K79746A27657b18600A89723D6570h8636B33458F0955b16693
15690I2527c01686e8595j96143A52713J03894a5787q7201j26154O5137B29575
15679a4912j3943r9463e0794A76830a4419j00021d1749A72321d2704k16607A74312
15667b60326n667B31865a25313b5597p8277M082j04205B66111a14938k15252O7648
$$ plain form
15656 -262542 -224833 4455 67133 -223075 -67106 -17637 -3812 -66983 39641 -299682 -101054
15644 -172683 -135343 -184736 32766 868 -136888 -342400 -126459 191500 87250 27192 -201301
15632 -327555 -174792 72450 -476997 -162488 -216084 -107135 184935 -37843 -234908 -14826
15621 -31189 229910 -54181 26613 -131054 323605 -191963 6464 -14944 177951 -57097 -105702
15610 -105702 202328 77471 54430 22792 -118617 -273118 -70182 312585 305439 -77012 265239
15598 -27316 -127153 -258812 125019 -183281 -243039 -267705 -43892 -201522 111238 148674 -77360
15586 -66770 16838 16365 -310303 -29815 56605 39686 -98788 -130950 -212681 -152366 83142 185293
15574 185293 -48590 -22704 194876 59326 147540 139069 205270 -54778 -114969 -95658 82105
$$ packed form
15656b62542L7709D455O2678b23075f7106a7637c812o3171C9641b99682a01054
15644a72683L7340m9393C2766H68a36888k05512a26459A91500H7250B7192b01301
15632c27555J52763G2450d76997a62488n3596a07135A84935c7843j97065a4826
15621c1189B29910e4181B6613a31054C23605a91963F464a4944A77951e7097m8605
15610a05702B02328G7471k3041B2792a18617j54501g0182C12585p146g7012B65239
15598b7316r9837j31659A25019a83281n9758k4666d3892j57630A11238L7436g7360
15586f6770A6838m73c10303b9815E6605j6919i8788l2162q1731O0315H3142J02151
15574A85293d8590b2704A94876E9326Q8214q471O6201e4778o0191J9311H2105
$$ plain form
15562 -136224 -212873 -229201 -357819 243275 187266 -63935 97083 -6286 -172746 -343091 106161
15550 12987 -90957 -105348 222102 181326 281789 -171140 -310444 -16687 129223 -300 208802
15538 -65461 193696 468146 -67268 193112 51829 -282820 32930 -192582 21473 68317 -151277
15526 310062 -61704 325785 37700 -156680 134055 229124 -69749 267638 -331887 62775
15515 115247 235933 -69057 45832 141135 35734 -161615 -163347 -261161 62030 -268259 50985
15503 -262502 271192 309272 -200223 -194854 -229020 61578 -22509 238306 141126 262158 -65880
15491 -234835 -241047 330403 9518 220345 -171345 349696 -88639 -104918 -195400 -4851 4395
15479 13827 -144308 121868 -101063 -151218 -9323 -59396 -158005 150897 -162998 -25923 -7477
$$ packed form
15562a36224p6649j6328j28618B43275n6009f3935I7083f286j66460j70345A06161
15550A2987i0957j4391B22102m0776J00463a71140j39304a6687A29223c00B08802
15538f5461A93696K74450f7268A93112E1829b82820C2930a92582B1473M6844a51277
15526C10062f1704C25785C7700a56680A34055R5069f9749B67638c31887F2775
15515A15247J20686f9057D5832R5303C5734a61615j732r7814F2030b68259E0985
15503b62502B71192L8080b00223N369l4166F1578b2509B38306r7180J21032f5880
15491b34835o212C30403I518K10827a71345C49696h8639j6279r0482d851D395
15479A3827a44308A21868a01063n0155i323n0073r8609A50897a62998b5923g477
$$ plain form
15467 257751 71163 -122634 -193324 -333430 -44090 346700 58880 -185876 451699 -8005 35172
15455 11462 121847 74365 7435 95461 -136161 -12781 -137184 249489 -103802 -78541 63270
15443 105946 -37112 381686 392527 -190072 105453 540853 -103856 -159092 -53518 206530
15432 -8716 -51426 -81734 -355331 -20328 85347 369391 54612 265322 256752 -127430 -236998
15421 -236998 118506 -279456 -8861 153173 109070 61971 342990 201846 94487 -133332
15410 317642 -210322 -45324 30205 230618 -75108 321251 7261 -107646 -15030 32764 82611
15399 82611 39612 29504 33684 247590 11740 72041 130204 -21762 -77647 -65441 86221 -98679
15386 123307 -127438 -74594 -224082 26672 50747 112622 183487 174180 -124814 -342651 438531
$$ packed form
15467B57751G1163a22634p0690j40106d4090C46700E8880a85876D51699h005C5172
15455A1462J10385m7482G435Q8026a36161a2781j24403B49489a03802K5261F3270
15443A05946c7112C81686J0841a90072A05453M35400a03856n5236e3518B06530
15432h716m2710l0308k73597b0328H5347K84044E4612K10710q570a27430j09568
15421b36998A18506b79456h861A53173m4103m7099K81019j41144I4487a33332
15410C17642b10322d5324C0205K00413g5108C21251G261a07646a5030C2764M9847
15399H2611C9612j0108M180K13906A1740O0301N8163b1762n5885J2206H6221i8679
15386A23307a27438N2844j49488B6672K4075O1875P0865r307a24814k17837D38531
$$ plain form
15374 -7423 -41669 -82967 -371351 70879 -175179 22121 -55264 46275 -61946 95431 98235 -225916
15361 -744 -322690 120865 -73727 -63382 -106531 162043 42999 -211082 60758 105656 163849
15350 163849 -82370 130241 -106519 289215 19553 343665 190959 -235989 -55742 25805
15339 -25324 150750 -137668 106510 -180523 -143681 -51372 -96058 -318551 340841 -73664
15328 195365 -14854 45306 -310277 98845 25042 229733 -68659 -109755 200603 69621 -3525
15316 197232 88808 192529 231826 65260 -20370 138850 -71509 46908 -168620 188349 137251
15305 137251 -70469 -41005 238578 44848 -302184 -53271 -199730 577776 -238230 216423
15294 104641 -77727 233585 80479 250441 -253846 59555 6279 8254 3971 361907 -73308
$$ packed form
15374g423l4246m1298k88384G0879a75179B2121e5264D6275f1946I5431K804b25916
15361g44l21946A20865g3727J0345m3149A62043D2999b11082F0758M4898N8193
15350A63849h2370A30241a06519B89215A9553L24112j52706b35989e5742B5805
15339b5324A50750a37668A06510a80523L6842e1372m4686k22493C40841g3664
15328A95365a4854D5306c10277I8845B5042K04691f8659m1096B00603F9621c525
15316A97232H8808J03721L9297F5260b0370A38850g1509D6908a68620A88349n1098
15305A37251g0469K9464B38578D4848c02184e3271j46459E77776b38230B16423
15294A04641g7727B33585H0479J69962b53846E9555F279J975C971L57936g3308
$$ plain form
15282 -186559 202883 -83071 -245933 134169 213826 -278496 196763 456549 94845 154505
15272 154505 -27185 -72232 329176 -50631 198831 -47639 -194039 50293 -184980 -20921 496346
15260 210109 42386 -220211 189637 171543 -139805 -45438 -113444 74647 -53270 199079 812
15248 -9004 193228 30753 5145 353834 -14872 -303648 -79822 197651 35243 216593 3579
15236 396083 141032 545500 633930 1268782 1794566 1358945 894578 1250825 887969 405750
15225 478385 309864 -307731 -66168 -47102 248580 -32765 115004 -80528 539102 55926
15214 128535 -67072 253626 190397 -5723 -25451 -83100 56284 -87294 -131525 23744 52924
15203 52924 52391 171999 -149161 -145508 110092 127650 239758 52875 167348 -42044 285092
$$ packed form
15282a86559B02883h3071j62862A34169P9657b78496A96763K59786I4845N9660
15272A54505b7185m5047C29176e0631A98831d7639j46400E0293a84980b0921D96346
15260B10109D2386b20211A89637j8094a39805d5438o8006G4647e3270A99079H12
15248i004A93228C0753E145L48689a4872k88776g9822A97651C5243J81350C579
15236C96083A41032M04468Q8430O34852N25784m35621m64367L56247l62856D05750
15225D78385j68521c07731f6168J9066B48580c2765A15004h0528E39102E5926
15214A28535f7072B53626o3229e723j9728n7649E6284h7294m4231B3744K9180
15203E2924n33J19608a49161L653A10092J7558J12108E2875J14473d2044B85092
$$ plain form
15191 370859 249535 -279151 -105326 218330 -56734 -143532 104105 94775 259887 342290
15181 342290 -5723 -139494 130996 -35812 117601 43006 254514 -272909 -58928 -8035 163764
15169 -9817 206157 137567 -90979 -376003 -123624 -31692 276373 136475 -218555 -27314 224773
15157 32640 57108 139811 68853 157895 -430697 -64367 297051 57297 65621 461982 132102
15145 325407 265903 -237812 93384 -130441 25783 39475 304215 372755 140015 67604 81329
15134 81329 95220 8211 360570 -66254 -61658 -249015 200029 364637 284194 111227 242722
15123 242722 221984 452923 -213600 56047 64153 73350 126893 -259361 131074 246267 -5174
15111 -102214 119574 356152 -21640 247926 285545 -160721 29772 -118362 281165 242814
$$ packed form
15191C70859j21324b79151a05326B18330e6734q6798A04105r330J65112Q2403
15181C42290e723j33771A30996c5812A17601D3006K11508b72909e8928h035A63764
15169i817B06157o8590i0979k85024a23624c1692B76373A36475b18555b7314B24773
15157C2640K4468Q2703F8853Q9042d30697f4367B97051E7297Q324L96361A32102
15145C25407n9504b37812I3384a30441B5783J3692K64740O8540A40015F7604J3725
15134H1329J3891H211L52359f6254M596j87357B00029J64608q0443A11227J31495
15123B42722k0738K30939b13600E6047Q106R197N3543b59361A31074J15193e174
15111a02214A19574K36578b1640B47926L7619a60721B9772a18362B81165l8351
$$ plain form
15101 242814 292266 122631 24876 151337 -74308 275065 -3198 -105622 95401 -188821 328236
15089 217779 146357 -95969 -15948 64735 340335 138766 209769 -26883 -15282 284652 157712
15078 157712 -37225 -153618 174729 -119272 203308 -39019 120830 179909 33092 281986
15068 281986 102807 141880 535867 88338 303057 278227 584528 327751 -25390 -227471
15058 -227471 424986 229844 48438 68956 173039 74468 136358 455099 72292 277373
15048 277373 -44919 99388 156273 380860 176428 7357 88769 157599 -18880 160248 -41247
15036 297951 472304 30172 214848 -30645 449931 184129 135121 414303 256861 266271
15026 266271 132456 33768 80232 624657 117991 263441 280496 89976 184576 290695
$$ packed form
15101B42814M9452A22631B4876J26461g4308B75065c198j02424I5401a88821C28236
15089B17779p1422i5969a5948F4735K75600A38766P1003b6883J1601B84652j26940
15078A57712c7225j16393A74729a19272B03308c9019A20830N9079C3092K48894
15068B81986A02807L9073L93987H8338K14719k4830L06301k56777b5390k02081
15058b27471D24986j95142D8438K0518J04083G4468O1890L18741G2292K05081
15048B77373d4919I9388N6885K24587A76428G357Q1412O8830a8880A60248d1247
15036B97951J74353C0172J84676c0645D49931A84129m9008K79182j57442R410
15026B66271A32456C3768M6464N44425A17991J45450J7055H9976R4600J06119
$$ plain form
15016 290695 211123 -6151 80637 123737 314213 19926 -197288 117864 352031 46491 165328
15005 165328 60893 171193 25811 276698 341495 366813 -18243 13167 -4241 271707 85767
14993 384905 157917 177113 286217 -151725 191913 271535 -106900 20373 165783 414279
14983 414279 -255470 208921 458772 363822 82306 217032 -201769 -41292 243656 411445
14973 411445 -24679 234779 301834 -102297 172431 346415 30808 237276 169875 33931
14962 -24676 282903 332969 -105616 295749 432040 -35642 272397 -35554 16769 153303
14952 153303 127274 284456 367116 31147 136018 427169 310965 326289 100371 77014
14942 77014 20297 399955 17276 -31605 489702 359946 461929 348904 252209 528556
$$ packed form
15016B90695p9572f151H0637M3100J90476A9926a97288A17864K34167D6491J18837
15005A65328F0893J10300B5811K50887O4797K5318a8243A3167d241B71707H5767
14993C84905A57917J9196J09104a51725A91913P9622a06900B0373J45410K48496
14983D14279b55470B08921K49851r4950H2306J34726b01769d1292B43656J67789
14973D11445b4679B34779O7055a02297A72431J73984C0808K06468o7401C3931
14962b4676B82903N0066a05616B95749J36291c5642B72397c5554A6769J36534
14952A53303k6029J57182Q2660C1147J04871K91151j16204J5324A00371k3357
14942G7014B0297L79658A7276c1605D89702j29756J01983j13025r6695K76347
$$ plain form
14932 528556 -39203 66918 169451 160063 290024 375284 210294 141051 179320 585223 408338
14921 408338 336928 319008 368884 -125739 467913 127048 -77796 -10459 35403 134187 217498
14910 217498 332447 230844 425314 377082 133424 392057 515160 567592 140500 214994
14900 214994 359091 166879 110108 118145 201851 -62794 240207 423075 302664 190494
14890 190494 313216 -17025 350136 112086 354398 -41957 385774 348343 389729 583667
14880 583667 197035 595335 443747 270254 314792 486349 232882 403075 233796 363565
14870 363565 537470 395416 411948 389728 36191 145414 371296 437229 208575 252583
14860 252583 63751 496436 -43505 43594 483991 545967 559311 289931 -4997 330083 524984
$$ packed form
14932E28556c9203F6918J02533r388J29961Q5260j64990o9243L8269M05903j76885
14921D08338p1410j7920M9876a25739D67913A27048g7796a0459C5403R8784Q3311
14910B17498J14949j01603J94470m8232A33424K58633J23103N2432A40500P4494
14900B14994J44097A66879n6771Q037Q3706f2794B40207J82868j20411j12170
14890A90494J22722a7025C50136A12086K42312d1957C85774l7431M1386J93938
14880E83667A97035L98300j51588j73493M4538J71557B32882J70193j69279J29769
14870C63565J73905j42054J6532k2220C6191J09223K25882O5933B08575M4008
14860B52583F3751M32685d3505D3594M40397O1976J3344k69380d997C30083J94901
$$ plain form
14849 524984 411379 770409 330631 322823 388271 541840 523398 464518 453195 265504 71551
14837 516622 949454 409951 541903 207718 337232 438257 580359 424917 354626 444732
14827 444732 610238 467778 336625 35308 378154 242746 251662 587521 481804 201070
14816 273263 295575 189259 607463 577934 561547 352720 165422 458930 538694 498926
14806 498926 231919 288018 212183 416415 77412 509779 279143 528205 399819 273088
14796 273088 376793 416237 776241 279084 549128 878987 604426 552599 231767 551799
14786 551799 355446 324473 617602 299485 482684 470779 658991 243602 494265 919909
14776 919909 283611 572060 374865 626590 389552 252200 701209 575812 617367 306358
$$ packed form
14849E24984j13605L59030C30631p808O5448J53569j8442n8880j1323j87691G1551
14837E16622M32832D09951J31952B07718J29514J01025J42102j55442p0291R0106
14827D44732J65506j42460j31153C5308L42846j35408Q916L35859j05717B01070
14816B73263K2312j06316M18204k9529j6387k08827A65422K93508P9764l9768
14806D98926B31919N6099p5835K04232G7412M32367k30636K49062j28386j26731
14796B73088J03705L9444L60004B79084K70044L29859k74561n1827B31767L20032
14786E51799j96353l0973K93129B99485J83199j1905J88212B43602K50663M25644
14776I19909B83611K88449j97195K51725k37038j37352M49009j25397M1555C06358
$$ plain form
14765 593485 367412 591795 720680 239808 468773 523138 496573 319210 459407 551389
14755 551389 451308 558278 427683 371086 276069 420099 485717 574200 560242 715981
14745 715981 431759 337174 842644 705363 600112 505033 522690 818873 685563 443810
14735 443810 237798 294136 504751 734842 612094 370627 330412 667268 578933 641858
14725 641858 732719 702820 641185 703310 823100 815659 658569 682360 570501 421525 285159
14714 285159 241252 339142 759633 862326 536816 675910 768529 713149 504241 554046
14704 554046 565095 707022 713846 514034 603049 714922 509552 635845 785707 751425
14694 751425 433906 779325 739977 855985 903248 880083 893427 661904 745283 863955
$$ packed form
14765E93485k26073K24383J28885B39808K28965N4365k6565j77363J40197R1982
14755E51389j00081J06970j30595n6597r5017J44030O5618Q8483j3958J55739
14745G15981k84222r4585N05470j37281j05251r5079J7657K96183j33310k41753
14735D43810k06012N6338K10615K30091j22748k41467m0215L36856q8335O2925
14725F41858R0861k9899o1635O2125J19790p441j57090K3791j11859j48976j36366
14714B85159m3907R7890M20491J02693l25510J39094R2619n5380k08908M9805
14704E54046J1049J41927O824j99812Q9015J11873k05370J26293J49862l4282
14694G51425l17519L45419l9348J16008M7263k3165J3344k31523Q3379J18672
$$ plain form
14684 863955 719601 852514 694165 721870 497026 865705 645692 876730 910440 797392
14674 797392 802951 863900 804742 808574 978352 811834 1048663 1074884 1001949 934406 1060240
14663 1060240 728363 720117 1189542 894024 776679 746092 1190185 825602 1265776 965410
14653 965410 1051773 1007594 816197 1023572 871669 869083 970727 1323579 870130 1059957
14643 1059957 736967 1056869 907173 880099 1112560 1322222 1030841 940208 974972 1094206
14633 1094206 1007951 1300150 952943 1408703 966124 1116455 904982 1462503 1345512 1162765
14623 1162765 1197077 1471983 1425494 1010482 1163997 1064307 751958 1176078 981912 1060731
14613 1060731 1236940 1190261 1455433 1026911 1233315 1157089 1240228 1483069 1341005 1278388
$$ packed form
14684H63955j44354J32913j58349K7705k24844L68679k20013K31038L3710j13048
14674G97392N559O0949n9158L832J69778j66518K36829K6221p2935o7543J25834
14663A060240l31877q246M69425k95518j17345l0587M44093l64583M40174l00366
14653I65410Q6363m4179j91397K07375j51903k586J01644L52852m53449J89827
14643A059957l22990L19902j49696k7074K32461K09662k91381r0633L4764J19234
14633A094206q6255K92199l47207M55760m42579J50331k11473N57521j16991j82747
14623A162765L4312K74906m6489m15012J53515r9690l12349M24120j94166P8819
14613A060731J76209m6679K65172m28522K06404p6226Q3139K42841j42064o2617
$$ plain form
14603 1278388 1105587 1444926 1475466 1312228 1311174 1322365 1320366 1299074 1348982 1707483 1441940
14592 1441940 1276512 1568612 1469193 1102312 1610454 1745899 1647137 1593606 1872821 1884320
14582 1884320 1817918 1425530 1368214 1382394 1554725 1426271 1660429 1568595 1577378 1611118 1445603
14571 1445603 1810096 1492428 1592951 1675112 1649775 1711072 1790898 1436505 1844571 1659959
14561 1659959 1810116 1791963 1964663 1718360 2124938 1727269 2350245 2027408 2116988 2181249
14551 2181249 2367856 2267432 2355420 2229030 2529598 2765265 2688910 2635622 3149970 3041500
14541 3041500 3360143 3404461 4232949 4260614 5024889 5916662 6824460 9330391 13298599
14532 13298599 20232214 30394658 29027544 17793896 12564866 8122041 5091545 3646271
$$ packed form
14603A278388j72801L39339L0540j63238j054J1191j999k1292M9908L58501k65543
14592A441940j65428K92100r9419l66881N08142J35445r8762n3531K79215J1499
14582A884320o6402l92388n7316J4180J72331j28454K34158r1834Q783L3740j65515
14571A445603L64493l17668J00523Q2161k5337O1297P9826l54393M08066j84612
14561A659959J50157j8153J72700k46303M06578l97669O22976l22837Q9580O4261
14551B181249J86607j00424Q7988j26390L00568K35667p6355n3288N14348j08470
14541C041500L18643M4318Q28488K7665P64275Q91773R07798K505931L968208
14532A3298599O933615J0162444j367114j1233648n229030m442825l030496j445274
$$ plain form
14524 3646271 3404784 2710393 2521357 2138387 2404494 2364069 2041491 2257368 1940442 2215608
14514 2215608 2085568 2363925 2541294 1986438 2392939 2447440 1984978 1949188 2349669 1773506
14504 1773506 1969288 2552410 2268937 2623307 2501993 2626031 2136758 2101087 2703971 2100726
14494 2100726 2397466 2784567 2742519 2766780 2788316 2490693 2834101 2872063 3007808 2581924
14484 2581924 2684191 3171779 3006790 2879972 3095133 3087824 2980858 3404062 3323506 3361125
14474 3361125 3360642 3271595 3440262 3291159 3285828 3515013 3661185 3567118 3604380 3448999 3361064
14463 3361064 3868507 3722851 3553653 3548156 3543876 3604242 3957704 3854850 4250990 3925679
14453 3925679 3963483 4092924 3656686 4123462 4244651 4601742 4189314 4082869 4614626 4495914
$$ packed form
14524C646271k41487o94391j89036l82970K66107m0425l22578K15877l16926K75166
14514B215608j30040K78357J77369n54856M06501N4501m62462l5790M00481n76163
14504A773506J95782N83122k83473L54370j21314J24038m89273l5671O02884o03245
14494B100726K96740L87101m2048K4261K1536k97623L43408L7962J35745m25884
14484B581924J02267M87588j64989j26818K15161p309j06966M23204q0556L7619
14474C361125m83q9047J68667j49103n331K29185J46172r4067L7262j55381q7935
14463C361064N07443j45656j69198n497m280O0366L53462j02854L96140l25311
14453C925679L7804J29441m36238M66776J21189L57091m12428j06445N31757j18712
$$ plain form
14443 4495914 4306431 4208710 4616117 4751205 4676022 4680304 4698869 4865059 4844386 4913236 4995491
14432 4995491 5117451 4896271 5099318 5490679 5307287 5529469 5563645 5770636 5636280 5523076
14422 5523076 5843208 6052100 5923765 6060220 6006474 6258647 6076343 6454857 6528238 6758645
14412 6758645 6478048 6655142 6779450 6797104 6939784 6599693 6975021 7475159 7330981 7545730
14402 7545730 7800347 7728083 7517235 7963981 8054066 7861845 8264652 8315800 8383844 9041436
14392 9041436 8676784 8813051 9259802 9345680 9424694 9436867 9869401 9925116 10140538 10062881
14382 10062881 10163946 10357684 10981640 10951217 10979772 11462840 11603760 11550331 11848488 11735287
14372 11735287 12207391 12407284 12916687 12828237 12797829 13412952 13469041 13794478 14147671 14098327
$$ packed form
14443D495914j89483r7721M07407J35088p5183M282J8565J66190k0673O8850Q2255
14432D995491J21960k21180K03047L91361j83392K22182L4176K06991j34356j13204
14422E523076L20132K08892j28335J36455n3746K52173j82304L78514P3381K30407
14412F758645k80597J77094J24308J7654J42680l40091L75328N00138j44178K14749
14402G545730K54617p2264k10848M46746R0085j92221M02807N1148O8044O57592
14392I041436l64652J36267M46751Q5878P9014J2173M32534N5715K15422p7657
14382A0062881J01065J93738O23956l0423K8555M83068J40920n3429K98157j13201
14372A1735287M72104J99893N09403q8450l0408O15123N6089L25437L53193m9344
$$ plain form
14362 14098327 14740880 14829147 15057634 15438214 15661409 16003522 16312020 16530735 16851143
14353 16851143 17453623 17696600 18081376 18415895 18763446 19186154 19617743 19916401 20681359
14344 20681359 21257732 21345894 22126538 22488111 23059467 23337018 24677734 24706675 25096581
14335 25096581 25942222 26638262 27251409 28144104 28277555 29325023 30609092 31290095 32283980
14326 32283980 32830122 33713191 34484309 35590461 36598917 37526891 38975827 39913550 41311167
14317 41311167 42234327 43945046 45162698 46794090 48191181 49862112 51250859 53071498
14309 53071498 55127187 56914411 58809065 61271126 63316936 65898408 68550211 70840194
14301 70840194 74072035 76326707 79756276 82812901 86514949 89993182 94064115 98433996
$$ packed form
14362A4098327O42553Q8267K28487L80580K23195L42113L08498K18715L20408
14353A6851143O02480K42977L84776L34519L47551M22708M31589K98658P64958
14344B0681359N76373Q8162P80644L61573N71356K77551J340716K8941L89906
14335B5096581Q45641O96040O13147Q92695J33451J047468J284069O81003R93885
14326C2283980N46142Q83069P71118J106152J008456R27974J448936R37723J397617
14317D1311167R23160J710719J217652J631392J397091J670931J388747J820639
14309E3071498K055689J787224J894654K462061K045810K581472K651803K289983
14301G0840194L231841K254672L429569L056625L702048L478233M070933M369881
$$ plain form
14293 98433996 102535298 106970848 112259925 117743483 123096225 129084913 135672818 142689301
14285 142689301 150051464 157613929 165497665 174374482 183478317 193413509 203595948 214814901
14277 214814901 226453097 238630451 251404551 265070755 278763325 293026645 307302695
14270 307302695 322082188 336919629 351345241 365225591 378819765 391727647 404052454
14263 404052454 415583077 425820563 435442543 444410031 452314831 457050959 459090608 459740059
14255 459740059 460461956 454994509 448186672 441217863 432417726 420849332 409189439 396623582
14247 396623582 382983555 368750889 354281161 339373596 324643731 309985538 295485905
14240 295485905 281692781 268489936 256256324 244110833 231470247 219100491 207236495
$$ packed form
14293I8433996M101302M435550N289077N483558N352742N988688O587905P016483
14285A42689301P362163P562465P883736Q876817R103835R935192J0182439J1218953
14277B14814901J1638196J2177354J2774100J3666204J3692570J4263320J4276050
14270C07302695J4779493J4837441J4425612J3880350J3594174J2907882J2324807
14263D04052454J1530623J0237486R621980Q967488P904800M736128K039649O49451
14255D59740059P21897n467447o807837o968809q800137j1568394j1659893j2565857
14247C96623582j3640027j4232666j4469728j4907565j4729865j4658193j4499633
14240B95485905j3793124j3202845j2233612j2145491j2640586j2369756j1863996
$$ plain form
14233 207236495 196286900 185733146 176192222 166944502 159284187 150881662 143450671 136592505
14225 136592505 130290001 124018149 118522097 113232647 108108692 103388538 99005051 94650748
14217 94650748 90625025 86805325 83651168 80350815 77035202 73979762 70896981 68593279
14209 68593279 65733330 63566156 60972334 58957491 56913603 55302727 53411524 51448273
14201 51448273 49601949 48121741 46713511 44899514 44117801 42595154 41078008 39934785
14193 39934785 39237761 38084601 37209198 36107434 34837242 33879166 32857148 32057062 31484218
14184 31484218 30531237 29467410 28681343 27801766 27406811 26903647 25981900 25573435 24811321
14175 24811321 24229675 23575058 23179866 22521564 22275418 21773033 20978142 20644094 20064047
$$ packed form
14233B07236495j0949595j0553754r540924r247720p660315q402525p430991o858166
14225A36592505o302504o271852n496052n289450n123955m720154m383487m354303
14217I4650748m025723l819700l154157l300353l315613l055440l082781k303702
14209F8593279k859949k167174k593822k014843k043888j610876j891203j963251
14201E1448273j846324j480208j408230j813997p81713j522647j517146j143223
14193C9934785o97024j153160q75403j101764j270192r58076j022018q00086n72844
14184C1484218r52981j063827p86067q79577l94955n03164r21747m08465p62114
14175B4811321n81646o54617l95192o58302k46146n02385p94891l34048n80047
$$ plain form
14166 20064047 19542548 19410860 18943014 18571991 17737634 17679368 17378219 17275963 16539589
14157 16539589 15946793 15901025 15830109 15178354 15283533 14840329 14446970 14234489 14202609 13767395
14147 13767395 13597060 13301675 13067044 12829035 12758489 12333801 11967639 12062000 11736591 11407833
14137 11407833 11713926 11274427 10680919 10466776 10508266 10260407 10285994 10305197 9956917 9854771
14127 9854771 9726876 9828979 9494455 9185603 9221430 9006310 8853690 8853381 8945451 8502153
14117 8502153 8498132 8472400 8427110 8003655 7906209 7596808 7727832 7474985 7478610 7410309 7289572
14106 7289572 7163343 7050746 6922263 6959031 6858986 6887851 6537948 6669158 6581445 6216818
14096 6216818 6469323 6479019 6036525 5949859 6056353 5785916 5793071 5668305 5677794 5667600 5612423
$$ packed form
14166B0064047n21499j31688m67846l71023q34357n8266l01149j02256p36374
14157A6539589n92796m5768p0916o51755J05179m43204l93359k12481l1880m35214
14147A3767395j70335k95385k34631k38009p0546m24688l66162R4361l25409l28758
14137A1407833L06093m39499n93508k14143M1490k47859K5587J9203l48280j02146
14127I854771j27895J02103l34524l08852L5827k15120j52620l09R2070m43298
14117H502153m021k5732m5290m23455r7446l09401J31024k52847L625o8301j20737
14106G289572j26229j12597j28483L6768j00045K8865l49903J31210q7713l64627
14096F216818K52505R696m42494q6666J06494k70437P155j24766R489j0194n5177
$$ plain form
14085 5612423 5656529 5680786 5552463 5457859 5279837 5201782 5009836 5245639 5170047 5105771
14075 5105771 4522969 4962344 4891441 4969853 4766796 4715321 4845618 4531608 4340506 4252705
14065 4252705 4447209 4814494 4543164 4470085 4547358 4341664 4343830 4352710 4369588 3704439 3808985
14054 3808985 4014904 3995024 3843851 4074983 3834822 3714409 3658662 3764679 3446399 3646239
14044 3646239 3562967 3680527 3478023 3834481 3438299 3437770 3493676 3255476 3620312 3313681
14034 3313681 2934291 2780332 3428309 3217602 2946491 3106683 2924722 2874953 3006079 2974635
14024 2974635 2698662 2856611 2701266 2935753 2811496 2599524 2986694 2924801 2995321 2879359
14014 2879359 2626555 2929672 2831641 2708568 2524280 2389078 2326963 2710027 2699396 2399596
$$ packed form
14085E612423M4106K4257j28323r4604j78022p8055j91946K35803p5592o4276
14075E105771n82802M39375p0903P8412k03057n1475J30297l14010j91102q7801
14065D252705J94504L67285k71330p3079P7273k05694K166Q880J6878o65149J04546
14054C808985K05919j9880j51173K31132k40161j20413n5747J06017l18280J99840
14044C646239q3272J17560k02504L56458l96182n29N5906k38200L64836l06631
14034C313681l79390j53959O47977k10707k71111J60192j81961m9769J31126l1444
14024B974635k75973J57949j55345K34487j24257k11972L87170o1893P0520j15962
14014B879359k52804L03117r8031j23073j84288j35202o2115L83064j0631k99800
$$ plain form
14004 2399596 2824499 2542746 2084240 2370827 2302462 2270363 2152386 1945595 2137888 2188795
13994 2188795 2069724 2221634 1834462 2126148 2396392 2320749 1940196 2089247 2226872 1901314
13984 1901314 2003920 2142661 2262521 2493422 2339405 2543543 2694684 3017665 3863102
13975 3863102 4604992 6225774 9080086 15418219 26475541 29771004 20129915 13206117
13967 13206117 8799962 6841765 5490878 4924466 4252953 3664492 3281807 3252628 3013722
13958 3013722 2612966 2973788 2655790 2660925 2896676 2675976 2500284 2398583 2178485 2041601
13948 2041601 2182038 1782944 1970859 1992534 2181291 1876475 1794938 2194679 1758755 2088831
13938 2088831 1735174 1407303 1576125 1778482 1839565 1788117 1841941 1677346 1577059 1623771
$$ packed form
14004B399596M24903k81753m58506K86587o8365l2099j17977k06791J92293N0907
13994B188795j19071J51910l87172K91686K70244p5643l80553J49051J37625l25558
13984A901314J02606J38741J19860K30901j54017K04138J51141L22981Q45437
13975C863102P41890J620782K854312O338133J1057322L295463r641089o923798
13967A3206117m406155j958197j350887n66412o71513n88461l82685k9179k38906
13958C013722m00756L60822l17998N135K35751k20700j75692j01701k20098j36884
13948B041601J40437l99094J87915K1675J88757l04816q1537L99741m35924L30076
13938B088831l53657l27871J68822K02357O1083n1448N3824j64595j00287M6712
$$ plain form
13928 1623771 1728957 1663692 1542217 1688006 1532248 1516385 1581989 1532481 1829111 2130121
13918 2130121 1689690 1692021 1271817 1486878 1512984 1093721 1300468 1443096 1612400 1574014
13908 1574014 1472162 1035184 1420130 1371385 1460348 1681864 1459090 1047964 1312353 1489904
13898 1489904 1636624 1465564 1474482 1330269 1650711 1236273 1029475 1161507 1345476 1372367
13888 1372367 1031495 1253892 1148012 1364828 946558 1092273 1077615 1137934 1436563 1404452
13878 1404452 1146503 1409249 892252 1147940 1082317 1069233 1237852 1121109 1031169 1228150
13868 1228150 1042280 1289065 988603 681183 1304323 1175235 1210811 982823 752059 899443
13858 899443 1014606 1068181 1216950 789191 632809 714613 1165537 902129 1275450 1167152
$$ packed form
13928A623771J05186o5265j21475J45789j55758j5863O5604m9508K96630L01010
13918B130121m40431K331m20204K15061K6106m19263K06747J42628J69304l8386
13908A574014j01852m36978L84946m8745Q8963K21516k22774m11126K64389J77551
13898A489904J46720j71060Q918j44213L20442m14438k06798J32032J83969K6891
13888A372367l40872K22397j05880K16816m18270J45715j4658O0319K98629l2111
13878A404452k57949K62746n16997K55688o5623j3084J68619j16743q9940J96981
13868A228150j85870K46785l00462l07420O23140j29088L5576k27988k30764J47384
13858H99443J15163N3575J48769m27759j56382Q1804M50924k63408L73321j08298
$$ plain form
13848 1167152 989594 1024184 1092168 1082237 635139 1036098 1245398 728738 859036 1139119
13838 1139119 1034584 975376 726184 1170666 964667 996346 930244 1052344 801455 855444
13828 855444 1081143 907634 882042 968430 1045129 1075282 735158 1040247 887763 909027
13818 909027 1024821 955155 756257 961511 617030 815667 611869 830441 672812 896242
13808 896242 771873 818521 523138 919412 1205234 1130258 819947 835146 855587 461159
13798 461159 758096 811211 395624 820612 720379 539876 861367 797070 533138 607672
13788 607672 685705 808141 652133 853442 593400 508322 1022673 709326 591740 487957
13778 487957 677906 978577 612337 666848 396369 915424 689134 854993 458674 608347
$$ packed form
13848A167152j77558L4590O7984r931m47098M00959K09300n16660J30298K80083
13838A139119j04535n9208k49192M44482k05999L1679o6102J22100k50889N3989
13828H55444K25699j73509k5592Q6388P6699L0153l40124L05089j52484K1264
13818I09027J15794o9666j98898K05254l44481J98637k03798K18572j57629K23430
13808H96242j24369M6648k95383L96274K85822p4976l10311J5199K0441l94428
13798D61159K96937N3115C95624M24988j00233j80503L21491o4297k63932P4534
13788F07672P8033J22436j56008K01309k60042q5078N14351l13347j17586j03783
13778D87957J89949L00671l66240N4511k70479N19055k26290J65859l96319J49673
$$ plain form
13768 608347 686987 507805 351700 935840 519291 858375 855139 841057 725053 581498
13758 581498 783599 766766 606328 439942 635640 579905 794694 830007 591184 856681
13748 856681 907157 771354 619385 703911 847098 438642 528878 626396 556406 689723
13738 689723 309336 699093 801169 615947 589624 702908 679197 783105 604276 892511
13728 892511 596268 732685 589389 219020 548908 617096 572003 475864 277045 519053
13718 519053 540073 240961 590408 653230 567933 692447 747290 603636 678183 575769
13708 575769 546604 638913 548496 674841 792025 723336 375755 814234 619992 695941
13698 695941 526133 877218 370439 556093 668020 564013 569160 577371 301991 710343
$$ packed form
13768F08347P8640j79182j56105N84140m16549L39084l236j4082j16004j43555
13758E81498K02101j6833j60438j66386J95698n5735K14789L5313k38823K65497
13748H56681N0476j35803j51969Q4526J43187m08456R0236R7518o9990J33317
13738F89723C09336L89757J02076j85222k6323J13284k3711J03908j78829K88235
13728H92511k96243J36417j43296B19020L29888O8188m5093r6139j98819K42008
13718E19053K1020B40961L49447O2822q5297J24514N4843j43654P4547j02414
13708E75769k9165R2309r0417J26345J17184o8689l47581M38479j94242P5949
13698F95941j69808L51085C70439J85654J11927j04007N147Q211k75380M08352
$$ plain form
13688 710343 119693 575978 301425 161007 440911 455515 733380 198578 596578 719885
13678 719885 865851 398016 672802 749722 105058 466319 401550 285341 464812 597444
13668 597444 325303 459261 275781 321322 601957 381326 267629 396327 481573 171073
13657 514631 552463 236325 679166 470404 409539 527515 475466 -7397 635845 430070
13647 430070 324279 320846 504794 346540 195234 476239 232444 198267 397873 261975
13637 261975 502599 538417 355490 504148 597301 195087 370737 329003 475063 478730
13627 478730 357364 223582 581411 402566 533665 251318 141464 148696 417252 448983
13617 448983 12189 177540 626390 335056 238962 553989 267146 321731 178541 477852
$$ packed form
13688G10343A19693M56285k74553j40418K79904J4604K77865A98578L98000J23307
13678G19885J45966C98016K74786P6920A05058L61261o4769j16209J79471J32632
13668E97444k72141J33958j83480M5541K80635k20631j13697J28698Q5246A71073
13657E14631L7832B36325M42841k08762o0865J17976n2049g397F35845k05775
13647D30070j05791l433J83948j58254j51306K81005B32444l4177J99606j35898
13637B61975K40624L5818j82927J48658R3153A95087J75650m1734J46060L667
13627D78730j21366j33782L57829j78845J31099B51318j09854P232K68556L1731
13617D48983A2189J65351M48850k91334r6094L15027B67146N4585j43190K99311
$$ plain form
13607 477852 210715 354932 505010 449689 435100 476535 235853 386381 57758 315212
13597 315212 546734 337821 340470 223170 729107 527277 277129 219358 200688 191464 439727
13586 439727 739025 397308 113957 202442 399631 382395 490989 487304 97736 99060 368692
13575 368692 388721 357591 313920 208241 90751 271110 309165 288931 323135 -99802 144996
13563 564908 510334 408170 355825 419934 504283 555650 120887 639796 222264 210049 151366
13552 151366 203150 678203 426328 51132 122796 205399 50470 470485 194928 218136 379627
13541 379627 322738 401335 203893 331865 408183 241859 490511 197493 322217 118361
13530 333668 144469 241678 291181 674258 532552 308992 157409 473473 241730 439275
$$ packed form
13607D77852B10715J44217J50078n5321j4589M1435B35853J50528E7758K57454
13597C15212K31522k08913K649j17300N05937k01830k50148n7771j8670r224K48263
13586D39727K99298l41717A13957Q8485J97189j7236J08594l685I7736J324K69632
13575C68692K0029l1130m3671j05679I0751J80359L8055k0234L4204i9802A44996
13563E64908n4574j02164n2345O4109Q4349N1367A20887N18909B22264j2215n8683
13552A51366N1784M75053k51875E1132P1664Q2603E0470M20015A94928K3208J61491
13541C79627n6889P8597j97442J27972P6318j66324K48652A97493J24724A18361
13530C33668A44469R7209M9503L83077j41706k23560j51583L16064k31743J97545
$$ plain form
13520 439275 228106 221882 410321 13208 598468 -28012 229539 466898 247575 135173
13510 135173 197980 292972 162386 271187 268534 332270 425151 302600 489648 383214 248300
13499 248300 305440 367357 102286 130967 70712 425446 445081 -146003 407023 37702 454828
13488 454828 301152 288328 -147226 476634 503055 429578 178474 214974 189995 309061
13478 309061 371895 97066 336072 319511 293257 -63061 107739 92041 33569 305317 131876
13466 196510 405540 161997 119958 178093 -49623 230290 337983 541129 -16787 381071
13455 25071 413209 201707 411541 147945 248735 413739 375306 328622 436026 401394
13445 401394 354170 328405 155809 132632 365151 208169 289075 334487 76823 300127 -46425
$$ packed form
13520D39275k11169o224J88439A3208N85260b8012B29539K37359k19323j12402
13510A35173O2807R4992j30586J08801k653O3736R2881j22551J87048j06434j34914
13499B48300N7140O1917A02286K8681o0255L54734J9635a46003D07023C7702M17126
13488D54828j53676j2824a47226D76634K6421p3477A78474L6500k4979J19066
13478C09061O2834I7066K39006j6561k6254f3061A07739j5698C3569K71748A31876
13466A96510K09030A61997m2039N8135d9623B30290J07693K03146a6787C81071
13455B5071L88138B01707K09834A47945J00790J65004l8433m6684J07404l4632
13445D01394m7224k5765A55809k3177K32519j56982Q0906M5412G6823K23304d6425
$$ plain form
13433 200449 168830 43446 -4344 264032 241516 298522 359886 136335 133104 502947 462788
13422 462788 249217 -65773 145014 82845 147214 525752 305496 433659 200532 340113
13412 340113 -76535 350873 440826 -73237 342156 -74979 299377 33165 264076 426329
13402 426329 -68810 88024 215073 134374 181268 130381 273804 527607 221965 36340 203905
13391 203905 340438 236524 88358 118638 180653 15703 352688 -70651 -150405 393257 196439
13379 361919 311555 39388 369985 109150 -135145 374588 371305 49823 176916 218780 229863
13368 229863 -171285 310471 242533 -206345 261984 405897 225496 -75549 120305 203278
13358 203278 -6151 -179917 111675 275972 479106 338360 -30009 467732 -15330 270932
$$ packed form
13433B00449l1619D3446d344B64032k2516N7006O1364A36335l231L69843m0159
13422D62788k13571f5773A45014o2169O4369L78538k20256J28163B00532J39581
13412C40113g6535C50873Q9953g3237C42156g4979B99377C3165K30911J62253
13402D26329f8810H8024J27049q0699M6894n0887J43423K53803B21965C6340J67565
13391B03905J36533j03914H8358L0280O2015A5703L36985g0651p9754C93257A96439
13379C61919n0364C9388L30597A09150a35145C74588l283D9823J27093M1864J1083
13368B29863a71285C10471o7938b06345B61984J43913j80401g5549A20305Q2973
13358B03278f151j73766A11675J64297K03134j40746c0009D67732a5330B70932
$$ plain form
13347 381838 87656 59013 316109 -3576 90746 -97496 353642 97858 537112 176591 -128260
13335 38842 273547 -158372 506803 141355 380227 377171 308771 248152 115410 395447
13325 395447 510539 382566 158549 312468 102206 49327 -14934 190850 50491 209789
13315 209789 112864 13653 304940 394832 165599 192377 86974 112488 142289 250036 159283
13304 159283 266462 -132119 184715 29568 46422 -54032 -8927 186140 191968 233680 356918
13293 356918 -70133 112259 -57628 213346 350242 251838 45165 282442 133045 113818
13283 113818 393045 280983 94488 286669 284854 219068 59282 384497 93869 228195 251196
13272 251196 383965 335882 237477 43678 121384 58859 -160804 392520 169193 252234 130663
$$ packed form
13347C81838H7656k8643K57096c576I0746i7496C53642I7858M39254A76591a28260
13335C8842K34705a58372E06803A41355K38872l056o8400o0619A15410K80037
13325C95447J15092j27973A58549J53919A02206D9327a4934A90850E0491J59298
13315B09789r6925A3653K91287Q9892A65599K6778H6974K5514K9801J07747r0753
13304A59283J07179a32119A84715B9568J6854e4032h927A86140N828M1712J23238
13293C56918g0133A12259e7628B13346J36896r8404D5165K37277A33045j9227
13283A13818K79227j12062I4488J92181j815o5786E9282L25215I3869J34326K3001
13272B51196J32769m8083r8405D3678P7706E8859a60804C92520A69193Q3041j21571
$$ plain form
13261 130663 94429 -80740 -71879 336534 -29851 92093 188950 260720 -23580 -18485 -15783 155450
13248 126024 141664 -55057 102491 302593 -130716 162290 17109 -254272 336827 273136
13238 273136 258592 275564 307098 177535 -3521 110596 51694 -30263 235312 259004 16628
13226 446869 -113143 162293 -191520 -90601 -240742 419148 108299 149882 42526 150403
13216 150403 -61626 98158 98992 205715 89279 202269 132618 -40687 197203 237165 400148
13205 400148 -144204 45236 339285 302899 -209491 394235 165063 82853 -128421 -231978
13195 -231978 185611 88401 58288 109557 -184862 -63205 117991 12234 79067 -196520 -44154
13183 -160292 78883 234543 504138 -26462 178672 -202018 177866 95856 -141024 275001
$$ packed form
13261A30663l6234h0740Q861C36534b9851I2093R6857P1770b3580N095K702A55450
13248A26024J5640e5057A02491K00102a30716A62290A7109b54272C36827o3691
13238B73136j4544J6972L1534j29563c521A10596E1694c0263B35312K3692A6628
13226D46869a13143A62293a91520i0601j50141D19148A08299M1583D2526J07877
13216A50403f1626I8158Q34J06723H9279J12990o9651d0687A97203L9962J62983
13205D00148a44204D5236K94049l6386b09491C94235A65063q2210a28421j03557
13195b31978A85611H8401l0113N1269a84862f3205A17991A2234O6833a96520d4154
13183a60292G8883J55660K69595b6462A78672b02018A77866q2010a41024B75001
$$ plain form
13172 281324 -41635 -79675 -164708 7627 126180 35188 124686 -64330 307994 130357 30308
13160 11116 9903 197676 126992 332428 -129669 926 453341 35545 -156036 297810 129931
13148 226793 -82690 346410 -61327 -249400 167696 118615 -21605 42938 181044 -35796 181465
13136 102492 -117864 4190 -168076 -142664 129529 128358 191037 61204 373959 58276 191337
13125 191337 -39245 113162 197634 -82238 -106314 -48034 21585 181441 152219 -8569 -207027
13114 -207027 232829 86880 135366 218422 -258651 -161615 -219795 72570 113326 39601 -189815
13102 173055 -137883 -98487 32336 210648 160145 -99106 -11518 -51174 -117472 -298635 188773
13090 296946 242378 349661 -67837 -151425 -20331 -172083 -166439 47638 -4439 349698 289337
$$ packed form
13172B81324d1635l8040q5033G627J18553C5188Q9498f4330C07994A30357C0308
13160A1116j213J87773p0684K05436a29669I26M52415C5545a56036B97810A29931
13148B26793h2690C46410f1327j88073A67696m9081b1605D2938J38106c5796A81465
13136A02492a17864D190a68076K5412A29529j171O2679F1204L12755E8276J33061
13125A91337c9245A13162Q4472h2238k4076d8034B1585J59856k9222h569j98458
13114b07027B32829H6880M8486Q3056b58651R7036n8180G2570M0756C9601a89815
13102A73055a37883L9396C2336J78312n0503i9106a1518l9656o6298j81163A88773
13090B96946n4568J07283f7837q3588b0331j51752N644D7638d439C49698o0361
$$ plain form
13079 289337 -97759 254112 224100 87657 180726 -47086 -176966 185371 -76591 -10808 250573
13067 505198 -100582 57689 167935 -23897 215521 -85541 9730 231919 100384 -231208
13056 96189 -113434 -130328 178064 -78225 -309889 -43556 4922 300733 -205979 -328653 -4934
13044 31979 -113048 76760 6652 -30287 246494 -150600 81198 39212 2391 376537 147787
13032 109147 141996 8913 42405 337522 178435 -3941 -228119 173570 91071 -134524 85851
13020 413517 44920 161678 575085 130966 -92193 190282 414486 199161 93422 215743
13010 215743 335109 -146813 139178 318116 63405 72432 50912 304466 356367 -311012
12999 27350 201173 -300901 183130 433450 285594 51953 -41363 -167858 -92750 156684
$$ packed form
13079B89337i7759B54112l0012H7657R3069d7086j29880A85371g6591a0808B50573
13067E05198a00582E7689J10246b3897B15521h5541I730K22189A00384b31208
13056I6189a13434j6894A78064g8225k31664d3556D922K95811b05979j22674d934
13044C1979a13048G6760F652c0287B46494a50600H1198C9212B391L74146A47787
13032A09147L2849H913L3492K95117j59087c941k24178A73570q2499a34524H5851
13020D13517D4920J16758M13407A30966i2193A90282K24204A99161I3422J22321
13010B15743J19366a46813A39178J78938F3405R027k1520K53554N1901c11012
12999B7350J73823c00901A83130K50320j47856E1953d1363j26495P5108A56684
$$ plain form
12988 221467 205754 167939 -55843 -64463 -70692 37304 277298 491664 75969 52527 -51143
12976 53794 213450 268440 -77361 32000 -96269 70162 218651 283861 336623 -107133 -17071
12964 190414 176238 -105407 56137 -13680 172846 199799 -155199 -287063 -113225 -154943
12954 -154943 -26437 -113929 2085 143080 146976 148725 -86871 -3316 96625 12723 -152012 343350
12941 137068 -167705 232554 -186490 -27890 60047 190395 37632 -83100 -82170 197184 310314
12930 310314 152295 -30320 -162977 -46667 284793 21673 81153 -279002 19592 185865
12920 185865 156606 31264 -196127 88451 6243 -90206 -196902 106676 52505 228029 42641
12908 40167 -284920 -202302 37604 -3338 -59891 -119654 -10196 -82837 -226500 263091 163791
$$ packed form
12988B21467j5713l7815e5843q620o229C7304K39994K14366G5969k3442e1143
12976E3794J59656N4990g7361C2000i6269G0162J48489O5210N2762a07133a7071
12964A90414j4176a05407E6137a3680A72846K6953a55199j31864a13225m1718
12954a54943b6437q7492B085J40995L896J749h6871c316I6625A2723a52012C43350
12941A37068a67705B32554a86490b7890F0047J30348C7632h3100R30A97184J13130
12930C10314A52295c0320j32657d6667B84793B1673N9480b79002A9592J66273
12920A85865k9259C1264a96127H8451F243i0206j06696A06676E2505J75524D2641
12908D0167b84920Q2618C7604c338n6553n9763a0196p2641j43663B63091r9300
$$ plain form
12897 163791 264224 124547 55867 -214775 238033 37798 324014 217398 -21282 -175305
12887 -175305 -75119 196721 245919 -5253 433604 102414 133185 -219309 36797 226070 43270
12875 -7612 46220 -132753 -45163 444876 91573 33860 94834 21878 -21699 120530 305517
12864 305517 -230092 319155 130297 -157846 -73753 -217595 90952 -47158 208419 -12461
12853 181103 -90838 -76249 16636 283355 -109553 52987 196850 -312552 -174079 -328086
12843 -328086 14980 296967 184185 196654 188604 73828 -321360 132816 -63653 -5697 94597
12831 -100687 95697 137331 -219353 -468069 -219946 45472 -84577 110788 87813 -307587
12820 -87804 -7060 -210537 -153546 150298 -424878 262401 88254 2761 -164592 -100403 338870
$$ packed form
12897A63791J00433A24547E5867b14775B38033C7798K86216j06616b1282j54023
12887a75305g5119A96721M9198e253D33604A02414L0771b19309C6797J89273D3270
12875g612D6220a32753d5163D44876I1573C3860O0974B1878b1699A20530J84987
12864C05517b30092C19155A30297a57846g3753j43842I0952d7158B08419a2461
12853A81103i0838J4589A6636K66719a09553E2987J43863c12552J38473j54007
12843c28086A4980K81987j12782J2469q050G3828c21360A32816f3653e697I4597
12831a00687I5697M1634b19353k48716b19946D5472h4577A10788k2975c07587
12820h7804g060k03477N6991A50298d24878B62401H8254B761a64592O4189C38870
$$ plain form
12808 -98874 -57132 -145330 76993 82742 -130848 -40118 -493413 84257 280790 -111117 -148263
12797 -148263 -10042 -222027 -126014 -460213 -44918 -15665 -202400 -254408 251180 74548 248141
12786 248141 -29771 359818 88500 465491 26582 -198094 213221 87836 -19566 197296
12775 60527 370700 25372 -106431 -171173 428963 -177122 56062 -290480 168451 143918
12765 143918 123188 49997 48719 -27837 -2288 -8860 -169082 -132121 -84711 -166724 48406 94610
12753 94610 -132915 233206 -39298 390706 -79735 -113669 -155450 294635 -20923 187505 195802
12742 195802 297446 -27487 -286172 26556 -18138 -93807 -232350 -26725 107843 37515 224711
12731 224711 91593 213013 -201995 164441 173489 -32559 60336 20864 -344337 452660 203479
$$ packed form
12808i8874M1742q8198G6993N749a30848d0118m53295H4257J96533a11117l7146
12797a48263a0042k11985R6013l34199d4918a5665j86735n2008B51180G4548J73593
12786B48141b9771C59818H8500L76991B6582a98094B13221H7836a9566A97296
12775F0527L10173B5372a06431o4742D28963a77122E6062b90480A68451k4533
12765A43918k0730D9997j278b7837b288o572j60222L6961M7410q2013D8406M6204
12753I4610a32915B33206c9298C90706g9735l3934m1781B94635b0923A87505Q297
12742A95802J01644b7487k58685B6556a8138p5669j38543b6725A07843C7515J87196
12731B24711I1593J21420b01995A64441R048c2559F0336B0864c44337D52660B03479
$$ plain form
12719 47897 23135 -269324 74123 141722 77408 -47842 172025 -266568 -71853 242292 43351
12707 -121159 -158389 52500 -194556 220101 -179460 44613 -55775 179835 139702 226193 -421459
12695 -162006 -63117 186833 -194749 -116884 -9463 118443 103698 113229 -158678 270555 37630
12683 420255 111848 -16025 312361 -213947 158531 394848 72738 -164060 -8578 -21867
12673 -21867 -286633 -223420 -12506 37793 271215 31994 54640 189716 -176797 -176863 -116721
12662 -116721 114115 210297 102228 34155 -32263 110641 249687 72079 112707 240926
12652 240926 172001 213685 -35285 245374 178950 62771 232171 91468 -31501 338777 210325
12641 210325 282081 396804 25507 -54512 353884 -256689 26871 -72212 6642 88769 248657
$$ packed form
12719D7897B3135b69324G4123O7599o4314d7842A72025b66568g1853B42292D3351
12707a21159l7230E2500a94556B20101a79460D4613e5775A79835m0133Q6491d21459
12695a62006f3117A86833a94749P7865i463A18443j4745R531a58678B70555C7630
12683D20255A11848a6025C12361b13947A58531K36317G2738a64060h578j3289
12673b1867k64766O3213a2506C7793K33422C1994K2646J35076a76797o6O0142
12662a16721A14115R6182A02228C4155c2263A10641J39046G2079M0628J28219
12652B40926o8925M1684c5285B45374o6424F2771J69400I1468c1501C38777j28452
12641B10325P1756J14723B5507e4512C53884b56689B6871g2212F642Q2127J59888
$$ plain form
12630 248657 -210301 42820 -372716 120303 61670 231721 150526 185177 211177 67619 31024
12618 -35336 252374 106590 77808 139979 178523 683802 19520 144296 -207293 -101353
12607 78399 156649 48797 142888 179337 236606 105077 349203 179924 72577 -134272 125078
12595 245285 201385 -75243 -41100 -167724 -298855 49894 247389 -201357 133836 -77315
12584 301429 234754 134295 241572 -348842 39679 167990 -53186 261766 183256 -357224
12573 51290 66594 -133352 -79865 132062 -321827 174259 511122 272359 -11903 -100525
12563 -100525 -164014 56043 88675 32211 13340 37439 76724 382416 143179 285721 -125863
12551 73682 117632 337893 -21464 -20196 283217 -246549 200282 -3610 166700 -98303 184695
$$ packed form
12630B48657b10301D2820c72716A20303n8633J70051q1195L4651K6000F7619C1024
12618c5336B52374A06590k8782O2171L8544N05279A9520J24776b07293a01353
12607G8399P8250D8797R4091L6449N7269A05077K44126j69279G2577a34272A25078
12595B45285m3900g5243L4143j26624j31131D9894J97495b01357A33836g7315
12584C01429o6675j00459J07277c48842C9679J28311e3186B61766p8510c57224
12573E1290J5304a33352N3487A32062c21827A74259L36863k38763a1903q8622
12563a00525o3489E6043L2632C2211A3340K4099L9285L05692A43179J42542a25863
12551G3682M3950K20261b1464J268B83217b46549B00282c610A66700i8303A84695
$$ plain form
12539 -147108 65765 -38546 61772 145907 -245860 -255261 -30072 -99430 -257304 269041 235291
12528 235291 -120184 45346 -271968 -167515 6539 -42221 -156770 -179500 113548 161972 37060
12516 152295 -75426 30088 230462 145687 14196 277502 310250 376895 254094 -161896 180425
12504 162375 -146564 -230352 303463 -134644 -1611 249364 -241305 287059 -128000 202378
12493 -212117 -24985 232296 -297818 54229 84823 -347969 151856 -282069 -212546 71048
12482 104908 207717 -77443 -13220 -14010 -163700 92228 -195611 -147889 342002 -162191 -222858
12471 -222858 -37365 -142300 1830 306010 140789 86331 27422 86779 -48948 147754 -183613
12459 -114275 -8432 -263222 174823 77787 201350 -77479 23562 58293 169702 -13819 -222074
$$ packed form
12539a47108F5765c8546F1772Q4135b45860r401c0072o9358j57874B69041l3750
12528B35291a20184D5346b71968J04453F539d2221j14549k2730A13548M8424C7060
12516A52295g5426C0088K00374q4775A4196K63306L2748O6645j22801a61896A80425
12504A62375a46564q3788C03463a34644a611B49364b41305B87059a28000B02378
12493b12117b4985B32296b97818E4229L0594c47969A51856b82069O9523G1048
12482A04908J02809g7443a3220p90j49690I2228a95611M7722C42002a62191o0667
12471b22858c7365j04935A830L04180A40789n4458B7422N9357d8948A47754a83613
12459a14275h432k54790A74823G7787J23563g7479B3562L4731J11409a3819k08255
$$ plain form
12448 -222074 -23714 84649 321544 95658 -77111 123555 -281144 120798 -152033 39404
12437 34181 259967 157802 -63367 -30992 -121922 -64763 132327 157195 89172 107605 296566
12426 296566 119011 -64271 38878 60164 70276 7941 -155399 -134050 147536 -6535 -350764
12415 -350764 -6675 -77239 156306 107454 57891 -74508 -17880 43454 -200532 57877 -41943
12403 -276978 -192877 230936 359655 -46367 -53469 136412 -76054 -107897 -192717 7742 188787
12392 188787 -19515 19131 -30167 -172357 135448 -90342 43036 -214682 -41216 -65899 485423
12380 37864 -39948 88537 69456 62391 218901 263893 49458 251078 329610 26608 -93629
12368 28442 9419 -32655 -207598 333613 19089 359735 329508 31414 187522 -6186 148925
$$ packed form
12448b22074b3714H4649K36895I5658g7111A23555b81144A20798a52033C9404
12437C4181K25786j02165f3367c0992r0930N7159A32327K4868o8023J8433J88961
12426B96566A19011f4271C8878K1286J0112G941a55399K1349A47536f535l44229
12415c50764f675p0564A56306m8852m9563g4508a7880D3454b00532E7877d1943
12403b76978Q4101B30936J28719d6367p102A36412g6054l1843q4820G742J81045
12392A88787a9515A9131c0167j42190A35448i0342D3036b14682d1216k4683D85423
12380C7864c9948H8537j9081p065J56510M4992D9458K01620P8532B6608i3629
12368B8442I419c2655j74943C33613A9089L40646l0227C1414J56108f186A48925
$$ plain form
12356 156859 -172931 -36280 -58005 -721 -121952 73879 -260228 57621 89939 -69008 -34938
12345 -34938 -11731 -283025 -160937 106145 -88687 23119 93239 -129977 -105345 -199696 -175845
12334 -175845 -177727 -105459 59178 74306 -309914 -151246 -183785 -25703 -260940 -124987 60142
12322 -111876 -120836 -417699 10211 217436 47045 -114668 33320 193335 217017 -156552 100127
12310 -19086 200443 18308 -57080 -72229 45519 256080 -27256 -132121 178879 -111559 -183410
12299 -183410 -38223 245367 -7939 -39079 207950 -21085 204962 24715 -78280 100134 17015
12287 243171 -52594 -45437 64296 185197 61200 78980 -50598 -281338 32559 11577 396473
12276 396473 105944 51224 6227 1767 -218703 111780 -34140 -80625 61390 -59895 201391
$$ packed form
12356A56859a72931c6280k1725g21j21231G3879b60228E7621L2318f9008L4070
12345c4938a1731k71294J22088A06145h8687B3119P0120a29977K4632r4351K3851
12334a75845j882P2268E9178J5128c09914a51246l2539b5703k35237a24987F0142
12322a11876q960k96863A0211K07225D7045a14668C3320J60015K3682a56552A00127
12310a9086B00443A8308e7080j5149D5519K10561b7256j04865A78879a11559p1851
12299a83410c8223B45367g939l1140B07950b1085B04962B4715g8280A00134A7015
12287B43171e2594P157F4296J20901F1200J7780e0598k30740C2559A1577L84896
12276C96473A05944E1224F227A767b18703A11780c4140m6485F1390e9895B01391
$$ plain form
12264 27944 -48580 -111560 -255000 118307 174210 38737 288574 462227 -36712 8985 -362803
12252 152008 56064 -119288 -258917 204308 47159 -181255 31325 338550 -175456 123037
12241 55501 -48399 -60141 149669 130581 -281854 399146 169085 -50830 304378 109692
12230 75656 95103 -69746 -179844 -208688 -44502 -211115 -17959 -85324 -52391 55014 -45731
12218 24541 -342994 73514 379907 2262 215204 -251413 98169 58957 567023 163393 45004
12206 100570 472831 236667 242776 420707 168059 -245496 480941 63203 208003 -74733
12195 75600 138644 349655 -23178 -9422 -128317 110871 64711 127697 348019 309364 102584
12183 112192 262287 211429 209819 -18272 463756 119113 57504 148272 175262 153338 243889
$$ packed form
12264B7944d8580o2980j43440A18307N5903C8737K49837J73653c6712H985c62803
12252A52008E6064a19288j39629B04308D7159a81255C1325L07225a75456A23037
12241E5501d8399j1742A49669j9088b81854C99146A69085e0830C04378A09692
12230G5656J9447f9746j10098k8844d4502j66613a7959o7365L2933E5014d5731
12218B4541c42994G3514L06393B262K12942b51413I8169l9212N08066A63393D5004
12206A00570L72261k36164O109J77931A68059b45496D80941F3203J44800g4733
12195G5600O3044K11011b3178i422j18895A10871m6160O2986K20322l8655A02584
12183A12192J50095n0858j610a8272D63756A19113E7504R0768K6990k1924R0551
$$ plain form
12172 243889 244639 -178537 264179 137812 62345 187757 196101 161955 111431 -22552 221960
12160 359485 -46817 266508 28249 -111247 132183 -17866 -11133 -20760 231970 89217 25504
12148 -157249 56681 605650 1665 177000 -200681 128702 -102264 103418 120084 23277
12137 -107572 -293453 27411 174790 -154403 393608 72208 389828 42777 466999 162567
12126 -40301 -212238 133181 148325 -22261 23833 468059 -31362 188095 97897 49490 -2232
12114 20399 -50465 51126 43464 -87065 243295 -32680 123898 17356 -262273 60323 209540
12103 209540 208154 -72008 68545 -88599 296011 110186 121551 -138680 -120515 8669 357202
12092 357202 -84728 -110805 152980 125914 -52194 -40378 -38922 202040 -58936 247762 -51220
$$ packed form
12172B43889P50a78537B64179j26367F2345J25412Q344l4146n0524b2552B21960
12160C59485d6817B66508B8249a11247A32183a7866O733r627B31970H9217B5504
12148a57249E6681N48969A665J75335b00681A28702a02264A03418J6666B3277
12137a07572j85881B7411J47379a54403C93608G2208L17620D2777M24222A62567
12126d0301j71937A33181J5144b2261B3833M44226c1362A88095r0198m8407b232
12114B0399e0465E1126p662h7065B43295c2680A23898A7356b62273F0323J49217
12103B09540j386g2008F8545h8599B96011A10186J1365a38680J8165H669L48533
12092C57202h4728k6077A52980k7066e2194J1816J456B02040e8936B47762e1220
$$ plain form
12080 163284 -47473 183957 -174867 -69254 -60887 -134132 11747 -135786 -297010 35741 -213458
12068 274116 -5817 -72133 -188307 -73573 -210268 79594 -292963 278742 181050 8740 214789
12057 214789 417755 1012842 917231 95900 187607 197198 171865 -52889 190068 -58297 -101164
12046 -101164 147504 -64160 -13916 126131 190058 240706 206997 -136905 81759 43894 88702
12035 88702 -117149 -580555 -1205 -124604 -154196 -339970 6129 5358 -331903 105092 -4574
12023 26800 52850 -154643 6639 -225071 104910 -245204 -199845 -29802 171669 -189830 198467
12011 -71126 107423 124242 -30909 -64024 -11499 41356 80464 -120199 -76629 54985 -66744
11999 -245192 83523 -96538 -78117 57099 13268 62983 75485 -54463 279897 -45188 106948
$$ packed form
12080A63284d7473A83957a74867f9254Q367p3245A1747a35786j61224C5741b13458
12068B74116e817o6316j16174g3573j36695G9594b92963B78742r7692H740K06049
12057B14789K02966N95087r5611I5900R1707R591k5333e2889A90068e8297m2867
12046a01164A47504f4160a3916A26131O3927N0648l3709a36905H1759l7865M4808
12035H8702a17149m63406a205j23399k9592j85774F129p71c31903A05092d574
12023B6800K6050a54643F639b25071A04910b45204M5359b9802A71669a89830A98467
12011g1126A07423J6819c0909l3115a1499D1356L9108a20199M3570E4985f6744
11999b45192H3523i6538J8421E7099A3268M9715J2502e4463B79897d5188A06948
$$ plain form
11987 -183531 105939 44373 120411 -59354 16150 -90408 -124758 1336 -33027 -185479 41570
11975 -7038 -234545 140115 -281440 -182460 -224212 -273258 -378639 51154 -62242 -172791 -59765
11963 190492 -185536 192603 -190646 -202064 70666 -53539 -5704 154811 12341 -21883 57214
11951 222018 -52954 -172689 -76417 171180 58238 -49932 -281357 -168211 170489 1729 -276104
11939 -425224 -35385 94727 279291 -107796 417608 260531 42315 183051 -157605 -248613
11929 -248613 -10752 -282652 -139751 -119069 -357401 56375 -320604 -61873 17831 7609 -223261
11917 -22994 -87565 -258415 95160 -395659 -54967 33876 289241 54473 199299 -98473 -212845
11906 -212845 -198453 -88395 204323 244448 -121692 -128519 -107567 107191 -362404 -40875 -52554
$$ packed form
11987a83531A05939D4373P6038e9354A6150i0408l4350A336c3027j52452D1570
11975g038k27507A40115b81440R8980m1752m9046j05381E1154f2242j10549e9765
11963A90492a85536A92603a90646j1418G0666e3539e704A54811A2341b1883E7214
11951B22018e2954j19735g6417A71180E8238d9932k31425J13146A70489A729b76104
11939d25224c5385I4727J84564a07796D17608j57077D2315J40736a57605r1008
11929b48613a0752k71900a39751K0682k38332E6375c20604f1873A7831G609b23261
11917b2994o4571j70850I5160c95659e4967C3876K55365E4473J44826i8473j14372
11906b12845J4392h8395B04323M0125a21692o827K0952A07191c62404d0875j1679
$$ plain form
11895 -52554 396927 -87917 -46654 -142992 2907 -192685 150198 114036 -222612 -212424 -58852
11883 -20199 60752 -236777 -208504 182700 305349 53903 25678 235248 -424957 49054 -72575
11871 58997 286280 28830 -14759 35434 -80481 -161550 193619 -187490 120946 53277 -122474
11859 -31114 274038 -253798 110830 -203070 78443 -251090 167504 -293791 -125427 -257233
11849 -257233 -9357 -106410 -246269 4588 -170267 83143 -244257 155062 -198300 -319109 123791
11837 -167183 70305 -81928 115888 184612 -456994 140788 94182 169621 -90862 -314284 35471
11825 -164362 -111871 -8453 -45975 47513 -35942 -42690 -89826 255034 -95390 -271286 -9767 196154
11812 -232883 -254746 111553 118609 100652 -197640 -150647 191846 17329 36038 55152 139412
$$ packed form
11895e2554C96927h7917M1263r6338B907a92685A50198l6162b22612J0188e8852
11883b0199F0752b36777K8273A82700J22649E3903B5678K09570d24957D9054g2575
11871E8997K27283B8830a4759C5434h0481q1069A93619a87490A20946E3277a22474
11859c1114B74038b53798A10830b03070G8443b51090A67504b93791a25427j31806
11849b57233i357r7053j39859D588a70267H3143b44257A55062a98300j20809A23791
11837a67183G0305h1928A15888O8724d56994A40788m6606P5439i0862k23422C5471
11825a64362N2491h453l7522D7513c5942o748m7136B55034i5390j75896i767A96154
11812b32883k1863A11553P056j7957a97640M6993A91846A7329J8709J9114Q4260
$$ plain form
11801 139412 3263 -290441 430755 39886 -189424 78990 -23114 260612 226822 -21091 73734
11789 -244024 178443 126506 -122152 -26204 176274 -174747 -419773 18150 10473 84774 73248
11778 73248 14044 87576 150894 99384 257144 -145019 -18922 151013 -36316 -92632 -40136
11766 290111 -208192 117185 -150655 -70316 17740 -57071 -93426 27234 17468 62485 -83309
11754 99696 189710 121402 -78082 -111903 -191448 -71607 18722 -293089 -313062 27566 7927 -212309
11741 200013 -144764 -37113 -63211 -201924 73677 -94620 21920 220728 -250366 -80351 -127223
11730 -127223 -48801 233813 47725 -9636 -160816 83162 -15191 31237 -9500 13038 49241
11719 49241 -176003 -393725 88609 -306467 -166655 15722 43445 -100190 -172377 -145123 -24517
$$ packed form
11801A39412C263b90441D30755C9886a89424G8990b3114B60612l3790b1091G3734
11789b44024A78443n1937a22152b6204A76274a74747k45026A8150p677P4301j1526
11778G3248A4044P3532O3318n1510J57760a45019a8922A51013c6316n6316d0136
11766B90111b08192A17185a50655g0316A7740e7071l6355B7234r766M5017h3309
11754I9696R0014o8308g8082l3821p9545g1607A8722b93089j9973B7566G927b12309
11741B00013a44764c7113k6098j38713G3677i4620B1920J98808b50366h0351m6872
11730a27223d8801B33813D7725i636j51180H3162a5191C1237i500A3038L6203
11719D9241a76003k17722H8609c06467J39812A5722K7723a00190p2187K7254b4517
$$ plain form
11707 -30977 38114 -20252 -201198 70788 -263604 19409 36886 -21063 165202 -162984 -67366
11695 155343 -83641 -55203 -86829 59697 -250373 -210507 -12083 45031 70595 46878 150241
11684 150241 -170398 11464 27399 -274378 186229 -77223 -149616 225699 -265208 2153 310166
11673 310166 -36673 208489 124022 71929 66311 54307 -126432 168484 429819 -368379 81135
11661 118149 294478 307534 -222924 -29786 56097 -59081 -117296 -20696 -177624 70474 99307
11650 99307 -247419 -7381 -70974 -106918 20593 -321239 -372682 -1375 -55038 -208149 -80262
11638 -29278 233813 -334698 -98487 199802 134504 -46169 183648 165456 -378575 -161538
11627 323219 12734 -76727 114996 -381837 -64037 107295 -90695 -219676 142584 -250413
$$ packed form
11707c0977C8114b0252j80946G0788b63604A9409J7477b1063A65202a62984f7366
11695A55343h3641K8438l1626E9697b50373L9866a2083D5031K5564k3717J03363
11684A50241a70398A1464J5935b74378A86229g7223p2393B25699b65208B153L08013
11673C10166c6673B08489q4467n2093n618j2004a26432A68484K61335c68379H1135
11661A18149J76329J3056b22924b9786E6097e9081n8215b0696j56928G0474K8833
11650I9307b47419g381o3593l5944B0593c21239n1443a375n3663j53111h0262
11638b9278B33813c34698i8487A99802o5298d6169A83648j8192c78575a61538
11627C23219A2734g6727A14996c81837f4037A07295i0695j28981A42584b50413
$$ plain form
11616 -145015 -99138 79872 220726 -78287 211084 -163597 -53572 -74273 -333280 -61181 12827
11604 74529 148258 130651 117284 -81687 -35738 24422 -188032 -19932 -475405 -229280 34667
11592 83982 89163 -224151 199162 -340601 31634 -96077 368326 -76200 335848 86063 318479
11581 318479 8658 29502 -320700 -26643 30167 -30769 -159970 104572 -140792 63113 -103426
11569 -103966 20217 -220119 195472 333884 -124406 59939 -275969 -74925 -93681 -33162
11558 -164709 90531 -80309 -25598 132983 -94815 279629 197585 271958 -23530 -271090 119900
11546 -125456 -250724 -70226 -250324 -198720 137204 133285 65495 -79816 -497247 71509 -30030
11534 374013 20711 26631 329042 264018 -163907 -26012 -106907 33584 -509067 229839 -121514
$$ packed form
11616a45015M5877G9872J40854g8287B11084a63597e3572k0701k59007f1181A2827
11604G4529P3729j7607j3367h1687c5738B4422a88032a9932m55473b29280C4667
11592H3982N181b24151A99162c40601C1634i6077C68326g6200C35848H6063K32416
11581C18479H658K0844c20700b6643C0167c0769j29201A04572a40792F3113a03426
11569a03966B0217b20119A95472J38412a24406E9939b75969g4925j8756c3162
11558a64709I0531h0309b5598A32983i4815B79629q2044P4373b3530k47560A19900
11546a25456j25268g0226j80098N1604A37204l919F5495g9816m17431G1509c0030
11534C74013B0711N920L02411o5024a63907b6012q0895C3584e09067B29839a21514
$$ plain form
11522 276545 -119548 152553 -248343 311545 145911 61003 -247580 222844 111377 -28058
11511 -181142 -12279 31271 -67802 310272 96638 242707 -36539 489024 -342693 87854 -55787
11499 -470414 353420 17575 150628 116862 212239 177305 159293 212383 105565 428712 298875
11488 298875 -4998 314829 279493 67175 124096 -282706 110613 -74996 -263307 -184653 -21664
11476 34179 164125 -133165 191729 -228565 -23248 -261854 242395 -30104 233140 79442
11465 121582 114270 47844 52744 161419 -137797 175903 263461 -261191 -175948 188315 269726
11454 269726 105650 8420 132663 165720 271208 -62157 141119 37769 121480 306679 272716
11443 272716 150773 148123 -191352 -255799 41760 291198 134827 173603 -52287 166256 377479
$$ packed form
11522B76545a19548A52553b48343C11545A45911F1003b47580B22844A11377b8058
11511a81142a2279C1271f7802C10272I6638J46069c6539D89024c42693H7854e5787
11499d70414C53420A7575J33053l3766R5377l4934j8012N3090A05565L23147j29837
11488B98875d998C14829l5336F7175N6921b82706A10613g4996j88311P8654b1664
11476C4179J29946a33165A91729b28565b3248k38606B42395c0104B33140G9442
11465A21582p312D7844M900J08675a37797A75903Q7558b61191Q5243A88315Q1411
11454B69726A05650H420J24243L3057J05488f2157A41119C7769Q3711J85199l3963
11443B72716j21943k650a91352o4447D1760K49438A34827L8776e2287A66256K11223
$$ plain form
11432 377479 94194 193350 64268 -28943 195666 20543 100600 393309 -64133 116190 77498
11421 77498 134067 18635 19654 472430 10615 -80532 386266 -94311 182282 16784 -163054
11409 228336 136661 163128 23943 -62773 90177 -109940 77635 -49958 248450 -121071 -197388
11398 -197388 -163088 237517 137456 173237 110083 245156 -65380 91771 13336 61278 -17748
11386 -205207 -160941 -68671 185191 -119079 -46649 -82696 107962 16929 155324 -40907 102568
11374 182137 153317 1303 21090 150579 28667 51599 2296 129521 -170651 -183650 -6237
11362 -42499 388928 -18168 135623 1415 -81199 -193841 -164692 -74039 -31727 -5248 -77183
11351 -77183 -258316 48302 13436 41541 170117 -173968 179842 -216435 -184859 -197013 158313
$$ packed form
11432C77479I4194R9156F4268b8943A95666B0543Q0057K92709f4133A16190l8692
11421G7498N6569A8635J019M52776A0615h0532C86266i4311A82282A6784a63054
11409B28336r1675K6467B3943f2773I0177a09940G7635d9958B48450a21071p6317
11398a97388L4300B37517j00061L5781o3154J35073f5380I1771A3336M7942a7748
11386b05207M4266f8671A85191a19079d6649l6047A07962A6929J38395d0907A02568
11374A82137k8820A303J9787J29489B8667K2932B296J27225a70651j2999f237
11362d2499C88928a8168A35623A415h1199j12642K9149g4039c1727e248p1935
11351g7183j81133D8302A3436K8105J28576a73968A79842b16435L1576j2154A58313
$$ plain form
11339 129950 -45722 -160994 -192807 -145336 33874 323822 -160797 6234 68190 -87769 -87731 -238783
11327 -238783 204620 -176137 45079 -229433 41676 23988 -166099 -22296 389720 172619
11316 -38621 -121822 68574 -35511 137176 118873 14757 56684 -11648 -404865 5747 16164
11305 16164 126793 -51355 316973 -38562 -425145 208112 -512 -84701 290750 -67930 -235180
11294 -235180 228643 70101 208534 -45768 48365 -260294 193176 -79466 59476 -122282
11283 22629 26872 285381 -172762 -210498 18167 -106685 -5257 -6439 243318 -140495 -117724
11272 -117724 -149877 -133287 -4162 -32742 -81422 135142 -180978 88002 -21831 -236257 -192711
11261 -192711 184919 12212 225698 -101718 34025 156992 119152 -193437 -236108 158960
$$ packed form
11339A29950d5722j15272l1813M7471C3874K89948a60797F234O1956h7769L8j51052
11327b38783B04620a76137D5079b29433D1676j7688a66099b2296C89720A72619
11316c8621q3201F8574c5511A37176j8303A4757M1927a1648l93217E747J0417
11305A6164J10629e1355C16973c8562l86583B08112e12q4189B90750f7930j67250
11294b35180B28643G0101J38433d5768D8365b60294A93176g9466E9476a22282
11283B2629M243K58509a72762l7736A8167a06685e257j182B43318a40495K2771
11272a17724l2153J6590d162k8580m8680A35142a80978H8002b1831k14426M3546
11261a92711A84919A2212K13486a01718C4025J22967l7840a93437m2671A58960
$$ plain form
11250 135955 -24266 42139 150263 -263698 -80535 -246826 -182869 47293 249669 -190068
11239 -98497 190294 238158 61838 -25626 85871 -339508 -92027 82033 73799 -110107 172453
11227 50279 -138586 -362397 -172410 -88523 -85724 163213 280898 11630 -178934 1468 58406
11216 58406 -131304 -78225 -140499 -156501 14364 185480 217482 6316 -122526 -35102 -182481
11205 -182481 74184 -283138 11125 -12895 218716 -17557 -259831 90389 -193231 -33689 -262152
11194 -262152 -112030 -213503 -50458 176555 88058 -308860 -12388 40208 173159 28453
11183 16715 6505 -139923 -58859 -451154 -237880 290836 18289 -93962 160752 -170864 -121159
11172 -121159 -252119 -116050 34192 -26535 -76802 -147397 -193882 122330 609 -68128 -119777
$$ packed form
11250A35955b4266D2139J08124b63698h0535j66291O3957D7293K02376a90068
11239i8497A90294M7864F1838b5626H5871c39508i2027H2033q234a10107A72453
11227E0279a38586k23811a72410Q3887K799A63213J17685A1630a78934A468N6938
11216E8406a31304N3079o2274j6002A4364J71116L2002F316a22526c5102j47379
11205a82481G4184b83138A1125a2895B18716a7557k42274I0389a93231c3689k28463
11194b62152a12030j01473e0458A76555H8058c08860a2388D0208J32951B8453
11183A6715F505a39923e8859l92295K13274B90836A8289i3962A60752a70864M9705
11172a21159j30960a16050C4192b6535n0267p0595m6485A22330F09f8128n1649
$$ plain form
11161 -119777 -376162 113602 53655 95459 -77849 -96076 -362956 32487 -300963 -193124
11151 -193124 51340 220473 -173889 -254100 -168395 -193036 -265539 16315 -105807 -29815 21881
11139 15211 174921 -211003 97853 -307556 -17129 -125210 -73616 48585 241148 52562 399918
11128 399918 226162 -167375 143118 255916 -38138 -89920 -88162 -109520 4324 -245052 -312000
11117 -312000 253561 -216053 323435 -208745 -120966 -160909 -22803 117047 -65878 -348394
11107 -348394 88158 12954 45363 194998 44753 258128 33424 277334 79768 198043 -168448
11095 198372 -57289 -140559 4333 2519 235134 237068 -258498 131471 270796 322189 -133658
11083 38259 -129240 -84940 177997 -7341 -220028 126469 314774 338126 447843 77538 -132217
$$ packed form
11161a19777k56385A13602E3655M1804g7849j8227k66880C2487c00963J07839
11151a93124E1340J69133a73889q0211Q5705k4641p2503A6315a05807b9815B1881
11139A5211J59710b11003I7853c07556a7129j08081N1594D8585J92563E2562L47356
11128C99918j73756a67375A43118J12798c8138n1782J758k1358D324b45052o6948
11117c12000B53561b16053C23435b08745Q7779l9943b2803A17047f5878k82516
11107c48394H8158A2954L2409J49635D4753K13375C3424K43910G9768J18275a68448
11095A98372e7289q3270D333j814K32615J934b58498A31471J39325N1393a33658
11083C8259a29240M4300A77997g341k12687A26469J88305K3352J09717G7538a32217
$$ plain form
11071 192401 233293 396320 338050 -27615 15474 478050 101415 474030 52206 191517
11061 191517 347173 88692 400083 287790 108960 -52500 307638 356836 118482 420652
11051 420652 320305 434734 285865 709805 362518 263184 197405 515636 531007 754895
11041 754895 613067 687732 697829 514761 760486 528060 681055 825381 505391 684426
11031 684426 437959 820393 716806 584816 729606 1118344 719825 1113026 717526 640116
11021 640116 1067374 722161 898022 668757 653837 838298 902011 732687 752245 733153
11011 733153 598860 766499 661420 722122 647166 745816 303452 544092 502240 413466
11001 413466 508155 738664 588564 457160 715411 773686 442986 218167 703054 299719
$$ packed form
11071A92401M0892J63027n8270b7615A5474M62576A01415L72615E2206J39311
11061A91517J55656H8692L11391j12293A08960e2500C07638M9198A18482L02170
11051D20652j00347J14429j48869M23940l47287r9334o5779L18231J5371K23888
11041G54895j41828P4665J0097j83068K45725k32426J52995J44326l19990J79035
11031F84426k46467L82434j03587j31990J44790L88738l98519L93201l95500p7410
11021F40116M27258l45213J75861k29265j4920J84461O3713j69324J9558j9092
11011G33153j34293J67639j05079O0702p4956R8650C03452K40640m1852q8774
11001D13466R4689K30509j50100j31404K58251N8275l30700B18167M84887B99719
$$ plain form
10990 717583 652232 686979 439128 590043 601433 560531 800164 1098145 826216 550365
10980 550365 819289 369915 521166 816495 862614 682355 717318 828239 884672 796979
10970 796979 959737 975932 1173391 987478 1179641 1388307 1546112 1436615 1382577 1640346
10960 1640346 1920386 2380319 2502433 2697908 2733994 2586822 3109307 2718498 2811283 2511900
10950 2511900 2123198 1861140 1728404 1414888 1264370 960793 1292369 1159274 1462581
10941 1462581 1012796 882551 918925 934906 506064 628343 658910 613612 391373 446710
10931 446710 516303 243843 252390 -46850 256543 -33193 184774 373186 127590 -44863 31313
10919 73671 93931 329142 163536 42281 28907 202558 -171255 108796 -334436 -140241
$$ packed form
10990G17583o5351L4747k47851J50915J1390m0902K39633K97981k71929k75851
10980E50365K68924C69915J51251K95329M6119j80259L4963J10921N6433q7693
10970G96979J62758J6195J97459j85913J92163K08666J57805j09497n4038K57769
10960A640346K80040M59933J22114J95475L6086j47172N22485l90809R2785k99383
10950B511900l88702k62058j32736l13516j50518l03577L31576j33095L03307
10941A462581m49785j30245L6374J5981m28842J22279L0567m5298k22239N5337
10931D46710O9593B43843Q547d6850B56543c3193A84774J88412A27590d4863C1313
10919G3671K0260K35211A63536D2281j3374J73651a71255A08796c34436a40241
$$ plain form
10908 -6399 -23271 -283935 -305511 -185933 79968 42583 41456 43094 -126125 -171215 243755
10896 -12878 -70202 256563 141173 -160493 20303 156343 237739 340903 -82352 -234317
10886 -234317 -191338 -418613 -26095 242958 86308 -116541 -334390 -397225 192374 187522 72536
10874 -116374 100322 -41176 182366 36871 -83491 115855 -197242 -257088 -255072 -13148 11143
10862 36673 -376530 -214540 -73440 -338208 297014 -34502 18695 -292502 113489 146403
10852 146403 4796 8346 -368404 6847 -238745 -19149 202169 -387950 423 -80422 -245331
10841 -245331 -274335 -166892 84799 -209912 74043 -14911 -374997 217138 27072 -242368
10830 214261 195830 -163266 80163 -86597 -221201 -69885 -79344 95573 -202969 -238975 62320
$$ packed form
10908f399j6872k60664k1576J19578G9968l7385j127J638a26125m5090B43755
10896a2878n7324B56563j15390a60493B0303J36040Q1396J03164h2352j51965
10886b34317M2979k27275b6095B42958H6308a16541k17849o2835A92374m852G2536
10874a16374A00322d1176A82366C6871h3491A15855a97242n9846K016a3148A1143
10862C6673c76530J61990g3440k64768B97014c4502A8695b92502A13489L2914
10852A46403D796L550c68404F847b38745a9149B02169c87950D23h0422j64909
10841b45331k9004J07443H4799b09912G4043a4911l60086B17138B7072b42368
10830B14261j8431a63266H0163h6597j34604f9885r459I5573b02969l6006F2320
$$ plain form
10818 -63690 13898 11872 273350 35708 61644 -255392 -152547 -67846 139748 -271804 76672
10806 -131594 21212 16227 -7433 -103728 -450452 39798 -160920 -296692 -95653 -110315 -334014
10795 -334014 117148 33838 192516 151895 -47553 -47740 -69712 218177 20558 -161871 106822
10783 -163756 16609 -111252 -95747 -45267 -49701 53718 -79492 163008 -45942 -122455 151750
10771 -401411 -239370 7130 139691 59847 214246 119777 -227914 -87570 201143 151707 -275289
10759 60347 650 52509 171103 -266208 149264 -155268 -13693 -150771 364761 78460 -174836
10747 -354091 26147 -691 36829 86687 -204815 269992 53607 133712 429684 -1442 -228854
10736 -228854 25 30778 37701 -140131 77924 3704 -444157 -68199 -29334 -110770 51040 -378813
$$ packed form
10818f3690A3898k026K61478C5708K5936b55392J02845f7846A39748b71804G6672
10806a31594B1212m985g433r6295l46724C9798a60920j35772i5653j4662k23699
10795c34014A17148C3838J58678m0621d7553j87k1972B18177B0558a61871A06822
10783a63756A6609a11252J5505d5267m434E3718g9492A63008d5942p6513A51750
10771d01411J62041G130J32561E9847J54399r4469b27914h7570B01143m9436b75289
10759F0347F50N1859J18594b66208A49264a55268a3693j37078C64761G8460a74836
10747c54091B6147f91C6829M9858b04815B69992E3607Q0105K95972a442k27412
10736b28854B5L0753O923a40131G7924C704d44157f8199b9334q1436E1040c78813
$$ plain form
10723 -329924 -21625 8349 79067 -106281 -155230 -72388 -30353 391002 -293031 -239870 -159386
10712 -159386 99930 124282 -148954 -6438 -217176 -150816 117194 -316530 -82902 242452 1401
10700 -10949 -33433 -35619 244112 -344701 -398823 -81592 -96783 -229451 -311318 97847 -28328
10688 -225820 -129319 13150 -192861 292875 34686 11587 285950 20554 -155661 16860 -121802
10676 44492 14145 -152497 -209264 -129980 -153172 -21244 -42674 148912 164658 5710 412524
10665 412524 83182 -314895 -106407 133215 -307781 160417 -135268 -11063 -200278 -186520
10655 -186520 -207011 -11622 241075 212278 -277688 86579 263621 -65839 -210548 237691
10644 52143 -111813 95255 -27022 197187 -7006 250051 -313387 86317 110012 -293073 158857
$$ packed form
10723c29924b1625H349P0718a06281m8949g2388c0353C91002b93031N3161Q0484
10712a59386I9930K4352a48954f438k10738O6360A17194c16530h2902B42452A401
10700a0949k2484k186B44112c44701n4122h1592j5191j32668q1867I7847b8328
10688b25820R6501A3150a92861B92875C4686A1587K74363B0554a55661A6860a21802
10676D4492A4145a52497n6767P9284k3192b1244k1430A48912J5746E710M06814
10665D12524H3182c14895a06407A33215c07781A60417a35268a1063j89215J3758
10655a86520k0491a1622B41075k8797b77688H6579J77042f5839j44709B37691
10644E2143a11813I5255b7022A97187g006B50051c13387H6317K3695b93073A58857
$$ plain form
10632 232416 -267250 67365 -108040 162546 -226581 -69194 -115863 -27184 45734 -268676
10621 -249064 -111182 60850 67024 141173 350 -87772 -228879 -13190 76344 262441 494235
10610 494235 -55444 -115433 -93460 12506 136373 186638 -55266 -164135 132217 -75172 -194831
10599 -194831 -191177 -180816 61079 61502 -399534 135336 -72415 -106620 275153 78154 -176693
10587 90650 -332878 -119913 97907 106635 186809 -163092 45559 -292944 800 -208105 -34344
10575 -331256 -5880 -40779 -88958 149383 289330 -60543 142837 -430903 -47169 -240031 -286022
10564 -286022 144233 493779 -158518 -153161 188131 -153984 244634 -179543 -144158 -152186
10554 -152186 -143196 -370045 -132076 -40557 91642 -270615 170235 -41982 216529 -12702 -65414
$$ packed form
10632B32416b67250F7365a08040A62546b26581f9194m6669b7184D5734b68676
10621b49064a11182F0850O174P4149C50h7772j41107a3190G6344J86097K31794
10610D94235e5444n9989K1973A2506J23867N0265e5266j08869A32217g5172j19659
10599a94831L654J0361F1079M23c99534A35336g2415l4205B75153G8154a76693
10587I0650c32878a19913I7907Q728Q0174a63092D5559b92944H00b08105c4344
10575c31256e880l4899m8179A49383J39947f0543A42837d30903d7169j92862m5991
10564b86022A44233L49546a58518N357A88131a53984B44634a79543L5385q028
10554a52186Q990k26849a32076d0557I1642b70615A70235d1982B16529a2702n2712
$$ plain form
10543 -65414 -276294 -40677 -53233 -65127 -99067 -79789 -54367 -40047 -53195 -99943 -75232
10532 -75232 352733 -14142 62553 -47758 67570 -416991 -187932 -191550 69234 100600 -323664
10520 -58498 -117817 64805 -84201 -231544 97891 -130590 -39466 -182232 -283881 -228392 69929
10508 606231 -162421 81291 77006 -82749 -117415 154634 -426289 -148277 534910 -194768
10497 -58119 -177039 -253188 -300081 -262956 358821 -210849 -335116 -77749 -49513 -183479 -222938
10486 -222938 -84774 90168 -33665 27105 330088 -84410 -60635 58364 -123128 63470 -100675
10474 -334281 -215157 -95841 159475 -94532 17066 -345282 -240606 -70256 -104888 5683 -114850
10462 101279 -184448 22242 -15669 -122241 -98211 186747 14766 18049 -126270 280830 -65211
$$ packed form
10543f5414k10880d0677j2556j1894l3940J9278K5422J4320j3148m6748K4711
10532g5232C52733a4142F2553d7758F7570d16991a87932l618F9234L1366c23664
10520e8498n9319F4805h4201j47343I7891a30590c9466j42766j01649N5489F9929
10508F06231a62421H1291m285h2749l4666A54634d26289a48277E34910a94768
10497e8119j18920p6149m6893L7125C58821b10849j24267g7749K8236j33966l9459
10486b22938h4774I0168c3665B7105L02983h4410K3775E8364a23128F3470a00675
10474c34281J19124i5841A59475i4532A7066c45282J04676g0256l4632E683a14850
10462A01279a84448B2242a5669j06572K4030A86747A4766L283a26270B80830f5211
$$ plain form
10450 53475 -170967 152461 -12606 338264 -34665 -170042 -23178 -234557 -281773 -19638 -480700
10439 -480700 -58545 46559 -46693 116253 2237 208972 -201721 -25862 -134295 -191324 -180401
10428 -180401 356809 104267 23532 -213235 -45360 -231515 163344 182938 -164105 9398
10417 -75558 -203620 -83117 224935 95552 25814 -231341 -182865 38944 50372 46471 80293
10406 80293 -245961 -10074 119143 70002 -75663 -15507 -364903 221113 -297507 -386827 -342351
10395 -342351 -137724 168137 -118003 -186671 -219261 214421 -68212 71699 -158659 63807
10384 230830 -121760 -39169 -152654 69198 124685 67653 244599 6914 168605 61753 243832
10373 243832 120836 235711 201840 -218972 -30127 39284 158751 403494 95902 -191900
$$ packed form
10450E3475a70967A52461a2606C38264c4665j35377b3178k11379m7216a9638m61062
10439d80700e8545D6559d6693A16253B237K06735b01721b5862j08433n7029J0923
10428a80401C56809A04267B3532b13235d5360j86155A63344J9594a64105I398
10417g5558j28062h3117B24935I5552B5814b31341M8476C8944J1428l901L3822
10406H0293b45961a0074A19143m9141g5663a5507l49396B21113b97507q9320M4476
10395c42351a37724A68137a18003o8668l2590B14421f8212G1699a58659F3807
10384B30830a21760c9169j13485F9198N5487n7032J76946F914J61691F1753J82079
10373B43832A20836J14875l3871b18972c0127C9284J19467K44743I5902a91900
$$ plain form
10362 13329 315876 217425 -48037 215841 136989 55114 474300 303960 -40527 424537 115672
10350 74907 542352 323600 592074 99770 726685 411274 435441 227973 266538 63721
10339 -153204 147872 107611 350678 169142 562170 525791 463725 315793 182359 187414
10329 187414 177345 450259 261221 194420 61058 417666 -7705 79854 152092 121759 -32388
10317 -113088 -200183 -173064 207972 1888 99105 -99201 -74211 -61282 -90482 94508 314056
10306 314056 243493 215268 38523 459197 407654 -50549 91399 15466 68315 -91996 24145
10294 -126765 -133699 241551 -189336 -17557 88688 61425 194917 203252 40657 -209117 52123
10282 135713 101091 156583 -76830 -111416 -145252 356609 -6288 172134 -26543 -119944 -444433
$$ packed form
10362A3329L02547r8451d8037B15841p8852E5114M19186j70340d0527D24537A15672
10350G4907M67445k18752K68474I9770O26915l15411K4167k07468L8565F3721
10339a53204A47872m0261K43067A69142L93028l6379o2066j47932j33434N055
10329A87414j0069K72914j89038o6801F1058L56608g705G9854P2238l0333c2388
10317a13088q7095K7119B07972A888R7217i9201K4990J2929k9200I4508K19548
10306C14056p0563k8225C8523M20674n1543e0549I1399A5466N2849i1996B4145
10294a26765o934B41551a89336a7557H8688k7263J33492Q335D0657b09117E2123
10282A35713l4622N5492g6830l4586l3836C56609f288A72134b6543r3401l24489
$$ plain form
10271 -444433 129979 -167470 317135 128398 -136159 141909 -67344 -37173 -262387 -146606
10261 -146606 76435 375921 -2729 276166 -74830 -164157 110046 162678 -455842 28380 96176
10250 96176 -201908 -157213 88899 109583 -599 74092 256942 221769 23849 -20147 76646 -101867
10237 134493 1861 -290620 260565 -136208 -3390 104659 -61943 41568 40288 -90889 72654
10225 -206372 139535 176782 -226395 280661 22257 99753 -308682 168069 59538 169712
10215 169712 90784 -9559 -96105 216846 -304857 -322865 -69360 239989 -588527 180856 204988
10204 204988 -195583 118278 170158 -32323 121759 99183 3990 42035 187924 -93971 -246677
10193 -246677 -40820 -83373 163112 147454 90785 65798 -63529 102948 79153 -76706 63593
$$ packed form
10271d44433A29979a67470C17135A28398a36159A41909f7344L0171k25214J15781
10261a46606G6435K99486b729B76166g4830q9327A10046N2632d55842B8380O7796
10250I6176b01908M4695H8899K0684e99G4092J82850l5173B3849b0147G6646a01867
10237A34493A861b90620B60565a36208c390A04659f1943D1568j280i0889G2654
10225b06372A39535L7247b26395B80661B2257P7496c08682A68069E9538J10174
10215A69712p8928i559q6546B16846c04857j8008f9360B39989e88527A80856K4132
10204B04988a95583A18278N1880c2323A21759k2576C990L8045J45889i3971j52706
10193b46677d0820m2553A63112j5658n6669k4987f3529A02948k3795g6706F3593
$$ plain form
10181 49760 -233380 -361049 -41407 1928 164573 -241340 -78913 -91724 -293214 34511 -274830
10169 -166574 -84291 -417014 -316289 145382 -347530 -197829 6398 -117189 195780 179199
10159 179199 -405324 -182589 29395 -101384 61075 57584 345716 -93654 90406 -21598 -200197
10148 -200197 -164601 65395 1666 -31865 63365 -77384 -118811 -178930 -157739 -29526 104562
10136 -69967 -211547 -103085 -44666 -105590 -7033 -155785 -259693 -263090 -347077 216699 -203834
10124 -103814 77914 -6660 -136762 -8516 -236244 -131720 -161794 -356114 21852 -42202 -133937
10113 -133937 -125103 -22585 -16803 234144 127263 -195248 188708 -46423 299186 25682 81522
10102 81522 -218196 -70484 -73399 -78653 -151095 -252476 -104861 -354372 -227509 -50950 -164788
$$ packed form
10181D9760b33380j27669d1407A928J62645b41340g8913j2811k01490C4511b74830
10169a66574Q2283l32723J00725A45382c47530J49701F398a17189A95780j6581
10159A79199d05324a82589B9395a01384F1075l491K88132i3654I0406b1598j78599
10148b00197L5596F5395A666c1865F3365g7384m1427o0119K1191b9526A04562
10136f9967j41580a03085d4666o0924g033j48752j03908l397q3987B16699b03834
10124a03814G7914f660j30102h516k27728J04524l0074j94320B1852d2202r1735
10113a33937Q834b2585N782B34144j06881a95248A88708d6423B99186B5682N5840
10102H1522b18196g0484k915n254p2442j01381a04861k49511J26863e0950j13838
$$ plain form
10091 -164788 -231967 -118455 -171823 66323 -199774 -169760 179862 250891 -167859 265741
10080 -135517 -55353 30156 23946 -33151 288221 85653 135216 -79001 204504 -329045 -3807
10068 14610 -53356 173354 -232149 -142682 -247298 -303426 48838 -65373 -169222 9040 97277
10057 97277 267751 -501257 -40107 -178295 265172 -30145 182887 274116 22866 -127275
10046 -47110 -227859 370011 164131 196770 -295762 -13286 -9585 -59847 -203267 162754 -87862
10034 133784 -58395 -231653 -163414 -24449 -112653 -88683 104855 -171962 274072 -52264 -168809
10023 -168809 -19207 -130372 -209565 247012 -27733 -41262 -69624 -11632 -335789 103964 -151530
10011 144024 134134 -88309 25501 -33897 -194130 40764 -147178 -219034 37707 110873 199801
$$ packed form
10091a64788o7179J13512n3368F6323a99774L0014A79862P1029a67859B65741
10080a35517e5353C0156o210c3151B88221H5653M9563g9001B04504c29045c807
10068A4610e3356A73354b32149Q9467j04616n6128D8838f5373j03849I040Q8237
10057I7277J70474e01257d0107j38188B65172c0145A82887R1229B2866a27275
10046d7110j80749C70011A64131L2639b95762a3286L701n0262j43420A62754h7862
10034A33784e8395j73258O8239b4449q8204K3970A04855a71962B74072e2264j16545
10023a68809a9207j11165p9193B47012b7733j3529k8362a1632l24157A03964a51530
10011A44024r890h8309B5501c3897j60233D0764a47178p1856C7707P3166Q8928
$$ plain form
10000 199801 435641 230624 -170280 -41573 142135 50669 74403 203248 -340760 -2851
9989 -81310 -261110 -120178 107449 -44168 -132101 -194220 -523826 -216295 -61555 -89154 -32561
9977 18199 60167 -322071 -66389 -256655 -146029 -191311 -71746 -170599 6362 105917 -303622
9965 172555 219461 197111 -140506 -222469 -124393 -352054 13314 235750 -23223 216057 -115563
9953 -107483 75995 64507 21493 -103372 57948 -212520 -68085 -303769 -57072 -197645 -134747
9942 -134747 -42948 -306423 -10259 15678 -151602 -103247 -249587 -137754 83796 -4648 6456
9930 38543 73900 -77603 -1350 -66450 -112741 -40574 -6546 -173307 -158910 -212223 42885 111361
9918 111361 25511 89797 -121327 262987 -240507 -408164 105132 274881 40771 156588
$$ packed form
10000A99801K35840k05017a70280d1573A42135E0669K3734J28845c40760b851
9989h1310j79800a20178A07449d4168q7933o2119l29606b16295f1555k7599c2561
9977A8199M1968c22071f6389j90266J10626m5282g1746r8853F362R9555c03622
9965A72555M6906k2350a40506q1963R8076k27661A3314K22436b3223B16057a15563
9953a07483G5995j1488B1493a03372E7948b12520f8085k35684e7072j40573O2898
9942a34747d2948k63475a0259A5678a51602M8355j46340J11833H3796d648F456
9930C8543L5357g7603a350o5100m6291d0574f546j66761J4397n3313D2885O8476
9918A11361B5511O4286a21327B62987b40507j67657A05132J69749D0771J15817
$$ plain form
9908 156588 -213015 133324 -61192 -343857 336357 -212699 -255373 119771 93148 -180425
9897 147575 42499 281464 188915 -98896 168942 53269 -101586 54458 238633 -44517 92661
9885 56734 -271415 -470697 524624 -166899 25897 84946 -209433 -165822 -265294 -192843 11568
9873 39945 21649 -281597 -74062 20493 -46218 60554 83987 -26073 -75221 78960 233304
9862 233304 -178265 6739 -293611 -155500 -304920 -231096 29348 -26321 -194111 123066 79905
9851 79905 -389917 89458 106142 12534 240844 -87725 -257393 -141465 -222561 -151223 38167
9839 -96295 57884 -201434 -117800 46504 190624 -348126 -286471 47078 -26794 -44499 40107
9827 -305535 -85507 -217862 -366463 185486 -6159 -37811 -24262 -308473 -56845 -120516 270479
$$ packed form
9908A56588b13015A33324f1192k82665C36357b12699m2674A19771k6623a80425
9897A47575D2499K38965r2549i8896A68942E3269a01586E4458J84175d4517I2661
9885E6734b71415j99282E24624a66899B5897N9049b09433M3611r9472P2451A1568
9873C9945j8296b81597g4062B0493d6218F0554K3433b6073m9148G8960J54344
9862B33304a78265F739b93611J38111j49420P3824B9348b6321j67790A23066m3161
9851G9905c89917H9458J6684A2534K28310h7725j69668J15928q1096P1338C8167
9839i6295E7884b01434Q3634D6504J44120c48126O1655D7078b6794j7705D0107
9827c05535h5507j32355j48601A85486f159l1652J3549k84211e6845o3671B70479
$$ plain form
9815 130062 -207423 8995 -71803 -14209 -337419 -216855 -298119 -120828 -246953 -57980 -285104
9804 -285104 -138718 -271829 -9544 66257 -110663 64670 46320 39959 187509 6250 -36025
9792 -313072 -44346 -65395 -304765 -235846 48686 -160116 -111953 9233 42530 271937 61740
9780 -11074 -222532 -315766 78838 -26252 -9067 145337 -165803 64232 179543 -97314 -87370
9769 -87370 307856 145237 50936 48077 -24573 -212389 225592 -32452 219393 -93573 -327032
9758 -327032 102003 -100147 161860 56470 -258024 120376 -162565 -218874 135922 -67167
9747 112154 170448 4242 -20661 -206547 -232605 47766 -348805 23439 24296 -26066 -289637 -32404
9734 149239 287585 -267174 -165622 -130995 32097 271501 -179497 -259617 -376948 123890
$$ packed form
9815A30062b07423H995g1803a4209l23210J20564q1264a20828j26125e7980k27124
9804b85104a38718j33111i544F6257a10663F4670j8350o361J47550F250c6025
9792c13072d4346k1049k39370O8919D8686a60116M8163I233L3297K29407F1740
9780a1074k11458r3234G8838b6252i067A45337a65803F4232J15311i7314R944
9769h7370C07856A45237E0936k859b4573j87816B25592c2452B19393i3573k33459
9758c27032A02003a00147A61860E6470b58024A20376a62565n6309A35922f7167
9747A12154N8294D242b0661j85886k6058D7766c48805B3439Q57b6066k63571c2404
9734A49239J38346b67174J01552L4627C2097K39404a79497q0120j17331A23890
$$ plain form
9723 101693 -187485 -151355 37785 92337 -185078 391630 -71296 -10203 35129 110060 -117426
9711 157897 84564 -12684 133399 -41841 76848 331312 -43679 103225 232002 161125 -141096
9699 167305 -158203 230511 45084 -284690 120606 34939 -102474 -475170 -136300 185779
9688 54410 -164501 -711 -59823 -77687 -205803 -73901 91437 55254 -103741 -60794 -100575 28942
9675 52028 -21664 -35788 34159 105205 -298922 43253 -97107 247620 -125228 4054 290191
9664 290191 -183637 -66210 111877 143721 21579 78059 -83449 76097 -182793 -15994 228124
9652 106237 113220 76564 -146564 282576 -82730 -61057 -26877 -59772 -92088 -142033 61346
9640 605145 32863 125816 -74994 -80969 -60382 -362636 141961 -223259 -306 180743 57186
$$ packed form
9723A01693a87485L6130C7785N4552a85078C91630g1296a0203C5129P4931a17426
9711A57897p3333a2684A33399d1841G6848K54464d3679A03225J28777p0877a41096
9699A67305a58203B30511D5084b84690A20606C4939a02474l72696a36300A85779
9688E4410a64501g11n9112j7864j28116g3901I1437l6183a03741M2947l9781B8942
9675E2028b1664j4124C4159P1046b98922D3253i7107B47620a25228D054K86137
9664B90191a83637f6210A11877L1844B1579N6480h3449G6097a82793a5994B28124
9652A06237O983l6656a46564B82576h2730K1673b6877l2895l2316m9945F1346
9640F05145C2863R2953g4994n975K0587l02254A41961b23259c06A80743E7186
$$ plain form
9628 242473 40796 7677 -60181 -488654 -293798 -87996 94937 -153238 -50966 -163226 -44203
9616 44146 218607 -384920 -32454 201958 -227277 -148217 -143281 -22251 -296290 -595328 -112449
9604 -45590 287057 -303537 -11103 59986 162565 -329652 -273623 -133456 -2284 -50459 75104
9592 189191 -147677 -217 -93383 -209401 304355 -177612 -346277 27044 133511 139055 -277246
9580 -127372 -111803 -30000 -424560 -50532 -918 3319 -51439 -3277 69735 -202174 -150784 563
9567 146256 -67178 -127844 -432635 108625 -9969 91897 -269647 384407 -43825 -331362 50440
9555 -226214 -5419 -200904 -140994 -227421 -230822 -78696 38302 -19117 21150 -53582 43384 -320631
9542 -59997 -48127 -182227 -72079 -383230 328045 -231586 246805 -165257 25036 -159063
$$ packed form
9628B42473D0796G677f0181m28473J94856h7996I4937a53238e0966j12260d4203
9616D4146J74461c84920c2454B01958b27277P9060M936b2251k74039k99038a12449
9604d5590B87057c03537a1103E9986J02579c29652N6029a33456b284m8175G5104
9592A89191a47677b17r3166j16018C04355a77612j68665B7044J06467N544b77246
9580a27372J5569c0000l94560e0532i18C319e1439c277F9735b02174N1390E63
9567A46256f7178o0666l04791A08625i969I1897b69647C84407d3825k87537E0440
9555b26214e419j95485N9910q6427l401g8696C8302a9117B1150e3582D3384c20631
9542e9997J1870j34100g2079l11151C28045b31586B46805a65257B5036a59063
$$ plain form
9531 24059 -79603 -203914 -249069 -111198 -243516 37370 -187376 42958 -43533 -192959 100344
9519 -15797 -281589 -293654 -83446 209600 -182511 -129141 263307 -334558 36222 97332 31187
9507 -217512 -117216 -152712 -427841 -125725 -220600 -288363 155704 -30667 -175425 -85605 -152257
9496 -152257 186849 -8322 -22343 -384517 73659 -272323 -162212 -129054 -310072 -147092 -187407
9485 -187407 67230 299145 -232177 -488116 -103758 -252936 24453 144102 -325111 -203559
9475 -203559 -167453 88641 182987 -321011 41942 -146134 39156 102266 -162285 -45042 -203295
9464 -203295 28768 12432 -150629 -54867 225162 -11716 -62432 258319 36041 -178276 19095
9452 101726 -101206 60748 -226324 47806 -147457 -101554 -49454 -61129 132635 85446 -160644
$$ packed form
9531B4059g9603j24311m5155a11198j32318C7370a87376D2958d3533j49426A00344
9519a5797k65792j2065h3446B09600a82511N3370B63307c34558C6222O1110C1187
9507b17512J00296l5496k75129a25725r4875o7763A55704c0667j44758h5605o6652
9496a52257A86849h322j4021l62174G3659b72323J10111L3158j81018a47092m0315
9485a87407F7230K31915b32177k55939a03758j49178B4453J19649c25111J21552
9475b03559L6106H8641R4346c21011D1942a46134C9156O3110a62285d5042j58253
9464b03295B8768A2432a50629e4867B25162a1716n0716B58319C6041a78276A9095
9452A01726a01206F0748b26324D7806a47457M5903d9454j1675A32635m7189a60644
$$ plain form
9440 -322766 101050 256223 96183 -429298 137825 32324 -8692 -162784 181427 -274517
9429 -183694 -27177 72916 -83297 -133028 50608 -336279 15602 132976 417570 316980 -181481
9417 -14964 -170522 -210604 224376 248230 -78329 311258 -12255 -73604 131038 -35037 80048
9405 64260 -38391 -11438 488453 34938 113954 -209006 167637 -132602 -45945 147600 18673
9393 -251724 -70017 275138 -24072 151242 278246 -104944 -170440 -224396 147072 -60023 -62615
9382 -62615 68689 286678 23354 -98699 -116192 -378076 -14285 -135149 47338 -210454 250012
9370 -18060 -107047 -249666 55306 13927 38612 82103 126600 -93095 27236 -10406 -160331
9359 -160331 -19474 -280864 -244445 -404678 -157804 42833 82997 -357710 94283 66601 -50303
$$ packed form
9440c22766A01050J55173I6183d29298A37825C2324h692j54092A81427b74517
9429a83694b7177G2916h3297m9731E0608c36279A5602J17374K84594j00590a81481
9417a4964j55558m0082B24376K3854g8329C11258a2255o1349A31038c5037H0048
9405F4260c8391a1438D88453C4938P9016b09006A67637a32602d5945A47600A8673
9393b51724g0017B75138b4072A51242J27004a04944o5496n3956A47072f0023k592
9382f2615F8689K17989B3354i8699j7493k61884a4285j20864D7338b10454B50012
9370a8060q8987j42619E5306A3927K4685M3491M4497i3095B7236a0406j49925
9359a60331a9474k61390L6419j60233a57804D2833M0164c57710I4283k7682e0303
$$ plain form
9347 -195317 -1929 -84690 -117628 31056 146911 -222164 -12399 -280903 -100247 243028 -244200
9335 -14484 -271037 -134000 -48219 117543 84770 -212342 30709 140512 -160896 -353213
9325 -353213 -136228 -328481 61341 121446 -122579 26301 27277 202221 19973 253979 67431
9313 -131488 117700 39749 -197808 -34955 -208319 126325 -1721 -353806 -96854 -334320 -223406
9302 -223406 -172771 15208 -366198 137034 -106594 -14977 -286168 -179533 -77902 -80590 73388
9290 81060 233648 -245112 -201786 158194 -63377 -286837 -345261 106962 -82616 -31293 34264
9278 127161 -236945 124217 -321359 -156025 -78990 -79682 -211213 -16486 -177609 260748 -207229
9266 -73753 21051 -198931 47892 11960 107116 -135204 -115872 100951 -187626 -222939 -289370
$$ packed form
9347a95317a929q2761l2938C1056J15855b22164a2399k68504a00247B43028b44200
9335a4484k56553a34000d8219A17543l2773b12342C0709J09803a60896j92317
9325c53213a36228j92253F1341O0105a22579B6301R76J74944A9973K34006F7431
9313a31488A17700C9749a97808c4955j73364A26325a721l52085i6854k37466J10914
9302b23406N0635A5208c66198A37034a06594a4977k71191J06635g7902k688G3388
9290H1060J52588b45112M3326A58194f3377k23460n8424A06962h2616c1293C4264
9278A27161b36945A24217c21359a56025P7035o92j31531a6486j61123B60748b07229
9266g3753B1051a98931D7892A1960R5156a35204J9332A00951a87626l5313o6431
$$ plain form
9255 -289370 -7973 267547 -107059 227276 122309 6227 -78819 252463 -167401 -219747 12019
9243 -67568 64153 -167336 104862 226786 217920 185373 -234178 -235740 -269039 -187396 89017
9231 93981 165218 -504394 -98746 -148154 125376 16798 286641 18068 -390683 -68931 63315
9219 -4317 -195924 -194407 37958 -363111 -357649 121141 1133 -236308 -193503 -40179 63100 -18725
9206 -291783 125983 31081 48501 -128387 -73737 14483 138931 112503 -50421 -155537 31834
9194 30581 45717 -87036 -44026 -6368 238085 81853 -104178 -81070 58231 -359552 41006
9182 -203188 -107568 -261791 8415 -54400 -222719 -153817 95211 -205377 -178902 -111819 45987
9170 103187 -35864 -291454 99235 -127378 252349 6726 162700 -285107 -127 46386 218532
$$ packed form
9255b89370g973B67547a07059B27276j04967F227g8819B52463a67401n2346A2019
9243f7568F4153a67336A04862J21924q866l2547b34178j562l3299Q1643H9017
9231I3981P1237e04394i8746m9408A25376A6798K69843A8068c90683f8931F3315
9219d317j91607J517C7958c63111N462A21141A133b36308M2805d0179F3100a8725
9206b91783A25983C1081J7420a28387N4650A4483J24448k6428e0421j05116C1834
9194C0581J5136h7036M3010f368B38085H1853a04178K3108E8231c59552D1006
9182b03188R5620j54223H415e4400j68319O8902I5211b05377K6475O7083D5987
9170A03187c5864k55590I9235a27378B52349F726J55974b85107a27D6386J72146
$$ plain form
9159 218532 -14250 188006 -143453 -325569 96754 -38575 -153688 -326772 -55223 56814 64630
9148 64630 87780 -155207 -27945 -93966 128178 145691 186394 -71487 89573 500 -178606 -218136
9136 -218136 194559 110262 -162928 323 -112780 -242654 -75828 40126 155027 -157590 124438
9124 172190 107087 -143408 34107 -186258 -311986 -300724 -145053 9320 -46374 54804 95878
9113 95878 266683 -171390 286835 35043 -305661 156949 -263786 4546 81724 201680 190185
9102 190185 -163088 -77083 -110643 397232 -236175 -249629 -67766 -159843 -229300 -302074 210024
9090 -109158 -149318 -233910 -166738 171457 -60076 119855 122029 76636 -179000 38988 189885
9079 189885 -119769 23080 -51420 -20522 -288295 243546 204411 29242 -41994 139275 87370
$$ packed form
9159B18532a4250A88006a43453j82116I6754c8575j15113j73084e5223E6814P816
9148F4630K3150a55207b7945o6021A28178J7513M0703g1487H9573E00a78606l9530
9136b18136A94559q4297a62928C23a12780j29874g5828D0126J14901a57590A24438
9124A72190o5103a43408C4107a86258j25728J1262a45053I320d6374E4804M1074
9113I5878J70805a71390B86835C5043c05661A56949b63786D546P7178J19956j1495
9102A90185a63088g7083l3560C97232b36175j3454f7766r2077o9457p2774B10024
9090a09158m0160q4592O7172A71457f0076A19855K174m5393a79000C8988J50897
9079A89885a19769B3080e1420b0522k67773B43546l9135B9242d1994A39275n1905
$$ plain form
9068 87370 -181529 -257160 -95656 -91347 494554 18822 -164161 -212961 -225080 -258641 15750
9056 -300755 -14006 -209880 -317003 -125440 -173666 127132 -49075 62391 -286266 84861 333473
9045 333473 202459 33142 -116332 105620 -294964 -267491 40945 -159278 192263 -296421
9034 -135152 35609 -154472 32498 94596 -127656 169955 22093 20009 -108340 131922 23819
9022 55689 104204 -95528 -205046 -85205 -147536 -33582 16258 -20155 -191355 -64496 -47851
9011 -47851 -37579 -79313 191969 101205 673 -16666 -221728 -7069 -7327 -363193 -252481 106018
8998 133449 30255 60639 -103586 14472 114712 9765 42533 -76025 -264985 -85445 261389
8986 248025 22575 -310238 16516 -139683 114808 75615 -108907 -141531 -61196 -105430 64775
$$ packed form
9068H7370a81529p5631i5656M309D94554A8822a64161m8800j2119l3561A5750
9056c00755a4006j95874j07123a25440m8226A27132d9075F2391b86266H4861K48612
9045C33473j31014C3142a16332A05620b94964K7473D0945a59278A92263b96421
9034a35152C5609a54472C2498O2098a27656A69955B2093k084a08340A31922B3819
9022E5689M8515i5528j09518h5205o2331c3582A6258b0155j71200f4496J6645
9011d7851J0272m1734A91969r0764F73a6666k05062g069k58l55866J10712A06018
8998A33449C0255L0384a03586A4472J00240I765L2768g6025j88960h5445B61389
8986B48025B2575c10238A6516a39683A14808l9193a08907l2624f1196m4234F4775
$$ plain form
8974 87591 21184 -175850 -173635 156648 105218 -39015 -453527 263529 -450014 -413827 -277927
8963 -277927 151135 -18066 113664 244067 5680 -191939 177942 -41918 -21377 108987 -24468
8951 -78581 2791 32529 157504 46855 -105363 -265268 27723 -94631 -74471 -67646 -10132 -267906
8939 -267906 -101125 -54660 -130165 -73081 -259423 -87021 162774 58398 -67167 -104415 54553
8927 -167538 269580 -89908 -114532 6045 124950 183507 -86043 -78823 208914 -3925 192170
8915 80744 9620 -112137 -109637 388368 461671 894677 904682 1230234 2543247 5094170 10326324
8904 10326324 4856596 2214385 1371695 960642 610444 455222 422083 213863 345375
8895 345375 175019 397840 111213 300402 176210 -124334 -27605 -150293 230428 26466
$$ packed form
8974H7591B1184a75850K215A56648n1430c9015m14512B63529d50014L6187J35900
8963b77927A51135a8066A13664J30403E680a91939A77942d1918K0541A08987b4468
8951g8581B791K9738J24975D6855a05363j59905B7723i4631K0160O825a0132k57774
8939b67906a01125M6465p5505N7084j86342h7021A62774E8398f7167l7248E4553
8927a67538B69580h9908k4624F045J18905N8557h6043P220B08914c925A92170
8915H0744I620a12137K500C88368P3303M33006J0005L25552J313013K550923N232154
8904A0326324D856596B214385q42690m11053l50198j55222l3139k08220J31512
8895C45375j70356K22821A11213J89189j24192a24334b7605j22688B30428B6466
$$ plain form
8884 118578 61894 -55722 -19355 -80856 124498 -16120 -20826 92395 -76695 -224011 -98818
8872 -349607 -241918 -95495 150267 174364 -479964 -84347 -114619 -126283 -170851 -72380 -233137
8861 -233137 270833 -238085 74876 -474301 -161691 -66344 -348924 132883 -40394 -289800
8851 -289800 -460670 13472 126475 43414 260479 111759 158898 -254557 24600 -363347
$$ packed form
8884A18578n6684e5722a9355o1501A24498a6120m706I2395g6695j47316i8818
8872c49607J07689i5495A50267K4097d79964h4347l0272j1664m4568g2380j60757
8861b33137B70833b38085G4876d74301a61691f6344k82580A32883d0394k49406
8851b89800j70870A3472J13003D3414K17065A11759M7139b54557B4600c63347
$$ [...]
##END NTUPLES=NMR SPECTRUM
##END=
