
##TITLE=AC1001_LAOS_6278554_7pEHoew2PJ
##JCAMPDX= 6.0         $$ Bruker NMR JCAMP-DX V2.0
##DATA TYPE= NMR SPECTRUM
##DATA CLASS= NTUPLES
##ORIGIN= BRUKER
##OWNER= Administrator
$$ 1.72 TOPSPIN		Version 2.1
$$ 2012-06-03 15:34:01.796 -0500  Administrator@TOPSPIN
$$ Compression mode = diff/dup
##.OBSERVE FREQUENCY= 400.13188235
##.OBSERVE NUCLEUS= ^1H
##.ACQUISITION MODE= SIMULTANEOUS (DQD)
##.ACQUISITION SCHEME= undefined
##.AVERAGES= 64
##.DIGITISER RES= 22
##SPECTROMETER/DATA SYSTEM= spect
##.PULSE SEQUENCE= noesygpps1d.comp
##.SOLVENT NAME= COFFEE_meoh
##.SHIFT REFERENCE= INTERNAL, COFFEE_meoh, 1, 14.96712
##AUDIT TRAIL= $$ (NUMBER, WHEN, WHO, WHERE, PROCESS, VERSION, WHAT)
$$ ##TITLE= Audit trail, TOPSPIN		Version 2.1
$$ ##JCAMPDX= 5.01
$$ ##ORIGIN= Bruker BioSpin GmbH
$$ ##OWNER= Administrator
$$ $$ C:\Bruker\TOPSPIN/data/COFFEE/nmr/AC1001_LAOS_6278554_7pEHoew2PJ/12/pdata/1/auditp.txt
$$ ##AUDIT TRAIL=  $$ (NUMBER, WHEN, WHO, WHERE, PROCESS, VERSION, WHAT)
(   1,<2012-06-03 15:33:56.531 -0500>,<Administrator>,<TOPSPIN>,<go>,<TOPSPIN 2.1>,
      <created by zg
	started at 2012-06-03 15:22:26.250 -0500,
	POWCHK enabled, PULCHK disabled,
       configuration hash MD5:
       D5 CA 7A 23 FE 6B EE E2 50 67 74 61 24 F7 5E 3B
       data hash MD5: 64K
       41 4F BA 48 D3 DF F4 0F 65 07 CF 29 13 6A 96 EC>)
(   2,<2012-06-03 15:33:59.640 -0500>,<Administrator>,<TOPSPIN>,<proc1d>,<TOPSPIN 2.1>,
      <Start of raw data processing
       efp LB = 0.3 FT_mod = 6 PKNL = 1 PHC0 = 0 PHC1 = 0 SI = 128K 
       data hash MD5: 128K
       E0 B7 D2 D1 13 42 5B 10 69 D9 D4 41 14 63 CE E7>)
(   3,<2012-06-03 15:34:00.828 -0500>,<Administrator>,<TOPSPIN>,<proc1d>,<TOPSPIN 2.1>,
      <pk PHC0 = 31.85486 PHC1 = 0 
       data hash MD5: 128K
       58 7E CB D2 14 79 EE 5D C1 EC F7 56 BF C2 43 E1>)
(   4,<2012-06-03 15:34:01.453 -0500>,<Administrator>,<TOPSPIN>,<proc1d>,<TOPSPIN 2.1>,
      <abs ABSG = 1 
       data hash MD5: 128K
       30 77 F5 BD A2 32 4A AC 3D 28 62 AD EE CC 88 AA>)
(   5,<2012-06-03 15:34:01.515 -0500>,<Administrator>,<TOPSPIN>,<proc1d>,<TOPSPIN 2.1>,
      <abs ABSG = 2 
       data hash MD5: 128K
       13 52 AD 1E 9B 5D CC 7E CD B2 30 BA 78 0A DF 6C>)
(   6,<2012-06-03 15:34:01.578 -0500>,<Administrator>,<TOPSPIN>,<proc1d>,<TOPSPIN 2.1>,
      <abs ABSG = 3 
       data hash MD5: 128K
       57 11 CD 5A CA 4C 47 EA 3D E0 AB F4 D6 E7 85 AB>)
(   7,<2012-06-03 15:34:01.640 -0500>,<Administrator>,<TOPSPIN>,<proc1d>,<TOPSPIN 2.1>,
      <abs ABSG = 4 
       data hash MD5: 128K
       A6 61 2D 89 F9 A6 04 87 8B 30 4B 87 E3 EC 9D 9D>)
(   8,<2012-06-03 15:34:01.703 -0500>,<Administrator>,<TOPSPIN>,<proc1d>,<TOPSPIN 2.1>,
      <abs ABSG = 5 
       data hash MD5: 128K
       52 BD 4E 5F D2 CB 90 4D 8D 76 E1 06 B2 49 7B DB>)
$$ ##END=
$$ 
$$ $$ hash MD5
$$ $$ 17 79 E2 E7 66 83 A2 24 7E 63 51 61 F7 22 48 68
##$RELAX= 
##$RELAX= 
##$RELAX= 
##$RELAX= 
##$RELAX= 
##$RELAX= 
##$RELAX= 
##$RELAX= 
$$ Bruker specific parameters
$$ [...]
##$TP07= 0
##$TPNAME0= <>
##$TPNAME1= <>
##$TPNAME2= <>
##$TPNAME3= <>
##$TPNAME4= <>
##$TPNAME5= <>
##$TPNAME6= <>
##$TPNAME7= <>
##$TPOAL= (0..7)
0.5 0.5 0.5 0.5 0.5 0.5 0.5 0.5
##$TPOFFS= (0..7)
0 0 0 0 0 0 0 0
##$TUNHIN= 0
##$TUNHOUT= 0
##$TUNXOUT= 0
##$USERA1= <user>
##$USERA2= <user>
##$USERA3= <user>
##$USERA4= <user>
##$USERA5= <user>
##$V9= 5
##$VALIST= <valist>
##$VCLIST= <CCCCCCCCCCCCCCC>
##$VD= 0
##$VDLIST= <DDDDDDDDDDDDDDD>
##$VPLIST= <PPPPPPPPPPPPPPP>
##$VTLIST= <TTTTTTTTTTTTTTT>
##$WBST= 2048
##$WBSW= 25
##$XGAIN= (0..3)
0 0 0 0
##$XL= 0
##$YL= 0
##$YMAX_a= 9260827
##$YMIN_a= -6274173
##$ZGOPTNS= <>
##$ZL1= 120
##$ZL2= 120
##$ZL3= 120
##$ZL4= 120
##$ABSF1= 14.96712
##$ABSF2= -5.58541
##$ABSG= 5
##$ABSL= 3
##$ALPHA= 0
##$AQORDER= 0
##$ASSFAC= 0
##$ASSFACI= 0
##$ASSFACX= 0
##$ASSWID= 0
##$AUNMP= <proc_prof1d_extract.lims>
##$AXLEFT= 0
##$AXNAME= <>
##$AXNUC= <1H>
##$AXRIGHT= 0
##$AXTYPE= 0
##$AXUNIT= <>
##$AZFE= 0.1
##$AZFW= 0.1
##$BCFW= 0
##$BC_mod= 0
##$BYTORDP= 0
##$COROFFS= 0
##$CY= 15
##$DATMOD= 1
##$DC= 0
##$DFILT= <>
##$DTYPP= 0
##$F1P= 0
##$F2P= 0
##$FCOR= 0.5
##$FTSIZE= 131072
##$FT_mod= 6
##$GAMMA= 0
##$GB= 0
##$INTBC= 1
##$INTSCL= 1
##$ISEN= 128
##$LB= 0.3
##$LEV0= 0
##$LPBIN= 0
##$MAXI= 10000
##$MC2= 0
##$MEAN= 0
##$ME_mod= 0
##$MI= 0
##$NCOEF= 0
##$NC_proc= -3
##$NLEV= 6
##$NOISF1= 0
##$NOISF2= 0
##$NSP= 0
##$NTH_PI= 0
##$NZP= 0
##$OFFSET= 14.96712
##$PC= 1
##$PHC0= 31.85486
##$PHC1= 0
##$PH_mod= 1
##$PKNL= yes
##$PPARMOD= 0
##$PPDIAG= 0
##$PPIPTYP= 0
##$PPMPNUM= 2147483647
##$PPRESOL= 1
##$PSCAL= 4
##$PSIGN= 0
##$PYNMP= <proc.py>
##$REVERSE= no
##$SF= 400.13000539885
##$SI= 131072
##$SIGF1= 0
##$SIGF2= 0
##$SINO= 400
##$SIOLD= 131072
##$SPECTYP= <>
##$SREGLST= <1H.CDCl3>
##$SSB= 0
##$STSI= 131072
##$STSR= 0
##$SW_p= 8223.68421052632
##$SYMM= 0
##$S_DEV= 0
##$TDeff= 65536
##$TDoff= 0
##$TI= <>
##$TILT= no
##$TM1= 0
##$TM2= 0
##$TOPLEV= 0
##$USERP1= <user>
##$USERP2= <user>
##$USERP3= <user>
##$USERP4= <user>
##$USERP5= <user>
##$WDW= 1
##$XDIM= 131072
##$YMAX_p= 446832939
##$YMIN_p= -391470117
##$CURPLOT= <Network HP LaserJet P1505>
##$CURPRIN= <$Network HP LaserJet P1505>
##$DFORMAT= <normdp>
##$LAYOUT= <+/1D_H.xwp>
##$LFORMAT= <normlp>
##$PFORMAT= <normpl>
##$SURQMSG= 1
$$ End of Bruker specific parameters
$$ ---------------------------------
##NTUPLES= NMR SPECTRUM
##VAR_NAME=  FREQUENCY,     SPECTRUM/REAL,   SPECTRUM/IMAG
##SYMBOL=    X,             R,               I
##VAR_TYPE=  INDEPENDENT,   DEPENDENT,       DEPENDENT
##VAR_FORM=  AFFN,          ASDF,            ASDF
##VAR_DIM=   131072,        131072,          131072
##UNITS=     HZ,            ARBITRARY UNITS, ARBITRARY UNITS
##FACTOR=    0.0627417313425165, 1,          1
##FIRST=     8223.62146879498, -1881,        -100103
##LAST=      0,             1651,            -101618
##MIN=       0,             -391470117,      0
##MAX=       8223.62146879498, 446832939,    0
$$ Real data points
##PAGE= N=1
##DATA TABLE= (X++(R..R)), XYDATA
$$ [...]
61295H77912R878R467R996J2035J4807J6894J7581J7600J8366K0249K1848K1501
$$ 877912 887790 897257 907253 919288 934095 950989 968570 986170 1004536 1024785 1046633 1068134
61283A068134J9374J7284J6229J5109J2630R591P945P826P079M126l6l456n634
$$ 1068134 1087508 1104792 1121021 1136130 1148760 1158351 1166296 1174122 1181201 1185327 1185291 1181835 1176201
61270A176201p191q142q067p675q373j0059j0900r801p823o398n464m402l632
$$ 1176201 1169010 1160868 1152801 1145126 1136753 1126694 1115794 1105993 1098170 1091772 1086308 1081906 1078274
61257A078274l849m431m184l305l066l668l913l175k145j266J14K349M514N710
$$ 1078274 1074425 1069994 1065810 1062505 1059439 1055771 1051858 1048683 1046538 1045272 1045386 1047735 1052249 1057959
61243A057959O380P259P798O778M120R91j697m045o387q575j0301j1618j2822
$$ 1057959 1064339 1071598 1079396 1086174 1090294 1091285 1089588 1085543 1079156 1070581 1060280 1048662 1035840
61230A035840j3931j4435j3661j1533q822o447m632l090j794q29K87K289M945
$$ 1035840 1021909 1007474 993813 982280 973458 967011 962379 959289 957495 956666 956953 959242 964187
61217I64187P124Q329R290J0654J2073J3122J4183J5598J6811J7249J7425J8199
$$ 964187 971311 979640 988930 999584 1011657 1024779 1038962 1054560 1071371 1088620 1106045 1124244
61205A124244J9490K0671K1760K3248K5054K6582K7672K8714L0011L1527L2889
$$ 1124244 1143734 1164405 1186165 1209413 1234467 1261049 1288721 1317435 1347446 1378973 1411862
61194A411862L2962L0244K4653J8324J3440R731N431K81m196p359j0560j4928
$$ 1411862 1444824 1475068 1499721 1518045 1531485 1541216 1546647 1546928 1542732 1535373 1524813 1509885
61182A509885j9506k2539k3640k3775k3748k3570k2956k1813k0387j9283j8985
$$ 1509885 1490379 1467840 1444200 1420425 1396677 1373107 1350151 1328338 1307951 1288668 1269683
61171A269683j9145j8767j7361j5505j3967j2713j1099q818o469n187n609o926
$$ 1269683 1250538 1231771 1214410 1198905 1184938 1172225 1161126 1152308 1145839 1140652 1135043 1128117
61159A128117p437o572n903p121r400j0142q380n884m483l931l375l374m831o873
$$ 1128117 1120680 1114108 1108205 1101084 1091684 1081542 1073162 1067278 1062795 1058864 1055489 1052115 1047284 1040411
61145A040411p579o496m807l189j128J418L364M182M942O709Q986J0862J2863
$$ 1040411 1032832 1026336 1021529 1018340 1017212 1018630 1021994 1026176 1031118 1037827 1046813 1057675 1070538
61132A070538J6101J9964K2275K2052K0654J9545J8074J4698R750N630M225N015
$$ 1070538 1086639 1106603 1128878 1150930 1171584 1191129 1209203 1223901 1233651 1239281 1243506 1248521
61120A248521O020N789M271K276N96n83j591k560k969k369j453j657l583o302
$$ 1248521 1254541 1260330 1264601 1266877 1267473 1266890 1265299 1262739 1259770 1257401 1255948 1254291 1250708 1244406
61106A244406q440r425r573r528r925j1009j2349j3242j3465j3188j2286j0587
$$ 1244406 1235966 1226541 1216968 1207440 1197515 1186506 1174157 1160915 1147450 1134262 1121976 1111389
61094A111389q714p542o739n104k649p84J32J602M222N883M427P64k705n631r274
$$ 1111389 1102675 1095133 1088394 1083290 1080641 1079857 1079989 1081591 1085813 1091696 1096123 1096887 1094182 1088551 1079277
61079A079277j3255j5492j5579j5591j6750j7449j5737j2019q135n156l270k545
$$ 1079277 1066022 1050530 1034951 1019360 1002610 985161 969424 957405 949270 944114 940844 938299
61067I38299k425j451J014L488M240L986N140Q466J1923J3292J2748J2065J2139
$$ 938299 935874 934423 935437 938925 943165 947151 952291 960757 972680 985972 998720 1010785 1022924
61054A022924J2321J1959J1556J2047J3638J5776J7826J9175J9151J7724J6115
$$ 1022924 1035245 1047204 1058760 1070807 1084445 1100221 1118047 1137222 1156373 1174097 1190212
61043A190212J5657J5948J5105J2175Q231M691J696j194l805n858p752r879j1887
$$ 1190212 1205869 1221817 1236922 1249097 1257328 1262019 1263715 1262521 1258716 1252858 1245106 1235227 1223340
61030A223340j3424j4758j5777j5463j3571j1584j0708j0049q385o523n866n822
$$ 1223340 1209916 1195158 1179381 1163918 1150347 1138763 1128055 1118006 1109621 1103098 1097232 1091410
61018A091410m998m091m713n800m310J89M491O038N670N380N770O818Q753J0928
$$ 1091410 1086412 1082321 1077608 1071808 1067498 1067687 1072178 1078216 1083886 1089266 1095036 1101854 1110607 1121535
61004A121535J1805J1362J1662J3858J6476J7983J9176K1483K4549K7145K9109
$$ 1121535 1133340 1144702 1156364 1170222 1186698 1204681 1223857 1245340 1269889 1297034 1326143
60993A326143L0866L2274L3374L5134L8015M0993M3207M5399M8446N1804N4777
$$ 1326143 1357009 1389283 1422657 1457791 1495806 1536799 1580006 1625405 1673851 1725655 1780432
60982A780432N8047O2389O7043P0908P4293P7962Q1582Q4735Q8561R4549J02359
$$ 1780432 1838479 1900868 1967911 2038819 2113112 2191074 2272656 2357391 2445952 2540501 2642860
60971B642860J10281J17349J23773J29959J36338J43562J51867J60767J69917
$$ 2642860 2753141 2870490 2994263 3124222 3260560 3404122 3555989 3716756 3886673
60962C886673J79282J88222J96097K04346K15786K30971K47649K65005K85613
$$ 3886673 4065955 4254177 4450274 4654620 4870406 5101377 5349026 5614031 5899644
60953E899644L11229L39616L68203L98501M34277M77922N31509N98559O81066
$$ 5899644 6210873 6550489 6918692 7317193 7751470 8229392 8760901 9359460 10040526
60944A0040526P77640Q88521J019447J175748J356047J557855J785701K046236
$$ 10040526 10818166 11706687 12726134 13901882 15257929 16815784 18601485 20647721
60936B0647721K340180K669585L042419L436810L744359L779069L394846K620922
$$ 20647721 22987901 25657486 28699905 32136715 35881074 39660143 43054989 45675911
60928D5675911J672572Q15135K15939q5616j14435P3543L50949M99197L00443
$$ 45675911 47348483 48163618 48379557 48293941 48179506 48253049 48603998 49103195 49403638
60919D9403638l13250j201702k112289k835125l283814l471592l452811l290424
$$ 49403638 49090388 47888686 45776397 42941272 39657458 36185866 32733055 29442631
60911B9442631l045974k768704k486492k210904j948943j706641j486301j287772
$$ 29442631 26396657 23627953 21141461 18930557 16981614 15274973 13788672 12500900
60903A2500900j112652r63401q39198p36057o50354n79322n19250m66487m19824
$$ 12500900 11388248 10424847 9585649 8849592 8199238 7619916 7100666 6634179 6214355
60894F214355l79318l43308l09190k76572k47125k21542j98885j78680j61616
$$ 6214355 5835037 5491729 5182539 4905967 4658842 4437300 4238415 4059735 3898119
60885C898119j48222j38524j32466j28995j25354j19326j11725j04928r9527r4373
$$ 3898119 3749897 3611373 3478907 3349912 3224558 3105232 2993507 2888579 2789052 2694679
60875B694679q9083q4195p9208p2969o5947n9919n5218n0384m4692l8971l3706
$$ 2694679 2605596 2521401 2442193 2369224 2303277 2243358 2188140 2137756 2093064 2054093 2020387
60864B020387k8347k2941j8579j5742j3805j2473j2031j1901j0809q960q284r894
$$ 2020387 1992040 1969099 1950520 1934778 1920973 1908500 1896469 1884568 1873759 1864799 1856515 1846621
60852A846621j2786j5667j8418k1079k3008k3997k4939k6420k7737k8067k7589
$$ 1846621 1833835 1818168 1799750 1778671 1755663 1731666 1706727 1680307 1652570 1624503 1596914
60841A596914k6778k5719k4770k4718k5542k6136k5928k5612k5500k4669k2808
$$ 1596914 1570136 1544417 1519647 1494929 1469387 1443251 1417323 1391711 1366211 1341542 1318734
60830A318734k1605k2688k5076k6269k5337k3503k2017k0975k0169j9746j9640
$$ 1318734 1297129 1274441 1249365 1223096 1197759 1174256 1152239 1131264 1111095 1091349 1071709
60819A071709j9278j8248j6794j5446j4589j4350j4483j4449j3990j3514j3506
$$ 1071709 1052431 1034183 1017389 1001943 987354 973004 958521 944072 930082 916568 903062
60808I03062j3716j3486j2676j1729j0797r541p967o827o738p248p342o797o544
$$ 903062 889346 875860 863184 851455 840658 831117 823150 816323 809585 802337 794995 788198 781654
60795G81654p367q658r041q138p021o629o436n328l309j488o85j008k527n108
$$ 781654 774287 765629 756588 748450 741429 734800 728364 723036 719727 718239 717554 716546 714019 708911
60781G08911p460p721n762l785l670m581m377k818j926l120n336o470n666l647
$$ 708911 701451 693730 687968 684183 680513 675932 671555 668737 666811 663691 658355 651885 646219 642572
60767F42572j448K91J170J073N58O41J866L741N168N359M350K918K059K158K507
$$ 642572 641124 641415 642585 643658 644216 644857 646723 650464 655632 660991 665341 668259 670318 672476 674983
60752F74983J951K97j310j813j648k039l176m050m119m005m135l803k453j032
$$ 674983 676934 677231 675921 674108 672460 670421 667245 663195 659076 655071 650936 647133 644680 643648
60738F43648r90k318l706m377m698n040n123m742m245m020m188m859o002o841
$$ 643648 642658 640340 636634 632257 627559 622519 617396 612654 608409 604389 600201 595342 589340 582499
60724E82499o349m718l523l868m995n337m419l104k380k573l416m296m460l526
$$ 582499 576150 571432 567909 564041 559046 553709 549290 546186 543806 541233 537817 533521 529061 525535
60710E25535j881k87Q52J640K269K724K829K461J787J375J795K992M282N161N813
$$ 525535 523654 523367 524219 525859 528128 530852 533681 536142 537929 539304 541099 544091 548373 553534 559347
60695E59347O593P311P381O620N517M733M443M269L843L361L423M092M338K860
$$ 559347 565940 573251 580632 587252 592769 597502 601945 606214 610057 613418 616841 620933 625271 628131
60681F28131m65m289o937p661o895n802n535o360p348p436o741o200n964n260
$$ 628131 627666 623377 616440 608779 601884 596082 590547 584187 576839 569403 562662 556462 550498 545238
60667E45238m170m172n904p401o170k657o5m99k646l790l000j407k70P3m06j784
$$ 545238 541068 536896 530992 523591 517421 514764 514699 514200 511554 507764 504764 503357 503087 503160 502754 500970
60651E00970l587m619m025k223l82Q78J786K541K790K245J368Q51O03p4j217j718
$$ 500970 497383 492764 488739 486516 486134 487012 488798 491339 494129 496374 497742 498593 499196 499122 497905 496187
60635D96187o03J647L499L978L384K574K116K330L468N295O746O743N595M988
$$ 496187 495584 497231 500730 504708 508092 510666 512782 515112 518580 523875 530621 537364 542959 547947
60621E47947O085P958Q635P658O706P248Q426Q177O070L868L189L591L388J711
$$ 547947 554032 561990 570625 578283 584989 592237 600663 608840 614910 618778 621967 625558 628946 630657
60607F30657q41l080m273m590m891n831o928o995n729m285l862m320m786m987
$$ 630657 629816 626736 622463 617873 612982 607151 600223 593228 587499 583214 579352 575032 570246 565259
60593E65259n048m498k758o09J98p53j683q51J095J921O09j671l332m270n359
$$ 565259 560211 555713 552955 552346 552544 551791 550108 549257 550352 552273 552882 551211 547879 543609 538250
60578E38250o666o974n398k957j751k509l616l121j259j30r05k322k376q00Q86
$$ 538250 531584 524610 519212 516255 514504 511995 508379 505258 503999 503869 502964 500642 498266 497466 498352
60563D98352J497J519K153L604M845N008M531M509N052M932L304J199M29J197
$$ 498352 499849 501368 503521 507125 511970 516978 521509 526018 531070 536002 539306 540505 540934 542131
60549E42131J847J277N57J363L632N728O502O125N128L795K655K577L773N306
$$ 542131 543978 545255 545812 547175 550807 556535 563037 569162 574290 578085 580740 583317 587090 592396
60535E92396O030N640M609L537K878K799L001L005K873L157L902M313L854L111
$$ 592396 598426 604066 608675 612212 615090 617889 620890 623895 626768 629925 633827 638140 641994 645105
60521F45105K970L416L823M076M593N388O020O594P952J0510J3416J5379J6104
$$ 645105 648075 651491 655314 659390 663983 669371 675391 681985 689937 700447 713863 729242 745346
60508G45346J6549J7806J9980K2220K3692K4333K4508K4145K2625J9623J5603
$$ 745346 761895 779701 799681 821901 845593 869926 894434 918579 941204 960827 976430
60497I76430J1254O841K445j550m638o476o607m400rM965Q612J0563J2204J5144
$$ 976430 987684 994525 996970 995420 990782 984306 977699 973299 973290 978255 986867 997430 1009634 1024778
60483A024778J9897K5698L0956L4351L6321L9126M4380N0874N5967N8806O0569
$$ 1024778 1044675 1070373 1101329 1135680 1172001 1211127 1255507 1306381 1362348 1421154 1481723
60472A481723O1578O0067N4438M5140L3473K0117N985o853j6636k3599k8992l3160
$$ 1481723 1543301 1603368 1657806 1702946 1736419 1756536 1762521 1755668 1739032 1715433 1686441 1653281
60460A653281l5587l6106l4842l1736k7311k3124k0059j6909j2135o335j302K833
$$ 1653281 1617694 1581588 1546746 1515010 1487699 1464575 1444516 1427607 1415472 1409137 1407835 1410668
60448A410668P437J2699J7266K0820K4942L0789L7656M4623N2021O0380O9294
$$ 1410668 1418105 1430804 1448070 1468890 1493832 1524621 1562277 1606900 1658921 1719301 1788595
60437A788595P8132Q6662R4123R8999J00603R9817R7425R3007Q6419P8857P1234
$$ 1788595 1866727 1953389 2047512 2146511 2247114 2346931 2444356 2537363 2623782 2702639 2773873
60426B773873O2961N3928M6397M2611M1234L8361L1792K2190R913o755k9051n4961
$$ 2773873 2836834 2890762 2937159 2979770 3021004 3059365 3091157 3113347 3123260 3116505 3087454 3032493
60414C032493q0309j01822j18371j30042j37118j39782j38233j33032j25321j16212
$$ 3032493 2952184 2850362 2731991 2601949 2464831 2325049 2186816 2053784 1928463 1812251
60404A812251j06106r5287q4993p6679p0003o2935n4657m7089m2448m0223l7970
$$ 1812251 1706145 1610858 1525865 1449186 1379183 1316248 1261591 1214502 1172054 1131831 1093861
60393A093861l4468l0528k6972k3534k0197j7980j7546j7899j7474j5996j4434
$$ 1093861 1059393 1028865 1001893 978359 958162 940182 922636 904737 887263 871267 856833
60382H56833j3493j2934j2194j0910q898o309l941k798l048l781m075m030m462
$$ 856833 843340 830406 818212 807302 798404 792095 788154 785356 782308 778527 774452 770422 765960
60369G65960n765p273p879p264o477o945q654r713q431n632l976m697n996n458
$$ 765960 760195 752922 745043 737779 731302 724357 715703 705990 697559 691927 687951 683254 677258 671800
60355F71800l274j794k114k612j448O55J346n0j571j163Q44K553L030K912K695
$$ 671800 668526 666732 664618 662006 660558 661213 662559 662509 660938 659775 660619 663172 666202 669114 671809
60340F71809J846J74j015l58J528K719K557K283K834L386K864J720J170J287J122
$$ 671809 673655 673829 672814 672456 673984 676703 679260 681543 684377 687763 690627 692347 693517 694804 695926
60325F95926L85j21K70J408K892M437N563N705M899L739K592J494Q44J332K941
$$ 695926 696311 696190 696460 697868 700760 705197 710760 716465 721364 725103 727695 729189 730033 731365 734306
60310G34306M703N781O192O326O474O957P896Q437P224M215J285K20P70J460J791
$$ 734306 739009 744790 750982 757308 763782 770739 778635 787072 794296 798511 799796 800016 800786 802246 804037
60295H04037K530M125N968P361Q373R410J0488J1257J1425J0912R854Q537P216
$$ 804037 806567 810692 816660 824021 832394 841804 852292 863549 874974 885886 895740 904277 911493
60282I11493N897M415K633N67j526l147l967m363n045n875n643l595p67R72R32
$$ 911493 917390 921805 924438 925005 923479 920332 916365 912002 906957 901082 895439 891844 891077 892049 892981
60267H92981r5j307k621l848m239l543k796l252m797o021n738l909j227J531L694
$$ 892981 892886 891579 888958 885110 880871 877328 874532 871280 866483 860462 854724 850815 849588 851119 854813
60252H54813M889N530O773R547J3579J7619K0683K2964K5527K9183L3539L6918
$$ 854813 859702 865232 872005 881552 895131 912750 933433 956397 981924 1011107 1044646 1081564
60240A081564L7359L4108K8216K1335J3831M617o776j8462k7325l1809l2966l2756
$$ 1081564 1118923 1153031 1181247 1202582 1216413 1221030 1214254 1195792 1168467 1136658 1103692 1070936
60228A070936l2107l0999k9584k8303k7058k5109k1994j8099j4057j0143o609
$$ 1070936 1038829 1007830 978246 949943 922885 897776 875782 857683 843626 833483 826874
60217H26874m322m182n816p478p736o872n980n144l529j239J45m54k161l402l891
$$ 826874 822552 818370 812554 805076 797340 790468 784488 779344 775815 774576 774721 774267 772106 768704 764813
60202G64813m225m288l359j663l72Pk9l54j551l418m504l913k592j892j772j373
$$ 764813 760588 756300 752941 751278 750906 750913 750884 750530 748979 745561 741057 737144 734552 732660 730888 729515
60186G29515o17r8J38O49J588K517L071L190K894K495K752M019N389N471M034
$$ 729515 728898 728800 728938 729587 731175 733692 736763 739953 742847 745342 748094 752113 757502 762973 767007
60171G67007K289J574K315M046N862O821O508N339M059L142K922L727N252O253
$$ 767007 769296 770870 773185 777231 783093 789914 796422 801761 805820 808962 811884 815611 820863 827116
60157H27116N825M763M694N933P157P384P172P432P947P763O636N383M883N139
$$ 827116 832941 837704 842398 848331 855488 862872 870044 877476 885423 893186 899822 905205 910088 915227
60143I15227N413N143M660M754N417N435L750J057o43j98J474K433J670r2j222
$$ 915227 920640 925783 930443 935197 940614 946049 949799 950856 950213 950015 951489 953922 955592 955500 954278
60128I54278p76N37J072J79r50q06M81J464J409J031J148J676K234K852L506L699
$$ 954278 953502 954039 955111 955290 954340 953534 954015 955479 956888 957919 959067 960743 962977 965829 969335 973034
60112I73034L240K880L390M326M436L277J680N72q8q08j477j502r71r47k063l303
$$ 973034 976274 979154 982544 986870 991306 994583 996263 996835 996747 995939 994462 992960 991989 991042 988979 985676
60096I85676l070j292M88J339K042L419M793N268N562O990R139J0342J0223R998
$$ 985676 982606 981314 981802 983141 985183 988602 993395 998663 1004225 1011215 1020354 1030696 1040919 1050917
60082A050917J0098R454P749O452O557O946O468O183P737J0484J2266J2525J2620
$$ 1050917 1061015 1070469 1078218 1084670 1091227 1098173 1104641 1110824 1118561 1129045 1141311 1153836 1166456
60069A166456J3110J2774J0784Q135O097M644L325K458K303K011P38p61r76J01
$$ 1166456 1179566 1192340 1203124 1211259 1217356 1222000 1225325 1227783 1230086 1232097 1232835 1232074 1231098 1231199
60055A231199R09O67O20K389N891R497J1697J2077J1177J0086R921J0898J1849
$$ 1231199 1232108 1232775 1233395 1235784 1241675 1251172 1262869 1274946 1286123 1296209 1306130 1317028 1328877
60042A328877J1201Q582N126K213M01m53o49n78p35j343k100k512k404j985j695
$$ 1328877 1340078 1348660 1353786 1355999 1356400 1355947 1355298 1354720 1353985 1352642 1350542 1348030 1345626 1343641 1341946
60027A341946j969k797l553l697l685m434n814o630o534o875q841j1628j3693
$$ 1341946 1339977 1337180 1333627 1329930 1326245 1321811 1315997 1309367 1302833 1295958 1287117 1275489 1261796
60014A261796j5097j7079j9689k1463k1626k1046k0520j9559j7752j6178j6261
$$ 1261796 1246699 1229620 1209931 1188468 1166842 1145796 1125276 1105717 1087965 1071787 1055526
60003A055526j7699j8604j7575j5057j2645j1532j1573j1710j1292j0717j0518
$$ 1055526 1037827 1019223 1001648 986591 973946 962414 950841 939131 927839 917122 906604
59992I06604j0080q286n369k958k020j748j079k82j95p63j370j931k617k950k294
$$ 906604 896524 888238 882869 879911 877891 876143 875064 874782 874587 873824 872454 870523 867906 864956 862662
59977H62662j044l29n64j240j945k668l144k914k263k190l145m401m990m664l748
$$ 862662 861618 861289 860725 859485 857540 854872 851728 848814 846551 844361 841216 836815 831825 827161 823413
59962H23413k612j677j396j788k185j807m95J075J814R78j057k850l191k294j235
$$ 823413 820801 819124 817728 815940 813755 811948 811453 812528 814342 815320 814263 811413 808222 805928 804693
59947H04693m13O63K060K903K655J954J513Q67p39k786l880l688l344l691m100
$$ 804693 804280 804943 807003 809906 812561 814515 816028 816895 816156 813370 809490 805802 802458 798767 794667
59932G94667l626k495j618j137l80Q49J831K071K115K848M341N805O445O087N174
$$ 794667 791041 788546 786928 785791 785411 786260 788091 790162 792277 795125 799466 805271 811716 817803 822977
59917H22977M346L905L590L078K680L018L916M354L901L374L457L454K587J834
$$ 822977 827323 831228 834818 837896 840576 843594 847510 851864 855765 859139 862596 866050 868637 870471
59903H70471K934N658P660P506O483O551P588P753N985L083N22j008j913k986
$$ 870471 873405 879063 886723 894229 900712 907263 914851 922604 928589 931672 932194 931186 929273 926287
59889I26287m373n241m821l704l318l911m105l011j600j120j144m82P16J242Q52
$$ 926287 921914 916673 911852 908148 904830 900919 896814 893803 892203 891083 889939 889457 890173 891415 892267
59874H92267N89J157K274L736N803Q285J0276J1223J1323J0645R021P186O889
$$ 892267 892856 894013 896287 900023 905826 914111 924387 935610 946933 957578 966599 973785 980674
59861I80674Q983J2199J4623J5844J6788J7907J8510J7924J6551J5374J4748J3951
$$ 980674 989657 1001856 1016479 1032323 1049111 1067018 1085528 1103452 1120003 1135377 1150125 1164076
59849A164076J2046R084O212M411L404K100r7k821n295o790o856n958n726p579
$$ 1164076 1176122 1185206 1191418 1195829 1199233 1201333 1201236 1198415 1193120 1186330 1179474 1173516 1167790 1160211
59835A160211j0774j2723j1640q249m639k255j316j317j329m40J325K903L493
$$ 1160211 1149437 1136714 1125074 1116825 1112186 1109931 1108615 1107298 1105969 1105529 1106854 1109757 1113250
59822A113250L538L894M603N163N545O121O924P667Q314Q869Q868P809O011M305
$$ 1113250 1116788 1120682 1125285 1130448 1135993 1142114 1149038 1156705 1165019 1173888 1182756 1190565 1196576 1200881
59808A200881K934J385n83k359l115k668j688j324k387m490o169o316n313m333
$$ 1200881 1203815 1205200 1204617 1202258 1199143 1196475 1194787 1193463 1191076 1186586 1180417 1174101 1168788 1164455
59794A164455l850l567l375l485l664l301k331j117N49L276O543Q584Q496P420
$$ 1164455 1160605 1157038 1153663 1150178 1146514 1143213 1140882 1139765 1140314 1143590 1150133 1158717 1167213 1174633
59780A174633O797O215M257R84j671k051m49J466K131Q77k007n565q905j1815
$$ 1174633 1181430 1187645 1191902 1192886 1191215 1189164 1188715 1190181 1192312 1193189 1191182 1185617 1176712 1164897
59766A164897j4377j6144j6298j4828j2907j1733j1318j0715r017n969k080J340
$$ 1164897 1150520 1134376 1118078 1103250 1090343 1078610 1067292 1056577 1047560 1041591 1039511 1040851
59754A040851K688J405j200l021l178k568k442l095m195n655p418q727q602p185
$$ 1040851 1043539 1044944 1043744 1040723 1037545 1034977 1032535 1029440 1025245 1019590 1012172 1003445 994843 987658
59740I87658n863n697o296o698o749o852o772n784m070k923l092l729l587k648
$$ 987658 981795 976098 969802 963104 956355 949503 942731 936947 932877 929954 926862 923133 919546 916898
59726I16898j832j528j257n99K97J061J262L97j425k825k214J10J965J878Q72
$$ 916898 915066 913538 912281 911682 911979 913040 914302 914699 913274 910449 908235 908345 910310 912188 913060
59711I13060Q67K073L010K760K025J891K494L227L666L890M210M800N492N947
$$ 913060 913927 916000 919010 921770 923795 925686 928180 931407 935073 938963 943173 947973 953465 959412
59697I59412O283P190Q950J0562J0654R321Q224Q589R798J0282R238P031M539
$$ 959412 965695 972885 981835 992397 1003051 1012372 1020596 1029185 1038983 1049265 1058503 1065534 1070073
59684A070073K630J826J805J560N91l51l24L05J04j754m741p723r720j0004q441
$$ 1070073 1072703 1074529 1076334 1077894 1078485 1078134 1077810 1078115 1078219 1076465 1071724 1064001 1054281 1044277 1035836
59669A035836o156n022n814p226p445o365n500n753o123n129k965j467j893l337
$$ 1035836 1029680 1024658 1018844 1011618 1004173 997808 992308 986555 980432 975303 972338 970871 968978 965641
59655I65641l738k112O43K948M024M141M101M736O479Q942J1259J3184J5382J8080
$$ 965641 961903 959791 960434 963382 967406 971547 975648 980384 986863 995805 1007064 1020248 1035630 1053710
59641A053710J9972J9452J6841J4253J3054J2534J1571J0483J0127R927Q302N047
$$ 1053710 1073682 1093134 1109975 1124228 1137282 1149816 1161387 1171870 1181997 1191924 1200226 1205273
59629A205273J950O00N53L56m27j122j430j827k460k682k207k045l439o145q477
$$ 1205273 1207223 1207823 1208376 1208732 1208305 1207183 1205753 1203926 1201466 1198784 1196577 1194532 1191093 1184948 1176471
59614A176471r112q260o919n637m459l518k986k551j671l53Q11J609K575M182
$$ 1176471 1167359 1159099 1152180 1146543 1142084 1138566 1135580 1133029 1131358 1131005 1131816 1133425 1136000 1140182
59600A140182O120P852R351J0709J1411J0838R427Q465Q429Q257O683L830R15
$$ 1140182 1146302 1154154 1163505 1174214 1185625 1196463 1205890 1214355 1222784 1231041 1237724 1241554 1242469
59587A242469j263k998m960p325r717j1686j3157j4470j5960j7410j8290j8540
$$ 1242469 1241206 1238208 1233248 1225923 1216206 1204520 1191363 1176893 1160933 1143523 1125233 1106693
59575A106693j8701j8821j7926j5299j1971r926r862j0703j1321j1686j1926j1618
$$ 1106693 1087992 1069171 1051245 1035946 1023975 1014049 1004187 993484 982163 970477 958551 946933
59563I46933j0793j0644j1990j3712j4021j2950j2229j2720j3292j2622j0796
$$ 946933 936140 925496 913506 899794 885773 872823 860594 847874 834582 821960 811164
59552H11164q603o344m282l381m353o149o609m844k178m75j08j25J01J46m25j045
$$ 811164 802561 796217 791935 788554 784201 778052 771443 766599 764421 763946 763838 763713 763814 763960 763535 762490
59536G62490q11K7J13j198k741k881j557k32l4p97j955l341m739n501n261m502
$$ 762490 761679 761706 761819 760621 757880 754999 753442 753210 753176 752379 750424 747083 742344 736843 731582 727080
59520G27080l771k805j150O81J410M33j504l135l777l633l359l459l775l607k495
$$ 727080 723309 720504 719354 720035 721445 721878 720374 717239 713462 709829 706470 703011 699236 695629 693134
59505F93134r07J33O8p46j506j586p63Q27K710M256N056N250N476O348P776Q810
$$ 693134 692227 692360 692428 691682 690176 688590 687827 688654 691364 695620 700676 705926 711402 717750 725526 734336
59489G34336Q501P127O286P519J0799J4464J6601J6576J5508J5314J7069K0273
$$ 734336 742837 749964 756250 763769 774568 789032 805633 822209 837717 853031 870100 890373
59477H90373K3671K6263K7039K4441J7683Q746J555j716k467l091l879l792k984
$$ 890373 914044 940307 967346 991787 1009470 1018216 1019771 1018055 1015588 1012497 1008618 1004826 1001842
59464A001842k481j818N85M380O679N443J944j176l019m438n990p437q739j0212
$$ 1001842 999361 997543 998128 1002508 1009187 1014630 1016574 1015398 1012379 1007941 1001951 994514 985775 975563
59450I75563j1745j2890j3588j4009j3945j3237j2525j2502j2577j1491r409q037
$$ 975563 963818 950928 937340 923331 909386 896149 883624 871122 858545 847054 837645 829608
59438H29608q270q828q023n874l509j341Q88K646K764J268o1L63K198L843M325
$$ 829608 821338 812510 804487 798613 795104 793763 794651 797297 800061 801329 801268 801631 803829 807672 811997
59423H11997L984L724M167N219O080N865M627L388K814K325J186o9l20K75K70
$$ 811997 815981 819705 823872 829091 835171 841036 845663 849051 851865 854190 855376 855307 854987 855262 855532
59408H55532j000k429k633j573j02J144J700J006p47j984j122J596M587O929Q742
$$ 855532 854532 852103 849470 847897 847795 848939 850639 851645 850898 848914 847792 849388 853975 860904 869646
59393H69646R745R072P056N811O845Q835R017O379K557k85j380j192o72j059l264
$$ 869646 879391 888463 895519 901330 908175 917010 926027 932406 934963 934678 933298 932106 931434 930375 927111
59378I27111o578q727q259o430n628o273o601n513m037l333k711q27K118M796
$$ 927111 920533 911806 903547 897117 891489 885216 878615 873102 869065 865732 863021 862194 864312 869108
59364H69108O643P924Q368P507O366P017R986J3450J5735J7286J9593K3273K7844
$$ 869108 875751 883675 892043 899550 905916 912933 922919 936369 952104 969390 988983 1012256 1040100
59351A040100L2025L3463K9602K0334Q999m26o454r670j0535r132o040j591M875
$$ 1040100 1072125 1105588 1135190 1155524 1164523 1164097 1157643 1147973 1137438 1128306 1122266 1120675 1125550
59338A125550J2840J8330J6491P068m759j3760j9033k2324k4166k3565k0464j6511
$$ 1125550 1138390 1156720 1173211 1180279 1175520 1161760 1142727 1120403 1096237 1072672 1052208 1035697
59326A035697j3303j0933q571n850l356j820r86K03K073L518L680L625M930P035
$$ 1035697 1022394 1011461 1002890 997040 993684 991864 990878 991081 993154 996672 1000352 1003977 1008907 1015942
59312A015942P738O560N782P443J0776J3507J4425J3759J2280J1066J1034J1690
$$ 1015942 1023680 1030240 1036022 1043465 1054241 1067748 1082173 1095932 1108212 1119278 1130312 1142002
59300A142002J1357R691Q733J0156J2614J3532J2701J2183J3043J4059J3769J2256
$$ 1142002 1153359 1163050 1171783 1181939 1194553 1208085 1220786 1232969 1246012 1260071 1273840 1286096
59288A286096J0674J0252J1708J4491J6572J6322J4614J3769J4435J4977J4238
$$ 1286096 1296770 1307022 1318730 1333221 1349793 1366115 1380729 1394498 1408933 1423910 1438148
59277A438148J3004J2094J0700P945M828L030K413J208j454m564o871q455j0127
$$ 1438148 1451152 1463246 1473946 1481891 1486719 1489749 1492162 1493370 1491916 1487352 1480481 1472026 1461899
59264A461899j1927j2886j2256j0611r439r537j0102r806q601p703p703p709o894
$$ 1461899 1449972 1437086 1424830 1414219 1404780 1395243 1385141 1375335 1366734 1359031 1351328 1343619 1336725
59251A336725o041o417p608p749n962l374j466m19L02P76R90J599L184N053O003
$$ 1336725 1330684 1324267 1316659 1308910 1302948 1299574 1298108 1297689 1297991 1298767 1299757 1301356 1304540 1309593 1315596
59236A315596O211P141R426J1986J3501J3430J1012M932m584j4444k1275k4857
$$ 1315596 1321807 1328948 1338374 1350360 1363861 1377291 1388303 1393235 1388651 1374207 1352932 1328075
59224A328075k7295k9371k9802k8162k6016k4280k1567j6657j0977o850m417k224
$$ 1328075 1300780 1271409 1241607 1213445 1187429 1163149 1141582 1124925 1113948 1107098 1102681 1100457
59212A100457m5R96Q27R53K232L745M428M515M727M986M558K963L78k281l719
$$ 1100457 1100412 1101408 1102235 1103188 1105420 1109165 1113593 1118108 1122835 1127821 1132379 1135342 1135720 1133439 1129720
59197A129720l520l027l956o007p094o378n695o992r483j0570r012o067l813l400
$$ 1129720 1126200 1123173 1119217 1113210 1106116 1099738 1094043 1087051 1077568 1066998 1057986 1051919 1048106 1044706
59183A044706m650o312o746n238k768q07M63J789K967K626M35j753j868OK175
$$ 1044706 1040056 1033744 1026998 1021760 1018992 1018185 1018648 1020437 1023404 1026030 1026465 1024712 1022844 1022850 1025025
59168A025025L625M597N111M493K790J397J281J477N34j025j183N73K253K111
$$ 1025025 1028650 1033247 1038358 1042851 1045641 1047038 1048319 1049796 1050330 1049305 1048122 1048695 1050948 1053059
59154A053059J122J485L386M844M695M093M477N374N369M544M456N696O713N775
$$ 1053059 1054181 1055666 1059052 1063896 1068591 1072684 1077161 1082535 1087904 1092448 1096904 1102600 1109313 1115088
59140A115088L427K066L116N386O510N606L941L143L399L745L645L688M615O222
$$ 1115088 1118515 1120581 1123697 1129083 1135593 1141199 1145140 1148283 1151682 1155427 1159072 1162760 1167375 1173597
59126A173597P511P777P173O275N369M364L269K383J885J426N41o15j399j708
$$ 1173597 1181108 1188885 1196058 1202333 1207702 1212066 1215335 1217718 1219603 1221029 1221570 1220955 1219556 1217848
59112A217848k336l705m765m071j970o07j210k316j635Q89L151L838L905M614
$$ 1217848 1215512 1211807 1207042 1202971 1201001 1200394 1199184 1196868 1195233 1196122 1199273 1203111 1207016 1211630
59098A211630N469N116L549K087J459J094L79n16j412k739m809p073q628r113
$$ 1211630 1217099 1222215 1225764 1227851 1229310 1230404 1230783 1230267 1228855 1226116 1221307 1214234 1205606 1196493
59084A196493q787q236q262r374j0982j1791j1468j1112j1445j1456r882p313
$$ 1196493 1187706 1179470 1171208 1161834 1150852 1139061 1127593 1116481 1105036 1093580 1083698 1076385
59072A076385n518n116n287n424n536m963k494J684N549P553Q274R069J0183J1078
$$ 1076385 1070867 1065751 1060464 1055040 1049504 1044541 1042047 1043731 1049280 1056833 1065107 1074176 1084359 1095437
59058A095437J1782J2765J4030J5302J6734J8562K0267K0881K0056J8317J6497
$$ 1095437 1107219 1119984 1134014 1149316 1166050 1184612 1204879 1225760 1245816 1264133 1280630
59047A280630J5236J4696J4288J3079J0959R025Q231Q080P261N310L024J414O92
$$ 1280630 1295866 1310562 1324850 1337929 1348888 1357913 1366144 1374224 1381485 1386795 1389819 1391233 1391925
59034A391925J86j060l375n916p398p577p488q022q997r970j1047j2366j3666
$$ 1391925 1392111 1391051 1387676 1381760 1374362 1366785 1359297 1351275 1342278 1332308 1321261 1308895 1295229
59021A295229j4998j6985j9531k1238k1117j9978j9029j8084j6503j4964j4498
$$ 1295229 1280231 1263246 1243715 1222477 1201360 1181382 1162353 1144269 1127766 1112802 1098304
59010A098304j4341j2801j0004p905p516p968q426q914q924p398m947m018n569
$$ 1098304 1083963 1071162 1061158 1053253 1045737 1037769 1029343 1020429 1011505 1004107 999160 995142 989573
58997I89573p311o810m857l968m609m982m054k692j708o18J018K373K460J755
$$ 989573 982262 975452 970595 966627 962018 957036 952982 950290 948582 947964 948982 951355 953815 955570
58983I55570J749L067M740N515N508O028P819R969J0986J0570R731R421R879J1201
$$ 955570 957319 960386 965126 970641 976149 982177 989996 999965 1010951 1021521 1031252 1040673 1050552 1061753
58969A061753J3504J6208J8155J8922J9363K0490K2547K5429K8892L1798L2330
$$ 1061753 1075257 1091465 1109620 1128542 1147905 1168395 1190942 1216371 1245263 1277061 1309391
58958A309391L0081K6937K4675K2418J7955J1122M363q9k215l354m678o810r590
$$ 1309391 1339472 1366409 1391084 1413502 1431457 1442579 1446942 1446853 1444638 1441284 1436606 1429796 1420206
58945A420206j1709j1557r094o062l906k403j036o94k674o510j0030j1682j1911
$$ 1420206 1408497 1396940 1387846 1381784 1377878 1375475 1374439 1373745 1371071 1364561 1354531 1342849 1330938
58932A330938j2055j2743j3800j5094j6673j8200j8889j8395j7393j6845j6777
$$ 1330938 1318883 1306140 1292340 1277246 1260573 1242373 1223484 1205089 1187696 1170851 1154074
58921A154074j6282j4796j2786j0801q676o275m408l754l240j073K378M498M027
$$ 1154074 1137792 1122996 1110210 1099409 1090733 1084458 1080050 1076296 1073056 1071983 1074361 1078859 1082886
58908A082886L105M291O772P578N912M011L703M200L915K652J032o97k268l090
$$ 1082886 1085991 1090282 1097054 1104632 1110544 1114555 1118258 1122458 1126373 1129025 1130057 1129360 1127092 1124002
58894A124002l423m650p177r297r511q815q853q996p504n034m210n552o437m991
$$ 1124002 1120579 1115929 1108752 1099455 1089944 1081129 1072276 1063280 1055776 1050742 1046532 1040980 1034543 1029552
58880A029552k654j616j699j469r83j403k691l616l664l416l170k608j860j662
$$ 1029552 1026898 1025282 1023583 1022114 1021131 1019728 1017037 1013421 1009757 1006341 1003171 1000563 998703 997041
58866I97041k180k712k693k245j661j168j296k534m382n477n085l958l328l560
$$ 997041 994861 992149 989456 987211 985550 984382 983086 980552 976170 970693 965608 961650 958322 954762
58852I54762m000l714k074R16M352O721P089O155N819P455J0565J3317J4216J3161
$$ 954762 950762 947048 944974 945890 950242 956963 964052 970207 976026 983481 994046 1007363 1021579 1034740
58838A034740J1104R199Q322Q733R768J0425J0670J1584J3587J5316J5323J4227
$$ 1034740 1045844 1055043 1063365 1072098 1081866 1092291 1102961 1114545 1128132 1143448 1158771 1172998
58826A172998J3825J4517J5218J5585J6393J7465J7272J5343J3222J2126J1330
$$ 1172998 1186823 1201340 1216558 1232143 1248536 1266001 1283273 1298616 1311838 1323964 1335294
58815A335294R961Q618P865O819M876L341L452M014L105J054l64r60k052l906
$$ 1335294 1345255 1353873 1361738 1368557 1373433 1376774 1380226 1384240 1387345 1388399 1388035 1387075 1385023 1381117
58801A381117n582p083r445j2566j5127j6818j8654k0758k1777k1035j9536j8269
$$ 1381117 1375535 1368452 1359007 1346441 1331314 1314496 1295842 1275084 1253307 1232272 1212736 1194467
58789A194467j7155j6065j5335j4676j3208j1205j0297j1219j2700j3252j2767
$$ 1194467 1177312 1161247 1145912 1131236 1118028 1106823 1096526 1085307 1072607 1059355 1046588
58778A046588j1740j0294q790q116q471q942q974r173r953j0600j0482r988r408
$$ 1046588 1034848 1024554 1015764 1007648 999177 990235 981261 972088 962135 951535 941053 931065 921657
58765I21657q019n417k816j859k662l921m478m024k919k014k104k874k899j297
$$ 921657 913638 908221 905405 903546 900884 896963 892485 888461 885542 883528 881424 878550 875651 874354
58751H74354J136K882L184K127R1k115l148k112M07K716L312J861o76k689l145
$$ 874354 875490 878372 881556 883683 883774 881659 878511 876399 876806 879522 882834 884695 884019 881330 878185
58736H78185k278r30L74J234J098K11J11J791L952M739M681N775P932R017Q636
$$ 878185 875907 874977 875351 876585 877683 877894 878005 879796 883748 888487 893168 898943 906875 915892 924528
58721I24528R048J1336J3473J3644J3017J3272J3596J2445J0514R355Q282N446
$$ 924528 933576 944912 958385 972029 985046 998318 1011914 1024359 1034873 1044228 1052510 1057956
58709A057956J298j696k661l267m697n818n184l389k401l226m961n963n580m644
$$ 1057956 1059254 1057558 1054897 1051630 1046933 1041115 1035931 1032542 1030141 1026915 1021954 1015991 1010411 1005767
58695A005767m161l876k850j218k37m39r60j177j497j859j083J239L532M293M208
$$ 1005767 1001606 997730 994880 993662 993425 992986 992026 990849 989352 987493 986410 987649 991181 995474 999682
58680I99682M852O406Q013R406J0696J1405J1266J1196J2071J3306J4043J4881
$$ 999682 1004534 1010940 1018953 1028359 1039055 1050460 1061726 1072922 1084993 1098299 1112342 1127223
58668A127223J6718J8598J8602J6542J4068J2307J1020R909R285R373J0106J1439
$$ 1127223 1143941 1162539 1181141 1197683 1211751 1224058 1235078 1244987 1254272 1263645 1273751 1285190
58656A285190J2939J3532J2773J1679J1056R779O386J629k380n178q143j1995
$$ 1285190 1298129 1311661 1324434 1336113 1347169 1356948 1363334 1364963 1362583 1357405 1349262 1337267
58644A337267j6088k0091k4258k7834k9336k9055k9371l1604l4133l4655l3201
$$ 1337267 1321179 1301088 1276830 1248996 1219660 1190605 1161234 1129630 1095497 1060842 1027641
58633A027641l1687l1256l1120k9826k6850k2910j9054j5734j2904j0737r494
$$ 1027641 995954 964698 933578 903752 876902 853992 834938 819204 806300 795563 786069
58622G86069q624p117n188m357n006n152l074O4J824J808J462J438J275J421L148
$$ 786069 777445 770328 765140 760783 755777 750625 747551 747615 749439 751247 752709 754147 755422 756843 759991
58607G59991O164Q329Q368P288O619O563O456N879M857L756L040K470Q49k270
$$ 759991 766155 774484 782852 790140 796759 803322 809778 815657 820514 824270 827310 829780 830629 828359
58593H28359n170n759m504l875m994o574p280p304p235p072o846o874o929o439
$$ 828359 823189 817430 812926 809051 804057 797483 790203 782899 775664 768592 761746 754872 747943 741504
58579G41504n716n611n890n519m637m449m849m269k411j130j566k327j700p1J239
$$ 741504 735788 730177 724287 718768 714131 709682 704833 700564 698153 697023 695457 693130 691430 691359 692598
58564F92598J969K381K033Q38K92J849M593O195N898N082M874M785M026L067L046
$$ 692598 694567 696948 698981 699819 700111 701960 706553 712748 718646 723728 728602 733387 737413 740480 743526
58549G43526M166N409N738N128M292L776L665L814L896L335K049J169J966L882
$$ 743526 747692 753101 758839 763967 768259 772035 775700 779514 783410 786745 788794 789963 791929 795811
58535G95811M893M281L567L899M293L825L871O059R236J0946J1035J1249J1920
$$ 795811 800704 804985 808552 812451 816744 820569 824440 830499 839735 850681 861716 872965 884885
58522H84885J1845J1316J2307J5100J7471J7945J7468J6972J5761J3502J1731
$$ 884885 896730 908046 920353 935453 952924 970869 988337 1005309 1021070 1034572 1046303
58511A046303J1818J3187J4862J7270K1104K5730K9896L2984L4630L4420L2959
$$ 1046303 1058121 1071308 1086170 1103440 1124544 1150274 1180170 1213154 1247784 1282204 1315163
58500A315163L1918L2086L2416L1794L0266K7867K3846J8116J1933N991m52p299
$$ 1315163 1347081 1379167 1411583 1443377 1473643 1501510 1525356 1543472 1555405 1561396 1560944 1553645
58488A553645j2370j4280j5027j7632k2149k6110k8164k9173l0101l0813l1032
$$ 1553645 1541275 1526995 1511968 1494336 1472187 1446077 1417913 1388740 1358639 1327826 1296794
58477A296794l0899l0424k9544k8696k8267k7569k5467k1980j8305j5350j3247
$$ 1296794 1265895 1235471 1205927 1177231 1148964 1121395 1095928 1073948 1055643 1040293 1027046
58466A027046j2102j2091j2547j1998r687o625m684m663n491n418m021k685k775
$$ 1027046 1014944 1002853 990306 978308 968621 961996 957312 952649 947158 941740 937719 935034 932259
58453I32259l732l855k737j782k076k931l112k469j713j327j455k113k808k565
$$ 932259 928527 924672 921935 920153 918077 915146 912034 909565 907852 906525 905070 902957 900149 897584
58439H97584j026R16K161K524K373J858J208J270K787N297P419Q249Q141Q127
$$ 897584 896558 897474 899635 902159 904532 906390 907598 908868 911655 916952 924371 932620 940761 948888
58425I48888Q894J0306J1766J3024J4377J6052J7719J8831J9095J8293J6359J4043
$$ 948888 957782 968088 979854 992878 1007255 1023307 1041026 1059857 1078952 1097245 1113604 1127647
58413A127647J2640J2166J0786P197K756l02k028m304p679j0645j2102j2500j2234
$$ 1127647 1140287 1152453 1163239 1170436 1173192 1172890 1170862 1166558 1158879 1148234 1136132 1123632 1111398
58400A111398j0776q124n594m343m090l751k517j77K684M817N570N673N761M817
$$ 1111398 1100622 1092498 1086904 1082561 1078471 1074720 1072203 1072026 1074710 1079527 1085097 1090770 1096531 1101348
58386A101348J736k334n128o318p172p710o770m822l880m274m095k398l15J530
$$ 1101348 1103084 1100750 1095622 1089304 1082132 1074422 1067652 1062830 1058950 1054676 1050581 1048183 1047868 1049398
58372A049398L977O877Q443Q152P709Q012P770O467O034P937J0845J2862J3876
$$ 1049398 1053375 1060252 1068695 1076847 1084556 1092568 1100338 1106805 1112839 1120776 1131621 1144483 1158359
58359A158359J4087J2516Q907N087K492J19l256o583q155q117p616o916o005n584
$$ 1158359 1172446 1184962 1193869 1198956 1201448 1201567 1198311 1191728 1183573 1175456 1167840 1160924 1154919 1149335
58345A149335n794n462m024k690k280j702l8J762K917M438O851Q268O977M267
$$ 1149335 1143541 1138079 1134055 1131365 1129085 1127383 1127345 1129107 1132024 1136462 1143313 1151581 1158558 1162825
58331A162825K402J394J13q53q5J828K823K277J435J285J647K054K353K814M224
$$ 1162825 1165227 1166621 1166734 1165881 1165796 1167624 1170447 1172724 1174159 1175444 1177091 1179145 1181498 1184312 1188536
58316A188536O973R728J0465R345Q661R383J0109J0189J1033J2925J3587J1980
$$ 1188536 1195509 1205237 1215702 1225047 1233708 1243091 1253200 1263389 1274422 1287347 1300934 1312914
58304A312914J0723J2172J4558J4827J3320J2639J3474J4414J4677J4461J3599
$$ 1312914 1323637 1335809 1350367 1365194 1378514 1391153 1404627 1419041 1433718 1448179 1461778
58293A461778J2068J0887J0656J0386R356Q624R087R832J0127J0971J2900J4434
$$ 1461778 1473846 1484733 1495389 1505775 1515131 1523755 1532842 1542674 1552801 1563772 1576672 1591106
58281A591106J4685J5138J6795J7998J7564J7389J9201K1204K1016J9543J8828
$$ 1591106 1605791 1620929 1637724 1655722 1673286 1690675 1709876 1731080 1752096 1771639 1790467
58270A790467J8300J6563J4871J5209J6618J6780J5741J4874J3848J1909J0467
$$ 1790467 1808767 1825330 1840201 1855410 1872028 1888808 1904549 1919423 1933271 1945180 1955647
58259A955647J1059J2421J2745J3107J5241J7822J8574J8509K0345K4072K7576
$$ 1955647 1966706 1979127 1991872 2004979 2020220 2038042 2056616 2075125 2095470 2119542 2147118
58248B147118L0181L2227L2767L1212K9586K9785L0386K9678K9614L2635L6720
$$ 2147118 2177299 2209526 2242293 2273505 2303091 2332876 2363262 2392940 2422554 2455189 2491909
58237B491909L7958L6400L4994L4524L4103L4903L8440M2554M3942M3663M5422
$$ 2491909 2529867 2566267 2601261 2635785 2669888 2704791 2743231 2785785 2829727 2873390 2918812
58226B918812M9564N3419N6457O0206O4087O6223O7582P0575P4558P7541Q1114
$$ 2918812 2968376 3021795 3078252 3138458 3202545 3268768 3336350 3406925 3481483 3559024 3640138
58215C640138Q8301R7419J03637J06294J09319J14553J19826J23710J27310J31269
$$ 3640138 3728439 3825858 3929495 4035789 4145108 4259661 4379487 4503197 4630507 4761776
58205D761776J35486J41545J51100J62234J71616J79254J86770J92656J94580
$$ 4761776 4897262 5038807 5189907 5352141 5523757 5703011 5889781 6082437 6277017
58196F277017J95013J98857K06359K13897K20829K29678K40389K50471K60500
$$ 6277017 6472030 6670887 6877246 7091143 7311972 7541650 7782039 8032510 8293010
58187H293010K73709K90392L08067L26555L47471L69650L90660M11859M36394
$$ 8293010 8566719 8857111 9165178 9491733 9839204 10208854 10599514 11011373 11447767
58178A1447767M63549M90766N19564N53289N90760O28315O66095P06056P46453
$$ 11447767 11911316 12402082 12921646 13474935 14065695 14694010 15360105 16066161 16812614
58169A6812614P85222Q25803Q72172R21473R69648J020635J080841J148283J217022
$$ 16812614 17597836 18423639 19295811 20217284 21186932 22207567 23288408 24436691 25653713
58160B5653713J288699J369196J457769J550896J652896J770282J899252K031944
$$ 25653713 26942412 28311608 29769377 31320273 32973169 34743451 36642703 38674647
58152C8674647K171483K327060K498688K682541K887435L128987L411164L732033
$$ 38674647 40846130 43173190 45671878 48354419 51241854 54370841 57782005 61514038
58144F1514038M104715M553358N091391N723696O466109P341753Q365534R557876
$$ 61514038 65618753 70172111 75263502 80987198 87453307 94795060 103160594 112718470
58136A12718470J0962917J2615607J4491424J6522293J8661196K0909581K3318644
$$ 112718470 123681387 136296994 150788418 167310711 185971907 206881488 230200132
58129B30200132K6010259K9081385L2218362L4272201L3438132K8275493J8845842
$$ 230200132 256210391 285291776 317510138 351782339 385220471 413495964 432341806
58122D32341806O923776m936905j4660636k1305750k4934758k6138709k5653606
$$ 432341806 439265582 434328677 419668041 398362291 373427533 347288824 321635218
58115C21635218k4190805k2387653k0750693j9549263j8750478j8112837j7395772
$$ 321635218 297444413 275056760 254306067 234756804 216006326 197893489 180497717
58108A80497717j6496958j5424110j4211976j2908206j1593350j0350685r215490
$$ 180497717 164000759 148576649 134364673 121456467 109863117 99512432 90296942
58101I0296942q181822p247706o423884n707949n082000m535164m065207l660551
$$ 90296942 82115120 74867414 68443530 62735581 57653581 53118417 49053210 45392659
58093D5392659l302563k984349k708687k469665k254367k060421j894298j753224
$$ 45392659 42090096 39105747 36397060 33927395 31673028 29612607 27718309 25965085
58085B5965085j624561j502171j388853j283991j183076j088351j006207r34444
$$ 25965085 24340524 22838353 21449500 20165509 18982433 17894082 16887875 15953431
58077A5953431q64629p96014p34955o82146o32891n88846n56526n34210n12423
$$ 15953431 15088802 14292788 13557833 12875687 12242796 11653950 11097424 10563214 10050791
58068A0050791m87731m64744m44385m21780l96688l74900l57636l39579l18948
$$ 10050791 9563060 9098316 8653931 8232151 7835463 7460563 7102927 6763348 6444400
58059F444400l00199k85335k71464k58127k48354k41184k31596k19126k08450
$$ 6444400 6144201 5858866 5587402 5329275 5080921 4839737 4608141 4389015 4180565
58050D180565k00398j90519j77660j65840j56309j45703j33579j23989j17796
$$ 4180565 3980167 3789648 3611988 3446148 3289839 3144136 3010557 2886568 2768772
58041B768772j10906j01927r4383q9534q4146p7395p2850p1193o7766o0160n2134
$$ 2768772 2657866 2555939 2461556 2372022 2287876 2210481 2137631 2066438 1998672 1938512 1886378
58030A886378m7262m4277m1205l8698l6820l3602k9297k7268k8395k9175k7433
$$ 1886378 1839116 1794839 1753634 1714936 1678116 1644514 1615217 1587949 1559554 1530379 1502946
58019A502946k5525k5887k7642k9478l1715l3846l4049l2615l1995l2288l0954
$$ 1502946 1477421 1451534 1423892 1394414 1362699 1328853 1294804 1262189 1230194 1197906 1166952
58008A166952k8035k7023k8934l0043k7467k3031j9731j7992j7154j7146j7119
$$ 1166952 1138917 1111894 1082960 1052917 1025450 1002419 982688 964696 947542 930396 913277
57997I13277j5727j3917j4171j6225j7091j6017j5374j5954j5712j4311j4349
$$ 913277 897550 883633 869462 853237 836146 820129 804755 788801 773089 758778 744429
57986G44429j6387j7185j5004j2714j3175j4977j5221j3623j1654r979q741q310
$$ 744429 728042 710857 695853 683139 669964 654987 639766 626143 614489 604510 595769 587459
57974E87459q409q295q416r662j0972j0422q841r121j1684j4002j4807j5146j4984
$$ 587459 579050 570755 562339 552677 541705 531283 522442 513321 501637 487635 472828 457682 442698
57961D42698j2779r133o865o535n757l811k804l356l409k575l272n857p112n435
$$ 442698 429919 420786 413921 407386 401629 397818 395014 391658 388249 385674 382402 376545 369433 363998
57947C63998l411l013k475l69J157R7j803k057j033l4J345L451M902M981N084
$$ 363998 360587 357574 355099 354730 355887 355984 354181 352124 351091 351057 352402 355853 360755 365736 370820
57932C70820N778N315L170J820K589K987R18j466j295K83J29k181m795o899q629
$$ 370820 376598 381913 385083 386903 389492 392479 393397 391931 390636 390919 391048 388867 384072 377173 368544
57917C68544r155p690n391l987l673l946n038o714p285n719l308j707q91l25k70
$$ 368544 359389 351699 346308 342321 338648 334702 329664 322950 315665 309946 306638 304931 304040 303715 303445
57902C03445n77k98J71j030l835n364m159k541k680l160j945j50Qj131j823j877
$$ 303445 302868 302570 302741 301711 297876 292512 288353 285812 283132 279972 278027 277877 277885 276754 274931 273054
57886B73054j931j547m37K68K13J207L994N998N089L337L918O230P552P682Q345
$$ 273054 271123 269576 269139 269407 269620 270827 274821 280819 285908 289245 293163 299393 306945 314627 322972
57871C22972R302Q912P717P843R183R494Q110O486N189L269O69j332k284k932
$$ 322972 332274 341186 348903 356746 365929 375423 383533 390019 395208 398477 399146 397814 395530 392598
57857C92598l466l592l999n560p179o902n051m059n043o615p265o990o275n296
$$ 392598 389132 385540 381541 375981 368802 361900 356849 352790 347747 341132 333867 326877 320602 315306
57843C15306m472m333m613m551m097l809l905m497n996q078r046p725n294l625
$$ 315306 310834 306501 301888 297337 293240 289431 285526 281029 275033 266955 257909 250184 244890 241265
57829B41265k687j260N62J559J479R86J26j241k027j047Q33J672J261R41J008
$$ 241265 238578 237318 237880 239439 240918 241904 242030 240789 238762 237715 238548 240220 241481 242422 243430
57814B43430N99r3Q3Q10L48j542k899k472j370j060j471j913k358k831k798k033
$$ 243430 244029 243936 244019 244829 245177 243635 240736 238264 236894 235834 234363 232450 230092 227261 224463 222430
57798B22430j137m69N19K236L905M312L214J551N86Q23J563J663J043R58K174
$$ 222430 221293 220824 221343 223579 227484 231796 235010 236561 237147 237970 239533 241196 242239 243197 245371
57783B45371L552L332J358j026k840m131n150n916o507o841o388m974l517l055
$$ 245371 248923 252255 253613 252587 249747 245616 240466 234550 228043 221202 214814 209840 206323 203268
57769B03268l505m265n320o654p234o053l730j707k97J088K225K282J478Q70N93
$$ 203268 199763 195498 190178 183524 176290 170237 166507 164800 164503 165591 167816 170098 171576 172446 173039
57754A73039on45K37K156L211K144p1j867k930l661m072m086m041m091l760k700
$$ 173039 173033 172488 172725 174881 178092 180236 180165 178298 175368 171707 167635 163549 159508 155417 151657 148957
57738A48957j389n60l62m95o80o71j88P82J771K133J551M11k52M11J887K520J297
$$ 148957 147568 147008 146646 146151 145471 144800 144612 145394 147165 149298 150849 151260 151008 151419 153306 155826 157123
57721A57123r79k649k752j176J730M831O432N996N008M995N450M911L335J868
$$ 157123 156144 153495 150743 149567 151297 156128 162560 168556 173564 178559 184009 188920 192255 194123
57707A94123R57L53N41K071L764L600J588l35j426l029n716p725p472n816m505
$$ 194123 195080 195433 195974 198045 201809 205409 206997 206662 205236 202207 196491 188766 181294 175478 170973
57692A70973l836l199k603k172j204O80K358K747K712L661M846M169J634k38N
$$ 170973 167137 163938 161335 159163 157959 158639 160997 163744 166456 170117 174963 179132 180766 180528 180533
57677A80533O80l79k636l826l114j727q75p29j245k396l289k661r37l79k139m330
$$ 180533 181213 180834 178198 174372 171258 169531 168656 167927 166682 164286 160997 158336 157399 157020 154881 150551
57661A50551m357k361q39j371l284n253o434o086l930j377o72k024l121k419j342
$$ 150551 146194 143833 142994 141623 138339 133086 126652 120566 116636 115259 114587 112563 109442 107023 105681
57646A05681j932l525l557j110J968L458K997J710N89j98p92r16n7J423J993N76
$$ 105681 103749 100224 96667 95557 97525 100983 103980 105690 106279 106081 105289 104373 104316 105739 107732 108308
57630A08308j720k696j925j160j585k236j854q00k6N86J626K931M205O009Q774
$$ 108308 106588 103892 101967 100807 99222 96986 95132 94332 94306 94892 96518 99449 103654 109663 118437
57615A18437J1726J4086J6652K0673K5817L0614L4610L8591M2953M6927M9220
$$ 118437 130163 144249 160901 181574 207391 238005 272615 311206 354159 401086 450306
57604D50306M8284M2467L1210J6078k31j5656k8844l8356m3266m4250m2961m0568
$$ 450306 498590 541057 572267 588345 588114 572458 543614 505258 461992 417742 374781 334213
57592C34213l7689l4874l1927k7652k1889j6959j5072j4913j3041q663m637l331
$$ 334213 296524 261650 229723 202071 180182 163223 148151 133238 120197 111534 106897 103566
57580A03566l738l587k400j143k31O53J466J727J150k37k209m126n104m892m166
$$ 103566 99828 96241 93841 92698 92467 93120 94586 96313 97463 97226 95017 90891 85787 80895 76729
57565G6729l663l487l512l867m587n187n032m037k798k095k233k835l322l624
$$ 76729 73066 69579 66067 62200 57613 52426 47394 43357 40559 38464 36231 33396 30074 26450
57551B6450l978m235l995l569l779B483a485j854L43Q55J17j93K00J89n47j024
$$ 26450 22472 18237 14242 10673 6894 2483 -1485 -3339 -2996 -2141 -2024 -2217 -2017 -1828 -2375 -3399
57535c399p21l64p03j624k710l705m269m122l569l140k715j739k94P75P51l89
$$ -3399 -4120 -4484 -5187 -6811 -9521 -13226 -17495 -21617 -25186 -28326 -31041 -32780 -33074 -32299 -31548 -31937
57519c1937k041l096k611j046j17p19j804k233k601l823n062n000m331m812o212
$$ -31937 -33978 -37074 -39685 -40731 -40848 -41567 -43371 -45604 -48205 -52028 -57090 -62090 -66421 -71233 -77445
57504g7445o565n404m446m732n296n271n267n675n542m303l142l284m013l726
$$ -77445 -84010 -89414 -93860 -98592 -103888 -109159 -114426 -120101 -125643 -129946 -133088 -136372 -140385 -144111
57490a44111k195o08K14N50R49J471J848J995K187K783L734M567M966N016M780
$$ -144111 -146306 -146914 -146700 -146150 -145201 -143730 -141882 -139887 -137700 -134917 -131183 -126616 -121650 -116634 -111854
57475a11854M229L764L883M003K869Q28J98K050M132L789J670L31K55r6r47r30
$$ -111854 -107625 -103861 -99978 -95975 -93106 -92278 -92080 -90030 -85898 -82109 -80439 -80108 -79853 -79949 -80896 -81826
57459h1826j64o32k874m918n406n414n992o171m893l179k704l507m554n509o575
$$ -81826 -81990 -82622 -85496 -90414 -95820 -101234 -107226 -113397 -118290 -121469 -124173 -127680 -132234 -137743 -144318
57444a44318p315o989n768m702m613n327n809n004l067j568j778l097m022m140
$$ -144318 -151633 -158622 -164390 -169092 -173705 -179032 -184841 -189845 -192912 -194480 -196258 -199355 -203377 -207517
57430b07517l982l545k559j818k327l362l317k387k298l291l700k851k108k371
$$ -207517 -211499 -215044 -217603 -219421 -221748 -225110 -228427 -230814 -233112 -236403 -240103 -242954 -245062 -247433
57416b47433k787k709k835l452l626l118l127m100m646l814k620k182k081j707
$$ -247433 -250220 -252929 -255764 -259216 -262842 -265960 -269087 -273187 -277833 -281647 -284267 -286449 -288530 -290237
57402b90237j536j851j898j417j404k264k981l155l912n503o138m765l097l048
$$ -290237 -291773 -293624 -295522 -296939 -298343 -300607 -303588 -306743 -310655 -316158 -322296 -327061 -330158 -333206
57388c33206l924l983l209k621k285j843j667j762r99Q53J890Q64m44P4J262N06
$$ -333206 -337130 -341113 -344322 -346943 -349228 -351071 -352738 -354500 -355499 -354646 -352756 -351892 -352336 -352262 -351000 -350494
57372c50494j991l459k663j197o90q88p89j25N08J84j376k845k366k68Q58k00
$$ -350494 -352485 -355944 -358607 -359804 -360494 -361382 -362171 -362296 -361788 -361604 -362980 -365825 -368191 -368459 -367601 -367801
57356c67801j569j679j958l832n364m075j362m84j353j155M79R46n24j535p30
$$ -367801 -369370 -371049 -373007 -376839 -382203 -386278 -387640 -388124 -389477 -390632 -390153 -389207 -389731 -391266 -391996
57341c91996K04j09n90l00l95j665k639k003q67p96j160m41J077J858J538J100
$$ -391996 -391792 -391901 -392491 -392791 -393186 -394851 -397490 -399493 -400360 -401156 -402316 -402757 -401680 -399822 -398284 -397184
57325c97184J127J216R77M76j74r61j784k557l277l802l957l912l906l579k342
$$ -397184 -396057 -394841 -393864 -393388 -393562 -394523 -396307 -398864 -402141 -405943 -409900 -413812 -417718 -421297 -423639
57310d23639n17O75N96j47o30n72k25J8k74j121j767j475n86k8J35N90J281J192
$$ -423639 -424156 -423481 -422885 -423032 -423662 -424234 -424459 -424441 -424715 -425836 -427603 -429078 -429664 -429692 -429557 -428967 -427686 -426494
57292d26494j53k062l775n068n557m654k790j528j689k245j853p57k43p85j602
$$ -426494 -426647 -428709 -432484 -437552 -443109 -447763 -450553 -452081 -453770 -456015 -457868 -458625 -458868 -459653 -461255
57277d61255j883j647j378j374j573j834k087k125j316R69M232O566O231L595
$$ -461255 -463138 -464785 -466163 -467537 -469110 -470944 -473031 -475156 -476472 -475503 -471271 -464705 -458474 -454879
57263d54879J009O25K599N326P028P074O216N682N976O562O644O042N172M591
$$ -454879 -453870 -453245 -450646 -445320 -438292 -431218 -425002 -419320 -413344 -406782 -400138 -394096 -388924 -384333
57249c84333M649N200N582N374N103N418N685M602K461J342K389M296N341N517
$$ -384333 -379684 -374484 -368902 -363528 -358425 -353007 -347322 -342720 -340259 -338917 -336528 -332232 -326891 -321374
57235c21374N510N008L672K588K919L923M124L796M290N373N342L741K031J363
$$ -321374 -315864 -310856 -307184 -304596 -301677 -297754 -293630 -289834 -285544 -280171 -274829 -271088 -269057 -267694
57221b67694J400J603K049K581K572K027J703J797J587P29q6j08O36J623K194
$$ -267694 -266294 -264691 -262642 -260061 -257489 -255462 -253759 -251962 -250375 -249646 -249732 -249840 -249204 -247581 -245387
57206b45387J838Q88N78J384J887O84j127j206M76J373k7k253l250l035k974l632
$$ -245387 -243549 -242661 -242083 -240699 -238812 -238128 -239255 -240461 -239985 -238612 -238639 -240892 -244142 -247177 -250151 -253783
57190b53783m441m704m197l190k383k318k717k856k554k183j902j577j219o14
$$ -253783 -258224 -262928 -267125 -270315 -272698 -275016 -277733 -280589 -283143 -285326 -287228 -288805 -290024 -290638
57176b90638R68L562N569N428L917L338M647O929R377J1976J4318J5773J6965
$$ -290638 -289670 -286108 -280539 -275111 -271194 -267856 -263209 -256280 -246903 -234927 -220609 -204836 -187871
57163a87871J9144K1788K2958K2542K3006K5955b2601I879L3622L4502L5424L5752
$$ -187871 -168727 -146939 -123981 -101439 -78433 -52478 -22601 9879 43501 78003 113427 149179
57151A49179L5392L5013L5292L6491L8265L9435L8857L6934L5275L4655L4332
$$ 149179 184571 219584 254876 291367 329632 369067 407924 444858 480133 514788 549120
57140E49120L3687L3147L3037L2860L2273L1483L0226K7876K5136K3927K4766
$$ 549120 582807 615954 648991 681851 714124 745607 775833 803709 828845 852772 877538
57129H77538K5857K5799K5431K5699K5441K3130J9622J7139J6189J5428J4138
$$ 877538 903395 929194 954625 980324 1005765 1028895 1048517 1065656 1081845 1097273 1111411
57118A111411J3081J2757J2464J1560J0637J0811J2289J4006J4577J3585J1882
$$ 1111411 1124492 1137249 1149713 1161273 1171910 1182721 1195010 1209016 1223593 1237178 1249060
57107A249060J0632J0205J0350J0953J1896J2338J1260Q836O300M186J503l122
$$ 1249060 1259692 1269897 1280247 1291200 1303096 1315434 1326694 1335530 1341830 1346016 1347519 1344397
57095A344397j0237j9490k9843l9773m8268n5884o4057p3293q2925r2540j02546
$$ 1344397 1334160 1314670 1284827 1245054 1196786 1140902 1076845 1003552 920627 828087 725541
57084G25541j13312j24771j36874j49382C9715a33093j84619j98554k14475k30883
$$ 725541 612229 487458 350584 201202 39715 -133093 -317712 -516266 -730741 -961624
57074i61624k47261k64191k81491k98409l15810l35995l59889l86341m14738m46313
$$ -961624 -1208885 -1473076 -1754567 -2052976 -2368786 -2704781 -3064670 -3451011 -3865749 -4312062
57064d312062m82239n22098n65023o10902o60014p12885p70615q34186r03775
$$ -4312062 -4794301 -5316399 -5881422 -6492324 -7152338 -7865223 -8635838 -9470024 -10373799
57055a0373799r80369j067271j167775j282201j409847j552948j715250j897474
$$ -10373799 -11354168 -12421439 -13589214 -14871415 -16281262 -17834210 -19549460 -21446934
57047b1446934k098577k321679k574550k863657l192108l564473l989611m477989
$$ -21446934 -23545511 -25867190 -28441740 -31305397 -34497505 -38061978 -42051589 -46529578
57039d6529578n040670n692079o449401p327694q338349r490030j0783833j2207221
$$ -46529578 -51570248 -57262327 -63711728 -71039422 -79377771 -88867801 -99651634 -111858855
57031a11858855j3738308j5350776j6999794j8606659k0087704k1418821k2647142
$$ -111858855 -125597163 -140947939 -157947733 -176554392 -196642096 -218060917 -240708059
57024b40708059k3786652k4664845k4866418k3851181k1190886j6798319j1027535
$$ -240708059 -264494711 -289159556 -314025974 -337877155 -359068041 -375866360 -386893895
57017c86893895m576222J775886P438620J2123691J5772023J8428380K0188371
$$ -386893895 -391470117 -389694231 -382255611 -370131920 -354359897 -335931517 -315743146
57010c15743146K1205769K1675763K1774518K1612006K1235564K0659636J9886896
$$ -315743146 -294537377 -272861614 -251087096 -229475090 -208239526 -187579890 -167692994
57003a67692994J8918413J7763270J6445778J5005888J3496750J1981002J0520709
$$ -167692994 -148774581 -131011311 -114565533 -99559645 -86062895 -74081893 -63561184
56996f3561184R162924P932694O838175N878615N047321M332691L721403L201064
$$ -63561184 -54398260 -46465566 -39627391 -33748776 -28701455 -24368764 -20647361 -17446297
56988a7446297K759811K385817K068585J799465J570454J374214J205641J061565
$$ -17446297 -14686486 -12300669 -10232084 -8432619 -6862165 -5487951 -4282310 -3220745
56980c220745R38263Q30901g15686f3771E14230N12357M53702M02284L58356L20833
$$ -3220745 -2282482 -1451581 -715686 -63771 514230 1026587 1480289 1882573 2240929 2561762
56970B561762K88227K59940K35890K15613J98410J84015J72918J66384J65580
$$ 2561762 2849989 3109929 3345819 3561432 3759842 3943857 4116775 4283159 4448739
56961D448739J69298J72347J67505J50142J20877Q4010M4211M613l3164o8124
$$ 4448739 4618037 4790384 4957889 5108031 5228908 5312918 5357129 5361742 5328578 5260454
56951E260454r9068j24615j44280j59173j71121j81014j88283j91599j89793j82682
$$ 5260454 5161386 5036771 4892491 4733318 4562197 4381183 4192900 4001301 3811508 3628826
56941C628826j71656j58984j46146j33359j21187j11330j04783j00080r4909q8857
$$ 3628826 3457170 3298186 3152040 3018681 2897494 2786164 2681381 2581301 2486392 2397535
56931B397535q3208p8547p4285p0322o7355o5244o2650n8770n4288n0179m6722
$$ 2397535 2314327 2235780 2161495 2091173 2023818 1958574 1895924 1837154 1782866 1732687 1685965
56920A685965m4029m2451m1802m1170m0091l9012l8114l6564l3695l0136k6964
$$ 1685965 1641936 1599485 1557683 1516513 1476422 1437410 1399296 1362732 1329037 1298901 1271937
56909A271937k4224k1210j7892j5096j3299j1936j0278q382o701m955k167J773
$$ 1271937 1247713 1226503 1208611 1193515 1180216 1168280 1158002 1149620 1142919 1137964 1135797 1137570
56897A137570N151N845L613O4l669q082j3536j8608k1494k2305k2574k2808k2089
$$ 1137570 1142721 1148566 1152179 1152243 1148574 1140492 1126956 1108348 1086854 1064549 1041975 1019167 997078
56884I97078k0150j8295j7641j7519j6292j3117q381l167J224L968N579P593J0790
$$ 997078 976928 958633 940992 923473 907181 894064 885683 882516 883740 887708 893287 900880 911670
56871I11670J4139J5966J5638J3456R432L212m854j3262k0284k4963k7249k7684
$$ 911670 925809 941775 957413 970869 980301 983513 978659 965397 945113 920150 892901 865217
56859H65217k7032k5829k4103k1712j8928j6322j4103j2048j0212r119q898q675
$$ 865217 838185 812356 788253 766541 747613 731291 717188 705140 694928 685809 676911 668236
56847F68236p413n141k806j089pM58J32p01j107n23N23J137J103P59L22n2J55
$$ 668236 660823 655682 652876 651787 651780 652238 652370 651669 650562 650039 650562 651699 652802 653561 653883 653831 653986
56830F53986J398L336N151O483P542Q344Q484P609N611K514j226m459o166o524
$$ 653986 655384 658720 663871 670354 677896 686240 694724 702333 707944 710458 709232 704773 698607 692083
56816F92083o443o128n016l064r59J207M294Q601J2957J6044J7878J9299K0799
$$ 692083 685640 679512 674496 671432 670473 671680 675974 684575 697532 713576 731454 750753 771552
56803G71552K2639K5360K9093L2660L4273L3079K9390K3735J6419P974o58q435
$$ 771552 794191 819551 848644 881304 915577 948656 978046 1001781 1018200 1026174 1025516 1017081
56791A017081j4379j7639j8035j6491j4360j2147r234m869Q41O947J2451J7104
$$ 1017081 1002702 985063 967028 950537 936177 924030 914796 909927 910768 917715 930166 947270
56779I47270K1544K6514L1923L6976M1156M4539M6820M6596M2197L3169K0644
$$ 947270 968814 995328 1027251 1064227 1105383 1149922 1196742 1243338 1285535 1318704 1339348
56768A339348O480p643k0430l0741l7400l9610l7875l4360l1468k9754k7680k3585
$$ 1339348 1345828 1338185 1317755 1287014 1249614 1210004 1172129 1137769 1106301 1076547 1048867 1025282
56756A025282j7365j0190l263K753P829J2595J7750K3040K7354L0055L1351L0858
$$ 1025282 1007917 997727 994464 997217 1005046 1017641 1035391 1058431 1085785 1115840 1147191 1178049
56744A178049K6889J8107N487q164k0139k8863l3899l6045l6914l7381l6723l3957
$$ 1178049 1204938 1223045 1228532 1220368 1200229 1171366 1137467 1101422 1064508 1027127 990404 956447
56732I56447k9502k4638j9911j5097j0240n580r22L724P289Q945R952J2393J5875
$$ 956447 926945 902307 882396 867299 857059 851479 850557 854281 861570 870515 880467 892860 908735
56719I08735J7277J4373Q157R22o382j3670j9940k3878k5760k7192k8824k9544
$$ 908735 926012 940385 948542 949464 943082 929412 909472 885594 859834 832642 803818 774274
56707G74274k8202k5272k2328k0425j9419j8525j7150j5264j3185j1132r173p598
$$ 774274 746072 720800 698472 678047 658628 640103 622953 607689 594504 583372 574199 566601
56695E66601p022p597q297p660n428k912j465j155j428k389m306o195o346m618
$$ 566601 559579 551982 543685 536025 530597 527685 526220 525065 523637 521248 516942 510747 504401 499783
56681D99783k950k887l750m121m001m093l954k663q77k58q90j263r76j456l268
$$ 499783 496833 493946 490196 486075 482074 477981 474027 471364 470487 470229 469339 468076 467100 465644 462376
56666D62376m747m394k949j803q58N78K037K598K379J851O82j224k509j913l54
$$ 462376 457629 453235 450286 448483 447625 448203 450240 452838 455217 457068 457750 456526 454017 452104 451750
56651D51750L46N6j33k54j117k036j355O16J554M48j179j948k360k917k711j276
$$ 451750 452096 452152 452019 451765 450648 448612 447257 447873 449427 449875 448696 446748 444388 441471 438760 437484
56635D37484n7l69j249j118m18p15j778j669L04K489L153K403J331L32o93j308
$$ 437484 437427 437058 435809 434691 434273 433558 431780 430111 430415 432904 436057 438460 439791 440123 439430 438122
56619D38122p54P67J886J622O51M37J313K109J873J102P95R65R65Q07J126J980
$$ 438122 437368 438135 440021 441643 442294 442731 444044 446153 448026 449128 449923 450888 451853 452660 453786 455766
56603D55766K722L073L330L356K415L75j764l068l669m125m482m493m264m111
$$ 455766 458488 461561 464891 468247 470662 471037 469273 466205 462536 458411 453929 449436 445172 441061
56589D41061m173m443m839m986m506l765l710m431m676l394j301p8l15j025j110
$$ 441061 436888 432445 427606 422620 418114 414349 410639 406208 401532 398138 396837 396759 396444 395419 394309
56574C94309m62N35J861L643N388O102N354L903K884K500K000R77J18K29R73J287
$$ 394309 393847 394382 396243 399886 405274 411376 416730 420633 423517 426017 428017 428994 429112 429341 430314 431601
56558D31601Q48M92J054K232K800J800m12k290k498j245J30R12J610K588L209
$$ 431601 432449 432941 433995 436227 439027 440827 440415 438125 435627 434382 434512 435424 437034 439622 442831
56543D42831K977K549K644K832K592K603L428L757K001p41j578J48J905J702O80
$$ 442831 445808 448357 451001 453833 456425 459028 462456 466213 468214 467473 465895 466043 467948 469650 470330
56528D70330Q87K230L108K934K460K257K202K096J948J769J615J519J217N42K39
$$ 470330 471217 473447 476555 479489 481949 484206 486408 488504 490452 492221 493836 495355 496572 497114 497353
56513D97353J368L602N247N458N256N711O354O365O156O526P165P259P061P581
$$ 497353 498721 502323 507570 513028 518284 523995 530349 536714 542870 549396 556561 563820 570881 578462
56499E78462R087J0976J2721J3980J4135J2772J0519Q476P004N687M388L584L747
$$ 578462 587549 598525 611246 625226 639361 652133 662652 671128 678132 683819 688207 691791 695538
56486F95538M797O080O659O056M834L905L184J792k87j960k821l782n220o114
$$ 695538 700335 706415 713074 719130 723964 727869 731053 732845 732558 730598 727777 723995 718775 712661
56472G12661o073o693r219j2147j3017j1677r936q699p512o481o451p202p414
$$ 712661 706588 699895 690676 678529 665512 653835 643899 635200 627688 621207 614756 607554 600140
56459F00140o630n661n008m505m507n565o693o024l733k339l268m953n517n511
$$ 600140 593510 587849 582841 578336 573829 568264 561571 555547 551814 549475 546207 541254 535737 530226
56445E30226o409p729p586n447k692o45M69P79L12m26n26K11R03P34m4o26q10
$$ 530226 523817 516088 508502 503055 500363 499718 500187 500966 501278 500852 500326 500537 501440 502174 502130 501504 500694
56428E00694j204k245l411l670k716j432q55r23o79L62J558K008J673J296J411
$$ 500694 499490 497245 493834 490164 487448 486016 485161 484238 483559 483921 485479 487487 489160 490456 491867
56413D91867J711J400J11j510k153r83J471L606L982K438K09j083q49r6l12j793
$$ 491867 493578 494978 495089 493579 491426 490443 491914 495520 499502 501940 502149 501066 500217 500121 499809 498016
56397D98016l330l592k346l33J461K151J429J34l01N29J550J879K126L186M573
$$ 498016 494686 491094 488748 488415 489876 492027 493456 493590 493289 493818 495368 497247 499373 502559 507132
56382E07132N091M686M352M442M338L712K991K443J859J355J529K425L118K800
$$ 507132 512223 516909 521261 525703 530041 533753 536744 539187 541046 542401 543930 546355 549473 552273
56368E52273J804J180J562K584L190K637J384O55Q53R88K39p12q08l94o48j709
$$ 552273 554077 555257 556819 559403 562593 565230 566614 567269 568122 569110 569349 568637 567829 567435 566787 565078
56352E65078k710l416m345n347n448m358k825j405o0Q55O83k35p25n57o74j302
$$ 565078 562368 558952 554607 549260 543812 539454 536629 535224 535164 536019 536702 536467 535742 535185 534511 533209
56336E33209j427p19k98q04j291j027q21j339j583n96P11J174J649L631O316P229
$$ 533209 531782 531063 530765 529961 528670 527643 526822 525483 523900 523304 524015 525189 526838 530469 536785 544014
56320E44014N647L378K000J193K52m87n47l17k68j34L00M80J2l30M71K100L175
$$ 544014 549661 553039 555039 556232 556484 555997 555450 555133 554865 554731 555031 555511 555523 555193 555664 557764 560939
56303E60939K898J707L91o85j355j403r24m82m78o16m17J4K02R5N1qo27j699k108
$$ 560939 563837 565544 565935 565250 563895 562492 561568 561086 560608 559992 559575 559589 559791 559886 559937 559929 559302 557603 555495
56284E55495j120M18J074P54O95J551K551K751K358K222K556K779K440J780J388
$$ 555495 554375 554793 555867 556621 557316 558867 561418 564169 566527 568749 571305 574084 576524 578304 579692
56269E79692J507J819J900J772J843K298K878L330L587L364K279Q47M90J732L126
$$ 579692 581199 583018 584918 586690 588533 590831 593709 597039 600626 603990 606269 607116 607606 609338 612464
56254F12464L175K560K938L996L743J880P14J810L598L764K589K201L310M581
$$ 612464 615639 618199 621137 625133 628876 630756 631470 633280 636878 640642 643231 645432 648742 653323
56240F53323M937M850M977M985M314L261K574K402K278J937J698J860K113J903
$$ 653323 658260 663110 668087 673072 677386 680647 683221 685623 687901 689838 691536 693396 695509 697412
56226F97412J356J385K490L815L957K664J112N01R48J824K539K777K444J818J351
$$ 697412 698768 700153 702643 706458 710415 713079 714191 714692 715640 717464 720003 722780 725224 727042 728393
56211G28393J210J293J679K599L918N191O249P196P794P632O929O469O566O795
$$ 728393 729603 730896 732575 735174 739092 744283 750532 757728 765522 773154 780083 786552 793118 799913
56197G99913O927P340Q243R294J0329J1723J3613J5550J7323J9363K1810K3887
$$ 799913 806840 814180 822423 831717 842046 853769 867382 882932 900255 919618 941428 965315
56185I65315K4853K5025K5265K5805K6146K5848K5062K4348K4031K3601K1980
$$ 965315 990168 1015193 1040458 1066263 1092409 1118257 1143319 1167667 1191698 1215299 1237279
56174A237279J8799J5064J1853Q770M805L25l222n531p810j0540j2550j2922j2415
$$ 1237279 1256078 1271142 1282995 1291765 1296570 1296895 1293673 1288142 1280332 1269792 1257242 1244320 1231905
56161A231905j2156j2202j2210j2454j3282j4485j5876j7444j8421j7536j4995
$$ 1231905 1219749 1207547 1195337 1182883 1169601 1155116 1139240 1121796 1103375 1085839 1070844
56150A070844j2814j2236j2148j1133r617q683q015o701n000l745k813j694p91
$$ 1070844 1058030 1045794 1033646 1022513 1012896 1004213 996198 989497 984497 980752 977939 976245 975454
56137I75454n92l20R33K390K624J962K096L468M662M451L093J645J067J866L537
$$ 975454 974862 974542 975475 977865 980489 982451 984547 988015 992677 997128 1000221 1001866 1002933 1004799 1008336
56122A008336M607M244L492L886N309O419O690O658O463N658M384L530L707M924
$$ 1008336 1012943 1017187 1020679 1024565 1029874 1036293 1042983 1049641 1056104 1061762 1066146 1069676 1073383 1078307
56108A078307O925Q926R721R272R464J1766J4812J6026J5140J4194J4414J5265
$$ 1078307 1085232 1094158 1103879 1113151 1122615 1134381 1149193 1165219 1180359 1194553 1208967 1224232
56096A224232J6486J8674K1351K2738K2461K2664K5262K9454L3096L5401L7180
$$ 1224232 1240718 1259392 1280743 1303481 1325942 1348606 1373868 1403322 1436418 1471819 1508999
56085A508999L9339M2333M6520N2007N8328O5023P2443Q1498R2621J05148J17659
$$ 1508999 1548338 1590671 1637191 1689198 1747526 1812549 1884992 1966490 2059111 2164259 2281918
56074B281918J28968J38841J47452J53828J55496J50519J39682J25977J12185
$$ 2281918 2410886 2549727 2697179 2851007 3006503 3157022 3296704 3422681 3534866
56065C534866R9672Q9005Q0351P2836O4475N3332L8816K1970M944j0072k1969
$$ 3534866 3634538 3723543 3803894 3876730 3941205 3994537 4033353 4055323 4060267 4050195 4028226
56054D028226l1019l8245m5056n3407o5082q0016r6020j10701j22894j31741j35842
$$ 4028226 3997207 3958962 3913906 3860499 3795417 3715401 3619381 3508680 3385786 3254045 3118203
56043C118203j34567j29281j21931j13016j02149q9926p7933o7302n8212n0376
$$ 3118203 2983636 2854355 2732424 2619408 2517259 2427333 2349400 2282098 2223886 2173510
56033B173510m3068l5469k7801k1400j6919j3490j0408q161o704m474o60L048
$$ 2173510 2130442 2094973 2067172 2045772 2028853 2015363 2004955 1996794 1990090 1985616 1984956 1988004
56021A988004M740M903M986M960M395M479O500R469J1640J3280J5651J8336K0123
$$ 1988004 1992744 1997647 2002633 2007593 2011988 2016467 2022967 2032436 2044076 2057356 2073007 2091343 2111466
56008B111466K1442K3347K5209K6077K7025K9269L1225L0846K9718L1152L4807
$$ 2111466 2132908 2156255 2181464 2207541 2234566 2263835 2295060 2325906 2355624 2386776 2421583
55997B421583L7145L6934L6426L7019L7634L7757L8493L9901M0644M0871M2417
$$ 2421583 2458728 2495662 2532088 2569107 2606741 2644498 2682991 2722892 2763536 2804407 2846824
55986B846824M5621M8803N1249N3790N6356N8157O0187O4176O9125P2454P4506
$$ 2846824 2892445 2941248 2992497 3046287 3102643 3160800 3220987 3285163 3354288 3426742 3501248
55975C501248P7958Q2824Q6449Q8806R3050R9794J05564J08493J11178J16075
$$ 3501248 3579206 3662030 3748479 3837285 3930335 4030129 4135693 4244186 4355364 4471439
55965D471439J22062J27500J33022J39348J45713J52087J59707J68202J75505
$$ 4471439 4593501 4721001 4854023 4993371 5139084 5291171 5450878 5619080 5794585
55956E794585J81765J89615J99657K09554K18622K29114K41801K54723K67545
$$ 5794585 5976350 6165965 6365622 6575176 6793798 7022912 7264713 7519436 7786981
55947G786981K82525K99779L16352L31469L47844L66296L84306M01658M22065
$$ 7786981 8069506 8369285 8685637 9017106 9364950 9731246 10115552 10517210 10939275
55938A0939275M47135M74208N02281N34110N70010O05563O38446O71819P08117
$$ 10939275 11386410 11860618 12362899 12897009 13467019 14072582 14711028 15382847 16090964
55929A6090964P45454P82838Q22662Q65142R07329R50759J002643J065637J134022
$$ 16090964 16836418 17619256 18441918 19307060 20214389 21165148 22167791 23233428 24367450
55920B4367450J204183J280811J368014J462862J563448J674823J800347J935306
$$ 24367450 25571633 26852444 28220458 29683320 31246768 32921591 34721938 36657244
55912C6657244K076136K228466K399389K589842K801589L043473L323806L645890
$$ 36657244 38733380 40961846 43361235 45951077 48752666 51796139 55119945 58765835
55904E8765835M019017M465077N006343N655398O423033P325077Q376328R592785
$$ 58765835 62784852 67249929 72256272 77911670 84334703 91659780 100036108 109628893
55896A09628893J1006038J2656087J4560404J6709852J9101209K1743137K4617540
$$ 109628893 120634931 133291018 147851422 164561274 183662483 205405620 230023160
55889B30023160K7659062L0730827L3452208L4920444L3738513K8681976J9642427
$$ 230023160 257682222 288413049 321865257 356785701 390524214 419206190 438848617
55882D38848617P984322m092675j4636230k2596777k7780106l0483227l1214830
$$ 438848617 446832939 442740264 428104034 405507257 377727151 347243924 316029094
55875C16029094l0542629k8970629k6862667k4460487k1943281j9452277j7088268
$$ 316029094 285486465 256515836 229653169 205192682 183249401 163797124 146708856
55868A46708856j4920563j2996637j1333284r912961q704935p684042o824249
$$ 146708856 131788293 118791656 107458372 97545411 88840476 81156434 74332185
55861G4332185o090780n452930m896146m412225l987389l608982l273945k980499
$$ 74332185 68241405 62788475 57892329 53480104 49492715 45883733 42609788 39629289
55853C9629289k719179k480777k265488k075453j905116j747290j602491j473998
$$ 39629289 36910110 34429333 32163845 30088392 28183276 26435986 24833495 23359497
55845B3359497j359105j252957j156112j070843r94140r21401q53307p92709p38033
$$ 23359497 22000392 20747435 19591323 18520480 17526340 16604939 15751632 14958923 14220890
55836A4220890o85789o36602n93285n55444n20593m87917m56984m25794l93878
$$ 14220890 13535101 12898499 12305214 11749770 11229177 10741260 10284276 9858482 9464604
55827I464604l64009l37384l10791k82058k54057k29335k05102j78119j50703
$$ 9464604 9100595 8763211 8452420 8170362 7916305 7686970 7481868 7303749 7153046
55818G153046j27217j08499r4827r0838j01584j25675j56903j90379k22671k48654
$$ 7153046 7025829 6917330 6822503 6731665 6630081 6504406 6347503 6157124 5934453 5685799
55808E685799k63913k69260k68562k63191k52331k37121k20432k03661j87140
$$ 5685799 5421886 5152626 4884064 4620873 4368542 4131421 3910989 3707328 3520188
55799C520188j72251j59692j47269j32994j18873j08084r9934r1343q2011p4274
$$ 3520188 3347937 3188245 3040976 2907982 2789109 2681025 2581091 2489748 2407737 2333463
55789B333463o8852o4478o0950n9082n8057n6029n2875m9540m5519l9944l4340
$$ 2333463 2264611 2200133 2139183 2080101 2022044 1966015 1913140 1863600 1818081 1778137 1743797
55778A743797l1295l0863l1044l1116l1668l2128l1383l0357l1049l3086l3953
$$ 1743797 1712502 1681639 1650595 1619479 1587811 1555683 1524300 1493943 1462894 1429808 1395855
55767A395855l2514k9942k7340k4857k2996k2483k2818k2830k2435k2084k1099
$$ 1395855 1363341 1333399 1306059 1281202 1258206 1235723 1212905 1190075 1167640 1145556 1124457
55756A124457j8618j5693j4266j4374j4372j3527j2445j1266r493p337n501l867
$$ 1124457 1105839 1090146 1075880 1061506 1047134 1033607 1021162 1009896 1000403 993066 987565 983698
55744I83698k035n56N9R54L621P428J0173J0634R162O566L985K761K571Q59l721
$$ 983698 981663 981107 981166 982120 985741 993169 1003342 1013976 1023138 1029704 1033689 1036450 1039021 1039880 1036159
55729A036159q651j0808j1168j3118j6902j9218j8394j6591j6308j7522j9132
$$ 1036159 1027508 1016700 1005532 992414 975512 956294 937900 921309 905001 887479 868347
55718H68347k0666k1510k0666j8297j5852j3892j1443q112n012k898j179K40m8
$$ 868347 847681 826171 805505 787208 771356 757464 746021 737909 732897 729999 728820 729060 729012
55705G29012k969p137j0259j1476j1422j0785r816q785q101q017q449q961r018
$$ 729012 726043 718906 708647 697171 685749 674964 665148 656363 648262 640245 631796 622835 613817
55692F13817q549q109q102q237q151p927p530o606n635o146q450j0233r180o254
$$ 613817 605268 597159 589057 580820 572669 564742 557212 550606 544971 538825 530375 520142 510962 504708
55678E04708m377m263l950k536j968l964p130q651p778o253n727o105o458o540
$$ 504708 500331 496068 492118 489582 487614 483650 476520 467869 460091 453838 448111 442006 435548 429008
55664D29008o799p281p285o459n512n159m772l332j447q64j698j937l81J695K816
$$ 429008 422209 414928 407643 401184 395672 390513 385741 382409 380962 380098 378400 376463 376082 377777 380593
55649C80593L492M633N409M543K531Q10l35j285j683j435k060m828q265r741q942
$$ 380593 384085 388718 394127 398670 401201 402011 401676 400391 398708 397273 395213 390385 382120 372379 363437
55634C63437p674o802n733m589m349m809m759m271m639n815o118m826k953j152
$$ 363437 355763 348961 343228 338639 334290 329481 324722 320451 315812 309997 303879 299053 296100 294948
55620B94948R49K918L292K020J051J539K213J512l06k160l677m747m917m334m034
$$ 294948 295897 298815 302107 304127 305178 306717 308930 310442 310136 307976 304299 299552 294635 290301 286267
55605B86267m328m075k451l12J165K171L462M773N138M358L348L159M081N463
$$ 286267 281939 277864 275413 275101 276266 278437 281899 286672 291810 296168 299516 302675 306756 312219
55591C12219O276O278O364P171P765O740M339K044L09j748m292o124o523o284
$$ 312219 318495 324773 331137 338308 346073 352813 357152 359196 359505 357757 353465 347341 340818 334534
55577C34534o313o533o656o813o880o434n784n789o284o078m909l960l877l842
$$ 334534 328221 321688 315032 308219 301339 294905 289121 283332 277048 270970 266061 262101 258224 254382
55563B54382l251k658k281j254N06J344J26j833k572k109j830k162k408k155j492
$$ 254382 251131 248473 246192 244938 245444 246788 246914 245081 242509 240400 238570 236408 234000 231845 230353
55548B30353l81R17J283o6k147l188k770j953j614j712k004k361k326j360K15
$$ 230353 229972 230889 232172 232106 229959 226771 224001 222048 220434 218722 216718 214357 212031 210671 210886
55533B10886J222Q72l50j137o41O24J156P2j683k232r78Q36J949K532L300L976
$$ 210886 212108 212980 212630 211493 210852 211476 212632 212704 211021 208789 207811 208647 210596 213128 216428 220404
55517B20404L632K098L89k69O42K710M938O455P152P430P383O735N587M519L701
$$ 220404 224036 226134 226523 226254 226896 229606 234544 240999 248151 255581 262964 269699 275286 279805 283506
55502B83506K603Q17j325l262m780n936o981q334r970j0794r586o749m194l305
$$ 283506 286109 286926 285601 282339 277559 271623 264642 256308 246338 235544 225958 219209 215015 211710
55488B11710l863m963n822n498l345m18R81nj599j770o26M58R29R56K70j331k875
$$ 211710 207847 202884 197062 191564 188219 187801 188782 188777 187178 185408 184782 185240 186169 187125 187395 186064 183189
55471A83189l033j930r81r79j368j402j124j060j531k402l150l252k678j831r34
$$ 183189 180156 178226 177245 176266 174898 173496 172372 171312 169781 167379 164229 160977 158299 156468 155534
55456A55534NN76J25j141k031j837j117n36Q8Q25Q33l09j286m98J572K760K034
$$ 155534 155539 156115 156240 155099 153068 151231 150114 149578 149666 150491 151324 151015 149729 149231 150803 153563 155597
55439A55597O63L80J376K489K763K227J406N01o37j760j991q67O30J059M94M19
$$ 155597 156260 156640 158016 160505 163268 165495 166901 167402 166765 165005 163014 162147 162777 163836 164330 164749
55423A64749J429K270J775N50j96m57r41j497j313l07Q03J556J953J825Q87n84
$$ 164749 166178 168448 170223 170773 170577 170120 169179 167682 166369 166062 166865 168421 170374 172199 173086 172502
55407A72502j849k349j921p87K02n3j563k831k601j443q57j349k305l115l306
$$ 172502 170653 168304 166383 165596 165798 165745 164182 161351 158750 157307 156450 155101 152796 149681 146375
55392A46375k214J44K294K732J995J787K305J976J67j571j647m87M46O25M95K88
$$ 146375 144161 144305 146599 149331 151326 153113 155418 157394 157561 155990 154343 153856 154302 154927 155422 155710
55376A55710k8o5O40J678K106J817J732K293K499J221r69k153j388K27J154J322
$$ 155710 155682 155617 156257 157935 160041 161858 163590 165883 168382 169603 168634 166481 165093 165320 166474 167796
55360A67796J632K276K653K722L000L233K461Q52J07J163K673K834J797J027R52
$$ 167796 169428 171704 174357 177079 180079 183312 185773 186625 186732 187895 190568 193402 195199 196226 197178
55345A97178P00k03j249k104l108m303m938m325k715r89M7l2j200k898m238m542
$$ 197178 197878 197675 196426 194322 191214 186911 181973 177648 174933 173944 173991 173959 172759 169861 165623 161081
55329A61081l755k436j336o43K38J790L292L443K210J127J259J809J475L37n02
$$ 161081 157326 154890 153554 152911 153149 154939 158231 161674 163884 165011 166270 168079 169554 169891 169389
55314A69389m89J16R84J709J514J19j469k085k109k788m047m304k679k13J566
$$ 169389 168900 169016 170000 171709 173223 173342 171873 169788 167679 164891 160844 156540 153861 153648 155214
55299A55214K256K231J555J24j529k398k057j146n63m24j35M63N85l37j391j056
$$ 155214 157470 159701 161256 161380 159851 157453 155396 154250 153687 153263 153128 153591 154176 153839 152448 151392
55283A51392N76J639R94k47m41K49M66j95r13j129j034p12N5R71J241O19k32n68
$$ 151392 151968 153607 154601 154354 153913 154162 154628 154433 153520 152391 151357 150645 150700 151671 152912 153531 153299 152731
55265A52731j91O65J420J219l00k283l279k753j425k04O93J455K064K146J253
$$ 152731 152540 153205 154625 155844 155544 153261 149982 147229 145804 145600 146293 147748 149812 151958 153211
55250A53211n62k372k976k090n61Q41K078L030K984J773N55M61J050J148P29P61
$$ 153211 152649 150277 147301 145211 144650 145491 147569 150599 153583 155356 155911 156372 157422 158570 159299 160060
55234A60060J615K621L040K560J225l02q54j76L40n99k279l058k749k404k224
$$ 160060 161675 164296 167336 169896 171121 170819 169965 169789 170129 169530 167251 164193 161444 159040 156816
55219A56816j489l71Q2q4L89J774K673K131Q99K0m77q76j067j179j686k310k004
$$ 156816 155327 154956 155038 154954 155343 157117 159790 161921 162820 162840 162363 161487 160420 159241 157555 155245 153241
55202A53241o81L46L86M30J348K298K122J192O39O04O25R47J928K668J789l86
$$ 153241 152560 152906 153292 153722 155070 157368 159490 160682 161321 161925 162550 163497 165425 168093 169882 169496
55186A69496j839j300M79K120L180L685L123J085j473k732k093r36p55j281j255
$$ 169496 167657 166357 166836 168956 172136 175821 178944 180029 178556 175824 173731 172795 172040 170759 169504
55171A69504n95m86j332j956j374j68O45J083J574J790J248L46k84p20r93l71
$$ 169504 168909 168423 167091 165135 163761 163593 164238 165321 166895 168685 169933 170279 169995 169275 168282 167911
55155A67911J233K124R19j037j434n81p34k217k843j565%N25Q45J679J834M17
$$ 167911 169144 171268 172187 171150 169716 169135 168401 166184 163341 161776 161776 162301 163146 164825 166659 167076
55139A67076j090q71M14P81j55j110j304j065p40l20R9M34Q47J181Q16k27q74
$$ 167076 165986 165115 165529 166310 166155 165045 163741 162676 161936 161616 161715 162149 162996 164177 164993 164766 163892
55122A63892m64K63M26K88L10O6p59j252m92Q67J502J115J36j339k895l066j016
$$ 163892 163428 163691 164117 164405 164715 164781 164022 162770 162278 163145 164647 165762 165898 164559 161664 158598 157582
55105A57582J643K552J737J274K039K757K392J619J353J314Q02k18j423k648l506
$$ 157582 159225 161777 163514 164788 166827 169584 171976 173595 174948 176262 177064 176846 175423 172775 169269
55090A69269l323k006l78P11J174J277J126Q28P10R63J323J316P66M0j49N56J517
$$ 169269 165946 163940 163562 164273 165447 166724 167850 168678 169388 170351 171674 172990 173756 173796 173647 174203 175720
55073A75720J537K55j327k041j705q16K19R21P00j94m09P68K081J923O74L1L80
$$ 175720 177257 177512 176185 174144 172439 171623 171842 172763 173463 173269 172860 173628 175709 177632 178306 178337 178717
55056A78717M67l30j040q00j63q6o10j189j536j630j433j000m69J38O80O34k18
$$ 178717 179184 178854 177814 177014 176851 176765 176155 174966 173430 171800 170367 169367 168898 169036 169716 170350 170132
55039A70132j040q38L8M00J84N54J831K689K099P87o1m56r69j263n03J224K866
$$ 170132 169092 168254 168292 168692 168876 169430 171261 173950 176049 176836 176775 176319 175350 174087 173584 174808 177674
55022A77674L661L664L225K568J759O71p61j959j972q99m26j958m530n673m283
$$ 177674 181335 184999 188224 190792 192551 193222 192461 190502 188530 187631 187205 185247 180717 175044 170761
55007A70761j722O5N39L10j45p56j240j055nJ444K512K677K060J388J319J586
$$ 170761 169039 169104 169643 169953 169808 169052 167812 166757 166752 168196 170708 173385 175445 176833 178152 179738
54991A79738J090o80k671l241k038k55R53J465J452O87o45j307l11J514K331J502
$$ 179738 180828 180148 177477 174236 172198 171943 172896 174361 175813 176500 175855 174548 174237 175751 178082 179584
54975A79584N2r49j301j056k29N96O88M86J190K510K422J16k339k698j611j230
$$ 179584 179636 178687 177386 176330 176101 176697 177385 177871 179061 181571 183993 184109 181770 179072 177461 176231
54959A76231j804j732n85J61m05j335j498q69K80J881L151K737P28q50o32K00
$$ 176231 174427 172695 172110 172271 171866 170531 169033 168164 168444 170325 173476 176213 176941 176091 175459 175659
54943A75659j53j326j470n3J620K452K617K506J995J164P02J049J816K480K962
$$ 175659 175506 174180 172710 172657 174277 176729 179346 181852 183847 185011 185713 186762 188578 191058 194020
54928A94020L071K194K48j487j550j90Q17L86o64j024o71m34m46j87R8m73j614
$$ 194020 197091 199285 199533 198046 196496 196306 197123 197509 196845 195821 195150 194716 194270 194083 194181 193708 192094
54911A92094j641P6J668J200l31k02K096M076L746K094J227J510J825J533P89
$$ 192094 190453 190529 192197 193397 193066 192864 194960 199036 202782 204876 206103 207613 209438 210971 211760
54896B11760l99j922k748j890j17P63M70O02J960L019K149J32q66k29O79P80M85
$$ 211760 211361 209439 206691 204801 204684 205447 205917 206519 208479 211498 213647 213779 212913 212684 213363 214143 214628
54879B14628M15K84k88p76m82L92J102J437J640J630J187Q48J644L715N795O556
$$ 214628 215043 215327 215039 214263 213781 214173 215275 216712 218352 219982 221169 222017 223661 227376 233171 239727
54863B39727O091N677O219P202P261N803L944L505M883O402O190M223J906Q2j563
$$ 239727 245818 251495 257714 264916 272177 277980 281924 285429 290312 296714 302904 307127 309033 309115 307552
54848C07552l353n075o694q457r866r660p546n149m352n198o096n744m177k342
$$ 307552 304199 299124 292430 283973 274107 264447 256901 251752 247400 242202 236106 230362 226185 223843
54834B23843j228j055r81P6J921L089K785J973J788J811J087J68N80K494M399
$$ 223843 222615 221560 220579 220655 222576 225665 228450 230423 232211 234022 235109 235277 235857 238351 242750
54819B42750N329N951P081Q267Q678Q485Q466Q662Q280O839M746K538P0l092o495
$$ 242750 248079 254030 261111 269378 278056 286541 295007 303669 311949 318788 323534 326072 326142 323050 316555
54804C16555q640q577p387p159q401r417q667o649m744l284k012j440k167l280
$$ 316555 307915 299338 291951 284792 276391 266974 258307 251658 246914 243630 241618 240178 238011 234731
54790B34731l213k098j552k034k269j686j507k510l467l151k520l114m270l869
$$ 234731 231518 229420 227868 225834 223565 221879 220372 217862 214395 211244 208724 205610 201340 197471
54776A97471j594M12M57o77j140m01O30J064Q27K09n41j148j282r02m49m85j102
$$ 197471 195877 196289 196746 196069 194929 194528 195158 196222 197049 197258 196717 195569 194287 193385 192936 192451 191349
54759A91349j788j872j117J31J224J640J300O24J48L4O1K16Q85K183L409L662
$$ 191349 189561 187689 186572 186703 187927 189567 190867 191491 191639 191673 191734 191950 192835 195018 198427 202089
54743B02089K827J445j49j879l196l065j140J576L566M103L542K721K258K180
$$ 202089 204916 206361 206212 204333 201137 198072 196932 198508 202074 206177 209719 212440 214698 216878
54729B16878K083J733J436J476J405N39p78j240k32J249J780J157L05O7O19J765
$$ 216878 218961 220694 222130 223606 225011 225550 224772 223532 223300 224549 226329 227486 227791 227858 228477 230242
54713B30242L052L792L665L322L742M949N935O128O173O832P656P607O764O299
$$ 230242 233294 237086 240751 244073 247815 252764 258699 264827 271000 277832 285488 293095 299859 306158
54699C06158O548O113L736L41j999k872l872n915p624p303n450m062m002m347
$$ 306158 312706 318819 322555 322896 320897 318025 314153 308238 300614 293311 287861 283799 279797 275450
54685B75450m115l274k098p04L65K33r81j877j511q10j228k470k653q68J401K074
$$ 275450 271335 268061 265963 265259 265624 265857 264876 262999 261488 260678 259450 256980 254327 253459 254860 256934
54669B56934J079L09J035K341K637K022K117L705N656O498O158N599N398N344
$$ 256934 258013 258322 259357 261698 264335 266357 268474 272179 277835 284333 290491 296090 301488 306832
54655C06832M935L649J248j642l715m371m382m639m992n098n530o863q244q291
$$ 306832 311767 315416 316664 315022 311307 306936 302554 297915 292923 287825 282295 275432 267188 258897
54641B58897p060n798m968m013k957k601k870k514j043L43M69k83p98p07l31K5
$$ 258897 251837 246039 241071 237058 234101 231500 228630 226116 225073 225416 225885 225602 224804 224097 223766 223791
54625B23791N8n92j819k881l159k612j405J67J333J332N67L46J170K113K191J425
$$ 223791 223849 223257 221438 218557 215398 212786 211381 211548 212881 214213 214780 215126 216296 218409 220600 222025
54609B22025K84q81j549j267n67n20r45m70J016J520l49l113m150k781m28J416
$$ 222025 222309 221428 219879 218612 218045 217525 216580 216110 217126 218646 218297 215184 211034 208253 207825 209241
54593B09241K142J719P57L72R42J461J090N32P54J155M90r74j770j422q62o99
$$ 209241 211383 213102 213859 214231 215173 216634 217724 218256 219010 220165 220655 219681 217911 216489 215627 214928
54577B14928n28j05Q8k68p55p98j56J075K272K429J349L18N78J436J176l12j333
$$ 214928 214400 214295 214383 214115 213360 212562 212406 213481 215753 218182 219531 219849 220427 221863 223039 222727 221394
54560B21394r52k26l73j017j098n47n3K81R90K044K447J398m99j635j115K36J069
$$ 221394 220442 220216 219843 218826 217728 217181 217128 217409 218399 220443 222890 224288 223789 222154 221039 221275 222344
54543B22344J290J744K337J898M51j03J177K197N92k429l391j436O07M58o75m81
$$ 222344 223634 225378 227715 229613 230064 229961 231138 233335 233927 231498 228107 226671 227278 227736 227061 226580
54527B26580J108K431K589J868O22p10j030M67K867M208L612K014Q32O53J155
$$ 226580 227688 230119 232708 234576 235198 234488 233458 233925 236792 241000 244612 246626 247458 248111 249266
54512B49266J575J133m10k438l896m046k736l29K304M094M602M314L808K983J604
$$ 249266 250841 251974 251564 249126 245230 241184 238448 238119 240423 244517 249119 253433 257241 260224 261828
54497B61828J81m66l46j64j60J3K75Ro08k14J899M284M788L224J486J045J525
$$ 261828 262009 261543 261197 261033 260873 260886 261161 261170 260562 260348 262247 266531 271319 274543 276029 277074 278599
54480B78599J943K178K427K252J253Q0l05k4M9j70M6Q52J624K115K542K348M02
$$ 278599 280542 282720 285147 287399 288652 288732 288427 288403 288452 288282 288328 289180 290804 292919 295461 297809 298211
54463B98211k924n189m581k153m32n04j516k265k100q34R96K079J625M93P3L69
$$ 298211 295287 290098 285517 283364 282932 282428 280912 278647 276547 275713 276709 278788 280413 280906 280979 281348
54447B81348L26j82o6J126K235J838j73k603m022l657j869J39J480K435L579M502
$$ 281348 281674 281492 281426 282552 284787 286625 286452 283849 279827 276170 274301 274440 275920 278355 281934 286436
54431B86436M223K834J708J862K811L322K759J572Q46J377K828L943L963L407
$$ 286436 290659 293493 295201 297063 299874 303196 305955 307527 308373 309750 312578 316521 320484 323891
54417C23891L013K664K204K500M226O091N982L911K170K318L451L894L186J778
$$ 323891 326904 329568 331772 334272 338498 344589 350571 354482 356652 358970 362421 366315 369501 371279
54403C71279J23j148j293m56K63L72O76J780K867K728J165j270l999o167o619
$$ 371279 371402 370254 368961 368505 368768 369140 369816 371596 374463 377191 378356 377086 373087 366920 360301
54388C60301n114k897j349o62m46o24r70p89q4j43j740l586l911l018k663l260
$$ 360301 355187 352290 350941 350279 349833 349209 348239 347450 347366 347223 345483 341897 337986 334968 332305 329045
54372C29045l325j817L74J697J620O57m24j061j147j179j645k145j750l86P66
$$ 329045 325720 323903 324277 325974 327594 328251 327827 326766 325619 324440 322795 320650 318900 318514 319280
54357C19280O36l77q74j63Q91Q63n37k057k420j791j194q55j63P74J020O87J411
$$ 319280 319916 319539 318665 318502 319393 320256 319719 317662 315242 313451 312257 311402 311239 312013 313033 313720 315131
54340C15131L749N501M306J110q33j23J479J952J255K47p63j518j264K2Q91P4
$$ 315131 318880 324381 328687 329797 328964 328841 330320 332272 333527 333774 333011 331493 330229 330251 331142 331216
54324C31216j677k527j834n59K43K85l87j593k659k663j431K07J415K174K904
$$ 331216 329539 327012 325178 324619 324862 325147 324760 323167 320508 317845 316414 316621 318036 320210 323114
54309C23114L613L794L059J607J14p52o88J64J270J857J286k74j657j694o42j69
$$ 323114 326727 330521 333580 335187 335301 334549 333861 334025 335295 337152 338438 338164 336507 334813 334171 334002
54293C34002j415l319l589j446J181J648n68l494m963m653l685k922k343j847
$$ 334002 332587 329268 325679 324233 325414 327062 326494 323000 318037 313384 309699 306777 304434 302587
54279C02587j789k322k770k290r96Q4J40p19j852k682k746j737J5J448J707J098
$$ 302587 300798 298476 295706 293416 292420 292504 292644 291925 290073 287391 284645 282908 282923 284371 286078 287176
54263B87176O18M76k23k016l850l976k040L47J267L70j035j431l67J340K298J696
$$ 287176 287794 288270 288047 286031 282181 278205 276165 276512 277779 278149 277114 275683 275316 276656 278954 280650
54247B80650J59o74J54J738K233J007o87j345j024j023j910k614j876j53O33n46
$$ 280650 280809 280135 280289 282027 284260 285267 284580 283235 282211 281188 279278 276664 274788 274635 275268 274722
54231B74722k428l053k275j699k145k433j314M61J060Lj504k335k347j665l83
$$ 274722 272294 269241 266966 265267 263122 260689 259375 259836 260896 260899 259395 257060 254713 253048 252665
54216B52665P55O43n83j247j27J963L371L594L223K483J042q31k059k013j338
$$ 252665 253420 254063 253480 252233 252106 254069 257440 261034 264257 266740 267782 266951 264892 262879 261541
54201B61541j070j284j045K78J929K287O84j525k256j000P46J403R28J94l24n61
$$ 261541 260471 259187 258142 258420 260349 262636 263320 261795 259539 258539 259285 260688 261616 261810 261486 260925
54185B60925k99M44R02M35l76n24k18n59j609k081j403p61j346k586l088k658
$$ 260925 260626 261070 261972 262407 262031 261507 261289 260730 259121 257040 255637 254876 253530 250944 247856 245198
54169B45198k148j787r24M95J479J430J067J297J850J836J128L63k18r50j766
$$ 245198 243050 241263 240339 240834 242313 243743 244810 246107 247957 249793 250921 251284 251066 250116 248350
54154B48350j968j327o17n00n16J63J381K169K038J312L13r67k229k789k492k115
$$ 248350 246382 245055 244438 243938 243422 243585 244966 247135 249173 250485 250798 249831 247602 244813 242321 240206
54138B40206k304k608k080o08Q09J129K97p12q02K25J496K053J958J994K377K401
$$ 240206 237902 235294 233214 232606 233415 234544 234841 234129 233327 233552 235048 237101 239059 241053 243430 245831
54122B45831J614N96O8j96q31j557j262M75K590L472K485M21j219j382k10J188
$$ 245831 247445 248041 248109 247913 247082 245525 244263 244738 247328 250800 253285 253706 252487 251105 250895 252083
54106B52083J788J467P36k8p56j291j333r93q89j422k066j772j53J850K642J455
$$ 252083 253871 255338 256074 256046 255290 253999 252666 251673 250784 249362 247296 245524 245371 247221 249863 251318
54090B51318q71k615k755j740p48l80k59J69P23O38l50j307r59P09K199K200J201
$$ 251318 250447 247832 245077 243337 242589 242209 241950 242119 242842 243480 243130 241823 240864 241573 243772 245972 247173
54073B47173P67J464K280K145J245N19M66Q44J121P95k16j167r44M85J565Q24
$$ 247173 247940 249404 251684 253829 255074 255593 256059 256903 258024 258819 258603 257436 256492 256977 258542 259366
54057B59366j144k126q06J705L069K069l44k054j695K69K152K636J718K81q58
$$ 259366 258222 256096 255290 256995 260064 262133 261789 259735 258040 258309 260461 263097 264815 265096 264238
54042B64238j394j477j554k007k587k440j033J050K464K281P27r66j366O6K326
$$ 264238 262844 261367 259813 257806 255219 252779 251746 252796 255260 257541 258268 257302 255936 256002 258328
54027B58328L613L090J723J146J920L198L783L085J412k28p20K26J680K347J797
$$ 258328 261941 265031 266754 267900 269820 273018 276801 279886 281298 281070 280350 280576 282256 284603 286400
54012B86400P42L32J278L273N016N271M320L869N064P003P847O887M814K452K73
$$ 286400 287142 287474 288752 292025 297041 302312 306632 310501 315565 322568 330415 337302 342116 344568 344841
53997C44841j095j247r45j531k954l438j783Q33K131J341k74j089n95O29J757
$$ 344841 343746 342499 341554 340023 337069 333631 331848 332681 334812 336153 335879 334790 334195 334824 336581
53982C36581K398K784L417M340M973M850M333M234M969O383Q160R806J0390R176
$$ 336581 338979 341763 345180 349520 354493 359343 363676 367910 372879 379262 387422 397228 407618 416794
53968D16794O819N296N931P792Q663P611N864N072N372N637N184M438L959L490
$$ 416794 423613 428909 434840 442632 451295 458906 464770 469842 475214 480851 486035 490473 494432 497922
53954D97922K386N39j482l110m282n189n739n559m596l556l378m220n281n833
$$ 497922 500308 500847 499365 496255 491973 486784 481045 475486 470890 467334 463956 459736 454455 448622
53940D48622o062o481o840o262m511k495j368j437k212l084l697l846l390k393
$$ 448622 442560 436079 429239 422977 418466 415971 414603 413166 410954 407870 404173 400327 396937 394544
53926C94544j342j048k041l919n554o109n570m250k442q39m59j415k406k330j705
$$ 394544 393202 392154 390113 386194 380640 374531 368961 364711 362269 361430 360971 359556 357150 354820 353115
53911C53115j473j179Q1J458J047j147k893k736j475k05J161K549K927K125J755
$$ 353115 351642 350463 350544 352002 353049 351902 349009 346273 344798 344593 345754 348303 351230 353355 355110
53896C55110K811L893L538K759L350M775N068M110L606M035L981K769J799K622
$$ 355110 357921 361814 365352 368111 371461 376236 381304 385414 389020 393055 397036 399805 401604 404226
53882D04226N098P965R986J0302Q894P102O622P609Q711R073R186R516R569Q816
$$ 404226 409324 417289 427275 437577 446471 453573 460195 467804 476515 485588 494774 504290 513859 522675
53868E22675P645O807O625O994P560P743P298O945P804J0091J3024J5796J7812
$$ 522675 530320 537127 543752 550746 558306 566049 573347 580292 588096 598187 611211 627007 644819
53855F44819J8310J6847J4035J0752O916K397j182j609O77K502J979Q45J541L477
$$ 644819 663129 679976 694011 704763 711679 714076 712894 711285 711962 714464 716443 717288 718829 722306
53841G22306L817J260k489m816m682l109j936k206l409m423n042n980p495q918
$$ 722306 726123 727383 724894 720078 715396 712287 710351 708145 704736 700313 695271 689291 681796 672878
53827F72878r781j0360j0802j0771j0455j0775j1836j2311j1241r546q694q756
$$ 672878 663097 652737 641935 631164 620709 609934 598098 585787 574546 565000 556306 547550
53815E47550q864q903r300r582q696o883n932o941q654q753o609m103l553n048
$$ 547550 538686 529783 520483 510901 502205 495322 489390 482449 473795 465042 458433 454330 450777 445729
53801D45729o362n673l739k793l829n897p681q508p875n576k756j349j729k140
$$ 445729 439367 433694 429955 427162 423333 417436 409755 401247 393372 387796 385040 383691 381962 379822
53787C79822j338l69o49j528j394l88k33j599l192l485k248l00J191J261j1j154
$$ 379822 378484 378115 377466 375938 374544 374156 373923 372324 369132 365647 363399 363099 364290 365551 365540 364386
53771C64386p90N36R72j68j652k292k385k632k625j510L41J405Q80j91j25J467
$$ 364386 363596 364132 365104 364936 363284 360992 358607 355975 353350 351840 352181 353586 354466 354275 354150 355617
53755C55617L372M335M445M608N062N084M201L037K542K799L072K932K845L619
$$ 355617 358989 363324 367769 372377 377439 382523 386724 389761 392303 395102 398174 401106 403951 407570
53741D07570N381P242Q173Q186Q395R545J0892J1035R636P661O166N526N680O161
$$ 407570 412951 420193 428366 436552 444947 454492 465384 476419 486055 493716 499882 505408 511088 517249
53727E17249O021M727L208K852L381K993J034r55j473j083j213k107l104m089
$$ 517249 523270 527997 531205 534057 537438 540431 541465 540510 539037 537954 536741 534634 531530 527441
53713E27441n355o594p179p228p428p980q424q290p421o020m776m418m816n192
$$ 527441 522086 515492 508313 501085 493657 485677 477253 468963 461542 455522 450746 446328 441512 436320
53699D36320n418o025o590n592k896q19j350l415m502l971l098k600k137j783
$$ 436320 430902 424877 418287 412695 409799 408980 407630 404215 399713 395742 392644 390044 387907 386124
53685C86124k074k709k870k692k833k822j644O1L68j117k583k639j923j524j345
$$ 386124 384050 381341 378471 375779 372946 370124 368480 368541 368909 367792 365209 362570 360647 359123 357778
53670C57778q78l25q1l2m3k69m96j01R34J834K208K470K836K961K784K580J931
$$ 357778 356900 356575 356494 356462 356419 356150 355654 355553 356487 358321 360529 362999 365835 368796 371580 374160 376091
53653C76091J44j894j873R56M337N656M869L715L184L072L130L145K382L75j898
$$ 376091 376235 374341 372468 373424 377761 383417 388286 392001 395185 398257 401387 404532 406914 407289 405391
53638D05391k765j753R6J617K556L394M721O464P469O504M173K709L025L157J105
$$ 405391 402626 400873 400969 402586 405142 408536 413257 419721 427190 433694 437867 440576 443601 446758 447863
53623D47863j826k453j42K394K893K085J646J530O81p64j560j206l43M59J231
$$ 447863 446037 443584 443442 445836 448729 450814 452460 453990 454671 453907 452347 451141 450798 451257 452488
53608D52488J836J693O28o17j195j145j165j635k249k605k695k615k123j003K20
$$ 452488 454324 456017 456645 456028 454833 453688 452523 450888 448639 446034 443339 440724 438601 437598 437818
53593D37818O34L08N86K222L731K784n98l514l552j715r14k192l786l832k502
$$ 437818 438452 438760 439346 441568 445299 448083 447485 443971 440419 438704 437790 435598 431812 427980 425478
53578D25478r68M25J981L360L672K738J377M48K51P39J680K455K397J542O81N54
$$ 425478 424510 424935 426916 430276 433948 436686 438063 438511 438762 439501 441181 443636 446033 447575 448256 448810
53562D48810J259K418L428L763L562L873N486P512Q000O261L734K164J814K033
$$ 448810 450069 452487 455915 459678 463240 467113 472599 480111 488111 494372 498106 500270 502084 504117
53548E04117K729M168N761O165M949L437L407M988O263N333K781J381K876N765
$$ 504117 506846 511014 516775 522940 527889 531326 534733 539721 545984 551317 554098 555479 558355 564120
53534E64120P226O574N314M168K208o11k233j237Q79J680Q82j86j100k370l576
$$ 564120 571346 577920 583234 587402 589610 588999 586766 585529 586408 588088 588970 588784 587684 585314 581738
53519E81738l476j978l53N39Q91Q88L92k80n76p40j426k228j921l49J247J998
$$ 581738 578262 576284 575931 576470 577361 578249 578641 578361 577785 577045 575619 573391 571470 571121 572368 574366
53503E74366K308K645K658K019J243J191K230L952N160M503K021l24o91M42J416
$$ 574366 576674 579319 581977 583996 585239 586430 588660 592612 597772 602275 604296 603972 603281 603723 605139
53488F05139K037L353N151N903N460N553P007Q398Q358P387O510N958O216Q413
$$ 605139 607176 610529 615680 621583 627043 632596 639603 648001 656359 663746 670256 676214 682430 690843
53474F90843J2244J5165J5287J3820J3098J3502J4003J4544J5846J7637J8997
$$ 690843 703087 718252 733539 747359 760457 773959 787962 802506 818352 835989 854986
53463H54986K0043K1555K3196K3865K3703K4196K6140K8714L0599L1132L0543
$$ 854986 875029 896584 919780 943645 967348 991544 1017684 1046398 1076997 1108129 1138672
53452A138672K9993L1067L4072L7205L8582L8707L9598M1800M3807M4427M4033
$$ 1138672 1168665 1199732 1233804 1271009 1309591 1348298 1387896 1429696 1473503 1517930 1561963
53441A561963M3240M1940M0323L9467M0065M1343M2111M2240M2407M2808M2820
$$ 1561963 1605203 1647143 1687466 1726933 1766998 1808341 1850452 1892692 1935099 1977907 2020727
53430B020727M1788L9747L7363L5340L3858L2585L1306L0225K9422K8464K7047
$$ 2020727 2062515 2102262 2139625 2174965 2208823 2241408 2272714 2302939 2332361 2360825 2387872
53419B387872K5620K4776K4359K3816K3095K2320K0918J8088J4109J0251P205
$$ 2387872 2413492 2438268 2462627 2486443 2509538 2531858 2552776 2570864 2584973 2595224 2602429
53408B602429M373Q39l650q647j3271j6478j7914j8608k0081k2668k5407k7645
$$ 2602429 2606802 2607641 2603991 2595344 2582073 2565595 2547681 2529073 2508992 2486324 2460917 2433272
53396B433272k9791l2321l5078l7831m0604m2882m3467m1867l9234l7213l6339
$$ 2433272 2403481 2371160 2336082 2298251 2257647 2214765 2171298 2129431 2090197 2052984 2016645
53385B016645l6092l6003l5910l5521l4556l3182l1719l0079k7973k5422k2501
$$ 2016645 1980553 1944550 1908640 1873119 1838563 1805381 1773662 1743583 1715610 1690188 1667687
53374A667687j8895j4426r901o561m523k527M69M045P144R553J1998J5074J8730
$$ 1667687 1648792 1634366 1624465 1617904 1613381 1610854 1611323 1615368 1622512 1632065 1644063 1659137 1677867
53361A677867K2680K6645L0214L3082L5657L8798M2643M6154M8301M9337N0432
$$ 1677867 1700547 1727192 1757406 1790488 1826145 1864943 1907586 1953740 2002041 2051378 2101810
53350B101810N2341N4901N7637O0261O2669O4959O7457P0316P3266P6141P9305
$$ 2101810 2154151 2209052 2266689 2326950 2389619 2454578 2522035 2592351 2665617 2741758 2821063
53339B821063Q3024Q6698Q9484R1383R2873R3834R4005R4238R5829R8477J00315
$$ 2821063 2904087 2990785 3080269 3171652 3264525 3358359 3452364 3546602 3642431 3740908 3841223
53328C841223J00306R9084R7028R3349Q8091Q3227Q0257P8048P4725P0518O6922
$$ 3841223 3941529 4040613 4137641 4230990 4319081 4402308 4482565 4560613 4635338 4705856 4772778
53317D772778O3839N9751N4299M8738M3815L8958L3575K7459J9953J0460j06j0245
$$ 4772778 4836617 4896368 4950667 4999405 5043220 5082178 5115753 5143212 5163165 5173625 5173519 5163274
53305E163274k0529l3267m8696o3453p4182q1173q7078r3128r8343j01841j04361
$$ 5163274 5142745 5109478 5060782 4997329 4923147 4841974 4754896 4661768 4563425 4461584 4357223
53294D357223j07293j10990j14241j15142j12933j09237j06833j06859j07847
$$ 4357223 4249930 4138940 4024699 3909557 3796624 3687387 3580554 3473695 3365848
53285C365848j07870j06609j04681j02099r8626r4913r1879q9198q5648q0825
$$ 3365848 3257978 3151369 3046688 2944589 2845963 2751050 2659171 2569973 2484325 2403500
53275B403500p5546p0575o5921o1400n6955n2310m7138m1718l6749l2420k8445
$$ 2403500 2327954 2257379 2191458 2130058 2073103 2020793 1973655 1931937 1895188 1862768 1834323
53264A834323k5017k2695k1126j8925j5504j2136j0247r281p303l618L37K920
$$ 1834323 1809306 1786611 1765485 1746560 1731056 1718920 1708673 1699392 1692089 1688471 1688808 1691728
53252A691728M264N766Q256J1288J4068J6324J8252K0093K1962K3795K5338K6502
$$ 1691728 1695992 1701758 1710014 1721302 1735370 1751694 1769946 1790039 1812001 1835796 1861134 1887636
53240A887636K7794K9993L3118L6187L8320L9705M0992M2230M3084M3759M4822
$$ 1887636 1915430 1945423 1978541 2014728 2053048 2092753 2133745 2175975 2219059 2262818 2307640
53229B307640M6227M7356M8020M8458M8189M6044M1943L7660L5003L3874L2883
$$ 2307640 2353867 2401223 2449243 2497701 2545890 2591934 2633877 2671537 2706540 2740414 2773297
53218B773297L1184K8766K5527K1355J6882J2926R244M836m33n696j0632j5926
$$ 2773297 2804481 2833247 2858774 2880129 2897011 2909937 2919181 2924017 2923584 2917888 2907256 2891330
53206B891330k1860k7811l3667m0330m7749n3706n6138n6009n6317n8540o1518
$$ 2891330 2869470 2841659 2807992 2767662 2719913 2666207 2610069 2554060 2497743 2439203 2377685
53195B377685o3658o4661o4938o4805o4683o4795o4178o1497n7415n4677n4784
$$ 2377685 2314027 2249366 2184428 2119623 2054940 1990145 1925967 1864470 1807055 1752378 1697594
53184A697594n6015n5983n4918n4688n5533n5899n5087n4019n3180n1744m9142
$$ 1697594 1641579 1585596 1530678 1475990 1420457 1364558 1309471 1255452 1202272 1150528 1101386
53173A101386m5960m2687l9077l5296l2297l0189k7703k4212k1078j9809j9880
$$ 1101386 1055426 1012739 973662 938366 906069 875880 848177 823965 802887 783078 763198
53162G63198j9607j8402j6997j6088j5836j6055j5851j3863j0240p585q271j1149
$$ 763198 743591 725189 708192 692104 676268 660213 644362 630499 620259 612674 604403 593254
53150E93254j2725j1555r605q955r126q574p270o385o320o379o075n726n819o500
$$ 593254 580529 568974 559369 550414 541288 532714 525444 519059 512739 506360 500285 494559 488740 482240
53136D82240p597q572q544o975m469k486k015k664l199k912k363k600l734m678
$$ 482240 474643 466071 457527 450552 446083 443597 441582 438918 435719 432807 430444 427844 424110 419432
53122D19432m487l538k887k830k759k323j923j872j845j535j292j592k229k523
$$ 419432 414945 411407 408520 405690 402931 400608 398685 396813 394968 393433 392141 390549 388320 385797
53108C85797k198j635j326j361j450j218m92M84J074O84o52k146k846k431j416
$$ 385797 383599 381964 380638 379277 377827 376609 376117 376601 377675 378359 377707 375561 372715 370284 368868
53093C68868n97m30r63k000l020l250k287o37P95J630J965J715Q36L6K54J234
$$ 368868 368271 367841 366878 364878 361858 358608 356321 355684 356479 358109 360074 361789 362625 362661 362915 364149
53077C64149J737J477J544K335K422O49j732k446j082P50J662J555Q58J10J52
$$ 364149 365886 367363 368907 371242 373664 374313 372581 370135 369053 369803 371465 373020 373878 373988 374140
53062C74140J385K884L306K563J586Q18K14K05J000J249n64l304l976j881J84
$$ 374140 375525 378409 381715 384278 385864 386682 386896 387101 388101 389350 388786 385482 381506 379625 379809
53047C79809q4j417j411k40O5j034k191k641l061l809m044l152j875j348j595
$$ 379809 379725 378308 376897 376657 376722 375688 373497 370856 367795 363986 359942 356790 354915 353567 351972
53032C51972j549m20J238J860M72j987l403k833j552j271j810j484M01K341K342
$$ 351972 350423 350003 351241 353101 353573 351586 348183 345350 343798 342527 340717 339233 339634 341975 344317
53017C44317L05j820k201j078k19m93p68L35K124K466O67j403j660l22O63J10
$$ 344317 344622 342802 340601 339523 339304 338811 338043 338378 340502 342968 343635 342232 340572 340250 340913 341023
53001C41023j332k358k517k381k617l047k713j018J339K963L111J971q3k576m256
$$ 341023 339691 337333 334816 332435 329818 326771 324058 323040 324379 327342 330453 332424 332341 329765 325509
52986C25509l705j190J001R24r74k727l116k367j257m87n61j384k057j743o44
$$ 325509 321804 320614 321615 322539 321565 318838 315722 313355 312098 311611 311050 309666 307609 305866 305222
52971C05222L10N51K37k58p44j217j773k375k626k214j576j492j719j035Q57K341
$$ 305222 305532 306083 306320 306062 305318 304101 302328 299953 297327 295113 293537 292045 290326 289291 290148 292489
52955B92489J821O1n76R28L067L723K442N45n75p79q57j218j351q27k66n21j203
$$ 292489 294310 294371 293795 294723 297790 301513 303955 304500 303925 303146 302289 301071 299720 298893 298627 298106 296903
52938B96903j121j62N27N13Q06J941K675J622p36k749l425k705r22Q26R02p77
$$ 296903 295782 295620 296147 296660 297466 299407 302082 303704 302968 300219 296794 294089 293167 293993 294895 294118
52922B94118j745J01L289M420K686O03J57N37L73J37R67K478L307L082K473J758
$$ 294118 292373 292474 295763 300183 302869 303472 303629 304166 304539 304676 305643 308121 311428 314510 316983 318741
52906C18741N15j161k282k143j350j152j875k419j568M48K111K367J633Q00M4
$$ 318741 319256 318095 315813 313670 312320 311168 309293 306874 305306 305754 307865 310232 311865 312665 312709
52891C12709p38r95j97Q61N57j487l733m385l126j047M43M65r00k567l284k720
$$ 312709 311971 310976 310779 311640 312197 310710 306977 302592 299466 298419 298862 299327 298427 295860 292576 289856
52875B89856j490j80J067J946J806M76j252k414k810k795k468j593k16J067J627
$$ 289856 288366 288186 289253 291199 293005 293481 292229 289815 287005 284210 281742 280149 279933 281000 282627
52860B82627J430J016Q74R55Q87N45J59j13l83p39j090j367j614j752j668j467
$$ 282627 284057 285073 285947 286902 287789 288334 288493 288380 287997 287258 286168 284801 283187 281435 279767 278300
52844B78300j226o21N01J311P65o17j020J35J309J300J181K404M167M508L391
$$ 278300 277074 276453 276954 278265 279030 278413 277393 277528 278837 280137 281318 283722 287889 292397 295788
52829B95788K701L173L266J659o29j501l69J323J802P14p38j246q79p46j205j292
$$ 295788 298489 301662 304928 306587 305958 304457 304088 305411 307213 307927 307189 305943 305064 304318 303113 301821
52813C01821l66P29J016R34J416K210K454K208K070J777Q77J79R00K491L180K583
$$ 301821 301455 302184 303200 304134 305550 307760 310214 312422 314492 316269 317146 317325 318225 320716 323896 326479
52797C26479K020K234K540K320J658L64j823l832l982k529j546j870k159j605
$$ 326479 328499 330733 333273 335593 337251 337615 335792 331960 327978 325449 323903 322033 319874 318269
52783C18269j338k103k670k030j381k204l835m569m114l372k727j972j159l52
$$ 318269 316931 314828 312158 310128 308747 306543 302708 298139 294025 290653 287926 285954 284795 284443
52769B84443P20J784J854Q02n6On0r75j541n78P73P53k38o24m24p59j318o81J128
$$ 284443 285163 286947 288801 289603 289547 289553 289503 288528 286987 286409 287182 287935 287697 287073 286649 285890 284572 283891 285019
52750B85019K588L064L205L120K260J075O96P88j31j971k814k050j471k396l596
$$ 285019 287607 290671 293876 296996 299256 300331 301027 301815 301684 299713 296899 294849 293378 290982 287386
52735B87386l368k047j067p90p17q21j252j416p44J24O4p97j167k79J194J920
$$ 287386 284018 281971 280904 280114 279397 278576 277324 275908 275164 275288 275352 274555 273388 273109 274303 276223
52719B76223J118p91k256j725Q05L421M033K370N7j108o56N11J154Q18N6l60l82
$$ 276223 277341 276550 274294 272569 273374 276795 280828 283198 283255 282147 281491 282002 283156 283974 284030 283670 283288
52702B83288n15r77j405j432j029k40Q83K014K714K972L122L177K734J639K41
$$ 283288 282773 281796 280391 278959 277930 277690 278573 280587 283301 286273 289395 292572 295306 296945 297186
52687B97186j012j780j725q46R6K59j48k31R4L8m70l07J160L029M159M611M871
$$ 297186 296174 294394 292669 291823 291919 292178 292030 291799 291893 291931 291461 291154 292314 295343 299502 304113 308984
52670C08984M609L296J444J09n65j248k173k876l032k702j864o11K94l3j414k652
$$ 308984 313593 316889 318333 318442 317877 316629 314456 311580 308548 305846 303982 303371 303665 303632 302218 299566
52654B99566k859k124r30K89J033R85N05J55l22j641l345l685j794Q24J872Q99
$$ 299566 296707 294583 293653 293942 294975 295960 296465 296620 296298 294657 291312 287627 285833 286657 288529 289428
52638B89428m61o03M93J691J983J211J04k58N50J791K375K156J787J386K23j801
$$ 289428 288967 288364 288857 290548 292531 293742 293846 293588 294138 295929 298304 300460 302247 303633 303856 302055
52622C02055l309k990j541q10j074o42J338L051K291l51k131j816q17m76m6J489
$$ 302055 298746 295756 294215 293405 292331 291689 293027 296078 298369 298018 295887 294071 293254 292778 292732 294221
52606B94221L103K962J249j6K04R14J007O92N41M40K90O39J775K955L380L243
$$ 294221 297324 300286 301535 301519 301723 302637 303644 304336 304877 305317 305607 306246 308021 310976 314356 317599
52590C17599L006K434J287K91J69K63n31j732j735l77M86m51k102k598j841j295
$$ 317599 320605 323039 324326 324617 324786 325049 324518 322786 321051 320674 321160 320709 318607 316009 314168 312873
52574C12873j725k186j387O29K454K789J774Q20J119K601M270N064M104R95l163
$$ 312873 311148 308962 307575 308204 310658 313447 315221 316041 317160 319761 324031 329095 333199 334194 331031
52559C31031n811n361l377k812m130m952l762j943j256j268p46O7L28M70J283
$$ 331031 325220 319859 316482 313670 309540 304588 300826 298883 297627 296359 295613 295680 296008 296478 297761
52544B97761K060J630O15N55J280J302N41M04J022P92p66j886j190M34J620K490
$$ 297761 299821 301451 302066 302621 303901 305203 305744 306148 307170 307962 307196 305310 304120 304554 306174 308664
52528C08664L533M092L372J956R25L50k11n31k22L05N18P71J479J992J452K39
$$ 308664 312197 316289 319661 321617 322542 322892 322681 322150 321928 322233 322751 323522 325001 326993 328445 328684
52512C28684n98q89j148j372j235j142j714k472k361j463q85r16o55K93J106J108
$$ 328684 328086 327197 326049 324677 323442 322300 320586 318114 315753 314290 313405 312489 311834 312127 313233 314341
52496C14341O89L32j48p25n29Q47K179J927M79j73Q30J765M23k860n155m183r41
$$ 314341 315030 315362 315214 314489 313960 314807 316986 318913 319392 319219 320049 321814 322237 319377 314222 310039 309098
52479C09098J475J331j46o50O02K593M160N032N343M917L480J343n88j589j740
$$ 309098 310573 311904 311758 311108 311710 314303 318463 323495 328838 333755 337235 338578 337990 336401 334661
52464C34661j590j258l51J007J675P58r53j669p23Q96K114K877L445L609L208
$$ 334661 333071 331813 331462 332469 334144 334902 333949 332280 331557 332453 334567 337444 340889 344498 347706
52449C47706K603K122J594Q98K66k98j084j753j417j68N65o0j055j193p57o42
$$ 347706 350309 352431 354025 354923 355189 354891 353807 352054 350637 350469 351034 350974 349919 348726 347969 347327
52433C47327p86p15p77j387j870j471p79o28l97Q42K165J860K50p29o26p37j155
$$ 347327 346541 345826 345049 343662 341792 340321 339542 338914 338517 339359 341524 343384 343634 342905 342279 341542 340387
52416C40387j32K693M824M137J835N73J014J803J909J328K20j077j454N7K717
$$ 340387 340255 342948 347772 351909 353744 354317 355331 357134 359043 360371 360591 359514 358060 358117 360834
52401C60834M548M519L460K656K292J676N51l86m03Q8k03j769l492m015l508l215
$$ 360834 365382 369901 373361 376017 378309 379985 380536 380150 379747 379835 379632 377863 374371 370356 366848 363633
52385C63633l553l656k845j592r45j590l341m806m044p64K506L045J495R76K575
$$ 363633 360080 356424 353579 351987 351042 349452 346111 341305 337261 336497 339003 342048 343543 344519 347094
52370C47094L970L150J114l62j414k706l184j542J126K432J868R42N75L02r6m8
$$ 347094 351064 354214 355328 354966 353552 350846 347662 346120 347246 349678 351546 352488 353063 353365 353269 353221
52354C53221N70J275K102L523N199O153O143N498L916J182r87p8L644O740O830
$$ 353221 353791 355066 357168 360691 365890 372043 378186 383684 387600 388782 387795 387717 391361 398101 404931
52339D04931N304M487L845J147l553p361p913n711k840q02J0k17j008j847k437
$$ 404931 410235 414722 418567 419714 416161 408800 400887 395176 392336 391534 391544 391327 390319 388472 386035
52324C86035k492j415J017L676M719L653K022J536K154K595K139J117N2p14o76
$$ 386035 383543 382128 383145 386821 391540 395193 397215 398751 400905 403500 405639 406756 406808 406094 405418
52309D05418N53K424L685L715L058K522K352K433K531K130R06k92L3J843L064
$$ 405418 405971 408395 412080 415795 418853 421375 423727 426160 428691 430821 431727 431435 431468 433311 436375
52294D36375K165L46j76P77J545J399J247J560J531Q33O35J916L854M881M549
$$ 436375 438540 438886 438710 439487 441032 442431 443678 445238 446769 447602 448237 450153 454007 458888 463437
52279D63437L646L102L284L777L507J805k85p55Q83K855L497L394M295O764R763
$$ 463437 467083 470185 473469 477246 480753 482558 482273 481518 482401 485256 488753 492147 496442 503206 512969
52264E12969J1788J1733R450O424N096O494R009J0393J0159R213Q068O761N894
$$ 512969 524757 536490 545940 552364 557460 563954 572963 583356 593515 602728 610796 617557 623451
52251F23451O152P050P393O817N859M827L739L134L695N206O891Q599J0479J1824
$$ 623451 629603 636653 644046 650863 656722 661549 665288 668422 672117 677323 684214 692813 703292 715116
52237G15116J1504R543P192N465M597M586N002M620K756Q26Q85K625L585K566
$$ 715116 726620 736163 743355 748820 753417 758003 763005 767625 770381 771207 772092 774717 778302 780868
52223G80868R72K70Q4k54q4J274K893L423L017K811L126L411L426L382L280L034
$$ 780868 781840 782110 782194 781940 781856 783130 786023 789446 792463 795274 798400 801811 805237 808619 811899 814933
52207H14933K954L343L921M250M283M050L390K611K637L742M904N212N204N843
$$ 814933 817887 821230 825151 829401 833684 837734 841124 843735 846372 850114 855018 860230 865434 871277
52193H71277O874P450P766Q668R933J0345R497Q318P592P125O588O115N637M606
$$ 871277 878151 885601 893367 902035 911968 922313 931810 940128 947720 954845 961433 967548 973185 977791
52179I77791K927J471J121J724K481K993L488M250N151N744N747N374N052M669
$$ 977791 980718 982189 983310 985034 987515 990508 993996 998246 1003397 1009141 1014888 1020262 1025314 1029983
52165A029983L587J752L74P15K442M125N151O176P546Q490Q385P809P649P858
$$ 1029983 1033570 1035322 1035696 1036411 1038853 1042978 1048129 1054305 1061851 1070341 1078726 1086535 1094184 1102042
52151A102042P932P935Q159Q230P673P071P452Q424Q178N930L354K635L714M558
$$ 1102042 1109974 1117909 1126068 1134298 1141971 1149042 1156494 1164918 1173096 1179026 1182380 1185015 1188729 1193287
52137A193287L976L072L531N389P221P963P693O836N503L927K833K748L320L700
$$ 1193287 1197263 1200335 1203866 1209255 1216476 1224439 1232132 1238968 1244471 1248398 1251231 1253979 1257299 1260999
52123A260999L433K545J033j217l904o277p746q278q038p049n385l551k280j949
$$ 1260999 1264432 1266977 1268010 1266793 1262889 1256612 1248866 1240588 1232550 1225501 1220116 1216565 1214285 1212336
52109A212336k274k576k445k221k647l833m718m053j961O2Q31O33M17M61M94O00
$$ 1212336 1210062 1207486 1205041 1202820 1200173 1196340 1191622 1187569 1185608 1185670 1186501 1187134 1187551 1188012 1188506 1189106
52093A189106J044J379O85j111k875l476k697r68R98K067J376k68p18Q29K445
$$ 1189106 1190150 1191529 1192214 1191103 1188228 1184752 1182055 1181087 1182085 1184152 1185528 1185260 1184542 1185371 1187816
52078A187816K032M09Q6J359J816J50j651j116J224K789K540J985K875N358Q491
$$ 1187816 1189848 1190257 1190343 1191702 1193518 1193668 1192017 1190901 1192125 1194914 1197454 1199439 1202314 1207672 1216163
52063A216163J1369J3436J4434J4497J3932J2950J1925J1619J2449J3596J3660
$$ 1216163 1227532 1240968 1255402 1269899 1283831 1296781 1308706 1320325 1332774 1346370 1360030
52052A360030J2253J0325Q902Q082P357O235M402J913m51j492n89J713M118N340
$$ 1360030 1372283 1382608 1391510 1399592 1406949 1413184 1417586 1419499 1419048 1417556 1416967 1418680 1422798 1428138
52038A428138M774L022J677J893L171M038L791K787J223j213m233o610p540p517
$$ 1428138 1432912 1435934 1437611 1439504 1442675 1446713 1450504 1453291 1454514 1453301 1449068 1442458 1434918 1427401
52024A427401p347p060o493o100o267o381n509l822k543k443l046l257k508j268
$$ 1427401 1420054 1412994 1406501 1400401 1394134 1387753 1382244 1378422 1375879 1373436 1370390 1367133 1364625 1363357
52010A363357n79q07q97M58K761L800K459M38J73J733L045K728J325j11j117j354
$$ 1363357 1362778 1361971 1361074 1361532 1364293 1368093 1370552 1370990 1371163 1372896 1375941 1378669 1379994 1379883 1378766 1377412
51994A377412m22J150J813P17j160k232k121j602j399j786k903m701o577p884
$$ 1377412 1376990 1378140 1379953 1380670 1379510 1377278 1375157 1373555 1372156 1370370 1367467 1362766 1356189 1348305
51980A348305q644r275r678r286q066o782n982n325m276l003k112j818j909k309
$$ 1348305 1339661 1330386 1320708 1311422 1303356 1296574 1290592 1285267 1280991 1277988 1275876 1274058 1272149 1269840
51966A269840l041l708l696l096k710k875k893k171j318j331k109k656k596k562
$$ 1269840 1266799 1263091 1259395 1256299 1253589 1250714 1247821 1245650 1244332 1243001 1240892 1238236 1235640 1233078
51952A233078k993l500l715m013m944o547q526j0513j1914j2198j1770j1921j3367
$$ 1233078 1230085 1226585 1222870 1218857 1213913 1207366 1198840 1188327 1176413 1164215 1152445 1140524 1127157
51939A127157j5493j7390j8798j9484j8778j6734j4936j4788j5565j5476j4313
$$ 1127157 1111664 1094274 1075476 1055992 1037214 1020480 1005544 990756 975191 959715 945402
51928I45402j3426j3250j2688j1355j0707j1904j3846j4579j3857j3039j2833
$$ 945402 931976 918726 906038 894683 883976 872072 858226 843647 829790 816751 803918
51917H03918j2404j0907q943q043q951j0719j1515j0295p678n105l294j876l26
$$ 803918 791514 780607 771664 763621 754670 743951 732436 722141 714463 709358 706064 704188 703862
51904G03862J402L249N308P292Q343P983O857N961N391M492L119J966J451R05
$$ 703862 705264 708513 713821 721113 729456 737439 744296 750257 755648 760140 763259 765225 766676 767581
51890G67581n66k580l564k607q84m28j543k150k50L657P329R463J0585J1555J2508
$$ 767581 767015 764435 760871 758264 757380 756952 755409 753259 753009 756666 763995 773458 784043 795598 808106
51875H08106J3428J4541J5607J5873J5280J4671J4137J2316Q441M046J138p00
$$ 808106 821534 836075 851682 867555 882835 897506 911643 923959 932400 936446 937584 936884
51863I36884l566p769j1024j1587j0631j0406j1217j1499j0273q135n808k914
$$ 936884 933318 925549 914525 902938 892307 881901 870684 859185 848912 840777 834969 832055
51851H32055J234O284J0955J4281J6160J6636J5180J1223N122j848q534j4546
$$ 832055 833289 839573 850528 864809 880969 897605 912785 924008 929130 927282 918748 904202
51839I04202j9647k3076k3914k2097j8768j5684j4269j4790j6200j7037j6804
$$ 904202 884555 861479 837565 815468 796700 781016 766747 751957 735757 718720 701916
51828G01916j6168j5630j4613j2412r444o757m639k627p27M20P45J123K188L526
$$ 701916 685748 670118 655505 643093 633649 626892 622253 619626 618899 619319 620064 621187 623375 626901
51814F26901M421M743M686M256L473K604J794R08R7j39J31p4j390l036l862l962
$$ 626901 631322 636065 640751 645007 648480 651084 652878 653786 653883 653744 653875 653801 652411 649375 645513 641551
51798F41551m314n047n125l939k253j204j054j345j785k481l612n199o954q069
$$ 641551 637237 632190 627065 623126 620873 619669 618615 617270 615485 613004 609392 604193 597239 589170
51784E89170p587n449k946j659j972k969l708m121m644n385n897n524l989j886
$$ 589170 581583 576134 573188 571529 569557 566588 562880 558759 554115 548730 542833 537309 533320 531434
51770E31434n23p28j691j665j40J475J870J657K007K270P57k082l416j865L14
$$ 531434 530911 530183 528492 526827 526687 528162 530032 531689 533696 535966 536723 534641 531225 529360 529674
51755E29674L58j069j110R53K965L360K998L001K877J924Q90Q68J557J883J566
$$ 529674 530032 528963 527853 528806 531771 535131 538129 541130 544007 545931 546821 547689 549246 551129 552695
51740E52695R11k23j999l593l843k706j168J6O88Q08M58J5m50j459k918l404j900
$$ 552695 553606 553383 551384 547791 543948 541242 540074 540090 540778 541586 542044 542059 541609 540150 537232 533828 531928
51723E31928L17J054J12p71p45p49j403j814j164M8J145K243L347L808L636M021
$$ 531928 532245 533299 533411 532640 531895 531146 529743 527929 526765 526813 527958 530201 533548 537356 540992 545013
51707E45013N452O559O092M939M738N446N905O021O500O821N481K407o20k363
$$ 545013 550465 557024 563116 568055 572793 578239 584144 590165 596665 603486 608967 611374 610754 608391
51693F08391l422m651n684n848n364m837m418m277n039o703p761o514l223j3J358
$$ 608391 604969 600318 594634 588786 583422 578585 574167 569890 564851 558148 550387 543873 540650 540637 541995
51678E41995J111P34J285K598L859M669N406O482P497P466O126M436L512L330
$$ 541995 543106 543840 545125 547723 551582 556251 561657 568139 575636 583102 589228 593664 597176 600506
51664F00506L013K230J716K235L374L759K402l15l000m487m611l905k832j538
$$ 600506 603519 605749 607465 609700 613074 616833 619235 618920 615920 611433 606822 602917 600085 598547
51650E98547k16O21M30q75k657l817l564k184q55m42n69j91J015K272K676K071
$$ 598547 598331 598952 599382 598507 595850 592033 588469 586285 585430 584988 584419 584228 585243 587515 590191 592262
51634E92262Q21p10k114k815k485j549r03j065j749k264k315k353l059m366n208
$$ 592262 593083 592373 590259 587444 584959 583410 582507 581442 579693 577429 575114 572761 569702 565336 560128
51619E60128m609k909j447r51q15j50J041K166K990L649M010L854L624M253N970
$$ 560128 555519 552610 551163 550212 549397 549247 550288 552454 555444 559093 563103 566957 570581 574834 580804
51604E80804P803Q619Q374P984Q095Q213P033L676j173n363o940n961m380l907
$$ 580804 588607 597226 605600 613584 621679 629892 636925 640601 639428 634065 627125 621164 616784 612877
51590F12877m291m017k328N8J948K632J772p23m166p029q194q094q079q707r249
$$ 612877 608586 604569 602241 602299 604247 606879 608651 607928 603762 596733 588539 580445 572366 563659 554410
51575E54410q775p196n178l630l315m294n429n112k951l05J278J628J483J072
$$ 554410 545635 538439 533261 529631 526316 522022 516593 511481 508530 508225 509503 511131 512614 513686
51561E13686J27r36r88K39J396R67q11k035j223J051K731K458R92L18J457L501
$$ 513686 513813 512877 511889 512128 513524 514491 513680 511645 510422 511473 514204 516662 517654 517972 519429 522930
51545E22930M774M478K927Q38j017j860j410l68K77M24Q63K120L872N529O725
$$ 522930 527704 532182 535109 535947 534930 533070 531660 531292 531569 531993 532856 534976 538848 544377 551102
51530E51102P144O593N448M439L697K565P53r53j561j093m01n9J40P44K112M323
$$ 551102 558246 564839 570287 574726 578423 580988 581741 580788 579227 578134 577733 577674 577814 578558 580670 584993
51514E84993P243J0589J3751J5698J5558J3753J2142J2178J3135J3117J1692J0360
$$ 584993 592236 602825 616576 632274 647832 661585 673727 685905 699040 712157 723849 734209
51502G34209J0207J0502J0291J0157J1409J4393J8471K2787K6124K6929K4880
$$ 734209 744416 754918 765209 775366 786775 801168 819639 842426 868550 895479 920359
51491I20359K1671J8941J6068J1542N832R52k621o457j1443j6528k0807k4742
$$ 920359 942030 960971 977039 988581 994413 995365 992744 986287 974844 958316 937509 912767
51479I12767k8363l0081k8829k6064k3940k2598k0831j8727j7559j7383j6575
$$ 912767 884404 854323 825494 799430 775490 752892 732061 713334 695775 678392 661817
51468F61817j4132j0891q114o155m998m873n486n562m176k075q53j102j981k459
$$ 661817 647685 636794 628680 622525 617527 612654 607168 601606 597430 595355 594502 593400 591419 588960
51454E88960k254j597p03K92J178J727J817J470P87j18j207k522m005n239n550
$$ 588960 586706 585109 584406 584698 585876 587603 589420 590890 591677 591559 590352 587830 583825 578586 573036
51439E73036m538k709j377j561k883l883l591k503j750j771k251k953l812m362
$$ 573036 568498 565789 564412 562851 559968 556085 552494 549991 548241 546470 544219 541266 537454 533092
51425E33092l983k930k279k497k804k446j774j436j182m81J30m62k152l486l523
$$ 533092 529109 526179 523900 521403 518599 516153 514379 512943 511761 511280 511410 510948 508796 505310 501787
51410E01787k856k459k438k502k747l188l114j886j05R01O58k4j65M03J231J837
$$ 501787 498931 496472 494034 491532 488785 485597 482483 480597 480492 481393 482051 482027 481862 482265 483496 485333
51394D85333K021J996K138K378K123J315J082K504M930O603O993P329Q556R970
$$ 485333 487354 489350 491488 493866 495989 497304 498386 500890 505820 512423 519416 526745 535301 545271
51380E45271J0504J0252R762Q810P035N220M620N209N657M899K868q3l357n853
$$ 545271 555775 566027 575789 584599 591634 596854 601474 606683 612340 617239 620107 620024 616667 610814
51366F10814o764o818p476q708q802o902m372k934k649k756l271m233m286j933
$$ 610814 604050 597232 589756 581048 572246 565344 560972 558038 555389 552633 549362 545129 540843 538910
51352E38910J872M201L586J672Q66J504K200K041J467J309J797K462K630K163
$$ 538910 540782 544983 548569 550241 551107 552611 554811 556852 558319 559628 561425 563887 566517 568680
51338E68680J863K644M082M514L113J210P17J721K680K797L091M852P873J0712
$$ 568680 570543 573187 577269 581783 584896 586106 586823 588544 591224 594021 597112 601964 609837 620549
51324F20549J2141J2053J1407J1570J3341J6357J9679K2948K6484L0139L2842
$$ 620549 632690 644743 656150 667720 681061 697418 717097 740045 766529 796668 829510
51313H29510L3735L3107L1715K9655K6584K2730J8768J4725R745L235m198j1250
$$ 829510 863245 896352 928067 957722 984306 1007036 1025804 1040529 1050274 1053509 1049311 1038061
51301A038061j7120k1987k6335k9980l2049l2070l0975l0412l0944l1426l0486
$$ 1038061 1020941 998954 972619 942639 910590 878520 847545 817133 786189 754763 724277
51290G24277k8093k5195k2335j9371j6275j3455j1326j0117r866j0043r448p473
$$ 724277 696184 670989 648654 629283 613008 599553 588227 578110 568244 558201 548753 541280
51278E41280n294m740n860o764o148m763l793l086k088j604k924n449o732n420
$$ 541280 535986 531246 525386 518622 512474 507711 503918 500832 498744 497140 494216 488767 482035 476615
51264D76615k993j901k638l455k711o45J269J997J560M69p40j389r25L34J311
$$ 476615 473622 471721 469083 465628 462917 462272 463541 465538 467098 467567 466827 465438 464513 464847 466158
51249D66158J473J531K144K638K090J218J697L506M574L582J679M62l68j966l966
$$ 466158 467631 469162 471306 473944 476034 477252 478949 482455 487029 490611 492290 492752 492384 490418 486452
51234D86452m812m042k708j646p47%J49k09j52P16J485J050n19k066k450j413
$$ 486452 481640 477598 474890 473244 472497 472497 472646 472437 472285 473001 474486 475536 475017 472951 470501 469088
51218D69088K36J359J857K948N239O948N514J232k328k357J2J528Q35n97q63M45
$$ 469088 469324 470683 472540 475488 480727 487675 493189 494421 492093 489736 489748 491276 492111 491514 490651 491096
51202D91096K475M015M081K516K29j657k855l534l322j659Q71K641K706J590J86
$$ 491096 493571 497586 501667 504183 504412 502755 499900 496366 493044 491385 492256 494897 497603 499193 499379
51187D99379j212k409k753j876m59N89J263K053K686K242N47j359k459k788k844
$$ 499379 498167 495758 493005 491129 490670 491259 492522 494575 497261 499503 500050 498691 496232 493444 490600
51172D90600k451r28J657L855L931J614j399k985k684j919j963k195j148J019
$$ 490600 488149 487221 488878 492733 496664 498278 496879 493894 491210 489291 487328 485133 483985 485004
51158D85004K238J159r15j645n66P34J096J125J746K577K658K031J660K004K596
$$ 485004 487242 488401 487486 485841 485275 486009 487105 488230 489976 492553 495211 497242 498902 500906 503502
51143E03502L060L700M706N379M760K883R39P4K34M13o1p13n31P53K143K212M08
$$ 503502 506562 510262 514968 520347 525107 527990 528929 529003 529237 529650 529589 528876 528345 529098 531241 533453 533861
51126E33861k403m545m768l217j324o01j357k510k661j358N53J742J659J029R02
$$ 533861 531458 526913 522145 518928 517604 517003 515646 513136 510475 509117 509670 511412 513071 514100 515002
51111E15002J297J261M69m7N63J415R89o27j859j966j730j662j050N06K002K489
$$ 515002 516299 517560 518029 517982 518545 519960 520949 520322 518463 516497 514767 513105 512055 512561 514563 517052
51095E17052K473K719K691J575N8l93L72J289J827K207K090P72j197k222j870
$$ 517052 519525 522244 524935 526510 526568 526175 526547 527836 529663 531870 533960 534732 533535 531313 529443
51080E29443j449j835k127j343j98r9j073j824j520o41j44l79q48p28L74K046
$$ 529443 527994 526159 524032 522689 522491 522392 521319 519495 517975 517334 517190 516811 515963 515235 515609 517655
51064E17655L556M544M999M789L857K713K039J896K030K751M379N945N917M494
$$ 517655 521211 525755 530754 535543 539400 542113 544152 546048 548078 550829 555208 561153 567070 571564
51050E71564L741M649N576M705K727J629J708J626R62Q26J702K369J673J94p32
$$ 571564 575305 579954 585530 590235 592962 594591 596299 597925 598887 599713 601415 603784 605457 605651 604919
51035F04919r01j197j991k533k081j034m47o86j091j000o22m86n62m33j86k81
$$ 604919 604018 602821 600830 598297 596216 595182 594735 594049 592958 591958 591336 590850 590288 589855 589669 589388
51019E89388o61o79o4O90J014P10k50j543k085r28J216K425K028J561K617M842
$$ 589388 588727 588048 587984 588674 589688 590398 590148 588605 586520 585592 586808 589233 591261 592822 595439 600281
51003F00281O803P773P742O779N548N520P254R279J0008J0003J0758J1987J2012
$$ 600281 607084 614857 622599 629378 634926 640446 647700 656979 666987 676990 687748 699735 711747
50990G11747J0559R136Q605Q396Q373R458J1504J2489J0994Q120N671L694J246
$$ 711747 722306 731442 740047 748443 756816 766274 777778 790267 801261 809381 815052 818746 819992
50977H19992j433l142l700m164n130o114o696p238q098r034r706j0149j0299r612
$$ 819992 818559 815417 811717 807553 802423 796309 789613 782375 774277 765243 755537 745388 735089 725477
50963G25477p735n321l645l228l180k089M67L461N451N852N231M665M982O262
$$ 725477 717742 712421 708776 705548 702368 700279 700746 704207 709658 715510 720741 725406 730388 736650
50949G36650P666Q050P096N765N162N225N143M799N002O115P340P681P033N869
$$ 736650 744316 752366 759462 765227 770389 775614 780757 785556 790558 796673 804013 811694 818727 824596
50935H24596M560L473L178L873M830N136M844M866N717O854P270O543N206M288
$$ 824596 829156 832629 835807 839680 844510 849646 854490 859356 865073 871927 879197 885740 890946 895234
50921H95234M448N323N762M958L285J838J202R36L17o98j476j547j064k97J013
$$ 895234 899682 905005 910767 915725 919010 920848 922050 922986 923303 922605 921129 919582 918518 918221 919234
50906I19234L315O189Q226Q466P687P700R307J1497J2796J2961J3070J4249J6626
$$ 919234 922549 928738 936964 945430 953117 960817 970124 981621 994417 1007378 1020448 1034697 1051323
50893A051323J9406K1565K2555K2516K2077K1997K2863K4808K7255K9078K9411
$$ 1051323 1070729 1092294 1114849 1137365 1159442 1181439 1204302 1229110 1256365 1285443 1314854
50882A314854K8442K7378K7591K9642L2727L4843L4037L0027K4499J9414J5289
$$ 1314854 1343296 1370674 1398265 1427907 1460634 1495477 1529514 1559541 1584040 1603454 1618743
50871A618743J1516P866M750K110q74m578q267j1218j3988j7834k2962k7873l0685
$$ 1618743 1630259 1638125 1642875 1644985 1644111 1639533 1631266 1620048 1606060 1588226 1565264 1537391 1506706
50858A506706l1029l0420l0552l1285l1023k9142k7088k6223k5583k3264j9580
$$ 1506706 1475677 1445257 1414705 1383420 1352397 1323255 1296167 1269944 1244361 1221097 1201517
50847A201517j6940j6425j6346j4969j3012j2248j2939j4017j4823j5228j4726
$$ 1201517 1184577 1168152 1151806 1136837 1123825 1111577 1098638 1084621 1069798 1054570 1039844
50836A039844j2955j0741r261q400p148n403m010l303k876k757l239l571k467
$$ 1039844 1026889 1016148 1006887 998487 991339 985936 981926 978623 975747 972990 969751 966180 963713
50823I63713l24P60n1q68K06K189K592R65o25n39N59J192J254J873L534N376O465
$$ 963713 963389 964149 964098 963230 963436 965625 968217 969182 968557 968018 968577 969769 971023 972896 976430 981806 988271
50806I88271P176Q625J0835J2276J1796J0471J0524J2583J5113J6709J7743J9116
$$ 988271 995447 1004072 1014907 1027183 1038979 1049450 1059974 1072557 1087670 1104379 1122122 1141238
50794A141238K0599K1493K2190K3663K5707K7035K7282K7754K9737L2810L5394
$$ 1141238 1161837 1183330 1205520 1229183 1254890 1281925 1309207 1336961 1366698 1399508 1434902
50783A434902L6566L6894L7646L9411M1401M2224M1609M0992M1831M3626M4548
$$ 1434902 1471468 1508362 1546008 1585419 1626820 1669044 1710653 1751645 1793476 1837102 1881650
50772A881650M3977M3307M3870M5143M5840M5912M6375M7620M9116N0803N3504
$$ 1881650 1925627 1968934 2012804 2057947 2103787 2149699 2196074 2243694 2292810 2343613 2397117
50761B397117N7483O1334O3093O2233N9909N7285N4027M8779M0875L1190K1157
$$ 2397117 2454600 2515934 2579027 2641260 2701169 2758454 2812481 2861260 2902135 2933325 2954482
50750B954482J1295J130r459j9405k7371l3173l7833m2175m5743m7306m6318m3651
$$ 2954482 2965777 2966907 2957448 2938043 2910672 2877499 2839666 2797491 2751748 2704442 2658124 2614473
50738B614473m0681l7689l3593k7565k0505j4070q396j866O311J4324J9631K2124
$$ 2614473 2573792 2536103 2502510 2474945 2454440 2440370 2431974 2430108 2436419 2450743 2470374 2492498
50726B492498K4213K7718L1783L4213L4047L1996K8923K4846J9752J4617J0758
$$ 2492498 2516711 2544429 2576212 2610425 2644472 2676468 2705391 2730237 2749989 2764606 2775364
50715B775364Q024M497j317q389j4372j8808k3831l1127l9509m6583n1825n6623
$$ 2775364 2783388 2787885 2786568 2778179 2763807 2744999 2721168 2690041 2650532 2603949 2552124 2495501
50703B495501o1792o6564o9879p1287p0609o7988o4438o1229n8543n5650n2284
$$ 2495501 2433709 2367145 2297266 2225979 2155370 2087382 2022944 1961715 1903172 1847522 1795238
50692A795238m8586m3959l7683l0919k6177k4098k2450j9188j4872j1026p715
$$ 1795238 1746652 1702693 1665010 1634091 1607914 1583816 1561366 1542178 1527306 1516280 1508565
50681A508565m174m16L372P784J2792J6574J7742J7964K0122K4268K7630K8654
$$ 1508565 1504391 1503975 1507347 1515131 1527923 1544497 1562239 1580203 1600325 1624593 1652223 1680877
50669A680877K8820K9948L1632L2297L1308K9093K6261K3619K2308K2889K4463
$$ 1680877 1709697 1739645 1771277 1803574 1834882 1863975 1890236 1913855 1936163 1959052 1983515
50658A983515K5268K4203K1783J9727J9421K0424K0896J9835J8292J7734J8159
$$ 1983515 2008783 2032986 2054769 2074496 2093917 2114341 2135237 2155072 2173364 2191098 2209257
50647B209257J8998K0865K4643K9275L2542L4105L5803L8609M1244M2503M2895
$$ 2209257 2228255 2249120 2273763 2303038 2335580 2369685 2405488 2444097 2485341 2527844 2570739
50636B570739M2940M1624L8046L3309K9204K5920K2579J9426J7853J8444K0137
$$ 2570739 2613679 2655303 2693349 2726658 2755862 2781782 2804361 2823787 2841640 2860084 2880221
50625B880221K1478K2049K2648K4480K7915L1821L4590L6122L8135M2239M8541
$$ 2880221 2901699 2923748 2946396 2970876 2998791 3030612 3065202 3101324 3139459 3181698 3230239
50614C230239N6450O5651P5594Q5111R3523J01179J08002J12553J13718J12353
$$ 3230239 3286689 3352340 3427934 3513045 3606568 3707747 3815749 3928302 4042020 4154373
50604D154373J09860J06042J00014R2518Q5406P9029P2090O4190N6683N0348M3892
$$ 4154373 4264233 4370275 4470289 4562807 4648213 4727242 4799332 4863522 4920205 4970553 5014445
50593E014445L5632K5607J5081M740n646j6142k5995l3996l9132m1056m0129l7134
$$ 5014445 5050077 5075684 5090765 5095505 5089859 5073717 5047722 5013726 4974594 4933538 4893409 4856275
50581D856275l2987k8727k5094k1634j6810r982k960J507K699K270J620J47l467
$$ 4856275 4823288 4794561 4769467 4747833 4731023 4721041 4718081 4719588 4722287 4724557 4726177 4726324 4722857
50568D722857r322j6233k2830k8085l1616l4126l7023m1107m6066n1556n7702
$$ 4722857 4713535 4697302 4674472 4646387 4614771 4580645 4543622 4502515 4456449 4404893 4347191
50557D347191o3820o7594o6796o1490n3504m4157l3750k3108j3933p140k053J860
$$ 4347191 4283371 4215777 4148981 4087491 4033987 3989830 3956080 3932972 3919039 3911899 3909846 3911706
50545C911706L475J247m601j2225k0270k8737l7910m7475n6965o6080p4119p9924
$$ 3911706 3915181 3916428 3911827 3899602 3879332 3850595 3812685 3765210 3708245 3642165 3568046 3488122
50533C488122q3008q4184q4494q4060q2618q0465p7907p4304o8802o1883n5039
$$ 3488122 3405114 3320930 3236436 3152376 3069758 2989293 2911386 2837082 2768280 2706397 2651358
50522B651358m8943m3126l7535l2968k9417k5272j9227j2094n733p85L464P539
$$ 2651358 2602415 2559289 2521754 2488786 2459369 2434097 2414870 2402776 2397043 2396258 2399722 2407261
50510B407261J1293J4806J8502K2162K4835K6157K7045K8602L0832L3089L5495
$$ 2407261 2418554 2433360 2451862 2474024 2498859 2525016 2552061 2580663 2611495 2644584 2680079
50499B680079L9144M4642N1086N7175O3162P0702Q0374R0276R8021J03444J08033
$$ 2680079 2719223 2763865 2814951 2872126 2935288 3005990 3086364 3176640 3274661 3378105 3486138
50488C486138J12031J13848J12680J10054J07857J06202J04285J02338J01400
$$ 3486138 3598169 3712017 3824697 3934751 4042608 4148810 4253095 4355433 4456833
50479D456833J01875J03430J05831J08802J11565J13610J15415J17401J18806
$$ 4456833 4558708 4662138 4767969 4876771 4988336 5101946 5217361 5334762 5453568
50470E453568J18879J18645J20001J23223J26778J29484J31487J33187J34550
$$ 5453568 5572447 5691092 5811093 5934316 6061094 6190578 6322065 6455252 6589802
50461F589802J35645J36538J36404J33875J28190J18769J03945Q2222N5193K7160
$$ 6589802 6725447 6861985 6998389 7132264 7260454 7379223 7483168 7565390 7620583 7647743
50451G647743P61k5363n3391q2325j08837j30950j49062j63854j74918j81336
$$ 7647743 7648504 7623141 7569750 7487425 7378588 7247638 7098576 6934722 6759804 6578468
50441F578468j82266j76974j65505j49472j31078j11174q9273o5681m2647k2812
$$ 6578468 6396202 6219228 6053723 5904251 5773173 5661999 5572726 5507045 5464398 5441586
50431E441586p114N139J4433J9745J9067J1152l209k1653m2147o4094q7317j10233
$$ 5441586 5434472 5439611 5454044 5473789 5492856 5504008 5500799 5479146 5436999 5372905 5285588 5175355
50419E175355j29982j44675j54866j62333j67773j70370j69413j65593j60404
$$ 5175355 5045373 4900698 4745832 4583499 4415726 4245356 4075943 3910350 3749946
50410C749946j54830j48985j42591j35263j26626j16823j06907r8025r0075q1925
$$ 3749946 3595116 3446131 3303540 3168277 3041651 2924828 2817921 2719896 2629821 2547896
50400B547896p3252o5393n9590n5015m9474m1973l3851k7300k3366k1387j9882
$$ 2547896 2474644 2409251 2349661 2294646 2245172 2203199 2169348 2142048 2118682 2097295 2077413
50389B077413j7809j5267j2996j1058q493m717p68J749K880M501Q196J3646J9191
$$ 2077413 2059604 2044337 2031341 2020283 2011790 2007073 2006305 2008054 2010934 2015435 2023631 2037277 2056468
50376B056468K3212K4801K4024K2117K0940K1672K4166K7669L1769L6510M1890
$$ 2056468 2079680 2104481 2128505 2150622 2171562 2193234 2217400 2245069 2276838 2313348 2355238
50365B355238M7419N2025N4634N5398N6076N8470O2451O6246O8739P0586P3001
$$ 2355238 2402657 2454682 2509316 2564714 2620790 2679260 2741711 2807957 2876696 2947282 3020283
50354C020283P6293P9942Q3395Q6394Q9022R1603R4015R5174R4083R1285Q8332
$$ 3020283 3096576 3176518 3259913 3346307 3435329 3526932 3620947 3716121 3810204 3901489 3989821
50343C989821Q5686Q2370P7754P2262O5642N6214M2876K6801R971o918k4034m0881
$$ 3989821 4075507 4157877 4235631 4307893 4373535 4429749 4472625 4499426 4509397 4502479 4478445 4437564
50331D437564n6634p1247q4808r6295j04352j08933j10809j09842j05191r7095
$$ 4437564 4380930 4309683 4224875 4128580 4024228 3915295 3804486 3694644 3589453 3492358
50321C492358q6969p5737o3438n0633l8644k8036j8183r001j869J869K409P31
$$ 3492358 3405389 3329652 3266214 3215581 3176937 3148901 3130718 3121717 3119848 3121717 3124126 3124857
50309C124857k869q703j6757k6581l7632m9097n9687o8320p4717p8922q0716q0129
$$ 3124857 3121988 3113285 3096528 3069947 3032315 2983218 2923531 2855211 2780494 2701572 2620856 2540727
50297B540727p8200p6385p5175p3815p1438o7958o3868n9776n6263n3669n1578
$$ 2540727 2462527 2386142 2310967 2237152 2165714 2097756 2033888 1974112 1917849 1864180 1812602
50286A812602m8783m4343l8653l3155k8891k5670k2732j9790j6998j4221j1013
$$ 1812602 1763819 1719476 1680823 1647668 1618777 1593107 1570375 1550585 1533587 1519366 1508353
50275A508353p456m366k394j379j002j593l791p465j1503j4605j5985j5594j4092
$$ 1508353 1500897 1496531 1494137 1492758 1491756 1490163 1486372 1478907 1467404 1452799 1436814 1421220 1407128
50262A407128j2503j1330r981p433l612K97L000M300N104O580R263J2663J5591
$$ 1407128 1394625 1383295 1373314 1365881 1362269 1362566 1365566 1369866 1374970 1381550 1390813 1403476 1419067
50249A419067J7151J7501J7514J7764J8234J8795J9467K0012J9863J8763J7161
$$ 1419067 1436218 1453719 1471233 1488997 1507231 1526026 1545493 1565505 1585368 1604131 1621292
50238A621292J5719J4789J4616J5484J7052J7929J6768J3895J1160J0065J0578
$$ 1621292 1637011 1651800 1666416 1681900 1698952 1716881 1733649 1747544 1758704 1768769 1779347
50227A779347J1987J4012J6555J9145K1596K4609K8294L0265K6881J7214M583
$$ 1779347 1791334 1805346 1821901 1841046 1862642 1887251 1915545 1945810 1972691 1989905 1994488
50216A994488o672j4820k0153k2223k0002j4470q763n014k560P9K960N355P183
$$ 1994488 1987816 1972996 1952843 1930620 1910618 1896148 1887385 1882371 1879811 1879890 1882850 1888205 1895388
50203A895388Q643R451R714J0712J3480J7254K0617K3598K7200L1387L5186L8648
$$ 1895388 1904031 1913482 1923196 1933908 1947388 1964642 1985259 2008857 2036057 2067444 2102630 2141278
50191B141278M2960M8550N4705O1447P0064Q0920R2227J02030J10389J18473J26221
$$ 2141278 2184238 2232788 2287493 2348940 2419004 2499924 2592151 2694181 2804570 2923043 3049264
50180C049264J32089J34585J33027J27166J17292J04854R2161Q1119P2395O5436
$$ 3049264 3181353 3315938 3448965 3576131 3693423 3798277 3890438 3971557 4043952 4109388
50170D109388N8720N0200L8304K2631L533j8686m3556o9609r4444j15879j32791
$$ 4109388 4168108 4218308 4256612 4279243 4282776 4264090 4220534 4150925 4056481 3940602 3807811
50159C807811j45029j52843j56355j55333j49687j40458j29767j19186j08664
$$ 3807811 3662782 3509939 3353584 3198251 3048564 2908106 2778339 2659153 2550489
50150B550489r7886q8204q1781p8753p6597p2954o7935o2955n8345n3277m7435
$$ 2550489 2452603 2364399 2282618 2203865 2127268 2054314 1986379 1923424 1865079 1811802 1764367
50139A764367m1435l5849l0849k6835k4392k3352k2569k0989j8556j6009j4110
$$ 1764367 1722932 1687083 1656234 1629399 1605007 1581655 1559086 1538097 1519541 1503532 1489422
50128A489422j3071j2327j0952q720o522n263m721m162l625l481l113j373J515
$$ 1489422 1476351 1464024 1453072 1444352 1437830 1432567 1427846 1423684 1420059 1416578 1413465 1412092 1413607
50115A413607L935N085N822O913P881Q285Q663R310R676J0061J2165J6291J9645
$$ 1413607 1417542 1422627 1428449 1435362 1443243 1451528 1460191 1469501 1479177 1489238 1501403 1517694 1537339
50102A537339J9638J7734J7409J9138K0323K0091K0811K4003K7697K9481K9980
$$ 1537339 1556977 1574711 1592120 1611258 1631581 1651672 1672483 1696486 1724183 1753664 1783644
50091A783644L1306L3726L5843L7161L8577M0727M3279M5632M7308M8100M8652
$$ 1783644 1814950 1848676 1884519 1921680 1960257 2000984 2044263 2089895 2137203 2185303 2233955
50080B233955N0332N3748N8080O2646O8253P5964Q5469R5897J07503J21065J36196
$$ 2233955 2284287 2338035 2396115 2458761 2527014 2602978 2688447 2784344 2891847 3012912 3149108
50069C149108J51716J67411J83981K01319K18114K32884K44142K49829K48327
$$ 3149108 3300824 3468235 3652216 3853535 4071649 4304533 4548675 4798504 5046831
50060E046831K40385K28750K15605K01470J86836J73230J61644J50738J37340
$$ 5046831 5287216 5515966 5731571 5933041 6119877 6293107 6454751 6605489 6742829
50051F742829J18204R1113N5335J2225l4864q1925j25833j64875j98434k26555
$$ 6742829 6861033 6952146 7007481 7019706 6984842 6902917 6777084 6612209 6413775 6187220
50041F187220k49268k65983k75728k78189k74245k65418k53090k38336k22111
$$ 6187220 5937952 5671969 5396241 5118052 4843807 4578389 4325299 4086963 3864852
50032C864852k05333j88810j73011j57775j42641j27826j14543j03670r4470q5378
$$ 3864852 3659519 3470709 3297698 3139923 2997282 2869456 2754913 2651243 2556773 2471395
50022B471395p5937o7179o0144n4865n0766m7118m2994l7817l2391k8549k7100
$$ 2471395 2395458 2328279 2268135 2213270 2162504 2115386 2072392 2034575 2002184 1973635 1946535
50011A946535k6676k5232k2262j9111j7384j7466j8309j8319j6719j4386j3043
$$ 1946535 1919859 1894627 1872365 1853254 1835870 1818404 1800095 1781776 1765057 1750671 1737628
50000A737628j3321j4002j3511j1864j0526j0412j0686r892p901o088n485n389
$$ 1737628 1724307 1710305 1696794 1684930 1674404 1663992 1653306 1643414 1635513 1629425 1623940 1618551
$$ [...]
##END NTUPLES=NMR SPECTRUM
##END=
