
##TITLE=AC1002_Guinea_6278607_ac5B1C9jLt
##JCAMPDX= 6.0         $$ Bruker NMR JCAMP-DX V2.0
##DATA TYPE= NMR SPECTRUM
##DATA CLASS= NTUPLES
##ORIGIN= BRUKER
##OWNER= Administrator
$$ 1.72 TOPSPIN		Version 2.1
$$ 2012-06-03 10:34:06.453 -0500  Administrator@TOPSPIN
$$ Compression mode = diff/dup
##.OBSERVE FREQUENCY= 400.13188235
##.OBSERVE NUCLEUS= ^1H
##.ACQUISITION MODE= SIMULTANEOUS (DQD)
##.ACQUISITION SCHEME= undefined
##.AVERAGES= 8
##.DIGITISER RES= 22
##SPECTROMETER/DATA SYSTEM= spect
##.PULSE SEQUENCE= zg30
##.SOLVENT NAME= COFFEE_meoh
##.SHIFT REFERENCE= INTERNAL, COFFEE_meoh, 1, 14.98061
##AUDIT TRAIL= $$ (NUMBER, WHEN, WHO, WHERE, PROCESS, VERSION, WHAT)
$$ ##TITLE= Audit trail, TOPSPIN		Version 2.1
$$ ##JCAMPDX= 5.01
$$ ##ORIGIN= Bruker BioSpin GmbH
$$ ##OWNER= Administrator
$$ $$ C:\Bruker\TOPSPIN/data/COFFEE/nmr/AC1002_Guinea_6278607_ac5B1C9jLt/10/pdata/1/auditp.txt
$$ ##AUDIT TRAIL=  $$ (NUMBER, WHEN, WHO, WHERE, PROCESS, VERSION, WHAT)
(   1,<2012-06-03 10:33:55.781 -0500>,<Administrator>,<TOPSPIN>,<go>,<TOPSPIN 2.1>,
      <created by zg
	started at 2012-06-03 10:32:48.921 -0500,
	POWCHK enabled, PULCHK disabled,
       configuration hash MD5:
       D5 CA 7A 23 FE 6B EE E2 50 67 74 61 24 F7 5E 3B
       data hash MD5: 64K
       0E D2 D8 6D A5 23 54 7E F5 7B 1B DF EB 2C 28 38>)
(   2,<2012-06-03 10:34:02.250 -0500>,<Administrator>,<TOPSPIN>,<proc1d>,<TOPSPIN 2.1>,
      <Start of raw data processing
       efp LB = 0 FT_mod = 6 PKNL = 1 PHC0 = 0 PHC1 = 0 SI = 32K 
       data hash MD5: 32K
       18 AE 1C 1A 5F 7E 3F F4 23 3C BA AD DA 20 6D 0D>)
(   3,<2012-06-03 10:34:02.562 -0500>,<Administrator>,<TOPSPIN>,<proc1d>,<TOPSPIN 2.1>,
      <pk PHC0 = 210.6079 PHC1 = 0 
       data hash MD5: 32K
       A7 D1 1D C5 C1 B9 72 65 26 D5 7B 93 57 EF 26 F7>)
(   4,<2012-06-03 10:34:02.656 -0500>,<Administrator>,<TOPSPIN>,<proc1d>,<TOPSPIN 2.1>,
      <abs ABSG = 1 
       data hash MD5: 32K
       30 E8 F2 4F E6 42 40 52 6C A7 D3 CD 2A 8A 51 47>)
(   5,<2012-06-03 10:34:02.703 -0500>,<Administrator>,<TOPSPIN>,<proc1d>,<TOPSPIN 2.1>,
      <abs ABSG = 2 
       data hash MD5: 32K
       D0 D8 3C 7D 81 99 41 A4 B5 66 48 9B FB 9A D9 EF>)
(   6,<2012-06-03 10:34:02.718 -0500>,<Administrator>,<TOPSPIN>,<proc1d>,<TOPSPIN 2.1>,
      <abs ABSG = 3 
       data hash MD5: 32K
       CD D9 BE 70 C3 52 9F ED 32 DA F1 92 14 A1 D1 65>)
(   7,<2012-06-03 10:34:02.750 -0500>,<Administrator>,<TOPSPIN>,<proc1d>,<TOPSPIN 2.1>,
      <abs ABSG = 4 
       data hash MD5: 32K
       99 7D 39 0E 9B 34 EB 0A 02 22 55 E3 2B 34 B4 3D>)
(   8,<2012-06-03 10:34:02.781 -0500>,<Administrator>,<TOPSPIN>,<proc1d>,<TOPSPIN 2.1>,
      <abs ABSG = 5 
       data hash MD5: 32K
       C6 9F 91 08 CD C6 01 E7 B2 61 85 28 2D F2 B0 73>)
$$ ##END=
$$ 
$$ $$ hash MD5
$$ $$ CF 8B 5E EC FE F8 B6 3C 2F D8 FD 47 45 2D D8 C6
##$RELAX= 
##$RELAX= 
##$RELAX= 
##$RELAX= 
##$RELAX= 
##$RELAX= 
##$RELAX= 
$$ Bruker specific parameters
$$ --------------------------
$$ [...]
##$TP= (0..7)
150 150 150 150 150 150 150 150
##$TP07= 0
##$TPNAME0= <>
##$TPNAME1= <>
##$TPNAME2= <>
##$TPNAME3= <>
##$TPNAME4= <>
##$TPNAME5= <>
##$TPNAME6= <>
##$TPNAME7= <>
##$TPOAL= (0..7)
0.5 0.5 0.5 0.5 0.5 0.5 0.5 0.5
##$TPOFFS= (0..7)
0 0 0 0 0 0 0 0
##$TUNHIN= 0
##$TUNHOUT= 0
##$TUNXOUT= 0
##$USERA1= <user>
##$USERA2= <user>
##$USERA3= <user>
##$USERA4= <user>
##$USERA5= <user>
##$V9= 5
##$VALIST= <valist>
##$VCLIST= <CCCCCCCCCCCCCCC>
##$VD= 0
##$VDLIST= <DDDDDDDDDDDDDDD>
##$VPLIST= <PPPPPPPPPPPPPPP>
##$VTLIST= <TTTTTTTTTTTTTTT>
##$WBST= 2048
##$WBSW= 25
##$XGAIN= (0..3)
0 0 0 0
##$XL= 0
##$YL= 0
##$YMAX_a= 503459
##$YMIN_a= -605736
##$ZGOPTNS= <>
##$ZL1= 120
##$ZL2= 120
##$ZL3= 120
##$ZL4= 120
##$ABSF1= 14.98061
##$ABSF2= -5.57192
##$ABSG= 5
##$ABSL= 3
##$ALPHA= 0
##$AQORDER= 0
##$ASSFAC= 0
##$ASSFACI= 0
##$ASSFACX= 0
##$ASSWID= 0
##$AUNMP= <proc_prof1d_extract_pilot.lims>
##$AXLEFT= 0
##$AXNAME= <>
##$AXNUC= <1H>
##$AXRIGHT= 0
##$AXTYPE= 0
##$AXUNIT= <>
##$AZFE= 0.1
##$AZFW= 0.1
##$BCFW= 0
##$BC_mod= 0
##$BYTORDP= 0
##$COROFFS= 0
##$CY= 15
##$DATMOD= 1
##$DC= 0
##$DFILT= <>
##$DTYPP= 0
##$F1P= 0
##$F2P= 0
##$FCOR= 0.5
##$FTSIZE= 32768
##$FT_mod= 6
##$GAMMA= 0
##$GB= 0
##$INTBC= 1
##$INTSCL= 1
##$ISEN= 128
##$LB= 0
##$LEV0= 0
##$LPBIN= 0
##$MAXI= 10000
##$MC2= 0
##$MEAN= 0
##$ME_mod= 0
##$MI= 0
##$NCOEF= 0
##$NC_proc= -8
##$NLEV= 6
##$NOISF1= 0
##$NOISF2= 0
##$NSP= 0
##$NTH_PI= 0
##$NZP= 0
##$OFFSET= 14.98061
##$PC= 1
##$PHC0= 210.6079
##$PHC1= 0
##$PH_mod= 1
##$PKNL= yes
##$PPARMOD= 0
##$PPDIAG= 0
##$PPIPTYP= 0
##$PPMPNUM= 2147483647
##$PPRESOL= 1
##$PSCAL= 4
##$PSIGN= 0
##$PYNMP= <proc.py>
##$REVERSE= no
##$SF= 400.13
##$SI= 32768
##$SIGF1= 0
##$SIGF2= 0
##$SINO= 400
##$SIOLD= 32768
##$SPECTYP= <>
##$SREGLST= <1H.CDCl3>
##$SSB= 0
##$STSI= 32768
##$STSR= 0
##$SW_p= 8223.68421052632
##$SYMM= 0
##$S_DEV= 0
##$TDeff= 65536
##$TDoff= 0
##$TI= <>
##$TILT= no
##$TM1= 0
##$TM2= 0
##$TOPLEV= 0
##$USERP1= <user>
##$USERP2= <user>
##$USERP3= <user>
##$USERP4= <user>
##$USERP5= <user>
##$WDW= 1
##$XDIM= 32768
##$YMAX_p= 456700212
##$YMIN_p= -742915
##$CURPLOT= <Network HP LaserJet P1505>
##$CURPRIN= <$Network HP LaserJet P1505>
##$DFORMAT= <normdp>
##$LAYOUT= <+/1D_H.xwp>
##$LFORMAT= <normlp>
##$PFORMAT= <normpl>
##$SURQMSG= 1
$$ End of Bruker specific parameters
$$ ---------------------------------
##NTUPLES= NMR SPECTRUM
##VAR_NAME=  FREQUENCY,     SPECTRUM/REAL,   SPECTRUM/IMAG
##SYMBOL=    X,             R,               I
##VAR_TYPE=  INDEPENDENT,   DEPENDENT,       DEPENDENT
##VAR_FORM=  AFFN,          ASDF,            ASDF
##VAR_DIM=   32768,         32768,           32768
##UNITS=     HZ,            ARBITRARY UNITS, ARBITRARY UNITS
##FACTOR=    0.250966925370066, 1,           1
##FIRST=     8223.43324360095, 148510,       -4026
##LAST=      0,             -29214,          122974
##MIN=       0,             -742915,         0
##MAX=       8223.43324360095, 456700212,    0
$$ Real data points
##PAGE= N=1
##DATA TABLE= (X++(R..R)), XYDATA
$$ [...]
19546a20566n1045d8311j01933b6180B64698b75194J27877k3138a9310q1551A69759
$$ -120566 -171611 -48311 -150244 -26180 264698 -275194 -147317 -170455 -19310 -100861 169759
19534A83484b97097A06509E193N7313O2085A2117h4435A33685o0320J2034b81183
$$ 183484 -297097 106509 5193 62506 124591 12117 -84435 133685 73365 85399 -281183
19522A36334m154f8952K9276q1653N6882B99923j49738d0299j2740a084k02686
$$ 136334 132180 -68952 -39676 -121329 -64447 299923 150185 -40299 -53039 -1084 -203770
19511b03770A73363D3704c87851l2413b74A09173j6122B3404g4911j69315l0265
$$ -203770 173363 43704 -387851 -420264 -274 109173 93051 23404 -74911 -244226 -274491
19500b74491A06142a05186j28464R7046A33768b90859J30845H7972a37300j10202
$$ -274491 106142 -105186 -233650 -136604 133768 -290859 -160014 87972 -137300 -247502
19490b47502A03967a54063H0530B8786d50050D7908a76514B90588h5709K4652
$$ -247502 103967 -154063 80530 28786 -450050 47908 -176514 290588 -85709 -61057
19480f1057j40317I8360a2723A34395b1338j23778O6076A39293a72904k4376A72339
$$ -61057 -201374 98360 -12723 134395 -21338 -145116 -79040 139293 -172904 -197280 172339
19468E7091J13381i822n3472j21086B9810J77675i1655L194p9682B17121a80818
$$ 57091 170472 -9822 -63294 -184380 29810 207485 -91655 -88461 -168143 217121 -180818
19456b83751C99361I1015b30039B01572K08438b15119k69902J98056C51378d6145
$$ -283751 399361 91015 -230039 201572 410010 -215119 -485021 -286965 351378 -46145
19445c5318o5609K7945A7590b76338A16265K54855b51549B16158b04250i361B034
$$ -35318 -100927 -72982 17590 -276338 116265 371120 -251549 216158 -204250 -9361 2034
19433a98932c7027F1724J46074a99469e9425m2267G06f8238I3982c47378a07969
$$ -198932 -37027 61724 207798 -199469 -59425 -101692 706 -68238 93982 -347378 -107969
19421A55693g6845j08275J5278m9537R3530e3821C36485a72850l06887a36498
$$ 155693 -76845 -185120 -169842 -219379 -125849 -53821 336485 -172850 -479737 -136498
19410i1716C2642Q5184l3251d0133I3924b27884K9464L5709b905o4729C4500c75691
$$ -91716 32642 117826 84575 -40133 93924 -227884 -198420 -162711 -2905 -67634 34500 -375691
19397b16797I580O0486h9174l2131p0745f8168k71947G1933L2794k7760c76628
$$ -216797 9580 70066 -89174 -121305 -192050 -68168 -340115 71933 104727 76967 -376628
19385A14168a16509D9290M0854a15006I669d8878k06787m5069C3372L7121J4658
$$ 114168 -116509 49290 90144 -115006 9669 -48878 -255665 -300734 33372 70493 85151
19374H5151J78514E1217a49340J280B35703a49191C35289a38894c243j95749k01658
$$ 85151 263665 51217 -149340 -148060 235703 -149191 335289 -138894 -3243 -198992 -400650
19363d00650c7441A6604a31739k4408G1887h4953j93073G3394a99638B18862b31597
$$ -400650 -37441 16604 -131739 -156147 71887 -84953 -278026 73394 -199638 218862 -231597
19351g5275A76467O8784A5072J86343a01790l604j0291A7077N4158a74794A10741
$$ -75275 176467 245251 15072 201415 -101790 -105394 -115685 17077 71235 -174794 110741
19339a11843c8994j39544a772l49694R8725d8659p0410a0149k0141F167Q2857
$$ -111843 -38994 -178538 -1772 -351466 -252741 -48659 -119069 -10149 -30290 6167 89024
19328H9024A5370a70762C9476b92851K2977J18800e6077C9961g6731B55084b21637
$$ 89024 15370 -170762 39476 -292851 -269874 -151074 -56077 39961 -76731 255084 -221637
19316c76087M367J23508g9383A05828b76698f8555C25526A59392a42826j18414
$$ -376087 -371720 -248212 -79383 105828 -276698 -68555 325526 159392 -142826 -261240
19306b61240j07358J53391B158J00650j6499b32158p2176b5366E2372a06970K575
$$ -261240 -368598 -215207 2158 102808 86309 -232158 -304334 -25366 52372 -106970 -104395
19295a04395I7320J12314c9606A11701C7299A351a0510I5923a08722C5072N0749
$$ -104395 97320 209634 -39606 111701 37299 1351 -10510 95923 -108722 35072 85821
19284H5821b01445Q7498d515r7125k382j48011c1744j43629i541k40240A34804
$$ 85821 -201445 -113947 -4515 -101640 -104022 -252033 -31744 -175373 -9541 -249781 134804
19272C14526J7695a04228I1825J6930k6346B4264i1444A13719L9251b65173B04890
$$ 314526 332221 -104228 91825 108755 82409 24264 -91444 113719 152970 -265173 204890
19260C12213q9445a27661J2975l45971F7795a62993A13566b03302A84677e6248
$$ 312213 222768 -127661 -114686 -460657 67795 -162993 113566 -203302 184677 -56248
19249g1879c3517j78512C871M9861a73833J5436M6335k94577a26768A32505k7590
$$ -71879 -33517 -212029 3871 53732 -173833 -158397 -112062 -406639 -126768 132505 104915
19238A04915a56762E8629J87292c6501A28908d6498B27483a73509A9389b46869
$$ 104915 -156762 58629 245921 -36501 128908 -46498 227483 -173509 19389 -246869
19227a53525k223O2877j26162b794n1615l2014A28064b52746D0204J44544A6704
$$ -153525 -155748 -92871 -219033 -2794 -54409 -86423 128064 -252746 40204 184748 16704
19215a13286M6136B42281a0556C6095a23060B67906c02336P0031M1554a1706k22511
$$ -113286 -67150 242281 -10556 36095 -123060 267906 -302336 -232305 -190751 -11706 -234217
19204b34217B18875a10977L535k88815B49448E4845j1286c60408I47e824A5217
$$ -234217 218875 -110977 -107442 -396257 249448 54845 43559 -360408 947 -5824 15217
19192h8166K3245r7407j72274a35731o708a9862j04299B16806C667N9465A5740
$$ -88166 -64921 -162328 -334602 -135731 -142439 -19862 -124161 216806 3667 63132 15740
19180a24904D944f2339r2829k20560d7354a328I9246b98724o748e5243j14972
$$ -124904 4944 -62339 -155168 -375728 -47354 -1328 99246 -298724 -305472 -55243 -170215
19169a70215e9109j69692G0942a75760K8953A97005K2459E0327g9880j05238E2972
$$ -170215 -59109 -228801 70942 -175760 -146807 197005 219464 50327 -79880 -185118 52972
19157H7683g0825K9186r6119j5894q425m5687C2983J41839H1265g0494B1392i3009
$$ 87683 -70825 -41639 -137758 -153652 -162077 -207764 32983 174822 81265 -70494 21392 -93009
19144B11287E173K37570A5530c3861D2498Q9573c96647a35390j5647C0299J9692
$$ 211287 5173 242743 15530 -33861 42498 132071 -396647 -135390 -151037 30299 49991
19133D9991b9487j83662A88837d19539B041O0035b21479C20442e0001k61880e1581
$$ 49991 -29487 -213149 188837 -419539 2041 62076 -221479 320442 -50001 -311881 -51581
19121A78420a07028A29400b33410D3357J82627f7660B07857K9356g7877D805L50047
$$ 178420 -107028 129400 -233410 43357 225984 -67660 207857 237213 -77877 4805 354852
19110C54852F6648a48125k68331a92942A85826O4669q0379a76943b6679p4868
$$ 354852 66648 -148125 -416456 -192942 185826 250495 170116 -176943 -26679 -101547
19100a01547B95166a4620F6839K70059a87606A25581b08399d6092G6470e8070
$$ -101547 295166 -14620 66839 336898 -187606 125581 -208399 -46092 76470 -58070
19089F722h2412J6705n6324M0961A14911R6316I1933b44477l737g7202A71678
$$ 6722 -82412 -65707 -122031 -81070 114911 211227 91933 -244477 -248214 -77202 171678
19077b15356B49195b0746k6009k30204B40921a96751L6540p2969A38984h781A78656
$$ -215356 249195 -20746 -46755 -276959 240921 -196751 -160211 -233180 138984 -8781 178656
19065b01940m6329l38040A32142a69709A70525h0170H9081K8697a21417A50163
$$ -201940 -248269 -586309 132142 -169709 170525 -80170 89081 117778 -121417 150163
19054a55385k1100B886Q8417K0368i9116I9687A5998e6296k04750D2552d98206
$$ -155385 -176485 2886 91303 111671 -99116 99687 15998 -56296 -261046 42552 -498206
19042a41910D139L6995c75288A87969h8771l46702h0850j40299p6228P3681A71494
$$ -141910 4139 41134 -375288 187969 -88771 -435473 -80850 -221149 -297377 -223696 171494
19030B34637b22395J01117l4981C25173A52891a66155a4768A48201b94064H4773
$$ 234637 -222395 -121278 -156259 325173 152891 -166155 -14768 148201 -294064 84773
19019g2165A25173a93339e4010o1614B9060K92809b4468B91629A16946e9419c995
$$ -72165 125173 -193339 -54010 -115624 29060 321869 -24468 291629 116946 -59419 -3995
19007A26596l9284d8197A66956q0706f1333l891j83770r1058m0522a33070m2052
$$ 126596 87312 -48197 166956 86250 -61333 -65224 -248994 -340052 -380574 -133070 -175122
18996a75122C35374a21274C7417b49385B37589L9517A5120M8955e6726a6173j17102
$$ -175122 335374 -121274 37417 -249385 237589 277106 15120 64075 -56726 -16173 -133275
18985a33275G6547c5324o1312l6580b6457l9530k93884A14356k5934g1842k48419
$$ -133275 76547 -35324 -96636 -133216 -26457 -65987 -359871 114356 88422 -71842 -320261
18974c20261A11897G034K19603i9139j10032c7584C69156c13317J14008Q9186
$$ -320261 111897 7034 226637 -99139 -209171 -37584 369156 -313317 -199309 -110123
18964a10123j7283c6617o104j13795C04540a39159F5745H518J3402a65933G0888
$$ -110123 -127406 -36617 -42721 -156516 304540 -139159 65745 8518 21920 -165933 70888
18952d04951B8591i4270d2310A13868b88227d1244j28947H8664e3045j0879j66718
$$ -404951 28591 -94270 -42310 113868 -288227 -41244 -170191 88664 -53045 -63924 -230642
18941b30642l5114P2465a2539B35573c2377C33432A20036J83411G8741a54218
$$ -230642 -265756 -193291 -12539 235573 -32377 333432 120036 303447 78741 -154218
18930b27970K172G4541a93534n7577O8796K8147m2331A97674a65792K3301j25299
$$ -227970 -225798 74541 -193534 -251111 -182315 -154168 -196499 197674 -165792 -142491 -267790
18919b67790b3389k16523L9312B44368i7358B8506i5472m3800c9766q5284M118
$$ -267790 -23389 -239912 -200600 244368 -97358 28506 -95472 -139272 -39766 -125050 -120932
18908a20932B1862N6999i935C960b34860b1633k88254c2564C84176E7562R4067
$$ -120932 21862 78861 -9935 3960 -234860 -21633 -309887 -32564 384176 57562 151629
18897A51629j1912o4125a03187k9281d1553j4554M865p1673A7375c4712p08203
$$ 151629 139717 75592 -103187 -132468 -41553 -56107 -51242 -122915 17375 -34712 -742915
18886g42915D702c603p7886L7310j71464E4167a48534j03089I2300g2062C17397
$$ -742915 4702 -3603 -81489 -44179 -215643 54167 -148534 -251623 92300 -72062 317397
18874B6764Q7264c91140A50076N926d1332m4345B15923a53647A16475a48937O6568
$$ 26764 114028 -391140 150076 156002 -41332 -85677 215923 -153647 116475 -148937 -82369
18863h2369C8437R5781b21249G4239P0158A2485N2762a76670B62051a11445m008
$$ -82369 38437 134218 -221249 74239 144397 12485 65247 -176670 262051 -111445 -115453
18852a15453m769B2456c8735I472b8366j10510i692A79314b46627A17252a28576
$$ -115453 -120222 22456 -38735 9472 -28366 -138876 -9692 179314 -246627 117252 -128576
18840a90623A11456b78526Q8681g2717o2346A55084a10917r2273A23954b62811
$$ -190623 111456 -278526 -189845 -72717 -135063 155084 -110917 -203190 123954 -262811
18829E2296J943J51230b10883a201k635r5824L8714m6941B09295n5161a19452
$$ 52296 54239 205469 -210883 -1201 -3836 -99660 -60946 -107887 209295 154134 -119452
18817a08550c7127j31999A68478b7007j65715g2839m2537E5696J90132a92666
$$ -108550 -37127 -169126 168478 -27007 -192722 -72839 -115376 55696 245828 -192666
18806b98778Q8383j6544C02750j21138m0627R4015C2278c97856b5770G288a36198
$$ -298778 -210395 -226939 302750 181612 140985 235000 32278 -397856 -25770 7288 -136198
18794c2556A6630A014J51216i7732k382j82561A5497K4540a14813j5848K8736
$$ -32556 16630 1014 152230 -97732 -100114 -282675 15497 40037 -114813 -130661 -101925
18783a01925D9470c09201a14048I7869h7994A34575b14321N5535a32G5247h7810
$$ -101925 49470 -309201 -114048 97869 -87994 134575 -214321 -158786 -132 75247 -87810
18771a21766k75508C82382A35967K6188a7484n4564A24094a07711j7644j19596
$$ -121766 -397274 382382 135967 162155 -17484 -72048 124094 -107711 -125355 -244951
18761b44951q687a0428k01546N1514H9757a57477d2181m12630a41040l7804c6594
$$ -244951 -253638 -10428 -211974 -160460 89757 -157477 -42181 -454811 -141040 -178844 -36594
18749f4458m4684L5740F7332h0775o1687A49052a30673B02215O629d04864j0758
$$ -64458 -109142 -73402 67332 -80775 -142462 149052 -130673 202215 208844 -404864 -415622
18738d15622A8077c54974j3570J78355n7795A21379b99461q863f1843j2453A27652
$$ -415622 18077 -354974 -368544 -190189 -247984 121379 -299461 -308324 -61843 -74296 127652
18726B34627E4114a98449K8111p9908A22792a91489Q5935G056e2917A39739n4412
$$ 234627 54114 -198449 -170338 -250246 122792 -191489 -105554 7056 -52917 139739 85327
18715H5327K74079f7332A5568b78901i8616C72465a83831F8693b3412j31543E5066
$$ 85327 359406 -67332 15568 -278901 -98616 372465 -183831 68693 -23412 -154955 55066
18703a55217n3469N6130C69578F0723L66903k06645a08361J6281q7168d7730k69881
$$ -155217 -208686 -152556 369578 60723 427626 220981 -108361 -92080 -179248 -47730 -317611
18692c17611a33341g805j8807k6056A9616J61219m7040g5561o4929j45258Q4304
$$ -317611 -133341 -7805 -26612 -52668 19616 180835 133795 -75561 -140490 -285748 -201444
18681b01444d2697j74839B16137D0370N9451c70569a06203B63898a28713d3057
$$ -201444 -42697 -217536 216137 40370 99821 -370569 -106203 263898 -128713 -43057
18670C6607b7223O45h318j2036A42912b4900o9652A39286B7620d70773I3921B2412
$$ 36607 -27223 -26578 -8318 -20354 142912 -24900 -94552 139286 27620 -470773 93921 22412
18657f7831K8665E6819a98629h2794j64053a21294E5424a89261L9095B27701G5834
$$ -67831 -39166 56819 -198629 -82794 -246847 -121294 55424 -189261 -150166 227701 75834
18645B9717a69767h886m8995k4317K6027a0708l2218k3949k70880I6416a82920
$$ 29717 -169767 -8886 -57881 -82198 -56171 -10708 -42926 -66875 -337755 96416 -182920
18633a7065j1193j82907B72154a29571N4688B20195j04460i0558d095n4921b3900
$$ -17065 -28258 -211165 272154 -129571 -74883 220195 115735 -90558 -4095 -59016 -23900
18621F513J1136a82243P6794b7354p6896A17207a14398l9746e1851B14792c18827
$$ 6513 17649 -182243 -105449 -27354 -104250 117207 -114398 -154144 -51851 214792 -318827
18609C32399l7986A09718J12553A05251a90008a5660j81083j03386A6819a28345
$$ 332399 294413 109718 222271 105251 -190008 -15660 -196743 -300129 16819 -128345
18598a2498k90688Q4187j47080D0130b64479P3341d4508F5657J40533b44646B0222
$$ -12498 -303186 -218999 -366079 40130 -264479 -191138 -44508 65657 206190 -244646 20222
18586H0838e399k90534a07938G2453a88044j98988C33132j16567I8415C3976e639
$$ 80838 -5399 -295933 -107938 72453 -188044 -387032 333132 216565 98415 33976 -5639
18574i3068j63847a12558j7636A37410k5376j9968c61422b394n17800A80668A3349
$$ -93068 -256915 -112558 -130194 137410 112034 92066 -361422 -2394 -520194 180668 13349
18562e5355k48373B12015m7608E7034b88859H4981h703A68331d21002D707a77950
$$ -55355 -303728 212015 164407 57034 -288859 84981 -8703 168331 -421002 4707 -177950
18550A17029a46572A26548a26843L8913o4641A05833J0125d13995I8641a50197
$$ 117029 -146572 126548 -126843 -87930 -152571 105833 115958 -413995 98641 -150197
18539C70229b99719G6449J0649a74619C78003a39059F0098P5564b9991j97327
$$ 370229 -299719 76449 87098 -174619 378003 -139059 60098 135662 -29991 -227318
18529b27318G4025c15401A3872d81258A22833c00390A73138b76419b3398r9637
$$ -227318 74025 -315401 13872 -481258 122833 -300390 173138 -276419 -23398 -123035
18519a23035j19901L3418d8514q5777A44075a74107L7882l6097A22630K8593i8434
$$ -123035 -242936 -209518 -48514 -134291 144075 -174107 -136225 -172322 122630 151223 -98434
18507A78488a16772I7682J15213K7413m7286c929j27367A85878a8547A44173a04685
$$ 178488 -116772 97682 212895 240308 193022 -3929 -131296 185878 -18547 144173 -104685
18495a71098B08305A5086a33966A01795C1781O0860G829A321L2918f8777E78c02523
$$ -171098 208305 15086 -133966 101795 31781 92641 7829 1321 34239 -68777 578 -302523
18482I8605B0432c09468J39916A54472A1369K13517L529G5900a47564A82709J4565
$$ 98605 20432 -309468 -169552 154472 11369 224886 228415 75900 -147564 182709 197274
18471A97274F3834g5160A0011a15881J6965E3775b7285p6212o7812n0249N2098
$$ 197274 63834 -75160 10011 -115881 -98916 53775 -27285 -103497 -171309 -221558 -169460
18460a69460P0379D5132a60449A38235J7355d1003k91459b30k44669J4752C0125
$$ -169460 -99081 45132 -160449 138235 155590 -41003 -332462 -230 -244899 -230147 30125
18448B7264b1562j65278a2292A60186p3613b30824A69046B740b21090L462A86956
$$ 27264 -21562 -186840 -12292 160186 86573 -230824 169046 2740 -221090 -217628 186956
18436i2052H6958Q1943Q177d4699B10628l7107a0629B78624a11920G9574a487
$$ -92052 86958 168901 177078 -44699 210628 173521 -10629 278624 -111920 79574 -1487
18424c36688d786A62659o8199a5874k80578J28596f0139C23099b66825J09171
$$ -336688 -4786 162659 94460 -15874 -296452 -167856 -60139 323099 -266825 -157654
18414a57654o5076Q0086E5041F748b26902j36564a39203J5759j1477A73565p9095
$$ -157654 -222730 -142644 55041 6748 -226902 -363466 -139203 -123444 -134921 173565 94470
18403I4470g4328D7062b07313I2531c18593a1981D040b54390e2793j86602Q7875
$$ 94470 -74328 47062 -207313 92531 -318593 -11981 4040 -254390 -52793 -239395 -151520
18392a51520B60984B0204e8483G3758g7201B96198C6570J8677H601g1298D09067
$$ -151520 260984 20204 -58483 73758 -77201 296198 36570 55247 8601 -71298 409067
18380b52737i1649m8204q89F2033d55712C8803L35678F2042P7071a17563d8888
$$ -252737 -91649 -139853 -140742 62033 -455712 38803 374481 62042 139113 -117563 -48888
18368c92079k23130I4388a41324A65866c34868B57004b83983E737a00306l7375
$$ -392079 -615209 94388 -141324 165866 -334868 257004 -283983 5737 -100306 -137681
18358a37681k18411N2568Q6372A30012a95838D6019a85730O3679E1672p176A2386
$$ -137681 -356092 -303524 -217152 130012 -195838 46019 -185730 -122051 51672 44496 12386
18346A53557i7437r6147A7452K69594b26375A86643m2015b72726a17050D1729
$$ 153557 -97437 -193584 17452 287046 -226375 186643 144628 -272726 -117050 41729
18335b56187E0198b6665j86970J03448b4395B32054b5218j35023D7030a19667
$$ -256187 50198 -26665 -213635 -110187 -24395 232054 -25218 -160241 47030 -119667
18324a10127A0884a59614B1417N9256J1874K15295j48839o7839b98192A86728
$$ -110127 10884 -159614 21417 80673 92547 307842 159003 91164 -298192 186728
18313E0747n891N476d4715A08587J56588A2969b1140I0434c49851d5594B55214
$$ 50747 44856 50332 -44715 108587 265175 12969 -21140 90434 -349851 -45594 255214
18301D8662J75210b02436p4229h0532a5179k50908n8671h9473b4428k6188I7416
$$ 48662 223872 -202436 -276665 -80532 -15179 -266087 -324758 -89473 -24428 -50616 97416
18289e9360B01234b03958B78003b96780B50446b22593A55030i6764A72783D1957
$$ -59360 201234 -203958 278003 -296780 250446 -222593 155030 -96764 172783 41957
18278G8076K13748n8092a61917C4380J24283G1648P4865a2137G7574K8715d2917
$$ 78076 291824 233732 -161917 34380 158663 71648 146513 -12137 77574 106289 -42917
18266A50190c446H7263b50047h8453a4254l1017A56055a11898k03846Q2597A01208
$$ 150190 -3446 87263 -250047 -88453 -14254 -45271 156055 -111898 -315744 -233147 101208
18254B788b78653J16928C4509e2356k3274k1770O978A5903J52717J5806f0396
$$ 2788 -278653 -161725 34509 -52356 -75630 -97400 -90422 15903 168620 184426 -60396
18242g061A61375b9205B25381a4417p7844J7091l9869B6693K35185a63099q6993
$$ -7061 161375 -29205 225381 -14417 -92261 -75170 -115039 26693 261878 -163099 -250092
18231b50092Q522J01982g070j3732j28929a7013r4472b4335D4530a67114j33187
$$ -250092 -241570 -139588 -7070 -20802 -149731 -17013 -111485 -24335 44530 -167114 -300301
18220c00301A24457e8772D1368M6411a04548q0705G7259b0192p5315A2951d496
$$ -300301 124457 -58772 41368 87779 -104548 -185253 77259 -20192 -95507 12951 -4496
18208b67826A77205J3354A1495J75370e6082r8240b7341k33301I7718h0589A95317
$$ -267826 177205 190559 11495 186865 -56082 -154322 -27341 -260642 97718 -80589 195317
18196a8855F9325e5343A13571j0413r993h8278E8944a05097I5052b02200f6339
$$ -18855 69325 -55343 113571 103158 93165 -88278 58944 -105097 95052 -202200 -66339
18184a37489o3122B82751c17385A10647a26254G8718J76136G6918c0491A3798
$$ -137489 -200611 282751 -317385 110647 -126254 78718 254854 76918 -30491 13798
18173A8191b7187p0244M7830F3327a40324N3991a605B08806b5887A31594a84807
$$ 18191 -27187 -97431 -49601 63327 -140324 -86333 -1605 208806 -25887 131594 -184807
18161b9334p3658B9525J34713Q5387B0978l114R3707j3181h7146B08564c3874
$$ -29334 -102992 29525 164238 249625 20978 17864 111571 98390 -87146 208564 -33874
18149d7825k2167k01787n5546J23485h4492k4040a3675q8560C893K29391f8587
$$ -47825 -69992 -271779 -327325 -203840 -84492 -108532 -13675 -102235 3893 233284 -68587
18137F9038J4666c16391a44039A94771J74528j05928f2342B92158A37161c44792
$$ 69038 83704 -316391 -144039 194771 369299 263371 -62342 292158 137161 -344792
18126c63572A22208k2112J36203a9477C38659f7368j25083l8602j18207F6474
$$ -363572 122208 100096 236299 -19477 338659 -67368 -192451 -231053 -349260 66474
18115c87276f2021C61404b0891B9056a08277B19899E8474N443J20779r0978c71890
$$ -387276 -62021 361404 -20891 29056 -108277 219899 58474 63917 184696 93718 -371890
18103F4645e1702m6966j52082B29754i1210A81615l7344b1778D9032K04580b01374
$$ 64645 -51702 -98668 -250750 229754 -91210 181615 144271 -21778 49032 253612 -201374
18091b61625B23258a99627j90928d6663C44106e8698j57885B72965a81836j36950
$$ -261625 223258 -199627 -390555 -46663 344106 -58698 -216583 272965 -181836 -318786
18081c18786J37518k04448J56118m0576O9131j01262C06221a12286A7556a73997
$$ -318786 -181268 -385716 -229598 -270174 -201043 -302305 306221 -112286 17556 -173997
18070I4420J792i5681b3680l8784r2197A6492K1152N3365D1154b16143A537K8166
$$ 94420 96212 -95681 -23680 -62464 -154661 16492 37644 91009 41154 -216143 1537 29703
18058B9703a06878c9817A11321P2674G5783b21452D3448c57675e7542A37302o1237
$$ 29703 -106878 -39817 111321 183995 75783 -221452 43448 -357675 -57542 137302 76065
18047G6065J69817g12443b14349I5649B7199J67058a4115j01033E2997J45097
$$ 76065 245882 -712443 -214349 95649 27199 194257 -14115 -115148 52997 198094
18037A98094p4108b59803A31737B4226K02918a75098e8812j9330r7029c1993A10420
$$ 198094 123986 -259803 131737 24226 227144 -175098 -58812 -78142 -175171 -31993 110420
18025f4487B5632p516N5531a40964n5805L0015j29464A92265l029a35481o2556
$$ -64487 25632 18116 73647 -140964 -196769 -166754 -296218 192265 189236 -135481 -198037
18014a98037l3334A37953g4053A623J0232K03478B2408b5877A0024b14276N3975
$$ -198037 -231371 137953 -74053 1623 11855 215333 22408 -25877 10024 -214276 -160301
18003a60301f6104A05430m6427K95641f4540A13322J32175J6389a3633j92209
$$ -160301 -66104 105430 59003 354644 -64540 113322 245497 261886 -13633 -205842
17993b05842Q1243c2049j07589C5485f1459j23232A14662a19190p1193Q1204b120
$$ -205842 -124599 -32049 -139638 35485 -61459 -184691 114662 -119190 -190383 -109179 -2120
17981A39382f4699I4142l5237a67381F9803a915e7B36222a10375F9080a20943
$$ 139382 -64699 94142 58905 -167381 69803 -1915 -57 236222 -110375 69080 -120943
17969g3247m9181c0903B097c22764G7098a08487L6485L3931r9484c0794j07393
$$ -73247 -122428 -30903 2097 -322764 77098 -108487 -72002 -38071 -137555 -30794 -138187
17958a38187m3884C4863K14076B0421a99065O4418N9924A17580d9451F5274B8840
$$ -138187 -182071 34863 248939 20421 -199065 -134647 -74723 117580 -49451 65274 28840
17946d32888f5734D6776J96136e517j24829j73148F3608l416a39264e2829C12624
$$ -432888 -65734 46776 242912 -5517 -130346 -303494 63608 60192 -139264 -52829 312624
17934i5520q1304B11959r1539a54908E18207b64572A48325n7825A2292a38343
$$ -95520 -176824 211959 120420 -154908 518207 -264572 148325 90500 12292 -138343
17923b73764P6011p8271a34728d6698A92062c7963A9797a72971G0051J88824g1062
$$ -273764 -197753 -276024 -134728 -46698 192062 -37963 19797 -172971 70051 258875 -71062
17911a04664j61153B0018d6192I8511M2437n6223l9353b2216D6920M8314d4347
$$ -104664 -265817 20018 -46192 98511 140948 84725 45372 -22216 46920 95234 -44347
17899B24100a43659k03062A0134K1199K00949b11923P8902l6678F5136a81553
$$ 224100 -143659 -346721 10134 31333 232282 -211923 -133021 -169699 65136 -181553
17888a92402j6941C43574c0548B36565j16392a24995K6846p6810F314J5469J59651
$$ -192402 -209343 343574 -30548 236565 120173 -124995 -98149 -174959 6314 21783 181434
17877A81434D7173g6472A84275c60937N9637a5558D1299g53j13763c0633j7761
$$ 181434 47173 -76472 184275 -360937 -301300 -15558 41299 -753 -114516 -30633 -48394
17866d8394j94927l3547j45170A80104m0427L4623f4982j32877f8842k33561J07574
$$ -48394 -243321 -276868 -422038 180104 139677 174300 -64982 -197859 -68842 -302403 -194829
17855a94829D4066b75868B79242C9784b04217h3926c8617E0230a4056k68746F9739
$$ -194829 44066 -275868 279242 39784 -204217 -83926 -38617 50230 -14056 -282802 69739
17843C70635A73288J60801a56550B75995L8854i8734a341k8531C7298d10381b2700
$$ 370635 173288 334089 -156550 275995 314849 -98734 -1341 -29872 37298 -410381 -22700
17831b86863f0655b9773A22505H365J09943J01850l8423o8516D9792R7188c02769
$$ -286863 -60655 -29773 122505 8365 118308 220158 181735 113219 49792 146980 -302769
17819C6051a47412a3413k49215D9408b1209k78265e4690b888D62558k14834c10905
$$ 36051 -147412 -13413 -262628 49408 -21209 -299474 -54690 -2888 462558 247724 -310905
17807A0082M7283a80598A46835L6821h3837a5386j07848L5936E3288K6271K08484
$$ 10082 57365 -180598 146835 183656 -83837 -15386 -123234 -87298 53288 79559 288043
17796B88043a41495c1155k23233C6475a88678Q6519k48192D16443l0361G50a37156
$$ 288043 -141495 -31155 -254388 36475 -188678 -102159 -350351 416443 386082 750 -137156
17784b71786a30363f4823J9825m0653A84009m5822C8034b70554B47151f4423A32154
$$ -271786 -130363 -64823 -44998 -85651 184009 138187 38034 -270554 247151 -64423 132154
17772b7905D9400a58287A7909q273a018G6772f811C6761J13900b4652B23709F6052
$$ -27905 49400 -158287 17909 9636 -1018 76772 -6811 36761 150661 -24652 223709 66052
17759I2794j8096J46012p3403K04031b03461a3570l6279j08142C46694A684L3532
$$ 92794 74698 220710 147307 351338 -203461 -13570 -49849 -157991 346694 1684 35216
17748C5216b64934F6881J74250b15270b4250k16223D9467b27187g2142j79926
$$ 35216 -264934 66881 241131 -215270 -24250 -240473 49467 -227187 -72142 -252068
17738b52068B3148Q0092a25121A89389c6007G5646a82781A64818M4563a43423
$$ -252068 23148 103240 -125121 189389 -36007 75646 -182781 164818 209381 -143423
17727h5795A00172B859K23911a41981c7186j84888c5253j82257a04182b2949A29191
$$ -85795 100172 2859 226770 -141981 -37186 -222074 -35253 -217510 -104182 -22949 129191
17715A94743i8148A30017b18854B14445h7413k481d160A31134A2571L33735a30716
$$ 194743 -98148 130017 -218854 214445 -87413 -89894 -4160 131134 12571 346306 -130716
17703a56439C2459Q3066J07736f8710C0218a08894A04569a21005A23681l306d5872
$$ -156439 32459 115525 223261 -68710 30218 -108894 104569 -121005 123681 120375 -45872
17691a94609f3031B97836H3358j5639b4347A20981a8034C3184d58460J31685A61685
$$ -194609 -63031 297836 83358 67719 -24347 120981 -18034 33184 -458460 -326775 161685
17679h0986C38141G7067d0941K0269m32193A14729J3038P4323D0746J19884a34153
$$ -80986 338141 77067 -40941 -20672 -452865 114729 127767 202090 40746 160630 -134153
17667c02809a402l10713A16259b52915J11798j70531C65884o8773a1165A5094
$$ -302809 -1402 -312115 116259 -252915 -141117 -311648 365884 297111 -11165 15094
17656c00518A45221l6791J15796o7149c25798A13950M4813K0633a18153C52612
$$ -300518 145221 108430 224226 157077 -325798 113950 158763 179396 -118153 352612
17645G148a69538A78927p439L6511a29105K9745A16479K1678F555i6600b0020
$$ 7148 -169538 178927 171488 207999 -129105 -99360 116479 138157 6555 -96600 -20020
17633B6086a68449A68656b93489A71666e6443l56771J91761d9432b4454k6736
$$ 26086 -168449 168656 -293489 171666 -56443 -413214 -221453 -49432 -24454 -51190
17623e1190D351a2491G8447J32335G7784a82852M9169j34497C6405g5577A21546
$$ -51190 4351 -12491 78447 210782 77784 -182852 -133683 -268180 36405 -75577 121546
17611A59100a48866B53985A13991E2198a74339B62373e0864P055j38651B43844
$$ 159100 -148866 253985 113991 52198 -174339 262373 -50864 -43809 -182460 243844
17600A53946P0855a74752a6999C8152N0109J41236H5466A7158b5995C8480K08674
$$ 153946 224801 -174752 -16999 38152 88261 229497 85466 17158 -25995 38480 247154
17589B47154j13116A3598K86112H0098q23a8351j63559B25187F6478d3301B47056
$$ 247154 134038 13598 299710 80098 79275 -18351 -181910 225187 66478 -43301 247056
17577f2335A81556A8249g8122j0399A76438R291N8630h2085E3889a13904e4565
$$ -62335 181556 18249 -78122 -88521 176438 185729 244359 -82085 53889 -113904 -54565
17565a99275C8136a82784A53309P7037G107a5223D0638a33167C98849A48857J34516
$$ -199275 38136 -182784 153309 230346 7107 -15223 40638 -133167 398849 148857 283373
17554B83373a39226I1911g6391B5178a85821A74066J22566H0900g8527B1590J98656
$$ 283373 -139226 91911 -76391 25178 -185821 174066 296632 80900 -78527 21590 220246
17543B20246g9219K9659C1087P4844a3822j74478A16257J378c53534F224K491
$$ 220246 -79219 -49560 31087 105931 -13822 -188300 116257 117635 -353534 6224 8715
17532H715Q6409j091b56579A49258o5551J13739H6104J17083j2611F1265a92499
$$ 8715 95124 94033 -256579 149258 83707 197446 86104 203187 190576 61265 -192499
17520E7961K98244M1286a23423G6587L7630a0045r838j73591B6426N1467a651
$$ 57961 356205 397491 -123423 76587 114217 -10045 -19883 -193474 26426 77893 -1651
17508b33582H5339C6464b9632B2626L08420b59684B67445n2846i3133A37493a43106
$$ -233582 85339 36464 -29632 22626 331046 -259684 267445 214599 -93133 137493 -143106
17496E8732J71042o0958k7021K90023e5627A80965N7600i559A51982J22801O239
$$ 58732 229774 168816 141795 431818 -55627 180965 238565 -9559 151982 274783 281022
17485B81022b59804G1506h9483m6624C29973j23235b89608C97011Q3074A28740
$$ 281022 -259804 71506 -89483 -136107 329973 206738 -289608 397011 480085 128740
17474A06634g2571A8889R2981J12096M7955j27476m014f694B34509o8444H149
$$ 106634 -72571 18889 111870 223966 271921 144445 140431 -6694 234509 166065 8149
17462A69249a92546F129K74040R274j8407B2138E993J23425J53682L6254b55389
$$ 169249 -192546 6129 280169 289443 271036 22138 5993 129418 283100 319354 -255389
17450B12312l2476N9933a45203B25856F2102I398R4495a80544o7809H4655P8417
$$ 212312 179836 239769 -145203 225856 62102 9398 103893 -180544 -248353 84655 163072
17439A63072o0083J66826p0229K0628K80014E965P36356l59670H1479L79962k13865
$$ 163072 102989 269815 199586 220214 500228 5965 742321 382651 81479 461441 247576
17428B47576K6792b4510B33716j8466K48167M763A46259L00843D3115K77113l6164
$$ 247576 274368 -24510 233716 215250 463417 468180 146259 447102 43115 320228 284064
17417B84064p4424n6103Q7693c9285j01445B94160J1637r7858a73787A75273l3005
$$ 284064 209640 153537 241230 -39285 -140730 294160 305797 207939 -173787 175273 142268
17406A42268a09752a8838B26596Q1281N0203o8261r3348J5867K08566A40192J25328
$$ 142268 -109752 -18838 226596 307877 358080 289819 196471 212338 420904 140192 265520
17395B65520O4455m4468d7122A41005A7991d9080A82482A7149J15519O7054G4771
$$ 265520 329975 285507 -47122 141005 17991 -49080 182482 17149 132668 199722 74771
17383A88399p3505m5842J02346L47619I1630K00689j30911J31562j16337p129
$$ 188399 114894 69052 171398 519017 91630 292319 161408 292970 176633 169504
17373A69504C4425O9810g8024B71439b5761b249C37016i4084D47991D3655J85393
$$ 169504 34425 104235 -78024 271439 -25761 -2249 337016 -94084 447991 43655 229048
17362B29048b1280B19879p2511l7047L714f4600l6247D0774a04917k5256C64628
$$ 229048 -21280 219879 147368 110321 114035 -64600 -100847 40774 -104917 -130173 364628
17350A44187c9907j84850I7273K29790j48246F0450M2118J13451J3566a29980
$$ 144187 -39907 -224757 97273 327063 178817 60450 102568 216019 229585 -129980
17339G5205a39027B83063J12681F0509K18411F2550K36293J23582H8410j3045
$$ 75205 -139027 283063 395744 60509 278920 62550 298843 422425 88410 75365
17329G5365J98087K311e7699j0941J3524j7128C9094c08301C6812N1003K24801
$$ 75365 273452 275763 -57699 -68640 -55116 -72244 39094 -308301 36812 87815 312616
17318C12616A04475J12098n0601i0843A8766P2124J73247M7021j16391F4349e239
$$ 312616 104475 216573 165972 -90843 18766 90890 264137 311158 194767 64349 -5239
17306B50795G7766J52172J06674F0253M1885J50591A7044K98370A43626K28452
$$ 250795 77766 229938 336612 60253 102138 252729 17044 315414 143626 372078
17296C72078j29998b0015B48766J36934g1805A7538a31647H0876K62391G5283
$$ 372078 242080 -20015 248766 385700 -71805 17538 -131647 80876 343267 75283
17285A27172J09884B1263Q1607b3934C38174B9023J12262R0582j8748P1470A24600
$$ 127172 237056 21263 102870 -23934 338174 29023 141285 231867 213119 284589 124600
17273A51262K77913b72452A14148J2331A0449L364L5405N4230N6224f205B73588
$$ 151262 429175 -272452 114148 126479 10449 13813 49218 103448 159672 -6205 273588
17261F5013J29575q2850h9405A33443K40220E2685J29409H1212L56592f061B08360
$$ 65013 194588 111738 -89405 133443 373663 52685 182094 81212 437804 -6061 208360
17249E391K70546M1921A8363L72793I5266K17354E6857a65309B63417m3594H8660
$$ 5391 275937 317858 18363 391156 95266 312620 56857 -165309 263417 219823 88660
17237f0733B6005L91622M0981H4357j5493R7236J24332j40283O2331g712C22842
$$ -60733 26005 417627 458608 84357 68864 166100 290432 150149 212480 -7712 322842
17225a01515B71982B8782K85652F6706J95008I0239J00990n3045D0325e7424B14139
$$ -101515 271982 28782 314434 66706 261714 90239 191229 138184 40325 -57424 214139
17213C49901a88397B01615a48375C25911A24404K49660A03764L00365I6275K5053
$$ 349901 -188397 201615 -148375 325911 124404 374064 103764 404129 96275 121328
17203A21328P3244D6247N5376b33145F6024K24045A37725K64259A88481L62290
$$ 121328 194572 46247 101623 -233145 66024 290069 137725 401984 188481 550771
17193E50771H7190K87280A21319Q408M2260k2866G2389J45246e0647A43115F0217
$$ 550771 87190 374470 121319 129727 171987 149121 72389 217635 -50647 143115 60217
17181C21112g0741b3369D72196p4430A24217j943J8836J75411A37305J68919I6551
$$ 321112 -70741 -23369 472196 397766 124217 122274 141110 316521 137305 306224 96551
17169B29322M931q6443b2156B70102A28250l518J92875j48533N03005A37650F7077
$$ 229322 234253 147810 -22156 270102 128250 124732 317607 169074 672079 137650 67077
17157B36531I4905J57632C7560O89545l34202A79641n4288J56540J11505J84322
$$ 236531 94905 252537 37560 727105 392903 179641 125353 281893 393398 577720
17147E77720j48779n6273j52055p0084M5644n6558F2911K6332K42747o0755j12231
$$ 577720 428941 372668 220613 150529 196173 139615 62911 89243 331990 271235 159004
17136A59004k2119J62584D2512B1126M27257k22772M85742l11867l069A74759
$$ 159004 136885 299469 42512 21126 448383 225611 711353 399486 396417 174759
17125C09422J04845A44961a15204C39083j12699L9357K03262j76794O1381j14472
$$ 309422 414267 144961 -115204 339083 226384 265741 469003 292209 353590 239118
17115B39118J51058r3258B8659b2565A54384M6875J55656j28737L18589k00813
$$ 239118 390176 296918 28659 -22565 154384 201259 356915 228178 546767 345954
17105C45954A38390K31868j25106J62652L1506j70595L70855G6385K04288L50587
$$ 345954 138390 370258 245152 407804 439310 268715 639570 76385 280673 631260
17095F31260k07777J59416B79846K2339K07132j94941l6200J53137j78793P6981
$$ 631260 423483 582899 279846 302185 509317 314376 278176 431313 252520 329501
17085C29501o733J27033a0508C83050l7523K21228J8083B34570m0072L69085k68927
$$ 329501 322768 449801 -10508 383050 345527 566755 584838 234570 194498 563583 294656
17074B94656J88807q8106J5887j82537K91902o3661P4469j66260Q9621K10337
$$ 294656 483463 395357 411244 228707 520609 456948 531417 365157 454778 665115
17064F65115r9336I5369J98692P7056l262A63793L92113L7056j62179N7965j7714
$$ 665115 565779 95369 294061 371117 367855 163793 555906 592962 430783 488748 471034
17053D71034j76917L80995j87790G9014j0194L67901A46523K64958j71042M53233
$$ 471034 294117 675112 487322 79014 68820 436721 146523 411481 240439 693672
17043F93672k63116k9572J62858J80123r5528q9807A84405M82847n1482k93098
$$ 693672 430556 400984 563842 743965 648437 558630 184405 667252 615770 322672
17033C22672O7968M71582C34153M8574J3331K36274k72028J85524k57560M30699
$$ 322672 390640 862222 334153 382727 396058 632332 360304 545828 288268 718967
17023G18967k09936K41863n7350l26905K29722k03240o9822J82382O4038j12995
$$ 718967 509031 750894 693544 366639 596361 393121 323299 505681 569719 456724
17013D56724L4753J57127q2233j84559L73788j95346K50478J8352j08288k16079
$$ 456724 491477 648604 566371 381812 755600 560254 810732 829084 720796 504717
17003E04717n7593L49138l76312J30182N26704n37257L48693l18810K65M1087
$$ 504717 447124 796262 419950 550132 1076836 539579 888272 569462 569727 610814
16993F10814j10390J95438J09448p028M2857C95122N96257l07150L3439K21510
$$ 610814 500424 695862 805310 798282 841139 395122 991379 684229 717668 939178
16983I39178l25117M64356m35430L8070l7277J33211l04966J52547K31998C99253
$$ 939178 614061 1078417 642987 681057 643780 776991 472025 624572 856570 399253
16972F57041K77620o3502j69820P9499N1127m3169Q0802O0331B79653K78023J66561
$$ 657041 934661 871159 701339 780838 831965 788796 869598 929929 279653 557676 724237
16961G24237P1196L55776k37781k11859l828R9515L6914L13046j58850m64134
$$ 724237 795433 1151209 913428 701569 697741 797256 834170 1147216 988366 524232
16951E24232J56992O2853k02572J77814P9227o433J49205j30674q8561k10416
$$ 524232 681224 744077 541505 719319 798546 792113 941318 810644 722083 511667
16941E11667K9395O41950k33471R784k4623K87899k76757j31405O8634J18605
$$ 511667 541062 1183012 949541 959325 934702 1222601 945844 814439 883073 1001678
16931A001678j21122j47488L53298J66248j90141L73147k39522m9627K06519m62987
$$ 1001678 880556 733068 1086366 1252614 1062473 1435620 1196098 1146471 1352990 890003
16921H90003N04431j36351l74475M04531k63803Q6262R617J31432Q2634l79733
$$ 890003 1394434 1258083 883608 1288139 1024336 1110598 1120215 1251647 1334281 954548
16911I54548J37618K69428j37867M07904k16671m7626K16901j44622l75494O01933
$$ 954548 1092166 1361594 1223727 1631631 1414960 1367334 1584235 1439613 1064119 1666052
16901A666052n53466L15224K06089k1507k11165L1875M4588K5929J39313J20209
$$ 1666052 1112586 1427810 1633899 1612392 1401227 1433102 1477690 1503619 1642932 1763141
16891A763141j28881K9626j5748J58733l70783M356P4704K9943K61098j64030
$$ 1763141 1634260 1663886 1648138 1806871 1436088 1440444 1515148 1545091 1806189 1642159
16881A642159r6204j12979N72669p9825J13912k34370K0510J5238K05359p0543
$$ 1642159 1545955 1432976 2005645 1925820 2039732 1805362 1825872 1841110 2046469 1975926
16871A975926J59788p2732j28813K47276k95706L80590k09049Q848j64661L44932
$$ 1975926 2135714 2062982 1934169 2181445 1885739 2266329 2057280 2066128 1901467 2246399
16861B246399k89605K26597M70844j76810j96888J82884j91018j7346K43786k62455
$$ 2246399 1956794 2183391 2654235 2477425 2280537 2463421 2272403 2255057 2498843 2236388
16851B236388K94159j46076J18656R1987Q0765J46932r5314k3920k38220M66094
$$ 2236388 2530547 2384471 2503127 2595114 2675879 2822811 2727497 2703577 2465357 2931451
16841B931451m11403N81468l31332L10363l98050O11116K3017l2069l07990K80259
$$ 2931451 2520048 3101516 2770184 3080547 2682497 3293613 3316630 3284561 2976571 3256830
16831C256830k67499P7996N23752r3512j76955L51200j45452O8339K14478K25879
$$ 3256830 2989331 3067327 3591079 3497567 3320612 3671812 3526360 3594699 3809177 4035056
16821D035056j6826J74405n3105Q0596L17619j89948R3318R5099l6658L49450
$$ 4035056 4018230 4192635 4139530 4220126 4537745 4347797 4441115 4536214 4499556 4849006
16811D849006l49269L32439J78538K03327j00396K23516J14865N553J1633K87024
$$ 4849006 4499737 4832176 5010714 5214041 5113645 5337161 5452026 5457579 5469212 5756236
16801E756236q8640K7090L13180j88600P19393r9357L47973j69639O91903m14040
$$ 5756236 5667596 5694686 6007866 5819266 6538659 6439302 6787275 6617636 7309539 6895499
16791F895499N32658k83854K77525M20110M4509L29492M4504N01903j29820r2
$$ 6895499 7428157 7144303 7421828 7841938 7886447 8215939 8260443 8762346 8632526 8632434
16781H632434N64154M8358o73N06048M26130K18596N61226K7268P14368j16324
$$ 8632434 9196588 9244946 9244273 9750321 10176451 10395047 10956273 10983541 11697909 11581585
16771A1581585N32096J88913L89264P19846K11848L12866M36691N25346M40420
$$ 11581585 12113681 12302594 12691858 13411704 13623552 13936418 14373109 14898455 15338875
16762A5338875M96665J41511O11244P63626M01015J094085N06585O11891J029383
$$ 15338875 15835540 15977051 16588295 17351921 17752936 18847021 19353606 19965497 20994880
16753B0994880R58991M25594Q99331J078208R93890J305205J442533L09676J766044
$$ 20994880 21953871 22379465 23278796 24357004 25350894 26656099 28098632 28408308 30174352
16744C0174352J225002J296300J707058J734847J494629K079596J802647K234160
$$ 30174352 31399354 32695654 34402712 36137559 37632188 39711784 41514431 43748591
16736D3748591K582393J903205K664600K830884L309244L022824L168303L770027
$$ 43748591 46330984 48234189 50898789 53729673 57038917 60061741 63230044 67000071
16728F7000071M074244L261633N054104M259588N217130N084684N278260N995427
$$ 67000071 71074315 74335948 79390052 83649640 88866770 93951454 99229714 105225141
16720A05225141N614687O479178O364850O417673O469403O235708O035822O343343
$$ 105225141 110839828 117319006 123683856 130101529 136570932 142806640 148842462 155185805
16712A55185805N612434M865107M308256L919577K684224J480213P04224k94492
$$ 155185805 160798239 165663346 169971602 173891179 176575403 178055616 178759840 178465348
16704A78465348j352587k075491l775764m086237m962038n539192o130255o026000
$$ 178465348 177112761 175037270 171261506 167175269 162213231 156674039 150543784 144517784
16696A44517784o545423o473567o454869n895995o880038n642075o043078n325580
$$ 144517784 137972361 131498794 125043925 119147930 112267892 106625817 100582739 95257159
16688I5257159n535532m695688m986582m298152m077033l775511l862402l347316
$$ 95257159 89721627 85025939 80039357 75741205 71664172 67888661 64026259 60678943
16680F0678943l389284l227209k434013l078524k602605k193226k232894j833105
$$ 60678943 57289659 54062450 51628437 48549913 45947308 43754082 41521188 39688083
16672C9688083j864812j836552j940636j153735j396742j548513j283024j287955
$$ 39688083 37823271 35986719 34046083 32892348 31495606 29947093 28664069 27376114
16664B7376114j098188j393283p48255p56758j226093o32367o87793p90753n32193
$$ 27376114 26277926 24884643 24136388 23379630 22153537 21521170 20833377 20042624 19510431
16655A9510431q16211j036049j81042r84123l14789q58751m67401k09560n46827
$$ 19510431 18694220 17658171 17477129 16493006 16178217 15319466 14852065 14642505 14095678
16646A4095678o22758m94801m68594k84556l09524m53908M2536n28276m51455
$$ 14095678 13472920 12978119 12509525 12224969 11915445 11461537 11504073 10975797 10524342
16637A0524342j91098j69267m83226n28808J83049j31616k00277n00101k28087
$$ 10524342 10333244 10163977 9680751 9151943 9334992 9203376 9003099 8502998 8274911
16628H274911k51720L28043q04727j50342K3628k52357K12759m72525k20847k81054
$$ 8274911 8023191 8351234 7546507 7396165 7419793 7167436 7380195 6907670 6686823 6405769
16618F405769J62806l80970j70534J85354n33256L7371k65473O0828k33178k63613
$$ 6405769 6568575 6187605 6017071 6202425 5669169 5706540 5441067 5501895 5268717 5005104
16608E005104J92265j09597r4568l51343P0848m9399p1652j57765L1646j67951
$$ 5005104 5197369 5087772 4993204 4641861 4712709 4663310 4591658 4433893 4465539 4297588
16598D297588k25m78081J82942j03538j11617Q0002q9199j97908Q8128k76120
$$ 4297588 4297363 3819282 4002224 3898686 3787069 3867071 3777872 3579964 3668092 3391972
16588C391972K35316m77254M90456k87622k28517R0115N9535Q5539l53013o9432
$$ 3391972 3627288 3150034 3640490 3352868 3124351 3214466 3274001 3359540 3006527 2937095
16578B937095K24596k78318j49347R0827L4445q5810p9680k36558K47960l50643
$$ 2937095 3161691 2883373 2734026 2824853 2859298 2773488 2693808 2457250 2705210 2354567
16568B354567K03291k4802k31512L56965l24351k29101M64850N0514l41233J37778
$$ 2354567 2557858 2533056 2301544 2658509 2334158 2105057 2569907 2620421 2279188 2416966
16558B416966l29497l7195J08943M35342m12737m33066M03236O9914k27804o7710
$$ 2416966 2087469 2050274 2159217 2594559 2181822 1748756 2151992 2221906 1994102 1926392
16548A926392J64960j69185k05436R4576q4364L29507j09823l91192J63637j36457
$$ 1926392 2091352 1922167 1716731 1811307 1726943 2056450 1946627 1555435 1719072 1582615
16538A582615K13209j37825j3386m047J70026L7295k57216j85978K15692p1460
$$ 1582615 1795824 1657999 1644613 1640566 1810592 1847887 1590671 1404693 1620385 1548925
16528A548925k9612J08263P0197k4264j91768J1991L3684K8415r9374K29371m667
$$ 1548925 1519313 1627576 1697773 1673509 1481741 1493732 1527416 1555831 1456457 1685828 1681161
16517A681161k25348r3696k39568J45997m5520J5236j2763r9880K1722l0076N8404
$$ 1681161 1455813 1362117 1122549 1268546 1223026 1238262 1225499 1125619 1147341 1117265 1175669
16506A175669K27958j0308K78362o52041J63919q9049j6487p3667j62772J7376
$$ 1175669 1403627 1393319 1671681 1019640 1183559 1094510 1078023 1004356 841584 858960
16496H58960L99211j03107j01911j53286j08619K44442k98761J06916J92894j25129
$$ 858960 1258171 1155064 1053153 899867 791248 1035690 736929 843845 1036739 911610
16486I11610l03502O99173n05752J44637k10171J65066q7310l0652n3002J79565
$$ 911610 608108 1307281 801529 946166 735995 901061 813751 783099 730097 909662
16476I09662j88065J83771k9766K27631E15478L96642j61906j53496K25547P7539
$$ 909662 721597 905368 875602 1103233 515478 912120 750214 596718 822265 899804
16466H99804j11464k9040J44716K95287m42282j95961K72928q6584j80845K27875
$$ 899804 788340 759300 904016 1199303 757021 561060 833988 747404 566559 794434
16456G94434N09450n22884j81813K33954B87649L63910J21962l8260j41392K50589
$$ 794434 1303884 781000 599187 833141 287649 651559 773521 735261 593869 844458
16446H44458k77115L93085k29983M5154k21096J45358P5572k8219l8222r5719
$$ 844458 567343 960428 730445 775599 554503 699861 775433 747214 708992 613273
16436F13273J50033L7906C98392L34003A81001L56295J01993j44178j51470L75051
$$ 613273 763306 801212 398392 732395 181001 537296 639289 495111 343641 718692
16426G18692j94846J4616q0382B23226J77316J39053n3561J57682J5704j19513
$$ 718692 523846 538462 458080 223226 400542 539595 486034 643716 659420 539907
16416E39907J57710C12534M83661B25921K93498R8665o4690B72827A5148N60243
$$ 539907 697617 312534 796195 225921 519419 618084 553394 272827 15148 575391
16406E75391H4235M62545j06823L1107A59621O30538k51745A84847K61337M4037
$$ 575391 84235 546780 439957 471064 159621 790159 538414 184847 446184 490221
16396D90221P5569j805j27748K5114j61310K54400m8361N1959k58459L2770K69820
$$ 490221 565790 563985 436237 461351 300041 554441 506080 558039 299580 332350 602170
16385F02170k84334N6542J37406k00862n7757N5211L07791k15720j61670O2171
$$ 602170 317836 374378 511784 310922 253165 308376 616167 400447 238777 300948
16375C00948m5546K57953j35567J34090A52269J07757m8178L77304j06429L4386
$$ 300948 255402 513355 377788 511878 152269 260026 211848 589152 482723 517109
16365E17109M7195j04952Q3305B37926R7158P23m7494J89511k20472d6712B55074
$$ 517109 564304 459352 542657 237926 335084 335807 288313 477824 257352 -46712 255074
16353D19736f9169H5035J61454H0647N09905j93848L2067o4282L04217l20141
$$ 419736 -69169 85035 246489 80647 590552 396704 428771 364489 668706 348565
16343C48565J46852q6491n1614A75110a55765B19676n1934L3250j411n2555K35025
$$ 348565 495417 408926 357312 175110 -155765 219676 167742 200992 199581 147026 382051
16332C82051K6144n8227L9462A03980L01078j66631n6749J48532L5832Q8891J56094
$$ 382051 408195 349968 389430 103980 405058 238427 181678 330210 366042 454933 611027
16321F11027j49739A28982m1118N2262R8881J74000M6586J18595A73555O4323
$$ 611027 461288 128982 87864 140126 239007 413007 459593 578188 173555 237878
16311B37878I6995c5467B75781K34538k35039j1535B5258M08539B00683J68806
$$ 237878 96995 -35467 275781 510319 275280 263745 25258 433797 200683 369489
16301C69489A52521K68117E8656K41005j19240E9952J31222H7421K63609a1488
$$ 369489 152521 420638 58656 299661 180421 59952 191174 87421 351030 -11488
16290B65108r7260K59024j13008A35102J92209A16127J16645J9107L75018a0151
$$ 265108 167848 426872 313864 135102 327311 116127 232772 251879 626897 -10151
16279C67015F6714P9337L5848K55249b83325A71373N1005B269J00987P4287M5612
$$ 367015 66714 146051 181899 437148 -283325 171373 222378 2269 103256 177543 223155
16268B23155j1943m2372L74248A11512R8132D5715K45922j15974J962R4485J49755
$$ 223155 211212 168840 543088 111512 209644 45715 291637 175663 177625 272110 421865
16257D21865j40230o9487p9029A8687Q6770G587R2604K34442D8019N43720j82572
$$ 421865 281635 212148 133119 18687 105457 7587 100191 334633 48019 591739 409167
16246D09167J08844B08104e1400A76926b37037H8278K90331A36055J91893j03769
$$ 409167 518011 208104 -51400 176926 -237037 88278 378609 136055 327948 224179
16236B24179J35526A79657a21900A67177J13524A13838a4879B34701J28144j80199
$$ 224179 359705 179657 -121900 167177 280701 113838 -14879 234701 362845 182646
16226A82646D4986K81121b58999B00856d7233B69984a92322E1511K66007b474
$$ 182646 44986 326107 -258999 200856 -47233 269984 -192322 51511 317518 -2474
16215C09119A44407E4644k3995J40364C0710L80408m9621j31088J32727j78515
$$ 309119 144407 54644 30649 171013 30710 411118 361497 230409 363136 184621
16205A84621J05174J76160A08601a07719B50033M3509K00990k17858p7788B2194
$$ 184621 289795 465955 108601 -107719 250033 293542 494532 276674 198886 22194
16194D34908A36550g9776A39828b28728A07148a2479A57591i8553R021a6313C03278
$$ 434908 136550 -79776 139828 -228728 107148 -12479 157591 -98553 -89532 -16313 303278
16182B00469f2628A86058J21056b08293A73814J25913F8742J25097b233D32415
$$ 200469 -62628 186058 307114 -208293 173814 299727 68742 193839 -2233 432415
16171a88784P0368B72799A23142L4227k7610R888n4520c05401A07508b18552a00773
$$ -188784 -118416 272799 123142 157369 129759 139647 85127 -305401 107508 -218552 -100773
16159H2494i8518B5929c79606A49987p1133R76g7736A33110l5061J69046g2553
$$ 82494 -98518 25929 -379606 149987 78854 79830 -77736 133110 98049 267095 -72553
16147G1512R3266c2801C15714l8551j01100J22107F5175e7135A03200J14901r5849
$$ 71512 164778 -32801 315714 277163 176063 298170 65175 -57135 103200 218101 122252
16136A22252C2830R9710b31572g1701A6121b36531B96342F7517E404L1068J20310
$$ 122252 32830 132540 -231572 -71701 16121 -236531 296342 67517 5404 36472 156782
16125A56782G7163a29567a06A42136M14493A2681K8625O7373L6387G0466h5029
$$ 156782 77163 -129567 -106 142136 556629 12681 41306 108679 145066 70466 -85029
16113B48278H7981A9510i8427E6652a13272q760D7142J93302d37376E7947b41434
$$ 248278 87981 19510 -98427 56652 -113272 -122032 47142 240444 -437376 57947 -241434
16101a71493M7069B06408E9297P3968a6421L743D45778i8938B0977P2243b0074
$$ -171493 -124424 206408 59297 133265 -16421 -12678 445778 -98938 20977 93220 -20074
16089d7835j17418E3119J95233r7298P7210M2399q8983q4042K36074A44813a44024
$$ -47835 -165253 53119 248352 151054 228264 270663 181680 97638 333712 144813 -144024
16077A14237f4306G6616a68926P5291r8736I3161K45556i0515R262r626m4641
$$ 114237 -64306 76616 -168926 -93635 -192371 93161 338717 -90515 -81253 -90879 -135520
16066a35520B40788j12474M187e3974D53615r5051I9331a58431K8358I5878R2717
$$ -135520 240788 128314 132501 -53974 453615 358564 99331 -158431 -130073 95878 188595
16055A88595d0751l0515A71562E0397a75518j18569I575d7236B0625b29046A80482
$$ 188595 -40751 -71266 171562 50397 -175518 -294087 9575 -47236 20625 -229046 180482
16043B87065a08295D5030J02740P2399b9735B70189e7917F3403b1013B09747g5031
$$ 287065 -108295 45030 147770 220169 -29735 270189 -57917 63403 -21013 209747 -75031
16031C2227b41092A44919N226a09276F3264M7855N9189b38086B12154j097a160
$$ 32227 -241092 144919 150145 -109276 63264 111119 170308 -238086 212154 211057 -1160
16019A80679K4716R0899I237a39561B31463J29078b8393j13188L8265F7084L3016
$$ 180679 205395 296294 9237 -139561 231463 360541 -28393 -141581 -103316 67084 100100
16008A00100G987a55943K8959j28176E8351N8211f0095A84313a16919E7231d5514
$$ 100100 7987 -155943 -126984 -255160 58351 116562 -60095 184313 -116919 57231 -45514
15996b43787d0637k35558A26740m7623Q0708E1840B2176R574j2090a34232C0846
$$ -243787 -40637 -276195 126740 79117 159825 51840 22176 31750 19660 -134232 30846
15984i1032I5340i4552A37173E0626a10827a1770l3989D181L5998J82244J01995
$$ -91032 95340 -94552 137173 50626 -110827 -11770 -45759 4181 40179 222423 324418
15973C24418j42199a10287G1262J08445o5349J47972r8760K91706J8395j43968
$$ 324418 182219 -110287 71262 179707 114358 262330 163570 455276 473671 329703
15963C29703b2591A92947r3819M6178m9729e0696k53472a01385p021A51565d902
$$ 329703 -22591 192947 99128 145306 95577 -50696 -304168 -101385 -108406 151565 -4902
15951A34771B4155K5395c52237A21997E2283K07388G8973a61052b4548k37922
$$ 134771 24155 49550 -352237 121997 52283 259671 78973 -161052 -24548 -262470
15941b62470J6041h6425j76077M9657d8506G9872a51706k02821B8274a96141P2089
$$ -262470 -246429 -86425 -262502 -212845 -48506 79872 -151706 -354527 28274 -196141 -124052
15930a24052b4730h693j25640D4785J53632a1313j15195c2545j19132O1763l62914
$$ -124052 -24730 -8693 -134333 44785 198417 -11313 -126508 -32545 -151677 -89914 -452828
15919d52828f8953j64100A37224b29310R8543e6957a166j44322Q23D6341L6661
$$ -452828 -68953 -233053 137224 -229310 -130767 -56957 -1166 -145488 -144665 46341 83002
15908H3002e0356H3425d2775G3256c62497I2774a36535D2552g3698I1575b43663
$$ 83002 -50356 83425 -42775 73256 -362497 92774 -136535 42552 -73698 91575 -243663
15896D8238a73375G6093b26042H1760O435J87819A3835d14375h7844o0039c9003
$$ 48238 -173375 76093 -226042 81760 88195 276014 13835 -414375 -87844 -147883 -39003
15884A40644b89172c1230j21154A1188a94221D3171a12257d7599M913m6893j0189
$$ 140644 -289172 -31230 -152384 11188 -194221 43171 -112257 -47599 -42686 -89579 -99768
15873i9768a397A77620q4511J65626b83246c3053A96715C8377J13567E3348c28182
$$ -99768 -1397 177620 93109 258735 -283246 -33053 196715 38377 151944 53348 -328182
15861e1308j11677B30534b44384n6066J43175M3439c0360C5360L9598J47115a7388
$$ -51308 -162985 230534 -244384 -300450 -157275 -113836 -30360 35360 74958 222073 -17388
15849b6594A5278f8000r4108f9681j47047B74124C3539c49736a9758m9628H9505
$$ -26594 15278 -68000 -162108 -69681 -216728 274124 33539 -349736 -19758 -69386 89505
15837B02671r3437b46942C09301a10822A14176c634k07933j12301P5173A19784
$$ 202671 109234 -246942 309301 -110822 114176 -3634 -211567 -323868 -248695 119784
15826B06140q0908c33676a28749A71143n7898a93925b0786m050l06264B9350J51237
$$ 206140 125232 -333676 -128749 171143 113245 -193925 -20786 -24836 -331100 29350 180587
15815A80587b53116N5909B43827a69418E127c0235j76591F8098e9888D5316h6585
$$ 180587 -253116 -197207 243827 -169418 5127 -30235 -206826 68098 -59888 45316 -86585
15803A45706o2483a82992G6089l6064b7968j48509J7266A35411e82110H5421c04702
$$ 145706 83223 -182992 76089 40025 -27968 -176477 -159211 135411 -582110 85421 -304702
15791A83538H403b17279J8356j78860C4119f4710A89014b58184G5105J0715b00539
$$ 183538 8403 -217279 -198923 -377783 34119 -64710 189014 -258184 75105 85820 -200539
15779c63532A15751a21765B60306e338j6225p9151a823j65572P4854G7021a41677
$$ -363532 115751 -121765 260306 -5338 -21563 -100714 -1823 -167395 -92541 77021 -141677
15767B22232G7043b06209A82540g5116k44631l6678B125Q7258k3105C714b95837
$$ 222232 77043 -206209 182540 -75116 -319747 -356425 2125 89383 66278 3714 -295837
15755b65778a21097b797o6752D62968k06828b62319J19629b8539A41486J54298
$$ -265778 -121097 -2797 -69549 462968 256140 -262319 -142690 -28539 141486 295784
15745B95784b88232h5201B36262I5458m0887d4816C31517A3544e7303l76096C0732
$$ 295784 -288232 -85201 236262 95458 54571 -44816 331517 13544 -57303 -433399 30732
15733a83138A12780f7614j7821H0202A4864b33343n136A23094A8026b51290B03776
$$ -183138 112780 -67614 -85435 80202 14864 -233343 -238479 123094 18026 -251290 203776
15721a50957j98380e3269H1596a33184j29952R4403B73787b084r4337B73163c43656
$$ -150957 -349337 -53269 81596 -133184 -263136 -168733 273787 -2084 -96421 273163 -343656
15709c5985H3170C8853M2882a97871M9052d4468l1662F1016j2510i7288A66565
$$ -35985 83170 38853 81735 -197871 -148819 -44468 -76130 61016 48506 -97288 166565
15697B3562B178N7618M1938b05363A19357D9926a49799d9861j23183B88977r0028
$$ 23562 2178 59796 101734 -205363 119357 49926 -149799 -49861 -173044 288977 198949
15686A98949A0205b64419e007o6540c4498m61230g4520H2154r618h5090B33171
$$ 198949 10205 -264419 -5007 -71547 -34498 -495728 -74520 82154 72536 -85090 233171
15674A7295c45823j03486a22013e5957I0326a21064B6525O8614c23706p0745a89678
$$ 17295 -345823 -449309 -122013 -55957 90326 -121064 26525 95139 -323706 -394451 -189678
15662a63042m6455n3044o1981C39859a55131N1860k94715A62628J23183f1164
$$ -163042 -209497 -262541 -324522 339859 -155131 -103271 -397986 162628 285811 -61164
15651i3456B29882b95317A72030a56946E9863c12721a13883j76984e6669j50455
$$ -93456 229882 -295317 172030 -156946 59863 -312721 -113883 -290867 -56669 -207124
15641b07124j56859I2711Q7902D1422e0174A00297O7939a31698C57600D8170a0038
$$ -207124 -363983 92711 180613 41422 -50174 100297 168236 -131698 357600 48170 -10038
15629b34299C1162a02554j28352a13977H9383a03962d6526k1110k17179A39341
$$ -234299 31162 -102554 -230906 -113977 89383 -103962 -46526 -67636 -284815 139341
15618a27253l8712h29j5299M067j32583O1040A0288J10847h6010H790a93822B86278
$$ -127253 -165965 -829 -16128 -12061 -144644 -83604 10288 121135 -86010 8790 -193822 286278
15605i4339j48820A20612Q1475J60014b04369B1557f0327B98241a84682e8920
$$ -94339 -243159 120612 202087 362101 -204369 21557 -60327 298241 -184682 -58920
15594c41313e94j64155a8016j85097J00016A54547j8259a53831D6955g5647o9033
$$ -341313 -594 -164749 -18016 -203113 -103097 154547 136288 -153831 46955 -75647 -144680
15583a44680A06407a68715g1173A41717g4307D7554d8220m5569H8700J47620A17652
$$ -144680 106407 -168715 -71173 141717 -74307 47554 -48220 -93789 88700 236320 117652
15571A27651d7790A41010E2947a08573p1280q7363B1332P1023b8681F7758b934
$$ 127651 -47790 141010 52947 -108573 -179853 -267216 21332 92355 -28681 67758 -2934
15559A89840a47945K6696D7983d18474A61114c18822F3865f0176C6062M9651J65845
$$ 189840 -147945 -121249 47983 -418474 161114 -318822 63865 -60176 36062 85713 251558
15548B51558R7456e3172A9874P0141b48346A004L8943N8371p328a07637e3365
$$ 251558 349014 -53172 19874 90015 -248346 1004 39947 98318 90990 -107637 -53365
15536E6221a63002d8172r626k04918Q2176P3714A46547g4998j1324A88237d3954
$$ 56221 -163002 -48172 -57798 -262716 -180540 -106826 146547 -74998 -86322 188237 -43954
15524a54013K9179D0715a69006A7496M155K66749h9583k33043D21712C8989P9475
$$ -154013 -124834 40715 -169006 17496 21651 288400 -89583 -322626 421712 38989 118464
15513A18464d2305C8534L35713j05668o397G4910J03111n4266h7375C07939j21040
$$ 118464 -42305 38534 374247 268579 262182 74910 178021 123755 -87375 307939 186899
15502A86899a3772n9121B77767a45035F1476J29884A937f8511l988D7784a52652
$$ 186899 -13772 -72893 277767 -145035 61476 191360 1937 -68511 -72499 47784 -152652
15490a23495A02726N5412G7809a57979C4685f2404j51602P6909k04477C2592a46675
$$ -123495 102726 158138 77809 -157979 34685 -62404 -214006 -137097 -341574 32592 -146675
15478b9651k16789Q6440e3345a3140l63526A98284o5431c00584P2095A19960i2615
$$ -29651 -246440 -160000 -53345 -13140 -376666 198284 132853 -300584 -228489 119960 -92615
15466A95905i3587H4860Q834a30649f1734B92899E7549c04930c5756B6857j670
$$ 195905 -93587 84860 93694 -130649 -61734 292899 57549 -304930 -35756 26857 25187
15455B5187b9759k41232A3090c20732f9732J8728A53466c093A32494b71197A79655
$$ 25187 -29759 -270991 13090 -320732 -69732 -51004 153466 -3093 132494 -271197 179655
15443D9868c72635I4908e03304J67377c2248A01060K19665e0402C7053a12753
$$ 49868 -372635 94908 -503304 -335927 -32248 101060 320725 -50402 37053 -112753
15432H7780b02973B1825J01213J86703A35061K585Q75R0337R8067a55929j12199
$$ 87780 -202973 21825 123038 309741 135061 137646 138521 228858 326925 -155929 -268128
15421b68128e2949n0377j99081D21469H0266a62816M5098A26093d29128B42101
$$ -268128 -52949 -103326 -302407 421469 80266 -162816 -117718 126093 -429128 242101
15410f1421B29750o1680f835R46B16042f6936B14651b33837B74404j35774Q741
$$ -61421 229750 168070 -6835 -5889 216042 -66936 214651 -233837 274404 138630 147371
15399A47371o798a55074e3884D1146b14550E186K37476a31569A06308b69500B77733
$$ 147371 140573 -155074 -53884 41146 -214550 5186 242662 -131569 106308 -269500 277733
15387c2282A8910K12516a91610D9720L63325h77B12889q1305Q1875d9900A04699
$$ -32282 18910 231426 -191610 49720 413045 -877 212889 131584 213459 -49900 104699
15375a91517A04706J76514G4223B869b2601l8974A6722g1499C62143h1264A42961
$$ -191517 104706 281220 74223 2869 -22601 -61575 16722 -71499 362143 -81264 142961
15363A42910l7158a10870A28641o0692L5856a09989A46151O32b14765i3707B75631
$$ 142910 105752 -110870 128641 67949 103805 -109989 146151 146783 -214765 -93707 275631
15351b47696A81799G2282N5247N7839E4613J7256k0340K71693d0531A96875e6408
$$ -247696 181799 72282 127529 185368 54613 71869 51529 323222 -40531 196875 -56408
15339C6022c48849J14236h8824n9973M9726j0982B59130E1324b8406G2358a08831
$$ 36022 -348849 -234613 -88824 -148797 -99071 -110053 259130 51324 -28406 72358 -108831
15327b47975H262a66566A10520a02548A64452G7835P0189k5632b45371A2597d0807
$$ -247975 8262 -166566 110520 -102548 164452 77835 148024 122392 -245371 12597 -40807
15315D0798K37351a754G7036e7707B24960n770b29866C9123j4723a3100B18909
$$ 40798 278149 -1754 77036 -57707 224960 219190 -229866 39123 24400 -13100 218909
15303G2141J89658C0891o50K1659R9870R635a21366C64562A38610c8510G5828
$$ 72141 261799 30891 30241 51900 151770 161405 -121366 364562 138610 -38510 75828
15291a90376J3326B35549B5527a33786A91471C7618L2495J9249f769j42608A41275
$$ -190376 -177050 235549 25527 -133786 191471 37618 70113 89362 -6769 -149377 141275
15279C04096b2189E0708k2150h1972C0032a68583Q552F8612c0641j6549l07047
$$ 304096 -22189 50708 28558 -81972 30032 -168583 -160031 68612 -30641 -47190 -354237
15268c54237A81594f6269A40288m0176f9358r442a0661A39257K02925j36971o3733
$$ -354237 181594 -66269 140288 100112 -69358 -78800 -10661 139257 342182 205211 141478
15257A41478j0352n4275C6716L5450M2273J14529E8481b23154A59913J03628A28099
$$ 141478 131126 76851 36716 72166 114439 228968 58481 -223154 159913 263541 128099
15245C1848a19819c4815j72229B5720O8175c0488C90721F3692K32338j18841L02964
$$ 31848 -119819 -34815 -207044 25720 93895 -30488 390721 63692 296030 177189 480153
15234D80153j02796N56932N55877n8507O2253L21962o90525D25068A55824R2856
$$ 480153 377357 934289 1490166 1431659 1493912 1815874 1125349 425068 155824 248680
15224B48680E2614J94995C8961c0597k10344G7607J84556C4021J45352J33030
$$ 248680 52614 247609 38961 -30597 -240941 77607 262163 34021 179373 312403
15214C12403a25363G5001M1207c52j97541e6662D1269d5312C19685d9834B01415
$$ 312403 -125363 75001 116208 -352 -197893 -56662 41269 -45312 319685 -49834 201415
15202a64603C77285L280E5935O482e5231B5441P5787c26938i237r5407B36362
$$ -164603 377285 380565 55935 62417 -55231 25441 101228 -326938 -9237 -104644 236362
15190A16192h765C39320j62437C1967N9580K6179D7410K24222a50114A47981G0140
$$ 116192 -8765 339320 176883 31967 91547 117726 47410 271632 -150114 147981 70140
15178a09503A74700g9566C4497A027P8633i681k9660j37903g6282A86259a30120
$$ -109503 174700 -79566 34497 1027 79660 -9681 -39341 -177244 -76282 186259 -130120
15166h1791B83234j09911C3808I668R3172K46349C063a34376B21714q7302E4410
$$ -81791 283234 173323 33808 9668 102840 349189 3063 -134376 221714 134412 54410
15154d627F1414L4509K523c35406E9186R7539a01715o214C052O8815K00979H9797
$$ -4627 61414 95923 98446 -335406 59186 156725 -101715 -107929 3052 71867 272846 89797
15141a02918A81739J51313a15523I1315J42423f6070E5539R408M8311A9866a93405
$$ -102918 181739 333052 -115523 91315 233738 -66070 55539 64947 113258 19866 -193405
15129A30435n006C0437K29505M0197D2799J4540L8788J97159c9636j52012B21239
$$ 130435 125429 30437 259942 300139 42799 57339 96127 293286 -39636 -191648 221239
15117B06016D3311J90334R0133a59800A19173e4828J7947B98825j34415J54845
$$ 206016 43311 233645 323778 -159800 119173 -54828 -36881 298825 164410 319255
15107C19255I2150b03614C82023J40411A20895a3918D0540K1427K18826a78273
$$ 319255 92150 -203614 382023 522434 120895 -13918 40540 61967 280793 -178273
15096c0898C43858d4599m4122A35539k6640L65772a6632C13824j52163n2406J63953
$$ -30898 343858 -44599 -88721 135539 108899 474671 -16632 313824 161661 109255 273208
15085B73208j17052E0422M4339J87054J5871A34023A7762L24749I5766J18543
$$ 273208 156156 50422 94761 281815 297686 134023 17762 342511 95766 214309
15075B14309i8074D0439K00548a05432E7041K22910a36508A43061j059n5801K6963
$$ 214309 -98074 40439 240987 -105432 57041 279951 -136508 143061 142002 86201 113164
15064A13164n259k5458A4413J84527J30305j62768b79136A44473L29608D8891
$$ 113164 107905 82447 14413 198940 329245 166477 -279136 144473 474081 48891
15053B68862j15639a12867C71055F6080J5326K3086P9544o8192K02696b10800
$$ 268862 153223 -112867 371055 66080 81406 104492 184036 115844 318540 -210800
15042a47443A62452p6450N5628K2397c4075C64738o6666L7028l6963L0402A39544
$$ -147443 162452 86002 141630 164027 -34075 364738 298072 335100 298137 328539 139544
15030B70951N5011m9514J64063k16022J23610A14464c67657C00582I4656K37093
$$ 270951 325962 276448 440511 224489 348099 114464 -367657 300582 94656 331749
15020C31749j36736J77320F0679K8270M6388f0956C38421J62779A59132L11236
$$ 331749 195013 372333 60679 88949 135337 -60956 338421 501200 159132 470368
15010D70368r0261j54680j5088q2471J63905q8563K76537q7175k4758A46580K01660
$$ 470368 380107 225427 210339 127868 291773 203210 479747 392572 367814 146580 348240
14999C48240j14134j8774K8050r6431R4576K6380A29345J45170g0839b0169B61432
$$ 348240 234106 215332 243382 146951 241527 267907 129345 274515 -70839 -20169 261432
14987H8613e5521D93175G1130b32386b7830j15878A91361o7371L41331A73007
$$ 88613 -55521 493175 71130 -232386 -27830 -143708 191361 123990 465321 173007
14976F4801J94047j05737M4472N4900K81322A37509J65400B3186L49744j03547
$$ 64801 258848 153111 197583 252483 533805 137509 302909 23186 372930 269383
14966B69383a30761D13909D0413K40914J23418A17367J17972g8353B52903K9346
$$ 269383 -130761 413909 40413 281327 404745 117367 235339 -78353 252903 282249
14956B82249G3546K93628n3836j09776L44594B06610a34640D17239A45915P7045
$$ 282249 73546 367174 313338 203562 548156 206610 -134640 417239 145915 222960
14946B22960n4288b2056C34832L9259r1438K53462B48686K43170A69720j9219
$$ 222960 168672 -22056 334832 374091 282653 536115 248686 491856 169720 150501
14936A50501m2556K64140K4412A89904J18823I0038K711h9147C24520j27397N0658
$$ 150501 107945 372085 396497 189904 308727 90038 92749 -89147 324520 197123 247781
14925B47781M7863J58938m555H4394K62650A67963p1744P6634J7864J92633j83590
$$ 247781 295644 454582 450027 84394 347044 167963 96219 172853 190717 383350 199760
14914A99760o1786K2053K1342J62033O787F2001J96184R1824C1432J81839G8723
$$ 199760 137974 160027 181369 343402 350189 62001 258185 350009 31432 213271 78723
14902a3606C72172p1603l7758C1974M41811A94313B5843J85071J89019k9845A50704
$$ -13606 372172 300569 262811 31974 473785 194313 25843 210914 399933 370088 150704
14890C02587e7966D42960j26192k0684A08006J82417K81329k27926k6614j1965
$$ 302587 -57966 442960 316768 296084 108006 290423 571752 343826 317212 305247
14880C05247K25143j51670r725j44486m5746J47675C6856g2993B72089L40527
$$ 305247 530390 378720 368995 224509 178763 326438 36856 -72993 272089 612616
14870F12616j63426j61111A26333O24027b2302C56053l5069J76439A66448K53098
$$ 612616 449190 288079 126333 750360 -22302 356053 320984 497423 166448 419546
14860D19546J877r6059P8694A32828K78894m3867J27451Q559j04152K9376j35331
$$ 419546 421423 325364 404058 132828 411722 367855 495306 503865 399713 429089 293758
14849B93758o7436J65791A40790M24478j00847k9588A44965Q0685J9084K56724
$$ 293758 226322 392113 140790 565268 464421 434833 144965 225650 244734 501458
14839E01458j09789O3989K26043B46145N6446p066J07434l4083K26593p7144B57649
$$ 501458 391669 455658 681701 246145 302591 295525 402959 368876 595469 518325 257649
14827C98267K57759l20154M5650K81968B68310M6692P0000j23874J77872L3015
$$ 398267 656026 335872 381522 663490 268310 315002 385002 261128 439000 472015
14817D72015K87520B65342K62723l2011k32537J92104A99659L71755j81999R9560
$$ 472015 759535 265342 528065 496054 263517 455621 199659 571414 389415 488975
14807D88975l6143l8588A95132L92116k75607K0935J25204q6925O2899N2150j10587
$$ 488975 452832 414244 195132 587248 311641 332576 457780 370855 433754 485904 375317
14796C75317K5901R8925l3294n2824K9708A09474L4435K99953B270L14820J80661
$$ 375317 401218 500143 466849 414025 443733 109474 143909 443862 2270 317090 497751
14785D97751q2151K74869k31190J27905R2071k38402J27335P5952j88632p8028
$$ 497751 415600 690469 459279 587184 679255 440853 568188 644140 455508 377480
14775C77480N62923l28995k98088K13889L8719o403k64515P4598K79454j99144
$$ 377480 940403 611408 313320 527209 565928 559525 295010 369608 649062 449918
14765D49918J42685J1417k97603K75572K99370B06047K49983j95614M86950k82456
$$ 449918 592603 604020 306417 581989 881359 206047 456030 260416 747366 464910
14755D64910K16575P6136J47285l45755B77846J06828L26720k80655K97296J3628
$$ 464910 681485 757621 904906 559151 277846 384674 711394 430739 728035 741663
14745G41663j32902B52161N79929k95591M335J24786P7195p2282L48840m74899
$$ 741663 608761 252161 832090 536499 540834 665620 742815 670533 1019373 544474
14735E44474K11215k73394K08667L60293j74396k90244k47256K72163O7439J92295
$$ 544474 755689 482295 690962 1051255 876859 586615 339359 611522 678961 871256
14725H71256l19197J67194o6408C08406R2664K24888L41788B55054N60387k09348
$$ 871256 552059 719253 652845 308406 401070 625958 967746 255054 815441 606093
14715F06093j18255L0624K71211C94807N96293k71352j52915q3888L89917M5776
$$ 606093 487838 518462 789673 394807 991100 719748 566833 482945 872862 918638
14705I18638j57712p3411J91721L502q2364k58924J10202J69554p7229N9282j60693
$$ 918638 760926 687515 879236 882738 800374 541450 651652 821206 743977 803259 642566
14694F42566j01029J05981k57419K82727N7942q3542N39466E69958K10337j17561
$$ 642566 541537 647518 390099 672826 730768 647226 1186692 569958 780295 662734
14684F62734J395R6689K51161J0580j1770J409j29307j06612j30363M16957m13743
$$ 662734 664129 760818 1011979 1022559 1010789 1012198 882891 776279 645916 1062873 649130
14673F49130J24266L28083k77791J133j16156N3138k53353L27374J98758l45803
$$ 649130 773396 1101479 823688 824821 708665 761803 508450 835824 1034582 688779
14663F88779N6277K28963M5442j03082R6831J03503q9710m8167j00329J31379
$$ 688779 745056 974019 1019461 916379 1013210 1116713 1027003 978836 878507 1009886
14653A009886p5643q2871L67853j98669k62387L01611k40771L09284j80043m0213
$$ 1009886 934243 851372 1219225 1020556 758169 1059780 819009 1128293 948250 908037
14643I08037j52902M31390k25198J11089r6154J20195j6514P8755L05086n23717
$$ 908037 755135 1186525 961327 1072416 976262 1096457 1079943 1158698 1463784 940067
14633I40067P2864L11708m0727k50707N27073n21583M9528j07672N3014J70870
$$ 940067 1012931 1324639 1283912 1033205 1560278 1038695 1088223 980551 1033565 1204435
14623A204435m5140J79312l08106p1021R7247L61094k71311K05033j68955L9715
$$ 1204435 1159295 1338607 1030501 959480 1056727 1417821 1146510 1351543 1182588 1222303
14613A222303l911q2416L7429o6774K06215j42353q4017L42985l42436M37717
$$ 1222303 1218392 1135976 1173405 1106631 1312846 1170493 1086476 1429461 1087025 1524742
14603A524742l89808P1306n133L60699k56203L7496K26213m02581M44506k53355
$$ 1524742 1134934 1206240 1201107 1561806 1305603 1343099 1569312 1166731 1611237 1357882
14593A357882K43050Q0970k7898l4871j48072l89m8620P593n17600O64782r7020
$$ 1357882 1600932 1681902 1654004 1619133 1471061 1470672 1422052 1429645 912045 1576827 1479807
14582A479807J15597j45053J75809J68518r443j37931j2103p3204K13010j88039
$$ 1479807 1595404 1450351 1626160 1794678 1785235 1647304 1635201 1561997 1775007 1586968
14572A586968J86714J6013K1822K89330l90757q6263L569L22048K5142j29184
$$ 1586968 1773682 1789695 1811517 2100847 1710090 1623827 1627396 1949444 1974586 1845402
14562A845402L5958K03638O979j56487m4791R5089M1521k86361J71375M7775J81909
$$ 1845402 1881360 2084998 2091977 1935490 1890699 1985788 2027309 1740948 1912323 1960098 2142007
14551B142007k1634j81996M67493o489N4858J29928J47674k28890N23433P9540
$$ 2142007 2120373 1938377 2405870 2399381 2454239 2584167 2731841 2502951 3026384 3105924
14541C105924L61215k852N70069L10401P02993P47210J004020K876720L257735
$$ 3105924 3467139 3464287 4034356 4344757 5047750 5794960 6798980 9675700 12933435
14532A2933435O149836R118369Q94338j0541555o256629k757489l397828j818165
$$ 12933435 19083271 28201640 29095978 18554423 12297794 9540305 6142477 4324312
14524D324312j081869j22788o76307j06462L03266j87985m79392K59662k57399
$$ 4324312 3242443 3119655 2443348 2336886 2640152 2452167 1972775 2232437 1975038
14515A975038M0507J79302l09602K52772k29158N53153Q2655k91674J85910N8896
$$ 1975038 2015545 2194847 1885245 2138017 1908859 2462012 2544667 2252993 2438903 2497799
14505B497799j4723j78299L77086l12370K13401k12437N0374R3529n26046M08355
$$ 2497799 2483076 2304777 2681863 2369493 2582894 2370457 2420831 2514360 1988314 2396669
14495B396669J26483r455N1047J61611j59872L9163q1609M26447j56479k50589
$$ 2396669 2523152 2513697 2564744 2726355 2566483 2605646 2524037 2950484 2794005 2543416
14485B543416K80201j47758k1287K78448L02825k51662J86787k08087O59999k33506
$$ 2543416 2823617 2675859 2654572 2933020 3235845 2984183 3170970 2962883 3622882 3389376
14475C389376m45874M26517j75672M76992o93091M80556k2231k06145J76397j55673
$$ 3389376 2943502 3370019 3194347 3671339 2978248 3458804 3436573 3230428 3406825 3251152
14465C251152K39078j8640K7833K0640K53166j17639j15065M68958n7397N3396
$$ 3251152 3490230 3471590 3499423 3520063 3773229 3655590 3540525 4009483 3952086 4005482
14455D005482k2323J05335K4695J77038l07028N29405k17806J45555p5331Q208
$$ 4005482 3983159 4088494 4113189 4290227 3983199 4512604 4294798 4440353 4365022 4373230
14445D373230J24880j72425K75616j6723J33553M3120n1034n2801M4463P6825
$$ 4373230 4498110 4325685 4601301 4584578 4718131 4761251 4710217 4657416 4701879 4778704
14435D778704J98531J37528J01763j83239N32164l68541J84091K04974J67646
$$ 4778704 4977235 5114763 5216526 5033287 5565451 5196910 5381001 5585975 5753621
14426E753621j22152k52093R3576L47852N6826J74562l30562J41349J66484J79568
$$ 5753621 5631469 5379376 5472952 5820804 5877630 6052192 5721630 5862979 6029463 6209031
14416F209031P0093O1657p8160J97476L6951J11829O0321K76971k82082K39949
$$ 6209031 6279124 6340781 6262621 6460097 6497048 6608877 6669198 6946169 6664087 6904036
14406F904036J61404m9446J76611j1952L07490K33508j36020P13736n61846r9879
$$ 6904036 7065440 7015994 7192605 7180653 7488143 7721651 7585631 8299367 7737521 7637642
14396G637642J83342N83337J47507n0701M61479J20547k87619J11226Q1959M75076
$$ 7637642 7820984 8404321 8551828 8501127 8962606 9083153 8795534 8906760 8988719 9463795
14386I463795K9054O26152k76030q5727P67917L0769J01127Q7163j66911N23479
$$ 9463795 9492849 10119001 9842971 9757244 10525161 10555930 10657057 10744220 10577309 11100788
14376A1100788K29164L30322Q0518K7684L60787P7373M40915o9832O54875l65068
$$ 11100788 11329952 11660274 11740792 11768476 12129263 12206636 12647551 12577719 13232594 12867526
14366A2867526M89404N31544M7319M5611M06536L81590M79429J7127K86218M02069
$$ 12867526 13356930 13888474 13935793 13981404 14387940 14769530 15248959 15266086 15552304 15954373
14356A5954373J73761P04292k71513Q14214K30201L73133M56886J20759L04903
$$ 15954373 16128134 16832426 16560913 17375127 17605328 17978461 18435347 18556106 18861009
14347A8861009P03589j09026O94530N61691P92092L34136P03484K75963N74644
$$ 18861009 19564598 19455572 20150102 20711793 21503885 21838021 22541505 22817468 23392112
14338B3392112L95034N68862N15640R84235M57943O91031O10577N26263P31950
$$ 23392112 23787146 24356008 24871648 25855883 26313826 27004857 27615434 28141697 28873647
14329B8873647R49219O54890P93271R50096R02707R90082P49460J141052Q60368
$$ 28873647 29822866 30477756 31271027 32221123 33123830 34113912 34863372 36004424 36864792
14320C6864792J189828J051448J381262J107765J377814J306364J433601J205499
$$ 36864792 38054620 39106068 40487330 41595095 42972909 44279273 45712874 46918373
14312D6918373J803552J813779J241682K019692J942687J928056K527291J750163
$$ 46918373 48721925 50535704 51777386 53797078 55739765 57667821 60195112 61945275
14304F1945275K194477K595326K465145K963038K466955L267668L308900L469508
$$ 61945275 64139752 66735078 69200223 72163261 74630216 77897884 81206784 84676292
14296H4676292L645129L659750M036747M454775M544288M683307N031750N776219
$$ 84676292 88321421 91981171 96017918 100472693 105016981 109700288 114732038 120508257
14288A20508257N788221O188008O968703O994093P331359Q470188Q232311Q984422
$$ 120508257 126296478 132484486 139453189 146447282 153778641 162248829 170481140 179465562
14280A79465562R857808J0073452J0759685J1577031J2084328J2609317J3453675
$$ 179465562 189323370 199396822 210156507 221733538 233817866 246427183 259880858
14273B59880858J3544642J4239236J4291668J4810646J4932701J4869556J4238932
$$ 259880858 273425500 287664736 301956404 316767050 331699751 346569307 360808239
14266C60808239J4034218J2956914J2062452J1709238J0324376R896492Q783967
$$ 360808239 374842457 387799371 399861823 411571061 421895437 431791929 440575896
14259D40575896P338378M114907K179175J666544Q25312k824384o331780n971741
$$ 440575896 447914274 452029181 454208356 455874900 456700212 453875828 447544048 441572307
14251D41572307p953389j1230209j1765568j3241048j3842530j4367129j4837235
$$ 441572307 433618918 422388709 410623141 397382093 383539563 369172434 354335199
14244C54335199j4575045j4524769j4752897j4166354j3952295j3007325j2566809
$$ 354335199 339760154 325235385 310482488 296316134 282363839 269356514 256789705
14237B56789705j1555074j2037508j1250610j1359846j1115565j0548887r957042
$$ 256789705 245234631 233197123 221946513 210586667 199471102 188922215 178965173
14230A78965173r320873q256401q427366p298722p099508o999057o165078n269025
$$ 178965173 169644300 161387899 152960533 145661811 138562303 131563246 125398168 120129143
14222A20129143n705155n130598n096054m538972m398467l718911l485820l577007
$$ 120129143 114423988 109293390 104197336 99658364 95259897 91540986 88055166 84478159
14214H4478159l738013l229256k814293k842835k889536k429915k873390k097964
$$ 84478159 80740146 77510890 74696597 71853762 68964226 66534311 63660921 61562957
14206F1562957k192088j838562j985551k207732j551413j655454j632024j379947
$$ 61562957 59370869 57532307 55546756 53339024 51787611 50132157 48500133 47120186
14198D7120186j512670j426444j467768j133819j309152j025884q77626j288118
$$ 47120186 45607516 44181072 42713304 41579485 40270333 39244449 38366823 37078705
14190C7078705j250644j019963q38924q72875q26990p93803r57313q55507q55497
$$ 37078705 35828061 34808098 33969174 33096299 32269309 31475506 30518193 29662686 28807189
14181B8807189o64856q34751m98094q40449n41511q43912l05425m40304o53646
$$ 28807189 28142333 27307582 26809488 25969039 25427528 24583616 24278191 23837887 23184241
14172B3184241n83691o22803o10339j97896o63383o83649j81642m55052k39529
$$ 23184241 22600550 21977747 21367408 21169512 20506129 19822480 19640838 19185786 18946257
14163A8946257o37289k45563l00743n25747m38724j55410l34938j42195m34504
$$ 18946257 18308968 18063405 17762662 17236915 16798191 16642781 16307843 16165648 15731144
14154A5731144m08035j23677n88131k42437k07548j23311m05044P8206m16012
$$ 15731144 15323109 15199432 14611301 14368864 14161316 14038005 13632961 13711167 13295155
14145A3295155k62738l16061k00590l95549j39920J13186m61720q0418k06200
$$ 13295155 13032417 12716356 12515766 12120217 11980297 12093483 11631763 11551345 11345145
14136A1345145j53242m33842O4816L1820n91082k02738j38635J00824l27891M2064
$$ 11345145 11191903 10758061 10822877 10854697 10263615 10060877 9922242 10023066 9695175 9737239
14126I737239m68438k639K80870k91535n95585k9453j23760N9823j84617k59957
$$ 9737239 9268801 9266162 9547032 9255497 8659912 8630459 8506699 8566522 8381905 8121948
14116H121948M93059o20376j47332j86457J37112l92486Q3436k86171J88305m80894
$$ 8121948 8615007 7994631 7847299 7660842 7797954 7405468 7488904 7202733 7391038 6910144
14106F910144j3264K62744n09184M03131l92516m1998j23146j01987J770K21168
$$ 6910144 6896880 7159624 6650440 7053571 6661055 6619057 6495911 6393924 6395694 6616862
14096F616862l22657J5283r8823q3644k62991J29816J03883m04925j5881j59957
$$ 6616862 6294205 6309488 6210665 6127021 5864030 5993846 6097729 5692804 5676923 5516966
14086E516966K9297o6345j137n565K43419l96381r5007j75418J61471k63211n7357
$$ 5516966 5546263 5479918 5478781 5473216 5716635 5320254 5225247 5049829 5211300 4948089 4890732
14075D890732k09100L62775k73905r2319j94379J16956p5641J19361n79927M45667
$$ 4890732 4681632 5044407 4770502 4678183 4483804 4600760 4525119 4644480 4064553 4510220
14065D510220m35967O2699K78607m91375L50866p5844k55830J03453j33086J132
$$ 4510220 4074253 4136952 4415559 3924184 4275050 4199206 3943376 4046829 3913743 3914875
14055C914875n6783K22724P2524m01268K34588j02215j41969r9370m9101M4919
$$ 3914875 3858092 4080816 4153340 3752072 3986660 3884445 3742476 3643106 3594005 3638924
14045C638924l12613L11729o69265P33846n16506J67692J4272J25119r1875j12649
$$ 3638924 3326311 3638040 2968775 3702621 3186115 3353807 3368079 3493198 3401323 3288674
14035C288674l52593N9493M78083l51793k00791k86178P27851m11718Q6539p4030
$$ 3288674 2936081 2995574 3473657 3121864 2921073 2634895 3362746 2951028 3037567 2963537
14025B963537m7485K39732j27120m03938L17891k04036N7734j35266K58117O9257
$$ 2963537 2916052 3155784 3028664 2624726 2942617 2738581 2796315 2661049 2919166 2988423
14015B988423l25214n9199L38473m67481M75475n28263K68889m46701L85369l46153
$$ 2988423 2663209 2604010 2942483 2475002 2950477 2422214 2691103 2244402 2629771 2283618
14005B283618J63551j64908L62880K0484l70761L24940m44461q438J0172K79407
$$ 2283618 2447169 2282261 2645141 2665625 2294864 2619804 2175343 2166905 2177077 2456484
13995B456484j03488l04353J85363m75599J78790K43015k09163O1332j7907j3338
$$ 2456484 2352996 2048643 2234006 1758407 1937197 2180212 1971049 2032381 2014474 2001136
13985B001136l38119L47862K46858J8143j19959K71010J82462K30127L51932J73976
$$ 2001136 1663017 2010879 2257737 2275880 2155921 2426931 2609393 2839520 3191452 3365428
13975C365428J210700J651094K841144N160050R841378N438480q447666p455474
$$ 3365428 4576128 6227222 9068366 14228416 24069794 29508274 21060608 13605134
13967A3605134m001561k893648j393695q20976n01769k03617o98210K38038m96760
$$ 13605134 9603573 6709925 5316230 4495254 3993485 3789868 3091658 3329696 2832936
13958B832936j58718r3064m03806L2072L76563M950l97576r9685n9786q5897p8282
$$ 2832936 2674218 2581154 2177348 2209420 2585983 2590933 2193357 2093672 2033886 1947989 1869707
13947A869707N3364M3290k89532K76818r9144p682K09082j63581j30601j54055
$$ 1869707 1923071 1966361 1676829 1953647 1854503 1846821 2055903 1892322 1761721 1607666
13937A607666K29894J64518m12820J10849K62476k63252k39060n005J37993J87422
$$ 1607666 1837560 2002078 1589258 1700107 1962583 1699331 1460271 1455266 1593259 1780681
13927A780681k12738J62705o7411R6344k60972j1213k49357K62126j18931K65703
$$ 1780681 1567943 1730648 1663237 1759581 1498609 1487396 1238039 1500165 1381234 1646937
13917A646937k79420J44459l57308M88875j14824l10883L35687p2355j3052K5674
$$ 1646937 1367517 1511976 1154668 1643543 1528719 1217836 1553523 1481168 1468116 1493790
13907A493790k0995k94328L47798m0579p3173L1858m98796O98014l91803P1542
$$ 1493790 1472795 1178467 1526265 1485686 1412513 1444371 945575 1643589 1251786 1323328
13897A323328J62757j75331j53517J78657K48694m23886l14321J85597N78770
$$ 1323328 1486085 1310754 1157237 1335894 1584588 1160702 846381 1031978 1610748
13888A610748k60397J23381j06393j75535j51437J58942J27884M9197l76742Q1597
$$ 1610748 1350351 1473732 1367339 1191804 1040367 1199309 1327193 1376390 999648 1081245
13878A081245o7983M90568l92026q8423L62026m03898o1745Q3551Q4198j59404
$$ 1081245 1013262 1503830 1111804 1023381 1385407 981509 919764 1003315 1087513 928109
13868I28109K08223J9972m14103M73320j87757J50077q8689j12494n6686j06093
$$ 928109 1136332 1156304 742201 1215521 1027764 1177841 1089152 976658 919972 813879
13858H13879L82688n0019K5907p4810k51491M536L69973k51664O4129J72568j30514
$$ 813879 1196567 1146548 1172455 1097645 846154 850690 1220663 968999 1033128 1205696 1075182
13847A075182o1468P9121O5722j30934K01772o13526J13888J94895R7522k7144
$$ 1075182 1013714 1092835 1158557 1027623 1229395 615869 729757 924652 1022174 995030
13837I95030j3816K0936J98326n15282K19233K6571j41490K46701p1637J67659
$$ 995030 981214 1002150 1200476 685194 904427 930998 789508 1036209 964572 1132231
13827A132231l56085M5668N4789N036J09901K86115n08878R6138O3415p2383K6387
$$ 1132231 776146 821814 876603 881639 991540 1277655 768777 864915 928330 855947 882334
13816H82334q2605l10733K44732j13543J09314K3247j22648K19023k47779J90280
$$ 882334 799729 488996 733728 620185 729499 752746 630098 849121 601342 791622
13806G91622j58398k57714L37398L60083m18569m0594K56447k53393O1210N8219
$$ 791622 633224 375510 712908 1072991 654422 613828 870275 616882 678092 736311
13796G36311r4109l6J468L1126m8029M9467L05714j66032n5346j09220p7881o6236
$$ 736311 642202 642166 643634 674760 626731 676198 981912 815880 760534 651314 573433 507197
13784E07197O500J2651J61415k13552K83375j55726J29544C59381M80752j82137
$$ 507197 513697 526348 687763 474211 757586 601860 731404 359381 840133 657996
13774F57996J22893j62520J91562l05304o6060P4387m0099J80060j40802M45490
$$ 657996 780889 618369 809931 504627 438567 512954 472855 652915 512113 957603
13764I57603m11057N9116O3827J25875k95399O3232r5296L84834k58527A76800
$$ 957603 546546 605662 669489 795364 499965 563197 467901 852735 594208 176800
13753I81876l26974l04984K9868K86425J83836j60554B88096N31769j0432k95471
$$ 981876 654902 349918 379786 666211 850047 689493 288096 819865 809433 513962
13743E13962j16437J25298J02865j63930J35383M0098k50522r4099L09290J80285
$$ 513962 397525 522823 625688 461758 597141 637239 386717 292618 601908 782193
13733G82193j90118n7273R5113o5565K95421k47903J47194l18047j34987K40524
$$ 782193 592075 534802 629915 564350 859771 611868 759062 441015 306028 546552
13723E46552r5891K91336p1570n2335j25598K2311r8626J32436K8461J88656j04306
$$ 546552 450661 741997 670427 618092 492494 514805 416179 548615 577076 765732 661426
13712F61426k65078q9389L63225o7193p1021K80842B69435M8144K29057O2468
$$ 661426 396348 306959 670184 602991 531970 812812 269435 317579 546636 609104
13702F09104j18637j01536P6744R0303j63808j0281P9648j07819J67665n1223
$$ 609104 490467 388931 465675 555978 392170 381889 461537 353718 521383 470160
13692D70160J2463J14577k14271j50942M63719j95018p4706m4345A32911K32506
$$ 470160 482623 597200 382929 231987 695706 500688 425982 381637 132911 365417
13682C65417J66313n5070m7646K59388j67192j69116l4851K19159J17937j3977
$$ 365417 531730 476660 429014 688402 521210 352094 317243 536402 654339 640362
13672F40362j17551l7022K6375l8830J44182k32660K63606p6845r2634J96775
$$ 640362 522811 485789 512164 473334 617516 384856 648462 571617 478983 675758
13662F75758B79013l344L0484j16925K24548J77663B25724K67001K36337B49987
$$ 675758 279013 275669 306153 189228 413776 591439 225724 492725 729062 249987
13651A87283L48690j60672L9362q2859K24074j89406r1337O8784a28307H78672
$$ 187283 535973 375301 414663 331804 555878 366472 275135 343919 -128307 878672
13640D36855K84773R7856l99435A96650J81038J37277C3194K98593J57214B08484
$$ 436855 721628 819484 420049 196650 377688 514965 33194 331787 489001 208484
13629E87354B59754Q8747j4009q2039K33559N2122j59074K38140B96736m2697
$$ 587354 259754 348501 334492 252453 486012 538134 379060 617200 296736 254039
13619B54039J13520L37651A19720P1948R0535J76221j4673J91653j10888k31188
$$ 254039 367559 705210 119720 191668 282203 458424 443751 635404 524516 293328
13609B93328N9365j56575K14748p6744f324B18029L49630l1733B35102K63298
$$ 293328 352693 196118 410866 334122 -6324 218029 567659 535926 235102 498400
13599D98400L2339p6828j5926k06555j1855K16011M87h85E49789A82131N36165
$$ 498400 530739 453911 437985 231430 219575 435586 436073 -885 549789 182131 718296
13588G18296C29951n2448J24656K29200C4583K51392P4579q4248j16644J45607
$$ 718296 329951 277503 402159 631359 34583 285975 360554 276306 159662 305269
13578C05269L33705A12958m3795J81449J99711r815J46785j99147N4034j35406
$$ 305269 638974 112958 69163 250612 450323 440508 587293 388146 442180 306774
13568C06774J14336A45907L31938I1478L34684j40152r0926J70415K80734G7087
$$ 306774 421110 145907 477845 91478 426162 286010 195084 365499 646233 77087
13557C69393h0431C91815n6303i0975B46253Q2655D2310N55375k90110o5247I9103
$$ 369393 -80431 391815 335512 -90975 246253 328908 42310 597685 307575 242328 99103
13545B97211J12893C5233M02415M674A7149J48279K07197j17903K25745P8296
$$ 297211 410104 35233 437648 442322 17149 165428 372625 254722 480467 558763
13535E58763B12627O8267q685G9667K06115J10527A672M22354L0818n9648a8015
$$ 558763 212627 280894 272209 79667 285782 396309 1672 424026 454844 395196 -18015
13523C55722c1083A0967N9588P5327K05254p9260K78998k20736j00126o5835K8514
$$ 355722 -31083 10967 70555 145882 351136 271876 550874 330138 230012 164177 192691
13512A92691J40553l1191a42770E03441H1058J25464J13634A6549L93K12638c8057
$$ 192691 333244 302053 -142770 503441 81058 206522 320156 16549 16942 229580 -38057
13500C65916H2840J04684n0353R2312J20033N9796L1529I1085Q0288L6947K18476
$$ 365916 82840 187524 137171 229483 349516 409312 440841 91085 171373 208320 426796
13489D26796k9494n5203K5016p3511A42149J46820D3463J05505K14057A62473
$$ 426796 397302 342099 367115 293604 142149 288969 43463 148968 363025 162473
13478B60624i4672I4235Q1799J818j080H2230L98667A48541L7438q5629J74942
$$ 260624 -94672 94235 176034 177852 176772 82230 480897 148541 185979 100350 275292
13467B75292L0569A13923L70199A61824J25517L5360A40353M4022J74535A51314
$$ 275292 305861 113923 484122 161824 287341 322701 140353 184375 358910 151314
13456D8076a52158H0087b49221H3993a9591l2085A61777l7289N8083q2625J16510
$$ 48076 -152158 80087 -249221 83993 -19591 -51676 161777 124488 182571 99946 216456
13445B16456l285E1901K35957O134J45700G7330J5460K03867j10330m8483a22164
$$ 216456 213171 51901 287858 293992 439692 77330 92790 296657 186327 137844 -122164
13433A78625c5068B12648a78069b7019B08689p4094a3410A15870I521K70469A23548
$$ 178625 -35068 212648 -178069 -27019 208689 134595 -13410 115870 9521 279990 123548
13421A16519g626m6907E7217K85763a9996D12243e5932A55829a42865G1402M3097
$$ 116519 -7626 -54533 57217 342980 -19996 412243 -55932 155829 -142865 71402 114499
13410A14499J23832a46960B81188A1282J78899K50209a09636A76364L66890j84400
$$ 114499 238331 -146960 281188 11282 190181 440390 -109636 176364 543254 358854
13400C58854f2364E52003A56937N9953K20752k10075G3142k9557b57015B60495
$$ 358854 -62364 552003 156937 216890 437642 227567 73142 43585 -257015 260495
13389a55582I0980a06321A34339C8883R92L13493H1546j5350l139K7939J22929
$$ -155582 90980 -106321 134339 38883 39875 353368 81546 66196 63057 90996 213925
13378B13925O831I5993a5053B40970b87255C72994j29871G1258L06855D6672j7709
$$ 213925 220756 95993 -15053 240970 -287255 372994 243123 71258 378113 46672 28963
13367B8963N1061r584N4575R1135J59899i9350G0997M59443B14910F9867L6829
$$ 28963 80024 70440 125015 216150 376049 -99350 70997 530440 214910 69867 106696
13356A06696J29928J05917j58337R5320N6766o7759I3087R1012N9296E0601M07556
$$ 106696 236624 342541 184204 279524 336290 268531 93087 184099 243395 50601 458157
13345D58157A84558k9512L55533J0267A88053q9499k8867J87542a81895C04432
$$ 458157 184558 155046 510579 520846 188053 98554 69687 257229 -181895 304432
13334D34687I7160J10229J87054j89752j01009J85706n8575J5931J40862A54787
$$ 434687 97160 207389 394443 204691 103682 289388 230813 246744 387606 154787
13323B96121A3277O4715l1485J51146K28515A63731J31559d6652D97160A29042
$$ 296121 13277 77992 46507 197653 426168 163731 295290 -46652 497160 129042
13312D75978F1428b4226B98469n1753o1700K28073A60531L9268a64851B92478
$$ 475978 61428 -24226 298469 246716 185016 413089 160531 199799 -164851 292478
13301A73049C6840L8140N2918J56740A40687n0874M02795B4091K9742K33980m156
$$ 173049 36840 74980 127898 284638 140687 89813 492608 24091 53833 287813 283657
13290B83657b80535a34676C6282L6589a05557A18972m5944L41865A12613J34647
$$ 283657 -280535 -134676 36282 72871 -105557 118972 73028 414893 112613 247260
13280B47260R5903A02306f8438B31407C045a0375A98112A7229g5317k3913j52374
$$ 247260 343163 102306 -68438 231407 3045 -10375 198112 17229 -75317 -99230 -251604
13269b51604G7575M3720B155J26510f6579B1084m282J18441b939j55408P0868
$$ -251604 77575 121295 2155 128665 -66579 21084 16802 135243 -2939 -158347 -87479
13258h7479L9229K2893D4534J21982M2436e7316d276D47571A34492a49529B10828
$$ -87479 -48250 -25357 44534 166516 208952 -57316 -4276 447571 134492 -149529 210828
13246c8160A38211b32316A97620r6195P62j957C938J34519K29503A67179f8046
$$ -38160 138211 -232316 197620 101425 102187 100230 3938 138457 367960 167179 -68046
13234a38736B13605p6543c13945e5031B70241g8324A52092b47211A03527K92743
$$ -138736 213605 137062 -313945 -55031 270241 -78324 152092 -247211 103527 396270
13224C96270A34555o4940K43974a6196A1069a0537A8214L51775a23778k5098A63248
$$ 396270 134555 69615 313589 -16196 11069 -10537 18214 369989 -123778 -148876 163248
13212I4739J42033P4925f2380B21748o2107J05283n3469d8022b0177j65244A03363
$$ 94739 236772 311697 -62380 221748 159641 264924 211455 -48022 -20177 -185421 103363
13200D23406j08041a34081B43760f360j11762m2641A52738e2136C42534b7077
$$ 423406 315365 -134081 243760 -6360 -118122 -160763 152738 -52136 342534 -27077
13189C72813j49657L9378j28659F3281L35722C3782a20376a9167B22308b91327
$$ 372813 223156 262534 133875 63281 399003 33782 -120376 -19167 222308 -291327
13178F4532P7449B9000J81049J93539j88326i6789H4554k7833e1747n2154G5423
$$ 64532 141981 29000 210049 403588 215262 -96789 84554 56721 -51747 -103901 75423
13166C6228J62587A9189K30976m3020Q6315j35475D3314L37525H9268d4564A79405
$$ 36228 198815 19189 250165 207145 293460 157985 43314 380839 89268 -44564 179405
13154c16232F1982j632b20618A34616J39396C8574a52062K1893n2135D1048e8546
$$ -316232 61982 60350 -220618 134616 274012 38574 -152062 -130169 -182304 41048 -58546
13142A07124J8196k3163j2011b71648C4397O0235a35814C64930D1949a22175B56184
$$ 107124 125320 102157 90146 -271648 34397 94632 -135814 364930 41949 -122175 256184
13130a05211o7377n5584I4288A0916K31621c58338A89238m9612M6770H7334h3161
$$ -105211 -172588 -228172 94288 10916 242537 -358338 189238 139626 186396 87334 -83161
13118A83816E6493a31300B8986J7987e1869B9707K49852d6647q0551J6518A22170
$$ 183816 56493 -131300 28986 46973 -51869 29707 279559 -46647 -127198 -110680 122170
13106B18725j03758M1121C3170j2898b24915a01662r8367g2176A97592O2069a15237
$$ 218725 114967 156088 33170 20272 -224915 -101662 -200029 -72176 197592 259661 -115237
13094f8737j57859C47457b74534g5858A8258d390q3362A38115b45002A31395a59227
$$ -68737 -226596 347457 -274534 -75858 18258 -4390 -87752 138115 -245002 131395 -159227
13082B9338i4998F536K46719c9683r7218A65768n5080D5916h2748j9427B04012
$$ 29338 -94998 6536 253255 -39683 -136901 165768 110688 45916 -82748 -102175 204012
13070a18302c0230A38253a8872B04965J05660a62185I7893c79758b2154A9993
$$ -118302 -30230 138253 -18872 204965 310625 -162185 97893 -379758 -22154 19993
13059D00938B6570a86839B12127a72038b738C06945k5591m7471h7899c5853j81190
$$ 400938 26570 -186839 212127 -172038 -2738 306945 281354 233883 -87899 -35853 -217043
13048b17043B17658a40692O6735C099L61601a25519A21694l2263J38317O768a23957
$$ -217043 217658 -140692 -73957 3099 364700 -125519 121694 89431 227748 234516 -123957
13036C11623I200b09724B48305A8638J0916a61156O8207c9419n4792E1010G02
$$ 311623 9200 -209724 248305 18638 29554 -161156 -92949 -39419 -94211 51010 702
13024i4222B47188D4656O2518K37862d9454A34613b29263B39279H6115m1545K18654
$$ -94222 247188 44656 107174 345036 -49454 134613 -229263 239279 86115 44570 263224
13013B63224A05206d0176G2588g1440A62943b7858j44931B50248B9817b13736
$$ 263224 105206 -40176 72588 -71440 162943 -27858 -172789 250248 29817 -213736
13002A89242J287c2764E4639a26847B54948c09145A78077l3192J31310R3958A61528
$$ 189242 190529 -32764 54639 -126847 254948 -309145 178077 144885 276195 370153 161528
12990A839i8495B26074p0317b40022h1706n0640C55268e414p101G5530J62429
$$ 1839 -98495 226074 155757 -240022 -81706 -132346 355268 -5414 -12515 75530 237959
12979B37959a68632b8350C14466r3128a64510I5326K02393B8685a09783A25542
$$ 237959 -168632 -28350 314466 221338 -164510 95326 297719 28685 -109783 125542
12968A57269o8997J60225b58643G7023f2835C97408D045a13222j79954A02765
$$ 157269 88272 248497 -258643 77023 -62835 397408 4045 -113222 -293176 102765
12957A5012M70372A20631K48098b55758B17986F9302a47119a4814k9024B19264
$$ 15012 485384 120631 368729 -255758 217986 69302 -147119 -14814 -43838 219264
12946c8535p9519k03586D0975O012L36159b75168I3622b65956E2237K85973a3548
$$ -38535 -118054 -321640 40975 46987 383146 -275168 93622 -265956 52237 338210 -13548
12934c35381F4063K55822O5891a53229E9027O6038a57209G5158g4259l5334j1260
$$ -335381 64063 319885 385776 -153229 59027 125065 -157209 75158 -74259 -109593 -120853
12923a20853B8522K4504g8399k35711g5948A79643J15275a4499D1664L00970d1868
$$ -120853 28522 53026 -78399 -314110 -75948 179643 294918 -14499 41664 342634 -41868
12911e8434A83563A4783J88725i0793B75972Q6894A14836j056k7386a29156C0742
$$ -58434 183563 14783 203508 -90793 275972 362866 114836 113780 86394 -129156 30742
12899A39642M2230H4500j0427g29F8668g3258A4790h0090F7424b73723B15923
$$ 139642 181872 84500 74073 -729 68668 -73258 14790 -80090 67424 -273723 215923
12887a26996C56695j70097D7784a79106A31444k5198g422j12022D833a92877I32
$$ -126996 356695 186598 47784 -179106 131444 106246 -7422 -119444 4833 -192877 932
12875I620a68245H4179r002c04143a2898j615A94055K62620A8532b07839i4944
$$ 9620 -168245 84179 75177 -304143 -12898 -14513 194055 456675 18532 -207839 -94944
12863A79K299d4927B04635J49197a60284K5434K6597c8707H8493a3117B14473
$$ 179 2478 -44927 204635 353832 -160284 -134850 -108253 -38707 88493 -13117 214473
12851d8480B27680G7391J38850e5407j09685d7596C203a59791d6019j79673E4538
$$ -48480 227680 77391 216241 -55407 -165092 -47596 3203 -159791 -46019 -225692 54538
12839B50201O9445j56703D4615d1391E8447e0050K3617A07357B3642b02514J00661
$$ 250201 319646 162943 44615 -41391 58447 -50050 -26433 107357 23642 -202514 -101853
12828a01853n4851I7106j549M1953m2558B012b10230b877F970L807h9741k17779
$$ -101853 -156704 97106 95557 137510 94952 2012 -210230 -2877 6970 10777 -89741 -307520
12816c07520N7572C47135j27657P6604b0746l11548G6390a86372f144l2747M113
$$ -307520 -249948 347135 219478 296082 -20746 -332294 76390 -186372 -6144 -38891 -34778
12805c4778p3621h235k6451H0732c39123B74376g373o5980C18959a59755P4541
$$ -34778 -108399 -8235 -34686 80732 -339123 274376 -7373 -73353 318959 -159755 -85214
12794h5214B8529J45714H1607a63818b8643A23167J43253a4584C691J39302b19696
$$ -85214 28529 174243 81607 -163818 -28643 123167 266420 -14584 3691 142993 -219696
12782H8763c9468F4077O4766B0219a2831r0666o8974F5439g1620E3949A208f8593
$$ 88763 -39468 64077 128843 20219 -12831 -103497 -172471 65439 -71620 53949 1208 -68593
12769e0149K3697d692k08694A59417a03140q5333C0297K45622a60891A0J56707
$$ -50149 -26452 -4692 -213386 159417 -103140 -188473 30297 275919 -160891 10 156717
12758A56717a71482n8053A83579E7339Q621K18067g3644H8132O4077k8515e7926
$$ 156717 -171482 -229535 183579 57339 65960 284027 -73644 88132 152209 123694 -57926
12746a3693B79872a82162B18707a15549a6523j6979H5485k3116g5088C6645Q386
$$ -13693 279872 -182162 218707 -115549 -16523 -33502 85485 62369 -75088 36645 45031
12735D5031a54809D8679e44684J88954J15616E1034a5230F3463k725b06529g2507
$$ 45031 -154809 48679 -544684 -355730 -240114 51034 -15230 63463 60738 -206529 -72507
12723A22618C1914d47512a06944K8167j48521A29072j9421a1556G9281J77945
$$ 122618 31914 -447512 -106944 -78777 -227298 129072 109651 -11556 79281 257226
12713B57226o611A00414Q8436e4225B21894d29450i2284j70180I5815A2137K09872
$$ 257226 250615 100414 188850 -54225 221894 -429450 -92284 -262464 95815 12137 222009
12702B22009C9324i5409E1522i9835A53033J39319h8740a8143k0355j10765c9403
$$ 222009 39324 -95409 51522 -99835 153033 292352 -88740 -18143 -38498 -149263 -39403
12690A10018e3045a8621j37517O4297C10818a18412I4110a83108f588I6205K55549
$$ 110018 -53045 -18621 -156138 -91841 310818 -118412 94110 -183108 -6588 96205 351754
12679C51754b3581G7389J30662J76741H1651J06877l1988p7419M4480M61114A72011
$$ 351754 -23581 77389 208051 384792 81651 188528 156540 79121 123601 584715 172011
12667A6214a77546B20118c47931k62253b2731j98078M438F3086L56701a970B36616
$$ 16214 -177546 220118 -347931 -610184 -22731 -220809 -216371 63086 419787 -1970 236616
12655B72697p4758a1681C73336G1122J35844R9702A9010b308G0089c7930A36569
$$ 272697 197939 -11681 373336 71122 206966 306668 19010 -2308 70089 -37930 136569
12643b54099E7114P7658j3243J74821j43031a1823j90679C89142A67346K4480
$$ -254099 57114 134772 121529 296350 153319 -11823 -202502 389142 167346 191826
12633A91826a19388B7727J42723J9723o3065O2464n5771b6096A77157g2995A02613
$$ 191826 -119388 27727 170450 190173 127108 189572 133801 -26096 177157 -72995 102613
12621B5504b2554I0572J1974P4280L51506b9170I5879k9815L77473f1928D35633
$$ 25504 -22554 90572 102546 176826 528332 -29170 95879 66064 443537 -61928 435633
12609B43971K4061a5618B96198J41286a95464B42345r1219J86492A5615O5671
$$ 243971 268032 -15618 296198 437484 -195464 242345 151126 337618 15615 81286
12599H1286K64623b14722E6810J48035B9882P0143h2617A4887d7841D7906I06
$$ 81286 345909 -214722 56810 204845 29882 100025 -82617 14887 -47841 47906 906
12587H1851d4248A53822C2268K17455r641p1115b0097j0733F8782L34587j85423
$$ 81851 -44248 153822 32268 249723 240082 168967 -20097 -30830 68782 403369 217946
12576B17946E7628b01472d8162J3085q5435j43900J11280C5583a43189B19496
$$ 217946 57628 -201472 -48162 -35077 -120512 -264412 -153132 35583 -143189 219496
12565H6912c46579I7231a5721B16889N7656b2547A53179K36686d21418a47876
$$ 86912 -346579 97231 -15721 216889 274545 -22547 153179 389865 -421418 -147876
12554d6121B21730G6980O0434n0939a29377i854k01128G2512m522e911l43776
$$ -46121 221730 76980 137414 86475 -129377 -9854 -210982 72512 67990 -5911 -349687
12543c49687J60009A6894J26822a990H1804J78185b37928B87226A16416L9274
$$ -349687 -189678 16894 143716 -1990 81804 259989 -237928 287226 116416 155690
12533A55690K37062c3523C17190G6570f2697H6743a28838J006J7245A35538a85315
$$ 155690 392752 -33523 317190 76570 -62697 86743 -128838 -127832 -110587 135538 -185315
12521G630b12006f1935A26481f2660A15023L04649I3405a28529A1496J29338a84546
$$ 7630 -212006 -61935 126481 -62660 115023 419672 93405 -128529 11496 140834 -184546
12509B06799b19700C9906a45799B62616r7582B2499i1169M4119A99079K25358
$$ 206799 -219700 39906 -145799 262616 165034 22499 -91169 -47050 199079 424437
12499D24437A84304C7063Q9236a57884c494A83618b45291m776d2459B48643E9751
$$ 424437 184304 37063 126299 -157884 -3494 183618 -245291 -250067 -42459 248643 59751
12487a32986k57951g4976l8892m11596B99886b09309E093J5882b47170A00455
$$ -132986 -390937 -74976 -113868 -525464 299886 -209309 5093 20975 -247170 100455
12476D07570A11831C2096J59887r2819m9373K07441b40257D87945A95675E5018
$$ 407570 111831 32096 191983 99164 49791 257232 -240257 487945 195675 55018
12465C959i8378l7824k1822N814a6508j62056j9320O0032j95651F2334J38258
$$ 3959 -98378 -136202 -158024 -152210 -16508 -178564 -197884 -137852 -333503 62334 200592
12454B00592f8280D3975b03823p6170P2868d4499B7000a19398A66374R4529a02080
$$ 200592 -68280 43975 -203823 -279993 -207125 -44499 27000 -119398 166374 260903 -102080
12442B24310F4570J07552a54066j02554N0756A72990a7020k56300J20403j36889
$$ 224310 64570 172122 -154066 -256620 -205864 172990 -17020 -273320 -152917 -289806
12432b89806g3097j97039A22885b1847j4183a895I9782e5838C05511b01170B03522
$$ -289806 -73097 -270136 122885 -21847 -36030 -1895 99782 -55838 305511 -201170 203522
12420a8292j72040D1968J10017a66677G8579d8825G1678b41632C3639e7673B0992
$$ -18292 -190332 41968 151985 -166677 78579 -48825 71678 -241632 33639 -57673 20992
12408I1852c25150J51499j9930C15026Q296j3570A04652f5194A77972a5097l90071
$$ 91852 -325150 -173651 -193581 315026 323322 309752 104652 -65194 177972 -15097 -405168
12397d05168J94484J1718O4540M2616D5319a04146H9400a60370A71903l8625m3217
$$ -405168 -210684 -198966 -134426 -91810 45319 -104146 89400 -160370 171903 133278 90061
12386I0061b8141j86349Q1559j3518e7924o5666A94679n7837n3713J5757j7232
$$ 90061 -28141 -214490 -132931 -146449 -57924 -123590 194679 136842 83129 98886 81654
12375H1654a08675j07553C21736j57269L1267f5043A15734i2215G5413c8753A08465
$$ 81654 -108675 -216228 321736 164467 195734 -65043 115734 -92215 75413 -38753 108465
12363f322C1065O6325B0027b4839A74779i4281I3046c04132D9175a06871B47029
$$ -6322 31065 97390 20027 -24839 174779 -94281 93046 -304132 49175 -106871 247029
12351h2067H754M8239b08313l365B58722r4499K3027o3488K4738e8463p7001A29273
$$ -82067 8754 56993 -208313 -211678 258722 164223 187250 123762 148500 -58463 -135464 129273
12338e4576A21400b9239m8993B8410b35482a00456A66514L4427H1719M4701f1749
$$ -54576 121400 -29239 -78232 28410 -235482 -100456 166514 200941 81719 126420 -61749
12326B69551a11755a2076j55661f6753j40709f671D0112J20413p7188m0823D985
$$ 269551 -111755 -12076 -167737 -66753 -207462 -6671 40112 160525 83337 42514 4985
12314a50638d8930P429m5645B63690j21959a60504d0441n3440j1776D5359b4670
$$ -150638 -48930 -41501 -87146 263690 141731 -160504 -40441 -93881 -105657 45359 -24670
12302f1285a8695a001k5905k5037A69549a56909L0640c1608p203m5415B31921
$$ -61285 -18695 -1001 -26906 -51943 169549 -156909 -126269 -31608 -38811 -84226 231921
12290A49337a48777j61110D7341K35652A10769b3090P878D6230b22768M756a05962
$$ 149337 -148777 -309887 47341 282993 110769 -23090 -15212 46230 -222768 -218012 -105962
12278c7613E0135L71580a59908O0029j24859h2746j10m8499A75853a40963q8230
$$ -37613 50135 421715 -159908 -99879 -224738 -82746 -82856 -131355 175853 -140963 -229193
12267b29193E04666j15380h2325A69207a37460M0725A14285b1333p4352d5537
$$ -229193 504666 389286 -82325 169207 -137460 -96735 114285 -21333 -95685 -45537
12256G464K39557J22001p7097I1057b00287A56337A6347c65370A0628L72958f7707
$$ 7464 247021 369022 291925 91057 -200287 156337 16347 -365370 10628 383586 -67707
12244a28884B21306A3666c4463j12656C4198b452j93297k5383a01818C769f3044
$$ -128884 221306 13666 -34463 -147119 34198 -2452 -195749 -221132 -101818 3769 -63044
12232D5586P7235d6342H9099J40261K59277j22130a15649A1513b13087h1296q0254
$$ 45586 122821 -46342 89099 229360 488637 366507 -115649 11513 -213087 -81296 -161550
12221a61550H5599f8470D9159K37384A27981o1521K19988r7344J89945A67223
$$ -161550 85599 -68470 49159 286543 127981 66460 286448 189104 379049 167223
12210f1873C02404l659c481C67085G8918J21458C372K82640G9328J92599I1066
$$ -61873 302404 298745 -3481 367085 78918 200376 3372 286012 79328 271927 91066
12198C7439J05293o1408J54646Q4176f544m3852q3353B55031g9334B96109E9461
$$ 37439 142732 81324 235970 320146 -6544 -50396 -133749 255031 -79334 296109 59461
12186A27616a16507A92511j7587j208n0982f9487C22473j04288q8693C5414M37403
$$ 127616 -116507 192511 174924 173716 122734 -69487 322473 218185 129492 35414 472817
12175D72817A48286f7178A40831b30029C52755h8079C89726j61816I1680C6277
$$ 472817 148286 -67178 140831 -230029 352755 -88079 389726 227910 91680 36277
12164g9752G4112K42998b27391B24000H1492K391a29758A07564O3005g0803b6839
$$ -79752 74112 317110 -227391 224000 81492 83883 -129758 107564 170569 -70803 -26839
12152a05958l7491A28075D7412K53989l0046m7734e9289A26054E4720g5174B8761
$$ -105958 -143449 128075 47412 301401 271355 223621 -59289 126054 54720 -75174 28761
12140D814b17779D0445J06842E4481L01194F6526L3075h3392j5438L9917C74368
$$ 4814 -217779 40445 147287 54481 355675 66526 99601 -83392 -98830 -58913 374368
12128a42103B65497a57570a5298I5628a72594G5828C3370a01048a7868A03220
$$ -142103 265497 -157570 -15298 95628 -172594 75828 33370 -101048 -17868 103220
12117A25406k0205m543N3662b30127a03284j02009A56985b65418j30427J71984
$$ 125406 105201 100658 154320 -230127 -103284 -205293 156985 -265418 -395845 -223861
12107b23861j3326A84731H8887J03158J345F2560J63378b30907h7683n3298L3925
$$ -223861 -237187 184731 88887 192045 193390 62560 225938 -230907 -87683 -140981 -107056
12096a07056C38854k8134j25978C6134Q6885Q6543e1744j02496P2496R656I1123
$$ -107056 338854 310720 184742 36134 123019 209562 -51744 -154240 -81744 -72088 91123
12084e9571a0383Q86C686J75710m575a25423B28405A4114c06275H0407f6549E26596
$$ -59571 -10383 -9497 3686 179396 174821 -125423 228405 14114 -306275 80407 -66549 526596
12071a7804B08019a34045C0413d7267A690J47117c29421a42628B84104a89153
$$ -17804 208019 -134045 30413 -47267 1690 148807 -329421 -142628 284104 -189153
12060c252A4766L12721j48526h9841A12929n5851K75098g3A83800J55567O5218
$$ -3252 14766 327487 178961 -89841 112929 57078 332176 -73 183800 339367 404585
12049D04585M26379A62921J70112b35277c9912D35900A84132a19341a1338A93616
$$ 404585 830964 162921 333033 -235277 -39912 435900 184132 -119341 -11338 193616
12038A857J70458F2905a21789j8929A28401a23719q9056B0400a23107r8221j67915
$$ 1857 172315 62905 -121789 -140718 128401 -123719 -212775 20400 -123107 -221328 -389243
12027c89243B8536D80g4089B5711A0457J26328C591K44997F1774K17887p4326
$$ -389243 28536 480 -74089 25711 10457 136785 3591 248588 61774 279661 205335
12016B05335h2642j23850A1709d78459K21237a3358j71266g304D2439J35705A6699
$$ 205335 -82642 -206492 11709 -478459 -257222 -13358 -184624 -7304 42439 178144 16699
12004E5853J185g8096k10616B46764A7350a02877A28509C3419a03537k13884I1581
$$ 55853 57038 -78096 -288712 246764 17350 -102877 128509 33419 -103537 -317421 91581
11992b04705M8555Q513p2045G8673e6659o4736k95825E2569K67719j55736a31366
$$ -204705 -156150 -147637 -219682 78673 -56659 -121395 -417220 52569 320288 164552 -131366
11980g2152o0243C62343H1396b28814G0591c40891H2479e7609k28672A69016c0547
$$ -72152 -132395 362343 81396 -228814 70591 -340891 82479 -57609 -286281 169016 -30547
11968A44471L5582g8212A50244o6960e04837H9131d782A45178O3564a71385c4526
$$ 144471 180053 -78212 150244 83284 -504837 89131 -4782 145178 208742 -171385 -34526
11956B4216a23015o6141b8717A97635i6553c4003k54507a11200k04662a7176j77409
$$ 24216 -123015 -189156 -28717 197635 -96553 -34003 -288510 -111200 -315862 -17176 -194585
11945a94585A4620a49765A38215a04787p4230A94443a75184M9093b9782Q599p8534
$$ -194585 14620 -149765 138215 -104787 -179017 194443 -175184 -126091 -29782 -21183 -99717
11934i9717n732j8727C02197b76827a8632k39329g7822o9695f0131j48873c6131
$$ -99717 -105449 -124176 302197 -276827 -18632 -257961 -77822 -147517 -60131 -209004 -36131
11922a84038B3108a53312M3666D2841O2792a20537F8063a81005b6006k6016B2033
$$ -184038 23108 -153312 -109646 42841 105633 -120537 68063 -181005 -26006 -52022 22033
11910E0424F734a02522M6912A52189h9323n9100O1754K9864A05915a7268p4936
$$ 50424 6734 -102522 -55610 152189 -89323 -148423 -86669 -56805 105915 -17268 -92204
11899i2204B48865C3441c40849J33688d5227C0668a71453A31880m1132f2496j69577
$$ -92204 248865 33441 -340849 -207161 -45227 30668 -171453 131880 90748 -62496 -232073
11888b32073b9258j50732A64748b2038p7371A01755a38141L2900A40275d52928
$$ -232073 -29258 -179990 164748 -22038 -99409 101755 -138141 -105241 140275 -452928
11877a25239F4046b35814F9192i8429l7930H5929b73270a04113H8235a2796l5872
$$ -125239 64046 -235814 69192 -98429 -136359 85929 -273270 -104113 88235 -12796 -48668
11866d8668j10558H3119b4016D40403G7516C7879b76258E5606a8606q0042F2933
$$ -48668 -159226 83119 -24016 440403 77516 37879 -276258 55606 -18606 -98648 62933
11854F8621a24684H0486b2053A7228h9065H6133c07167e1406l39143D81610b6377
$$ 68621 -124684 80486 -22053 17228 -89065 86133 -307167 -51406 -390549 481610 -26377
11842c8443j22672B33186g8357C4298A5567L36256I583b72324A07253L9601a12414
$$ -38443 -161115 233186 -78357 34298 15567 351823 9583 -272324 107253 146854 -112414
11830A3567a06685A27514F275d6057F5165O0066b420o1926A1893c85774f8819
$$ 13567 -106685 127514 6275 -46057 65165 125231 -2420 -64346 11893 -385774 -68819
11818b27038B6947M1271M2193a03383A39882i7792l8093B5873i2715a5428j27629
$$ -227038 26947 68218 110411 -103383 139882 -97792 -135885 25873 -92715 -15428 -143057
11807a43057h907j41927j59641a7273l01207a35019l54158K40244A7479J12856
$$ -143057 -8907 -150834 -310475 -17273 -318480 -135019 -489177 -248933 17479 130335
11797A30335a00184K6875G2834a70694k41095h8507I5031c730B29280a50288O7451
$$ 130335 -100184 -73309 72834 -170694 -411789 -88507 95031 -3730 229280 -150288 -82837
11786h2837B92592A03094a41671J4634o8541B9677Q5817g5311c0504n3841l50867
$$ -82837 292592 103094 -141671 -127037 -195578 29677 115494 -75311 -30504 -84345 -435212
11775d35212i3858B90956d63331A54277Q9234F6140a37232B67711F4239a46609
$$ -435212 -93858 290956 -463331 154277 243511 66140 -137232 267711 64239 -146609
11764A25876K654C578a68925I1918d9843j9037o3711B69832j21962a64237r267
$$ 125876 128530 3578 -168925 91918 -49843 -68880 -132591 269832 147870 -164237 -173504
11753a73504O3982B75888a19623N275A62725J35577a8285l15604F3105J58204
$$ -173504 -109522 275888 -119623 -114348 162725 298302 -18285 -333889 63105 221309
11743B21309b3357O740G4378l3981J66156a10864F9712d1059k50536d0588n4039
$$ 221309 -23357 -16617 74378 40397 206553 -110864 69712 -41059 -291595 -40588 -94627
11732i4627b9224H8115c51628i0898j14515A84042a17585I0934d16101e8781k9171
$$ -94627 -29224 88115 -351628 -90898 -205413 184042 -117585 90934 -416101 -58781 -87952
11721h7952c7601p8625A13383a71582h5326j15322j26784a13534N6229l36636
$$ -87952 -37601 -116226 113383 -171582 -85326 -200648 -327432 -113534 -57305 -393941
11711c93941g1288k4331l0845C45244H3976b31203J15481j0829B5091d9759A27131
$$ -393941 -71288 -95619 -126464 345244 83976 -231203 -115722 -126551 25091 -49759 127131
11699D4158d40215a88645A62166B6133c05650a18336b8329D576b52327B79563
$$ 44158 -440215 -188645 162166 26133 -305650 -118336 -28329 4576 -252327 279563
11688D3500a21063a3659D1577d645j34175B99587a86753N8632M2589j68630B04380
$$ 43500 -121063 -13659 41577 -4645 -138820 299587 -186753 -128121 -85532 -254162 204380
11676b56500N3608k24367A64414n1381a22255F2015N4342J97173A7522L9588d56139
$$ -256500 -202892 -427259 164414 113033 -122255 62015 116357 313530 17522 57110 -456139
11664E503Q5873a07988D5584j5646i4723C72008b7885B36961C5754L9278K1788
$$ 5503 91376 -107988 45584 29938 -94723 372008 -27885 236961 35754 75032 96820
11653I6820e81179b84938J41469A343K542c09692J36094A59788l1653a94797L2269
$$ 96820 -581179 -284938 -143469 1343 3885 -309692 -173598 159788 128135 -194797 -162528
11642a62528m4924E7571P9672D2025i3061n0426F3845a8688k81175b1036j07085
$$ -162528 -207452 57571 137243 42025 -93061 -143487 63845 -18688 -299863 -21036 -128121
11631a28121A15484K79244j49123a71748G0848a4409B7028E090a11695a6040b401
$$ -128121 115484 394728 245605 -171748 70848 -14409 27028 5090 -111695 -16040 -2401
11619b29885e5153n2524A03615a67914I3934a58325i941B65216H8731a83109j04899
$$ -229885 -55153 -107677 103615 -167914 93934 -158325 -9941 265216 88731 -183109 -288008
11608b88008F646K13275a62470F8132a56248H2470i9267o1632G6603J23955L7093
$$ -288008 6646 219921 -162470 68132 -156248 82470 -99267 -160899 76603 200558 237651
11597B37651a86003P0268A04859a05076H1836b25944P5663D2083J15887C9259
$$ 237651 -186003 -115735 104859 -105076 81836 -225944 -150281 42083 157970 39259
11586A45304a43157E9595e1675B39144c3837H7401L92592c73225d4637q6742A1949
$$ 145304 -143157 59595 -51675 239144 -33837 87401 479993 -373225 -44637 -131379 11949
11574b43579B39387F406b68794B58512q8547b44924A22109M0328b50467A71059
$$ -243579 239387 6406 -268794 258512 169965 -244924 122109 162437 -250467 171059
11563a55270A17214b94717E4835d98744A26243b10146B07003a76692I8060h3575
$$ -155270 117214 -294717 54835 -498744 126243 -210146 207003 -176692 98060 -83575
11552a8338q1557d4772C6490Q9577g3580H8052d0978A4302o082a75039c9612B21949
$$ -18338 -99895 -44772 36490 126067 -73580 88052 -40978 14302 8220 -175039 -39612 221949
11539b79241D9278b36718r9210a22793B55365j6441A05767b0525j3870B7866K40109
$$ -279241 49278 -236718 -335928 -122793 255365 238924 105767 -20525 -34395 27866 267975
11528B67975a232j87678b6870D2332I015a99978C01176c2487I5395i2500K0615
$$ 267975 -1232 -188910 -26870 42332 9015 -199978 301176 -32487 95395 -92500 -71885
11517g1885B59039C0052a53367N2810i999j60813C2824q185l522K03961p7481
$$ -71885 259039 30052 -153367 -100557 -9999 -170812 32824 24639 21117 225078 147597
11506A47597a20160N1047A28331b424I2373k4528e91A12403J34355J51360B2043
$$ 147597 -120160 -69113 128331 -2424 92373 67845 -591 112403 246758 398118 22043
11494i9354A57152P2698h842E2341J60268a57027C9274J60236i3499A85645C185
$$ -99354 157152 229850 -8842 52341 212609 -157027 39274 199510 -93499 185645 3185
11482B26765f0352G02875C12163c9111C0435L05083P5761b67979A07371M4178
$$ 226765 -60352 702875 312163 -39111 30435 335518 411279 -267979 107371 151549
11472A51549M1969l1239F0591a87117f5756B32148A06050k9769P653C4017K27799
$$ 151549 193518 162279 60591 -187117 -65756 232148 106050 76281 83934 34017 261816
11461B61816G2280N9783J3640D2063J71704a53307G4790L8072K8899R2591a1674
$$ 261816 72280 132063 145703 42063 213767 -153307 74790 112862 141761 234352 -11674
11449G9500K90465h9565A73777M3637k1662c0024o0000B15271q348J04836Q8486
$$ 79500 369965 -89565 173777 217414 195752 -30024 -90024 215271 206923 311759 400245
11438D00245j58620b89727a19994H1770c54764Q5370F0810B6277i5654k23772
$$ 400245 241625 -289727 -119994 81770 -354764 -269394 60810 26277 -95654 -319426
11428c19426a0348C4542K3810K34102j34397E597e411F9662f8340j236j13393
$$ -319426 -10348 34542 58352 292454 158057 5597 -5411 69662 -68340 -69576 -182969
11417a82969J9741P8758A21686h9595C1516b10103j35269B03222i2727D2385J85581
$$ -182969 -163228 -84470 121686 -89595 31516 -210103 -345372 203222 -92727 42385 227966
11406B27966b65870B32812A113J94829a00923E9265d6742k880B38629j10919f0511
$$ 227966 -265870 232812 1113 195942 -100923 59265 -46742 -49622 238629 127710 -60511
11394A66376C6466a18704B09010d2884A15685n0553J39386f4035A07095b931B04409
$$ 166376 36466 -118704 209010 -42884 115685 65132 204518 -64035 107095 -2931 204409
11382a76206A7841A34L5414J18798J14435A29965f2331C3870a48362B35043l4067
$$ -176206 17841 134 35548 154346 268781 129965 -62331 33870 -148362 235043 200976
11371B00976g5706p091L5244b2306B70164a6109k1106j58468k2745a05803K1989
$$ 200976 -75706 -82797 -47553 -22306 270164 -16109 -37215 -195683 -218428 -105803 -83814
11360h3814i761k75487J32282B10096b89250B83886b50876B51621j12209k3321
$$ -83814 -9761 -285248 -152966 210096 -289250 283886 -250876 251621 139412 116091
11350A16091L5696J16009b88905M8174B3697k380b8872j33216a8638j86946A14479
$$ 116091 151787 267796 -288905 -240731 23697 21317 -28872 -162088 -18638 -205584 114479
11338c5179j8513A32167J89169c0351B7117a43862N5255G2969d263A60921k1622
$$ -35179 -53692 132167 321336 -30351 27117 -143862 -88607 72969 -4263 160921 139299
11327A39299b31024A43297f1957m5797I4613b69720B50393b31891H1734i4590
$$ 139299 -231024 143297 -61957 -107754 94613 -269720 250393 -231891 81734 -94590
11316a38870B82160c17345a48239P1241j63921A21371b5540j08489I0260A635
$$ -138870 282160 -317345 -148239 -76998 -240919 121371 -25540 -134029 90260 1635
11305B96676j08694b71189R4327P7301m4279j84812A84049L1092k7147J14289
$$ 296676 187982 -271189 -176862 -99561 -143840 -328652 184049 215141 187994 302283
11295C02283c1170j418C5017e7631C45714g8375B011c0185j88882d6478K3124
$$ 302283 -31170 -32588 35017 -57631 345714 -78375 2011 -30185 -219067 -46478 -23354
11284b3354C51996j70997b0779q7724b0837A06451c0031B61876a67223M9640B274
$$ -23354 351996 180999 -20779 -108503 -20837 106451 -30031 261876 -167223 -117583 2274
11272A20469a66584j49049e4786A62167a22921k31351J39754C823a59732I0955
$$ 120469 -166584 -315633 -54786 162167 -122921 -354272 -214518 3823 -159732 90955
11261c61377a24207C33970a46781B1211i0046k93894D45592b3293B08522b5403
$$ -361377 -124207 333970 -146781 21211 -90046 -383940 445592 -23293 208522 -25403
11250b01609C2128f8286O644r8406M4786F2872d9565j68982e7663k07848E8024
$$ -201609 32128 -68286 -61642 -160048 -115262 62872 -49565 -218547 -57663 -265511 58024
11238e80124b55151a9722A21618l0801e0469l8525l4373p4664n2718a1264k41600
$$ -580124 -255151 -19722 121618 90817 -50469 -88994 -123367 -198031 -250749 -11264 -252864
11227b52864h9531o0170j63424a52321k13303K2199A81938c26410a33522N3529
$$ -252864 -89531 -149701 -313125 -152321 -365624 -343425 181938 -326410 -133522 -79993
11217g9993j04918f129A61866I031K08747g3580k2368H7487m420b30367r1819
$$ -79993 -184911 -6129 161866 9031 217778 -73580 -95948 87487 83067 -230367 -322186
11206c22186A06008C9018A3004b5418R739H6969m2963J62610E2892c27580C8240
$$ -322186 106008 39018 13004 -25418 -15679 86969 44006 206616 52892 -327580 38240
11194b37742c03k01251N0844J76j05173a3358m897j58968L6445O0342j75381J12971
$$ -237742 -303 -201554 -150710 -150534 -255707 -13358 -18255 -177223 -140778 -80436 -255817 -142846
11182a42846d450B5051a91014A44580c06124A03602f532E0434h4964A21600F0100
$$ -142846 -4450 25051 -191014 144580 -306124 103602 -6532 50434 -84964 121600 60100
11170a12628F1174K25471A31733A283K81910I7250J99609Q9170F50a3933C07446
$$ -112628 61174 286645 131733 1283 283193 97250 296859 386029 650 -13933 307446
11158b28951b2060I7581i9677D1396a43514A33096a85223G0649a82827B96475
$$ -228951 -22060 97581 -99677 41396 -143514 133096 -185223 70649 -182827 296475
11147b17456A13217N3998B8248K72416C0325d8761A16627b06103i1698c2437j33791
$$ -217456 113217 167215 28248 300664 30325 -48761 116627 -206103 -91698 -32437 -166228
11136a66228c8317H0768A3482J15880a27180H7330d1224n6824q9995B40265a22472
$$ -166228 -38317 80768 13482 129362 -127180 87330 -41224 -98048 -188043 240265 -122472
11124b74662B22033c9857l8696E4573J05481F4002L940J37009P583L7214c9793
$$ -274662 222033 -39857 -78553 54573 160054 64002 67942 204951 212534 249748 -39793
11112A32435a91722A9422J33737F6905b29174C185K5407J69886b7394C3347c53777
$$ 132435 -191722 19422 153159 66905 -229174 3185 28592 198478 -27394 33347 -353777
11100A24313N804M8299B5589K0127a68715A91460l1367D4215K95341g3335A83802
$$ 124313 130117 178416 25589 45716 -168715 191460 160093 44215 339556 -73335 183802
11088I3822J63803j21782o5079b0934A72955C8294J78609q078a5071B93372j1803
$$ 93822 257625 135843 70764 -20934 172955 38294 216903 208825 -15071 293372 281569
11077B81569B5560K1930P4932J630b70504P2331C43072m3969b09238C48700A03154
$$ 281569 25560 47490 122422 124052 -270504 -198173 343072 299103 -209238 348700 103154
11065H9034Q1137K36637L2427P6567A59260P8948R294C7679O08570k94599K5800
$$ 89034 170171 406808 439235 515802 159260 238208 247502 37679 646249 351650 377450
11054C77450k7731m1788J86002n3756J22584j77297K9671j02181K93698j19316
$$ 377450 349719 307931 493933 440177 562761 385464 415135 312954 606652 487336
11044D87336j38520J29320L6384Q6368r5834Q6833l4681Q8950j44201L26886N140
$$ 487336 348816 478136 514520 600888 505054 591887 557206 646156 501955 828841 833981
11033H33981j73165J58967k26189q6616l4631L34955l9354J94184p9449j2553
$$ 833981 660816 819783 593594 506978 472347 807302 767948 962132 882683 870130
11023H70130k27447j13484J31512r0955J70166J82340l12693K30054k10093K06631
$$ 870130 642683 529199 660711 569756 739922 922262 609569 839623 629530 836161
11013H36161l48635J97733j34261m6412J30943k57554M33370k71773L81442l86695
$$ 836161 487526 685259 550998 504586 635529 377975 811345 539572 921014 534319
11003E34319L21597k10368K21886k45882L7220K40423o4780O7790l50823J17123
$$ 534319 855916 645548 867434 621552 658772 899195 834415 902205 551382 668505
10993F68505j96459L78243K7351j37714j49365j5496K58288m7178C65881P68661
$$ 668505 472046 850289 877640 739926 590561 575065 833353 786175 365881 1134542
10983A134542C83002K76090j30330J74360J46162K9878l59959K30815K43185j89688
$$ 1134542 383002 659092 528762 703122 849284 879162 519203 750018 993203 803515
10973H03515j19104K62282j40782q6797M20652j87371L56765j34066J27384J12058
$$ 803515 684411 946693 805911 719114 1139766 952395 1309160 1175094 1302478 1414536
10963A414536J19559Q5868L21150L82888p9975J91301K45654M43003K22577k33373
$$ 1414536 1534095 1619963 1941113 2324001 2244026 2435327 2680981 3123984 3346561 3113188
10953C113188j21089n66021R319j95045q34253M71N5571l61400L52781m39251
$$ 3113188 2992099 2426078 2435397 2240352 1406099 1406570 1462141 1100741 1453522 1014271
10943A014271K20348j86638K73480k57233q5687k88805J79083j67691C48765Q8351
$$ 1014271 1234619 1047981 1321461 1064228 978541 689736 868819 701128 348765 437116
10933D37116r1817J0172j6391k9067J31069A21919J51297d4094D44823a0026p1291
$$ 437116 345299 355471 339080 310013 441082 121919 273216 -44094 444823 -10026 -81317
10922h1317A5342R3058D7532R8674c4548I6501P5922F7328j2116B6183L66937
$$ -81317 15342 108400 47532 146206 -34548 96501 172423 67328 55212 26183 393120
10911C93120A46367J56304a66123A74643a47571e6656K3906p8626D9528d5918
$$ 393120 146367 302671 -166123 174643 -147571 -56656 -32750 -111376 49528 -45918
10900a98530A15854k7288C1141a43441C03239b75430K4577b8784A44322L7782
$$ -198530 115854 88566 31141 -143441 303239 -275430 -250853 -28784 144322 182104
10890A82104C4750J83022K6816a52488J9714E8725f8689A7667a37112G8899B6694
$$ 182104 34750 217772 244588 -152488 -132774 58725 -68689 17667 -137112 78899 26694
10878c0749q7159I0009e8014j14191M9663j85636a14098e799j2010k13468M4322
$$ -30749 -117908 90009 -58014 -172205 -122542 -308178 -114098 -5799 -17809 -231277 -186955
10867a86955g7374I463b35875A57611i6090B3165g9042B11621a60922G2518b04000
$$ -186955 -77374 9463 -235875 157611 -96090 23165 -79042 211621 -160922 72518 -204000
10855C1363J29821J35445c42830G1862a94508G7406K19306h7449G8666O2794m4247
$$ 31363 161184 296629 -342830 71862 -194508 77406 296712 -87449 78666 141460 97213
10844I7213O7036J74208B8492A2967D41d932r3500L3712n4226l8800L3090A81934
$$ 97213 164249 338457 28492 12967 441 -4932 -98432 -64720 -118946 -157746 -124656 181934
10831A07102a85251C4079N3547a29687A27422a77015H8405K3321K7693a33632
$$ 107102 -185251 34079 87626 -129687 127422 -177015 88405 111726 139419 -133632
10820A84362R627c6296E6210c4139k26594l3654A92391d17259d615B8660J50669
$$ 184362 193989 -36296 56210 -34139 -260733 -294387 192391 -417259 -4615 28660 179329
10809A79329c66561I0634J00542i7427K2998m8524J8267I4401f8675B71115a8058
$$ 179329 -366561 90634 191176 -97427 -74429 -122953 -104686 94401 -68675 271115 -18058
10797a89864e262A72021a67281K4609e1362m9877M0358B49806a2136m32273A57118
$$ -189864 -5262 172021 -167281 -142672 -51362 -101239 -60881 249806 -12136 -444409 157118
10785a71704a9981o1674r4622a333k23282D6120a89851A36539L0465M0533P4872
$$ -171704 -19981 -81655 -176277 -1333 -224615 46120 -189851 136539 167004 207537 282409
10774B82409a81607C9953b2999k3542I0389N9170d7926B24786k0473b23854J05418
$$ 282409 -181607 39953 -22999 -46541 90389 149559 -47926 224786 204313 -223854 -118436
10763a18436M0838F712a03711k6000j04480A02411a02979J4589B00429m4628N5290
$$ -118436 -77598 6712 -103711 -129711 -234191 102411 -102979 -88390 200429 155801 211091
10752B11091a65960J1044A80641b75916i0601H852a09281F7147b1151k32136f9698
$$ 211091 -165960 -154916 180641 -275916 -90601 8852 -109281 67147 -21151 -253287 -69698
10740a54435I76P2274K28861a52727J4358L6103B04353n96b63632H547K02168
$$ -154435 976 73250 302111 -152727 -138369 -102266 204353 203757 -263632 8547 210715
10729B10715B5193c12590R8399A14178a8299p1708m8591A623b5898A02710c3030
$$ 210715 25193 -312590 -214191 114178 -18299 -90007 -138598 1623 -25898 102710 -33030
10717b91760e2047A50836f2051A09323a29721N9753m87673A42485g3315B4969
$$ -291760 -52047 150836 -62051 109323 -129721 -69968 -557641 142485 -73315 24969
10706I6861b4718k1075F4005d0366r8009k9846Q0623n7615C20305d5509j36116
$$ 96861 -24718 -45793 64005 -40366 -138375 -168221 -87598 -145213 320305 -45509 -181625
10695a81625P4437r5286R051F5084j4250a36663j9231E8735Q8433C6223c7299
$$ -181625 -107188 -202474 -193423 65084 50834 -136663 -155894 58735 147168 36223 -37299
10683e2813m0443A33568a89007L0877B33295k3956h0699E3616J99029G4060f679
$$ -52813 -93256 133568 -189007 -158130 233295 209339 -80699 53616 252645 74060 -6679
10671A06921h2155k07396C5125j790f9825j13412h9291l28081d9724r8912A02481
$$ 106921 -82155 -289551 35125 33335 -69825 -183237 -89291 -417372 -49724 -148636 102481
10659b6719a0785D9702b26229J05113A77075a82563N2978H7726R398c80247j7772
$$ -26719 -10785 49702 -226229 -121116 177075 -182563 -129585 87726 97124 -380247 -398019
10648c98019J91962f1412C2239g1514A40664c03188J48468H8180A9781j201k16
$$ -398019 -206057 -61412 32239 -71514 140664 -303188 -154720 88180 19781 18580 18364
10637A8364J53985o4143l3814p69d9489k05809D9999a07114k12922H1384a48090
$$ 18364 172349 108206 74392 73623 -49489 -255298 49999 -107114 -320036 81384 -148090
10625B26458k6632f2401A01624a5230l38535c202o1944J8134E3205a89100j70738
$$ 226458 199826 -62401 101624 -15230 -353765 -3202 -65146 -47012 53205 -189100 -359838
10614c59838A69985a28247b1514A9050J9848e6001I5585f0484k79843J53522P1800
$$ -359838 169985 -128247 -21514 19050 38898 -56001 95585 -60484 -340327 -186805 -115005
10603a15005B1011J14411a28375k42719E7731B2785K75848h4485A2117R9955a05648
$$ -115005 21011 135422 -128375 -371094 57731 22785 298633 -84485 12117 112072 -105648
10591F4874J50852Q084A8373J56167f6228n2206n5681I3604a92980r1548A98435
$$ 64874 215726 223810 18373 174540 -66228 -118434 -174115 93604 -192980 -284528 198435
10579A65304p0199b88818a10438J0566G1170J88905c62251J07638A34711A9626
$$ 165304 95105 -288818 -110438 -99872 71170 260075 -362251 -254613 134711 19626
10568e3554j26946q1397I7333b15655k8019c3434k43935C6876J76259H8897i7636
$$ -53554 -180500 -261897 97333 -215655 -243674 -33434 -277369 36876 213135 88897 -97636
10556b12917m4457l0186f5082k18247M9129p4479a07472l02589I5508k4178i1589
$$ -212917 -257374 -287560 -65082 -283329 -234200 -308679 -107472 -410061 95508 71330 -91589
10544F5728h1566E0234i651p3705c7420k1671F1367O3257K95785j87160g1668
$$ 65728 -81566 50234 -9651 -83356 -37420 -59091 61367 124624 420409 233249 -71668
10532a60106r2883E2598a3720k8723A06076q113a9472j73434B26199a65280d6325
$$ -160106 -252989 52598 -13720 -42443 106076 97963 -19472 -192906 226199 -165280 -46325
10520E0723m406b21761B23593q6335a04912j51983j34294B73751a85484j30540
$$ 50723 46317 -221761 223593 137258 -104912 -256895 -391189 273751 -185484 -316024
10510c16024M0962g0126k29695A56111a41263q969B25737b05073F3053a50767
$$ -316024 -275062 -70126 -299821 156111 -141263 -150232 225737 -205073 63053 -150767
10499C36745a96585B8513a40994L5491e2393C02846e4200E7958g6627L0777j03354
$$ 336745 -196585 28513 -140994 -105503 -52393 302846 -54200 57958 -76627 -45850 -149204
10488a49204f2686k8905E1823h0585j5279m5427j87659a3966j29480j08464f4119
$$ -149204 -62686 -91591 51823 -80585 -95864 -141291 -328950 -13966 -143446 -251910 -64119
10476a81611Q0386j38894j27340A70991j5111b45473G7032a31206E4009a25353
$$ -181611 -101225 -240119 -367459 170991 155880 -245473 77032 -131206 54009 -125353
10465d0899l53180F5182g6591j89940B3033b58487A04341i3502L2953K1936k03923
$$ -40899 -394079 65182 -76591 -266531 23033 -258487 104341 -93502 -60549 -38613 -242536
10454b42536q1576A78425n5617E7728c17366B4947O0347k3363b15521c398j15280
$$ -242536 -324112 178425 122808 57728 -317366 24947 85294 61931 -215521 -3398 -118678
10443a18678a8027B4107a84109p070P9425c2622A01175b06462B09718a18557A24857
$$ -118678 -18027 24107 -184109 -191179 -111754 -32622 101175 -206462 209718 -118557 124857
10431F4457K84301G2138a21478A99941o2783a9002A42623b36978g8665A35066
$$ 64457 348758 72138 -121478 199941 137158 -19002 142623 -236978 -78665 135066
10420d0333B82747a58021L6562d2639B22305b7436k71169B0533N4150M7728a73722
$$ -40333 282747 -158021 -121459 -42639 222305 -27436 -298605 20533 74683 122411 -173722
10408C6025Q6449e8867K715r3672A25118c3314j72291A61067n4595a13163B52627
$$ 36025 122474 -58867 -56152 -149824 125118 -33314 -205605 161067 106472 -113163 252627
10396A90590a0965A78092c677F8223R2504i1209B75806Q4777I8911h3911d1049
$$ 190590 -10965 178092 -3677 68223 160727 -91209 275806 360583 98911 -83911 -41049
10384I7092a44968A83117c30508B76015q1041b611D0378A2210K76688j3375d529
$$ 97092 -144968 183117 -330508 276015 194974 -2611 40378 12210 288898 275523 -4529
10372B59067D8110N8921J93131A24909j1322Q8152J13642b17162C94504c2693
$$ 259067 48110 107031 300162 124909 113587 201739 315381 -217162 394504 -32693
10361B38290B4083L2733M32878A46429J86911A03203J48327J05734R8639O3503
$$ 238290 24083 56816 489694 146429 333340 103203 251530 357264 455903 519406
10351E19406j47061j5696p9109q35L6785a76311E12054F2077I55J15254j4908
$$ 519406 372345 356649 277540 276705 313490 -176311 512054 62077 955 116209 101301
10340A01301m4770J36474m2950M21302j77096N7392K11245K7543B51069n7474
$$ 101301 56531 193005 150055 571357 394261 451653 662898 690441 251069 193595
10330A93595r0496K2305L48556C6297O841M1831Q1773K07187D3041P0371R3817
$$ 193595 103099 125404 473960 36297 43138 84969 166742 373929 43041 113412 207229
10319B07229n8945K34286c4206j67740A14783J06890K3251I5976a58312C19642
$$ 207229 148284 382570 -34206 -201946 114783 221673 244924 95976 -158312 319642
10308B42344A17893e9720C2300J47216M583O577F3804J98287H42a93602B45124
$$ 242344 117893 -59720 32300 179516 184099 190676 63804 262091 842 -193602 245124
10296F2778j755k5199a66606F2585k4687P1296B9145b60803a15361A2529e074
$$ 62778 61023 35824 -166606 62585 37898 109194 29145 -260803 -115361 12529 -5074
10284C90841g5621L6314n0563A96945b62693N2218A04686J30468F4135P6425b74301
$$ 390841 -75621 -39307 -89870 196945 -262693 -210475 104686 235154 64135 140560 -274301
10272b1350l0690C25151C1043R4235b03007F6823b32403a861j20987j89364B01330
$$ -21350 -52040 325151 31043 125278 -203007 66823 -232403 -1861 -122848 -312212 201330
10260A99905d0187k30003c0833a1952A149K09255c49781b0901k7219C4675a86719
$$ 199905 -40187 -270190 -30833 -11952 1149 210404 -349781 -20901 -48120 34675 -186719
10248a04292j41267r4878N6806R9982A69871O545b99260I5696D5989P1464k4113
$$ -104292 -245559 -340437 -283631 -183649 169871 176416 -299260 95696 45989 117453 93340
10237I3340c5029j4333B00315d9833B26946a9861j36944E3710K4370M2981l2011
$$ 93340 -35029 -49362 200315 -49833 226946 -19861 -156805 53710 78080 121061 89050
10226H9050c03494a48256O5335B96273D1308M4947c7535A3669h7807q0016q9169
$$ 89050 -303494 -148256 -82921 296273 41308 86255 -37535 13669 -87807 -167823 -256992
10215b56992B71169e6923j4218A64004j1851f8103A0445c48539I2275m471g8268
$$ -256992 271169 -56923 -71141 164004 152153 -68103 10445 -348539 92275 87804 -78268
10203e4442p3287A08985B6543p559b45787O7195N5619A01062b795j15715A77860
$$ -54442 -127729 108985 26543 18984 -245787 -178592 -122973 101062 -2795 -118510 177860
10191A69683B1074g9451A35950i1749j89658B7407k946K56537I2997c11577H7927
$$ 169683 21074 -79451 135950 -91749 -281407 27407 24461 280998 92997 -311577 87927
10179d25306F6206c85551A63351a82418b2427n8677o652I9636M1250B4166f6043
$$ -425306 66206 -385551 163351 -182418 -22427 -81104 -87756 99636 140886 24166 -66043
10167C9209K06320j4738e5314j50955J02261A86858e1653F8497b7871D3874K8343
$$ 39209 245529 230791 -55314 -206269 -104008 186858 -51653 68497 -27871 43874 72217
10156G2217b6883j18056j89324C1807a11606B7338e67080B32032a66287j98168
$$ 72217 -26883 -144939 -334263 31807 -111606 27338 -567080 232032 -166287 -364455
10146c64455d5969o1607L109i116k26695J06433I6378b52377J06078M09a8420
$$ -364455 -45969 -107576 -104467 -9116 -235811 -129378 96378 -252377 -146299 -145890 -18420
10134C26276b80359B00289a96155C06350a20342l7683E3007a02699L7741j16977
$$ 326276 -280359 200289 -196155 306350 -120342 -158025 53007 -102699 -64958 -181935
10124a81935j97324a05943j47082n2613J27754b7905k72971a47780j13435j2070
$$ -181935 -379259 -105943 -253025 -305638 -177884 -27905 -300876 -147780 -261215 -273285
10114b73285j62574I1364g1566B65943b41625A3115K00537a82799A33253a25276
$$ -273285 -435859 91364 -71566 265943 -241625 13115 213652 -182799 133253 -125276
10103C6198e2259D1180d7407C91934b1454C7488a34090A94336b1847G1254b06143
$$ 36198 -52259 41180 -47407 391934 -21454 37488 -134090 194336 -21847 71254 -206143
10091I7189a7163o229A23852a59358K5244O6859l6327D5066j8052Q8020a11416
$$ 97189 -17163 -23392 123852 -159358 -134114 -67255 -103582 45066 27014 115034 -111416
10079A16345a10870k4846I7537f0901p2033I4122R6590i2493j48077a5155k22255
$$ 116345 -110870 -135716 97537 -60901 -132934 94122 190712 -92493 -240570 -15155 -237410
10068b37410k3583E2585b41663M6689P9712j47118h6749C03894e2727a554B958
$$ -237410 -260993 52585 -241663 -194974 -115262 -262380 -86749 303894 -52727 -1554 2958
10056A63634e330A04372g9819c153j72731K0395A54125D220b59147a20770d3627
$$ 163634 -5330 104372 -79819 -3153 -175884 -155489 154125 4220 -259147 -120770 -43627
10044b27163h4355A03226a80934P4151A29230a32026m36f0075I183h745k85534
$$ -227163 -84355 103226 -180934 -106783 129230 -132026 -132462 -60075 9183 -8745 -294279
10033b94279a36730a9924A499R1239M906h405r8773o000A73686a27647B72321
$$ -294279 -136730 -19924 1499 92738 97644 -8405 -107178 -113178 173686 -127647 272321
10021c64628a51520j98064C3966J10443J00237a77415q2750A18987d10996b647
$$ -364628 -151520 -349584 33966 144409 244646 -177415 -260165 118987 -410996 -2647
10010b74870o3654B27746b84156B7623J71787a24119C8616i4240H4231J3579c9238
$$ -274870 -338524 227746 -284156 27623 199410 -124119 38616 -94240 84231 97810 -39238
9998c2785m44537a52185k8366d9706k67347e2620j38804b9874H3966A7392a64860
$$ -32785 -477322 -152185 -180551 -49706 -317053 -52620 -191424 -29874 83966 17392 -164860
9986b05766A03076c3976j73801M8906k2553Q5993j02841a4794H8146B144e2357
$$ -205766 103076 -33976 -207777 -158871 -181424 -95431 -198272 -14794 88146 2144 -52357
9974e1424j59929A98822R1723g3700q6738b5661j99879A96881r4116D8463J35383
$$ -51424 -211353 198822 290545 -73700 -160438 -25661 -225540 196881 102765 48463 183846
9963A83846C3374c75755e2353D0073d698j36659d8337A29155d5777C1645O3542
$$ 183846 33374 -375755 -52353 40073 -4698 -141357 -48337 129155 -45777 31645 95187
9952I5187D0310a34040J3189C64263a12283A22044a44769A52098b6615l99274
$$ 95187 40310 -134040 -120851 364263 -112283 122044 -144769 152098 -26615 -425889
9942d25889E9091K28227b76516A66967C9159N9121h784C4776c64943a7316j22808
$$ -425889 59091 287318 -276516 166967 39159 98280 -8784 34776 -364943 -17316 -140124
9931a40124D5579R0321L2967a7823j61812a1913j49613P0545I0677h1485q7845
$$ -140124 45579 135900 168867 -17823 -179635 -11913 -161526 -90981 90677 -81485 -169330
9920a69330C29697c32898J0195i9606A00222f2616P150k15492Q5582j06552d0538
$$ -169330 329697 -332898 -322703 -99606 100222 -62616 -55466 -270958 -185376 -291928 -40538
9908F4615b2945h952o4511L578k14777a23175D1619f4835k82267f4924H628J21394
$$ 64615 -22945 -8952 -73463 -69885 -284662 -123175 41619 -64835 -347102 -64924 8628 130022
9896A30022J1319a30653j13137p6470G2426a6184C04768A34793a02018B14975
$$ 130022 141341 -130653 -243790 -320260 72426 -16184 304768 134793 -102018 214975
9885A35685b9609B2065J64541b10685L6202B42032C8J94174r2064a10206A49613
$$ 135685 -29609 22065 186606 -210685 -174483 242032 38 194212 102148 -110206 149613
9873b20845i6266p3835p415D1631a19043e1691m10942N0896g8474L5153B6755
$$ -220845 -96266 -170101 -177516 41631 -119043 -51691 -462633 -411737 -78474 -43321 26755
9861F884a18863p4341A75123f0447k37821N8056h7015A83486a95602A05372c94071
$$ 6884 -118863 -193204 175123 -60447 -298268 -240212 -87015 183486 -195602 105372 -394071
9849a94617e0791b491H9485N1861d3882o5036H6024Q2453E4955b0662j18194a8071
$$ -194617 -50791 -2491 89485 141346 -43882 -108918 86024 168477 54955 -20662 -138856 -18071
9836G9674a03591l21196J93387D1451d19994A77526j6215G0269Q0655c44493B45230
$$ 79674 -103591 -424787 -231400 41451 -419994 177526 161311 70269 150924 -344493 245230
9824D3606N8396a22921N1446B7514M26875c50j62232g3480j86937A85896l4132
$$ 43606 102002 -122921 -71475 27514 454389 -350 -162582 -73480 -260417 185896 151764
9813A51764d03255A02118m0841e461j55863j00360b2533j69113n6385m7588J2631
$$ 151764 -403255 102118 61277 -5461 -161324 -261684 -22533 -191646 -248031 -295619 -282988
9802b82988h4119a6887m4528A470e2325R806k7862C6584a32906B66675a62545
$$ -282988 -84119 -16887 -61415 1470 -52325 -42519 -70381 36584 -132906 266675 -162545
9790B17502E4826c41634B5332K0732R6646a37283A04659b95512H5501c3808I277
$$ 217502 54826 -341634 25332 46064 142710 -137283 104659 -295512 85501 -33808 9277
9778A85412i4621c9907k09133A01821a5459g082j26140a7523n0638A96179b63520
$$ 185412 -94621 -39907 -249040 101821 -15459 -7082 -133222 -17523 -68161 196179 -263520
9766a89742L4753A69266a5333C4129g2409b7657k731j44149E0949a5807j33232
$$ -189742 -154989 169266 -15333 34129 -72409 -27657 -30388 -174537 50949 -15807 -149039
9755a49039d4460j29277d0568k34853E9480k5128h66H1056b75635I1615Q801b32405
$$ -149039 -44460 -173737 -40568 -275421 59480 34352 -866 81056 -275635 91615 100416 -232405
9742b13893A6589h7065k2532j68396O1033E6623J04738f6625C4836K1540k4791
$$ -213893 16589 -87065 -109597 -277993 -216960 56623 161361 -66625 34836 56376 31585
9731C1585b55657j9804O6965D0471h808j5328D4789a31167m4623N47b2098l76580
$$ 31585 -255657 -275461 -208496 40471 -8808 -24136 44789 -131167 -175790 -175243 -22098 -398678
9719c98678g0369F6615a54528j61001C08343f7951a7887j61107e0712j10509l37029
$$ -398678 -70369 66615 -154528 -315529 308343 -67951 -17887 -178994 -50712 -161221 -498250
9708d98250b28440e9159r7405G6833f1209G093j667a54728k21798B30914a5818
$$ -498250 -228440 -59159 -156564 76833 -61209 7093 5426 -154728 -376526 230914 -15818
9696c5720C39932b2029A59873b13961J03691M2369J8795l3792D62092A80866d5404
$$ -35720 339932 -22029 159873 -213961 -110270 -67901 -49106 -82898 462092 180866 -45404
9684D17458g6084m5024j2948C90191D5675c19018e7091B28055a32660Q336l37055
$$ 417458 -76084 -121108 -134056 390191 45675 -319018 -57091 228055 -132660 -124324 -461379
9673d61379K29944a00727A52726c94003J80697H725b15284A9204Q6221a68469
$$ -461379 -231435 -100727 152726 -394003 -213306 8725 -215284 19204 105425 -168469
9662g8465k41054E1250a61458l43397B22378r1616c17092n3924a55513A04854
$$ -78465 -319519 51250 -161458 -504855 222378 130762 -317092 -371016 -155513 104854
9651a25299H2024J3258a59088f8602j69794f9258C7152c26584B19253b71145o5436
$$ -125299 82024 95282 -159088 -68602 -238396 -69258 37152 -326584 219253 -271145 -336581
9640c36581j14882F5883b02151d3933p6175J7765M5981A8406a7786k825k82303
$$ -336581 -451463 65883 -202151 -43933 -120108 -102343 -56362 18406 -17786 -20611 -302914
9629c02914M4735B00236b88783f3629A72021a42304f3478k9057H3185e5908C6028
$$ -302914 -258179 200236 -288783 -63629 172021 -142304 -63478 -92535 83185 -55908 36028
9617b7631A09027a85051j11345a30634j54171B24630B8727J91523p6162N1124
$$ -27631 109027 -185051 -296396 -130634 -284805 224630 28727 220250 144088 195212
9607A95212J65656h5370D2234K3298a95151j06290C265a83627B16149i6633I7115
$$ 195212 360868 -85370 42234 65532 -195151 -301441 3265 -183627 216149 -96633 97115
9595i525D7829M6926B9416j4114R0823Q5587C2894b12461R5626r6666H8166c0234
$$ -9525 47829 94755 29416 15302 106125 191712 32894 -212461 -116835 -213501 88166 -30234
9582B51467a13582n1915A7020b29349A34122i864k32005G4782b14607P9869A00617
$$ 251467 -113582 -165497 17020 -229349 134122 -9864 -241869 74782 -214607 -134738 100617
9570a05227c1593l7442o1424d3830j45008A09788N1240m7056a10634k1191j00811
$$ -105227 -31593 -69035 -130459 -43830 -188838 109788 161028 113972 -110634 -131825 -232636
9559b32636f2598k9575j77482L6771k64136C6533J48364j0861j7657b13965A64157
$$ -232636 -62598 -92173 -269655 -232884 -497020 36533 184897 174036 156379 -213965 164157
9547f0877r8869A94068C7721A6510d48238A7677a04095k36638a06554A41629d70387
$$ -60877 -159746 194068 37721 16510 -448238 17677 -104095 -340733 -106554 141629 -470387
9535a1096k42927G394b73157N8957J41p5981F3074b90806A18801c94760J33665
$$ -11096 -254023 7394 -273157 -214200 -214059 -290040 63074 -290806 118801 -394760 -261095
9524b61095B2037P3419d5430l062n1398p2381J5882E779K29872a33673K8874C13462
$$ -261095 22037 95456 -45430 -48492 -99890 -172271 -156389 5779 235651 -133673 -104799 313462
9511H739g2437C3143b05374G5589i1043m8387O8978K7709e725A07331C8696d19443
$$ 8739 -72437 33143 -205374 75589 -91043 -139430 -70452 -42743 -5725 107331 38696 -419443
9498d86B08014E9864J69422o098J23961b04324A2932N36541A7211a82844o6424
$$ -486 208014 59864 229286 223188 347149 -204324 12932 549473 17211 -182844 -249268
9487b49268j08575A8585a91802a9308A98527J7444G4620R2371a5479A18373b72762
$$ -249268 -357843 18585 -191802 -19308 198527 215971 74620 166991 -15479 118373 -272762
9475f9243H653L1736b73980B25903F5392g2714n5167c8811B41164a21887E0836
$$ -69243 8653 40389 -273980 225903 65392 -72714 -127881 -38811 241164 -121887 50836
9463i2097D3177d6288A35021c9308F7328b283A4341K32435d36833d6002d576j80001
$$ -92097 43177 -46288 135021 -39308 67328 -2283 14341 246776 -436833 -46002 -4576 -184577
9451a84577f6793G4034P7104g2322D5579e61154b4944B81776a16365o0934h1596
$$ -184577 -66793 74034 151138 -72322 45579 -561154 -24944 281776 -116365 -177299 -81596
9439c87867e1877j82939a4895A08153p774a82142Q1188I4730a70908j70135P1171
$$ -387867 -51877 -234816 -14895 108153 100379 -182142 -100954 94730 -170908 -341043 -269872
9428b69872J02106e6120a9789E6121O8928c86720J22789c5549E1319b60576b4487
$$ -269872 -167766 -56120 -19789 56121 125049 -386720 -263931 -35549 51319 -260576 -24487
9416a00618j42373D754L7762N1804b45023j21111a08603H394L6556c94530a35513
$$ -100618 -242991 4754 42516 94320 -245023 -366134 -108603 8394 44950 -394530 -135513
9404b23581k8769K9990e7440n0250J0440l6712n6015C70792A7943a22668P302
$$ -223581 -252350 -222360 -57440 -107690 -97250 -133962 -189977 370792 17943 -122668 -115366
9393a15366k7278c3174r5724G5426a71532j83134B7400Q9977D630a16579C2072
$$ -115366 -142644 -33174 -128898 75426 -171532 -354666 27400 117377 4630 -116579 32072
9381D13042I0553j6268Q3746a2120B4933i2866A29688o580R6314E6958K04912
$$ 413042 90553 74285 158031 -12120 24933 -92866 129688 123108 219422 56958 261870
9370B61870c5092j44449e7598m21371B3117J66024i9204p9539j10193R3283k1873
$$ 261870 -35092 -179541 -57598 -478969 23117 189141 -99204 -178743 -288936 -195653 -217526
9359b17526G796b92065c1164A77416B5412b31438A71419A481b6792A43196a28768
$$ -217526 7796 -292065 -31164 177416 25412 -231438 171419 1481 -26792 143196 -128768
9347a25223q4391A24930b83619a15946c9772D2645a24920i089k43515e2714H313
$$ -125223 -209614 124930 -283619 -115946 -39772 42645 -124920 -9089 -252604 -52714 8313
9335a70645f0721k68680A3523g4814A99579h6306C9773a68598p3454a05138b7181
$$ -170645 -60721 -329401 13523 -74814 199579 -86306 39773 -168598 -242052 -105138 -27181
9323b16003J00544j2846A62708E3786a64347O9281f370j62829L8636q6777J08318
$$ -216003 -115459 -128305 162708 53786 -164347 -95066 -6370 -169199 -130563 -217340 -109022
9312a09022o6308B52362a5388k18915f3078a4977H0399a670B5603b04046P1889
$$ -109022 -175330 252362 -15388 -234303 -63078 -14977 80399 -1670 25603 -204046 -132157
9301a32157M9728q2765A3516J96687a07888N3515F4168O2742M048k3019D5831
$$ -132157 -82429 -165194 13516 210203 -107888 -54373 64168 126910 130958 107939 45831
9289d7690k79128B40589A4670F73a75709r5740a2883r6247l6623l2585A0052c09679
$$ -47690 -326818 240589 14670 673 -175709 -271449 -12883 -109130 -145753 -178338 10052 -309679
9276C3750N7487N2787K047l759g1481G9099b69145p9312J24269i874r1978E8022
$$ 33750 91237 144024 146071 142312 -71481 79099 -269145 -348457 -224188 -9874 -101852 58022
9263H3767a04266B18498a27460Q194A19926a74171j05599O7901i8731A68709h8522
$$ 83767 -104266 218498 -127460 -119266 119926 -174171 -279770 -211869 -98731 168709 -88522
9251b25178a1786j54877D0023N6137a62010F7284a36061B60605a03537E1322d1843
$$ -225178 -11786 -166663 40023 96160 -162010 67284 -136061 260605 -103537 51322 -41843
9239B09322a59046n0840B44921D2479D024h7666b564j87807A28758M8654a26741
$$ 209322 -159046 -209886 244921 42479 4024 -87666 -2564 -190371 128758 177412 -126741
9227h078l54926n1652A89363a62391F5061L1201f0568C76365b596j96507p7639
$$ -8078 -363004 -414656 189363 -162391 65061 96262 -60568 376365 -2596 -199103 -276742
9216b76742A47046j6684b17494m830L8791k4587j75938a54958F5272b80159E0843
$$ -276742 147046 130362 -217494 -222324 -183533 -208120 -384058 -154958 65272 -280159 50843
9204d5598j95577c5497q9936c3808p6005n4221e2225l5897A72548a72687l2947
$$ -45598 -241175 -35497 -125433 -33808 -109813 -164034 -52225 -88122 172548 -172687 -205634
9193b05634B8455J40601J93720d575o7845A36041b40499G4552e1458k81125i1884
$$ -205634 28455 169056 362776 -4575 -72420 136041 -240499 74552 -51458 -332583 -91884
9181c27582h283B9429J10811a04013r2495g7754A48941b34021G8272a02917J9165
$$ -327582 -8283 29429 140240 -104013 -196508 -77754 148941 -234021 78272 -102917 -83752
9170h3752r5174H498L87201e3747q2164A61329a32355c5840G2006h9740I9984
$$ -83752 -178926 8498 395699 -53747 -135911 161329 -132355 -35840 72006 -89740 99984
9158A25574K22714a02478j12796j89088P1943P3383d7147k05964g0832c158l03789
$$ 125574 348288 -102478 -215274 -404362 -332419 -259036 -47147 -253111 -70832 -3158 -306947
9147c06947A4852J76818a35301F032b25147B274N7386a50693j34925b5921k81582
$$ -306947 14852 191670 -135301 6032 -225147 2274 59660 -150693 -285618 -25921 -307503
9136c07503d0775B12315b35869J17802b746j29997B44381b41122e9945b74B7850
$$ -307503 -40775 212315 -235869 -118067 -2746 -132743 244381 -241122 -59945 -274 27850
9124d13529C9739l996A7763J01591a56565G6332b3069j71922j17951a35264M3684
$$ -413529 39739 35743 17763 119354 -156565 76332 -23069 -194991 -312942 -135264 -91580
9113i1580j96865b8775E0166a82194B15568b83489i5988k94693A82801g1381A15235
$$ -91580 -288445 -28775 50166 -182194 215568 -283489 -95988 -390681 182801 -71381 115235
9101a57902a1939k40464b4221A13975j6911b14581e2757j85274q3680B4856J21143
$$ -157902 -11939 -252403 -24221 113975 97064 -214581 -52757 -238031 -321711 24856 145999
9090A45999a24780A71607A4734f0390j10798A59047f5365l90403F7644b27953
$$ 145999 -124780 171607 14734 -60390 -171188 159047 -65365 -455768 67644 -227953
9079A5107a68340m724a0470p417q5940d2905B01125c95810O0000A5268a2634j18282
$$ 15107 -168340 -173064 -10470 -17887 -103827 -42905 201125 -395810 -335810 15268 -12634 -130916
9067a30916d3364q216C2994M1871P074f0580m4931N19B56251A05890i9345B5071
$$ -130916 -43364 -51580 32994 74865 81939 -60580 -105511 -104992 256251 105890 -99345 25071
9054A15318c47738B7299f2981J368n4502m179k80231a76101I8640J3976a99808
$$ 115318 -347738 27299 -62981 -61613 -116115 -120294 -400525 -176101 98640 112616 -199808
9042B4357b16341A14369b96809A18136a02059A6593P802a07739j98492B87137
$$ 24357 -216341 114369 -296809 118136 -102059 16593 24395 -107739 -306231 287137
9031H3614R7278b30741c4811k55619N4900j87849a48572D41569A96492E3822i7498
$$ 83614 180892 -230741 -34811 -290430 -235530 -423379 -148572 441569 196492 53822 -97498
9019A04493c11275J13407B15498D429K71509A35753c49956A67129B4783g2710
$$ 104493 -311275 -197868 215498 4429 275938 135753 -349956 167129 24783 -72710
9008A02472l133C8326K4889l098c6098d972D5336d7068k06836A49514n2162j9944
$$ 102472 99339 38326 63215 60117 -36098 -4972 45336 -47068 -253904 149514 97352 77408
8996G7408A5562O7318b0452B42163a15068A50750C9367d5277i297j9724j83448
$$ 77408 15562 82880 -20452 242163 -115068 150750 39367 -45277 -9297 -29021 -212469
8985b12469e0435j1527A19879b49280B34088C7282P7520k5235m3230G767a13248
$$ -212469 -50435 -61962 119879 -249280 234088 37282 114802 89567 46337 7767 -113248
8973g2117B76125f2285j76791g9037E8500e7522a7927k49941E9513a70955k601
$$ -72117 276125 -62285 -239076 -79037 58500 -57522 -17927 -267868 59513 -170955 -173556
8962a73556E4358d1526q5156C46775B6745L1723A4915h9742k9399k25829a70632
$$ -173556 54358 -41526 -126682 346775 26745 58468 14915 -89742 -119141 -344970 -170632
8950C7448a40712A10286a69430A28453c06495f2496j81576f4099q3800a4006l1480
$$ 37448 -140712 110286 -169430 128453 -306495 -62496 -244072 -64099 -147899 -14006 -45486
8939d5486l18967C4778e5795J6831n8493a825B09732d3415q8135a0314p5845j9731
$$ -45486 -364453 34778 -55795 -38964 -97457 -1825 209732 -43415 -131550 -10314 -86159 -105890
8927a05890A01744c13802d8028I0072L1312b25809E61180a28516F3940R9685K56600
$$ -105890 101744 -313802 -48028 90072 121384 -225809 561180 -128516 63940 163625 420225
8916D20225A56574J23574a33366F4452J53052K37340O12651k54911Q33072J187733
$$ 420225 156574 280148 -133366 64452 217504 454844 1067495 812584 1645656 2833389
8906B833389J761037O045648n276198k349677A285220E94256k47106r108j35785
$$ 2833389 4594426 10640074 5363876 3014199 1285220 594256 347150 338042 202257
8897B02257F695J4231a2574A52781n7509R5869q714b58719P4972B51937P9325
$$ 202257 6695 20926 -12574 152781 95272 191141 182427 -258719 -183747 251937 331262
8886C31262j00891b29218C7703J33795g9903A5523E373a05088k8599j34485M8699
$$ 331262 230371 -229218 37703 171498 -79903 15523 5373 -105088 -133687 -268172 -219473
8875b19473g1834F9001c88287E7890K46690b89137a14837a0281j9606A06002J29464
$$ -219473 -71834 69001 -388287 57890 304580 -289137 -114837 -10281 -29887 106002 235466
8864B35466a94855Q81j377f069B59306d3140k6544D0266O3149R857Q5293C5321
$$ 235466 -194855 -193974 -195351 -6069 259306 -43140 -69684 40266 103415 113272 198565 35321
8851G5722b8689o7269m4845K5418F7210b73907e0403j83347b0166E2274a44539
$$ 75722 -28689 -95958 -140803 -115385 67210 -273907 -50403 -233750 -20166 52274 -144539
8839b6159j45144H5992l523a61465C8738g7437I913J53723H780J70446G5924k6321
$$ -26159 -171303 85992 82469 -161465 38738 -77437 9913 163636 8780 179226 75924 49603
8827D9603b83707J38353M150e6571A26943c55232A18328c7820A3460J21049A781
$$ 49603 -283707 -145354 -141204 -56571 126943 -355232 118328 -37820 13460 134509 1781
$$ [...]
##END NTUPLES=NMR SPECTRUM
##END=
