
##TITLE=AC1003_Arabica_6279629_PtdVFPNt5I
##JCAMPDX= 6.0         $$ Bruker NMR JCAMP-DX V2.0
##DATA TYPE= NMR SPECTRUM
##DATA CLASS= NTUPLES
##ORIGIN= BRUKER
##OWNER= Administrator
$$ 1.72 TOPSPIN		Version 2.1
$$ 2012-06-03 18:55:39.859 -0500  Administrator@TOPSPIN
$$ Compression mode = diff/dup
##.OBSERVE FREQUENCY= 400.13188235
##.OBSERVE NUCLEUS= ^1H
##.ACQUISITION MODE= SIMULTANEOUS (DQD)
##.ACQUISITION SCHEME= undefined
##.AVERAGES= 8
##.DIGITISER RES= 22
##SPECTROMETER/DATA SYSTEM= spect
##.PULSE SEQUENCE= zg30
##.SOLVENT NAME= COFFEE_meoh
##.SHIFT REFERENCE= INTERNAL, COFFEE_meoh, 1, 14.98061
##AUDIT TRAIL= $$ (NUMBER, WHEN, WHO, WHERE, PROCESS, VERSION, WHAT)
$$ ##TITLE= Audit trail, TOPSPIN		Version 2.1
$$ ##JCAMPDX= 5.01
$$ ##ORIGIN= Bruker BioSpin GmbH
$$ ##OWNER= Administrator
$$ $$ C:\Bruker\TOPSPIN/data/COFFEE/nmr/AC1003_Arabica_6279629_PtdVFPNt5I/10/pdata/1/auditp.txt
$$ ##AUDIT TRAIL=  $$ (NUMBER, WHEN, WHO, WHERE, PROCESS, VERSION, WHAT)
(   1,<2012-06-03 18:55:32.562 -0500>,<Administrator>,<TOPSPIN>,<go>,<TOPSPIN 2.1>,
      <created by zg
	started at 2012-06-03 18:54:25.796 -0500,
	POWCHK enabled, PULCHK disabled,
       configuration hash MD5:
       D5 CA 7A 23 FE 6B EE E2 50 67 74 61 24 F7 5E 3B
       data hash MD5: 64K
       EF 8C 45 C7 B3 10 11 18 C1 2B FC DD 7F 61 56 45>)
(   2,<2012-06-03 18:55:35.578 -0500>,<Administrator>,<TOPSPIN>,<proc1d>,<TOPSPIN 2.1>,
      <Start of raw data processing
       efp LB = 0 FT_mod = 6 PKNL = 1 PHC0 = 0 PHC1 = 0 SI = 32K 
       data hash MD5: 32K
       DA 8A 0A 72 2B 37 9F 1C 4C FE BD 50 6C 8D 98 F4>)
(   3,<2012-06-03 18:55:35.984 -0500>,<Administrator>,<TOPSPIN>,<proc1d>,<TOPSPIN 2.1>,
      <pk PHC0 = 208.4326 PHC1 = 0 
       data hash MD5: 32K
       FB 5F C5 AC FD 0E 4F BD FD 69 A1 78 0A 44 7A 77>)
(   4,<2012-06-03 18:55:36.046 -0500>,<Administrator>,<TOPSPIN>,<proc1d>,<TOPSPIN 2.1>,
      <abs ABSG = 1 
       data hash MD5: 32K
       42 D9 C4 49 23 C1 59 D5 32 AE 23 36 C8 7A FA 50>)
(   5,<2012-06-03 18:55:36.062 -0500>,<Administrator>,<TOPSPIN>,<proc1d>,<TOPSPIN 2.1>,
      <abs ABSG = 2 
       data hash MD5: 32K
       61 B3 2F 82 58 A5 38 08 6B 12 09 62 BE 5A AB D5>)
(   6,<2012-06-03 18:55:36.093 -0500>,<Administrator>,<TOPSPIN>,<proc1d>,<TOPSPIN 2.1>,
      <abs ABSG = 3 
       data hash MD5: 32K
       EE 85 8A 6A 03 50 24 53 B8 A6 C7 62 B2 3C BC B0>)
(   7,<2012-06-03 18:55:36.125 -0500>,<Administrator>,<TOPSPIN>,<proc1d>,<TOPSPIN 2.1>,
      <abs ABSG = 4 
       data hash MD5: 32K
       44 20 E9 48 47 4E FA 16 40 F2 AA E3 BA 0C 07 1F>)
(   8,<2012-06-03 18:55:36.156 -0500>,<Administrator>,<TOPSPIN>,<proc1d>,<TOPSPIN 2.1>,
      <abs ABSG = 5 
       data hash MD5: 32K
       E2 A5 FC E4 A2 95 46 82 D0 B1 3A E0 30 F2 8C 0D>)
$$ ##END=
$$ 
$$ $$ hash MD5
$$ $$ E0 AB 82 F9 AD 6E 34 9A 89 42 84 29 CE 6B FF 32
##$RELAX= 
##$RELAX= 
##$RELAX= 
##$RELAX= 
##$RELAX= 
##$RELAX= 
##$RELAX= 
$$ Bruker specific parameters
$$ --------------------------
$$ [...]
##$TP= (0..7)
150 150 150 150 150 150 150 150
##$TP07= 0
##$TPNAME0= <>
##$TPNAME1= <>
##$TPNAME2= <>
##$TPNAME3= <>
##$TPNAME4= <>
##$TPNAME5= <>
##$TPNAME6= <>
##$TPNAME7= <>
##$TPOAL= (0..7)
0.5 0.5 0.5 0.5 0.5 0.5 0.5 0.5
##$TPOFFS= (0..7)
0 0 0 0 0 0 0 0
##$TUNHIN= 0
##$TUNHOUT= 0
##$TUNXOUT= 0
##$USERA1= <user>
##$USERA2= <user>
##$USERA3= <user>
##$USERA4= <user>
##$USERA5= <user>
##$V9= 5
##$VALIST= <valist>
##$VCLIST= <CCCCCCCCCCCCCCC>
##$VD= 0
##$VDLIST= <DDDDDDDDDDDDDDD>
##$VPLIST= <PPPPPPPPPPPPPPP>
##$VTLIST= <TTTTTTTTTTTTTTT>
##$WBST= 2048
##$WBSW= 25
##$XGAIN= (0..3)
0 0 0 0
##$XL= 0
##$YL= 0
##$YMAX_a= 532786
##$YMIN_a= -655461
##$ZGOPTNS= <>
##$ZL1= 120
##$ZL2= 120
##$ZL3= 120
##$ZL4= 120
##$ABSF1= 14.98061
##$ABSF2= -5.57192
##$ABSG= 5
##$ABSL= 3
##$ALPHA= 0
##$AQORDER= 0
##$ASSFAC= 0
##$ASSFACI= 0
##$ASSFACX= 0
##$ASSWID= 0
##$AUNMP= <proc_prof1d_extract_pilot.lims>
##$AXLEFT= 0
##$AXNAME= <>
##$AXNUC= <1H>
##$AXRIGHT= 0
##$AXTYPE= 0
##$AXUNIT= <>
##$AZFE= 0.1
##$AZFW= 0.1
##$BCFW= 0
##$BC_mod= 0
##$BYTORDP= 0
##$COROFFS= 0
##$CY= 15
##$DATMOD= 1
##$DC= 0
##$DFILT= <>
##$DTYPP= 0
##$F1P= 0
##$F2P= 0
##$FCOR= 0.5
##$FTSIZE= 32768
##$FT_mod= 6
##$GAMMA= 0
##$GB= 0
##$INTBC= 1
##$INTSCL= 1
##$ISEN= 128
##$LB= 0
##$LEV0= 0
##$LPBIN= 0
##$MAXI= 10000
##$MC2= 0
##$MEAN= 0
##$ME_mod= 0
##$MI= 0
##$NCOEF= 0
##$NC_proc= -8
##$NLEV= 6
##$NOISF1= 0
##$NOISF2= 0
##$NSP= 0
##$NTH_PI= 0
##$NZP= 0
##$OFFSET= 14.98061
##$PC= 1
##$PHC0= 208.4326
##$PHC1= 0
##$PH_mod= 1
##$PKNL= yes
##$PPARMOD= 0
##$PPDIAG= 0
##$PPIPTYP= 0
##$PPMPNUM= 2147483647
##$PPRESOL= 1
##$PSCAL= 4
##$PSIGN= 0
##$PYNMP= <proc.py>
##$REVERSE= no
##$SF= 400.13
##$SI= 32768
##$SIGF1= 0
##$SIGF2= 0
##$SINO= 400
##$SIOLD= 32768
##$SPECTYP= <>
##$SREGLST= <1H.CDCl3>
##$SSB= 0
##$STSI= 32768
##$STSR= 0
##$SW_p= 8223.68421052632
##$SYMM= 0
##$S_DEV= 0
##$TDeff= 65536
##$TDoff= 0
##$TI= <>
##$TILT= no
##$TM1= 0
##$TM2= 0
##$TOPLEV= 0
##$USERP1= <user>
##$USERP2= <user>
##$USERP3= <user>
##$USERP4= <user>
##$USERP5= <user>
##$WDW= 1
##$XDIM= 32768
##$YMAX_p= 464386468
##$YMIN_p= -734285
##$CURPLOT= <Network HP LaserJet P1505>
##$CURPRIN= <$Network HP LaserJet P1505>
##$DFORMAT= <normdp>
##$LAYOUT= <+/1D_H.xwp>
##$LFORMAT= <normlp>
##$PFORMAT= <normpl>
##$SURQMSG= 1
$$ End of Bruker specific parameters
$$ ---------------------------------
##NTUPLES= NMR SPECTRUM
##VAR_NAME=  FREQUENCY,     SPECTRUM/REAL,   SPECTRUM/IMAG
##SYMBOL=    X,             R,               I
##VAR_TYPE=  INDEPENDENT,   DEPENDENT,       DEPENDENT
##VAR_FORM=  AFFN,          ASDF,            ASDF
##VAR_DIM=   32768,         32768,           32768
##UNITS=     HZ,            ARBITRARY UNITS, ARBITRARY UNITS
##FACTOR=    0.250966925370066, 1,           1
##FIRST=     8223.43324360095, -69467,       70915
##LAST=      0,             106921,          -132306
##MIN=       0,             -734285,         0
##MAX=       8223.43324360095, 464386468,    0
$$ Real data points
##PAGE= N=1
##DATA TABLE= (X++(R..R)), XYDATA
$$ [...]
$$ plain form
19517 -254856 206751 235470 -180464 118563 -228006 -276100 89211 116518 -25306 -416477
19507 -416477 -13178 58393 21596 53261 102054 -314300 -111042 834 -135809 -9974 -10775 156263
19494 -280382 -82621 199117 -284831 -99164 -543631 91104 420023 -39749 112602 -312723
19483 -172245 107790 -92807 8422 22166 177941 -39086 -269868 80628 -285243 164567 -216552
19471 71148 -83419 33053 -298909 -17075 15969 -212306 -97545 -29401 194379 -269532 108127
19459 -31124 -124671 14691 -188172 -99317 -307994 35635 55883 205622 75022 -298069 -180038
19448 -180038 321315 -129011 57247 107926 -95679 -205498 -241994 -399571 -314241 -179846
19438 -179846 -129949 29 11085 -103916 -252264 -35494 55712 -160073 232684 -101629 -519856
$$ packed form
19517b54856B06751K8719a80464A18563b28006m8094H9211K7307b5306l91171
19507d16477a3178E8393B1596L1665M8793c14300a11042H34a35809i974q01A56263
19494b80382h2621A99117b84831i9164m44467I1104L28919c9749A12602c12723
19483a72245A07790i2807H422J3744J55775c9086k30782H0628b85243A64567b16552
19471G1148h3419C3053b98909a7075A5969b12306i7545b9401A94379b69532A08127
19459c1124r3547A4691a88172Q8855k08677C5635K0248J49739G5022b98069J18031
19448a80038C21315a29011E7247N0679i5679j09819l6496j57577Q5330J34395
19438a79846M9897B9J1056a03916j48348c5494E5712a60073B32684a01629m18227
$$ plain form
19427 -519856 25633 -388221 -65144 -298925 -77307 283307 -129290 -24824 -65306 -198788
19417 -198788 60674 -139268 132063 -109627 -156386 -180790 -3293 -82892 -215646 -2439 -380253
19406 -380253 -117539 -212437 -321879 348145 -85076 10777 24512 -389117 57089 131302 -43817
19394 138539 -203223 214671 195580 -50136 183288 25058 -81698 -394727 -126772 279442
19383 -200597 289579 -57493 12297 -131407 -132070 -172768 -152234 262433 -153106 -81782 -82389
19372 -82389 -375763 -155198 -133865 -69095 -23095 -99429 -72662 -329220 169651 -15164 -113608
19361 -113608 20020 -179687 -382549 120750 -152313 -21171 -102795 299627 -6304 -10010 -5386
19350 -5386 248863 15697 -206541 83265 96459 -109069 -467811 -171484 50015 45447 -94889
$$ packed form
19427e19856B5633c88221f5144k33781g7307B83307a29290b4824m0482j33482
19417a98788F0674a39268A32063a09627m6759k4404c293p9599j32754b439l77814
19406c80253a17539r4898j09442C48145h5076A0777J3735c89117E7089P4213d3817
19394A38539b03223B14671j9091e0136A83288B5058h1698l13029a26772B79442
19383b00597B89579e7493A2297a31407o63m0698K0534B62433a53106P1324o07
19372h2389k93374a55198K1333O4770b3095p6334K6767k56558A69651a5164r8444
19361a13608B0020a79687k02862A20750a52313b1171q1624B99627f304l706M624
19350e386B48863A5697b06541H3265J3194a09069l58742a71484E0015m568i4889
$$ plain form
19338 -9631 -19767 116447 -132204 1283 -65112 -11243 20090 121429 109636 52325 277130
19327 277130 -59438 36144 -333933 242035 -287638 292035 -43771 -222274 164734 -193821
19316 -108112 222669 -285570 -50938 -72391 -97912 -137792 -89115 -66264 292146 17059 55798
19305 55798 146643 -306891 189225 -106206 358543 43126 139216 68490 10694 254772 -116685
19293 -292976 -168675 185188 -236124 -217076 240195 88476 -231602 148742 137212 -41966
19282 91836 175578 -245918 -202760 -27109 -175065 -49833 153842 -133657 -362494 -29079 31523
19270 -216377 -43753 -40508 25893 -90908 -4813 -73985 166764 -85985 -174475 -101977 -315350
19259 -315350 -152769 -482631 -59891 -220278 -99557 -212202 -18012 29256 -120017 -255093
$$ packed form
19338i631j0136A16447a32204A283f5112a1243B0090J01339j1793E2325K24805
19327B77130e9438C6144c33933B42035b87638B92035d3771j78503A64734a93821
19316a08112B22669b85570e0938k1453k5521l9880M8677K2851B92146A7059L8739
19305E5798R0845c06891A89225a06206C58543D3126R6090F8490A0694K44078a16685
19293b92976J24301A85188b36124J9048B40195H8476b31602A48742j1530d1966
19282I1836Q3742b45918M3158b7109j47956d9833A53842a33657k28837b9079C1523
19270b16377d3753L245B5893i0908d813o9172A66764h5985q8490P2498k13373
19259c15350a52769l29862e9891j60387i9557j12645a8012B9256a20017j35076
$$ plain form
19249 -255093 -76245 -94539 -68374 -59968 -294845 137219 -108942 -59878 -101072 -315406 -211373
19238 -211373 -252406 -262677 -181374 -53901 318957 99416 35862 -129240 117529 54526 -113884
19226 -168484 39645 296540 -167385 -209343 -144323 -158372 74551 76547 -80308 75875 126016
19215 126016 -153595 -135409 22560 13545 -167197 144404 -9365 277543 -289166 33584 28530
19204 28530 -154437 -11634 77197 143404 -122423 -119193 -155341 -50909 82082 -251757 -228513
19193 -228513 -231051 -347552 -91714 -72109 -89809 205726 -192638 -206568 54009 77894 -80139
19181 30424 65908 184949 81233 162868 -289310 209732 33653 -131193 -250120 220514
19170 -359744 -180053 -188079 -51632 -235393 -11478 -103187 -81629 -336519 -30298 -76943 147625
$$ packed form
19249b55093g6245j8294K6165Q406k34877A37219a08942M9064m1194k14334J04033
19238b11373m1033j0271Q1303e3901C18957I9416C5862a29240A17529E4526a13884
19226a68484C9645K56895a67385m1958O5020j4049G4551J996h0308G5875N0141
19215A26016a53595J8186B2560r015a67197A44404i365B77543b89166C3584n054
19204B8530a54437a1634G7197O6207a22423L230l6148e0909H2082b51757K3244
19193b28513k538j16501i1714J9605j7700B05726a92638j3930E4009K3885h0139
19181C0424L5484J19041H1233Q1635b89310B09732C3653a31193j18927B20514
19170c59744J79691q026e1632j83761a1478r1709K1558k54890c0298m6645A47625
$$ plain form
19158 -141756 -293527 73259 -64458 115498 1172 -282763 -62140 -48110 -228907 -454990 -108950
19146 -193413 -111665 -161825 -10456 -67373 14752 -166407 -212961 348091 142846 106595 -45695
19134 53181 21692 -377156 -145577 164394 90331 -110707 -158185 -58445 376624 1097 108417
19123 108417 -75138 107533 -16079 -178046 -214884 137437 45874 -98341 -124098 -46758 65125
19111 -127586 -3278 227771 -105698 -198261 -41975 -211706 -143558 88374 -240923 231928 149618
19100 149618 -355417 19432 45205 -150413 66132 -43940 -44877 -170033 -70468 -190607 -315756
19089 -315756 138289 -122097 65933 -233161 -27109 -311886 137123 -302602 48055 -257931
19078 -227090 -146465 -46995 85746 -135013 -240082 -31923 -169626 -40322 129247 34042 -62822
$$ packed form
19158a41756j51771G3259f4458A15498A172b82763f2140J4030j80797k26083a08950
19146a93413Q1748n0160a0456n6917A4752a66407m6554C48091A42846l6251d5695
19134E3181B1692c77156a45577A64394p4063a10707m7478e8445C76624A097J07320
19123A08417g5138A07533a6079j61967l6838A37437D5874i8341k5757d6758F5125
19111a27586c278B27771a05698r2563d1975j69731O8148H8374b40923B31928q2310
19100A49618c55417A9432K5773a50413F6132d3940r37j25156g0468j20139j25149
19089c15756A38289a22097F5933b33161b7109k84777A37123c02602D8055b57931
19078b27090Q0625d6995H5746a35013j05069c1923j37703d0322A29247C4042f2822
$$ plain form
19066 -62678 562 -310500 -136784 -55844 145004 145669 -332276 -195200 -112397 -166147 -101584
19055 -101584 -194711 -85705 112785 -188562 -269974 -279696 -132568 189857 56055 74553 -165711
19043 -235896 -81617 187086 -239487 -133064 -199556 -271388 163742 73728 75614 -296500 -250206
19032 -250206 -63866 211924 24133 371317 -130945 -147249 -74372 109949 125104 -34542 313869
19020 144381 -268847 -98603 -32443 -172386 28828 81414 -42870 160564 -2898 -55121 -47246
19009 -47246 -54808 393252 203883 -83661 93636 -132105 83901 24309 -290132 28480 -55904
18997 325448 53179 -7123 -90283 -48740 80274 94559 9109 220441 156262 23604 -157561
18985 188628 -574078 -59609 245676 296026 -291346 343408 23407 330964 449854 -367946
$$ packed form
19066f2678E62c10500a36784e5844A45004O65c32276J37076Q2803n3750O4563
19055a01584r3127h5705A12785a88562q1412r722a32568A89857E6055J8498a65711
19043b35896h1617A87086b39487J06423o6492p1832A63742G3728J886b96500M6294
19032b50206f3866B11924B4133L47184a30945j6304P2877A09949J5155c4542C13869
19020A44381b68847i8603c2443j39943B8828N2586d2870A60564b898n2223P875
19009d7246p562C93252j89369h3661I3636a32105H3901B4309b90132B8480e5904
18997C25448E3179g123q3160M1543H0274J4285I109K11332o4179B3604a57561
18985A88628e74078e9609B45676N0350b91346C43408B3407L07557J18890c67946
$$ plain form
18974 399545 182714 -136957 -105473 -179780 -182536 -226093 95300 -282592 321313 44491 142004
18963 142004 83871 18962 -17311 -23408 -71475 -293454 254326 -74925 -309465 64876 156918
18952 156918 -8089 -47600 170974 -50505 -40705 -3020 -13589 -167590 81348 169118 -125403
18940 -184125 90913 115160 53260 -93646 -100532 -139614 -257283 -181989 -265313 -52633 -329242
18929 -329242 -273687 -253326 21296 -64695 -424122 64336 121023 66874 -107204 -36147 -101756
18918 -101756 -5432 -314514 14492 -126245 85660 -68409 -64902 -73052 30597 -189215 -268853
18907 -268853 -38484 -68416 5322 16768 -195045 244204 -33652 169764 -201207 11955 -2167
18895 155920 -208506 50569 38912 -75787 7110 -100381 94802 -182439 -296261 9598 92887
$$ packed form
18974C99545A82714a36957L1484p4307k756m3557I5300b82592C21313D4491R7513
18963A42004n8133A8962a7311o097m8067k21979B54326g4925k34540F4876R2042
18952A56918h089l9511A70974e0505R800c020j0569j54001H1348Q7770a25403
18940a84125I0913K4247E3260i3646o886l9082j17669P5294q3324e2633k76609
18929c29242N5555K0361B1296f4695l59427F4336N6687n4149a07204c6147o5609
18918a01756e432l09082A4492a26245H5660f8409L507q150C0597a89215p9638
18907b68853c8484k9932E322J1446a95045B44204c3652A69764b01207A1955b167
18895A55920b08506E0569j1657g5787G110a00381I4802a82439j13822I598Q3289
$$ plain form
18884 92887 -100290 -68800 44545 35556 -11147 120299 -94501 -184281 -154488 -12561 140996
18872 -268622 -162743 48547 169766 -103022 -35688 -108584 198101 283389 -251297 7239 -153314
18860 -81383 -92967 24711 -108841 -124260 143248 240458 -175205 236569 116476 -74944 40886
18848 -273752 145987 -34111 130102 -514748 51816 -29852 1478 137544 -170179 -56801 -135936
18837 -135936 38620 122495 16802 216880 -204811 -114632 -46865 -115382 -144557 -195226 -118892
18826 -118892 285297 154718 191662 -279745 -122036 -154391 3584 -302180 93027 -89676 219837
18814 338800 244566 -132247 124432 25413 -391845 -284557 -27114 214085 256001 -87889
18803 26833 11061 244821 17729 -211163 -171204 6932 256282 300116 186460 -24289 127554
$$ packed form
18884I2887a00290L1490D4545q989a1147A20299i4501q9780K9793a2561A40996
18872b68622J05879D8547J21219a03022c5688p2896A98101Q5288b51297G239a53314
18860h1383j1584B4711a08841j5419A43248R7210a75205B36569A16476g4944D0886
18848b73752A45987c4111A30102e14748E1816b9852A478J36066a70179e6801p9135
18837a35936C8620Q3875A6802K00078b04811R0179d6865o8517k9175n0669P6334
18826a18892B85297j30579L6944b79745a22036l2355C584c02180I3027h9676B19837
18814C38800r4234a32247A24432B5413c91845J07288b7114B14085M1916h7889
18803B6833A1061K33760A7729b11163L9959F932K49350M3834j13656b4289A27554
$$ plain form
18791 172505 82845 -54206 -176240 -5700 -176243 150328 104657 128723 -188376 -270619 -40338
18779 290092 -10374 -155399 -98426 -299854 -400475 96340 530571 187099 -11890 -198865
18769 -198865 -311106 -228202 -202995 -192583 -9507 97778 107315 -22632 162679 -178273 -63693
18757 30053 -55702 -57568 -150266 47505 42278 -331747 91349 -151644 -39143 -894 -62449 -176864
18745 -176864 -82314 7283 123837 -16119 167260 -104303 84144 -430102 114891 25664 -20329
18733 -176451 20412 -361241 72782 -27563 -259510 -56558 -39183 -153620 -188851 15412 -98496
18721 -161365 -210703 39716 72374 -280527 -22895 -291245 -98433 52122 76785 64873 -85499
18709 -211374 -118528 -79392 -56417 -62057 -201344 -131632 -148716 -61087 145693 -201069 -122122
$$ packed form
18791A72505H2845e4206j22034e700j70543A50328m5671K4066a88376q2243d0338
18779B90092a0374j45025N6973k01428j00621I6340M34231A87099a1890j86975
18769a98865j12241Q2904K5207J0412i507I7778R537b2632A62679a78273f3693
18757C0053e5702j866r2698D7505n227c31747I1349a51644c9143h94o1555j14415
18745a76864h2314G283J16554a6119A67260a04303H4144d30102A14891B5664b0329
18733a76451B0412c61241G2782b7563k31947e6558J7375j14437l5231A5412i8496
18721a61365m9338C9716L2658b80527b2895k68350i8433E2122K4663j1912h5499
18709b11374R2846L9136K2975n640j39287O9712j7084f1087A45693b01069P8947
$$ plain form
18698 -122122 -205491 -54148 142029 -431763 95351 -132244 -89713 -158237 -73473 39078 192305
18687 192305 -143411 -138964 -186615 -38907 67094 -272299 -109155 -101448 24515 91557 -133665
18675 -46358 -106810 15308 -98338 -367375 -87631 232104 -64245 60534 -115142 248097 -12900
18663 89729 206842 -121003 -111539 -141647 140652 219236 -214600 -41653 -109854 50121 111630
18652 111630 -231166 -116354 -91678 -400741 -65478 28406 158922 -48879 -503028 50812
18641 -144625 4395 -127849 222352 89542 358482 -148125 -14303 -28489 -141126 13878 196698
18630 196698 93579 -145778 -39445 -443358 -168366 67718 181889 -88239 102768 -187448
18619 -47619 -61300 4254 63205 -647 -127577 -19927 -22382 63655 56173 -317597 98749 109042
$$ packed form
18698a22122q3369e4148A42029d31763I5351a32244M2531o8524g3473C9078J53227
18687A92305a43411M447m7651c8907F7094b72299a09155P707B4515O7042a33665
18675d6358o0452A5308i8338k69037h7631B32104f4245F0534a15142B48097a2900
18663H9729J17113a21003R464l0108A40652P8584b14600d1653o8201E0121O1509
18652A11630b31166J14812K4676l09063f5478B8406J30516d8879m54149E0812
18641a44625D395a27849B22352H9542K68940a48125a4303j4186j12637A3878J82820
18630A96698I3579a45778c9445m03913a68366F7718J14171h8239A02768a87448
18619d7619j3681D254N8951f47j26930a9927k455F3655p482c17597I8749J0293
$$ plain form
18607 109042 -58134 -40308 245689 -173110 -191262 -477244 -180904 192392 -89963 -186107
18597 -186107 -319313 -108924 -24808 33067 -35017 -197140 211662 166877 -247301 113630
18586 8863 -80666 -330456 -214263 -212273 73723 425255 -5991 120700 -19335 164836 -8651
18574 -66363 -143882 84654 -138688 54832 -44118 -138103 18582 -49160 153351 -89340 280937
18562 -92680 -30591 -13567 576640 -45587 18088 -355570 188412 -4898 -99567 196102 -7993
18550 -224204 228639 -63936 -76164 187050 59510 293282 -213422 6492 -241234 55190 -91299
18538 -213147 36346 84703 120544 150654 250242 -521707 -485266 -15324 -213698 -29386 228555
18526 -239559 353519 -148400 -124339 49409 172521 -105246 -234638 -58269 319395 294264
$$ packed form
18607A09042e8134J7826B45689a73110j8152k85982a80904A92392h9963r6144
18597a86107j33206a08924b4808C3067c5017j62123B11662m4785b47301A13630
18586H863h0666k49790J16193J990G3723L51532e991A20700a9335A64836h651
18574f6363p7519H4654a38688E4832d4118r3985A8582d9160A53351h9340B80937
18562i2680c0591a3567E76640d5587A8088c55570A88412d898r4669A96102g993
18550b24204B28639f3936j2228A87050E9510K33772b13422F492b41234E5190i1299
18538b13147C6346M8357L5841L0110R9588e21707L6441a5324j98374b9386B28555
18526b39559C53519a48400K4061D9409J23112a05246j29392e8269C19395k5131
$$ plain form
18516 294264 -232836 -348990 -313287 -69194 -441139 -155706 71404 -202439 244349 -52619
18505 -578485 100898 25734 -198721 -50852 150533 -69003 -258893 21958 -264547 -24255
18494 -167955 82108 6270 -270310 10583 -57262 -52235 -170755 95287 -18075 -48395 65883
18482 -153393 -34839 -43167 -121976 -118432 8299 215548 -599662 369656 -52963 84354 -216399
18470 -224650 -54479 -153715 1359 25326 -263606 -40755 326475 -180579 157585 -79781 -133982
18459 -133982 -11171 -122749 184294 -145080 -194043 -40748 34550 24567 -100031 -240508 172493
18447 -70873 -392390 -194254 33414 -428820 18662 -147501 -345564 -323755 -318721 -34611 -141344
18436 -141344 131829 -301771 -269636 133569 299684 -71061 -59585 -19831 34604 -37273 39674
$$ packed form
18516B94264b32836j16154L5703f9194l71945a55706G1404b02439B44349e2619
18505e78485A00898B5734a98721e0852A50533f9003j89890B1958b64547b4255
18494a67955H2108F270b70310A0583e7262N027j18520I5287a8075l0320F5883
18482a53393c4839q328p8809L544H299K07249e99662C69656e2963H4354b16399
18470b24650e4479r9236A359K3967b63606d0755C26475a80579A57585g9781n4201
18459a33982a1171j11578A84294a45080m8963d0748C4550r983a00031j40477A72493
18447g0873l21517a94254C3414d28820A8662a47501j98063K1809N034c4611j06733
18436a41344A31829c01771L2135A33569J66115g1061J1476a9831C4604c7273C9674
$$ plain form
18424 -155158 -291541 126525 15018 316906 62384 54679 233857 51652 156804 72972 -206962
18412 -166357 104429 -168344 -34782 167610 -200082 -1936 71187 127850 -99362 14922 -395344
18400 -425027 -248219 -296794 102290 -127624 20520 166058 148193 66080 240041 130121
18390 130121 147375 -382128 204242 134541 216506 -7435 -54441 93942 -187725 201680 -99503
18378 -242019 68808 171047 32700 -88458 -73941 -143292 205354 -2251 71540 -233192 -213141
18367 -213141 -215631 -313207 -95378 -109488 170789 51471 -75436 -22978 369125 149584 8931
18355 23583 87914 -68578 -95232 278249 208719 -162376 -40301 -174996 215880 381070 90208
18343 -329191 106971 176228 22041 -371782 -310839 -92072 -225675 -36069 -179192 3717 364479
$$ packed form
18424a55158j36383A26525A5018L01888F2384p705J79178E1652J05152G2972b06962
18412a66357A04429a68344c4782A67610b00082a936G1187N6663i9362A4922c95344
18400d25027J76808m8575A02290a27624B0520J45538j7865F6080J73961j09920
18390A30121J7254c82128B04242o9701Q1965g435m7006I3942a87725B01680i9503
18378b42019F8808J02239C2700h8458J4517o9351B05354b251G1540b33192K0051
18367b13141k490r7576i5378j4110A70789E1471g5436b2978C69125A49584H931
18355B3583O4331f8578k6654B78249o9530a62376d0301j34695B15880J65190I0208
18343c29191A06971O9257B2041c71782O0943i2072j33603c6069j43123C717L60762
$$ plain form
18332 364479 71649 72398 -344066 -24632 -120029 17134 -337471 -288332 186786 11445 -130473
18320 -55361 -124991 394844 -400584 -2796 -297644 -40777 -301994 -312791 -228962 274770 -323551
18308 -119491 -143762 182900 -75186 214971 -24593 27330 96618 7956 -87637 -171911 168620
18296 -122377 -132975 -66133 34868 194810 -664 179925 80096 36918 -168052 190221 126547
18285 126547 -217748 117113 -149859 89566 -165027 -171586 -4305 108839 112749 3424 438590
18274 438590 162322 14290 -197020 -620123 74331 -76733 -285618 -115625 136396 145351
18264 145351 -41298 -116689 -195896 5654 103267 25844 95082 -2812 -228876 22271 169832
18253 169832 73270 272229 135313 -35855 -45885 157335 -150630 -82558 -26213 -179265
$$ packed form
18332C64479G1649P49c44066b4632r5397A7134c37471M9139A86786A1445a30473
18320e5361o9630C94844d00584b796k94848d0777k61217j0797Q3829B74770c23551
18308a19491k4271A82900g5186B14971b4593B7330O9288G956h7637q4274A68620
18296a22377j0598f6133C4868J59942f64A79925H0096C6918a68052A90221o3674
18285A26547b17748A17113a49859H9566a65027o559d305A08839L910C424M35166
18274D38590A62322A4290a97020m23103G4331g6733k08885a15625A36396Q955
18264A45351d1298p5391p9207E654R7613B5844O9238b812k26064B2271J47561
18253A69832G3270J98959A35313c5855j0030A57335a50630O8072b6213j53052
$$ plain form
18243 -179265 92458 -237311 161733 191700 201447 243967 -7896 71552 -280384 -8387 -105228
18232 -105228 -90885 63940 -153736 -201230 -84096 200733 -137632 82537 -125827 -33639 -273600
18221 -273600 -96671 -17986 134736 -36100 -46800 180040 173312 307077 254504 125013 -306493
18209 -37120 183517 287092 167486 14037 -253044 -232902 -200200 -150507 309833 243986 117099
18197 -106715 -74377 -74785 27436 -542550 177358 -83562 -57163 -170682 -108898 1774 29034
18186 29034 -173295 -223261 -84477 11400 228416 -21040 33412 144138 -164896 -104857 68126
18174 -41384 -80371 -204910 -151671 394699 -28144 183505 132552 -49035 23328 -48814 -76885
18163 -76885 55713 237556 -211725 -120264 144065 -233845 -294564 129724 113768 199179 -5638
$$ packed form
18243a79265I2458b37311A61733K9967R747M2520g896G1552b80384h387r6841
18232a05228J4343F3940a53736m7494h4096B00733a37632H2537a25827c3639k39961
18221b73600i6671a7986A34736c6100j0700A80040o728J33765n2573A25013c06493
18209c7120A83517J03575j19606A4037b53044K0142L2702M9693C09833o5847A17099
18197a06715L2338m08B7436e42550A77358h3562K6399j13519O1784A774K7260
18186B9034a73295m9966h4477A1400K17016b1040C3412J10726a64896O0039F8126
18174d1384l8987j24539N3239C94699b8144A83505n0953d9035B3328d8814k8071
18163g6885E5713J81843b11725R1461A44065b33845o0719A29724j5956Q5411e638
$$ plain form
18151 108264 -65336 82625 35224 -203390 227045 116362 18625 -314340 92358 172601 174428
18140 174428 54137 -324631 -540426 116615 74627 101438 196676 -70548 25031 -467542 -29793
18128 173440 269944 216456 18002 -133019 -218116 -219496 20419 -246685 105669 240825 -75047
18116 -22555 -153837 -83817 336657 203596 -94812 -314053 -26177 -549248 -65533 120297
18105 132989 -39586 197074 87062 19463 200068 216689 -72431 68946 -98450 -38457 138065
18093 -212541 80537 -54450 3447 333856 -70930 -137622 -67917 43281 -158979 171228 -25060
18081 -72685 -111995 -44861 -304823 -3193 -42645 399971 193027 -323421 -53755 116905 -139759
18069 4865 -93409 6198 -239948 -196125 -285854 -178988 139311 -6357 127722 497 -203917 200148
$$ packed form
18151A08264f5336H2625C5224b03390B27045j10683A8625c14340I2358Q0243J827
18140A74428E4137c24631k15795A16615m1988K6811R5238g0548B5031d67542b9793
18128A73440R6504n3488A8002a33019q5097j380B0419b46685A05669J35156g5047
18116b2555j31282P0020C36657j33061i4812k19241b6177n23071f5533A20297
18105A32989c9586A97074H7062A9463J80605J6621g2431F8946i8450c8457A38065
18093b12541H0537e4450C447L30409g0930o6692f7917D3281a58979A71228b5060
18081g2685l9310d4861k59962c193l9452C99971A93027c23421e3755A16905a39759
18069D865i3409F198b39948M3823q9729J06866A39311f357A27722D97b03917B00148
$$ plain form
18056 -136822 -103071 10853 33105 -149685 24317 201477 -95496 -303483 -110223 -196456 88348
18044 -147709 486655 -4054 96177 -266505 105824 27794 -279069 -249013 -207872 -281969 -176866
18033 -176866 238246 2925 -265910 178619 189695 318553 -10373 -142888 -265541 73446
18022 -176138 -127637 -33880 84243 -373828 79114 -127449 -225797 87924 -148735 -118572 -235523
18011 -235523 -97693 173550 123161 -118384 -70229 4617 -103202 244921 16738 -148211 22423
17999 -162126 -234682 -20228 30841 -73312 -39256 128619 205218 -128393 -272431 53887 136958
17988 136958 -41582 -68039 -373158 -176549 -86109 -282055 415889 248146 184045 -69911
17977 -332569 4151 183995 -9284 -148436 362012 -192970 -207488 305745 -40079 480644 -29010
$$ packed form
18056a36822L3751A0853K2252a49685B4317J77160i5496k07987a10223q6233H8348
18044a47709D86655d054I6177b66505A05824B7794b79069L0056M1141p4097J05103
18033a76866B38246B925b65910A78619J1076J28858a0373j32515j22653G3446
18022a76138M8501c3880H4243c73828G9114a27449r8348H7924a48735L0163j16951
18011b35523i7693A73550n0389a18384M8155D617a03202B44921A6738a48211B2423
17999a62126p2556b0228C0841g3312L4056A28619P6599a28393j44038E3887Q3071
17988A36958d1582k6457l05119a76549h6109j95946D15889j67743o4101f9911
17977c32569D151J79844i284j39152C62012a92970j4518C05745d0079D80644b9010
$$ plain form
17965 102923 50057 -274207 -67994 -87332 22038 -53263 306543 282300 -228115 -156897 -45705
17953 264677 -438646 75490 95580 -120213 222689 80639 -93494 153680 -292751 -39258
17942 325412 -214830 -15854 56235 -93506 83020 20914 77107 -36723 89811 -15465 109060
17930 -176243 -119342 -121231 -57094 244300 17654 106634 204707 29062 109302 24909 232881
17919 232881 -132035 89170 -51343 -70654 -273926 -186423 -240283 -351425 -35983 52453 332367
17908 332367 88459 -143437 -108853 211327 223377 78019 5983 171861 -247270 279579 -226277
17896 -130477 -71546 119799 214783 -206225 -42093 223665 593 37894 -70262 265902 103947
17884 -187553 147634 -202187 -94589 205328 -404981 68326 212759 -47096 212399 -180641
$$ packed form
17965A02923E0057b74207f7994j9338B2038e3263C06543k4243b28115P1218d5705
17953B64677d38646G5490K0090a20213B22689H0639i3494A53680b92751c9258
17942C25412b14830a5854E6235i3506H3020B0914N6193c6723H9811a5465A09060
17930a76243N6901j889e7094B44300A7654Q8980R8073B9062Q0240B4909K07972
17919B32881a32035H9170e1343j9311k03272Q7503n3860j11142c5983E2453K79914
17908C32367H8459a43437L4584B11327J2050G8019E983J65878b47270B79579b26277
17896a30477N8931A19799R4984b06225d2093B23665E93L7301g0262B65902A03947
17884a87553A47634b02187i4589B05328d04981F8326J44433d7096B12399a80641
$$ plain form
17873 -247619 -113392 -23733 231033 118697 79676 66525 -281558 173875 276447 27664
17862 -226842 -286843 115182 -320273 -156834 92026 31828 144527 121374 108951 -7032 105376
17850 169539 276165 54955 -212109 -130177 -2346 107078 -324330 -8745 13379 -47955 -206261
17839 -206261 78800 226461 -507215 180932 269648 -25058 244154 22441 139701 8843 121830
17828 121830 284346 -89613 133174 -79436 -9909 285418 58564 -134161 78096 72073 -184252
17816 35510 -94101 25852 78108 -254560 -279746 343300 129969 125660 218984 233999 -114582
17804 98562 105399 -143563 5347 -115669 356 -72613 -124045 -4228 336154 235714 -140684 -51106
17791 140996 -69055 -133109 80532 8481 54890 288769 212204 71138 757 -242465 -141488
$$ packed form
17873b47619a13392b3733B31033j12336l9021j3151b81558A73875J02572B7664
17862b26842o0001A15182c20273a56834I2026C1828J12699k3153j2423g032A05376
17850A69539J06626E4955b12109Q1932b346A07078c24330h745A3379d7955j58306
17839b06261G8800J47661e07215A80932Q8716b5058B44154B2441J17260H843J12987
17828A21830J62516h9613A33174g9436i909B85418E8564a34161G8096o023a84252
17816C5510i4101B5852N2256b54560k5186C43300A29969m309R3324J5015a14582
17804I8562O837a43563E347a15669C56g2613n1432d228C36154j00440a40684e1106
17791A40996f9055o4054H0532H481M6409K33879p6565G1138G57b42465J00977
$$ plain form
17780 -141488 419145 347536 -379181 -229602 147153 -253378 -74491 234233 130968 -83500
17769 549930 203367 -43904 95229 64014 -149331 25717 -52264 38688 90552 184558 -257882
17757 -143620 -243713 212571 170431 -108228 172242 -92515 254524 -118250 217082 -38270
17746 171956 135997 -18946 62814 422318 292999 124474 -208287 194626 148761 13742
17735 -201863 -53116 -128313 -143437 -53745 -106755 -152394 -25889 -28956 25342 375168 178284
17723 -393944 69276 33333 -29860 -145642 120839 99941 -184294 299027 131961 -46663
17712 -84297 -171073 -4737 -86080 -268415 321582 219700 -189997 242317 92571 547579 -169624
17700 -29165 -81834 -91458 -93583 -181454 87295 14077 25371 -51883 25603 86523 39807 -38554
$$ packed form
17780a41488D19145p1609c79181J49579A47153b53378g4491B34233j03265h3500
17769E49930B03367d3904I5229l1215a49331B5717e2264C8688N1864R4006b57882
17757a43620j00093B12571m2140a08228A72242i2515B54524a18250B17082c8270
17746A71956l5959a8946F2814L59504j29319A24474b08287A94626m5865A3742
17735b01863e3116p5197j5124e3745n3010m5639b5889l067B5342L49826A78284
17723c93944F9276C3333b9860j15782A20839k0898a84294B99027A31961d6663
17712h4297q6776d737q1343j82335C21582j01882a89997B42317I2571M55008a69624
17700b9165n2669r624k125q7871H7295A4077J1294e1883B5603O0920C9807c8554
$$ plain form
17687 -46350 -48356 -296723 -242388 182748 -104835 71494 -38999 287581 163052 -123231 181376
17675 270383 -117090 -234859 -36878 120522 18517 121619 384919 146181 -23763 154535
17664 61502 663073 -196350 -51033 238255 216716 -109912 234356 -13046 7430 310 -213147
17652 54092 -218631 129872 321414 -293654 -176532 44886 385057 -179807 132353 -80186
17641 -222698 90489 14361 111022 148832 -56688 245122 49208 -170255 -42156 -31410 74953
17629 -25438 89072 -237550 159189 90189 -8342 -227992 164797 -100942 47204 -259800 -277178
17618 -277178 -233980 213072 59726 -202810 52915 -8670 219629 -11302 -50625 202570 -836
17606 169588 -73073 88043 -175693 164972 102684 64465 15890 39870 -226276 -103707 38589
$$ packed form
17687d6350k006k48367N4335A82748a04835G1494c8999B87581j24529a23231A81376
17675B70383a17090j17769c6878A20522A8517J03102K63300A46181b3763A54535
17664F1502O01571a96350e1033B38255k1539a09912B34356a3046G430C10b13147
17652E4092b18631A29872J91542b93654J17122D4886L40171a79807A32353h0186
17641b22698I0489A4361R6661L7810e6688B45122D9208a70255d2156J0746G4953
17629b5438H9072b37550A59189o9000h342k19650A64797a00942D7204b59800j7378
17618b77178M3198B13072E9726b02810E2915h670B19629a1302l9323B02570h36
17606A69588g3073H8043a75693A64972o2288l8219A5890K3980b26276a03707C8589
$$ plain form
17594 -58147 -122112 -120913 89056 293096 348231 -31871 264129 97923 172594 -30030 315269
17582 -121591 197330 113882 193349 -86113 42681 -6582 -268159 -44413 -15485 304928 291420
17571 291420 288722 -66557 -113137 14150 -10826 -253695 -9574 289276 -105090 -57432 70400
17559 156429 154165 163856 185235 373342 -106457 84421 111608 96426 39076 -278894 109541
17547 268434 -42621 -89424 125668 25450 15524 -64618 99873 33459 30480 -23129 -80380 150191
17534 226698 -159750 272664 536173 183721 92049 105718 36036 70914 -46459 -100405 223749
17522 219301 80504 320843 -68991 -53621 -169785 378245 506603 -47974 18665 188010
17512 188010 210119 229491 32618 -96530 -46441 18237 46087 54449 10230 -20258 -209056
$$ packed form
17594e8147o3965J199H9056K04040N5135c1871B64129I7923P4671c0030C15269
17582a21591A97330q3448P9467h6113D2681f582k61577d4413a5485C04928j3508
17571B91420k698f6557m6580A4150a0826k42869i574B89276a05090M7658G0400
17559A56429k264R691K1379J88107a06457H4421K7187j5182C9076b78894A09541
17547B68434d2621m6803A25668B5450r926f4618I9873C3459k979b3129n7251A50191
17534B26698a59750B72664K63509A83721r1672J3669C6036L4878d6459n3946B23749
17522B19301H0504K40339f8991J5370j16164C78245J28358d7974A8665J69345
17512A88010K2109J9372C2618i6530d6441A8237K7850Q362A0230b0258j88798
$$ plain form
17501 -209056 -115448 -307066 268042 351748 28398 129988 100659 95843 302282 119834 238687
17490 238687 66426 135606 52005 78453 -45055 101046 126564 126806 -123131 78043 185046
17479 185046 386639 43301 -262626 143426 338122 133519 -251991 -68108 11648 216414
17469 216414 95420 71658 104402 -130011 20113 -50792 309062 191379 142902 260995 543135
17458 543135 250685 -157820 -13257 -10265 387777 371759 -214328 221050 -121855 47929
17447 112568 145914 82152 -129753 -33975 137460 -89723 92547 156918 -129646 -161080 110939
17435 504012 307952 99609 273579 375629 572703 414667 115833 89859 373816 305161
17425 305161 359578 340003 -63039 312180 191506 65649 35927 386472 350200 -58203 386828
$$ packed form
17501b09056R3608j91618B68042Q3706B8398J01590k9329m816K06439A19834J18853
17490B38687F6426O9180E2005K6448d5055A01046K5518K42a23131G8043J07003
17479A85046K01593D3301b62626A43426J94696A33519b51991f8108A1648K04766
17469B16414I5420k3762L2744a30011B0113e0792C09062j17683m8477J18093K82140
17458E43135B50685a57820a3257K992C87777j6018b14328B21050a21855D7929
17447A12568L3346o3762a29753c3975A37460h9723I2547O4371a29646l1434A10939
17435E04012j96060I9609J73970J02050J97074j58036A15833k5974K83957o8655
17425C05161N4417j9575f3039C12180j20674F5649k9722L50545l6272e8203C86828
$$ plain form
17413 267383 119618 266801 600666 276561 203063 648066 -28669 -7895 317889 14226
17402 423051 83530 355423 190198 45292 310300 -138993 4186 395601 97537 376465
17392 376465 -53604 321082 125209 219495 140018 264433 461253 259366 -41114 511789
17381 685224 230259 38562 169411 392714 85630 330487 180381 -64418 152987 209067
17371 209067 333123 556425 409940 155805 278196 335340 575340 102004 369055 309196
17361 309196 185816 211608 114137 -15369 231343 39237 124094 -43673 107695 135842 11788
17349 138183 279450 131965 2493 294789 537022 230896 296650 416263 298582 11050
17338 -39381 261833 -164962 229055 371049 450884 88172 4546 140149 362538 211609
$$ packed form
17413B67383A19618J47183L33865B76561p3498M45003b8669g895C17889A4226
17402D23051H3530K71893j65225D5292K65008a38993D186L91415I7537K78928
17392C76465e3604C21082A25209R4286p9477J24415J96820k01887d1114E11789
17381F85224B30259C8562J30849K23303H5630K44857j50106f4418A52987N6080
17371B09067J24056K23302j46485A55805J22391N7144K40000A02004K67051n9859
17361C09196j23380K5792r7471a5369B31343C9237Q4857d3673A07695K8147A1788
17349A38183J41267A31965B493K92296K42233B30896O5754J19613j17681A1050
17338c9381B61833a64962B29055J41994P9835H8172D546J35603K22389j50929
$$ plain form
17328 211609 258727 295690 122103 348878 38748 242075 424873 257108 131764 253612
17318 253612 -233361 -78461 149575 319748 216393 199248 133082 305679 -56141 238645
17307 -87734 97004 366864 103016 24842 -48328 -92692 201924 125085 -24041 -136533 246068
17295 165116 299262 -54142 67290 343325 184959 246712 255694 40349 576045 171349 67522
17283 150896 -101129 177926 334307 333550 133743 216679 296635 126807 143262 231170 363162
17272 363162 205161 298413 119719 303915 304621 -127865 113338 262531 259050 162968 206916
17261 206916 221412 162870 338781 126404 96693 47414 54790 318467 -65425 242083 97793
17249 442648 43557 182089 184459 -103775 136406 358834 368832 6085 410516 36263 250557
$$ packed form
17328B11609M7118L6963A22103K26775C8748K03327J82798j67765j25344J21848
17318B53612b33361g8461A49575J70173j03355j7145o6166J72597e6141B38645
17307h7734I7004K69860A03016B4842d8328m4364B01924p6839b4041j12492B46068
17295A65116J34146e4142F7290K76035j58366O1753Q982D0349N35696A71349F7522
17283A50896a01129A77926J56381p57A33743Q2936P9956A26807J6455Q7908J31992
17272C63162j58001R3252A19719J84196P06a27865A13338J49193l481r6082M3948
17261B06916J4496n8542J75911A26404k9711D7414P376K63677f5425B42083I7793
17249D42648D3557J38532K370a03775A36406K22428R998F085M04431C6263K14294
$$ plain form
17238 250557 46294 267270 110972 406947 -41217 272070 162738 186202 -156515 277030
17227 402252 71985 65724 275638 187630 -121923 527457 -107965 283332 -11893 455978
17216 279099 395335 190275 211923 288092 215009 480420 86405 580584 521579 341869
17206 341869 185755 -84095 291253 228901 -92545 301753 152627 436608 255756 527384
17196 527384 116587 226351 97472 386680 155365 367788 438103 292033 134081 309601
17186 309601 548981 247014 173294 -1161 72701 354439 1514 192494 143154 166276 221290
17175 221290 417745 259948 342887 455669 69251 152714 201350 231191 229949 724680 481611
17164 481611 379389 291352 120743 635081 296308 345765 -66783 292022 133075 481962
$$ packed form
17238B50557D6294K20976A10972K95975d1217B72070j09332K3464a56515B77030
17227D02252G1985o261K09914q8008a21923E27457a07965B83332a1893D55978
17216B79099J16236A90275K1648P6169p3083K65411H6405M94179n9005j79710
17206C41869j56114h4095B91253o2352i2545C01753j49126K83981j80852K71628
17196E27384A16587J09764I7472K89208A55365K12423P0315j46070A34081J75520
17186C09601K39380B47014p3720a161G2701K81738A514J90980m9340K3122N5014
17175B21290J96455j57797Q2939J12782F9251Q3463M8636K9841j242M94731k43069
17164D81611j02222q8037A20743N14338B96308M9457f6783B92022A33075L48887
$$ plain form
17154 481962 246224 149834 416497 -73799 170821 361942 295352 459161 158421 313103
17144 313103 377924 538748 571652 632054 46696 188177 453031 75026 316802 478851
17134 478851 407313 121842 640142 443427 564439 458443 375442 611118 483247 144835
17123 533663 60628 46077 584982 515922 631410 141955 563519 487864 438548 328701
17113 328701 482494 459036 583558 148687 457401 358800 429394 645639 448439 457067
17103 457067 562378 444080 272968 294086 479534 662917 591298 424116 667586 417675
17093 417675 279338 583546 859720 328971 441976 604814 411855 204887 450626 228097
17083 228097 535582 240116 571441 205174 766402 713011 630058 332214 634757 475517
$$ packed form
17154D81962k35738r6390K66663g3799A70821J91121o6590J63809A58421J54682
17144C13103O4821J60824L2904O0402D6696J41481K64854G5026K41776J62049
17134D78851p1538A21842N18300j96715J21012j05996q3001K35676j27871A44835
17123E33663F0628j4551N38905o9060J15488A41955M21564p5655m9316j09847
17113C28701J53793k3458J24522A48687L08714r8601P0594K16245j97200Q628
17103D57067J05311j18298j71112K1118J85448J83383p1619j67182K43470k49911
17093D17675j38337L04208K76174C28971J13005J62838j92959B04887K45739k22529
17083B28097L07485B40116L31325B05174N61228n3391q2953k97844L02543j59240
$$ plain form
17073 475517 219761 549276 398593 486287 780101 810153 299415 597361 886281 616048
17063 616048 805933 553247 486757 348557 739963 417255 781045 541815 615122 508659
17053 508659 482825 510031 452715 742068 567692 482037 868721 645288 188169 837773
17043 837773 455515 510858 531430 404903 498649 677989 644678 605863 608305 535907 686555
17032 686555 783071 266692 593090 544510 516769 487468 580936 633469 871953 753487 777244
17021 777244 377876 415923 369629 624954 410937 906868 761095 733397 759711 811893
17011 811893 796746 566705 708267 705699 533203 985456 665536 652362 569718 927662
17001 927662 816017 928811 913506 742398 800210 491813 883320 846542 949039 756761
$$ packed form
17073D75517B19761L29515j50683Q7694K93814L0052B99415K97946K88920k70233
17063F16048J89885k52686o6490j38200L91406l22708L63790k39230P3307j06463
17053E08659k5834K7206n7316K89353j74376q5655L86684k23433A88169O49604
17043H37773l82258N5343K0572j26527R3746J79340l3311l8815K442p2398J50648
17032F86555R6516B66692L26398m8580k7741k9301R3468N2533K38484j18466K3757
17021G77244C77876L8047m6294K55325k14017M95931j45773k7698K6314N2182
17011H11893j5147k30041J41562k568j72496M52253l19920j3174q2644L57944
17001I27662j11645J12794j5305j71108N7812l08397L91507l6778J02497j92278
$$ plain form
16991 756761 569942 674588 1106847 837485 978934 683689 1152739 766099 592239 926008
16981 926008 918354 877139 1035792 967173 414725 1008510 796899 874875 840550 1039226 959718
16970 959718 548133 942512 1072852 994484 1039365 971800 909860 1132288 1002586 1165408
16960 1165408 691687 1269745 1099239 769439 1093103 1158475 1028512 1271321 1080077 1106940
16950 1106940 973185 1222821 810916 1367997 831349 937655 1112437 1208710 1196092 1276395
16940 1276395 977857 1335062 1113790 1103834 1334807 1191965 1172153 1346602 1201967 1055216
16930 1055216 1361971 1373070 1193766 1396347 1395004 1432415 1288700 1263380 1487367 1778659
16920 1778659 1322494 1588061 1446457 1667521 1471044 1428025 1670553 1599976 1878643 1755893
$$ packed form
16991G56761j86819J04646M32259k69362J41449k95245M69050l86640j73860L33769
16981I26008p654m1215J58653o8619D14725N93785k11611P7976l4325J98676p9508
16970I59718m11585L94379J30340p8368M4881o7565o1940K22428j29702J62822
16960A165408m73721N78058j70506l29800L23664O5372j29963K42809j91244K6863
16950A106940j33755K49636m11905N57081n36648J06306J74782R6273j2618Q0303
16940A276395k98538L57205k21272r956K30973j42842j9812J74449j44635j46751
16930A055216L06755J1099j79304K02581j343L7411j43715k5320K23987K91292
16920A778659m56165K65567j41604K21064j96477m3019K42528p0577K78667j22750
$$ plain form
16910 1755893 1333032 1778513 1669560 1723039 1840597 1295232 1407809 1467845 1956938 1934108
16900 1934108 1312546 1402303 2003431 1740039 1943745 1946068 1839450 1434563 1851053 1841130
16890 1841130 2238920 1986712 1902974 1761407 2336461 2096167 2361871 2439293 2171745 1959621
16880 1959621 2104234 2428295 2335588 2423279 2324126 2291655 2173713 2588409 2213409 2430289
16870 2430289 2279400 2726394 2540459 2538739 2598455 2389898 2499663 2928823 2464624 2860026
16860 2860026 2488117 2801081 2800094 2718655 2885708 3136382 3072713 3077484 2991135 3021024 3252096
16849 3252096 3227625 3330646 3001288 3228761 3651595 3151894 3458883 3579479 3477381 3544041
16839 3544041 3826741 3395126 3868082 3535314 3738539 3904385 4011873 3814914 4147565
$$ packed form
16910A755893m22861M45481j08953N3479J17558n45365J12577O0036M89093k2830
16900A934108o21562Q9757O01128k63392K03706K323j06618m04887M16490r923
16890A841130L97790k52208q3738j41567N75054k40294K65704P7422k67548k12124
16880A959621J44613L24061r2707Q7691r9153l2471j17942M14696l75000K16880
16870B430289j50889M46994j85935j720N9716k08557J09765M29160m64199L95402
16860B860026l71909L12964r87q1439J67053K50674o3669M771q6349K9889K31072
16849C252096k4471J03021l29358K27473M22834m99701L06989J20596j02098O6660
16839C544041K82700m31615M72956l32768K03225J65846J07488j96959L32651
$$ plain form
16830 4147565 4330809 4390792 4139198 4207523 4592723 4673387 4418861 4785557 4719421 4815163
16820 4815163 4891252 5435097 5135583 5431446 5713424 5244061 5343467 5863327 5409168 5970063
16810 5970063 5949689 6041051 6279880 6449403 6548884 6754410 6671132 6800606 7134328 6902423
16800 6902423 6778457 7128899 7559940 7800162 7865472 7900982 8071882 8166006 8503683 8455408
16790 8455408 8766350 9103254 9614269 9700378 9785695 9885924 10261087 10566479 10719149 10742760
16780 10742760 11321738 11417672 11795331 11863059 12300313 12707077 13182143 13202672 13984037 14267949
16770 14267949 14585484 15180584 15661932 16297520 16662541 16909027 17668563 18009820 18391720
16761 18391720 19202285 20001283 20081046 21370734 21605778 22620230 23385546 24251739 25472416
$$ packed form
16830D147565J83244N9983k51594O8325L85200Q0664k54526L66696o6136R5742
16820D815163P6089N43845k99514K95863K81978m69363R9406N19860m54159N60895
16810E970063k0374R1362K38829J69523R9481K05526q3278J29474L33722k31905
16800F902423j23966L50442M31041K40222O5310L5510J70900R4124L37677m8275
16790H455408L10942L36904N11015Q6109Q5317J00229L75163L05392J52670K3611
16780A0742760N78978R5934L77659O7728M37254M06764M75066K0529P81365K83912
16770A4267949L17535N95100M81348O35588L65021K46486P59536L41257L81900
16761A8391720Q10565P98998P9763J289688K35044J014452P65316Q66193J220677
$$ plain form
16752 25472416 26136691 27216169 27922067 28968209 30305409 31558776 32966977 34333830
16744 34333830 35643091 37018941 38969972 40649690 42012731 44480524 46077717 48135200
16736 48135200 50504551 52964440 55551426 58361151 61395712 64380845 67637825 71462920
16728 71462920 75152942 79166197 83280363 87880510 92742308 97534131 103182592 108133836
16720 108133836 113879835 120045629 126173457 131672924 138434990 144501661 150665244 156598983
16712 156598983 162407709 167257859 172485224 176064523 179477919 181703804 183301966 183697551
16704 183697551 183318535 181890353 179205322 175905525 171704272 166810058 161653513 155413391
16696 155413391 149294263 142839027 136488533 130037936 123560207 117310846 111082662 105079813
$$ packed form
16752B5472416O64275J079478P05898J046142J337200J253367J408201J366853
16744C4333830J309261J375850J951031J679718J363041K467793J597193K057483
16736D8135200K369351K459889K586986K809725L034561K985133L256980L825095
16728G1462920L690022M013255M114166M600147M861798M791823N648461M951244
16720A08133836N745999O165794O127828N499467O762066O066671O163583N933739
16712A56598983N808726M850150N227365L579299L413396K225885J598162L95585
16704A83697551l79016j428182k685031l299797m201253m894214n156545o240122
16696A55413391o119128o455236o350494o450597o477729o249361o228184o002849
$$ plain form
16688 105079813 99497783 93996691 88937682 84072973 79671651 75177008 71164285 67363072
16680 67363072 63853825 60249627 57135785 54064352 51094714 48762419 46377250 44027635
16672 44027635 42146389 39918812 38323261 36603793 34996611 33467789 31811335 30456637
16664 30456637 29085745 27905900 26955977 25720055 25178390 23736383 22967197 22129360 21381086
16655 21381086 20691608 19629787 18922399 18375908 17471716 17178719 16406788 15953063 15197215
16646 15197215 14904873 14612754 13855374 13591892 13406180 12712922 12451751 12398221 11662004
16637 11662004 11341494 11109940 10738240 10188529 10399768 9690487 9530744 9438254 9065454
16628 9065454 8569929 8544017 8513058 8169029 8019526 7776855 7667883 7242637 7160740 7086123
$$ packed form
16688A05079813n582030n501092n059009m864709m401322m494643m012723l801213
16680F7363072l509247l604198l113842l071433k969638k332295k385169k349615
16672D4027635j881246k227577j595551j719468j607182j528822j656454j354698
16664C0456637j370892j179845r49923j235922n41665j442007p69186q37837p48274
16655B1381086o89478j061821p07388n46491r04192k92997p71931m53725p55848
16646A5197215k92342k92119p57380k63482j85712o93258k61171n3530p36217
16637A1662004l20510k31554l71700n49711K11239p09281j59743r2490l72800
16628I065454m95525k5912l0959l44029j49503k42671j08972m25246q1897p4617
$$ plain form
16618 7086123 6899521 6829060 6591771 6370607 6340683 6403307 6070065 6084059 5567598 5656045
16608 5656045 5604073 5257658 5469285 5258470 5067105 5297647 4944210 4759874 4929321 4683501
16598 4683501 4184051 4506065 4394203 4232358 4307993 3694598 4035073 3785022 3996699 3780837
16588 3780837 3791654 3556168 3687789 3505719 3508789 3344211 3700379 3208042 3702090 3009795
16578 3009795 3112024 2873624 2897396 2978709 2989817 2745508 3305431 2855356 2559313 2814784
16568 2814784 2717111 2844966 2766302 2670016 2503312 2244040 2667769 2707966 2208561 2672603
16558 2672603 2626785 2504843 2179568 2370624 2072607 2180356 2205391 2182017 1623637 2040512
16548 2040512 2052330 1696512 2115906 2141886 2288326 1723649 1877677 1782229 1611802 1758327
$$ packed form
16618G086123j86602p0461k37289k21164k9924O2624l33242J3994n16461Q8447
16608E656045n1972l46415K11627k10815j91365K30542l53437j84336J69447k45820
16598D683501m99450L22014j11862j61845P5635o13395L40475k50051K11677k15862
16588C780837J0817k35486J31621j82070L070j64578L56168m92337M94048o92295
16578C009795J02229k38400K3772Q1313J1108k44309N59923m50075k96043K55471
16568B814784r7673J27855p8664r6286j66704k59272M23729M0197m99405M64042
16558B672603m5818j21942l25275J91056k98017J07749K5035k3374n58380M16875
16548B040512J1818l55818M19394K5980J46440n64677J54028r5448j70427J46525
$$ plain form
16538 1758327 1490642 1537898 1764787 2006019 1537608 1239726 1568962 1339307 1370839 1609811
16528 1609811 1434245 1731195 1750137 1343523 1558670 1412592 1493891 1392084 1468033 1368688
16518 1368688 1308514 1457182 1453379 1169880 1651028 1038820 1009521 1142096 1330962 1036211
16508 1036211 1553152 1154138 1343605 1462787 1371412 1214663 1052981 1153437 1073955 1081607
16498 1081607 853042 1145455 1055170 837600 872722 957877 1038450 802254 988341 1226445
16488 1226445 923011 1080905 903067 1208629 774770 988187 990515 828870 802703 859204
16478 859204 1026885 969981 1319275 1093835 714165 931094 370784 728470 795315 702526
16468 702526 788110 765503 462516 757994 834356 694844 636932 751763 795312 767566 901538
$$ packed form
16538A758327k67685M7256K26889K41232m68411k97882L29236k29655L1532K38972
16528A609811j75566K96950J8942m06614K15147j46078Q1299j01807P5949r9345
16518A368688o0174J48668l803k83499M81148o12208k9299J32575J88866k94751
16508A036211N16941l99014J89467J19182r1375j56749j61682J00456p9482P652
16498A081607k28565K92413r0285k17570L5122Q5155Q0573k36196J86087K38104
16488A226445l03434J57894j77838L05562m33859K13417K328j61645k6167N6501
16478H59204J67681n6904L49294k25440l79670K16929C70784L57686O6845r2789
16468G02526Q5584k2607l02987K95478P6362j39512n7912J14831M3549k7746J33972
$$ plain form
16457 901538 929805 456355 755609 735379 904288 516674 644594 686418 866777 716816
16447 716816 577869 512274 559377 720956 726299 245397 758331 792816 547510 587576 314690
16436 314690 642344 839195 627138 711787 541940 525398 563802 609842 928090 242621
16425 576880 719346 331218 532250 614421 192420 314256 832947 795225 487826 384923
16415 384923 232921 433895 380432 599343 513383 602874 398550 419884 674982 74877
16404 239449 567188 189835 154458 366300 338301 389675 180468 556629 509410 353887
16394 353887 264654 454516 622426 333798 455324 645062 410005 468354 668170 319835
16383 400701 319206 64189 383809 660048 486995 309569 648035 229745 125622 486080
$$ packed form
16457I01538K8267D56355K99254k0230J68909l87614J27920M1824J80359j49961
16447G16816j38947o5595M7103J61579N343B45397N12934L4485k45306M0066k72886
16436C14690L27654J96851k12057Q4649j69847j6542L8404M6040L18248B42621
16425E76880J42466C31218K01032Q2171A92420J21836N18691l7722l07399j02903
16415C84923j52002K00974n3463K18911q5960Q9491k04324K1334K55098G4877
16404B39449L27739A89835l5377K11842k7999N1374A80468L76161m7219j55523
16394C53887q9233J89862J67910k88628J21526J89738k35057N8349J99816C19835
16383D00701q1495F4189L19620K76239j73053j77426L38466B29745j04123L60458
$$ plain form
16373 486080 485636 117602 385439 525132 298461 372393 -44547 286088 182469 262560 555733
16362 555733 -12143 -253 298770 588331 597539 170836 -206169 592036 608481 511329 95123
16350 -2569 -24967 75597 431573 277364 52050 193588 197556 -16234 354561 333888 298185
16339 298185 159481 312520 265484 273613 172058 312964 183632 323457 310151 371361
16329 371361 209937 262981 198863 -72979 214150 -45191 517852 485243 113020 250107
16319 250107 422144 304490 372288 328534 512847 54130 -89679 -12539 316496 -110679
16308 436170 152285 199129 282672 -200281 265487 119059 -96 -108408 491015 199737 168645
16297 168645 196400 -9133 -55696 243202 244412 101313 125564 163536 -136647 57885 2076
$$ packed form
16373D86080m44A17602K67837J39693k26671P3932d4547B86088j03619Q0091K93173
16362E55733a2143b53B98770K89561R208A70836b06169E92036J6445r7152I5123
16350b569k2398G5597L55976j54209E2050J41538L968a6234C54561k0673l5703
16339B98185j38704J53039m7036Q129j01555J40906j29332J39825j3306O1210
16329C71361j61424N3044o4118g2979B14150d5191E17852l2609A13020J37087
16319B50107J72037j17654O7798m3754J84313E4130h9679a2539C16496a10679
16308D36170A52285M6844Q3543b00281B65487A19059i6j08312D91015A99737l1092
16297A68645K7755i133m6563B43202J210A01313K4251L7972a36647E7885B076
$$ plain form
16285 171947 110659 208301 399842 227185 65087 313778 187284 212152 190707 -57464 -41925
16274 -41925 126917 71295 -8274 625559 316055 -78438 -114375 149940 126664 -35937 -192687
16263 -192687 356756 34672 97049 149731 17048 135073 146308 109259 -133809 212976 88638
16251 -165241 61805 83460 -217802 164750 18014 161334 513554 244604 -32503 419092
16240 191420 410607 278042 156927 94005 174970 145933 63252 318476 188990 -68968
16229 142956 -107080 125509 159882 99669 -159931 93182 -119818 -195440 124528 119732 64978
16218 64978 -116733 64344 511450 48832 264512 267845 -283244 124614 14934 62263 -259682
16206 276579 -44539 353491 128186 -173044 133167 -3617 -150237 -146722 218253 52000 37994
$$ packed form
16285A71947o1288R7642J91541j72657F5087K48691j26494K4868k1445e7464J5539
16274d1925A26917n5622h274F25559l09504g8438l5937A49940k3276c5937j56750
16263a92687C56756C4672O2377N2682A7048J18025J1235l7049a33809B12976H8638
16251a65241F1805K1655b17802A64750A8014J43320L52220B44604c2503D19092
16240A91420K19187j32565j21115o2922Q0965k9037F3252K55224j29486f8968
16229A42956a07080A25509L4373o0213a59931I3182a19818p5622A24528m796n4754
16218F4978a16733F4344M47106D8832K15680L333b83244A24614A4934M7329b59682
16206B76579d4539C53491A28186a73044A33167c617j46620L515B18253E2000j4006
$$ plain form
16195 37994 198603 188175 144996 197355 -41727 -9814 236629 -65381 11905 238758 21504
16183 -156244 291568 -207273 -156794 28522 150925 40915 -168036 109407 147722 15001
16172 129966 -39734 -9234 -213031 -38413 70363 71808 113011 -243787 114152 -210380 -49579
16160 396394 65350 -129801 7905 -359842 83750 -177659 171338 -102947 -165891 -156893 60615
16148 86779 -126130 102904 180434 -5911 118049 207124 -200417 76369 -190969 -9848 243130
16136 213706 -60824 44660 78369 220927 -130745 -84756 -15088 -55383 80941 -239276 186477
16124 18822 25554 180915 33233 69541 45158 -134553 112424 -160390 -127303 165506 -185192
16112 -264933 234141 111785 -92473 95026 78321 -270399 -172239 182283 212109 210627 -125129
$$ packed form
16195C7994J60609j0428m3179N2359d1727i814B36629f5381A1905K26853B1504
16183a56244B91568b07273N0479B8522J22403D0915a68036A09407L8315A5001
16172A29966c9734i234k03797c8413G0363J445M1203b43787A14152b10380d9579
16160C96394F5350a29801G905c59842H3750a77659A71338a02947o2944Q998F0615
16148H6779a26130A02904P7530e911A18049Q9075b00417G6369a90969i848B43130
16136B13706f0824D4660L3709J42558a30745M5989a5088m0295H0941b39276A86477
16124A8822O732J55361C3233L6308k4383a34553A12424a60390L3087A65506a85192
16112b64933B34141A11785i2473I5026j6705b70399R8160A82283K9826j482a25129
$$ plain form
16100 29020 168314 27562 191507 56266 263116 -275013 183867 -55152 -10646 324369
16089 -49218 -238794 193460 182768 177853 -33355 -218545 -87896 130398 -86099 68950 188713
16078 188713 264626 -143593 330986 -10186 309283 -90782 -142552 -97479 -128405 31678 376921
16067 376921 171842 -12274 -94683 -197436 185154 11917 191480 -135232 160077 105148
16057 105148 -82652 -9908 249559 332198 -18335 -27618 374073 249126 -414595 -128003 128658
16045 144375 14411 120451 251690 -133142 197372 44423 -114658 -10536 -309389 228118
16034 -319434 -270670 -422973 -200982 -55707 154909 122007 78058 -77692 223058 90265 -200284
16022 -128467 -304074 -227828 276511 -83550 19759 -136298 -249219 -685 59357 -113934 -80753
$$ packed form
16100B9020J39294B7562J63945E6266K06850b75013A83867e5152a0646C24369
16089d9218j89576A93460j0692m915c3355j85190h7896A30398h6099F8950J19763
16078A88713P5913a43593C30986a0186C09283i0782n1770M5073l0926C1678L45243
16067C76921A71842a2274q2409j02753A85154A1917J79563a35232A60077n4929
16057A05148h2652i908B49559Q2639a8335r283C74073j24947d14595a28003A28658
16045A44375A4411J06040J31239a33142A97372D4423a14658a0536k98853B28118
16034c19434M8764j52303b00982e5707A54909l2902m3949g7692B23058I0265b00284
16022a28467j75607P6246B76511h3550A9759a36298j12921f85E9357a13934L3181
$$ plain form
16011 -80753 -275538 160235 56206 -89985 -10648 391780 123210 -182267 -231329 -104840
16000 -351990 76948 377439 -178298 217635 172720 -55080 -73759 -255632 -248359 -176962 -101771
15989 -101771 -12902 -32375 221322 289103 -290426 -291246 -507046 111388 -215110 -201186 -280904
15978 -280904 242013 96736 -164825 -18815 -200443 226071 155791 329280 -69213 308538
15967 730382 -15450 4668 136128 235243 -118859 86171 -334153 90722 23918 -132028 -213145
15956 -213145 95759 90446 45725 -98282 161407 -77248 18665 -212455 165300 -213430 75902
15944 -5080 -444296 -315884 -55633 -35481 27909 -127556 250885 -27969 -188144 186666 -27751
15932 136200 296384 -387355 -214889 -86277 -155811 -64694 -172597 55498 10734 -319388
$$ packed form
16011h0753j94785A60235E6206h9985a0648C91780A23210a82267m9062a04840
16000c51990G6948L00491a78298B17635m4915e5080j8679j81873P273P1397P5191
15989a01771a2902j9473B21322O7781b90426q20k15800A11388b15110J3924p9718
15978b80904B42013I6736a64825a8815j81628B26071p0280J73489f9213C08538
15967G30382a5450D668J31460R9115a18859H6171c34153I0722B3918a32028q1117
15956b13145I5759n313m4721i8282A61407g7248A8665b12455A65300b13430G5902
15944e080m39216J28412e5633K0152B7909a27556B50885b7969j60175A86666b7751
15932A36200J60184c87355J72466h6277o9534f4694j07903E5498A0734c19388
$$ plain form
15921 -142696 -19091 44696 125037 297134 -170910 87989 68232 214280 384935 14840 -303231
15909 358568 -279759 106203 -188182 61597 -112441 -50138 -146396 -185670 -266617 -61566 -127402
15898 -127402 -45420 -179213 -9527 153249 -221463 30117 -179003 -69950 29950 235310 125293
15887 125293 -112468 67198 -147077 -331063 63214 101093 -158110 285407 51400 -96461
15876 56696 152086 -60269 40334 198005 129823 -127629 72671 -45100 141952 -318047 -15780
15864 -37071 -273204 130617 27393 -25026 82594 -88815 261886 153598 182826 -180133 -302340
15853 -302340 -216710 148650 29570 266237 -210905 230693 -230151 -164076 292647 142011
15842 -13180 63320 98476 -169894 -154754 89840 191448 -126340 -88474 83510 43848 27672
$$ packed form
15921a42696a9091D4696Q0341J72097a70910H7989j9757J46048J70655A4840c03231
15909C58568b79759A06203a88182F1597a12441e0138r6258l9274q0947f1566o5836
15898a27402d5420j33793i527A53249b21463C0117a79003f9950B9950K05360j10017
15887A25293a12468F7198a47077j83986F3214L7879a58110B85407E1400i6461
15876E6696R5390f0269D0334J57671o8182a27629G2671d5100A41952c18047a5780
15864c7071k36133A30617B7393b5026H2594h8815B61886j08288K9228a80133j22207
15853c02340Q5630A48650B9570K36667b10905B30693b30151O6075B92647A42011
15842a3180F3320L5156a69894J5140H9840J01608a26340L7866H3510l9662j6176
$$ plain form
15831 27672 76589 52321 -177985 -1429 -303205 -33131 -165960 -284089 93473 221590 32658
15819 110547 -404944 -272147 94931 -331395 -23638 -141012 -266294 190858 150208 -70023
15808 25282 -256964 -5288 -172521 -149128 162053 203390 -131308 -117569 101867 -166541 -298225
15797 -298225 -267996 346233 -175921 208080 -46193 124292 -168765 -273655 -155626 -337254
15787 -337254 -339707 -25127 73323 -78863 -237018 -68329 40615 3212 142241 -94611 -49723
15776 -49723 -166770 -97036 191545 -167913 -973 -212136 -88555 -44328 -136551 -265557 -55567
15764 -108286 24519 6926 -33087 269858 22598 -268984 -2612 186665 54996 34057 -106926
15752 38085 163448 -54233 -30168 97403 -104323 -90406 109479 92990 -179036 -247421 324601
$$ packed form
15831B7672M8917k4268a77985a429l01776c3131j32829j18129I3473J28117C2658
15819A10547d04944J32797I4931c31395b3638j17374j25282A90858m0650g0023
15808B5282b56964e288j67233K3393A62053M1337a31308J3739A01867a66541j31684
15797b98225L0229C46233a75921B08080d6193A24292a68765j04890J18029j81628
15787c37254k453b5127G3323g8863j58155f8329D0615C212J39029i4611M4888
15776d9723j17047O9734A91545a67913i73k11163h8555M4227r2223j29006e5567
15764a08286B4519F926c3087B69858B2598b68984b612A86665E4996k0939a06926
15752C8085J25363e4233K4065I7403a04323J3917A09479j6489a79036o8385C24601
$$ plain form
15740 512747 -31513 -117956 209838 -115223 214229 114623 -149495 -105389 -25817 -176311
15730 -176311 244463 85555 116213 65375 254818 -75924 -314203 114024 216049 -46392
15719 -252558 141945 -133861 -253110 -31412 28632 -54143 60926 -102021 -10673 -163254
15709 -163254 -35650 105158 162980 76307 -143167 -409687 -132755 -69648 -324963 -179860
15699 -179860 -355253 458664 -348297 -379054 2846 -221949 37605 71216 -183079 -73865 -67451
15688 -67451 98775 -102437 -45902 35113 12222 108900 237818 -200939 -125910 189161 49092
15676 -82641 -64320 298575 139534 113846 -274601 -202790 45543 -348887 125587 79944 73924
15665 73924 -82758 78848 -145684 -3696 90716 106566 -152799 255874 41531 55075 112527
$$ packed form
15740E12747c1513q6443B09838a15223B14229r9606a49495M4106b5817j50494
15730a76311B44463H5555L0658n0838J89443g5924k38279A14024J02025d6392
15719b52558A41945a33861j19249c1412B8632e4143F0926a02021a0673j52581
15709a63254c5650A05158N7822G6307a43167k66520a32755O3107k55315J45103
15699a79860j75393D58664c48297l0757B846b21949C7605L3611a83079g3865O414
15688f7451I8775a02437d5902C5113A2222R6678J28918b00939P5029A89161D9092
15676h2641J8321B98575A39534k5688b74601P1811D5543c48887A25587m5643o020
15665G3924h2758G8848a45684c696I0716J5850a52799B55874D1531J3544N7452
$$ plain form
15654 112527 -91739 -209822 -138260 -283657 113819 -81344 -24205 -17737 -170103 229636 -155870
15642 -83748 178077 26818 87275 -233923 -257772 172810 -245535 -99497 -140201 -274692 138616
15630 255906 122622 1243 164230 34216 88863 -49177 17935 -107440 181109 -147290 496186
15618 -33964 -405498 113186 63893 -150405 -74277 319220 45579 -28602 -128820 78471 -38356
15606 -290739 28490 -12423 13072 -48254 -204261 244899 40319 -303005 187828 8428 304888
15595 304888 179165 229044 -179177 -57704 104565 11482 128852 -106338 -191640 25538
15584 -8330 -112244 64297 -31560 388030 165456 -109239 80434 -10548 -13551 -111418 13054
15572 -48756 71198 43274 218977 -22575 -160999 -86873 -40343 176223 -82383 -97783 103707
$$ packed form
15654A12527i1739j18083P1562j45397A13819h1344b4205O468j52366B29636a55870
15642h3748A78077B6818O0457b33923k3849A72810b45535i9497m0704j34491A38616
15630B55906A22622A243J62987C4216N4647d9177A7935a07440A81109a47290D96186
15618c3964l71534A13186m9293a50405g4277C19220D5579b8602j00218G8471c8356
15606b90739B8490a2423A3072d8254j56007B44899D0319c03005A87828H428K96460
15595C04888j25723M9879a79177e7704A04565A1482J17370a06338q5302B5538
15584h330j03914F4297c1560C88030A65456a09239H0434a0548l003r7867A3054
15572d8756G1198k7924J75703b2575j38424P4126d0343A76223h2383j5400A03707
$$ plain form
15560 -260727 -107706 -156820 -233802 -14303 134212 171025 13414 -51751 255612 -140041 328776
15548 -4761 63493 66789 89809 -79346 -140618 170165 11474 -70454 -10140 144726 -270 126319
15535 -36228 186719 107752 32436 -348385 -64467 177423 185092 132359 156476 -365304 -135572
15523 118558 56615 8833 -282228 -303864 92783 290649 -12165 -82053 92812 -372436 -185324
15511 280017 227507 -186632 53256 29596 54776 -16638 -275388 221168 -20828 -127394 -126946
15500 -126946 33953 59133 103116 192278 87238 -57773 -365618 -222821 106850 210899 -69541
15488 94261 -4723 188982 -230357 41524 284352 89504 -16217 35470 -99411 -277287 -45709
15476 360309 -341390 185838 -200960 31260 5325 -273353 -20269 -31572 47747 -296159 -22538
$$ packed form
15560b60727a07706m9114p6982a4303A34212L6813A3414e1751B55612a40041C28776
15548d761F3493L296K3020g9346o1272A70165A1474g0454a0140A44726b70A26319
15535c6228A86719p8967C2436c48385f4467A77423P669n2733K4117c65304a35572
15523A18558E6615H833b82228k1636I2783J97866a2165o9888I2812c72436a85324
15511B80017n2510a86632E3256k3660K5180a6638k58750B21168b0828j06566M48
15500a26946C3953K5180M3983Q9162H7238e7773l07845J42797A06850J04049f9541
15488I4261d723A88982b30357D1524K42828H9504a6217C5470i9411j77876d5709
15476C60309c41390A85838b00960C1260E325b73353b0269j1303D7747b96159b2538
$$ plain form
15464 220883 267951 -363753 205892 57981 -173892 34777 72253 -233172 112776 10791
15453 120430 199111 55964 40132 119266 165860 -39017 139206 294276 141579 150808 89421
15442 89421 -240371 303852 -101605 -151011 51088 123835 -18446 27813 -34903 -24023 135950
15430 155418 -209724 -218620 184032 84683 -78014 -195498 19580 -37046 -28918 20872 23999
15419 23999 92255 111122 -66757 -72832 -176904 -67574 468441 201535 150938 26187 -174721
15407 -251099 -64706 -267036 64628 223522 212015 191169 149591 132377 -245382 -375560 40737
15395 140199 -117760 157147 11186 350792 71937 -110589 -278821 396649 -61774 357080
15384 -213479 -156569 -58406 115891 -160963 -55827 -256586 -55703 153851 -203326 260877
$$ packed form
15464B20883M7068c63753B05892E7981a73892C4777L7476b33172A12776A0791
15453A20430P8681E5964j5832P9134M6594c9017A39206J55070A41579R229o1387
15442H9421b40371C03852a01605m9406E1088P2747a8446B7813c4903J0880A35950
15430A55418b09724q896A84032H4683g8014j17484A9580c7046Q128B0872L127
15419B3999O8256J8867f6757o075j04072f7574D68441B01535n0597B6187a74721
15407b51099f4706k02330F4628J58894j1507k0846m1578j7214b45382j30178D0737
15395A40199a17760A57147A1186L39606G1937a10589j68232C96649f1774C57080
15384b13479N6910e8406A15891a60963e5827k00759e5703A53851b03326B60877
$$ plain form
15373 -269448 255546 434993 122723 -407375 141961 179105 277919 -31074 -342852 163138
15362 -52932 75674 247762 17728 160559 63337 255688 151070 -64193 144046 133198 -16658
15350 -370988 74781 -251934 -70244 -137052 -53578 39420 -151428 95324 99229 6328 63142
15339 63142 -263537 251488 121598 -24914 163665 -74071 -143250 -287605 -150394 6651 128176
15328 128176 174650 42196 -162691 -215711 85671 -388884 163539 -196332 -273763 -13385 25341
15316 -38125 152864 -180881 -174508 138766 12111 187301 71869 157984 45514 690 204092
15305 204092 -55722 -168104 36744 -5779 119128 82770 -88486 154898 161414 165902 306381
15294 306381 68151 154929 -36407 410404 -185447 -269485 298793 -248098 302178 -237670
$$ packed form
15373b69448B55546J79447A22723d07375A41961L7144R8814c1074l11778A63138
15362e2932G5674J72088A7728J42831F3337J92351j04618f4193A44046j0848a6658
15350c70988G4781b51934g0244o6808e3578C9420a51428I5324L905F328N6814
15339F3142b63537B51488A21598b4914A63665g4071o9179j44355J37211F651J21525
15328A28176M6474D2196a62691n3020H5671c88884A63539a96332p7431a3385B5341
15316c8125A52864a80881O373A38766A2111J75190G1869Q6115D5514F90K03402
15305B04092e5722j12382C6744e779A19128l6358h8486A54898O516M488J40479
15294C06381F8151Q6778c6407D10404a85447q4038B98793b48098C02178b37670
$$ plain form
15283 30460 18025 216103 30484 134178 58342 -88964 299636 207541 45450 -3077 -80330
15272 -80330 156465 169838 199826 41357 -3210 110146 362824 165311 315205 -78839 -160637
15261 -160637 -142953 -76456 -18993 -156615 198108 342811 40490 -544472 203993 -201930
15250 49418 -14372 154452 155817 357161 49415 -346429 6598 195734 29984 347218 19064
15238 -119190 287963 387599 421223 798717 965274 1477041 1173025 1063223 1455400 583095
15227 305470 302731 533123 272097 137711 99192 32611 -236367 282471 307306 118868
15216 120231 66240 -135451 -45905 -70373 46294 15743 15156 -73429 5765 -9858 119760 210818
15204 210818 -56722 -65626 204279 382296 -187962 165421 144747 136944 -294807 206366 236522
$$ packed form
15283C0460j2435J98078C0484J03694E8342h8964B99636r2095D5450c077p7253
15272h0330A56465J3373K9988D1357c210A10146K52678A65311J49894g8839q1798
15261a60637J7684O6497a8993j37622A98108J44703D0490e44472B03993b01930
15250D9418a4372A54452J365K01344D9415c46429F598J89136B9984L17234A9064
15238a19190B87963R9636L3624L77494J66557N11767l04016j09802L92177E83095
15227C05470k739K30392k61026j34386l8519C2611b36367B82471K4835A18868
15216A20231n3991a35451d5905k4468D6294A5743n87g3429E765i858A19760R1058
15204B10818e6722q904B04279J78017a87962A65421k0674p803b94807B06366L0156
$$ plain form
15193 236522 245431 190008 303230 233319 69777 -95635 60638 -53305 -132838 267598 -203955
15181 -100479 367823 -378620 361460 124974 -101860 284370 293409 -190095 47220 -36874
15170 15262 129104 -176041 -109235 192280 156215 63924 51437 -188521 -262748 344351 -171003
15158 517447 -4673 215910 107076 299447 -21632 -33793 147618 -181412 -47753 -32672 146201
15146 -44365 -49519 56048 191649 271271 216067 171911 3776 -69284 -192146 -65268 -51057 181720
15133 163283 104598 213402 172086 97136 47687 -159007 150760 60446 -68866 -19882 -886
15121 -39472 389981 366619 6546 114198 386982 112219 38311 144072 117840 246252 68397
15109 190255 89374 -177876 245549 -1623 241116 423463 -2761 -430685 278552 414552
$$ packed form
15193B36522Q909n5423J13222o9911F9777i5635F0638e3305p9533B67598b03955
15181a00479C67823c78620C61460A24974a01860B84370R039a90095D7220c6874
15170A5262J13842a76041O6806A92280l6065F3924j2487a88521p4227C44351a71003
15158E17447d673B15910A07076J92371b1632j2161A47618a81412d7753J5081A46201
15146d4365n154E6048J35601P9622n5204m4156C776f9284j22862f5268J4211A81720
15133A63283n8685J08804m1316p4950D7687a59007A50760F0446f8866a9882h86
15121c9472C89981k3362F546J07652K72784A12219C8311J05761k6232J28412F8397
15109A90255H9374a77876B45549a623B41116J82347b761m27924B78552J36000
$$ plain form
15099 414552 414697 362370 110899 125132 332627 3249 208801 367707 170526 151209 650059
15088 650059 10294 110428 372721 50495 234108 258863 287787 106319 144872 246814
15078 246814 126796 316785 161452 519767 322910 29939 -180678 462474 -3640 394135
15067 -76727 -99427 383356 199852 124845 288820 456460 18890 93388 86002 353071 151167
15055 305116 41253 72681 422465 233259 39753 280477 391245 208166 -13519 239683
15044 24122 210962 142422 63716 335739 81243 44862 316599 155400 229631 430864 -90902
15032 396074 184933 40873 55052 -128523 -5669 -75188 382595 -44253 491478 -235299 133816
15020 200557 444556 66797 165068 524704 228542 171968 82288 157631 -25319 126213 144917
$$ packed form
15099D14552J45n2327A10899J4233K07495C249K05552J58906A70526j9317M98850
15088F50059A0294J00134K62293E0495J83613K4755K8924A06319L8553J01942
15078B46814j20018J89989j55333L58315j96857B9939a80678D62474c640C94135
15067g6727k2700C83356j83504p5007J63975J67640A8890P4498p386K67069A51167
15055C05116D1253L1428L49784j89206C9753K40724J10768j83079a3519B39683
15044B4122J86840o8540F3716K72023H1243l6381K71737A55400P4231K01233i0902
15032C96074A84933D0873J4179a28523e669o9519C82595d4253D91478b35299A33816
15020B00557K43999F6797R8271L59636B28542n6574H2288P5343b5319A26213J8704
$$ plain form
15009 144917 472803 363182 374868 -63829 312478 -12462 23735 -141276 -19885 289371
14998 611406 126238 -207118 -70574 49074 147793 -91403 -204145 155057 16717 184205
14988 184205 182926 78557 182561 303061 -67684 381789 270583 183596 213826 78301 19058
14976 111149 615240 138883 381879 301446 270594 -57538 148234 433506 183038 227364
14966 227364 470013 227877 405679 317182 156523 289957 319146 283659 556042 178278
14955 91845 335880 438892 384154 385927 -50132 113400 200625 197525 74679 377665 668811
14944 668811 280996 189204 157843 367656 448599 243258 82993 360549 388050 430798 98021
14932 407086 487165 108695 220741 381619 -28291 80827 261769 325465 529046 139164
$$ packed form
15009A44917L27886j09621J1686f3829C12478a2462B3735a41276a9885B89371
14998F11406A26238b07118g0574D9074R8719i1403j12742A55057A6717J67488
14988A84205j279G8557J04004J20500f7684C81789j11206q6987L0230G8301A9058
14976A11149N04091A38883K42996q0433l0852e7538A48234K85272A83038M4326
14966B27364K42649B27877J77802q8497A56523J33434K9189l5487K72383A78278
14955I1845K44035J03012n4738J773e0132A13400Q7225l100G4679L02986K91146
14944F68811B80996r1792l1361K09813Q0943k05341H2993K77556K7501M2748I8021
14932D07086Q0079A08695J12046J60878b8291H0827J80942O3696K03581A39164
$$ plain form
14921 383451 602775 273402 402119 252194 412346 195406 160961 354780 234515 556017
14911 556017 -155407 272220 500518 519209 65831 461565 212188 412342 405342 118112
14900 326852 371409 389185 181327 426792 470765 229404 103277 272736 434636 228553
14890 228553 371659 306197 224793 197373 696564 -213389 467594 372931 33750 166494
14880 166494 396670 408421 52110 66195 89535 306181 409218 319663 593970 325758
14870 325758 230801 174693 220335 637702 157670 399426 205928 575441 409096 558706
14860 558706 311022 267401 548463 511575 557697 191970 546424 380694 738294 288144
14849 444744 319226 343857 218098 71053 384145 840798 580366 489483 263561 330938
$$ packed form
14921C83451K19324B73402J28717j49925J60152A95406l4445J93819j20265L21502
14911E56017a55407B72220K28298J8691F5831L95734B12188K00154p000A18112
14900C26852M4557J7776A81327K45465M3973B29404A03277J69459J61900k06083
14890B28553J43106o5462q1404k7420M99191b13389D67594r4663C3750J32744
14880A66494K30176J1751E2110J4085K3340K16646J03037q9555K74307k68212
14870C25758r4957n6108M5642M17367A57670K41756j93498L69513j66345J49610
14860E58706k47684m3621K81062l6888M6122A91970L54454j65730L57600B88144
14849D44744j25518K4631j25759G1053L13092M56653k60432r0883k25922O7377
$$ plain form
14839 330938 422036 716407 112091 323622 364751 621154 463911 642399 288677 324945
14829 324945 578348 149602 301753 336469 660381 157885 362987 529115 334819 362918
14819 362918 314857 828211 376459 638140 528280 215488 716802 571280 487092 417507
14809 417507 396271 450501 667076 684679 694151 796040 803095 470354 710206 568313 226226
14797 377740 520263 634692 382089 260172 773979 403174 776091 366358 282202 607325
14787 607325 348133 528877 412383 718734 715647 580218 699238 702840 649498 440028
14777 440028 584824 519777 743686 758718 587066 423925 771296 686511 379659 418487
14767 418487 692944 426561 547580 691603 587539 402655 676637 614050 532425 553200
$$ packed form
14839C30938R1098K94371A12091K11531M1129K56403j57243J78488B88677L6268
14829C24945K53403A49602J52151L4716L23912A57885K05102J66128j94296K8099
14819C62918m8061N13354C76459K61681j09860B15488N01314j45522q4188o9585
14809D17507k1236N4230K16575J7603R472J01889P055l32741K39852j41893B26226
14797C77740J42523J14429k52603j21917N13807l70805L72917C66358q4156L25123
14787F07325k59192J80744j16494L06351l087j35429J19020L602n3342k09470
14777D40028J44796o5047K23909J5032j71652j63141L47371q4785l06852L8828
14767D18487K74457k66383J21019J44023j04064j84884K73982o2587q1625K0775
$$ plain form
14757 553200 424020 693007 428286 945021 601288 726364 639634 513451 202691 851477
14747 851477 812584 679325 714282 594547 600816 735084 968285 471702 658628 749974
14737 749974 936864 908638 382252 267189 932813 543380 599612 750825 502181 603662
14727 603662 580594 977039 500200 903787 1037896 814896 986564 788773 543746 338265
14717 338265 827696 939365 826568 831055 869347 614539 799541 587065 850692 939877
14707 939877 857422 553907 895293 967298 807824 755568 911494 801055 1007902 670586
14697 670586 739971 679095 874646 685128 898692 1102026 748819 909478 1169210 1166306
14687 1166306 976822 737751 785031 1214743 1004689 1073571 1330885 1181708 694236 871608
$$ packed form
14757E53200j29180K68987k64721N16735l43733J25076q6730j26183B02691O48786
14747H51477l8893j33259L4957j19735O269J34268K33201D71702J86926R1346
14737G49974J86890k8226C82252j15063O65624l89433N6232J51213k48644J01481
14727F03662k3068L96445m76839M03587J34109k23000J71668j97791k45027k05481
14717C38265M89431J11669j12797M487L8292k54808J85002k12476K63627Q9185
14707I39877q2455l03515L41386P2005j59474n2256J55926j10439K06847l37316
14697F70586O9385o0876J95551j89518K13564K03334l53207J60659K59732k904
14687A166306j89484k39071M7280M29712k10054O8882K57314j49177m87472J77372
$$ plain form
14677 871608 992655 1031894 1203049 1231555 895225 1168900 1034075 1160008 879834 852599
14667 852599 924170 961345 940879 1102592 1117372 1118622 924653 1253357 823724 853640 1247750
14656 1247750 839414 1058849 835673 1229222 1167943 1098313 1064297 931973 1096329 1146815
14646 1146815 1144997 1004659 1368075 1230895 627766 1329071 1138802 1367584 1177484 1170123
14636 1170123 1039092 1123850 1381219 1436682 1313280 1222191 1355924 1350478 1212342 1467186
14626 1467186 1292244 1148580 1042503 1482183 1316325 1216996 1432730 1035290 1166308 1456437
14616 1456437 1149463 1445638 1671123 1656013 1565114 1386998 1244104 1432004 1614063 1424835
14606 1424835 1319615 1609449 1607333 1633975 1754992 1777875 1218034 1737892 1312584 1744045
$$ packed form
14677H71608J21047L9239J71155K8506l36330K73675j34825J25933k80174k7235
14667H52599P1571L7175k0466J61713J4780J250j93969L28704m29633K9916L94110
14656A247750m08336K19435k23176L93549o1279o9630l4016j32324J64356N0486
14646A146815j818j40338L63416j37180o03129P01305j90269K28782j90100p361
14636A170123j31031Q4758K57369N5463j23402r1089J33733n446j38136K54844
14626A467186j74942j43664j06077M39680j65858r9329K15734l97440J31018K90129
14616A456437l06974K96175K25485j5110r0899j78116j42894J87900J82059j89228
14606A424835j05220K89834k116K6642J21017K2883n59841N19858m25308M31461
$$ plain form
14596 1744045 1487888 1510993 1610812 1910441 1742866 2117624 1775705 1780184 1411372 1639350
14586 1639350 1839451 1867774 1673443 1907749 1744641 1655191 1889264 2104861 2061735 1731272
14576 1731272 2024023 1723614 1615892 1893320 2128798 2105597 1664172 2061319 2354974 2070671
14566 2070671 1890423 1840162 2025033 2393239 1969713 2576761 2343733 2661367 2579235 2290029
14556 2290029 2453675 2492775 2208237 2631446 2808571 2569707 2660125 2713152 3047535 2817947
14546 2817947 3127219 2927310 3532812 3241181 3358749 4024828 4113537 4424891 5044261 5735166
14536 5735166 6430738 7903418 10666209 15144148 21670045 32111857 31745041 18961626
14528 18961626 10659123 7099753 5129811 3719881 3311204 2791353 2460681 2111653 2514544
$$ packed form
14596A744045k56157K3105R9819K99629j67575L74758l41919M479l68812K27978
14586A639350K00101K8323j94331K34306j63108q9450K34073K15597m3126l30463
14576A731272K92751l00409j07722K77428K35478k3201m41425L97147K93655k84303
14566B070671j80248n0261J84871L68206m23526O07048k33028L17634q2132k89206
14556B290029J63646L9100k84538M23209J77125k38864R0418N3027L34383k29588
14546B817947L09272j99909O05502k91631J17568O66079Q8709L11354O19370O90905
14536E735166O95572J472680K762791M477939O525897J0441812l66816j2783415
14528A8961626q302503l559370j969942j409930m08677n19851l30672l49028M02891
$$ plain form
14519 2514544 2639826 2270083 2397076 2408351 2055464 2511446 2526006 2564385 2414482 2482398
14509 2482398 2423080 2723628 2521832 2729548 2711321 2808740 2786591 2827063 2840914 2770045 2909748
14498 2909748 2921910 2991473 3114633 3000773 3238974 3358108 3175462 3106939 3321950 3226713
14488 3226713 3044085 3199517 2994099 3354302 3386392 3714724 3260455 3619186 3600739 3602956
14478 3602956 3685878 3401347 3416704 3900282 3798621 3586816 3937121 4197008 3593516 3893636
14468 3893636 3747598 3909001 4073992 4198209 4300024 4150667 4151247 4651872 4318980 4121052
14458 4121052 4562560 4725602 4593494 4600731 4396012 4593959 4648018 4930544 4558288 4641135
14448 4641135 4567359 5186386 5019535 5148297 5172568 5442863 5346494 5173504 5477793 5439599
$$ packed form
14519B514544J25282l69743J26993J1275l52887M55982J4560L8379j49903O7916
14509B482398n9318L00548k01796K07716j8227R7419k2149M0472J3851p0869J39703
14498B909748J2162O9563J23160j13860K38201J19134j82646o8523K15011r5237
14488C226713j82628J55432k05418L60203L2090L28332m54269L58731j8447K217
14478C602956Q2922k84531J5357M83578j01661k11805L50305K59887o03492L00120
14468C893636j46038J61403J64991J24217J01815j49357N80N00625l32892j97928
14458D121052M41508J63042j32108P237k04719J97947N4059K82526l72256Q2847
14448D641135p3776O19027j66851J28762K4271K70295r6369j72990L04289l8194
$$ plain form
14438 5439599 5564620 5764080 5718713 5822157 5740661 5942672 5846805 6022499 6055919 6556227
14428 6556227 6372504 6273492 6584294 6557314 6632715 6798169 6814584 7043855 6930759 7054828
14418 7054828 7327739 7257445 7566513 7628490 7456231 7697780 7474226 7890957 8151113 8198608
14408 8198608 7985658 7957901 8392926 8396013 8653483 8844803 9285477 9140370 9386306 9311250
14398 9311250 9294106 9787625 9780076 10108541 10534144 9913350 10310255 10461440 10618205 10745550
14388 10745550 11050169 11111670 11367245 11737715 11724119 11947062 12108953 12482097 12749783 12865957
14378 12865957 13073035 12776966 13234589 13287951 13948159 14014898 14450887 14583602 14915058 15156160
14368 15156160 15456631 15550260 15758720 16192741 16632993 17052523 16997947 17746956 17990108 18026479
$$ packed form
14438E439599J25021J99460m5367J03444q1496K02011r5867J75694L3420N00308
14428F556227j83723r9012L10802k6980P5401J65454J6415K29271j13096J24069
14418G054828K72911p0294L09068O1977j72259K41549k23554M16731K60156M7495
14408H198608k12950k7757M35025L087K57470J91320M40674j45107K45936p5056
14398I311250j7144M93519p549L28465M25603o20794L96905J51185J56765J27345
14388A0745550L04619O1501K55575L70470j3596K22943J61891L73144K67686J16174
14378A2865957K07078k96069M57623N3362O60208O6739M35989J32715L31456K41102
14368A5156160L00471R3629K08460M34021M40252M19530n4576P49009K43152L6371
$$ plain form
14358 18026479 18767043 19018215 19418522 19886591 20102350 20322497 20768571 21197707 21790571
14349 21790571 22264074 22850244 23189399 23583247 24293443 24921450 25388322 25884448 26572617
14340 26572617 27111499 27780187 28594606 29039994 29921564 29981360 31132005 32157369 32623733
14331 32623733 33572069 34755026 35630445 36606390 37361548 38460555 39706547 40457584 41723923
14322 41723923 43275227 44405656 45824176 46944723 48545407 49933982 51110042 53088394
14314 53088394 54857192 56665832 58248232 60069031 62006115 64639000 66597999 68902668
14306 68902668 71315292 73971387 76259266 79625748 82467901 85351024 88658139 92219148
14298 92219148 95669071 99781882 103814972 107799101 112842694 117790239 122308712 127753662
$$ packed form
14358A8026479P40564K51172M00307M68069K15759K20147M46074M29136N92864
14349B1790571M73503N86170L39155L93848P10196O28007M66872M96126O88169
14340B6572617N38882O68688Q14419M45388Q81570N9796J150645J025364M66364
14331C2623733R48336J182957Q75419R75945P55158J099007J245992P51037J266339
14322D1723923J551304J130429J418520J120547J600684J388575J176060J978352
14314E3088394J768798J808640J582400J820799J937084K632885J958999K304669
14306F8902668K412624K656095K287879L366482K842153K883123L307115L561009
14298I2219148L449923M112811M033090L984129N043593M947545M518473N444950
$$ plain form
14290 127753662 133369517 139377161 145472715 152460342 159411920 167092730 175050649 183227647
14282 183227647 192279007 201823717 211530426 222130517 233236437 244802795 256909327
14275 256909327 269484736 283002759 297036607 311137485 325876542 340677091 354845573
14268 354845573 368785477 382057032 394266812 406376342 417983178 428458609 437538512
14261 437538512 445314812 452918394 459655890 462627679 462503773 462747376 464386468 461999916
14253 461999916 453385297 444811676 434511558 423632974 411916384 399314336 385934524
14246 385934524 371928117 357977601 343261589 328306556 314524594 300242537 286860028
14239 286860028 273812755 260900187 247964226 235932528 223880678 212694054 201657195
$$ packed form
14290A27753662N615855O007644O095554O987627O951578P680810P957919Q176998
14282A83227647R051360R544710R706709J0600091J1105920J1566358J2106532
14275B56909327J2575409J3518023J4033848J4100878J4739057J4800549J4168482
14268C54845573J3939904J3271555J2209780J2109530J1606836J0475431R079903
14261D37538512P776300P603582O737496K971789j23906K43603J639092k386552
14253D61999916q614619q573621j0300118j0878584j1716590j2602048j3379812
14246C85934524j4006407j3950516j4716012j4955033j3781962j4282057j3382509
14239B86860028j3047273j2912568j2935961j2031698j2051850j1186624j1036859
$$ plain form
14232 201657195 191280239 181574238 172452723 163903072 155998562 148440961 141426401 134922806
14224 134922806 128676786 123146591 117970603 112557681 107785588 102980639 99220318 95308027
14216 95308027 91421305 87563765 84192578 81025015 78069834 74939466 72597684 69409444
14208 69409444 67357540 65126331 62611567 60642799 58649923 56586641 55082112 52892342
14200 52892342 51369137 50117901 48478800 47177238 45705270 44309153 42784350 41539956
14192 41539956 40959704 39973711 38686640 37433768 36492157 35618417 34898651 33823440 32675438
14183 32675438 32025166 31075255 30483833 29812270 29006520 28213496 27571953 27088644 26250060
14174 26250060 25457259 25019748 24473796 23741205 23340066 22751379 22228174 21824263 21425957
$$ packed form
14232B01657195j0376956r706001r121515q549651p904510p557601p014560o503595
14224A34922806o246020n530195n175988n412922m772093m804949l760321l912291
14216I5308027l886722l857540l371187l167563k955181l130368k341782l188240
14208F9409444k051904k231209k514764j968768j992876k063282j504529k189770
14200E2892342j523205j251236j639101j301562j471968j396117j524803j244394
14192D1539956n80252r85993j287071j252872r41611q73740p19766j075211j148002
14183C2675438o50272r49911n91422o71563q05750p93024o41543m83309q38584
14174B6250060p92801m37511n45952p32591m01139n88687n23205m03911l98306
$$ plain form
14165 21425957 20874056 20633586 19921487 19517030 19172475 19027944 18396753 18224609 17547198
14156 17547198 17697232 17257633 16637245 16412203 16050307 15585021 15258785 15020446 15032270
14147 15032270 14494374 14657126 14017320 13991428 13437932 13585270 13408512 12643839 12908446
14138 12908446 12700551 12563816 12292909 11898615 11910110 11526256 11580016 11657003 11095994 10851980
14128 10851980 10437091 10765412 10738392 10287370 10042118 10174557 10110456 9443033 10064019 9510861
14118 9510861 9134174 9163419 9111549 9039912 8552242 8752333 8541747 8834260 8381968 8476763
14108 8476763 8187319 7993102 7681653 7876732 7606915 7555659 7573527 7383203 7088726 7096202
14098 7096202 7151391 6762095 6848255 6674478 6873351 6760227 6735774 6034518 6597953 6597945 6412205
$$ packed form
14165B1425957n51901k40470p12099m04457l44555j44531o31191j72144o77411
14156A7547198J50034m39599o20388k25042l61896m65286l26236k38339J1824
14147A5032270n37896J62752o39806k5892n53496J47338j76758p64673K64607
14138A2908446k07895j36735k70907l94294J1495l83854N3760P6987n61009k44014
14128A0851980m14889L28321k7020m51022k45252J32439o4101o67423O20986n53158
14118I510861l76687K9245n1870p1637m87670K00091k10586K92513m52292R4795
14108H476763k89444j94217l11449J95079k69817n1256J7868j90324k94477P476
14098G096202N5189l89296Q6160j73777J98873j13124k4453p01256N63435qj85740
$$ plain form
14087 6412205 6124860 6049381 6122814 5838877 5768194 5779852 6074978 5537291 5437747 5479556
14077 5479556 5197413 5336133 5609668 5668342 5115064 5188410 5126528 5173072 5013227 5161440
14067 5161440 5181248 5025563 4797508 5009937 4973123 4998439 4440592 4712726 4497018 4524310
14057 4524310 4291795 4424663 4453455 4209783 4663082 4030745 4392729 4588917 4121457 4196261
14047 4196261 4163753 4381714 3984647 4317738 3979724 4323091 4012144 3975031 3651019 3764929
14037 3764929 3487500 3789387 3486849 3747093 3804439 3525350 3789892 3462174 3254715 3498696
14027 3498696 3399244 3290717 3518032 3267253 3411349 3248801 3343640 3007422 3131616 3107512
14017 3107512 3489972 3036431 2966355 3050163 3150441 3015543 2932820 2914736 2880651 2565869
$$ packed form
14087F412205k87345p5479P3433k83937p0683J1658K95126n37687r9544M1809
14077E479556k82143J38720K73535N8674n53278P3346o1882M6544j59845J48213
14067E161440J9808j55685k28055K12429l6814K5316n57847K72134k15708K7292
14057D524310k32515J32868K8792k43672M53299o32337L61984J96188m67460P4804
14047D196261l2508K17961l97067L33091l38014L43367l10947l7113l24012J13910
14037C764929k77429L01887l02538K60244N7346k79089K64542l27718k07459K43981
14027C498696r9452j08527K27315k50779J44096j62548R4839l36218J24194k4104
14017C107512L82460m53541p0076Q3808J00278j34898q2723j8084l4085l14782
$$ plain form
14007 2565869 2912781 2570713 2763480 2728107 2703833 2662661 2519250 2649270 2613213 2861227
13997 2861227 2553217 2417839 2391037 2713243 2292920 2310263 2416856 2249015 2413306 2252992
13987 2252992 2378324 2436119 2363177 2489733 2471619 2610765 2739230 2824936 2753136 3389322
13977 3389322 3570908 3876871 4949293 6827932 10546814 16264796 26746079 32616432
13969 32616432 20994278 13250412 9380381 7146741 5769585 4886285 4091116 3760841
13961 3760841 3305754 3259050 2884603 3109175 3164156 2931740 2676761 2482228 2352844 2462145
13951 2462145 2307924 2311009 2264600 2399073 2137461 2133094 2243953 2443468 2232363 2138465
13941 2138465 2144663 1862953 1887438 1972775 2146237 2049884 2034214 1811192 1942772 1941241 2137918
$$ packed form
14007B565869L46912l42068J92767l5373k4274m1172j43411J30020l6057K48014
13997B861227l08010j35378k6802L22206m20323J7343J06593j67841J64291j60314
13987B252992J25332N7795p2942J26556j8114J39146J28465Q5706p1800O36186
13977C389322J81586L05963J072422J878639L718882N717982J0481283N870353
13969C2616432j1622154p743866l870031k233640j377156q83300p95169l30275
13961C760841m55087m6704l74447K24572N4981k32416k54979j94533j29384J09301
13951B462145j54221L085m6409J34473k61612m367J10859J99515k11105r3898
13941B138465O198k81710K4485Q5337J73462r6353j5670k23022J31580j531J96677
$$ plain form
13930 2137918 1863792 1571338 1922957 1770918 1535108 1675117 1574330 1562952 1868119 1815837
13920 1815837 1933641 1895188 1526742 1675500 1820544 1779443 1636528 1477850 1833482 1791803
13910 1791803 1731758 1660445 1816010 1644789 1530205 1413533 1605462 1643468 1303374 1681943
13900 1681943 1552117 1327872 1542837 1304810 1393787 1593575 1550350 1136089 1198634 1255905
13890 1255905 1096648 1273990 1023605 1348725 1537632 1486993 1545813 1323657 1191008 1210938
13880 1210938 1233793 1324703 1253947 1146582 1168909 1187047 1039381 1171566 992490 1151637
13870 1151637 1067633 1207455 1244410 1117067 906226 1163673 1489433 1153143 1273477 1134678
13860 1134678 949406 1241617 1046749 1206538 1333756 952676 1187733 1100009 1197367 1444590
$$ packed form
13930B137918k74126k92454L51619j52039k35810J40009j00787j1378L05167n2282
13920A815837J17804l8453l68446J48758J45044m1101j42915j58678L55632m1679
13910A791803o0045p1313J55565j71221j14584j16672J91929L8006l40094L78569
13900A681943j29826k24245K14965k38027Q8977J99788m3225m14261O2545N7271
13890A255905j59257J77342k50385L25120J88907n0639N8820k22156j32649J9930
13880A210938K2855R0910p0756j07365K2327J8138j47666J32185j79076J59147
13870A151637q4004J39822L6955j27343k10841K57447L25760l36290J20334j38799
13860A134678j85272K92211j94868J59789J27218l81080K35057q7724R7358K47223
$$ plain form
13850 1444590 1079546 1471591 804898 1184746 1066439 1102097 1321294 1269996 1169180 1058517
13840 1058517 1021436 960481 1057943 871002 1059280 1269626 704410 1017520 1352062 665617
13829 937001 1084038 1047902 1052663 1058774 874125 1028042 1203016 797139 1141954 1037636
13819 1037636 932767 756364 1024389 913202 859900 908823 1000348 1019743 821187 1104494
13809 1104494 732008 785819 635522 930813 1029159 757369 901283 913095 734297 1343321
13799 1343321 997871 1114509 493731 699339 987945 863221 524665 794824 901023
13790 901023 805655 625723 946609 872963 798749 759745 1054281 844975 627324 980320
13780 980320 574413 698467 722351 930948 993711 1002944 748813 1002291 600277 637415
$$ packed form
13850A444590l65044L92045o66693L79848j18307L5658K19197n1298j00816j10663
13840A058517l7081o0955R7462j86941J88278K10346n65216L13110L34542F65617
13829I37001J47037l6136M761O111j84649J53917J74974m05877L44815j04318
13819A037636j04869j76403K68025j11187n3302M8923R1525J9395j98556K83307
13809A104494l72486N3811j50297K95291R8346k71790J43914J1812j78798O09024
13799A343321l45450J16638D93731K05608K88606j24724l38556K70159J06199
13790I01023r5368j79932L20886p3646p4214l9004K94536k09306k17651L52996
13780I80320m05907J24054K3884K08597O2763R233k54131K53478m02014L7138
$$ plain form
13770 637415 681192 705779 813448 629751 719280 918155 1022635 946499 786017 482534
13760 482534 751042 653496 815232 701342 896034 735571 603930 364595 618619 752604
13750 752604 585299 924235 588556 868677 601933 689286 409496 690212 707608 619878
13740 619878 781343 1028875 785951 988097 818034 512052 374133 596423 555250 586184
13730 586184 884671 643109 700543 675571 462067 805874 773146 705081 755646 734738 718617
13719 718617 430583 580839 339624 656177 395356 832342 913814 832342 679957 557024
13709 557024 438877 913185 365631 850256 544934 759615 429715 628134 906975 394659
13698 757008 656782 321321 548122 420441 119218 298684 739714 628251 592510 474066
$$ packed form
13770F37415M3777K4587J07669j83697Q9529J98875J04480p6136j60482l03483
13760D82534K68508r7546J61736j13890J94692j60463j31641k39335K54024J33985
13750G52604j67305L38936l35679K80121k66744Q7353k79790K80716J7396q7730
13740F19878J61465K47532k42924K02146j70063l05982j37919K22290m1173L0934
13730E86184K98487k41562N7434k4972k13504L43807l2728o8065N0565k0908j6121
13719G18617k88034J50256k41215L16553k60821M36986Q1472q1472j52385j22933
13709E57024j18147M74308C65631M84625l05322K14681l29900J98419K78841C94659
13698G57008j00226C21321K26801j27681A19218J79466M41030j11463l5741j18444
$$ plain form
13688 474066 450853 515642 474450 711522 595260 390827 396865 500343 314866 385897 585708
13677 585708 856326 600563 481356 607558 189195 385864 498298 305489 626313 451728
13667 451728 411571 441565 912684 516449 382186 795142 478288 477757 619607 777388
13657 777388 262411 832595 640412 608667 509928 207679 248906 553623 565516 459135
13647 459135 454934 243627 570154 492423 286637 640772 419205 291786 198590 493645
13637 493645 496636 271772 153458 415675 247757 99679 539350 499979 525968 290316
13627 290316 567811 375520 612120 650916 585098 540603 -11393 290464 446896 370150
13617 370150 294251 534319 427848 782230 653632 284647 418780 592188 98701 392031
$$ packed form
13688D74066k3213O4789m1192K37072j16262k04433O038J03478j85477P1031J99811
13677E85708K70618k55763j19207J26202A89195J96669J12434j92809L20824j74585
13667D51728m0157K9994M71119l96235j34263M12956l16854n31J41850J57781
13657G77388B62411N70184j92183l1745r8739B07679M1227L04717J1893j06381
13647D59135m201k11307L26527p7731k05786L54135k21567j27419r3196K95055
13637D93645K991k24864j18314K62217j67918I9679M39671l9371K5989k35652
13627B90316K77495j92291K36600L8796o5818m4495a1393B90464J56432p6746
13617C70150p5899K40068j06471L54382j28598B84647J34133J73408I8701K93330
$$ plain form
13607 392031 573869 441148 339360 602118 474002 564156 363265 537062 361884 264769
13597 264769 727590 214510 531429 270771 546567 852660 377591 214212 367114 494574
13587 494574 595327 342833 779676 277046 343834 438306 474401 357177 380162 460673
13577 460673 243479 90209 310401 203006 455110 110944 58418 579541 368190 226340
13567 226340 185149 467748 391581 159318 525943 394514 635021 153556 354177 339434
13557 339434 185866 281527 57709 494633 274509 819792 369135 426414 496472 565568
13547 565568 54918 310295 329578 310666 361444 220418 57011 196913 166743 279035 308844
13536 308844 580399 464732 326405 467357 192096 531746 278194 508144 228749 365363
$$ packed form
13607C92031J81838j32721j01788K62758j28116R0154k00891J73797j75178r7115
13597B64769M62821B14510L16919k60658K75796L06093C77591j63379J52902J27460
13587D94574J00753k52494M36843B77046O6788R4472L6095j17224K2985Q0511
13577D60673k17194I0209K20192j07395K52104A10944n2526N21123k11351j41850
13567B26340m1191K82599p6167A59318L66625j31429K40507A53556K00621j4743
13557C39434j53568R5661E7709M36924k20124N45283C69135N7279P0058O9096
13547E65568E4918K55377J9283j8912N0778j41026E7011J39902l0170J12292K9809
13536C08844K71555j15667j38327J40952A92096L39650k53552K29950B28749J36614
$$ plain form
13526 365363 359384 429982 148867 65416 109809 217112 448973 170067 54301 -23693 110912
13514 145417 252740 368556 73800 449626 348836 360117 322641 466544 299083 387303
13504 387303 115073 439535 27126 -19702 -105971 369502 443409 339043 249583 -84935 441571
13492 310760 204422 441344 399012 245683 430048 346476 260846 402213 587565 236120
13481 89183 207718 639301 178706 448770 239915 248965 70661 223654 -57274 300886
13470 495308 326211 272540 74358 441905 410664 378884 200803 236576 164325 84756 361223
13459 361223 176138 166265 286903 -9731 193404 -5602 294329 488810 306788 143022 444775
13448 444775 133430 148217 16521 507586 202579 141823 415079 289534 111980 105771
$$ packed form
13526C65363n979P0598A48867F5416M4393J07303K31861A70067E4301b3693A10912
13514A45417J07323J15816G3800L75826j00790J1281l7476J43903j67461Q8220
13504C87303A15073L24462B7126a9702q6269C69502P3907j04366q9460h4935D41571
13492C10760j06338K36922m2332j53329J84365q3572q5630J41367J85352B36120
13481H9183J18535M31583A78706K70064k08855R050G0661J52993e7274C00886
13470D95308j69097n3671G4358L67547l1241l1780j78081L5773p2251p9569K76467
13459C61223A76138r873J20638i731A93404e602B94329J94481j82022A43022L01753
13448D44775A33430J4787A6521M91065B02579o0756K73256j25545A11980o209
$$ plain form
13438 105771 34560 197003 238523 38836 206699 434006 6336 114021 430619 112870
13427 -134149 31406 219327 19039 -66971 -23220 151602 179978 490289 122113 36860 392311
13416 392311 191289 102494 448746 61328 219149 306159 63818 2506 322018 308041 293199
13405 293199 98382 364118 270362 107604 502190 205126 260357 197988 -17033 287667
13394 189036 234319 -194287 348793 -10329 39789 544857 325328 422196 512021 11972 132893
13383 132893 -336971 -155705 145393 66376 99981 167887 -5906 301058 -17005 434900 292365
13372 292365 285675 264413 339746 655292 599369 -86238 -8621 -86593 104894 209037 -10743
13360 169455 367928 286035 135735 522374 314739 65485 566357 16181 216508 48878
$$ packed form
13438A05771C4560J62443M1520C8836J67863K27307F336J07685L16598A12870
13427a34149C1406J87921A9039f6971b3220A51602K8376L10311A22113C6860L55451
13416C92311A91289q8795L46252F1328J57821Q7010F3818B506L19512j3977j4842
13405B93199I8382K65736r3756A07604L94586B05126N5231o2369a7033B87667
13394A89036M5283a94287C48793a0329C9789N05068k19529R6868Q9825A1972J20921
13383A32893c36971a55705A45393F6376L3605O7906e906C01058a7005D34900j42535
13372B92365o690k1262P5333L15546n5923h6238h621p7972A04894J04143a0743
13360A69455J98473q1893A35735L86639k07635F5485N00872A6181K00327D8878
$$ plain form
13349 307428 56848 242275 348609 268632 267957 290642 81539 192801 134233 372096 479819
13338 479819 15194 55593 353022 318702 -111980 132054 430181 395180 -54677 225398
13327 173252 220721 35766 430558 431339 157072 179989 10601 264039 354104 174222 298324
13316 298324 368698 216591 -48799 351246 335640 75905 466389 196506 107340 392361
13306 392361 231418 353865 235409 378575 254049 119789 394824 232978 956 309850
13296 309850 158865 158560 344188 414460 1191 179014 129189 444603 -128710 225025 304035
13285 304035 216604 179868 167069 129685 144146 382493 309825 140131 438598 124182 78499
13274 78499 360460 42200 288363 252694 216352 -43710 69519 -103511 32062 23334 -792 -13328
$$ packed form
13349C07428E6848J85427J06334p9977o75K2685H1539J11262n8568K37863J07723
13338D79819A5194M0399K97429l4320a11980A32054K98127l5001e4677B25398
13327A73252M7469C5766L94792P81A57072K2917A0601K53438R0065A74222J24102
13316B98324P0374j52107d8799C51246j5606G5905L90484A96506q9166K85021
13306C92361j60943J22447j18456J43166j24526A19789K75035j61846I56L08894
13296C09850j50985l05J85628P0272A191J77823m9825L15414a28710B25025P9010
13285C04035q7431l6736j2799l7384J4461K38347p2668A40131K98467A24182m5683
13274G8499K81961D2200K46163l5669l6342d3710F9519a03511C2062q728g92j2536
$$ plain form
13262 -13328 214060 -72110 -140664 268292 371099 317098 203543 -66958 207097 51252 316670
13251 316670 34181 20395 122581 285157 248796 85118 224655 159416 -20755 147611 491571
13240 491571 398168 -10111 280172 108654 -23825 294029 298987 464704 105667 -335630
13229 183042 157248 31911 98059 48013 -127028 206969 -14361 243339 -149937 159614
13218 348042 240266 128021 370510 128242 -104219 248564 203188 178319 292318 300838
13208 300838 153757 357802 114907 229526 -67870 279579 107613 103854 227869 -18387
13197 -176626 278815 -167327 33750 -10872 134824 -425978 -207245 177951 208082 -153615
13186 -336808 -53921 154023 9639 -82423 -19060 162789 -80543 -306802 232599 -82822 182764
$$ packed form
13262a3328B14060g2110o8554B68292J02807n4001j13555f6958B07097E1252K65418
13251C16670C4181j3786J02186J62576l6361H5118J39537o5239b0755A47611L43960
13240D91571r3403a0111B80172A08654b3825B94029M958J65717A05667c35630
13229A83042k5794C1911O6148D8013a27028B06969a4361B43339a49937A59614
13218C48042j07776j12245K42489A28242a04219B48564m5376k4869J13999Q520
13208C00838j47081K04045A14907J14619f7870B79579A07613l759J24015a8387
13197a76626B78815a67327C3750a0872A34824d25978b07245A77951L0131a53615
13186c36808e3921A54023I639h2423a9060A62789h0543k26259B32599h2822A82764
$$ plain form
13174 -72778 9586 111148 -114152 403389 319759 434076 -190026 40300 378863 426650 -3581
13162 -11839 -71444 131479 6702 -240447 70109 -62760 -112498 218783 108950 -115868 132820
13150 68298 -52352 203223 271890 -153121 127476 -3801 54968 364360 487181 -56088 -181350
13139 -181350 207404 -86489 181889 112627 -156235 -20832 -292788 234968 152203 255578
13129 255578 99643 89372 -225126 -21388 -16625 308723 350075 -13616 271586 165429 109602
13118 109602 67909 44138 -98643 -198100 -95689 1082 114128 -140025 334566 -62612 302574
13106 -329 -44964 -127660 286001 -93207 119514 -47420 -118685 -63110 278480 105209 331545
13095 331545 -144438 -132346 169510 214785 328211 222943 448828 135238 -7451 377074
$$ packed form
13174g2778I586J01562a14152D03389q3630J14317a90026D0300L38563M7787c581
13162a1839n9605A31479F702b40447G0109f2760m9738B18783A08950a15868A32820
13150F8298e2352B03223O8667a53121A27476c801E4968L09392J22821e6088j25262
13139a81350B07404h6489A81889o9262a56235b0832k71956B34968q2765J03375
13129B55578I9643j0271b25126b1388M763C08723M1352a3616B71586j06157n5827
13118A09602m1693k3771i8643r9457i5689A082J13046a40025C34566f2612C02574
13106c29m4635q2696B86001i3207A19514d7420p1265N5575B78480A05209K26336
13095C31545a44438J2092A69510M5275J13426j05268K25885A35238g451C77074
$$ plain form
13084 251785 55988 38375 -184287 -209492 -142308 118774 301000 123482 -18207 29797 124742
13073 124742 133369 239710 -15973 129696 -242120 -203044 114513 31248 2375 197576 88976
13061 -10781 18467 227832 -187874 249285 -209031 -210059 -194731 230633 -31395 108099 10386
13049 157938 21850 36219 -1827 185489 68759 128959 104006 274057 295486 -69658 141540
13037 170344 -14777 353128 61646 141156 62620 -81287 318041 141456 52705 105096 -212636
13025 -286042 110457 -33760 -393233 13619 123332 -153961 149237 259492 -82378 164081
13014 231537 351651 343008 114158 263622 355766 266428 210459 118561 212835 161846 107092
13003 107092 143641 -19468 -27995 -34849 132973 16990 70383 44780 261846 283252 169283
$$ packed form
13084B51785E5988j7613a84287k5205O7184A18774J82226A23482a8207B9797R4945
13073A24742Q627J06341a5973A29696b42120L9076A14513C1248B375J95201H8976
13061a0781A8467K09365a87874B49285b09031j028J5328B30633c1395A08099A0386
13049A57938B1850J4369a827A85489F8759O0200k4953J70051K1429f9658A41540
13037A70344a4777C53128F1646P9510F2620h1287C18041A41456E2705N2391b12636
13025b86042A10457c3760l59473A3619J09713a53961A49237J10255h2378A64081
13014B31537J20114q643A14158J49464R2144q9338n5969r1898R4274n0989n4754
13003A07092L6549a9468q527o854A32973A6990N3393k5603K17066K1406j13969
$$ plain form
12992 169283 39676 207537 -30503 355 219941 186960 121021 -95986 37324 -3452 -32384 346267
12979 153852 212946 -41465 194920 -34147 269097 175274 401265 30247 41417 82153 -322723
12967 90651 87281 2025 152381 -385881 155448 -210737 -184969 -150058 41182 -246557 -1876
12955 191326 128581 -229090 184858 -173226 155008 415794 -174680 -82179 64098 139151
12945 139151 -55131 37096 165365 209548 -217155 15237 98093 -117773 112422 277729
12935 277729 204011 428189 53135 -112507 234081 210823 99390 -258565 16617 1445 -216005
12923 41104 -20659 -72366 169972 18977 -33278 349623 148870 -117912 -235440 119029
12912 -260589 -443727 275029 46341 193723 -74325 -298186 280154 -345603 139308 67065
$$ packed form
12992A69283C9676J67861c0503C55K19586l2981o5939i5986C7324c452k8932C46267
12979A53852N9094d1465A94920c4147B69097r3823K25991C0247J1170M0736c22723
12967I0651l370B025J50356c85881A55448b10737K5768L4911D1182b46557a876
12955A91326o2745b29090A84858a73226A55008K60786a74680h2179F4098P5053
12945A39151e5131C7096J28269M4183b17155A5237Q2856a17773A12422J65307
12935B77729p3718K24178E3135a12507B34081k3258I9390b58565A6617A445b16005
12923D1104b0659n1707A69972A8977c3278C49623A48870a17912j17528A19029
12912b60589j83138B75029D6341J47382g4325k23861B80154c45603A39308F7065
$$ plain form
12901 49561 191259 5958 131595 -170889 56107 68421 -1803 53663 -244720 -139956 58726
12889 -152634 142499 34047 117078 -320711 112445 312414 70120 67552 8120 65875 -120284
12877 -173511 314709 128437 -80747 182937 48762 9255 -27398 144162 202997 -142283 -16446
12865 -44086 35068 459902 375315 387270 233598 -171173 175170 151644 63033 -273577 112853
12853 -60871 287825 -97102 192792 35080 -123544 213132 152289 -46054 -50571 -99188 123120
12841 53044 -199704 -21247 -169970 -3219 -177476 -76858 -39028 73088 77539 52698 245137
12830 245137 -163422 320699 90980 307615 155884 8343 118583 -141448 113638 9137
12819 189034 26623 165929 -110165 9213 98535 256329 -28761 58024 -206299 -48394 380999
$$ packed form
12901D9561J41698E958J25637a70889E6107J2314a803E3663b44720J04764E8726
12889a52634A42499C4047Q3031c20711A12445J99969G0120k568H120N7755a20284
12877a73511C14709A28437h0747A82937D8762I255b7398A44162N8835a42283a6446
12865d4086C5068M24834q4587J1955j53672a71173A75170k3526F3033b73577A12853
12853f0871B87825i7102A92792C5080a23544B13132o0843d6054m517m8617A23120
12841E3044a99704b1247j48723c219j74257g6858L7830G3088M451k4841J92439
12830B45137a63422C20699I0980K16635j51731H343J10240a41448A13638I137
12819A89034B6623J39306a10165I213Q9322J57794b8761E8024b06299d8394C80999
$$ plain form
12807 69008 -6195 -81483 5180 -296444 -375414 25072 108744 -105152 -94790 35167 -115127
12795 -195545 -74765 232760 152836 164034 303738 36887 -161467 72478 -122213 -119204 -87139
12784 -87139 -148802 140628 -46939 -297978 -218687 -191057 294787 -99342 -50821 112283 -121428
12772 181524 -71259 145244 140280 -74130 103607 99039 17242 328130 -91436 -81638 36054
12760 106449 -22532 -158389 119414 -273129 64457 31232 -250115 46356 280682 -31824
12749 95832 -247711 -18792 110339 177810 -16238 205882 94265 -72023 206706 75310 145919
12738 145919 212058 -83974 80684 -20929 241601 -20874 56626 -49472 -198684 -87350 -190647
12727 -190647 -181739 -113337 -132935 222665 174374 219007 85508 -124179 107818 312417 -35979
$$ packed form
12807F9008f195p5288E180b96444p8970B5072Q3672a05152J0362C5167a15127
12795a95545g4765B32760p9924J1198J39704C6887a61467G2478a22213L009L2065
12784h7139o1663A40628d6939k51039P9291K7630B94787i9342M8521A12283a21428
12772A81524g1259A45244m964g4130A03607m568A7242L10888i1436R798C6054
12760A06449b2532j35857A19414b73129F4457C1232b50115D6356K34326c1824
12749I5832b47711a8792A10339O7471a6238B05882I4265g2023B06706G5310P0609
12738A45919O6139h3974H0684b0929B41601b0874E6626d9472j49212h7350j03297
12727a90647Q908O8402j9598B22665m8291M4633H5508a24179A07818K04599c5979
$$ plain form
12715 198747 260806 142105 369688 -276398 -76456 136067 -4827 199249 421622 -22406
12704 -200115 -140827 76408 113872 -114141 136782 -220141 -144691 -47150 231673 141979 328524
12693 328524 380313 355983 271465 -55463 48705 312618 21900 -254160 302543 136086 -4773
12681 66014 61772 27856 18580 203263 -85011 -109994 -147429 -59460 -41683 263359 58489 169906
12669 169906 330909 -153298 31491 277235 176364 -72936 411617 -30345 92704 250108
12659 250108 232622 -113714 19760 9892 539649 63751 -294068 5573 94884 240492 250962
12648 250962 171584 26960 258040 26538 -42317 247114 226748 413040 6214 167964 7656
12636 316268 188936 227594 130488 -113743 27803 441090 -5654 128816 -156524 -422843
$$ packed form
12715A98747O2059j18701K27583b76398g6456A36067d827A99249K22373b2406
12704b00115N9288G6408L7464a14141A36782b20141P5450d7150B31673q9694J86545
12693C28524N1789k4330q4518e5463D8705K63913B1900b54160C02543A36086d773
12681F6014m242B7856r276J84683h5011k4983l7435e9460J7777B63359E8489J11417
12669A69906J61003a53298C1491K45744j00871g2936D11617c0345I2704J57404
12659B50108j7486a13714A9760r868N29757F3751b94068E573Q9311J45608J0470
12648B50962p9378B6960K31080B6538d2317B47114k0366J86292F214J61750G656
12636C16268j27332L8658r7106a13743B7803M13287e654A28816a56524k66319
$$ plain form
12626 -422843 223877 -14471 -158717 96574 -98806 -242934 173475 174370 -80938 -168367 -194566
12615 -194566 528306 249031 -97318 272205 211770 92546 257113 265895 5959 -1767 161478
12603 18575 282569 -239359 -87795 104247 56212 -18000 -147219 151289 300189 -160145
12592 20344 96627 -169318 89018 -185454 -84254 118048 127723 95963 -189459 -1683 87312
12580 176215 -154047 -189063 40535 -200701 507701 181886 119269 8093 18831 -145762 263211
12568 97911 -176394 90475 239190 15528 -160552 179765 -118812 -47698 246682 36824
12557 83296 -270941 -250218 -176568 -117774 -58201 325786 -29237 -286313 107219 323591 289109
12546 289109 180209 -186720 -7687 31225 235700 -142650 106249 -330131 -355211 133489
$$ packed form
12626d22843B23877a4471j44246I6574i8806j44128A73475Q95h0938q7429k6199
12615a94566E28306B49031i7318B72205o0435I2546J64567Q782E959a767A61478
12603A8575K63994b39359h7795A04247m8035a8000j29219A51289J48900a60145
12592B0344P6283a69318H9018a85454h4254A18048R675l1760a89459a683H7312
12580A76215a54047l5016D0535b00701E07701A81886o2617H093J0738a45762B63211
12568I7911a76394I0475J48715A5528a60552A79765a18812d7698B46682C6824
12557H3296b70941K0723P3650N8794e8201C25786b9237k57076A07219K16372l4482
12546B89109j08900a86720g687C1225K04475a42650A06249c30131k5080A33489
$$ plain form
12535 443060 12939 -9728 6208 -42626 -78029 129722 -43101 -82148 125637 -17729 234847
12523 -63017 187587 -72769 -123370 -90471 291520 269449 394310 66641 37698 -121842 241925
12511 165764 300126 26830 359864 86387 -124783 -81379 132930 139392 245728 -205385
12500 -275057 55667 9823 90101 231588 145708 231583 487825 199850 -184450 66543 30147
12488 179077 227652 -13507 -204837 99128 403159 47086 -18440 380623 -128834 134840
12477 185469 -179477 -58319 -115588 132544 -191196 155897 204141 -93961 -11769 -14753 10827
12465 -50883 2558 245542 87386 74530 113204 33119 -20086 84395 -105439 -189691 -65288
12453 -101617 -61930 64950 -331288 86117 -23008 -289996 41056 102595 -33864 -29505 166325
$$ packed form
12535D43060A2939i728F208d2626l5403A29722d3101l9047A25637a7729B34847
12523f3017A87587g2769n0601L2899B91520k2071J24861F6641k8943a21842B41925
12511A65764J34362B6830L33034H6387a24783M3404A32930O462J06336b05385
12500b75057E5667I823Q0278J41487q5880Q5875K56242A99850a84450F6543C0147
12488A79077M8575a3507j91330I9128L04031D7086a8440C80623a28834A34840
12477A85469a79477e8319n7269A32544a91196A55897M8244i3961a1769k984A0827
12465e0883B558K42984H7386j2856L8674C3119b0086H4395a05439q4252f5288
12453a01617L9687F4950c31288H6117b3008k66988D1056O1539c3864M359A66325
$$ plain form
12441 76259 -44408 148138 -126438 211974 -297948 187864 -111559 -201621 -130960 -19803
12430 -171582 -99381 156944 90035 -55248 -20717 -54103 -62329 112200 12604 60003 162452
12419 162452 -108216 -173371 280719 100611 -110388 -47812 -240599 -45235 65637 -80312
12408 41314 26599 123472 5618 242916 -49555 -116933 22516 263785 236291 -271167 28216
12396 235647 105084 -120951 -21279 -160027 163864 21288 -10889 7357 181560 -242195
12385 17174 141467 -63792 29710 5444 363826 65146 -24127 519737 -53835 14857 -108712
12373 -267666 -167099 -249195 -13042 33660 24488 125174 251411 31662 65961 344647 5032
12361 -31142 -54267 48175 12223 250121 155767 -237506 125960 -36545 127045 91581 -101174
$$ packed form
12441G6259d4408A48138a26438B11974b97948A87864a11559r0062P0661a9803
12430a71582P2201A56944o6909e5248b0717l3386q226A12200A2604M7399J02449
12419A62452a08216o5155B80719A00611a10388d7812j92787d5235F5637h0312
12408D1314j4715R6873E618K37298d9555o7378B2516K41269k7494b71167B8216
12396B35647A05084a20951b1279j38748A63864B1288a0889G357J74203b42195
12385A7174J24293f3792B9710E444L58382F5146b4127E19737e3835A4857a08712
12373b67666J00567q2096a3042C3660r172J00686J26237C1662L4299K78686E032
12361c1142k3125D8175A2223K37898r4354b37506A25960c6545A27045l5464a01174
$$ plain form
12349 135243 -342737 70976 150623 -78465 -82471 -287203 -120634 -40391 259696 335613 322767
12338 322767 -48552 -15153 115503 -122482 323946 -28144 171633 -129144 -64341 83226
12327 132872 363426 -407609 1569 -368362 61374 171087 26917 35376 -38954 51698 -127780
12315 233957 -150610 -326328 -200914 -366718 29332 -120031 118073 352454 307289 200859
12305 200859 179804 47011 49843 358529 -10167 -1121 126872 130763 -58557 -152488 153040
12293 -50133 26206 141681 -85539 -307293 -147841 11722 -47908 285516 -318621 6310 135637
12282 135637 138315 304842 -122904 113272 98855 42662 123913 -233534 -105483 335502
12271 144483 8996 188361 -107803 204904 376492 -244255 265180 124210 83148 29706
$$ packed form
12349A35243c42737G0976P9647g8465m006k04732a20634d0391B59696P5917j2846
12338C22767d8552a5153A15503a22482C23946b8144A71633a29144f4341H3226
12327A32872K30554d07609A569c68362F1374J09713B6917Q459c8954E1698a27780
12315B33957a50610j75718J25414j65804B9332a20031A18073K34381m5165j06430
12305B00859k1055D7011K832L08686a0167a121A26872L891e8557r3931A53040
12293e0133B6206J15475h5539k21754a47841A1722d7908B85516c18621F310J29327
12282A35637K678J66527a22904A13272j4417D2662Q1251b33534a05483C35502
12271A44483H996J79365a07803B04904J71588b44255B65180A24210m1062B9706
$$ plain form
12260 -13043 260819 231842 -190923 655664 -195772 -256749 110598 82524 -68467 295876
12249 63970 98092 96081 273899 64606 -334522 -164048 185786 -290760 -6198 97850 153295
12238 153295 310818 254967 -79263 171704 -14614 147100 -68334 470402 214133 100280
12227 43447 504446 -133462 -26726 44523 250464 -68214 54701 -87684 101031 39299 186352
12216 186352 214797 126551 -87822 143785 253175 135713 132129 158038 69047 394566 -10874
12204 494264 280093 49907 31539 102006 262620 -19390 -136018 355779 103304 1711 -172827
12192 213225 239921 -170814 -209851 -30296 55775 45345 43096 86953 178932 513726 8956
12180 228705 276372 180828 -237850 66551 253630 133044 2678 -11207 45800 186716 322694
$$ packed form
12260a3043B60819k8977a90923F55664a95772o0977A10598k8074f8467B95876
12249F3970L4122k011J77818F4606c34522a64048A85786b90760f198I7850N5445
12238A53295J57523n5851g9263A71704a4614A47100f8334D70402B14133A00280
12227D3447M60999a33462b6726D4523K05941f8214E4701h7684A01031C9299J47053
12216A86352K8445q8246h7822A43785J09390j17462l584K5909F9047L25519a0874
12204D94264k14171D9907j8368P0467J60614a9390j16628C55779A03304A711a72827
12192B13225K6696a70814l9037c0296E5775j0430k249M3857R1979L34794H956
12180B28705M7667r5544b37850F6551J87079j20586B678a1207D5800J40916J35978
$$ plain form
12169 322694 210155 231385 199950 389881 -172799 -109263 153097 165683 291341 242750
12159 242750 200248 77077 -3848 187139 214863 257213 328645 -16275 251149 179622 82330
12147 122931 21329 445314 1447 -155837 266380 -32407 457215 -25234 -158757 216324
12136 291762 -231929 135988 365942 -139350 -16430 269018 -350733 232376 346139 -294049
12125 982 132887 183928 53877 154004 9524 178214 -296826 -19141 -94970 -60551 -54153 192443
12112 342895 55540 -449495 -94921 -248616 -150995 -156290 -184476 267489 375445 -64696 -50572
12101 -50572 -184514 159715 -489244 44671 -369951 203449 -23677 -124265 -145297 162673
12090 138610 153240 272734 15363 -55529 317255 -114206 -170197 15230 171616 127264 -107997
$$ packed form
12169C22694j12539K1230l1435J89931a72799O3536A53097J2586J25658m8591
12159B42750m2502G7077c848A87139K7724M2350P1432a6275B51149p1527H2330
12147A22931B1329M23985A447a55837B66380c2407D57215b5234j33523B16324
12136B91762b31929A35988K29954a39350a6430B69018c50733B32376J13763b94049
12125I82J31905N1041E3877J00127I524J68690b96826a9141p5829L4419O398A92443
12112C42895E5540d49495i4921j53695R7621n295k8186B67489J07956f4696J4124
12101e0572j33942A59715d89244D4671c69951B03449b3677j00588k1032A62673
12090A38610J4630J19494A5363e5529C17255a14206n5991A5230J56386m4352a07997
$$ plain form
12078 -99423 32701 -65010 91029 -3571 -239420 -129742 57846 77841 12543 18501 168183
12067 168183 168815 428258 599739 1213664 1117582 556429 157861 301435 35332 490843
12057 490843 -47352 299806 108105 133299 16916 -235926 -40684 28189 -168268 -170359 414400
12045 61644 -143313 -166126 -304323 -232716 36264 184843 -157424 -186681 -168171 -88587 -52895
12034 -52895 -35089 -137791 -415280 -115963 -163646 322040 168893 368910 -22577 367041
12023 10415 -109138 -18349 72794 -69214 -36121 445766 282381 46708 -64039 -213158 65496
12011 92885 -65939 -73028 -166706 378521 340567 84783 -254739 -24548 376324 -42769 -72609
12000 -72609 -16986 20835 317273 52915 -88127 185759 -343241 -138462 -293982 -229638 -52545
$$ packed form
12078i9423C2701f5010I1029c571k35849J09678E7846J9995A2543N958J49682
12067A68183O32K59443J71481O13925r6082E56429A57861J43574C5332M55511
12057D90843d7352B99806A08105K5194A6916b35926d0684B8189a68268k091D14400
12045F1644a43313k2813j38197P1607C6264J48579a57424k9257J8510P9584L5692
12034e2895J7806j02702k77489a15963m7683C22040j53147K00017b2577C67041
12023A0415a09138a8349G2794f9214L3093D45766j63385D6708f4039j49119F5496
12011I2885f5939p089r3678C78521l7954H4783b54739b4548C76324d2769k9840
12000g2609a6986B0835K96438E2915h8127A85759c43241a38462j55520O4344e2545
$$ plain form
11988 212513 45233 67500 -124269 -102716 14168 273749 90394 242555 -17113 -190621 267219
11976 31457 -117599 147999 -221143 64028 -95851 -258375 -29190 -609950 93755 -97646 208626
11964 -161987 92383 4783 -282459 96620 -5474 -200565 246032 -228970 -99742 -153397 -157502
11953 -157502 24481 -112104 9917 -166484 465646 -108940 -165463 -53330 -378826 -178224
11942 99195 -83286 53378 -109361 36145 13485 -89683 144043 -153091 82545 -57417 -349236
11931 -349236 415877 -299951 29819 34457 -191580 -11253 66744 -488820 48327 156821 -27729
11919 -49455 -108441 231341 -369544 -155861 3295 186805 -82227 194541 -95911 -205332 176608
11907 -46247 -60072 -64855 227137 -47965 72619 19234 -209927 -251101 -164181 154286 288687
$$ packed form
11988B12513D5233K2267a24269K1553A4168K59581I0394J52161a7113j73508B67219
11976C1457a17599A47999b21143F4028i5851j62524b9190n80760I3755i7646B08626
11964a61987I2383D783b82459I6620e474j95091B46032b28970i9742n3655m105
11953a57502B4481a12104I917a66484D65646a08940n6523e3330l25496a78224
11942I9195h3286E3378a09361C6145A3485h9683A44043a53091H2545e7417k91819
11931c49236D15877b99951B9819M638a91580a1253F6744d88820D8327J08494b7729
11919d9455n8986B31341c69544a55861C295J83510h2227A94541i5911j09421A76608
11907d6247j3825m783B27137d7965G2619A9234b09927m1174Q6920A54286J34401
$$ plain form
11896 288687 132276 162691 -6995 -258407 -52994 177588 176238 58310 -245719 -100726 211904
11884 265792 33944 51071 436949 204894 42382 13119 -174560 -203824 -66138 57211 -27920
11872 -76999 -18636 -27139 -77848 -90611 409193 -312304 -42596 242082 -92982 176986 -30549
11860 -154373 -207453 90973 4474 171179 -126315 -294867 117199 -135889 -14929 -29979 159467
11848 -132665 -25665 -38774 14281 -497685 20848 109308 -258789 -313276 108230 87847 35828
11836 387708 98866 29721 101600 58275 124103 314138 -155879 174060 227044 -206161 14204
11824 -291892 -214636 -131726 160453 -87332 -154176 -175842 289466 -166233 -236885 -41877 -184960
11813 -184960 80061 -216177 -23297 -113097 182242 36574 -40323 90851 -311697 78493 -184387
$$ packed form
11896B88687A32276L0415f995k51412e2994A77588j350E8310b45719a00726B11904
11884B65792C3944J7127L85878B04894D2382A3119a74560k9264f6138E7211b7920
11872g6999a8636q503n0709j2763D09193c12304d2596B42082i2982A76986c0549
11860a54373n3080I0973D474J66705a26315j68552A17199a35889a4929j5050A59467
11848a32665b5665j3109A4281d97685B0848Q8460b58789n4487A08230k0383C5828
11836C87708I8866B9721P1879m3325O5828J90035a55879A74060N2984b06161A4204
11824b91892P7256Q2910A60453h7332o6844k1666B89466a66233p0652d1877j43083
11813a84960H0061b16177b3297q9800A82242C6574d0323I0851c11697G8493a84387
$$ plain form
11801 -24583 11875 -33896 -7005 -50843 20691 -95290 -196288 -46447 -34232 -103118 65036 -272994
11788 -96318 302244 194121 -98986 -218858 16669 -417680 64284 -239974 187631 153259
11778 153259 -425778 74603 -275299 7025 -231961 308266 -332079 -264706 -92872 5237 -84236
11766 198293 -128658 -54710 -340308 21848 229430 -125118 -71672 -268897 203304 -143032
11755 162120 -314318 115611 -16775 5918 239171 22845 158750 2005 -217264 63781 52575
11744 52575 -186810 85971 21977 53196 123935 -422694 54930 773 -198851 129060 -119434
11732 -173400 -103268 -232197 196333 -77280 -121104 -48725 401945 172671 -130110 -330335
11722 -330335 176460 121982 475746 -227972 215368 384915 105552 85853 212413 173171
$$ packed form
11801b4583A1875c3896g005m3838B0691i5290j00998d6447J2215o8886F5036b72994
11788i6318C02244j08123i8986j19872A6669d17680F4284b39974A87631l4372
11778A53259d25778G4603b75299G025b31961C08266c32079O7373i2872E237h4236
11766A98293a28658e4710k85598B1848K07582a25118N3446j97225B03304a43032
11755A62120c14318A15611a6775E918K33253B2845J35905B005b17264F3781j1206
11744E2575a86810H5971B1977L1219P0739d22694E4930G73a98851A29060a19434
11732a73400P0132j28929A96333g7280m3824d8725D01945A72671a30110k00225
11722c30335A76460n4478L53764b27972B15368J69547A05552j9699J26560l9242
$$ plain form
11712 173171 -242659 82313 -52454 112082 -58801 163960 -273735 -149983 136935 -3235
11701 -48648 -109707 -48835 -114016 -171867 119678 315060 103278 394280 9827 281018 147005
11690 147005 98527 -93395 74413 106703 126562 136790 128595 -90519 422405 258871 120257
11678 -199234 -116160 -241231 133046 149383 -6678 -86863 35147 119035 157676 -3972 248157
11666 230826 -119780 61359 298748 306884 264380 -188755 -38670 -253423 239650 -33321 -153855
11655 -153855 108676 68867 109297 -370885 308893 -335016 -41880 296201 230681 -134519
11644 143175 125647 109922 -30067 61204 240461 -44617 -139696 -90071 -292716 -205405 74408
11632 84484 -59780 -243430 42354 302095 231005 -216879 10609 44196 142034 38097 -84056
$$ packed form
11712A73171b42659H2313e2454A12082e8801A63960b73735J23752A36935c235
11701d8648o1059d8835o5181n7851A19678J95382A03278K91002I827K71191j34013
11690A47005m8478i3395G4413L2290J9859J0228q195i0519D22405j63534A20257
11678a99234Q3074j25071A33046J6337f678q0185C5147Q3888L8641c972B48157
11666B30826a19780F1359K37389Q136m2504a88755c8670k14753B39650c3321j20534
11655a53855A08676l9809M0430c70885C08893c35016d1880B96201o5520a34519
11644A43175j7528j5725c0067F1204J79257d4617r5079M9625k02645Q7311G4408
11632H4484e9780j83650D2354K59741p1090b16879A0609L3587R7838C8097h4056
$$ plain form
11620 291273 158026 -191834 17633 -234351 67842 79160 201306 386630 231081 288609
11610 288609 -4169 401695 22903 317754 40973 73378 60504 207412 -26851 -242960 13164
11598 356438 62881 -269799 -98816 -175137 408249 126063 -282973 -82722 172632 161348
11588 161348 85610 241983 -25513 -1210 147043 284744 -11229 -188847 -43091 14117 -288764
11576 -54322 -145431 -5129 -316682 89336 80719 101367 -68099 340541 -53183 -152286 95730 -59863
11563 -14128 158620 93822 136185 264277 244392 26087 -54139 50425 24252 220151 48919
11551 -209812 221624 107979 311473 -117355 -65088 293746 -81867 299595 120299 227752
11541 227752 183095 74079 -187173 152132 127695 -231609 118629 -105759 -130008 1322 -110049
$$ packed form
11620B91273j33247a91834A7633b34351F7842J1318J22146J85324j55549N7528
11610B88609d169D01695B2903K94851D0973L2405j2874J46908b6851k16109A3164
11598C56438F2881b69799i8816p6321D08249A26063b82973h2722A72632j1284
11588A61348p5738J56373b5513a210A47043J37701a1229j77618d3091A4117b88764
11576e4322r1109e129l11553H9336q617K0648f8099C40541e3183r9103I5730e9863
11563a4128A58620o4798M2363J28092j9885B6087e4139E0425B4252J95899D8919
11551b09812B21624A07979K03494a17355N2267B93746h1867B99595A20299J07453
11541B27752m4657G4079a87173A52132k4437b31609A18629a05759k4249A322a10049
$$ plain form
11529 199087 -45672 56978 -56791 32857 -136440 112847 275729 -121044 -253074 202915
11518 83409 -26506 -100423 235266 17484 208607 244189 -676 100933 -201386 -202911 -218728
11507 -218728 130435 -51275 79653 347321 -234845 224175 43086 73278 249781 285532
11497 285532 -10809 16637 212066 181426 -322747 163808 170174 505982 20015 126009 397115
11486 397115 178219 285804 13070 -143539 176224 -31889 -108446 142871 -168760 410147
11475 -79604 61850 -58241 73346 165219 -100817 257089 -254742 8851 -109421 149000 -162059
11463 275102 152835 65919 16094 -114364 141538 102046 252182 182073 70588 -35185 284817
11451 74386 271544 39200 228164 -99806 -103181 -7520 241824 27549 189221 228489 170923
$$ packed form
11529A99087d5672E6978e6791C2857a36440A12847J62882a21044j32030B02915
11518H3409b6506p3917B35266A7484J91123L5582f76A00933b01386j525j5817
11507b18728A30435e1275G9653K67668b34845B24175D3086L0192J76503L5751
11497B85532a0809A6637J95429l0640c22747A63808O366L35808B0015J05994K71106
11486C97115A78219J07585A3070a43539A76224c1889p6557A42871a68760D10147
11475g9604F1850e8241G3346R1873a00817B57089b54742H851a09421A49000a62059
11463B75102j22267F5919A6094a14364A41538l9492J50136p0109G0588c5185B84817
11451G4386J97158C9200J88964i9806l375g520B41824B7549J61672L9268n7566
$$ plain form
11440 170923 -64216 3307 -176963 -54127 216541 61440 -178794 386698 -175818 59397 39691
11429 39691 108215 -99339 162431 -195341 236381 -121719 329939 -77776 -107400 -28994 -410822
11418 -410822 377306 -129391 -248207 -37609 172308 11833 381029 -10765 62651 -634 -171173
11407 -171173 370165 -162355 167187 -86797 -252229 -123263 -108845 -89243 -89588 -131007 65620
11395 -165802 -24403 -32051 -52473 132172 -188464 397036 162445 115880 272638 -190470
11384 192749 164894 -35490 162086 118135 -51501 41648 -142479 96766 -171002 -280486 189114
11372 59308 -193127 -315650 -1149 58697 228131 154260 66215 -216993 28779 56077 255978
11361 255978 -127076 385720 64022 96426 186658 -112747 110816 48964 134254 73620 68880
$$ packed form
11440A70923f4216C307a76963e4127B16541F1440a78794C86698a75818E9397j9706
11429C9691O8524i9339A62431a95341B36381a21719C29939g7776k9624b8994l81828
11418d10822C77306a29391j18816c7609A72308A1833L69196a0765F2651f34j70539
11407a71173C70165a62355A67187h6797j65432a23263J4418J9602l45m1419F5620
11395a65802b4403p648k0422A32172a88464C97036A62445m6565J56758a90470
11384A92749k7855c5490A62086m3951e1501D1648a42479I6766a71002j09484A89114
11372E9308a93127j22523a149E8697J69434p3871F6215b16993B8779K7298J99901
11361B55978a27076C85720F4022L2404R0232a12747A10816D8964Q5290o0634m740
$$ plain form
11350 68880 66323 154689 10385 -223166 -213916 4302 132562 -130483 -388 -96376 384243 -120100
11337 62941 -87968 97542 -76408 -260749 -224474 66923 -91056 281711 104881 46735 15999
11325 236709 -258605 141222 -116948 44442 144175 313353 -91853 130652 39493 -324019
11314 -98597 130100 -360351 -10419 -225622 -165559 -19639 74849 -4168 -137510 -220483 139849
11302 84003 -82853 8080 97331 325877 147082 -140814 -161005 -130664 37296 -266029 122282
11290 -127543 -160272 -120997 182849 -178529 -108225 -151417 -129306 141427 207318 92587 103255
11279 103255 -157908 202525 -9170 -83874 -55009 284930 258246 -226333 -366485 30976 177413
11268 177413 -144363 67917 33519 -261569 -71130 370225 65200 -6511 -143548 408205 -91644
$$ packed form
11350F8880k557Q8366A0385b23166R250D302J28260a30483c88r5988C84243a20100
11337F2941h7968I7542g6408j84341L6275F6923i1056B81711A04881D6735A5999
11325B36709b58605A41222a16948D4442R9733J69178i1853A30652C9493c24019
11314i8597A30100c60351a0419k15203O0063a9639G4849d168j33342q2973A39849
11302H4003h2853H080Q9251K28546A47082a40814k0191L0341C7296b66029A22282
11290a27543l2729L9275A82849a78529P0304m3192K2111A41427O5891I2587J0668
11279A03255a57908B02525i170p4704K8865B84930k6684b26333j40152C0976J46437
11268A77413a44363F7917C3519b61569g1130C70225F5200f511j37037D08205i1644
$$ plain form
11256 439605 163404 -109875 -163400 34694 -102922 -49699 -250808 -95132 -256161 173197
11245 139325 15931 121973 -103805 85450 -211425 107115 -57811 -226203 331108 -71886
11234 480976 -58094 178041 153127 -192098 177498 78377 -173000 10518 25664 171497
11224 171497 13332 70839 -244649 57241 -125072 -358177 81765 227019 46557 -108986
11213 -146668 -43012 -98135 165067 -119 -348550 -31381 -77472 -204134 -382330 -111153 -112894
11202 -112894 -200795 -227262 -273377 -234850 -279850 58506 -79889 -35964 -122346 -221597 62793
11190 -55236 -183814 31097 -190752 -133918 134045 -20250 -185994 93176 11566 -319038 -115297
11178 -77645 15564 -106260 -192291 10345 -40679 -8083 -56817 -51242 -129023 -124748 39900 61064
$$ packed form
11256D39605A63404a09875n3525C4694a02922d9699k01109i5132j61029A73197
11245A39325A5931J06042a03805H5450b11425A07115e7811j68392C31108g1886
11234D80976e8094A78041k4914a92098A77498G8377a73000A0518J5146J45833
11224A71497A3332N7507b44649E7241a25072k33105H1765J45254D6557a08986
11213a46668d3012n5123A65067a19l48431c1381m6091j26662j78196a11153j741
11202a12894q7901k6467m6115L8527m5000E8506g9889c5964q6382r9251F2793
11190e5236j28578C1097a90752N6834A34045b0250j65744I3176A1566c19038a15297
11178g7645A5564a06260q6031A0345d0679h083m8734N575p7781M275C9900K1164
$$ plain form
11166 61064 -12413 -229539 141613 -127770 -208107 -20221 -379680 -182105 38850 210156
11156 210156 102351 418387 -50311 142752 -128199 96411 23357 -415888 -36724 224077
11145 62182 44707 -84449 -293921 -172321 -269823 -118848 -88366 176970 64624 121266 35
11133 217569 154934 -103687 -55934 63962 -161634 -29586 65355 -113527 289471 12595 231990
11122 231990 27479 12711 -11504 154589 98251 -149936 -27047 61242 176752 213147 -44689
11110 476897 219715 255955 -17648 162068 346500 172115 -79355 8541 -55098 -126643 105240
11098 -138642 -447 -1105 332724 179373 129081 -58274 184091 61986 84588 201341 -65429
11086 130279 32493 106866 222398 359321 150691 236821 73743 62088 196903 41486 443806
$$ packed form
11166F1064a2413k17126A41613a27770q0337b0221l59459a82105C8850J71306
11156B10156A02351L16036e0311A42752a28199I6411B3357d15888c6724B24077
11145F2182j7475h4449k09472J21600r7502a18848L0482A76970F4624N6642C5
11133B17569o2635a03687M7753F3962a61634b9586F5355a13527B89471A2595K19395
11122B31990B7479A2711a1504A54589n6338a49936b7047F1242J15510L6395d4689
11110D76897B19715L6240a7648A62068J84432A72115g9355H541e5098p1545A05240
11098a38642d47o58C32724j53351n0292e8274A84091F1986K2602J16753f5429
11086A30279C2493P4373J15532J36923A50691Q6130G3743j1655J34815D1486M02320
$$ plain form
11075 443806 149225 38700 318676 339955 177310 244237 -10831 357506 139689 160806
11065 160806 229096 292061 -165349 148555 230974 41940 139541 163497 824844 272850 98658
11053 328795 56350 197677 442429 350921 313914 312298 372902 629618 358213 593954 722697
11042 722697 152851 526700 582399 617056 340609 463203 839751 298619 531613 592606
11032 592606 963008 693772 846870 645301 777334 350519 653674 511622 502022 675577
11022 675577 518174 746949 453994 858214 682194 496124 721539 347727 709188 549193
11012 549193 579156 574262 945531 593689 814139 436789 741434 553426 396693 675558
11002 675558 418555 564113 625710 780835 816533 717516 679867 610400 486454 956385
$$ packed form
11075D43806A49225C8700K79976K1279j62645O6927a0831C57506A39689K1117
11065A60806O8290O2965a65349A48555Q2419D1940R7601K3956O61347B72850I8658
11053C28795E6350J41327K44752r1508l7007j616O0604K56716k71405K35741J28743
11042G22697A52851L73849N5699L4657k76447J22594L76548B98619K32994O0993
11032E92606L70402k69236J53098k01569J32033C50519L03155j42052r600J73555
11022F75577j57403K28775k92955M04220j76020j86070K25415C47727L61461j59995
11012E49193K9963m894L71269l51842K20450l77350L04645j88008j56733K78865
11002F75558k57003J45558O1597J55125L5698r9017l7649o9467j23946M69931
$$ plain form
10992 956385 472237 290137 661530 669947 585941 617909 802347 697576 490707 564366
10982 564366 617055 631348 916913 582334 862603 587702 1058741 868814 950418 688291
10972 688291 774332 1045015 1121854 864049 797831 1049884 1095254 981654 1326566 1361129
10962 1361129 1643116 1654305 1783483 1984851 2337466 2328100 2632769 2681529 2678517 2303708
10952 2303708 2344967 2433509 1981509 1978377 1998146 1638247 1754911 1526462 1705095 1511965
10942 1511965 1654581 1512426 1733828 1771416 1447287 1385115 1138173 1311781 1358944 812939
10932 812939 778052 843174 615592 87455 386881 322274 175772 163356 505477 45137 -33570
10920 104534 115545 208962 27834 127999 -111149 109181 209935 322057 57320 -263820
$$ packed form
10992I56385D72237j82100L71393Q417q4006L1968J84438j04771k06869P3659
10982E64366N2689J4293K85565l34579K80269k74901M71039j89927Q1604k62127
10972F88291Q6041K70683P6839k57805o6218K52053M5370j13600L44912L4563
10962A361129K81987J1189J29178K01368L52615r366L04669M8760l012l74809
10952B303708M1259Q8542m52000l132J9769l59899J16664k28449J78633j93130
10942A511965J42616j42155K21402L7588l24129o2172k46942J73608M7163n46005
10932H12939l4887O5122k27582H7455K99426o4607j46502j2416L42121D5137c3570
10920A04534J1011R3417B7834J00165a11149A09181J00754J12122E7320b63820
$$ plain form
10909 175387 480922 242966 104342 -76417 22605 -40789 -248610 -10842 -33619 444833
10898 -345102 205408 77061 -72000 -34347 -253523 -172861 -212043 87665 148050 265635 265806
10887 265806 -17896 71079 -148437 149896 -50822 17111 207162 261620 314576 233050 -109891
10875 -234445 -100674 139809 119064 -110135 -118301 -36160 48905 -43889 -154344 20795 76949
10864 76949 -226637 -156589 -163976 -101146 -116700 114736 -56383 143664 -71562 -23041 86806
10852 -334905 71153 -8582 -433594 -176339 149585 205848 127896 53141 -321213 32782 20333
10841 20333 -418410 8298 195650 22909 369152 200480 -247030 -28102 145711 -51642 -182030
10830 -182030 -221294 -54303 -165612 86691 108234 70604 68157 148044 11850 20588 92793 -474064
$$ packed form
10909A75387L05535k37956A04342g6417B2605d0789k07821a0842k2777D44833
10898c45102B05408G7061g2000c4347k19176Q0662l9182H7665O0385J17585J71
10887B65806a7896G1079a48437A49896e0822A7111J90051N4458N2956q1526a09891
10875b34445a00674A39809k0745a10135q166c6160D8905d3889j10455B0795N6154
10864G6949b26637P0048p387O2830j5554A14736e6383A43664g1562b3041H6806
10852c34905G1153h582m25012a76339A49585N6263p7952E3141c21213C2782j2449
10841B0333d18410H298J87352B2909L46243j68672b47030b8102A45711e1642j30388
10830a82030l9264e4303j11309H6691K1543l7630k447P9887A1850Q738P2205d74064
$$ plain form
10817 5438 -152577 183415 80434 -229115 -27305 114940 -301114 -56910 159918 11101 -21710
10805 -185385 -59883 97951 8168 -316318 9053 95461 642174 -344024 162026 -244642 10051
10793 -157024 -153455 236594 -157486 -62030 -66059 -368593 -83793 136392 274163 -186559 -238408
10782 -238408 314664 -87436 150630 -164848 -364145 -374574 -138349 21938 249452 78038
10771 -168583 -32766 -366400 187064 62300 -29656 -255873 -136726 -69898 -269348 -229359
10761 -229359 104403 114712 73373 246032 -319572 -146213 25659 -325670 -72228 -438429
10751 -438429 245542 213133 -182945 -28712 -10192 102384 -244730 -251676 -4403 -166594 -133240
10740 -133240 -115082 171934 282107 166800 -13263 -210490 -79834 -54311 142744 22136
$$ packed form
10817E438a52577A83415H0434b29115b7305A14940c01114e6910A59918A1101b1710
10805a85385e9883I7951H168c16318I053Q6408N46713c44024A62026b44642A0051
10793a57024L569B36594a57486f2030m029l02534h3793A36392J37771a86559n1849
10782b38408C14664h7436A50630a64848j99297j0429a38349B1938K27514G8038
10771a68583c2766l33634A87064F2300b9656k26217J19147O6828j99450L9989
10761b29359A04403J0309m1339J72659c19572a46213B5659c25670g2228l66201
10751d38429B45542l2409a82945b8712a0192A02384b44730o946d403j62191L3354
10740a33240J8158A71934J10173j15307a3263j97227g9834K5523A42744B2136
$$ plain form
10729 177606 -20266 84640 84344 82098 150644 224450 -146744 233704 -70420 237615 130617
10718 130617 -124813 -85043 -208317 -272357 922 56617 105514 -61537 -36022 166209 -221165
10706 -61552 41823 36794 -127647 -27764 52183 25520 -133487 -97506 -345742 106332 -30022
10694 54289 56040 43652 -222125 -152637 -223521 16418 -166572 33757 -33112 -148180 -51121
10682 -9881 30707 -111113 -154225 -146544 49977 49232 -180934 -220368 -18952 -249810 201948 -145921
10669 -66199 142731 -141718 201131 -99265 277801 6380 -212647 -25865 -98595 -59030 -19985
10657 -289082 -235391 -137749 -358382 -423735 38806 -15182 -351244 -5477 -101262 -151336 226426
10645 -236862 -102310 -75922 150404 -222187 -73671 -366999 -41123 -12586 59930 -63929 -401167
$$ packed form
10729A77606b0266H4640k96k246O8546P3806a46744B33704g0420B37615j06998
10718A30617a24813L9770j23274o4040I22N5695M8897f1537K5515A66209b21165
10706f1552D1823n029a27647b7764E2183B5520a33487L5981k48236A06332c0022
10694E4289J751j2388b22125O9488p0884A6418a66572C3757c3112j15068e1121
10682i881C0707a11113m3112P681D9977p45a80934l9434a8952k30858B01948a45921
10669f6199A42731a41718B01131i9265B77801F380b12647b5865p2730L9565a9985
10657b89082N3691R7642k20633o5353C8806a5182l36062e477r5785n0074B26426
10645b36862a02310K6388A50404b22187g3671k93328d1123a2586E9930f3929l37238
$$ plain form
10634 -401167 -132871 -141648 166319 -93932 -228714 82512 -37951 62432 87072 -276645 -156237
10623 -156237 -1743 -7038 -53928 72854 -199404 -265764 65239 -109653 -129310 -246520 -44739
10611 159660 -161656 173398 21190 -101264 -144225 -82189 219856 -52315 -119989 104913
10600 345365 -94807 42658 -287091 -28284 280983 254562 -153800 -112719 78679 -455416 -208200
10588 -144923 92412 -17216 -194479 -183697 184096 -112034 -51806 -104298 423974 -54090 355148
10576 -135596 -175854 283918 -37794 111586 80150 145726 -338000 86296 -425813 137676
10565 9684 -15750 -44563 -171212 140485 34993 -56832 -120142 4282 1730 217036 -39274 -54567
10553 -54567 174117 211180 -38910 32776 -24817 -177276 -574409 -214358 -43501 -19217 21113
$$ packed form
10634d01167a32871q777A66319i3932j34782H2512c7951F2432K4640b76645J20408
10623a56237a743n295m6890G2854a99404o6360F5239a09653j9657j17210d4739
10611A59660a61656A73398B1190a01264m2961O2036B19856e2315o7674A04913
10600C45365i4807D2658b87091b8284B80983k6421a53800M1081G8679d55416b08200
10588a44923I2412a7216j77263J0782A84096a12034e1806n2492D23974e4090C55148
10576a35596m0258B83918c7794A11586l1436O5576c38000H6296d25813A37676
10565I684a5750k8813j26649A40485C4993e6832o3310D282A730K15306c9274j5293
10553e4567A74117L7063c8910C2776b4817j52459l97133b14358d3501a9217B1113
$$ plain form
10541 -135248 -47827 -97556 -115706 49177 9125 -133460 -119597 121362 -76483 -9409 7624 -186649
10528 26930 -13165 -435465 -247091 -71057 -120566 -262517 -30462 -13553 83966 -237327 24249
10516 -93725 76585 -86254 -48011 100412 -176408 142953 -162686 278961 34751 -79655 47263
10504 137638 -54228 -1853 21805 -105374 -250775 314076 134686 280606 107153 174117
10494 174117 -29572 251225 151047 134108 -65400 16569 175273 76238 393098 79931 108394
10483 108394 108715 -198208 -152662 -156673 -55157 147193 35098 162928 -170132 127265 -218394
10471 -15022 140732 54172 190775 -192172 -43290 487713 293050 363139 799191 350778
10460 376471 252100 198194 -18610 36894 31740 125329 172140 -356019 256772 -297705 53225
$$ packed form
10541a35248d7827m9729j8150D9177I125a33460J3863A21362g6483i409G624a86649
10528B6930a3165m22300J88374g1057m9509j41951c0462a3553H3966b37327B4249
10516i3725G6585h6254L8243A00412a76408A42953a62686B78961C4751g9655D7263
10504A37638e4228a853B1805a05374j45401C14076A34686J45920A07153O6964
10494A74117b9572B51225j00178j6939f5400A6569J58704G6238L16860G9931K8463
10483A08394L21a98208M5546m011e5157A47193C5098J27830a70132A27265b18394
10471a5022A40732E4172J36603a92172d3290D87713j94663P0089M36052C50778
10460C76471j24371n3906a8610C6894n154R3589M6811c56019B56772b97705E3225
$$ plain form
10448 192081 -213979 -304828 56943 -71777 -41933 218796 225799 58991 -9160 133894 13202
10436 -22380 36015 -86308 28332 213253 129685 50847 -49099 111127 -24463 58966 129583
10425 129583 -115340 69368 -59692 321253 -215350 137175 91354 -77517 -204602 -229690
10415 -229690 -20836 -22825 47809 -256979 -181216 2231 -60863 -306621 24151 -219579 6004
10403 78877 -122665 75738 -28593 209379 228492 -137032 3153 -126306 86666 -103341 155572
10391 -76417 -32785 -186762 190047 -194036 -167312 -74362 83158 -26126 115448 108232 256233
10380 256233 345313 57769 -23121 -15246 235873 394325 -226435 -192846 122440 400542 223765
10369 223765 262842 -48269 -107123 101430 119934 -32471 37273 285989 390863 336049 13329
$$ packed form
10448A92081b13979r0849E6943g1777K9844B18796P003E8991i160A33894A3202
10436b2380C6015h6308B8332J84921q3568E0847d9099A11127b4463E8966P0617
10425A29583a15340F9368e9692C21253b15350A37175m5821g7517j27085k5088
10415b29690b0836j989D7809b56979P5763B231f0863k45758B4151b19579F004
10403G8877a22665G5738b8593B09379J9113a37032C153a26306H6666a03341A55572
10391g6417c2785j53977A90047a94036K6724g4362H3158b6126A15448p216J48001
10380B56233Q9080E7769b3121P875B35873J58452b26435L3589A22440K78102j76777
10369B23765L9077d8269n8854A01430J8504c2471C7273K48716J04874n4814A3329
$$ plain form
10357 303454 -1670 -7065 403374 423889 591259 351520 116665 446089 323158 388057 338456
10346 338456 97885 -183498 393448 269524 583610 293598 42670 184545 331110 334465
10336 334465 539126 188209 155411 479404 523539 335603 164500 429074 100013 314479
10326 314479 308964 224700 -62812 555014 237989 385319 -40653 -62848 106136 1739 44732
10315 44732 -166474 168611 36130 260210 379327 55600 126199 108136 365557 -66207 -8417
10303 330695 319262 32034 156181 78597 416387 88582 118198 -123647 112992 98276 -187641
10291 -14316 -22350 80127 -123942 -155140 -7686 167270 476642 -48024 6166 170672 -58363
10279 -336244 -68293 172668 -319797 -156395 -121507 -306824 160825 1165 -313996 -58076
$$ packed form
10357C03454a670n395D03374K0515J67370k39739A16665L29424j22931O4899m9601
10346C38456I7885a83498C93448j23924L14086k90012D2670J41875J46565L355
10336C34465K04661A88209l2798L23993M4135j87936A64500K64574A00013K14466
10326C14479n515q4264f2812E55014B37989J47330d0653k2195A06136A739M2993
10315D4732a66474A68611C6130K24080J19117E5600P0599j8063K57421f6207h417
10303C30695j1433C2034J24147p7584L37790H8582K9616a23647A12992j4716a87641
10291a4316q034H0127a23942l1198g686A67270L09372d8024F166J64506e8363
10279c36244f8293A72668c19797a56395L4888j85317A60825A165c13996e8076
$$ plain form
10268 89561 52459 -542792 -105929 -142498 -177266 -152928 16658 -20766 -297827 459133 278762
10257 278762 -121999 -83611 -78079 157482 95421 2223 -273603 193569 -81658 23658 -70330
10245 94813 544744 60699 289998 114226 1001 554679 218540 -202089 -178019 283769
10234 -36783 13162 -229396 -117106 -204458 -39345 72039 96102 -127490 -78231 -13421 54372
10222 -32777 59483 379088 -216150 240910 -87754 -47365 -79482 -38834 152288 66212 -307018
10210 -292148 -276188 52980 -227262 -140512 221430 19046 -37895 -167950 -210808 -77737 204994
10198 -273542 -33586 -61377 92319 -254110 257992 -52213 173715 -264737 -37050 -226683
10188 -226683 -122335 -58837 -88781 169272 129589 -64653 156800 244533 88292 -103633 186652
$$ packed form
10268H9561l7102e42792a05929l6569l4768K4338A6658b0766k77061D59133j80371
10257B78762a21999L8388N532A57482o2061B223b73603A93569h1658B3658g0330
10245I4813M49931F0699K29299A14226A001N53678B18540b02089K4070B83769
10234c6783A3162b29396J12290q7352c9345G2039K4063a27490M9259a3421E4372
10222c2777E9483L19605b16150B40910h7754M0389l2117c8834A52288F6212c07018
10210b92148J5960E2980b27262Q6750B21430A9046c7895j30055m2858g7737B04994
10198b73542c3586k7791I2319b54110B57992e2213A73715b64737c7050j89633
10188b26683J04348e8837k9944A69272l9683f4653A56800Q7733H8292a03633A86652
$$ plain form
10176 245126 -163937 -5940 -303121 -27872 141500 70438 131906 -115328 66055 87622 -19155
10164 106640 -37408 -304831 61510 160067 -20038 -43773 -121959 -78886 -88900 -39078 -19740
10153 -19740 -187495 -158062 30925 -87436 86584 -67268 242660 328277 -473688 38278 -102657
10141 -247748 -89345 -412795 192588 -47155 -29127 -137977 -118171 -166544 -268343 50861 -288374
10129 -189252 -233415 -44365 -203637 173138 -214733 -442888 134757 -40633 -394737 -172666
10118 417494 -105394 -25566 15254 -4973 207960 -127160 -247574 115907 -104814 98192
10107 138740 -176665 -277383 -65715 -276825 49979 21287 -320776 -279852 173417 -222967
10096 286282 203330 88235 -48966 -32719 -94380 169553 189694 -123362 693 66439 -338032
$$ packed form
10176B45126a63937e940k97181b7872A41500G0438O1468a15328F6055K1567a9155
10164A06640c7408k67423F1510R8557b0038k3735p8186M3073j0014c9078J9338
10153a9740j67755K9433C0925h7436H6584f7268B42660Q5617d73688C8278a02657
10141b47748h9345l23450A92588d7155J8028j08850J9806m8373j01799E0861b88374
10129a89252m4163d4365j59272A73138b14733k28155A34757d0633l54104a72666
10118D17494a05394b5566A5254d973B07960a27160j20414A15907a04814I8192
10107A38740a76665j00718f5715k11110D9979B1287c20776M0924A73417b22967
10096B86282q2952H8235d8966J6247o1661A69553K0141a23362F93O5746c38032
$$ plain form
10084 -97431 -184457 -55018 39609 -12082 -124608 -181398 -74769 -373479 -205466 -67270 342511
10072 -160803 -443379 50070 -171672 -214245 -9370 -333481 -10131 -55693 -3713 6681 -99868
10060 141511 -335112 99251 -26142 51563 -51182 -64266 -174949 -173828 -198859 -55924 -67648
10049 -67648 -134847 19297 -80113 134004 -168581 -120366 368519 -178786 5536 -179088 -310225
10038 -310225 -220631 -274577 17099 -46988 77994 -28299 -131752 229794 -1715 -26070 62280
10026 -47989 -132211 -120174 -80211 47791 -37611 -195015 103762 -187581 -143863 126744 -175902
10014 4352 -515904 -178695 -46452 -26763 -354734 -194675 42485 40915 -9 -297759 -3352 107989
10001 -118153 -285025 25519 -222447 -5681 206196 260663 35343 122546 -156043 -152045 -94132
$$ packed form
10084i7431q7026e5018C9609a2082j12526n6790g4769k98710J68013f7270C42511
10072a60803k82576E0070a71672m2573i370l24111a0131m5562c713F681i9868
10060A41511c35112I9251b6142E1563e1182j3084j10683J121k5031e5924j1724
10049f7648o7199A9297h0113A34004a68581M8215C68519a78786E536a79088j31137
10038c10225Q9594n3946A7099d6988G7994b8299j03453B29794a715k4355F2280
10026d7989q4222J2037L9963D7791c7611j57404A03762a87581M3718A26744a75902
10014D352e15904a78695d6452J9689l27971J60059D2485j570ik97750c352A07989
10001a18153j66872B5519b22447e681B06196N4467C5343Q7203a56043L998N7913
$$ plain form
9990 -94132 106556 -125897 -43236 168949 173056 -327366 207838 -78598 -285954 -39946 -5068
9978 181398 -360840 -135448 -166380 32715 233481 -1371 -63765 2641 -67125 139454 118313
9967 118313 -7336 -385027 -197055 -213345 -282862 88553 -287533 -108935 230236 -334799 193728
9955 -156611 -123202 17891 -216622 -38748 136817 -252562 -162124 84306 107163 -442898 -106433
9943 -435696 -83731 245448 -33008 -109644 53957 -50480 -85411 181342 71197 -71454 136345
9931 -310752 -118769 -192119 88174 -202093 -11682 1989 -286640 -72677 -59293 -144764 -47555
9919 -213826 -51736 -126218 303697 31554 -149907 -172179 325812 167514 -184365 -36406 120364
9907 -377165 -98553 -48044 -147348 194689 15512 -196906 -17872 -378673 -129583 -160032 -160038 88754
$$ packed form
9990i4132A06556a25897d3236A68949M107c27366B07838g8598k07356c9946e068
9978A81398c60840a35448l0932C2715K00766a371o2394B641f7125A39454k1141
9967A18313g336l77691J87972j6290o9517H8553b87533a08935B30236c34799A93728
9955a56611L3409A7891b16622c8748A36817b52562R0438H4306K2857d42898a06433
9943d35696h3731B45448c3008p6636E3957e0480l4931A81342G1197g1454A36345
9931c10752a18769p3350H8174b02093a1682A989b86640g2677J3384q5471d7555
9919b13826e1736p4482C03697C1554a49907k2272C25812j58298a84365c6406A20364
9907c77165i8553d8044r9304A94689A5512a96906a7872l60801a29583l0449oH8754
$$ plain form
9894 -335500 245710 -27044 208012 109917 -332074 -89739 169938 4890 -260346 -8976 -46827
9883 -46827 -37308 248005 148 281544 -403942 199241 -289514 -81211 -74160 -5380 8852 64159
9871 64159 -50002 -232751 -242408 -299558 -225855 -66680 62287 -102834 143938 -137373 -157189
9860 -157189 180319 -4970 -35456 -32255 -32214 -90481 151018 8637 24642 -252632 900 83176 -173942
9846 10817 69016 -167935 313701 261170 -207838 74313 -16377 60830 -167834 -36082 85124
9834 -71246 -5437 -45454 -15486 -169298 63837 -128637 -324446 37493 -124482 -110907 -115484
9823 -115484 282214 -268839 51717 21892 -45363 -297073 -304990 117393 -6703 -286139 144487
9811 -448790 -340103 -391330 -26291 304066 -324517 -323211 -142342 -156734 -300796 -126586 74093
$$ packed form
9894c35500B45710b7044B08012r8095c32074h9739A69938D890b60346h976l7851
9883d6827R519B48005A48K81396d03942A99241b89514h1211P051e380H852N5307
9871F4159e0002j82749r657n7150P3703f6680F2287a02834A43938a37373j9816
9860a57189A80319d970l0486L201M1n8267A51018H637J6005b52632I00Q2276a73942
9846A0817N8199a67935C13701n2531b07838G4313a6377F0830a67834c6082H5124
9834g1246e437m0017a5486j53812F3837a28637j95809C7493a24482J3575m577
9823a15484B82214b68839E1717B1892d5363k51710p917A17393f703k79436A44487
9811d48790J08687n1227b6291C04066c24517J306a42342j4392j44062a26586G4093
$$ plain form
9799 302065 -177277 -320276 8119 -288934 -68124 76209 -239170 130043 69447 -146164 -16644
9787 -126468 -156668 -90516 194302 21149 -47114 29685 -455031 77790 -48069 175017 193270
9776 193270 22414 -201685 -395438 -163004 -268243 -239996 -208258 -191344 -117127 21762 -158515
9764 -191333 -81300 -309604 130956 -142867 -17876 -141918 -203562 -293731 -349986 273226 -106943
9752 77858 -128036 -109411 40712 -100814 4655 125116 -189567 290726 -83942 -16011 -11683
9741 -11683 -118305 -242469 179281 -39469 205161 -85850 -136128 -230035 -11257 -117231 49558
9729 203561 101322 -117690 154475 -23752 -71644 -27211 -360655 2801 75032 -3389 -276994
9718 -276994 -200760 -236395 -308396 58238 99939 -255603 -74494 -293878 -174787 -74131 -234823
$$ packed form
9799C02065a77277j42999H119b88934f8124G6209b39170A30043o0596a46164a6644
9787a26468l0200O6152A94302B1149d7114B9685d55031G7790d8069A75017J8253
9776A93270B2414b01685j93753a63004j05239K8247L1738J6914P4217B1762a58515
9764a91333h1300k28304A30956a42867a7876j24042o1644r0169n6255B73226a06943
9752G7858a28036J8625D0712a00814D655J20461a89567B90726h3942a6011M328
9741a1683j06622j24164A79281c9469B05161h5850n0278r3907a1257j05974D9558
9729B03561A01322a17690A54475b3752m7892b7211l33444B801P2231c389k73605
9718b76994P6234l5635p2001E8238M1701b55603g4494k19384J19091g4131j60692
$$ plain form
9707 -234823 -203637 4422 -226607 -116512 281973 -218165 62969 567234 36057 -102345 -81699
9696 -81699 -223728 107938 -129313 436550 129463 -217099 -220770 -169549 -224290 -69545 -238561
9685 -238561 19836 -182772 25550 -68784 -175816 172517 177629 157781 -64490 -497087 -185745
9673 16092 135444 32621 -113538 88954 85807 -59165 157677 -124016 30191 -56237 82767
9661 232852 69910 60675 -56826 82403 138334 41672 -190295 161383 -76899 -158285 247347
9649 -331034 240 -453896 12968 116306 504 7158 -207202 -264677 5877 177885 40765 300322
9637 300322 -352233 -64274 -77657 -16544 -83429 -12153 -118387 -1543 27524 -303377 142233
9625 -88507 -67249 -187065 -156720 27191 -73600 -476556 -399206 -72657 -18942 72837 -348751
$$ packed form
9707b34823L1186D422b26607J10095B81973b18165F2969N04265C6057a02345K0646
9696h1699j42029A07938a29313D36550A29463b17099l671N1221n4741f9545j69016
9685b38561A9836a82772B5550f8784j07032A72517N112j9848f4490m32597a85745
9673A6092J19352C2621a13538H8954l147e9165A57677a24016C0191e6237H2767
9661B32852F9910r235e6826H2403N5931D1672a90295A61383g6899q1386B47347
9649c31034B40d53896A2968J03338E04O654b07202n7475E877J72008D0765K59557
9637C00322c52233f4274j3383a6544o6885a2153j06234a543B7524c03377A42233
9625h8507K1258j19816L0345B7191g3600m02956P7350g2657a8942G2837c48751
$$ plain form
9613 -300235 -84917 -133061 -67411 -86582 -129570 -279582 -131402 36999 -30745 -41533 19970
9601 -98075 6143 55896 -153855 -452261 -205624 -66711 24644 -106551 146131 48803 78733
9590 78733 -151403 -116407 3368 102336 -162635 -35320 -176301 -220246 -168719 -326168 240718
9578 -232516 116749 -263815 -161125 -734285 -94894 -73954 157083 -199104 -149517 -280718
9568 -280718 50329 -306343 -69754 1105 -188873 -344938 196311 -307276 250114 184060 42331
9556 -107881 -178267 -109840 -112684 -122351 -247127 81674 -19871 -358848 -185481 -166038 -204588
9545 -204588 44386 -182811 -51665 506715 4342 96622 -176971 66007 104640 -98156 -51342
9534 -51342 33546 161261 -219661 94695 -142743 -35804 -88611 233583 -298851 -23936 -138345
$$ packed form
9613c00235h4917m8144O5650j9171m2988j50012a31402C6999c0745j0788A9970
9601i8075F143M9753a53855k98406b05624f6711B4644a06551A46131D8803K9930
9590G8733a51403L4996C368R8968a62635c5320j40981m3945N1527j57449B40718
9578b32516A16749b63815J02690n73160i4894K0940A57083a99104M9587j31201
9568b80718E0329c06343f9754A105a88873j56065A96311c07276B50114o6054D2331
9556a07881p0386O8427k844r667j24776H1674a9871l38977J73367J9443l8550
9545b04588D4386a82811e1665E06715D342R2280a76971F6007L8633i8156M6814
9534e1342C3546J27715b19661I4695a42743c5804n2807B33583b98851b3936j14409
$$ plain form
9523 -138345 -174290 -92336 -241293 146249 -176097 83019 40112 -59255 31622 -27037 -194849
9512 -194849 -85229 37507 45122 -115456 -70218 -10794 -264193 -93156 242243 -473946 -123688
9500 216018 -151269 -241526 -10147 -261417 44506 7338 48770 -243465 -68582 77186 78239
9489 78239 -154512 318501 -35453 -168621 -16088 -288741 -415087 -143988 -284028 33801
9478 147939 -35077 185210 -1044 -110007 -90796 185555 121263 370010 -272191 -149470 -218810
9467 -218810 -70938 42442 -114485 -233775 356965 -131241 105702 200390 -394878 -29672
9456 -58444 -16351 -216021 54416 -483 62928 -50268 185656 45488 -96135 84657 40613 -51482
9443 84833 88830 -14855 -25791 -70134 -41651 -161810 300616 61867 -56636 173661 -175154
$$ packed form
9523a38345l5945Q1954j48957A46249a76097H3019D0112e9255C1622b7037j67812
9512a94849h5229C7507P615a15456M5238a0794k53399i3156B42243d73946a23688
9500B16018a51269r0257a0147k51270D4506G338M1432b43465f8582G7186J053
9489G8239a54512C18501c5453j33168a6088k72653j26346a43988j40040C3801
9478A47939c5077A85210a044j08963J9211A85555o4292K48747b72191J22721o9340
9467b18810g0938D2442a14485j19290C56965a31241A05702R4688c94878b9672
9456e8444a6351j99670E4416d83F2928e0268A85656D5488i6135H4657D0613e1482
9443H4833L997a4855j0936m4343K8483j20159C00616F1867e6636A73661a75154
$$ plain form
9431 -145824 -71833 -171727 -39850 -312347 34013 -275559 -285194 1253 -102312 -79348 21548
9419 -1796 162526 -158247 182590 -293619 -72891 23007 -231455 39041 -218876 -287171 -146451
9408 -146451 6307 38790 -34439 -360244 -36322 62681 215043 -126938 -92239 -47441 232024
9396 -109538 30310 -417014 -44167 11028 -134944 -232260 10998 -265557 -53372 98057 -54814
9384 -241550 48943 -319930 -48966 -85481 -11221 -174664 -351952 -291681 -38931 -156089 2 -437742
9371 -388890 78498 -78515 -266492 24522 -300758 -311233 80826 96547 -413723 -20422 -3922
9359 175109 -196791 -7034 77423 56820 -79248 -207405 -157334 -326389 -295770 -83548 -168691
9348 -168691 113712 -158265 -408690 139801 -115717 -198655 45746 105471 165923 -36725 -93354
$$ packed form
9431a45824g1833r9894c9850k72497C4013b75559r635A253a02312K2964B1548
9419a796A62526a58247A82590b93619g2891B3007b31455C9041b18876o8295J40720
9408a46451F307L2483c4439l25805c6322F2681J52362a26938L4699M4798B32024
9396a09538C0310d17014d4167A1028a34944r7316A0998b65557e3372I8057e4814
9384b41550D8943c19930d8966l6515a1221j63443j77288O0271c8931j17158Bd37742
9371c88890G8498g8515j87977B4522c00758j0475H0826J5721d13723b0422c922
9359A75109a96791g034G7423k0603g9248j28157N0071j69055L0619h3548q5143
9348a68691A13712a58265k50425A39801a15717q2938D5746N9725O0452c6725n6629
$$ plain form
9337 -93354 -121427 23836 -128802 -47030 162214 -163481 71078 -599495 -99283 -527106 -83894
9325 -67047 114885 -175632 13607 141208 -29551 -161050 -24737 117061 -20745 67017 223985
9314 223985 8253 215912 -79593 -32645 54551 -167076 -246305 -312880 -775 -272459 -100859
9302 -175444 -154819 -626 -127747 -44356 172694 -183212 67716 -80815 -160294 117140 -338382
9290 -143387 -367522 -195359 -243569 -59137 -157314 -274707 4597 -170446 69699 59903 25680
9278 3702 -8601 151736 314398 -66905 -27420 201512 81014 167585 125122 -3752 -116696 -35924
9265 196323 -252564 -294528 50599 -252331 -232155 -257892 -51247 -226284 139634 -88099 23889
9253 159972 -31535 -156850 -45883 72403 -126011 -1211 61470 -76906 -214607 91554 -299866
$$ packed form
9337i3354k8073B3836a28802d7030A62214a63481G1078e99495i9283m27823h3894
9325f7047A14885a75632A3607J27601b9551j31499b4737A17061b0745F7017J56968
9314B23985H253K07659g9593c2645E4551a67076p9229o6575g75k71684a00859
9302a75444K0625f26j27121d4356A72694a83212F7716h0815p9479A17140c38382
9290a43387k24135J72163m8210e9137r8177j17393D597a70446F9699r796B5680
9278C702h601A51736J62662f6905b7420B01512H1014Q6571m2463c752j12944c5924
9265A96323b52564m1964E0599b52331K0176k5737e1247j75037A39634h8099B3889
9253A59972c1535j25315d5883G2403a26011a211F1470g6906j37701I1554b99866
$$ plain form
9241 -380814 128395 35063 158735 -135856 -156732 137569 199197 5537 248350 -76519 424350
9229 -24488 38613 -218048 323948 -67739 -69125 31335 -219004 252735 16072 151022 40131
9217 -260513 -61484 65065 -175268 174993 -216293 17700 95653 -283907 -25589 -206743 70569
9205 151931 -68378 8472 -173555 -127884 80406 157225 -239153 14383 -189254 -120406 -234389
9194 -234389 -311814 -124345 -115115 145313 -146854 28467 194946 59980 -221869 -389176 -155542
9182 -196510 -131016 225625 -68588 -438403 309886 -84401 -148466 104207 388890 60415 -46922
9170 -289254 94057 239840 174782 -124012 -78047 -121077 68310 -319204 26972 27316 -281886
9158 -125432 -43556 -74344 -117310 -34591 199861 -148653 -173088 -402 -255315 88953 -122637
$$ packed form
9241c80814A28395C5063J23672a35856k0876A37569O1628E537K42813g6519D24350
9229b4488C8613b18048C23948f7739j386C1335b19004B52735A6072J34950D0131
9217b60513f1484F5065a75268A74993b16293A7700P7953b83907b5589j81154G0569
9205A51931f8378H472a73555M5671H0406P6819b39153A4383a89254O8848j13983
9194b34389p7425a24345R230A45313a46854B8467J66479E9980b21869j67307a55542
9182a96510O5494B25625f8588l69815C09886h4401o4065A04207K84683F0415d6922
9170b89254I4057J45783o5058a24012M5965m3030F8310c19204B6972L44b81886
9158a25432d3556l0788m2966c4591A99861a48653k4435d02k54913H8953a22637
$$ plain form
9146 17005 145070 -373279 -36201 -97922 2761 -127584 -232218 -193829 -64201 167774 35539
9134 -107167 123695 -135591 -64418 -227613 -201865 -91492 38556 -5903 45380 -222434 -383300
9123 -383300 -282416 36205 -81173 -460513 -231012 193430 -115654 -72600 2331 -224259 -200414
9112 -200414 181475 248784 -335533 -39400 69183 -149200 -160022 -210433 -87064 -145364 69326
9100 -10775 -169133 -284919 75915 285025 -69518 -48656 -450056 104936 -41890 -115530 -61332
9089 -61332 27640 146468 -103345 -13722 71399 -81481 -122889 428151 47892 -154140 -12823
9077 13873 75250 -104597 289592 -215948 77214 65852 -13656 -66309 -12211 169834 -211241
9065 -57121 -302384 314320 -50860 119752 65788 45325 -17507 74121 -61251 115802 166113
$$ packed form
9146A7005J28065c73279c6201o1721B761a27584j04634L8389f4201A67774C5539
9134a07167A23695a35591f4418j63195K5748i1492C8556e903D5380b22434j60866
9123c83300J00884C6205h1173l79340K29501A93430a15654M3054B331b24259K3845
9112b00414A81475O7309c35533c9400F9183a49200j0822n0411h7064n8300F9326
9100a0775j58358j15786G5915K09110f9518K0862m01400A04936d1890p3640N4198
9089f1332B7640J18828a03345a3722G1399h1481m1408D28151D7892a54140a2823
9077A3873O1377a04597B89592b15948G7214j1362a3656n2653a2211A69834b11241
9065e7121k45263C14320e0860A19752n3964k0463a7507G4121f1251A15802N0311
$$ plain form
9054 166113 -284843 -72647 -206968 190647 5900 -22123 -169866 280251 -213690 -83560 106354
9042 -69990 -4822 121009 -218699 99023 -198492 -85957 130602 -285409 -133487 -134197 -230802
9031 -230802 -122735 -261108 -306444 262718 -43466 -190023 -33377 -151797 -110111 192939
9020 53299 -86083 441354 178485 -186061 -104175 -173590 -75709 -133091 308514 193205 -84168
9008 21880 -193332 -169073 -244862 -195566 195954 -45866 144888 127294 233505 126734 25068
8996 -193317 -55342 -94866 35633 -577180 -87802 -273822 -12848 43043 -90041 49859 162607
8985 162607 122665 -223997 279384 -68867 -424624 -32136 -172807 -176142 -9731 33701 26468
8974 26468 396705 -35218 -284106 -159096 -25728 -208363 -55972 -16580 -343528 -234650 97048
$$ packed form
9054A66113b84843g2647j34321A90647E900b2123j47743B80251b13690h3560A06354
9042f9990d822A21009b18699I9023a98492h5957A30602b85409a33487p10r6605
9031b30802J08067j38373m5336B62718d3466j46557c3377j18420M1686A92939
9020E3299h6083D41354A78485a86061Q1886o9415g5709n7382C08514j15309h4168
9008B1880a93332K4259p5789M9296A95954d5866A44888j7594J06211j06771B5068
8996a93317e5342l9524C5633e77180h7802j86020a2848D3043i0041D9859J12748
8985A62607l9942b23997B79384f8867l55757c2136j40671l335i731C3701p233
8974B6468L70237c5218k48888J25010b5728j82635e5972a6580l26948J08878I7048
$$ plain form
8962 5189 -160122 -34546 41621 289802 272964 -42031 123867 -273867 59399 54177 112235
8951 112235 -246497 213270 140667 -46675 92951 20253 39273 -64859 -107447 -11731 -390209
8940 -390209 -378020 57096 194560 -176499 -73625 56474 -206858 87453 134012 197992 277742
8929 277742 196478 -116388 70428 -307304 77767 -19107 -119051 106788 56101 -14398 79815
8917 504868 71795 -309287 71304 178628 274054 357182 700894 824927 1068673 1668243
8907 1668243 2922255 5557593 11030162 4908827 2181175 1497396 859772 488568 76584
8897 570716 317943 -34700 307973 322508 270350 559543 148480 111495 -168193 -109820 -443739
8886 -443739 -308089 -188902 -17585 -140810 -220976 167729 -257943 -300702 336793 95675
$$ packed form
8962E189a60122c4546D1621K48181j6838d2031A23867b73867E9399n222N8058
8951A12235b46497B13270p2603d6675I2951B0253J9020f4859m2588a1731l78478
8940c90209J2189E7096J37464a76499g3625E6474b06858H7453M6559O3980P9750
8929B77742q1264a16388G0428c07304G7767a9107r9944A06788n0687a4398G9815
8917E04868G1795c09287G1304J07324R5426Q3128L43712J24033K43746N99570
8907A668243J254012K635338N472569D908827B181175o83779o37624l71204G6584
8897E70716k52773c4700C07973J4535n2158K89193A48480l6985a68193N8373l33919
8886d43739J35650J19187a7585j23225q0166A67729b57943m2759C36793I5675
$$ plain form
8875 -90391 211390 -94068 -132640 180832 -105448 99142 44088 119380 -10506 -98299 346822
8863 208210 127299 99990 165375 -264034 64208 -441125 79051 33573 36763 -68502 54944
8851 -59447 -182684 46779 -94159 249679 -126751 118319 -148211 -126324 197982 -53027 -25969
8839 -186597 -24660 -327954 100070 -202983 -7445 128147 18343 213781 -438523 -77934 7115
$$ packed form
8875i0391B11390i4068l8572A80832a05448I9142D4088P5292a0506q7793C46822
8863B08210q0911k7309O5385b64034F4208d41125G9051C3573L190f8502E4944
8851e9447j23237D6779i4159B49679a26751A18319a48211K1887A97982e3027b5969
8839a86597b4660l03294A00070b02983g445A28147A8343J95438d38523g7934G115
$$ [...]
##END NTUPLES=NMR SPECTRUM
##END=
