
##TITLE=AC1007_S-149_6114592_zZLpfeKMET
##JCAMPDX= 6.0         $$ Bruker NMR JCAMP-DX V2.0
##DATA TYPE= NMR SPECTRUM
##DATA CLASS= NTUPLES
##ORIGIN= BRUKER
##OWNER= Administrator
$$ 1.72 TOPSPIN		Version 2.1
$$ 2012-05-14 18:50:03.140 -0500  Administrator@TOPSPIN
$$ Compression mode = diff/dup
##.OBSERVE FREQUENCY= 400.13188235
##.OBSERVE NUCLEUS= ^1H
##.ACQUISITION MODE= SIMULTANEOUS (DQD)
##.ACQUISITION SCHEME= undefined
##.AVERAGES= 64
##.DIGITISER RES= 22
##SPECTROMETER/DATA SYSTEM= spect
##.PULSE SEQUENCE= noesygpps1d.comp
##.SOLVENT NAME= COFFEE_meoh
##.SHIFT REFERENCE= INTERNAL, COFFEE_meoh, 1, 14.96666
##AUDIT TRAIL= $$ (NUMBER, WHEN, WHO, WHERE, PROCESS, VERSION, WHAT)
$$ ##TITLE= Audit trail, TOPSPIN		Version 2.1
$$ ##JCAMPDX= 5.01
$$ ##ORIGIN= Bruker BioSpin GmbH
$$ ##OWNER= Administrator
$$ $$ C:\Bruker\TOPSPIN/data/COFFEE/nmr/AC1007_S-149_6114592_zZLpfeKMET/22/pdata/1/auditp.txt
$$ ##AUDIT TRAIL=  $$ (NUMBER, WHEN, WHO, WHERE, PROCESS, VERSION, WHAT)
(   1,<2012-05-14 18:49:58.359 -0500>,<Administrator>,<TOPSPIN>,<go>,<TOPSPIN 2.1>,
      <created by zg
	started at 2012-05-14 18:38:28.187 -0500,
	POWCHK enabled, PULCHK disabled,
       configuration hash MD5:
       AF F2 23 6B 01 CD 40 DD E5 A1 38 A0 06 EA F7 77
       data hash MD5: 64K
       D0 F8 97 51 58 BD 07 C2 BD 95 AD C4 BC 34 D3 00>)
(   2,<2012-05-14 18:50:01.156 -0500>,<Administrator>,<TOPSPIN>,<proc1d>,<TOPSPIN 2.1>,
      <Start of raw data processing
       efp LB = 0.3 FT_mod = 6 PKNL = 1 PHC0 = 0 PHC1 = 0 SI = 128K 
       data hash MD5: 128K
       C1 CB E5 A6 B8 F3 E2 15 2C 62 AC 67 A6 5F 44 DE>)
(   3,<2012-05-14 18:50:02.406 -0500>,<Administrator>,<TOPSPIN>,<proc1d>,<TOPSPIN 2.1>,
      <pk PHC0 = 36.93054 PHC1 = 0 
       data hash MD5: 128K
       F6 6B 40 29 DF 12 3A 73 28 30 29 9D 62 93 58 87>)
(   4,<2012-05-14 18:50:02.640 -0500>,<Administrator>,<TOPSPIN>,<proc1d>,<TOPSPIN 2.1>,
      <abs ABSG = 1 
       data hash MD5: 128K
       F0 2D 07 B9 93 FA DC 05 C1 4F 74 6C E1 76 05 E7>)
(   5,<2012-05-14 18:50:02.703 -0500>,<Administrator>,<TOPSPIN>,<proc1d>,<TOPSPIN 2.1>,
      <abs ABSG = 2 
       data hash MD5: 128K
       08 3B 32 59 29 8B 3E D1 E4 7F 0C 6F 9A 56 4E 0F>)
(   6,<2012-05-14 18:50:02.765 -0500>,<Administrator>,<TOPSPIN>,<proc1d>,<TOPSPIN 2.1>,
      <abs ABSG = 3 
       data hash MD5: 128K
       8A 13 B7 9F 48 5F D4 D7 B1 88 80 1D 4D C1 18 52>)
(   7,<2012-05-14 18:50:02.984 -0500>,<Administrator>,<TOPSPIN>,<proc1d>,<TOPSPIN 2.1>,
      <abs ABSG = 4 
       data hash MD5: 128K
       F9 BB CC 7F 52 A1 2F 78 EB 85 0D 7F 1A BF 34 01>)
(   8,<2012-05-14 18:50:03.031 -0500>,<Administrator>,<TOPSPIN>,<proc1d>,<TOPSPIN 2.1>,
      <abs ABSG = 5 
       data hash MD5: 128K
       EF 2A 90 E1 12 5F 0A BC 4B EF 4D 1D E7 5D 5F 56>)
$$ ##END=
$$ 
$$ $$ hash MD5
$$ $$ 1C 0E 0C 7C E1 06 04 FA FD 1E 01 9E 2C 79 73 80
##$RELAX= 
##$RELAX= 
##$RELAX= 
##$RELAX= 
##$RELAX= 
##$RELAX= 
##$RELAX= 
##$RELAX= 
$$ Bruker specific parameters
$$ [...]
##$TP07= 0
##$TPNAME0= <>
##$TPNAME1= <>
##$TPNAME2= <>
##$TPNAME3= <>
##$TPNAME4= <>
##$TPNAME5= <>
##$TPNAME6= <>
##$TPNAME7= <>
##$TPOAL= (0..7)
0.5 0.5 0.5 0.5 0.5 0.5 0.5 0.5
##$TPOFFS= (0..7)
0 0 0 0 0 0 0 0
##$TUNHIN= 0
##$TUNHOUT= 0
##$TUNXOUT= 0
##$USERA1= <user>
##$USERA2= <user>
##$USERA3= <user>
##$USERA4= <user>
##$USERA5= <user>
##$V9= 5
##$VALIST= <valist>
##$VCLIST= <CCCCCCCCCCCCCCC>
##$VD= 0
##$VDLIST= <DDDDDDDDDDDDDDD>
##$VPLIST= <PPPPPPPPPPPPPPP>
##$VTLIST= <TTTTTTTTTTTTTTT>
##$WBST= 2048
##$WBSW= 25
##$XGAIN= (0..3)
0 0 0 0
##$XL= 0
##$YL= 0
##$YMAX_a= 11245272
##$YMIN_a= -6072818
##$ZGOPTNS= <>
##$ZL1= 120
##$ZL2= 120
##$ZL3= 120
##$ZL4= 120
##$ABSF1= 14.96666
##$ABSF2= -5.585871
##$ABSG= 5
##$ABSL= 3
##$ALPHA= 0
##$AQORDER= 0
##$ASSFAC= 0
##$ASSFACI= 0
##$ASSFACX= 0
##$ASSWID= 0
##$AUNMP= <proc_prof1d_extract.lims>
##$AXLEFT= 0
##$AXNAME= <>
##$AXNUC= <1H>
##$AXRIGHT= 0
##$AXTYPE= 0
##$AXUNIT= <>
##$AZFE= 0.1
##$AZFW= 0.1
##$BCFW= 0
##$BC_mod= 0
##$BYTORDP= 0
##$COROFFS= 0
##$CY= 15
##$DATMOD= 1
##$DC= 0
##$DFILT= <>
##$DTYPP= 0
##$F1P= 0
##$F2P= 0
##$FCOR= 0.5
##$FTSIZE= 131072
##$FT_mod= 6
##$GAMMA= 0
##$GB= 0
##$INTBC= 1
##$INTSCL= 1
##$ISEN= 128
##$LB= 0.3
##$LEV0= 0
##$LPBIN= 0
##$MAXI= 10000
##$MC2= 0
##$MEAN= 0
##$ME_mod= 0
##$MI= 0
##$NCOEF= 0
##$NC_proc= -3
##$NLEV= 6
##$NOISF1= 0
##$NOISF2= 0
##$NSP= 0
##$NTH_PI= 0
##$NZP= 0
##$OFFSET= 14.96666
##$PC= 1
##$PHC0= 36.93054
##$PHC1= 0
##$PH_mod= 1
##$PKNL= yes
##$PPARMOD= 0
##$PPDIAG= 0
##$PPIPTYP= 0
##$PPMPNUM= 2147483647
##$PPRESOL= 1
##$PSCAL= 4
##$PSIGN= 0
##$PYNMP= <proc.py>
##$REVERSE= no
##$SF= 400.130005582174
##$SI= 131072
##$SIGF1= 0
##$SIGF2= 0
##$SINO= 400
##$SIOLD= 131072
##$SPECTYP= <>
##$SREGLST= <1H.CDCl3>
##$SSB= 0
##$STSI= 131072
##$STSR= 0
##$SW_p= 8223.68421052632
##$SYMM= 0
##$S_DEV= 0
##$TDeff= 65536
##$TDoff= 0
##$TI= <>
##$TILT= no
##$TM1= 0
##$TM2= 0
##$TOPLEV= 0
##$USERP1= <user>
##$USERP2= <user>
##$USERP3= <user>
##$USERP4= <user>
##$USERP5= <user>
##$WDW= 1
##$XDIM= 131072
##$YMAX_p= 465897863
##$YMIN_p= -118213287
##$CURPLOT= <Network HP LaserJet P1505>
##$CURPRIN= <$Network HP LaserJet P1505>
##$DFORMAT= <normdp>
##$LAYOUT= <+/1D_H.xwp>
##$LFORMAT= <normlp>
##$PFORMAT= <normpl>
##$SURQMSG= 1
$$ End of Bruker specific parameters
$$ ---------------------------------
##NTUPLES= NMR SPECTRUM
##VAR_NAME=  FREQUENCY,     SPECTRUM/REAL,   SPECTRUM/IMAG
##SYMBOL=    X,             R,               I
##VAR_TYPE=  INDEPENDENT,   DEPENDENT,       DEPENDENT
##VAR_FORM=  AFFN,          ASDF,            ASDF
##VAR_DIM=   131072,        131072,          131072
##UNITS=     HZ,            ARBITRARY UNITS, ARBITRARY UNITS
##FACTOR=    0.0627417313425165, 1,          1
##FIRST=     8223.62146879498, -339,         -105848
##LAST=      0,             3158,            -105911
##MIN=       0,             -118213287,      0
##MAX=       8223.62146879498, 465897863,    0
$$ Real data points
##PAGE= N=1
##DATA TABLE= (X++(R..R)), XYDATA
$$ [...]
63610E46030k682r84P42J762K419L550M837M667K186j315l680m196l920m132m997
$$ 546030 543348 542364 543106 544868 547287 550837 555674 560341 562527 561212 557532 553336 549416 545284 540287
63595E40287n701n390m025k517j865k028k053j405o58o25j463k936m703n824m905
$$ 540287 534586 529196 525171 522654 520789 518761 516708 515303 514645 514020 512557 509621 504918 499094 494189
63580D94189j727J910M032M651N046N571N694N806O960Q690Q995P383O258Q002
$$ 494189 492462 494372 498404 503055 508101 513672 519366 525172 532132 540822 549817 557200 563458 571460
63566E71460J1783J4639J4978J3771J2836J3234J5136J7996K0687K2354K3329
$$ 571460 583243 597882 612860 626631 639467 652701 667837 685833 706520 728874 752203
63555G52203K4608K6513K8504L0197L1780L3412L4971L6619L8858M1666M4053
$$ 752203 776811 803324 831828 862025 893805 927217 962188 998807 1037665 1079331 1123384
63544A123384M4923M4187M2702M1063L8579L3697K5724J6147P690J810k363o189
$$ 1123384 1168307 1212494 1255196 1296259 1334838 1368535 1394259 1410406 1418096 1419906 1417543 1411354
63532A411354r482j1115j1176j1292j2838j5791j9535k3809k8413l2569l5129
$$ 1411354 1401872 1390757 1379581 1368289 1355451 1339660 1320125 1296316 1267903 1235334 1200205
63521A200205l5367l3611l1283l0003k9971k9590k7399k4050k1274j9206j6265
$$ 1200205 1164838 1131227 1099944 1069941 1039970 1010380 982981 958931 937657 918451 902186
63510I02186j1871p527m528k204M55K911M377N821Q721J2404J4680J5167J5983
$$ 902186 890315 882788 878260 876056 876511 879422 883799 889620 898341 910745 925425 940592 956575
63497I56575J8524K1282K1965K0725J9946K1345K4314K7199K9366L1622L4943
$$ 956575 975099 996381 1018346 1039071 1059017 1080362 1104676 1131875 1161241 1192863 1227806
63486A227806L9159M3246M6777N0375N4145N6139N3440M4979L2618J9414P590
$$ 1227806 1266965 1310211 1356988 1407363 1461508 1517647 1571087 1616066 1648684 1668098 1675688
63475A675688j777q289j2273j4644j5993j6262j5811j6078j8383k2465k7045l1536
$$ 1675688 1673911 1665622 1653349 1638705 1622712 1606450 1590639 1574561 1556178 1533713 1506668 1475132
63463A475132l6252m1142m5354m8155m9541m9768m8972m7494m5919m4507m2974
$$ 1475132 1438880 1397738 1352384 1304229 1254688 1204920 1155948 1108454 1062535 1018028 975054
63452I75054m0931l8109l4281k9665k5403k2690k1191j9359j6673j4484j3901
$$ 975054 934123 896014 861733 832068 806665 783975 762784 743425 726752 712268 698367
63441F98367j3992j3186j1599j0422r649q142n907m425m286m107k630n93N68P43
$$ 698367 684375 671189 659590 649168 639519 631377 625470 621045 616759 612652 610022 609429 609997 610740
63427F10740O87M17m18j039l6K581N064N990N580M713L661K406J395J190J691
$$ 610740 611427 611844 611426 610387 610351 612932 617996 623986 629566 634279 637940 640346 641741 642931 644622
63412F44622K225K236J555K60j408l126m612n562n575m628l561l470m398n168
$$ 644622 646847 649083 650638 650898 649490 646364 641752 636190 630615 625987 622426 618956 614558 609390
63398F09390m752l263j397L98J852K691L137L956N377O601P164Q016J0197J2979
$$ 609390 604638 601375 599978 600376 602228 604919 608056 612012 617389 623990 631154 639170 649367 662346
63384F62346J4678J5179J6133J8341K0459K1019K0644K1251K3679K7142L0594
$$ 662346 677024 692203 708336 726677 747136 768155 788799 810050 833729 860871 891465
63373H91465L3743L6787L9935M3139M5754M6420M4012L8799L2352K6139K0756
$$ 891465 925208 961995 1001930 1045069 1090823 1137243 1181255 1220054 1252406 1278545 1299301
63362A299301J6603J4631J5788J9789K5028K9937L4207L8467M2964M6938M9220
$$ 1299301 1315904 1330535 1346323 1366112 1391140 1421077 1455284 1493751 1536715 1583653 1632873
63351A632873M9020M6034M0406L3012K5226J7713R859J267o615j1639j3796j5442
$$ 1632873 1681893 1727927 1768333 1801345 1826571 1844284 1854143 1855410 1848795 1837156 1823360 1807918
63339A807918j8211k1188k3106k5009k8989l5060m0988m5159m7923m9992n1048
$$ 1807918 1789707 1768519 1745413 1720404 1691415 1656355 1615367 1570208 1522285 1472293 1421245
63328A421245n0592m8986m6949m4832m2798m0847l8248l3925k7978k2058j7675
$$ 1421245 1370653 1321667 1274718 1229886 1187088 1146241 1107993 1074068 1046090 1024032 1006357
63317A006357j4858j2842j1029q647m680P78N998R499J1665J3600J5486J7351
$$ 1006357 991499 978657 967628 958981 954301 955079 961077 970576 982241 995841 1011327 1028678
63305A028678K0231K4498K7948K8028K5972K6170L0769L7148M1689M4062M6285
$$ 1028678 1048909 1073407 1101355 1129383 1155355 1181525 1212294 1249442 1291131 1335193 1381478
63294A381478M9168N1609N2543N1916M9901M6369M1077L3721K4306J3973M804
$$ 1381478 1430646 1482255 1534798 1586714 1636615 1682984 1724061 1757782 1782088 1796061 1800865
63283A800865k006p104j1478j4970j7148j8606k0167k1806k3688k7247l3264l9723
$$ 1800865 1798859 1791755 1780277 1765307 1748159 1729553 1709386 1687580 1663892 1636645 1603381 1563658
63271A563658m3724m5247m6728m8950m9895m8204m5273m2678l9639l4775k8844
$$ 1563658 1519934 1474687 1427959 1379009 1329114 1280910 1235637 1192959 1153320 1118545 1089701
63260A089701k3750j9809j5791j1283p498n966p508j2147j8822k5236k9120k9815
$$ 1089701 1065951 1046142 1030351 1019068 1011570 1005604 998096 985949 967127 941891 912771 882956
63248H82956k8197k5451k2516k0238j8937j8015j6755j5228j3810j2281j0338
$$ 882956 854759 829308 806792 786554 767617 749602 732847 717619 703809 691528 681190
63237F81190q469p293o473n450m791n293o083n422l536k769m229o021n912m346
$$ 681190 672721 665428 658955 653505 648714 643421 637338 631916 628380 625611 621382 615361 609449 605103
63223F05103l411l778m257l914l151k631k299j781r94o9Q05J373J566J804K657
$$ 605103 601692 597914 593657 589743 586592 583961 581662 579881 578887 578818 579623 580996 582562 584366 587023
63208E87023M061N269N681N487N338N574N943O045N954O135O625O663N709M693
$$ 587023 591084 596353 602034 607521 612859 618433 624376 630421 636375 642510 649135 655798 661507 666200
63194F66200N428Q435J2022J4065J4275J4181J5168J7040J8456J8358J7215J6899
$$ 666200 671628 680063 692085 706150 720425 734606 749774 766814 785270 803628 820843 837742
63182H37742J9004K2980K6663K8970L1195L4860L9152M1806M2095M1491M1484
$$ 837742 856746 879726 906389 935359 966554 1001414 1040566 1082372 1124467 1165958 1207442
63171A207442M2138M2936M3508M3104M0917L7733L5952L6787L8475L8538L7014
$$ 1207442 1249580 1292516 1336024 1379128 1420045 1457778 1493730 1530517 1568992 1607530 1644544
63160A644544L5989L6445L7158L6729L5096L2666K9187K4183J7789J0576L072
$$ 1644544 1680533 1716978 1754136 1790865 1825961 1858627 1887814 1911997 1929786 1940362 1943434
63149A943434m190j0750j6742k2798k9016l4507l8293m0199m0528l9497l7443
$$ 1943434 1939244 1928494 1911752 1888954 1859938 1825431 1787138 1746939 1706411 1666914 1629471
63138A629471l4964l2105k7957k1869j4813q689m290o89L366Q180J3286J8146
$$ 1629471 1594507 1562402 1534445 1512576 1497763 1489074 1484784 1484095 1487461 1495641 1508927 1527073
63126A527073K2304K5426K7614K9487L1658L4251L6905L8914L9417L7964L5198
$$ 1527073 1549377 1574803 1602417 1631904 1663562 1697813 1734718 1773632 1813049 1851013 1886211
63115A886211L2616L1215L0547K9288K6659K3070J9435J5964J1785N942j284q574
$$ 1886211 1918827 1950042 1980589 2009877 2036536 2059606 2079041 2095005 2106790 2112732 2111448 2102874
63103B102874j5306k2429l0864l9629m6838n2296n7496o2736o5936o5399o2351
$$ 2102874 2087568 2065139 2034275 1994646 1947808 1895512 1838016 1775280 1709344 1643945 1581594
63092A581594n9295n6842n3850n0091m6761m4327m1702l8032l3810k9625k5214
$$ 1581594 1522299 1465457 1411607 1361516 1314755 1270428 1228726 1190694 1156884 1127259 1102045
63081A102045k0535j6645j4511j3741j3324j2784j1885j0184p967o643o896p133
$$ 1102045 1081510 1064865 1050354 1036613 1023289 1010505 998620 988436 980469 973826 966930 959797
63069I59797n339j977O39J710K742M682O200N839M319L447L725M413N239O441
$$ 959797 954458 952481 953120 954830 957572 962254 968454 974293 978612 982059 985784 990197 995436 1001877
63055A001877P491P228N624M277M611O341Q045Q691Q122O631M736L235K763L052
$$ 1001877 1009368 1016596 1022220 1026497 1031108 1037449 1045494 1054185 1062307 1068938 1073674 1076909 1079672 1082724
63041A082724K912J451p14j854j065O21J553J585J932L003L662L168K644L467
$$ 1082724 1085636 1087087 1086373 1084519 1083454 1084075 1085628 1087213 1089145 1092148 1095810 1098978 1101622 1105089
63027A105089N080N810N383N131N842O939P890Q869R694R653R089R718J2436J5937
$$ 1105089 1110169 1115979 1121362 1126493 1132335 1139274 1147164 1156033 1165727 1175380 1184469 1194187 1206623 1222560
63013A222560J8527K0147K1554K2724K3523K4989K8141L2123L5268L7657M0798
$$ 1222560 1241087 1261234 1282788 1305512 1329035 1354024 1382165 1414288 1449556 1487213 1528011
63002A528011M4955M8663N1228N3862N7732O2312O6507P0179P3870P8016Q3027
$$ 1528011 1572966 1621629 1672857 1726719 1784451 1846763 1913270 1983449 2057319 2135335 2218362
62991B218362Q9077R5112R9142J00230R9453R8393R7664R7287R7141R6370R3876
$$ 2218362 2307439 2402551 2501693 2601923 2701376 2799769 2897433 2994720 3091861 3188231 3282107
62980C282107R0375Q8457Q9225R0295Q8741Q4805Q0715P6880P1603O4029N4860
$$ 3282107 3372482 3460939 3550164 3640459 3729200 3814005 3894720 3971600 4043203 4107232 4162092
62969D162092M4079L0366J3463m720k2107l8121n2865o6209p8266q9269r8211
$$ 4162092 4206171 4236537 4250000 4245280 4223173 4185052 4132187 4065978 3987712 3898443 3800232
62958C800232j03031j02959r9496r4270q7295p8197o7837n7347m6582l4756k1986
$$ 3800232 3697201 3594242 3494746 3400476 3313181 3234984 3167147 3109800 3063218 3028462 3006476
62947C006476r226K616J2694K0405K6660L3914M3483N3514O1001O5105O7027O7433
$$ 3006476 2997250 2999866 3012560 3032965 3059625 3093539 3137022 3190536 3251537 3316642 3383669 3451102
62935C451102O6063O3666O2022O1522O0444N7471N3459M9709M5586L9102K9279
$$ 3451102 3517165 3580831 3642853 3704375 3764819 3822290 3875749 3925458 3971044 4010146 4039425
62924D039425J6960L493j0490k4990l9967n5077o9900q4186r7672j09702j19325
$$ 4039425 4056385 4059878 4049388 4024398 3984431 3929354 3859454 3775268 3677596 3567894 3448569
62913C448569j25931j29429j29685j26521j20789j14694j09930j05777j00122
$$ 3448569 3322638 3193209 3063524 2937003 2816214 2701520 2591590 2485813 2385691
62904B385691r2290q3869p6668p0899o5651o0387n5428n1584m9447m8661m7889
$$ 2385691 2293401 2209532 2132864 2061965 1996314 1935927 1880499 1828915 1779468 1730807 1682918
62893A682918m6053m3487m1174l9137l6658l3921l2089l1536l1336l0872l0542
$$ 1682918 1636865 1593378 1552204 1513067 1476409 1442488 1410399 1378863 1347527 1316655 1286113
62882A286113l0308k9029k6218k3193k1311k0055j8156j5750j3921j2776j1448
$$ 1286113 1255805 1226776 1200558 1177365 1156054 1135999 1117843 1102093 1088172 1075396 1063948
62871A063948r788q618q316q371q418q605q725p934n771k941r22r97l195n750
$$ 1063948 1054160 1045542 1037226 1028855 1020437 1011832 1003107 995173 989402 986461 985539 984542 981347 975597
62857I75597o215m146k145l092o571r365r348p415n471m160l312l221m287o099
$$ 975597 969382 965236 963091 959999 953428 944063 934715 927300 921829 917669 914357 911136 906849 900750
62843I00750p767q771q867p805n831m044l458l832l986l130j490K11J515K397
$$ 900750 892983 884212 875345 867540 861709 857665 854207 850375 846389 843259 841769 841980 843495 845892
62829H45892K921K793J635j39j214q15J30J14q78j528j323j117j290r20M70J607
$$ 845892 848813 851606 853241 853102 851888 851073 851203 851317 850439 848911 847588 846471 845181 844261 844731 846338
62813H46338J144l39j198r13k28L24Q41J249J195O82Q0l51m17J33J002J289Q06
$$ 846338 847482 847143 845945 845032 844804 845128 845969 847218 848413 849095 849175 848824 848407 848540 849542 850831 851637
62796H51637P82K164L931M374L539K845K667K084R74M76Q79Q61l90j761j977j523
$$ 851637 852419 854583 858514 862888 866427 869272 871939 874023 874997 875473 876352 877213 876823 875062 873085 871562
62780H71562j619k124j825l38J391K400K626K481K113J276j27j374j074J395M594
$$ 871562 869943 867819 865994 865656 867047 869447 872073 874554 876667 877943 877816 876442 875368 876763 881357
62765H81357N988M582J985O40J645M457P723R845R642P419N058M322N352P029
$$ 881357 887345 891927 893912 894552 896197 900654 908377 918222 927864 935283 940341 944663 950015 957044
62751I57044Q264Q614Q420Q821J0914J4278J7081J8214J8551J9325K0302K0579
$$ 957044 965308 973922 982342 991163 1002077 1016355 1033436 1051650 1070201 1089526 1109828 1130407
62739A130407K0476K1368K3962K7770L1908L5552L8085L9879M2470M6877N2171
$$ 1130407 1150883 1172251 1196213 1223983 1255891 1291443 1329528 1369407 1411877 1458754 1510925
62728A510925N6819O0909O5721P1584P7782Q4381R2305J01338J09717J16315J21893
$$ 1510925 1567744 1628653 1694374 1765958 1843740 1928121 2020426 2121764 2231481 2347796 2469689
62717B469689J27636J33530J38696J42086J42441J38772J31562J22296J11150
$$ 2469689 2597325 2730855 2869551 3011637 3154078 3292850 3424412 3546708 3657858
62708C657858R6311P6493N3086K8876N562j6592l7675n7829p7298r5468j10409
$$ 3657858 3754169 3830662 3883748 3912624 3918186 3901594 3863919 3806090 3728792 3633324 3522915
62697C522915j20627j26925j31369j34692j35952j34593j31528j27767j23039
$$ 3522915 3402288 3275363 3143994 3009302 2873350 2738757 2607229 2479462 2356423
62688B356423j16473j08223r9850r2953q7507q1777p4279o5754n8494n3436m8991
$$ 2356423 2239950 2131727 2031877 1938924 1851417 1769640 1695361 1629607 1571113 1517677 1468686
62677A468686m3439l7478l3088l0521k8065k4661k1160j8511j6168j3107r448
$$ 1468686 1425247 1387769 1354681 1324160 1296095 1271434 1250274 1231763 1215595 1202488 1193040
62666A193040o036l073r1L017N870Q356J0718J2793J3986J4314J4988J7431K1893
$$ 1193040 1187004 1183931 1183840 1186857 1192727 1201083 1211801 1224594 1238580 1252894 1267882 1285313 1307206
62653A307206K7386L2830L7849M2479M6602N0071N3276N7252O3102P1073Q0067
$$ 1307206 1334592 1367422 1405271 1447750 1494352 1544423 1597699 1654951 1718053 1789126 1869193
62642A869193Q8193R4453R9937J06765J15497J24227J30767J34952J37884J39540
$$ 1869193 1957386 2051839 2151776 2258541 2374038 2498265 2629032 2763984 2901868 3041408
62632C041408J38534J34019J26419J16105J02704Q6207O7577M7598K6045K678
$$ 3041408 3179942 3313961 3440380 3556485 3659189 3745396 3812973 3860571 3886616 3889294
62622C889294k1751m5975o8871q9208j05842j18854j29503j38363j44443j46834
$$ 3889294 3867543 3821568 3752697 3663489 3557647 3438793 3309290 3170927 3026484 2879650
62612B879650j46030j42758j36927j28977j20889j14208j08093j01033r3485q6800
$$ 2879650 2733620 2590862 2453935 2324958 2204069 2089861 1981768 1880735 1787250 1700450
62602A700450q0468p2878o4475n7541n2783m8611m4175m0630l8459l5922l1607
$$ 1700450 1619982 1547104 1482629 1425088 1372305 1323694 1279519 1238889 1200430 1164508 1132901
62591A132901k6710k3320k1722k0758j9672j8303j6510j4679j3906j4404j4584
$$ 1132901 1106191 1082871 1061149 1040391 1020719 1002416 985906 971227 957321 942917 928333
62580I28333j2910j0062p943p200o939o391n643m949m312l637k657j148K12P2
$$ 928333 915423 905361 897418 890218 883279 876888 871245 866296 861984 858347 855690 854542 854754 854826
62566H54826j653k983k161kJ491K051L047M775N786N174L954L714N070P804J1334
$$ 854826 853173 850190 848029 848027 849518 851569 854616 859391 865177 870351 874305 878019 883089 890893 902227
62551I02227J4477J5932J5746J5544J6688J8929K1365K3914K6974L0258L3000
$$ 902227 916704 932636 948382 963926 980614 999543 1020908 1044822 1071796 1102054 1135054
62540A135054L5155L7508M0560M4018M7563N1470N5889N9922O2195O2533O2290
$$ 1135054 1170209 1207717 1248277 1292295 1339858 1391328 1447217 1507139 1569334 1631867 1694157
62529A694157O2521O2336N9935N4902M8425M1167L2258K0968Q266m163j5687k6527
$$ 1694157 1756678 1819014 1878949 1933851 1982276 2023443 2055701 2076669 2084935 2080772 2065085 2038558
62517B038558l6485m4967n1896n7547o1704o3881o4228o3326o1331n8214n4576
$$ 2038558 2002073 1957106 1905210 1847663 1785959 1722078 1657850 1594524 1533193 1474979 1420403
62506A420403n1197m8022m4589m1277l8914l7286l5327l2799l0375k7910k4317
$$ 1420403 1369206 1321184 1276595 1235318 1196404 1159118 1123791 1090992 1060617 1032707 1008390
62495A008390j9698j5974j4298j3157j0377o269l279k817l735m061l237k253k038
$$ 1008390 988692 972718 958420 945263 934886 928617 925338 922521 918786 914725 911488 909235 907197
62482I07197k255j746r1J716K535K724L731O013Q295R235R103R268J0608J2898
$$ 907197 904942 903196 903105 904821 907356 910080 913811 919824 928119 937354 946457 955725 966333 979231
62468I79231J5382J7424J8912K0334K2269K4747K7585L1176L6115M1924M7129
$$ 979231 994613 1012037 1030949 1051283 1073552 1098299 1125884 1157060 1193175 1235099 1282228
62457A282228N1071N4728N9308O4884P0808P6454Q0917Q3049Q2723Q1213P9370
$$ 1282228 1333299 1388027 1447335 1512219 1583027 1659481 1740398 1823447 1906170 1987383 2066753
62446B066753P6306P0810O3190N4406M4281L2155J8874O555l664j2395k0556k8282
$$ 2066753 2143059 2213869 2277059 2331465 2375746 2407901 2426775 2433330 2429666 2417271 2396715 2368433
62434B368433l5147m0291m2464m1101l7382l3036k8250k1864j3605m662L971J2266
$$ 2368433 2333286 2292995 2250531 2209430 2172048 2139012 2110762 2088898 2075293 2070631 2074602 2086868
62422B086868K0062K6818L2928L9725M7375N4141N8585O1153O2513O1652N7120
$$ 2086868 2106930 2133748 2166676 2206401 2253776 2307917 2366502 2427655 2490168 2551820 2608940
62411B608940M9260L9660K8972J6795L430r921k2884l6505n1401o6223p8571q7129
$$ 2608940 2658200 2697860 2726832 2743627 2747057 2737136 2714252 2677747 2626346 2560123 2481552 2394423
62399B394423r2373r5504r7111r7024r5084r1667q7230q1673p4624o6375n8033
$$ 2394423 2302050 2206546 2109435 2012411 1917327 1825660 1738430 1656757 1582133 1515758 1457725
62388A457725n0671m4680l9812l5354l0362k4508j8800j4614j1960r605p115n506
$$ 1457725 1407054 1362374 1322562 1287208 1256846 1232338 1213538 1198924 1186964 1177359 1170244 1164738
62376A164738n352n584n005l860k906k127j674k916o728j1356j3940j4014j3757
$$ 1164738 1159386 1153802 1148797 1144937 1142031 1139904 1138230 1135314 1128586 1117230 1103290 1089276 1075519
62363A075519j4840j6747j8390j9547k0079j9397j7583j5816j4776j3737j2108
$$ 1075519 1060679 1043932 1025542 1005995 985916 966519 948936 933120 918344 904607 892499
62352H92499j0780j0812j1581j1490j0070q353p282o726o067n132m286l910l790
$$ 892499 881719 870907 859326 847836 837766 829413 822131 815405 809338 804206 799920 796010 792220
62339G92220l157j621O6Q18P39J022K102K976K848K367K533L223L807M347N236
$$ 792220 789063 787442 787508 788326 789065 790087 792189 795165 798013 800380 802913 806136 809943 814290 819526
62324H19526O183O772P462Q837J0179J0146Q865Q080R058J1335J3786J5972J8099
$$ 819526 825709 832481 839943 848780 858959 869105 877970 886050 895108 906443 920229 936201 954300
62311I54300K0371K2802K5116K6754K7492K8085K9543L1763L3688L4950L6532
$$ 954300 974671 997473 1022589 1049343 1076835 1104920 1134463 1166226 1199914 1234864 1271396
62300A271396L9540M4120M9793N5996O1892O6551O9930P2904P5807P7569P7018
$$ 1271396 1310936 1355056 1404849 1460845 1522737 1589288 1659218 1732122 1807929 1885498 1962516
62289A962516P4271P0052O4179N5710M4506L1809J9266P930j968j0851j9451k8145
$$ 1962516 2036787 2106839 2171018 2226728 2271234 2303043 2322309 2330239 2328271 2317420 2297969 2269824
62277B269824l6562m4052n0281n5043n7929n8697n7789n5852n3038m9426m5810
$$ 2269824 2233262 2189210 2138929 2083886 2025957 1967260 1909471 1853619 1800581 1751155 1705345
62266A705345m3062m0734l7438l2977k9158k7733k8297k9034k9076k9107k9840
$$ 1705345 1662283 1621549 1584111 1551134 1521976 1494243 1465946 1436912 1407836 1378729 1348889
62255A348889l0981l1937l2529l2560l1471k9285k7310k6872k7440k6992k4421
$$ 1348889 1317908 1285971 1253442 1220882 1189411 1160126 1132816 1105944 1078504 1051512 1027091
62244A027091k0651j7093j4041j1286r316q699q735q025o322m596l262j594O83
$$ 1027091 1006440 989347 975306 964020 954704 946005 937270 929245 922923 918327 915065 913471 914154
62231I14154K472K776K235K277L244M262M635M541M526M933N828O937P836Q491
$$ 914154 916626 919402 921637 923914 927158 931420 936055 940596 945122 950055 955883 962820 970656 979147
62217I79147R371J0721J2105J3141J4188J5753J7614J9188K0367K1351K2203K3334
$$ 979147 988518 999239 1011344 1024485 1038673 1054426 1072040 1091228 1111595 1132946 1155149 1178483
62205A178483K5901L0480L5697L9534M1997M5120N0111N5867O0915O5485P0690
$$ 1178483 1204384 1234864 1270561 1310095 1352092 1397212 1447323 1503190 1564105 1629590 1700280
62194A700280P6583Q2063Q6232Q8867Q9804Q8721Q5396P9665P1134N9501M5234
$$ 1700280 1776863 1858926 1945158 2034025 2123829 2212550 2297946 2377611 2448745 2508246 2553480
62183B553480K9684J4509Q45j1310k3048l5398m8131o0015p0173p8442q4413q7316
$$ 2553480 2583164 2597673 2598518 2587208 2564160 2528762 2480631 2420616 2350443 2272001 2187588 2100272
62171B100272q7417q6428q5555q3972q0202p4425o8210o2468n6897n1227m5766
$$ 2100272 2012855 1926427 1840872 1756900 1676698 1602273 1534063 1471595 1414698 1363471 1317705
62160A317705m0651l5727l1318k8079k5895k3852k1534j9336j7337j4941j2179
$$ 1317705 1277054 1241327 1210009 1181930 1156035 1132183 1110649 1091313 1073976 1059035 1046856
62149A046856j0216r719r562q140n454k965j790j821k405k944k713r95K172N654
$$ 1046856 1036640 1026921 1017359 1009219 1003765 1000800 999010 997189 994784 991840 989127 988132 990304 995958
62135I95958Q020Q760Q712R232J0729J2200J2475J1898J2049J3697J5741J6612
$$ 995958 1003978 1012738 1021450 1030682 1041411 1053611 1066086 1077984 1090033 1103730 1119471 1136083
62123A136083J6111J5263J4963J5411J6455J7596J7906J6861J5191J4207J4394
$$ 1136083 1152194 1167457 1182420 1197831 1214286 1231882 1249788 1266649 1281840 1296047 1310441
62112A310441J5418J7298K0460K4532K8236L1015L3903L8048M3066M7557N0803
$$ 1310441 1325859 1343157 1363617 1388149 1416385 1447400 1481303 1519351 1562417 1609974 1660777
62101A660777N3279N5646N7861N9084N8046N3722M6152L6523K6287J6392P470
$$ 1660777 1714056 1769702 1827563 1886647 1944693 1998415 2044567 2081090 2107377 2123769 2131239
62090B131239L9o132j2339j9647k7480l4280l9445m3674m7342m9593m9510m7401
$$ 2131239 2131278 2125146 2112807 2093160 2065680 2031400 1991955 1948281 1900939 1851346 1801836 1754435
62078A754435m4239m0354l5387k9390k3390j8784j6231j5043j3635j0983p681
$$ 1754435 1710196 1669842 1634455 1605065 1581675 1562891 1546660 1531617 1517982 1506999 1499318
62067A499318n176l973l318k738k738l266k570R03N862R048Q970P379O468N890
$$ 1499318 1494142 1490169 1486851 1484113 1481375 1478109 1475539 1476442 1482304 1491352 1500322 1507701 1514169 1520059
62053A520059L654q73o018r657j0940j0252q486o759o136p063r106j1373j3123
$$ 1520059 1523713 1522840 1516822 1507165 1496225 1485973 1477487 1470728 1464592 1457529 1448423 1437050 1423927
62040A423927j4067j4356j4314j3972j2870j0634p623m609j945N63K888M488N042
$$ 1423927 1409860 1395504 1381190 1367218 1354348 1343714 1336091 1331482 1329537 1330100 1332988 1337476 1342518
62027A342518N045N361O392P939R643J1336J3180J5516J8293K0659K1579K1185
$$ 1342518 1347563 1352924 1359316 1367255 1376898 1388234 1401414 1416930 1435223 1455882 1477461 1498646
62015A498646K0964K2175K4511K6780K8370K9409K9863K9477K8676K8667L0286
$$ 1498646 1519610 1541785 1566296 1593076 1621446 1650855 1680718 1710195 1738871 1767538 1797824
62004A797824L3152L6148L8394L9772M0866M2300M3708M3547M0530L5091K8567
$$ 1797824 1830976 1867124 1905518 1945290 1986156 2028456 2072164 2115711 2156241 2191332 2219899
61993B219899K1278J2616L166m904j0455j5158k1424k9391l7276m4089n0407n6546
$$ 2219899 2241177 2253793 2256959 2252055 2241600 2226442 2205018 2175627 2138351 2094262 2043855 1987309
61981A987309o1515o4285o5042o4661o3674o2178o0187n7621n4365n0610m6771
$$ 1987309 1925794 1861509 1796467 1731806 1668132 1605954 1545767 1488146 1433781 1383171 1336400
61970A336400m2956l8977l4975l1472k8717k6513k4874k4136k4121k3781k2182
$$ 1336400 1293444 1254467 1219492 1188020 1159303 1132790 1107916 1083780 1059659 1035878 1013696
61959A013696j9532j6927j5388j5242j5981j6480j5814j4151j2388j0892r223
$$ 1013696 994164 977237 961849 946607 930626 914146 898332 884181 871793 860901 851678
61948H51678p233n596m803m380l642k542j212N55K599L940M035L869M628N656
$$ 851678 844445 838849 834046 829666 826024 823482 822270 822825 825424 829364 833399 837268 841896 847552
61934H47552N125K692K37m87J55N18k83j847l408m617n582o617p880r114r824
$$ 847552 852677 855369 855606 855119 855274 855792 855509 853662 850254 845637 840055 833438 825558 816444 806620
61919H06620r801r285q570p781p059o637o523o332n669m601l652l293l420l368
$$ 806620 796819 787534 778964 771183 764124 757487 750964 744632 738963 734362 730710 727417 723997 720629
61905G20629k630j593j181j671k298k234j488l87J166L267N229O132N895N133
$$ 720629 717999 716406 715225 713554 711256 709022 707534 707147 708313 711580 716809 722941 728836 733969
61891G33969M236L466L676N630Q555J0586J1075J1410J2904J4939J6062J6192
$$ 733969 738205 741671 745347 750977 759532 770118 781193 792603 805507 820446 836508 852700
61879H52700J6683J8399K0587K1845K1697K1074K1241K2286K2833K1581J8958
$$ 852700 869383 887782 908369 930214 951911 972985 994226 1016512 1039345 1060926 1079884
61868A079884J6613J5323J4257J2491J0328Q491O848M708J953q75l319n194o274
$$ 1079884 1096497 1111820 1126077 1138568 1148896 1157387 1164235 1168943 1170896 1170021 1166702 1161508 1155234
61855A155234o375n632m255k263J46K370M134O077Q960J2413J5162J6460J6721
$$ 1155234 1148859 1143227 1138972 1136709 1136855 1139225 1143359 1149436 1158396 1170809 1185971 1202431 1219152
61842A219152J6668J6368J5199J2504Q328L697n0k544m856q225j2528j6398j8634
$$ 1219152 1235820 1252188 1267387 1279891 1288219 1291916 1291866 1289322 1284466 1276241 1263713 1247315 1228681
61829A228681j9041j8143j6796j6027j6489j7751j8589j8219j7003j5865j5362
$$ 1228681 1209640 1191497 1174701 1158674 1142185 1124434 1105845 1087626 1070623 1054758 1039396
61818A039396j5442j5723j5680j4824j3053j0834q814p252n980m887m236m095
$$ 1039396 1023954 1008231 992551 977727 964674 953840 945026 937774 931794 926907 922671 918576
61806I18576l721k069P93L428M783N674P550J0243J2229J3194J4766J8092K2050
$$ 918576 914855 912786 913579 917007 921790 927464 935014 945257 957486 970680 985446 1003538 1025588
61793A025588K4886K6553K8181L0095L1798L3433L5680L8173L9315L7967L4519
$$ 1025588 1050474 1077027 1105208 1135303 1167101 1200534 1236214 1274387 1313702 1351669 1386188
61782A386188L0227K6220K3122K0713J7883J3642Q257K784k212o656j0008j1549
$$ 1386188 1416415 1442635 1465757 1486470 1504353 1517995 1526252 1529036 1526824 1520168 1510160 1498611
61770A498611j1484j0632q925n567q84L352N943P447Q833J0020J0413R823Q131
$$ 1498611 1487127 1476495 1467570 1462003 1461119 1464471 1470414 1477861 1486694 1496714 1507127 1516950 1525081
61757A525081M929L10m786r670j4595j9763k4515k8282l1317l3700l4622l3813
$$ 1525081 1530010 1530320 1525534 1515864 1501269 1481506 1456991 1428709 1397392 1363692 1329070 1295257
61745A295257l2669l2488l2321l0272k6476k3048k1077j9515j7477j5860j5687
$$ 1295257 1262588 1230100 1197779 1167507 1141031 1117983 1096906 1077391 1059914 1044054 1028367
61734A028367j6197j5830j4444j3232j2731j2071j0353p944n988n105n055n392
$$ 1028367 1012170 996340 981896 968664 955933 943862 933509 925565 919577 914472 909417 904025
61722I04025n871o228o118n561n002m520l443j536j13p97l110m579l800k217j910
$$ 904025 898154 891926 885808 880247 875245 870725 867282 865746 865633 864836 861726 857147 853347 851130 849220
61707H49220k654k489o63J504K560K482K108K047K474L143L401K710J412L88R3
$$ 849220 846566 844077 843414 844918 847478 849960 852068 854115 856589 859732 863133 865843 867255 867643 867736
61692H67736M64J511K995L719K475p5j748j580r93j505k562k692j900j435j700
$$ 867736 868200 869711 872706 876425 878900 878825 877077 875497 874504 872999 870437 867745 865845 864410 862710
61677H62710j893j723k003l122l922l018p65R29Q77J30P26L108N430N802M530
$$ 862710 860817 859094 857091 853969 850047 847029 846264 847193 848070 848200 848926 852034 857464 863266 867796
61662H67796L309K644J456o31k112j589K29J626K125K392K540K028R99K54j98
$$ 867796 871105 873749 875205 874574 872462 870873 871102 872728 874853 877245 879785 881813 882812 883066 882868
61647H82868j203k889m279m807n014n250m965l985l368l963n026n418n418o085
$$ 882868 881665 878776 874497 869690 864676 859426 854461 850476 847108 843145 838119 832701 827283 821198
61633H21198p248p584o726n972o392p244o988n432m084m290n482n639l624p49
$$ 821198 813950 806366 799640 793668 787276 780032 773044 767612 763528 759238 753756 748117 744493 743744
61619G43744M80p73k746l382k798k723l935n400n889n358m367l005j136P44J601
$$ 743744 744224 743451 740705 737323 734525 731802 727867 722467 716578 711220 706853 703848 702712 703456 705057
61604G05057R09o63j800j778j126q62j055o51R96L020M255M962O185P568P326
$$ 705057 705966 705303 703503 701725 700599 699737 698682 698031 699027 702047 706302 711264 717449 725017 732343
61589G32343M850K005R05J360J725J537J915L432N041N491M878M063L250J924
$$ 732343 737193 739198 740103 741463 743188 744725 746640 750072 755113 760604 765482 769545 772795 774719
61575G74719K1j654k449k791l526m501m485k904j037p75k395m343n273n383n513
$$ 774719 774740 773086 770637 767846 764320 759819 755334 752430 751393 750618 748223 743880 738607 733224 727711
61560G27711n838o053o246o793p646q283q203p127n173l213k499l285m289m285
$$ 727711 721873 715820 709574 702781 695135 686852 678649 671522 666349 663136 660637 657352 653063 648778
61546F48778l865m657o966r161r656q669p627p352p295o473m773l148k492k601
$$ 648778 644913 640256 633290 624129 614473 605804 598177 590825 583530 577057 572284 569136 566644 564043
61532E64043k622k420k654l425l810l238k459k283k219j304K91J587K124J931
$$ 564043 561421 559001 556347 552922 549112 545874 543415 541132 538913 537609 537900 539487 541611 543542
61518E43542P95j154k660k650j924j971k498k003o09n2n43j77J650K698J268r00
$$ 543542 544337 543183 540523 537873 535949 533978 531480 529477 528868 528816 528273 528096 529746 532444 533712 532812
61502E32812j102N68K052K731L566M481M166K547J308J431J979J897J467J232
$$ 532812 531710 532278 534330 537061 540627 545108 549274 551821 553129 554560 556539 558436 559903 561135
61488E61135Q00k66j273j089L83K146L110K703R61j280k560j890K04K168K963
$$ 561135 561935 561669 560396 559307 559690 561836 564946 567649 568610 567330 564770 562880 563084 565252 568215
61473E68215K837K504K092J312M21K03P92J168N14m96o64j90m48j786k878k771
$$ 568215 571052 573556 575648 576960 577381 577584 578376 579544 580058 579562 578898 578708 578260 576474 573596 570825
61457E70825k177k028j974j403q96j207j699j287m35m95j378j653r95o85j171
$$ 570825 568648 566620 564646 563243 562347 561140 559441 558154 557719 557224 555846 554193 553198 552513 551342
61442E51342j057O02K507K887J920J033N79j58j081j052J96J370J361P57Q17J653
$$ 551342 550285 550887 553394 556281 558201 559234 559813 559655 558574 557522 557718 559088 560449 561206 562023 563676
61426E63676K348K462K398K317J755O51j50r6J27k60n96L78K353L571L290K742
$$ 563676 566024 568486 570884 573201 574956 575607 575457 575361 575488 575228 574632 575010 577363 580934 584224 586966
61410E86966L019L369K580J109M61J007J671J576R40L25n7k55m23p42j043p69
$$ 586966 589985 593354 595934 597043 597504 598511 600182 601758 602698 603023 602966 602711 602288 601546 600503 599734
61394E99734J75R89J066J028J762K902L206K267R02O3K01J270K519K755J855J408
$$ 599734 599909 600898 601964 602992 604754 607656 610862 613129 614031 614094 614295 615565 618084 620839 622694 624102
61378F24102K514L681K731L06o86P91K650L127L152M147N388N247L677J922O38
$$ 624102 626616 630297 633028 633334 632648 633439 636089 639216 642368 646515 651903 657150 660827 662749 663387
61363F63387k58o32l08L34R60J843L001L524K812J681J103N90q64k792l661l049
$$ 663387 663129 662497 662189 662523 663483 665326 668327 671851 674663 676344 677447 678037 677173 674381 670720 667671
61347F67671k116j961k556l326l822l791l335k976k917k499j132N90J513J460
$$ 667671 665555 663594 661038 657712 653890 650099 646764 643788 640871 638372 637240 637830 639343 640803
61333F40803J218J265J454J782K408K912K530J312K33k2L51R49J689K447K848
$$ 640803 642021 643286 644740 646522 648930 651842 654372 655684 655917 655895 656246 657195 658884 661331 664179
61318F64179K738K459K509L146M228N154N231M462L646L153K189J42j842j830
$$ 664179 666917 669376 671885 675031 679259 684413 689644 694106 697752 700905 703094 703236 701394 699564
61304F99564L78K833L763L359K983L421M373N043M893M245M279N983Q907J1452
$$ 699564 699942 702775 706538 709897 712880 716301 720674 725717 730610 734855 739134 745117 754024 765476
61290G65476J2441J2053J1283J0972J1354J1885J1578J0069Q266P289O997O341
$$ 765476 777917 789970 801253 812225 823579 835464 847042 857111 865377 872666 879663 886004
61278H86004N059M044M027M738N496N762N154L788K584K265K104R17q16j356m19
$$ 886004 891063 895107 899134 903872 909368 915130 920284 924072 926656 928921 931025 931942 931126 929770 929351
61263I29351K51l45r46k33J091J801K271L437M815N386N601O635Q090Q484P795
$$ 929351 929602 929257 928311 928078 929169 930970 933241 936678 941493 946879 952480 959115 967205 975689 983484
61248I83484P693R104J1363J3863J6687J9139J9470J7048J3383J0127P321M567
$$ 983484 991177 1000281 1011644 1025507 1042194 1061333 1080803 1097851 1111234 1121361 1128682 1133249
61236A133249K477J467K53k706o749r723j0951j1787j3113j4008j3531j2416j1874
$$ 1133249 1135726 1137193 1137446 1134740 1127991 1118268 1107317 1095530 1082417 1068409 1054878 1042462 1030588
61223A030588j1704j0901r618r101r558r352o974l115l0R60P14J045K816N320
$$ 1030588 1018884 1007983 998365 989264 979706 970354 963380 960265 960235 961195 961909 962954 965770 971090
61209I71090P175P523O608N451M982N271N654N625N490N963P204Q542R178Q969
$$ 971090 978265 985788 992396 997847 1002829 1008100 1013754 1019379 1024869 1030832 1038036 1046578 1055756 1064725
61195A064725Q358P731P028N978M556L120K234K347L473M998N886N357L607J683
$$ 1064725 1073083 1080814 1087842 1093820 1098376 1101496 1103730 1106077 1109550 1114548 1120434 1125791 1129398 1131081
61181A131081N21J36p4m03n60l64k89j062k844m912o050n213k273J617M641N764
$$ 1131081 1131602 1131738 1131664 1131261 1130701 1130337 1130048 1128986 1126142 1121230 1115180 1109967 1107694 1109311 1113952 1119716
61165A119716N566N412O013P130Q296R180R348Q520P271O791P534Q689R312R419
$$ 1119716 1125282 1130694 1136707 1143837 1152133 1161313 1170661 1179181 1186452 1193243 1200777 1209466 1218778 1228197
61151A228197R426R185Q323P135O277N846N514N370N621N683M717L255L050M815
$$ 1228197 1237623 1246808 1255131 1262266 1268543 1274389 1279903 1285273 1290894 1296577 1301294 1304549 1307599 1312414
61137A312414P146Q361Q510Q767R690J1089J2912J4949J6014J4761J1450P877
$$ 1312414 1319560 1327921 1336431 1345198 1354888 1365977 1378889 1393838 1409852 1424613 1436063 1443940
61125A443940N325L426J267j274l647n325n969n417m135l248l659n171o682p124
$$ 1443940 1449265 1452691 1453958 1452684 1449037 1443712 1437743 1432326 1428191 1424943 1421284 1416113 1409431 1402307
61111A402307o219m705l897m642o524q318r295r730j0162j0700j1178j1604j2126
$$ 1402307 1396088 1391383 1387486 1382844 1376320 1368002 1358707 1348977 1338815 1328115 1316937 1305333 1293207
61098A293207j2886j4036j5520j6735j6767j5297j3083j1345j0699j0618r952
$$ 1293207 1280321 1266285 1250765 1234030 1217263 1201966 1188883 1177538 1166839 1156221 1146269
61087A146269q216o393n878o422o176m569l965o740j1454j4049j2834j0025p963
$$ 1146269 1138053 1131660 1125782 1119360 1113184 1108615 1104650 1097910 1086456 1072407 1059573 1049548 1041585
61074A041585o255l864j676r53p66P60L563O131Q198J0744J3522J4849J4270J3549
$$ 1041585 1035330 1031466 1029790 1028837 1028071 1028831 1032394 1038525 1046723 1057467 1070989 1085838 1100108 1113657
61060A113657J4413J6665J9167K1411K3414K5251K7339L0259L3479L5149L4252
$$ 1113657 1128070 1144735 1163902 1185313 1208727 1233978 1261317 1291576 1325055 1360204 1394456
61049A394456L2323L1940L3527L4760L3467L0434K8451K8700K9061K6645K1326
$$ 1394456 1426779 1458719 1492246 1527006 1560473 1590907 1619358 1648058 1677119 1703764 1725090
61038A725090J5605J1120O971J900l446p745j1268j5221j9430k2450k3813k4603
$$ 1725090 1740695 1751815 1758786 1760686 1757240 1749495 1738227 1723006 1703576 1681126 1657313 1632710
61026A632710k5646k6527k6769k6714k6761k6656k5986k4631k2587k0136j8233
$$ 1632710 1607064 1580537 1553768 1527054 1500293 1473637 1447651 1423020 1400433 1380297 1362064
61015A362064j7711j7841j6692j3417r363o472n164m234k327P77M010O012O513
$$ 1362064 1344353 1326512 1309820 1296403 1287040 1280568 1275404 1271170 1268843 1269620 1273630 1279642 1286155
61002A286155O634P514R144J1092J3632J7134K0894K3804K5861K7755K9478L0779
$$ 1286155 1292789 1300303 1309447 1320539 1334171 1351305 1372199 1396003 1421864 1449619 1479097 1509876
60990A509876L2490L5610L9279M1687M3044M5495M9713N3803N6477N9158O3684
$$ 1509876 1542366 1577976 1617255 1658942 1701986 1747481 1797194 1850997 1907474 1966632 2030316
60979B030316O9541P4800P8570Q1349Q3967Q7254R1907R7759J03962J10307J17346
$$ 2030316 2099857 2174657 2253227 2334576 2418543 2505797 2597704 2695463 2799425 2909732 3027078
60968C027078J24927J32015J38331J44643J51190J57559J64539J73914J86006
$$ 3027078 3152005 3284020 3422351 3566994 3718184 3875743 4040282 4214196 4400202
60959D400202J99878K16441K38240K64980K92876L20373L51110L88848M33206
$$ 4400202 4600080 4816521 5054761 5319741 5612617 5932990 6284100 6672948 7106154
60950G106154M83478N42534O12393O89523P70409Q59252R64181J088247J231355
$$ 7106154 7589632 8132166 8744559 9434082 10204491 11063743 12027924 13116171 14347526
60941A4347526J398766J598579J831586K093442K381341K671095K871551K828443
$$ 14347526 15746292 17344871 19176457 21269899 23651240 26322335 29193886 32022329
60933C2022329K424752J704334Q82685K11857j72774k81685j87801L5150K83088
$$ 32022329 34447081 36151415 37034100 37245957 37073183 36791498 36603697 36638847 36921935
60924C6921935L85078J68775m04712j183301j919411k428402k666328k690218
$$ 36921935 37307013 37475788 37071076 35887775 33968364 31539962 28873634 26183416
60916B6183416k579901k397655k186408j972989j767781j571047j383328j208086
$$ 26183416 23603515 21205860 19019452 17046463 15278682 13707635 12324307 11116221
60908A1116221j047617r02338p73914o64979n75679n03357m45219l98753l60355
$$ 11116221 10068604 9166266 8392352 7727373 7151694 6648337 6203118 5804365 5444010
60899E444010l26569k96470k70525k47592k25475k03931j84506j67536j51897
$$ 5444010 5117441 4820971 4550446 4302854 4077379 3873448 3688942 3521406 3369509
60890C369509j37697j26708j19619j14894j10734j06309j00877r3852q6253q0220
$$ 3369509 3231812 3105104 2985485 2870591 2759857 2653548 2552671 2458819 2372566 2292346
60880B292346p6324p2934o8787o4539o1196n8562n6003n3328n0231m6348m2590
$$ 2292346 2216022 2143088 2074301 2009762 1948566 1890004 1834001 1780673 1730442 1684094 1641504
60869A641504m0871m1476m2102m0751l8206l6222l4479l1409k7417k4940k4839
$$ 1641504 1600633 1559157 1517055 1476304 1438098 1401876 1367397 1335988 1308571 1283631 1258792
60858A258792k4632k1494j6007j1655j0919j2889j4769j4678j2660r825p437o365
$$ 1258792 1234160 1212666 1196659 1185004 1174085 1161196 1146427 1131749 1119089 1109264 1101827 1095462
60846A095462o376n996m091j590n79j445k284j686o89q59j746j870j283j284j975
$$ 1095462 1089086 1083090 1078999 1077409 1076830 1075385 1073101 1071415 1070726 1069867 1068121 1066251 1064968 1063684 1061709
60831A061709k159j712k123m187o775q551r663j0915j2310j3246j3344j2609j1524
$$ 1061709 1059550 1057838 1055715 1051528 1044753 1036202 1026539 1015624 1003314 990068 976724 964115 952591
60818I52591j1221j2463j4067j3707j1093q911r424j1375j1823j0174q398p692
$$ 952591 941370 928907 914840 901133 890040 881129 871705 860330 848507 838333 829935 822243
60806H22243o972n182l248k629l000k626p83J304K019J144j56o60JJ414K819L461
$$ 822243 815271 810089 806841 804212 801212 798586 797803 799107 801126 802270 802114 801454 801455 802869 805688 809149
60790H09149L041K121J685K003K311K037J799K415L307L027J391j24m82m40j120
$$ 809149 812190 814311 815996 817999 820310 822347 824146 826561 829868 832895 834286 834162 833680 833240 832120
60775H32120k260k896l015l309l677l326k337j848k310k611j633P2R48L62r06
$$ 832120 829860 826964 823949 820640 816963 813637 811300 809452 807142 804531 802898 802970 803918 804280 803374
60760H03374j985k868l828m520m370l694l724n200p271q321p780o634o096o268
$$ 803374 801389 798521 794693 790173 785803 782109 778385 773185 765914 757593 749813 743179 737083 730815
60746G30815o409o137n868o079o566o682o166n480n165n038m383l043j945k060
$$ 730815 724406 718269 712401 706322 699756 693074 686908 681428 676263 671225 666842 663799 661854 659794
60732F59794l136l964l828l093k376j799j331j186j478j857j926j650j076KJ617
$$ 659794 656658 652694 648866 645773 643397 641598 640267 639081 637603 635746 633820 632170 631094 631096 632713
60717F32713L227M211M511M480M315M128M260M977N982O723P000O888O264N054
$$ 632713 635940 640151 644662 649142 653457 657585 661845 666822 672804 679527 686527 693415 699679 704733
60703G04733L735K925K561K184J945K364K920K050p88l812m716l358j747j539
$$ 704733 708468 711393 713954 716138 718083 720447 723367 725417 724629 720817 716101 712743 710996 709457
60689G09457k567l832m859n528n447m378k912j967j709j726k038l123m785n943
$$ 709457 706890 703058 698199 692671 687224 682846 679934 677967 676258 674532 672494 669371 664586 658643
60675F58643o037n897o502p432p458o349n101m416l937l300k943l265l565k732
$$ 658643 652606 646709 640207 632775 625317 618968 613867 609451 605514 602214 599271 596006 592441 589709
60661E89709p47J105J574O32p26j514j475r83m71q1J04m4k86J81J830L795M569
$$ 589709 588962 590067 591641 592273 591547 590033 588558 587575 587104 587023 587127 587083 586797 586978 588808 592603 597172
60644E97172L880L041L127L647L686L457L794M594M973M775M832N502N941N270
$$ 597172 601052 604093 607220 610867 614553 618010 621804 626398 631371 636146 640978 646480 652421 657691
60630F57691L799K647K478L001L434L227K497J933K077K661K805J936M01q01p61
$$ 657691 661490 664137 666615 669616 673050 676277 678774 680707 682784 685445 688250 690186 690587 689786 689025
60615F89025O29K393L097K112K75j041j353j266j585k619m146n473n742m894m074
$$ 689025 689654 692047 695144 697256 697531 696490 695137 693871 692286 689667 685521 680048 674306 669412 665338
60600F65338m357n184m994l468k037j884k470k579j913q49N06K133L339L276K162
$$ 665338 660981 655797 650803 647335 645298 643414 640944 638365 636452 635603 636109 638242 641581 644857 647019
60585F47019J188J131J548J420J79j866l813m795m618l793k906k119j358o42l7
$$ 647019 648207 649338 650886 652306 652485 650619 646806 642011 637393 633600 630694 628575 627217 626575 626538
60570F26538M61P90Q27O62N01K01n67j476j599p13J01j76j075j343o67J70N62
$$ 626538 626999 627789 628616 629278 629779 629980 629413 627937 626338 625625 625726 625550 624475 623132 622465 622635 623197
60553F23197O42O45N84N58P16Q60P54P85J581K853L362K409P95k5M69J472J795
$$ 623197 623839 624484 625068 625626 626342 627202 627956 628741 630322 633175 636537 638946 639741 639716 640185 641657 643452
60536F43452J090J85J35R82J852K351L137M491N162L698O15j880k305j008R26
$$ 643452 644542 644727 644862 645844 647696 650047 653184 657675 662837 666535 667150 665270 662965 661957 662883
60521F62883K796M157M796N141N756O283N888M918M857O235P914R047J0339J2531
$$ 662883 665679 669836 674632 679773 685529 691812 697700 702618 707475 713710 721624 730671 741010 753541
60507G53541J4886J6309J6914J7203J6629J4441J1271Q390N886L066L45r33o63
$$ 753541 768427 784736 801650 818853 835482 849923 861194 869584 875470 878536 878881 877948 877285
60494H77285m79j626l462m439l748j627J120L602N395O843Q379R804J0907J2430
$$ 877285 876806 875180 871718 867279 863531 861904 863024 866626 872021 878864 887243 897047 907954 920384
60480I20384J5238J8671K1063K2084K3130K4926K6080K4933K1767J8139J4732
$$ 920384 935622 954293 975356 997440 1020570 1045496 1071576 1096509 1118276 1136415 1151147
60469A151147J0983O470J691k508n615p579q701r343r585r340q857q529q098o748
$$ 1151147 1162130 1168600 1170291 1167783 1162168 1154589 1145888 1136545 1126960 1117620 1108763 1100234 1092136 1085388
60455A085388m337j888l99L00J030K294M199O675R107J0609J1519J3840J9069
$$ 1085388 1081051 1079163 1078764 1079064 1080094 1082388 1086587 1093262 1102369 1112978 1124497 1138337 1157406
60442A157406K6041L2119L6247L9699M3921M8882N3642N7409N9630O0032N8965
$$ 1157406 1183447 1215566 1251813 1291512 1335433 1384315 1437957 1495366 1554996 1615028 1673993
60431A673993N7071N4256M9695M3134L5387K7187J8148P414n206j9177l3616m7175
$$ 1673993 1731064 1785320 1835015 1878149 1913536 1940723 1958871 1966285 1961079 1941902 1908286 1861111
60419A861111n8080o5103o8556o9880p0274o9918o8264o4810n9802n4377m9706
$$ 1861111 1803031 1737928 1669372 1599492 1529218 1459300 1391036 1326226 1266424 1212047 1162341
60408A162341m5801m1598l6556l1584k7870k5303k2879k0321j8224j6653j4763
$$ 1162341 1116540 1074942 1038386 1006802 978932 953629 930750 910429 892205 875552 860789
60397H60789j2301j0574j0881j2438j2863j0875p704n538n064n201m918m496m717
$$ 860789 848488 837914 827033 814595 801732 790857 783153 777615 772551 767350 762432 757936 753219
60384G53219n378n449m546l584l465l696l053j434k59o21j781k125j300m79n49
$$ 753219 747841 742392 737846 734262 730797 727101 724048 722614 722355 721734 719953 717828 716528 716049 715500
60369G15500r30o58P7K52m29j195j433j430j586j553q33J45K98o76j681j352L77
$$ 715500 714570 713912 713989 714241 713812 712617 711184 709754 708168 706615 705782 705927 706225 705549 703868 702516 702893
60352G02893K069K227Q74m03j32J519L126L795L981M378M703M304L509L390M237
$$ 702893 704962 707189 708063 707660 707528 709047 712173 715968 719949 724327 729030 733334 736843 740233 744470
60337G44470N060M897L948L027K543K450K783L547M362M774M813M718M367L580
$$ 744470 749530 754427 758375 761402 763945 766395 769178 772725 777087 781861 786674 791392 795759 799339
60323G99339K999L734N762P393P048N215L854L928M381L758K202J236J847L476
$$ 799339 802338 806072 811834 819227 826275 831490 835344 839272 843653 847411 849613 850849 852696 856172
60309H56172M852N268M824L882K617J119l04j013l62J598L797M904M627M060M506
$$ 856172 861024 866292 871116 874998 877615 878734 878430 877417 877055 878653 882450 887354 891981 896041 900547
60294I00547O090P701Q161P307O189O212P818R816J0382R036P167O183N624L888
$$ 900547 906637 914338 922499 929806 935995 942207 950025 959841 970223 979259 986426 992609 998233 1002121
60280A002121N86k847m987o018p007q330r392r597q934p693o089m396l220l321
$$ 1002121 1002707 999860 994873 988855 981848 973518 964126 954529 945595 937902 931813 927417 924197 920876
60266I20876m826o576o846n198l251k826l610l713k399q65P6J542M682Q465J0810
$$ 920876 916050 909474 902628 897430 894179 891353 887743 884030 881631 880766 880842 882384 887066 895531 906341
60251I06341J1320J1413J2236J3841J6202J9315K2202K3476K3342K3417K3913
$$ 906341 917661 929074 941310 955151 971353 990668 1012870 1036346 1059688 1083105 1107018
60240A107018K2570J7568J0199L202k701q971j6357k3342k7678k8400k6304k3252
$$ 1107018 1129588 1147156 1157355 1160557 1157856 1148885 1132528 1109186 1081508 1053108 1026804 1003552
60228A003552k1045k0112j9167j6797j3315j0368q802p853o479m594k778j545
$$ 1003552 982507 962395 943228 926431 913116 902748 893946 886093 879614 875020 872242 870697
60216H70697j144j386j585j337j279k150l207k959j708j689l900o344o693n434
$$ 870697 869553 868167 866582 865245 863966 861816 858609 855650 853942 852253 848353 842009 835316 829882
60202H29882m701m942m768l744l227m013m907m468k926j490o63j65J04L5p6L53
$$ 829882 825181 820239 815471 811727 808500 804487 799580 795112 792186 790696 790033 789868 789972 790007 789931 790284
60186G90284J350K151J923O02q84j276K5K426M612N456M557K463O20M85J981L319
$$ 790284 791634 793785 795708 796310 795426 794150 794175 796601 801213 806669 811226 813689 814309 814794 816775 820094
60170H20094L115K219K422L768M514L680K188J303J353K322M170N975O218M892
$$ 820094 823209 825428 827850 831618 836132 839812 842000 843303 844656 846978 851148 857123 863341 868233
60156H68233L986M887O553P327P262P342P734Q318R773J2213J3743J2618J0236
$$ 868233 872219 877106 883659 890986 898248 905590 913324 921642 931415 943628 957371 969989 980225
60143I80225R644J1335J2875J2735J2017J1952J2036J1582J0945J0186Q430N796
$$ 980225 989869 1001204 1014079 1026814 1038831 1050783 1062819 1074401 1085346 1095532 1103962 1109758
60131A109758M104M226M499L317J712J411J829J143o37k067l012m572o494p245
$$ 1109758 1113862 1118088 1122587 1125904 1127616 1129027 1130856 1131999 1131362 1129295 1126283 1121711 1115217 1107972
60117A107972o844p245r091j0267q879o097m666n608p555q651p995n848l477k551
$$ 1107972 1101128 1093883 1084792 1074525 1065646 1059549 1054883 1049275 1041720 1033069 1025074 1019226 1015749 1013198
60103A013198l799o218p907p650n561k730m26P39J147J409J406P28j49j94N71
$$ 1013198 1009399 1003181 995274 987624 982063 979333 978907 979646 980793 982202 983608 984336 984187 983993 984564
60088I84564R95O53M55Q62R20L9n92L47K348M075N357O626P311O666N691O074
$$ 984564 985559 986212 986667 987529 988449 988488 987896 988243 990591 994666 1000023 1006649 1013960 1020626 1026317 1032391
60072A032391P474P907O946O388P352Q708R128Q768Q033O516M377L015L056L166
$$ 1032391 1039865 1047772 1054718 1061106 1068458 1077166 1086294 1095062 1103095 1109611 1113988 1117003 1120059 1123225
60058A123225K316J626K250L098K821K686M669P549Q012N573L283L056L189J786
$$ 1123225 1125541 1127167 1129417 1132515 1135336 1138022 1142691 1150240 1158252 1163825 1167108 1170164 1173353 1175139
60044A175139j42q18q31j779l301l814l453l998n969p756p895o716n375m394l630
$$ 1175139 1174997 1174179 1173348 1171569 1168268 1164454 1161001 1157003 1151034 1143278 1135383 1128667 1123292 1118898 1115268
60029A115268k885k208j942k462l436l764k960k124k555l746m009k959k067k414
$$ 1115268 1112383 1110175 1108233 1105771 1102335 1098571 1095611 1093487 1090932 1087186 1083177 1080218 1078151 1075737
60015A075737l292l589l441l614m100m330m405n116o827r000j0848j1970j2303
$$ 1075737 1072445 1068856 1065415 1061801 1057701 1053371 1048966 1043850 1037023 1028023 1017175 1005205 992902
60002I92902j1897j0907r657q479p567o929o550o529o940p515p666p029n838m481
$$ 992902 981005 970098 960441 951962 944395 937466 930916 924387 917447 909932 902266 895237 889399 884918
59988H84918k931r39J321L267M527N184N506N784O315P068P469P039O176N727
$$ 884918 881987 881048 882369 885636 890163 895347 900853 906637 912952 920020 927489 934528 940704 946431
59974I46431N856N956N679N290M804L705J881J26q60j381k101k975l548l949m918
$$ 946431 952287 958243 963922 969212 974016 977721 979602 979728 978868 977487 975386 972411 968863 964914 959996
59959I59996o816r163j1113j2097j2083j1587j1255j1210j0941j0217r744j0321
$$ 959996 953180 944017 932904 920807 908724 897137 885882 874672 863731 853514 843770 833449
59947H33449j1393j1181q676n102k871l117m526m789l027n59O43K7j225j675j092
$$ 833449 822056 810875 802199 797097 794226 791109 786583 781794 778767 778208 778851 778878 777653 775978 774886
59932G74886l36r3N4J081L119M974N445M874M731N564O377O276N716N321M606
$$ 774886 774550 774457 774511 775592 778711 783685 789130 794004 798735 804299 810676 816952 822668 827989 832595
59917H32595L102J893K275L282K528l47k993l677l424l837m531m147k762j671
$$ 832595 835697 837590 839865 843147 845675 845328 842335 838658 835234 831397 826866 822719 819957 818286
59903H18286j435j542j481r51M41K536M100M219L722L962M666M392K858J182m1
$$ 818286 816851 815309 813828 812877 813318 815854 819954 824173 827895 831857 836523 840915 843773 844955 844914
59888H44914j226k213j978n13N06j21j465j852j048j40J32%n8O9J35j67o30l51
$$ 844914 843688 841475 839497 838984 839490 839369 837904 836052 835004 834864 834996 834996 834938 835007 835142 834975 834345 833994
59870H33994J304L488M558M163L610L761L894L412L406N179Q053J0156J0799J0555
$$ 833994 835298 838786 843344 847507 851117 854878 858772 862184 865590 870769 878822 888978 899777 910332
59856I10332R416O752L233R48Q77J692J853J663K170L161L612L533L881M822N397
$$ 910332 919748 926500 929733 930681 931558 933250 935103 936766 938936 942097 945709 949242 953123 957945 963342
59841I63342N139M833N251O029O306N789M661L104J535Q86J862M006O070P272
$$ 963342 968481 973314 978565 984594 990900 996689 1001350 1004454 1005989 1006875 1008737 1012743 1018813 1026085
59827A026085P759P970Q056P978P773P500P085O310N038L682L370M957P519Q619
$$ 1026085 1033844 1041814 1049870 1057848 1065621 1073121 1080206 1086516 1091554 1095236 1098606 1103563 1111082 1119701
59813A119701O867L765J914J783J509j72k355l819m883o247p124o086l481j561
$$ 1119701 1126568 1130333 1132247 1134030 1135539 1135367 1133012 1129193 1124310 1118063 1110939 1104853 1101372 1099811
59799A099811j923l761n014m615l191j929j128K2K343N523Q367J0196J1465J2800
$$ 1099811 1097888 1094127 1089113 1084498 1081307 1079378 1078250 1078272 1080615 1086138 1094505 1104701 1116166 1128966
59785A128966J3934J3969J2258Q715L850r45l793l961k848k468l082l283k404
$$ 1128966 1142900 1156869 1169127 1177842 1181692 1180747 1176954 1172993 1170145 1167677 1164595 1161312 1158908
59772A158908j848l490p328j1279j3199j2774j1428j0538j0039r042p516o514
$$ 1158908 1157060 1153570 1146242 1134963 1121764 1108990 1097562 1087024 1076985 1067943 1060427 1053913
59760A053913o588o932o634o029n938o228o226o031o289o820o625n299l487k009
$$ 1053913 1047325 1040393 1033759 1027730 1021792 1015564 1009338 1003307 997018 990198 983573 978274 974787 972778
59746I72778j425k273m458o356n966l329o58M19N32R41J436J001l14j370j440
$$ 972778 971353 969080 964622 958266 952300 948971 948313 948732 949264 950205 951641 952642 952328 950958 949518
59731I49518q21j31K00j44j265k692l550l275k110r16m16m44j74P01J322Q29k91
$$ 949518 948697 948566 948766 948622 947357 944665 941115 937840 935730 934814 934398 933954 933780 934481 935803 936632 936341
59714I36341r52j195j879k691k115P4J920J898J060J275K527L549M305N916Q236
$$ 936341 935389 934194 932315 929624 927509 927583 929503 931401 932461 933736 936263 939812 944117 950033 958269
59699I58269R428Q489O871O801Q759J1214J2424J2055J1292J1570J3138J4910
$$ 958269 967697 976186 983057 989858 998617 1009831 1022255 1034310 1045602 1057172 1070310 1085220
59687A085220J5875J6219J6583J6735J5971J4644J4028J4326J3890J1281P396
$$ 1085220 1101095 1117314 1133897 1150632 1166603 1181247 1195275 1209601 1223491 1234772 1242168
59676A242168M566L764L698K751R32o65j722l029m997o761p257o588n694n089
$$ 1242168 1246734 1250498 1254196 1256947 1257879 1257214 1255492 1252463 1247466 1240705 1233448 1226860 1221166 1216077
59662A216077m689m565n043n993o821p177p035o219m877m256n651q260r502q154
$$ 1216077 1211388 1206823 1201780 1195787 1188966 1181789 1174754 1168535 1163658 1159402 1153751 1145491 1135989 1127835
59648A127835n783m248l176j269J096K350K130J443P92k20j461k002j427j66J435
$$ 1127835 1122052 1117804 1114628 1113359 1114455 1116805 1118935 1120378 1121170 1120950 1119489 1117487 1116060 1115894 1117329
59633A117329L149M100L451J978J340J597J032j001k808k782j642j138j735k694
$$ 1117329 1120478 1124578 1128029 1130007 1131347 1132944 1133976 1132975 1130167 1127385 1125743 1124605 1122870 1120176
59619A120176l471l918l944m052n401q116j0316j0055p731n360m083l688m037
$$ 1120176 1116705 1112787 1108843 1104791 1099390 1091274 1080958 1070903 1063172 1057812 1053729 1050041 1046004
59606A046004n287o751p130o182n039m583m630m802n036m851l286k49K911M685
$$ 1046004 1040717 1033966 1026836 1020654 1015615 1011032 1006402 1001600 996564 991713 988427 988178 991089 995774
59592I95774M642L297J662J191K844N533O597M780J786o9p42j814l814n825p262
$$ 995774 1000416 1003713 1005375 1006566 1009410 1014943 1021540 1026320 1028106 1028037 1027295 1025481 1021667 1015842 1008580
59577A008580q331q800q005o355n235m982m407l104k636m265o712p647o680n322
$$ 1008580 1000249 991449 983444 977089 971854 966872 962465 959361 956725 952460 945748 938101 931421 926099
59563I26099m528l913l300l285l851l971l331l211m600o291o184m093k030j685
$$ 926099 921571 917658 914358 911073 907222 903251 899920 896709 892109 885818 879634 875541 873511 871826
59549H71826k667l429l041j517P51L109M562M595L987L993M462L744J055j879
$$ 871826 869159 865730 862689 861172 861923 865032 869594 874189 878176 882169 886631 890375 891430 889551
59535H89551k635j244r0n64j257k88J818K996K666K214K499K527J167r96k470
$$ 889551 886916 885672 885582 885018 883761 883473 885291 888287 890953 893167 895666 898193 899360 898364 895894
59520H95894k774k647k814l305l806m001l648k826k083j966k437l017l310l082
$$ 895894 893120 890473 887659 884354 880548 876547 872899 870073 867990 866024 863587 860570 857260 854178
59506H54178k089l33J535K568K345J248n1j035j399j086m45m8j66n50p91p63n92
$$ 854178 852089 851756 853291 855859 858204 859452 859401 858366 856967 855881 855436 855388 855222 854672 853881 853118 852526
59489H52526l06L09J429K863M185N246O351P742R106J0030J0740J1933J3856J6099
$$ 852526 852220 852529 853958 856821 861006 866252 872603 880345 889451 899481 910221 922154 936010 952109
59475I52109J8350K0467K1476J9390J3189M644k830p290r428j0600j0759q994
$$ 952109 970459 990926 1012402 1031792 1044981 1049625 1046795 1039505 1030077 1019477 1008718 999724
59463I99724n388j392J511K817K717J631K98l03K13J130J321M00j197k942m559
$$ 999724 994336 992944 994455 997272 999989 1001620 1001918 1001615 1001828 1002958 1004279 1004679 1003482 1000540 995981
59448I95981n805o591p345q582r952j0490j0058r695r983j0031q905p422p132
$$ 995981 990176 983585 976240 967658 957706 947216 937158 927463 917480 907449 898544 891122 883990
59435H83990p862p662n355k024M84J537J748J748J600J050j12j603k440j586R16
$$ 883990 876128 868466 863111 861087 861571 863108 864856 866604 868204 869254 869142 867539 865099 863513 864429
59420H64429L761N494N628M828M374N225O937P770O628M579L505L574L395K523
$$ 864429 868190 873684 879312 884140 888514 893739 900676 908446 915074 919653 923158 926732 930127 932650
59406I32650K069K484K602J746J183K231M141N227N105M562M057L664L877N072
$$ 932650 934719 937203 939805 941551 942734 944965 949106 954333 959438 964000 968057 971721 975598 980670
59392I80670O672P863Q669R332R353Q404P394P359P842P775P104O100L823n56
$$ 980670 987342 995205 1003874 1013206 1022559 1030963 1038357 1045716 1053558 1061333 1068437 1074537 1078360 1077804
59378A077804n370p657o902n528n358n634n168m383m090l862k930j536k37J193
$$ 1077804 1072434 1064777 1057875 1052347 1046989 1041355 1036187 1031804 1027714 1023852 1020922 1019386 1019149 1020342
59364A020342L088M918O078P130R207J2529J6129J8829K0017K0017K0096K1559
$$ 1020342 1023430 1028348 1034426 1041556 1050763 1063292 1079421 1098250 1118267 1138284 1158380 1179939
59352A179939K4475K7873L1304L4956L7605L5881K7198J3127j365j1912j7203
$$ 1179939 1204414 1232287 1263591 1298547 1336152 1372033 1399231 1412358 1410993 1399081 1381878
59341A381878j8045j5552j0663m374K329Q388J2170J1587N503m783j5869k4392
$$ 1381878 1363833 1348281 1337618 1333244 1335573 1343961 1356131 1367718 1373221 1368438 1352569 1328177
59329A328177k8877k9617k7412k3124j8274j4743j3131j1991r599o058k825p20
$$ 1328177 1299300 1269683 1242271 1219147 1200873 1186130 1172999 1161008 1151409 1145351 1142526 1141806
59317A141806N05J003P60P15K326N409P809P936O648N691N287M441K985J999K321
$$ 1141806 1142311 1143314 1144074 1144789 1147115 1152524 1160333 1168269 1174917 1180608 1185895 1190336 1193321 1195320 1197641
59302A197641L565M710M996M251K884J673J269J850L302N388P548R019R640J0213
$$ 1197641 1201206 1205916 1210912 1215163 1218047 1219720 1220989 1222839 1226141 1231529 1239077 1248096 1257736 1267949
59288A267949J1550J3289J4226J3799J2834J2626J3535J4706J5159J4936J4892
$$ 1267949 1279499 1292788 1307014 1320813 1333647 1346273 1359808 1374514 1389673 1404609 1419501
59277A419501J5417J5837J5342J3919J1932R235N528J364k109m432o211q248j0841
$$ 1419501 1434918 1450755 1466097 1480016 1491948 1501183 1506711 1508075 1505966 1501534 1495323 1487075 1476234
59264A476234j3806j6406j7430j6259j3927j2289j2160j2966j3951j4522j3670
$$ 1476234 1462428 1446022 1428592 1412333 1398406 1386117 1373957 1360991 1347040 1332518 1318848
59253A318848j0664o683m276m587o211p374p973q761r725j0182r593p540l809
$$ 1318848 1308184 1301501 1297225 1292638 1286427 1279053 1271080 1262319 1252594 1242412 1232819 1225279 1221470
59240A221470Q02M722P381R769J2357J3469J0776L800n650j4798k1095k3332k2600
$$ 1221470 1222272 1226994 1234375 1244144 1256501 1269970 1280746 1284546 1278896 1264098 1243003 1219671 1197071
59227A197071k1325k0664j9718j7807j5836j4451j2542r182n513k951r03J841
$$ 1197071 1175746 1155082 1135364 1117557 1101721 1087270 1074728 1065546 1060033 1057082 1056179 1058020
59215A058020M678O415P779J0098J2319J2297J0780J0988J3841J6513J6632J5270
$$ 1058020 1062698 1069113 1076892 1086990 1099309 1111606 1122386 1133374 1147215 1163728 1180360 1195630
59203A195630J4445J3965J2511J0104P727N593L360J180p34k874n564q005r229
$$ 1195630 1210075 1224040 1236551 1246655 1254382 1259975 1263335 1264515 1263781 1260907 1255343 1247338 1238109
59190A238109r432r360r056q186p030o077n078l585k095j535j664j094Q04K839
$$ 1238109 1228677 1219317 1210261 1202075 1195045 1188968 1183890 1180305 1178210 1176675 1175011 1173917 1174721 1177560
59176A177560L320K167J150J902M042N623N546M731M502M608L825K065M81l32
$$ 1177560 1180880 1183047 1184197 1186099 1190141 1195764 1201310 1206041 1210543 1215151 1218976 1221041 1221522 1221190
59162A221190r05j597k244l361n859q847r573o950l661l120n408q029r683j1045
$$ 1221190 1220285 1218688 1216444 1213083 1207224 1198377 1188804 1181854 1178193 1175073 1169665 1161636 1151953 1140908
59148A140908j2187j1781r469p097o536p553q589q619p448n286l017k003k490
$$ 1140908 1128721 1116940 1107471 1100374 1093838 1086285 1077696 1069077 1061629 1056343 1053326 1051323 1048833
59135A048833k830j430R99K378K159J882K704L758L636K537J946K673M071N038
$$ 1048833 1046003 1044573 1045572 1047950 1050109 1051991 1054695 1058453 1062089 1064626 1066572 1069245 1073316 1078354
59121A078354N133M733M611N431P189R151J0526J1127J1095J0342Q865P353O718
$$ 1078354 1083487 1088220 1092831 1098262 1105451 1114602 1125128 1136255 1147350 1157692 1166557 1173910 1180628
59108A180628O909O947O264N312M667M283L992L892L732K665M61j706k535k360
$$ 1180628 1187537 1194484 1200748 1206060 1210727 1215010 1219002 1222894 1226626 1229291 1229752 1228046 1225511 1223151
59094A223151k692m244o319q038r262j0170j0795j1281j2022j3202j4513j5463
$$ 1223151 1220459 1216215 1209896 1201858 1192596 1182426 1171631 1160350 1148328 1135126 1120613 1105150
59082A105150j5705j5117j3988j2962j2332j1452r480o699m498l916m702n862
$$ 1105150 1089445 1074328 1060340 1047378 1035046 1023594 1014114 1007415 1002917 999001 994299 988437
59070I88437o593o580n984n232m379k651O86M967Q344R667R482Q908Q350P779
$$ 988437 981844 975264 969280 964048 959669 957018 957704 962671 971015 980682 990164 999072 1007422 1015201
59056A015201P646Q592J0491J2367J3219J2667J0984Q857O994N736N051M928N321
$$ 1015201 1022847 1031439 1041930 1054297 1067516 1080183 1091167 1100024 1107018 1112754 1117805 1122733 1128054
59043A128054N633M901K985J072M53R83J355P36l99j145j305j504k366l726m558
$$ 1128054 1133687 1138588 1141573 1142645 1143098 1144081 1145436 1146172 1145773 1144628 1143323 1141819 1139453 1135727 1131169
59028A131169l845j673N81J413M75j418l300m726n673o283o773p182p104o153
$$ 1131169 1127324 1125651 1126232 1127645 1128120 1126702 1123402 1118676 1113003 1106720 1099947 1092765 1085661 1079508
59014A079508m830m414n541p258q060p642o977o776o678o278o066o557o995n995
$$ 1079508 1074678 1070264 1064723 1057465 1049405 1041763 1034786 1028010 1021332 1015054 1008988 1002431 995436 989441
59000I89441l588j733k173m296n763n206l690l241m332n419n013l527k455k084
$$ 989441 985853 984120 981947 977651 971888 966682 962992 959751 955419 950000 944987 941460 939005 936921
58986I36921j180Q05K449K119K39j335j657j262q02n14p95j748k148n57K306M018
$$ 936921 935741 936546 938995 941114 941353 940018 938361 937099 936297 935783 934988 933240 931092 930535 932841 936859
58970I36859L961M356O782R522J0150R165Q915R919J0675J0803J1807J4403J7079
$$ 936859 940820 945176 951958 961480 971630 980795 989710 999629 1010304 1021107 1032914 1047317 1064396
58957A064396J8182J7902J7293J6470J4779J2051Q841N785L225J136q38k998n038
$$ 1064396 1082578 1100480 1117773 1134243 1149022 1161073 1169914 1175699 1178924 1180060 1179222 1176224 1171186
58944A171186o162n855m370k495j067l87K03J714M039N731N873N420N659O052
$$ 1171186 1165024 1159169 1154799 1152304 1151237 1150850 1151053 1152767 1156806 1162537 1168410 1173830 1179489 1185541
58930A185541N063K766J033J003J828K122J422q3j892k861j810Q91L423M748N626
$$ 1185541 1190604 1193370 1194403 1195406 1197234 1199356 1200778 1200695 1198803 1195942 1194132 1195023 1198446 1203194 1208820
58915A208820O961Q313R011R614J1217J3905J6830J9230K0627K0566J9157J7503
$$ 1208820 1215781 1224094 1233105 1242719 1253936 1267841 1284671 1303901 1324528 1345094 1364251 1381754
58903A381754J6671J6346J5254J2794R700P047N222L853K375M55j956m761p849
$$ 1381754 1398425 1414771 1430025 1442819 1452519 1459566 1464788 1468641 1471016 1471471 1469515 1464754 1456905
58890A456905j1071j4255j7254j9810k1389k1581k0890k0437k0555k0328j9102
$$ 1456905 1445834 1431579 1414325 1394515 1373126 1351545 1330655 1310218 1289663 1269335 1250233
58879A250233j7500j6151j4379j1463q332o376n203l507j746j673l075l483j797
$$ 1250233 1232733 1216582 1202203 1190740 1182408 1176032 1170829 1167322 1165576 1163903 1160828 1157345 1155548
58866A155548J13O13Q93K642M863N164L225R91j75p39j474k223k475k232j861
$$ 1155548 1155661 1156274 1157167 1159809 1164672 1169836 1173061 1174052 1173877 1173138 1171664 1169441 1166966 1164734 1162873
58851A162873j506q61M46K054K810K195J589K901N946Q752J0626J2990J6416J8974
$$ 1162873 1161367 1160506 1160952 1163006 1165816 1168011 1169600 1172501 1178447 1187199 1197825 1210815 1227231 1246205
58837A246205J9100J8245J8599J9559J8898J6715J5681J7336K0352K2809K4329
$$ 1246205 1265305 1283550 1302149 1321708 1340606 1357321 1373002 1390338 1410690 1433499 1457828
58826A457828K5341K5828K5657K5160K4588K3673K2069J9715J6615J2895R096
$$ 1457828 1483169 1508997 1534654 1559814 1584402 1608075 1630144 1649859 1666474 1679369 1688465
58815A688465N682K354j341m831p011q032r454j2171j5133j6745j6740j6051j5415
$$ 1688465 1694147 1696501 1695160 1690329 1683318 1675286 1665832 1653661 1638528 1621783 1605043 1588992 1573577
58802A573577j4907j4529j4507j4823j4993j4557j3768j3580j4710j6810j8697
$$ 1573577 1558670 1544141 1529634 1514811 1499818 1485261 1471493 1457913 1443203 1426393 1407696
58791A407696j9520j9372j8699j7563j5902j4201j3266j3335j3665j3224j1667
$$ 1407696 1388176 1368804 1350105 1332542 1316640 1302439 1289173 1275838 1262173 1248949 1237282
58780A237282r718q590q905j0163j1398j2172j2548j2357j1207r323p726p224
$$ 1237282 1227564 1218974 1210069 1199906 1188508 1176336 1163788 1151431 1140224 1130901 1123175 1115951
58768A115951p678q281q081o374l388o95L0j050k082j739k69J818M566P359Q435
$$ 1115951 1108273 1099992 1091911 1085537 1082149 1081454 1081484 1080434 1078352 1076613 1076344 1078162 1082728 1090087 1098522
58753A098522O942M539L478L845L999L230K462K388K409J627k3k032m070o113
$$ 1098522 1105464 1110003 1113481 1117326 1121325 1124555 1127017 1129405 1131814 1133441 1133418 1131386 1127316 1121203
58739A121203q103r596r908q844p245o275o113o130o329p360q838r137p714o223
$$ 1121203 1113100 1103504 1093596 1084752 1077507 1071232 1065119 1058989 1052660 1045300 1036462 1027325 1019611 1013388
58725A013388o143o473n195k228O41K080K107J260L46N07K075L664L711K509J369
$$ 1013388 1007245 1000772 995577 993349 993990 996070 998177 999437 999783 1000290 1002365 1006029 1009740 1012249 1013618
58710A013618L75j296l199l801l073k957m686p101q447q538q327q199p564n745
$$ 1013618 1013993 1012697 1009498 1005697 1002624 999667 994981 987880 979433 970895 962568 954369 946805 941060
58696I41060k800K78K090K010R39L94R54K053K985L461L451L202L199L387K958
$$ 941060 938260 938538 940628 942638 943577 943971 944925 946978 949963 953424 956875 960077 963276 966663 969621
58681I69621J848J764M269Q035R709P937N118M479O467Q827R502Q496P126O316
$$ 969621 971469 973233 977502 985537 995246 1003183 1008301 1012780 1019247 1028074 1037576 1046072 1053198 1059514
58667A059514N942N629N491N658N517M394L001K838L924M628M376M745O607Q113
$$ 1059514 1065456 1071085 1076576 1082234 1087751 1092145 1095146 1097984 1101908 1106536 1110912 1115657 1122264 1130377
58653A130377P521O423P509J0091J0813Q583N798M303K982L71k781n056o670q735
$$ 1130377 1137898 1144321 1151830 1161921 1172734 1181317 1187115 1191418 1194400 1194771 1191990 1186934 1180264 1171529
58639A171529j1446j4253j6924j9444k1566k3039k3654k2824k0326j7565j6627
$$ 1171529 1160083 1145830 1128906 1109462 1087896 1064857 1041203 1018379 998053 980488 963861
58628I63861j7503j7785j5852j2846j0648r424q377p560p431p583p304o795o578
$$ 963861 946358 928573 912721 899875 889227 879803 871426 863866 856435 848852 841548 834753 828175
58615H28175o266n181l691k732k270j344M23K281L356L519L309L477M510O229
$$ 828175 821909 816728 813037 810305 808035 806691 807114 809395 812751 816270 819579 823056 827566 833795
58601H33795P976R317J0115R878P798M021J87k048k612k642k905l234l180k576
$$ 833795 841771 851088 861203 871081 878879 882900 883087 881039 878427 875785 872880 869646 866466 863890
58587H63890j665j157j899l956o145p097o697o029n873n761m732k719p37L98J058
$$ 863890 862225 861068 859169 855213 849068 841971 835274 829245 823372 817611 812879 810160 809423 809821 810879
58572H10879K082L259L453K397J511K156L744M485L633K039P39q2p27j493k530
$$ 810879 812961 816220 819673 822070 823581 825737 829481 833966 837599 839638 840377 840295 839568 838075 835545
58557H35545l520l600k278k68J351K445L467M215M153L680L793M452M599L966
$$ 835545 832025 828425 826147 825879 827230 829675 833142 837357 841510 845190 848983 853435 858034 862000
58543H62000L533L898M374M168L346K158M74j522k935l127k399j332j35Q94J100
$$ 862000 865533 869431 873805 877973 881319 883477 883951 882429 879494 876367 873968 872636 872501 873395 874495
58528H74495L19m32L23L139P142J0705J2766J3730J4884J6708J8297J8816J8634
$$ 874495 874814 874382 874705 877844 884986 895691 908457 922187 937071 953779 972076 990892 1009526
58515A009526J8337J7600J6229J5317J5783J6482J5669J3894J3462J5203J7822
$$ 1009526 1027863 1045463 1061692 1077009 1092792 1109274 1124943 1138837 1152299 1167502 1185324
58504A185324K0435K3583K7304L0265L1582L1823L1630L0984L0332L0581L1128
$$ 1185324 1205759 1229342 1256646 1286911 1318493 1350316 1381946 1412930 1443262 1473843 1504971
58493A504971K9681K5022J8584J2433P090K167k286n986q743r910q957p181p074
$$ 1504971 1534652 1559674 1578258 1590691 1597781 1599948 1597662 1591676 1582933 1573023 1564066 1556885 1549811
58480A549811r051j0780j0950j1664j5288k0642k4571k6156k7074k8379k9230
$$ 1549811 1540760 1529980 1519030 1507366 1492078 1471436 1446865 1420709 1393635 1365256 1336026
58469A336026k8747k7204k5088k2451j9620j7391j5938j4284j1498q097n812n848
$$ 1336026 1307279 1280075 1254987 1232536 1212916 1195525 1179587 1165303 1153805 1145708 1139896 1134048
58457A134048p527q936r043q658q845r035p798n101k585j610k135l411m541m466
$$ 1134048 1126521 1117585 1108542 1099884 1091039 1082004 1074206 1069105 1066520 1064910 1062775 1059364 1054823 1050357
58443A050357k874j155r71j833j755m12L93j99p25J9J089J248R40J104J579J993
$$ 1050357 1047483 1046328 1045357 1043524 1041769 1041357 1041750 1041551 1040826 1040845 1041934 1043182 1044122 1045226 1046805 1048798
58427A048798K872M428N559N490N311O494Q863J1254J3181J4599J5110J4804J5009
$$ 1048798 1051670 1056098 1061657 1067147 1072458 1078952 1087815 1099069 1112250 1126849 1141959 1156763 1171772
58414A171772J6679J8815J9682J9008J7645J5766J2771Q610L993n22m607p615
$$ 1171772 1188451 1207266 1226948 1245956 1263601 1279367 1292138 1300748 1304741 1304219 1299612 1291997
58402A291997q907q635p590o335m953l376j630J21J813L927P200J1232J4156J4825
$$ 1291997 1283090 1274455 1266865 1260530 1255577 1252201 1250571 1250692 1252505 1256432 1263632 1274864 1289020 1303845
58388A303845J4618J5283J5664J2893O783M55l849o924r860j1802j1958j1452
$$ 1303845 1318463 1333746 1349410 1362303 1369086 1369541 1365692 1358768 1348908 1337106 1325148 1313696
58376A313696j1400j0950r116o978o145o173n335l160p34R21J616J719K070L452
$$ 1313696 1302296 1291346 1282230 1275252 1269107 1262934 1257599 1254439 1253705 1254626 1256242 1257961 1260031 1263483
58362A263483N598P379Q209Q279P496N705L960L503L320R47l725p841r522r871
$$ 1263483 1269081 1276460 1284669 1292948 1300444 1306149 1310109 1313612 1316932 1317879 1314154 1306313 1296791 1286920
58348A286920j0260j0298r795j0012j1228j1520r768p629o701n973m057j882j059
$$ 1286920 1276660 1266362 1256567 1246555 1235327 1223807 1214039 1206410 1199709 1193736 1189679 1187797 1186738
58335A186738j280j284p06N73L013N715O415M803L576M291M754K824K16j38J661
$$ 1186738 1185458 1184174 1183468 1184041 1187054 1192769 1199184 1203987 1207563 1211854 1216608 1219432 1219648 1219510 1221171
58320A221171L682N576P750Q915P667N280M117M364M881N911Q287J1048J2590
$$ 1221171 1224853 1230429 1238179 1247094 1254761 1260041 1264158 1268522 1273403 1279314 1287601 1298649 1311239
58307A311239J3258J4342J5434J5247J4204J3897J4627J5478J6094J6658J6988
$$ 1311239 1324497 1338839 1354273 1369520 1383724 1397621 1412248 1427726 1443820 1460478 1477466
58296A477466J7165J8058J9736K0654J9729J7858J6162J4500J2798J1735J0913
$$ 1477466 1494631 1512689 1532425 1553079 1572808 1590666 1606828 1621328 1634126 1645861 1656774
58285A656774Q766N639M217N438O993P492Q668J1388J3238J2803J2646J4904J7416
$$ 1656774 1665540 1671179 1675396 1680834 1687827 1695319 1703987 1715375 1728613 1741416 1754062 1768966 1786382
58272A786382J7641J7044J7985J9418J9537J9575K1002K1976K0677J9213J9922
$$ 1786382 1804023 1821067 1839052 1858470 1878007 1897582 1918584 1940560 1961237 1980450 2000372
58261B000372K0746J8716J5279J3554J3040J1682J0522J1417J2705J2083J1224
$$ 2000372 2021118 2039834 2055113 2068667 2081707 2093389 2103911 2115328 2128033 2140116 2151340
58250B151340J2583J4283J3498J2355J4741J9546K2838K4618K7476L0627L1469
$$ 2151340 2163923 2178206 2191704 2204059 2218800 2238346 2261184 2285802 2313278 2343905 2375374
58239B375374L1400L3731L7300L8425L7864L9367M2397M2861M0549L9393M0554
$$ 2375374 2406774 2440505 2477805 2516230 2554094 2593461 2635858 2678719 2719268 2758661 2799215
58228B799215M1289M0645M0652M1933M3284M5152M8578N1742N2544N3172N6698
$$ 2799215 2840504 2881149 2921801 2963734 3007018 3052170 3100748 3152490 3205034 3258206 3314904
58217C314904O1004O2091O1532O4120O9777P4614P8555Q4726R2320R7418J00250
$$ 3314904 3375908 3437999 3499531 3563651 3633428 3708042 3786597 3871323 3963643 4061061 4161311
58206D161311J04634J10880J16096J20754J27892J36761J44207J51290J61198
$$ 4161311 4265945 4376825 4492921 4613675 4741567 4878328 5022535 5173825 5335023
58197E335023J71992J79081J83679J90788K00005K06646K10939K17629K27305
$$ 5335023 5507015 5686096 5869775 6060563 6260568 6467214 6678153 6895782 7123087
58188G123087K36618K46121K59209K74349K87174K99124L14947L33336L49714
$$ 7123087 7359705 7605826 7865035 8139384 8426558 8725682 9040629 9373965 9723679
58179I723679L66443L89709M17764M43312M66277M92888N23294N52017N79751
$$ 9723679 10090122 10479831 10897595 11340907 11807184 12300072 12823366 13375383 13955134
58170A3955134O12584O50294O87726P26715P73879Q27963Q82772R40915J010234
$$ 13955134 14567718 15218012 15905738 16632453 17406332 18234295 19117067 20057982 21068216
58161B1068216J088318J166105J245317J336205J439770J549612J669585J810799
$$ 21068216 22156534 23322639 24567956 25904161 27343931 28893543 30563128 32373927
58153C2373927J972400K144877K330795K541577K776052L025354L297560L613917
$$ 32373927 34346327 36491204 38821999 41363576 44139628 47164982 50462542 54076459
58145E4076459L984495M414422M927940N551438O274405P064447P921935Q883253
$$ 54076459 58060954 62475376 67403316 72954754 79229159 86293606 94215541 103098794
58137A03098794R974897J1210223J2624751J4252335J6062485J7992442K0062529
$$ 103098794 113073691 124283914 136908665 151161000 167223485 185215927 205278456
58130B05278456K2407070K5194580K8559511L2456655L6213764L8084328L5674648
$$ 205278456 227685526 252880106 281439617 313896272 350110036 388194364 423869012
58123D23869012K7509537J4519314j56936j3074526k2355484k8009858l0954076
$$ 423869012 451378549 465897863 465740927 452666401 430310917 402301059 371346983
58116C71346983l2035797l1779601l0551437k8668292k6394056k3941361k1477505
$$ 371346983 339311186 307531585 276980148 248311856 221917800 197976439 176498934
58109A76498934j9104456j6863460j4782146j2896992j1227946r767035q503812
$$ 176498934 157394478 140531018 125748872 112851880 101623934 91856899 83353087
58102H3353087p434602o539560n778972n122171m558703m077025l656234l284607
$$ 83353087 75918485 69378925 63599953 58477782 53919079 49842054 46185820 42901213
58094D2901213k964227k691230k450851k236068k051520j894564j751079j614537
$$ 42901213 39936986 37245756 34794905 32558837 30507317 28612753 26861674 25247137
58086B5247137j491573j384335j284223j187491j100600j025201r52984q80414
$$ 25247137 23755564 22371229 21087006 19899515 18798915 17773714 16820730 15940316
58078A5940316q14600p59985p12133o68587o33009o04498n74983n41149n08063
$$ 15940316 15125716 14365731 13653598 12985011 12352002 11747504 11172521 10631372 10123309
58069A0123309m78113m47674m17198l92828l74850l55710l32712l11882k96329
$$ 10123309 9645196 9197522 8780324 8387496 8012646 7656936 7324224 7012342 6716013
58060F716013k81506k65280k52064k43426k34548k23457k14273k08065j99956
$$ 6716013 6434507 6169227 5917163 5673737 5439189 5215732 5001459 4793394 4593438
58051D593438j88500j78643j72126j64179j53112j44129j39830j35636j28488
$$ 4593438 4404938 4226295 4054169 3889990 3736878 3592749 3452919 3317283 3188795
58042C188795j21912j18462j14934j08862j02533r7114q9953q1025p4916p3118
$$ 3188795 3066883 2948421 2833487 2724625 2622092 2524978 2435025 2354000 2279084 2205966
58032B205966p1188o6501o1981n9297n5595n0038m6491m6370m5681m2516m0656
$$ 2205966 2134778 2068277 2006296 1946999 1891404 1841366 1794875 1748505 1702824 1660308 1619652
58021A619652m2240m3594m2001m0229m0429l9738l5923l1689k9488k7349k3597
$$ 1619652 1577412 1533818 1491817 1451588 1411159 1371421 1335498 1303809 1274321 1246972 1223375
58010A223375k0526j9947j9862j8785j8439j9321j8656j5700j3952j5228j6634
$$ 1223375 1202849 1182902 1163040 1144255 1125816 1106495 1087839 1072139 1058187 1042959 1026325
57999A026325j6255j6427j8367j9029j6694j4484j4823j5394j4083j2952j3696
$$ 1026325 1010070 993643 975276 956247 939553 925069 910246 894852 880769 867817 854121
57988H54121j4006j2234j0977j2191j3145j1193q439p748q027p294o696p676q554
$$ 854121 840115 827881 816904 804713 791568 780375 771936 764188 756161 748867 742171 734495 725941
57975G25941p622o537p255q620r080r669j1361j2628j2404j2373j3677j4535j3675
$$ 725941 718319 711782 704527 695907 686827 677158 665797 653169 640765 628392 614715 600180 586505
57962E86505j2682j2525j1410q557o257n586m087o16J675L32k280l238l511m615
$$ 586505 573823 561298 549888 541331 535074 529488 525401 524785 526460 526792 524512 521274 517763 513148
57948E13148m733k184O44R29j1L82J306Q77K30J330K906K508P79J59J013K026
$$ 513148 508415 506231 506875 507804 507793 508175 509481 510358 510588 511918 514824 517332 518111 518270 519283 521309
57932E21309K682K712J120j699l146k154j196k188l350k885k598m544p022p410
$$ 521309 523991 526703 527823 526124 522978 520824 519628 517440 514090 511205 508607 504063 497041 489631
57918D89631o391n862n174l181j645k812n422o685o367n645m103j368L26q74k560
$$ 489631 483240 477378 472204 469023 467378 464566 459144 452459 446092 440447 436344 434976 435302 434428 431868
57903D31868j105K738M965L994J782K31k49M95J973K165j02k785l169j792j240
$$ 431868 430763 433501 438466 442460 444242 444473 444224 444719 446692 448857 448755 445970 442801 441009 439769
57888D39769k233l404l888l565j924P77K396J450l24l38J185K293K634L237M179
$$ 439769 437536 434132 430244 426679 424755 425532 427928 429378 429054 428716 429901 432194 434828 438065 442244
57873D42244M952N903P156P434O149N052N472N713L695M14j935l504n526p224
$$ 442244 447196 453099 460255 467689 473838 478890 484362 490075 493770 494184 492249 488745 483219 475995
57859D75995p132o103n911o066n082l631l339l649k996k048k445l332k458j22
$$ 475995 468863 462760 456849 450783 445701 442070 438731 435082 432086 430038 427593 424261 421803 421681
57845D21681J224R21O54J358K304L004L585L598K690J846J865J625J86o98R89
$$ 421681 422905 423826 424480 425838 428142 431146 434731 438329 441019 442865 444730 446355 446541 445843 446832
57830D46832L788M542L109K049K292K388J786J633K180K253J499O49l88k273m202
$$ 446832 450620 455162 458271 460320 462612 465000 466786 468419 470599 472852 474351 475000 474612 472339 468137
57815D68137m646m163m925p292r163q946p238n319l780k696j699j77J502J813
$$ 468137 463491 459328 454403 447111 437948 429002 421764 416445 412665 409969 408270 408093 409595 411408
57801D11408M38n80J62J012J73q44L17K541K991K135L133O551R481J0034R273
$$ 411408 411846 411266 411428 412440 412613 411769 412086 414627 417618 419753 422886 429437 438918 448952 458225
57786D58225Q277O604M343K774K211J636Q70P29Q23k35k091k860k359k376l278
$$ 458225 466502 473106 477449 480223 482434 484070 484940 485669 486492 486257 484166 481306 478947 476571 473293
57771D73293l261j791r81k316m361n068m395l556l347m180o071p735p327m853
$$ 473293 470032 468241 467260 464944 460583 455515 451120 447564 444217 440037 433966 426231 418904 414051
57757D14051k484j779k094k255k277k661l310l912m524n299o327p755r201r566
$$ 414051 411567 409788 407694 405439 403162 400501 397191 393279 388755 383456 377129 369374 360173 350607
57743C50607q422o980o352n713l879j728r31j060l95R11J241P99J578L751M958
$$ 350607 342185 335205 328853 323140 319261 317533 316602 315542 315147 316058 317299 318098 319676 323427 328385
57728C28385L961K465K428L745N429P139Q544Q932Q362P766P424O808O138O296
$$ 328385 332346 334811 337239 340984 346413 353552 362096 371028 379390 387156 394580 401388 407526 413822
57714D13822O886O407M845M044M765N315M061J718J14PR07J890J960O71j214k611
$$ 413822 420708 427115 431960 436004 440769 446084 450145 451863 451977 451984 452891 454781 456741 457412 456198 453587
57698D53587l570m664n208l944j435J17k04j120j440j534k120l180m490n749o159
$$ 453587 450017 445353 440145 436201 434766 434883 434679 433559 432119 430585 428465 425285 420795 415046 408887
57683D08887n360m662n544p091p070n266l448k139k37J918K269O95q0J500L618
$$ 408887 403527 398865 393321 386230 379160 373894 370446 368307 368070 369988 372257 372952 372872 374372 377990
57668C77990M331M404N053N278L742J543Q20J748K846L303L318K959K253J674
$$ 377990 382321 386725 391778 397056 400798 402341 403161 404909 407755 411058 414376 417335 419588 421262
57654D21262J346N05j186k720l174l066l203l220k501j711k091l751n596o497
$$ 421262 422608 423113 421927 419207 416033 412967 409764 406544 404043 402332 400241 396490 390894 384397
57640C84397n893l970j905j060j352j333m61j1r79k410l017l332m747p092q582
$$ 384397 378504 374534 372629 371569 370217 368884 368423 368412 367433 365023 362006 358674 353927 346835 338253
57625C38253p925n368j922J444L906M988N025N111O461R641J4044J8182K0948
$$ 338253 330328 324960 323038 324482 328388 333376 338401 343512 349973 359614 373658 391840 412788
57612D12788K2637K4419K7174L1343L7212M4185M9947N1563M7433L7415K1876
$$ 412788 435425 459844 487018 518361 555573 599758 649705 701268 748701 786116 807992
57601H07992K338j7318l2556m1800m6864m9544m9613m6802m2647l8903l5343l0702
$$ 807992 810330 793012 760456 718656 671792 622248 572635 525833 483186 444283 408940 378238
57589C78238k5040j9904j6446j4330j2454j0163p776o106n368m741l342j318N12
$$ 378238 353198 333294 316848 302518 290064 279901 272125 266019 260651 255910 252568 251250 251762
57576B51762J625J818R14o38j521r91j0K01l4J58L07o39k310l528m286n211n742
$$ 251762 253387 255205 256119 255481 253960 252969 252959 253160 253126 253284 253591 252952 250642 247114 242828 237617 231875
57559B31875n116m525n680p630p790o064m990n554n925m863l389k234o34J185
$$ 231875 226759 222234 216554 208924 201134 195070 190080 184526 178601 173738 170349 168115 167481 168666
57545A68666J378l34j552r51m37j739l387l245j940j547k541m102n897p569p866
$$ 168666 170044 169710 168158 167207 166770 165031 161644 158399 156459 154912 152371 148269 142372 134803 126937
57530A26937o285m369l634l473k735j974k312l229l422k800k047j236m83q00k588
$$ 126937 120652 116283 112649 109176 106441 104467 102155 98926 95504 92704 90657 89421 88938 88138 85550
57515H5550m255m094k639j601j306q74j07M62P19O98j28j864l217k886j317K02
$$ 85550 81295 77201 74562 72961 71655 70781 70674 71136 71855 72553 72425 70561 67344 64458 63141 63343
57499F3343J422K813M182M952N212N290M946M064L314L106K697J495K40j56L1
$$ 63343 64765 67578 71760 76712 81924 87214 92160 96224 99538 102644 105341 106836 107076 106920 106951
57484A06951K62Q82K133L089K973K476K575L106L713M851O312O285L769P01l65
$$ 106951 107213 108095 110228 113317 116290 118766 121341 124447 128160 133011 139323 145608 149377 150078 149713
57469A49713K42L43m57m91R44K662L691M381N049N161M332L072K271K559L974
$$ 149713 149955 150298 149841 149350 150294 152956 156647 161028 166077 171238 175570 178642 180913 183472 187446
57454A87446N671O401N965N460N531N341M124K522J290n9k026l732m324m582n499
$$ 187446 193117 199518 205483 210943 216474 221815 225939 228461 229751 229692 227666 223934 219610 215028 209529
57439B09529o441o498o552p840r384r143p322o275p258r184j0529j0716r670p701
$$ 209529 203088 196590 190038 182198 172814 163671 156349 150074 142816 133632 123103 112387 102717 95016
57425I5016n852n014m807m429m100m260m135k790r92k59n46p57r41j955l326l680
$$ 95016 89164 84150 79343 74914 70814 66554 62419 59629 58637 58378 57832 57075 56134 54179 50853 47173
57409D7173l115l015l550l585l103l462m796n426m459l085k536k506B070g50l789
$$ 47173 44058 41043 37493 33908 30805 27343 22547 17121 12662 9577 7041 4535 2070 -750 -4539
57394d539m432l838k359r28j4K21l92j618k733l170k838j715O7J884L058L445
$$ -4539 -8971 -12809 -15168 -16096 -16110 -15889 -16281 -17899 -20632 -23802 -26640 -28355 -28288 -26404 -23346 -19901
57378a9901K913R68k003l821k563P17L021L045K182K012K541L146L420a490c71
$$ -19901 -16988 -16020 -18023 -21844 -24407 -23690 -20669 -17624 -15442 -13430 -10889 -7743 -4323 -1490 -371
57362i39n86f86A014J121L94N98J014P40K48J42q7r21j595j275m69j49k78A75
$$ -939 -1525 -686 1014 2135 2529 3127 4141 4881 5129 5271 5184 4263 2668 1393 924 775 497 175
57343b74j224k560l786m296l648j768L41R84l28k028k338j273r2N59R50J327J669
$$ -274 -1498 -4058 -7844 -12140 -15788 -17556 -17215 -16231 -16559 -18587 -20925 -22198 -22290 -21731 -20781 -19454 -17785
57326a7785K137K908L714M140h32B455J495r00H52a80A530L561L083R76j322l007
$$ -17785 -15648 -12740 -9026 -4886 -832 2455 3950 3050 852 -180 1530 5091 8174 9150 7828 4821
57310D821A199a445l58a14A948J119M39O08O11m54k096a241m431n459n935m954
$$ 4821 1199 -1445 -1803 -114 1948 3067 3506 4114 4725 4271 2175 -1241 -5672 -11131 -17066 -22020
57294b2020k858j165q65j605k551l145k992k031j042j033j911k660l011l715m969
$$ -22020 -24878 -26043 -26908 -28513 -31064 -34209 -37201 -39232 -40274 -41307 -43218 -45878 -48889 -52604 -57573
57279e7573n838n718n037l969j919P56K102J008r10j402n82k66j038j732j528
$$ -57573 -63411 -69129 -74166 -78135 -80054 -79298 -77196 -76188 -77098 -78500 -79082 -79348 -80386 -82118 -83646
57264h3646q84l67Q6N75R00Q93M96l75j377j697j129p07j306k257k320j475p29
$$ -83646 -84530 -84897 -84811 -84236 -83336 -82443 -81947 -82322 -83699 -85396 -86525 -87232 -88538 -90795 -93115 -94590 -95319
57247i5319o54j136k001k798k617j275K2M40J023K861M612M054J606l0K06M64
$$ -95319 -95973 -97109 -99110 -101908 -104525 -105800 -105778 -105338 -104315 -101454 -96842 -92788 -91182 -91212 -91006 -90542
57231i0542p12k125k052q38N2L31P77J551J989J889K016L187N397P812R447R956
$$ -90542 -91254 -93379 -95431 -96269 -96217 -95886 -95109 -93558 -91569 -89680 -87664 -84477 -79080 -71268 -61821 -51865
57215e1865R831R734R751R613c581E720R421R289Q771Q207P890P724P446O990
$$ -51865 -42034 -32300 -22549 -12936 -3581 5720 15141 24430 33201 41408 49298 57022 64468 71458
57201G1458O609O675P243P803P749O975N589L323K42k165k099o6J223L89o67L50
$$ 71458 78067 84742 91985 99788 107537 114512 120101 123424 123666 121501 119402 119336 120559 120948 120281 120631
57185A20631K772M141L855L678M951O990Q281Q079O765N513N496O645P567P423
$$ 120631 123403 127544 131399 135077 140028 147018 155299 163378 170143 175656 181152 187797 195364 202787
57171B02787P117P806R017R585R715J0549J2159J3615J4848J6820J9769K2662
$$ 202787 209904 217710 226727 236312 246027 256576 268735 282350 297198 314018 333787 356449
57159C56449K4605K5707K6280K6378K6286K6537K7084K7253K6912K7003K8536
$$ 356449 381054 406761 433041 459419 485705 512242 539326 566579 593491 620494 649030
57148F49030L1329L4018L5377L5628L6270L8348M1146M3240M4372M5195M5485
$$ 649030 680359 714377 749754 785382 821652 860000 901146 944386 988758 1033953 1079438
57137A079438M4331M2310M1647M3380M5909M7135M6707M5422M3980M3135M3510
$$ 1079438 1123769 1166079 1207726 1251106 1297015 1344150 1390857 1436279 1480259 1523394 1566904
57126A566904M4373M4253M3564M4632M8071N1376N2560N2780N3528N3710N2038
$$ 1566904 1611277 1655530 1699094 1743726 1791797 1843173 1895733 1948513 2002041 2055751 2107789
57115B107789N0137N0303N1617N1402M9493M8095M8059M8170M7877M8176M9649
$$ 2107789 2157926 2208229 2259846 2311248 2360741 2408836 2456895 2505065 2552942 2601118 2650767
57104B650767N1692N3737N5684N7262N8303N9172N9750N8906N6242N3313N1644
$$ 2650767 2702459 2756196 2811880 2869142 2927445 2986617 3046367 3105273 3161515 3214828 3266472
57093C266472N0606M8809M6355M4052M1652L8581L5265L2080K8156K2762J6631
$$ 3266472 3317078 3365887 3412242 3456294 3497946 3536527 3571792 3603872 3632028 3654790 3671421
57082C671421J0450L610m216j1927j8953k6330l4483m2078m8642n5946o5146p5209
$$ 3671421 3681871 3685481 3681265 3669338 3650385 3624055 3589572 3547494 3498852 3442906 3377760 3302551
57070C302551q5744r8315j13020j27141j39543j52862j68932j85711k01534k18502
$$ 3302551 3216807 3118492 3005472 2878331 2738788 2585926 2416994 2231283 2029749 1811247
57060A811247k38654k60805k84487l12567l46299a3864m18354m57516n02381n50391
$$ 1811247 1572593 1311788 1027301 714734 368435 -13864 -432218 -889734 -1392115 -1942506
57050a942506n99384o52451p12389p77002q44969r19880j002609j086384j165555
$$ -1942506 -2541890 -3194341 -3906730 -4683732 -5528701 -6448581 -7451190 -8537574 -9703129
57041i703129j241674j314506j377069j430208j495295j603368j777575k029672
$$ -9703129 -10944803 -12259309 -13636378 -15066586 -16561881 -18165249 -19942824 -21972496
57033b1972496k358117k739542l138006l531828l909592m237502m492516m781198
$$ -21972496 -24330613 -27070155 -30208161 -33739989 -37649581 -41887083 -46379599 -51160797
57025e1160797n365701o439992p830684q994200r386291q834239p551555n873051
$$ -51160797 -56526498 -62966490 -70797174 -79791374 -89177665 -98011904 -105563459 -111436510
57017a11436510m047114k223932n05731J051710K437816L641739M624096N351319
$$ -111436510 -115483624 -117707556 -118213287 -117161577 -114723761 -111082022 -106457926 -101106607
57009a01106607N836564O130779O292819O380133O441619O490992O493517O396457
$$ -101106607 -95270043 -89139264 -82846445 -76466312 -70024693 -63533701 -57040184 -50643727
57001e0643727O171311N823481N377508M868646M339481L826682L348926K912269
$$ -50643727 -44472416 -38648935 -33271427 -28402781 -24063300 -20236618 -16887692 -13975423
56993a3975423K521447K179303J882272J625338J407632J227134J075218R43191
$$ -13975423 -11453976 -9274673 -7392401 -5767063 -4359431 -3132297 -2057079 -1113888
56985a113888b84225D51297O56503N86697N25113M72545M26022L82052L41789
$$ -1113888 -284225 451297 1107800 1694497 2219610 2692155 3118177 3500229 3842018
56976C842018L07693K78429K51691K28362K09252J91722J74365J61201J55976
$$ 3842018 4149711 4428140 4679831 4908193 5117445 5309167 5483532 5644733 5800709
56967E800709J55743J55161J53549J51921J45845J27633R4971N3053R390k9753
$$ 5800709 5956452 6111613 6265162 6417083 6562928 6690561 6785532 6838585 6847975 6818222
56957F818222n9708p8986r0456r8130j03590j07257j10828j15600j20438j24256
$$ 6818222 6758514 6679528 6589072 6490942 6387352 6280095 6169267 6053667 5933229 5808973
56947E808973j28581j35068j42715j50244j58960j70183j81892j90999j97065
$$ 5808973 5680392 5545324 5402609 5252365 5093405 4923222 4741330 4550331 4353266
56938D353266k00925k01591j97721j90535j82204j72667j60835j47710j35615
$$ 4353266 4152341 3950750 3753029 3562494 3380290 3207623 3046788 2899078 2763463
56929B763463j25263j15851j07044r8881r0883q3027p6369p1221o6415o1858n9830
$$ 2763463 2638200 2522349 2415305 2316424 2225541 2142514 2066145 1994924 1928509 1866651 1806821
56918A806821o1792o5748o8578o9151o7574o3612n8083n3618n1757n0932m9237
$$ 1806821 1745029 1679281 1610703 1541552 1473978 1410366 1352283 1298665 1246908 1195976 1146739
56907A146739m7203m5772m3784l9914l5197l1216k7569k3459j9875j7644j5160
$$ 1146739 1099536 1053764 1009980 970066 934869 903653 876084 852625 832750 815106 799946
56896G99946j0878o693n937r029j3560j7686k0977k2799k2452k0607j8687j7019
$$ 799946 789068 782375 776438 767409 753849 736163 715186 692387 669935 649328 630641 613622
56884F13622j4929j2082q613m790j508N9K20Q71K980N517P569R633J1918J3613
$$ 613622 598693 586611 577998 573208 571700 571759 571979 572850 575830 581347 588916 598549 610467 624080
56870F24080J4732J6135J6461J2032J844r948j8733k4145k7981l0188k9910k8305
$$ 624080 638812 654947 671408 683440 685284 675336 656603 632458 604477 574289 544379 516074
56858E16074k7129k5915k3344k0043j7435j5180j2231r155p022n349l473k498
$$ 516074 488945 463030 439686 419643 402208 387028 374797 365642 358620 353271 349798 347300
56846C47300l392m532l786j816q07j052j230r99p63M5J989L819M129L896N133
$$ 347300 343908 339376 335590 333774 332967 331915 330685 329686 328923 328968 330957 334776 338905 342801 347934
56831C47934P769J0143J1664J2838J3603J3865J4636J6270J6472J2643N579j381
$$ 347934 355703 365846 377510 390348 403951 417816 432452 448722 465194 477837 483416 482035
56819D82035o222r145j0475j0142q858p563n950l269n8K577M695O954R267J1544
$$ 482035 475813 466668 456193 446051 437193 429630 423680 420411 420353 422930 427625 434579 443846 455390
56805D55390J4614J8616K1907K3614K5727L0193L5181L6923L4210K8455K0360
$$ 455390 470004 488620 510527 534141 559868 590061 625242 662165 696375 724830 745190
56794G45190R651k235j2229j8751k2439k3900k2798j9343j4727r902n275j243
$$ 745190 754841 752606 740377 721626 699187 675287 652489 633146 618419 608517 603242 601999
56782F01999K346O669J2478J8930K5145L1640L8660M4527M7767M9421N0773M9984
$$ 601999 604345 611014 623492 642422 667567 699207 737867 782394 830161 879582 930355 980339
56770I80339M3687L1219J4948k600j9341l2456l9809m2337m2483m0699l6039k9554
$$ 980339 1024026 1055245 1070193 1067593 1048252 1015796 975987 933650 891167 850468 814429 784875
56758G84875k4008k0208j6400j1456o049n72N533J1978J7441K1654K5696K9921
$$ 784875 760867 740659 724259 712803 706754 706182 711715 723693 741134 762788 788484 818405
56746H18405L3247L4463L2496K5821J3839j068j4861k5217l2159l5935l6582l5171
$$ 818405 851652 886115 918611 944432 958271 957203 942342 917125 884966 849031 812449 777278
56734G77278l3068l0068k5306j9818j5769j3354j0756p160l497k47L037O005P806
$$ 777278 744210 714142 688836 669018 653249 639895 629139 621979 618482 618235 621272 627277 635083
56721F35083R271J2102J5493J5988J1542L669m989j3113k0130k5257k8178k9305
$$ 635083 644354 656456 671949 687937 699479 703148 698159 685046 664916 639659 611481 582176
56709E82176k8804k6717k4094k2348k1232j9232j6105j3309j1632j0229q436o815
$$ 582176 553372 526655 502561 480213 458981 439749 423644 410335 398703 388474 380038 373223
56697C73223n891n341m916m838n076n308n612o005n582l653j415q32j950k903
$$ 373223 367332 361991 357075 352237 347161 341853 336241 330236 324654 321001 319586 318754 316804 313901
56683C13901k447r54P79K049K031O52o50o88l87j112k197k260j958k711l507k149
$$ 313901 311454 310500 311279 313328 315359 316011 315361 314673 314286 313174 310977 308717 306759 304048 300541 298392
56667B98392O60J822N10r69j341k060l951n296m614k865j523o52l5j97j163j946
$$ 298392 299052 300874 301384 300415 299074 297014 293063 287767 283153 280288 278765 278113 278078 277881 276718 274772
56651B74772k083j950j247P22K832K755O36m67J089L186L345K116J300R01j14
$$ 274772 272689 270739 269492 270214 273046 275801 276437 275970 277059 280245 283590 285706 287006 287907 287793
56636B87793j367j482k03J331K029J559K82q09o69O88K174K870K578J347n12j998
$$ 287793 286426 284944 284741 286072 288101 289660 289942 289133 288464 289152 291326 294196 296774 298121 297609 295611
56620B95611k247j699j300r59j21P14P98Q67K061L543L539K405K150L047L396
$$ 295611 293364 291665 290365 289406 289285 289999 290797 291664 293725 297268 300807 303212 305362 308409 311805
56605C11805K698K262K386J821O04N40K038L304L506L926M875M410J654j280k280
$$ 311805 314503 316765 319151 320972 321576 322116 324154 327458 330964 334890 339765 344175 345829 344549 342269
56590C42269j821r98M40K285K482j19l394m510l493k447k490l335m614n860o065
$$ 342269 340448 339450 339890 342175 344657 344538 341144 336634 333141 330694 328204 324869 320255 314395 308330
56575C08330m747k841j462p33m71p51j017j75J412J710l4j748j354L01Q79k73
$$ 308330 303583 300742 299280 298547 298076 297325 296308 296133 297545 299255 299221 297473 296119 296420 297299 297026
56559B97026j842k568k183j067k8J47k96k58O33J489J589J186N60m29j487j923
$$ 297026 295184 292616 290433 289366 289338 289485 289189 288931 289564 291053 292642 293828 294388 293959 292472 290549
56543B90549j853j981k028j045N54J261R98J212J970J453q11k581k079l61P76
$$ 290549 288696 286715 284687 283642 284196 285457 286455 287667 289637 291090 290279 287698 285619 285258 286034
56528B86034J254J648J469J76j413k060j397L10K401L382K104j36o59Q63K010
$$ 286034 287288 288936 290405 290581 289168 287108 285711 286021 288422 291804 293908 293772 293113 293976 295986
56513B95986J562J132J871K405J583P49J309K402K869L545N506P838R045R171
$$ 295986 297548 298680 300551 302956 304539 305288 306597 308999 311868 315413 320919 328757 337802 346973
56499C46973Q945Q440P984Q487R448Q591N090J147j180k488l777m222l300k773
$$ 346973 355918 364358 372342 380829 390277 398868 403958 405105 403925 401437 397660 393438 390138 387365
56485C87365l987n202m232k024r81j257j267o69m19q21j550k564l285k370l4J186
$$ 387365 383378 378176 373944 371920 370939 369682 368415 367746 367327 366506 364956 362392 359107 356737 356703 357889
56469C57889l6j469p42R31J084P7k09r6j166k735k684j217o02j453k163j951j804
$$ 357889 357853 356384 355642 356573 357657 357734 357525 357429 356263 353528 350844 349627 349025 347572 345409 343458 341654
56452C41654k251k587k415k128j899j802k529m302n661n111l367k244j984j519
$$ 341654 339403 336816 334401 332273 330374 328572 326043 321741 316080 310969 307602 305358 303374 301855
56438C01855n59L95J406K566K963K022J016J278J935J525P92J468L088L662K932
$$ 301855 301296 301691 303097 305663 308626 310648 311664 312942 314877 316402 317194 318662 321750 325412 328344
56423C28344K412K587K590K328K401K177N76j179m34K818N208M312J533l37o80
$$ 328344 330756 333343 335933 338261 340662 342839 343415 342236 341802 344620 349828 354140 355673 355336 354656
56408C54656q38j568k096j463J54J635K119J707Q38n36k373l604l168j771j025
$$ 354656 353818 352250 350154 348691 348845 350480 352599 354306 355144 354608 352235 348631 345463 343692 342667
56393C42667q47J88J785J764k41j646p11J072J888K203K661K066j04j646o91J210
$$ 342667 341820 342008 343793 345557 345316 343670 342959 344031 345919 348122 350783 352849 352745 351099 350408 351618
56377C51618J625Q59L79k64j863k865j496Q35J428L64k51Q7L99P63J716K271J414
$$ 351618 353243 354102 354481 354217 352354 349489 347993 348828 350256 350620 350369 350456 350855 351618 353334 355605 357019
56360C57019M04P35J261L46p28j0J128J66j674j120J399K194L42j237j017q20
$$ 357019 357423 358158 359419 359765 359037 359027 360155 360321 358647 357527 358926 361120 361462 360225 359208 358388
56344C58388j673j668M94L038L698K495Q74%M93K078L257K933K098K189K607K007
$$ 358388 356715 355047 355541 358579 362277 364772 365646 365646 366139 368217 371474 374407 376505 378694 381301 383308
56328C83308J007J004J320M63p90p92m39j628l175k227O93K135J107n3k89j103
$$ 383308 384315 385319 386639 387102 386312 385520 385081 383453 380278 378051 378744 380879 381986 381933 381644 380541
56312C80541k704k998j370J29L54M46Q56L61j097j856j561j612j976r79J124J901
$$ 380541 377837 374839 373469 373598 373952 374398 375254 375615 374518 372662 371101 369489 367513 366534 367658 369559
56296C69559Q03rL67M25j69J89J231M03k277k995J65M143N610N251N012M563L268
$$ 369559 370362 370353 370720 371145 370976 371165 372396 372799 370522 367527 367692 371835 377445 382696 387708 392271 395539
56279C95539K690M178O227O813O490O830P569P447O352M908L462K784L970O374
$$ 395539 398229 402407 408634 415447 421937 428767 436336 443783 450135 455043 458505 461289 465259 471633
56265D71633P460N959L442J869J531K160L694N008M393K273J092J626K084J636
$$ 471633 479093 485052 488494 490363 491894 494054 497748 502756 507149 509422 510514 512140 514224 515860
56251E15860J786L141M059L817L920M773M468K740K594N586Q753Q966P502P385
$$ 515860 517646 520787 524846 528663 532583 537356 541824 544564 547158 552744 561497 570463 577965 585350
56237E85350Q737R697R862R878R413Q285Q067R926J2239J2645J1255R827R178
$$ 585350 594087 603784 613646 623524 632937 641222 649289 659215 671454 684099 695354 705181 714359
56224G14359R267J0463J2782J5141J6904J8752K0786K1673K1050K0673K1647K2753
$$ 714359 723626 734089 746871 762012 778916 797668 818454 840127 861177 881850 903497 926250
56212I26250K3260K4845K8497L2020L3243L3637L5981M0039M3456M5572M7698
$$ 926250 949510 974355 1002852 1034872 1068115 1101752 1137733 1177772 1221228 1266800 1314498
56201A314498N0525N3761N7638O2627O8217P3693P9391Q5883R2911J00440J09473
$$ 1314498 1365023 1418784 1476422 1539049 1607266 1680959 1760350 1846233 1939144 2039584 2149057
56190B149057J20465J32192J43470J54553J65682J75937J84795J92940K00093
$$ 2149057 2269522 2401714 2545184 2699737 2865419 3041356 3226151 3419091 3619184
56181C619184K04056K03610K00333J95655J88024J74985J56342J33239J05921
$$ 3619184 3823240 4026850 4227183 4422838 4610862 4785847 4942189 5075428 5181349
56172E181349P4641M1236P720k5352n7326q6048j10137j30939j49918j65671j76049
$$ 5181349 5255990 5297226 5304946 5279594 5222268 5136220 5026083 4895144 4745226 4579555 4403506
56161D403506j81845j85702j88178j87522j83006j76191j68974j61965j54656
$$ 4403506 4221661 4035959 3847781 3660259 3477253 3301062 3132088 2970123 2815467
56152B815467j46129j36001j25463j16630j10096j04161r7170q9308q1449p3856
$$ 2815467 2669338 2533337 2407874 2291244 2181148 2076987 1979817 1890509 1809060 1735204
56142A735204o6945o1747n8480n5966n3179m9941m5861m0641l5781l3440l2933
$$ 1735204 1668259 1606512 1548032 1492066 1438887 1388946 1343085 1302444 1266663 1233223 1200290
56131A200290l1078k7026k3673k2891k2450j9642j5222j1567r281p784p080o876
$$ 1200290 1169212 1142186 1118513 1095622 1073172 1053530 1038308 1026741 1017460 1009676 1002596 995720
56119I95720n930m138l286m165n017m437l424k922j907K54K100K571K815L705
$$ 995720 989790 985652 982366 978201 973184 968747 965323 962401 960494 960748 962848 965419 968234 971939
56105I71939M229M119N291Q477J1239J1542J0722J0758J1375J2004J3795J7182
$$ 971939 976168 980287 985578 994055 1005294 1016836 1027558 1038316 1049691 1061695 1075490 1092672
56093A092672K0199K1632K3233K6454K9828L1926L4039L7486M1207M4678N0048
$$ 1092672 1112871 1134503 1157736 1184190 1214018 1245944 1279983 1317469 1358676 1403354 1453402
56082A453402N8613O8105P6219Q3889R2274R9731J04612J07700J08857J04767
$$ 1453402 1512015 1580120 1656339 1740228 1832502 1932233 2036845 2144545 2253402 2358169
56072B358169R3766P9713O7611N8300N0743M5833M3837M1281L4862K5974J7536
$$ 2358169 2451935 2531648 2599259 2657559 2708302 2754135 2797972 2839253 2874115 2900089 2917625
56061B917625R280J31p863j2459j5665k1175k9729m0583n4382p0489q4559r3099
$$ 2917625 2926905 2927036 2919173 2906714 2891049 2869874 2840145 2799562 2745180 2674691 2590132 2497033
56049B497033r7593j00113r8592r1233q1896p5494p0985o4418n5967m8261m0629
$$ 2497033 2399440 2299327 2200735 2109502 2027606 1952112 1881127 1816709 1760742 1712481 1671852
56038A671852l1266k2786j9262j9366j8348j5263j2486r864n460p23J096P93J867
$$ 1671852 1640586 1617800 1598538 1579172 1560824 1545561 1533075 1523211 1517751 1517028 1518124 1518917 1520784
56025A520784M313N334N089O219Q485R419R521J1383J4310J5042J3380J2210J2506
$$ 1520784 1525097 1530431 1535520 1541739 1550224 1559643 1569164 1580547 1594857 1609899 1623279 1635489 1647995
56012A647995J2920J3466J5216J7270J8253J9491K2590K5747K6647K6831K8645
$$ 1647995 1660915 1674381 1689597 1706867 1725120 1744611 1767201 1792948 1819595 1846426 1875071
56001A875071L0511L0096K9427L1583L5049L6783L7909M0643M2633M0661L7117
$$ 1875071 1905582 1935678 1965105 1996688 2031737 2068520 2106429 2147072 2189705 2230366 2267483
55990B267483L6340L7293L6402L4712L5349L6842L6101L5164L7646M1340M2007
$$ 2267483 2303823 2341116 2377518 2412230 2447579 2484421 2520522 2555686 2593332 2634672 2676679
55979B676679M1565M4642M9878N2872N4736N9233O4380O6044O6999P2736Q0832
$$ 2676679 2718244 2762886 2812764 2865636 2920372 2979605 3043985 3110029 3177028 3249764 3330596
55968C330596Q4522Q4653Q7799R4393R9251J02435J08787J17684J23979J28379
$$ 3330596 3415118 3499771 3587570 3681963 3781214 3883649 3992436 4110120 4234099 4362478
55958D362478J36327J47313J55704J61450J69304J78525J84268J88309J97053
$$ 4362478 4498805 4646118 4801822 4963272 5132576 5311101 5495369 5683678 5880731
55949E880731K09821K20403K29149K41678K56760K68061K76988K90919L09377
$$ 5880731 6090552 6310955 6540104 6781782 7038542 7306603 7583591 7874510 8183887
55940H183887L25148L38467L56382L78561L97983M15463M38874M68018M95080
$$ 8183887 8509035 8847502 9203884 9582445 9980428 10395891 10834765 11302783 11797863
55931A1797863N20048N50413N85899O19613O54003O98589P51751Q02676Q51744
$$ 11797863 12317911 12868324 13454223 14073836 14727839 15426428 16178179 16980855 17832599
55922A7832599R10387R80062J050831J121867J203379J297153J396070J504049
$$ 17832599 18742986 19723048 20773879 21895746 23099125 24396278 25792348 27296397
55914B7296397J634299J786378J947807K119495K315317K536266K772020L029423
$$ 27296397 28930696 30717074 32664881 34784376 37099693 39635959 42407979 45437402
55906D5437402L331623L689581M105860M604449N217595N939974O736194P597688
$$ 45437402 48769025 52458606 56564466 61168915 66386510 72326484 79062678 86660366
55898H6660366Q550802R610447J0781011J2108375J3669402J5499674J7595655
$$ 86660366 95211168 104821615 115602626 127711001 141380403 156880077 174475732
55891A74475732J9989447K2730397K5776092K8986449L2160537L4776476L5538522
$$ 174475732 194465179 217195576 242971668 271958117 304118654 338895130 374433652
55884C74433652L2537603K4474026J2020639k152736j4895247k4227457k9795578
$$ 374433652 406971255 431445281 443465920 441313184 426417937 402190480 372394902
55877C72394902l2238595l2449504l1247780k9278628k6942265k4424945k1839508
$$ 372394902 340156307 307706803 276459023 247180395 220238130 195813185 173973677
55870A73973677j9307213j6921519j4721446j2734236j0996335r515351q257186
$$ 173973677 154666464 137744945 123023499 110289263 99292928 89777577 81520391
55863H1520391p189051o300154n570407m957037m426857l971982l583440l238467
$$ 81520391 74331340 68031186 62460779 57503742 53076885 49104903 45521463 42282996
55855D2282996k924195k647205k409278k196901k002709j834060j691873j562265
$$ 42282996 39358801 36711596 34302318 32105417 30102708 28268648 26576775 25014510
55847B5014510j437417j325051j229652j142829j059556r86221r25184q67669
$$ 25014510 23577093 22252042 21022390 19879561 18820005 17833784 16908600 16040931
55839A6040931q08953p55640p11524o70485o28970n91726n59921n26985m91339
$$ 16040931 15231978 14476338 13764814 13094329 12465359 11873633 11313712 10786727 10295388
55830A0295388m60150m35819m11425l84159l60432l42870l24677l02089k80732
$$ 10295388 9835238 9399419 8987994 8603835 8243403 7900533 7575856 7273767 6993035
55821F993035k64675k50480k36875k29064k28234k27255k21848k16062k12218
$$ 6993035 6728360 6477880 6241005 6011941 5783707 5556452 5334604 5118542 4906324
55812D906324k05642j94261j83533j76816j70104j61094j54043j50647j45314
$$ 4906324 4700682 4506421 4322888 4146072 3975968 3814874 3660831 3510184 3364870
55803C364870j34930j24796j19286j14723j06938r8292r1846q5691p8349p2943
$$ 3364870 3229940 3105144 2985858 2871135 2764197 2665905 2574059 2488368 2410019 2337076
55793B337076p0926o8108o1931n6455n5302n5580n3554n0749m9748m9239m7593
$$ 2337076 2266150 2198042 2136111 2079656 2024354 1968774 1915220 1864471 1814723 1765484 1717891
55782A717891m6430m6695m5971m3174m0948m0292l8077l3112k9015k7757k5996
$$ 1717891 1671461 1624766 1578795 1535621 1494673 1454381 1416304 1383192 1354177 1326420 1300424
55771A300424k1505j7595j7130j7410j5289j2528j1885j2327j2111j2498j4569
$$ 1300424 1278919 1261324 1244194 1226784 1211495 1198967 1187082 1174755 1162644 1150146 1135577
55760A135577j6349j6565j7333j9858k1453k0144j8264j8265j8808j8020j6732
$$ 1135577 1119228 1102663 1085330 1065472 1044019 1023875 1005611 987346 968538 950518 933786
55749I33786j5630j3205r397p176p665p805n612l429l044k175R06L591L304J557
$$ 933786 918156 904951 895554 888378 880713 872908 867296 863867 860823 858648 859554 863145 866449 868006
55735H68006N02m94j653o73K603L941J006k304k006l85j680n224p589q368r127
$$ 868006 868508 868014 866361 865688 868291 872232 873238 870934 868928 868543 866863 861639 854050 845682 836555
55720H36555r445q662r035j2572j6813j7948j6214j4324j2773j0607q732q304
$$ 836555 827110 818448 809413 796841 780028 762080 745866 731542 718769 708162 699430 691126
55708F91126p664m788j274j63j265k246k849m332o041o176n065m491m613m444
$$ 691126 683462 678674 677400 677237 675972 673726 670877 666545 660504 654328 649263 644772 640159 635715
55694F35715m323n086n925n666n090n433n972n640n499o862q418q097o568o067
$$ 635715 631392 626306 620381 614715 609625 604192 598220 592580 587081 580219 571801 563704 557136 551069
55680E51069o845p485p646p882p686o258m342l126k418j962k936n693p682o498
$$ 551069 544224 536739 529093 521211 513525 507267 502925 499799 497381 495419 492483 486790 479108 472610
55666D72610l692k644l755m751m719m676m677l663k064j786l190m418m030k515
$$ 472610 468918 466274 462519 457768 453049 448373 443696 440033 437969 436183 432993 428575 424545 422030
55652D22030j053l35m60o90L34K879N116N199L639K204J322J14j642l259m356
$$ 422030 420977 420642 420182 419492 419826 422705 427821 433020 436659 438863 440185 440299 438657 435398 431042
55637D31042n035n297n404o049p077o956m796j971n10p17j449j860j749j092k75
$$ 431042 426007 420710 415306 409257 402180 395224 390428 388457 387947 387230 385781 383921 382172 381080 380805
55622C80805K25J049L485O960Q822P691N349L844K755R21r75j708j857k658l558
$$ 380805 381030 382079 385564 392524 401346 409037 414386 418230 420985 421906 420931 419223 417366 414708 411150
55607D11150l060j136Q29J874J779N94q03q28P20J910J293j10p94j089j750j824
$$ 411150 408090 406954 407783 409657 411436 412030 411227 410399 411119 413029 414322 414212 413418 412329 410579 408755
55591D08755j60K189L072K038L17j029j483p71L54J90j582k902k141m75J2j031
$$ 408755 408595 410784 413856 415894 416211 415182 413699 412928 413282 413472 411890 408988 406847 406372 406384 405353
55575D05353l074o243r975j1928j0667q060o755o623n990m790m016l286j782n49
$$ 405353 402279 396036 386061 374133 363466 355406 348651 342028 336038 331248 327232 323946 322164 321615
55561C21615j086k524k847k210k290k992k647j231n79j300j885j245j06L67k88
$$ 321615 320529 318005 315158 312948 310658 307666 305019 303788 303209 301909 300024 298779 298673 299040 298752
55546B98752k106m551o275o368n580n075m680l731k625j944j053O14J935J747
$$ 298752 296646 292095 285820 279452 273872 268797 264117 260386 257761 255817 254764 255378 257313 259060
55532B59060J065J445K149J370n04j357n58O83J678K636L067K316J376J749K820
$$ 259060 260125 261570 263719 265089 264585 263228 262670 263353 265031 267667 270734 273050 274426 276175 278995
55517B78995K786J899K221M149N819O156O054O194O147O118P235R307J0278Q802
$$ 278995 281781 283680 285901 290050 295869 302025 308079 314273 320420 326538 333773 343080 353358 362160
55503C62160N772K765M38j122j976k751m129n634o156n752n524n741n557m609
$$ 362160 367932 370697 371135 370013 368037 365286 361157 355523 349367 343615 338091 332350 326793 322184
55489C22184l404k043j36J915K964K696J847R57J01k93J68P77M56n33j007p13
$$ 322184 318780 316737 316601 318516 321480 324176 326023 326980 327081 326788 326956 327733 328189 327656 326649 325936
55473C25936m01l91n55j294k838l975l346j723j138j917k551k461k790m174n652
$$ 325936 325535 325144 324589 323295 320457 316482 313136 311413 310275 308358 305807 303346 300556 296382 290730
55458B90730o162n662m560l346k888l688m898n360n253n310n089l850k557k888
$$ 290730 284568 278906 274346 271000 268112 264424 259526 254166 248913 243603 238514 234664 232107 229219
55444B29219m543n661n640n384n057l957k515j970k028j236L11J106J062J500
$$ 229219 224676 219015 213375 207991 202934 198977 196462 194492 192464 191228 191539 192645 193707 195207
55430A95207K144J215r79j722j92Q83o17l047l760k633j115K78J594K257K036
$$ 195207 197351 198566 197587 195865 195673 196556 195939 192892 189132 186499 185384 185662 187256 189513 191549
55415A91549J903K432K626J685N75N16J195J747K093J973K14l279o017n324j685
$$ 191549 193452 195884 198510 200195 200770 201286 202481 204228 206321 208294 208508 205229 199212 193888 192203
55400A92203J855L114K379J031m1p98j703k922l698l116j704j165k002k622j610
$$ 192203 194058 197172 199551 200582 200541 199743 198040 195118 191420 188304 186600 185435 183433 180811 179201
55385A79201J89R44L19m11j03J357L350M815M652K651q3k079k637j930n72N80
$$ 179201 179390 180334 180653 180242 180139 181496 184846 189661 194313 196964 196881 194802 192165 190235 189663 190243
55369A90243Q96N50K10Ln05j304j754j663j711k439l410l681k619l43K136L392
$$ 190243 191139 191689 191899 191902 191397 190093 188339 186676 184965 182526 179116 175435 172816 172473 174609 178001
55353A78001K949J832J117N42m19r38J09J961K642J649K26q01j578j790q39L86
$$ 178001 180950 182782 183899 184441 184022 183084 183193 185154 187796 189445 189671 188870 187292 185502 184663 185049
55337A85049J63j233j572o2J479J598J115R61L67j297k680k109M2K135L273L337
$$ 185049 185212 183979 182407 182345 183824 185422 186537 187498 187865 186568 183888 181779 181821 183956 187229 190566
55321A90566K157m7k093k853k355j332m05k2l26p47p14p59j599k277j102J422
$$ 190566 192723 192676 190583 187730 185375 184043 183638 183616 183290 182543 181829 181070 179471 177194 176092 177514
55305A77514K790K032P77K15m45j520j454L47J742P90j364k583k815l104l154
$$ 177514 180304 182336 183113 183328 182883 181363 179909 180256 181998 182788 181424 178841 176026 172922 169768
55290A69768k093m42P61J674K601K581J108RJ158L262L339R07j597k236j372k33
$$ 169768 167675 167233 167994 169668 172269 174850 175958 175967 177125 180387 183726 184633 183036 180800 179428 179195
55274A79195L01l80k087l278k560o71M87N04N86J316J976J971J359K0k062l622
$$ 179195 179496 179116 177029 173751 171191 170520 171007 171511 172097 173413 175389 177360 178719 178739 176677 173055
55258A73055l014o14J159Q36m10o54L00J202J305J066R97O65o70k520l089j338
$$ 173055 170041 169427 170586 171422 171012 170358 170658 171860 173165 174231 175228 175893 175223 172703 169614 168276
55242A68276J244K099Q07m46N8J510K202J809R44k30j583k143j156N39J458J359
$$ 168276 169520 171619 172426 171980 172038 173548 175750 177559 178503 178273 176690 174547 173391 173930 175388 176747
55226A76747J019O70q3j117j702j472p06J82Q41J004P81M68j62j471k610j886
$$ 176747 177766 178436 178353 177236 175534 174062 173356 173538 174379 175383 176164 176632 176470 174999 172389 170503
55210A70503P66L052L067J670R77J608K621L070K420M82j838k771j936j214k036
$$ 170503 171269 174321 177388 179058 180035 181643 184264 187334 189754 190236 188398 185627 183691 182477 180441
55195A80441l190k879j615j137j550j670j337j172p84O01K153K269J083J86J48
$$ 180441 177251 174372 172757 171620 170070 168400 167063 165891 165107 165708 167861 170130 171213 171399 171547
55180A71547K02J05K90N64M97Q31K362L763K899J88j671j514q96j159j698j701
$$ 171547 171749 171854 172144 172708 173205 174036 176398 180161 183060 183248 181577 180063 179167 178008 176310 174609
55164A74609j455j146l50N57M34m98m42J198K730K822K283K105J618J46j213j206
$$ 174609 173154 172008 171658 172215 172649 172151 171709 172907 175637 178459 180742 182847 184465 184611 183398 182192
55148A82192n79q77k041k854k939k660j698L38K181J823m77j953r01R38Q67q85
$$ 182192 181613 180736 178695 175841 172902 170242 168544 168882 171063 172886 172409 170456 169555 170493 171360 170475
55132A70475j535J75K086J674m33j499m64J146J982K554L520M107L418K029J089
$$ 170475 168940 169115 171201 172875 172442 170943 170479 171625 173607 176161 179681 183788 187206 189235 190324
55117A90324P01L71R8j25r27k384l115j930K85J749K087K096K082J910J901J967
$$ 190324 191025 191396 191494 191369 190442 188058 184943 183013 183298 185047 187134 189230 191312 193222 195123 197090
55101A97090Q68j813l863k942j78J258P28M05J146J223k41j560j419r20j269j631
$$ 197090 197958 196145 192282 189340 189162 190420 191148 191553 192699 193922 193681 192121 190702 189782 188513 186882
55085A86882r43p5l57j333j652j198q81j063j396j606j481p93J09L81J0P2R82
$$ 186882 185939 185864 185507 184174 182522 181324 180443 179380 177984 176378 174897 174104 174213 174594 174604 174676 175658
55068A75658J597R42j84l70M68J312J577J459J230J007R23J007J084J036P35j29
$$ 175658 177255 178197 178013 177643 178111 179423 181000 182459 183689 184696 185619 186626 187710 188746 189481 189352
55052A89352j511k424j890l77Q27J478K134K338R91j140j679j76Q94l7j026K57
$$ 189352 187841 185417 183527 183150 183977 185455 187589 189927 190918 189778 188099 187923 188817 188780 187754 188011
55036A88011K691L331J714J65K60J295K082K388K352K036J824K085K275J431l19
$$ 188011 190702 194033 195747 195912 196172 197467 199549 201937 204289 206325 208149 210234 212509 213940 213621
55021B13621j724j991j450n93N32J658J984J110j95p22j23P70R65L11n61j225
$$ 213621 211897 209906 208456 207863 208395 210053 212037 213147 212952 212230 212107 212877 213842 214153 213592 212367
55005B12367j924k820l294k640j197J8N96Q87R80O20J40K36O96N51j04Q8J465
$$ 212367 210443 207623 204329 201689 200492 200510 201106 201993 202973 203593 203733 203969 204665 205216 205112 205200 206665
54988B06665K316J103j285k698k260p73P43J674J558L35j311k574l167k959j589
$$ 206665 208981 210084 208799 206101 203841 203068 203811 205485 207043 207378 206067 203493 200326 197367 195778
54973A95778P17K669L068K126Q61j74q85r35q4J128J821J706R58l04j797k771
$$ 195778 196495 199164 202232 204358 205219 205045 204160 203225 203141 204269 206090 207796 208754 208450 206653 203882
54957B03882k731k009j014M59K361L556K983J245q1n04q89j765k539k478j678
$$ 203882 201151 199142 198128 198587 200948 204504 207487 208732 208651 208147 207258 205493 202954 200476 198798
54942A98798o53L01J125J751K112K187J931J343N58k24p65p93l33K4l01r81j117
$$ 198798 198145 198446 199571 201322 203434 205621 207552 208895 209453 209229 208464 207671 207338 207362 207061 206080 204963
54925B04963n22J08M08P83J304J298N79qj0k05j102j631o07J267K166J485K62
$$ 204963 204441 204549 204957 205740 207044 208342 208921 208913 208903 208698 207596 205965 205358 206625 208791 210276 210538
54908B10538l48O0J447L308M455L921K062P8j342k149k184j310j55L37L5m03n31
$$ 210538 210190 210250 211697 215005 219460 223381 225443 225521 224179 222030 219846 218536 218381 218718 218753 218350 217819
54891B17819l90n0K84L1r18j412k39J938L036K096L43n66m52l12q34j663j813
$$ 217819 217429 217379 217663 217694 216776 215364 215125 217063 220099 222195 222538 221972 221520 221208 220374 218711 216898
54874B16898o51J251K344J684J70m67K05J042J219J388K457M012M770M316L652
$$ 216898 216247 217498 219842 221526 221696 221229 221434 222476 223695 225083 227540 231552 236322 240638 244290
54859B44290L900M977N924O260O497P084P461O830N618N278O375P736P835O409
$$ 244290 248190 253167 259091 265351 271848 278932 286393 293223 298841 304119 310494 318230 326065 332474
54845C32474M109J254k207n752q167q656p756o915p116p800p477n621l667l391
$$ 332474 336583 337837 335630 329878 321711 313055 305299 298384 291268 283468 275991 270370 266703 263312
54831B63312m586n302m286k133K5J642K198J044j434l512l845k661q09J223K813
$$ 263312 258726 253424 249138 247005 247030 248672 250870 251914 250480 246968 243123 240462 239653 240876 243689
54816B43689L161K656K953M537N667N050M205N334P921R419Q720O994N443M084
$$ 243689 246850 249506 252459 256996 262663 267713 271918 277252 285173 294592 303312 310306 315749 319833
54802C19833K685J242n55k986n425o939p552p788p390n969m449m207m935m999
$$ 319833 322518 323760 323205 320219 314794 307855 300303 292515 285125 279156 274707 270500 265565 260566
54788B60566l923k881k661k768k753k901l169k909j982j005k65M03N21p24k844
$$ 260566 256643 253762 251101 248333 245580 242679 239510 236601 234619 233614 233349 233752 234273 233549 230705
54773B30705m145l908l103k553j787l91Q82J164O82J96p2l61q14j372j693j195
$$ 230705 226560 222652 219549 216996 215209 214818 215700 216864 217546 217742 217670 217309 216495 215123 213430 212235
54757B12235J16J185J199R43J583K505K166Q15K48P41N66q60j768j058j71m50
$$ 212235 212351 213536 214735 215678 217261 219766 221932 222747 222995 223736 224302 223442 221674 220616 220445 219995
54741B19995q01J13J194P92j96L33K015K411R02l05M91K245L053K622J808R38
$$ 219995 219194 219307 220501 221293 221097 221430 223445 225856 226758 226453 226944 229189 232242 234864 236672 237610
54725B37610j80j129r26O13K189K079k1k441l096j670R1M14o61j667j398K66K650
$$ 237610 237430 236301 235375 235988 238177 240256 240235 237794 234698 233028 233119 233533 232872 231205 229807 230073 232723
54708B32723M767N745N475M861N009O086P253P635P173O604O751P719Q708Q798
$$ 232723 237490 243235 248710 253571 258580 264666 271919 279554 286727 293331 300082 307801 316509 325307
54694C25307P844O305M337J625j769n028p309q442q684q260p362o234m947l496
$$ 325307 333151 339456 343793 345418 343649 338621 331312 322870 314186 305926 298564 292330 287383 283887
54680B83887k231j846k688m300n697n875m395j934p1J95m98r14q84q72m32J329
$$ 283887 281656 279810 277122 272822 267125 261250 256855 254921 254850 255045 254547 253633 252749 251877 251445 252774
54664B52774L746M853M026K793K314J892Q71L70J698M339O971R279J1166J1312
$$ 252774 256520 261373 265399 268192 270506 272398 273269 273639 275337 279676 286647 295926 307092 318404
54650C18404Q634M528J577J72j677n008q292r600q807p077n396m365m295m716
$$ 318404 327038 331566 333143 333315 331638 326630 318338 308738 299931 292854 287458 283093 278798 274082
54636B74082m536l375k068j413j172q55o87j022j438j379j242j822k818k920j676
$$ 274082 269546 266171 264103 262690 261518 260663 259976 258954 257516 256137 254895 253073 250255 247335 245659
54621B45659l95o03k110l207k674r94M06O17k65j563k510k541j674n75N3K58O35
$$ 245659 245264 244661 242551 239344 236670 235676 236082 236699 236434 234871 232361 229820 228146 227571 227624 227882 228517
54604B28517J422K127K239J903J642J605J332L06j358k779l062k257j366j218
$$ 228517 229939 232066 234305 236208 237850 239455 240787 241093 239735 236956 233894 231637 230271 229053
54590B29053j524j357l77P99J333R84K56j8N46J290J132M5p07l39J87l36j328
$$ 229053 227529 226172 225795 226594 227927 228911 229167 229149 229695 230985 232117 232162 231455 231116 231303 230967 229639
54573B29639j248l7Q61R08J135J997K269J002q01j608j428j303j457j284p77o65
$$ 229639 228391 228354 229215 230123 231258 233255 235524 236526 235725 234117 232689 231386 229929 228645 227868 227203
54557B27203j133j350o64L79N43o40k160k438r54J219K704L166K984K226Q72l09
$$ 227203 226070 224720 224056 224435 224978 224338 222178 219740 218786 220005 222709 225875 228859 231085 231957 231648
54541B31648l35O10J380J429J112N95k12o83j5J096R36p21k289k887l276l590
$$ 231648 231313 231923 233303 234732 235844 236439 236227 235544 235529 236625 237561 236840 234551 231664 228388 224798
54525B24798k353Q07L467L229Q87j006j478j251o91L67J412J796J945K397K301
$$ 224798 222445 223252 226719 229948 230835 229829 228351 227100 226409 226776 228188 229984 231929 234326 236627
54510B36627O75j488k214j365m94k21L15J388J921J174k82j566k264k078r38M55
$$ 236627 237302 235814 233600 232235 231741 231520 231835 233223 235144 236318 236036 234470 232206 230128 229190 229645
54494B29645J228J446J668J737J208N43M83O17J54l51K61J520J826J086Q15J481
$$ 229645 230873 232319 233987 235724 236932 237475 237958 238575 238729 238378 238639 240159 241985 243071 243886 245367
54478B45367J819J189N93Q23J347J639J768J265n15k407k099J75J054j293m099
$$ 245367 247186 248375 248968 249791 251138 252777 254545 255810 255295 252888 250789 250964 252018 250725 246626
54463B46626l658l36K324K329P50p49j539j382k32J063J254K30q78j140n75L61
$$ 246626 242968 242632 244956 247285 248035 247286 245747 244365 244133 245196 246450 246680 245802 244662 244087 244448
54447B44448J114J110L59k31J3M52L0j069j762j696j447j276q32j63J01k08m72
$$ 244448 245562 246672 247031 246800 246813 247265 247295 246226 244464 242768 241321 240045 239213 239050 239151 238943 238471
54430B38471l41k80o81j110q63J19J244J981K300K489K626K247Q38j261k790k764
$$ 238471 238130 237850 237169 236059 235196 235315 236559 238540 240840 243329 245955 248202 249040 247779 244989 242225
54414B42225j467J03J397K421L045K829J584k68j950k690k114n89J000K195L350
$$ 242225 240758 240861 242258 244679 247724 250553 252137 251869 249919 247229 245115 244526 245526 247721 251071
54399B51071M778N871N688M198K436J367J055Q33Qj502k931l292k436j274o77
$$ 251071 255849 261720 267408 271606 274042 275409 276464 277297 277305 275803 272872 269580 267144 265870 265193
54384B65193o07o27o49o98n04j7J57l95r89o72M37J470K108K505K214O01j628
$$ 265193 264586 263959 263310 262612 262108 262091 262248 261853 260864 260192 260629 262099 264207 266712 268926 269527 267899
54367B67899k654j795m06N7k44l72j35J64O64J466J810J051J86Q76K792L395J180
$$ 267899 265245 263450 263044 263101 262857 262485 262350 262514 263178 264644 266454 267505 267691 268567 271359 274754 275934
54350B75934j997l003j219J020J628R80N72Q39J216J533J960J979P41j355k647
$$ 275934 273937 270934 269715 270735 272363 273343 273915 274754 275970 277503 279463 281442 282183 280828 278181
54335B78181k179p52M43J180J557J098l15j346n04J705L218L025K181J924K043
$$ 278181 276002 275250 275693 276873 278430 279528 279213 277867 277363 279068 282286 285311 287492 289416 291459
54320B91459J561J70j687l376m104l013j60K864M037K847Q60K70J810L971M374
$$ 291459 293020 293190 291503 288127 284023 281010 280850 283714 287751 290598 291458 291728 293538 297509 301883
54305C01883K276l62q72J146L635M728M560M023L179J872R11J156J865J433l49
$$ 301883 304159 303797 302925 304071 307706 312434 316994 321017 324196 326068 326979 328135 330000 331433 331084
54290C31084k105k975l600m525m972l998k123q43r11j800k625k892k460j384j01
$$ 331084 328979 326004 322404 317879 312907 308909 306786 305943 305032 303232 300607 297715 295255 293871 293770
54275B93770M49o07l061n256n354l410j558j480k325k148p90J96K77O51J800K344
$$ 293770 294219 293612 290551 285295 279941 276531 274973 273493 271168 269020 268230 268426 268703 269354 271154 273498
54259B73498J368J73L11J244J613J521J714J505j67k217k380o31O06O9q99j003
$$ 273498 274866 275039 275350 276594 278207 279728 281442 282947 282780 280563 278183 277552 278158 278227 277328 276325
54243B76325r39j622k413k386j923j650j160n7Q19P03L79Q90J698J670J186J473
$$ 276325 275386 273764 271351 268965 267042 265392 264232 264175 264994 265697 266076 266966 268664 270334 271520 272993
54227B72993K329K287J062J83P31J829J950R16j13k03K73J50j025k212j971k66
$$ 272993 275322 277609 278671 278854 279585 281414 283364 284280 284167 283964 284237 284387 283362 281150 279179 278913
54211B78913J551K567L051L115K040j93j987k031j090n92l99M04J399J378M72
$$ 278913 280464 283031 286082 289197 291237 291044 289057 287026 285936 285344 284945 285349 286748 288126 288598
54196B88598j11j69m85q84k99J185K297K670L100L507K688O49q64r35o94j085
$$ 288598 288487 288318 287833 286949 286650 287835 290132 292802 295902 299409 302097 302746 301882 300947 300253 299168
54180B99168j273l71Q97J486J506J183r0k297l778l286j844r92m01R85K489K482
$$ 299168 297895 297524 298421 299907 301413 302596 302506 300209 296431 293145 291301 290309 289908 290893 293382 295864
54164B95864R83m95j349k157k817k363q29N07J092J652K416K361Q51j229k649
$$ 295864 296847 296352 295003 292846 290029 287666 286837 287344 288436 290088 292504 294865 295716 294487 291838
54149B91838l060k612j528o12r86k466l194j894L51J470R73N4k87j61N0K93M86
$$ 291838 288778 286166 284638 284026 283040 280574 277380 275486 275837 277307 278280 278334 278047 277886 277936 278229 278715
54132B78715M28L36P54J598J901R50o26j461r52K75J270J677J666J463J261J318
$$ 278715 279143 279479 280233 281831 283732 284682 284056 282595 281643 281918 283188 284865 286531 287994 289255 290573
54116B90573J643J697Q13q52k116j802o5J593J772O82j26L32J088M40j671l271
$$ 290573 292216 293913 294726 293874 291758 289956 289891 291484 293256 293938 293812 294144 295232 295672 294001 290730
54100B90730k835j197k03j66J16J140J917J642Q43L23L4k80k37M46R98M13j032
$$ 290730 287895 286698 286495 286329 286445 287585 289502 291144 291987 292310 292344 292064 291827 292273 293271 293684 292652
54083B92652k005j864j358j401j745j311K74J906K050N85q62q24K10O26P1r2J125
$$ 292652 290647 288783 287425 286024 284279 282968 283242 285148 287198 287783 286921 286097 286307 286933 287004 286912 288037
54066B88037K850L508K656J082k08n44J84J224J447O56j82l89m21o26l22Q66J740
$$ 288037 290887 294395 297051 298133 297925 297381 297565 298789 300236 300892 300710 300321 299900 299274 298952 299818 301558
54049C01558J083j88j06J406K348J562K64P0R09J679J935K061K260K378K398K499
$$ 301558 302641 302453 302347 303753 306101 307663 307927 307997 308906 310585 312520 314581 316841 319219 321617 324116
54033C24116K680K705K489K286K496L289M293M778M449L857L740L988L767K656
$$ 324116 326796 329501 331990 334276 336772 340061 344354 349132 353581 357438 361178 365166 368933 371589
54019C71589J161K8o25j236k095k878k915j942n22N63J221J771J834M87j952l453
$$ 371589 372750 372778 372153 370917 368822 365944 363029 361087 360565 361128 362349 364120 365954 366441 364489 361036
54003C61036k607o47K17j53J8J391K496K100R42L43L69M66Q36K012L701N163O296
$$ 361036 358429 357782 357999 357846 357864 359255 361751 363851 364793 365136 365505 365971 366807 368819 372520 377683 383979
53986C83979P357Q019P742O981O945Q040R390J0016R707Q591O766M788L801M397
$$ 383979 391336 399355 407097 414078 421023 429063 438453 448469 458176 466767 473533 478321 482122 486519
53972D86519N793O785P237P841Q643Q778P943P073O973O897N477K630l54k452
$$ 486519 492312 499097 506334 514175 522818 531596 539539 546612 553585 560482 565959 568589 568235 565783
53958E65783l624l879k883r86L90J95j074k365l520m922o319p136p680q773j0161
$$ 565783 562159 558280 555397 554411 554801 554996 553922 551557 548037 543115 536796 529660 521980 513207 503046
53943E03046j0423q887o778n814o144o298n085l128k330l761o199p256o091m312
$$ 503046 492623 483736 476958 471144 465000 458702 453617 450489 448159 444398 438199 430943 424852 420540
53929D20540l666l673k619m61P93j76k255l430l042j749j28J523K478J810m45
$$ 420540 416874 413201 410582 410121 410914 410738 408483 405053 402011 400262 400134 401657 404135 405945 405500
53914D05500k990m356l999k402n32P12R09L16l94o13p7J103K491L478L746L648
$$ 405500 402510 398154 394155 391753 391221 391933 392842 393158 392764 392151 392074 393177 395668 399146 402892 406540
53898D06540L811M250M141K944J573J776M084O943Q481Q671R036J0436J2192J3416
$$ 406540 410351 414601 418742 421686 423259 425035 429119 436062 444543 453214 462250 472686 484878 498294
53884D98294J4030J4023J2740R856O339L544J815P72M33R91J736J468J28q85l16
$$ 498294 512324 526347 539087 548943 555282 558826 560641 561413 561846 562837 564573 566041 566169 565284 564968
53869E64968J573L459M275L993L551M028N587P315Q364Q847R138Q928P858O703
$$ 564968 566541 570000 574275 578268 581819 585847 591434 598749 607113 615960 625098 634026 641884 648587
53855F48587O724Q000R444J0465J1482J2682J3484J3486J2888J1595R143N965
$$ 648587 655311 663311 672755 683220 694702 707384 720868 734354 747242 758837 767980 773945
53843G73945L592K724K115K99k337m225m795m908n422o362p443q633r973j1320
$$ 773945 777537 780261 782376 782675 780338 776113 771318 766410 760988 754626 747183 738550 728577 717257
53829G17257j2396j2903j2782j2485j2635j3088j2889j1612j0232r907j0265r839
$$ 717257 704861 691958 679176 666691 654056 640968 628079 616467 606235 596328 586063 576224
53817E76224q201o729o881q379r617r502q347p123o363n967n681n392n060m637
$$ 576224 568023 561294 554413 546034 536417 526915 518568 511445 505082 499115 493434 488042 482982 478345
53803D78345m212m086m545n498o362o339n116l419k543k891l366k872k124k816
$$ 478345 474133 470047 465502 460004 453642 447303 442187 438768 436225 433334 429968 427096 424972 422156
53789D22156m887o076m907k721j587j420q62j60r35l142m353k863J06K168K530
$$ 422156 417269 411193 406286 403565 401978 400558 399696 399536 398601 395459 391106 388243 388349 390517 393047
53774C93047K058J557J033J91j091k521l173k136K13K151K406J514Q66J027J559
$$ 393047 395105 396662 397695 397886 396795 394274 391101 388965 389178 391329 393735 395249 396115 397142 398701
53759C98701K050K521L017L397L513L302K786K155J683J509J765K820M837P068
$$ 398701 400751 403272 406289 409686 413199 416501 419287 421442 423125 424634 426399 429219 434056 441124
53745D41124Q279Q112P472P332P712Q082Q163Q008P766P711P999Q294Q001P031
$$ 441124 449403 457515 464987 472319 480031 488113 496276 504284 512050 519761 527760 536054 544055 551086
53731E51086N815M640L662L448M438N680N287K675n85k604l100k967k852k817
$$ 551086 556901 561541 565203 568651 573089 578769 584056 586731 586146 583542 580442 577475 574623 571806
53717E71806k719k433k154k740m892p748r286q607o862n565n102n328o222p173
$$ 571806 569087 566654 564500 561760 556868 549120 539834 531227 524365 518800 513698 508370 502148 494975
53703D94975o943n413m204m488n349n447n049n049n096m426l627l723m148l482
$$ 494975 488032 482619 478415 473927 468578 463131 458082 453033 447937 443511 439884 436161 432013 428531
53689D28531j949j328k373l891m412l513j474R66K462K076N79l04j9N28P03Q17
$$ 428531 426582 425254 422881 418990 414578 411065 409591 410557 413019 415095 415674 415370 415351 415879 416582 417399
53673D17399J009P34k22j174j288k11J951M391N551M475K151N32L12Q04J621L006
$$ 417399 418408 419142 418920 417746 416458 416247 418198 422589 428140 432615 434766 435298 435610 436414 438035 441041
53657D41041M541N095M408L361K538J839J540K103K761K132Q02J168L828O126
$$ 441041 445582 450677 455085 458446 460984 462823 464363 466466 469227 471359 472161 473329 477157 483283
53643D83283N729L834L008L297K839J518J451L735O709Q175P834O770N636M346
$$ 483283 489012 492846 495854 499151 501990 503508 504959 508694 515403 523578 531412 538182 543818 548164
53629E48164K922J620M24q23j685j224P00K659K930J506N2l72o06j724l092l272
$$ 548164 551086 552706 553130 552307 550622 549398 550098 552757 555687 557193 557245 556873 556267 554543 551451 548179
53613E48179k290j434j007m7J483J938K71k341m090m641m661m296l369k371j909
$$ 548179 545889 544455 543448 543401 544884 546822 547093 544752 540662 536021 531360 527064 523695 521324 519415
53598E19415j609o53Q13J891K262K371K478K429K281K227K045J422P70Q80J799
$$ 519415 517806 517153 517966 519857 522119 524490 526968 529397 531678 533905 535950 537372 538142 539022 540821
53583E40821K803L406L606L254K196J062R73K068L238L661L720M037M402M367
$$ 540821 543624 547030 550636 553890 556086 557148 558121 560189 563427 567088 570808 574845 579247 583614
53569E83614M172M300M575M546M477N034O160O975O999O732O917P670Q545Q999
$$ 583614 587786 592086 596661 601207 605684 610718 616878 623853 630852 637584 644501 652171 660716 669715
53555F69715Q670P658O703O577P019O907N782M629M497M880M366K746J544K229
$$ 669715 678385 686043 692746 699323 706342 713249 719031 723660 728157 733037 737403 740149 741693 743922
53541G43922M482O447O313L654j64k837k941j135O85J396J267R42P09P87J175
$$ 743922 748404 754851 761164 764818 764654 761817 758876 757741 758426 759822 761089 762031 762740 763527 764702
53526G64702J022o93l335m680l568j427l21n44j221k153l591m871m922l814k508
$$ 764702 765724 765031 761696 757016 753448 752021 751700 751156 749935 747782 744191 739320 734398 730584 728076
53511G28076j401m12o1q72j916j649j71R31J082J273J817J455m63k557l204k533
$$ 728076 726675 726263 726202 725330 723414 721765 721594 722525 723607 724880 726697 728152 727689 725132 721928 719395
53495G19395j575n59Q33K383L545M163M230L604K724K788M308O197P155P260P344
$$ 719395 717820 717261 718094 720477 724022 728185 732415 736019 738743 741531 745839 752036 759191 766451 773795
53480G73795P531P488P498Q095Q968R349R296R667J0989J3082J5568J8001J9745
$$ 773795 781326 788814 796312 804407 813375 822724 832020 841687 852676 865758 881326 899327 919072
53467I19072K0574K1016K1443K1243J9957J8739J9412K2107K5057K6901K8018
$$ 919072 939646 960662 982105 1003348 1023305 1042044 1061456 1083563 1108620 1135521 1163539
53456A163539K9301L0779L1998L3011L4240L5817L7446L8571L8548L7284L5896
$$ 1163539 1192840 1223619 1255617 1288628 1322868 1358685 1396131 1434702 1473250 1510534 1546430
53445A546430L5953L7559L8847L8117L5893L4182L3961L4410L4513L4417L4680
$$ 1546430 1582383 1619942 1658789 1696906 1732799 1766981 1800942 1835352 1869865 1904282 1938962
53434A938962L4967L4288L2417L0348K9254K9313K9748K9709K8899K7648K6600
$$ 1938962 1973929 2008217 2040634 2070982 2100236 2129549 2159297 2189006 2217905 2245553 2272153
53423B272153K6158K6064K5655K4632K3359K2154K0669J8219J4544J0011N427
$$ 2272153 2298311 2324375 2350030 2374662 2398021 2420175 2440844 2459063 2473607 2483618 2489045
53412B489045J775m32k069m888r317j3361j4854j4409j4741j7103j9838k0924
$$ 2489045 2490820 2490388 2488319 2483431 2474114 2460753 2445899 2431490 2416749 2399646 2379808 2358884
53400B358884k0498k0128k0668k1741k2734k3425k4052k5177k7061k8832k9146
$$ 2358884 2338386 2318258 2297590 2275849 2253115 2229690 2205638 2180461 2153400 2124568 2095422
53389B095422k8071k7321k7898k8469k7047k3552j9560j6122j3119j0457q583
$$ 2095422 2067351 2040030 2012132 1983663 1956616 1933064 1913504 1897382 1884263 1873806 1865223
53378A865223p659p058o005m258k188n05M74J549M052P859J0860J1405J0666J1239
$$ 1865223 1857564 1850506 1844501 1840243 1838055 1837550 1838024 1839573 1843625 1851484 1862344 1873749 1884415 1895654
53364A895654J3829J6832J9116K1512K4941K8602L1044L2195L3313L5276L7769
$$ 1895654 1909483 1926315 1945431 1966943 1991884 2020486 2051530 2083725 2117038 2152314 2190083
53353B190083M0087M2049M4021M6405M9199N2013N4456N6476N8375O0584O3542
$$ 2190083 2230170 2272219 2316240 2362645 2411844 2463857 2518313 2574789 2633164 2693748 2757290
53342B757290O7379P1494P4718P6449P7425P8865Q0912Q2444Q2542Q1669Q1059
$$ 2757290 2824669 2896163 2970881 3047330 3124755 3203620 3284532 3366976 3449518 3531187 3612246
53331C612246Q1173Q1148P9859P7360P4860P3053P1049O7628O3183N9254N6065
$$ 3612246 3693419 3774567 3854426 3931786 4006646 4079699 4150748 4218376 4281559 4340813 4396878
53320D396878N1985M6045L9588L4316K9815K4542J8384J2434O529r82j0625k0572
$$ 4396878 4448863 4494908 4534496 4568812 4598627 4623169 4641553 4653987 4660516 4659534 4648909 4628337
53308D628337k8757l5175m1347m8326n5793o2513o7163o9292o9781p0112p0923
$$ 4628337 4599580 4564405 4523058 4474732 4418939 4356426 4289263 4219971 4150190 4080078 4009155
53297D009155p1735p1967p1472p0146o7863o5069o2572o0591n8794n7482n7668
$$ 4009155 3937420 3865453 3793981 3723835 3655972 3590903 3528331 3467740 3408946 3351464 3293796
53286C293796n9407o1036o0822n8712n5911n3293n0985m8951m7250m5840m4589
$$ 3293796 3234389 3173353 3112531 3053819 2997908 2944615 2893630 2844679 2797429 2751589 2707000
53275B707000m3189m0894l7012l2099k7992k5972k5496k5361k5557k6877k9134
$$ 2707000 2663811 2622917 2585905 2553806 2525814 2499842 2474346 2448985 2423428 2396551 2367417
53264B367417l0833l0811k9253k6971k4439k1857j9603j8001j6764j5095j2504
$$ 2367417 2336584 2305773 2276520 2249549 2225110 2203253 2183650 2165649 2148885 2133790 2121286
53253B121286r446p054o012n732m794k291J437N424Q984J1823J3742J4723J5272
$$ 2121286 2111840 2104786 2098774 2093042 2088248 2085957 2087394 2092818 2101802 2113625 2127367 2142090 2157362
53240B157362J6201J8051K0835K4205K7680L0773L3082L4346L4481L3843L3369
$$ 2157362 2173563 2191614 2212449 2236654 2264334 2295107 2328189 2362535 2397016 2430859 2464228
53229B464228L3789L4487L3715L0516K6053K2388K0190J8336J5681J2362R050
$$ 2464228 2498017 2532504 2566219 2596735 2622788 2645176 2665366 2683702 2699383 2711745 2720795
53218B720795N729J907k316o204r540j3086j7449k1855k4881k6399k7998l0971
$$ 2720795 2726524 2728431 2726115 2719911 2710371 2697285 2679836 2657981 2633100 2606701 2578703 2547732
53206B547732l4514l6711l7038l6772l6980l7245l6936l6719l7695l9566m0801
$$ 2547732 2513218 2476507 2439469 2402697 2365717 2328472 2291536 2254817 2217122 2177556 2136755
53195B136755m0620l9833l9483l9618l9744l9770l9780l9430l8384l7142l6577
$$ 2136755 2096135 2056302 2016819 1977201 1937457 1897687 1857907 1818477 1780093 1742951 1706374
53184A706374l6605l6147l4782l3694l4136l5392l5270l2800k9509k7554k7219
$$ 1706374 1669769 1633622 1598840 1565146 1531010 1495618 1460348 1427548 1398039 1370485 1343266
53173A343266k6918k5265k2337j9044j6160j4205j3583j4345j6089j8349k0829
$$ 1343266 1316348 1291083 1268746 1249702 1233542 1219337 1205754 1191409 1175320 1156971 1136142
53162A136142k3093k4497k4745k4233k3541k2882k2315k2097k2251k2155k1159
$$ 1136142 1113049 1088552 1063807 1039574 1016033 993151 970836 948739 926488 904333 883174
53151H83174j9558j8263j7541j6838j5926j5483j5993j6785j6783j5880j4857
$$ 883174 863616 845353 827812 810974 795048 779565 763572 746787 730004 714124 699267
53140F99267j4176j3573j2746j1808j0932j0184r745r700r578q825p770p247p088
$$ 699267 685091 671518 658772 646964 636032 625848 616103 606403 596825 588000 580230 572983 565895
53127E65895o092l986k259k185l101l758m331n532o533n832l879k806l257l557
$$ 565895 559803 555817 553558 551373 548272 544514 540183 534651 528118 522286 518407 515601 512344 508787
53113E08787k602j598j929k991l487l439l433l031j623p6J93o37j139r14j063
$$ 508787 506185 504587 502658 499667 496180 492741 489308 486277 484654 484578 484771 484134 482995 482081 481018
53098D81018k317l935m682m046k410o50M61Q86J098R97j43k081l162k492j451
$$ 481018 478701 474766 470084 466038 463628 462978 463439 464325 465423 466420 466277 464196 461034 458542 457091
53083D57091j654k377j817j00J063J234J515K003J382n47k058j916q16J75Q96
$$ 457091 455437 453060 451243 451143 452206 453440 454955 456958 458340 457793 455735 453819 453003 453178 454074
53068D54074J105J29j579k201j038L15L48k13N0R70J437J308J189J115Q02N41
$$ 454074 455179 455308 453729 451528 450490 450805 451153 450940 450990 451960 453397 454705 455894 457009 457811 458352
53052D58352P61J244J701K383L165K950J152j046k044j776j217q18n59p82j575
$$ 458352 459113 460357 462058 464441 467606 470556 471708 470662 468618 466842 465625 464807 464248 463466 461891
53037D61891k025j450o48o05o65L59J885K167R08n89j677k896m071l880j902L90
$$ 461891 459866 458416 457768 457163 456498 456857 458742 460909 461817 461228 459551 456655 452584 448704 446802 447192
53021D47192J399J099M00j18l04k29l47j053j835j679n99K72L00N7M4r3n66p64
$$ 447192 448591 449690 450090 449972 449668 449439 449092 448039 446204 444525 443926 444198 444498 444555 444599 444506 443940 443176
53003D43176l32k8n88j484j638r25q4M34Q37J339J804J924J413J63j397k349k027
$$ 443176 442844 442816 442228 440744 439106 438181 438097 438531 439368 440707 442511 444435 445848 446011 444614 442265 440238
52986D40238o46J002K151K238R96j043k450j974Q7J984K199Q80o32j415j660j685
$$ 440238 439592 440594 442745 444983 445979 444936 442486 440512 440599 442583 444782 445662 445030 443615 441955 440270
52970D40270j037O83K525K903J722O36P12R53J14j168j311j57J012J450J434J091
$$ 440270 439233 439916 442441 445344 447066 447702 448414 449367 449481 448313 447002 446845 447857 449307 450741 451832
52954D51832K75l37L13J834K435J322k60r14o96j98O19J730K329J930J344J388
$$ 451832 452107 451770 452083 453917 456352 457674 457414 456500 455804 455606 456225 457955 460284 462214 463558 464946
52938D64946J396K73j497k228j353j72q5r48j503r05N39J920K763L322L808L673
$$ 464946 466342 466615 465118 462890 461537 461365 461280 460332 458829 457924 458463 460383 463146 466468 470276 473949
52922D73949K290K48r49p05n2n0l50J0J120K319L311M169M544L793K010K76k44
$$ 473949 476239 476487 475538 474833 474781 474731 474381 474391 475511 477830 481141 485310 489854 493647 495657 495933 495689
52905D95689O91K106K548J502K75P11K817M516M172K296J63j956l989m715l081
$$ 495689 496380 498486 501034 502536 502811 503522 506339 510855 515027 517323 517486 515530 511541 506826 503745
52890E03745l39J002K74r30j416j706k331k675k361k319l263m154l543j829q52
$$ 503745 503406 504408 504682 503752 502336 500630 498299 495624 493263 490944 487681 483527 479984 478155 477303
52875D77303j390k178j651K7J148M27j457k518j614L43J608J638J235R81N53l39
$$ 477303 475913 473735 472084 472111 473259 473686 472229 469711 468097 468440 470048 471686 472921 473902 474455 474116
52859D74116j248j669j704j612j382j116j144j311r29L7M56m81j850j989o03R11
$$ 474116 472868 471199 469495 467883 466501 465385 464241 462930 462001 462038 462494 462013 460163 458174 457571 458482
52843D58482J168J83q71r02L8P04m7j731k577j660K6J083J432J720J896J510Q22
$$ 458482 459650 459833 458962 458060 458098 458802 458755 457024 454447 452787 452813 453896 455328 457048 458944 460454 461276
52826D61276M65L99L46P43J852K480J313o53j052L12J053k2r75J02J980K316J375
$$ 461276 461741 462140 462486 463229 465081 467561 468874 468221 467169 467481 468534 468512 467537 467639 469619 471935 473310
52809D73310J379K892M117L797K668J652M20j449l155l539k497q52N95J410J478
$$ 473310 474689 477581 481698 485495 488163 489815 490235 488786 485631 482092 479595 478743 479338 480748 482226
52794D82226J038M11n51k188m030m822l978k414j480j603k427l647n009n945n941
$$ 482226 483264 483675 483124 480936 476906 472084 468106 465692 464212 462609 460182 456535 451526 445581 439640
52779D39640n163m159l145k076j099m07J73P89R97M24k43J05J248J691Q82J99
$$ 439640 434477 430318 427173 425097 423998 423591 423764 424553 425550 425974 425731 425836 427084 428775 429657 429856
52763D29856Q28J705J037q08j699j005n27j453k330j481Q1J93q57p04J158K327
$$ 429856 430684 432389 433426 432618 430919 429914 429387 427934 425604 424123 424204 424397 423540 422836 423994 426321
52747D26321J075j119j893j131k29M05J278K095K029J266O71J99o99j312k29K126
$$ 426321 427396 426277 424384 423253 423024 423429 424707 426802 428831 430097 430768 430967 430268 428956 428727 430853
52731D30853L315J835j052l093l383k443j114k09k60r13j162o75p4K68O91J142
$$ 430853 434168 436003 434951 431858 428475 426032 424918 424709 424449 423536 422374 421699 421625 421893 422584 423726
52715D23726R02J7k62O45J530J124j27j124j842k765l436k989j562N9J576K761
$$ 423726 424628 424645 424383 425028 426558 427682 427555 426431 424589 421824 418388 415399 413837 413896 415472 418233
52699D18233K627O00j915k771j721m15J18M86J402K683L927M952N310M616L583
$$ 418233 420860 421460 419545 416774 415053 414638 414756 415242 416644 419327 423254 428206 433516 438132 441715
52684D41715L437M074M112L060J979J562J087R4m34L50J580K019J894J981J756
$$ 441715 445152 449226 453338 456398 458377 459939 461026 461120 460686 461036 462616 464635 466529 468510 470266
52669D70266K84j463j171J465L706L013K32j706j617j156k029l485l549j962o56
$$ 470266 470550 469087 467916 469381 473087 476100 476332 474626 473009 471853 469824 466339 462790 460828 460172
52654D60172j184k829l771l357k344j393m49N22J150J276J270J408J441J091N57
$$ 460172 458988 456159 452388 449031 446687 445294 444845 445367 446517 447793 449063 450471 451912 453003 453560
52639D53560K42J92K9o51j730k300j372Q02K526K438J106M4l25o59r32k77J208
$$ 453560 453802 453994 454023 453372 451642 449342 447970 448772 451298 453736 454842 454886 454561 453902 452970 452693 453901
52622D53901J996J187k77j148j444j478o22J466L221K555k83k798l333k652k066
$$ 453901 455897 457084 456807 455659 454215 452737 452115 453581 456802 459357 459074 456276 452943 450291 448225
52607D48225j377K81K437L332K048k59j625j374m78K9M39J708L753N232N221M436
$$ 448225 446848 447129 449566 452898 454946 454687 453062 451688 451210 451239 451678 453386 457139 462371 467592 472028
52591D72028M229M859N432N284M587L612K145O8k044l368l704l483l117k703k329
$$ 472028 476257 481116 486548 491832 496419 500031 502176 502244 500200 496832 493128 489645 486528 483825 481496
52576D81496k198k267k063j227j14N08M12J93M55J051J315R46L19QK26O49O98
$$ 481496 479298 477031 474968 473741 473627 474135 474547 474740 475195 476246 477561 478507 478826 478834 479060 479709 480407
52559D80407R1p11q87j47R13J525J449P88l56j623k158j317N28K248K891K152
$$ 480407 480498 479787 478900 478753 479666 481191 482640 483428 483072 481449 479291 477974 478502 480750 483641 485793
52543D85793M09j330k061j891j812j882p10K166M629M430K551J862K792K898J116
$$ 485793 486202 484872 482811 480920 479108 477226 476516 478682 483311 487741 490292 492154 494946 497844 498960
52528D98960l61L78J914J865M45m45l88l80m55K88J483J487j85k108k892k494
$$ 498960 498599 498977 500891 502756 503201 502756 502368 501988 501533 501821 503304 504791 504606 502498 499606 497112
52512D97112j370J62J371J438Q08R36J992K210M26j924k645j817j499k707m135
$$ 497112 495742 495904 497275 498713 499521 500457 502449 504659 505085 503161 500516 498699 497200 494493 490358
52497D90358m116k678j034N8O35O92K6j029j544j069j74N31J301K535L529L088
$$ 490358 486242 483564 482530 482588 483223 483915 483941 482912 481368 480299 480125 480656 481957 484492 488021 491109
52481D91109J327j63l11K65N15O06J352K613L250K544J002k89n92%O29K98j086
$$ 491109 492436 492273 491962 492227 492742 493348 494700 497313 500563 503107 504109 503820 503228 503228 503857 504155 503069
52464E03069k396k336o84J688L654M306L214Q77j287k097j733j197q83k18J312
$$ 503069 500673 498337 497653 499341 502995 507301 510515 511392 510105 508008 506275 505078 504195 503977 505289
52449E05289L306M746M830L725K674L013M646N866N221L178J312J27j295l503
$$ 505289 508595 513341 518171 521896 524570 527583 532229 538095 543316 546494 547806 547933 546638 543135
52435E43135n451n622m013k455k770m736o239n705l936k790k331p26K677N632
$$ 543135 537684 532062 528049 525594 522824 518088 511849 506144 502208 499418 497087 496361 499038 504670
52421E04670N530K615n12j900j451O9J653K058Q15p20p20P50K042K348K277J984
$$ 504670 510200 512815 512303 510403 508952 509021 510674 512732 513547 512827 512107 512857 514899 517247 519524 521508
52405E21508P32j160j833m44J386J870J627K424M255N357M800L549K755K138O41
$$ 521508 522240 521080 519247 518803 520189 522059 523686 526110 530365 535722 540522 544071 546826 548964 549605
52390E49605j899m284n132m248k758j801j456j319j622k842m317m496l051j655
$$ 549605 547706 543422 538290 534042 531284 529483 528027 526708 525086 522244 517927 513431 510380 508725
52376E08725j840k836k621o55J546K441K164J832J894J736P89m63q97l9J420K512
$$ 508725 506885 504049 501428 500773 502319 504760 506924 508756 510650 512386 513175 512712 511815 511776 513196 515708
52360E15708K955K948K582K016J802K251K832K994L227M215N368N512M941N099
$$ 515708 518663 521611 524193 526209 528011 530262 533094 536088 539315 543530 548898 554410 559351 564450
52346E64450O187O916P066Q184J0765J2737J2351J0777R903Q931N659L44m285
$$ 564450 570637 577553 584619 592803 603568 616305 628656 639433 649336 658267 663926 664270 659985
52333F59985o736q034r045q959p310n600n492o583p163o369m556k284K3J777K482
$$ 659985 653249 645215 636170 627211 619901 614301 608809 602226 595063 588694 584138 581854 581877 583654 586136
52318E86136K245J650J380K080L986O288P543P214O289N885N867N516M971N083
$$ 586136 588381 590031 591411 593491 597477 603765 611308 618522 624811 630696 636563 642079 647050 652133
52304F52133O083P271P923P831O910N121K918J170L73K66M49R59J939L132M106
$$ 652133 658216 665487 673410 681241 688151 693272 696190 697360 697733 697999 698448 699407 701346 704478 708584
52289G08584M817N573O393O776O359N693N991P925J0697J2633J2774J1717J0839
$$ 708584 713401 718974 725367 732143 738502 744195 750186 758111 768808 781441 794215 805932 816771
52276H16771J0888J1585J2409J3332J4696J6680J9090K1510K3562K5196K6921
$$ 816771 827659 839244 851653 864985 879681 896361 915451 936961 960523 985719 1012640
$$ [...]
##END NTUPLES=NMR SPECTRUM
##END=
