
##TITLE=AC1007_S-149_6114592_zZLpfeKMET
##JCAMPDX= 6.0         $$ Bruker NMR JCAMP-DX V2.0
##DATA TYPE= NMR SPECTRUM
##DATA CLASS= NTUPLES
##ORIGIN= BRUKER
##OWNER= Administrator
$$ 1.72 TOPSPIN		Version 2.1
$$ 2012-05-14 18:55:38.625 -0500  Administrator@TOPSPIN
$$ Compression mode = diff/dup
##.OBSERVE FREQUENCY= 400.13188235
##.OBSERVE NUCLEUS= ^1H
##.ACQUISITION MODE= SIMULTANEOUS (DQD)
##.ACQUISITION SCHEME= undefined
##.AVERAGES= 8
##.DIGITISER RES= 22
##SPECTROMETER/DATA SYSTEM= spect
##.PULSE SEQUENCE= zg30
##.SOLVENT NAME= COFFEE_meoh
##.SHIFT REFERENCE= INTERNAL, COFFEE_meoh, 1, 14.98061
##AUDIT TRAIL= $$ (NUMBER, WHEN, WHO, WHERE, PROCESS, VERSION, WHAT)
$$ ##TITLE= Audit trail, TOPSPIN		Version 2.1
$$ ##JCAMPDX= 5.01
$$ ##ORIGIN= Bruker BioSpin GmbH
$$ ##OWNER= Administrator
$$ $$ C:\Bruker\TOPSPIN/data/COFFEE/nmr/AC1007_S-149_6114592_zZLpfeKMET/30/pdata/1/auditp.txt
$$ ##AUDIT TRAIL=  $$ (NUMBER, WHEN, WHO, WHERE, PROCESS, VERSION, WHAT)
(   1,<2012-05-14 18:55:31.828 -0500>,<Administrator>,<TOPSPIN>,<go>,<TOPSPIN 2.1>,
      <created by zg
	started at 2012-05-14 18:54:25.312 -0500,
	POWCHK enabled, PULCHK disabled,
       configuration hash MD5:
       AF F2 23 6B 01 CD 40 DD E5 A1 38 A0 06 EA F7 77
       data hash MD5: 64K
       93 CB DA 72 4B D6 51 96 C5 C1 B3 CB BA 95 39 A9>)
(   2,<2012-05-14 18:55:34.500 -0500>,<Administrator>,<TOPSPIN>,<proc1d>,<TOPSPIN 2.1>,
      <Start of raw data processing
       efp LB = 0 FT_mod = 6 PKNL = 1 PHC0 = 0 PHC1 = 0 SI = 32K 
       data hash MD5: 32K
       B9 F4 D1 14 09 7B 0E D3 F1 69 D0 90 2A 99 D8 67>)
(   3,<2012-05-14 18:55:34.875 -0500>,<Administrator>,<TOPSPIN>,<proc1d>,<TOPSPIN 2.1>,
      <pk PHC0 = 216.6339 PHC1 = 0 
       data hash MD5: 32K
       70 13 26 E6 0C E9 7A FF 1A 8E F5 1A B9 F9 F7 CF>)
(   4,<2012-05-14 18:55:34.937 -0500>,<Administrator>,<TOPSPIN>,<proc1d>,<TOPSPIN 2.1>,
      <abs ABSG = 1 
       data hash MD5: 32K
       2D A7 14 B9 2D 8D 2F 37 5E 4B 35 AA 7E E3 34 48>)
(   5,<2012-05-14 18:55:34.968 -0500>,<Administrator>,<TOPSPIN>,<proc1d>,<TOPSPIN 2.1>,
      <abs ABSG = 2 
       data hash MD5: 32K
       44 87 E8 51 FC DB 0C 22 E8 2A 8C 4D B4 5E 52 07>)
(   6,<2012-05-14 18:55:35.000 -0500>,<Administrator>,<TOPSPIN>,<proc1d>,<TOPSPIN 2.1>,
      <abs ABSG = 3 
       data hash MD5: 32K
       37 B8 6E 37 F1 65 F1 D5 E7 69 49 27 6D 97 2A 01>)
(   7,<2012-05-14 18:55:35.046 -0500>,<Administrator>,<TOPSPIN>,<proc1d>,<TOPSPIN 2.1>,
      <abs ABSG = 4 
       data hash MD5: 32K
       13 35 0E 61 6D 0C 66 D0 F9 AC F3 1A 68 AD A3 CD>)
(   8,<2012-05-14 18:55:35.078 -0500>,<Administrator>,<TOPSPIN>,<proc1d>,<TOPSPIN 2.1>,
      <abs ABSG = 5 
       data hash MD5: 32K
       68 9A 1D E6 38 F1 B0 76 BC 1C 4F 72 D2 F1 09 40>)
$$ ##END=
$$ 
$$ $$ hash MD5
$$ $$ 28 97 D6 4F 76 A2 99 EA 1B D5 C9 CA 66 BC 9E 98
##$RELAX= 
##$RELAX= 
##$RELAX= 
##$RELAX= 
##$RELAX= 
##$RELAX= 
##$RELAX= 
$$ Bruker specific parameters
$$ --------------------------
$$ [...]
150 150 150 150 150 150 150 150
##$TP07= 0
##$TPNAME0= <>
##$TPNAME1= <>
##$TPNAME2= <>
##$TPNAME3= <>
##$TPNAME4= <>
##$TPNAME5= <>
##$TPNAME6= <>
##$TPNAME7= <>
##$TPOAL= (0..7)
0.5 0.5 0.5 0.5 0.5 0.5 0.5 0.5
##$TPOFFS= (0..7)
0 0 0 0 0 0 0 0
##$TUNHIN= 0
##$TUNHOUT= 0
##$TUNXOUT= 0
##$USERA1= <user>
##$USERA2= <user>
##$USERA3= <user>
##$USERA4= <user>
##$USERA5= <user>
##$V9= 5
##$VALIST= <valist>
##$VCLIST= <CCCCCCCCCCCCCCC>
##$VD= 0
##$VDLIST= <DDDDDDDDDDDDDDD>
##$VPLIST= <PPPPPPPPPPPPPPP>
##$VTLIST= <TTTTTTTTTTTTTTT>
##$WBST= 2048
##$WBSW= 25
##$XGAIN= (0..3)
0 0 0 0
##$XL= 0
##$YL= 0
##$YMAX_a= 506820
##$YMIN_a= -584413
##$ZGOPTNS= <>
##$ZL1= 120
##$ZL2= 120
##$ZL3= 120
##$ZL4= 120
##$ABSF1= 14.98061
##$ABSF2= -5.57192
##$ABSG= 5
##$ABSL= 3
##$ALPHA= 0
##$AQORDER= 0
##$ASSFAC= 0
##$ASSFACI= 0
##$ASSFACX= 0
##$ASSWID= 0
##$AUNMP= <proc_prof1d_extract_pilot.lims>
##$AXLEFT= 0
##$AXNAME= <>
##$AXNUC= <1H>
##$AXRIGHT= 0
##$AXTYPE= 0
##$AXUNIT= <>
##$AZFE= 0.1
##$AZFW= 0.1
##$BCFW= 0
##$BC_mod= 0
##$BYTORDP= 0
##$COROFFS= 0
##$CY= 15
##$DATMOD= 1
##$DC= 0
##$DFILT= <>
##$DTYPP= 0
##$F1P= 0
##$F2P= 0
##$FCOR= 0.5
##$FTSIZE= 32768
##$FT_mod= 6
##$GAMMA= 0
##$GB= 0
##$INTBC= 1
##$INTSCL= 1
##$ISEN= 128
##$LB= 0
##$LEV0= 0
##$LPBIN= 0
##$MAXI= 10000
##$MC2= 0
##$MEAN= 0
##$ME_mod= 0
##$MI= 0
##$NCOEF= 0
##$NC_proc= -8
##$NLEV= 6
##$NOISF1= 0
##$NOISF2= 0
##$NSP= 0
##$NTH_PI= 0
##$NZP= 0
##$OFFSET= 14.98061
##$PC= 1
##$PHC0= 216.6339
##$PHC1= 0
##$PH_mod= 1
##$PKNL= yes
##$PPARMOD= 0
##$PPDIAG= 0
##$PPIPTYP= 0
##$PPMPNUM= 2147483647
##$PPRESOL= 1
##$PSCAL= 4
##$PSIGN= 0
##$PYNMP= <proc.py>
##$REVERSE= no
##$SF= 400.13
##$SI= 32768
##$SIGF1= 0
##$SIGF2= 0
##$SINO= 400
##$SIOLD= 32768
##$SPECTYP= <>
##$SREGLST= <1H.CDCl3>
##$SSB= 0
##$STSI= 32768
##$STSR= 0
##$SW_p= 8223.68421052632
##$SYMM= 0
##$S_DEV= 0
##$TDeff= 65536
##$TDoff= 0
##$TI= <>
##$TILT= no
##$TM1= 0
##$TM2= 0
##$TOPLEV= 0
##$USERP1= <user>
##$USERP2= <user>
##$USERP3= <user>
##$USERP4= <user>
##$USERP5= <user>
##$WDW= 1
##$XDIM= 32768
##$YMAX_p= 453281268
##$YMIN_p= -671609
##$CURPLOT= <Network HP LaserJet P1505>
##$CURPRIN= <$Network HP LaserJet P1505>
##$DFORMAT= <normdp>
##$LAYOUT= <+/1D_H.xwp>
##$LFORMAT= <normlp>
##$PFORMAT= <normpl>
##$SURQMSG= 1
$$ End of Bruker specific parameters
$$ ---------------------------------
##NTUPLES= NMR SPECTRUM
##VAR_NAME=  FREQUENCY,     SPECTRUM/REAL,   SPECTRUM/IMAG
##SYMBOL=    X,             R,               I
##VAR_TYPE=  INDEPENDENT,   DEPENDENT,       DEPENDENT
##VAR_FORM=  AFFN,          ASDF,            ASDF
##VAR_DIM=   32768,         32768,           32768
##UNITS=     HZ,            ARBITRARY UNITS, ARBITRARY UNITS
##FACTOR=    0.250966925370066, 1,           1
##FIRST=     8223.43324360095, 69502,        -226686
##LAST=      0,             -40150,          -208986
##MIN=       0,             -671609,         0
##MAX=       8223.43324360095, 453281268,    0
$$ Real data points
##PAGE= N=1
##DATA TABLE= (X++(R..R)), XYDATA
$$ [...]
23840 -246038 -76340 -109175 -110235 -5507 -17550 -101717 48862 5447 108472 -201241 -149796 28965
23827 -171448 -52669 -50259 -3337 184618 154433 -343581 -83756 224504 -35413 318227 -173908
23815 261810 -43515 -132188 -127470 -64247 114781 -18271 -14555 -120439 -187533 16180 74034
23804 74034 -33616 -313241 -21458 -40254 -64358 -200777 86587 -61367 237774 44939 -284629
23792 35243 178133 -185026 -93218 101093 -93191 -201514 -130028 93454 294942 -218276
23781 61306 -260991 -30183 14456 76951 -144693 -61920 194462 -129490 126789 -183022
23770 62160 -471440 -88139 174451 39726 -202507 183635 -109306 124109 28961 -306202
23759 -50179 78546 -116074 63469 -153702 140436 -97936 447830 124663 107799 101467 87676
23748 87676 218899 256834 -193017 -128191 -183 40423 161396 -15555 263115 87683 76871
23737 76871 32256 41102 -177146 276520 85772 -94284 7222 -30853 -250918 76391 -27549
23725 -78212 63599 181681 235248 -317134 121077 -86939 19827 55470 -29242 264679 -95444
23713 -17485 268471 -53656 213052 -32108 209519 382302 -115657 169779 52023 -115711
23702 -341513 -180831 -46385 -38437 15114 87202 -260042 122680 265503 -71597 119621 -163101
23690 24123 284877 178393 -194870 169557 225073 -21630 14943 -199292 -112508 -176943 217226
23678 100210 71861 11017 -241427 -149658 -90131 127382 -91751 -36644 -17907 -113931 -54148
23666 -8188 -39176 65817 -102563 -122484 -269942 -108566 -115549 -394415 -339032 -61047 106824
23654 20250 71398 -70981 -71200 57054 -6269 -296689 260961 -12449 -28223 -284696 49478 -80858
23641 -40745 -2626 -184545 141881 90666 -81487 -299207 167859 80531 -155926 -63490 51821
23629 75123 73768 -73604 -17879 257481 59170 121913 -47238 -199846 -44516 268968 -109179
23617 -9525 -116989 -420916 98557 -433097 51769 19566 -488029 -89292 -177352 -1817 230246
23605 80426 -185321 17290 77987 384 -97646 -28475 -80327 45742 143644 80188 -153228 239238
23592 -186265 250163 -145955 105593 -50220 -273841 355893 -186310 -15860 69681 296555
23582 296555 369015 -53317 -378599 -46214 -41589 -91761 113928 -73710 185392 182809 -100430
23570 -124477 -298887 74818 -357897 -179426 293807 -101882 174375 -43335 -336278 151690
23559 272970 -73071 253759 -128606 98220 116013 168718 94878 -20689 -46213 21813 197730
23548 197730 -153449 -29357 -142674 26318 45053 340823 20668 152539 -251826 -70922
23537 -239510 143328 -231123 153282 -91823 -164357 -156206 -42067 199148 -182842 89531 -131849
23525 24591 30487 -132805 -56652 -288764 73944 23003 69325 161689 4989 -1985 49636 38430
23513 38430 244540 -350815 154503 335900 -77061 -74468 -229200 -52729 -40626 38416 -160288
23501 -107869 160983 -40675 71022 -275301 -148786 110809 -21497 -193942 -54268 -63118 -152026
23490 -152026 261029 32984 9336 -410922 -303838 -148697 -93764 326180 20932 100229 203185
23479 203185 30478 -263431 245166 -144449 295433 81655 125293 20369 -486532 2103 36823
23468 36823 96135 -118676 -193300 255190 29982 164082 -263671 -78896 30699 -102297 -72390
23457 -72390 72138 11976 -125831 78542 5737 -96727 -68409 155344 43231 -59606 -21247
23445 -119901 86736 -232323 -90718 333604 -186315 -218006 152712 -53212 -88939 153911
23434 9386 238118 -64533 137026 -128103 -113096 -184161 -371861 -351603 73548 -128691 164299
23422 166771 -135493 -143511 -272070 11839 10973 416351 247392 -59406 -81693 -32694 -52387
23411 -52387 -8703 71963 -180081 -145041 46528 189448 -35345 -12954 429842 59234 64988
23400 64988 69221 154055 -194121 135727 59599 -296600 -103367 156624 -15494 -389934 110665
23388 -212012 -217749 -72216 56526 -236358 -102487 -85739 173068 72779 195715 -104065 53771
23376 -58444 -10892 -62251 -7928 -125749 -347325 -90565 17274 -26567 9927 -283977 106336
23364 -3425 4458 56128 -135025 -151949 -181755 -535143 -24886 -434005 23046 105498 212490
23353 212490 104187 118747 -234372 -86706 239208 -208945 159915 -190021 198925 -129224
23342 -132606 27874 -76588 -87568 130442 194188 40582 -35294 -175000 -195742 104618 30081
23330 158685 -79010 -187703 31393 325712 96007 -189464 202422 455736 -92070 27521
23319 50855 270254 -133122 458402 202690 39855 -99598 125246 -171419 -47417 -154572
23309 -154572 -131840 -276087 -162127 25194 19541 -156540 68097 -243271 15805 -317085 -140091
23297 55956 64516 -35322 16265 -30773 -1808 -58203 91793 -56502 -52025 54280 -184884 -41459
23284 248844 -229634 128570 170740 150983 262885 -158164 -130640 113315 -178252 185715
23273 -150683 -51953 -227625 -174346 -201592 -199757 50764 -102341 -85507 -173597 37575 -137655
23261 269642 -369566 -289149 -63360 124933 374874 -251660 -207134 53807 425916 102095
23250 194610 -141416 -37001 67190 41663 89571 -5815 40803 -116104 182704 -439794 -101092
23238 -156519 -231439 96271 -46752 109072 140752 205757 134767 -165485 145570 -272389 46261
23226 393433 -82920 46935 -29651 94292 40500 168885 -82841 49145 422297 103862 -113560
23214 216524 19458 106 -29088 62420 -137357 96457 223030 -452555 105566 61699 90982
23203 90982 -73095 -114436 -68508 -152055 137828 61918 -307245 -74015 -82473 -19406 -144162
23192 -144162 121253 -3124 7661 99008 95610 267051 290895 -109530 -145922 -67926 -233076
23181 -233076 -18309 133316 -165946 -115362 -26289 45912 -110707 176446 122130 -244205
23170 -376222 -102781 164889 -53514 -146202 84654 -10458 -103340 -224373 -324082 16935 -49725
23158 58850 -285057 118807 -109219 -158166 -88458 226342 -239236 -284786 -127740 -35961
23147 23636 231274 -70124 -387236 -208102 -249862 -62594 196822 57037 -228184 397772
23136 167285 -119640 113934 -131027 -105453 52418 35254 60484 14599 52565 -241624 -124130
23125 -124130 11374 -195524 115135 -129769 -73312 160215 -54628 -16863 -165736 139274
23114 -70935 -183027 -200260 -49269 181453 -74137 18733 -197168 147758 41495 232068 75489
23102 360577 -170235 -288139 -611633 -88166 -227543 -227675 -26193 156113 -83522 150982 -189668
23090 -14737 -141663 -18938 -195783 85883 117 13809 352931 -104282 -75121 -221704 -285371
23079 -285371 344690 -65623 142603 48968 125464 -182158 137505 -154270 171460 15727
23068 7218 70440 123019 74621 -218536 -103159 16240 62150 -155965 -268494 13628 -12650
23056 54541 64177 -110684 -54178 -270420 -87246 427679 -54521 -104211 -38668 46344 -203958
23044 107469 -214715 16736 -27507 -47570 166475 160930 -201203 179031 91151 132537 288120
23033 288120 -230715 -198995 90225 243129 -20630 227996 291128 177750 -34544 -57980 255121
23021 -511 -448298 195880 41173 -18529 -139235 227886 240109 -201213 144534 -95438 -107089
23010 -107089 74966 -125829 112084 243151 146379 -1872 8497 258600 -15831 -135515 -10811
22998 26871 -355024 92332 147960 52809 191451 -123049 -46793 -271613 103153 134547 -120233
22986 -39354 -138068 11675 -387724 -80816 -141726 189170 98987 159905 -133874 103169 9058
22974 398154 76699 -155324 197876 30713 98681 179968 16123 -35944 219200 -164670 -272805
22963 -272805 -195728 -133593 72459 428640 -173911 -424388 -95821 143860 122461 -195164
22952 -88188 -278823 9264 -7309 -270095 -95838 -77784 45973 -135745 -139234 -23189 -88213 -13463
22939 -256830 -92397 196940 230868 18178 -251714 -262088 -175297 109062 57225 -193386 -65083
22927 -173781 57448 39220 94915 -93968 118091 -25665 -37999 -44689 -82796 -273065 87429
22915 -56240 121428 -40114 232544 -113797 -185765 -19475 -136891 14513 -206376 39790 201623
22904 201623 56069 -97995 122909 161342 199125 -91615 -290514 -143756 223396 -23482 40519
22892 4997 323897 -243306 -119842 -4960 -267150 20615 -35700 -65503 535023 -83333 240455
22880 -199907 190831 -300227 -321569 67688 -135897 89786 -210802 -105402 -262193 -69959
22869 -203036 -191398 -275129 -12906 -144529 -22754 -219833 -85578 -227170 84454 20854 -98443
22857 -270711 -100871 -423371 -121726 110792 -130820 158825 -34748 155457 -59020 -239810
22847 -239810 22010 -110349 109121 -295511 -193927 4857 21815 -43060 -86028 -128756 -199463
22836 -199463 -111870 85683 -383910 228342 163514 -400086 -211673 -172740 2384 171919 170243
22825 170243 -57241 27757 -120977 -377047 -166477 -206556 64727 236584 -356108 -350145 -75266
22813 44362 -141166 -141020 154688 -294686 -246116 -75807 129580 266069 88144 -178341 -37245
22801 -88640 -240170 -148246 -230633 -135241 363680 -159013 -248391 88788 297006 -182380 -335617
22790 -335617 394339 85599 -32740 -96759 21182 67617 -152982 -57445 -82463 82241 16256
22778 -241440 -231524 148765 -105987 84847 211324 -71762 -143782 -161889 -132321 -44839 -103236
22767 -103236 -41426 -244704 -201956 -193661 77072 64841 -321392 249578 82899 126378 23664
22755 205589 -121590 -127830 -66051 -205333 230575 -60333 -154854 -3494 22677 -19228 -167747
22744 -167747 -54905 -45288 185007 -180818 136428 236990 41100 2060 -18291 28428 199625
22733 199625 189269 -56954 -1448 79819 -118932 252903 -150299 84617 -255897 230366 -104203
22721 70802 182918 -159926 -38759 -115490 30081 306393 -82103 408092 -34716 -1616 92645
22709 319906 -64464 -385583 -113558 -28896 239986 137336 114853 -159146 -253217 -309817
22699 -309817 31367 -28282 -228344 222599 -118451 160214 -219052 -62559 -79703 -169665
22689 -169665 242515 -109985 35255 -157225 -301214 -61347 62732 -205787 -140933 23458
22678 -413306 33434 -23454 -284289 -164938 -138371 51069 10276 -46170 -135510 -126303 -172060
22667 -172060 212484 334972 16378 -46794 -103505 -268597 -327107 -135770 117099 35772
22656 260381 -273735 -365484 -101212 -37798 -151568 -221965 97809 66614 521938 -366024
22645 114231 -117990 72974 61181 -147882 -69920 -253035 127921 -13544 -263885 -13552
22634 -108580 60122 -6220 35729 196158 -38826 257381 106547 186737 6666 81620 31158
22622 -190417 -15449 -64251 -328804 -100032 -189394 -261343 51391 -106040 -134753 215127 -349411
22610 92932 -89518 63500 -248771 81175 -67808 -176483 391982 -18605 60039 -155659 404961
22598 444215 25060 -62420 -161646 -80665 -101050 159882 202133 -67603 -156547 -29912 -144475
22587 -144475 96099 -166000 -203102 -145967 -241913 -231087 57672 -203040 265994 320923 -118786
22575 14007 -156004 2195 -40513 -127021 159160 87238 112329 -36228 -75415 -312550 7359
22563 34067 -80412 -5227 -194439 74330 -367816 24971 103659 -30254 19785 -17991 -313011
22552 -313011 208992 -73872 -170364 -67898 49481 109662 -19239 -146711 -373314 -131912 132713
22540 117607 89229 -84821 -60672 -287941 -341815 -68750 137391 123771 -200970 85545 60313
22529 60313 430689 -9852 -34524 -96297 -5483 22033 -139113 -257917 121578 108659 -237662
22517 -182054 -197423 96361 -23930 115466 -105390 284659 -75986 15547 -222892 -9067 -286619
22506 -286619 -59427 123753 61698 179028 -209800 -300297 204546 73951 -95614 102820
22495 36331 -47162 -152716 1118 -80083 -413147 -43228 -14928 297050 -277331 102233 -197342
22483 -174764 -236310 20324 -37273 -232851 -79627 -257295 -352222 -235345 -47494 -52559 45329
22471 -99442 156150 -159058 33617 -302310 -172072 -152319 -198735 -1327 -90707 206036 -239692
22459 -71405 33356 31468 -320814 104174 67044 -51408 -24651 17122 -230418 -42933 33558
22447 170988 119792 133245 -40834 93550 168665 -163369 54523 -389147 -72154 -437826 155161
22435 -36086 -330942 -83245 68738 279180 -279995 -148013 -201943 58197 84738 -6385 -207319
22424 -207319 199286 -45370 20584 -300169 105742 -207301 -247293 -225059 19670 85559 -136855
22412 -111100 61837 184824 16097 139987 -627452 -38630 -65605 115909 162655 113077 -295126
22400 135774 -78586 227063 -6650 50482 112373 110505 276591 -155315 -67247 -49489 -468132
22389 -468132 -374092 -214349 330211 -310817 245424 3385 256919 36705 -84474 -69811 270339
22377 98487 259135 -169427 187292 52894 -15141 270219 117478 -286819 -74783 -222664
22367 -222664 -54881 -119058 -88015 -294666 215547 -36548 -78206 -222111 148468 9690 40297
22356 40297 -100967 128885 -125966 -110810 -170660 381769 391467 -1033 136129 146441 -65548
22344 60560 -203358 88193 -222224 115043 -22651 59502 24570 -230448 18537 -60262 9603
22332 41383 -144440 -57281 -229692 11019 -21150 -165731 133263 46111 258847 352697 -140275
22320 145507 -46491 11170 -3132 168451 -43938 395532 -89924 126144 -312899 -335944 -113728
22308 238103 -27931 -12654 -144027 -85010 -39267 137690 -246466 -84918 -49640 -301 -26603
22297 -26603 409560 227865 -43106 -168138 405715 90932 294316 -228754 -8001 44144 -225155
22285 -67515 -32345 176041 -88890 79565 104938 -223683 81007 93668 -190779 -142280 -188396
22274 -188396 32944 112295 -95394 -76059 -129691 97016 -176989 195233 103400 17070 -23126
22262 10335 -114210 -428521 -59607 -188367 67909 -279501 -73352 -259827 -214896 28431 335912
22251 335912 -231563 -211584 -292379 -190430 -14300 140667 78610 281186 115339 -107322
22240 -91022 -260860 68514 -265783 245072 -47737 -168439 149162 -128381 -237246 83529
22229 -36123 -74557 59550 38938 17876 -55650 -164578 -16799 8123 -39947 -53410 -178953
22218 -178953 8214 -113314 74688 -337170 324591 113975 -349147 154196 176451 -117484
22207 -147507 -210281 92946 195543 183052 236681 -3595 -25000 -99210 -255056 -189447 -364105
22196 -364105 35080 67205 -265176 -162637 -156950 27256 -162482 -67105 -211303 244688 123124
22185 123124 -95458 99335 -12344 205696 18529 -114164 21239 -156502 72159 56431 -76869
22173 184815 186361 -70033 -33814 58250 -91831 -159344 74843 26879 -237114 192797 -169548
22161 -222520 14834 23499 249170 -117019 134351 -56555 71217 144872 -278142 -211496 74936
22149 -51871 -205769 -186467 -304484 82245 -86920 -110354 -90337 -287055 -98021 94243 138912
22138 138912 27359 148954 -94135 112536 -324764 -346257 -59212 -224630 -152560 -47022 -215905
22127 -215905 -10258 -65455 -139715 216648 -105602 -106979 103167 147203 -28446 -402546 -178515
22115 139827 -485211 325477 -362167 -5938 130100 -17392 -358294 54663 -146804 -272100
22105 -272100 -173227 43584 -202585 159216 -217435 127937 -33329 -149263 204016 -44044
22094 -246794 97334 -210871 -74551 24728 -135980 38726 -82518 -101861 -106406 -200822 128814
22082 155739 6002 37876 -245607 -238264 -197207 372627 -345697 299172 -394758 -210074 172823
22070 -207297 -216215 12027 -249208 63127 -120354 -44621 -82070 -79699 -44879 42284 344462
22059 344462 -113290 -125190 -174865 36671 -166383 206708 151847 -335564 -160056 171033
22048 201443 -261547 -268991 216093 -91329 -80430 -186613 -164238 -76482 221706 -52318 170113
22036 -172992 -76146 165956 72010 138661 167367 129129 -61580 24828 10878 320538 79722
22024 -281270 -378361 103668 153862 271083 -40507 -20845 -190734 -184987 -88436 -234218 -211700
22013 -211700 290303 8448 -228094 -192322 -21 -162279 -356467 421089 -216673 -80947 65115
22001 -106016 -358008 -257958 -238310 131707 -186906 57860 125512 -46350 -154983 127847
21990 -87799 -42012 160185 -211798 -219479 -91042 92778 313054 32627 -291186 225670 32772
21978 -30541 65384 3899 -9107 -171389 79221 -125036 -144358 51244 84980 99632 104827 257169
21966 257169 -59632 -10527 -144400 -188563 -255747 112905 -91057 153486 105340 -188143 -156480
21955 -156480 -75269 -88363 -27565 -26821 252542 47201 103881 24282 -40290 -194376 307143
21943 -64409 -225334 -242656 -83557 -59047 -117011 -9738 -91544 209694 -247916 45029 -210745
21931 -169678 -52016 326251 155383 -23088 38283 -56350 -11 -131610 184481 -324156 76711
21919 -82736 -14668 -190975 -166947 -349556 -109710 330079 113950 159865 229705 57261 -263880
21907 283961 -145191 20454 80643 -163581 86472 98853 -120883 -200137 -171338 29526 152050
21896 152050 -44149 -172200 -199724 -116965 -260241 -6784 -168233 -153084 -169063 31584 -592478
21884 -6899 662 91615 35801 -103337 -162024 50851 38479 127497 -250705 -99397 138271 -167721
21871 -266544 127879 199506 80371 317054 -132233 -31986 59737 62867 242253 323010 70744
21859 144027 101180 242540 50777 -55525 166958 -159983 136643 -134321 -165048 -15712
21848 194766 -48463 -7137 -246710 39986 -393164 -6865 -470929 74109 121662 -160374 -175673
21837 -175673 -162917 191612 -559261 32415 230792 101803 -45371 9644 43444 66199 163823
21826 163823 -68022 -73677 -146340 23800 141821 -841 -156534 -202455 -217704 70270 -410198
21814 -118370 -103743 131075 179589 -112399 -310836 -288963 87080 -61963 -12124 66642 -111898
21802 170187 -120983 -310811 48865 84318 -6602 177534 -8868 -122812 -313324 -118700 -206854
21791 -206854 -302870 -36411 88512 -221149 6467 -217121 16903 250794 -208259 -173507 -53545
21779 -116909 700 -64996 28988 -190416 -11978 -76882 -229238 -50462 -170286 -227833 11238
21767 -168912 278128 -195705 -93822 -167504 80975 236662 -26257 8393 -198140 -97775 -96552
21756 -96552 -245084 -175093 40284 -147414 -231620 95706 -257898 -102068 360866 -262384
21745 45857 -73682 -255217 -34168 -226194 -61981 -108058 319602 -7642 -76614 153268 -52591
21733 -103435 -288834 -265005 16249 -90460 -238908 -69997 -134646 28655 87277 186312 -290069
21721 77997 -215183 -32249 104098 -28986 -220885 -156975 399422 105487 -224145 113463
21710 90068 25801 -43725 44528 232533 -51195 303517 207465 -327305 249709 -171122 -52983
21698 -62523 44709 95531 -17593 -39547 -8219 -1396 25924 -59106 -156824 -4584 -68217 20325
21685 -104825 -199596 262732 62202 -128161 -200 -46118 -145863 -232068 230870 -12782 -54958
21674 -54958 -77744 108365 -140174 -192779 -16807 333039 212255 -62363 -140662 91547 180180
21663 180180 -44936 -340818 102988 -190697 -146921 231217 -158317 -390240 -11332 -25833
21653 -25833 -193178 -224262 -107521 366666 -134112 -42668 305291 32395 116782 133814 -34549
21641 21258 -213843 -162509 -26703 -36162 -39304 54400 -76213 -239175 -218927 -195351 -98161 -237037
21629 -237037 -297355 -176820 -107773 84312 -90073 25821 -230425 -169296 -124559 -41801 -465594
21618 -465594 -29025 172929 -102943 87239 -71960 269580 -280690 -101653 82066 218104
21608 218104 25594 -141905 -460893 -97609 202727 -79201 124754 -294320 -14391 -125330
21598 -125330 -68426 -462873 14790 -2621 127874 86087 -8920 993 -226909 107686 21679
21586 35877 -378415 -42420 -256633 240712 172507 -73932 -75911 -43423 -4307 -67966 12958
21574 -246356 -222656 -156843 -121198 31101 395679 -162195 140033 -396050 -144872 301489
21563 -67858 260320 -253246 -45322 226667 27267 -113133 -400803 -123961 39123 -171254
21552 74405 -247339 -144042 -158014 -1467 112013 230149 85911 80282 -13698 -33421 -36097
21541 -36097 -122811 -194303 175364 -263290 -8881 -21147 -45879 -153891 36071 -297696 308180
21529 -320983 -189128 -124748 73280 212934 -131275 -837 -224659 3076 365905 -98908 -243187
21518 -243187 -332326 -13712 -171338 -58968 68667 -254857 -40041 -2287 109877 79068 84814
21507 84814 127282 163090 -72433 -7645 -85150 -56885 106233 -209402 -261999 -13395 217989
21495 -92558 -110398 90762 -268337 65540 97356 168476 -228416 32989 -6384 311176 -16947
21483 159650 -43310 -267361 246627 -71172 -102728 -78185 -242790 31805 262154 127655
21472 -7366 146622 166513 -311434 -89270 -431542 -412471 134678 -43183 219000 180005 76063
21460 -88759 -40897 1 -255597 194391 -459446 -41521 -123425 117281 -69974 37882 -19457 38843
21447 -29975 27273 236101 70569 -20612 26280 -326195 63774 -27698 -250262 -320955 -62261
21435 -503467 -87793 -190767 -162648 -10802 46829 -106638 -360854 -159064 -139221 -41095 86449
21423 -90212 77739 338849 15173 50533 251860 -15720 221756 -41652 59268 309871 -21623
21411 154967 -228350 -161313 -71287 29495 -281309 -46200 -14117 -46852 13564 158076 -120353
21399 251569 -35663 166830 126219 -67298 -204450 -93719 -188712 -17941 -109224 377292 88019
21387 -75063 -239504 294038 -141900 -47522 -567999 -467177 330320 186566 -302091 286073
21376 320664 -104656 -101506 -31420 -33614 132159 -215030 -111979 -497267 130114 -263467
21365 100983 -61826 -95634 25659 -137815 -200085 -34980 118398 -157861 -75522 148501 63333
21353 -76090 198758 236378 -182771 -19887 158294 -131997 111243 -199273 16642 363539
21343 363539 79421 136476 -165810 97273 87339 -22114 -165847 -105910 -264775 -459523 -301361
21332 -301361 53547 109925 51972 320807 -19144 -107697 19720 -74433 -279235 -26226 284929
21320 -175354 -222499 -154760 -29275 -49244 -82182 -254972 184071 184377 -394411 -70317 483211
21308 51066 -55328 -138417 -70272 -66533 -127985 384383 136315 -33147 -66664 -89428 -172792
21297 -172792 -172564 -188692 70063 -114257 161352 106544 -370726 -73180 -350156 76711 13203
21285 -9220 18379 -204165 -107673 79090 -85578 -277050 -150057 -140829 108313 -461511 47505
21273 6620 -118818 -6940 155162 33682 -68074 5767 -224591 55540 68961 -235979 138653
21261 -63395 94636 -104897 -161426 208206 -199518 -352850 -20843 121262 81255 175545 -328830
21249 -44274 147627 -207243 -119132 180759 -16916 -72495 93690 51161 -307358 93591 -183918
21237 -144776 262408 -174437 275049 78506 85176 -219045 -268694 59801 -16304 256229 71722
21225 56516 73494 245749 26020 -299888 -171645 207256 -234950 -84648 88216 47673 167055
21214 167055 15048 -10594 -67058 25553 -23738 -284993 -239230 90664 2528 44465 -112635
21202 908 -239777 71557 -70667 -137596 -108013 -15520 62319 -361003 -123454 52059 98359
21191 98359 -128311 -68663 -91580 19632 -13026 25579 82797 -174115 -280600 22716 247151
21180 247151 31883 203800 12074 -45671 -152386 300577 79248 16952 -178778 -161145 -40666
21168 10410 120632 138257 -180835 -76015 -186135 -142012 132800 97457 -86379 -42209 -262523
21157 -262523 -51440 -109454 -371756 -125375 -40896 324856 150278 -127601 108330 -88242
21146 -188791 -6858 -76754 -169150 30581 158218 24644 78213 -123803 -278900 -258444 -277765
21135 -277765 167474 -9813 226800 84098 -432409 -172759 -72781 20652 -149298 24812 213995
21124 213995 -63492 -52480 -124190 -292413 -330469 24891 -118533 49986 -98934 -167556 182182
21112 132271 62816 -19301 36857 241869 -36326 -61898 -61745 -56533 -272045 238338 94557
21100 -19770 129682 -162896 -76775 -578984 -41353 150678 -109087 -136546 -18130 128008
21089 -76668 261014 340452 69237 -66908 -98830 34783 -278761 -232292 -47766 -5061 -199296
21078 -199296 193814 70422 -22718 199902 -77756 140817 82474 -403802 -190685 -197741 -39122
21066 297170 144052 277811 454283 -57462 -200115 -64508 -216581 180609 284116 -78545
21055 -30673 311941 -86625 -189103 37868 207502 -398056 37970 -79430 -3420 -176130 25690
21043 -241296 -237821 -557827 111077 -135635 -158911 -233613 343040 69371 -74620 -22464 -221330
21032 -221330 43211 -328592 -82822 -52469 -5099 -128784 -205027 -53146 -143844 -173204 -63081
21020 -151989 -379086 -569078 -148725 300980 75464 -183506 134646 62336 67041 -218933
21009 177170 43560 -20732 -47122 81277 71267 239254 -191786 -80025 116100 41800 -374548
20997 163179 46259 20921 -58521 137963 -177864 -263659 -207932 -74066 86808 189858 142977
20986 142977 294136 -117338 225150 -169100 -238481 -290417 73533 -361962 -286505 -141741
20975 -117455 340289 166482 124484 -81181 -70438 102994 174404 221197 -11086 -144975 183727
20963 -21271 228785 -194622 -136149 -122684 280778 -33426 -212987 265329 215528 134435 184079
20952 184079 68005 185608 90760 11571 167503 159835 -41267 -44993 140042 -321848 -13726
20940 53015 -163576 33211 -100289 -104714 -108593 150604 44315 343746 -59214 -8206 -47513
20929 -47513 -173322 -223653 149753 -2908 -203989 -284136 -284891 128879 -108696 -103529 -217644
20918 -217644 -160594 -51714 36170 -357498 -90161 133823 -76735 -328455 246994 58182 14892
20906 -425766 -77400 -276440 163280 -269348 -294304 -88119 -415403 -45940 -39820 -143029 -196565
20895 -196565 -284441 199010 -343640 -179445 85000 -165956 -99290 215999 271707 -498283
20884 311995 -395019 -99538 -187483 39560 -77179 -208901 -303896 96694 146745 -293916 275726
20872 -63489 386366 -253388 -17147 100579 -348596 -73515 66112 42131 -33249 -180529 -109450
20861 -109450 82730 147643 70011 -50088 -589997 228544 -73101 160521 -50862 -39119 -8296
20849 -346605 -74863 -8913 84315 419134 -151846 256380 131244 115197 -51761 -162025 31096
20837 -183437 -334589 -398155 92802 -259468 226819 55367 48774 -114980 272426 -224993
20826 -188179 -7671 111983 -190738 -103278 265401 -74293 193279 -532672 113302 -135534
20815 -138028 -275229 -102244 -63645 39505 411201 64039 -15482 225264 11991 75430 77248
20804 77248 -285764 47013 -29848 -217743 -198250 -145492 -161021 156133 202554 -213556 176936
20792 103388 -30795 -35562 263977 56944 -159143 -76061 -102879 -194164 -89882 -58137 -333947
20781 -333947 31177 -31054 -31461 -325054 -241859 40009 -171126 -20242 170904 273333 -69158
20769 96707 -50243 -53197 42823 30276 -164773 -6117 136385 65478 -146248 260976 -200245
20757 124961 115798 -382565 -34473 -113941 -285089 85543 150923 231696 17182 -127592 -172245
20746 -172245 -139341 46397 -123317 90550 -278025 -236730 -163997 4286 108447 -207867 21975
20734 -12904 -107595 -31005 -111057 -133545 -58524 -118227 -182397 -234169 -233400 115907 136357 -64606
20721 38100 62059 37467 88737 -186056 -351890 -71990 -70217 12542 47917 -4942 -206167
20710 -206167 -298902 -184856 -136227 -167276 -248312 -229676 214172 -35245 7632 -95216 10948
20698 -163584 71847 267976 127111 -280712 -56188 -414980 -468153 -268217 25978 -262518
20687 -131572 -306834 -85927 130217 214902 -164178 -46853 133864 156185 144925 34304 61959
20676 61959 -122842 -237237 -257328 57080 196299 -342055 -153037 14607 -303943 -95336
20665 -207290 40182 -25311 -316108 -34307 51975 -240371 229386 32394 -241970 -258807 -163210
20654 -163210 66043 85978 -129307 16537 -165137 -204076 -79691 135794 248661 -80317 -241139
20643 -241139 57930 32393 -368946 -451764 64352 109093 -89734 -220859 -162203 -18635 230990
20631 -169806 -309619 -18262 -157896 -482727 -61500 92009 -261603 69267 25836 -277202
20620 -161575 17499 41467 -229894 259737 -330497 -195136 -396314 8307 382391 51347
20609 39476 63756 46914 -37334 125223 -8868 -29213 -438220 173777 202641 147817 -99322
20597 -18324 -11844 -192258 -2196 50651 -268898 -90804 28038 -245935 -251636 -198989 91955 47143
20585 47143 181743 -336228 100250 -339841 70469 -199625 96611 19553 70329 104557 -415968
20573 -199374 71423 155756 -220389 188532 -204040 -39151 185096 165565 -554645 60627
20562 199355 44841 5543 -60043 30554 219504 128590 238794 -47028 111994 -106840 11187
20550 258508 173572 53086 29198 7052 -147530 72383 59718 -209483 91870 -489546 133107
20538 -199257 -9505 75806 187265 136040 -6937 -212521 -208252 -32925 -132999 -121434 -254404
20527 -254404 30935 185426 53190 63668 443 -22911 -84532 -144542 -144458 -308224 -84609 -146136
20515 -146136 -377551 -127352 130821 -56685 -145809 -5720 -137991 104047 49524 28158 281946
20504 281946 99139 -201542 -107613 -36984 -166807 -28937 31651 303833 151925 166275 226761
20493 226761 336959 -88968 77384 -2998 164329 -177078 -52263 -339533 -171238 -31868 -31242
20482 -31242 -56530 -174745 -163717 152850 -41289 134654 156438 -153400 15903 -222199 -341037
20471 -341037 335551 26557 156651 -214392 103436 138781 -183460 187181 -50095 -138184
20461 -138184 -231543 143080 -300596 25396 -28664 -129353 -154368 47257 117994 -107409 35611
20449 254019 -3974 -55162 104749 -322341 5183 -49551 29692 -14663 190213 294764 129100
20437 -79831 -285185 -47463 21779 -487678 96319 -16974 70589 -243550 -142795 -503475 34343
20425 126464 -44624 47508 16374 -306992 -293587 233492 32345 33361 -426806 -220516 -68068
20413 39202 -129828 47729 11907 -437217 155838 -4431 32447 -126514 214355 -235460 120863
20401 -160258 -7761 -49395 -124623 213745 -78504 194258 -6622 36859 14542 -76365 193828
20389 -136118 131123 -99861 18626 -22325 113373 -80678 131 82365 -248266 -214727 -193501
20378 -193501 71785 72430 165843 127867 -64741 -143851 -154250 318322 -154860 253432 -231256
20366 224668 -54767 150463 -17543 -211362 33377 -194213 -41146 27602 -65538 -171552 -52486
20354 48336 -328619 -7344 -316386 -455097 187832 -102653 75435 115724 -139709 -16565 -9911
20343 -9911 -119185 -207439 -134482 -48660 -263453 -221957 169827 -167294 -80097 53889 -25631
20331 -380140 -131413 187657 -173034 -176980 -241447 -211114 -238597 -176460 -131225 -60865 37447
20319 -205905 -71720 96926 36567 -8825 -329616 22086 -246385 229910 -120923 -1373 -55494
20308 -55494 -21313 -354377 83757 -256651 -11535 113087 -393290 -267130 -335512 284839
20297 -88278 -364131 229891 38004 -542454 166456 -155628 245808 335057 -258322 118310
20286 -113160 -22840 9254 -59199 83628 -21597 58556 -118358 190529 -194994 -145429 -167223
20275 -167223 59710 -79895 -273938 -73266 43912 7870 -176767 -73772 -77673 -145900 69464
20263 55605 88278 -200286 -229490 -296060 341237 -172109 178041 -71541 244750 -48708 -112507
20252 -112507 -49030 260624 173517 37030 478269 -140092 -58998 116103 -131809 -339208
20242 -339208 -141072 81510 160789 139627 -139469 151903 4681 -38141 91986 -49858 151264
20230 27238 -21650 -439192 65591 -63711 -399605 44919 -30783 321873 -440740 -381257 -162693
20218 -101210 285821 177298 -30828 -26544 33176 -129744 30365 -153733 -212471 98733 -15845
20206 199940 -81471 157664 2450 272271 -204082 46334 -84563 -58749 -171401 248232 -267633
20194 -111105 77772 -221717 -213993 -10937 86800 52478 61504 55949 20688 -141356 -2464 50924
20181 -129178 152307 234527 -90697 -232352 24526 -102838 -240748 182109 138482 -144982
20170 -146099 -9951 -167593 -272318 200030 100433 -28920 -97703 -124935 -118652 -229630 143844
20158 30372 -168237 -65203 651 -273588 24466 -152295 -116916 75118 217783 193834 141286
20147 141286 -111740 205583 -173190 145460 -105984 -155464 479412 120293 -191174 87882
20136 109592 -150010 51715 241443 -43721 -193976 -326332 206519 -403000 -91616 -119585
20126 -119585 -262076 248435 -347917 -99739 -155269 111840 -164852 -154303 80214 47808
20116 47808 -433335 -110877 -57773 -277090 24665 -30080 -241624 -150377 -159431 -81962 16216
20104 -41458 -83415 -157658 -85138 152987 -316250 176209 -149067 -169279 -283039 -28548 -38677
20093 -38677 80166 238804 -234253 -138224 179167 -24959 73996 -84827 -72464 -402537 -238494
20082 -238494 292760 12254 -74022 -199018 -159701 -132572 123501 25638 -430979 10858 -75385
20070 -253781 -326128 -112110 24983 372644 -118133 237434 68429 82280 -206413 -262540
20060 -262540 12535 30188 -125612 -322283 -382470 -44432 170946 -208508 25547 205779
20050 205779 156859 52510 38982 -205448 -61208 -17191 -25335 -42498 -185752 237942 118400
20038 -42760 -163946 -295381 14039 65449 -145192 452 -106615 144736 362327 27694 31290
20027 31290 -90793 47342 163669 -129785 22782 183522 -233967 91921 -36099 -223031 86980
20015 -15209 -57686 -257762 -453633 -102947 120108 -46341 176334 81199 77181 -383107 82111
20003 -63293 186243 86302 -96012 480345 -27648 202869 73905 -2527 31316 -101201 -243122
19992 -243122 -236786 -82657 -148714 -60119 46431 -375054 -9711 -11461 -43261 -175704 -174617 -74263
19979 -73617 154553 -39953 -192425 -458925 -325059 -109027 285369 30984 219501 67330
19968 -210000 -261776 21295 -227707 -155967 -148420 287699 -235227 -74651 -196763 20741 168526
19957 168526 126735 -155010 3324 268472 -93733 -129225 -79272 105750 53568 39946 -339834
19945 64746 411766 20585 -115401 -31031 -157907 -136020 385586 -112934 -43169 70376 -134364
19933 -311738 -118568 158671 -88774 -52309 -369003 -193484 97673 -198625 40436 -243170
19922 38244 -198720 -226815 73082 -9791 -50833 -115919 82197 -56167 198266 -35392 121614
19910 -307587 -225232 200509 -115385 -25655 -117212 53126 -181621 91960 -54061 -93946 38009
19898 360749 23963 -242775 178892 138111 -57220 -23003 -190082 145233 -54393 -37788 -103954
19887 -103954 -274831 151116 -305479 -121544 268285 -127466 38035 -328730 54106 -151635
19876 -126838 -193621 248399 -1285 -188869 -162501 -139887 -69374 87423 65748 159716 -47403
19864 -47916 27638 216770 -50603 445908 24390 83722 -59244 296478 -238364 172133 -42333
19852 -16814 -30793 -126543 243323 -30329 167422 -234438 -209662 49017 -296717 -90594 -57165
19841 -57165 -275006 -529489 202418 -130851 -130538 -279261 99335 146852 210936 111295 223086
19830 223086 -46661 101043 -8435 -219856 -53408 -176004 -255031 -28214 -203660 -63277 109924
19818 -24617 -424245 101870 -111527 -132932 -73469 81030 -383525 -57478 107093 -187583
19807 -42205 -260220 16280 330103 -146106 -342934 40094 53098 -143823 -177793 -34583 -306760
19796 -306760 134927 -30515 -15811 151415 -60792 -567134 -218530 -147455 -231101 -193609 187237
19784 327532 -160968 -129453 80439 -38435 82323 -10557 -80069 -145991 -145204 34280 -20667 -69705
19772 -69705 53764 -129038 -191460 -43595 -202962 50299 -119829 -37032 9743 213037 -40695
19760 -155338 -327903 -170820 6031 -335103 -35214 -43263 -183180 -469927 26685 -233234 -194969
19749 -194969 -305059 46769 105796 -65601 78807 -147128 354098 -76361 -43250 -69606 2353
19737 -79708 164125 141547 151816 -41016 -72068 -177153 -24539 -174441 -75414 41551 -31459
19725 -175362 -62087 -176379 28646 -38436 122968 -312474 -317922 227725 -208419 260357
19714 254416 81318 -157101 -115149 -27383 52115 -120246 -83181 90406 196801 216616 23488
19702 -85469 -161938 152235 209876 320766 268172 159474 -104742 -33175 14601 -168416 -376505
19691 -376505 -88403 102557 -75267 -102578 130662 35772 147305 -395031 179802 -169812
19680 -11950 228396 -659 -220512 37215 -174168 -428631 -26135 176662 25747 -142221 -313596
19669 -313596 1163 -256493 -61235 -28427 18865 332052 -183458 -306843 -128419 19577 -200590
19657 -143042 170939 96950 -1341 191354 -35747 -342543 -53164 -294456 119528 41580 22791
19646 22791 165971 27619 -17434 -29069 -191765 -341097 -22113 -252606 -242447 -299983 53205
19634 59469 -402344 -46201 67079 27217 81701 -117795 -3180 185866 -244356 5784 159627
19623 159627 8327 -59801 6955 -102608 161409 -210931 -278044 -23534 27734 -45000 -14549
19611 -121468 63834 -189760 308928 217199 43124 -42476 -169576 -50088 -185367 135650
19600 94441 104779 -149805 -21826 -15892 195426 139969 192216 -182957 166965 102397 -233825
19588 -189593 2624 -107255 -4583 10683 8868 -86973 -84205 -267236 171323 227245 270388 133130
19575 -275111 -136495 137518 -126528 -111511 -303429 -138390 166642 -38787 -91054 57826
19564 1739 -22723 -29808 -189955 97214 249138 -15315 4369 -36336 -414477 58052 -160776
19552 130535 -14366 -133697 238945 -158241 -303789 -128291 2304 208353 52368 -278687
19541 119380 -94266 -270055 -268218 -1179 -89444 -145170 135192 -290189 -120694 143021 -94672
19529 -32130 -19869 -136093 80659 -370475 -423274 -345066 191719 104340 31312 33848 -53252
19517 -165424 -148953 -138385 -108593 1798 -95084 -278149 -256824 6085 34461 199402 -214618
19505 413689 -418491 262228 -198281 -225597 -44902 47734 35139 99922 -277344 -220575 131550
19493 -199932 74013 132717 -27930 47826 18610 -144014 -192657 182951 129602 74453 -95317
19481 120887 -6051 100076 -137190 -158740 -24198 9055 -319808 268489 -53392 -77487 -122882
19470 -122882 179873 -303147 -184551 -348327 63166 -151316 -110466 59685 -136769 150500
19459 -96908 -33319 -37612 -260074 -64979 16864 -32678 -70336 -192869 -72008 90190 -52834
19447 -31137 -220868 -245685 304165 -111412 -220843 142857 -15157 -257799 -270205 54708
19436 -137968 378551 189428 70410 -29422 544056 123060 -210637 213907 148597 153315
19426 153315 209846 -183005 57544 -234213 -209579 -75774 -205835 -47286 -346556 -122858
19415 65999 126362 -154796 317086 -87095 88230 -217618 43440 104713 -33092 -11395 51159
19403 -321748 -33141 -144521 -11608 -161813 -137465 21211 -196634 104105 -190251 -358413
19393 -358413 -142838 87585 63267 -308376 -252124 337177 -403915 -163084 -238490 13708
19382 -288087 58435 -141439 -38523 -163464 94773 9866 -245557 16429 -91265 136395 296624
19371 296624 52524 212320 185596 88553 -12244 76019 -236143 150256 265638 -166810
19360 -169804 -41787 20588 77874 -42115 8155 -199404 290943 -120099 -185474 -150804 -74297
19348 -195572 -288016 -191584 -81964 106039 -270506 -203228 -283566 155036 129686 -137352 -244916
19337 -244916 -189442 -420742 29543 -134184 93428 236450 113929 7404 175054 -94539 83859
19325 177408 -212635 -95488 97545 -398273 -5977 -580398 76098 282310 -120268 10384 -258304
19313 -36313 -35148 64233 91950 342491 -27082 -67153 187863 -18871 -101660 -49357 9072 123747
19301 123747 -67799 24078 132186 -236920 -74376 -278302 50939 335839 -57569 -107896 96715
19289 13762 46302 141297 -204127 -36983 -40343 182658 116156 -139830 -163078 -81665 -158602
19278 -158602 -345435 -172434 -394342 -80616 -188404 132084 103980 -46754 35038 -172796
19267 57157 3554 -106025 132460 -479892 136961 191809 -231072 -198765 -338337 -78591 -101813
19256 -101813 82209 21649 59586 -41266 201250 -183605 -85272 -546053 41228 -242557 54362
19244 -142965 -217954 -180937 -186621 -244586 -254146 -409253 236497 -199103 68585 36473 378076
19233 378076 -198623 45885 -287460 39414 29813 102215 108742 80146 -245185 -133726 227735
19221 -214813 33170 -1989 -54174 -372187 -69635 -466607 -320738 21371 -57453 -88493 -54055
19210 -54055 133358 -172806 73621 -132376 -60728 -204247 -208792 -37002 -345655 -150947 42228
19198 297871 115862 226770 12496 -197914 -271244 123850 -138448 -128719 93001 -208760
19187 -53640 -219072 -162888 303551 145927 -30203 -70404 -25795 215280 179300 205616 48866
19175 -109402 -120442 44336 -127960 -51282 -116075 86643 -21549 -53085 43848 -158999 -96533
19164 -96533 196082 92286 -63752 127300 -39853 -168588 -343101 121028 10661 -91354 -113420
19153 -113420 341054 -238618 -222167 -14767 85504 168932 -160357 -34990 182432 202138 44493
19141 102274 321413 54953 144628 -339663 -155232 -106869 -155877 -455404 142191 5776 -138857
19129 146255 72068 75646 -506287 -107206 -194490 -194044 42370 -94063 -57466 -34911 245436
19117 157918 -134832 199957 156041 -26737 90778 -260165 -101534 -27072 132372 -449318
19106 -185982 -292980 56235 23580 58507 -154204 63889 -240824 -11755 -22463 -544 -250858
19095 -250858 -52693 9274 130588 107775 214197 -274957 -132687 -158719 9901 -58370 -114104
19084 -114104 13745 -31321 76845 -168613 -137012 152877 -95296 -243326 -246213 292708 23674
19072 111519 -136772 140445 -99372 -359058 54072 -83044 -32924 -313742 -106358 175212
19061 -117968 159670 46418 118351 -21145 -24859 -103910 -117217 -75833 -58826 -12762 65176
19049 -148478 -247702 -163282 25130 -369402 1631 -35866 123679 -85593 188953 -496534 -350591
19038 -350591 -85026 -138434 -32537 53089 -163202 192775 -118730 -58194 -91141 -114917 -279093
19027 -279093 -119504 -135178 -32199 -332448 -163291 13756 -238147 119129 -66907 56181
19016 188714 11832 52002 159711 25633 -116490 370625 74896 238754 -26851 -146190
19006 -146190 -96431 -107674 -278200 -183693 -41399 -297546 -105005 -199735 -299206 -113147 -131168
18995 -131168 -246054 -77454 -334221 341091 250255 60335 -185118 -156055 -52474 64572 97290
18984 97290 -116293 -294960 244178 -101557 -425944 -607342 324684 -57452 -98314 -208364
18974 -208364 279236 -101063 134967 -167136 94421 51347 242712 -88506 -248850 -319878
18964 -319878 204802 57408 -181807 -191308 224103 -32083 -308051 -55254 -130189 238337 251681
18953 251681 -90206 -341706 -472772 -78791 -9336 -440092 -311945 35891 -18502 58598 40397
18942 40397 -112145 -62851 -89265 -170942 -94416 -289107 66062 72544 58388 -33445 -268628
18931 -268628 1149 40087 30038 -184464 247506 -194734 -309723 -410751 17402 74420 -70026
18919 -5144 -21709 1808 237379 10741 -84533 -146573 -70499 11862 -13488 22940 -161496 -196653
18907 -196653 99744 29532 -165037 -58037 3275 -112128 366238 -117738 -447089 -114601
18896 -100446 -70311 -100688 -45771 184655 154222 183922 250993 -83275 71716 -22925 -221604
18885 -221604 -135936 -118023 -74545 79270 281203 53034 120407 -97338 -109699 -104930 -215174
18874 -215174 122146 -117218 74967 180734 167183 -85833 -102873 143813 89053 -280786
18863 -119963 -69816 -173891 39723 -88789 -185140 -293255 281130 -1885 11188 179230 222028
18852 222028 -23606 -167028 281807 -166505 53736 -45037 -210198 275017 205111 8095 48767
18841 48767 86595 -5301 -165618 143267 316708 -115598 224736 118496 268642 49523
18830 89533 -301074 77968 -146626 -257628 355299 -105886 25733 199188 144511 -41496
18819 -176117 246909 31069 -201541 98939 -162799 120166 -218843 31194 -126221 -127116 100210
18807 79 265915 -237199 191229 40489 165349 -220768 -204452 -26234 160044 -30436 -159508
18796 -159508 173673 255852 -33690 -334501 167601 -295855 -58595 37310 247653 -62017
18785 -78884 -1389 102848 194752 -450775 -67435 -172577 -84156 63367 -164457 73873 -160650
18773 210989 -398024 65710 -50221 33314 26309 -187969 -29232 184827 40318 201687 339781
18762 339781 -146143 123164 -148438 -324399 318512 -17071 -223729 -175892 41246 -200122
18751 -204629 -350948 -155476 -108882 -80846 -139273 13396 206491 289248 184773 -155981
18740 96837 -16793 -176299 146723 109475 -165768 182782 4288 150011 58006 54768 -182375
18728 44766 -94858 -25705 57799 79217 -88180 -143792 -300158 -46136 -423884 -34212 -238439
18717 -238439 51114 75177 -132141 -177489 -97512 -12978 -78308 -28498 -461841 246410 61996
18705 -166461 209408 -47218 -144735 -227767 52667 313974 -138483 8483 66739 107376 200446
18694 200446 -45527 -112748 -280652 -61276 -143959 -64738 -163756 -154462 -238204 -207482 -115101
18683 -115101 -127691 31755 29928 -18241 -152920 -241446 -223261 -218962 9925 -19468 6232 -310114
18670 -149809 -21496 38001 -195106 -125690 40473 -224399 -24196 -145358 255480 -116529
18659 -94738 90564 12869 58885 -8317 -331338 -216933 -295681 38498 248067 -197372 165407
18647 -89354 -62372 -191142 55719 165540 -155079 154078 -61802 -137882 -220273 -270565 90326
18635 -258104 9821 -169450 185888 -111781 314717 67478 -205977 -355065 -168078 -30614
18624 350526 -468872 150702 64018 -115555 285342 -36313 -77608 -121746 -16192 -7869 122364
18612 -25500 -37480 47748 -255581 164827 49384 25487 -176374 96960 -122937 -33861 124228
18600 -416427 -368352 -41375 107241 -71987 -197447 163411 85217 -479407 -172292 -59392
18589 -32607 209596 -206451 4473 37388 -66511 -19564 -319766 309092 -86974 -384260 -78791
18577 111878 -155735 47029 -172638 -94471 88570 23935 -64604 -330466 291855 -25807 -144466
18566 -144466 -148074 4501 -349669 -302345 -400365 133537 105597 203565 -90969 86871 17853
18554 30250 -106207 51091 41572 -323985 -260547 -324088 -64581 -86369 189966 -325123 67812
18542 -36137 -350048 -173266 -130980 29942 149056 -215415 -342075 -115203 -602669 -23988
18531 -187948 -18688 -11120 -17226 -427366 94016 -333357 57762 29885 -109708 66798 -116945
18519 -85790 -52011 254396 -81895 -174569 117477 187020 -18013 -53319 -182086 328323 -156974
18507 57799 227161 -238587 -459328 -207443 -203339 189452 -129619 198252 -43992 -89944
18497 -89944 -339653 -75985 46027 -82243 -157820 -328058 -107835 99252 -36541 -102524 9710
18485 -20530 239403 -159017 289158 207413 -114177 -119298 -65845 -72781 241671 187303 13828
18473 -212089 185214 9079 29449 204263 -169482 223474 124748 43868 -78450 166382 -163295
18461 -55199 -24456 -103913 -386422 -223562 51451 61114 -390088 333101 141839 -213438 256480
18449 -80129 81279 -182130 -144684 -12397 123280 -306935 -41265 -109159 -133183 11194 -107165
18437 414921 -210600 83426 -266401 -107992 260291 -111207 -204195 -28458 -177791 69959
18426 19515 -54204 5807 88996 -30379 -336578 -199930 -178664 -92059 -20574 130016 105109
18415 105109 134906 -88609 -236941 -138503 -72277 -110408 -177047 -238734 53245 -269248 110885
18403 -435454 70879 50718 -137873 189242 -262902 -189918 -349615 -99249 -47593 -9926 -225110
18392 -225110 17402 21504 161537 33456 88220 -28253 91156 -197622 61489 53040 135707
18381 135707 7422 -268396 -149519 -276449 -213928 -255655 264587 -233507 21920 -128506
18370 146853 66672 -217060 72604 -847 340993 -1223 92034 40125 38477 -165217 -76255 -51448
18358 -51448 -147762 -113376 -173566 -85691 -132214 -434655 126531 -17728 101423 107633 233454
18347 233454 -23813 47553 -75497 -198530 -331312 82806 -241076 -72850 239870 -282538
18336 -38416 -22353 9587 -110539 -345304 -20831 -124395 34791 -153001 272770 155059 -132339
18324 127088 143024 -54802 -349013 -26204 -13751 -138228 39931 111285 100956 -46554 66405
18312 112610 -178772 101036 78426 -52526 -199330 -276300 67419 -34728 66773 -71673 -385369
18301 -385369 -10873 -294457 -53967 -38699 67252 149162 -229381 -15285 -97258 124991 123521
18290 123521 147800 -87998 -54502 141053 4802 -39610 116454 -191659 187308 -281956 -122547
18278 8664 20658 138160 -65221 118254 103397 -135916 -85998 -213601 -235912 85841 -9705
18266 -478965 -7794 -277027 116400 244922 70898 -7188 -139192 -386148 -64411 73717 93970
18255 93970 -181577 272838 -150998 -93739 138076 -42801 282458 -312685 -91266 285489
18244 -127042 -253781 123973 -77798 117167 63640 -156430 -63670 128797 238326 236709
18234 236709 12558 -111217 200057 -346384 -525764 -419033 63034 22586 13718 -224470
18223 -179838 117411 77904 355363 -40919 -340326 -116210 297225 -486398 -174366 172991
18212 30106 61259 -186429 -151774 -93334 117597 -86771 257634 101126 -113578 67624 -199076
18200 72120 -61445 -18660 163137 -6422 -248419 -139079 -75292 -198890 137181 5677 167911
18189 167911 -47246 -273895 -7515 -16236 83148 -173150 -287162 -369332 46034 -253182 -123609
18177 -14619 62179 204391 -387586 -173295 -165539 -502856 259650 -206022 101368 228199
18167 228199 -30717 -42258 164759 -251695 -78964 99531 170735 53131 -266608 89135 53501
18156 53501 -132265 138444 31395 -59843 47134 -159008 -56563 111200 104012 113728 5975
18144 70203 147300 -8395 -119868 -140014 -441735 -119227 -437286 146245 -45709 248700 -165866
18132 61732 199288 14733 293472 -117631 15778 -106299 149593 87545 258646 -123862
18121 -268559 -111296 68313 -21744 -79000 -155524 -5457 99323 186906 -190397 -139869 -90240
18110 -90240 3264 48045 -246242 -108476 35257 8408 194763 167496 97258 -90890 51426
18098 182072 -135575 -312214 -523467 -28909 -211419 93501 -144224 -94725 -404534 204080
18087 -111179 -12699 164831 -110604 -312421 83688 6340 51235 -117561 -143148 -44515 -25839
18076 -25839 60370 165816 71657 -114800 342740 -60901 -260671 -314634 -36256 100454 140777
18065 140777 187617 -136785 -146356 -11579 254922 100731 -316594 184584 104279 320185
18055 320185 -109706 -44128 -48652 -290181 -258482 120693 -69077 -143775 82057 -121937 63127
18043 -30193 159256 33187 201169 -37894 -272673 70935 -184267 -37912 -57853 384311 -112185
18031 78321 47898 -274160 -371992 35845 -51174 -7726 -17170 168018 11273 -120914 79735
18019 -168761 46878 -147203 285464 106831 101183 -88508 63411 -116963 -229579 226885
18008 -421400 102321 -153289 -160079 -65480 93632 356696 -290544 -96844 -49656 -171288 294365
17996 -49558 17292 73306 86234 -155547 -57121 79710 20171 -208146 -8969 -47085 20746
17984 -71750 -367574 -254577 62422 -166362 48755 -222261 330113 141103 19614 -257109
17973 405454 -83083 -15648 -143904 -188134 -98781 26386 -220441 122611 -156625 -42636 135662
17961 44606 -207535 -184495 219970 111298 -94243 -121539 -432822 -94978 -59867 -109437 33784
17949 -64232 67067 -75114 -30938 -96090 102278 -265901 9492 -137287 168964 120812 -94363
17937 14516 -104992 434714 -155374 -18757 290404 60180 -78361 114027 -188549 -400446
17927 -400446 303259 -55834 234685 -25753 92543 73786 -311058 93872 40169 97117 -7362
17915 -140456 128057 -107932 170549 -208229 -110552 71351 87121 81898 -15391 58205 -211254
17903 3707 -207035 6930 -35424 -249318 -112973 -67274 -56321 123062 48134 -65328 -119910
17892 -119910 219647 99803 95703 -101749 -263636 -184878 -66363 -143174 -384234 112794 -133563
17880 -41876 -30663 286754 -261925 -137243 278353 -74786 -49678 -95518 -9409 204759 -15601
17868 53711 58642 6618 -95468 -100414 -102394 -246920 124187 36968 -164793 141082 135525 -17516
17855 100323 -31108 -311066 21715 -253416 -135798 -244408 11998 118615 -9478 270565
17844 -302942 96832 131120 -123597 -75815 -63118 225530 201144 -239129 18380 -135705 -91988
17833 -91988 -58079 84252 -24833 145385 -511171 183502 108725 86377 -15236 109862 124527
17822 124527 -195344 -304187 -83924 -132785 225293 -183736 -53775 125269 326230 -80425
17811 108546 -288020 292491 -20151 160566 -312292 -56920 335470 40060 248344 -148222
17800 30560 -131979 -194215 -202714 74165 85177 66676 12061 10776 333143 -81607 119589
17788 -262635 -37609 118003 -32480 -271908 -122364 3926 -388863 6827 -145061 138495 150454
17777 150454 -255592 137486 248312 -324459 47457 121112 210335 -86651 136878 127363 177428
17766 177428 40037 -79489 -161638 -30864 241446 249531 -95117 -70355 202808 -61015 -170556
17755 -170556 -79179 -87202 -258128 56782 26513 -89306 -160345 205380 78248 175753 133251
17744 133251 -12706 -112437 312668 109939 -60326 13055 92237 -131319 -113924 -66189 -110968
17733 -110968 -79412 308703 157701 -100043 -147882 -6958 -120976 -70581 73160 263684 211791
17722 211791 98618 316051 65385 155066 93018 76080 106620 4110 177953 -39047 -281393
17711 -281393 25369 274176 -93787 -9352 39694 -152124 -146942 76322 104678 68601 71786 -157222
17698 276777 270923 312675 -119280 -42613 -18207 182404 296829 436686 106475 -21966 -49197
17687 -49197 90686 -225207 -35693 -19437 63018 224324 1994 -344832 7440 36988 286886
17676 286886 230379 -61526 -169991 385558 -40133 53343 151459 22627 -93725 -51127 277774
17664 -247054 -258757 -142962 -37642 19849 -299326 84375 -98948 -14176 50039 -41476 106848
17652 -92969 -139350 -308892 -256403 -88025 -12857 -178482 204202 330385 -172177 208386
17641 -173231 -37201 7406 138122 -15136 -229858 -327241 225095 60787 132531 -104397 -51037
17629 214186 233964 341779 97640 -26145 338290 62538 341522 -48167 -101551 -1698 51489
17617 -40376 -61409 -55468 82419 -151319 9016 148481 5995 -50704 -187276 114464 67071
17606 67071 128668 -13113 -20047 241206 -187611 -115751 -83451 -100472 -68629 56689 -162471
17594 93164 53211 -89101 -89996 -217263 171687 172043 136394 96871 28143 97643 273956 21806
17581 -52034 201002 120068 -137752 3820 125767 199198 41633 -30904 71023 -35705 -127667
17570 -127667 50280 -203783 153238 -155686 -86105 332124 250451 -111122 130903 59991
17559 13394 -118948 27500 122461 21654 126039 144744 30555 45466 -147134 103050 -177771
17547 -52088 -117535 -106587 72826 2251 59276 85982 259558 -27525 70872 99191 128830 -269046
17534 11485 -164971 -111011 -122602 118014 8566 101492 -356495 161349 97432 -149083 -10228
17522 -144288 146295 384827 66429 5639 175919 -11104 -59710 127383 120856 -274231 286967
17510 -16420 134054 189251 28386 147214 273244 -62149 -22417 -145456 201118 15124 115946
17499 115946 -69722 301815 -214213 -31449 145957 281937 316179 -108036 -236531 104612
17488 54308 -90867 -86184 159863 65100 175796 66279 -199140 -201725 136772 72388 247793
17477 247793 -106839 361924 203317 338944 131062 1592 81538 -47831 95669 -50743 242801
17465 372242 124426 274311 -12022 195799 12989 44179 1656 232871 264433 411841 239421
17454 239421 284252 329820 239610 224656 246295 -153757 28259 164879 245324 346499 207652
17443 207652 79795 270035 144165 272632 -37750 42698 38883 298983 196794 556144
17433 556144 242203 386030 91036 271286 102180 452444 51195 278209 198900 379880
17423 379880 300955 -87238 4231 159193 182704 264129 255484 257489 373327 285640 419263
17412 419263 354010 -31068 318752 524854 340309 75622 194512 316902 52057 163242
17402 163242 264196 -23194 302540 372736 277313 160973 -112625 194184 40269 18850
17391 19110 16017 222513 298474 6316 320392 139610 -58290 257150 19877 -68372 294815
17379 -128069 25006 74489 271207 -61107 221768 259381 102622 92810 58735 134084 231669
17368 231669 405900 -156623 -15854 346055 71466 156159 376385 -147019 52692 23034
17357 -48050 286123 -64429 -54925 -76812 115723 -65948 -62128 -134071 259965 70890 120651
17346 120651 -266354 4406 27328 125781 -264741 -99326 -69596 243063 57713 -40294 308613
17334 -132773 -231858 82613 128779 194292 170469 288786 50023 120527 190550 187081 24305
17322 83920 294135 70061 185933 328082 -69042 215622 318731 -174732 179404 192550
17312 192550 299062 60613 205030 285430 -34435 140508 284817 -107750 75267 157230
17302 157230 535454 217976 156519 183157 129345 -25591 -55025 -32421 -2966 -194927 404908
17290 422982 -59946 148299 249139 73676 -198141 238103 62301 70559 -76894 210382 72596
17278 136902 259347 175085 116707 122810 126595 -214300 398268 -58817 317278 339483 207199
17267 207199 439452 370205 93182 176100 -206435 22680 180105 -47626 147215 160513 7413
17255 38968 209098 268279 101783 370363 165150 41629 20233 -322 -33857 625737 101672
17243 176364 254431 469939 326895 11406 142108 -199269 300889 314562 95876 -15418
17232 177439 475207 200431 153066 345086 -35166 365631 227523 -21284 42539 184505
17222 184505 218384 -122961 252297 57161 328481 231924 116310 5042 255948 201672 279094
17211 279094 219237 68752 254878 -161016 395352 52618 -17534 -197808 308672 241431
17201 241431 170307 496109 355498 136128 407477 41927 -10714 9903 323301 193581
17191 193581 333728 181256 470275 311793 154575 229480 527334 207591 110862 336054
17181 336054 348713 195002 -37506 410832 128000 144549 -43779 334284 287359 75373 28787
17169 -156591 372291 165898 297315 393231 388534 238332 246891 121442 337202 277101 146903
17158 146903 230071 312697 162192 227143 89864 316537 346178 206454 122880 363176 430290
17147 430290 166440 208987 235105 463450 400794 164919 579677 213863 303995 343243
17137 343243 351435 497803 198820 564867 200755 529792 413851 448140 250437 152525
17127 152525 195704 324068 398300 216159 36993 207687 -142844 142256 303193 389353
17117 389353 583223 415143 178813 115751 333780 307443 346232 359724 318329 415079 177067
17105 28091 344178 373324 151123 -119093 379300 269333 339378 49188 342147 404331
17095 404331 285832 493878 528242 260055 354771 488832 124187 459629 167979 41807
17084 704545 447235 342410 482467 141397 46623 272866 486807 298897 333381 203609
17074 203609 483570 698022 108981 550658 714855 455460 105618 -107884 529815 151950
17063 429947 638299 311794 225893 339009 391826 -169292 357888 345345 199764 263061
17053 263061 428489 128258 209292 476759 439685 -93046 397371 628159 175169 504995
17043 504995 146524 217621 247318 313373 589925 742345 425348 476678 722486 541975
17033 541975 320998 464650 176598 537506 766631 388244 262447 454226 272487 737532
17023 737532 128787 633314 380548 643449 442950 395083 391531 241735 799472 805589
17013 805589 630980 372207 366603 485828 389203 663928 618370 396370 677019 504733
17003 504733 561433 408825 652440 499420 792494 617069 740142 683609 705900 751658
16993 751658 736416 954180 551674 484315 767608 536776 602176 579900 620117 710075 632119
16982 632119 620672 774468 716191 295190 225596 724017 905444 608316 674437 597945
16972 597945 402661 484577 415066 532610 724911 776352 637428 882565 720460 706591
16962 706591 991459 561215 360967 910628 738191 512988 1105511 717094 849836 893802
16952 893802 1055384 899379 821760 827144 757845 529292 812903 956618 626909 1193353
16942 1193353 753331 1066411 841594 1121570 979682 935011 906954 937575 781668 1217492
16932 1217492 1060863 825311 1033661 984212 1016085 1030144 710752 1061760 838069 953510
16922 953510 927515 961764 752932 886386 994112 844397 1090675 1244731 1218596 861459
16912 861459 1230087 1134879 1128689 1124678 1088916 1238930 991395 1143604 1063789 1517931 1064306
16901 1064306 959313 1211815 972208 1036716 1378504 1287395 1216879 1421641 1355773 1272301
16891 1272301 1032533 1383561 1194805 1472010 1233305 1117826 1747077 1430369 1311704
16882 1311704 1416552 1628875 1870883 1572024 1797790 1551221 1786727 1394827 1445501 1453994
16872 1453994 1574057 1693301 1779989 1853119 1742889 2099300 1979950 1506982 1700570 2000532
16862 2000532 1679940 1653582 2002615 2072857 2149118 1957345 2480889 1613442 2000741 2032490
16852 2032490 2031843 2170260 2255289 2173071 1954233 2114659 2491312 2440079 1927938 1893368 2423065
16841 2423065 2489974 2475315 2564205 2797224 2695731 2628210 2480832 2825016 2397328 2789779
16831 2789779 2776474 2910342 2931479 2965289 2610320 2783214 3067438 3022493 3181539 3364023
16821 3364023 3373313 3273127 3416897 3311999 3428269 3565568 3690966 3773716 3663902 3843457
16811 3843457 3552047 3711312 3843471 3941984 4309195 4383109 3996134 4158727 4362378 4502740
16801 4502740 4850848 4893479 4782457 4693719 5163962 4947385 5261723 5227205 5768208 5783356
16791 5783356 5725134 5702545 5763949 6049258 6143255 6322231 6636649 6657551 6819813 6810362 7277495
16780 7277495 7123279 7348041 8040147 7770946 7858166 8446402 8422118 8617127 8920775 9302685
16770 9302685 9390857 9797245 9954661 10318658 10547068 10750680 11459970 11462628 11892569 11962637
16760 11962637 12442707 13200875 13677493 14063249 14506433 14939236 15718167 15896271 16709977
16751 16709977 17410593 18061280 18732485 19232845 20112310 20876631 21854033 22976308 23532143
16742 23532143 25058620 26092004 27147378 28416102 29913009 31274183 33236468 34868742
16734 34868742 36518023 38686494 40436578 42731162 45340219 47867600 50380634 53649463
16726 53649463 56906919 61112343 64877598 69182544 73663648 78366108 84063091 89871567
16718 89871567 96483343 103027861 110347778 117843065 126126122 134757891 143175143 152320218
16710 152320218 161613099 170720170 180055789 188289969 195651265 202284765 207551624 211467692
16702 211467692 213679477 213721699 211853359 208756878 203767409 197524870 190306145 182005706
16694 182005706 173254308 163653737 154574474 145136725 135919705 127064062 118907726 110962319
16686 110962319 103320793 96366648 90147407 83969295 78201808 73534643 68259099 63771860
16678 63771860 59404484 56234677 52417803 48926176 46355640 43320390 41056279 38513308
16670 38513308 36568904 34581615 32678962 31046781 29463617 27932412 26413411 25215007
16662 25215007 23889615 22999069 21827125 20869835 19822950 19034974 18261673 17161356 16496336
16653 16496336 16228841 15477713 14581528 14445901 13763167 13344711 12786822 12674628 11939524
16644 11939524 11419757 11263380 10704225 10284169 10004493 9616881 9236356 9340086 8757530
16635 8757530 8295190 8258939 8009915 7550950 7815231 7398719 6864362 6672984 6706257 6294712
16625 6294712 6594642 6039485 6074909 5838546 5638054 5747021 5345357 5400229 5243231 4663792
16615 4663792 4999882 4527881 4654467 4683238 4451373 4449396 4016452 3920854 4224696 4001927
16605 4001927 4053142 3644246 3875223 3764112 3735245 3058211 3612066 3434720 2982523 3269395
16595 3269395 3070406 2980026 2995593 2902758 3277986 2665375 2598101 2704530 2622134 2609263
16585 2609263 2550506 2556183 2559481 2488783 2216170 2194485 2015543 1938111 2375167 2005171 2357709
16574 2357709 1991878 2292619 2288674 2173773 1839298 2025980 1978673 1904692 1895086 1791503
16564 1791503 1788340 1734294 1902281 1914612 1330772 1621876 1666561 1664456 1284215 1423793 1673393
16553 1673393 1356023 1751404 1267480 1444836 1308455 1631687 1463716 939456 1266977
16544 1266977 1274610 1354589 1166898 1447974 1189285 1205604 1213410 1407872 1143084 1552722
16534 1552722 870067 1128150 1036498 899293 1212888 1179310 1112021 1209873 1499217 930389
16524 930389 1068340 790539 838414 790611 943605 1051563 962107 1038981 1010804 500815
16513 616031 793868 1042333 711582 1079640 762908 716650 715660 919922 616340 718504
16503 718504 626573 524766 638728 832202 871227 540620 867112 709819 696681 581818
16493 581818 490417 600481 634023 787586 778181 885028 584992 681840 419410 711312
16483 711312 585075 690507 392301 598535 720161 398026 403568 645960 402301 538610
16473 538610 422218 508141 418273 173332 511696 153966 270225 549618 469644 443235
16463 443235 425195 741618 495011 447401 378544 230500 725021 497390 455966 283474
16453 283474 529927 358968 351238 192790 403067 239819 355451 374848 183740 281758
16443 281758 358773 410583 340081 369101 412689 245481 543946 268501 279302 -20604 495217
16431 416273 325421 259111 208174 344530 549183 293527 118535 280734 -64843 310615
16420 311982 -75651 5305 585909 306795 206024 280969 163123 71814 136365 189746 816405
16409 816405 478412 193874 448849 118450 481537 250909 215011 51102 124522 244113
16399 244113 135033 244317 181828 -76657 252265 25369 294720 170708 285473 388077
16389 388077 242674 271471 286117 73506 208191 53102 152007 175516 251094 64282 256225
16378 256225 -56294 285460 64948 138100 205875 -93337 328639 243083 331979 263699 235570
16367 235570 49660 173967 206595 541689 47384 218337 228036 126794 346913 -344871
16356 -69795 360345 354382 -144976 414551 86092 140710 109484 286963 241699 265724 75184
16344 438250 78594 64450 149517 25202 154014 75557 254519 91740 18062 27118 121328
16333 121328 55214 23062 178514 -154188 326386 246509 -27654 112808 231322 78101
16322 -18753 -65618 82455 335101 63165 33382 277269 -26856 -194426 142553 -78038 -461387
16311 -461387 -338690 -199072 -86243 109318 22040 -152203 195532 53542 541684 276381
16301 276381 -83482 300132 -42175 1768 53575 46166 28471 162785 -172838 40323 54912
16290 54912 238027 109999 252363 23942 90566 -9040 -452415 60312 201350 -179355 -159748
16279 -159748 26834 171660 287609 146567 192265 203421 -48021 -79079 355088 -191448
16268 -50298 45944 86693 -97087 63775 65819 279834 212854 198126 -135300 -113496 213654
16256 -314671 3926 219064 11840 28656 44500 247791 388901 -101317 71848 98512 -109916
16244 -225092 51686 173287 297562 248551 14014 -158754 -296212 113308 163732 168913 -38650
16232 25225 -40400 103912 -7373 351083 -158374 41588 -109328 598 -63680 -219097 193425
16220 -27444 365347 177549 -63773 30789 78083 181230 123244 -84757 -149296 -131002 -212157
16209 -212157 164934 -10697 -170176 -61567 -82976 -237932 -206071 108098 -41882 -306182
16199 -306182 72213 309556 92221 29778 108563 296142 -333707 -32887 111602 275996
16189 275996 -21648 73921 -327915 5390 -267863 -71777 -217789 -314893 86630 -236834 122245
16177 -269314 -107427 487566 -72431 77227 73126 66114 483506 -122612 -73866 281740 335741
16166 335741 91246 84515 57712 -239815 -20808 -65542 995 -123230 -196940 -6915 165019 -170734
16153 -34773 -74517 -207250 -118587 152272 90585 24674 -5635 253585 -130841 97972 -259376
16141 -39970 342740 -346485 34827 27100 -199708 433222 159623 15265 315481 -34019 159039
16129 2823 51169 67881 19275 -263186 -380506 233752 -76190 -229319 -31982 -32492 172071
16117 86731 220141 -112954 100206 118990 -178202 103932 -115554 186102 -51947 -133397
16107 -133397 -27832 -428427 -227527 186957 175579 -119375 -5800 -191400 79647 76941 293623
16096 293623 95633 303915 220071 -42735 -21474 64596 -108986 19949 125248 280811 348540
16085 348540 157209 82133 205794 146616 -55431 -195992 -113531 -75631 -255669 136035
16074 -396131 38023 213584 -264737 -393411 105578 38335 -207332 26257 -8103 -253427
16064 -253427 -167227 51723 -141246 -46746 -437615 137965 28350 -344506 -164490 -163095 34722
16052 222447 -131613 105022 -182232 55368 -247103 -133832 -330081 189069 -67029 -265607
16042 -265607 -42312 140975 -227801 154029 -172349 -207725 -205316 131786 63697 -73844 -893
16030 -129849 -219824 -136818 168967 14092 -115996 -449250 159571 3366 94339 -178003 -204700
16019 -204700 -15235 -134732 -234433 -114414 -115136 208084 -212624 99973 -37153 -263577 -21254
16007 34587 -88965 -169520 -38822 -169196 -159980 48081 -136677 17594 -217793 -170831 -29000
15995 -156725 -197722 -106192 62658 70300 -52732 127907 -118365 -203981 -121300 42319 173894
15984 173894 -170776 -254836 94542 75479 -72728 -115603 -82837 -123657 -136320 4329 14130 -116299
15971 -29026 334782 543189 144107 492980 365463 375087 222473 442240 -57607 221343
15960 -115998 -59549 171426 160396 231581 -297055 175418 59787 312354 -344844 169449
15949 65839 198674 24788 264005 92909 -140099 -149343 -204201 -200217 -6041 128066 44915
15937 184010 -190095 81264 -148666 155249 -43436 -34772 -104333 28092 -125686 59095 -280549
15925 -269772 -102582 -134179 -62992 -212390 14843 -96611 -175849 -7206 -17980 271537 30502
15913 179692 -218473 -409669 528 -83347 101022 -45761 50431 -17431 152789 -338702 -296890
15902 -296890 -9990 -21829 -282305 -22557 -155475 -176101 -79418 637353 -351674 -295886 -124475
15890 -305816 -133445 128571 -132325 -91164 -289004 -246346 25495 -179225 244460 -217930
15879 -258311 -133305 116177 10168 -82700 -116123 -41371 194896 -28944 170390 -373606
15868 106273 54582 148175 -211756 107929 -190548 36565 -277386 -162856 -10183 -106527
15858 -106527 -58740 -383720 -141884 38452 -299782 -16173 -187024 -42808 59144 -221814
15847 -140987 97702 84477 21866 -83323 -82015 -133517 -342084 178104 -6772 17420 397375
15836 397375 -86687 -10842 -125188 -172361 -81521 -213859 51571 54074 222278 -181928 -330267
15825 -330267 -184927 -163987 139310 -228694 62340 -90524 -113984 110884 192734 20642 7668
15813 -46842 -6850 -120550 313887 24102 271029 -44419 -40574 -180958 -196425 -179252 45709
15801 71306 76785 -319188 -189843 -100806 -40492 -49022 277711 -127194 38363 -213055 84897
15789 -195461 -130905 2612 -294929 3982 -153806 -179219 -27367 196531 31674 -11245 -73669
15778 -73669 -28586 45775 144220 -70681 -218131 -39179 -312468 220491 89041 -182168 22323
15766 15224 95586 -143257 -134721 220585 75283 5168 -149373 -314579 265845 150613 316828
15755 316828 73432 -163924 -47299 -239214 -78895 -1573 -73535 -244539 -35435 -34460 -20239
15744 -20239 349035 -49657 89003 -104319 99110 103051 262606 -212730 114397 42221 -9394
15732 -12597 75315 28731 66606 237277 -144157 19393 103589 -218874 -135593 -44076 13665
15720 -188216 27636 -130399 -102970 -186469 -25444 -228356 18024 -234926 -67220 -309767 -228071
15709 -228071 -198088 -246449 67542 -45083 -436536 -125433 449168 -41632 -118717 14298 -168325
15697 281694 115416 312280 -271235 106080 -18223 -435161 226066 -136464 -193609 -415913
15687 -415913 -88465 -148268 78496 115653 -82385 -27345 21543 304646 -206701 93391 29592
15675 261935 4842 216595 221140 28435 -124745 233153 32655 287135 -363847 -415173 -190004
15663 -91390 2759 -105899 15168 -205849 22443 -180292 23750 -337 219340 -23660 -9793 159615
15650 294988 -230120 24680 -265780 -292097 -154209 -244609 56376 391133 -114282 37432
15639 182072 -54080 44184 -166211 197261 -105711 -211650 -221664 -211776 346362 -101495
15628 -74750 109145 57635 11237 -76124 -229364 95961 21524 323817 209665 4359 39904
15617 39904 -317267 714 49143 -134896 114381 115178 -34280 108032 80338 -141975 19593
15605 81736 -55904 -126080 -50666 -147952 -55075 361441 -15202 55057 -123868 -153180 -60439
15593 253903 -9415 84084 -122929 -84923 -20825 261156 300447 -106968 -271289 92255 77622
15582 77622 142005 110983 -344573 64701 -22305 -231298 -23508 -306233 145997 -49645 33736
15570 -87984 -125135 133435 81469 -118165 -68697 45760 -165580 -295302 167788 -79216 -102246
15559 -102246 -15996 -53169 16133 -361674 -278782 122320 -348617 439484 -3450 21513 -123970
15547 -163139 -317482 -138654 -41763 71740 139886 178723 -134420 202248 271187 78845 -99773
15535 276649 -34385 18319 -145415 44090 -150865 -147299 -57798 76345 -120715 165057 -34707
15523 -49450 220117 507570 63979 -10909 -103707 -148639 77286 -175177 78216 -154455 120326
15511 -1678 109939 -333317 -3451 -83792 13051 -18609 198939 9916 -223967 -19420 186630
15499 231970 -258357 84105 -34180 447702 -73948 263038 -355276 -48680 -60022 -162751
15489 -162751 -53950 206585 -371017 114192 142829 -49890 -327307 26757 -126595 82056
15478 -28257 275006 231196 94427 -202494 -47571 211016 -75950 -75949 209334 -103503 64412
15466 -12262 -75920 -62007 -382519 9732 -183382 319925 -285716 -71283 -102870 -254382 76279
15454 149196 168228 -369247 -23571 82207 29026 126887 -190375 -109241 -11955 93648 1 54344
15442 54344 66309 19837 -218250 113236 -49859 49766 -92358 177815 -16938 -42113 414
15430 147395 104530 17961 -9923 -210776 -19123 -37947 17958 -27213 78883 93865 71817
15419 71817 -176950 101750 218009 -251924 236061 -27936 75170 73679 -5369 -450438 -44708
15407 122610 13521 101143 -50378 -23929 -50571 -18957 208357 72457 203597 111016 -286834
15395 -81071 -151627 -69519 203436 -170638 34856 350149 -219175 198194 -46234 233306
15384 -143053 -95781 82558 -251165 -2226 -32666 -206282 -129147 -159518 -23226 132709 113579
15373 113579 206440 -37146 56886 223710 122463 -88952 -63182 -154344 95249 -164208 275719
15361 66750 216215 30056 -70909 77742 11894 154154 76907 271734 -20546 128683 75022
15350 75022 -129568 -3174 -104536 79620 123819 -257184 -61123 118840 -214390 298875 246128
15339 246128 -7664 127095 -34512 131605 -208519 -162081 -94534 -192170 115895 -45637 -20483
15327 879 12164 210030 -95253 48962 -73371 274806 272743 198096 154848 57844 242117 246689
15315 246689 11721 -118826 -300416 71887 475784 21279 65027 72748 -206170 -282321 -312828
15304 -312828 -38585 129257 238531 228668 -66128 28085 27470 118348 -38114 -153850 10827
15292 -381944 23508 107004 128170 35193 -191451 -158776 -28947 -33292 -118713 14505 165958
15281 165958 -4368 18018 -187410 -192122 -719 130825 -125777 -92056 16498 201537 68643
15269 -189660 344382 17417 25014 58267 92597 -255292 81233 252831 166642 50589 -94108
15257 -41673 109975 -126038 -24306 -250730 387337 155558 -187569 -175092 177000 4607
15246 60375 -119660 512457 40464 -5512 86476 -281299 -185838 80089 111924 -36007 212625
15234 350194 539538 672695 1268066 1230842 1116472 972632 447590 193970 409870 366353
15224 366353 218638 206488 -26054 71967 102471 90233 174829 260613 342707 160297 61113
15212 233183 123092 141011 -482423 -1551 -165800 36971 34029 130222 27382 172941 -95090
15200 169967 192444 -284502 278898 -80720 127754 183772 -22309 177248 -137707 -126466
15190 -126466 156391 15872 -442857 5657 18972 128243 -325 -46964 -117582 245550 106944
15178 113469 19919 225142 -73715 139156 108951 247623 -89400 -7154 183186 174076 -40743
15166 197190 203252 -166929 -38747 223170 31899 -167720 -26948 267838 -41268 275288 151190
15155 151190 -156637 180333 567639 207421 -8570 -16874 173579 -172282 384036 171073
15144 49324 27591 -55365 41280 -546142 282660 58679 129948 -128356 133595 -18437 427512
15132 378610 368146 41770 -4726 -7581 368725 290025 184484 -9060 -14768 235933 -38692 133394
15119 -21331 112263 -101135 358451 93118 -41323 339359 -48992 415750 141667 216165
15109 216165 -47437 -103776 137013 287448 236324 268062 74252 54156 41931 -7380 598490
15097 281957 252809 -16321 -44377 135675 361181 281627 160552 -61900 382639 288475 74904
15085 175281 629330 302140 -43485 236660 119217 573280 -53203 -85110 133128 71774
15075 71774 -228038 209047 134475 444749 -169899 156169 43509 312526 199309 190617
15065 190617 -133025 298671 37314 -161251 16525 264033 243896 368760 198639 -39670
15054 358302 136869 197807 90455 239012 314534 145723 226149 -118356 252956 374781
15044 374781 623821 -89512 -10039 -90102 348700 8966 206157 420993 452375 336485 231183
15033 231183 -173094 81197 -162401 149928 498697 100072 229562 303145 -88725 299531
15022 88281 231957 212132 7764 242089 260617 -114170 79425 38474 253198 358058 783830
15011 783830 155395 514440 39679 -146977 403065 106323 52436 162385 184514 198833
15001 198833 -50866 39216 75851 286337 188698 221262 -13829 112757 108065 -216064 42700
14989 357775 383640 363582 31353 -71320 332357 -104205 334152 334429 628577 295124 102125
14977 226727 -227661 335942 235016 -43280 667987 165258 123982 272701 46291 -235637
14966 108256 301117 -436939 425445 525316 139739 168289 428882 228302 98503 112738
14956 112738 154880 151532 82684 290394 115123 366273 254773 -14391 273998 48230 319585
14945 319585 233309 403491 18882 440306 -13765 166653 193387 197181 289794 316484 149558
14933 206807 597652 313956 488506 162660 382571 390103 492529 240449 518003 347681
14923 347681 153392 232340 199391 351817 614317 28809 166885 345310 110791 145136
14913 145136 459571 207360 254757 415767 305621 173464 192964 -15286 264102 77163
14902 584344 183239 448365 323527 -52690 295960 232023 284939 457481 401984 144027
14891 293811 168510 147458 61484 -3080 415257 307076 -228 401091 539847 232743 339509
14880 339509 651282 336663 321896 540655 246569 187511 297280 318290 411265 -41318
14869 563916 403418 493927 554405 203170 456817 192163 260712 325982 514719 278630
14859 278630 206019 175169 192291 313365 431400 282595 494549 354649 60943 327888
14849 327888 350062 525320 139015 366632 528063 571637 48627 183580 242222 466322
14839 466322 394068 381609 503940 202449 337126 340313 478695 136489 473620 260132
14829 260132 246248 412021 529057 437393 539907 281048 150408 646494 39562 333918
14819 333918 478715 133313 554970 412091 492202 371617 547115 275597 522173 -24277
14808 41099 522039 467818 358995 582054 244507 545474 88798 561797 376011 646843
14798 646843 440903 440854 454556 385223 345064 511076 715117 622916 607438 403124 485371
14787 485371 432390 458075 442892 199622 671578 371537 762298 683650 522294 610907
14777 610907 172322 435943 376020 446194 293790 608598 132295 184776 579930 670476
14767 670476 278930 423501 624547 664552 610209 445680 140355 826225 356612 426883
14757 426883 611207 722150 693672 235041 727264 433061 559940 330419 611628 488132
14747 488132 504689 434682 726323 431770 558480 868301 559383 448814 852912 534173
14737 534173 1026942 528131 683652 639823 772393 837906 341280 676754 555187 656954
14727 656954 704888 836440 410113 603660 728506 721465 1060759 944962 1055791 908514
14717 908514 513423 714131 964150 943901 889495 800305 447978 978531 934841 558085
14707 558085 960912 842714 808147 494023 774119 978153 552511 937805 822180 713611
14697 713611 770733 816753 784429 907596 1168189 717810 570976 846734 803865 1019694
14687 1019694 905820 1021856 936275 548728 1187561 792654 938363 1046510 1051787 847106
14677 847106 474010 864267 679691 1004032 1016244 589738 782996 944648 684634 897104
14667 897104 909132 711635 985494 837913 1158278 825502 696346 1257363 959961 688399
14657 688399 1038665 627802 994961 1080702 901143 740912 1180934 594410 642452 1061840
14647 1061840 1006554 651987 836722 783199 1085895 771084 1004412 1113728 1270676 868408
14637 868408 846951 831341 1038334 941060 1145969 1250740 1089344 953415 1414174 1102090
14627 1102090 1151726 770367 1448445 1308540 1210561 1172612 1026545 1187416 939319 1386615
14617 1386615 1630900 858333 1369976 1134571 1093758 1229145 1125793 1178046 1042010 1212009
14607 1212009 1122994 1019344 1164762 1191837 1304860 1383175 1648411 1209020 1434296 1502285
14597 1502285 1255041 1263935 1417192 1635747 1323852 1606253 1552088 1371503 1583047 1389677
14587 1389677 1408958 1376929 1437484 1533878 1282340 1589636 1760649 1620126 1308948 1797403
14577 1797403 1518155 1656909 1371214 1166788 1460644 1849034 1558362 1808880 1742253 2003362
14567 2003362 1751773 1301140 1781378 1701998 1683242 2007322 1866010 1713051 1917413 2216807
14557 2216807 1970163 1800311 2363318 1924895 2061149 1952575 2248678 2200401 2239512 2151086
14547 2151086 2392306 2375638 2623348 2675353 2366608 2628798 3154764 3188031 3553593 3910498
14537 3910498 4558478 4966796 6277414 7941590 10972808 16045260 24920297 29908587
14529 29908587 23078393 15788388 10373788 6982799 4772332 3290538 2975855 2720913
14521 2720913 2123209 2576083 2360322 2226528 2309935 2466729 2117735 2199021 1870008 2005814
14511 2005814 1975719 1921719 1880079 2055719 2466653 2472432 2061329 2283634 2487522 2621843
14501 2621843 2409821 2561377 2297815 2632379 2346724 2138299 2409021 2636005 2789373
14492 2789373 2424282 2780638 2383134 2130403 2666791 2970566 2991270 3069600 2921354 3138068
14482 3138068 3138468 2747571 2904669 3240240 3077272 3196275 3342530 3156678 3294654 3039643
14472 3039643 3595471 3244829 3279135 3221534 3444909 3456182 3404531 3692774 3682611 3617342
14462 3617342 3699509 3591673 3907241 3793564 3223064 3962913 3923433 3890225 4082354 3971048
14452 3971048 3997541 4402086 3947330 4296882 4405769 4426376 3961023 4518013 4344191 4325383
14442 4325383 4329144 4657553 4927088 4569095 4836397 4764837 5198946 4862548 4954350 5022877
14432 5022877 5104101 5260823 5348433 5106133 5584738 5613198 5674659 5787800 5904410 5737644
14422 5737644 5447936 5812859 5993428 6138951 5968175 6150689 6297617 6155980 6273978
14413 6273978 6424429 6534079 6446922 6513761 6932691 7155577 7227922 6988735 7447581 7465835
14403 7465835 7442099 7479503 7603986 7877129 7792231 7829388 7965704 8155122 8246314 8003675
14393 8003675 8413122 8599125 9132659 8889073 9058832 9148632 9135503 9135665 9339494 9873778
14383 9873778 9578863 10323598 9987284 10397274 10139743 10780270 10992788 11116816 11359723
14374 11359723 11684058 11658592 11971725 12042461 12065991 12243579 12743345 12663939 13192095 13270287
14364 13270287 13699244 13878117 14109556 14284891 14720551 14560443 15400182 15306736 15836646
14355 15836646 16240844 16396930 16836607 17085226 17405518 17815091 18240486 18618128 18846434
14346 18846434 19130083 19926892 20038720 20560522 21128754 21610060 22250069 22837482 23520485
14337 23520485 23612732 24219409 24600223 25575794 26232979 26906053 27527365 27954687 28839526
14328 28839526 29522747 30511388 31131768 31839842 32943523 33565186 34746867 35521385 36775150
14319 36775150 37883805 39061746 40220179 41456031 42903406 43718101 45505663 47030188
14311 47030188 48582938 49844535 51518862 53378951 55039872 56898495 58949241 61077606
14303 61077606 63573952 66053088 68350556 71367583 73716997 76727214 79926813 83162280
14295 83162280 87074801 90252395 94159639 98532332 102867896 107752043 112628545 118061954
14287 118061954 123449184 129643905 136056108 142671963 150084372 157844383 166116649 174463407
14279 174463407 183772650 193350304 204183933 214954096 226367555 239028277 251586823
14272 251586823 264928064 278831736 292831519 307076148 321425612 336267415 350785610
14265 350785610 365232463 378664308 392055963 404470948 415975852 427008241 437413105
14258 437413105 444518559 447926813 451030659 453281268 451430744 447497811 443184336 440064597
14250 440064597 436117504 430268302 420288385 407364042 393203997 379041420 364725249
14243 364725249 349548048 335120432 320396907 306012227 292153136 278985818 265580988
14236 265580988 252836885 240693415 228987789 216803170 204993489 194114778 183900620
14229 183900620 174370902 165376734 157104570 149321072 141945795 134825985 128525879 122785153
14221 122785153 117359968 112219072 106651472 101985708 97760730 93525358 89690009 85933928
14213 85933928 82421955 79068582 75983003 72922225 70119099 67401814 65234584 62805984
14205 62805984 60496032 58281137 56201582 54374039 52702090 50882922 49260489 47488101
14197 47488101 45803242 45008373 43296059 42100213 40805870 40406406 38727715 37514239
14189 37514239 36488650 35218805 34342298 33693586 32703390 31770126 30992481 30020000 29591003
14180 29591003 28616941 27844812 27021033 26652567 25869643 25296593 24697543 23942703 23237941
14171 23237941 22802601 22424745 21787036 21343305 20815720 20196469 19504973 19449444 18718428
14162 18718428 18721733 18310443 17937099 17366811 17432434 16803125 16523782 16341219 16007062 15651439
14152 15651439 15255978 15009160 14630953 14135232 14176304 13784761 13810839 13425228 13047407 13363420
14142 13363420 13038475 12810118 12546355 12293705 12210580 11690549 11497675 11534678 11263699 10981334
14132 10981334 10701349 10697915 10338190 10165017 10281173 10121669 9823518 9615048 9613061 9759293
14122 9759293 9105194 9007398 8933561 8725125 8744863 8215021 8374182 8385158 7979114 7987013
14112 7987013 8291442 7857554 7991401 7721127 7249857 7234916 7503413 7244147 7094546 7133803
14102 7133803 6853767 6688848 6436593 6646984 6505777 6382908 6215746 6378920 6270304
14093 6270304 6048960 5840662 5936504 5933402 6174270 5881787 5725218 5657398 5528043 5346850
14083 5346850 5378709 5315153 5474583 5360088 5179470 5529188 4795803 5200832 5001977 4711275
14073 4711275 4499045 5035556 4650925 4780118 4464570 4652418 4414389 4381949 4537427 4654834
14063 4654834 4688604 3880737 4004322 4117125 4397368 4052290 3861310 3843840 3939967 3805169
14053 3805169 3962241 3964634 4060087 3477473 3766991 3960553 3960808 3537948 3566584 3459754 3586494
14042 3586494 3482509 3641285 3772417 3291180 3562068 3485829 3195389 3382066 3445862 3236217
14032 3236217 3203854 3250534 2866817 3369862 2978270 2977080 2939667 3001523 2960539 3096824 2927903
14021 2927903 3032487 2676146 2724268 2673397 2717487 2942803 2654354 2829630 2611935 2890151
14011 2890151 2821476 2589961 2618331 2324582 2616077 2450088 2565266 2246071 2667542 2362053
14001 2362053 2274266 2501307 2199632 1991289 2138053 2169457 1911979 2346990 2028154 2307677
13991 2307677 2233602 2228659 2070314 2038571 2097167 1816510 2021775 1905981 2299157 1820161
13981 1820161 2381011 2225213 2210671 2471624 2485347 2911465 3554666 4740915 7564358
13972 7564358 12230509 20540054 28818710 23948499 17309193 12505794 8959534 6369368
13964 6369368 5205469 4556725 3884357 3284960 3306776 3239482 3084816 2953795 2835657 2606839
13954 2606839 2226298 2235535 2408645 2103962 2077497 1975944 2052756 2095551 2183247 1965060
13944 1965060 1902218 1944186 2187829 1951223 1764629 2069992 1567030 1754829 1781485 1740052
13934 1740052 1825361 1763718 1828740 1707391 1418921 1773383 1570230 1705152 1973286 1544994
13924 1544994 1523866 1382671 2130394 1705270 1209258 1899250 1573125 1411510 1415635 1652729
13914 1652729 1467172 1680573 1267351 1333957 1552185 1460853 1176541 1401010 1484563 1401934
13904 1401934 1252732 1503321 1459959 1203566 1513940 1503004 1251142 1419868 1407127 1426897
13894 1426897 1165854 1604633 1305874 1160370 1195805 1210246 1290594 1098450 1184278 908688
13884 908688 1434738 880916 1091759 974764 1245180 1305741 1102338 1100118 1464043 1035082
13874 1035082 705581 1143077 980333 1269331 983759 1149249 913552 1035772 877509
13865 877509 1113340 1145938 899410 973344 936259 1210641 1221624 989234 1109210 1019905
13855 1019905 1298740 1039754 1174274 772831 1220502 851190 689104 927499 998828 1256592
13845 1256592 1022481 967646 973766 1046698 728510 783486 910170 851980 993488 916280 1042360
13834 1042360 875360 824275 832066 730495 650498 1135152 603961 805126 857661 767640
13824 767640 1059756 868265 1064784 1102471 687221 910438 771212 990399 709435 652291
13814 652291 1130590 894594 1002314 942085 687619 904176 974771 661623 806554 603571
13804 603571 711088 752884 776153 867186 726495 794642 741620 901689 770649 718540 572813
13793 572813 940591 921568 958048 437301 484246 234823 646024 744793 788850 995811
13783 995811 685507 832458 396896 570031 598887 443556 729532 672457 801093 521771
13773 521771 565047 681019 595150 575404 607784 442490 753388 287743 840849 783504
13763 783504 693300 422742 373377 466473 610717 698001 774042 630041 437929 365705 801373
13752 801373 601834 768015 846556 383563 399804 660179 201039 516114 368101 788055
13742 788055 650889 661214 103971 523157 808420 614277 490206 463816 661537 486255
13732 486255 557949 408188 727665 557160 742780 476528 265816 40414 403796 805065
13722 805065 342632 615568 365499 617792 499410 478164 622467 638778 505551 546421
13712 546421 769987 528244 179333 156478 681596 317164 743558 818321 140150 861937
13702 861937 465287 589673 233509 320514 654039 486656 354635 350641 447416 454030 250197
13691 250197 551176 540555 689258 579456 561148 248575 394950 201028 576240 598452
13681 598452 486074 127661 706688 515303 230904 228955 457623 450912 443852 441785 387235
13670 387235 528034 258987 419236 384929 483830 267032 134091 438263 389274 85140
13659 545387 469812 427167 61290 177028 341655 528615 423494 650078 368284 201143
13649 201143 918648 377089 370552 343604 604682 268141 565562 270098 30208 162752
13639 162752 505598 579973 -64288 661924 386171 406197 539581 365448 398347 -130444
13628 279675 334173 626894 422258 465271 465779 333714 238874 120195 379352 486990 404525
13617 404525 213702 530659 559729 380920 279135 123202 346055 205828 98646 443896
13607 443896 555014 233355 445010 -17899 339988 404473 628739 319657 404862 -28682
13596 350959 376187 504833 444157 247227 470639 65867 -8593 697936 64671 363642 190432
13585 190432 381060 195134 360092 61715 62477 431985 65770 410460 452904 368408 123546
13573 124563 223513 369504 131423 526979 199883 193133 63935 113629 178418 252976 192615
13562 192615 299905 182863 325401 399343 155651 183531 275662 563945 488481 76393
13551 537802 3437 281035 473519 172224 284323 519442 121023 145020 317073 225346
13541 225346 99454 341569 150753 318911 275115 263978 207947 236143 -125402 251083
13530 124026 221959 16987 44754 221246 344974 406189 132690 340584 402814 -33617 418943
13518 160044 197473 465124 9727 295407 357234 261757 367435 -39220 -50128 -157106 144883
13506 78733 138319 131368 228093 155919 228640 328345 41023 292019 160601 66943 115410
13495 115410 195667 422774 22712 487320 210369 487807 69370 451705 -20666 -59713
13485 -59713 110364 120828 -56268 321201 72623 390783 129258 299405 334352 420222 134636
13473 49080 611285 553902 91983 196484 260198 175490 603725 474215 198488 33347 62742
13462 62742 285210 211647 556409 54611 -304837 -13992 697590 380051 119848 255923
13452 255923 234621 53206 47327 107736 129463 -44321 38737 -38411 380834 71106 176900
13441 176900 -207096 625214 65299 -86006 270609 298302 24428 251202 150623 67128
13430 75672 359300 159921 286796 235559 313263 459618 266517 431294 235050 57815
13419 148555 -41411 -158131 -83391 486540 -109045 -20967 271977 273445 78154 -129080 246160
13407 193040 121984 158254 -85889 -29693 151432 142309 275688 273842 119944 214377 -142697
13395 -21037 157274 79789 167353 -53500 229203 36970 411089 -91783 128431 246527 374859
13384 374859 86471 357115 189361 304389 222491 476010 195603 247479 385271 275191
13374 275191 48251 7208 325715 387369 206365 -39707 -262499 -9848 254226 148340 59183
13362 323832 176992 447974 -217645 290421 197248 127443 280242 53119 220157 346351
13352 346351 184644 248842 400821 305771 450318 152030 271304 50601 166390 163172
13342 163172 123219 -106067 323251 38221 -98001 206794 359680 230979 322967 243060
13332 243060 176272 444377 147214 179353 -58199 302312 176407 263294 246620 -41990 516123
13320 1912 -86529 465517 125934 -73480 145059 9722 320801 292219 -18257 9106 87706
13309 87706 138030 -106193 327606 193408 -99025 96464 341885 -75892 132234 76991 457740
13298 457740 158679 38446 71087 10360 237687 -107755 173642 176643 -126662 89052 311768
13287 311768 -103839 66795 -126267 61288 21660 199433 445738 267710 451208 249677
13277 249677 -158649 118131 322512 155675 -218569 -91600 19422 -193478 192542 56663
13266 379242 8472 83250 74686 173983 -176323 390457 15687 106376 300225 179446 169686
13255 169686 -659 133660 288909 430756 -30924 -346262 -79939 118243 86547 -27338 120530
13243 -67982 46744 315574 110333 367173 103964 333511 80368 -150176 -152459 54528 -167887
13231 70425 17158 -42706 112962 234688 257961 -142664 140590 135093 23881 202504 410900
13220 410900 306479 56718 436904 -105151 115036 200403 -266402 68983 -154584 -150285
13210 -150285 71802 246803 266602 110090 -69697 317148 89651 -38570 149541 -7349 69739
13198 272586 358607 -67010 118942 108241 167143 -118717 53377 -38334 125837 244392 -63106
13186 -50213 90348 346945 267923 83342 -18396 115469 16597 -103243 -48002 232820 96964
13174 152467 -55611 -12715 -129261 513358 127940 -136934 74667 246128 -46909 62013
13163 224513 -20571 -42707 48395 -55099 46091 -81010 309697 34758 -63514 -425729 106452
13151 317570 10408 176061 -45524 193306 -65203 24941 43566 -277377 86351 75190 16575
13139 168681 -108193 -228176 -57449 149493 66758 241565 -268989 -37393 286763 93553
13128 353985 112779 326945 -141363 -67385 8233 20150 314668 -230518 57836 -215985
13117 128023 -19405 329265 5534 206344 114506 99975 231315 232867 146713 -54363 -79944
13106 -79944 779 550983 329888 128086 25155 -75871 49834 269514 334728 -214236 184946
13094 -105320 69555 -217672 -182114 -45119 -41324 215859 3626 -160565 220517 99729 -195983
13082 180193 330123 268292 303551 -53434 342882 19526 384885 -83632 -77582 172525 -68852
13070 -222961 36801 112064 50653 100013 209667 -118234 97576 37847 123575 -3962 128995
13058 55657 99125 23235 293770 -54587 1290 119438 309617 207660 142633 128267 490046
13047 490046 130562 142101 153609 -180826 422801 32173 6634 171348 65054 -100525 -345444
13036 -345444 -92864 -193498 -100913 175930 66286 31988 153807 55273 -22384 153539 172928
13025 172928 -272422 163465 302683 -6868 -290538 216418 2055 -229607 173172 -66100
13014 193925 94905 364885 -153566 9701 172700 145606 424995 494097 -210921 126607
13003 105066 -21866 312156 286041 303692 -28159 159439 39626 82505 -274363 140064 562261
12992 562261 86200 58406 216788 -463740 233367 113093 109903 -91069 -81849 89251 11946
12980 280563 137053 353195 159113 70199 10050 3307 -178358 193086 172596 -19918 -33238
12969 -33238 -63691 102592 -55087 99707 -73384 -198919 -19658 -246377 -283882 51453 293747
12958 293747 69919 74781 -110575 196689 -261124 229615 73439 -75246 270876 272066 -191541
12946 77725 -29672 298353 209379 57772 431268 161487 268695 134429 195143 9047 42685
12935 42685 -223341 309302 -3970 -167039 -53610 16596 25988 214158 34117 91313 -170594
12923 83572 -303942 -101646 45366 344665 -26462 300490 94138 -86619 150568 -158994
12912 -8435 237501 -10348 -12648 84823 74819 126349 299980 -200304 -279917 284847 181457
12901 181457 -22444 -15971 222106 -167390 258134 -171062 192999 14645 123855 -12793
12890 169902 -74511 -52145 114613 42350 293972 8570 127741 -171335 -15682 -43097 123146
12878 109253 -259429 181937 -27855 -40962 143152 -70068 -13125 -288429 -167087 -83494
12867 172618 248954 108604 149062 1338 328077 -8229 112099 -128934 66519 94834 -78024
12855 283139 -142065 103620 -137085 6408 -167029 -203199 -125433 103070 -16294 85635 -462793
12843 283403 109041 -50393 394 -124108 195644 -402205 62866 -29618 -156539 285639 168526
12832 168526 -24600 -266745 5240 10393 -337662 56180 -305614 95950 -132407 -16612 -186046
12821 -186046 -8599 14485 -146267 26305 58715 -109870 73659 -248843 103786 44355 35791
12810 35791 100691 397137 -230475 -28308 239059 215665 -67239 208265 -118032 -29294 73517
12798 -91373 -511131 -210073 -253661 -82443 -73284 -88528 -49455 141029 -20230 106981 -219335
12786 104266 95190 125942 324044 -186944 236362 91579 312227 192955 -371094 148042
12775 -40498 169868 -6278 376861 -23344 -48438 -230608 -112609 -204640 -67982 265719 -16465
12763 -225901 223347 21656 -259883 -21060 212233 99449 63287 -67630 100529 243607
12753 243607 -207176 -166186 -173560 -190817 66890 22602 155509 74596 -8066 267388 84089
12741 143784 -2737 143698 85501 84968 58708 37541 -221082 1573 27407 -105590 -106761 -139891
12729 -139891 -11102 162241 -75444 106530 139051 -40022 -51530 1631 149596 144444 -52691
12717 -13170 37490 249285 113613 22132 251800 9939 239588 -78379 181029 4100 -59111
12705 114041 102841 230459 107334 -17592 71877 -171667 -847 -94327 152277 299466 -85603
12693 -38254 112491 186505 199674 250837 172509 -140861 457195 112686 237766 232075 -212472
12681 -3178 61167 -154339 -188499 201528 -166005 57333 -112579 83061 178799 -82215 -209429
12670 -209429 -90344 78588 -52665 63777 293702 -80155 9702 -159633 -188997 49587 53468
12659 53468 -27329 33586 -166724 267 84720 -131845 237927 -8322 -91092 125247 17243
12647 -96351 25940 -43787 136379 -111057 161769 -80504 17585 142370 142969 123208 121265
12636 121265 477139 25066 225244 -38951 97749 203804 -209720 -52283 135337 93116
12626 93116 343239 -92034 -100740 -5319 -109261 459267 -47595 78748 20825 309531 177648
12615 177648 208956 52732 -37756 314043 77259 163468 -108859 -73106 53740 59099 313362
12604 313362 129684 -86851 349454 202115 15388 120959 -49802 40882 336235 20942
12593 72930 -226910 52780 -261594 17301 -156222 -245129 1579 -173822 8088 344931 22302
12581 -2230 -12792 -5190 204897 54156 388930 57273 -197921 -220454 -39411 18188 -310637
12569 -4070 -122780 -101743 259677 33253 -31644 -46748 136235 -210285 90011 -27028 370952
12557 238308 158167 331782 -131267 -35208 264651 226776 -432640 -106841 -34099 -141475
12547 -141475 -76236 2689 -57298 20691 -91215 132571 98292 245994 91060 -226336 38494
12535 -164620 210057 54749 -94293 -92432 -110122 -156917 114834 -146824 -147179 -2396 182096
12523 -161298 70918 -1981 55043 -138303 -152993 -177014 -143310 299506 -116526 -62868 32629
12511 48163 -84293 286009 -83338 -5061 145920 4114 223028 329375 285523 -132156 102138
12499 -294545 -223888 133948 -240021 154269 83177 -215477 357543 48230 168455 146936
12489 146936 196549 -43823 -36608 155579 -26877 511425 45973 11812 18279 317213 -100947
12477 -77098 -36688 -5229 82679 95195 -194637 265481 -231175 115331 385780 203923 10901
12465 -21319 -21770 -222597 -88878 191948 -99373 -207976 120952 202999 53633 -379907 -13602
12453 -157094 169546 -229653 281675 146094 96373 158460 -24599 -307254 -122789 314157
12442 -219284 -152994 -21671 -269976 -308941 -75906 -18618 114280 -107215 -35309 269259 50222
12430 -80127 61007 -70199 -230321 -234927 -85284 -88001 -4426 -255872 -329368 -4385 191767 24406
12417 262889 167703 -383607 -104915 -80795 -122257 105311 1495 118690 -123318 116974
12406 -240321 -156662 -21053 41380 -322516 -210414 341523 -264619 -239613 -74682 -279623
12396 -279623 -192303 -188064 38323 -36780 -40381 -149167 -143481 347041 -8146 -121758 -7210 -156490
12384 -156490 -289421 -368925 -21770 -157137 105980 83945 198685 -37842 60411 -44770 -74071
12373 -74071 170430 440816 31518 -155507 156578 37346 -140748 149367 320197 92995
12362 21321 -2573 102833 -5112 224601 211595 27650 -110362 292613 126643 302845 16440
12350 -66292 112470 -232221 -66900 198894 214354 -89240 -119916 153945 -19034 1005 39939
12339 39939 -201167 -65154 103644 230767 -139333 -156067 -62287 16321 -151681 209751
12328 153760 -61183 -113663 165304 88083 340737 159270 -249760 166139 -143022 -72694
12318 -72694 -48144 9758 136176 198959 -257488 -239067 121440 107205 229666 17358 -132097
12306 16077 -242657 36298 -19748 81853 -33220 41955 145176 -113854 40010 215857 -102074
12294 -14051 423228 59965 -134042 314016 31510 -207199 10859 136622 76651 -18217 -275425
12283 -275425 309658 -159878 -149756 273148 91487 -43573 -129350 175303 110917 -159357
12272 62692 -64230 26004 17328 113452 60611 70965 277741 -102033 32671 -54941 -43566
12261 -43566 -324627 -227989 465271 28222 67734 84832 155950 541407 -8077 -66824 129688
12249 107088 -8030 167341 235023 230596 207805 -235640 176731 -181539 -37099 57741 -139540
12237 398077 97732 151465 322063 237689 -8011 78659 -324103 -112446 -115514 -89332 257212
12225 154599 262052 78737 267431 55348 287627 80775 33318 112006 -53041 9704 109529
12214 109529 125114 351200 390719 251046 235061 328429 263573 181592 322505 -31731 98350
12202 220824 -60424 281192 -12522 159416 293936 352939 -207531 -207033 253882 -166798 48699
12190 633275 252583 4837 55158 175270 100895 265294 156356 235312 -35874 -60109 122523
12178 17574 253195 -25984 238698 199028 -6119 -89389 109931 83271 105449 184727 89845
12166 420111 355048 196249 195040 186645 -7787 -98129 -77815 208354 136536 71708 336216
12155 336216 438608 232993 -106436 64328 157645 -71958 290643 67944 306322 104017
12144 220744 436636 97959 -36862 172318 -105578 -73638 227869 -316585 151693 -203053
12133 246433 160011 -79896 -176260 9404 280775 63259 -159694 299128 121441 -246406 47640
12121 139208 117235 214857 -71059 -110877 -75506 -95913 151696 -37298 77987 -184880 -30578
12109 -114214 143645 29645 -113164 541367 -365965 -127841 -154440 -52306 -42588 77349 -318579
12097 -116625 161509 85976 394726 -201968 -61370 -227969 262544 -597490 -133742 133489
12086 -14816 -16209 -91997 204722 -45888 -125326 100029 -125730 -11102 -23159 -224121 56075
12074 -341153 -81952 142774 155407 -63089 35473 -123068 -169071 22812 16386 -144271 203899
12062 -318140 53451 53437 253208 555778 714417 594596 607655 394998 -79193 189640 86545
12050 -163049 -120605 141275 -282341 28496 -183590 -78151 -78515 -8047 -84032 -208099 275085
12038 124152 48821 -13948 274913 97272 46279 116844 28067 -100255 -180608 -341317 -157800
12026 -138306 -303721 -198163 -191611 -70401 130793 133469 -133906 -102671 8662 -340312 67521
12014 73683 -74469 -237901 192520 91075 -243270 -63328 33741 -61884 -148323 -200849 241518
12002 136469 -94029 -217005 -108985 375807 -96200 284881 58209 265203 -172792 -56697
11991 203671 12725 162918 -107005 -297372 -55808 9736 -200758 161400 2197 -178776 220404
11979 455822 -99391 130211 243514 -110161 68617 132218 64680 -143264 24532 75167 -427768
11967 -163667 -97780 -277595 -296670 98868 10876 -128713 -14986 85379 256685 -163906 85696
11955 -133947 -73917 104384 -206581 -162586 37664 72477 72118 161642 -81664 -27032 -182718
11944 -182718 25075 -298194 -93005 -191020 46489 122366 63774 -236250 585087 47526 -173648
11932 61311 -63922 221299 22673 113215 223271 93126 89173 5164 -102975 80831 -229457
11920 54831 46784 -28994 542617 -171385 -8516 -405662 54796 -83266 -178990 -101332 232451
11908 151603 72664 -292458 55219 -90586 141862 -10588 264064 278784 -104933 170584
11897 11474 -190552 113589 -56692 120844 858 -377446 -72865 -142639 173699 -487409 -156384
11885 -71487 87571 -115373 -17880 249850 -145142 -124426 124679 -36238 184479 -20678 57200
11873 -344596 -205373 -188520 -64231 255050 -9874 -118359 6995 179817 9738 -143320 -134312
11862 -134312 -35770 -70743 10438 -39929 -126228 -63909 -25802 -209598 118287 58844 88613
11851 88613 -218110 370512 -439765 95753 -73397 -34988 -79961 -67282 33217 44375 -329936
11839 201057 -96186 69432 -106164 -61027 253623 317767 -122240 39517 -65674 -135658 72016
11827 -77953 -93564 -255512 -81484 -225091 -280481 151820 -41384 -33590 -137627 -128398 -173453
11816 -173453 -207786 -109870 111406 -5700 -291205 -465309 131080 195333 124347 -39228 -29372
11805 -29372 -90633 -109036 -7515 -154023 125298 8704 10159 -15838 237485 -28084 -3794 -315979
11793 -315979 25200 -67617 -82401 -145330 -49982 -62932 -149362 -65924 182014 96698 48697
11782 48697 208903 -149324 81741 -48977 -48812 395619 -10930 -175423 -184508 -109475 -17747
11770 -157147 -358719 -279566 -157266 104070 131604 -45856 220970 -177355 -121169 98712
11759 2707 129029 -163431 -65012 265417 99902 226048 -76861 -144090 -36079 176012 86351
11747 106104 191105 -30773 -248339 -102093 20577 -126069 182193 -234619 -225045 -348401
11737 -348401 269669 57744 -204430 281377 120241 -350978 -103582 -29762 326667 -297672
11726 34407 -198020 276950 -157412 -155520 -94198 289746 -166773 73886 30413 506403 -100485
11714 78906 84707 -130165 -47774 -335886 -65540 -114866 175976 -61470 -88989 93322 -133833
11702 138622 -17386 -140595 -169345 11602 -56985 -304304 -16721 41041 -87903 -111556 -22946
11690 -73459 134240 50350 -19567 69039 175125 -57412 174998 109180 -69380 24940 120723
11679 120723 113609 222127 50523 10150 100051 260952 83047 113245 -182816 165057 162206
11668 162206 -83902 -107876 -114841 -83845 109795 97304 181911 204624 53709 -45840 -64249
11657 -64249 -126652 77248 3941 -172939 82764 -5214 -136854 14023 -207062 331074 198589
11646 198589 -251169 -307095 -195915 106760 109835 180768 87532 80459 156538 -191369 123714
11634 -43173 -145450 -154874 58255 30193 -26876 -45828 -193586 64313 -222493 152661 -140130
11622 -56288 14664 90270 70040 66322 72061 -342331 -148725 -12319 128477 99613 19626
11610 92649 -218784 81648 -150153 189609 371776 30340 27445 160375 116540 64590 131578
11599 131578 224555 -224271 99915 43594 41373 118610 91781 -71848 146320 175475 281661
11588 281661 21381 226792 -194352 175502 -211781 135045 150669 137239 -56023 -86524
11578 -86524 139750 -126518 -31455 43753 310593 -106328 305650 189684 113744 -11749
11567 162503 369034 -22294 157207 -360296 98283 99192 188318 257213 227358 57163 -267927
11555 -38757 22854 42966 13524 -202914 119453 -38712 -182246 134796 20756 220555 192393
11544 192393 -64099 29024 -48084 240600 125706 -2112 123743 -96233 -278792 -5718 -7870
11533 -7870 -94250 -70145 -98420 194852 143950 -162318 293809 -167960 -44299 -45589 24091
11521 -224112 25297 -195122 114158 -22873 336632 175280 -42770 105037 105577 -453810 199455
11509 -38958 74911 -153537 342602 -140425 24404 -117207 312801 55504 -331549 216383
11498 431931 328060 150064 99465 226800 394446 -32768 93938 334575 203541 222858
11488 222858 107915 279540 130207 257035 -11172 240611 175093 335544 50315 -82814
11477 77129 132058 -50124 -304123 75179 107450 40188 481582 224521 38495 127799 347775
11466 347775 -98580 376851 156417 389828 127511 379822 1745 258759 294211 109439
11455 349327 102833 477564 -83646 128829 154462 89459 12978 152326 -23483 160901
11444 187270 -57653 -118631 358 -116827 333679 175788 214183 258892 -310349 -98391 562619
11432 395246 361675 -378704 254465 -116663 448759 266295 37237 7249 128589 14222
11421 207145 150918 29836 26021 23531 -110322 -94881 68892 -209794 81171 -151431 29696
11409 -198551 -36845 89934 -32245 108627 113150 61740 -79248 -76038 90143 -201540 -40444
11397 266195 -224740 -223683 -392645 92371 50887 68209 -55664 72929 64984 22672 -56895
11385 -174682 127700 185765 71566 98345 154680 -84392 52757 -111864 -158049 -325055 -186199
11374 -186199 85530 36996 6314 129856 -154111 84600 -155719 5700 -49240 261613 -308835
11362 211500 234289 -18958 93547 -222510 276922 -30267 269489 -95898 1926 -17607 -45320
11351 -45320 52159 -179996 168424 148459 93457 -4788 95344 174114 -92314 109812 -48304
11339 -221492 -263106 -308049 234274 -136600 252880 -45033 -32163 -382284 197127 206328 -229964
11327 21560 78131 86044 -101558 -14613 -71955 69303 158053 122493 -50939 -75802 39856 228811
11315 228811 -9528 4871 -305288 -114615 71293 -115418 -26762 -184692 -9417 389234 98522
11303 73353 -106167 -194166 -66361 -231156 -32760 -65896 -39939 -86123 -215582 339325 119078
11291 -52553 -49051 -263069 29240 -86600 -209432 -177143 104223 181893 13834 -6759 55112
11279 49953 -165463 -72872 -80 -146513 28686 13405 -85770 -172832 63242 93253 -569728 427183
11266 -227101 -224835 292174 -75365 99484 -57242 58992 104142 -121617 65117 -98805 310281
11254 32556 -14047 -181221 -160316 -121897 -75065 56053 14401 66057 149467 154489 142911 -76416
11241 88555 -237287 1056 181428 -265873 -115709 48364 -23209 -43330 -47310 -165182 53201
11229 -89550 -355595 39689 -539910 373689 129185 137635 398358 -149637 -111131 -59427 -21990
11217 32423 103592 13007 -183445 -278336 -169949 12672 76879 71077 71405 -63047 -74784 -289087
11205 -289087 -51848 -318706 49384 -41240 219324 36097 27759 -46428 -245017 -285047 -23817
11193 -168420 79859 171837 277921 -163085 -139995 128574 -52679 222500 60094 -16702 -116417
11182 -116417 -186130 -163416 -70890 -46476 63519 -138034 -104286 -237800 -117862 -20365 -101514
11171 -101514 -148128 -111841 196636 68059 -31217 247891 -394782 69292 197075 -150766
11160 142550 140331 -100947 96821 207968 -32691 50345 -156761 50926 -41367 -194653 18268
11148 155290 -221709 -259942 155267 -165637 -101760 224289 70899 -121483 -6449 -73413 -83662
11137 -83662 380597 353321 -38429 -132387 -408597 -155538 237890 -121722 241808 2940 -444353
11125 -24179 366692 -171150 131304 -119091 -298702 -42933 158927 21482 391421 121587
11114 54868 -128415 63855 57271 121183 53018 -56074 -83927 225749 -71933 228514 129630
11103 129630 -278294 -111835 -108516 -31250 47354 137941 -318559 -22951 40836 -167772 101312
11091 -79928 269617 39056 -91505 240277 -52590 254446 127098 -35931 420901 93799 -35859
11079 182599 210040 -29632 171316 -108727 154788 -17414 306955 -56573 510429 58786
11068 168241 43097 419203 176338 477024 206499 352811 226651 -52226 147540 197771
11058 197771 233949 320702 419684 234277 217954 439751 277807 379015 281628 426477
11048 426477 684133 892580 803396 506389 653600 765515 447457 724303 763622 663153
11038 663153 455586 649794 366866 787372 587101 764982 786005 673256 662506 773796
11028 773796 615669 256631 705662 756950 779539 682514 647587 829592 677022 832292
11018 832292 743790 673275 481769 565324 812103 647137 673983 874286 721982 821741
11008 821741 678817 514735 637248 1030136 499256 320142 619137 707244 860435 788687
10998 788687 582534 686468 518352 646693 704830 710326 656345 392400 593489 577327
10988 577327 556851 600328 690510 821483 854418 571725 680743 702148 432894 816598
10978 816598 619344 842058 938811 843544 914464 817273 917346 1068355 985319 1109679
10968 1109679 837057 1089868 1460284 1325223 1227457 1154183 1488178 1790762 2169482 2099754
10958 2099754 2378399 2541283 2317164 2422239 2765997 2289097 2260670 2164435 1948639 1575103
10948 1575103 1860405 1850202 1858066 1888794 2067553 1847971 1863286 1612568 1680320 1632552 1562516
10937 1562516 1287501 1134090 1116949 953382 526178 647522 567472 604657 285606 60215
10926 522578 78409 253266 150721 42544 363067 292490 74188 467392 30832 125998 38229
10914 110694 102956 22140 161939 -221141 229527 236126 -114640 -137462 66779 143948 81165
10903 81165 -91542 53980 229384 4165 82080 135568 -11706 29397 11636 389442 -126074
10891 132120 -72756 -353422 -66269 -108094 137646 -16816 -108065 4724 -158597 -161230 -370059
10880 -370059 148219 120722 117106 -564983 -420408 -39928 -28098 42909 -14646 -66175 52594
10868 -103368 47768 -116450 -51144 71337 91518 37788 29940 203196 206116 -6565 -324520
10857 -324520 -69603 83555 -68442 24709 31827 -146657 31120 10017 100346 45391 162215
10846 162215 131397 43246 -314786 -125642 222947 -55124 -252306 175175 140413 10646
10835 -338582 53928 -60253 -234435 128431 -135990 -44963 -251962 -160748 37453 -88815 -46724
10824 -46724 -28885 -12452 122216 66528 56163 -199592 -62867 345175 -295525 -121614 -24375
10812 -233216 -317395 -153280 311792 -206433 -419883 -82581 -30144 -23319 -78698 -135535 -225792
10801 -225792 96957 237353 -340485 -16197 -173242 -113172 -106534 40343 34703 -60191 19377
10789 138376 155184 -90401 44539 -87648 -8785 -175560 13078 170825 -18990 -83372 -373439
10778 -373439 283854 -211315 -141610 -438975 42025 300983 56549 -144373 -53538 246472
10767 26569 -185396 99647 -172157 138224 122772 145566 157705 -40754 -17878 -35722 217997
10755 -76151 44289 -151420 84132 -109950 -200161 -64811 -42548 -173 -184188 76196 -147116
10743 -149341 74762 -94236 28840 122867 -286058 -48463 120483 -32903 -129467 84068 77021
10732 77021 -86836 -93698 -134833 56843 155800 -183350 29215 -30507 -182946 256040 -246156
10720 10981 13538 -26745 -26772 -87843 -190676 250515 53104 -82676 -177087 -90099 41161 -96257
10707 -97306 -252939 -104038 47861 -16669 138016 23902 157004 -204152 -4215 21544 -139083
10695 153584 -165471 -239707 -222564 -236959 220733 -343837 -127709 -9079 197661 98593 370906
10684 370906 -11740 -237037 43332 62753 241122 124179 -256491 99540 99012 70119 -197015
10672 -109954 -169096 -134636 23619 206237 -185006 51576 -5155 -79768 -98115 22062 124461
10661 124461 18082 66436 -39775 -18287 107496 7528 -43948 125383 -78355 32183 -157324
10649 -152098 179321 26485 80106 36661 134114 -42815 -265430 -295812 -112730 163234 107580
10638 107580 -22100 -242505 -116589 87375 55865 -236750 -183678 95428 -166067 -61796 4848
10626 182961 -337830 -212820 -180949 299165 -8919 -123223 72180 -334033 33402 -192229
10615 61530 154562 -59480 35817 -93475 -250876 81464 -279707 -44877 42126 4348 -62625
10603 3196 -66577 -238839 -311527 -141709 -177245 -358934 -412209 -381891 -171075 -77639 -259566
10592 -259566 69348 236616 53855 -395234 -108039 124020 22320 -231357 -198789 256520
10581 22159 -305429 -256495 -96530 46936 40208 -236754 126977 -268065 -21287 -120201 -40634
10569 -268010 100527 235859 16453 235178 -195958 -258317 -104391 -66226 95994 -178487
10558 -346608 -28693 70483 -118399 -93356 -12227 -136717 -303701 -182018 -141308 247026
10547 -201411 85536 -148016 -99998 95528 -19163 209613 29560 -228894 184492 -101999
10536 153092 -64072 -235625 145942 -321239 -293283 160469 -92240 -278555 -120459 -354276
10526 -354276 -63947 -164068 -221444 3190 -256339 -80638 -31489 14500 -114948 -292136 -342585
10515 -342585 161168 -211331 104522 42219 -38936 -21360 -7858 145685 213089 -241204 9686
10503 -138993 -20903 177308 -78744 -18889 109803 40126 -36814 -28818 -74859 -194059 -58054
10491 -80302 -20049 95234 200609 -64970 3210 -89103 269605 196136 285388 260469 -3908 -130525
10479 -130525 -127168 -80187 59475 132313 28833 36626 -240885 285373 -95115 82424 -33576
10467 130740 111423 309956 388258 254409 216542 371514 240864 464306 -36211 229908
10456 138172 135368 -35058 -36265 -56187 96074 -285082 -132618 -224364 196 -123742 -68745 -111288
10444 -111288 -98321 -111056 124732 -152644 303649 -38093 116953 -230763 -108491 136640
10433 -40913 61199 -19390 -223886 70369 -86729 167786 98313 1041 215230 116926 148396
10422 148396 -390452 -272357 -126034 90078 157624 92434 -11336 19947 308286 45103 -12468
10410 224922 -191052 144719 198338 -70090 169560 89960 409571 51215 9900 -46373 71666
10398 79232 40080 43883 12507 -271542 195837 -139876 -347964 -119502 16431 364927 143101
10386 -184927 32932 -131435 265076 119158 -31854 -91283 219422 -51946 80145 162238 180839
10375 180839 198189 -61468 63782 81256 70438 230638 94843 -259151 477410 300891 249155
10364 249155 266421 -73749 133765 97576 -29497 -135388 21562 320244 517036 446807 339746
10353 339746 521341 357333 -26004 231013 186557 108135 294370 611690 417551 185142
10342 157031 52530 498989 509788 226585 216983 189525 341666 52480 500596 252182 431063
10331 431063 150630 141338 669187 493225 195700 354491 459391 68214 273368 159967
10321 159967 248572 108866 50207 -46357 201245 -27134 -3097 244374 -38099 285596 152619
10310 152619 356177 191154 -49027 71849 190213 86124 137376 193868 231596 281251 258806
10299 258806 102144 4656 84114 112471 -126454 47000 185415 -87526 37362 -25086 -134619
10288 -134619 190008 -312386 291842 -24452 61041 -67631 283472 -131310 9052 19853 -145437
10276 -46805 -134965 -74078 206005 -48758 98191 127352 82489 8359 170981 97672 172522
10265 172522 -6414 20309 50390 157345 -74085 -248271 -78397 264071 120748 214438 -121118
10253 -90877 100323 -10750 219513 -66433 155261 133557 345765 -96 135887 489502 190433
10241 262098 391471 409047 160506 72378 336998 516353 209933 -52855 -1679 -175587
10231 -175587 -105145 -209571 4303 -288792 270047 -187043 -18948 -258636 9385 267657 -174412
10219 -68473 -72389 -289310 -5616 -207872 -162414 -146019 -62664 -68520 72643 -156656 109295
10207 86341 -166918 -95574 168292 -203783 47138 -311627 -221779 -124737 -150030 98528 77765
10196 77765 -71495 -18646 -95431 246938 -6614 -84320 -23148 -94634 38677 95351 -108314
10184 -304961 106467 -19270 253198 172798 79611 -217255 173353 -217256 -28061 -13355
10173 -81687 -145473 -390675 260121 -4758 -47893 -82723 -93478 14368 -81971 -176880 53684
10161 76807 -320598 -437715 -276373 -248985 219982 -104820 -301006 216188 106008 103059
10151 103059 33902 -230752 -297944 -137079 -29311 -72561 102516 2800 -421343 -74060 -320088
10140 -320088 196409 63701 58583 -170948 -62054 -24040 118480 -13115 16877 13377 -30898
10128 -38655 -188826 -219642 32745 -369781 129678 101031 72888 -178579 -8678 69311 -111183
10116 -201811 -265469 -190848 193411 -140163 -152692 -149404 -126121 148367 -126809 -109983 252340
10104 -270847 -97409 -104558 137607 -123607 -326817 -144929 -56407 -76576 -196346 -412970
10094 -412970 -38919 34484 95570 84670 35179 58284 60075 -35753 -216270 -184584 84655
10082 -123522 -384707 -36000 -20412 -100549 -20179 227629 114505 163615 -41182 -63857 -19074
10070 215198 137616 136049 -55250 -69824 -81822 -55915 -134998 -142943 233543 -190441 -41327
10058 -107913 -265164 -53751 7247 173874 -98210 -414605 -131303 -145858 27099 46632 210441
10047 210441 205837 -194002 173651 60997 -465206 -428037 -53066 -41783 -202934 16960 -100890
10035 -167870 -332858 343140 252700 -214651 -106119 89377 -173292 -160757 -451925 93601
10024 -223701 -119740 -120304 46406 -146422 -510101 -364172 -63520 -196599 -422640 -347842 43566
10012 -87568 167920 194585 3613 98718 -34308 78979 49577 -133368 -158878 227706 -233591
10000 106267 105553 -208890 -64325 -204811 137808 127285 -47 -117494 -31064 -67118 -156207 175286
9987 -80916 88775 125566 -338101 -44798 264401 -130691 -158367 -329935 -138831 148114 -15778
9975 -179796 46488 -307760 153403 -76638 -20585 -112136 112981 -289626 -275788 -198549 -198310
9964 -198310 -205097 57729 -118998 96650 195388 -214914 39352 -180591 -565799 250786 -69962
9952 -287157 -62515 -60265 4272 -29804 -41904 -195301 -185428 8609 271964 -37718 -27865 -39743
9940 -39743 -89881 133469 36710 -385621 53057 -290774 -264424 -119873 -91996 -169145 349761
9928 -54235 -109183 -75173 -13065 -52489 79347 -186157 155795 -55614 -107726 -23237 -93607
9917 -93607 -161671 -49213 -248172 -128693 261513 -122175 78860 -16160 134264 234165 -18930
9905 -315807 -36426 -17049 353194 -156703 -160323 23381 -236312 -126829 -119514 -295129 -181319
9894 -181319 -161577 -187233 44393 33325 247131 -71869 -29865 70265 -92624 -244972 246044
9882 -80401 -59215 -129123 -130736 -50235 -2843 59534 -24430 -230230 -77688 -215097 -204648 174368
9869 5419 -7235 -210669 -132039 136930 -256250 272127 -95730 -397118 -16386 229184 -234332
9857 -180136 95771 -234234 -104126 99755 -70473 -59062 -55759 -277912 -108593 81087 194382
9846 194382 122076 15307 -126377 9484 -80783 -284988 346942 -171994 -130056 -243120 235710
9834 -344210 147796 277168 64776 -191699 -89134 2699 -199912 43085 -195545 -173965 -198808
9823 -198808 -149074 -48734 -199258 -232758 -62232 -309116 37956 306505 -265214 -187965 -182480
9812 -182480 -57662 -138868 72108 -139991 -62493 168247 -28903 -160010 -95340 -30281 -19612
9801 -19612 -179000 -121002 -55664 -119826 -18543 -190776 407485 -55892 199830 -140153 469555
9789 -264653 -70512 -116694 245585 44623 95855 63870 23307 -89627 146944 -134219 109829
9777 63354 -178302 -25004 213636 53597 -223062 -178389 32337 -406199 211501 203954 -113620
9765 -69335 -108331 175989 -232987 135270 -151508 45837 -205959 265717 -89599 92004 352998
9754 352998 -10875 -325120 86883 136243 -336545 -215529 194313 -84048 -200191 -42110 -19009
9742 -375881 -15109 110310 -66670 -1455 70812 -231432 -58595 82977 -49460 49143 134207
9731 134207 -213006 -81933 -287931 -136371 -50340 -228498 234988 -287925 -162169 -41904
9720 -189437 -23816 -106285 -10581 19107 -291365 -347177 71629 -9100 -179306 -342921 -110720
9708 -127587 -245683 -203740 42057 9082 171362 -229374 -78743 -249065 -325655 -158598 -109428
9697 -109428 -123465 175588 -19461 -122678 282430 -202975 -138070 -61379 -107351 134526 -49186
9685 -283624 17271 -71552 43624 -32351 244781 -143418 -92592 46239 162588 193552 -345732
9673 60551 183951 -254737 -90792 -34190 -165931 -177457 94836 146535 -283884 66850 -59363
9661 -272268 -199807 -76203 184957 -195732 74721 -207595 -134094 -190488 -185813 -41763 -75314
9650 -75314 -329619 -30358 -36509 -98343 -117512 166390 4155 -121167 -188654 -150652 -194910 494973
9637 27396 -78128 90272 -191231 18242 -23869 -82981 60619 -185019 13997 -368998 216944
9625 -160081 -20693 -304163 88190 -111109 171007 -352331 11861 -227582 -284287 -3195 -292522
9614 -292522 -211611 65632 -25729 -320486 143333 133732 92312 -177849 -135777 -70771 111378
9602 28940 89743 211006 -413099 -215761 53239 -216696 -241810 -113596 147986 -86017 157782
9590 149471 314630 8903 -350931 -208565 -80807 193681 -126601 -128946 -68292 62780 -102102
9578 149479 -150309 -226155 -71 -48481 -171847 -173571 -8892 -28322 404621 107530 -327307 -325333
9566 -325333 240979 -80384 -162635 -370215 -195181 -103212 15133 -106472 339981 -53814 41603
9554 -198813 17252 47257 -188491 -99768 -239303 -139296 145846 -431509 225945 -351655
9543 66681 -284026 -218250 -38078 -409276 -336197 -204606 -420417 88630 -62021 -60010 -42004
9532 -42004 -265202 15094 -120759 -247868 -58452 200075 155087 39435 -201238 -119220 -143901
9521 -143901 -185760 -197037 -156726 -269101 -154534 -6979 -238427 22099 -64883 16292 -164088
9509 -215873 -69191 -214053 144962 21848 -99141 -51 -282449 329750 -116430 -109395 105648
9497 -265532 -201806 -73949 -87227 225084 -208038 -208312 15060 -166186 -7146 -65109 153397
9485 -351715 -386567 -297494 47305 -331059 -111080 330766 63323 -225006 -13727 -68348 -98400
9474 -98400 -321425 169792 -56184 -271384 -28834 233673 131907 -239061 40803 -274240
9463 -189964 -17515 -39560 -161793 -163896 10372 -219254 62165 188939 76027 153187 88961
9452 88961 -2325 -203786 -72357 -55043 72068 -77667 -6524 -9117 919 -87699 -135629 52647 230923
9439 230923 -247568 -126243 -204083 -66142 138727 118178 174332 -269797 -14697 -43854 31016
9427 -78748 130850 44915 -133312 58358 -299744 -375964 -256561 154810 -89616 -55777 -146992
9416 -146992 -563165 -318926 -101198 -327521 -272132 17444 38388 -211017 41449 -8870 -111967
9405 -111967 112987 -2815 -371384 102645 -81463 87317 -264773 237581 57913 -21273 -294567
9394 -294567 -58457 -288014 36257 53402 6143 5378 -66345 -6127 -46633 -195526 29272 -228985
9381 -110354 -68057 -129884 -352557 -234184 506549 57260 17612 -214195 -128825 -160892 70501
9369 -128920 -94848 -181559 24495 -382053 -177393 59804 146079 -359276 -431657 71216 18432
9357 156705 -113578 -234142 -161312 -89757 -12050 22896 -98282 120561 -72437 154380 -82195
9345 -264024 -540345 37355 -134313 -179460 -167344 -275926 -126365 13646 190225 -28132 58422
9333 -91948 207941 4524 -204128 -28844 -127913 77683 -132989 -333618 122560 -24576 -129424
9322 -129424 294142 -226653 169234 104253 406769 250577 288387 -170989 59834 278564
9312 278564 -209361 -327518 146022 -151557 48035 -168136 -79253 -379201 289827 -182379
9301 -297994 70046 -153882 13822 41511 -186189 213765 -68849 -56433 -367562 -249571 469475
9289 -64659 66292 -99940 103868 -117623 52191 101666 139611 284720 71633 58710 -223104
9277 -158250 131322 -215383 -61335 1585 -22249 119434 27030 243057 -84356 -100221 -34358
9265 24110 -42333 150102 92974 41131 -386321 -18275 -75100 -247736 33058 184481 2071
9253 -474872 -283930 -276528 152970 -71471 -7750 -154919 33169 -342579 -354881 -446601 -274883
9242 -274883 25592 -403857 -57032 107556 44840 -154656 -204923 -90852 -42473 77679 114277
9231 114277 -158584 264894 367419 27833 -46693 33656 211684 -113224 -196926 -133744 -168606
9220 -168606 -80048 52732 17690 -254160 -154071 29367 -69702 -46985 -73088 -120681 -165519
9209 -165519 -93947 -194697 -182099 -91714 -167445 -19674 -14967 -105719 -85585 7223 -148324 323491
9196 43253 65125 -70909 25305 123567 65442 -127791 -317686 -175846 -272969 78913 -5967
9184 -493118 -123177 -160286 145350 106643 135141 80057 -183075 139932 -194295 174831
9173 -114326 137496 -45010 142090 -106402 10009 33455 -364037 -288550 -172415 -56423 185445
9161 -364568 55527 -264509 -386061 -419116 2734 -161425 -297243 106779 39848 112889 108371
9150 108371 -50589 6306 -107346 -152375 -298887 -94122 -268891 -117088 304637 -281954 93395
9138 86202 -41518 57954 -280257 166312 -159469 -183528 -314722 -238765 178520 96605 -53866
9126 -16170 -69506 -39762 -165580 -344052 -180732 253883 233368 19295 -100443 -97704 23247
9114 -444742 -209999 -129115 -416849 -255368 17722 49038 195461 -224527 131140 -68199
9103 -241219 -209396 -92690 186092 -65600 310747 -76668 -262955 214017 -385075 -194621
9093 -194621 -63396 -312873 19739 120124 288561 14645 61124 62297 -15855 -605467 -822
9081 -165637 -160120 255522 -413642 177905 -43112 -262937 33192 -17208 -155340 244970 84873
9069 -17663 80502 -134095 -139693 -36944 -382419 -224997 10818 -149432 -36379 42365 58049
9058 58049 -84152 -153834 -43716 -245435 -402230 -51781 -33908 -244223 -391401 123034 146081
9047 146081 -45691 202507 -85306 -111064 -190800 161843 -468307 29148 -230999 12653 108490
9036 108490 18040 -170978 89992 74890 72659 415851 115082 100101 -278057 -32879 -344409
9025 -344409 -31255 37583 -97686 -301505 4367 -226972 -139732 90796 24167 -67488 -179897
9014 -179897 315848 -103880 -340699 -48888 -189542 136480 57116 9459 141955 -261102
9003 93852 146621 150066 -115138 170165 -13178 -335966 -255110 104834 -28413 -55941 145704
8991 65019 -137441 -47064 -284905 -322434 -227498 22395 -169948 -50228 -265321 -295351 41758
8979 196321 14622 44002 12286 -78438 -155057 45963 -141186 -256393 99961 200545 7338
8967 91932 -76883 -6109 -193110 -227779 117808 -359222 -223495 -234597 -159117 163130 26318
8955 83685 227352 -265469 59205 -92498 -93538 -64997 135705 132186 -99836 -57405 -27104 282201
8942 -12828 109625 189421 -33952 -77038 -148424 -60973 -24724 -38812 -10750 27219 -363254
8930 -143026 -163207 -11791 198785 -69425 -222600 -45158 54557 -6474 38076 -60161 316959
8918 116969 -42287 -554 4249 188690 212635 115340 5369 404316 923612 1088785 1819834
8907 1819834 3676099 7834728 9551251 5017421 3404738 1790517 1197884 759725 477605
8898 477605 465187 -11048 420269 144243 135094 507430 369186 405130 120639 -53234 -34319
8887 -34319 -73595 -69034 66227 -200894 -86685 3 -89495 -137505 -120633 -49895 5172 -143526 1705
8873 24965 -2469 65214 168945 -126922 7029 -60989 82725 -249144 -31143 269562 -187613
8861 -261549 21745 -15038 46170 48315 18819 -43426 31201 -213625 -143617 150632 179781
8850 179781 98292 186311 -154046 -74709 -234783 -22392 -76076 -233876 -160313 -326888 -106681
8838 -41148 -107931 -43771 82409 96156 -42581 38036 188550 -370 -283413 -9161 -177632 -99543
8826 -99543 -123745 -34254 -99986 -4508 -210997 -190504 -76541 32476 -42549 -35751 -139550 -56255
8813 262598 86167 -15243 80049 51673 29178 77 -252574 -270288 -25940 73727 -78363 167560
8800 -63281 6514 257858 -135720 -281509 -86952 106454 314039 -236720 80758 -68684 -72125
8789 -72125 -82503 113815 38507 -186371 -194375 81804 23864 266729 -308458 148814 41808
8777 51002 -35213 181236 113255 52490 -394230 189030 220631 -219111 274997 190473 -48528
8765 -22971 63199 -270740 -73950 -30692 91226 -99622 -149337 -118670 -85846 -230263 -284529
8754 -284529 177244 196688 -144551 -393463 -264867 -137242 -53207 94418 -111945 186487
8743 -255813 -130910 19360 -29925 23201 619273 122712 61330 -239073 -150149 152430 13844
8731 -253021 -5282 -190750 -160029 -83572 101282 -15173 120655 -137132 -11601 -60248 230604
8719 -100785 -164138 -200648 -287550 -244526 62033 -342105 85197 -80602 -235767 125830 -209012
8707 204724 -27428 -217135 -144841 -85359 -477410 -317771 -288397 37179 -87103 -383551 -101396
8695 -86527 265127 -144864 278070 -158981 -150520 125968 117 -87442 102754 -73756 35932
8683 177294 -237110 -303452 -88994 93286 302127 -302468 -265730 -194422 40069 33918 15168
8671 -19945 -90038 -248213 406342 -407286 -288599 144254 118021 2674 26157 268687 -11510
8659 11270 -194209 -24687 156490 -459149 -207080 -145860 177142 -164261 -25747 -505876
8649 -505876 379287 -161041 -224318 -338238 63778 -130293 169836 269501 218172 112362
8639 112362 77746 -164209 51760 38891 -128484 52273 -287587 193325 -193163 115375
8628 -105137 -215176 134649 5108 72266 5059 34446 -484725 -140377 43113 -70165 36942
8616 -93532 107134 -209266 -131684 189305 -376037 -29688 276115 83107 -180501 24536 328040
8605 328040 128426 -216076 42942 -141694 -240828 248807 97686 60068 -89013 37744 -238348
8593 73478 -66571 129034 -61651 244820 -24140 9418 179766 -193363 257912 -150223 -20380
8581 -7469 -402947 -68139 35482 220823 38790 59262 -146838 -228669 -230799 -197462 -182287 -149050
8569 -149050 -87662 -243422 -77423 23765 -26271 91477 -220864 -132602 55366 133820 40699
8557 -41596 -219116 -36714 -7286 -21443 25631 -83070 253378 -87068 117556 42602 -17807
8545 -116453 -77305 -84699 101681 -21906 -193668 36745 -14200 4605 -247408 112037 -148780
8533 -114872 -280383 -275234 -208523 -99335 80876 197161 191230 -330105 -96319 87594 -354173
8521 -148343 380641 44374 370199 53812 62034 168185 23327 313020 -167962 -179579 224415
8509 -118306 123391 -196886 74473 -125755 -142807 173864 -211562 23201 -91366 20295 307495
8498 307495 -218529 42878 -183440 -253209 -101291 -157722 1999 19292 -112815 48124 110368
8487 110368 -120328 -29178 -217796 331285 -44881 -408456 -274290 -103055 -17853 -199710
8477 -199710 109935 -147450 183514 -233410 -166692 82743 -33929 -148869 -251871 -29174
8466 -112741 -204189 317174 -128798 -292838 -370283 -170221 -202681 -46006 -254560 292228
8455 -51167 -76578 -82661 158244 200350 -74674 187582 -211722 10459 -23707 28651 68801
8444 68801 -47285 -169970 -18593 -130058 66124 -149964 10409 -302 25993 -282165 -63452
8432 -311655 25654 43028 -14395 12258 169238 -88943 123067 99257 -39127 -122250 -97348
8421 -97348 -184069 -107585 15210 -62621 -43837 -26989 -147863 -108179 -335865 -225257 -86302
8409 -167616 -185328 -224286 241423 121136 141164 332974 167582 -166515 -239780 -203354 -88921
8397 272063 144412 -20179 -90645 52054 -58730 49985 -237344 -184797 -147126 -128926 -156924
8386 -156924 98644 -82880 -275918 163930 35227 44555 -61991 -104137 -202438 -196652 -100022 -186112
8374 -186112 95653 107726 -42365 135490 201207 20486 90135 61945 14594 60051 -9290 44043
8361 -386093 280398 -348934 148289 -68818 -136382 -281639 -47446 -172411 13532 94012 69413
8350 69413 -1257 108487 230811 -3372 -110299 -132019 -127665 114755 -20864 -86095 227198
8338 -341667 136029 341197 -94050 -400661 -207589 819 -101257 -93689 4935 2559 -68853 -18424
8325 -142532 62727 -74942 95521 162337 -137688 -102197 -57642 -188381 -138488 -92388 11923
8313 31043 188620 -231293 134223 -193748 -267170 -134826 111932 236239 -327893 -113509
8302 -132446 -63846 135250 -39443 -230535 -296542 -46093 131240 -363563 -94423 -38026 -178475
8291 -178475 123395 -46433 66890 -138556 46914 -60708 33946 14859 54381 33067 22102
8280 22102 135818 -55291 -309869 123013 -173055 -15504 213926 169731 -77004 335344 201066
8269 201066 -204671 62880 -132398 153161 92719 -44047 -132333 -6875 -112285 -56138 -86336
8258 -86336 18274 -283125 -125510 -42933 -241684 -262896 88402 167267 11475 -20885 -230100
8247 -230100 -88156 -143306 162880 57836 -407104 15602 159324 108983 87239 -99176 -160672
8236 -160672 17572 -260805 -187864 -275784 26976 -82027 -343051 287251 -334168 -129584 -152872
8225 -152872 -277945 104912 -10561 219364 -71446 271348 -48782 -83778 15306 -51896 -10448
8213 -160742 -172154 -7864 86027 223929 -538533 30569 19433 -355767 126678 32028 110167
8202 110167 5783 237120 -57768 17065 -258369 -86057 221834 151237 -5998 234569 98691
8190 15518 -34866 -375522 37460 -106959 114003 106488 -138997 49454 -2166 131608 -84180
8178 -101326 -255685 33378 4934 -25184 -75538 -280335 84272 -119668 -456918 88843 -132026
8166 -47938 14188 -298480 -182398 129882 48434 18051 -42351 -220232 112547 -638 86701
8154 176493 98182 -254062 50086 10793 -42595 -221508 280139 -28394 -29376 -14212 14665
8142 94474 286990 354494 -166144 234983 53019 -83684 173027 -268804 -109787 263970
8131 129769 200585 61162 -13774 197657 167165 60893 82714 -66535 -243053 35232 40480
8120 40480 -117875 2950 -18499 -87204 -169486 -255643 165134 -188951 -138893 -187197 360867
8108 -461491 -148854 142434 -43887 -153595 -229376 -208490 -116146 -285678 -130773 40402 -276885
8096 91406 28404 -216518 23427 82927 25939 -9227 30851 394 222734 -609114 53220 -339840
8083 -14670 -23240 -214540 112320 68579 -53819 -320186 52563 -241829 353282 -376496 -1473
8071 53449 -228555 52025 -143879 227886 -120346 -77777 -187179 222265 -77285 -104778 -21003
8059 17518 -287382 -61567 -80991 -135363 -174877 79812 40819 -89356 -136762 209720 -242209
8047 144192 63790 -305161 218084 497 -231493 40032 -101389 41762 54390 169699 69006
8035 -100588 -2384 146681 -212687 -98238 -609458 3817 -7034 -158944 -280529 110635 92207
8024 92207 -119866 -199057 -30609 78546 185150 20592 -204213 366527 204274 -285954 -86591
8012 -118253 -199733 -135609 -281365 148474 152813 -37743 -483876 -277960 -228789 131298 -182380
8000 -230683 128910 -235094 101186 -348245 -169219 1390 -29854 266327 -258277 124267
7989 -443630 -79535 751 -70569 -70857 -66164 -209480 -124814 60773 137072 -277853 -243099 168940
7976 78129 -26985 -273394 66293 -413521 -74017 -206069 34996 -108844 -47064 240683 41009
7964 145965 27719 -65914 -61634 -14805 -7624 90627 -229112 -358091 -33682 -99270 176227
7952 -95530 -300720 -29946 46166 -15490 -45702 -344181 281497 -315482 -44623 120989 -14430
7940 -24715 -45278 -44355 16470 -190364 -92590 2782 -17392 -87484 -168492 -23136 -106466 52954
7927 -25147 -34144 -79511 233295 112914 135635 110672 -250594 -33021 -210374 -273997 -107488
7915 -101803 284501 53616 -267614 11620 -92435 92278 -23090 -101435 3792 -116652 -50671
7903 -42883 13870 66252 170001 -38071 110300 234642 200340 -155445 14286 32727 -14900
7891 -5586 53245 -122434 -396282 97725 -107405 -322043 -15270 103502 -52778 -69388 270831
7879 -262173 43827 -26391 110375 -74416 49690 232673 1521 79589 -71664 -57375 15153
7867 141217 340735 -107294 204120 71835 122474 -133097 -229845 98264 139255 -307998 -318848
7856 -318848 -112500 74162 261044 -96505 173575 6586 161534 79992 212125 -119600 -335349
7845 -335349 -156166 -89084 340230 168814 -251777 236506 89176 -81003 55256 -195720
7834 -41318 -217735 77606 112299 -47231 -146706 340603 72673 261137 107108 -186465 -16819
7822 -72451 -187564 57930 318858 220993 164072 203597 -70586 -71410 160053 -138787 276756
7810 -186457 505558 -182643 155003 177549 -306838 124131 190060 -28703 -340008 226220
7799 -51093 54368 57408 -56501 1675 847 63056 226258 10731 -121301 -123096 -219953 -84194
7786 -48786 -175656 -131432 -517179 176836 -107161 -6056 -214623 223456 -41882 -135479 228338
7774 98032 -138372 224067 69244 89687 -185845 43284 406024 -21004 -163257 -298682 -230606
7763 -230606 89381 70609 195235 197129 -79651 -187157 180137 -31606 -21577 -10081 21403
7751 188415 183661 98709 -87703 19596 -381564 -176406 82223 100918 -169486 244992 404250
7740 404250 -147005 -219620 34991 -164381 176585 -267715 339726 -67757 -461472 13541
7729 216731 23717 66030 95093 -285906 248350 -11700 219214 -123892 -294893 -121010
7718 9184 -72538 309696 38218 -218972 -65878 96877 138315 373359 256036 -134589 -212662
7707 -212662 189257 104355 -343251 -37968 -53573 161272 11767 -29888 -447716 -225424 246142
7695 -256680 -246555 49859 172367 -158960 54408 -28511 42136 313453 -19108 71781 304716
7684 304716 -92460 202601 207659 29779 -246686 -39110 -140731 -215385 -112407 -19841 -227886
7673 -227886 56530 274148 98693 -123431 -13447 30255 7375 -105175 -40315 57368 -69785
7661 -281217 20262 -19070 92048 41512 124098 -428589 127 -202964 143584 -10073 148416
7649 -22625 -267016 -171710 -123312 194839 132418 106716 44123 -88902 63287 -65056 -193816
7638 -193816 -25319 -246838 -327958 -252238 -73281 -112330 -50678 -177068 -60369 161215 -313150
7626 -53986 71864 209483 -63681 -128578 -58615 -143978 -134789 -21358 -33287 244514 -106657
7614 -173499 55632 -213045 -229954 -250033 -3991 -57529 -244986 92789 -112228 -314936 -221216
7603 -221216 -89170 424314 -79403 122688 92967 -111871 -215024 -162030 173333 253085 31084
7591 200731 312997 67230 -5387 107060 144366 -72228 265851 -18440 -285174 -409738 70527
7579 -175858 185996 37196 -117102 122630 -89771 214577 -300442 -32239 -134042 174156
7568 379952 133798 173010 -69347 202045 -195231 -228183 -12132 116203 115845 -134119 -134266
7557 -134266 41113 -95927 -99871 -173706 37394 50848 -2995 -106095 -258756 -595901 -125693
7545 173697 -106011 -228039 319368 -122505 -193968 -184070 -38698 34875 -28865 192637 113468
7534 113468 -28558 79997 14175 -145825 -182776 -159237 192841 -629744 354323 -266361 -160646
7523 -160646 -70768 21997 -114966 -134542 -167966 80935 185222 -56897 -9444 -132095 84165
7511 -90830 -19596 165294 251307 149717 104843 243494 -18581 4161 306570 -313320 260490
7499 139290 201641 -29749 202774 29052 67656 -188686 -63092 187768 -40335 500699 -217150
7487 14172 106525 -205911 187980 -40893 180910 -250083 -88208 -359151 218507 89661 -238538
7475 -185392 -145641 -30905 32424 -82705 193713 6114 88706 -352000 -60429 -90797 -82086 26623
7462 280571 62450 -203428 87262 164430 94302 109076 -164353 92436 -112573 -106149 -254908
7451 -254908 -28486 -298725 -121215 371343 -133062 21973 -379937 -53980 203808 97398
7440 -17004 -33867 -72366 -233665 -90645 209793 -163410 -301528 -72135 -43317 287457 199060
7429 199060 75910 -220709 84639 55881 -96077 49551 27567 64587 -146406 45497 -56552
7417 -45974 -21111 81409 134268 105174 24503 -7573 -25609 1108 -57370 12651 92036 269101
7405 269101 -218317 56471 -200904 -99838 -153085 36474 178533 -176243 1055 -133014 -360082
7394 -360082 -333049 -127633 -164916 50305 87219 215987 184494 -49581 121913 -306160 -91644
7382 -211885 -54324 -371745 -192559 -49924 -86847 232447 -153202 -52228 443421 -371407
7371 260782 -317452 -75293 146333 52468 -34676 -21960 -2250 -124414 106564 -14611 -252901
7360 -252901 278912 85671 65782 -309816 5810 -235904 52861 63110 -60520 122087 -313043
7348 -82943 -95773 199239 152845 -214517 165725 83179 -255356 -75978 -114627 -29600 -108868
7337 -108868 -103169 -5212 54148 -95068 -8377 141749 -148443 88532 118948 -44835 -63039 196856
7324 -30987 251262 57567 -29641 82585 141970 250419 -24752 106972 121406 -177296 -573379
7313 -573379 146158 -48580 -50059 -174961 -38952 -97597 -149914 -95337 16810 -205260 -170388
7302 -170388 -10364 -272033 -42248 -147686 -139388 -7200 -245794 -71819 217001 59926 -126305
7290 -1877 -337310 -429960 -385585 50397 -299655 277700 -186494 -200690 28843 -95358 -353207
7279 -353207 -79373 194168 -133628 -203741 -99240 -39001 -101273 18228 -109167 -58523 136654
7267 -154408 296367 4153 -122102 88717 -150804 -136049 23035 -58972 -95703 -361217 -148099
7255 -47109 -3099 -25944 50256 -370106 362953 -227756 -193221 97742 84081 -6843 -67591 190658
7242 -11343 -44244 -12948 245219 -107536 308227 -211456 36575 -244692 257332 -156994
7231 268489 -45856 -44350 48715 -84986 -73392 -29261 -144255 -74819 254766 -234252 177239
7219 -10918 269900 -129873 207468 221883 100864 46879 -119359 -29901 -132804 -296672
7209 -296672 18060 -106343 221812 -52031 -302577 -385689 124618 81862 13189 22725 305430
7198 305430 -60834 146402 -172809 -67499 -170328 -193636 108839 -262101 -42881 4405 -108688
7186 79496 93072 32257 280610 -39735 1976 -45405 68988 -38688 -139603 -56893 -201584
7175 -201584 191487 299 173120 -151070 72077 -119567 49858 101021 -61796 -76005 -164215
7164 -164215 9237 24358 -110183 306019 82299 125146 -93441 -140752 -18689 -142457 99962
7152 -34196 92204 -149597 4245 -34910 -155997 215357 -175687 -36373 -26041 318286 114862
7140 202320 -199773 71500 19375 350836 102234 229470 -146645 5990 -14328 25939 -60500
7128 130813 -288615 -212340 -57398 -191630 -12452 140574 -273070 12791 -196894 -84409 -225994
7117 -225994 -410879 152448 287626 -169245 -101994 264086 23249 -88413 -39315 185237
7106 -81152 -213099 184002 279611 -49034 -285047 -85600 -62380 -112680 21867 -101430 -276165
7095 -276165 -18148 -46526 249359 -74681 -119184 -49167 29345 154513 171071 -161478 -195058
7084 -195058 54761 -3692 -205423 -162872 83013 318068 -37400 -252592 421240 -154880 73278
7072 -19843 55831 -224506 267342 -252047 118694 -71977 198536 -147369 104219 -44824
7061 -53326 -11106 -32725 70159 43072 -77854 -142354 -207100 -34993 -86558 -320456 -163774
7050 -163774 -245620 194883 -35387 -53720 -207534 -227282 -158465 -61537 -74693 56594 942 -17258
7037 80517 88411 -83180 620979 -157727 -48053 16580 138960 205570 161024 217015 -164347
7025 25410 75138 107754 -35614 183562 -258777 -70819 -69999 -81015 45533 -116527 -96203 -38678
7012 -51236 -60723 -57920 -146133 175790 -90627 118052 148507 -45496 261675 108565 -26177
7000 -5347 -105494 89848 110675 35001 25542 -210603 -187305 198147 -286655 253784 -59982
6988 62688 56745 -34716 -139146 29690 -354084 138521 -261600 168071 -79776 173653 -131556
6976 48522 -344958 167664 -77534 -580228 -85961 12482 -159439 -78446 41105 -236375 253300
6964 -93452 28988 -183765 113445 39714 69167 128243 -10855 52707 -281982 -10405 200456
6952 120372 -177931 -31882 -151188 225963 49323 59759 -82533 -134923 -66986 150178 34625
6940 168702 39322 138517 144461 -442610 -95108 -252087 -129800 191187 61835 178326 162515
6929 162515 146083 -184486 -1700 -181890 45083 157437 -108732 235773 24365 -93998 -54381
6918 -54381 112763 -63863 -212415 -33337 -226816 -291016 -37995 -243301 -111455 89058 -61584
6906 103045 -302515 59286 173837 -205142 103294 103934 126954 43032 9430 -171764 72998
6894 -50213 186530 76186 -9141 -354098 171359 37890 -20231 -30242 -253504 -64511 -16805
6882 189760 -32508 -200320 548588 23647 -11458 -20473 -274761 124743 -80456 -23452 237044
6870 90108 -43034 -106019 56682 211850 -35379 -107595 -206344 -283376 73545 34469 -344581
6858 -22214 387289 -295802 -57910 -112119 1088 -86044 -205017 77450 -252226 215537 -207326
6846 118355 -191587 24792 -130608 98341 154066 -31873 -34790 235216 235096 255288 197360 28056
6833 220443 148188 -224186 -194943 -87850 81737 -317379 1464 -230529 80108 -70768 -191341
6822 -191341 -267250 -40740 101911 264538 -49787 47255 -211962 120255 -320302 62363 4509
6810 -239563 191444 -55584 -35223 13618 -13805 341017 249196 -131422 -319070 -265660 -87714
6798 63724 -49648 -50768 -33614 -41267 -3091 102494 317931 -249603 -183095 -168958 270893 -12253
6785 5546 86143 117351 -162672 254750 -100170 -131134 68348 169793 -183389 260169 -272992
6773 -62500 -210930 126998 102316 123900 -3770 -41855 -180465 -120989 -36807 -217852 74099
6761 -111469 -72120 25603 -113954 6492 137487 172371 -130800 -17859 18800 88841 -242176
6749 -159586 -32015 138235 -259826 -225045 -107326 -170699 141432 317521 -264787 -117836
6738 -302723 -108213 -173677 -37340 -190306 -91930 162937 47258 214121 42200 -66025 182545
6726 6610 -80779 1867 229657 -29180 98279 159667 88620 64304 -85760 -12961 -165207 -96225
6714 -96225 13174 219175 -257050 -271318 -268029 -8596 117849 60279 122886 140441 20481 172491
6702 172491 -180171 -239356 -75480 178531 42798 -188679 56698 263663 194955 -165890 287178
6690 21295 -185997 135541 59055 -288957 84791 382199 429694 364118 52441 -240598 -106799
6678 -90667 -83679 441633 -244136 -102673 -107956 -336336 161624 98051 150400 259462 -178791
6666 54784 -19846 -61433 894 -143683 -81702 108836 377116 -73701 53461 -297292 143365
6654 -135861 -162869 -416613 -96326 33077 215361 -32216 161829 -37093 -95689 -308676 -175089
6643 -175089 -58005 -206794 85861 171945 -194499 -134857 112812 -43694 237560 -41136 16403
6631 52064 -141612 304889 200387 -109520 67319 100761 -106182 48368 352068 -112006
6620 -6168 161433 -107998 61929 -39008 -184148 117918 -214573 195722 23230 52450 -129787
6608 -9740 -390901 46354 -5464 124590 -195019 104288 -11168 -190329 -144282 -128939 155580
6596 -292533 153010 87088 8722 -51476 -201359 -271664 -224227 -48932 297432 198346 -214658
6584 78565 71310 290285 19893 101269 322049 -212215 31321 205002 -110041 10842 104345
6573 104345 -456499 -113691 137003 -25316 -233569 162422 -174137 -76768 -2983 39871 424425
6562 424425 -146101 284738 253563 -94406 -192254 90891 36640 -20551 -210164 51124 226557
6551 226557 132918 59090 -69811 -57653 5767 248231 -266527 20998 -277140 123690 -93636
6539 -5877 -183968 -341278 122720 -35337 -81268 -122026 252171 -90529 -97655 -66772 297328
6527 88603 251994 46842 228862 -3952 144778 102163 22460 -108352 -9685 68189 36054
6516 36054 -50407 7415 -29968 -147191 -222823 112334 -41605 207923 -62997 164403 63890
6504 -34378 -153313 213004 33524 334300 299370 -51130 -86052 -205576 15017 -78350 33918
6492 88581 -200085 149728 -267529 132269 41811 -63444 -308758 -24751 -304996 -233935 80670
6480 -231847 -216562 16755 -266234 140793 20669 222425 73992 -61805 33621 44248 57287
6469 57287 158069 123460 55946 223954 -214 -184435 -78365 133457 258639 -32376 -147177
6458 -147177 -31705 77351 -92460 193300 -301600 26696 135470 13024 86918 87279 -58899
6446 -523394 31620 -41611 137742 228924 51195 156051 96989 -229095 64141 160081 174120
6435 174120 -308006 20800 -277127 -43100 -43919 -286099 1090 21855 -43505 -56736 -146717 37972
6422 20895 -11723 20688 -197852 -15683 26188 -124575 -125941 26901 -76788 133659 -10842
6410 -193042 -139049 8123 -60473 -216715 -199811 -224850 -89706 126824 28514 35777 90213 168318
6398 168318 337527 214707 -282462 -112511 114803 294401 436919 -51834 -323210 -231708
6388 -231708 255845 130496 -104161 -83797 496353 -54004 -290951 45593 -54940 -83506 121963
6376 215726 -63074 272211 -329669 -108657 85003 347836 -71224 2605 150832 -16764 -15851
6365 -15851 -226919 -103103 -152671 -19986 275829 -24072 136667 -32968 169795 -187642 194911
6353 179198 -272092 327486 -174481 -93936 52443 -105055 -2198 -6667 -74215 135494 132885
6342 132885 82752 -68818 236401 -208984 -405428 108428 156768 196686 67745 27846 187245
6331 187245 -276115 -31413 -165098 37144 41238 160969 79399 83408 134109 60315 144622
6320 144622 88250 -111219 -219934 -7821 98722 40804 -84773 -25755 59539 94625 33434
6308 30691 11641 -145787 316377 218821 -149196 87400 204616 -217788 -140210 126735 -200188
6296 21611 -272350 30374 -148150 204759 118945 281690 -139460 -133043 21549 -312030 21816
6284 -35451 -118593 -31180 16150 257410 340418 -273262 28935 -121236 -282669 -148239 270738
6272 -862 -263745 -115243 -255994 -128317 8891 -91602 183003 -289346 183627 45730 -301538
6260 -230025 -72019 258633 153877 -149921 -59501 -139380 321187 51925 -90190 -133135 -4808
6248 -63181 39131 95958 261580 -273646 -36119 99644 318794 -264461 -138605 138387 -202884
6236 -55844 100905 -119074 29533 -165698 22135 39173 -126560 -277323 117981 -30979 143927
6224 -249627 29948 7618 -14484 -230983 -19506 -404345 -82429 -231514 -183642 -85369 -44522
6213 -44522 -133385 67900 90458 -348606 -91762 -30847 99078 -31154 -51444 -180124 -17251
6201 427788 17676 -263259 -199341 -107722 -114454 113317 73876 -226654 18932 -181452 148773
6189 -62377 91573 -225222 122680 -95918 135735 -308159 255153 22750 75198 -166910 164000
6177 177524 9712 1133 -125753 106871 190148 -120435 56432 155198 -321167 41733 -14294
6165 63547 114536 82249 -94683 -172606 158137 -64040 191694 6841 -44431 -51287 299011 -236592
6152 248842 134855 -226572 -4995 -60477 -323761 -9447 -21290 461081 -3751 25385 36072
6141 36072 289760 282649 97802 -159616 -154320 108779 145029 363145 70714 -142260 11579
6129 48305 202775 -27341 396346 -37443 92704 -33855 -20608 57911 10306 -196292 223948
6117 -20805 -271942 262448 202429 -293936 -186175 185089 31081 -155240 -65580 -197655
6107 -197655 -147264 -183587 31167 32658 -49454 -81481 -32240 -20387 -35438 99744 -118505 -159990
6095 -159990 -189346 -84814 159117 -34166 140642 -74122 235437 -25830 -152027 137305 346424
6084 346424 245555 113072 183284 1573 -437482 196216 -27086 133473 162958 -39347 190608
6072 -206756 -213900 53888 252267 85751 -49209 -165274 -153217 58283 157256 -125070 38540
6060 28817 -84445 -10731 163539 -55059 9211 58004 -349530 -161838 29460 71033 163065
6049 163065 300267 -246879 246560 -81700 99622 258354 -168553 -255488 85445 255976
6039 255976 -23130 196109 46037 -24114 -194136 46192 9142 -2551 -53437 194626 129731
6028 129731 460946 13517 -274449 59010 -8589 131326 -19621 -10018 91951 175578 -114143
6016 -90040 -268591 291409 -108014 -401448 -125120 -137702 364651 -101383 -93684 -146139 12063
6004 128307 60243 -59014 -194232 -401956 -81164 228933 47697 283655 -58541 -99275 -289186
5993 -289186 61871 120211 183803 -190159 145328 111253 56656 -271236 -129652 -240136 -28895
5981 15153 -184677 70020 -63801 148137 -193524 -133183 11061 -147195 -102312 201004 39315
5969 -245674 -139048 -22592 -179288 -93679 -29854 -65247 -86526 -28484 243969 32569 145643
5958 145643 33603 168628 -97828 -73620 -19889 205359 -255864 26643 -233478 -218276 -234738
5947 -234738 -178180 71575 70830 341649 -120845 -292550 372398 109671 217852 -72545 -75668
5936 -75668 -246951 -142267 -20955 125288 11366 -158043 179 -164961 -63190 -107596 -234005
5925 -234005 -179832 -186343 91769 -347802 108511 102926 180174 -162791 223842 -32213 109817
5913 -174627 -115772 99626 -351617 -132735 70339 51575 -57286 77064 -30525 -82016 -272549
5902 -272549 250752 291965 150967 22952 -6379 185044 -142178 181954 -236160 9112 60582
5891 60582 192126 -96410 -90586 11414 282581 59025 224895 -114903 -155795 51946 340843
5880 340843 159579 82922 55427 145097 -217147 340075 166456 57219 126074 258722 172398
5869 172398 -13297 106356 125990 11651 -63054 -7642 -109367 252170 62040 191455 29774
5857 -31702 437442 -163083 30776 -294776 -18808 6826 33115 -263 -293019 174126 -357010
5845 -85015 159807 142490 -97255 -30362 255 -104261 57891 -157152 -37566 -110154 -53936 -92597
5833 -92597 -36142 -18948 -73247 68224 -123003 266468 82932 -209858 305900 -272624 -7218
5821 -185785 340777 -35916 -35753 41053 170238 127382 -234282 -131323 -79434 -17862 -5017
5809 215130 117694 -207759 -177891 -161238 -137499 86337 -105478 307718 164335 36514 -181433
5797 131076 -86411 -171084 145220 64155 42080 225963 223308 -251239 82127 206502 -144034
5785 -181527 -33278 -93883 -251187 -98322 -44395 197423 -225142 95741 36490 95635 109560
5774 109560 323339 -196594 18695 -425506 -458210 162439 58988 207242 45428 4124 206022
5763 206022 -116874 -282706 -236632 174851 -167805 -390054 -120844 288754 -24717 386413
5752 107939 -296022 106321 106266 52831 265239 -273593 225925 296313 -261062 75419 25203
5740 28896 -37585 185161 -78396 -163429 29725 27852 59655 -109110 133263 -92864 -313381
5729 -313381 8308 -133704 -66548 -43668 -72334 -395621 -215934 120269 -236011 -79955 -17447
5717 -19040 -159169 24097 -130729 271291 -188561 256565 274658 -96832 -257072 62025 156796
5706 156796 332461 -189659 -377277 -38274 -55078 212697 337975 -311915 -110142 110408
5695 -254749 -96272 13659 179508 -261992 -81576 150077 -66258 -98937 208313 321411 -10128
5683 -54523 -286217 -414717 5217 24355 290162 -77611 -14177 -12737 230566 -16943 110481
5671 -162128 280827 -161003 -163751 -170168 -35189 43054 -294470 -139592 -258446 115378 -10331
5659 -194520 -5266 207903 -85670 26908 68946 -208267 -117596 -74783 56960 113274 126930
5648 126930 114688 -45676 59253 113151 22422 -4140 184746 82479 39744 72272 144140 -26063
5635 400793 -205870 100741 239517 -32623 -215650 -365163 -76621 256139 239681 -196537
5624 -147665 10102 -251381 -66715 -154741 -279499 297063 236405 -155162 214810 486476
5614 486476 255132 59330 -240299 70466 -65796 165109 22044 -117512 -21044 -391173 53408
5602 -43860 222692 -326124 -104493 3277 30407 -261185 229379 221184 157130 64055 34150
5591 34150 7098 -89167 182573 359713 81251 -12258 -379635 -255428 -67600 217776 -22258
5579 -29334 -153901 -201130 76378 -146993 128334 -40101 -198065 -80903 -99413 191140 -180525
5567 -141028 231395 174203 -39910 11179 77018 142439 84317 50031 40428 120900 -245930
5555 353003 9743 117539 127985 80377 -15197 -238682 164882 -16267 27592 57441 25881
5543 214875 -181117 -146308 241100 -220531 279908 -140944 56287 462087 383263 -20245
5532 -38568 152710 259904 -7865 101354 132649 -37560 -127870 -20606 -76849 -28179 259622
5520 -90869 -270300 43681 -64509 -45981 35262 71468 178399 -73240 120621 -229014 381947
5508 306571 -68890 194628 -164680 33691 -102933 85659 -45683 22477 10347 -321214 141398
5496 -30213 -165890 -54823 176499 -264506 -115975 176478 -77649 -465827 264178 34207
5485 -142482 59857 154854 -68680 120846 -25356 166907 14158 1185 -200253 -281106 221765
5473 -42335 -168349 -70597 81961 -95343 -75080 66730 -282754 -96195 16585 266259 413449
5462 413449 -89195 29001 -186988 164973 -40173 -111 20341 -72337 153731 -105664 27661
5450 -117727 -60008 23827 299974 -66834 -160414 162514 66012 -98492 27017 147479 -102567
5438 -218483 284765 -250593 -328832 -174114 -163244 -171014 -25853 -90986 229394 -230016 209801
5426 -168474 -124097 156165 -3359 -137608 99613 -240331 72744 56462 -54193 34211 -139085
5414 -260689 60483 43916 -277989 168768 -54772 -110810 39048 -96028 80355 75080 -115341
5402 131433 84774 -49277 -48539 -33637 37040 -193954 -344830 -77881 -13803 176716 121797
5391 121797 64177 -54476 -29464 11339 83906 159018 13239 34877 -37995 -5450 -276671 -135183
5378 206679 21279 -30594 -117013 -30639 -146709 62129 130300 66182 -180704 -351836 145419
5366 -214250 280602 17304 -67788 196173 -193402 50146 -78603 -154624 -251224 66610 134203
5355 134203 -170531 100636 34150 199031 -203592 -68019 -90345 148057 5648 -156018 -109255
5344 -109255 -235280 42800 7374 -28227 -103231 -221673 77366 325543 335999 183087 148260
5333 148260 -283706 -23874 17590 -47523 108245 73272 -305935 -127648 203027 -35054 -133469
5322 -133469 -110822 100136 -152462 41953 -62487 297241 -65118 187249 -45299 158090 18536
5310 -5309 47985 13524 97602 344286 -84521 104288 295221 138529 -227593 168826 -44896
5298 113904 -367530 190236 -143502 43021 -303600 166360 -113966 189343 160031 -119206
5287 -62689 128640 -297686 367380 -121730 21875 -121839 220131 319718 -860 -168734 281716
5275 108666 404631 -173152 -129263 -227904 106703 96249 183736 238371 184814 35887 94344
5264 94344 -24181 265254 87439 32319 -43987 -290854 53346 138639 129303 147741 88582 -123583
5251 -100248 -78734 218569 54870 155072 246540 306529 -18498 -93836 15682 184948 -94079
5239 -36569 43110 -123095 -113848 149797 96 159537 52019 199287 260020 -176446 -154251 176794
5226 216802 212260 -4090 260514 -111032 -85782 9807 168490 -245627 323591 119828 -128140
5214 -68697 92438 -97907 273976 -57357 -256729 173735 -82983 81956 182093 -163867 -307510
5203 -307510 -1006 -250376 279940 -289665 182289 190335 -177271 145504 3115 258049 -62340
5191 526254 -135182 -151152 11923 35845 406277 -79527 25335 -65691 -73934 38626 73228
5180 73228 -27904 106437 -69388 -10703 -77844 109363 15523 -57741 -40249 98204 155392
5169 155392 -346667 229462 17519 -9883 -106106 -227415 72786 -184337 -11678 -196239 -148535
5158 -148535 70744 78029 -306195 225462 265477 -64676 -246799 -139033 -7371 -90166 -277399
5147 -277399 28328 -184104 80816 -238346 292893 91376 131095 -51839 -79919 -71971 333383
5135 -108225 -413490 53172 342231 82588 34784 213715 136695 273947 -52076 344486 -235445
5123 26342 -98731 -46890 189949 131660 164237 7909 46757 -16831 -272176 -226475 -369618
5112 -369618 -201175 -129657 113265 -55391 -298835 -299004 -105685 9357 112269 457087 66929
5100 382896 178905 318053 -249439 91503 119761 134439 190115 267382 257796 172813 42992
5088 -13427 145468 -197199 65490 -176093 -78941 -361343 -12405 -81891 -375828 291849 91371
5076 -47268 -250849 109357 -54404 -205309 -46784 -32321 140970 82124 14481 -36608 -144548
5065 -144548 -98846 193478 -33170 11683 -73870 -247396 322438 38177 -96488 -512383 74563
5053 -212332 -152416 -37788 -149243 116356 -75547 163071 196460 197579 -155307 156809 -212799
5041 -329074 78032 -238513 -326554 -226207 -187153 -55048 -77462 -126923 -8309 -82707 176664
5029 4658 32176 5850 -224259 -138515 -151282 -85188 99403 -344572 106594 275423 -94984
5017 41005 251365 -137877 -2047 -289154 119992 99196 -225821 68737 74243 -289225 63717
5005 -249031 137895 262526 25745 -44110 -126045 239295 -138776 -130789 103609 174914 19375
4993 299423 -150800 45962 -85613 121442 -38602 -77554 -131827 103151 49036 54690 -253005
4981 58292 37036 580080 192125 -231794 118917 70146 160772 -138455 249487 62279 -57087
4969 -218009 54068 -6368 -322954 -180611 80064 -165469 -46651 64595 -174287 -47360 1093
4957 271797 -266152 -98186 -208974 -93562 228843 -247885 244890 -121951 40481 36312 -37499
4945 69456 31786 181668 -140833 219097 -44781 1148 76355 111858 45090 -236250 63662
4933 39534 -86600 -75193 939 -6341 -171687 141164 -337071 133452 129184 -24143 -104515 415203
4920 159942 20179 -96039 -102614 -75370 -150502 131851 14216 109091 77111 -15955 -166344
4909 -166344 -140795 -71379 66153 -148808 -129714 -42670 -200144 17810 187631 106083 -58840
4897 12877 -112192 -458400 89806 471488 121553 -102814 -142643 87782 220444 232331 42807
4885 118828 -213347 120839 59166 67960 109749 -7393 117238 267465 99914 -48079 -149996
4874 -149996 170474 139111 -54518 -118218 -139449 24148 339728 -336042 39738 -32939 -92914
4863 -92914 133066 2143 -32644 -133735 370104 219019 327426 -214925 -135753 129008 46990
4851 67998 45769 48690 210346 183334 143104 241948 -220913 120625 -50746 -1064 -123095
4840 -123095 35635 10853 236472 -34331 -122133 -251214 52365 20124 -145408 40580 -134863
4828 -184972 139989 -165238 144133 -247846 -77630 -4768 276454 -311424 149354 -41602
4817 -137571 -16211 105813 -284492 -281862 -16305 -203330 -110309 213848 -350668 173703 154882
4806 154882 29292 -61430 -357580 -33608 181660 -43717 -279712 194250 -345115 140364
4795 -123512 61745 388442 269536 -123292 -48947 -139183 -314122 -135693 393298 221313
4785 221313 -15359 235933 157871 399972 -31608 248463 -43289 -255133 313372 140579
4774 -101319 -198989 14786 -230758 -80072 -64050 -17701 -47999 -14532 -148542 184186 143591
4763 143591 1255 -94964 225366 -261996 464618 -21490 86347 -146317 92413 -252924 159721
4751 18499 197311 -19147 80441 -118770 52360 -200175 29607 61105 167443 -60225 94153
4739 70639 -194409 77488 16159 -3070 40402 94827 57239 -123617 -100226 211297 -97457
4727 352830 215821 123238 -199898 140106 -38176 -111581 -94573 -14297 -222065 5470 219793
4716 219793 -103254 -147476 71042 342049 -236354 -372264 -169470 130375 -145178 80840
4705 -229864 32797 147351 104182 -282668 5070 -192020 213184 202172 74311 -103899 -13014
4693 232753 -274348 169546 -436113 71298 -116394 47399 -10365 -1742 114021 -135353 37197
4681 -348341 52553 -79560 25825 226250 -109960 12244 -94312 -123459 -56817 130723 -2393
4669 -363736 -44234 -59016 -110820 74437 -185656 275563 -135685 -217242 61845 28341 -211272
4657 203556 -126794 296154 336384 -20723 14395 -48233 121116 1209 101983 -135472 -110481
4646 -110481 296389 412933 240912 308723 -28714 127191 146968 171585 172295 337846 -177052
4634 -36009 7052 -19763 228821 40450 120796 -418659 164838 194432 85621 96955 -186197
4622 131029 101926 -136162 -282449 12884 -63835 -231680 -380282 -14853 111555 422214
4612 422214 -93174 39462 181815 26928 -220247 99872 117108 -345652 -95147 -10707 -62202
4601 -62202 13898 -233203 -69166 261855 -4125 -164787 33736 69543 -14423 7544 115990
4590 115990 -15483 -253398 93172 48090 -236315 -176819 98369 127303 -137901 -43080 -34633
4579 -34633 119065 -16815 -72855 204709 -32469 -59360 309099 -82179 135112 -33070 212826
4567 -171147 293681 -9664 -294283 -136319 466527 -71200 -39218 291934 62938 -157648 125387
4555 96491 91345 88862 25520 -18227 198143 52409 181980 -99756 -414286 189250 127665
4544 127665 -123356 -51111 406229 215027 194276 -230691 -270787 -110808 15243 55350 36081
4533 36081 86050 -132355 24771 422018 21224 452708 32696 227953 -18615 -115038 22667
4521 188919 -110810 31205 270649 -90523 -267094 436 171392 211285 -183069 165208 -107868
4509 -255457 117554 208662 54309 332198 5126 -164169 48 -140947 198324 -81145 -71550 333827
4496 32410 103385 -279980 81563 184923 1037 311763 -44211 190692 -23126 -156094 79842
4484 227203 -44930 -146103 209929 72523 -302695 177009 47379 -79131 132212 -54450 -73714
4473 -73714 -222939 -100449 267574 -116261 -224211 185854 89657 -158632 -58649 113229
4462 -14400 -8335 187038 162041 170357 -181363 229711 72964 139282 -131497 -117644 329357
4450 164962 11507 -181909 171892 -282035 -53245 -92199 200674 23879 -82538 -44469 -169005
4439 -169005 131619 -16901 156322 38133 12426 -345557 78725 -48434 -168713 108867 -400418
4427 105546 -120837 185238 -164824 -21526 95708 41085 127250 148755 9969 23987 83270
$$ [...]
##END NTUPLES=NMR SPECTRUM
##END=
