
##TITLE=AC1007_S-149_6114592_zZLpfeKMET
##JCAMPDX= 6.0         $$ Bruker NMR JCAMP-DX V2.0
##DATA TYPE= NMR SPECTRUM
##DATA CLASS= NTUPLES
##ORIGIN= BRUKER
##OWNER= Administrator
$$ 1.72 TOPSPIN		Version 2.1
$$ 2012-05-14 19:08:42.625 -0500  Administrator@TOPSPIN
$$ Compression mode = diff/dup
##.OBSERVE FREQUENCY= 400.13188235
##.OBSERVE NUCLEUS= ^1H
##.ACQUISITION MODE= SIMULTANEOUS (DQD)
##.ACQUISITION SCHEME= undefined
##.AVERAGES= 64
##.DIGITISER RES= 22
##SPECTROMETER/DATA SYSTEM= spect
##.PULSE SEQUENCE= noesygpps1d.comp
##.SOLVENT NAME= COFFEE_meoh
##.SHIFT REFERENCE= INTERNAL, COFFEE_meoh, 1, 14.96697
##AUDIT TRAIL= $$ (NUMBER, WHEN, WHO, WHERE, PROCESS, VERSION, WHAT)
$$ ##TITLE= Audit trail, TOPSPIN		Version 2.1
$$ ##JCAMPDX= 5.01
$$ ##ORIGIN= Bruker BioSpin GmbH
$$ ##OWNER= Administrator
$$ $$ C:\Bruker\TOPSPIN/data/COFFEE/nmr/AC1007_S-149_6114592_zZLpfeKMET/32/pdata/1/auditp.txt
$$ ##AUDIT TRAIL=  $$ (NUMBER, WHEN, WHO, WHERE, PROCESS, VERSION, WHAT)
(   1,<2012-05-14 19:08:37.843 -0500>,<Administrator>,<TOPSPIN>,<go>,<TOPSPIN 2.1>,
      <created by zg
	started at 2012-05-14 18:57:07.593 -0500,
	POWCHK enabled, PULCHK disabled,
       configuration hash MD5:
       AF F2 23 6B 01 CD 40 DD E5 A1 38 A0 06 EA F7 77
       data hash MD5: 64K
       79 EB 26 71 8C 5B 7C 5D 84 82 D3 CC B6 E6 6D A8>)
(   2,<2012-05-14 19:08:40.671 -0500>,<Administrator>,<TOPSPIN>,<proc1d>,<TOPSPIN 2.1>,
      <Start of raw data processing
       efp LB = 0.3 FT_mod = 6 PKNL = 1 PHC0 = 0 PHC1 = 0 SI = 128K 
       data hash MD5: 128K
       3C 31 76 52 1E 99 33 2D E1 7E EF 42 FB 12 C7 17>)
(   3,<2012-05-14 19:08:41.875 -0500>,<Administrator>,<TOPSPIN>,<proc1d>,<TOPSPIN 2.1>,
      <pk PHC0 = 39.08936 PHC1 = 0 
       data hash MD5: 128K
       EC 84 A6 59 1B 52 95 49 DA 9D 65 DA 41 56 24 E4>)
(   4,<2012-05-14 19:08:42.109 -0500>,<Administrator>,<TOPSPIN>,<proc1d>,<TOPSPIN 2.1>,
      <abs ABSG = 1 
       data hash MD5: 128K
       37 FE ED 9A E0 87 91 EC 5D 92 B4 91 AA 61 85 D5>)
(   5,<2012-05-14 19:08:42.187 -0500>,<Administrator>,<TOPSPIN>,<proc1d>,<TOPSPIN 2.1>,
      <abs ABSG = 2 
       data hash MD5: 128K
       2D B4 86 73 CD F4 62 2D FF 94 A3 4B 4D 5C 24 39>)
(   6,<2012-05-14 19:08:42.250 -0500>,<Administrator>,<TOPSPIN>,<proc1d>,<TOPSPIN 2.1>,
      <abs ABSG = 3 
       data hash MD5: 128K
       A2 0C A4 00 48 D6 24 B7 38 C5 CF 50 85 45 4C B1>)
(   7,<2012-05-14 19:08:42.484 -0500>,<Administrator>,<TOPSPIN>,<proc1d>,<TOPSPIN 2.1>,
      <abs ABSG = 4 
       data hash MD5: 128K
       69 A7 A7 BF C1 48 78 35 AF 5B AC C7 DA 35 4B 4A>)
(   8,<2012-05-14 19:08:42.531 -0500>,<Administrator>,<TOPSPIN>,<proc1d>,<TOPSPIN 2.1>,
      <abs ABSG = 5 
       data hash MD5: 128K
       DC 76 05 20 4F B4 DB 2B 11 73 B6 68 79 1A 84 55>)
$$ ##END=
$$ 
$$ $$ hash MD5
$$ $$ 3A F1 DA 19 43 58 30 26 CE 59 F4 4C 44 ED FB 5E
##$RELAX= 
##$RELAX= 
##$RELAX= 
##$RELAX= 
##$RELAX= 
##$RELAX= 
##$RELAX= 
##$RELAX= 
$$ Bruker specific parameters
$$ [...]
##$TP07= 0
##$TPNAME0= <>
##$TPNAME1= <>
##$TPNAME2= <>
##$TPNAME3= <>
##$TPNAME4= <>
##$TPNAME5= <>
##$TPNAME6= <>
##$TPNAME7= <>
##$TPOAL= (0..7)
0.5 0.5 0.5 0.5 0.5 0.5 0.5 0.5
##$TPOFFS= (0..7)
0 0 0 0 0 0 0 0
##$TUNHIN= 0
##$TUNHOUT= 0
##$TUNXOUT= 0
##$USERA1= <user>
##$USERA2= <user>
##$USERA3= <user>
##$USERA4= <user>
##$USERA5= <user>
##$V9= 5
##$VALIST= <valist>
##$VCLIST= <CCCCCCCCCCCCCCC>
##$VD= 0
##$VDLIST= <DDDDDDDDDDDDDDD>
##$VPLIST= <PPPPPPPPPPPPPPP>
##$VTLIST= <TTTTTTTTTTTTTTT>
##$WBST= 2048
##$WBSW= 25
##$XGAIN= (0..3)
0 0 0 0
##$XL= 0
##$YL= 0
##$YMAX_a= 11715197
##$YMIN_a= -6179296
##$ZGOPTNS= <>
##$ZL1= 120
##$ZL2= 120
##$ZL3= 120
##$ZL4= 120
##$ABSF1= 14.96697
##$ABSF2= -5.58556
##$ABSG= 5
##$ABSL= 3
##$ALPHA= 0
##$AQORDER= 0
##$ASSFAC= 0
##$ASSFACI= 0
##$ASSFACX= 0
##$ASSWID= 0
##$AUNMP= <proc_prof1d_extract.lims>
##$AXLEFT= 0
##$AXNAME= <>
##$AXNUC= <1H>
##$AXRIGHT= 0
##$AXTYPE= 0
##$AXUNIT= <>
##$AZFE= 0.1
##$AZFW= 0.1
##$BCFW= 0
##$BC_mod= 0
##$BYTORDP= 0
##$COROFFS= 0
##$CY= 15
##$DATMOD= 1
##$DC= 0
##$DFILT= <>
##$DTYPP= 0
##$F1P= 0
##$F2P= 0
##$FCOR= 0.5
##$FTSIZE= 131072
##$FT_mod= 6
##$GAMMA= 0
##$GB= 0
##$INTBC= 1
##$INTSCL= 1
##$ISEN= 128
##$LB= 0.3
##$LEV0= 0
##$LPBIN= 0
##$MAXI= 10000
##$MC2= 0
##$MEAN= 0
##$ME_mod= 0
##$MI= 0
##$NCOEF= 0
##$NC_proc= -3
##$NLEV= 6
##$NOISF1= 0
##$NOISF2= 0
##$NSP= 0
##$NTH_PI= 0
##$NZP= 0
##$OFFSET= 14.96697
##$PC= 1
##$PHC0= 39.08936
##$PHC1= 0
##$PH_mod= 1
##$PKNL= yes
##$PPARMOD= 0
##$PPDIAG= 0
##$PPIPTYP= 0
##$PPMPNUM= 2147483647
##$PPRESOL= 1
##$PSCAL= 4
##$PSIGN= 0
##$PYNMP= <proc.py>
##$REVERSE= no
##$SF= 400.130005460122
##$SI= 131072
##$SIGF1= 0
##$SIGF2= 0
##$SINO= 400
##$SIOLD= 131072
##$SPECTYP= <>
##$SREGLST= <1H.CDCl3>
##$SSB= 0
##$STSI= 131072
##$STSR= 0
##$SW_p= 8223.68421052632
##$SYMM= 0
##$S_DEV= 0
##$TDeff= 65536
##$TDoff= 0
##$TI= <>
##$TILT= no
##$TM1= 0
##$TM2= 0
##$TOPLEV= 0
##$USERP1= <user>
##$USERP2= <user>
##$USERP3= <user>
##$USERP4= <user>
##$USERP5= <user>
##$WDW= 1
##$XDIM= 131072
##$YMAX_p= 446878012
##$YMIN_p= -72365226
##$CURPLOT= <Network HP LaserJet P1505>
##$CURPRIN= <$Network HP LaserJet P1505>
##$DFORMAT= <normdp>
##$LAYOUT= <+/1D_H.xwp>
##$LFORMAT= <normlp>
##$PFORMAT= <normpl>
##$SURQMSG= 1
$$ End of Bruker specific parameters
$$ ---------------------------------
##NTUPLES= NMR SPECTRUM
##VAR_NAME=  FREQUENCY,     SPECTRUM/REAL,   SPECTRUM/IMAG
##SYMBOL=    X,             R,               I
##VAR_TYPE=  INDEPENDENT,   DEPENDENT,       DEPENDENT
##VAR_FORM=  AFFN,          ASDF,            ASDF
##VAR_DIM=   131072,        131072,          131072
##UNITS=     HZ,            ARBITRARY UNITS, ARBITRARY UNITS
##FACTOR=    0.0627417313425165, 1,          1
##FIRST=     8223.62146879498, -4494,        -118809
##LAST=      0,             -1446,           -119675
##MIN=       0,             -72365226,       0
##MAX=       8223.62146879498, 446878012,    0
$$ Real data points
##PAGE= N=1
##DATA TABLE= (X++(R..R)), XYDATA
$$ [...]
63563F30748J0975J0604J0698J1670J3464J6031J9058K1690K3251K4130K5296
63552H17615K7012K8779L0392L2265L4498L6398L7422L8072L9386M1683M4151
63541A207673M5467M4632M1490L6792L1669K6724K1598J5612Q790K163k970o111
63529A473529p906r538j1743j4403j7063j9621k2381k5556k8891l1744l3422l3670
63517A217591l2954l2060l1138k9526k6842k3830k1439j9272j5991j1417p275
63506I65847n222m765l867j290K326N537P623R018J0637J2871J5096J6356J6657
63493A046824J7135J8674K0860K2939K5324K9077L4027L8416M0852M1808M2843
63482A378779M4915M7838N0641N1797M9678M3636L4637K4471J4612O006o45n193
$$ plain form
63563 630748 641723 652327 663025 674695 688159 704190 723248 744938 768189 792319 817615
63552 817615 844627 873406 903798 936063 970561 1006959 1044381 1082453 1121839 1163522 1207673
63541 1207673 1253140 1297772 1339262 1376054 1407723 1434447 1456045 1471657 1480447 1482610 1479640 1473529
63529 1473529 1465623 1456085 1444342 1429939 1412876 1393255 1370874 1345318 1316427 1284683 1251261 1217591
63517 1217591 1184637 1152577 1121439 1091913 1065071 1041241 1019802 1000530 984539 973122 965847
63506 965847 960625 955860 951993 950703 953029 958566 966189 975207 985844 998715 1013811 1030167 1046824
63493 1046824 1063959 1082633 1103493 1126432 1151756 1180833 1214860 1253276 1294128 1335936 1378779
63482 1378779 1423694 1471532 1522173 1573970 1623648 1667284 1701921 1726392 1741004 1747010 1746365 1741172
63470A741172q280j0612j2367j3897j6397k0728k5984l0528l4258l8346m2663
63459A487112m5354m5688m5533m6722m8338m8279m6434m4510m3218m1593l8920
63448I92523l5626l2171k8748k6125k5098k4729k2956j9516j6442j4871j3268
63437G32973j0300p583p496r355j0025p996m833k596j696j600j927k154j511J3
63423F63914J236J019m90k052k310o60K212M647N523N336N100M688L391J724R18
63408F94196O46p85l452n063m285k962l393m917n186l810k488k022j486m22L22
63393F54893M80J197L054M774N143M998O025Q277J0271J1203J1747J2647J3701
63380G48410J4565J5616J7412J9731K1856K3624K5539K7849L0109L2056L4346
$$ plain form
63470 1741172 1732892 1722280 1709913 1696016 1679619 1658891 1632907 1602379 1568121 1529775 1487112
63459 1487112 1441758 1396070 1350537 1303815 1255477 1207198 1160764 1116254 1073036 1031443 992523
63448 992523 956897 924726 895978 869853 844755 820026 797070 777554 761112 746241 732973
63437 732973 722673 715090 707594 698239 688214 680218 675385 672789 671093 669493 667566 665412 663901 663914
63423 663914 665150 666169 665679 663627 661317 660657 662869 667516 673039 678375 683475 688163 691554 693278 694196
63408 694196 694842 694057 690605 685542 681257 678295 674902 669985 664799 660989 658501 656479 654993 654571 654893
63393 654893 655373 656570 659624 664398 669541 674539 680564 688841 699112 710315 722062 734709 748410
63380 748410 762975 778591 796003 815734 837590 861214 886753 914602 944711 976767 1011113
63369A011113L7710M1552M4089M4049M1624L7665L2799K7904K4570K3945K5366
63358A392386K7055K8163K9353L1431L4308L7476M0601M3235M4635M4346M2431
63347A795420L8807L3025K5258J6976R845M244n88n222r546j3357j6698j9604
63335A858560k2159k4908k8572l3147l7778m1794m5331m8546n0700n0748m8747
63324A426130m6102m4109m2692m0773l7595l3332k8709k4478k1206j8875j6566
63313A071693j3036q115l154L79K505M397O733R149J1343J3889J7453K1678K5382
63300A160296K7766K9168L0721L3413L7286M1414M4815M7328M9334N0781N1085
63289A603407N0114M8501M6517M3253L7504K9252J9770J0581K782l009o835r539
$$ plain form
63369 1011113 1048823 1090375 1134464 1178513 1220137 1257802 1290601 1318505 1343075 1367020 1392386
63358 1392386 1419441 1447604 1476957 1508388 1542696 1580172 1620773 1664008 1708643 1752989 1795420
63347 1795420 1834227 1867252 1892510 1909486 1919331 1923575 1922987 1917765 1908219 1894862 1878164 1858560
63335 1858560 1836401 1811493 1782921 1749774 1711996 1670202 1624871 1576325 1525625 1474877 1426130
63324 1426130 1380028 1335919 1293227 1252454 1214859 1181527 1152818 1128340 1107134 1088259 1071693
63313 1071693 1058657 1050542 1047388 1047767 1050272 1054669 1061402 1070551 1081894 1095783 1113236 1134914 1160296
63300 1160296 1188062 1217230 1247951 1281364 1318650 1360064 1404879 1452207 1501541 1552322 1603407
63289 1603407 1653521 1702022 1748539 1791792 1829296 1858548 1878318 1888899 1891681 1888672 1881837 1872298
63277A872298j2114j4871j7575k0258k3406k7340l1869l6457m0414m3099m4414
63266A560481m5035m5640m5977m5180m2902l9657l6185l3043l0519k8141k4588
63255A143614j9165j3578j1026j3080j8172k3390k6821k7889k6870k4982k3890
63244I14751k3855k3130k0334j6732j4816j5039j5395j4112j1312q078n336l987
63232G42625m642o505p587o825n243m422m654n225n668n825n399m452l869m395
63218F67914n384n502m475l302k718k349j482KJ643K711K421O05j550k117l51
63203F46066K411M280M939N620P135Q653Q763P300N643N238O256P776Q944R639
63189G38663J0265J1273J2831J4616J5975J6681J7413J8994K1295K3528K5522
$$ plain form
63277 1872298 1860184 1845313 1827738 1807480 1784074 1756734 1724865 1688408 1647994 1604895 1560481
63266 1560481 1515446 1469806 1423829 1378649 1335747 1296090 1259905 1226862 1196343 1168202 1143614
63255 1143614 1124449 1110871 1099845 1086765 1068593 1045203 1018382 990493 963623 938641 914751
63244 914751 890896 867766 847432 830700 815884 800845 785450 771338 760026 751948 746612 742625
63232 742625 737983 731478 723891 717066 711823 707401 702747 697522 691854 686029 680630 676178 672309 667914
63218 667914 662530 657028 652553 649251 646533 644184 642702 642704 644347 647058 649479 650084 648534 646417 646066
63203 646066 648477 652757 657696 663316 670451 679104 687867 695167 700810 706048 712304 720080 729024 738663
63189 738663 748928 760201 773032 787648 803623 820304 837717 856711 878006 901534 927056
63178I27056K7765L0042L1257L1299L1829L4112L6977L8423L8575L9240M0780
63167A307355M1450M0351L9094L9495M1064M2035M1844M1246M0638L9775L8792
63156A753139L8140L7516L5941L2984K9007K4248J8627J2493O511N96o062j3476
63144A969664k0335k5501k9254l2348l4558l5104l4075l2503l1110k9680k7616
63133A637580k4523k0237j5005r732n320j498L001Q740J4643J9306K2769K6120
63121A655844K9692L2538L3850L4030L3981L3996L3817L3341L2704L1960L1102
63110B016855L0146K8733K6086K1913J7016J2283P347J091o586j4488k1628k8190
63098B090578l4663m0938m6610n1433n5092n7283n8416n9268n9506n7593n3034
$$ plain form
63178 927056 954821 984863 1016120 1047419 1079248 1113360 1150337 1188760 1227335 1266575 1307355
63167 1307355 1348805 1389156 1428250 1467745 1508809 1550844 1592688 1633934 1674572 1714347 1753139
63156 1753139 1791279 1828795 1864736 1897720 1926727 1950975 1969602 1982095 1988606 1989202 1983140 1969664
63144 1969664 1949329 1923828 1894574 1862226 1827668 1792564 1758489 1725986 1694876 1665196 1637580
63133 1637580 1613057 1592820 1577815 1568083 1562763 1561265 1564266 1573006 1587649 1606955 1629724 1655844
63121 1655844 1685536 1718074 1751924 1785954 1819935 1853931 1887748 1921089 1953793 1985753 2016855
63110 2016855 2047001 2075734 2101820 2123733 2140749 2153032 2160379 2161470 2154884 2140396 2118768 2090578
63098 2090578 2055915 2014977 1968367 1916934 1861842 1804559 1746143 1686875 1627369 1569776 1516742
63087A516742m7739m4027m1990m0088l7690l5533l3909l2031k9388k6330k3043
63076A124974j9270j5545j3384j3382j4034j3312j0824p687m834k379l06J077
63064A011094J610J785K545M418O680P726O768M958M150M754N682O234O656O744
63050A081804N573L373K157L274N413O399N971N367M967M114K882K204K256K223
63036A137977J783J432J214O41Q9P54K723M502N125N334N934O391O085N727O138
63021A191849O648O146N097M977O069P358Q487J0329J3279J6318J8363J9672K1268
63008A335860K3558K6041K8069K9443L0602L2429L5592L9850M4233M8005N1214
62997A724896N4310N7611O1206O5003O8868P2914P7573Q2893Q7878R1219R2914
$$ plain form
63087 1516742 1469003 1424976 1382986 1342898 1305208 1269675 1235766 1203735 1174347 1148017 1124974
63076 1124974 1105704 1090159 1076775 1063393 1049359 1036047 1025223 1017536 1012702 1010323 1010017 1011094
63064 1011094 1012704 1014489 1017034 1021452 1028132 1035858 1042626 1047584 1051734 1056488 1062170 1068404 1075060 1081804
63050 1081804 1087377 1090750 1092907 1096181 1101594 1107993 1113964 1119331 1124298 1128412 1131294 1133498 1135754 1137977
63036 1137977 1139760 1141192 1142406 1143047 1143136 1143890 1146613 1151115 1156240 1161574 1167508 1173899 1179984 1185711 1191849
63021 1191849 1198497 1204643 1209740 1214717 1220786 1228144 1236631 1246960 1260239 1276557 1294920 1314592 1335860
63008 1335860 1359418 1385459 1413528 1442971 1473573 1506002 1541594 1581444 1625677 1673682 1724896
62997 1724896 1779206 1836817 1898023 1963026 2031894 2104808 2182381 2265274 2353152 2444371 2537285
62986B537285R4465R7144J00463J02729J02821J01142R9114R7924R7547R6798
62976C527432R4573R1100Q7607Q4881Q2626Q0004P5959O8922N7544M2458K6412
62965D319518J1711j907j6044l1036m5596n8553o9692p8966q6083r0898r3274
62954C759180r2626q8604q2240p5276o8219o0098n0259l9322k8152j7146o878
62943C150360J948R859J8600K8839L8878M6667N2005N5869N8650O0438O1966O3635
62931C647714O4322O2782N9830N7260N4914N0784M4071L6170K8143J9120Q046
62920D133156m672j8293l2924m8331o2878p5191q5960r6456j05946j12411j15581
62909C374513j17417j19236j19910j17696j12807j07159j02168r7607r2516q6533
$$ plain form
62986 2537285 2631750 2728894 2829357 2932086 3034907 3136049 3235163 3333087 3430634 3527432
62976 3527432 3622005 3713105 3800712 3885593 3968219 4048223 4124182 4193104 4250648 4293106 4319518
62965 4319518 4331229 4329322 4313278 4282242 4236646 4178093 4108401 4029435 3943352 3852454 3759180
62954 3759180 3666554 3577950 3495710 3420434 3352215 3292117 3241858 3202536 3174384 3157238 3150360
62943 3150360 3152308 3162167 3180767 3209606 3248484 3295151 3347156 3403025 3461675 3522113 3584079 3647714
62931 3647714 3712036 3774818 3834648 3891908 3946822 3997606 4041677 4077847 4105990 4125110 4133156
62920 4133156 4128484 4110191 4077267 4028936 3966058 3890867 3804907 3708451 3602505 3490094 3374513
62909 3374513 3257096 3137860 3017950 2900254 2787447 2680288 2578120 2480513 2387997 2301464
62899B301464q0228p4488o9721o5588o1562n7677n4486n2130m9821m6706m3204
62888A645853m0803m0134l9809l7953l4668l1933l0829l0144k8390k6186k5177
62877A279827k5264k4565k2202j9486j7894j7224j6439j5193j3690j1983j0367
62866A085520r663j0004r952p911m291j355r77l009n682p069o525n179m709n362
62852A003832n778n126m417m991o499p467p239o305n228m384m277m967n491n002
62838I26661m102l911m290m250l641l003k148o59M62l56k526l521k240l27N67
62823H92716Q64J434J748J048j21r19j474j820r97J190K724J686p64j766o42O28
62807H95535O36K13M51R77R30L53l04j055j931k336j747o18L7r4l01K32J416K290
$$ plain form
62899 2301464 2221236 2146748 2077027 2011439 1949877 1892200 1837714 1785584 1735763 1689057 1645853
62888 1645853 1605050 1564916 1525107 1487154 1452486 1420553 1389724 1359580 1331190 1305004 1279827
62877 1279827 1254563 1229998 1207796 1188310 1170416 1153192 1136753 1121560 1107870 1095887 1085520
62866 1085520 1075857 1065853 1055901 1047990 1043699 1042344 1041367 1038358 1032676 1025607 1019082 1013903 1009194 1003832
62852 1003832 998054 992928 988511 983520 977021 969554 962315 956010 950782 946398 942121 937154 931663 926661
62838 926661 922559 918648 914358 910108 906467 903464 901316 900657 901119 900763 898237 894716 892476 892149 892716
62823 892716 893580 895014 896762 897810 897689 896770 895296 893476 892479 893669 896393 898079 897315 895549 894907 895535
62807 895535 896171 896384 896835 897812 898742 899095 898791 897736 895805 893469 891722 891104 891141 891047 890746 890978 892394 894684
62789H94684K068J120N71R78J776K165J967J371O06K52R76K244K205k2k685l330
62773I06946j801QR19J258J208L50p46n09J324K945L083K886L999N952P001O701
62757I41524O128N999O124O473P412Q655R262R075R152J0350J2167J3481J3949
62744A059751J4119J4483J4941J5228J5584J6788J9432K3068K6337K8196K8956
62733A276883K9906L1970L4943L8060M1021M4326M8711N4339O0601O6765P2713
62722A800238P8774Q5030R1280R7707J04900J12881J20697J27456J33134J37737
62712B889834J40237J39401J35412J29528J21941J11131R5858P7011N6780L6612
62702C933745J6556l735k4196m4308o3239q0016r4069j05517j14523j20726j24046
$$ plain form
62789 894684 896752 897872 898443 899421 901197 903362 905329 906700 907306 907558 908534 910778 912983 912961 910276 906946
62773 906946 905145 905153 906072 907330 908538 908888 908142 907633 908957 911902 914985 917871 921870 927822 934823 941524
62757 941524 947652 953651 959775 966248 973660 982315 991577 1000652 1009804 1020154 1032321 1045802 1059751
62744 1059751 1073870 1088353 1103294 1118522 1134106 1150894 1170326 1193394 1219731 1247927 1276883
62733 1276883 1306789 1338759 1373702 1411762 1452783 1497109 1545820 1600159 1660760 1727525 1800238
62722 1800238 1879012 1964042 2055322 2153029 2257929 2370810 2491507 2618963 2752097 2889834
62712 2889834 3030071 3169472 3304884 3434412 3556353 3667484 3763342 3840353 3897133 3933745
62702 3933745 3950301 3946566 3922370 3878062 3814823 3734807 3640738 3535221 3420698 3299972 3175926
62691C175926j25668j27128j28150j26669j21749j15492j10803j07740j03527
62682B109000r6287q7377p9477p3504o8393o3158n7848n2615m7133m1331l5860
62671A406017l1254k7152k2930j8715j5140j2292r606o767m155k032M0K436M525
62658A262975N401N629P321J1782J7673K2427K5288K7914L1824L6382M0093M3024
62646A537733M6722N1972N7854O3347O8940P5975Q4780R4195J02853J10399J17297
62635B412067J23671J28850J32170J33946J35014J35328J33501J28159J19122
62626C581828J06767R0952P1633N0200K8821Q207j2788l4916n6891p6700r3556
62615C663557j07544j18247j25177j29290j32499j35321j36166j33615j28492
$$ plain form
62691 3175926 3050258 2923130 2794980 2668311 2546562 2431070 2320267 2212527 2109000
62682 2109000 2012713 1925336 1845859 1772355 1703962 1640804 1582956 1530341 1483208 1441877 1406017
62671 1406017 1374763 1347611 1324681 1305966 1290826 1278534 1268928 1262161 1258006 1255974 1256014 1258450 1262975
62658 1262975 1268376 1274005 1281326 1293108 1310781 1333208 1358496 1386410 1418234 1454616 1494709 1537733
62646 1537733 1584455 1636427 1694281 1757628 1826568 1902543 1987323 2081518 2184371 2294770 2412067
62635 2412067 2535738 2664588 2796758 2930704 3065718 3201046 3334547 3462706 3581828
62626 3581828 3688595 3779547 3851180 3901380 3930201 3938408 3925620 3890704 3833813 3757113 3663557
62615 3663557 3556013 3437766 3312589 3183299 3050800 2915479 2779313 2645698 2517206
62606B517206j22945j17987j12965j07168j00960r4922q8691q1474p3517o6216
62596A550361o0544n5975n1433m6851m3059m0247l7494l4023l0253k7144k5003
62585A098335k3391k1838k0135j8186j6082j4190j2820j1957j1506j1336j0752
62574I26142q635m933j530n16j748l129l330k956k722j988n3K027K374P48j015
62559H98736j127M57K502L829L941L202K892M402P729J1043J2518J2488J3130
62546I75742J5860J9733K2736K4118K4855K6087K7942L0060L2565L5971M0230
62535A275899M4418M7541M9646N2000N5864O0890O4987O6187O4606O1910N8900
62524A902848N4587M7981L9829L1553K3161J3394J845j0186k1087l0204l7562
$$ plain form
62606 2517206 2394261 2276274 2163309 2056141 1955181 1860259 1771568 1690094 1616577 1550361
62596 1550361 1489817 1433842 1382409 1335558 1292499 1252252 1214758 1180735 1150482 1123338 1098335
62585 1098335 1074944 1053106 1032971 1014785 998703 984513 971693 959736 948230 936894 926142
62574 926142 917507 912574 911044 910528 908780 905651 902321 899365 896643 894655 894602 896629 899003 899751 898736
62559 898736 897609 898066 900568 904397 908338 911540 914432 918834 926563 937606 950124 962612 975742
62546 975742 991602 1011335 1034071 1058189 1083044 1109131 1137073 1167133 1199698 1235669 1275899
62535 1275899 1320317 1367858 1417504 1469504 1525368 1586258 1651245 1717432 1782038 1843948 1902848
62524 1902848 1957435 2005416 2045245 2076798 2099959 2113353 2115198 2105012 2083925 2053721 2016159
62513B016159m3313m7836n1606n4522n6051n6424n6759n7466n7376n5373n2190
62502A427243m9457m7356m4454l9952l5024l1483k9793k8847k7276k4628k1408
62491A047565j8307j5403j2268q852n933m336l941l978m028m179m266l669k104
62478I56301o2J718K963L918N024O565Q312R542R765R410R411J0142J1340J2939
62464A057288J5334J8702K2731K7095L1594L5728L8957M1673M5060M9698N4940
62453A438800O0036O4863O9204P2372P4374P6383P8933Q0564P9517P6030P1454
62442B242530O5666N7293M6444L5241K5117J5271M629o072j5175k2031k6926k9903
62430B392084l0811k9943k7686k3893j8494j2215n867O79P807J4879K0816K5818
$$ plain form
62513 2016159 1972846 1925010 1873404 1818882 1762831 1706407 1649648 1592182 1534806 1479433 1427243
62502 1427243 1377786 1330430 1285976 1246024 1211000 1179517 1149724 1120877 1093601 1068973 1047565
62491 1047565 1029258 1013855 1001587 992735 986802 982466 978525 974547 970519 966340 962074 958405 956301
62478 956301 956239 957957 960920 964838 969862 976427 984739 994281 1004046 1013456 1022867 1033009 1044349 1057288
62464 1057288 1072622 1091324 1114055 1141150 1172744 1208472 1247429 1289102 1334162 1383860 1438800
62453 1438800 1498836 1563699 1632903 1705275 1779649 1856032 1934965 2015529 2095046 2171076 2242530
62442 2242530 2308196 2365489 2411933 2447174 2472291 2487562 2492191 2486119 2470944 2448913 2421987 2392084
62430 2392084 2361273 2331330 2303644 2279751 2261257 2249042 2243175 2243854 2251661 2266540 2287356 2313174
62418B313174L1331L8137M5352N1548N5951N8216N7899N4638M8465L9675K8868
62407B823254J7223N940m913j6345k8904m1842n4215o5911p6766q5424r0358r1910
62395B289829r2169r2469r1926q8931q3387p6848p0830o5729o1253n7070n2801
62384A456416m7839m1770l4941k8425k3271j9725j7045j4105j0482o991m911m488
62372A202423m565m051l454m269o765r197r648q285p261q519j2010j5892j8127
62359A090380j7996j6430j4999j4532j4739j4953j4834j4205j2909j1316j0389
62348I33078j0649j1283j1048r758q218o909n639m447l800l655l170j889n03k1
62334H52089n94j501j814q20J529M222N832O022N747N660N251M297M166O369J0227
$$ plain form
62418 2313174 2344505 2382642 2427994 2479542 2535493 2593709 2651608 2706246 2754711 2794386 2823254
62407 2823254 2840477 2846417 2841504 2825159 2796255 2754413 2700198 2634287 2557521 2472097 2381739 2289829
62395 2289829 2197660 2105191 2013265 1924334 1840947 1764099 1693269 1627540 1566287 1509217 1456416
62384 1456416 1408577 1366807 1331866 1303441 1280170 1260445 1243400 1229295 1218813 1211822 1206911 1202423
62372 1202423 1197858 1193807 1190353 1186084 1179319 1170122 1160474 1152189 1144928 1136409 1124399 1108507 1090380
62359 1090380 1072384 1055954 1040955 1026423 1011684 996731 981897 967692 954783 943467 933078
62348 933078 922429 911146 900098 890340 882122 875213 869574 865127 861327 857672 854502 852613 852110 852089
62334 852089 851495 849994 848180 847360 848889 853111 858943 864965 870712 876372 881623 885920 890086 896455 906682
62319I06682J3340J4315J3802J2891J1923J1311J2096J4669J7783J9955K1296
62308A070063K2920K4870K5983K5971K6366K8658L2365L5930L9004M2551M6708
62297A421389N0026N1735N3620N8216O5294P1717P5150P6600P8404Q0572Q0482
62286B163205P5911O7191N6248M4563L2680K1013J0314J138o720j4172k2111l0704
62274B398556l9251m6650n2050n5240n6644n6940n6460n5001n2392m9118m5916
62263A832894m2950l9991l7420l6104l5955l5632l4312l3040l3337l5074l6605
62252A432474l6712l5544l3941l2651l1994l1497l0151k7794k5629k4425k2948
62241A099188j9630j5298j2360j1351j0288p811n066l690l601l805l955l903l031
$$ plain form
62319 906682 920022 934337 948139 961030 972953 984264 996360 1011029 1028812 1048767 1070063
62308 1070063 1092983 1117853 1143836 1169807 1196173 1224831 1257196 1293126 1332130 1374681 1421389
62297 1421389 1471415 1523150 1576770 1634986 1700280 1771997 1847147 1923747 2002151 2082723 2163205
62286 2163205 2239116 2306307 2362555 2407118 2439798 2460811 2471125 2472263 2465543 2451371 2429260 2398556
62274 2398556 2359305 2312655 2260605 2205365 2148721 2091781 2035321 1980320 1927928 1878810 1832894
62263 1832894 1789944 1749953 1712533 1676429 1640474 1604842 1570530 1537490 1504153 1469079 1432474
62252 1432474 1395762 1360218 1326277 1293626 1261632 1230135 1199984 1172190 1146561 1122136 1099188
62241 1099188 1079558 1064260 1051900 1040549 1030261 1022450 1017384 1013694 1010093 1006288 1002333 998430 995399
62228I95399j170P06J830K733M028N262O041P009Q450R171Q414P694Q785J0876
62214A075228J1954J2214J3571J6043J7415J6981J6997J9481K3635K7611L0955
62203A282085L4049L6622L8375M0069M2786M6766N1824N7879O4217O9414P3176
62192A837262P7203Q2866Q8664R1486Q9906Q5032P8499P0906O2105N1909M0329
62181B656167K7844J5299L097r086k1355l3026m3678n3836o3590p1538p6420p9052
62169B250826q1062q2353q1695p9434p7368p5782p2819o7553o1701n7123n3322
62158A460614m8738m3352l8416l4495l1222k8420k6093k3634k0376j6842j4279
62147A134747j2970j2009j0806r707q859p518n097k376q95j189k079j797K89L145
$$ plain form
62228 995399 994229 994935 996765 999498 1003526 1008788 1014829 1021838 1030288 1039459 1047873 1055567 1064352 1075228
62214 1075228 1087182 1099396 1112967 1129010 1146425 1163406 1180403 1199884 1223519 1251130 1282085
62203 1282085 1316134 1352756 1391131 1431200 1473986 1520752 1572576 1630455 1694672 1764086 1837262
62192 1837262 1914465 1997331 2085995 2177481 2267387 2352419 2430918 2501824 2563929 2615838 2656167
62181 2656167 2684011 2699310 2702407 2693321 2671966 2638940 2595262 2541426 2477836 2406298 2329878 2250826
62169 2250826 2169764 2087411 2005716 1926282 1848914 1773132 1700313 1632760 1571059 1513936 1460614
62158 1460614 1411876 1368524 1330108 1295613 1264391 1235971 1209878 1186244 1165868 1149026 1134747
62147 1134747 1121777 1109768 1098962 1089255 1080396 1072878 1067781 1065405 1064510 1063321 1061242 1059445 1059734 1062879
62133A062879N266O285P133Q627J0457J1907J3039J4469J6133J7140J7059J6656
62121A207050J6891J7619J7829J7011J5740J4869J4661J4954J5753J7149J8851
62110A388377K0383K1854K4029K7310L1067L4377L7157M0077M3572M7411N1162
62099A766776N4518N7179N8738N8715N6415N1141M3135L4094K5923J8978J2231
62088B237843N106j849q220j4517k1223k7928l3993l9182m3111m4962m4646m3454
62076A919864m2545m1354l8593l4376l0146k6689k3397j9614j5705j2519j0455
62065A624471r382q875q389p547o460n406m266k565p7K896N552O765N750L066
62051A595533L91j302k685m506n939n797m734m635n902p088p411q002r995j2777
$$ plain form
62133 1062879 1068145 1074430 1081563 1090190 1100647 1112554 1125593 1140062 1156195 1173335 1190394 1207050
62121 1207050 1223941 1241560 1259389 1276400 1292140 1307009 1321670 1336624 1352377 1369526 1388377
62110 1388377 1408760 1430614 1454643 1481953 1513020 1547397 1584554 1624631 1668203 1715614 1766776
62099 1766776 1821294 1878473 1937211 1995926 2052341 2103482 2146617 2180711 2206634 2225612 2237843
62088 2237843 2242949 2241100 2232880 2218363 2197140 2169212 2135219 2096037 2052926 2007964 1963318 1919864
62076 1919864 1877319 1835965 1797372 1762996 1732850 1706161 1682764 1663150 1647445 1634926 1624471
62065 1624471 1615089 1606214 1597825 1590278 1583818 1578412 1574146 1571581 1571504 1574400 1579952 1586717 1592467 1595533
62051 1595533 1595924 1594622 1591937 1587431 1581492 1575695 1570961 1566326 1560424 1553336 1545925 1537923 1527928 1515151
62037A515151j4815j5169j3571j0135n921k764j589j473r80K16J631K910L809
62024A457300M139M599O641J0514J4272J5907J5801J5809J6682J7793J8940K0730
62012A619127K3164K5432K7258K9203L1345L2951L3810L4683L5936L6787L6620
62001A966316L6156L6613L8287M0515M2389M2918M1197L7160L1805K6095K0046
61990B359497J3431O811R43m600j1237j9647k8920l7513m4606n0290n5070n9400
61978B069399o3249o5801o6051o4097o1466n9548n7981n5349n1449m7870m5927
61967A430611m4866m2945l9762l6420l3666l1062k8239k5832k4547k3967k3049
61956A076256k1377j9342j7492j6223j5673j5380j4380j2289r955q388p386n951
$$ plain form
62037 1515151 1500336 1485167 1471596 1461461 1455540 1452776 1451187 1449714 1448734 1448950 1450581 1453491 1457300
62024 1457300 1461439 1466038 1472679 1483193 1497465 1513372 1529173 1544982 1561664 1579457 1598397 1619127
62012 1619127 1642291 1667723 1694981 1724184 1755529 1788480 1822290 1856973 1892909 1929696 1966316
62001 1966316 2002472 2039085 2077372 2117887 2160276 2203194 2244391 2281551 2313356 2339451 2359497
61990 2359497 2372928 2379739 2380682 2376082 2364845 2345198 2316278 2278765 2234159 2183869 2128799 2069399
61978 2069399 2006150 1940349 1874298 1810201 1748735 1689187 1631206 1575857 1524408 1476538 1430611
61967 1430611 1385745 1342800 1303038 1266618 1232952 1201890 1173651 1147819 1123272 1099305 1076256
61956 1076256 1054879 1035537 1018045 1001822 986149 970769 956389 944100 934145 925757 918371 912420
61944I12420l898k191j699k239k894k695j040J789M416N290M111K044N59L66J221
61929I15560K129J839j57l015n451p158q600r665r618q529p601p601p850p398
61915H36885o384n629n548o129p273q377q271o560m617m161n044n428m257k443
61901G56764j383j255j347j369j527j560o12J625M161N610N701N498O082P443
61887G83831Q865R950J0798J1380J1465J1243J1489J2775J4896J7232J9355K0984
61875I44263K1731K1388K0370J9545J9527K0300K1390K2241K2336K1228J8766
61864A173085J5542J2821J1501J0839Q845M484p89m397n266m419l240k225j452
61851A215329j011m36J239M074O691Q002Q755J0370J2704J4241J4285J3774J3537
$$ plain form
61944 912420 908522 906331 904632 902393 899499 896804 895764 897553 901969 907259 911370 913414 913973 914339 915560
61929 915560 917689 919528 919371 916356 910905 903747 895147 885482 875864 867335 859734 852133 844283 836885
61915 836885 830501 824872 819324 813195 805922 797545 789274 782714 778097 773936 768892 763464 759207 756764
61901 756764 755381 754126 752779 751410 749883 748323 747711 749336 753497 759107 764808 770306 776388 783831
61887 783831 792696 802646 813444 824824 836289 847532 859021 871796 886692 903924 923279 944263
61875 944263 965994 987382 1007752 1027297 1046824 1067124 1088514 1110755 1133091 1154319 1173085
61864 1173085 1188627 1201448 1212949 1223788 1232633 1237117 1236328 1231931 1226665 1222246 1219006 1216781 1215329
61851 1215329 1214318 1213882 1215121 1219195 1225886 1233888 1242643 1253013 1265717 1279958 1294243 1308017 1321554
61838A321554J2813J0214N701Q98k537m471o080q364j1193j3889j6259j8515k0381
61825A249491k1110k0609j9714j8896j7559j5354j3459j3304j4433j4945j4178
61814A065930j3563j4294j5334j4733j2227r342p204n475l605k021j415j480j204
61801I64033j02J607L906P094J0782J3746J5351J6534J8588K1485K4177K6205
61789A123406K8005K9856L1544L3139L5035L6937L7744L6859L4835L2328K9251
61778A488939K5364K1002J6588J2145P782M034J122j390l678n059n033m169l249
61765A554398k109l20J665K981L616M267N177N938O139N455L500K96l539p738
61751A579726j2831j8750k3835k6574k7699k9117l1148l2418l2286l1597l0954
$$ plain form
61838 1321554 1334367 1344581 1350282 1351180 1348643 1344172 1338092 1329728 1318535 1304646 1288387 1269872 1249491
61825 1249491 1228381 1207772 1188058 1169162 1151603 1136249 1122790 1109486 1095053 1080108 1065930
61814 1065930 1052367 1038073 1022739 1008006 995779 986437 979233 973758 970153 968132 966717 965237 964033
61801 964033 963931 965538 969444 976538 987320 1001066 1016417 1032951 1051539 1073024 1097201 1123406
61789 1123406 1151411 1181267 1212811 1245950 1280985 1317922 1355666 1392525 1427360 1459688 1488939
61778 1488939 1514303 1535305 1551893 1564038 1571820 1575854 1576976 1575586 1571908 1566849 1561816 1557647 1554398
61765 1554398 1552289 1551969 1553634 1556615 1560231 1564498 1569675 1575613 1581752 1587207 1590707 1591003 1587464 1579726
61751 1579726 1566895 1548145 1524310 1497736 1470037 1440920 1409772 1377354 1345068 1313471 1282517
61740A282517k9883k8084k6029k3955k1564j9127j7527j6803j5991j4840j4306
61729A054408j4740j4995j4154j2760j1531j0040p773n368l840l376l722m751
61717I47358n850n961n110m725n292n140l011m75J20r24j448r69j017k049k410
61702I03097q96J524L236L747L327K334J562J971L267L966L524L224M002M665
61688I42550L553J178l59k51O8j002l230n017n216m144l073k993l755m331l933
61673I10045k768j677j220j242j274j084q32o87l75M92J598J940J212O99J783
61658I06610L777M397K761P24N19J937K876K201Q62K93O89J171J002K02p83j687
61642I27551k701m065n393n825n175m569n237o807p518o284l987k433k491l615
$$ plain form
61740 1282517 1252634 1224550 1198521 1174566 1153002 1133875 1116348 1099545 1083554 1068714 1054408
61729 1054408 1039668 1024673 1010519 997759 986228 976188 968415 963047 959207 955831 952109 947358
61717 947358 941508 935547 930437 925712 920420 915280 912269 911794 911914 910990 909542 908573 907556 905507 903097
61702 903097 902201 903725 906961 910708 914035 916369 917931 919902 923169 927135 930659 933883 937885 942550
61688 942550 946103 947281 946922 946671 946739 945737 942507 937490 932274 928130 925057 922064 918309 913978 910045
61673 910045 907277 905600 904380 903138 901864 900780 899948 899261 898886 899378 900976 902916 904128 904827 906610
61658 906610 910387 914784 917545 918269 918788 920725 923601 925802 926664 926957 927646 928817 929819 930021 929238 927551
61642 927551 924850 920785 915392 909567 904392 899823 894586 887779 880261 873977 869990 867557 865066 861451
61628H61451m855n845o794p769q253p606o016m649m491n194n586n139m219l034
61614G82001j380K23L55j422l297l167j477p40k168m164m527l011r59N45J219
61599G58031R62m8r28p55K47R23O52O2J99J575L997O755Q864R588Q972P627N985
61582H12708M153K383J270J246K069K760K160J9k196k434o38O86m26k591l031
61567H18138j756j544l587n671n713m800m934n631n128l818l788n273o112n163
61553G55220l953m186n337n849n353m555l867l371l552m968p422j0044j1946j2404
61539F68413j1061q531o262n084m330l033j494q08j185j813k223k842l937m983
61525F10827n409n300m879l951k457j148r63j873k964l579l750l505k547j029
$$ plain form
61628 861451 856596 850751 843957 836188 827935 820329 814313 809664 805173 799979 794393 789254 785035 782001
61614 782001 780621 780844 781199 779777 776480 773313 771836 771096 768928 764764 760237 757226 756267 756812 758031
61599 758031 758993 758945 758017 757262 757509 758432 759084 759146 759345 760920 764917 771672 780536 790124 799096 806723 812708
61582 812708 816861 819244 820514 821760 823829 826589 828749 828768 826572 824138 823500 824186 823760 821169 818138
61567 818138 816382 814838 811251 805580 799867 795067 790133 784502 779374 775556 771768 766495 760383 755220
61553 755220 751267 747081 741744 735895 730542 725987 722120 718749 715197 710229 702807 692763 680817 668413
61539 668413 657352 648821 642559 637475 633145 630112 628618 627810 626625 624812 622589 619747 615810 610827
61525 610827 605418 600118 595239 591288 588831 587683 586720 584847 581883 578304 574554 571049 568502 567473
61511E67473P5O3m57l63M04R31Q75Q94J360J664J406J241J797K471K338J742J758
61494E85672K373K541K049K000K918L556K490K58j129o28O81J088L11l04L35J534
61478F05745J665M59l92N22K267K783J660M09Q6P7l22o05j12O77R18O92N58M43
61460F17530p3r03j760k843m085m332k544K95J858J306K73N90J999K815K132O79
61444F12937k66k41Q1l26j650k919l005j845k48J136K125K438J891J154J289K100
61428F14651K026L20j552j730m53M33J26l31Q6J007J656K086K650K985K555J810
61412F28325J788K572L081K599J703J281J319J288J258J682K263J966M82j050
61398F50557j320m12M56N42L10N62J311J846J670J138J041J633K208J916R00J80
$$ plain form
61511 567473 567548 567611 567154 566791 567195 568126 569001 569895 571255 572919 574325 575566 577363 579834 582172 583914 585672
61494 585672 588045 590586 592635 594635 597553 601109 603599 603857 602728 602100 602781 603869 604180 603876 604211 605745
61478 605745 607410 607869 607477 607999 610266 613049 614709 615118 615204 615281 614959 614354 614242 614919 615837 616529 617087 617530
61460 617530 617457 616554 614794 611951 607866 603534 600990 601285 603143 604449 604722 605312 607311 610126 612258 612937
61444 612937 612671 612430 612511 612185 610535 607616 604611 602766 602518 603654 605779 608217 610108 611262 612551 614651
61428 614651 616677 616997 615445 613715 613262 613695 613821 613490 613576 614583 616239 618325 620975 623960 626515 628325
61412 628325 630113 632685 635766 638365 640068 641349 642668 643956 645214 646896 649159 651125 651607 650557
61398 650557 649237 648825 649281 649823 650133 650695 652006 653852 655522 656660 657701 659334 661542 663458 664358 664538
61382F64538K94O11L89j01j93o8k48k0K141N963Q479P027K553j307k263j165J99
61365F86829J455K955M029L505J692M18Q14K009K520K116J581J305J041Q29J143
61350G14241J938K419K141J598J181K24j989m575n501l899j077J041J780J527
61336G11049O21p38j891k072j377n75m8L10K12q15j988j333J819N254O118M297
61320G18843K322K024K711K904K451K119K116K055J932K126K616K965L036L077
61306G53297L147K988K473J746R94M76O49J702L069L880M028M272N262O832Q337
61291H03152R156Q929P849O845P016Q482J0204J1103J1094J0791J0586J0328R768
61278I25303R003Q468Q457Q644Q251O846M845L041J878J518K112L358M058L065
$$ plain form
61382 664538 664832 665443 665832 665731 665538 665470 665222 665202 667343 673306 681785 688812 691365 690058 687795 686630 686829
61365 686829 688284 691239 695268 698773 700465 700883 701697 703706 706226 708342 709923 711228 712269 713098 714241
61350 714241 716179 718598 720739 722337 723518 723742 721753 717178 711677 707778 706701 707742 709522 711049
61336 711049 711670 710932 709041 706969 705592 705017 704969 705279 705491 704676 702688 701355 703174 708428 714546 718843
61320 718843 721165 723189 725900 728804 731255 733374 735490 737545 739477 741603 744219 747184 750220 753297
61306 753297 756444 759432 761905 763651 764645 765121 765770 767472 770541 774421 778449 782721 787983 794815 803152
61291 803152 812308 821237 829086 835931 842947 851429 861633 872736 883830 894621 905207 915535 925303
61278 925303 934306 942774 951231 959875 968126 974972 979817 982858 984736 986254 988366 991724 995782 998847
61264I98847P13j417k296k235j832j050K31J529K231K300K253K793M499P178R421
61249A023165R834Q944Q835J0394J2168J2711J2729J3666J5181J5635J4494J2666
61237A170422J0740Q480O032M079K484J01l513p201r559j0457j0699j0910j1227
61224A138772j1681j2295j2911j3086j2231j0144p630o149o253o748o048l888
61212A029708j067J856M523O028N662M273L519L793M197M422N048O004O515O877
61198A091358Q251J0180J0426Q369O414O474O997N603L086K284L819N520N897
61185A174678N634N518N084M076L322L246K996K007J229J633K483K224O04j192
61171A213542k232k689k964k805j711J55J948L060L737M503N299N686N834O413
$$ plain form
61264 998847 999560 998143 995847 993612 991780 990730 990961 992490 994721 997021 999274 1002067 1006566 1013744 1023165
61249 1023165 1032999 1041943 1050778 1061172 1073340 1086051 1098780 1112446 1127627 1143262 1157756 1170422
61237 1170422 1181162 1189642 1195674 1199753 1202237 1202338 1198825 1191624 1182065 1171608 1160909 1149999 1138772
61224 1138772 1127091 1114796 1101885 1088799 1076568 1066424 1058794 1052645 1046392 1039644 1033596 1029708
61212 1029708 1028641 1030497 1035020 1041048 1046710 1050983 1054502 1058295 1062492 1066914 1071962 1077966 1084481 1091358
61198 1091358 1099609 1109789 1120215 1128584 1134998 1141472 1148469 1154072 1157158 1159442 1163261 1168781 1174678
61185 1174678 1180312 1185830 1190914 1194990 1198312 1201558 1204554 1206561 1207790 1209423 1211906 1214130 1214734 1213542
61171 1213542 1211310 1208621 1205657 1202852 1201141 1201296 1203244 1206304 1210041 1214544 1219843 1225529 1231363 1237776
61157A237776P327P491O520N721O410P926Q576Q144Q001Q804R562R377Q727Q329
61143A348691P856O605M837L542L295M006N456P425R430J0953J1997J3035J4239
61130A451367J4997J4456J2672J0954J0576J1033J0330P409L608J028O6m88j413
61117A546595k360k994l587m291m950n717o896q108q733r206j0545j2389j2986
61104A453833j1692j0055r724j0519j1380j1925j2168j1968j1798j2815j5022
61093A324767j6539j6057j4778j4330j3983j1961q659o170n018l840k445k678
61081A208309n307q206r032q321q400j0086j1848j1934j0160p668n569m039k464
61068A105275m60J499K827L994O148R443J2542J4190J4715J5555J7671K0673K3273
$$ plain form
61157 1237776 1245103 1252594 1259114 1264835 1271245 1279171 1287747 1295891 1303892 1312696 1322258 1331635 1340362 1348691
61143 1348691 1356547 1363152 1367989 1371531 1374826 1378832 1384288 1391713 1401143 1412096 1424093 1437128 1451367
61130 1451367 1466364 1480820 1493492 1504446 1515022 1526055 1536385 1543794 1547402 1548430 1548496 1548008 1546595
61117 1546595 1544235 1541241 1537654 1533363 1528413 1522696 1515800 1507692 1498959 1489753 1479208 1466819 1453833
61104 1453833 1442141 1432086 1422362 1411843 1400463 1388538 1376370 1364402 1352604 1339789 1324767
61093 1324767 1308228 1292171 1277393 1263063 1249080 1237119 1228460 1222290 1217272 1213432 1210987 1208309
61081 1208309 1203002 1194796 1185764 1177443 1169043 1158957 1147109 1135175 1125015 1117347 1111778 1107739 1105275
61068 1105275 1104815 1106314 1109141 1113135 1119283 1128726 1141268 1155458 1170173 1185728 1203399 1224072 1247345
61055A247345K4497K4769K5648K8142L1458L3989L5133L5386L4977L3721L2088
61044A587153L1015L0482K9525K7987K6726K5616K3048J8380J3372R783O897L027
61032A833011j603n503q687j2553j7053k0341k1729k2996k5538k7914k7883k5863
61020A615348k4531k5147k6082k5406k3491k1943k0868j8833j5486j2608j1729
61009A389224j1752j0347p225m438l310k636o74K416N272P524R892J2518J4667
60996A401131J6187J7875J9987K1526K1874K2410K5392L1173L7289M0852M1534
60985A697230M1755M3918M7998N2216N5445N8126O1057O4439O8384P3272P8872
60974B342712Q4020Q7987R1624R6215J01719J07115J12116J17472J23641J30209
$$ plain form
61055 1247345 1271842 1296611 1322259 1350401 1381859 1415848 1450981 1486367 1521344 1555065 1587153
61044 1587153 1618168 1648650 1678175 1706162 1732888 1758504 1781552 1799932 1813304 1823087 1829984 1833011
61032 1833011 1831408 1825905 1817218 1804665 1787612 1767271 1745542 1722546 1697008 1669094 1641211 1615348
61020 1615348 1590817 1565670 1539588 1514182 1490691 1468748 1447880 1429047 1413561 1400953 1389224
61009 1389224 1377472 1367125 1359900 1355462 1352152 1349516 1348842 1351258 1356530 1364054 1373946 1386464 1401131
60996 1401131 1417318 1435193 1455180 1476706 1498580 1520990 1546382 1577555 1614844 1655696 1697230
60985 1697230 1738985 1782903 1830901 1883117 1938562 1996688 2057745 2122184 2190568 2263840 2342712
60974 2342712 2426732 2514719 2606343 2702558 2804277 2911392 3023508 3140980 3264621 3394830
60964C394830J36744J43427J50587J58233J66192J74450J83496J94595K09226
60955D911780K27641K48454K70394K94132L21710L55115L96365M47888N10634
60946G984113N82154O58715P39575Q27423R24948J033923J158487J306298J484635
60937A6700271J696980J942244K208311K456684K615450K601952K368897J938814
60929C4529603J399312Q66769M46349K04442J51226K32429L40715L53211J81317
60920C8705373j93928p18443j290797j801636k170546k367587k411802k349540
60912B5401094k227446k076980j914990j751133j592076j441504j300456j169303
60904A1927206j048921r39980q42164p54360o75087o02782n36468m76295m22822
$$ plain form
60964 3394830 3531574 3675001 3825588 3983821 4150013 4324463 4507959 4702554 4911780
60955 4911780 5139421 5387875 5658269 5952401 6274111 6629226 7025591 7473479 7984113
60946 7984113 8566267 9224982 9964557 10791980 11716928 12750851 13909338 15215636 16700271
60937 16700271 18397251 20339495 22547806 25004490 27619940 30221892 32590789 34529603
60929 34529603 35928915 36795684 37242033 37446475 37597701 37830130 38170845 38524056 38705373
60920 38705373 38511445 37793002 36502205 34700569 32530023 30162436 27750634 25401094
60912 25401094 23173648 21096668 19181678 17430545 15838469 14396965 13096509 11927206
60904 11927206 10878285 9938305 9096141 8341781 7666694 7063912 6527444 6051149 5628327
60895E628327l75676l33608k95887k62784k34405k09812j87933j68760j53026
60886C406436j40929j31670j24068j17233j10758j04504r8310r1844q5009p8431
60876B323680p3030o8890o5171o1433n8476n7160n6921n6199n4213n1462m8484
60865A672241m5113m1140l7086l3771l1555l0199k9068k7239k4133k0461j8006
60854A334470j7736j8483j8226j6461j4547j3768j3891j3714j2412j0068p482
60843A177682n744n485o079o043m584k537j388j535j901j243L54J377L65k403
60829A140836n016o071o292p263q998j0065j0180j0934j3156j5128j4868j3102
60817A019763j2163j2636j3009j2423j1692j1420j0974j0060r507r614r208p554
$$ plain form
60895 5628327 5252651 4919043 4623156 4360372 4125967 3916155 3728222 3559462 3406436
60886 3406436 3265507 3133837 3009769 2892536 2781778 2677274 2578964 2487120 2402111 2323680
60876 2323680 2250650 2181760 2116589 2055156 1996680 1939520 1882599 1826400 1772187 1720725 1672241
60865 1672241 1627128 1585988 1548902 1515131 1483576 1453377 1424309 1397070 1372937 1352476 1334470
60854 1334470 1316734 1298251 1280025 1263564 1249017 1235249 1221358 1207644 1195232 1185164 1177682
60843 1177682 1171938 1166453 1160374 1154331 1149747 1147210 1145822 1144287 1142386 1141143 1141497 1142874 1143239 1140836
60829 1140836 1135820 1129749 1123457 1116194 1107196 1097131 1086951 1076017 1062861 1047733 1032865 1019763
60817 1019763 1007600 994964 981955 969532 957840 946420 935446 925386 915879 906265 897057 889503
60805H89503n921n824o649o529m972l173k053j443j048p96j49J563L780M861M133
60790H65283K822K372K804L336L745M100L900K762J701K212L840M021J228k658
60776I01468m354l096j187o65r49n29L88K88j226k931l880m420m944m919l910
60761H65134k768k719l624m020l037j569j288k727m708n672n302m524m136m125
60747H14915m458n528p141p955p143o028o514q146q425o383m032l563m609n402
60733G29588n385n280n475n605n374m691l425j834p40n35n86k88J5M9M50J576
60717F92460K413K096J528J882K304J168p74q61J726M807O414P135Q298R477R176
60702G49249O971L809Q24j201j816j260m33M1L75P83P51k39j748k784k978k769
$$ plain form
60805 889503 883582 877758 871109 864580 859608 856435 854382 852939 851891 851095 850946 852509 856289 861150 865283
60790 865283 868105 870477 873281 876617 880362 884462 888362 891124 892825 895037 898877 902898 904126 901468
60776 901468 897114 894018 892831 892166 891217 890688 891076 891364 890138 887207 883327 878907 873963 869044 865134
60761 865134 862366 859647 856023 852003 848966 847397 846109 843382 838674 833002 827700 823176 819040 814915
60747 814915 810457 804929 797788 789833 782690 776662 770148 762002 753577 747194 743162 739599 734990 729588
60733 729588 724203 718923 713448 707843 702469 697778 694353 692519 691779 691244 690658 690370 690385 690434 690884 692460
60717 692460 694873 696969 698497 700379 702683 703851 703077 702216 703942 708749 715163 722298 730596 740073 749249
60702 749249 756220 760029 760853 759652 757836 756576 756143 756184 756559 757342 758093 757854 756106 753322 750344 747575
60686G47575k607k405j796p43K01L10n88k067l851o023q119q826p453n169l748
60671F94691l565l908m649o066p381p291n992m954m537l695k355j975k966l587
60657F31770k650j440j444j851j119K95P81L50M76J543K352K179J814K260L503
60642F38819M757N179M440L208K787L633M714M980M697M455L852K455J260J512
60628F90748K565K734K019K111L551M742M414L476L617N120O794P233N694K518
60614G47336q03k685k944k609k266j574n82j88q08j720k373l208m458n205m729
60599G11184l836l592l522k511j012o63j772k739k381j347n46M73K283L833L502
60584F97354J657M69R05J464N40j230k130j888j576j528j049k26l70k094m087
$$ plain form
60686 747575 744968 742563 740767 740024 740225 740535 739947 737880 734029 728006 719887 711061 703608 698439 694691
60671 694691 691126 687218 682569 676503 669122 661831 655839 650885 646348 642653 640298 638323 635357 631770
60657 631770 629120 627680 626236 624385 623266 623561 624342 624692 625168 626711 629063 631242 633056 635316 638819
60642 638819 643576 648755 653195 656403 659190 662823 667537 672517 677214 681669 685521 687976 689236 690748
60628 690748 693313 696047 698066 700177 703728 708470 712884 716360 719977 725097 731891 739124 744818 747336
60614 747336 746533 743848 740904 738295 736029 734455 733873 733685 732877 731157 728784 725576 721118 715913 711184
60599 711184 707348 703756 700234 697723 696711 696048 694276 691537 689156 687809 687263 687736 690019 693852 697354
60584 697354 699011 699480 700385 701849 702389 701159 699029 697141 695565 694037 692988 692762 692392 690298 686211
60569F86211m568l212j104M26N01q48k361k471j226m49j323k696k681j067P81
60554F63913J761J758J107L51J4j54j025k412k627r14Q11M36j026p12J858M105
60538F67244M097K830K215K656L381L841L813L230K571K569L096L234K697K132
60524G09606J851J423Q49P29R89Q48M84J138K862L850L071K094L021N763Q674
60509G47252J0742J1923J2247J2055J2356J3627J4893J5166J4951J5010J4545
60498H94767J2342R054O466M760K463p28l041l138j894p36M69K666N580P719Q288
60483I45037Q099Q386R362J0376J1238J2710J5416J8632K0890K1672K1870K2277
60471A125965K2442K1484J9396J6903J4386J1593Q198M128l89m661p684q948q874
$$ plain form
60569 686211 681643 678431 677327 677753 678254 677406 675045 672574 671348 670899 669576 666880 664199 663132 663913
60554 663913 665674 667432 668539 668890 668904 668750 667725 665313 662686 661772 662583 663019 661993 661281 663139 667244
60538 667244 671341 674171 676386 679042 682423 686264 690077 693307 695878 698447 701543 704777 707474 709606
60524 709606 711457 712880 713729 714458 715447 716295 716779 717917 720779 724629 727700 729794 732815 738578 747252
60509 747252 757994 769917 782164 794219 806575 820202 835095 850261 865212 880222 894767
60498 894767 907109 916163 922629 927389 929852 929124 926083 922945 921051 920315 920784 923450 929030 936749 945037
60483 945037 953136 961522 970884 981260 992498 1005208 1020624 1039256 1060146 1081818 1103688 1125965
60471 1125965 1148407 1169891 1189287 1206190 1220576 1232169 1240367 1244495 1244106 1239445 1231761 1222813 1213939
60458A213939q206p349o529n917n183l670j702q96k176m033l828o21M164Q636
60444A176629J1996J4413J6476J8980K2468K6788L1436L6216M1131M5933N0378
60433A492844N4534N8254O0705O1263O0336N8420N4778M8345L9694L0670K1917
60422B041760J2058j34j3798k6812l7864m7043n4758o0759o4304o5298o4965o4793
60410A553290o4597o2529n7671n1716m7041m3949m1173l8348l6151l4258l1326
60399A044531k7252k3575k1076j8787j6161j4369j4271j4661j3861j1981j0159
60388H58378q621p004n910o373p991q959q091n825l411j957k126l641m961m455
60374G79053k252l29m28k298m115m314k867j084k82n14o92qJ008J163J37j074
$$ plain form
60458 1213939 1205733 1198384 1191855 1185938 1180755 1177085 1175383 1174487 1172311 1168278 1164450 1163829 1167993 1176629
60444 1176629 1188625 1203038 1219514 1238494 1260962 1287750 1319186 1355402 1396533 1442466 1492844
60433 1492844 1547378 1605632 1666337 1727600 1787936 1846356 1901134 1949479 1989173 2019843 2041760
60422 2041760 2053818 2053684 2039886 2013074 1975210 1928167 1873409 1812650 1748346 1683048 1618083 1553290
60410 1553290 1488693 1426164 1368493 1316777 1269736 1225787 1184614 1146266 1110115 1075857 1044531
60399 1044531 1017279 993704 972628 953841 937680 923311 909040 894379 880518 868537 858378
60388 858378 849757 842753 836843 830470 822479 813520 805429 799604 796193 794236 792110 788469 783508 779053
60374 779053 776801 776472 776044 773746 769631 765317 762450 761366 761084 760570 759878 759870 760878 762041 762178 761104
60358G61104j332o74k39q05j630j290K64J281M92q83o17J522L651M498M583M421
60342G74346L482J771Q30J830L840N240N711N639M786L252K621M137O275O286
60328H30046L978J940J891K793L090K979L446M435N155N455N912O801P574P325
60314H92820N689L516K195J931J363k21j262o5K115K428P33J1J876M187M515L747
60298I25578M228N954O867O099M776M032M086N048O959Q977J0012J0172J0362
60285A013150J0568R896Q376P148O549N380K698o75l195m382m998n920p287q512
60271A028796q804q032p044o744p045p206o938o465n743m601l482l056l052k515
60257I48069j280j21O23J451K498L264L861N103O966Q387R377J1650J6052K0754
$$ plain form
60358 761104 759772 759098 758859 758054 756424 755134 755398 756679 757171 756288 755671 757193 760844 765342 769925 774346
60342 774346 777828 779599 780429 782259 786099 791339 797050 802689 807475 810727 813348 817485 823760 830046
60328 830046 834024 835964 837855 840648 843738 846717 850163 854598 859753 865208 871120 877921 885495 892820
60314 892820 898509 902025 904220 906151 907514 907293 906031 905966 908081 910509 911242 911253 913129 917316 921831 925578
60298 925578 929806 935760 942627 948726 953502 957534 961620 966668 973627 982604 992616 1002788 1013150
60285 1013150 1023718 1033614 1041990 1049138 1055687 1061067 1063765 1063090 1059895 1055513 1050515 1044595 1037308 1028796
60271 1028796 1019992 1011960 1004916 998172 991127 983921 976983 970518 964775 960174 956692 953636 950584 948069
60257 948069 946789 946668 947291 948742 951240 954504 958365 963468 970434 978821 988198 999848 1015900 1036654
60243A036654K3508K4512K5355K6056K5080K1858J7302J2003N682j298p662j2856
60231A196194j7499k1637k3937k3419k1016j8546j6847j5611j4392j3054j1648
60220I98588j0338r282q270o852m939k979j488r10j649l447m895m714l638l733
60206I31454n524p063o632n106m574n557o831p274o680n204l232j613j033j229
60192H63902j517j872k610l417l618l216k703k040p58J056K734L962M765M803
60178H59471L787K544K356L051L037J742P01J411L133L908L126K060K064L102
60164H95493M070M013L012K153K466L791N004N552O079P186Q205Q009O692N661
60150I67386O066P739R672J0991J1381J1114J0799J0835J1001J0794J0261J0086
$$ plain form
60243 1036654 1060162 1084674 1110029 1136085 1161165 1183023 1200325 1212328 1218010 1216712 1209050 1196194
60231 1196194 1178695 1157058 1133121 1109702 1088686 1070140 1053293 1037682 1023290 1010236 998588
60220 998588 988250 978968 970698 963846 958907 955928 954440 953530 951881 948434 943539 938825 935187 931454
60206 931454 925930 918867 912235 907129 902555 896998 890167 882893 876213 871009 867777 866164 865131 863902
60192 863902 862385 860513 857903 854486 850868 847652 844949 842909 842151 843207 845941 849903 854668 859471
60178 859471 863258 865802 868158 871209 874246 875988 876689 878100 881233 885141 888267 890327 892391 895493
60164 895493 899563 903576 906588 908741 911207 914998 920002 925554 931633 938819 947024 955033 961725 967386
60150 967386 973452 981191 990863 1001854 1013235 1024349 1035148 1045983 1056984 1067778 1078039 1088125
60138A088125J0701J1653J2107J1825J1271J0740R816Q050N977M868N186N742
60126A196061M844K272m41j682j383p99j050k080k934k987k820l728o164q973
60112A168136j0545j0440r426q204o970o025n848o299o613o453o211n985n255
60099A073862m044l297l326k837o93K027K975J333j405l226l180j493P47K023
60085A059466J645O38M72J062J231J019J833L840N099M370L204L791N804P211
60071A100685P436P786Q877R653R284Q354P478O238M503L539M462O323O988N744
60057A197350L912L113L791N351O812P260O488N276M488L881K671J144O23J527
60043A253687K485J913k34k812m772n521m918l789l713n294p056p190n900m866
$$ plain form
60138 1088125 1098826 1110479 1122586 1134411 1145682 1156422 1166238 1174288 1180265 1185133 1190319 1196061
60126 1196061 1200905 1203177 1202736 1201054 1199671 1198872 1197822 1195742 1192808 1189821 1187001 1183273 1177109 1168136
60112 1168136 1157591 1147151 1137725 1129521 1122551 1116526 1110678 1104379 1097766 1091313 1085102 1079117 1073862
60099 1073862 1069818 1066521 1063195 1060358 1059665 1061692 1064667 1066000 1064595 1061369 1058189 1056696 1057443 1059466
60085 1059466 1061111 1061749 1062221 1063283 1064514 1065533 1067366 1071206 1076305 1080675 1083879 1087670 1093474 1100685
60071 1100685 1108121 1115907 1124784 1134437 1143721 1152075 1159553 1165791 1170294 1173833 1178295 1184618 1191606 1197350
60057 1197350 1201262 1204375 1208166 1213517 1220329 1227589 1234077 1239353 1243841 1247722 1250393 1251537 1252160 1253687
60043 1253687 1256172 1258085 1257851 1255039 1250267 1244746 1239828 1236039 1232326 1227032 1219976 1212786 1206886 1202020
60029A202020m723m436l246j820j137j384k373l904n215n163l736k414k259k538
60015A157672k124j413j610k719l606l836m190n292o765q017q968r745j0326j0720
60001A078341j0941j0752j0054r512r955j0920j0773q763o130m576m320m496m812
59988I72337n643o639o528m672j923O14L024N942Q911J0406R588P343N263M227
59974A002250M269N149O340O959O565N918N996O323N246K223j107k793k821k738
59960A047779l503m675n586o498q216j0881j3484j4679j4216j3348j3419j4109
59948I25165j3842j2054j0033q964q147o296l869k645l175l972l572k229j230
59935H45137j266j883k010q50J251K757K426Q40k34R2J262K745M731P093Q773
$$ plain form
60029 1202020 1197297 1192861 1189615 1187795 1186658 1185274 1182901 1178997 1173782 1168619 1164883 1162469 1160210 1157672
60015 1157672 1155548 1154135 1152525 1149806 1146200 1142364 1138174 1132882 1126117 1118100 1109132 1099387 1089061 1078341
60001 1078341 1067400 1056648 1046594 1037082 1027127 1016207 1005434 996671 990541 985965 981645 977149 972337
59988 972337 966694 960055 953527 948855 946932 947546 950570 956512 965423 975829 985417 992760 998023 1002250
59974 1002250 1006519 1011668 1018008 1024967 1031532 1037450 1043446 1049769 1055015 1057238 1056131 1053338 1050517 1047779
59960 1047779 1044276 1039601 1034015 1027517 1019301 1008420 994936 980257 966041 952693 939274 925165
59948 925165 911323 899269 889236 880272 872125 865829 861960 859315 856140 852168 848596 846367 845137
59935 845137 843871 841988 839978 839128 840379 843136 845562 846402 846168 846260 847522 850267 854998 862091 870864
59920H70864Q937P789N842L307Q47l05L8K41j134l193l858k619r05m7j54p96j529
59903H83325j691q69K87P16L98J72J14n20j484j203J019L651M736M156L062J956
59887H97825N15j106k087j976j011M44J917K507J670L85L37J565K087N67j616
59872I02023k040m41J037P99k47j35J644L942N690O809P383P107O154N772P010
59857I52507R061R901Q723O762N371M316K746J065N46J416K568L268L925M762
59843A016937M948L925K732K880M266N305N051M257M134M832N550N641N167M575
59829A080200M214M237M742N847P351Q484Q475P596P035P408P981P938P721Q111
59815A177340Q508P527N213L242K550K175R82o77j889k702l625m409m443l840
$$ plain form
59920 870864 879801 887590 893432 896739 897586 897281 897319 897560 896426 893233 889375 886756 885851 885804 885650 884854 883325
59903 883325 881634 880765 881052 881768 882166 882338 882452 881932 880448 879245 880264 883915 888651 892807 895869 897825
59887 897825 898340 897234 895147 893171 892160 892604 894521 897028 898698 899083 899420 900985 903072 903639 902023
59872 902023 899983 899542 900579 901378 901131 900996 902640 906582 912272 919081 926464 933571 939725 945497 952507
59857 952507 961568 971469 980192 986954 992325 996641 999387 1000452 1000998 1002414 1004982 1008250 1012175 1016937
59843 1016937 1021885 1025810 1028542 1031422 1035688 1040993 1046044 1050301 1054435 1059267 1064817 1070458 1075625 1080200
59829 1080200 1084414 1088651 1093393 1099240 1106591 1115075 1123550 1131146 1138181 1145589 1153570 1161508 1169229 1177340
59815 1177340 1185848 1193375 1198588 1201830 1204380 1206555 1207537 1206860 1204971 1202269 1198644 1194235 1189792 1185952
59801A185952l148k396j488j007j561k471k306p07J263K556K991K749K011J347
59787A183785J574K985N267Q016J0569J1594J0076O857M010K494J475K34o74p98
59773A247464r85k183l995n523o801q330r750j0201r697r073q649p962o834n891
59759A151590n934p242r363j1066j0924q820o628o469q224r685r229p464n952
59746A044590n310n095m852m487l812k523o91J037J852J371j4j282j456l65J217
59731A020180K261K167R28j043k995l931l177j102Q43J179l11k412l608l254j756
59716A003969q6O63j02j687k342j145N44N76j083k110p65K065M351N235N101M455
59700A017639L986M844P347R858J0357Q960P657P742Q883J0488J2416J4078J4510
$$ plain form
59801 1185952 1182804 1180408 1178920 1177913 1176352 1173881 1171575 1170868 1172131 1174687 1177678 1180427 1182438 1183785
59787 1183785 1185359 1188344 1193611 1201627 1212196 1223790 1233866 1240723 1244733 1247227 1248702 1248936 1248262 1247464
59773 1247464 1246479 1244296 1240301 1234778 1227977 1219647 1209897 1199696 1189999 1180926 1172277 1164315 1157481 1151590
59759 1151590 1145656 1138414 1129051 1117985 1107061 1098241 1091613 1085144 1076920 1067235 1058006 1050542 1044590
59746 1044590 1039280 1034185 1029333 1024846 1021034 1018511 1017820 1018857 1020709 1022080 1022066 1020784 1019328 1018963 1020180
59731 1020180 1022441 1024608 1025536 1024493 1021498 1017567 1014390 1013288 1014131 1015310 1014999 1012587 1008979 1005725 1003969
59716 1003969 1003883 1004546 1004444 1002757 1000415 999270 999814 1000390 999307 997197 996432 998497 1002848 1008083 1013184 1017639
59700 1017639 1021625 1026469 1033816 1043674 1054031 1062991 1070648 1078390 1087273 1097761 1110177 1124255 1138765
59687A138765J3915J3883J5294J7081J7713J6940J5331J3263J1218J0047R808
59676A293258R199P281N082M236M629M702L652J945j11k589m767n319m277l316
59662A313605l458l832l653m102o669j0315j2015j0198o435l474k649l504m876
59649A238425n671n246l930k892k894l380l268k402j616j466j553j232m31M76
59635A202920J165J496J455J164P91L59j16l05J11O86M55p44j796j689r21q44
59619A204187j932l434m552n209n596n731n599n308m949m727n123o357p690q039
59605A129941p440p095p649q148p269n039k685j212o71n66l79K19J173K027K396
59590A087603K407K442K588K666K593K422J989R19r21l062m668n204m995m959
$$ plain form
59687 1138765 1152680 1166563 1181857 1198938 1216651 1233591 1248922 1262185 1273403 1283450 1293258
59676 1293258 1302457 1309738 1314820 1319056 1323685 1328387 1332039 1333984 1333873 1331284 1326517 1321198 1316921 1313605
59662 1313605 1310147 1306315 1302662 1298560 1291891 1281576 1269561 1259363 1252928 1249454 1246805 1243301 1238425
59649 1238425 1232754 1227508 1223578 1220686 1217792 1214412 1211144 1208742 1207126 1205660 1204107 1202875 1202444 1202920
59635 1202920 1204085 1205581 1207036 1208200 1208991 1209350 1209234 1208929 1209040 1209726 1210181 1209437 1207641 1205952 1205031 1204187
59619 1204187 1202255 1198821 1194269 1189060 1183464 1177733 1172134 1166826 1161877 1157150 1152027 1145670 1137980 1129941
59605 1129941 1122501 1115406 1107757 1099609 1092340 1087301 1084616 1083404 1082733 1082167 1081788 1082007 1083180 1085207 1087603
59590 1087603 1090010 1092452 1095040 1097706 1100299 1102721 1104710 1105629 1104708 1101646 1096978 1091774 1086779 1081820
59576A081820n544o147o055n693o183p498q100o928m922l757l676l550k816k222
59562A008729k551l447l890l431k655k666m020o026p252p039o165n618n151l882
59548I44936k020q84j032j402p21R05K361K846K338J272L73L63J246K038J828
59533I54447R57N63J074J733J774J433J436J792J721P70m74j168j405k035l201
59518I59417l798k888j240o00j497k599k521j548j032j582k493k842k524k086
59504I30167j943j981j845j392q41n07m75n96o94o81n97o55j106j725j643j70
59488I13316K176L913M120L388L083L884N344O648P590Q661J0284J2059J3130
59475I97596J3386J3846J5403J7533J8797J8252J5640J0815M286j820n010n187
$$ plain form
59576 1081820 1076276 1070129 1064074 1058381 1052198 1044700 1036600 1029672 1024750 1020993 1017317 1013767 1010951 1008729
59562 1008729 1006178 1002731 998841 995410 992755 990089 986069 980043 972791 965752 959587 953969 948818 944936
59548 944936 942916 942032 941000 939598 938877 939782 942143 944989 947327 948599 948972 949335 950581 952619 954447
59533 954447 955404 955967 957041 958774 960548 961981 963417 965209 966930 967700 967226 966058 964653 962618 959417
59518 959417 955619 952731 951491 950891 949394 946795 944274 942726 941694 940112 937619 934777 932253 930167
59504 930167 928224 926243 924398 923006 922165 921658 921183 920587 919893 919212 918615 917960 916854 915129 913486 913316
59488 913316 915492 919405 923525 926913 929996 933880 939224 945872 953462 962123 972407 984466 997596
59475 997596 1010982 1024828 1040231 1057764 1076561 1094813 1110453 1121268 1125554 1123734 1118724 1113537
59463A113537m792n520o244n138k516j58J084J474J018k63j284j020m60j452l715
59448A084551n132n265o195q953j1427j1386r728q796q891q633p859p744q319
59435I76223q177o853n551m943m129k557j404j823k941k920j307Q37K603L835
59421I40893M447M312L928M152M980N397M710L441K574K445K754L219L756M272
59407I95280M597M606M172L301K417K224K794L206K665J874K417M560O495O401
59393A047009M663L279L403M449N574O821Q284R078Q287O604N868O809Q024P706
59379A135858N675L106P00j841m524o296o301n276m790n156n124l809j958o80
59365A099584K52J780L765N029N326N988Q140J1161J3644J5198J6535J8129J9708
$$ plain form
59463 1113537 1108745 1103225 1096981 1091843 1089327 1089169 1090253 1091727 1092745 1092482 1091198 1090178 1089718 1088266 1084551
59448 1084551 1079419 1074154 1067959 1059006 1047579 1036193 1026465 1017669 1008778 1000145 992286 984542 976223
59435 976223 968046 961193 955642 950699 946570 944013 942609 940786 937845 934925 933618 934455 937058 940893
59421 940893 945340 949652 953580 957732 962712 968109 972819 976260 978834 981279 984033 987252 991008 995280
59407 995280 999877 1004483 1008655 1011956 1014373 1016597 1019391 1022597 1025262 1027136 1029553 1034113 1040608 1047009
59393 1047009 1051672 1054951 1058354 1062803 1068377 1075198 1083482 1092560 1100847 1107451 1113319 1120128 1128152 1135858
59379 1135858 1141533 1144639 1145339 1143498 1138974 1132678 1126377 1121101 1116311 1111155 1106031 1102222 1100264 1099584
59365 1099584 1099836 1101616 1105381 1110410 1115736 1121724 1129864 1141025 1154669 1169867 1186402 1204531 1224239
59352A224239K1019K2567K5166K8895L2435L3658L1271K5907J9190J1900L990
59341A480237l546q271q807o657m338k392K41L327M703K720k164q578j5586k2076
59327A408813k6199k6686k4251k0826j7755j5230j3011j0817q294n337k422k98
59315A237687N92K94o20j082j51J973M019N106N626O298P037P233O693N666M375
59300A290746L209K891L687M730M943M437M309N180O653Q102R296J0155J0533
59287A368871J0533J0645J1443J3130J5284J6963J7439J7067J6876J7028J6377
59276A531656J4181J1487R981R890R967R094O960L609n08m250o826q938j1713
59263A574590j4640j6053j5749j5458j6186j6712j5625j3560j2111j1525j0771
$$ plain form
59352 1224239 1245258 1267825 1292991 1321886 1354321 1387979 1419250 1445157 1464347 1476247 1480237
59341 1480237 1476691 1468420 1459613 1452956 1448618 1446226 1446467 1449794 1454497 1457217 1455053 1446475 1430889 1408813
59327 1408813 1382614 1355928 1331677 1310851 1293096 1277866 1264855 1254038 1245744 1240407 1237985 1237687
59315 1237687 1238279 1238573 1237953 1236871 1236720 1238693 1242712 1247818 1253444 1259742 1266779 1274012 1280705 1286371 1290746
59300 1290746 1293955 1296846 1300533 1305263 1310206 1314643 1318952 1324132 1330785 1338887 1348183 1358338 1368871
59287 1368871 1379404 1390049 1401492 1414622 1429906 1446869 1464308 1481375 1498251 1515279 1531656
59276 1531656 1545837 1557324 1567305 1577195 1587162 1596256 1603216 1606825 1606317 1602067 1595241 1586303 1574590
59263 1574590 1559950 1543897 1528148 1512690 1496504 1479792 1464167 1450607 1438496 1426971 1416200
59252A416200r470q478q669r956j1481j2144j1145q655n891m037l145k480j706
59239A318943j121p80M0K119N131P483P613N480K312j139n339j0351j4515j6196
59225A299680j6264j6991j8487j8303j5232j1480r745r729r056o525k808J140
59213A166200M613O794P520Q095R847J2164J3378J3217J2872J2893J2736J2229
59201A292558J1885J1610J0729R384Q299O919L659j518o414r218j0282j0591j0115
59188A306905q796p614p289p031n893m480l839l610k705j356q33j377j817j263
59174A249002O4J695L449M894N318M720M236N027O975Q563P985M713K36l075m239
59159A299563m365m839n488n410m808m767n535o301o701p316q391r222r313r173
$$ plain form
59252 1416200 1406730 1398252 1389583 1379627 1368146 1356002 1344857 1336202 1330311 1326274 1323129 1320649 1318943
59239 1318943 1317822 1317042 1317082 1319201 1324332 1331815 1339428 1344908 1347220 1346081 1340742 1330391 1315876 1299680
59225 1299680 1283416 1266425 1247938 1229635 1214403 1202923 1193178 1183449 1174393 1167868 1165060 1166200
59213 1166200 1170813 1177607 1185127 1193222 1203069 1215233 1228611 1241828 1254700 1267593 1280329 1292558
59201 1292558 1304443 1316053 1326782 1336166 1344465 1351384 1355043 1353525 1347111 1337893 1327611 1317020 1306905
59188 1306905 1298109 1290495 1283206 1276175 1270282 1265802 1261963 1258353 1255648 1254292 1253459 1252082 1250265 1249002
59174 1249002 1249066 1250761 1254210 1259104 1264422 1269142 1273378 1278405 1285380 1293943 1301928 1306641 1306877 1303802 1299563
59159 1299563 1295198 1290359 1284871 1279461 1274653 1269886 1264351 1258050 1251349 1244033 1235642 1226420 1217107 1207934
59145A207934r323r194p856n516l620l478n042o973p698o691m928l969m338m924
59131A124384m095j398J917L980L930K554J392J348K333L950N907P608Q191P449
59117A169450O247N567N536N850O502P469Q269Q558Q673Q831Q506P501O836P280
59103A271075P761O860N296M979N786N617L863K400K317K004q3k829m418n262
59089A305366o945r482j1738j3635j5741j7233j6595j4300j2631j2569j2740j1884
59077A149873j0624j0164j0613j1307j1584j0695q098m504j731r74j862l339m357
59064A060021l643n38L298M740K968R94K031N577Q724J0300J1533J3025J3479
59051A132509J1959R614Q120P678P550P580P990Q213P341N704M823N285N553L815
$$ plain form
59145 1207934 1198611 1189417 1181561 1176045 1172425 1168947 1163905 1156932 1149234 1142543 1137615 1133646 1129308 1124384
59131 1124384 1120289 1118891 1120808 1124788 1128718 1131272 1132664 1134012 1136345 1140295 1146202 1153810 1162001 1169450
59117 1169450 1175697 1181264 1186800 1192650 1199152 1206621 1214890 1223448 1232121 1240952 1249458 1256959 1263795 1271075
59103 1271075 1278836 1285696 1290992 1295971 1301757 1307374 1311237 1313637 1315954 1317958 1317875 1315046 1310628 1305366
59089 1305366 1298421 1288939 1277201 1263566 1247825 1230592 1213997 1199697 1187066 1174497 1161757 1149873
59077 1149873 1139249 1129085 1118472 1107165 1095581 1084886 1076788 1072284 1070553 1069579 1067717 1064378 1060021
59064 1060021 1056378 1055840 1059138 1063878 1066846 1067840 1069871 1075448 1084172 1094472 1106005 1119030 1132509
59051 1132509 1144468 1154082 1162202 1169880 1177430 1185010 1193000 1201213 1208554 1214258 1219081 1224366 1229919 1233734
59037A233734O19j435q65Q21J102m86k263k923k772k378j485nR78K78j774l682
59021A217464m443m155l483l291m454p026r631j0603r770q549q234q779r177q433
59007A117436o306l828k887m413o957q015o856n189m784n553o325o445n850m482
58993A039546k653j443j686k813l591l757m025m556m559l663k714k641l078k836
58979I95531j517j0O30L92J78P67J990K992L186K854K750L182L782M224M787N931
58963A031649P515Q935J0031J1326J3194J5202J6698J7605J8181J8292J7584J6225
58951A202437J4684J2787R865O092K802R42r4j390k863l545l110k268j721j459
58937A233159j052L1K168M908O723O375M609L465L791M419M163L470L341L527
$$ plain form
59037 1233734 1234353 1232918 1232053 1232874 1233976 1233490 1231227 1228304 1225532 1223154 1221669 1221664 1222642 1222920 1221146 1217464
59021 1217464 1213021 1208866 1205383 1202092 1197638 1190612 1180981 1170378 1160608 1152059 1143825 1135046 1125869 1117436
59007 1117436 1111130 1107302 1104415 1100002 1093045 1085030 1078174 1072985 1068201 1062648 1056323 1049878 1044028 1039546
58993 1039546 1036893 1035450 1033764 1030951 1027360 1023603 1019578 1015022 1010463 1006800 1004086 1001445 998367 995531
58979 995531 994014 994004 994634 995026 995204 995971 997961 1000953 1004139 1006993 1009743 1012925 1016707 1020931 1025718 1031649
58963 1031649 1039164 1048099 1058130 1069456 1082650 1097852 1114550 1132155 1150336 1168628 1186212 1202437
58951 1202437 1217121 1229908 1239773 1245865 1248667 1249609 1249515 1248125 1245262 1241717 1238607 1236339 1234618 1233159
58937 1233159 1232107 1232138 1234306 1239214 1245937 1252312 1256921 1260386 1264177 1268596 1272759 1276229 1279570 1283097
58923A283097K951J511L69M22J205J540Q65j62j34J900N430Q834J0931J2038J3283
58908A344080J5101J6909J8020J8355J8256J8019J7645J6894J5587J4039J2862
58897A525767J2075J0671P710L663P5k182l745n713q391j1407j4486j7442j9667
58884A476928k0454k0004j9489j9687j9890j8801j6398j4265j3765j4343j4117
58873A285715j1975q689o035n152n728o356n628l239k24K040L079L385L419L026
58859A247638J933M39p81j339j494j856k733l671l834k991j888j260p26O68L038
58844A231143N495P351Q705R786J0613J1524J3021J4705J5435J5152J5553J7899
58832A376382K0934K2237K1246J9716J9367K0305K1864K3756K5773K7178K7200
$$ plain form
58923 1283097 1286048 1287559 1287928 1288350 1289555 1291095 1291960 1291798 1291664 1293564 1298994 1307828 1318759 1330797 1344080
58908 1344080 1359181 1376090 1394110 1412465 1430721 1448740 1466385 1483279 1498866 1512905 1525767
58897 1525767 1537842 1548513 1556223 1559886 1559961 1557779 1554034 1548321 1539930 1528523 1514037 1496595 1476928
58884 1476928 1456474 1436470 1416981 1397294 1377404 1358603 1342205 1327940 1314175 1299832 1285715
58873 1285715 1273740 1265051 1259016 1253864 1248136 1241780 1236152 1232913 1232689 1234729 1237808 1241193 1244612 1247638
58859 1247638 1249571 1250010 1249229 1247890 1246396 1244540 1241807 1238136 1234302 1231311 1229423 1228163 1227437 1228105 1231143
58844 1231143 1236638 1243989 1252694 1262480 1273093 1284617 1297638 1312343 1327778 1342930 1358483 1376382
58832 1376382 1397316 1419553 1440799 1460515 1479882 1500187 1522051 1545807 1571580 1598758 1625958
58821A625958K5961K4394K3170K1890J9463J5411J0709O993M745K720m97m729
58809A776188q477j0680j1737j2841j4664j6569j7093j5570j3326j2529j3647
58798A629055j4973j5222j5298j6433j7736j7422j5788j4981j5830j6909j6976
58787A451487j6479j6000j5052j3525j2673j3281j4082j3463j1939j1282j1801
58776A301910j2204j1979j2167j3382j4463j3901j1838r848r101r313r353q519
58764A165842p123n937n159m184k536o08R02K030L315M684N364N122M864N437
58750A172013O306O116M487K608J861K308K856K569J385l92k649n238p509q633
58736A178088q306o916n189l974m209o340r528j1957j2385j1159r442p820o189
$$ plain form
58821 1625958 1651919 1676313 1699483 1721373 1740836 1756247 1766956 1773949 1778694 1781414 1780917 1776188
58809 1776188 1767711 1757031 1745294 1732453 1717789 1701220 1684127 1668557 1655231 1642702 1629055
58798 1629055 1614082 1598860 1583562 1567129 1549393 1531971 1516183 1501202 1485372 1468463 1451487
58787 1451487 1435008 1419008 1403956 1390431 1377758 1364477 1350395 1336932 1324993 1313711 1301910
58776 1301910 1289706 1277727 1265560 1252178 1237715 1223814 1211976 1202128 1193027 1183714 1174361 1165842
58764 1165842 1158719 1152782 1147623 1143439 1140903 1140295 1141197 1143227 1146542 1151226 1156590 1161712 1166576 1172013
58750 1172013 1178319 1184435 1188922 1191530 1193391 1195699 1198555 1201124 1202509 1202117 1199468 1194230 1186721 1178088
58736 1178088 1169782 1162866 1157677 1153703 1149494 1143154 1133626 1121669 1109284 1098125 1088683 1080863 1074674
58723A074674m666l792l596l168j731K56J621K076K567L873N364N561L737O60
58709A083436k125l477l396l010l616n320o784o810n933n773o817p764p247n382
58695A009982l245j599o44l08j77L01J023J263R64J187K550M003M204L416K963
58680A025883L299L855M397N180N979O313O607P725R260R655Q414O907O472O833
58666A116779O912O263N219M364M293N108N993O113O012O895Q436Q833P592O576
58652A205388P272Q520Q303O674N273M761M296L204J682m4k003l985n701p466
58638A236174r838j2646j5187j7186j8783j9825k0084k0033k0435k1113k1031
58627A040013j9674j7577j5492j3754j2462j1565j0704r637q844q898r290q799
$$ plain form
58723 1074674 1070008 1066216 1062620 1059452 1057721 1057977 1059598 1061674 1064241 1068114 1073478 1079039 1082776 1083436
58709 1083436 1081311 1077834 1074438 1071428 1067812 1062492 1055708 1048898 1042965 1037192 1030375 1022611 1015364 1009982
58695 1009982 1006737 1005138 1004494 1004186 1004009 1004310 1005333 1006596 1007560 1008747 1011297 1015300 1019504 1022920 1025883
58680 1025883 1029182 1033037 1037434 1042614 1048593 1054906 1061513 1069238 1078498 1088153 1096567 1103474 1109946 1116779
58666 1116779 1123691 1129954 1135173 1139537 1143830 1148938 1154931 1161044 1167056 1173951 1182387 1191220 1198812 1205388
58652 1205388 1212660 1221180 1229483 1236157 1241430 1246191 1250487 1253691 1255373 1255329 1253326 1249341 1243640 1236174
58638 1236174 1226336 1213690 1198503 1181317 1162534 1142709 1122625 1102592 1082157 1061044 1040013
58627 1040013 1020339 1002762 987270 973516 961054 949489 938785 929148 920304 911406 902116 893317
58615H93317p293o141o323o941o328m148j641J0Q19J522K486L452M081M488N127
58600H76487O244P439P889P027N157L238J980J079l15k383m321n488o327p477
58586H90229q478q236o760n429n340o165o912o993o201m493k352q27n43j016j263
58571H19221p70M08J964L397M301M757N053M892L645J546j24m42L11J413K466
58556H52038L207L497L877N080O728P753Q343R882J2328J3482J2072R816Q804
58543I56907Q514P295N508M830N310N429M772M295M051K933J065L80K108N112
58529A018509P446Q411Q645R015R841J0510R912P945O192O117P111P603P567Q234
58515A133058R617J0240R514Q600Q590R320J0394J1781J3109J3823J4371J5790
$$ plain form
58615 893317 886024 879883 873560 866619 860291 856143 854502 854512 855331 856853 859339 862791 866872 871360 876487
58600 876487 882731 890170 898059 905086 910243 913481 915461 916540 916225 913842 909521 904033 897706 890229
58586 890229 881751 873515 866755 861326 855986 849821 842909 835916 829715 825222 822870 822043 821500 820484 819221
58571 819221 818451 818859 820823 824220 828521 833278 838331 843223 846868 848414 848290 847848 848159 849572 852038
58556 852038 855245 858742 862619 867699 874427 882180 890523 900405 912733 926215 938287 948103 956907
58543 956907 965421 972716 978224 983054 988364 993793 998565 1002860 1006911 1009844 1010909 1011289 1013397 1018509
58529 1018509 1025955 1034366 1043011 1052026 1061867 1072377 1082289 1090234 1096426 1102543 1109654 1117257 1124824 1133058
58515 1133058 1142675 1152915 1162429 1171029 1179619 1188939 1199333 1211114 1224223 1238046 1252417 1268207
58503A268207J7848J9275K0216K2516K6844L1254L3628L4009L3544L2548L0808
58492A570697K8538K5825K2074J7081J1732O785K052k362n330o406p060q797j1020
58479A643809j2289j2876j4258j6647j8847k0457k2409k4958k6732k6628k5551
58468A422157k5276k6018k6190k4520k1632j9105j7529j6255j4934j4190j4315
58457A202193j4252j2865j0598q778p722o770n858n633n957n755m654l495k921
58444A106935k619k330k455l153l837l984l543k451q39K43k35j409j202P15K269
58429A082105J998R79Q34J428J817K229L628O183R243J2110J4049J4516J4178
58416A165297J4613J6280J7846J8298J8358J8806J8931J7877J6099J4122J1205
$$ plain form
58503 1268207 1286055 1305330 1325546 1348062 1374906 1406160 1439788 1473797 1507341 1539889 1570697
58492 1570697 1599235 1625060 1647134 1664215 1675947 1682732 1684784 1682422 1677092 1670686 1663626 1654829 1643809
58479 1643809 1631520 1618644 1604386 1587739 1568892 1548435 1526026 1501068 1474336 1447708 1422157
58468 1422157 1396881 1370863 1344673 1320153 1298521 1279416 1261887 1245632 1230698 1216508 1202193
58457 1202193 1187941 1175076 1164478 1155700 1147978 1141208 1135350 1129717 1123760 1118005 1113351 1109856 1106935
58444 1106935 1104316 1101986 1099531 1096378 1092541 1088557 1085014 1082563 1081724 1081967 1081732 1080323 1079121 1079836 1082105
58429 1082105 1084103 1085082 1085916 1087344 1089161 1091390 1095018 1101201 1110444 1122554 1136603 1151119 1165297
58416 1165297 1179910 1196190 1214036 1232334 1250692 1269498 1288429 1306306 1322405 1336527 1347732
58405A347732O829K330p47k877n391p957r166q809p675n700k344J492M042N211
58391A316970O641Q963J0762J0779R707R006Q894Q248N962K112j989m833o080
58378A385142o740p863r466j0934j1732j1354r483o855m990m429m180l551l258
58365A290307l766l908k570m54J315L245O194Q987R369O992L695J114m50j243
58351A318827j921l891p833j1959j3535j2191j0225r526r791r909r496q712p808
58338A202030p173o823n928l915j805j031j118j83K205M399N175N201N320M989
58324A201343L444J383L38Q33J952K578K566K768M064O353Q605R963J0463J0597
58310A267250J0659J0684J0460R526Q040P674J0181J4627J7627J7273J5300J4324
$$ plain form
58405 1347732 1354561 1356891 1356144 1353267 1347876 1339919 1330753 1321944 1314269 1308569 1306225 1307717 1311759 1316970
58391 1316970 1323611 1332574 1343336 1354115 1363822 1372828 1381722 1389970 1395932 1398044 1396055 1391222 1385142
58378 1385142 1378402 1370539 1361073 1350139 1338407 1327053 1317570 1310715 1305725 1301296 1297116 1293565 1290307
58365 1290307 1286541 1282633 1280063 1279609 1280924 1284169 1290363 1299350 1308719 1315711 1319406 1320520 1320070 1318827
58351 1318827 1316906 1313015 1305182 1293223 1279688 1267497 1257272 1247746 1237955 1228046 1218550 1209838 1202030
58338 1202030 1194857 1188034 1182106 1178191 1176386 1175355 1174237 1174054 1176259 1180658 1185833 1191034 1196354 1201343
58324 1201343 1204787 1206170 1206508 1207341 1209293 1211871 1214437 1217205 1221269 1227622 1236227 1246190 1256653 1267250
58310 1267250 1277909 1288593 1299053 1308579 1316619 1324293 1334474 1349101 1366728 1384001 1399301 1413625
58298A413625J4628J5082J5588J6648J7730J7983J7604J6827J4799J1411Q819
58287A580744Q719R280P572M266K968N134Q547J0881J2075J2785J3013J3031J3690
58274A702705J5041J6145J6629J7022J7515J7820J8118J8750J9255J9252J9557
58263A897809K0708K1068J8736J4758J1979J1062J0273R138R445J2047J5079J6150
58251B068252J4639J1504Q535P796R977J3197J5105J5773J6849J8639K0299K2119
58239B242684K4924K7669K8440K7594K7238K7987K9008L0685L3921L7264L8269
58228B575683L7650L8500M1369M3772M4756M6022M7977M8802M8369M9277N2647
58217C074824N6457N9214O1929O5311O8393P1151P5055P9935Q3662Q6091Q9797
$$ plain form
58298 1413625 1428253 1443335 1458923 1475571 1493301 1511284 1528888 1545715 1560514 1571925 1580744
58287 1580744 1589463 1598743 1606315 1610581 1613549 1618683 1627230 1638111 1650186 1662971 1675984 1689015 1702705
58274 1702705 1717746 1733891 1750520 1767542 1785057 1802877 1820995 1839745 1859000 1878252 1897809
58263 1897809 1918517 1939585 1958321 1973079 1985058 1996120 2006393 2015531 2024976 2037023 2052102 2068252
58251 2068252 2082891 2094395 2102930 2110726 2120703 2133900 2149005 2164778 2181627 2200266 2220565 2242684
58239 2242684 2267608 2295277 2323717 2351311 2378549 2406536 2435544 2466229 2500150 2537414 2575683
58228 2575683 2613333 2651833 2693202 2736974 2781730 2827752 2875729 2924531 2972900 3022177 3074824
58217 3074824 3131281 3190495 3252424 3317735 3386128 3457279 3532334 3612269 3695931 3782022 3871819
58206C871819R5673J01348J05321J09114J13938J18850J23562J29595J37161J44447
58196E050828J51239J59599J69783J79430J87940J97457K08180K17364K24758
58187F746578K34184K47509K61568K73522K84817K97444L10692L24301L40401
58178I321016L59613L79377L98719M20438M46160M73705N01828N32810N67892
58169A3401558O04952O43379O86056P33822P83186Q32399Q84427R41318J001336
58160B0512433J064379J134040J211643J294861J384754J486546J600657J721666
58152C1410979J849763J993818K158855K340774K538932K763376L023321L320035
58144E1399853L659309M060920M547815N134985N832583O643949P553667Q539052
$$ plain form
58206 3871819 3967492 4068840 4174161 4283275 4397213 4516063 4639625 4769220 4906381 5050828
58196 5050828 5202067 5361666 5531449 5710879 5898819 6096276 6304456 6521820 6746578
58187 6746578 6980762 7228271 7489839 7763361 8048178 8345622 8656314 8980615 9321016
58178 9321016 9680629 10060006 10458725 10879163 11325323 11799028 12300856 12833666 13401558
58169 13401558 14006510 14649889 15335945 16069767 16852953 17685352 18569779 19511097 20512433
58160 20512433 21576812 22710852 23922495 25217356 26602110 28088656 29689313 31410979
58152 31410979 33260742 35254560 37413415 39754189 42293121 45056497 48079818 51399853
58144 51399853 55059162 59120082 63667897 68802882 74635465 81279414 88833081 97372133
58136I7372133R610008J0821586J2228836J3838256J5611746J7504518J9509822
58129A96496905K1721230K4352345K7553733L1021483L3743337L4274436L1461619
58122D00625088K5068209J5871516N313199m973285j3595126j9760494k3436042
58115C85113065k5158019k5611814k5304140k4510275k3386600k2061291k0651763
58108B18429163j9253174j7923265j6670599j5467111j4284056j3112884j1954166
58101A09763908j0806985r680110q599694p593841o677428n857830n142889m532762
58093E0872369m012611l563512l175300k842746k556968k308670k093872j909361
58085B8409329j747463j601389j470703j355785j251761j153438j061695r79560
$$ plain form
58136 97372133 106982141 117803727 130032563 143870819 159482565 176987083 196496905
58129 196496905 218218135 242570480 270124213 301145696 334889033 369163469 400625088
58122 400625088 425693297 441564813 446878012 441904727 428309601 408549107 385113065
58115 385113065 359955046 334343232 309039092 284528817 261142217 239080926 218429163
58108 218429163 199175989 181252724 164582125 149115014 134830958 121718074 109763908
58101 109763908 98956923 89276813 80677119 73083278 66405850 60548020 55405131 50872369
58093 50872369 46859758 43296246 40120946 37278200 34721232 32412562 30318690 28409329
58085 28409329 26661866 25060477 23589774 22233989 20982228 19828790 18767095 17787535
58077A7787535r06028q38683p78470p26933o82065o41147o04322n71649n40286
58068A1497952n08541m79162m54623m32470m09224l85784l65012l46655l28493
58059G787988l10276k93239k77658k63539k51659k41681k31539k20642k11080
58050E486675k03986j97698j91194j85892j82032j77041j69840j63041j58146
58041C857805j52349j43184j32813j24248j16569j07631r8656r2191q7630q2496
58031B720038p6544p1213o6515o1567n6984n3934n1899m9705m7489m5680m3510
58020B094998m0589l8343l7881l7951l6792l4467l1786k8843k6238k5559k6840
58009A729709k7589k6156k3988k2878k2384k1791k2005k3274k3604k1814j9869
$$ plain form
58077 17787535 16881507 16042824 15264354 14537421 13855356 13214209 12609887 12038238 11497952
58068 11497952 10989411 10510249 10055626 9623156 9213932 8828148 8463136 8116481 7787988
58059 7787988 7477712 7184473 6906815 6643276 6391617 6149936 5918397 5697755 5486675
58050 5486675 5282689 5084991 4893797 4707905 4525873 4348832 4178992 4015951 3857805
58041 3857805 3705456 3562272 3429459 3305211 3188642 3081011 2982355 2890164 2802534 2720038
58031 2720038 2643494 2572281 2505766 2444199 2387215 2333281 2281382 2231677 2184188 2138508 2094998
58020 2094998 2054409 2016066 1978185 1940234 1903442 1868975 1837189 1808346 1782108 1756549 1729709
58009 1729709 1702120 1675964 1651976 1629098 1606714 1584923 1562918 1539644 1516040 1494226 1474357
57998A474357j9733k0279j9793j9136j9625k0173j9434j8633j9142j9305j7033
57987A262071j3870j2989j4476j5832j6037j5895j5253j3197j0534r267r807j0880
57975A104034j1626j1877j1276j0186j0328j2394j4241j3774j2151j1711j2054
57964I72416j1112r014p839q131q463q099p617p286p041p495q762r092p018m096
57950H61351l040l810m102l098k141k093k502l119l942m113k931j531j354j599
57936H21976n46J333K116J688J474J370r4k618m017l516k548k057j554j094j653
57921H10260l061l993m363n346o608o146l683j802k502m573n639n082l864k767
57907G50831j951j367q40m12o96j950l007k418n91O75P07L76Q9p24j850k025j083
$$ plain form
57998 1474357 1454624 1434345 1414552 1395416 1375791 1355618 1336184 1317551 1298409 1279104 1262071
57987 1262071 1248201 1235212 1220736 1204904 1188867 1172972 1157719 1144522 1133988 1124721 1114914 1104034
57975 1104034 1092408 1080531 1069255 1059069 1048741 1036347 1022106 1008332 996181 984470 972416
57964 972416 961304 952290 944451 936320 927857 919758 912141 904855 897814 890319 881557 872465 865447 861351
57950 861351 858311 854501 850399 847301 845160 843067 840565 837446 833504 829391 826460 824929 823575 821976
57936 821976 821430 822763 824879 826567 828041 829411 829317 826699 822682 819166 816618 814561 813007 811913 810260
57921 810260 807199 803206 798843 793497 786889 780743 777060 775258 772756 768183 762544 757462 753598 750831
57907 750831 748880 747513 746673 746261 745565 743615 740608 738190 737599 738274 738981 739357 739446 738722 736872 734847 733764
57890G33764p08k157m507n959n849m765l523k679k347k126j652j095n88M29K306
57875F98544M155M913M968N462O269O170M853L347K526K427K854L317K685L33
57861G52823k661m769n986p099p689o899n670n921p463q032o637m766l787l259
57847F72185k446j616r76L1J457K178J362l22j528j427m1J679K187R96j64P27
57831F74282L149M762M715M289M248L783K536J531J308R27k00j089p01N35J485
57816G05560J525N14j301l034l913m414n429o430o096m691l917m283m536m002
57802F55553l433l107k310j179q95j295o43J412L005L284M006O366Q621Q727P367
57787F85479O376N917N350N225O022O184M005Q06k96J418L355L015N90k055l543
$$ plain form
57890 733764 733056 730899 726392 720433 714584 709819 706296 703617 701270 699144 697492 696397 695809 696238 698544
57875 698544 702699 707612 712580 718042 724311 730481 735334 738681 741207 743634 746488 749805 752490 752823
57861 752823 750162 745393 739407 732308 724619 717720 712050 706129 698666 690634 683997 679231 675444 672185
57847 672185 669739 668123 667147 667178 668635 670813 672175 671853 670325 668898 668857 670536 672723 673719 673555 674282
57831 674282 677431 682193 686908 691197 695445 699228 701764 703295 704603 705530 705330 704241 703540 704075 705560
57816 705560 707085 707599 706298 703264 699351 694937 689508 683078 676982 672291 668374 664091 659555 655553
57802 655553 652120 649013 646703 645524 644629 643334 642691 644103 647108 650392 654398 660764 669385 678112 685479
57787 685479 691855 697772 703122 708347 714369 720553 724558 725364 725068 726486 729841 732856 733446 731391 727848
57772G27848l842l901m733o244p086o148l936j962j226j713k823l704l753l324
57758F73453l298l691l531k628k192k915l639l122k164k610m884p736r985j1205
57744F09853j1160r871q166p113o861o765o550o500o624o428n700m944m777n102
57730E13292n133m229k720j592j275j200r84j260k365k940j314J938M517N542
57716E00277O402Q169R987J0826J1115J1564J1731J0944R607Q500P640O762O040
57703F19564N422M256K441J054Q54J048N56k88k07J425M232P314R359R123O697
57688F72850L759J904J308J294J288P87l71j256o50Q24J015n55j621n13J159R79
57672F82201o27j214J71K287L876M688M656L818K875K511K395K010J937K955M256
$$ plain form
57772 727848 724006 720105 715372 709128 702042 695894 691958 689996 688770 687057 684234 680530 676777 673453
57758 673453 670155 666464 662933 660305 658113 655198 651559 648437 646273 643663 638779 631043 621058 609853
57744 609853 598693 588822 580656 573543 566682 559917 553367 546867 540243 533815 528115 523171 518394 513292
57730 513292 508159 503930 501210 499618 498343 497143 496159 494899 492534 489594 488280 490218 494735 500277
57716 500277 506679 514848 524835 535661 546776 558340 570071 581015 590622 599122 606762 613524 619564
57703 619564 624986 629242 631683 632737 633591 634639 635195 634907 634700 636125 640357 647671 657030 666153 672850
57688 672850 676609 678513 679821 681115 682403 683190 682819 681563 680913 681737 682752 682197 680576 680063 681222 682201
57672 682201 681574 680360 680531 682818 686694 691382 696038 699856 702731 705242 707637 709647 711584 714539 718795
57657G18795M105K039p32k958m140m029k724j249q49j524k106j828j076p35j324
57642F99665k646l780l842l165l021l842m665m919n378o306o148l734p70q6j925
57627F45438l793l840k648j669j404j454j104L23K789N183O419O853P790R916
57613F68799J3038J6864K0993K4625K7575L1216L7027M4153M9569N0706M6868
57602A031433L8376K5800J0578m737j7614k6748l2188l4857l5885l6013l5478
57591H82667l4506l3389l1859k9225k5621k2296k0087j8365j6233j3866j1783
57580F25437r719p289n026l740l465l876m844n692n041k718o70n40j291q16R48
57565E71658K226K018P21j125l003l814l008j919k234l548m171l874l792m027
$$ plain form
57657 718795 722900 724939 724207 721249 717109 713080 710356 709107 708258 706734 704628 702800 701724 700989 699665
57642 699665 697019 693239 689397 686232 683211 679369 674704 669785 664407 658101 651953 648219 647449 647363 645438
57627 645438 641645 637805 635157 633488 632084 630630 629526 629849 632638 637821 644240 651093 658883 668799
57613 668799 681837 698701 719694 744319 771894 803110 840137 884290 933859 984565 1031433
57602 1031433 1069809 1095609 1106187 1101450 1083836 1057088 1024900 990043 954158 918145 882667
57591 882667 848161 814772 782913 753688 728067 705771 685684 667319 651086 637220 625437
57580 625437 615718 608429 603403 599663 596198 592322 587478 581786 576745 574027 573357 572817 571526 570710 571658
57565 571658 573884 575902 576623 575498 572495 568681 565673 563754 561520 557972 553801 549927 546135 542108
57551E42108l537k406k025k720l162k548j697j548k105l134m419n062m116k200
57537E01429j086j371j992k184k413l039l589l728l667l452l105l443n134o848
57523D56378o305l525j185j079k043k250j876k165l147l713l303k406j718j561
57509D20102j872k255k337k172k046j956j658j025L7J616L221L886L464L087L434
57494D23526L655L095K855L972N280N067L867L349L258K113K94l40L21O38L81
57479D61331Q99K063K214J620K643N536P403O704N633O267P234O406M417L173
57465E23543K878K797L158M068M183K651R68Q15J406J156N13P52J244N00q75j064
57449E48693l38r14l421n839o378n525m825n177o738r130j1213j1743j0788r700
$$ plain form
57551 542108 538571 536165 534140 531420 528258 525710 524013 522465 520360 517226 512807 507745 503629 501429
57537 501429 500343 498972 496980 494796 492383 489344 485755 482027 478360 474908 471803 468360 463226 456378
57523 456378 450073 446548 445363 444284 442241 439991 438115 435950 432803 429090 425787 423381 421663 420102
57509 420102 418230 415975 413638 411466 409420 407464 405806 404781 404818 406434 409655 413541 417005 420092 423526
57494 423526 427181 430276 433131 437103 442383 447450 451317 454666 457924 460037 460331 459991 460312 460950 461331
57479 461331 462230 464293 466507 468127 470770 476306 483709 490413 496046 502313 509547 515953 520370 523543
57465 523543 526421 529218 532376 536444 540627 543278 544246 545061 546467 547623 548136 548888 550132 550632 549757 548693
57449 548693 548355 547441 544020 538181 531803 526278 521453 516276 509538 500408 489195 477452 466664 456964
57435D56964r434r525q985p562n827m418l461k617j641p97n26q69j555k446l293
57420C94008l340k132n56L4l65o64o64j194k243k712k455k671l557l578k134r77
57404C64800j514k394j660O8M97j077l157m188l725j978K74J627J168l50j364
57389C47027j273o94m24p64j374j318L7J760K041O85l38L68J779K327K151K133
57373C54123K004J044l46j328k061k874k907j201J426L222L693L481K754J310
57359C62340j11l24O32J641K083K100J740J161J196K287L244K698J484J738L596
57344C87505M576K855k60j943j019J192K569K118N06r01j383j250j012o95j55
57329C92703N21J256K148L058L502L336L008K975L352M204N363N917N015L292
$$ plain form
57435 456964 447530 438005 429020 421458 415631 411213 407752 405135 403494 402697 402171 401302 399747 397301 394008
57420 394008 390668 388536 387980 388014 387649 386985 386321 385127 382884 380172 377717 375046 371489 367911 365777 364800
57404 364800 363286 360892 359232 359300 359797 358720 355563 351375 347650 345672 345946 347573 348741 348391 347027
57389 347027 345754 345060 344636 343872 342498 341180 341217 342977 345018 345703 345365 345733 347512 349839 351990 354123
57373 354123 356127 357171 356825 355497 353436 350562 347655 346454 347880 351102 354795 358276 361030 362340
57359 362340 362229 361905 362537 364178 366261 368361 370101 371262 372458 374745 377989 380687 382171 383909 387505
57344 387505 392081 394936 394676 392733 391714 392906 395475 397593 398099 397198 395815 394565 393553 392858 392703
57329 392703 393224 394480 396628 399686 403188 406524 409532 412507 415859 420063 425426 431343 436358 439650
57315D39650K278K213J857P78J36N71R92L87o85j319j496j263k95P89M29j464
57299D43558k930k957k990l991m303k494k21J87o85p38P8L30R6N70J564K051K501
57282D29626L985N499N019K968J920K685L340K391O45o27j319j703j707j412j083
57267D50227m42Q09J973K070J320O43J8j203k755l614l325j982L84L014M106L001
57251D54244J700K272L700L557J826N28K97O9k07O49K476L551L165K267J441L70
57235D81905p09j136j275j715j410R20L854M527K761J189J121J309J100J741L566
57220D97748M810M500M089M968O413P165P084O360N004M004M992P761J0027J0569
57206E85494J0786J2211J4361J6008J6872J7061J6557J6157J7212J9477K0829
$$ plain form
57315 439650 441928 444141 445998 446776 446912 447483 448475 448862 448177 446858 445362 444099 443804 444593 445022 443558
57299 443558 440628 437671 434681 430690 426387 423893 423672 423859 423174 422436 422514 422844 422940 423510 425074 427125 429626
57282 429626 433611 439110 444129 447097 449017 451702 455042 457433 458078 457451 456132 454429 452722 451310 450227
57267 450227 449785 450594 452567 454637 455957 456600 456618 455415 452660 449046 445721 443739 444123 447137 451243 454244
57251 454244 455944 458216 461916 465473 467299 467827 468124 468193 467986 468635 471111 474662 477827 480094 481535 481905
57235 481905 481196 480060 478785 477070 475660 476580 480434 484961 487722 488911 490032 491341 492441 494182 497748
57220 497748 502558 507058 511147 516115 522528 529693 536777 543137 548141 552145 557137 564898 574925 585494
57206 585494 596280 608491 622852 638860 655732 672793 689350 705507 722719 742196 763025
57195G63025K0054J8388J7360J6801J5996J5241J5031J4886J4143J3098J2423
57184I36446J2123J1712J0872R700Q888R417J1315J3120J3483J2734J1847J0928
57172A072585J0219J1210J4674J8681K0942K2080K3974K6228K7519K9256L3907
57161A311275M0128M3848M4270M4478M5688M5519M3160M1718M3338M5998M7429
57150A796849M8752N1599N4620N5561N4576N3240N2267N2047N3243N5146N5593
57139B383493N4204N3485N5098N7334N7962N7282N6594N5904N4856N3950N3191
57128B993353N1543M9211M8261M9625N1666N3010N4340N6115N7169N7207N8025
57117C579525O0478O2685O2961O2217O1966O2471O4147O7998P3037P6240P6758
$$ plain form
57195 763025 783079 801467 818827 835628 851624 866865 881896 896782 910925 924023 936446
57184 936446 948569 960281 971153 980853 989741 999158 1010473 1023593 1037076 1049810 1061657 1072585
57172 1072585 1082804 1094014 1108688 1127369 1148311 1170391 1194365 1220593 1248112 1277368 1311275
57161 1311275 1351403 1395251 1439521 1483999 1529687 1575206 1618366 1660084 1703422 1749420 1796849
57150 1796849 1845601 1897200 1951820 2007381 2061957 2115197 2167464 2219511 2272754 2327900 2383493
57139 2383493 2437697 2491182 2546280 2603614 2661576 2718858 2775452 2831356 2886212 2940162 2993353
57128 2993353 3044896 3094107 3142368 3191993 3243659 3296669 3351009 3407124 3464293 3521500 3579525
57117 3579525 3640003 3702688 3765649 3827866 3889832 3952303 4016450 4084448 4157485 4233725 4310483
57106D310483P7351P9859Q2404Q2978Q2590Q2688Q2639Q2149Q3131Q6604R0514
57095E223390R3022R5145R7852R9579R9268R8855J00131J01687J01545J00122
57085F210596R8175R4619Q8729Q1892P4944O6644N6591M6584L7301K7166J6179
57074F899420O896j73p713j6214k2489k5759k9768l6041m0785m1851m2860m6614
57062F596049n0483n2642n6797o5945p7322q8471j02300j21020j41227j60391
57052E679451j81813k07752k34448k59542k86927l18182l47427l71168l93966
57043C078226m16660m28397m18218l83686l19311k10315n2593J27484K78393L34754
57033A589677K26205q2202n30522B19464a141034j717467k141665k573603k824187
$$ plain form
57106 4310483 4387834 4467693 4550097 4633075 4715665 4798353 4880992 4963141 5046272 5132876 5223390
57095 5223390 5316412 5411557 5509409 5608988 5708256 5807111 5907242 6008929 6110474 6210596
57085 6210596 6308771 6403390 6492119 6574011 6648955 6715599 6772190 6818774 6856075 6883241 6899420
57074 6899420 6906316 6906143 6898430 6882216 6859727 6833968 6804200 6768159 6727374 6685523 6642663 6596049
57062 6596049 6545566 6492924 6436127 6370182 6292860 6204389 6102089 5981069 5839842 5679451
57052 5679451 5497638 5289886 5055438 4795896 4508969 4190787 3843360 3472192 3078226
57043 3078226 2661566 2233169 1814951 1431265 1111954 901639 849046 976530 1254923 1589677
57033 1589677 1815882 1733680 1203158 219464 -1141034 -2858501 -5000166 -7573769 -10397956
57024a0397956k805186k687765k788058l323102m289279n498940o652651p411324
57016d5854261p513864o891888n665888m031355k168837k39133J607164L253805
57008f7504257M626710N656029O255287O364476O003757N272103M310274L278749
57000b5736872K344462J644271J240896J113542J185944J360984J547643J683540
56992a3615590J745198J736820J671450J563919J431746J290861J150202J015013
56984b010381Q92037c32002C64573O18621N50843M91820M37322L84949L38144
56975C186272L00358K68646K38012K08720J84209J64833J48758J36141J27452
56966D963401J20529J14281J12375J17715J25364J26283J16261R6330O6819K7559
$$ plain form
57024 -10397956 -13203142 -15890907 -18678965 -22002067 -26291346 -31790286 -38442937 -45854261
57016 -45854261 -53368125 -60260013 -65925901 -69957256 -72126093 -72365226 -70758062 -67504257
57008 -67504257 -62877547 -57221518 -50966231 -44601755 -38597998 -33325895 -29015621 -25736872
57000 -25736872 -23392410 -21748139 -20507243 -19393701 -18207757 -16846773 -15299130 -13615590
56992 -13615590 -11870392 -10133572 -8462122 -6898203 -5466457 -4175596 -3025394 -2010381
56984 -2010381 -1118344 -332002 364573 983194 1534037 2025857 2463179 2848128 3186272
56975 3186272 3486630 3755276 3993288 4202008 4386217 4551050 4699808 4835949 4963401
56966 4963401 5083930 5198211 5310586 5428301 5553665 5679948 5796209 5892539 5959358 5986917
56956E986917j6724n7246q8409j10445j25277j34139j39349j43984j48702j51922
56946D870720j53650j56285j61238j67633j74863j83843j94802k05595k12940
56937C259871k14391k09456k00062j89302j78522j66334j51810j37197j25555
56928A687242j16844j08544r9471r0784q3745p8393p4171p0337o6245o2404o0277
56917G76027n9762n8317n4314m9668m6972m5372m1924l6146l0496k6742k4343
56906C01971k2288k0363j8476j6469j4617j2948j0525o769k746L88L131N983P203
56893A93475M730l96n057q208j1439j5632j9570k2058k3138k2855k1008j8488
56881C0356A3551b295j3986j0763p623n412l246n16J852L187M495O854R483g444
$$ plain form
56956 5986917 5970193 5912947 5824538 5714093 5588816 5454677 5315328 5171344 5022642 4870720
56946 4870720 4717070 4560785 4399547 4231914 4057051 3873208 3678406 3472811 3259871
56937 3259871 3045480 2836024 2635962 2446660 2268138 2101804 1949994 1812797 1687242
56928 1687242 1570398 1461854 1362383 1271599 1187854 1109461 1035290 964953 898708 836304 776027
56917 776027 716265 657948 603634 553966 506994 461622 419698 383552 353056 326314 301971
56906 301971 279683 259320 240844 224375 209758 196810 186285 179516 176770 177158 180289 186272 193475
56893 193475 198205 197809 192752 184544 173105 157473 137903 115845 92707 69852 48844 30356
56881 30356 13551 -2295 -16281 -27044 -34667 -40079 -43325 -43841 -41989 -38802 -34307 -27453 -17970 -7444
56866A670N832J564l385c516j5568k0750k2410k0184j6672j4696j4222j3351j1559
56853a52928j0007r062p790o090n081m830l750j148J319J788N14q89j296m59J285
56838a98424K922L383K947K966L828M503M676N714Q539J1887J3896J4360J4271
56825a04532J4180J4091J4096J3896J2479R424N809K856N37j371j943l95J985
56812a8888L015K480K194L349b546D619R019J1104J3143J5073J7586K1243K5602
56799A17389K9641L2573L3895L3190L0236K5068J7769Q668j045r389j4683j6526
56787B86786j5733j3647j1453r683q109o158l359O47O037J2326J8472K4113L0300
56774C10539L7919M5728N0996N2124M9391M3150L2966J9336M781q046j8489k6965
$$ plain form
56866 1670 7502 9066 5681 -3516 -19084 -39834 -62244 -82428 -99100 -113796 -128018 -141369 -152928
56853 -152928 -162935 -171997 -179787 -185877 -190958 -195788 -199538 -200686 -199367 -197579 -197065 -197954 -199250 -199709 -198424
56838 -198424 -195502 -192119 -189172 -186206 -182378 -177875 -173199 -167485 -158946 -147059 -133163 -118803 -104532
56825 -104532 -90352 -76261 -62165 -48269 -35790 -26366 -20557 -17701 -17164 -18535 -20478 -20873 -18888
56812 -18888 -15873 -13393 -11199 -7850 -2546 4619 13638 24742 37885 52958 70544 91787 117389
56799 117389 147030 179603 213498 246688 276924 301992 319761 328429 327384 317995 303312 286786
56787 286786 271053 257406 245953 236270 228161 222003 218644 219291 225328 237654 256126 280239 310539
56774 310539 348458 394186 445182 497306 546697 589847 622813 642149 646930 638884 620395 593430
56762E93430l2835l4899l3686l1514k9756k7407k3020j7138j1812q086m904o72
56750C37701M733J0022J4363J8381K2773K6454K7171K3977J8044J0622J603q935
56738E06909j8928k5743k8906k9977k9998k8711k6238k3775k1979k0079j7220
56727B35355j3621r857o063k454N80L522P635J2825J6761J7200J4408J0160N293
56714B91744l83o377j1288j4317j5970j7202j8559j9942k0596j9726j7737j6211
56702A13436j5929j5646j3935j1480j0228j0687j1528j1551A905f476m950j262
56690a2688P77L47j436k914l310k681j527o24l56j37O31J233M58j264k030r85
56674b6506P02J725K091K160J592J11j720l192m065m065k832r26K74L21K15O40
$$ plain form
56762 593430 560595 525696 492010 460496 430740 403333 380313 363175 351363 343277 338373 337701
56750 337701 342434 352456 366819 385200 407973 434427 461598 485575 503619 514241 515844 506909
56738 506909 487981 462238 433332 403355 373357 344646 318408 294633 272654 252575 235355
56727 235355 221734 211877 205814 203360 203940 207462 215097 227922 244683 261883 276291 286451 291744
56714 291744 291361 284984 273696 259379 243409 226207 207648 187706 167110 147384 129647 113436
56702 113436 97507 81861 67926 56446 46218 35531 24003 12452 1905 -6476 -11426 -12688
56690 -12688 -11911 -11564 -13000 -15914 -19224 -21905 -23432 -24056 -24412 -24549 -23918 -22685 -22227 -23491 -25521 -26506
56674 -26506 -25804 -24079 -21988 -19828 -18236 -18125 -19845 -23037 -27102 -31167 -33999 -34925 -34651 -34330 -34115 -33475
56658c3475J010J003J505K782L286J857n0k16J056J583P45J63P88J441R65J10
56642a5447K39J218J830J654J397J487J347L48j132k017j677l37J474L301a765
56626B787L435K310J971J876J356J208K725N280O635N949M860M859N168M322K516
56611E7257J044L45j6j94k45q30k327l686l553k255j383j652k418l130l885m536
56595B8536m535l849l031k239j171M6Q92J509K614M165N071M627L442K742L341
56580D2160N183P174P665O103M109L774M988N813N361M694M573M278L425L038
56566A12338L462K934J42k967l122q2L096M019L167J889K91j703k888j989L55
56551A18942K267K889K736K045K77k475m812n487m682l317j904q37r39k478m159
$$ plain form
56658 -33475 -32465 -31462 -29957 -27175 -23889 -22032 -22082 -22298 -21242 -19659 -18914 -18751 -17963 -16522 -15557 -15447
56642 -15447 -15208 -13990 -12160 -10506 -9109 -7622 -6275 -5927 -7059 -9076 -10753 -11090 -9616 -6315 -1765
56626 2787 6222 8532 10503 12379 13735 14943 17668 22948 29583 35532 40392 45251 50419 54741 57257
56611 57257 58301 58646 58630 58436 58191 57361 55034 51348 47795 45540 44157 42505 40087 36957 33072 28536
56595 28536 24001 20152 17121 14882 13711 13757 14649 16158 18772 22937 28008 32635 36077 38819 42160
56580 42160 47343 54517 62182 68285 72394 76168 81156 86969 92330 97024 101597 105875 109300 112338
56566 112338 115800 118734 118876 115909 112787 112705 115801 119820 122987 124876 125167 123464 120576 118587 118942
56551 118942 121209 124098 126834 128879 129156 126681 121869 116382 111700 108383 106479 105642 104703 102225 98066
56536I8066m325l052j802j186n60J8o04k338k922q42K106K982J517j18q05j440
56520H4695k434k511r06J092J875J665J765K620L660M380M680M630M688N478O645
56505A22022O645M689K323J874L709O120P641Q317Q719Q894Q647P854O268L821
56491B07543J422N28J425K609K510J215j06r51j805k944l844l934l317k452j517
56476A96382n40J76K19j95j43R30K208K138K51k082l127k632j707j179q47l11
56460A89541K41M42K63k17j137k484l807m654m913m511l273j562m00l97r49j211
56444A60972j297j742k247k077j418j173j407j185j68Q12J069Q45M35l41j256
56429A49822j372m04O15P95N64N31K09r60k184k200j105QO90J229J570J521J685
$$ plain form
56536 98066 93741 90689 88887 87701 87141 87159 86555 84217 81295 80453 82559 85541 87058 86940 86135 84695
56520 84695 82261 79750 78844 79936 81811 83476 85241 87861 91521 95901 100581 105211 109899 115377 122022
56505 122022 128667 133356 135679 137553 141262 147382 155023 163340 172059 180953 189600 197454 203722 207543
56491 207543 208965 209493 210918 213527 216037 217252 217146 216195 214390 211446 207602 203668 200351 197899 196382
56476 196382 195842 196018 196237 196042 195899 196829 199037 201175 201426 199344 196217 193585 191878 190699 189852 189541
56460 189541 189782 190224 190487 190270 189133 186649 182842 178188 173275 168764 165491 163929 163529 163132 162183 160972
56444 160972 159675 157933 155686 153609 152191 151018 149611 148426 148258 149070 150139 150984 151419 151078 149822
56429 149822 148450 148046 148661 149456 150020 150551 150760 149800 147616 145416 144311 144319 145009 146238 147808 149329 151014
56412A51014K697L745L330J585L10N44J441J884J801J438O64l32p94m06K58P27
56396A69906J033R16o9j195q60Q75J596l07l032l577j677J86L64j63K49J674K984
56379A68903L448L241K723J866N57p59j068R2J677J959N42j096j429n38N22J288
56363A81928J974K541K498J607J99j122j758j403m90K4l03q40o32N76K208L265
56347A90272K723M65j939k392q16N27L6j041n90J163K118J332j32j259k153k714
56331A85600j927N75L266M189L208K050K142L032L188K087R78J283K621L209K301
56316B17802J176J312K557L908N210O840Q289Q426P150N604M655M103L489K830
56302B83351K331K064K118K492K835K805K639K804L216L425L484L877M718N664
$$ plain form
56412 151014 153711 157456 160786 162371 162681 163225 164666 166550 168351 169789 170453 170121 169327 168921 169179 169906
56396 169906 170939 171855 171786 170591 169731 170606 172202 171895 168863 165286 163609 163795 164159 163996 164245 165919 168903
56379 168903 172351 175592 178315 180181 180738 179979 178911 179003 180680 182639 183181 182085 180656 180118 180640 181928
56363 181928 183902 186443 188941 190548 190747 189625 187867 186464 185974 185998 185695 184855 184223 184799 187007 190272
56347 190272 192995 193460 191521 189129 188313 188840 188876 187835 187245 188408 190526 191858 191726 190467 188314 185600
56331 185600 183673 184248 187514 191703 194911 196961 199103 202135 205323 207410 208388 209671 212292 215501 217802
56316 217802 218978 220290 222847 226755 231965 238805 247094 255520 262670 268274 272929 277032 280521 283351
56302 283351 285682 287746 289864 292356 295191 297996 300635 303439 306655 310080 313564 317441 322159 327823
56288C27823O498P049O707M988K626J084O48Lj869m091m844l498j213M15Q33P21
56272C43880R72J715K303K197J621J272J601K525L536L953L430K397J721J778
56258C74901K269K846L275K995J508m14j066O6J563K157K449L537N051N913O093
56243D13143O300O463O094N587N682O007N666N031N389O872Q203Q559Q452Q590
56229E06038R134J0017J0902J0961R895Q992R804J1943J3561J3929J3987J4535
56217F43698J5476J6886J9033K1233K2447K3150K4816K7246K8591K8580K9378
56206I00534L2222L5413L7174L8558M1604M6059N0076N3297N7088O1954O6633
56195A420612P0062P3055P7540Q4719R4160J04390J14472J24998J37108J50551
$$ plain form
56288 327823 334321 341370 348077 353065 355691 356775 357423 357426 355557 351466 346622 343124 341911 342326 343159 343880
56272 343880 344852 346567 348870 351067 352688 353960 355561 358086 361622 365575 369005 371402 373123 374901
56258 374901 377170 380016 383291 386286 387794 387380 386314 386380 387943 390100 392549 396086 401137 407050 413143
56243 413143 419443 425906 432000 437587 443269 449276 454942 459973 465362 472234 480437 488996 497448 506038
56229 506038 515172 525189 536091 547052 556947 565939 575743 587686 601247 615176 629163 643698
56217 643698 659174 676060 695093 716326 738773 761923 786739 813985 842576 871156 900534
56206 900534 932756 968169 1005343 1043901 1085505 1131564 1181640 1234937 1292025 1353979 1420612
56195 1420612 1490674 1563729 1641269 1725988 1820148 1924538 2039010 2164008 2301116 2451667
56185B451667J63391J73826J81571J87251J91541J95131J98276J99681J96963
56176D139298J89059J77234J62949J45763J24376R8817P0455M0593J0244j9202
56166E139586m6475p1400r4468j15553j33795j48578j59845j67757j72770j75788
56156C853157j77413j77094j73774j67449j59604j52103j45967j41023j36258
56147B422472j30489j23072j14288j05102r6617q9418q3097p6604o9592o3082
56137A471111n8253n4783n1372m7526m3789m0314l6576l2687k9496k6974k3959
56126A025382k0196j7266j6476j6934j6800j5520j3777j2049j0466r486r474r799
56114H57139r329p761n829m316l423k915k344j308K62K157M245O367P935Q347
$$ plain form
56185 2451667 2615058 2788884 2970455 3157706 3349247 3544378 3742654 3942335 4139298
56176 4139298 4328357 4505591 4668540 4814303 4938679 5037496 5107951 5148544 5158788 5139586
56166 5139586 5093111 5021711 4927243 4811690 4677895 4529317 4369472 4201715 4028945 3853157
56156 3853157 3675744 3498650 3324876 3157427 2997823 2845720 2699753 2558730 2422472
56147 2422472 2291983 2168911 2054623 1949521 1852904 1763486 1680389 1603785 1534193 1471111
56137 1471111 1412858 1358075 1306703 1259177 1215388 1175074 1138498 1105811 1076315 1049341 1025382
56126 1025382 1005186 987920 971444 954510 937710 922190 908413 896364 885898 876412 866938 857139
56114 857139 847810 840049 834220 829904 826481 823566 821222 819914 820176 822333 826578 832945 840880 849227
56100H49227P886P550P880Q742J0135J2126J3971J4711J4970J6732K0695K5111
56088A009736K8007K9459L0835L3013L6227M0632M5963N1436N6914O3437P1730
56077A497389Q0944Q9480R6203J00206J00521R7087R1260Q4567P7680P1175O6049
56066B452561O2520N9299N4976M9293M2289L3460K2863J2086K824m873j2157k0026
56054B755115k9138l9848n1496o2605p2452q1198q7885r0229q7774q3366p9767
56043A989357p6339p1021o4048n7252n0871m3823l6671l1627k9380k8114k5977
56032A474234k2833j9283j5591j2042r157p121n804n261n391n360m326k421k26
56019A359418K235N059P603R225J0334J1659J3041J4016J4837J5823J6469J6473
$$ plain form
56100 849227 857113 864663 872543 881285 891420 903546 917517 932228 947198 963930 984625 1009736
56088 1009736 1037743 1067202 1098037 1131050 1167277 1207909 1253872 1305308 1362222 1425659 1497389
56077 1497389 1578333 1667813 1764016 1864222 1964743 2061830 2153090 2237657 2315337 2386512 2452561
56066 2452561 2515081 2574380 2629356 2678649 2720938 2754398 2777261 2789347 2792171 2787298 2775141 2755115
56054 2755115 2725977 2686129 2634633 2572028 2499576 2418378 2330493 2240264 2152490 2069124 1989357
56043 1989357 1913018 1841997 1777949 1720697 1669826 1626003 1589332 1557705 1528325 1500211 1474234
56032 1474234 1451401 1432118 1416527 1404485 1395328 1388207 1382403 1377142 1371751 1366391 1362065 1359644 1359418
56019 1359418 1361653 1366712 1374315 1383540 1393874 1405533 1418574 1432590 1447427 1463250 1479719 1496192
56007A496192J6790J8148J9441J9271J8417J8844K0714K2366K3074K3970K5966
55996A723193K8473L0485L1747L2468L2883L3255L3643L3801L3778L4111L4884
55985B082721L5422L5642L6645L8869M0880M1384M1410M2907M5991M9150N1405
55974B542426N2823N3718N4860N7713O2755O8287P2368P5168P8017Q1247Q4616
55963C283998Q8699R3875R8848J02331J05372J09996J16210J22438J28425J35550
55953D385742J44512J54449J64260J73496J82385J91924K03047K14817K24952
55944F039584K33222K42358K54213K67239K79648K92532L07530L23798L40097
55935H580221L57654L78022M00289M23388M48917M78410N10157N42184N75976
$$ plain form
56007 1496192 1512982 1531130 1550571 1569842 1588259 1607103 1627817 1650183 1673257 1697227 1723193
55996 1723193 1751666 1782151 1813898 1846366 1879249 1912504 1946147 1979948 2013726 2047837 2082721
55985 2082721 2118143 2153785 2190430 2229299 2270179 2311563 2352973 2395880 2441871 2491021 2542426
55974 2542426 2595249 2648967 2703827 2761540 2824295 2892582 2964950 3040118 3118135 3199382 3283998
55963 3283998 3372697 3466572 3565420 3667751 3773123 3883119 3999329 4121767 4250192 4385742
55953 4385742 4530254 4684703 4848963 5022459 5204844 5396768 5599815 5814632 6039584
55944 6039584 6272806 6515164 6769377 7036616 7316264 7608796 7916326 8240124 8580221
55935 8580221 8937875 9315897 9716186 10139574 10588491 11066901 11577058 12119242 12695218
55926A2695218O13665O54039O95364P39422P88337Q40114Q92406R48103J011829
55917A9878497J083176J159029J240147J329578J426975J531217J646533J779199
55909C1074351J929935K096489K281643K491456K728484K995687L305685L677639
55901E2581369M126452M662371N296248O034155O872135P812075Q882100J0127412
55893A06394317J1583228J3270644J5210460J7413654J9853542K2456557K5076762
55886B31259164K7377892K8690333K8078356K4739433J8510390J0089207Q09044
55879C69553819p854753j4755596j9350995k1729973k2412435k2034744k1102953
55872B40312370j9921116j8645475j7353741j6084289j4860456j3704476j2631909
$$ plain form
55926 12695218 13308883 13962922 14658286 15397708 16186045 17026159 17918565 18866668 19878497
55917 19878497 20961673 22120702 23360849 24690427 26117402 27648619 29295152 31074351
55909 31074351 33004286 35100775 37382418 39873874 42602358 45598045 48903730 52581369
55901 52581369 56707821 61370192 66666440 72700595 79572730 87384805 96266905 106394317
55893 106394317 117977545 131248189 146458649 163872303 183725845 206182402 231259164
55886 231259164 258637056 287327389 315405745 340145178 358655568 368744775 369553819
55879 369553819 361699066 346943470 327592475 305862502 283450067 261415323 240312370
55872 240312370 220391254 201745779 184392038 168307749 153447293 139742817 127110908
55865A27110908j1640593j0715442r841154r003888q188511p387106o608888n873114
55857E7852212n193646m576474m027186l550345l141982k790951k488255k229415
55849B9853958k008787j818125j651255j505283j377333j264031j163566j074549
55841A7991029r93805r18795q50564p90783p37584o87973o42273o01966n65207
55832A1202079n28937m93928m63262m37006m12676l89793l69616l51296l32589
55823G422976l13613k95959k78886k60610k42603k28370k18268k09654k01841
55814E173172j96626j93901j90937j86629j82641j79626j75894j70701j65596
55805C530621j61443j56869j50705j43523j35877j27161j17106j06678r7008q8815
$$ plain form
55865 127110908 115470315 104754873 94913719 85909831 77721320 70334214 63725326 57852212
55857 57852212 52658566 48082092 44054906 40504561 37362579 34571628 32083373 29853958
55849 29853958 27845171 26027046 24375791 22870508 21493175 20229144 19065578 17991029
55841 17991029 16997224 16078429 15227865 14437082 13699498 13011525 12369252 11767286 11202079
55832 11202079 10673142 10179214 9715952 9278946 8866270 8476477 8106861 7755565 7422976
55823 7422976 7109363 6813404 6534518 6273908 6031305 5802935 5584667 5375013 5173172
55814 5173172 4976546 4782645 4591708 4405079 4222438 4042812 3866918 3696217 3530621
55805 3530621 3369178 3212309 3061604 2918081 2782204 2655043 2537937 2431259 2334251 2245436
55795B245436q2627p7921p2610o5425n8170n3397n0671m7801m4831m3616m3872
55784A604495m3229m1304m0162m0219l9211l6154l3037l1394l0107k8090k6391
55773A215197k5977k5743k4353k2237k0309j8560j7080j6633j7019j6801j5838
55762I94647j6027j8072j9625j8534j6240j5725j7320j8707j8334j6818j5315
55751H03930j4221j3421j2602j1294r436p696o617n848m821l692k912k470k140
55738G06760j932j593l34K114M591N497M503K758J537J207J290J149O77M35R35
55723G29594J781J988J139k99j823l516n693q482j1758j4933j6862j6776j5282
55710F39078j3636j2041r763p042n492n842o429n128k193j66r89l974o630p088
$$ plain form
55795 2245436 2162809 2084888 2012278 1946853 1888683 1835286 1784615 1736814 1691983 1648367 1604495
55784 1604495 1561266 1519962 1479800 1439581 1400370 1364216 1331179 1299785 1269678 1241588 1215197
55773 1215197 1189220 1163477 1139124 1116887 1096578 1078018 1060938 1044305 1027286 1010485 994647
55762 994647 978620 960548 940923 922389 906149 890424 873104 854397 836063 819245 803930
55751 803930 789709 776288 763686 752392 742956 735260 728643 722795 717974 714282 711370 708900 706760
55738 706760 704828 703235 702901 705015 709606 715103 719606 722364 723901 725108 726398 727547 728224 728659 729594
55723 729594 731375 733363 734502 734203 732380 728864 723171 714689 702931 687998 671136 654360 639078
55710 639078 625442 613401 603638 596596 591104 585262 578833 573705 571512 571346 570357 566383 559753 552665
55696E52665n619l991l546m071m619m945n588o808q159r141r627r639r203q542
55682D59167p884p218o584o347o552o396n199l578k703k672k788l084m076n076
55668C89010m526k537j383k523m531n111m103l121k991l032k612k172k434l398
55654C44536m334m417l412j887o94j53L5J48K84P73J896L001K809J080r02k058
55638C36705k840m124n634o462o475o125n352l867k233j436j389j080l82m51j813
55623B87042l110k648n82J340J963J859K233L392M597N043M541L420K135J152
55609C12377R30J622K693L108K227M99r11j316j093r90j107r49l56J21M1l07l76
55592C16213j92r4J4M38R11Q17K48K4M12P16M58J00J8m31j863l556m203l643k990
$$ plain form
55696 552665 547046 543055 539509 535438 530819 525874 520286 513478 505319 496178 486551 476912 467709 459167
55682 459167 451283 444065 437481 431134 424582 418186 412987 409409 406706 404034 401246 398162 394086 389010
55668 389010 384484 381947 380564 378041 373510 368399 364296 361175 358184 355152 352540 350368 347934 344536
55654 344536 340202 335785 332373 330486 329792 329639 329674 329822 330106 330879 332775 335776 338585 339665 338763 336705
55638 336705 333865 329741 324107 317645 311170 305045 299693 295826 293593 292157 290768 289688 289306 288855 287042
55623 287042 283932 281284 280702 282042 284005 285864 288097 291489 296086 301129 305670 309090 311225 312377
55609 312377 313307 314929 317622 320730 322957 323456 322545 321229 320136 319146 318039 317090 316734 316855 316896 316589 316213
55592 316213 316021 315927 315941 316379 317290 318107 318355 318379 318791 319507 319965 320065 320083 319652 317789 314233 310030 306387 303397
55573C03397l147m041n186o107o263n313l689k357j949k550m060o031p322o767
55559B38615m484j948o39r48k246l438l503k255o70j0n61j688k834l785m156l582
55543B01868k516j992k355k930l171l330l750m138l916k874j287K07Q37L69m29
55528A70593n59n2J72l89j283j828j627m00J700L597M060L171K247K193K823L801
55512A88219N008N833N414M091L382L953M820N208N744O822P156N434K501L78
55498B53963l32p25j686l066m519n952p236q445j0111j2176j3046j1131p371m737
55484A63430m848o245o613n590m547m303m109k798k87K378M131M843N057M970
55470A45469M290L259K980L897M556L129J23j760q92J296K227J225l44j209j339
$$ plain form
55573 303397 300250 296209 291023 284916 278653 273340 269651 267294 265345 262795 258735 252704 245382 238615
55559 238615 234131 232183 231544 230596 228350 224912 221409 219154 218484 218474 217913 216225 213391 209606 205450 201868
55543 201868 199352 197360 195005 192075 188904 185574 181824 177686 173770 170896 169609 169816 170653 171022 170593
55528 170593 170034 169982 170154 169765 168482 166654 165027 164627 166327 169924 173984 177155 179402 181595 184418 188219
55512 188219 193227 199060 204474 208565 211947 215900 220720 225928 231672 238494 245650 251084 253585 253963
55498 253963 253631 252906 251220 248154 243635 237683 230447 222002 211891 199715 186669 175538 168167 163430
55484 163430 158582 152337 145724 140134 135587 131284 127175 124377 124090 126468 130599 135442 140499 145469
55470 145469 149759 153018 155998 159895 164451 167580 167703 165943 165051 166347 168574 169799 169455 168246 166907
55455A66907j146o49K32J296K260K871K671J251q83k268j937o03J84j35p75r39
55439A68337o74k57L48R09N88r75k693l106k220j390j388j611j339q11n07k38
55423A52973L37Q16N06m73j265j437j395j628j979j969j490r95r39j178j063k55
55407A38566O86Q98L48m2L89J162J296N93k32n19m18n01q79r30r7J210J912J649
55389A45091J328J756K257J583K9o10N17K068K342J340J04j097k581l760l322
55374A47045j139J188K074J500L90p09j688k207j847r40n07j056j783j423J24
55359A39022J435J072p92k497k630j202P18K058K288J453R0j080j693j901j924
55344A34417j693j138m45J25M95O10M33K81P92K054L146K927J271q49k212k215
$$ plain form
55455 166907 165761 165112 165344 166640 168900 171771 174442 175693 174810 172542 170605 170002 170186 170051 169276 168337
55439 168337 167663 167406 167754 168663 169251 168276 165583 162477 160257 158867 157479 155868 154529 153718 153211 152973
55423 152973 153310 154126 154632 154159 152894 151457 150062 148434 146455 144486 142996 142001 141062 139884 138821 138566
55407 138566 139252 140150 140498 140456 140845 142007 143303 143896 143664 143145 142727 142226 141347 140417 140320 141530 143442 145091
55389 145091 146419 148175 150432 152015 152044 151434 151951 154019 156361 157701 157805 156708 154127 150367 147045
55374 147045 145906 147094 149168 150668 151058 150349 148661 146454 144607 143667 143160 142104 140321 138898 139022
55359 139022 140457 141529 140737 138240 135610 134408 135126 137184 139472 140925 141015 139935 138242 136341 134417
55344 134417 132724 131586 131141 131266 131761 132371 132804 133085 133877 135931 139077 142004 143275 142426 140214 137999
55328A37999j171j46o3o26m78J058K890L408K399Q74n70k110l383l205j145J455
55312A37186K739K157N58r80j812j755j264j324k428l693l707k252n22M12O29
55297A23944O64N48J08m38p94j130j620j737q10Q68K244K730K467J528p6j495
55281A27001j478k21M21n50j695j230L06J029O76O77J503J883J131M40Q92J537
55265A32322O82j685l832m211k688j90J988K869K432J567J063Q89O10M1o95j343
55249A29819j406n07P99J262M58m49o4J614L365M003L074Q99j349k200j217M48
55233A38549J368J230N93j61q93j339j322j046o69n2O27P09J69L5Q65J637J213
55216A41513J15m52o51j551k963l418k381r39k2O02J201J291O57R5K88P28N34
$$ plain form
55328 137999 136828 136682 136619 135993 135515 136573 139463 142871 145270 146144 145574 143464 140081 136876 135731 137186
55312 137186 139925 142082 142640 141660 139848 138093 136829 135505 133077 129384 125677 123425 122903 123315 123944
55297 123944 124608 125156 125264 124826 124032 122902 121282 119545 118735 119603 121847 124577 127044 128572 128496 127001
55281 127001 125523 125302 125723 125173 123478 122248 122554 123583 124259 124936 126439 128322 129453 129893 130785 132322
55265 132322 133004 131319 127487 123276 120588 120398 122386 125255 127687 129254 130317 131206 131816 131857 131162 129819
55249 129819 128413 127906 128705 129967 130425 129976 129912 131526 134891 138894 141968 142867 141518 139318 138101 138549
55233 138549 139917 141147 141740 141579 140686 139347 138025 136979 136310 136258 136885 137594 137763 137798 138663 140300 141513
55216 141513 141628 141176 140525 138974 136011 132593 130212 129273 129251 129853 131054 132345 133002 133097 133385 134113 134647
55199A34647j71m66J00R64J238O38k86p12m38N5L30M33M07J16l8P76K216K344
55181A42153J74k295k391n70K22j127k620k576j934j971k006j017J06On79J93
55165A23768K271L690L395K378J835J648J119L2j421k774l186k061j13J064Q93
55150A32538M53Q25J611J734J091N21N09P48Q92J019J083O38n27j851k525k324
55134A36435j563n27N20R96M94l55l14Q06J730J400L07n04r41j466j879j597p26
55117A32816K80J619L376M246K746j90j763r50K25j11j061q65K26P60O29P89J154
55100A43926P81oL23K131L900M338L688K577J020p57j811j804j798k650l405k486
55084A47967j9K154K667J770L89q44j380o82R93K378K460J584O73j97j442k478
$$ plain form
55199 134647 134476 134010 134110 135074 136312 136950 136664 135952 135514 135569 135899 136332 136739 136855 136817 137593 139809 142153
55181 142153 142327 140032 137641 137071 137293 136166 133546 130970 129036 127065 125059 124042 124148 124154 123575 123768
55165 123768 126039 129729 133124 135502 137337 138985 140104 140136 138715 135941 132755 130694 130581 131645 132538
55150 132538 132991 133816 135427 137161 138252 138773 139282 140030 140922 141941 143024 143662 143135 141284 138759 136435
55134 136435 134872 134345 134865 135861 136355 136000 135686 136492 138222 139622 139929 139425 138484 137018 135139 133542 132816
55117 132816 133096 134715 138091 142337 145083 144893 143130 142180 142405 142294 141233 140368 140594 141354 141983 142772 143926
55100 143926 144707 144701 145024 147155 151055 155393 159081 161658 162678 161921 160110 158306 156508 153858 150453 147967
55084 147967 147948 150102 152769 154539 154928 154084 152704 152022 153015 155393 157853 159437 160110 159913 158471 155993
55068A55993j945J66J752J025j057j879m25J748K710K116P33p76j919k099j205
55053A54938n7M00J35j68k1O20J517K148J886P17n83j408k030k848l455l160k051
55036A46580q03K15R33J096P33P57K004L680L960K310K01q81j063j233j358n87
55020A56544J333L473M487L715J696j97q82n18r2m0J66R38J717J691Q65j39r06
55003A73851j268q73M30J839K036O94j064j930j790j424j248r15k39Q6q50k864
54987A64471m432m078j875P04K368L041L195K737J243q70k182j778m54J85l96
54972A61879j150r10L11J640K369K276J343k00j640k183j588j45J751L477L913
54957A71143K275o08k722l023k392k001j624n38O15L32j441k813k325p79O6m3
$$ plain form
55068 155993 154048 154214 155966 156991 155934 154055 153630 155378 158088 160204 160937 160161 158242 156143 154938
55053 154938 154881 155281 155416 155248 155227 155847 157364 159512 161398 162115 161532 160124 158094 155246 151791 148631 146580
55036 146580 145777 145992 146925 148021 148754 149511 151515 155195 159155 161465 161666 160785 159722 158489 157131 156544
55020 156544 157877 161350 165837 169552 171248 171051 170169 169651 169559 169519 169685 170623 172340 174031 174896 174757 173851
55003 173851 172583 171710 172140 173979 176015 176709 175645 173715 171925 170501 169253 168338 168099 168185 167335 164471
54987 164471 160039 155961 154086 154790 157158 160199 163394 166131 167374 166504 164322 162544 162090 162275 161879
54972 161879 160729 159819 160130 161770 164139 166415 167758 167558 165918 163735 162147 162002 163753 167230 171143
54957 171143 173418 172810 170088 167065 164673 162672 161048 160510 161125 161457 160016 157203 154878 154099 154165 154122
54941A54122K54J757L416L654K384J102J096K080K729K173O84q17j519j151j36
54926A71828O60P37N32P03J002O13k66k19J417L202L166J243q06j590j198l43
54910A80681M95R37P51L13K76N26K86n39j015o34j76m77j106j052j89P09J098
54893A80884R84M27m76j186j070k43N18P28O61P09P98N36k49j182j491o82O78
54876A80344J243M18p43p06O73K139K691K433J785Q61j11m78J23J213K026K208
54860A96119J775J008O25J448L262M658M647L964M126N563P431Q846R382Q619
54846B61473O324L236P83l47p76j462k741m335n613n798m723l384k921l001k407
54831B34308j345j607l689n358m499k160j026j633k116j318j05P86K016L942N253
$$ plain form
54941 154122 154376 156133 159549 163203 165587 166689 167785 169865 172594 174767 175451 174634 173115 171964 171828
54926 171828 172488 173225 173757 174460 175462 176075 175809 175590 177007 180209 183375 184618 183812 182222 181024 180681
54910 180681 181176 182113 182864 183177 183453 183979 184265 183726 182711 182077 181901 181424 180318 179266 179077 179786 180884
54893 180884 181868 182295 181819 180633 179563 179320 179838 180566 181227 181936 182734 183270 183021 181839 180348 179666 180344
54876 180344 181587 182005 181262 180556 181229 183368 186059 188492 190277 191138 191027 190549 190672 191885 193911 196119
54860 196119 197894 198902 199527 200975 204237 208895 213542 217506 221632 227195 234626 243472 252854 261473
54846 261473 267797 271033 271816 271469 270693 269231 266490 262155 256542 250744 246021 242637 239716 236715 234308
54831 234308 232963 231356 227667 222309 217810 215650 214624 212991 210875 209557 209452 210238 212254 216196 221449
54816B21449M716L202K582L173L590K951K136K534M347O443P575P436O549N331
54802B84014L619J338p93j868k017k245l079m123n089o210p238p140n590l894
54788B39685l548m395n126n070m520l787k936k321k265k339j828r50p48j651k970
54773A95231l858m108l815k995j805o98j23l25j211k001j503M47K208K081O41
54758A78166L1Q74J537R35L27J101K229J734m9o87Q19K534K261L19j259j402o42
54741A88828L33J419K295K112O33j041j667j352j053r54l54Q32J643J488J006
54726A94168P94K91j044k199j655L54K037K528K688L197L224J935J02q25o19j25
54710B04851L00J128K439L501L829L994M911O597Q074Q370P445O065M968M451
$$ plain form
54816 221449 226165 229367 231949 235122 238712 241663 243799 246333 250680 257123 264698 272134 278683 284014
54802 284014 287633 288971 288178 286310 284293 282048 278969 274846 269757 263547 256309 249169 243579 239685
54788 239685 236137 231742 226616 221546 217026 213239 210303 207982 205717 203378 201550 200600 199852 198201 195231
54773 195231 191373 187265 183450 180455 178650 177952 177829 177504 176293 174292 172789 173236 175444 177525 178166
54758 178166 178197 179071 180608 181543 181870 182971 185200 186934 186885 186198 187017 189551 191812 192131 190872 189470 188828
54741 188828 189161 190580 192875 194987 195620 194579 192912 191560 190507 189553 189199 190031 191674 193162 194168
54726 194168 194962 195253 194209 192010 190355 190709 192746 195274 197962 201159 204383 206318 206420 205595 204976 204851
54710 204851 205151 206279 208718 212219 216048 220042 224953 231550 239624 247994 255439 261504 266472 270923
54696B70923M589N390O352O415N063L212K098J432k65l292n936o654n982n412
54682B77933n205m634l763l625m543n516n506m582l489k688k151j626r59m39o78
54667B28529j655k216j307M37J362J139J239K643M248M443L423K765L244M169
54653B52463M765N047N207N147M997N212N664N312L380M23k353m402n837o556
54639B78469o334n644n414n711n662n029m906n966o860n624k474L8K0j671k809
54624B14423k438j421q16p64r24j198j591j723j042K82J080K15k032m085m791
54609A93175m514m055l091q45J984L366K502R81O03J045Q27k31r18o69k58l18
54593A89584m59k57j46o77j504j719q46Q27K532L415L096K065J162N51k96j477
$$ plain form
54696 270923 275512 280902 287254 293669 298732 301944 304042 305474 305209 301917 295981 289327 283345 277933
54682 277933 272728 268094 264331 260706 256163 250647 245141 240559 237070 234382 232231 230605 229646 229207 228529
54667 228529 226874 224658 223351 223788 225150 226289 227528 230171 234419 238862 242285 245050 248294 252463
54653 252463 257228 262275 267482 272629 277626 282838 288502 293814 297194 297617 295264 290862 285025 278469
54639 278469 272135 266491 261077 255366 249704 244675 239769 233803 226943 221319 218845 218883 218903 217232 214423
54624 214423 211985 210564 209748 208984 208060 206862 205271 203548 202506 202788 203868 204083 202051 197966 193175
54609 193175 188661 184606 181515 180670 182654 186020 188522 189503 190106 191151 191978 191747 190829 190160 189902 189584
54593 189584 189125 188868 188722 188045 186541 184822 183976 184803 187335 190750 193846 195911 197073 197624 197328 195851
54577A95851k269k241j986k124k144j064J026K910L625L236K322J392Q59R18J113
54562B01424O08q44k471l302l075k168j029JO38Q55R67J151R52k67k208l343k245
54545A85644O96L162K942K46k292k264K5K119K381J617J568K529L368L396L137
54530B08274L135K973J988K26j759l584m935n327m633l472k468j408R9J464J662
54515A92235P72p6m70j163k396k951j854NJ141J598K453L549L394J562k57l65
54499A97177Q61J800J820J631J832K105J992J629J438J411J080J00j194j920j434
54484B10328q5J057J355J228J349J579J264M74K60J328K890L362K095N3j329j613
54468B25595j459j441j239l69O62N60j125l067l384j583J084K984L318K186K60
$$ plain form
54577 195851 193582 191341 189355 187231 185087 184023 185049 187959 191584 194820 197142 198534 199393 200311 201424
54562 201424 202032 201188 198717 195415 192340 190172 189143 189144 189782 190637 191604 192755 193707 193440 191232 187889 185644
54545 185644 186340 189502 192444 192690 190398 188134 188159 190278 192659 194276 195844 198373 201741 205137 208274
54530 208274 211409 214382 216370 216596 214837 211253 206318 200991 196358 192886 190418 189010 189109 190573 192235
54515 192235 193007 192931 192461 191298 188902 185951 184097 184102 185243 186841 189294 192843 196237 197799 197542 197177
54499 197177 198038 199838 201658 203289 205121 207226 209218 210847 212285 213696 214776 214876 213682 211762 210328
54484 210328 210243 211300 212655 213883 215232 216811 218075 218549 218809 220137 223027 226389 228484 228537 227208 225595
54468 225595 224136 222695 221456 221087 221749 222309 221184 218117 214733 213150 214234 217218 220536 222722 222982
54453B22982j384j814j154n36p37j187q26M44J703K189J873J050N5n82n29k91
54437B21256p85j936k441j390M65J635J606J027N57K66m5m97j134j672j521n76
54421B14815K17j31j200j553n95Q23J774K253K488K301J757J582K063K224J115
54406B29933o24j492j159o28m74k00N14J028Q24M03M53Q41J089J309J766K038
54390B35621J549O81L43M80J23r59j652j143k28j39p56r91n86l63o92q70l46L48
54372B30420M92K63J85J07l55o94J50K172L852L736K058M25N6O00O59o14k515
54355B40997l400k315J70K649M041L956K589P44n01p19l74J73J232K638K964J203
54339B56047j176j581L02K032J719J68q49r50o70j0J142K059J978J345J128J386
$$ plain form
54453 222982 221598 219784 218630 218094 217357 216170 215344 215788 217491 219680 221553 222603 222658 222076 221547 221256
54437 221256 220471 218535 216094 214704 215169 216804 218410 219437 219994 220260 220215 219718 218584 216912 215391 214815
54421 214815 215032 214901 213701 212148 211553 212376 214150 216403 218891 221192 222949 224531 226594 228818 229933
54406 229933 229309 227817 226658 226030 225556 225356 225870 226898 227722 228125 228578 229419 230508 231817 233583 235621
54390 235621 237170 237851 238194 238674 238797 237838 236186 235043 234815 234676 233920 232929 232343 231980 231288 230418 230072 230420
54372 230420 230912 231175 231360 231467 231112 230418 230568 232740 236592 240328 242386 242811 242867 243467 244126 243512 240997
54355 240997 237597 235282 235452 238101 242142 246098 248687 249431 248930 248211 247837 248010 249242 251880 254844 256047
54339 256047 254871 253290 253592 255624 257343 257511 256662 255712 255042 255032 256174 258233 260211 261556 262684 264070
54323B64070J572J618J616J051l48j534j380m96l51q08m49P32R67m45j788j382
54307B62645J58J194J329J175R79P85J255K866M728N479N135M790M601L510J247
54292C01876o64o97N80J083l52k809m527m749m070l357k886k543k388k574k875
54277B69048k803k297j891k073k720l276l287k653j615n90J49O73J122J335J102
54262B50224P23Q57J625K258J884M69j121j904j603r05p53j242j449p00M06Q60
54246B49629P70J089J920K138J034o01j496j360q51o61r77j430j300k93P73P41
54230B49125k67q65l18M80M14l40q70p64j42P50J343R11l05r24j71R57J157N65
54212B50736J40J36L92J213K551L074J699m13j122l08J08r01k265k741k345j469
$$ plain form
54323 264070 265642 267260 268876 269927 269579 268045 266665 266169 265818 265010 264561 265293 266260 265815 264027 262645
54307 262645 262803 263997 265326 266501 267480 268265 269520 272386 277114 282593 287728 292518 297119 300629 301876
54292 301876 301212 300515 301095 302178 301826 299017 294490 289741 285671 282314 279428 276885 274497 271923 269048
54277 269048 266245 263948 262057 259984 257264 253988 250701 248048 246433 245843 245992 246665 247787 249122 250224
54262 250224 250947 251804 253429 255687 257571 258040 256919 255015 253412 252507 251754 250512 249063 248363 248769 249629
54246 249629 250399 251488 253408 255546 256580 255979 254483 253123 252272 251611 250634 249204 247904 247611 248384 249125
54230 249125 248858 247993 247675 248155 248569 248229 247359 246595 246453 247203 248546 249457 249152 248228 248057 249014 250171 250736
54212 250736 250876 251012 251404 252617 255168 258242 259941 259528 258406 258098 258206 257305 255040 252299 249954 248485
54196B48485k26Q96J215J214K250M214N072L615J231o3j00J62N84J523K394K098
54180B74564N74j199k473k956k313o16J051J577J245J113J308J129O31P36J631
54165B76002K315K120J521R53o6j906l693m221l458k406j653q96J09Q81Q19R8
54149B66519m35k72K02K55k57p28o29k10k19j010k074k462j661j32J061J291J010
54132B60249J057J541J821J599J321J297J113L77m91p55k76N86J519K120J709
54117B74787J66j349j411o9J214J420R62O78O80N66K07k00m52m59k58j63n92j476
54099B74251k132j933r94nL70j3o56p42J18J411K199K051J225J33r11j507j367
54082B71498p88m37o10j164k102l509m797m821l164o22J845L948N408N454L795
$$ plain form
54196 248485 248259 249155 250370 251584 253834 258048 263120 266735 267966 267903 267803 267965 268549 270072 272466 274564
54180 274564 275138 273939 271466 268510 266197 265581 266632 268209 269454 270567 271875 273004 273635 274371 276002
54165 276002 278317 280437 281958 282911 282845 280939 277246 273025 269567 267161 265508 264612 264721 265602 266421 266519
54149 266519 266084 265812 266014 266269 266012 265284 264655 264445 264226 263216 261142 258680 257019 256887 257948 259239 260249
54132 260249 261306 262847 264668 266267 267588 268885 269998 270375 269884 269129 268853 269439 270958 273078 274787
54117 274787 274953 273604 272193 272124 273338 274758 275720 276398 277078 277644 277851 277651 277199 276740 276482 276319 275727 274251
54099 274251 272119 270186 269192 269187 269557 269544 268888 268146 268264 269675 271874 273925 275150 275283 274372 272865 271498
54082 271498 270710 270273 269663 268499 266397 262888 258091 253270 250106 249484 251329 255277 260685 266139 269934
54067B69934J582L59L57N66L00j24k28o7L2p7l39m63k1J032K034K319K124K151
54049B81471K387K171J515J477K680M141M240K551K45j206j231k34J040K053K628
54034C05928K758K446J735Q32P3j84M23J968L739M437L469J792P32K34o91j859
54018C27832j648M85K597K487M85j291j911k195k581k176n12J301K083K225K684
54003C29865L147K506Q56k46J59J162J242K53n15j4J366K422K619K600L156M077
53987C54655M503M237M090M738N884O890P660Q255Q241P221N819N163N390N538
53973D38284N089M784N545P233Q888R807R932R546Q902P937O380M458L293L799
53959E33877N116N268L732K208K119K512J588n89k451l436m481o021p104o948
$$ plain form
54067 269934 271516 271875 272232 272798 273098 272974 272746 272679 272711 272634 272295 271832 271811 272843 274877 277196 279320 281471
54049 281471 283858 286029 287544 289021 291701 295842 300082 302633 302878 301672 300441 300207 301247 303300 305928
54034 305928 308686 311132 312867 313699 313772 313588 314011 315979 319718 324155 327624 329416 330148 330382 329691 327832
54018 327832 326184 326669 329266 331753 332238 330947 329036 326841 324260 322084 321572 322873 324956 327181 329865
54003 329865 333012 335518 336374 336128 336287 337449 338691 338944 338429 338415 339781 342203 344822 347422 350578 354655
53987 354655 359158 363395 367485 372223 378107 384997 392657 400912 409153 416374 422193 427356 432746 438284
53973 438284 443373 448157 453702 460935 469823 479630 489562 499108 508010 515947 522327 526785 530078 533877
53959 533877 538993 544261 547993 550201 552320 554832 556420 555831 553380 549944 545463 539442 532338 525390
53945E25390o157n808o212p060p921q207p506o418o260p310q173p526n796m424
53931D30612m123m629n513o283o173m909l360k495j948o20J296K132Q47j597l437
53916C89800l977l658k933j830o11j06r19k400k798r37K192M035L053M77j101
53901C78287n38R65J758J620J546K254L515M693N389N526N179M587M286M945O776
53886D30788R141J1033J2047J2570J2894J2578J1060Q596O107M246L055K363K040
53873E38518J932J881J820J666J276Q37R07J649K310K164J731K335M500P386R660
53858E80572J0414R502P914P591R651J2662J3869J2471J0633J0675J2369J3725
53846G12048J3456J1677Q931N838L307K047J810J807J751J783J571L98j788m129
$$ plain form
53945 525390 519233 513425 507213 500153 492232 484025 476519 470101 463841 456531 448358 440832 435036 430612
53931 430612 426489 421860 416347 410064 403891 398982 395622 393127 391179 390559 391855 393987 394834 393237 389800
53916 389800 385823 382165 379232 377402 376791 376685 375766 373366 370568 369631 371823 375858 378911 379388 378287
53901 378287 377749 378714 380472 382092 383638 385892 389407 394100 399489 405015 410194 414781 419067 424012 430788
53886 430788 439929 450962 463009 475579 488473 501051 512111 520707 526814 531060 534115 536478 538518
53873 538518 540450 542331 544151 545817 547093 547930 548837 550486 552796 554960 556691 559026 563526 570912 580572
53858 580572 590986 600488 608402 615993 625644 638306 652175 664646 675279 685954 698323 712048
53846 712048 725504 737181 746112 751950 755257 757304 759114 760921 762672 764455 766026 766424 764636 760507
53832G60507n822o884p750q501q727q182p520q153j0775j4013j5388j4178j2484
53819F32130j2600j4016j4305j2536j0296r200r002q790q775r655j0876j0843
53807E01236q920o385n110n678o992p447o336m286k549j942k439l534m674n369
53793D29575n271m499l664l248l064k540j632j074j539k720l542l264k098p66
53779C90654J90N56M24K73O43J225Q42q98k476k168n58Q4q42j337nJ505Q26j536
53761C87402k861j905N6J710L281N028N941M971K621M83k41O55K489L938L987
53746D17555L261L657N937Q466R034P473N616N105N976P186P783P587P224P392
53732E09252P903P790O706N624N538O047O040N348M768M583M142L058J840J006
$$ plain form
53832 760507 754685 747801 740051 731550 722823 714641 707121 698968 688193 674180 658792 644614 632130
53819 632130 619530 605514 591209 578673 568377 559177 550175 541385 532610 522955 512079 501236
53807 501236 492316 485931 480821 475143 468151 460704 454368 450082 447533 445591 443152 439618 434944 429575
53793 429575 424304 419805 416141 412893 409829 407289 405657 404583 403044 400324 396782 393518 391420 390654
53779 390654 390844 391400 391824 392097 392740 393965 394807 393909 391433 389265 388707 388791 387949 386612 386607 388112 388938 387402
53761 387402 384541 382636 382692 384402 387683 392711 398652 403623 406244 406727 406486 407141 409630 413568 417555
53746 417555 420816 424473 430410 438876 447910 455383 460999 466104 472080 479266 487049 494636 501860 509252
53732 509252 517155 524945 531651 537275 542813 548860 554900 560248 565016 569599 573741 576799 578639 579645
53718E79645K75q39k188l306m207n380p001q542r268r033q523q540q934q580o795
53703D88784m570l685m534n625n613n023n197o077o254n156m025m200n347o142
53689D17336o059n434m255k157K04J105j91k165k700j520o6O12Q28J165J455J253
53673C99411N92j11m93l73J76P11Q33Q31J395K487L167K893K359K485L144L527
53657D23034L472L528L858L807K829J324K81L31J232K194K598K635L138M611O465
53642D65337P449O786M791K570J314J587K804L585L146K320K591M066N186M728
53628E18260L353K542K625K793K719K948L587L738K794J357J13j301l305m872
53614E37351m488k422p12o40j391j606r93Q7J410K459K359J230N76J122J318m08
$$ plain form
53718 579645 579920 579081 576893 573587 569380 564000 556999 548457 539189 530156 521633 513093 504159 495579 488784
53703 488784 484214 480529 475995 470370 464757 459734 454537 448460 442206 437050 433025 428825 423478 417336
53689 417336 411277 405843 401588 399431 399635 400740 400549 398384 395684 394164 394098 394710 395538 396703 398158 399411
53673 399411 400003 399892 399399 399026 399202 399913 400746 401577 402972 405459 408626 411519 413878 416363 419507 423034
53657 423034 426506 430034 433892 437699 440528 441852 442133 442464 443696 445890 448488 451123 454261 458872 465337
53642 465337 472786 479572 484363 486933 488247 489834 492638 496223 499369 501689 504280 508346 513532 518260
53628 518260 521613 524155 526780 529573 532292 535240 538827 542565 545359 546716 546829 545528 542223 537351
53614 537351 532863 530441 529729 529089 527698 526092 525099 525186 526596 529055 531414 532644 533220 534342 535660 535252
53598E35252k832l322j686m10r02j692j118J56N53R0j7O56J533K192K522K122
53582E33097P39p81r15J008M149O877P794O526M130K370K032K198J692P58N79
53567E72253J557K965M162N191O111O579O392N942N834O271P008P655P932P840
53553F53692P623P507P382O915N990N005M568M808N090M828M523N299P064P996
53539G38290O694M126K323J697J132L32K33R79J335N75o83k017l685m873l678
53524G42780k81J978N92k558l784k489j152j286k017k380k551k567j910q82q01
53509G20692k116l700m367m082l331k435j670j238r42n14l9O29K119M177M902
53494G08085L003O4j320j032q99j237m90J628L455M310N401P040P587O558O186
$$ plain form
53598 535252 532420 529098 527412 527002 526100 524408 523290 523446 523999 524089 524072 524728 526261 528453 530975 533097
53582 533097 533836 533055 532140 533148 537297 544174 551968 558494 562624 564994 567026 569224 570916 571674 572253
53567 572253 573810 576775 580937 586128 592239 598818 605210 611152 616986 623257 630265 637920 645852 653692
53553 653692 661315 668822 676204 683119 689109 694114 698682 703490 708580 713408 717931 723230 730294 738290
53539 738290 744984 749110 751433 753130 754262 754594 754827 755806 757141 757716 757033 755016 751331 746458 742780
53524 742780 742499 744477 745069 742511 738727 736238 735086 733800 731783 729403 726852 724285 722375 721493 720692
53509 720692 718576 714876 710509 706427 703096 700661 698991 697753 696811 696297 696258 696887 699006 703183 708085
53494 708085 711088 711152 709832 708800 707901 706664 706174 707802 711257 715567 720968 728008 735595 742153 748339
53479G48339Q144J0721J1196R448P383O277O526Q613J2197J5231J6058J5715J6283
53466H92131J7751J8541J8553J9398K1567K3425K3538K2504K1909K2688K4812
53455A126817K7636L0059L1218L1433L1996L3742L6174L7981L8189L6994L5833
53444A498072L6262L8332M0414M0998M0171L8911L7652L6332L5158L4485L4210
53433A910997L3990L3628L2798L1094K9072K8341K9562L1173L1219K9876K8752
53422B250502K8359K7796K6619K5420K4426K3069K1175J9341J7755J5816J3271
53411B493549J0678Q255N256J122l389o847q622r343j0262j2270j5181j7844j9228
53398B415874j9448j9476k0078k1438k3479k5862k7792k8487k7975k6959k5970
$$ plain form
53479 748339 756483 767204 778400 787848 795231 801508 808034 816647 828844 844075 860133 875848 892131
53466 892131 909882 928423 946976 966374 987941 1011366 1034904 1057408 1079317 1102005 1126817
53455 1126817 1154453 1184512 1215730 1247163 1279159 1312901 1349075 1387056 1425245 1462239 1498072
53444 1498072 1534334 1572666 1613080 1654078 1694249 1733160 1770812 1807144 1842302 1876787 1910997
53433 1910997 1944987 1978615 2011413 2042507 2071579 2099920 2129482 2160655 2191874 2221750 2250502
53422 2250502 2278861 2306657 2333276 2358696 2383122 2406191 2427366 2446707 2464462 2480278 2493549
53411 2493549 2504227 2512482 2517738 2518860 2515471 2508624 2500002 2490659 2480397 2468127 2452946 2435102 2415874
53398 2415874 2396426 2376950 2356872 2335434 2311955 2286093 2258301 2229814 2201839 2174880 2148910
53387B148910k5065k4184k3394k2803k2569k2667k2516k1355j9360j7596j6286
53376A911115j4096j0117n736l204k878l149k717j482N08L435O849R777J1910
53363A900215J3669J5106J5963J6865J9047K2572K6068K8654L0951L3671L6425
53352B159206L8614M0538M2765M5011M6472M7062M7840N0196N4528N9684O4016
53341B695932O7179P0249P3657P6183P6981P7383P8944Q0730Q0788P9690P9935
53330C537651Q1898Q3209Q2600Q1493Q0827P9189P5753P2378P0656O9081O5571
53319D380306O0982N7339N4009M8590M0943L3288K6527J9337J1341M370m77m997
53307D731558j1731k0901l0550l8793m5023m9610n3381n7048o0740o4137o7166
$$ plain form
53387 2148910 2123845 2099661 2076267 2053464 2030895 2008228 1985712 1964357 1944997 1927401 1911115
53376 1911115 1897019 1886902 1881166 1877962 1875084 1871935 1869218 1867736 1868244 1871679 1878528 1888305 1900215
53363 1900215 1913884 1928990 1944953 1961818 1980865 2003437 2029505 2058159 2089110 2122781 2159206
53352 2159206 2197820 2238358 2281123 2326134 2372606 2419668 2467508 2517704 2572232 2631916 2695932
53341 2695932 2763111 2833360 2907017 2983200 3060181 3137564 3216508 3297238 3378026 3457716 3537651
53330 3537651 3619549 3702758 3785358 3866851 3947678 4026867 4102620 4174998 4245654 4314735 4380306
53319 4380306 4441288 4498627 4552636 4601226 4642169 4675457 4701984 4721321 4732662 4737032 4736555 4731558
53307 4731558 4719827 4698926 4668376 4629583 4584560 4534950 4481569 4424521 4363781 4299644 4232478
53296D232478p0016p2461p3760p3417p1692o9416o7565o6669o6105o4502o1597
53285C475278n9183n9065o0473o0920n9482n7671n6784n6067n4259n1582m9015
53274B850777m6582m3601m0120l6982l4645l2842l1290l0059k9181k8533k8117
53263B468825k8061k8260k8328k7920k6935k5484k3889k2524k1361j9796j7211
53252B199056j3749j0389q269p739p893p030m110J44L977O604Q816J1294J3317
53239B184029J4024J4329J6134J9721K3266K5433K7083K9550L2261L3429L2713
53228B451972L1766L1987L2824L2734L1084K8611K6444K4981K3414K0321J5177
53217B751315R297M629J524j393m997q431j0729j2489j4972j8332k1918k5586
$$ plain form
53296 4232478 4162462 4090001 4016241 3942824 3871132 3801716 3734151 3667482 3601377 3536875 3475278
53285 3475278 3416095 3357030 3296557 3235637 3176155 3118484 3061700 3005633 2951374 2899792 2850777
53274 2850777 2804195 2760594 2720474 2683492 2648847 2616005 2584715 2554656 2525475 2496942 2468825
53263 2468825 2440764 2412504 2384176 2356256 2329321 2303837 2279948 2257424 2236063 2216267 2199056
53252 2199056 2185307 2174918 2166649 2158910 2151017 2143987 2139877 2140021 2143998 2150602 2159418 2170712 2184029
53239 2184029 2198053 2212382 2228516 2248237 2271503 2296936 2324019 2353569 2385830 2419259 2451972
53228 2451972 2483738 2515725 2548549 2581283 2612367 2640978 2667422 2692403 2715817 2736138 2751315
53217 2751315 2760612 2765241 2766765 2765372 2760375 2751944 2741215 2728726 2713754 2695422 2673504 2647918
53205B647918k9410l2615l4283l4927l5932l7515l8680l9253m0292m2109m3408
53194B239494m3104m1741m0326l9034l7862l7444l8175l9369m0204m0590m0400
53183A801245l8932l6374l4651l5295l7113l7635l6302l4642l3570l2435l0813
53172A413483k9295k7903k5430k1517j8101j7455j9416k1693k2560k2160k1368
53161A166585k0649k0352k1093k2970k4841k5249k4141k2964k2840k3286k3178
53150I15022k2338k1392k0480j9149j7412j5897j4757j3582j2556j2597j3744
53139G31118j4649j4461j4039j4293j4401j3195j1442j0971j1864j2371j1567
53128E87865j0325r346q037o164m980n501o642o522n031l841m010m771m836l961
$$ plain form
53205 2647918 2618508 2585893 2551610 2516683 2480751 2443236 2404556 2365303 2325011 2282902 2239494
53194 2239494 2196390 2154649 2114323 2075289 2037427 1999983 1961808 1922439 1882235 1841645 1801245
53183 1801245 1762313 1725939 1691288 1655993 1618880 1581245 1544943 1510301 1476731 1444296 1413483
53172 1413483 1384188 1356285 1330855 1309338 1291237 1273782 1254366 1232673 1210113 1187953 1166585
53161 1166585 1145936 1125584 1104491 1081521 1056680 1031431 1007290 984326 961486 938200 915022
53150 915022 892684 871292 850812 831663 814251 798354 783597 770015 757459 744862 731118
53139 731118 716469 702008 687969 673676 659275 646080 634638 623667 611803 599432 587865
53128 587865 577540 568194 560157 553993 549013 543512 536870 530348 525317 521476 517466 512695 507859 503898
53114E03898k844k144k152l051m757o370o427m273j134P12J31j830l267l387k786
53099D60319k233j874j574j380j292j004k01R29J752J799J304Q75O31Jj333k563
53083D54156k526j175M28J433J758J350J32j207j635j405j763k519j729R89K847
53068D49134J557r53j041J423L278L063K599L193L400J895l8o66n20j037j855
53053D63432j479K33J969K848L026K829K461K165J795P36q49j603q19J59k70j545
53037D75088j982j578j862l137l861l178k266k376l027l119k789k906l394l214
53023D36399j921m17M0q32k025k138o46J559K938K729J512M39J72N33Q79O69k2
53006D39868n18l34k8p38k571l974l278p68J458J915J354J485K523K964J814k9
$$ plain form
53114 503898 501054 498910 496758 493707 488950 482580 476153 471880 470746 471458 471589 469759 466492 463105 460319
53099 460319 458086 456212 454638 453258 451966 450962 450761 451690 453442 455241 456545 457420 458051 458052 456719 454156
53083 454156 451630 450455 450883 452316 454074 455424 455556 454349 452714 451309 449546 447027 445298 446287 449134
53068 449134 450691 449738 448697 450120 453398 456461 459060 462253 465653 467548 467510 466844 466324 465287 463432
53053 463432 461953 462186 464155 467003 470029 472858 475319 477484 479279 480015 479166 477563 476744 476903 476633 475088
53037 475088 473106 471528 469666 466529 462668 459490 457224 454848 451821 448702 445913 443007 439613 436399
53023 436399 434478 434061 434101 433269 431244 429106 428460 430019 432957 435686 437198 437637 437809 438342 439221 439890 439868
53006 439868 439350 439016 438988 438250 435679 431705 428427 427659 429117 431032 432386 433871 436394 439358 441172 441143
52990D41143j192j770k657l580l249j549l2L90Q04K279L663K983M92j396j214
52975D35115K9P93J046J517K045J818P71l79j291k260l086k730o48K030L436K987
52959D41193J869J356J270P24j17N0J769L683M016K654J019N8o21j539k234j953
52943D53197q52K07P70R97R15L32m47n79J88R57Q46J87j4M46Q58Q06N84L39k75
52924D59462j183j529q88j05j07l79L22K022L357L347K441J639J450J937K930
52909D74716L799L720K663J590J191R54J52p95o29J030K982L626K686J528J679
52894E00892K988L593K031q23k611k210q75m94j519l032m109m387l842k782j921
52879D80899j745j886j536m77P01J252Q41l14j537k096j907j596j571j398n96
$$ plain form
52990 441143 439951 438181 435524 431944 428695 427146 427114 427504 428308 430587 434250 437233 437725 436329 435115
52975 435115 435144 435937 436983 438500 440545 442363 443134 442755 441464 439204 436118 433388 432740 434770 438206 441193
52959 441193 443062 444418 445688 446412 446295 446345 448114 451797 455813 458467 459486 459544 458923 457384 455150 453197
52943 453197 452345 452552 453322 454319 455234 455566 455119 454540 454728 455685 456531 456718 456704 457150 458008 458814 459398 459737 459462
52924 459462 458279 456750 455862 455757 455650 455271 455593 457615 460972 464319 466760 468399 469849 471786 474716
52909 474716 478515 482235 484898 486488 487679 488633 488785 487990 487361 488391 491373 494999 497685 499213 500892
52894 500892 503880 507473 509504 508681 506070 503860 502985 502491 500972 497940 493831 489444 485602 482820 480899
52879 480899 479154 477268 475732 475255 475956 477208 478049 477735 476198 474102 472195 470599 469028 467630 467034
52864D67034L30L36p51j991k519k268j479l07P63Q39l66j793k047j058j02p2l56
52847D54193K59J935L535L725J949j313m652o250n183k392K51J924L087L782L029
52832D57879O26j786k579k126j633r74N35K012J838N87P22K836M389L179L56j367
52816D64494j122j11M62L48j45k32R50L095M474L922K264R01q1j221k085j820
52800D74093p14K48Q33J335J394M86o89q73r4L85j39j278k613l994m916m862m271
52783D54331l985l989l853m010n035n878m656j449J421K299J828J249O67k11j018
52768D27711j360j477j508j049n2Q12J222J604J904J166q26k616k744j535k89
52753D20963M84J037J330J128P28O27P60Q21R38J284J418P71m59j510j938j783
$$ plain form
52864 467034 467364 467700 466949 464958 462439 460171 458692 458385 459148 459987 459621 457828 455781 454723 454621 454549 454193
52847 454193 454452 456387 459922 463647 465596 464283 459631 453381 448198 445806 446057 447981 451068 454850 457879
52832 457879 458505 456719 454140 452014 450381 449407 449942 451954 453792 454379 455101 457937 462326 465505 465861 464494
52816 464494 463372 463261 463723 464071 463926 463694 464644 467739 472213 476135 478399 479300 479219 477998 475913 474093
52800 474093 473379 473627 474460 475795 477189 477675 476986 476113 476019 476404 476265 474987 472374 468380 463464 458602 454331
52783 454331 450346 446357 442504 438494 433459 427581 422925 421476 422897 425196 427024 428273 428940 428729 427711
52768 427711 426351 424874 423366 422317 422265 423077 424299 425903 427807 428973 428147 425531 422787 421252 420963
52753 420963 421447 422484 423814 424942 425670 426297 427057 427878 428816 430100 431518 432289 431830 430320 428382 426599
52737D26599j200m28K00N87Q99R52K07j201k235k283k057k325k551j778l87K65
52721D13264k32r70j218j256j424j355o46L01Q19R09J119J569J679J081L40K89
52705D14269Q42J092P21N32J134J772J345N8r59j346j639j837j288j64L50j83
52689D14699p35m87P1L48P62J691K494K597K609L087L216K072N26L25J638L075
52673D37988L842M374M742M080K107J16l46Q63K594L686L691K743J179n80j982
52658D69097k342j422rO55L82K71R85J571P84j040k407k609k181j702j148m88
52642D58397K8K96M10K69k82r94j438j599j628j319n02K07oq98j269l82J231K432
52624D52953K411J179l09p53J20J100J046L63R0K6q84k488l214k156k36J105J404
$$ plain form
52737 426599 425399 424971 425171 425758 426657 427609 427816 426615 424380 422097 420040 417715 415164 413386 412999 413264
52721 413264 413032 412062 410844 409588 408164 406809 406163 406464 407283 408192 409311 410880 412559 413640 413980 414269
52705 414269 415111 416203 416924 417456 418590 420362 421707 421765 420806 419460 417821 415984 414696 414532 414882 414699
52689 414699 413964 413477 413548 413896 414658 416349 418843 421440 424049 427136 430352 432424 432950 433275 434913 437988
52673 437988 441830 446204 450946 455026 457133 457249 456903 457766 460360 464046 467737 470480 471659 471079 469097
52658 469097 466755 465333 465324 465979 466361 466632 467617 469188 469972 468932 466525 463916 461735 460033 458885 458397
52642 458397 458425 458721 459131 459400 459118 458124 456686 455087 453459 452140 451638 451845 451839 450941 449672 449290 450521 452953
52624 452953 455364 456543 456234 455481 455601 456701 457747 458110 458200 458226 457342 454854 451640 449484 449248 450353 451757
52607D51757J074N65P0m76j255j969j619K88K613L606K944J739P06k60q10k1J948
52590D60900L504L544K717K200K265K491K418J637K72m40N86K143J607j367l894
52575D80583l703k095j545k115k255j816j751j573J95L033M354L010Q60J14P38
52560D76034J461J815J978J599K37j478k282j811r22n35o72p33k45P23J598J688
52544D78455P77n64j399j318q66q78j371j445n51N43O33j61m51M96J814K480K750
52527D78944L314L791L179J487k14j254j777j749p58Q31J716J375J098K276M121
52512D96380M236J545k097l830k814q19P3l05o79m12k28p77j359q51N60J408P79
52495D90810o00j304q70j02J05j72j04O88J515J411L23q89j535j627j285l43J023
$$ plain form
52607 451757 452831 453396 453466 452990 451735 449766 448147 448435 451048 454654 457598 459337 460043 459783 458973 458952 460900
52590 460900 464404 467948 470665 472865 475130 477621 480039 481676 481948 481508 482094 484237 485844 484477 480583
52575 480583 476880 474785 473240 471125 468870 467054 465303 463730 463925 466958 471312 474322 475182 475296 476034
52560 476034 477495 479310 481288 482887 483124 481646 479364 477553 476631 476096 475424 474691 474446 475169 476767 478455
52544 478455 479232 478668 477269 475951 475085 474207 472836 471391 470840 471383 472016 471855 471404 471900 473714 476194 478944
52527 478944 482258 486049 489228 490715 490501 489247 487470 485721 484963 485794 487510 488885 489983 492259 496380
52512 496380 500616 502161 500064 496234 493420 492601 492674 492369 491690 491278 491050 490273 488914 488063 488623 490031 490810
52495 490810 490210 488906 488036 487934 488039 487867 487763 488451 489966 491377 491700 490811 489276 487649 486364 486021 487044
52478D87044J967J816R02j3o84j196j295q02l80r65k305k976k029o4J522J983
52462D82525J735J828K902M247M133J690j639l274k213J28J763K042J446N54p8
52447D97789K29J692L472M420M388M243M591M939M381K827J177K32k89j287k889
52432E29915m152m412m252m450m485l225r60M43j32j594k054j035L79R70L40j112
52416E00184k413k469r82J125K554K848K553K461K957L776M045K949P92r72j177
52401E18231j37J059J939K737L402L493L029K710K953L177K321rk955m938m978
52386E32034l685k659k711l065k611j353j15O04O93j10j787l281l330k123j140
52371E05361j245j893k263k091j098J072L703M921L701J260m34r28j089j322j119
$$ plain form
52478 487044 489011 490827 491729 491716 491032 489836 488541 487739 487359 486394 484089 481113 479084 479020 480542 482525
52462 482525 484260 486088 488990 493237 497370 499060 497421 494147 491934 492062 493825 495867 497313 497867 497789
52447 497789 498018 499710 503182 507602 511990 516233 520824 525763 530144 532971 534148 534380 534091 532804 529915
52432 529915 525763 521351 517099 512649 508164 504939 503979 504422 504290 502696 500642 499607 499986 500956 501296 500184
52416 500184 497771 495302 494320 495445 497999 500847 503400 505861 508818 512594 516639 519588 520380 519408 518231
52401 518231 518094 519153 521092 523829 527231 530724 533753 536463 539416 542593 544914 544905 541950 537012 532034
52386 532034 528349 525690 522979 519914 517303 515950 515835 516439 517132 517022 515235 511954 508624 506501 505361
52371 505361 504116 502223 499960 497869 496771 497843 501546 506467 510168 511428 510994 510066 508977 507655 506536
52356E06536k17Q59J560J822J849J878K246L088M034M705N377O564Q122R359J0025
52341E67807J0513J1103J1640J1936J1890J1117R135O031K459j017l967n742n963
52328F36942n473n703o747p002n327k715j097j115j795j964j246P1J428K319K676
52313F03252K794K770K443K108K590M063N539O125O203O536O946O835O379O025
52299F70608N295L553J759J781L744N475N236L774K853K930L213L268L420L986
52285G20895M962O224P369P662O883N932N956O930P845Q174Q558R886J2205J4692
$$ plain form
52356 506536 506319 507178 508738 510560 512409 514287 516533 519621 523655 528360 533737 540301 548423 557782 567807
52341 567807 578320 589423 601063 612999 624889 636006 645141 651172 653631 652614 648647 642905 636942
52328 636942 631469 625766 619019 612017 606690 603975 602878 601763 599968 598004 596758 596829 598257 600576 603252
52313 603252 606046 608816 611259 613367 615957 620020 625559 631684 637887 644423 651369 658204 664583 670608
52299 670608 675903 679456 681215 682996 686740 692215 697451 701225 704078 707008 710221 713489 716909 720895
52285 720895 725857 732081 739450 747112 753995 759927 765883 772813 780658 788832 797390 807276 819481 834173
$$ [...]
##END NTUPLES=NMR SPECTRUM
##END=
