
##TITLE=AC1007_S-149_6114592_zZLpfeKMET
##JCAMPDX= 6.0         $$ Bruker NMR JCAMP-DX V2.0
##DATA TYPE= NMR SPECTRUM
##DATA CLASS= NTUPLES
##ORIGIN= BRUKER
##OWNER= Administrator
$$ 1.72 TOPSPIN		Version 2.1
$$ 2012-05-14 19:14:11.531 -0500  Administrator@TOPSPIN
$$ Compression mode = diff/dup
##.OBSERVE FREQUENCY= 400.13188235
##.OBSERVE NUCLEUS= ^1H
##.ACQUISITION MODE= SIMULTANEOUS (DQD)
##.ACQUISITION SCHEME= undefined
##.AVERAGES= 8
##.DIGITISER RES= 22
##SPECTROMETER/DATA SYSTEM= spect
##.PULSE SEQUENCE= zg30
##.SOLVENT NAME= COFFEE_meoh
##.SHIFT REFERENCE= INTERNAL, COFFEE_meoh, 1, 14.98061
##AUDIT TRAIL= $$ (NUMBER, WHEN, WHO, WHERE, PROCESS, VERSION, WHAT)
$$ ##TITLE= Audit trail, TOPSPIN		Version 2.1
$$ ##JCAMPDX= 5.01
$$ ##ORIGIN= Bruker BioSpin GmbH
$$ ##OWNER= Administrator
$$ $$ C:\Bruker\TOPSPIN/data/COFFEE/nmr/AC1007_S-149_6114592_zZLpfeKMET/60/pdata/1/auditp.txt
$$ ##AUDIT TRAIL=  $$ (NUMBER, WHEN, WHO, WHERE, PROCESS, VERSION, WHAT)
(   1,<2012-05-14 19:14:04.625 -0500>,<Administrator>,<TOPSPIN>,<go>,<TOPSPIN 2.1>,
      <created by zg
	started at 2012-05-14 19:12:58.125 -0500,
	POWCHK enabled, PULCHK disabled,
       configuration hash MD5:
       AF F2 23 6B 01 CD 40 DD E5 A1 38 A0 06 EA F7 77
       data hash MD5: 64K
       10 ED 96 96 82 D6 48 D3 4A 27 09 BB 19 93 F1 B4>)
(   2,<2012-05-14 19:14:07.281 -0500>,<Administrator>,<TOPSPIN>,<proc1d>,<TOPSPIN 2.1>,
      <Start of raw data processing
       efp LB = 0 FT_mod = 6 PKNL = 1 PHC0 = 0 PHC1 = 0 SI = 32K 
       data hash MD5: 32K
       3A 5C 52 15 FC 82 FC 67 0A BE 91 90 1E EE CD 1C>)
(   3,<2012-05-14 19:14:07.703 -0500>,<Administrator>,<TOPSPIN>,<proc1d>,<TOPSPIN 2.1>,
      <pk PHC0 = 216.2329 PHC1 = 0 
       data hash MD5: 32K
       87 F5 4A F5 50 E3 05 29 37 63 F2 F5 EB 6F 6A BB>)
(   4,<2012-05-14 19:14:07.812 -0500>,<Administrator>,<TOPSPIN>,<proc1d>,<TOPSPIN 2.1>,
      <abs ABSG = 1 
       data hash MD5: 32K
       B3 39 05 C7 1F C6 94 BE FA 51 85 E7 87 31 0A 16>)
(   5,<2012-05-14 19:14:07.859 -0500>,<Administrator>,<TOPSPIN>,<proc1d>,<TOPSPIN 2.1>,
      <abs ABSG = 2 
       data hash MD5: 32K
       78 6C D5 0A 67 65 DF 51 87 11 E8 7D E1 D5 B6 E5>)
(   6,<2012-05-14 19:14:07.890 -0500>,<Administrator>,<TOPSPIN>,<proc1d>,<TOPSPIN 2.1>,
      <abs ABSG = 3 
       data hash MD5: 32K
       58 E4 8E 77 22 E5 4D 0A 56 82 EB 93 07 D3 23 95>)
(   7,<2012-05-14 19:14:07.953 -0500>,<Administrator>,<TOPSPIN>,<proc1d>,<TOPSPIN 2.1>,
      <abs ABSG = 4 
       data hash MD5: 32K
       0B DA 9E 46 EF 57 7A 0B F9 14 90 38 21 1F 7D 34>)
(   8,<2012-05-14 19:14:07.984 -0500>,<Administrator>,<TOPSPIN>,<proc1d>,<TOPSPIN 2.1>,
      <abs ABSG = 5 
       data hash MD5: 32K
       02 FD 3F C2 43 AD 34 62 77 C9 4D 88 6F CF F7 88>)
$$ ##END=
$$ 
$$ $$ hash MD5
$$ $$ F9 13 72 F7 4E C7 FC 13 97 E5 D1 BF 74 0D 80 86
##$RELAX= 
##$RELAX= 
##$RELAX= 
##$RELAX= 
##$RELAX= 
##$RELAX= 
##$RELAX= 
$$ Bruker specific parameters
$$ --------------------------
$$ [...]
##$TP= (0..7)
150 150 150 150 150 150 150 150
##$TP07= 0
##$TPNAME0= <>
##$TPNAME1= <>
##$TPNAME2= <>
##$TPNAME3= <>
##$TPNAME4= <>
##$TPNAME5= <>
##$TPNAME6= <>
##$TPNAME7= <>
##$TPOAL= (0..7)
0.5 0.5 0.5 0.5 0.5 0.5 0.5 0.5
##$TPOFFS= (0..7)
0 0 0 0 0 0 0 0
##$TUNHIN= 0
##$TUNHOUT= 0
##$TUNXOUT= 0
##$USERA1= <user>
##$USERA2= <user>
##$USERA3= <user>
##$USERA4= <user>
##$USERA5= <user>
##$V9= 5
##$VALIST= <valist>
##$VCLIST= <CCCCCCCCCCCCCCC>
##$VD= 0
##$VDLIST= <DDDDDDDDDDDDDDD>
##$VPLIST= <PPPPPPPPPPPPPPP>
##$VTLIST= <TTTTTTTTTTTTTTT>
##$WBST= 2048
##$WBSW= 25
##$XGAIN= (0..3)
0 0 0 0
##$XL= 0
##$YL= 0
##$YMAX_a= 510333
##$YMIN_a= -589641
##$ZGOPTNS= <>
##$ZL1= 120
##$ZL2= 120
##$ZL3= 120
##$ZL4= 120
##$ABSF1= 14.98061
##$ABSF2= -5.57192
##$ABSG= 5
##$ABSL= 3
##$ALPHA= 0
##$AQORDER= 0
##$ASSFAC= 0
##$ASSFACI= 0
##$ASSFACX= 0
##$ASSWID= 0
##$AUNMP= <proc_prof1d_extract_pilot.lims>
##$AXLEFT= 0
##$AXNAME= <>
##$AXNUC= <1H>
##$AXRIGHT= 0
##$AXTYPE= 0
##$AXUNIT= <>
##$AZFE= 0.1
##$AZFW= 0.1
##$BCFW= 0
##$BC_mod= 0
##$BYTORDP= 0
##$COROFFS= 0
##$CY= 15
##$DATMOD= 1
##$DC= 0
##$DFILT= <>
##$DTYPP= 0
##$F1P= 0
##$F2P= 0
##$FCOR= 0.5
##$FTSIZE= 32768
##$FT_mod= 6
##$GAMMA= 0
##$GB= 0
##$INTBC= 1
##$INTSCL= 1
##$ISEN= 128
##$LB= 0
##$LEV0= 0
##$LPBIN= 0
##$MAXI= 10000
##$MC2= 0
##$MEAN= 0
##$ME_mod= 0
##$MI= 0
##$NCOEF= 0
##$NC_proc= -8
##$NLEV= 6
##$NOISF1= 0
##$NOISF2= 0
##$NSP= 0
##$NTH_PI= 0
##$NZP= 0
##$OFFSET= 14.98061
##$PC= 1
##$PHC0= 216.2329
##$PHC1= 0
##$PH_mod= 1
##$PKNL= yes
##$PPARMOD= 0
##$PPDIAG= 0
##$PPIPTYP= 0
##$PPMPNUM= 2147483647
##$PPRESOL= 1
##$PSCAL= 4
##$PSIGN= 0
##$PYNMP= <proc.py>
##$REVERSE= no
##$SF= 400.13
##$SI= 32768
##$SIGF1= 0
##$SIGF2= 0
##$SINO= 400
##$SIOLD= 32768
##$SPECTYP= <>
##$SREGLST= <1H.CDCl3>
##$SSB= 0
##$STSI= 32768
##$STSR= 0
##$SW_p= 8223.68421052632
##$SYMM= 0
##$S_DEV= 0
##$TDeff= 65536
##$TDoff= 0
##$TI= <>
##$TILT= no
##$TM1= 0
##$TM2= 0
##$TOPLEV= 0
##$USERP1= <user>
##$USERP2= <user>
##$USERP3= <user>
##$USERP4= <user>
##$USERP5= <user>
##$WDW= 1
##$XDIM= 32768
##$YMAX_p= 453449598
##$YMIN_p= -678176
##$CURPLOT= <Network HP LaserJet P1505>
##$CURPRIN= <$Network HP LaserJet P1505>
##$DFORMAT= <normdp>
##$LAYOUT= <+/1D_H.xwp>
##$LFORMAT= <normlp>
##$PFORMAT= <normpl>
##$SURQMSG= 1
$$ End of Bruker specific parameters
$$ ---------------------------------
##NTUPLES= NMR SPECTRUM
##VAR_NAME=  FREQUENCY,     SPECTRUM/REAL,   SPECTRUM/IMAG
##SYMBOL=    X,             R,               I
##VAR_TYPE=  INDEPENDENT,   DEPENDENT,       DEPENDENT
##VAR_FORM=  AFFN,          ASDF,            ASDF
##VAR_DIM=   32768,         32768,           32768
##UNITS=     HZ,            ARBITRARY UNITS, ARBITRARY UNITS
##FACTOR=    0.250966925370066, 1,           1
##FIRST=     8223.43324360095, 100404,       50365
##LAST=      0,             241571,          -40055
##MIN=       0,             -678176,         0
##MAX=       8223.43324360095, 453449598,    0
$$ Real data points
##PAGE= N=1
##DATA TABLE= (X++(R..R)), XYDATA
$$ [...]
$$ plain form
19545 93987 -235166 -228793 -355722 -66926 67636 -140449 -276654 -27809 -234231 183640 -41515
19533 -19930 -156276 -165014 6384 176662 -140098 -298511 88771 93891 183333 -211445 6687
19521 -104529 78507 215838 78497 -62838 -30127 145887 205971 -210039 -53620 161963 -30290
19509 146659 -164846 -511340 129274 -127245 159463 63979 -18098 -40701 164515 -509689
19498 -87949 114338 -371531 -162832 -232828 103154 -7756 -44039 -308893 -98239 -359350 -84038
19486 -213131 145287 54632 -8583 -20023 -131191 53310 42749 -51237 55781 124725 -114567
19474 -166603 37812 -374788 15509 -108952 -137616 -123178 -29850 -20344 -74262 -57135 -41671
19463 -41671 -208489 -77155 346255 150304 1036 -372916 133112 -58006 -249734 75080 -20227
$$ packed form
19545I3987b35166O373j26929f6926F7636a40449j36205b7809k06422A83640d1515
19533a9930j36346q738F384J70278a40098j58413H8771N120Q9442b11445F687
19521a04529G8507J37331G8497f2838c0127A45887O0084b10039e3620A61963c0290
19509A46659a64846l46494A29274a27245A59463F3979a8098k2603A64515e09689
19498h7949A14338c71531a62832o9996A03154g756l6283k64854i8239k61111h4038
19486b13131A45287E4632h583j1440j11168E3310j0561e1237E5781O8944a14567
19474a66603C7812c74788A5509a08952k8664J4438b9850R506n3918J7127J5464
19463d1671j66818g7155C46255A50304A036c72916A33112e8006j91728G5080b0227
$$ plain form
19451 -136513 -10912 -422116 368906 52692 137584 -97782 -95223 225744 -13544 117469 141094
19440 141094 -125684 -109660 -19422 174388 -269221 -315498 -109181 36480 117522 -190653
19429 -58565 50152 57393 -192595 144951 -36738 165720 -50965 -297332 -163732 1823 -241752
19417 104270 60665 31743 -268011 -94067 -114584 -113443 -98499 208692 -303437 5025 -151747
19405 -866 -184449 -116168 -289 -8264 -2400 -131802 86972 -194719 75266 -67201 -159508 -125250
19393 -125250 -20092 -144340 -228030 -158461 -16088 -142697 -380069 22257 -171388 -14504 -148011
19382 -148011 303296 -330852 -37621 80611 8681 -30180 -169230 -188276 -26430 -168706 -142423
19371 -142423 -76837 144968 -543653 -113072 -120163 -242529 295708 -222787 85317 56051
$$ packed form
19451a36513a0912m11204C68906E2692Q4892i7782K559B25744a3544A17469K3625
19440A41094a25684J6024a9422A74388b69221m6277a09181C6480Q1042a90653
19429e8565E0152P241a92595A44951c6738A65720e0965k46367J33600A823b41752
19417A04270m3605k8922b68011i4067k0517J141J4944B08692c03437E025a51747
19405h66j83583O8281b89p975b400j29402H6972a94719G5266f7201r2307L4258
19393a25250b0092j24248q3690O9569a6088j26609k37372B2257a71388a4504j33507
19382a48011C03296c30852c7621H0611H681c0180j39050j9046b6430j42276K6283
19371a42423O5586A44968e43653a13072p091j22366B95708b22787H5317k9266
$$ plain form
19361 56051 -486895 72881 -92049 -278251 -188366 -25460 170226 -407213 99979 -131511 -131903
19350 -131903 -1600 -64648 57973 -103323 29723 -260291 -313046 166205 -41277 134057 55853
19338 18851 -22970 -69847 -211602 -79967 82038 68826 -104870 -70595 -264158 -61582 110840
19326 -168970 -38566 -143772 38451 -128970 -26556 273547 -161540 -289442 -88816 -113924
19316 -113924 -177117 126511 -312686 -54567 -5024 -35003 55004 34660 345139 -181833 -66226
19304 10157 -218586 -13217 -1648 -35161 -230369 264393 28846 87063 100228 231825 183238
19293 183238 -329051 -223883 106361 118363 37131 -377910 -237759 -155942 -18644 58128
19282 100585 -275003 5705 -164894 112847 99967 15917 30709 270557 -297162 -354614 181862
$$ packed form
19361E6051d86895G2881i2049j86202Q9885b5460A70226d07213I9979a31511l92
19350a31903a600o3048E7973a03323B9723b60291n2755A66205d1277A34057E5853
19338A8851b2970m6877j41755g9967H2038j3212a04870L4275j93563f1582A10840
19326a68970c8566j05206C8451a28970b6556B73547a61540j27902h8816k5108
19316a13924o3193A26511c12686e4567e024k9979E5004k0344L10479a81833f6226
19304A0157b18586a3217a648l3513j95208B64393B8846N8217J3165J31597m8587
19293A83238c29051J05168A06361J2002C7131c77910J40151Q1817a8644E8128
19282A00585b75003E705a64894A12847j2880A5917J4792K39848b97162n7452A81862
$$ plain form
19270 118864 295332 173054 63425 -235934 -302085 -59904 61255 -31762 -311209 -250972 -451027
19259 -451027 -12068 -375640 -206270 -216535 75727 -167522 143325 -121423 103324 -305774
19248 77981 -153499 -335772 -185065 -67163 25322 50915 32475 -161235 -41409 -115602 -73267
19237 -73267 -240833 96157 16554 155747 78207 53207 -350078 196808 71180 -145348 39230
19225 209909 221172 -165865 -73075 -29058 -204597 -97400 -310662 -22811 -147029 234696
19214 -150264 -290468 -150842 -130633 -3383 -132766 5738 -364321 -27705 -226390 -59774 -175116
19203 -175116 192173 49509 -71336 -256657 176610 -60160 -211524 28842 17735 -161845
19192 36893 74481 229217 435096 -248872 -27340 59767 -157675 -155550 74502 -260783 -356893
$$ packed form
19270A18864J76468j22278F3425b35934o6151e9904F1255c1762k79447O0237k00055
19259d51027a2068l63572J69370j0265G5727a67522A43325a21423A03324c05774
19248G7981a53499j82273J50707f7163B5322K5593j8440a61235d1409p4193M2335
19237g3267j67566I6157A6554J39193p7540k5000c50078A96808G1180a45348C9230
19225B09909J1263a65865g3075b9058j75539i7400k13262b2811j24218B34696
19214a50264j40204J39626K0209c383j29383E738c64321b7705j98685e9774j15342
19203a75116A92173D9509g1336j85321A76610f0160j51364B8842j1107a61845
19192C6893L7588J54736K05879b48872b7340E9767a57675K125G4502b60783r6110
$$ plain form
19181 -356893 -213081 93643 129207 -107034 -81292 -233529 -97390 61233 84404 435748 227549
19170 227549 -42873 -18813 124504 -10928 -217123 -321352 86517 -509240 231462 406773
19160 406773 -149941 251828 135527 209902 -87352 101339 -75433 -89953 -229289 282761
19149 -67973 -267048 -142363 -254222 191009 -75861 107633 -35702 43851 -60800 -329852
19139 -329852 -412457 -93242 -4424 -18916 -180586 -208522 -201912 -75926 -131953 43293 -16633 122543
19126 51419 233453 32769 195647 213387 73398 -77027 -289616 -162651 52190 15645 100165
19115 100165 -39116 -175926 -49038 308379 -64281 -244978 55127 -115484 85780 22042 -37375
19103 -122377 150699 -191265 -60914 48005 -53032 -285385 29147 -203381 -58713 -39570 -469403
$$ packed form
19181c56893J43812I3643L5564a07034K5742j52237i7390F1233K3171L51344k08199
19170B27549d2873a8813A24504a0928k06195j04229H6517e09240B31462J75311
19160D06773a49941B51828j16301P4375h7352A01339g5433j4520j39336B82761
19149f7973j99075J24685j11859A91009g5861A07633c5702D3851f0800k69052
19139c29852q2605i3242d424j4492j61670k7936O610g5926n6027D3293a6633A22543
19126E1419J82034C2769J62878J7740G3398g7027k12589J26965E2190A5645Q4520
19115A00165c9116j36810d9038C08379f4281j80697E5127a15484H5780B2042c7375
19103a22377A50699a91265f0914D8005e3032k32353B9147b03381e8713J9143m29833
$$ plain form
19092 -469403 58291 -64258 -84592 -170930 -39603 43237 65903 -185179 -105408 211234 180167
19081 180167 -245974 23186 -132487 -207578 -301465 47528 448726 -48340 -72102 -281078 -321739
19070 -321739 87774 -233365 33436 222097 4242 -40150 176353 -20579 -288753 312394 -20182
19058 70143 -194796 -125330 -31684 -85604 -38793 140847 -64222 52850 -60590 -111331 -215193
19047 -215193 -177339 264924 -144410 79703 -37576 235067 -4815 -149187 156378 -78521 -130906
19036 -130906 -90967 22886 5234 61806 -65811 -77238 -308140 -43359 57812 -103311 -27377
19024 239389 212761 208087 93013 10 159930 360008 -164669 -58954 152304 -50781 232906
19012 191044 148987 57050 -59383 -261467 -58693 137309 211849 -14965 -30081 -31099 -117891
$$ packed form
19092d69403E8291f4258k0334q6338c9603D3237K2666a85179P9771B11234l1067
19081A80167b45974B3186a32487p5091r3887D7528M01198d8340k3762k08976m0661
19070c21739H7774b33365C3436J88661D242d0150A76353b0579k68174C12394b0182
19058G0143a94796O9466c1684n3920c8793A40847f4222E2850f0590n0741j03862
19047b15193L7854B64924a44410G9703c7576B35067d815j44372A56378g8521n2385
19036a30906L9939B2886E234N6572f5811j1427k30902d3359E7812a03311b7377
19024B39389k6628m674I3013A0J59920K00078a64669e8954A52304e0781B32906
19012A91044m2057E7050e9383k02084e8693A37309P4540a4965j5116j018q6792
$$ plain form
19001 -117891 -116748 28065 -81757 -12419 -120417 -141236 3454 -332447 57932 -24934 85554
18989 45168 -99922 302835 -87365 -325101 -210314 -87167 -101272 -160681 95202 -82533 9964
18977 -42524 -116555 189534 -193444 52107 17965 11018 -133634 -250537 -236308 133594 -115381
18965 219864 -278510 25400 -239717 -305937 -160812 -68655 -46615 73938 -408564 42711 -79608
18953 199744 18126 -160473 -85575 27240 155557 -62003 -64306 239141 -5529 137153 -71677
18941 -213826 -178421 -435897 -138268 -111680 -82737 -57777 -308556 -230222 -27091 9191 -6899
18929 54332 -155855 -74044 -54650 19642 88444 28984 -42872 32478 270159 225488 -236271
18917 -68298 395844 -116409 -117660 -78066 -58715 -157229 57432 210109 -175879 62808 20375
$$ packed form
19001a17891J143B8065h1757a2419j07998k0819C454c32447E7932b4934H5554
18989D5168i9922C02835h7365k37736J14787h7167j4105n9409I5202h2533I964
18977d2524p4031A89534a93444E2107A7965o947a33634j16903J4229A33594a15381
18965B19864b78510B5400b39717o6220J45125f8655K2040G3938d08564D2711g9608
18953A99744A8126a60473P4898B7240J28317f2003k303B39141e529A37153g1677
18941b13826L5405k57476a38268K6588K8943K4960k50779P8334b7091I191f899
18929E4332a55855g4044J9394A9642O8802B8984d2872C2478K37681m4671b36271
18917f8298C95844a16409j251L9594J9351r8514E7432J52677a75879F2808B0375
$$ plain form
18905 -190545 -108090 41038 89856 17329 335413 61029 -82134 70913 -101769 -535083 196712
18893 -60926 -283718 -33407 -334376 85189 54496 -86902 -296319 -58049 192394 140807 106299
18882 106299 -211397 -2286 35765 100086 -156723 -86443 338030 -46533 -244165 -131639 162332
18870 138436 -218088 -28206 -86436 -85117 -274630 320231 -31485 36646 86861 40334 -81591
18858 -118615 21703 -167616 -204213 -253837 -23194 -99780 36729 -168954 -23927 -225446 -253286
18847 -253286 11281 117876 224174 -347002 -34351 74689 -73659 49294 -54348 160642 183010
18836 183010 98419 -56142 -272413 127642 -67081 66388 -67457 -124924 -107591 -48379 -99169
18825 -99169 -16831 14106 -146953 -7597 -248955 -284565 -266716 -25599 -227180 -259223 272586
$$ packed form
18905a90545Q2455D1038M8818A7329L18084F1029h2134G0913a01769m33314A96712
18893f0926k22792c3407l00969H5189l0693h6902k09417e8049A92394n1587l4508
18882A06299b11397b286C5765O4321a56723P0280C38030d6533j97632J12526A62332
18870A38436b18088b8206n8230J319j89513C20231c1485C6646N0215D0334h1591
18858a18615B1703a67616l6597m9624b3194p6586C6729a68954b3927k01519k7840
18847b53286A1281J06595J06298c47002c4351G4689g3659D9294e4348A60642K2368
18836A83010q4591e6142k16271A27642f7081F6388f7457n7467J7333d8379n0790
18825i9169a6831A4106a46953g597k41358l5610J7849b5599k01581l2043B72586
$$ plain form
18813 62831 128074 -119492 34666 88928 -154940 -93907 -134393 -5327 132282 -385718 204732
18801 13149 200084 202194 178199 15444 -37065 323106 4463 -73151 139642 207433 -93384
18789 -72144 -173548 64727 274138 -39624 375986 -54751 160195 93381 -132285 -73648 199179
18777 -49134 -208664 -20106 -109325 48930 -64455 -7636 11483 -30055 191960 -28124 156179
18765 -116464 -44901 -227466 -57200 7485 -8607 3812 28096 -194277 -186314 158559 -196791
18753 357038 111839 -168379 -6997 -41013 -167645 31036 69051 14636 70137 -103330 -213032
18742 -213032 267242 -183538 -21673 -311671 -183813 267581 174938 -104919 190888 -44458
18731 -71398 34987 -118764 -43541 -238080 -123797 -183082 -229823 501945 155030 -220430
$$ packed form
18813F2831O5243a19492C4666N4262a54940O1033m0486e327A32282c85718B04732
18801A3149J86935K110k3995A5444c7065C23106D463g3151A39642O7791i3384
18789g2144j01404F4727K09411c9624C75986e4751A60195o6814a32285N8637A99179
18777d9134j59530b0106q9219D8930f4455g636A1483c0055A91960b8124A56179
18765a16464d4901j82565e7200G485h607C812K4284a94277P963A58559a96791
18753C57038A11839a68379f997l4016j26632C1036L8015A4636N5501a03330j09702
18742b13032B67242a83538b1673k89998J27858B67581r2643a04919A90888d4458
18731g1398C4987a18764d3541j94539J14283n9285m6741E01945A55030b20430
$$ plain form
18720 -440283 33211 -176144 -186505 83375 -134167 -244622 -205980 -70940 87839 -267104 -375813
18709 -375813 -48513 22183 -321718 175863 89181 122176 109107 133236 9513 95799 61389
18698 61389 -147469 -121911 -156374 105336 -38719 33598 -193813 -184385 -116250 -66703 105212
18686 235552 -167676 299284 -152419 -168211 90669 -332817 21738 -195130 -41043 -330896
18676 -330896 -52558 -66271 -227029 214488 324327 83763 95337 -19348 -200494 -175849 -227553
18665 -227553 123087 49554 52381 146217 -90907 108850 -83925 -67490 -174991 -260052 101112
18653 121031 -254235 -399749 -98751 200013 10696 -22014 119108 9723 63392 2382 44668
18642 44668 -207472 -57324 -281559 -349841 5517 230699 -136258 -97398 85752 -247156 44294
$$ packed form
18720d40283C3211a76144j0361H3375a34167j10455L8642g0940H7839b67104j08709
18709c75813d8513B2183c21718A75863q6682L2995j3069K4129I513Q6286l4410
18698F1389a47469K5558l4463A05336c8719C3598a93813R428O8135M9547A05212
18686B35552a67676B99284a52419j5792I0669c32817B1738a95130d1043k89853
18676c30896e2558j3713j60758B14488J09839H3763J1574a9348j81146K4645n1704
18665b27553A23087D9554K827R3836i0907A08850h3925J6435j07501q5061A01112
18653A21031b54235j45514i8751B00013A0696b2014A19108I723N3669B382M2286
18642D4668b07472e7324k24235o8282E517K25182a36258L8860H5752b47156D4294
$$ plain form
18630 17546 -106496 -124414 79248 -174380 -184748 41467 256920 230799 -77229 113713 136509
18619 136509 -53759 60863 -90622 -89776 319038 -17273 265927 105252 -111765 -251684 91636
18607 89821 7497 -151139 141406 -50828 -28294 15671 -88510 -166257 120345 39019 -248924
18595 33982 -68705 70489 -83414 -100218 -276667 106420 113631 -88423 -114516 -135643 -51087
18583 -42120 -395504 -48038 -78834 -50763 -115981 138105 -255762 -157636 228650 76761 -184347
18571 -49483 -77574 -42215 -58256 -26490 -17603 -120254 1413 11205 65741 -56779 -75243 -55505
18559 -55505 106081 107028 -54780 -172715 3881 -11912 107427 136708 -225612 71683 163326
18548 163326 -164207 47556 -139990 -59174 -17101 -412630 -220555 97159 237073 -182320
$$ packed form
18630A7546a06496j7918G9248a74380j0368D1467K15453k6121g7229A13713K2796
18619A36509e3759F0863i0622Q46C19038a7273B65927A05252a11765j39919I1636
18607H9821G497a51139A41406e0828K2534A5671h8510p7747A20345C9019b48924
18595C3982f8705G0489h3414j6804j76449A06420P211h8423k6093k1127e1087
18583d2120l53384d8038l0796K8071o5218A38105b55762R8126B28650G6761a84347
18571d9483k8091L5359j6041b6490Q887j02651A413R792N4536e6779j8464J9738
18559e5505A06081R47e4780j17935C881a1912A07427K9281b25612G1683R1643
18548A63326a64207D7556a39990e9174a7101l95529J92075I7159J39914a82320
$$ plain form
18537 143275 217834 -296216 -47764 304113 -6786 -109580 81125 51471 -34418 -119084 -36597
18525 -316126 -184055 -154336 -256818 41644 145474 -98600 -124598 23278 -151151 130197
18514 68288 91954 -40924 -125641 -85106 48484 -153636 50316 -426423 196288 9879 -100668
18502 -227964 148934 -247215 135032 -112904 -210223 307845 15451 124884 -171752 264195
18491 16616 236896 -66480 62518 -4514 -167996 -84930 -211880 97845 -65428 -3501 -53447
18480 -53447 34852 -100283 -12282 142139 34527 199318 -167236 76726 7365 -332486 -34306
18468 -106475 -80526 -259237 78404 72385 105307 -177879 45177 -104854 -267684 22286 -79905
18456 -243692 -209473 -329570 -64014 -152988 13067 67577 -137483 79156 -96986 -211601 -5335
$$ packed form
18537A43275P4559b96216d7764C04113f786j02794H1125k9654c4418q4666c6597
18525c16126J32071K9719j02482D1644J03830i8600k5998B3278a51151A30197
18514F8288K3666d0924q4717M0535D8484a53636E0316d26423A96288I879a00668
18502b27964A48934b47215A35032a12904r7319C07845A5451J09433a71752B64195
18491A6616K20280f6480F2518d514j63482Q3066j26950I7845f5428c501m9946
18480e3447C4852a00283a2282A42139C4527J64791a67236G6726G365c32486c4306
18468a06475K5949j78711G8404o019L2922a77879D5177a04854j62830B2286g9905
18456b43692L4219j20097f4014q8974A3067N4510a37483G9156i6986j14615e335
$$ plain form
18444 -258880 64573 -151065 -344492 -132752 76200 -151491 59332 60814 -109705 -66963 -178707
18433 -178707 50582 -38004 -57896 144465 -73667 -68580 -98084 -120689 -86171 -283029 -254440
18422 -254440 45059 -87144 62921 -44846 -57968 -178282 -149484 65849 95709 62289 -232209
18410 -227362 338697 79392 75805 3305 57162 45518 150665 334758 -307904 -129920 -42496
18398 93323 34644 55371 72217 297114 152674 76327 -91086 -132332 117678 -51157 225984
18386 -332006 -39540 21689 -68213 -238961 127495 -232200 10757 -253217 -54029 -234195
18376 -234195 -381424 -86806 264614 -278805 96309 -31749 -88838 -15098 90978 -143709 -74499
18365 -74499 -211377 206789 263904 -248971 8336 194248 -101908 -187052 113153 -397489
$$ packed form
18444b58880F4573a51065j93427a32752G6200a51491E9332J482a09705M2742j11744
18433a78707E0582c8004j9892A44465g3667N087k9504k2605L4518j96858K8589
18422b54440D5059h7144F2921d4846j3122j20314K8798F5849K9860l3420b32209
18410b27362C38697G9392l587C305N3857j1644J05147J84093c07904a29920d2496
18398I3323C4644K0727J6846K24897j44440G6327i1086m1246A17678e1157B25984
18386c32006c9540B1689f8213j70748A27495b32200A0757b53217e4029j80166
18376b34195j47229h6806B64614b78805I6309c1749n7089a5098I0978a43709O9210
18365g4499j36878B06789N7115b48971H336J85912a01908q5144A13153c97489
$$ plain form
18354 -224184 20017 144495 144651 117253 297787 11165 260248 134399 -279928 228902 -23835
18342 -176310 302834 313448 303108 -165419 112637 -336973 -165851 -20593 -121425 102881
18331 25878 320455 4459 -17164 -171914 -186000 -335796 16937 -258754 -146715 -257368 -117536
18319 -195360 23048 44547 41566 54801 11526 93963 296872 128925 -23207 38519 -251169
18307 -298230 90819 -141444 384509 89193 -24922 -196897 -30649 32269 121965 86640 -140932
18295 90302 -116766 -163548 -219035 -311455 15673 -197396 -191845 342620 -112501 -164349 135861
18283 21121 235637 33686 -242512 -129692 -266667 -267477 231756 -15453 -240405 -339444 104792
18271 -112065 129544 163148 -233363 42595 -406716 113284 -396613 -134967 79555 239206
$$ packed form
18354b24184B0017J24478J56k7398J80534A1165K49083j25849b79928B28902b3835
18342a76310C02834J0614j0340a65419A12637c36973a65851b0593j00832A02881
18331B5878K94577D459a7164j54750j4086j49796A6937b58754J12039j10653a17536
18319a95360B3048K1499k981J3235A1526Q2437K02909A28925b3207C8519b51169
18307b98230I0819a41444C84509H9193b4922j71975c0649C2269Q9696l5325a40932
18295I0302a16766m6782n5487r2420A5673a97396N551C42620a12501n1848A35861
18283B1121K14516C3686b42512J12820j36975q10B31756a5453k24952r9039A04792
18271a12065A29544L3604b33363D2595d06716A13284c96613a34967G9555J59651
$$ plain form
18261 239206 -334889 -38268 53940 16011 26696 -116402 32999 -291294 4871 -65434 57392
18249 157708 13854 -19211 -59071 185405 -78803 -50447 -196444 -22521 -163167 329275 -179700
18237 -200050 -206886 -88308 -62587 -179447 -397375 -198307 73498 -210375 212407 61528 -49600
18225 22537 -387803 51491 -130464 -56081 -281044 269321 -226522 143715 146920 -11191 -385886
18214 -385886 -222621 -67968 95107 44172 -113446 -35283 -85433 271784 46626 256254 -185311
18202 171832 2365 79950 154645 126651 34639 115563 222117 -71353 -103025 277900 102150
18190 63650 172263 -122222 -237688 -141860 59760 127357 5500 124567 32444 33503 -7606
18178 79220 -114908 -128046 -58810 -266838 49983 72305 164067 -353441 -46523 -122964 392968
$$ packed form
18261B39206c34889c8268E3940A6011J0685a16402C2999b91294D871f5434E7392
18249A57708A3854a9211l9860A85405g8803K8356j45997b2521j40646C29275a79700
18237b00050o836h8308K5721j16860k17928a98307G3498b10375B12407F1528d9600
18225B2537c87803E1491a30464e6081k24963B69321b26522A43715L205a1191l74695
18214c85886J63265f7968I5107D4172a13446c5283n0150B71784D6626K09628a85311
18202A71832B365P7585P4695k7994C4639Q0924J06554g1353l1672B77900A02150
18190F3650J08613a22222j15466R5828E9760O7597E500J19067C2444J059g606
18178G9220a14908j3138e8810k08028D9983K2322R1762c53441d6523p6441C92968
$$ plain form
18166 -307175 148884 -399731 -43989 -148920 -49673 -42976 27995 261185 -183858 -238313 -202313
18155 -202313 211859 -116790 12275 -137416 -328346 -210627 228630 17512 -292304 254123
18144 -113193 -116583 -146649 74047 -236296 -14041 -16633 -15646 -280261 -63356 -7844 -65284 76494
18131 -130694 -339966 243582 177237 -7943 140036 -135163 -197976 -7423 267551 -91238 234422
18119 -93744 84472 -453899 -239563 -70598 14750 -88905 267556 -117751 -134579 31495 104845
18108 104845 -94343 -79642 -122174 -162611 -241351 155430 29936 -112445 80642 94791 -67750
18096 -196338 -32921 -143502 47241 48204 -45388 219496 -18577 -197770 -74539 311757 133761
18084 225940 -61853 -83873 294408 177700 -224834 242593 294557 -378327 -38858 -53481
$$ packed form
18166c07175A48884c99731d3989j04931d9673O697B7995K33190a83858n4455L6000
18155b02313B11859a16790A2275a37416j90930J17719B28630A7512b92304B54123
18144a13193l390l0066G4047b36296a4041k592R87k64615f3356g844n7440G6494
18131a30694k09272B43582o6345g943A40036a35163o2813g423B67551i1238B34422
18119i3744H4472d53899K14336g0598A4750h8905B67556a17751j6828C1495P3350
18108A04845i4343J4701m2532m0437p8740A55430B9936a12445H0642J4149f7750
18096a96338c2921j10581D7241R63d5388B19496a8577j79193g4539C11757A33761
18084B25940f1853k2020B94408j16708b24834B42593N1964c78327c8858j4623
$$ plain form
18074 -53481 -259161 150812 82867 -44061 -475718 -301943 221269 38439 111920 64386 17340
18062 165292 -146329 -44129 46410 16798 27884 -73163 -152216 -70833 16616 121890 -193015
18050 31063 -132077 -216550 -86002 244712 -169662 -123897 -147420 -2544 -158927 -318826 202093
18038 78203 123963 -244035 178450 -336242 87218 245492 57122 386979 -140556 -53756
18027 153152 -129450 -96220 -92493 -22332 69953 -85919 1320 12241 -49681 -91278 -209959
18016 -209959 -170546 96313 -97403 -134286 -393294 -321906 36348 -72279 193844 163051 63435
18004 215262 55186 -255978 -259308 -15240 54018 -179830 -138017 61576 -519478 359205 142390
17992 -167324 222239 -304216 243289 33646 150041 115654 -4512 -10630 386807 40180 75514
$$ packed form
18074e3481k05680A50812o7945d4061m31657J73775B21269C8439P3481m7534A7340
18062A65292a46329d4129D6410A6798J1086g3163p9053g0833A6616J05274a93015
18050C1063a32077q4473h6002B44712a69662M5765k3523b544j56383j59899B02093
18038G8203M5760b44035A78450c36242H7218J58274E7122L29857a40556e3756
18027A53152a29450L3230L727b2332F9953h5919A320J0921d9681m1597j18681
18016b09959L9413I6313i7403l6883k59008P1388C6348g2279A93844l0793F3435
18004B15262E5186b55978l330a5240E4018a79830M1813F1576e19478C59205A42390
17992a67324B22239c04216B43289C3646J16395l4387d512o118C86807D0180L5334
$$ plain form
17981 75514 -133287 217849 -86015 198959 398195 -33578 207446 144958 103831 293273
17971 293273 -214690 -10629 -5361 -242228 23053 -80862 -306594 -121353 172246 394783
17961 394783 79742 -78600 244985 247227 -71917 133792 -23360 225138 -125667 115508 82366
17950 82366 -246757 -143255 -232660 -103943 92311 -262828 -13502 40612 -358222 -126146
17939 -152930 -36819 40309 -62439 266422 -307596 -409815 -108751 -135812 -2015 -4635 -218197
17928 -218197 -310583 132002 455255 -149803 -254605 -176243 -83083 -22719 -172273 227398
17917 301261 -172006 -143933 -144938 125772 144824 -129690 -216335 -152846 -122105 7076 118996
17906 118996 411778 -115553 -38851 -240658 41795 98065 -256402 -14728 357127 -138800
$$ packed form
17981G5514a33287B17849h6015A98959J99236c3578B07446o2488m1127J89442
17971B93273b14690a0629N268k36867B3053h0862k25732a21353A72246K22537
17961C94783G9742g8600B44985K242g1917A33792b3360B25138a25667A15508l3142
17950H2366b46757J03502q9405a03943I2311b62828a3502D0612c58222a26146
17939a52930c6819D0309f2439B66422c07596j02219a08751k7061b015k620k13562
17928b18197r2386A32002L23253a49803j04802P8362h3083b2719j49554B27398
17917C01261a72006K8073j005A25772J9052a29690q6645O3489L0741G076J11920
17906A18996K92782a15553c8851k01807D1795N6270b56402a4728C57127a38800
$$ plain form
17895 63201 6950 4245 114458 -33362 83595 200644 159342 -82263 89579 215657 115162
17884 115162 -84074 -29235 58590 148021 -261211 41454 -112066 -129596 132095 200914 59066
17872 -221647 -233482 -259805 34906 33283 14191 -19373 -212057 -77081 -37008 16475 81846
17861 81846 106561 143174 197330 -294331 109282 -217499 -86529 297141 -360636 -133126
17850 385656 -312000 -254674 -110335 -21269 271263 161995 304420 173178 -66787 201626
17839 -38689 -44002 17699 220138 -132140 -539244 255143 16023 154356 -82145 8971 39168
17828 39168 186808 -102786 164951 -201820 -233138 -61109 -118451 317939 77011 -38982 -15292
17816 -21978 -273112 267227 -6695 27123 -26504 301665 -18786 -80768 -176716 216691 117766
$$ packed form
17895F3201F950k705J10213c3362H3595J17049m1302h2263H9579J26078j00495
17884A15162h4074b9235E8590Q9431b61211D1454a12066j7530A32095O8819E9066
17872b21647j1835k6323C4906j623A4191a9373j92684g7081c7008A6475O5371
17861H1846K4715L6613N4156b94331A09282b17499h6529B97141c60636a33126
17850C85656c12000N7326a10335b1269B71263j09268J42425j31242f6787B01626
17839c8689n313A7699K02439a32140m07104B55143A6023J38333h2145H971L0197
17828C9168J47640a02786A64951b01820l1318f1109n7342C17939G7011c8982a5292
17816b1978k51134B67227f695B7123b6504C01665a8786o1982r5948B16691r8925
$$ plain form
17805 117766 -41951 -55685 -53541 -47685 379488 -163204 103096 -86103 -147208 57775 16043
17793 20465 -222652 88116 -335036 -116592 17203 63581 -30965 -38838 238634 132646 -92406
17781 -60469 138682 80623 97892 275936 -2627 48762 -32568 -201077 -38065 -67906 -81453
17770 -81453 -56 -135061 -23516 -199379 86670 -43727 -155629 172651 61287 -22388 120428
17758 134646 -13511 -209453 61203 -22022 314853 -32001 70705 -80205 -44582 -54712 -73421
17747 -73421 -269360 -98151 276383 129363 23808 -124735 4514 -120474 -57530 40289 -87049
17735 -108055 -73244 -166667 211192 311428 287011 14624 140305 -150050 24520 296086
17725 296086 -78266 57800 264517 -114110 66457 168686 -179917 -63647 115999 194709
$$ packed form
17805A17766d1951j3734K144N856C79488a63204A03096h6103o1105E7775A6043
17793B0465b22652H8116c35036a16592A7203M6378c0965p873B38634j05988i2406
17781f0469A38682n8059J7269J78044b627D8762c2568j68509c8065k9841j3547
17770h1453e6j35005b3516j75863H6670d3727j11902A72651F1287b2388A20428
17758A34646a3511j95942F1203b2022C14853c2001G0705h0205L5623j0130j8709
17747g3421j95939i8151B76383A29363B3808a24735D514a20474e7530D0289h7049
17735a08055L4811r3423B11192J00236k4417A4624J25681a50050B4520K71566
17725B96086g8266E7800K06717a14110F6457J02229a79917f3647A15999P8710
$$ plain form
17715 194709 -70018 -254445 -50826 32604 85851 64252 8662 206641 -254761 64864 85156
17704 85156 44332 97121 209330 -198150 99153 392477 -209410 182774 -69939 -195577
17694 -195577 -68659 -60283 126789 296171 28709 11631 -340479 76672 10181 118618 232853
17683 232853 182199 115961 -24779 226570 -14854 80425 -301570 169389 148159 -184726 193753
17671 -61115 29091 -151555 -118908 15806 -169015 292605 11225 -61454 138024 -203703 -163564
17660 -163564 -135153 32353 -78297 367846 -39458 179090 39226 -43850 121923 -353166 314401
17648 44622 75802 -106136 170499 134183 151814 -111038 78748 67224 267949 -205388 188252
17636 237561 -8602 464895 99284 70040 197628 188418 134181 -95114 94512 158530 271584
$$ packed form
17715A94709g0018j84427e0826C2604N3247k1599H662J97979b54761F4864K0292
17704H5156m0824N2789J12209a98150I9153K93324b09410A82774f9939j25638
17694a95577f8659Q376A26789J69382B8709A1631c40479G6672A0181J08437J14235
17683B32853n0654o6238b4779B26570a4854H0425c01570A69389k1230a84726A93753
17671f1115B9091a51555L2647A5806a69015B92605A1225f1454A38024b03703M0139
17660a63564K8411C2353g8297C67846c9458A79090C9226d3850A21923c53166C14401
17648D4622L1180a06136A70499l6316J7631a11038G8748j1524K00725b05388A88252
17636B37561h602D64895I9284k9244J27588r210n4237i5114I4512O4018J13054
$$ plain form
17625 271584 251675 47073 80921 55659 281523 212512 75378 -45375 -523741 -91462 50609
17613 -190433 331534 248857 420566 178979 100328 -145826 -81254 -198397 86594 -134099
17602 317570 -105827 -358383 -121420 -82458 73859 27484 -95908 1825 143009 -93377 97459
17590 131157 -101014 60753 298602 -16685 -181646 -143167 -227252 201720 110608 -64756 315352
17578 -359765 -82146 62940 88128 54719 139415 -7117 298453 93264 -206730 171276 -297
17566 12507 239635 -51119 38891 19756 114511 -212266 319467 221146 -3244 118671 -33531
17554 72388 173104 28981 -45142 144940 75612 -80281 -35349 -1322 -26853 -183543 56508
17542 -229857 -82472 161018 -24635 -12572 -30328 36737 151853 -4512 -132456 104316 357211
$$ packed form
17625B71584j9909D7073L3848k5262K25864o9011G5378d5375m78366i1462E0609
17613a90433C31534q2677J71709A78979p8651a45826O4572j17143H6594a34099
17602C17570a05827k52556a21420L8962G3859B7484i5908A825J41184i3377I7459
17590A31157a01014F0753K37849a6685j64961L8479q4085B01720r1112f4756C15352
17578c59765h2146F2940K5188l3409Q4696g117B98453I3264b06730A71276b97
17566A2507K27128e1119C8891j9135R4755b12266C19467r8321c244A18671c3531
17554G2388J00716B8981d5142A44940o9328h0281c5349a322k5531j56690E6508
17542b29857h2472A61018b4635J2063j7756C6737J15116d512j27944A04316K52895
$$ plain form
17531 357211 -214725 258389 -85466 380731 -205657 13994 155998 -34239 22966 23348 31651
17520 31651 17243 -137592 169907 -240392 -107255 39611 -27288 14462 124950 -193488
17509 111478 36908 124058 -113346 328987 -204777 202077 5091 280812 195492 270389 -34488
17497 -91496 38712 -23679 129851 197945 119161 134374 146562 63143 240774 1898 368543
17486 368543 179923 369521 -196285 -21341 353995 108909 -156084 108910 130644 276792
17476 276792 6249 229126 88168 15939 46944 113332 -302514 217359 66684 215282 64551
17464 350134 329875 104403 271462 201990 180973 169313 144274 118714 246213 231009 55189
17452 160265 318604 59396 212230 140694 -57721 -143114 173891 -93977 -122560 94760 41890
$$ packed form
17531C57211b14725B58389h5466C80731b05657A3994J42004c4239B2966L82Q303
17520C1651j4408a37592A69907b40392a07255C9611b7288A4462J10488a93488
17509A11478C6908Q7150a13346C28987b04777B02077E091K75721q5320P4897c4488
17497i1496C8712b3679A29851O8094p8784J5213J2188F3143J77631A898L66645
17486C68543A79923J89598a96285b1341C53995A08909a56084A08910K1734J46148
17476B76792F249K22877H8168A5939L1005O6388c02514B17359F6684J48598F4551
17464C50134k0259A04403J67059o9472k1017j1660k5039k5560J27499j5204E5189
17452A60265J58339E9396J52834p1536e7721q5393A73891i3977k8583I4760D1890
$$ plain form
17440 356574 232715 67363 160405 156971 41548 55162 207392 114155 81423 292519 192576
17429 192576 236250 82023 -227152 146660 303602 58331 434408 91573 416010 -5924 128234
17417 257765 429763 611259 125686 518824 80988 384480 -67017 132362 160760 195543
17407 195543 151322 375719 501480 156540 403902 289064 407064 98145 299791 -10468
17396 -130250 369259 200548 329146 90020 60001 322582 181856 -213922 16603 157424
17386 157424 266371 88463 191974 -65452 218848 89352 83787 -26120 556946 389360 42230
17374 116853 314443 -11466 95440 -376663 21333 237770 158503 337055 362846 132469
17363 13319 -60535 37247 147507 33886 325345 180009 50981 666392 6975 -221770 -138542
$$ packed form
17440C56574j23859F7363R3042l434D1548J3614J52230r3237l2732K11096r9943
17429A92576M3674H2023b27152A46660J56942E8331L76077I1573L24437e924A28234
17417B57765J71998J81496A25686L93138H0988L03492f7017A32362K8398L4783
17407A95543m4221K24397J25761A56540K47362j14838J18000I8145K01646a0468
17396a30250C69259j68711J28598I0020l0019K62581j40726b13922A6603J40821
17386A57424J08947H8463J03511f5452B18848H9352n565b6120E56946j67586D2230
17374A16853J97590a1466I5440c76663B1333K16437p9267J78552K5791A32469
17363A3319f0535C7247J10260C3886K91459j45336E0981O15411F975b21770Q3228
$$ plain form
17352 -138542 103784 82535 24979 -14140 314705 170724 268695 140720 195241 -169561
17341 -274232 43485 -30396 195811 134608 84390 -73458 -129659 -52325 387297 3857 84738
17330 84738 374790 116687 286577 260104 243622 241730 277984 277799 -48210 343273 318277
17319 318277 357506 117967 -97626 20068 19990 -29664 127573 389927 3615 105270 -154158
17307 258763 -79131 -9492 213877 -68787 40706 -93827 -32555 114142 121193 132908 -68673
17295 446078 437153 126920 368600 27828 78726 264308 -26826 -139241 247768 345960 -88152
17283 104974 191322 254976 296170 86669 50231 431944 -95880 16520 157375 173782 84255
17271 421746 22656 -116964 342950 -164513 100911 26517 34567 72394 138616 123015 140568
$$ packed form
17352a38542A03784k1249B4979a4140C14705j43981R7971j27975N4521a69561
17341b74232D3485c0396A95811o1203n0218g3458n6201e2325C87297C857Q0881
17330H4738K90052A16687J69890k6473j6482j892L6254j85d8210C43273k4996
17319C18277L9229A17967i7626B0068p8b9664A27573K62354C615J01655a54158
17307B58763g9131i492B13877f8787D0706i3827c2555A14142P051J1715f8673
17295D46078q925A26920K41680B7828N0898J85582b6826j12415B47768R8192h8152
17283A04974Q6348O3654M1194H6669l6438L81713i5880A6520J40855J6407H4255
17271D21746B2656a16964C42950a64513A00911B6517Q050L7827O6222j5601J7553
$$ plain form
17260 140568 -32559 259056 128639 50817 366616 198191 76267 415260 -9336 21778 95252
17249 95252 293107 474399 101394 195332 69381 287126 153272 215051 -51630 439444
17238 441901 48914 175620 258703 115481 166165 302835 277092 109850 133906 151460 339137
17227 339137 152270 73181 253832 201172 -30733 63481 33024 -136611 174241 -70775 159183
17215 -194843 19023 -362768 386958 209441 250359 83710 76547 272528 89399 217865 150836
17204 150836 195456 147477 301078 291384 -64213 435217 290483 -1405 272562 189966 164995
17193 164995 322052 209648 209407 386871 405845 -14797 671488 228427 70522 239218 292997
17182 292997 107107 181221 239642 245280 329826 109754 151641 116649 376698 328687 422922
$$ packed form
17260A40568c2559B59056A28639E0817L15799j68425G6267L38993i336B1778P3474
17249I5252J97855J81292A01394R3938F9381K17745j33854O1779e1630D39444
17238D41901D8914J26706Q3083A15481N0684J36670k5743A09850K4056J7554J87677
17227C39137A52270G3181J80651n2660c0733F3481l0457a36611A74241g0775A59183
17215a94843A9023c62768C86958j77517M0918H3710p163J95981H9399J28466o7029
17204A50836M4620m7979J53601r694f4213D35217j44734a405B72562q2596k4971
17193A64995J57057j12404k41J77464J8974a4797F71488B28427G0522J68696N3779
17182B92997A07107P4114N8421N638Q4546A09754M1887l4992K60049m8011R4235
$$ plain form
17171 422922 367173 160562 -17202 168903 189067 -95629 211524 82374 29050 -65795 522318
17159 416574 -6155 261856 452444 464576 325836 534433 264468 368611 233113 313688
17149 313688 253686 453135 299979 261455 223408 516910 281543 169523 180963 362539
17139 362539 315951 340297 462708 80664 240335 -20050 183272 437431 181261 30118
17128 302886 128302 251938 64037 221073 316568 -45865 340945 11123 391994 241861
17118 241861 134525 345116 245033 271093 158114 68900 528372 119607 505897 259548
17108 259548 376392 280059 362663 -129416 503590 274090 470445 131219 164923 476176
17098 476176 280063 320121 231123 -177916 366541 57595 343896 231716 284128 468386
$$ packed form
17171D22922n5749A60562a7202A68903K0164i5629B11524H2374B9050f5795E22318
17159D16574f155B61856J90588J2132j38740K08597B64468J04143j35498Q0575
17149C13688o0002J99449j53156l8524l8047K93502k35367j12020J1440J81576
17139C62539m6588K4346J22411H0664J59671b0050A83272K54159A81261C0118
17128C02886A28302J23636F4037J57036R5495d5865C40945A1123L80871j50133
17118B41861j07336K10591j00083K6060j12979F8900M59472A19607L86290k46349
17108B59548J16844r6333Q2604a29416E03590k29500J96355A31219L3704L11253
17098D76176j96113M0058q8998a77916C66541E7595K86301j12180N2412J84258
$$ plain form
17088 468386 76635 223830 74272 175655 91675 226539 389115 467322 375319 377113 93995
17076 394321 563246 411109 603012 572595 413911 657877 262126 268935 333990 260159
17066 260159 255649 527571 456215 599156 487159 443255 188165 399905 517805 378624
17056 378624 531153 325655 329773 381836 230061 389620 674534 613602 132698 296787
17046 296787 354972 290641 484578 678047 513924 639287 517968 335994 557089 474198
17036 474198 435497 327929 456471 580135 761918 390197 418580 571647 725870 647541
17026 647541 410843 212348 437663 153936 709533 603636 739820 651998 292332 605452
17016 605452 348142 695031 457085 677492 437600 587189 630707 312025 607098 386047
$$ packed form
17088D68386G6635J47195G4272J01383q3980J34864J62576P8207r2003J794I3995
17076C94321J68925j52137J91903l0417j58684K43966B62126O809O5055p3831
17066B60159m510K71922p1356J42941j11997m3904A88165K11740J17900j39181
17056C78624J52529k05498M118N2063j51775J59559K84914o0932A32698J64089
17046B96787N8185o4331J93937J93469j64123J25363j21319j81974K21095q2891
17036D74198l8701j07568J28542J23664J81783l71721K8383J53067J54223p8329
17026F47541k36698j98495K25315A53936N55597j05897J36184q7822B92332L13120
17016F05452k57310L46889k37946K20407k39892J49589M3518C12025K95073k21051
$$ plain form
17006 386047 678744 845727 338554 648914 941912 485454 471162 556373 532860 900274
16996 900274 397358 549020 494254 436941 680953 493479 700151 412174 443855 990568
16986 990568 694964 757616 529476 643882 413392 807968 762074 673880 265891 495603
16976 495603 685264 280114 727356 794566 804850 658516 608458 712478 675968 980569
16966 980569 794379 524863 792145 702766 521889 623234 687323 677712 758871 847810 799990
16955 799990 826046 1159575 950651 810095 884999 794112 601254 808820 999717 688016
16945 688016 748290 1111732 876416 1026194 1012885 1188335 967686 738970 600633 1063887
16935 1063887 1074206 1208056 814356 889973 952633 973935 1116008 1076634 911461 883803
$$ packed form
17006C86047K92697J66983C38554L10360K92998m56458j4292Q5211k3513L67414
16996I00274C97358J51662n4766n7313K44012j87474K06672k87977L1681N46713
16986I90568k95604O2652k28140J14406k30490L94576m5894q8194B65891K29712
16976D95603J89661B80114M47242O7210J0284j46334n0058J04020l6510L04601
16966I80569j86190k69516K67282q9379j80877J01345O4089r611Q1159Q8939m7820
16955G99990K6056L33529k08924j40556P4904r0887j92858K07566J90897l11701
16945F88016O0274L63442k35316J49778j3309J75450k20649k28716j38337M63254
16935A063887J0319J33850l93700P5617O2660K1302J42073l9374j65173k7658
$$ plain form
16925 883803 965166 741329 1174943 980826 1162584 1123376 1001745 979448 1130804 1083362
16915 1083362 1200657 795907 1251569 1244943 1332793 1058813 1142035 1220854 1111959 1202522
16905 1202522 1164050 1090293 1471085 1469075 978218 1416621 1261352 1283431 1572966 1346769
16895 1346769 1239081 1479676 1553042 1383589 1212063 1298207 1549099 1493538 1520443 1998759
16885 1998759 1407841 1324184 1254360 1612384 1633923 1604386 1681481 1585369 1827238 1499126
16875 1499126 1839627 1411441 1749575 1758827 1836915 1699672 1809544 1741503 1982572 1633421
16865 1633421 1805017 1763379 1701363 1722573 1863193 1975366 2008951 2058535 2321022 2029888
16855 2029888 1783958 2039974 2272783 2104415 2122739 2178010 2378907 2253410 1892139 2626098
$$ packed form
16925H83803Q1363k23837M33614j94117J81758l9208j21631k2297J51356m7442
16915A083362J17295m04750M55662o626Q7850k73980Q3222P8819j08895R0563
16905A202522l8472p3757L80792k010m90857M38403j55269K2079K89535k26197
16895A346769j07688K40595P3366j69453j71526Q6144K50892n5561K6905M78316
16885A998759n90918q3657o9824L58024K1539k9537P7095r6112K41869l28112
16875A499126L40501m28186L38134R252P8088j37243J09872o8041K41069l49151
16865A633421J71596m1638o2016K1210J40620J12173L3585M9584K62487k91134
16855B029888k45930K56016K32809j68368J8324N5271K00897j25497l61271P33959
$$ plain form
16845 2626098 2675818 2420557 2558718 2527693 2485559 2555843 2614894 2509186 2605886 2617060 2817743
16834 2817743 2620068 2811641 3115971 2847400 3132100 2984824 3082483 3062907 3037963 3073588
16824 3073588 3406792 3420431 3354617 3413925 3307347 3879637 3675516 3618303 3780511 3619948
16814 3619948 3734653 4191591 3790371 4095099 4313566 3914037 4065506 4506852 4490658 4177481
16804 4177481 4175169 4474352 4562770 5036692 5104310 5018017 4993821 5356176 5033117 5244061
16794 5244061 5619147 5676058 5684482 6091874 5938071 5682670 6143500 5959405 6426104 6908699
16784 6908699 6713837 7124221 7234959 7571118 7517218 8077080 8130870 8098011 8339878 8485962
16774 8485962 8893179 8802618 9269891 9488519 9736352 10071394 10573833 10622113 11125374 11510307
$$ packed form
16845B626098M9720k55261J38161l1025m2134P0284N9051j05708R6700J1174K00683
16834B817743j97675J91573L04330k68571K84700j47276R7659j9576k4944L5625
16824C073588L33204J3639o5814N9308j06578N72290k04121n7213J62208j60563
16814C619948J14705M56938m01220L04728K18467l99529J51469M41346j6194l13177
16804D177481k312K99183Q8418M73922O7618q6293k4196L62355l23059K10944
16794E244061L75086N6911Q424M07392j53803k55401M60830j84095M66699M82595
16784F908699j94862M10384J10738L36159n3900N59862N3790l2859K41867J46084
16774H485962M07217r0561M67273K18628K47833L35042N02439M8280N03261L84933
$$ plain form
16764 11510307 11842715 11976510 12312928 12530388 13157862 13624454 14258808 14643911 14825374
16755 14825374 15653693 16207556 16681765 17333144 17807665 18600076 19464837 20469107 21337511
16746 21337511 21930478 22985201 23888257 24590140 25933747 27024816 28818266 29754776 31238649
16737 31238649 32864236 34705407 36200839 38600580 40213993 42596390 45339643 47995635
16729 47995635 50383480 53199541 56439159 60239159 64281014 68010264 72645230 77433779
16721 77433779 82799811 88224472 94286960 100703913 107487187 114809179 122709289 130767980
16713 130767980 139009518 147473452 156595679 165693065 174162083 182423992 190071378 196932733
16705 196932733 202510088 206749960 209697399 211197675 210429085 207671153 203735968 198548487
$$ packed form
16764A1510307L32408J33795L36418K17460O27474M66592O34354L85103J81463
16755A4825374Q28319N53863M74209O51379M74521P92411Q64761J004270Q68404
16746B1337511N92967J054723R03056P01883J343607J091069J793450R36510J483873
16737C1238649J625587J841171J495432K399741J613413K382397K743253K655992
16729D7995635K387845K816061L239618L800000M041855L729250M634966M788549
16721G7433779N366032N424661O062488O416953O783274P321992P900110Q058691
16713A30767980Q241538Q463934R122227R097386Q469018Q261909P647386O861355
16705A96932733N577355M239872K947439J500276p68590k757932l935185n187481
$$ plain form
16697 198548487 192186764 184504565 176304784 167109276 158281107 149394270 140687339 131409386
16689 131409386 123322339 115434786 107635499 100566250 94045271 87601510 81902548 76607662
16681 76607662 71512272 66718759 62463445 58652099 54804197 51666148 48677831 45686128
16673 45686128 43154930 40671766 38610302 36298207 34502759 32549676 30817081 29358933
16665 29358933 28223340 26822524 25354522 24506923 23022038 22411840 21134569 20254968
16657 20254968 19378964 18680659 17878253 16838241 16202695 15640751 14926835 14577264 13820662
16648 13820662 13671431 13259207 12949249 12213954 11644570 11242369 10985764 10590784 10121881
16639 10121881 9640803 9497391 8907728 8894678 8794307 8442135 8218753 7978567 7852305
$$ packed form
16697A98548487o361723p682199q199781r195508q828169q886837q706931r277953
16689A31409386q087047p887553p799287p069249o520979o443761n698962n294886
16681G6607662n095390m793513m255314l811346l847902l138049k988317k991703
16673D5686128k531198k483164k061464k312095j795448j953083j732595j458148
16665B9358933j135593j400816j468002q47599j484885o10198j277271q79601
16657B0254968q76004o98305q02406j040012o35546n61944p13916l49571p56602
16648A3820662j49231m12224l09958p35295n69384m02201k56605l94980m68903
16639A0121881m81078j43412n89663j3050j00371l52172k23382k40186j26262
$$ plain form
16630 7852305 7720900 7240431 7302128 6932557 6538890 6696721 6405272 6150169 5744306 5956015
16620 5956015 6220450 5740708 5592955 5393854 5380970 4950233 4988205 4726869 4579110 4631579
16610 4631579 4614097 4553954 4476981 3961817 4145633 4305118 3710855 3928413 3504729 3877354
16600 3877354 3672050 3673412 3376636 3161753 3225006 3316159 2955244 3223532 2793636 3182168
16590 3182168 2922057 2737512 2565712 2754191 2460763 2801660 2802503 2501961 2433824 2069865
16580 2069865 2254543 2391586 2032681 2140789 2444890 2162132 2089761 2088475 2334987 1940034
16570 1940034 2086311 2182188 1908513 2242683 1491111 2013314 1615203 1890895 1671415 1659665
16560 1659665 1671594 1570339 1978506 1733642 1742306 1670414 1523206 1367965 1690321 1522803
$$ packed form
16630G852305j31405m80469O1697l69571l93667J57831k91449k55103m05863K11709
16620E956015K64435m79742j47753j99101j2884m30737L7972k61336j47759N2469
16610D631579j7482o0143p6973n15164J83816J59485n94263K17558m23684L72625
16600C877354k05304J362k96776k14883O3253R1153l60915K68288m29896L88532
16590C182168k60111j84545j71800J88479k93428L40897Q43l00542o8137l63959
16580B069865J84678J37043l58905J08108L04101k82758p2371j286K46512l94953
16570A940034J46277R5877k73675L34170p51572N22203l98111K75692k19480j1750
16560A659665J1929j01255M08167k44864Q664p1892j47208j55241L22356j67518
$$ plain form
16550 1522803 1120332 1433038 1555012 1499080 1493022 1422304 1123658 1538511 1486232 1599297
16540 1599297 1294928 1367364 1440515 959371 1285211 1303405 1246663 1365845 1338414 1155454
16530 1155454 1120065 819272 1259241 1099796 1078085 970532 1115662 1193539 1021670 732028
16520 732028 831911 915220 1084573 807080 627284 937886 984246 738310 794077 1069161
16510 1069161 934552 833787 1174519 931470 763619 994505 772029 602390 688813 630661
16500 630661 930445 888128 866459 667200 582570 1105307 758192 363713 602297 688532
16490 688532 471001 678385 600226 473132 650450 325280 738274 466224 681930 468578
16480 468578 462456 459497 520599 576584 450039 684023 648465 581517 344018 687308 423642
$$ packed form
16550A522803m02471L12706J21974n5932o058p0718k98646M14853n2279J13065
16540A599297l04369P2436P3151m81144L25840J8194n6742J19182k7431j82960
16530A155454l5389l00793M39969j59445k1711j07553J45130P7877j71869k89642
16520G32028R9883Q3309J69353k77493j79796L10602M6360k45936N5767K75084
16510A069161j34609j00765L40732k43049j67851K30886k22476j69639Q6423n8152
16500F30661K99784m2317k1669j99259q4630N22737l47115C63713K38584Q6235
16490F88532k17531K07384p8159j27094J77318l25170M12994k72050K15706k13352
16480D68578o122k959O1102N5985j26545K33984l5558o6948k37499L43290k63666
$$ plain form
16469 423642 596589 740272 843868 381445 628894 606781 346490 410043 439238 377052
16459 377052 404649 189876 275228 300738 567062 -22886 679201 129277 349851 462699
16449 462699 596938 475448 511129 306190 361231 -32618 195837 195191 249760 29535 347611
16438 347611 86243 474084 382822 458255 225129 617404 38169 375925 165428 317366
16428 317366 291990 362242 457257 453261 227225 381862 302296 354379 470668 183488 397273
16417 397273 261828 274218 297506 297511 -24557 270195 227163 176905 484042 347822 223862
16406 223862 96004 200467 65063 313272 402429 167725 445171 408921 383549 307112 192402
16395 192402 303355 -53843 201895 281476 282615 173764 343159 377790 313709 210827 -30976
$$ packed form
16469D23642J72947J43683J03596C81445K47449k2113k60291O3553K9195o2186
16459C77052K7597A89876Q5352K5510K66324b2886F79201A29277K20574J12848
16449D62699J34239j21490L5681k04939N5041c2618A95837o46N4569B9535L18076
16438C47611H6243L87841r1262P5433B25129L92275C8169L37756A65428J51938
16428C17366k5376P0252R5015l996k26036J54637p9566N2083J16289A83488K13785
16417C97273j35445J2390K3288Nb4557B70195m3032n0258L07137j36220j23960
16406B23862I6004J04463F5063K48209Q9157A67725K77446l6250k5372p6437j14710
16395A92402J10953e3843B01895P9581J139j08851J69395L4631o4081j02882c0976
$$ plain form
16383 152916 289406 238991 346788 122399 267329 -89033 607075 227734 403333 260653
16373 260653 101135 436155 234326 186492 24428 134477 304514 214001 529643 -8725
16362 -128095 96850 394282 195707 241578 91994 61251 75933 211845 443992 -112031
16351 120507 422873 -301633 68261 309158 543071 185759 117514 171013 -124999 55850
16340 281431 179465 236746 365605 236314 332673 55119 31792 218591 16895 252376
16330 252376 -160457 122341 78324 114994 -319651 262201 350621 425308 337105 -120322
16319 -315604 184285 -229665 255086 129112 167148 283995 15664 -43042 38505 217079
16309 217079 256881 128689 -66589 -87046 306997 297794 250923 86604 54810 221016 -113104
$$ packed form
16383A52916J36490n0415J07797A22399J44930h9033F07075B27734J75599j42680
16373B60653A01135L35020k01829m7834B4428J10049J70037r0513L15642h725
16362a28095I6850K97432A95707M5871I1994l0743J4682J35912K32147a12031
16351A20507L02366c01633F8261K40897K33913A85759o8245N3499a24999E5850
16340B81431j01966N7281J28859j29291R6359E5119k3327J86799A6895K35481
16330B52376a60457A22341m4017L6670c19651B62201Q8420P4687q8203a20322
16319c15604A84285b29665B55086j25974L8036J16847A5664d3042C8505J78574
16309B17079L9802j28192f6589k0457C06997r203m6871H6604l1794J66206a13104
$$ plain form
16297 -49785 111526 112591 212983 141159 98426 296507 2247 310666 303166 48618 108036
16286 108036 206093 -281963 -56306 222497 138696 40249 -85197 120067 218976 74751 222914
16275 222914 412176 -13400 167108 61552 123066 87624 -142549 276848 -167642 218670
16264 161732 -246734 317071 -71743 220026 -147878 366656 -183569 -14079 223927 -235529
16253 -245533 -197901 180054 -10311 -138810 158960 242511 31714 204069 -153729 -43364
16242 161438 -43636 131336 22501 -202866 -198618 -130804 15518 -173622 -146218 -145702 93764
16230 32635 -127932 -67020 -342858 16782 -86729 -14793 47633 -221150 109592 -21412 268272
16218 -183171 174105 -87347 -50649 150492 135844 171812 4531 -175135 74724 39451 343823
$$ packed form
16297d9785A11526J065J00392p1824m2733J98081B247L08419p500D8618N9418
16286A08036R8057b81963e6306B22497q3801D0249h5197A20067R8909G4751J48163
16275B22914J89262a3400A67108F1552O1514l5442a42549B76848a67642B18670
16264A61732b46734C17071g1743B20026a47878C66656a83569a4079B23927b35529
16253b45533M7632A80054a0311j28499A58960Q3551C1714J72355a53729d3364
16242A61438d3636A31336B2501b02866M248O7814A5518a73622K7404N16I3764
16230C2635a27932O0912k75838A6782h6729a4793D7633b21150A09592b1412B68272
16218a83171A74105h7347L6698A50492j4648L5968D531a75135G4724l5273L04372
$$ plain form
16207 343823 -87841 -24851 -79706 -204080 71248 19245 271904 -31606 -204879 231664 -26548
16195 122607 76249 -13467 107296 -207518 -239531 -168850 73128 -115519 -99795 -103334 130079
16183 110254 -77951 -27676 385490 186644 80786 -278821 233309 2567 179981 128613 67688
16172 67688 129723 198079 -123540 -61441 -19882 -150057 41067 -251800 -125932 105515 -234730
16160 -148491 -26956 -104118 73974 -36145 -132872 -74795 -67632 50484 -178500 -33340 -143227
16149 -143227 285054 43438 -361207 286953 160821 -235607 406120 -224372 -68470 49955
16138 -198135 16045 -121882 -239784 -153716 296806 -40526 53605 67777 -461404 -79965 -108052
16127 -108052 137606 -252623 -67039 -243235 185884 -130237 -101776 163149 -350357 -350829
$$ packed form
16207C43823h7841b4851n4855j24374G1248A9245K52659c1606j73273B31664b6548
16195A22607m6358a3467A07296b07518l2013P0681G3128a15519J5724l539A30079
16183A10254g7951b7676C85490A86644H0786b78821B33309B567J77414n1368o0925
16172F7688O2035O8356a23540f1441a9882j30175D1067b51800J25868A05515b34730
16160a48491b6956p7162G3974c6145r6727N8077P163E0484a78500c3340j09887
16149a43227B85054D3438c61207B86953j26132b35607D06120b24372f8470D9955
16138a98135A6045a21882j17902Q6068B96806d0526E3605J4172d61404g9965k8087
16127a08052A37606b52623f7039j76196A85884a30237K8461A63149c50357m72
$$ plain form
16117 -350829 307101 -58426 -157116 20028 -259465 97550 -141447 51005 -62520 -59809 333237
16105 -284325 59983 -207603 -39774 18852 -156828 222157 -102820 109897 315627 -83748
16094 -98944 134734 -30722 -23858 112548 -185684 153916 137658 -33516 -53330 -276209 230501
16082 95487 -47922 93361 144698 35361 111840 -440142 -219321 52812 37245 -361620 -64092
16070 -43386 -47209 -34180 -207815 -47275 -80774 83369 -62730 -268772 80311 336733 -100521
16058 234693 72027 -103719 -43621 -4807 -103443 2932 182845 59630 -184658 93073 14935
16046 238883 -173866 -97398 -15066 -86997 85196 -99334 187733 57592 -133165 19399 -150010
16034 -412918 159554 -254507 -233635 -55725 -23394 -76734 138174 -207885 -83253 22485 26736
$$ packed form
16117c50829C07101e8426r8690B0028b59465I7550a41447E1005f2520K711C33237
16105b84325E9983b07603c9774A8852a56828B22157a02820A09897K05730h3748
16094i8944A34734c0722O864A12548a85684A53916j6258c3516j9814k22879B30501
16082I5487d7922I3361N1337C5361P6479d40142b19321E2812j5567c61620f4092
16070d3386l823J3029j73635d7275l3499H3369f2730k06042H0311K56422a00521
16058B34693G2027a03719d3621d807r8636B932J79913E9630a84658I3073A4935
16046B38883a73866P6468a5066p1931H5196i9334A87733E7592a33165A9399a50010
16034d12918A59554b54507K0872e5725b3394n3340A38174b07885h3253B2485M251
$$ plain form
16023 26736 30649 282259 -87208 -90614 109714 -226705 -85521 -405043 -11038 210733 -20319
16011 128383 -132081 85147 46879 48471 158095 -166766 -396076 -159427 -120231 -7023 -118437
16000 -118437 48718 -206218 -97001 151535 131984 28161 -269255 -118245 6192 145384 324181
15989 324181 159281 49892 82296 -10820 -199633 113713 96367 -159566 43894 345810
15979 345810 -163721 9966 -116044 -49665 -8188 -132269 273790 -179081 -115371 50462 168177
15968 168177 223060 375283 86984 309373 318352 240407 -18090 106347 5996 -389382 -70021
15956 -6692 -184374 -88685 268888 -150970 197078 182380 122964 -3645 -296905 -122644 54171
15944 -45179 -91730 110522 -199734 110201 -336699 -18266 14215 168363 -44066 89797 252
$$ packed form
16023B6736L913K51610h7208l406A09714b26705h5521l19522a1038B10733b0319
16011A28383a32081H5147l8268J592J09624a66766k29310a59427L9196g023j11414
16000a18437D8718b06218i7001A51535j9551B8161b69255a18245F192J39192J78797
15989C24181A59281D9892L2404a0820j88813A13713j7346a59566D3894L01916
15979C45810a63721I966a16044d9665h188j24081B73790a79081O3710E0462J17715
15968A68177N4883J52223H6984K22389Q979p7945a8090A06347E996c89382g0021
15956f692j77682h8685B68888a50970A97078j4698n9416c645k93260a22644E4171
15944d5179m6551A10522a99734A10201c36699a8266A4215J54148d4066H9797B52
$$ plain form
15932 74509 -47125 -105282 38783 46612 33511 -347075 -68402 103716 -202463 -177960 56989
15920 2240 86202 -181683 143107 -141521 94744 -28492 27500 -131481 198435 221604 -169168
15908 -467590 119084 109310 134149 -289979 -147814 16061 -157205 191532 -237979 -231999 -208413
15897 -208413 159451 -92172 35340 102484 -91649 -33890 169357 33799 189975 -118924 -529228
15886 -529228 -164080 15486 -240049 263575 -7366 2618 29359 -254992 -340289 -167877 5355
15874 215212 -53022 -62475 -84688 -25930 -92694 -221523 -9309 125622 150671 154655 42685 -91398
15861 -54848 -333596 -4417 194113 109790 -349168 -104637 103631 -25042 -32290 -265378 -43653
15849 -364238 -210894 -9594 -37093 -224194 229557 -453480 95983 -45304 -291895 -46644 -435600
$$ packed form
15932G4509d7125n8157C8783P829j3101c47075f8402A03716b02463K4503E6989
15920B240Q3962a81683A43107a41521I4744b8492B7500a31481A98435K3169a69168
15908d67590A19084r774K4839b89979J42165A6061a57205A91532b37979N980K3586
15897b08413A59451i2172C5340O7144i1649c3890A69357C3799J56176a18924m10304
15886e29228a64080A5486b40049B63575g366B618K6741b54992q5297a67877E355
15874B15212e3022r453k2213b5930o6764j28829i309A25622K5049L984D2685i1398
15861e4848k78748d417A94113q4323c49168a04637A03631b5042p248k33088d3653
15849c64238J53344i594k7499j87101B29557d53480I5983d5304k46591d6644l88956
$$ plain form
15838 -435600 73999 156507 -105629 -208945 -33067 378570 -241936 -96017 135155 5636 185765
15827 185765 -311755 -275755 -64523 -239511 -268825 -124380 -246614 95514 368659 -174657
15816 -179257 31139 64356 -379863 -187267 -26918 -45713 -86195 -56240 22319 -50072 -66897
15805 -66897 -5946 -99754 3996 208878 182833 271347 189746 -95680 -308295 -363903 12771 66782
15793 66782 75521 -33512 -2993 287182 340142 -198455 164858 -173943 126441 63370 43221
15782 43221 -173699 29868 239970 63239 -353955 101434 -3317 -208627 213152 -98852 300845
15770 17356 -29681 76103 32078 43112 -164624 -408782 -18851 199152 -308602 102295 -6327
15758 -51969 -398342 -216232 -269944 53184 -261406 -137745 -175434 372653 -113066 74694
$$ packed form
15838d35600G3999Q2508a05629j03316c3067C78570b41936i6017A35155E636J80129
15827A85765c11755L6000f4523j74988k9314a24380j22234I5514K73145a74657
15816a79257C1139L3217c79863a87267b6918j8795m0482K9955B2319e0072j6825
15805f6897e946r3808C996K04882k6045Q8514q1601i5680k12615n5608A2771N4011
15793F6782Q739c3512b993B87182N2960a98455A64858a73943A26441o3071k0149
15782D3221a73699B9868K10102F3239c53955A01434c317k05310B13152i8852C00845
15770A7356b9681G6103C2078J1034a64624k44158a8851A99152c08602A02295f327
15758e1969l46373J82110n3712E3184b61406J23661l7689C72653a13066G4694
$$ plain form
15747 164963 316905 114947 78205 -123642 396825 -113790 -92558 303740 117212 219447
15737 219447 -80136 130614 -155619 38640 143920 -59799 145471 115831 -131078 -133434 -23006
15725 71569 -319361 -51819 -422674 -143807 118497 -378340 -47942 74462 -253362 -437890
15715 -437890 82371 -68508 89723 -190854 -34415 -148379 -159828 169615 -72950 119221 -83807
15703 -140874 64176 -207345 -226849 -165775 -87134 11981 -16989 120371 -57993 -96990 -151513
15692 -151513 6257 116682 -242130 211488 458583 -304476 -214872 -57708 -63133 -150338 -16374
15680 42626 -336985 126152 47193 158714 -132298 128939 -4319 -113860 122211 85899
15670 85899 409414 -210515 232650 5906 -20789 -63380 -102728 -178803 94374 425274 -118031
$$ packed form
15747A64963J51942A14947l6742a23642C96825a13790K1232C03740A17212J02235
15737B19447h0136A30614a55619C8640J05280e9799A45471k9640a31078k356b3006
15725G1569c19361e1819l70855a43807A18497c78340d7942G4462b53362j84528
15715d37890H2371f8508H9723a90854c4415j13964j1449A69615g2950A19221h3807
15703a40874F4176b07345j9504O1074P8641A1981a6989A20371e7993l8997n4523
15692a51513F257J10425b42130B11488K47095c04476Q9604e7708n425q7205a6374
15680D2626c36985A26152D7193J11521a32298A28939d319j09541A22211l6312
15670H5899L23515b10515B32650E906b0789m2591l9348p6075I4374L30900a18031
$$ plain form
15658 -16033 192016 -265341 -71910 -48476 53025 125195 -165850 -127674 239635 6393 25415
15647 25415 324227 -123845 50806 -84193 -197486 -101395 331542 41725 192774 109169 -209956
15635 -80722 162468 60712 -204767 186409 -163675 152324 -82583 156588 -213477 -88509
15624 -291604 -124983 -36438 883 57620 -39318 122867 -150974 -380240 14858 -45696 113484
15612 -109118 -128829 191029 301100 -98023 -199436 -17168 -62578 121638 168527 -200541
15601 95959 155373 28290 -30731 -374417 98507 28034 9071 -70278 -36648 -97473 -143086 -112467
15589 -112467 -17661 -229674 134976 -45986 -267180 -146321 -140509 295391 -14027 40938 -102365
15577 -176271 368546 348225 -58177 -225328 -269084 -214887 -179652 -55640 -15152 119547 127271
$$ packed form
15658a6033A92016b65341g1910K3434E3025P2170a65850L8176B39635F393J9022
15647B5415K98812a23845E0806h4193j13293R6091C31542D1725J51049q3605b09956
15635h0722A62468F0712b04767A86409a63675A52324h2583A56588b13477h8509
15624b91604a24983c6438H83N6737c9318A22867a50974k29266A4858d5696A13484
15612a09118j9711A91029J10071i8023j01413a7168m5410A21638M6889b00541
15601I5959N9414B8290c0731l43686I8507B8034I071g0278L3630o0825m5613L0619
15589a12467a7661k12013A34976d5986k21194J20859N812B95391a4027D0938a02365
15577a76271C68546k0321e8177j67151m3756N4197L5235e5640a5152A19547P724
$$ plain form
15566 127271 303794 -96765 173710 77695 255657 32839 137088 253993 100673 4226
15555 -207526 224848 364699 -95533 -122373 -282941 15789 -145181 108449 84573 167196
15545 167196 -93309 158932 -26481 110313 -288046 56690 -10695 224742 -177765 329283
15534 -146195 -29678 73974 -53230 208576 -4982 63515 -38763 193621 71467 26059 109583
15523 109583 -147305 -53966 125232 276153 -294365 87339 168811 28676 -12725 -91090 76388
15511 158425 77103 117051 -408171 -50853 96273 -444218 -321913 162582 126408 85085 -275173
15499 39252 -83009 238224 -8929 114980 76741 -90691 -57338 109271 -161988 174657 -41579
15487 252317 -167385 -51620 -149716 137299 208953 57849 -225849 -66175 -13579 95093 -31981
$$ packed form
15566A27271J76523i6765A73710G7695J77962C2839J04249J16905A00673D226
15555b07526B24848J39851i5533k6840j60568A5789a45181A08449k3876Q2623
15545A67196i3309A58932b6481A10313b88046E6690a0695B24742a77765C29283
15534a46195b9678G3974e3230B08576d982F3515c8763A93621G1467B6059Q3524
15523A09583a47305e3966A25232J50921b94365H7339Q1472B8676a2725p8365G6388
15511A58425G7103L9948d08171e0853I6273d44218J22305A62582l6174m1323b75173
15499C9252h3009B38224h929A14980l8239i0691L3353A09271a61988A74657d1579
15487B52317a67385e1620r8096A37299P1654E7849b25849f6175a3579I5093c1981
$$ plain form
15475 -192450 -12445 -7869 -182596 -61053 56656 97976 111055 34164 139076 -155799 16321
15463 -86522 -194420 243227 -133601 19695 -220082 -173777 8749 26839 66280 90344 -157958
15451 -385948 -372418 -678176 -326365 -18348 -167319 203789 153049 89536 -14883 -249008
15441 -249008 -454679 -163513 324483 216912 -100532 -916 45244 -81896 93122 268944 42875
15429 -139996 -89155 -231816 26752 -32002 72016 -86001 -214184 132102 -137651 186068
15418 147797 -113684 -117463 -112825 17141 -16459 91122 13008 291690 -91694 -123070 -101751
15407 -101751 -205610 -167772 359396 -113069 176643 -147103 107041 69996 115577 78572
15397 78572 -1167 184755 -80791 -86536 63953 336553 35251 26769 -267807 -103876 -42184
$$ packed form
15475a92450a2445M576j74727f1053E6656M1320J3079C4164J04912a55799A6321
15463h6522j07898B43227a33601A9695b20082M6305H749J8090L9441K4064a57958
15451c85948J3530l05758c26365a8348j48971B03789n0740o3513a4883k34125
15441b49008k05671a63513C24483j07571a00532i16D5244h1896I3122J75822D2875
15429a39996N0841j42661B6752c2002G2016h6001j28183A32102a37651A86068
15418A47797a13684l779M638A7141a6459I1122A3008K78682i1694l1376K1319
15407a01751j03859L7838C59396a13069A76643a47103A07041l7045M5581l7005
15397G8572a167A84755h0791n745F3953K72600C5251q482b67807a03876d2184
$$ plain form
15385 -34273 -41520 -146459 -54245 -50188 -99999 174510 158517 106986 5531 -118622 -54244 -45587
15373 -45587 -100063 -174432 201510 187265 227029 169784 -244985 159932 -301797 -55145 58029
15361 -148223 599636 274224 273695 -262592 11852 139631 -116791 -56271 -184255 -109863 558123
15349 -56895 70156 -97043 50138 -155716 -73597 44489 195296 131591 5878 194114 -176145
15337 34369 -104060 -8246 157927 66680 109469 -235442 17580 238693 -50864 179128 254768
15326 254768 100612 288656 121090 -39671 -77289 -177567 -270264 -161886 94966 53308
15316 53308 -326731 -16758 -107735 -233342 190516 242180 9866 241841 37257 -65778 -102169
15305 -102169 346529 -65981 17480 103851 268854 278719 -143167 94653 42643 -215486 331563
$$ packed form
15385c4273p247j04939e4245M057m9811A74510j5993n1531E531a18622e4244Q657
15373d5587n4476p4369B01510j4245L9764n7245b44985A59932c01797e5145E8029
15361a48223E99636B74224n29b62592A1852J27779a16791e6271j27984P4392E58123
15349e6895G0156i7043E0138a55716g3597D4489J50807o3705E878J88236a76145
15337C4369a04060h246A57927F6680M2789b35442A7580K21113e0864A79128P5640
15326B54768A00612J88044A21090c9671l7618j00278r2697J08378I4966m1658
15316E3308c26731a6758r0977j25607A90516N1664I866K31975C7257f5778l6391
15305a02169C46529f5981A7480Q6371J65003R865a43167I4653D2643b15486C31563
$$ plain form
15293 -137632 448240 334687 90290 60577 -93932 240867 50179 380494 72048 88207 -51254
15281 -14576 -23469 107385 246558 -13977 -260319 -3106 169756 178029 141197 28726 -67992
15269 -137322 73650 237575 -107963 4511 217995 -83928 201137 214556 226678 253586 147861
15258 147861 223180 -48862 7691 -22652 27912 254796 184906 478991 46990 -286896 170910
15246 -249587 17478 228856 -147826 244669 98213 83655 248184 184118 -69224 -14151 508331
15234 37289 806348 827292 1117165 1248897 638830 621813 397267 586405 18296 119787
15224 119787 344424 99764 244766 56256 -64675 363450 190042 220560 -140520 266914
15213 236445 83799 47892 -75235 -69366 -57089 125647 102358 -365403 94918 12648 -190824
$$ packed form
15293a37632D48240j13553I0290k9713i3932B40867E0179L30315G2048J6159e1254
15281a4576q893A07385J39173a3977k46342c106A69756Q273l6832B8726f7992
15269a37322G3650J63925a07963D511K13484h3928B01137J3419J2122K6908j05725
15258A47861P5319d8862G691b2652B7912K26884o9890K94085D6990b86896A70910
15246b49587A7478K11378a47826B44669I8213j4558J64529o4066f9224a4151E08331
15234C7289P69059K0944K89873J31732o10067j7017k24546J89138A8296J01491
15224A19787K24637I9764J45002E6256f4675C63450j73408L0518a40520B66914
15213B36445H3799l5907g5235N869J2277A25647k3289c65403I4918A2648a90824
$$ plain form
15201 274155 46055 25235 115690 100196 6421 104090 337485 57915 173264 -63358 250326
15189 -79976 52088 141469 15668 8236 122317 -259862 -217680 224779 -318913 -76837 157802
15177 60354 31423 -60858 85615 100330 246795 -105627 -9440 116397 54035 41227 21956
15166 21956 110596 80474 -75075 -238464 7562 236137 -123098 135835 390304 228866 71762
15154 62807 12007 297853 -5350 84283 162403 139827 -35177 60842 26820 294613 217345
15143 217345 -157364 344777 143076 -6395 304311 -111212 110884 99182 12171 -55459
15132 182258 185948 234653 106379 142843 -65604 -22110 167616 30059 215879 217909 157850
15121 157850 193556 69515 287962 -176992 3200 -79742 78677 223935 356965 371700 190108
$$ packed form
15201B74155D6055k0820R0455j5494F421R7669K33395E7915J15349f3358B50326
15189g9976E2088Q9381A5668p432J14081b59862M2182B24779c18913g6837A57802
15177F0354k8931f0858H5615J4715J46465a05627i440A16397E4035j2808j9271
15166B1956Q8640l0122g5075j63389G562K28575a23098A35835K54469j61438G1762
15154F2807A2007K85846e350H4283P8120k2576c5177F0842B6820K67793p7268
15143B17345a57364C44777A43076f395C04311a11212A10884j1702A2171e5459
15132A82258L690M8705A06379L6464f5604b2110A67616C0059J85820K030o0059
15121A57850L5706F9515K18447a76992C200g9742G8677J45258J33030J4735j81592
$$ plain form
15110 190108 340864 63783 -32545 -19913 141256 52240 -71064 428865 42355 354615 24086
15098 328700 381208 124537 5549 28786 -131901 368056 -141849 223162 48376 172066
15088 172066 -3439 119975 131092 487945 468041 174747 169376 230257 28225 275237 386476
15077 386476 331310 205048 41238 266780 173209 -55544 -68167 54979 210680 -7889 13326
15065 -110311 -128514 419237 142117 -2311 268665 155214 73149 24179 113599 167280 25444
15053 -27665 44573 143137 81256 -35683 329529 124839 40025 189924 179132 -275543 114161
15041 135064 195941 275159 191516 -42277 275632 117652 165684 -146031 5683 67235 223787
15030 223787 412286 178599 219873 106279 421063 74201 -85378 355450 215705 191158
$$ packed form
15110A90108J50756F3783c2545J2632A41256E2240g1064D28865D2355L12260B4086
15098C28700N2508A24537E549K3237a31901C68056a41849B23162D8376J23690
15088A72066c439A19975J1117L56853j9904A74747n371O0881B8225K47012J11239
15077C86476n5166j26262D1238K25542r3571e5544j2623E4979J55701g889A3326
15065a10311j8203D19237A42117b311B68665j13451G3149B4179Q9420N3681B5444
15053b7665D4573R8564o1881c5683C29529A24839D0025J49899j0792b75543A14161
15041A35064O0877P9218q3643d2277B75632A17652M8032a46031E683O1552J56552
15030B23787J88499A78599M1274A06279L14784G4201h5378C55450j39745k4547
$$ plain form
15020 191158 76715 306250 208602 259214 405363 306442 50169 108527 301023 161795 620592
15009 620592 87985 185112 477932 373078 57024 273576 329235 -86469 332299 306700 23544
14997 245038 56826 25585 472833 267167 262403 233612 -191340 79704 33739 230176 64439
14985 465835 -135782 196010 183115 213317 126703 294063 128842 395772 634959 46013
14974 361876 -194176 403730 313229 154099 41499 399514 90325 277576 197158 87259
14963 201999 165293 107246 -95918 307482 118504 73416 193075 273795 195749 421889 421474
14952 421474 179797 366272 88258 236092 230785 435780 434910 361978 66854 75886 149621
14941 149621 297530 44375 218920 497356 603678 172898 74978 189128 -28817 211209
$$ packed form
15020A91158G6715K29535r7648N0612J46149r8921E0169N8358J92496j39228M58797
15009F20592H7985R7127K92820j04854E7024K16552N5659h6469C32299k5599B3544
14997B45038E6826B5585M47248k05666m764k8791a91340G9704C3739J96437F4439
14985D65835a35782A96010j2895L0202q6614J67360A28842K66930K39187D6013
14974C61876a94176D03730r0501A54099D1499L58015I0325J87251q0418H7259
14963B01999l6706n8047i5918C07482A18504m5088J19659Q0720p8046K26140m15
14952D21474A79797J86475H8258J47834n307K04995q70p2932F6854R032P3735
14941A49621J47909D4375J74545K78436J06322A72898G4978J14150b8817B11209
$$ plain form
14930 247868 166391 214755 397428 376537 87361 -319 228616 384777 125116 82055 84338
14919 84338 340265 609094 410686 371271 529442 607727 -27114 251941 371076 294979
14909 294979 599840 364623 417580 102746 501748 247201 522720 423026 379462 520843
14899 520843 82251 295109 284073 270258 198774 234413 318601 528898 367327 183367 320932
14888 320932 715620 355004 309584 144781 -61805 410049 545338 656353 558861 321107
14878 321107 510454 404317 549653 360401 437717 203844 357789 201506 181532 218749
14868 218749 458960 280227 472296 510105 522113 678126 429369 584774 250922 235869
14858 235869 492209 693267 100182 398110 336104 392707 81900 436872 82631 228559
$$ packed form
14930B47868q1477M8364J82673k0891H7361c19B28616J56161A25116m3061K283
14919H4338K55927K68829j98408l9415J58171P8285b7114B51941J19135p6097
14909B94979L04861k35217N2957A02746L99002B47201K75519r9694m3564J41381
14899E20843H2251K12858j1036j3815p1484L5639Q4188K10297j61571A83367J37565
14888C20932L94688C55004m5420A44781f1805D10049J35289J11015r7492k37754
14878C21107J89347j06137J45336j89252P7316B03844J53945j56283j9974L7217
14868B18749K40211j78733J92069L7809J2008J56013k48757J55405B50922j5053
14858B35869K56340K01058A00182K97928o2006N6603H1900L54972H2631J45928
$$ plain form
14848 228559 350543 470682 605480 311288 570432 513707 144235 696961 381973 611312
14838 611312 677498 115037 221140 616448 28869 458294 369855 -5446 632139 93749 361534
14827 361534 437505 520001 340388 320607 395679 25157 326184 444896 518830 416317 208192
14816 208192 580518 681914 124619 374735 594199 275325 309495 199989 155152 86210
14806 86210 342332 188271 241796 240379 255894 282809 697717 443850 660003 378868 104972
14794 705771 670377 386655 589590 474494 476704 383263 126382 265902 655743 377158
14784 377158 470837 457292 382736 594280 234442 737389 33057 640501 263250 878441
14774 878441 140328 546990 646548 513192 599198 791415 493342 627708 199962 546391
$$ packed form
14848B28559J21984J20139J34798k94192K59144n6725A44235N52726l14988K29339
14838F11312O6186A15037J06103L95308B8869M29425q8439e446F32139I3749K67785
14827C61534P5971Q2496j79613j9781P5072B5157L01027J18712P3934j02513k08125
14816B08192L72326J01396A24619K50116K19464B75325L4170j09506m4837o8942
14806H6210K56122j54061N3525j417J5515K6915M14908k53867K16153k81135A04972
14794G05771l5394k83722K02935j15096K210r3441A26382J39520L89841k78585
14784C77158R3679j3545p4556K11544B34442N02947C3057O07444B63250O15191
14774H78441A40328M06662R9558j33356Q6006J92217k98073J34366A99962L46429
$$ plain form
14764 546391 572625 442218 589960 838506 732101 434305 877091 346627 528238 794525
14754 794525 406663 331316 636931 420601 486124 699553 259414 682397 562148 517595
14744 517595 658707 624241 605811 729590 542797 680390 557981 721944 623969 479044
14734 479044 750978 496508 351995 210961 629048 687641 407757 638489 604347 520811
14724 520811 565465 645817 597227 433455 643659 755157 841673 678137 796164 883459
14714 883459 865167 608548 470399 697383 869872 975008 693077 924148 767688 780477
14704 780477 873800 990731 682566 792306 679477 1219274 757700 543249 896943 686566
14694 686566 828808 752940 643962 653025 1228523 529510 1044215 765844 971147 798131
$$ packed form
14764E46391K6234j30407J47742K48546j06405k97796M42786C46627J81611K66287
14754G94525l87862p5347L05615k16330O5523K13429B59414M22983j20249m4553
14744E17595J41112l4466j8430J23779j86793J37593j22409J63963r7975j44925
14734D79044K71934k54470j44513j41034M18087N8593k79884K30732l4142q3536
14724E20811M4654Q0352m8590j63772K10204J11498Q6516j63536J18027Q7295
14714H83459j8292k56619j38149K26984J72489J05136k81931K31071j56460J2789
14704G80477R3323J16931l08165J09740j12829N39797m61574k14451L53694k10377
14694F86566J42242p5868j08978R063N75498E29510N14705k78371K05303j73016
$$ plain form
14684 798131 834389 529973 758617 862668 1032020 1021488 1134970 738120 802386 1038710
14674 1038710 870352 977549 979369 1026507 1053230 1060306 581255 986879 723162 968869
14664 968869 704177 697907 873102 944981 1173284 749859 846563 976669 1049100 846085
14654 846085 949288 991566 884340 1098468 741901 920084 866405 1048676 1017620 1122487
14644 1122487 1065747 844855 1231065 1174821 1216558 1200845 1036909 1078126 885716 1257051
14634 1257051 962127 892027 1379837 935876 1169150 1046202 1138295 910742 1113539 1044233
14624 1044233 1164062 1268566 908710 1259305 1255352 704127 1467909 1358019 1118447 1590938
14614 1590938 1149927 1402713 1337537 1305941 1538983 1317861 1323522 1134476 1226150 1212340
$$ packed form
14684G98131L6258l04416K28644J04051J69352j0532J13482l96850O4266K36324
14674A038710j68358J07197J820M7138K6723P076m79051M05624k63717K45707
14664I68869k64692o270J75195P1879K28303m23425R6704J30106P2431k03015
14654H46085J03203M2278j07226K14128l56567J78183n3679J82271l1056J04867
14644A122487n6740k20892L86210n6244M1737j5713j63936M1217j92410L71335
14634A257051k94924p0100M87810m43961K33274j22948R2093k27553K02797o9306
14624A044233J19829J04504l59856L50595l953n51225P63782j09890k39572M72491
14614A590938m41011K52786o5176l1596K33042k21122N661j89046R1674j3810
$$ plain form
14604 1212340 1508764 1335404 1170841 1301167 1556816 1092702 1276499 1082296 1211275
14595 1211275 1233212 1405216 1468996 1481256 1554951 1691250 1284527 1374389 1627570 1404573
14585 1404573 1643578 1455312 1147033 1475028 1635518 1797871 1402745 1580601 1737260
14576 1737260 1577801 1812724 1552902 1928094 1619851 1763611 1818902 1694305 2134294 1871285
14566 1871285 1983896 1959751 2064751 1915972 2105986 2153031 2058852 2142910 1847107 2111878
14556 2111878 1971713 2330319 1942973 2427391 2300732 2294573 2521335 2197255 2486827 2549727
14546 2549727 2239483 3077335 2903129 3090723 2956905 3409342 3542022 3928953 4491402
14537 4491402 4682892 5556501 7160889 8998876 13566846 19543927 29197315 27427274
$$ packed form
14604A212340K96424j73360j64563J30326K55649m64114J83797j94203J28979
14595A211275K1937J72004O3780J2260P3695J36299m06723Q9862K53181k22997
14585A404573K39005j88266l08279L27995J60490J62353l95126J77856J56659
14576A737260j59459K34923k59822L75192l08243J43760N5291j24597M39989k63009
14566A871285J12611k4145J05000j48779J90014M7045r4179Q4058k95803K64771
14556B111878j40165L58606l87346M84418j26659o159K26762l24080K89572O2900
14546B549727l10244Q37852j74206J87594j33818M52437J32680L86931N62449
14537D491402J91490Q73609J604388J837987M567970N977081R653388j770041
$$ plain form
14529 27427274 19325768 13254188 8983132 6149031 4294050 3311351 2785168 2054968
14521 2054968 2484530 2344999 2286235 2418428 2159105 2308003 2424346 2183151 2192553 2357987
14511 2357987 2169541 2158281 2351742 2307469 2540950 2589566 2522295 1863439 2282738 2399685
14501 2399685 2214537 2579279 2399462 2505923 2703304 2707436 2430975 2876882 2645738 3028709
14491 3028709 2473946 2610334 2682822 2985403 2729738 3294517 2918611 2991242 2976094 3253192
14481 3253192 2846831 3294699 3041351 3129233 3161215 3123041 3198178 3140440 3197440 3329178
14471 3329178 3055970 3072633 3250936 3620353 3479377 3343934 3771943 3713300 3727608 4080166
14461 4080166 3900725 3811806 4149310 3980732 3720451 4032996 4017057 4125117 3963583 4009922
$$ packed form
14529B7427274q101506o071580m271056k834101j854981r82699n26183p30200
14521B054968M29562j39531n8764J32193k59323J48898J16343k41195R402J65434
14511B357987j88446j1260J93461m4273K33481M8616o7271o58856M19299J16947
14501B399685j85148L64742j79817J06461J97381M132k76461M45907k31144L82971
14491C028709n54763J36388P2488L02581k55665N64779l75906P2631j5148K77098
14481C253192m06361M47868k53348Q7882L1982l8174P5137n7738N7000J31738
14471C329178k73208J6663J78303L69417j40976j35443M28009n8643J4308L52558
14461D080166j79441q8919L37504j68578k60281L12545j5939J08060j61534M6339
$$ plain form
14451 4009922 4195417 4328018 4187755 4414404 4222486 4240438 4414328 4732220 4753163 5025795
14441 5025795 4800857 4863229 4628528 4960356 5122565 5173615 4919594 4721705 5144849 5179653
14431 5179653 5611579 5172308 5502628 5317182 5612023 5627171 5543362 5999209 5612255 5942436
14421 5942436 5922905 5633790 6228205 6211968 6175534 6534644 6711268 6612179 6623475 6627339 6777485
14410 6777485 6935125 7305953 6962458 7072617 7249054 7531585 7645789 7849416 7809944 8101567
14400 8101567 7924103 8112115 8342492 8567275 8073839 8425662 8678156 8923397 9135372
14391 9135372 9020923 9370525 9465234 9659105 9746265 9930585 10068332 10070365 10078781 10767111
14381 10767111 10362663 10631676 10765330 11090143 11430836 11424322 11440170 11750705 11929679 12242396
$$ packed form
14451D009922J85495J32601j40263K26649j91918J7952J73890L17892K0943K72632
14441E025795k24938O2372k34701L31828J62209N1050k54021j97889M23144L4804
14431E179653M31926m39271L30320j85446K94841J5148q3809M55847l86954L30181
14421E942436j9531k89115N94415j6237l6434L59110J76624r9089J1296L864J50146
14410F777485J57640L70828l43495J10159J76437K82531J14204K03627l9472K91623
14400H101567j77464J88012K30377K24783m93436L51823K52494K45241K11975
14391I135372j14449L49602R4709J93871Q7160J84320J37747K033Q416O88330
14381A0767111m04448K69013J33654L24813L40693o514J5848L10535J78974L12717
$$ plain form
14371 12242396 12342153 12738921 13053966 13182129 13407880 13706275 14122857 14250087 14129207
14362 14129207 14729683 14863198 15293538 15421396 15873582 16011994 15845151 16830279 16529616
14353 16529616 17050103 17433852 18181744 18411208 18585506 18914289 19271164 19920999 20444245
14344 20444245 20832629 21095223 21402345 22178431 22462548 23412653 23725419 24340180 24508287
14335 24508287 25490347 25928685 26734852 27010118 28126059 28799411 29547459 30205282 31167165
14326 31167165 31837148 32737290 33394650 34630803 35443979 36536079 37655514 39252305 40414602
14317 40414602 41305117 42357977 43723644 45395092 46553431 48088666 49961489 51416524
14309 51416524 53366327 54740248 57119376 59109851 60793917 63392166 65824350 68057232
$$ packed form
14371A2242396R9757L96768L15045J28163K25751K98395M16582J27230j20880
14362A4129207O00476J33515M30340J27858M52186J38412j66843R85128l00663
14353A6529616N20487L83749P47892K29464J74298L28783L56875O49835N23246
14344B0444245L88384K62594L07122P76086K84117R50105L12766O14761J68107
14335B4508287R82060M38338Q06167K75266J115941O73352P48048O57823R61883
14326C1167165O69983R00142O57360J236153Q13176J092100J119435J596791J162297
14317D0414602Q90515J052860J365667J671448J158339J535235J872823J455035
14309E1416524J949803J373921K379128J990475J684066K598249K432184K232882
$$ plain form
14301 68057232 70681026 73793632 76581804 79416898 82832983 86114092 89822225 93641793
14293 93641793 98026712 102303283 107135425 111793061 117038924 122985294 128618720 134733472
14285 134733472 141624465 148717071 156431874 164334464 172901758 181765458 191246328 201867066
14277 201867066 212205053 223440243 235631362 248105839 260710074 274530329 287936795
14270 287936795 302460387 316452211 331119518 345156481 359571759 373728885 386766568
14263 386766568 399630178 411693818 422269071 432330900 441400374 447887702 450815849
14256 450815849 453177875 453449598 448445384 443563712 440336590 437345269 432504347 423707665
14248 423707665 411936396 399046830 385344165 371137195 356798281 342406461 327719061
$$ packed form
14301F8057232K623794L112606K788172K835094L416085L281109L708133L819568
14293I3641793M384919M276571M832142M657636N245863N946370N633426O114752
14285A34733472O890993P092606P714803P902590Q567294Q863700R480870J0620738
14277B01867066J0337987J1235190J2191119J2474477J2604235J3820255J3406466
14270B87936795J4523592J3991824J4667307J4036963J4415278J4157126J3037683
14263C86766568J2863610J2063640J0575253J0061829R069474O487328K928147
14256D50815849K362026K71723n004214m881672l227122k991321m840922q796682
14248D23707665j1771269j2889566j3702665j4206970j4338914j4391820j4687400
$$ plain form
14241 327719061 313243681 299411990 285828535 272795454 259921716 247858897 235906667
14234 235906667 223312226 211291235 200100994 189720180 180373219 170926841 162231870
14227 162231870 154176186 146470640 139228256 132867797 126669328 120973802 115402304 110153289
14219 110153289 105191441 100299532 96485859 92529708 88932386 84850225 82048260 78342609
14211 78342609 75131143 72490485 69708084 66995734 64862862 62270836 60120984 58235302
14203 58235302 55871776 53974109 52235166 50729751 49066481 47729588 46372373 44702773
14195 44702773 43554565 42240595 40909949 39865046 39018509 37487576 36484203 35225576
14187 35225576 34452056 33303416 32855837 31948613 31259583 30064002 29526893 28686574 27879817
$$ packed form
14241C27719061j4475380j3831691j3583455j3033081j2873738j2062819j1952230
14234B35906667j2594441j2020991j1190241j0380814r346961r446378q694971
14227A62231870q055684p705546p242384o360459o198469n695526n571498n249015
14219A10153289m961848m891909l813673l956151l597322m082161k801965l705651
14211G8342609l211466k640658k782401k712350k132872k592026k149852j885682
14203E8235302k363526j897667j738943j505415j663270j336893j357215j669600
14195D4702773j148208j313970j330646j044903q46537j530933j003373j258627
14187C5225576p73520j148640m47579r07224o89030j195581n37109q40319q06757
$$ plain form
14178 27879817 27439345 26711312 26238447 25366660 24726943 24227944 23587997 23040015 22210497
14169 22210497 22034105 21472087 20958163 20441260 20044634 19459119 19010306 18687438 18367954
14160 18367954 18087762 17993643 17737061 16922157 16351050 16166517 15865114 15713976 14863908
14151 14863908 14888201 14609323 14417594 14124282 13932204 13634333 13584375 13348447 13129980 12941876
14141 12941876 12260178 12199495 11831922 12077404 11305339 11268259 10995563 10695916 10967450 10624208
14131 10624208 10451251 10351132 10161407 9772618 10185249 9632181 9641131 9187122 9361697 9029295
14121 9029295 8725344 8888532 8866398 8551630 8937147 8234710 8013058 8439776 7840275 7921276
14111 7921276 7781227 7705748 7520109 7698620 7519962 7481782 7438655 6945786 7206245 6830183
$$ packed form
14178B7879817m40472p28033m72865q71787o39717m98999o39947n47982q29518
14169B2210497j76392n62018n13924n16903l96626n85515m48813l22868l19484
14160A8367954k80192r4119k56582q14904n71107j84533l01403j51138q50068
14151A4863908K4293k78878j91729k93312j92078k97871m9958k35928k18467j88104
14141A2941876o81698o0683l67573K45482p72065l7080k72696k99647K71534l43242
14131A0624208j72957j00119j89725l88789M12631n53068Q950m54009J74575l32402
14121I029295l03951J63188k2134l14768L85517p02437k21652M26718n99501Q1001
14111G921276j40049p5479j85639J78511j78658l8180m3127m92869K60459l76062
$$ plain form
14101 6830183 6623939 6570769 6875636 6449166 6515869 6542365 6428028 6358072 6051810 6060466
14091 6060466 5970580 6124577 6011297 5911954 5842084 5801095 5714870 5564387 5251668 5338581
14081 5338581 5393283 5174680 5081989 5141060 5061153 5132974 5009003 4901988 4825386 4726267 4817338
14070 4817338 4702683 4507479 4823461 4213255 4557875 4620710 4355387 4437045 4207120 4092461
14060 4092461 4077065 4257238 4394565 4101851 3905561 4092881 4278893 3942184 3760441 3867976
14050 3867976 3804621 3561506 3561890 4228910 3794695 3799229 3831248 3880776 3628887 3627738 3313390
14039 3313390 3686681 3226930 3262117 3358040 3481576 3088774 3514277 3389501 3275147 2833917
14029 2833917 3064252 3309740 3225108 3039635 3331546 2826786 2796912 2698061 2442201 2849392
$$ packed form
14101F830183k06244n3170L04867m26470O6703K6496j14337o9956l06262Q656
14091F060466q9886J53997j13280r9343o9870m0989q6225j50483l12719Q6913
14081E338581N4702k18603r2691N9071p9907P1821j23971j07015p6602r9119R1071
14070D817338j14655j95204L15982o10206L44620O2835k65323Q1658k29925j14659
14060D092461j5396J80173J37327k92714j96290J87320J86012l36709j81743J07535
14050C867976o3355k43115L84O67020m34215M534L2019M9528k51889j149l14348
14039C313390L73291m59751L5187R5923J23536l92802M25503j24776j14354m41230
14029B833917K30335K45488q4632j85473K91911n04760k9874r8851k55860M07191
$$ plain form
14019 2849392 2940129 2810834 3003781 2569340 2722083 2582700 2979981 3058511 2818729 2580413
14009 2580413 2435466 2722622 2536517 2358964 2177937 2762036 2213811 2315681 2373184 2522391
13999 2522391 2158398 2264869 2342505 2080066 2355697 2087685 1919980 1926816 2291294 2281034
13989 2281034 1849866 1865525 1756028 2249193 1820275 2013289 2530250 2280401 2187800 2113223
13979 2113223 2360214 2494158 2920394 3337465 4276458 5857756 9380570 15085520 26095916
13970 26095916 27581562 20204356 14755751 10795744 7754848 5856112 4876916 4294063
13962 4294063 3724088 3731559 3046600 3220188 3022161 2517241 2491940 2388304 2208811 2128918
13952 2128918 2211354 2313913 2063492 2241687 1697654 2004249 1834203 1976504 1647443 1969423
$$ packed form
14019B849392R0737j29295J92947m34441J52743j39383L97281P8530k39782k38316
14009B580413j44947K87156j86105j77553j81027N84099n48225J01870N7503J49207
13999B522391l63993J06471P7636k62439K75631k68012j67705O836L64478j0260
13989B281034m31168J5659j09497M93165m28918J93014N16961k49849r2601p4577
13979B113223K46991J33944M26236M17071R38993J581298L522814N704950J1010396
13970B6095916J485646p377206n448605l960007l040896j898736r79196n82853
13962D294063n69975P471o84959J73588j98027n04920k5301j03636j79493p9893
13952B128918Q2436J02559k50421J78195n44033L06595j70046J42301l29061L21980
$$ plain form
13942 1969423 1787121 1775275 2057695 1863854 1838064 1663855 2035898 1706183 1588599 1539614
13932 1539614 1914930 1637590 1894639 1874122 1498233 1713329 1748423 1567214 1589671 1589433
13922 1589433 1686411 1752913 1698755 1754244 1444783 1551874 1727979 1699961 1358819 1586917
13912 1586917 1233009 1702511 1601330 1329390 1350878 1632873 1322817 1385522 1413672 1356858
13902 1356858 1951401 1204828 1457570 1024605 1268829 1061178 1512069 1041827 1359246
13893 1359246 1421043 911601 1351317 1193399 1064837 1263315 1379828 1505898 1164392 1122063
13883 1122063 1123351 1178613 1189949 921079 1408884 1268483 1276981 878696 1232377 1282444 865895
13872 865895 1250164 1212827 1156516 895033 909223 1089664 1002955 1266302 1136558 1128246 1424522
$$ packed form
13942A969423j82302j1846K82420j93841k5790j74209L72043l29715j17584m8985
13932A539614L75316k77340K57049k0517l75889K15096L5094j81209K2457k38
13922A589433R6978O6502n4158N5489l09461J07091J76105k8018l41142K28098
13912A586917l53908M69502j01181k71940K1488K81995l10056O2705K8150n6814
13902A356858N94543p46573K52742m32965K44224k07651M50891m70242L17419
13893A359246O1797n09442M39716j57918j28562J98478J16513J26070l41506m2329
13883A122063J288N5262J1336k68870M87805j40401Q498l98285L53681N0067m16549
13872H65895L84269l7337n6311k61483J4190J80441q6709K63347j29744q312K96276
$$ plain form
13861 1424522 1280158 1207671 1205110 1216214 981532 811893 669022 1071760 912258 996104
13851 996104 909901 762755 772754 913175 979783 849322 828098 901029 878829 936368 1094767
13840 1094767 1111660 713216 1055985 717745 770505 826368 848111 899612 992385 910486 712168
13829 712168 1087995 1064193 819261 696127 819641 746452 718455 961079 609355 1011549
13819 1011549 791904 1073021 865906 1154153 759406 517891 826166 825267 904735 741879
13809 741879 689839 992154 932911 663637 622034 720053 593238 812786 549583 924389
13799 924389 554147 520135 729260 429840 565002 1094477 894754 671449 659466 639308
13789 639308 685240 717045 542054 674443 1015218 819984 763039 630641 702442 724469
$$ packed form
13861A424522j44364p2487k561J1104k34682j69639j42871M02738j59502Q3846
13851I96104q6203j47146R999J40421O6608j30461k1224P2931k2200N7539J58399
13840A094767J6893l98444L42769l38240N2760N5863K1743N1501R2773q1899j98318
13829G12168L75827k3802k44932j23134J23514p3189k7997K42624l51724M02194
13819A011549k19645K81117k07115K88247l94747k41515L08275q99P9468j62856
13809G41879n2040L02315n9243k69274m1603R8019j26815K19548k63203L74806
13799I24389l70242l4012K09125k99420J35162N29475j99723k23305j1983k0158
13789F39308M5932L1805j74991J32389L40775j95234n6945j32398P1801K2027
$$ plain form
13779 724469 1013294 404440 543570 747005 299533 679066 354242 701364 412757 538581
13769 538581 609038 413345 530605 796056 374479 552092 419951 625216 484871 627644
13759 627644 925493 694764 266319 633558 557758 859625 501633 720825 465924 407293
13749 407293 547194 574863 577615 507569 773073 185550 567595 692520 358236 735846
13739 735846 554958 546073 327208 400558 588555 559844 656482 628680 601420 717878 490499
13728 490499 682600 514744 423572 667176 478481 786608 525727 559417 285932 469694
13718 469694 883290 481900 500279 688090 345563 404041 516055 906821 149949 697841
13708 697841 495365 358114 262871 415786 597999 385087 183194 441898 254841 668297
$$ packed form
13779G24469K88825D04440J39130K03435B99533L79533l24824L47122k88607J25824
13769E38581P0457j95693J17260K65451C74479J77613j32141K05265j40345J42773
13759F27644K97849k30729B66319L67239p5800L01867l57992K19192k54901n8631
13749D07293J39901K7669K752p0046K65504A85550L82045J24925l34284L77610
13739G35846j80888q885k18865P3350J87997k8711R6638k7802k7260J16458k27379
13728D90499J92101j67856r1172K43604j88695L08127k60881L3690k73485J83762
13718D69694M13596m01390J8379J87811l42527N8478J12014L90766A49949N47892
13708F97841k02476j37251r5243J52915J82213k12912A83194K58704j87057M13456
$$ plain form
13698 668297 463871 653966 752899 593310 586571 573072 456380 226361 476075 202333
13687 506392 798552 475382 311159 323314 515802 441444 569286 321682 607146 512638
13677 512638 570879 435219 433959 753999 601873 735470 739841 490714 643943 581506 740779
13666 740779 263151 628544 586290 578933 408425 630276 612946 225532 437674 243467
13656 243467 247658 363068 208197 444862 291322 129665 358574 141660 582286 209449
13645 266823 148800 285244 83035 677842 307344 123823 93737 672976 532827 436587
13635 436587 293483 387277 463326 412930 494502 209953 401952 354382 223337 181118 249797
13624 249797 220398 271874 526197 664174 169259 496591 388387 259628 456769 73866
$$ packed form
13698F68297k04426J90095R8933j59589o739j3499j16692B26361K49714B02333
13687E06392K92160l23170j64223J2155J92488p4358J27842k47604K85464r4508
13677E12638N8241j35660j260L20040j52126J33597M371k49127J53229o2437J59273
13666G40779B63151L65393m2254p357j70508K21851j7330B25532K12142j94207
13656B43467M191J15410j54871K36665j53540A29665K28909A41660M40626B09449
13645B66823j18023J36444H3035N94807C07344A23823l0086N79239j40149r6240
13635D36587j43104R3794P6049n0396Q1572B09953J91999m7570j31045m2219O8679
13624B49797k9399N1476K54323J37977A69259L27332j08204j28759J97141G3866
$$ plain form
13613 333326 507243 174192 286921 496140 282100 203534 616588 403974 366070 323036
13603 323036 447329 175907 366401 178649 218669 -167869 275122 529895 37230 648934
13593 648934 346910 -124316 607890 308121 240856 365643 413198 585844 197637 -40822
13582 375846 328542 480856 151876 363646 246196 767750 262833 238496 356916 197288
13572 197288 356536 -125338 484512 295615 145011 279969 114767 378245 64356 646863
13562 646863 460295 279360 326320 223032 287341 224704 455803 95501 138801 359387
13552 359387 292058 49513 486672 -31454 540115 232257 500870 330751 226151 299011
13542 299011 375523 143814 450245 203241 485789 221782 139280 284596 197194 239295
$$ packed form
13613C33326J73917A74192J12729K09219k14040p8566M13054k12614l7904m3034
13603C23036J24293A75907J90494A78649M0020a67869B75122K54773C7230O11704
13593F48934l02024a24316F07890k99769o7265J24787M7555J72646A97637d0822
13582C75846m7304J52314A51876K11770j17450N21554B62833k4337J18420j59628
13572A97288J59248a25338D84512j88897A45011J34958A14767K63478F4356N82507
13562F46863j86568j80935M6960j03288O4309o2637K31099I5501M3300K20586
13552C59387o7329D9513M37159c1454E40115B32257K68613j70119j04600P2860
13542B99011P6512A43814L06431B03241K82548B21782q2502J45316q7402M2101
$$ plain form
13532 239295 105639 175097 238555 106757 206775 341945 -10677 183152 295924 147707
13521 239151 -18729 198144 9167 425876 216598 -37527 232670 348097 125840 357266
13511 357266 -179739 132117 217994 68198 280091 44324 52635 104603 213154 691343 454574
13500 454574 -22774 -90568 11555 342649 292052 155960 386448 292517 -80401 269720 -38746
13488 399205 89130 259854 87309 203045 179646 -17785 206141 -72996 29655 324429 -14345
13476 -179354 121191 135075 265657 421540 344057 206372 341126 286328 142979 -4423
13465 22728 170033 265104 238374 418894 146487 483024 206034 127154 126872 46982 489886
13454 489886 270789 93188 57812 153199 74741 -120896 435580 318664 96734 22666 159207
$$ packed form
13532B39295A05639O9458O3458A06757J00018J35170a0677A83152J12772A47707
13521B39151a8729A98144I167M16709k09278c7527B32670J15427A25840K31426
13511C57266a79739A32117Q5877F8198K11893D4324Q311N1968J08551M78189k36769
13500D54574b2774o7794A1555L31094n0597j36092K30488r3931h0401B69720c8746
13488C99205H9130J70724H7309J15736k3399a7785B06141g2996B9655K94774a4345
13476a79354A21191J3884J30582J55883p7483j37685J34754n4798A42979d423
13465B2728J47305R5071k6730J80520A46487L36537B06034p8880k82D6982M42904
13454D89886k19097I3188l5376R5387G4741a20896D35580j16916I6734B2666J36541
$$ plain form
13443 159207 -11678 256457 282927 -12497 50777 372452 60939 88665 689713 459867 366360
13432 366360 278494 -39363 134471 509404 337564 145710 410146 260830 189463 408183
13422 408183 395908 171384 -144377 325649 216064 127051 261276 256309 -130710 452845
13411 37884 99700 587557 65035 -56660 4251 282667 233188 269404 63837 151027 448414
13400 448414 156501 621774 -95335 -87811 344512 -79090 178123 261399 374891 -148024
13389 285058 37727 126005 -59879 633852 146137 156202 114503 62967 154366 314154 -50775
13377 -59260 150904 132678 481063 153010 222321 124030 180388 78738 176745 71284 318388
13366 318388 241692 198644 -240526 144891 185635 20963 -97136 156001 313973 70386 153060
$$ packed form
13443A59207a1678B56457K6470a2497E0777L21675F0939K7726O01048k29846r3507
13432C66360q7866c9363A34471L74933j71840A45710K64436j49316p1367K18720
13422D08183j2275A71384a44377C25649j09585q9013J34225m967a30710D52845
13411C7884O1816M87857F5035e6660D251K78416m9479L6216F3837Q7190K97387
13400D48414A56501M65273i5335P524C44512g9090A78123Q3276J13492a48024
13389B85058C7727Q8278e9879F33852A46137J0065m1699n1536R1399J59788e0775
13377e9260A50904j8226L48385A53010O9311r8291N6358G8738R8007G1284K47104
13366C18388p6696m3048b40526A44891M0744B0963i7136A56001J57972G0386Q2674
$$ plain form
13355 153060 -222231 638738 82168 -209866 210685 422710 217439 120904 12148 196569
13345 196569 -18332 187596 318881 -190989 168989 203406 394290 -70442 -9924 293824
13334 333941 434256 138202 418987 367389 262956 275451 243681 214189 163567 233854 269641
13323 269641 -185584 420311 209234 202333 346545 324542 122921 14441 37853 52748 106763
13312 106763 -89041 265607 -24490 198275 346670 37685 156984 242863 -7132 -158133 189300
13300 46896 -102346 411589 190991 261278 428165 253273 251365 306700 -57814 249771 48185
13288 55301 55842 111305 97505 93371 355657 86616 -129819 177447 30280 259762 -103007
13276 182623 387376 -183928 -121301 395864 377706 258726 110096 -161533 126764 237418
$$ packed form
13355A53060b22231F38738H2168b09866B10685K12025k05271r6535A2148J84421
13345A96569a8332A87596J31285a90989A68989L4417J90884g0442i924B93824
13334C33941J00315A38202K80785n1598j04433J2495l1770k9492n0622P0287L5787
13323B69641a85584D20311B09234o901J44212k2003A22921A4441K3412J4895N4015
13312A06763h9041B65607b4490A98275J48395C7685J19299Q5879g132j51001A89300
13300D6896a02346D11589A90991P0287J66887j74892j908N5335e7814B49771D8185
13288E5301N41N5463j3800m134K62286H6616a29819A77447C0280K29482a03007
13276A82623K04753a83928O2627C95864j8158j18980A10096a61533A26764J10654
$$ plain form
13266 237418 347679 -62275 87188 101867 54977 237068 49150 -152703 -26656 -146650 -83236
13255 -83236 -38721 82262 96344 -291535 192565 -154413 5682 78483 330905 17663 273754
13244 273754 220809 -2912 32810 31083 34110 238357 106986 -17940 2703 133744 357734
13233 357734 124168 294352 188306 -78148 -56062 -179761 43976 89733 313962 253493
13223 253493 86664 94449 97384 354123 -4458 69191 119630 61586 -9879 -145952 150319 104727
13211 104727 -82939 18307 -10776 108621 -206518 24073 328708 -107974 122144 -349369
13200 -20663 114428 -7297 7376 134299 118205 113311 267732 -251251 -222749 402089 146977
13188 73776 22655 199876 -221416 300870 183716 -102200 179337 469285 -113536 -102824
$$ packed form
13266B37418J10261f2275H7188J4679m6890J82091D9150a52703b6656j19994O3414
13255h3236c8721H2262J4082b91535A92565a54413E682P2801K52422A7663K56091
13244B73754n2945b912C2810j727L027K04247A06986a7940B703J31041K23990
13233C57734A24168J70184j06046g8148K2086j23699D3976M5757K24229o0469
13223B53493H6664P785K935K56739d458F9191N0439n8044i879j36073A50319m5592
13211A04727h2939A8307a0776A08621b06518B4073L04635a07974A22144c49369
13200b0663A14428g297G376J26923j6094m894J54421b51251K8502D02089A46977
13188G3776B2655J77221b21416C00870j17154a02200A79337K89948a13536J0712
$$ plain form
13178 -102824 42926 51706 190598 171058 241812 124697 -46383 364176 -41006 10810 259470
13167 259470 60496 212662 32444 -9654 -266491 159683 -138166 192005 53926 272649
13157 272649 26615 4042 172067 22973 143778 309572 84497 340019 205209 71356 307830
13146 307830 277887 -221906 457519 286688 53213 -77997 101781 -1025 139841 2550 16295
13135 16295 9082 -143671 -228471 11590 -198327 184761 -32423 91124 -202861 294556 -46950
13123 3948 -157394 -162579 734 74145 182414 59719 369716 -174305 311593 79270 162857
13112 162857 180946 154426 63761 56530 169339 271261 -309305 149924 -125424 -29126 180013
13100 346272 -240213 -70641 49793 52488 249560 -38825 -141863 -269504 -315571 92883 55116
$$ packed form
13178a02824D2926Q780J38892j9540P0754j17115d6383C64176d1006A0810K48660
13167B59470F0496J52166C2444i654k56837A59683a38166A92005E3926K18723
13157B72649B6615D042J68025B2973J20805J65794H4497K55522j34810G1356K36474
13146C07830k9943b21906D57519j70831E3213g7997A01781a025A39841B550J3745
13135A6295p213a43671q4800A1590a98327A84761c2423I1124b02861B94556d6950
13123C948a57394n185G34P3411J08269E9719L09997a74305C11593G9270Q3587
13112A62857J8089k6520F3761p231J12809J01922c09305A49924a25424b9126A80013
13100C46272b40213g0641D9793K695J97072c8825j03038j27641m6067I2883l7767
$$ plain form
13089 55116 -291345 229429 -182415 228613 -91947 43401 152985 132866 38332 255701
13079 255701 84851 -181862 -48616 -73926 -46935 35611 20867 -372605 -54448 11026 330810
13068 330810 60207 36686 -8741 135441 40444 40019 230806 -116801 -55294 128450 -27714
13056 -51720 -103202 -10828 -201627 52607 -44026 194225 174969 40741 186490 163928 28226
13044 -97627 211364 92054 -70240 -76895 70560 -161204 -134348 26475 173752 155694 -163673
13032 -9707 176260 -39762 -1395 14913 -127083 76333 73918 22759 -356946 -3690 127574 63235
13019 174935 275144 -74868 94872 -106561 79948 288647 251997 200003 193267 290623 64999
13007 157409 300990 312097 128897 66827 294713 -115544 23454 162313 129973 258341
$$ packed form
13089E5116b91345B29429a82415B28613i1947D3401J09584k0119C8332K17369
13079B55701H4851a81862d8616k5310K6991C5611j4744c72605e4448A1026L19784
13068C30810F0207k3521h741A35441D0444m25J90787a16801e5294A28450b7714
13056e1720n1482a0828j90799E2607d4026A94225j9256D0741J45749k2562B8226
13044i7627B11364I2054g0240o655G0560a61204K6856B6475J47277j8058a63673
13032i707A76260c9762a395A4913a27083G6333k415B2759c56946c690A27574F3235
13019A74935J00209g4868I4872a06561G9948K08699l6650n1994o736R7356F4999
13007A57409J43581J1107A28897o2070K27886a15544B3454J38859l2340J28368
$$ plain form
12997 258341 258394 -142490 171992 61818 88929 -68224 -95412 -116525 219054 324428 -43676
12985 518 19960 -123346 12560 49289 -278503 -174835 517557 110398 194943 9662 -174785
12973 -42843 441010 131326 -20873 82142 114685 91124 174977 -12935 60396 170178 118165
12962 118165 147203 214846 -111725 -16241 124777 322928 80539 23004 429380 -64643 -142311
12951 -142311 76011 45324 68391 230945 -24084 256533 6172 115814 154964 -43004 -43139
12940 -43139 -9829 30453 -99341 -130489 13681 -232961 -286053 34168 414504 -247769 -69100
12928 129615 -292540 59724 1582 -160573 -241514 108431 -343918 -8850 -85921 -31249 18133
12916 149292 210045 140736 -194840 -250396 139525 100449 -144387 -287319 -109499 -266256
$$ packed form
12997B58341N3a42490A71992F1818K7111f8224k7188k1113B19054J05374d3676
12985E18J9442a23346A2560L6729b78503J03668E17557A10398Q4545I662a74785
12973d2843D41010A31326b0873H2142L2543k3561Q3853a2935F0396J09782n2013
12962A18165K9038O7643a11725a6241A24777J98151H0539B3004M06376f4643p7668
12951a42311G6011l0687K3067J62554b4084B56533F172J09642L9150d3004j35
12940d3139i829C0453i9341l1148A3681b32961n3092C4168L80336b47769f9100
12928A29615b92540E9724A582a60573q0941A08431c43918h850p7071c1249A8133
12916A49292O0753o9309a94840n5556A39525l9076a44387j42932a09499j56757
$$ plain form
12906 -266256 -147960 213207 -226953 17332 -100771 -262341 122632 13018 60172 58867
12896 58867 -29470 279121 59433 229007 140314 238276 -75691 -218442 73639 -75344 97081
12884 134095 183199 49419 76565 -160040 242537 -207283 302082 216711 216349 118599 -354792
12872 100283 84763 369429 -89298 233824 56034 -169623 54725 -93721 -122438 16675 -893
12860 294898 -91353 149168 18393 75539 27998 80531 -42889 142776 420 63603 115974
12849 115974 291633 -16827 -236021 -94709 -113217 129922 -105355 -63834 -85396 -154937 -145281
12838 -145281 120856 -77372 -124463 52521 101768 -13066 199290 36132 3055 234637 -34259
12826 155928 183976 -63542 -194981 -75884 20117 -356153 64127 116917 -42733 -191824 -298309
$$ packed form
12906b66256J18296B13207b26953A7332a00771j61570A22632A3018M7154j305
12896E8867b9470B79121E9433J69574q8693R7962g5691j42751G3639g5344I7081
12884A34095M9104D9419K7146a60040B42537b07283C02082q5371l62r7750c54792
12872A00283j5520K84666h9298B33824E6034a69623E4725i3721k8717A6675h93
12860B94898i1353A49168A8393N7146B7998N2533d2889A42776D20O3183N2371
12849A15974J75659a6827k19194i4709j8508A29922a05355M1521k1562o9541R656
12838a45281A20856g7372m7091E2521M9247a3066A99290C6132C055K31582c4259
12826A55928K8048f3542j31439g5884B0117c56153F4127N2790d2733j49091j06485
$$ plain form
12815 -298309 143669 72669 79878 -159179 314404 -243107 179738 228923 -185604 97731
12804 -112302 -13379 -244938 157052 -180097 -226842 554953 193564 -60693 -155560 -120160
12794 -120160 -146362 -226609 117238 -30396 -47746 127143 -33403 109180 -84206 28572 -11287
12782 -104838 138460 -299731 -5254 -92733 52867 50759 -166207 -92113 -205306 187526 -84286
12770 -220811 169594 -113763 129243 -16217 -121894 58634 4364 -277507 43898 357215
12760 357215 95999 -73215 -49636 -51666 277372 -159193 -186359 -73649 -53281 -106217 -102257
12749 -102257 149726 156705 163372 190310 189050 -44639 100970 -79228 -63767 -26379 80054 19163
12736 -185362 -51606 -122031 195408 300462 281313 -308141 137548 93245 146885 -108606
$$ packed form
12815b98309A43669p1000P209a59179C14404b43107A79738M9185a85604I7731
12804a12302a3379k31559A57052a80097m6745E54953A93564f0693r4867L5400
12794a20160k6202q0247A17238c0396j7350A27143c3403A09180h4206B8572a1287
12782a04838A38460b99731e254q7479E2867k108a66207P4094j13193A87526h4286
12770b20811A69594a13763A29243a6217j05677E8634D364b77507D3898L13317
12760C57215I5999g3215K3579k030B77372a59193k7166g3649K0368n2936L960
12749a02257A49726O979O667K6938j260d4639A00970g9228J5461b6379H0054A9163
12736a85362e1606p0425A95408J05054j9149c08141A37548m4303N3640a08606
$$ plain form
12725 70399 -161776 -64960 38303 139991 205931 -348094 51021 -15802 83747 128185 131717
12714 131717 206698 49821 1995 -169590 373299 99415 -149796 95174 -5150 -35916 -26731
12703 -26731 312368 39258 349579 -125897 95891 82343 -162835 202627 565461 130266
12692 247900 198611 197256 275377 275146 441654 63358 -236639 435576 10874 37654 -80283
12680 13571 -28668 -320026 -111120 266399 112341 118904 -29012 -26533 -16462 176797 96334
12669 96334 65785 -16109 52172 -147946 379449 119453 77849 188051 69980 -93416 23242
12657 364373 372781 228048 -4063 -385510 173979 87744 -70225 124320 -116666 247605 184854
12646 184854 198809 -254239 396446 93210 -85455 247916 -125478 -109343 95266 -75638 195378
$$ packed form
12725G0399a61776f4960C8303J01688O5940c48094E1021a5802H3747M4438L532
12714A31717P4981D9821A995a69590C73299I9415a49796I5174e150l0766R185
12703b6731C12368C9258L10321a25897I5891j3548a62835B02627L62834A30266
12692B47900m9289j355P8121k31J66508F3358b36639D35576A0874K6780h0283
12680A3571b8668k91358a11120B66399A12341O563b9012K479J0071A76797q0463
12669I6334l0549a6109E2172a47946C79449A19453m1604J10202F9980i3416B3242
12657C64373Q408j44733d063l81447A73979q6235g0225A24320a16666B47605o2751
12646A84854J3955b54239C96446I3210h5455B47916a25478J6135I5266g5638A95378
$$ plain form
12634 572323 41011 3638 21814 199723 74378 -78009 251996 -128728 -81744 -25205 245820
12622 100541 202567 316716 208057 121650 259579 57760 469967 59014 68656 456810
12612 456810 392920 179487 335717 138667 -124015 94490 53140 244997 -215080 21629
12601 104751 -60458 102561 -32541 20329 34149 -259140 207072 221245 136837 -123039 -107252
12590 -107252 178835 146860 4260 34653 223723 344792 -16346 -13573 -15955 374624 149855
12578 -115158 -36263 136525 440867 -98998 221752 -24741 142972 98259 -198170 -137868
12568 -137868 -197665 261697 82849 258259 120333 -87206 37234 49731 14144 138716 -82823
12556 369939 83394 -28651 -184215 -11924 -103805 223067 40035 -90893 -272572 86496 293588
$$ packed form
12634E72323D1011C638J8176J77909G4378g8009B51996a28728M6984b5205B45820
12622A00541J02026J14149j08659q6407J37929E7760M12207E9014R642L88154
12612D56810o3890A79487J56230A38667a24015I4490m1350J91857b15080B1629
12601A04751f0458A02561c2541B0329J3820b59140B07072J4173q4408a23039J5787
12590a07252A78835l1975D260L0393J89070J21069a6346K773k382C74624A49855
12578a15158c6263A36525L04342i8998B21752b4741A42972m4713a98170O0302
12568a37868n9797B61697H2849J75410A20333h7206C7234J2497A4144J24572h2823
12556C69939H3394b8651j55564a1924r1881B23067D0035i0893j81679H6496K07092
$$ plain form
12545 293588 -157091 125766 -113013 -431718 -47020 -22459 -294544 -378411 -25120 55275
12534 -26637 319116 18191 -69075 -127068 -17648 -221046 -188203 156886 -435542 146695 -209234
12522 -96327 157128 84514 34004 -8707 -244622 250156 -100143 57266 -76133 27282 298414
12511 298414 -7150 -3515 -321777 118239 -68502 102828 -52592 1487 169287 -66208 -140226
12500 -140226 194170 157477 -61991 -35107 268523 -163196 -163093 -14002 -83542 117848 -160275
12488 212784 -157105 177011 29382 -55970 22203 232430 -25294 -235155 -472417 316507
12477 240027 21223 -50407 1825 70908 -165310 -62293 -171807 11768 -314713 121302 -78183
12465 202018 -89226 286602 87964 -382560 10610 283187 21114 64571 -75794 -22606 -240248
$$ packed form
12545B93588a57091A25766a13013l18705d7020b2459k72085q3867b5120E5275
12534b6637C19116A8191f9075n7993a7648k03398L2843A56886d35542A46695b09234
12522i6327A57128p2614C4004h707k35915B50156a00143E7266g6133B7282K71132
12511B98414g150c515l18262A18239f8502A02828e2592A487J67800f6208p4018
12500a40226A94170l6693f1991K6884B68523a63196J03a4002o9540A17848a60275
12488B12784a57105A77011B9382e5970B2203K10227b5294k09861k37262C16507
12477B40027B1223e0407A825O9083a65310f2293j09514A1768c14713A21302g8183
12465B02018h9226B86602H7964c82560A0610K72577B1114M3457g5794b2606k17642
$$ plain form
12454 -240248 -8818 -361451 -62765 -159107 -18417 -200770 -278851 28975 2996 158277 -70034
12442 -142389 -98732 59287 39017 303071 112158 155705 162086 -178240 -365441 156823 -11717
12430 215246 72902 100798 -125018 -616268 102345 86028 83036 -16355 -13929 -116995 77859
12418 -108115 -136956 372801 -144111 92223 -312435 -87960 -199279 105695 -28683 34691
12407 -395469 207907 14457 -139612 -155597 322518 68249 355876 -115845 -284010 29125
12396 -6458 -160061 -31629 -43150 -6311 130381 -99282 13832 -65188 83705 273845 -271068
12384 -161538 323175 -70580 135553 -64385 243216 -142213 168518 -156328 -117571 -189738
12374 -189738 30603 12118 17727 115916 -129375 -9869 -217871 124284 -129816 163269 216587
$$ packed form
12454b40248h818l52633f2765r6342a8417j82353p8081B8975B996J55281g0034
12442a42389M3657E9287k0270K64054A12158M3547O381a78240j87201A56823a1717
12430B15246G2902K7896a25018m91250A02345j6317k992a6355K426j03066G7859
12418a08115k8841C72801a44111I2223c12435h7960j11319A05695b8683C4691
12407c95469B07907A4457a39612j5985C22518F8249K87627a15845j68165B9125
12396f458j53603c1629j1521f311A30381i9282A3832f5188H3705J90140b71068
12384a61538C23175g0580A35553f4385B43216a42213A68518a56328L8757p2167
12374a89738C0603A2118N609R8189a29375i869k08002A24284a29816A63269N3318
$$ plain form
12363 216587 -206798 29486 -48031 188872 46203 191597 -317646 75549 -166555 -99206
12353 -99206 -96412 18792 404379 82297 -658 86715 -126144 -54195 -139057 -20759 -73425 -65760
12341 -65760 4045 -115386 337957 4722 292499 -210665 293456 37802 -91670 -103349 194824
12329 39589 306833 24693 -93196 245569 -161699 206021 -247703 -208102 43229 203069
12319 203069 -119870 -162912 184034 112863 -67271 250298 44341 177931 -54157 -41800 -111323
12308 -111323 -129016 197419 54664 -18176 -296995 -50257 -87297 -72425 -101634 39074 46585
12297 46585 -116568 220406 237294 -236979 -55167 309625 102327 148235 -146687 -78185
12287 -78185 -116318 24274 -16113 -231694 -262195 211959 165140 -110877 93732 -109708 -333143
$$ packed form
12363B16587b06798B9486d8031A88872D6203J45394c17646G5549a66555O7349
12353i9206K794A8792L85587H2297f58H6715a26144e4195q4862b0759n2666P665
12341f5760D045a15386C37957D722K87777b10665B93456C7802i1670j1679A94824
12329C9589K67244B4693i3196B45569a61699B06021b47703L9601D3229J59840
12319B03069a19870m3042A84034p1171f7271B50298D4341J33590e4157J2357o9523
12308a11323j7693A97419E4664a8176k78819e0257l7040J4872k9209C9074P511
12297D6585a16568B20406J6888b36979e5167C09625A02327M5908a46687O8502
12287g8185l8133B4274a6113k15581l0501B11959m6819a10877I3732a09708k23435
$$ plain form
12276 -333143 -319930 -69256 310923 99780 -179455 228456 382980 -65785 119912 150489
12266 150489 -65816 85554 224820 -55832 -35295 -91952 -70411 561154 506285 581881 -20375
12254 23126 -57608 429322 -23733 112544 -270345 -137780 244849 -123364 468924 -117119
12243 -259264 -88877 413881 -38288 51348 -21564 -10309 -61193 291872 -3523 146173 139876
12232 139876 -135915 -66916 78471 240003 238725 -134637 -177548 -16651 241550 -186913 25541
12220 -12360 -189254 -116310 342813 -86229 252671 142767 -139928 111778 90065 240821
12210 240821 154815 349626 401926 390706 -84970 -4173 70375 -3762 478787 81428 289967
12199 289967 206094 -6756 59708 275838 135995 349041 -103492 362465 302183 70925 257606
$$ packed form
12276c33143J3213f9256C10923I9780a79455B28456J54524f5785A19912L0577
12266A50489f5816H5554J39266e5832K0537n6657K1541E61154n4869P5596b0375
12254B3126e7608D29322b3733A12544b70345J32565B44849a23364D68924a17119
12243b59264h8877D13881c8288E1348b1564a0309n0884B91872c523A46173o297
12232A39876a35915f6916G8471J61532j278a34637m2911a6651B41550a86913B5541
12220a2360j76894P2944C42813h6229B52671j09904a39928A11778k1713J50756
12210B40821q6006J94811N2300j1220h4970d173G0375c762D78787H1428K08539
12199B89967q3873f756E9708K16130A35995K13046a03492C62465o0282G0925J86681
$$ plain form
12188 257606 307883 -109740 11764 189183 316458 -45166 212869 214636 495225 115594
12177 130270 83976 139803 89843 -89879 -160172 25991 233811 328482 45492 293835 -217265
12165 345945 43147 -86489 435311 -62095 42133 -135793 131986 181461 132416 279448 97471
12153 166101 170861 262627 983 112038 -48522 21037 32164 -24696 108199 52385 -64249 148198
12140 -377495 -54166 6145 -285505 73886 -45138 280392 -5591 -25340 393888 64416 193181
12129 193181 288431 -147049 260158 -72238 275099 34194 -100597 -202655 -46503 -41690 -208326
12118 -208326 236158 -57107 -164574 -69685 -264729 168108 75297 205728 -83379 -199762
12108 -199762 -278782 -24757 -51937 -53246 -478253 44920 -186293 -96771 -81166 -128743 24102
$$ packed form
12188B57606N0277a09740A1764J77419J27275d5166B12869J767K80589A15594
12177A30270m6294N5827m9960h9879p0293B5991K07820R4671D5492K48343b17265
12165C45945D3147h6489D35311f2095D2133a35793A31986M9475m9045J47032I7471
12153A66101M760R1766I83J11055d8522B1037J1127b4696A08199E2385f4249A48198
12140c77495e4166F145b85505G3886d5138B80392e591j9749C93888F4416J28765
12129A93181R5250a47049B60158g2238B75099C4194a00597j02058d6503M813j66636
12118b08326B36158e7107j07467f9685j95044A68108G5297J30431h3379j16383
12108a99762p9020b4757k7180j309m25007D4920a86293Q9522J5605m7577B4102
$$ plain form
12096 -72440 303977 189650 -93068 342614 -173167 -217214 202689 -247054 135902 -142171
12085 -216674 133501 -278877 297418 120133 -25031 413700 73893 -213667 13610 444815
12075 444815 -60962 -249402 -272063 214315 11231 -362694 25095 -108535 165480 -85754
12064 73306 -17061 -52088 220908 60953 908684 1181236 729616 379834 423318 282537
12054 282537 120366 324597 13739 45323 97846 51568 -45512 -177124 -7239 63807 286348
12043 286348 19157 -314741 13207 120987 501026 105545 25098 -45756 68193 151381 191339
12032 191339 74613 37465 -197437 266666 -131655 -34378 -274602 -122740 -81203 241916
12021 -98466 117673 -212324 -120197 9691 124786 -61490 -148246 -47450 -77846 -131216 191003
$$ packed form
12096g2440C03977j14327i3068C42614a73167m4047B02689b47054A35902a42171
12085b16674A33501b78877B97418A20133b5031D13700G3893b13667A3610M31205
12075D44815f0962j88440k2661B14315A1231c62694B5095a08535A65480h5754
12064G3306a7061l5027B20908F0953Q47731K72552m51620l49782M3484j40781
12054B82537A20366K04231A3739L1584N2523m6278d5512j31612g239F3807K22541
12043B86348A9157c14741A3207J07780L80039A05545B5098d5756F8193Q3188L9958
12032A91339G4613l7148a97437B66666a31655c4378k40224a22740M1537B41916
12021i8466A17673b12324R2127I691J15095f1490q6756d7450l0396n3370A91003
$$ plain form
12009 -340598 -47662 22291 50887 64241 165715 -9529 -217904 192374 -430815 -111575 46025
11997 -58259 -11710 372087 273690 20983 20779 -122267 -141805 -78663 -104595 -51011 -212692
11986 -212692 -227472 20072 100239 -258118 129182 76893 -219030 -45984 -93957 -200317 -168813
11975 -168813 -347351 79291 89229 -108390 15237 -134556 -111084 -14933 -233278 -166421 -111945
11964 -111945 -46067 204668 70457 242930 -311841 -17666 -108976 122814 -117366 47661
11953 -184708 23196 -31245 -97934 -44987 -41688 -16280 -2679 102224 -59695 -305704 323386
11941 -54257 125079 -318272 114175 106397 83707 25778 45252 100137 -27313 -12533 58861
11929 21821 -76127 -126648 -109454 -320798 330811 -319576 -31186 -339517 -99630 116993 -66164
$$ packed form
12009c40598d7662B2291K8596J3354J01474i529k08375A92374d30815a11575D6025
11997e8259a1710C72087r8397B0983k04a22267j9538O3142k5932e1011j61681
11986b12692j4780B0072Q0167b58118A29182n2289b19030d5984m7973j06360L1504
11975a68813j78538G9291R938a08390A5237a34556K3472a4933k18345O6857N4476
11964a11945d6067B04668G0457J72473c11841a7666r1310A22814a17366D7661
11953a84708B3196c1245o6689d4987L299a6280b679A02224e9695k46009C23386
11941e4257A25079c18272A14175p778k2690B5778J9474N4885b7313a2533E8861
11929B1821g6127n0521J7194k11344C30811c19576c1186l08331i9630A16993f6164
$$ plain form
11917 160676 255989 -35196 45166 -124923 -144530 87795 -130612 -11242 -61935 -226730 -129276
11906 -129276 -182666 64522 -127833 234205 139584 -77759 -29166 141952 54854 234131 26109
11894 186540 -270424 117667 -60702 78356 232800 -28319 -109050 6499 -140436 -70273 79088
11882 -93137 134757 26761 21930 -47748 305889 115452 162606 -193381 -72909 -60653 -17361
11870 -59385 93569 129205 -75343 91826 -37318 -200200 5366 -42982 -79913 -9607 -5215 -422866
11858 -422866 315513 -347137 71164 103622 -395502 -362007 88064 -264124 -152907 -30066
11847 -21393 -45282 68838 62307 -48399 28134 -136389 259233 -25502 129556 -288749 20775
11835 262672 181333 -106638 364482 135686 -18826 -8076 164375 -283309 86233 -16069 66006
$$ packed form
11917A60676R5313c5196D5166a24923j9607H7795a30612a1242n0693j64795R7454
11906a29276n3390F4522a27833B34205r4621g7759b9166A41952E4854J79277B6109
11894A86540b70424A17667f0702G8356J54444b8319q0731F499a40436P0163G9088
11882i3137A34757B6761m831d7748C05889A15452M7154a93381g2909J2256a7361
11870e9385I3569L5636g5343I1826c7318j62882E366d2982l6931i607M392m17651
11858d22866C15513c47137G1164L2458c95502L3495H8064b64124J11217c0066
11847b1393k3889F8838o531d8399B8134a36389B59233b5502A29556b88749B0775
11835B62672q1339a06638C64482A35686a8826h076A64375b83309H6233a6069F6006
$$ plain form
11823 391630 154566 4710 -24117 -110552 -16996 -113922 -372005 -310880 104939 -126796 -128925
11812 -128925 -276502 -193625 108655 -44896 -105436 55063 -266081 -179357 -317738 -125389
11801 208125 -8496 244077 -363819 65529 102674 -241161 66093 166980 177914 193335 -91017
11789 -173480 -120400 164512 190105 37355 -47198 89319 -157753 -212810 109113 188964 -233968
11777 29203 -14714 164915 85319 122265 21273 239632 147124 -26023 34236 -71278 118981
11765 -93034 50603 144142 44860 9360 -275221 -213192 -394004 146580 -188524 79899 120801
11754 120801 85328 -20182 179712 -144890 -47723 -183430 -85023 -122166 -203193 47664 -510777
11742 3369 -147753 107761 60538 10515 46102 -209006 128297 -136045 218150 -126803
$$ packed form
11823C91630A54566D710b4117q6435a6996r6926k58083O1125A04939a26796k129
11812a28925j47577Q2877A08655d4896o0540E5063b66081Q6724j38381a25389
11801B08125h496B44077c63819F5529L7145b41161F6093J00887J0934J5421i1017
11789a73480N3080A64512K5593C7355d7198H9319a57753n5057A09113P9851b33968
11777B9203a4714A64915p9596L6946B1273K18359r2508b6023C4236g1278A18981
11765i3034E0603R3539D4860I360b75221O2029j80812A46580a88524G9899M0902
11754A20801l5473b0182A79712a44890d7723j35707h5023l7143q1027D7664e10777
11742C369a47753A07761m7223A0515L5587b09006A28297a36045B18150a26803
$$ plain form
11731 -378938 -149116 -80694 -99030 -56459 110664 -315889 70603 95946 132051 35282 -31408
11719 -18276 -222648 175785 228974 31427 114257 -214212 -5565 -358418 287399 -184114 -48772
11707 264462 -201576 512367 63303 -134733 13117 332495 -14022 -30475 94 242865 -114586
11695 36405 263455 -65251 -80406 163962 -105419 -169138 -79612 -16835 250327 -314039 -77755
11683 -269963 223219 -60317 247899 -252249 -62643 70553 91044 269086 72141 74720 -2486
11671 438437 61041 -316761 315862 74658 65400 -94663 -22758 -118272 104441 197290 121794
11660 121794 -690 82241 -12679 214713 -223952 -441891 -73084 163942 143618 -202482 -40343
11648 -62985 -169271 -11126 127616 52172 88417 -14637 26623 -206206 370979 97489 96365
$$ packed form
11731c78938a49116O8422j8336M2571A10664c15889G0603K5343L6105C5282c1408
11719a8276k04372A75785N3189C1427Q2830b14212e565l52853B87399a84114d8772
11707B64462b01576E12367F3303a34733A3117L19378a4022j6453I4K42771a14586
11695C6405K27050f5251j5155A63962a05419o3719g9612a6835B50327c14039g7755
11683b69963B23219f0317B47899b52249f2643G0553K0491J78042G2141K579b486
11671D38437F1041c16761C15862G4658r258i4663b2758r5514A04441R2849p5496
11660A21794f90H2241a2679B14713b23952k17939g3084A63942k0324b02482d0343
11648f2985j06286a1126A27616E2172L6245a4637B6623b06206C70979I7489j124
$$ plain form
11637 96365 112818 199889 148376 42470 -242816 -26161 40401 40600 71999 265838 72216 -312394
11624 94708 342965 -34802 -273133 107606 -90256 335816 75839 90532 -244861 -57164 153922
11612 -199362 242815 284878 82856 121637 46474 211470 -96758 -58114 -23960 290862 -32611
11600 155570 86342 -16629 -45509 -147165 127765 -276266 47356 76105 134211 -464734 -29904
11588 90299 166358 10700 -167953 -284461 66864 183527 155942 127050 -35109 102035 98131
11577 98131 180856 -123898 8908 77919 84524 205464 59196 305844 -347610 29486 17385
11566 17385 60877 46421 139801 28393 -139339 105769 156206 -48826 76796 198333 -197676
11554 -357571 213292 248906 179816 172484 101652 -58232 -163261 -66938 -148336 -2478 -163607
$$ packed form
11637I6365J6453Q7071n1513D2470b42816b6161D0401J99L1399J93839G2216c12394
11624I4708K48257c4802k38331A07606i0256C35816G5839J4693b44861e7164A53922
11612a99362B42815M2063H2856L8781D6474J64996i6758L8644b3960B90862c2611
11600A55570o9228a6629k8880j01656A27765b76266D7356K8749N8106d64734b9904
11588I0299P6059A0700a67953j16508F6864J16663k7585k8892c5109A02035l904
11577I8131Q2725a23898H908O9011O605J20940E9196K46648c47610B9486j2101
11566A7385M3492j4456R3380B8393a39339A05769N0437d8826G6796J21537a97676
11554c57571B13292L5614o9090p332p0832e8232j05029f6938q1398b478j61129
$$ plain form
11543 -163607 103529 171922 225860 94945 172802 143593 -37848 524592 295802 -111278 173025
11531 -142636 73136 -79194 163553 200902 413606 215417 228899 21222 244841 46783 178571
11520 178571 412253 -117310 -62716 383203 11034 155785 404480 124501 412641 283725
11510 283725 85707 -5178 77769 -194305 64846 -151532 263497 -92089 132330 -112354 13227
11498 187096 -23473 154948 102988 -22543 27250 54785 138481 -40737 170964 -10197 182281
11486 29622 13486 342447 218390 64243 -11725 103754 76205 -125565 -92764 222566 316514
11475 316514 46276 -180729 -224891 -139885 52534 108911 82456 -141363 141554 101640 240125
11464 240125 -65748 6769 -137211 89690 2644 97013 2922 288266 51441 181002 66602
$$ packed form
11543a63607A03529O8393N3938I4945P7857k9209c7848E24592k28790a11278A73025
11531a42636G3136g9194A63553L7349K12704j98189J3482B1222K23619D6783J31788
11520A78571K33682a17310N4594C83203A1034J44751K48695A24501K88140j28916
11510B83725H5707e178G7769a94305F4846a51532B63497i2089A32330a12354A3227
11498A87096b3473A54948n1960b2543B7250K7535Q3696d0737A70964a0197A82281
11486B9622A3486L28961j24057F4243a1725A03754k7549a25565L2801B22566R3948
11475C16514D6276a80729m4162Q5006E2534N6377k6455a41363A41554l9914J38485
11464B40125f5748F769a37211H9690B644R4369B922K85344E1441J29561F6602
$$ plain form
11452 13711 -234694 -8511 299276 -70973 189327 48280 9205 308528 303404 381143 -29538
11440 -56239 -6840 315642 -1606 -249086 46300 226121 79270 255357 -73939 63722 126550
11429 126550 -164699 -16123 184887 168032 -89705 -51025 51621 438761 106634 145841 -70477
11417 693 29977 -65624 129596 -2431 -17493 4433 131518 290160 -11827 -129182 -88966 -42257
11404 -84730 348953 3475 -150790 435776 -12226 123555 44953 217794 31210 135434 275173
11393 275173 190530 -36787 302237 -140754 165745 46390 -2595 -6031 20860 31880 184566
11382 184566 139396 189895 -382605 8947 -181190 240898 -386197 12126 -188011 317440
11371 -92660 151153 162339 328319 5092 -20309 139917 -114222 94823 92914 -68155 -18785
$$ packed form
11452A3711b34694h511B99276g0973A89327D8280I205K99323n124P7739b9538
11440e6239f840C15642a606k47480D6300J79821G9270J76087g3939F3722O2828
11429A26550a64699a6123A84887j6855h9705L8680E1621L87140A06634L9207g0477
11417F93K9284f5624A29596b431j5062D433J27085J58642a1827j17355M0216d2257
11404h4730C48953C475a50790D35776a2226A23555D4953J72841C1210J04224J39739
11393B75173q4643c6787C02237a40754A65745D6390b595l436B0860J1020J52686
11382A84566m5170N0499c82605H947a81190B40898c86197A2126a88011C17440
11371i2660A51153J1186J65980E092b0309A39917a14222I4823j909f8155a8785
$$ plain form
11359 91004 -222701 373615 -209151 -197265 -63694 222061 -134305 -108847 85845 20159 36019
11348 36019 -107411 65173 -36707 52704 -78608 -252876 -408684 -194972 -66530 -205048 148474
11336 -256785 118370 -27553 60607 161999 -75291 -24398 138005 -377213 -160681 -77987
11325 -30249 -152195 -94541 334598 -205313 42151 -86106 256203 202924 221820 41038 -92196
11313 -86328 -54947 -266089 -94488 338611 21429 70290 -289891 -97119 133018 12112 -39328
11301 86715 105077 362844 -329639 169315 278642 -167505 -387361 56696 316816 -236669
11290 -236772 160169 -107916 56802 84434 259978 -47531 256387 -296950 124267 142726
11280 142726 -241790 -58039 -189845 -95930 -236364 -115168 -70467 74671 -86684 -75162 6983
$$ packed form
11359I1004b22701C73615b09151J1886f3694B22061a34305K5458H5845B0159J5860
11348C6019a07411F5173c6707E2704g8608j74268j55808a94972f6530j38518A48474
11336b56785A18370b7553F0607J01392g5291b4398A38005c77213a60681g7987
11325c0249j21946N7654C34598b05313D2151h6106B56203n3279J8896D1038i2196
11313h6328L1381k11142i4488C38611B1429M8861b89891i7119A33018A2112c9328
11301H6715J8362K57767c29639A69315J09327a67505k19856E6696K60120b36669
11290b36772A60169a07916E6802K7632J75544d7531B56387b96950A24267J8459
11280A42726b41790e8039j31806R3915j40434a15168M4701G4671h6684J1522F983
$$ plain form
11268 70143 170229 -22296 -108679 -314159 -32841 2023 145324 259859 270299 -55007 -106715
11257 -106715 74925 -42890 -69224 -49507 -396325 81775 197314 91934 -115279 77954 -70409
11245 -180228 -11769 -269 -57747 -101642 81543 -33441 -333907 -113673 47154 226431 -88359
11233 -308546 -168761 -281285 -93587 -128319 -126678 -237421 139342 -207457 -78845 140106
11222 -110132 1128 -214238 -118599 8392 -42187 -6254 294412 -62053 270634 -202546 -138752
11211 -138752 213419 -11727 121212 -60116 8389 -169878 -84963 41549 -123291 -194497 -128348
11200 -128348 -125395 -114011 129385 111529 524095 -16013 -36766 -76272 -163899 -230479 -204115
11189 -204115 76325 89514 -69890 -143685 -6324 -177522 126415 -200755 -164434 -208913 -59308
$$ packed form
11268G0143J00086b2296q6383k05480c2841B023J43301J14535J0440e5007n1708
11257a06715G4925d2890k6334J9717l46818H1775J15539I1934a15279G7954g0409
11245a80228a1769b69n7478m3895H1543c3441l00466a13673D7154J79277h8359
11233c08546J39785j12524i3587l4732J641j10743A39342b07457g8845A40106
11222a10132A128b14238R5639H392d2187f254B94412f2053B70634b02546O3794
11211a38752B13419a1727A21212f0116H389a69878Q4915D1549a23291p1206O6149
11200a28348K953J1384A29385j7856M12566a6013k0753l9506q7627o6580K6364
11189b04115G6325J3189f9890p3795f324j71198A26415b00755L6321m4479e9308
$$ plain form
11177 10216 -131407 -177415 -54818 25551 -182939 -34129 -10415 69436 40526 -303997 28450
11165 -54485 227358 53992 -115841 -114964 -140456 -281822 -87696 -248594 54336 -273708 112488
11153 -131270 -99362 -132223 -44545 294288 -67303 -121892 194773 -190919 -42358 153557 -158303
11141 176604 146230 298954 38764 154492 -19118 55746 -295041 171037 -108163 72584
11130 -21824 100663 -52549 -515438 228641 -7204 -42983 52572 275665 72499 250968 -283084
11118 -219741 4817 87348 14911 -4934 14957 -182617 256784 48333 91012 -109238 -7014
11106 113883 -3540 -29498 128260 -146960 -69859 276766 3766 25893 110049 282057 -265567
11094 -88518 299912 -206891 38412 180400 129547 -32167 153370 112689 37050 275253 479359
$$ packed form
11177A0216a31407m6008e4818B5551a82939c4129a0415F9436k8910c03997B8450
11165e4485B27358E3992a15841Q77k5492j41366h7696j60898E4336b73708A12488
11153a31270L1908l2861d4545B94288f7303n4589A94773a90919d2358A53557a58303
11141A76604l0374J52724C8764J15728a9118E5746b95041A71037a08163G2584
11130b1824A00663e2549m62889B28641g204l5779E2572K23093G2499J78469b83084
11118b19741D817Q2531A4911d934A4957a82617B56784D8333M2679a09238g014
11106A13883c540k5958A28260a46960f9859B76766C766K2127Q4156J72008b65567
11094h8518B99912b06891C8412J41988n0853c2167A53370m0681C7050K38203K04106
$$ plain form
11083 479359 198908 223777 -24241 240887 -60210 11432 -209028 122194 530610 -8083 172855
11071 -28107 341430 128043 266206 248369 197820 219259 295144 -311971 446671 219806
11060 107483 267684 187846 -51390 106055 642343 287159 342120 286905 517674 219846
11049 477272 319564 231434 493573 743737 569564 515514 262938 537709 866170 518017
11039 518017 157641 465540 660564 493258 496000 843289 649028 686959 640128 533180
11029 533180 634556 710393 511632 767093 729839 334385 673751 581706 751391 811604
11019 811604 780028 592363 449966 647819 997764 678394 686218 579735 642995 696500
11009 696500 907997 561906 835680 357741 646304 321042 552389 492331 653503 608711
$$ packed form
11083D79359A98908K4869b4241B40887f0210A1432b09028A22194M08416h083A72855
11071b8107C41430A28043J38163j7837n0549K1439P5885c11971D46671B19806
11060A07483J60201p9838e1390A06055N36288B87159N4961n5215K30769B19846
11049D77272j57708q8130K62139K50164j74173n4050k52576K74771L28461l48153
11039E18017A57641L07899J95024j67306K742L47289j94261L7931m6831j06948
11029E33180J01376P5837j98761K55461l7254C34385L39366r2045J69685O0213
11019H11604l1576j87665j42397J97853L49945l19370P824j06483O3260N3505
11009F96500K11497l46091K73774C57741K88563C21042K31347o0058J61172m4792
$$ plain form
10999 608711 1026535 484243 605866 622367 667417 913164 546541 724823 556880 609900
10989 609900 558634 478093 849400 632831 398766 524600 900058 863323 392203 538744
10979 538744 917096 801766 698281 809116 907545 616100 810295 842444 867694 1006568
10969 1006568 923414 1124663 934270 1014273 1051497 1797557 1607798 1391419 1871681 2064799
10959 2064799 1814010 2089796 2428802 2470437 2757983 2674633 2655449 2328406 2034455 1981021
10949 1981021 1658324 2011487 1693807 1745501 1694541 1667047 2046640 2080490 1927423 2097380
10939 2097380 1878122 1596285 1459453 1101925 865905 807922 624524 770424 546643 591104
10929 591104 123174 146325 246998 248106 28691 196015 97291 414676 102225 -10420 -143421
$$ packed form
10999F08711M17824D84243J21623J6501M5050K45747l66623J78282j67943N3020
10989F09900n1266q0541L71307k16569k34065J25834L75458l6735C92203J46541
10979E38744L78352j15330j03485J10835R8429k91445J94195L2149K5250J38874
10969A006568q3154K01249j90393Q0003L7224P46060j89759k16379M80262J93118
10959B064799k50789K75786L39006M1635K87546q3350j9184l27043k93951n3434
10949A981021l22697L53163l17680N1694n0960k7494L79593L3850j53067J69957
10939B097380k19258k81837j36832l57528k36020n7983j83398J45900k23781M4461
10929E91104A23174K3151J00673J108B8691J67324I7291L17385A02225a0420j33001
$$ plain form
10918 -143421 113622 -48700 193281 340191 150235 -95034 167419 221308 -123089 50318
10907 360265 193879 25107 -80396 88532 -163012 308624 115972 -86400 -137916 -63325 -228478
10896 -228478 178905 202531 -1649 54548 96519 173156 114263 90796 126826 73851 -133056
10884 -251043 173834 107931 12026 -225324 183157 52517 -102475 285912 324285 -13880
10873 20776 -132129 -134236 34711 -110762 -92801 -50574 -77526 -248152 -234668 -171691 -72183
10861 -105046 256640 -175634 -14408 -229545 -26412 -28624 289853 46455 -280255 113343
10850 -139912 -250006 -183282 -135556 -131464 133170 75521 -4199 -393156 159893 -78771 -21882
10838 -359344 -115259 -403684 -92043 57054 120100 174978 -413799 226228 -113695 340674
$$ packed form
10918a43421A13622d8700A93281J46910A50235i5034A67419N3889a23089E0318
10907C60265j66386B5107h0396H8532a63012C08624A15972h6400n1516f3325j65153
10896b28478A78905K3626a649E4548M1971P6637n8893k3467L6030n2975a33056
10884b51043A73834o5903A2026b25324A83157E2517a02475B85912L8373a3880
10873B0776a32129k107C4711a10762J7961M2227k6952j70626J3484O2977g2183
10861a05046B56640a75634a4408k15137b6412k212B89853D6455b80255A13343
10850a39912j10094O6724M7726M092A33170n7649d199l88957A59893g8771b1882
10838c59344a15259k88425i2043E7054O3046N4878d13799B26228a13695C40674
$$ plain form
10827 -132885 -53598 242110 -24248 -42311 146455 -31444 271895 -206708 166919 281118
10817 281118 6673 -89342 186313 -59475 238604 25599 -851 -158289 -17721 217116 100845
10805 -48720 -205852 -143891 -75943 111590 -250354 -321054 -270111 29253 -81765 -177032 148586
10793 -223737 105348 53128 1257 2117 -334078 28535 10900 32849 -9956 -274163 -133045
10781 -430232 -444876 -87114 -229580 177858 -115602 40650 -155886 -138374 238000 230341 138795
10770 138795 -8193 -18557 -174329 -304341 -76767 -77032 -95364 49300 -166931 57978 220202
10759 220202 116972 -52241 13847 307658 214659 -80818 -134720 -286689 -99884 -108874 34967
10747 176118 -43019 -173596 -124746 -200572 85192 89879 16938 88449 231320 103765 -223288
$$ packed form
10827a32885e3598B42110b4248j8063A46455c1444B71895b06708A66919J14199
10817B81118F673h9342A86313e9475B38604B5599h51j57438a7721B17116A00845
10805d8720j57132O1961O7948A11590b50354p0700N0943B9253h1765r5267A48586
10793b23737A05348n2220A257Q60c34078B8535A0900K1949i956k64207a33045
10781d30232j4644h7114j42466A77858a15602D0650a55886J7512B38000p659r1546
10770A38795h193j0364j55772j30012g6767k65j8332D9300a66931E7978J62224
10759B20202j03230e2241A3847K93811r2999h0818n3902j51969i9884q990C4967
10747A76118d3019j30577M8850p5826H5192M687A6938P1511J42871A03765b23288
$$ plain form
10735 96847 42236 157081 -386435 62164 72591 -91797 124110 85684 -10927 71544 234655
10724 234655 180374 164370 118679 -138873 994 33262 -62092 83089 -59430 223795 107469
10712 33363 -278420 -173539 -117902 112952 108181 -495 -133823 -198151 189992 20914 -253817
10700 6408 -116885 -192027 -27216 77608 10483 304713 133234 95460 46648 -19691 -132471
10689 -132471 -41413 -79989 71393 805 -324531 18177 -249297 9080 -93659 -69170 -247064
10678 -247064 -72504 -4658 -158077 320988 -11757 -44259 31125 -240070 86101 -97300 194688
10666 -519901 5213 -60354 -49746 -138496 -161016 -141496 -267871 168830 178959 255952 149435
10655 149435 136922 178048 -221326 -20613 -15657 -75900 -209865 -295752 296420 -119006 -136934
$$ packed form
10735I6847D2236J14845c86435F2164J0427i1797A24110l8426a0927G1544J63111
10724B34655n4281j6004m5691a38873I94L2268f2092H3089e9430B23795A07469
10712C3363b78420J04881N5637A12952m771d95j33328o4328A89992B0914b53817
10700F408a16885p5142b7216G7608A0483K94230A33234l7774D6648a9691j12780
10689a32471d1413l8576G1393H05c24531A8177b49297I080i3659K4489j77894
10678b47064g2504d658j53419C20988a1757l2502C1125b40070H6101i7300A94688
10666e19901E213f0354J0608q8750k2520J9520j26375A68830J0129P6993j06517
10655A49435j2513M1126b21326b0613M956o0243j33965q5887B96420a19006j7928
$$ plain form
10644 -136934 -305068 40037 -58836 -814 -432126 -250772 -72989 92011 149625 204586 -218273
10632 -423987 -92425 54092 -79538 71569 81127 -112041 -320764 118415 -15212 223672 -44775
10620 -166797 -16691 -17875 -77694 -24271 -31285 71168 -157287 97835 -342317 158220 -191388
10608 46329 -411855 -111506 -191394 202257 -783 51943 -380672 -325911 -122139 143138 -26001
10596 12719 16956 36183 49872 20649 79387 -89 -73830 103133 -216141 147082 261076 -66922
10583 -115308 123948 -34000 -132357 39253 -192675 -18155 -88001 -175945 -95693 -237410 -244852
10572 -244852 -49361 -94336 -277633 -220733 252037 53397 95514 -290017 -326370 -313548 150541
10560 -123284 -328814 -13382 46766 -31405 132142 -198768 -145346 -250477 -247213 -53259 -51577
$$ packed form
10644a36934j68134D0037e8836h14m31312J81354g2989I2011N7614N4961b18273
10632d23987i2425E4092g9538G1569R558a12041k08723A18415a5212B23672d4775
10620a66797a6691j184n9819b4271p014G1168a57287I7835c42317A58220a91388
10608D6329d11855a11506p9888B02257g83E1943c80672N4761a22139A43138b6001
10596A2719M237J9227J3689B0649N8738h9p3741A03133b16141A47082J13994f6922
10583a15308A23948c4000r8357C9253a92675a8155o9846q7944Q0252j41717p442
10572b44852d9361m4975j83297N6900B52037E3397M2117b90017l6353J2822A50541
10560a23284k05530a3382D6766c1405A32142a98768N3422j05131L264e3259J682
$$ plain form
10549 -51577 -172390 307548 205810 -93935 171277 109371 -296817 -170108 -176940 -65239 -261341
10538 -261341 -269176 -67649 -117390 47909 49172 70981 -59861 -134163 207982 -509496 -202649
10526 259614 -279562 -182278 -47441 -299858 114155 -97731 129253 226738 84835 -423638
10515 162034 50289 -69256 40104 -77650 103878 -27271 9544 -116111 -82388 -195928 -61096
10503 144854 -237463 26351 31856 53253 -73160 11520 -241562 -139117 -468071 -77904 -12321
10491 -12135 62810 -449038 -53916 -128020 484439 60535 -22467 69797 74002 -241965 -50353
10479 -99648 -69533 104872 -253948 -94236 60596 -116793 144069 177101 112330 -36811 -27505
10468 -27505 -74561 259978 191623 550240 558687 504748 160889 162158 186601 -336549 186171
$$ packed form
10549e1577j20813C07548j01738i3935A71277o1906b96817J26709o832f5239j96102
10538b61341p835f7649m9741D7909J263K1809e9861p4302B07982e09496b02649
10526B59614b79562R7284d7441k52417A14155i7731A29253R7485H4835d23638
10515A62034E0289f9256D0104g7650A03878b7271I544a16111L3723j13540f1096
10503A44854b37463B6351N505K1397g3160A1520b41562J02445l28954g7904a2321
10491a2135F2810d49038e3916p4104D84439F0535b2467F9797M205b41965e0353
10479i9648L0115A04872b53948i4236F0596a16793A44069L3032o4771c6811R306
10468b7505m7056B59978o8355L58617Q447n3939A60889J269K4443c36549A86171
$$ plain form
10456 -456555 -149233 -79921 133904 -63335 55325 147645 -235170 26507 -39355 118863 43191
10444 -232596 13751 -217986 -119085 -147492 -67720 -108410 142890 54664 -38444 85080 -21903
10432 -93164 -168332 227818 -339802 -435003 -301713 -72859 -24140 -295935 -48497 124912 51745
10420 -194239 36987 -207450 76168 145121 12353 213125 52952 -140237 257685 -172671
10409 209987 31542 -325136 44706 36550 -14998 -164030 18192 -34946 137204 -77969 189608
10397 -11629 4569 -101994 -124193 -42976 -13721 -44059 33700 -51701 -8160 -82371 -129611 -393936
10385 -393936 -341771 289628 12960 114272 -19914 -99464 -41530 -254437 65582 348446 337756
10374 337756 -113400 78689 138501 192570 -136541 135993 -80626 39035 -29521 152885 107170
$$ packed form
10456d56555a49233O9312A33904f3335E5325R2320b35170B6507c9355A18863D3191
10444b32596A3751b17986R8901k8407f7720m0690A42890E4664c8444H5080b1903
10432i3164p5168B27818c39802r5201J33290g2859b4140k71795d8497A24912E1745
10420a94239C6987b07450G6168O8953A2353K00772E2952a40237B57685a72671
10409B09987C1542c25136D4706q156a4998j49032A8192c4946A37204g7969A89608
10397a1629D569a01994k2199d2976a3721l0338C3700e1701h160p4211m7240k64325
10385c93936N2165B89628A2960J01312a9914p9550d1530k12907F5582K82864j0690
10374C37756a13400G8689N9812N4069a36541A35993h0626C9035b9521A52885m5715
$$ plain form
10363 107170 -117424 -162539 169699 240682 -108348 194128 163467 -111186 403915 323660
10353 323660 279703 436373 523467 463511 419072 294688 225484 448941 273083 79999 93049
10342 93049 182894 161966 177759 -213972 512821 369322 110830 318250 683157 458283
10332 458283 633485 399728 505758 531680 432572 541690 379855 249226 -244138 -106276
10321 -7411 159692 249572 301967 247236 353679 -65413 -47574 384454 1838 -46670 386257
10309 -337395 263733 149171 125381 367476 24766 -48817 292840 -113287 453900 537145
10299 537145 -27650 268718 -6545 107438 -5401 -26773 5549 132562 199841 25098 -281554
10287 134541 25298 -74141 89579 -143125 -78603 -50353 -16845 -260594 109553 -243771 -63688
$$ packed form
10363A07170a17424m5115A69699P0983a08348A94128l0661a11186D03915q0255
10353C23660m3957J56670Q7094n9956m4439j24384o9204K23457j75858G9999J3050
10342I3049Q9845k0928J5793b13972E12821j43499A10830K07420L64907k24874
10332D58283J75202k33757J06030K5922r9108J09118j61835j30629b44138a06276
10321g411A59692Q9880N2395n4731J06443f5413J7839C84454A838d6670C86257
10309c37395B63733j14562k3790K42095B4766d8817B92840a13287D53900Q3245
10299E37145b7650B68718f545A07438e401k1372E549J27013O7279B5098b81554
10287A34541B5298g4141H9579a43125O4522K8250a6845k43749A09553b43771f3688
$$ plain form
10275 115033 -161540 159572 -350089 -129460 -138869 -56788 -190140 -266669 63804 -148959
10264 121472 25427 59626 114508 96276 -371083 -29252 -106573 52553 68810 173338 -45984
10252 107906 50352 -241648 -38412 296958 239509 307976 -86365 237027 403426 538202
10242 538202 129074 279744 86921 -55133 4187 12157 -259232 -239918 204970 140937 281462
10231 281462 96959 -48699 -312693 368467 -277460 252989 -102884 -94117 40760 -159782
10220 -24401 -251237 -270719 -147499 118014 -208513 -63120 -87851 -187995 -219577 156691
10209 200659 -42254 -124205 -124107 65889 -311246 70055 -33806 197339 -188955 213196 131624
10198 131624 178312 -70787 -298491 88740 328172 180852 -31833 -115865 -405950 -138010
$$ packed form
10275A15033a61540A59572c50089a29460r409e6788j33352p6529F3804a48959
10264A21472B5427L4199N4882j8232c71083b9252p7321E2553J6257J04528d5984
10252A07906E0352b41648c8412B96958n7449O8467h6365B37027J66399J34776
10242E38202A29074J50670H6921e5133D187P970b59232J9314B04970o4033J40525
10231B81462I6959d8699k63994C68467b77460B52989a02884Q767D0760a59782
10220b4401k26836j9482J23220A18014b08513f3120k4731j00144l1582A56691
10209B00659d2254q1951R8F5889c11246G0055c3806A97339a88955B13196q1572
10198A31624M6688g0787k27704H8740K39432j47320c1833q4032k90085a38010
$$ plain form
10187 268213 144715 -27348 -125699 -71434 -137869 43216 -10805 -250521 -293028 -259171 -107328
10175 93832 -59601 -294195 -371502 87802 242135 -40586 -410564 -181806 -99973 -172954 -147599
10164 -147599 -257435 -149440 -409315 18720 -264109 56156 -357719 -15361 413030 134624
10153 -381722 -25512 145835 -253171 -28425 235883 -51466 -97494 -275401 -394037 386287
10142 -81056 -117516 -360226 16734 -192621 18429 4909 161203 -14393 6307 39092 -158354
10130 26512 156904 -262793 -130456 -94248 160824 99440 -234099 -193137 -56620 -169306
10120 -169306 1932 28217 -212189 -142127 -16082 61469 161628 -67371 7286 -53167 -238279
10109 -238279 -209350 44473 9739 -46153 -206637 -471401 279274 -41103 -75428 92793 -312236
$$ packed form
10187B68213j23498b7348r8351N4265o6435D3216a0805k39716m2507L3857a07328
10175I3832e9601k34594p7307H7802J54333d0586l69978a81806Q1833p2981K5355
10164a47599j09836J07995k59875A8720b64109E6156c57719a5361D13030A34624
10153c81722b5512A45835b53171b8425B35883e1466m6028j77907j18636C86287
10142h1056l6460k42710A6734a92621A8429D909J56294a4393F307L2785a58354
10130B6512J30392b62793a30456L6208A60824o1384b34099M0962e6620j12686
10120a69306A932K6285b12189P0062a6082F1469J00159f7371G286e3167j85112
10109b38279K8929D4473I739d6153j60484k64764B79274d1103l4325I2793c12236
$$ plain form
10097 -391408 3787 -261024 -215456 -112310 -195822 -129219 129127 198785 -5171 304706 -146630
10085 62828 11601 58164 -28880 -118889 168773 -241653 -59643 162319 -74810 116411 -127402
10073 -193820 -312256 -208537 -9979 71677 -247475 -153674 -246734 -29345 -65581 89823 28563
10061 -122289 -40882 -148709 -3934 -14858 97406 156392 -299917 -265623 19861 -357926 -139128
10049 222904 150555 -248039 -334811 -55096 6416 -7956 -320492 -27781 -215327 230013 113563
10037 240249 -255318 -70820 -129015 -168882 -282570 -150364 -181162 75069 -37804 -94563 -293220
10026 -293220 -136041 -266898 -28533 72741 154657 -75138 158735 -182885 -63364 -256931
10016 -256931 150805 30199 -86541 42755 224478 56631 62244 113979 178712 -298028 -10348
$$ packed form
10097c91408C787b61024M5568J03146q3512O6603A29127O9658e171C04706a46630
10085F2828A1601M6563b8880r0009A68773b41653e9643A62319g4810A16411a27402
10073a93820j18436J03719i979G1677b47475R3801r3060b9345l6236H9823B8563
10061a22289d0882j07827c934j0924I7406N8986b99917L4294A9861c57926a39128
10049B22904p2349b48039q6772e5096F416g956l12536b7781j87546B30013A13563
10037B40249b55318g0820n8195l9867j13688J32206l0798G5069c7804n6759j98657
10026b93220a36041j30857b8533G2741Q1916g5138A58735a82885f3364j93567
10016b56931A50805C0199h6541D2755J81723E6631N613N1735O4733b98028a0348
$$ plain form
10004 19713 85326 -258219 -198654 -81687 89872 142169 -260873 -123719 -96334 94346 -132371
9992 -47030 63778 -647603 243835 -177995 -288644 -143702 -261794 28139 72729 -64009 135488
9980 8754 164199 -102839 -116261 -246642 -25260 87801 -376439 184411 57587 -58735 -113513
9969 -113513 -31844 178499 -19638 -246370 -127970 -118766 -306820 34550 -179513 -201228 79018
9957 -268424 -40230 -139802 27635 -280469 -191075 28097 -11860 -69592 78531 62295 -193480
9945 -239760 -229019 -29612 165461 -200162 -399992 -175659 -35165 -250454 -80590 139502
9934 -347186 67124 -175555 208902 -291731 -354471 49365 80872 -238255 -67985 39770 -140345
9922 80362 -37260 -129964 -94976 -183374 -19175 -168478 276919 -147620 84976 173889 269760
$$ packed form
10004A9713O5613b58219N9565h1687H9872N2297b60873a23719K7385I4346a32371
9992d7030F3778f47603B43835a77995j10649a43702j18092B8139M4590f4009A35488
9980H754J55445a02839j3422j30381b5260H7801c76439A84411E7587e8735n4778
9969a13513c1844A78499a9638k26732J18400R204j88054C4550a79513k1715G9018
9957b68424d0230r9572B7635b80469Q9394B8097a1860n7732G8531j6236a93480
9945b39760J0741b9612A65461b00162j99830a75659c5165k15289h0590A39502
9934c47186F7124a75555B08902b91731o2740D9365L1507b38255f7985C9770a40345
9922H0362c7260r2704L4988q8398a9175j49303B76919a47620H4976Q8913R5871
$$ plain form
9911 269760 -94778 189373 -335902 23442 -46141 -183937 -110499 52049 55188 -319739 -199212
9900 -199212 -371245 127488 -75122 82706 124457 230966 20970 -65964 -197897 125254 97008
9889 97008 -247610 -12727 46334 118128 345583 -53100 787 168066 -55170 -405344 -144518
9877 -195171 226616 92234 -308737 -25399 -320028 -5150 179713 40243 52182 54892 -212970
9865 28991 -301069 -8386 -177968 -145264 281287 -245980 -296098 63699 -10243 -280955 -251150
9854 -251150 202877 102309 -26795 -201859 -207956 95567 -12740 82093 -38201 186492 -207695
9842 -167264 -51134 233506 87756 -114576 146666 -281259 94267 104014 -30561 -234210 -425567
9831 -425567 -34129 26698 74306 -244607 -225759 -430575 53692 -318289 -294181 -151322 -92075
$$ packed form
9911B69760i4778A89373c35902B3442d6141j37796P3438E2049L139c19739J20527
9900a99212j72033A27488g5122H2706M1751J06509B0970f5964j31933A25254k8246
9889I7008b47610a2727D6334P1794K27455e3100G87J67279e5170l50174a44518
9877a95171B26616I2234c08737b5399k94629e150A79713D0243J1939K710b12970
9865B8991c01069h386j69582L2704B81287b45980n0118F3699a0243k70712K9805
9854b51150B02877j00568b6795j75064o097I5567a2740H2093c8201A86492b07695
9842a67264e1134B33506H7756a14576A46666b81259I4267R747c0561k03649j91357
9831d25567c4129B6698M7608b44607J8848k04816E3692c18289K4108J42859N9247
$$ plain form
9820 -92075 28438 -20208 -84245 -323615 -12323 -40713 80779 -94681 122324 220633 -233349
9808 11807 -49490 -175187 -215700 110679 -369908 -47869 12168 -276944 102069 -9411 229124
9796 65258 -155428 -220158 -68826 -469210 180649 -271533 -298231 35750 -18844 58307 90438
9785 90438 129328 161768 346560 -3278 -506 110865 169329 -169879 -317198 -26815 -80610 -198413
9773 -198413 -36785 97183 -57734 10196 -224115 251250 -120299 -130923 -71122 -25383 -29325
9762 -29325 -475613 -9970 -55504 -32924 22047 67003 -67758 211087 -26668 14797 -215844
9750 -228138 -117863 -26196 -36537 -39462 -232406 -159440 -130533 -104413 -83087 -121908 43729
9738 86747 64413 -341481 -642740 72099 52149 13909 118517 72339 -17580 17384 18647
$$ packed form
9820i2075B8438b0208o4037k39370a2323k8390H0779i4681A22324R8309b33349
9808A1807d9490j25697m0513A10679c69908d7869A2168b76944A02069i411B29124
9796F5258a55428o4730f8826m00384A80649b71533k6698C5750a8844E8307L2131
9785I0438L8890L2440J84792c278e06A10865N8464a69879j47319b6815n3795j17803
9773a98413c6785I7183e7734A0196b24115B51250a20299j0624N9801b5383l942
9762b9325m46288i970m5534K2580B2047M4956f7758B11087b6668A4797b15844
9750b28138J10275b6196j0341k925j92944P2966K8907K6120K1326l8821D3729
9738H6747k2334c41481l01259G2099j9950A3909J04608m6178a7580A7384J263
$$ plain form
9727 18647 -11245 -102217 60717 84405 -251497 20278 758 3371 406566 159934 -38120 -348001
9715 -348001 -181548 -464543 -24678 -372168 -15536 -180950 -19528 -57541 -411574 -236380
9705 -236380 -288306 -107569 81553 -191802 24229 -26638 -82141 -384575 204043 -28339 -5568
9693 -80354 -31596 241783 -93838 34558 -267303 96049 -178033 -193460 -188526 278712 -112299
9681 -89485 -264673 -25368 -41772 -400381 157822 -73082 38924 90536 -58842 21231 -579651
9669 -113032 275197 -282851 -102668 -110214 21125 -135765 -277589 -129050 -379008 -141792
9658 141086 -72975 -126379 130155 -216160 -153711 1652 -29582 -199694 -256381 -24666 -145767
9647 -145767 -187987 65367 -179712 -325374 -99723 -260668 -101618 -79277 -55607 264692 -226318
$$ packed form
9727A8647a1245r0972F0717K3688b51497B0278G58K613M03195A59934c8120l09881
9715c48001J66453k82995b4678l47490a5536j65414a9528l8013l54033J75194
9705b36380n1926a07569H1553a91802B4229b6638n5503l02434B04043b8339e568
9693h0354c1596B41783i3838C4558b67303I6049a78033j5427M934B78712a12299
9681h9485j75188b5368j6404l58609A57822g3082C8924N1612e8842B1231e79651
9669a13032B75197b82851a02668p546B1125a35765j41824a29050k49958a41792
9658A41086g2975n3404A30155b16160O2449A652b9582j70112n6687b4666j21101
9647a45767m2220F5367a79712j45662i9723j60945a01618K2341K3670B64692b26318
$$ plain form
9635 156580 -29249 -41483 -321578 -139883 102482 -287418 105103 -265705 11784 90668
9625 90668 -35361 -269744 212218 154396 -314969 220354 -6363 25286 -271073 -9996 -199086
9614 -199086 -107471 31631 -36634 35940 136850 -173739 -196085 169845 -352466 -91295 -93085
9603 -93085 -292346 -92645 317300 -177804 285229 -134725 183084 -6839 77116 85935 125287
9592 125287 71232 7969 -230351 -266839 28802 -145937 -31815 174643 352338 71173 17380
9580 111615 -221836 152413 -120381 -5049 -59267 -211168 1999 -386644 -23093 -340209 -133190
9568 -66271 -136209 -2954 38579 -198788 117972 -171248 -149161 -48592 -71008 -55729 -72764
9557 -72764 -26132 222917 1647 -417151 -86951 197734 -154732 -63390 -157952 139079 113720
$$ packed form
9635A56580b9249j2234k80095a39883A02482b87418A05103b65705A1784P8884
9625I0668c5361k34383B12218n7822c14969B20354f363B5286b71073i996j89090
9614a99086R1615C1631c6634C5940J00910a73739k2346A69845c52466i1295j790
9603i3085j99261i2645C17300a77804B85229a34725A83084f839G7116Q819L9352
9592A25287n4055G969b30351l6488B8802a45937c1815A74643J77695G1173A7380
9580A11615b21836A52413a20381e049n4218j51901A999c86644b3093l17116a33190
9568f6271o9938b954C8579a98788A17972a71248K2087d8592k2416J5279j7035
9557g2764b6132B22917A647d17151h6951A97734a54732f3390r4562A39079k5359
$$ plain form
9546 113720 -193641 -312498 191506 52285 -474220 -245410 276549 -150004 -356657 -52248
9535 -434288 -174458 246842 27023 45726 218098 -445292 -104132 -373794 -153366 61221
9524 -90425 75699 356910 -20854 -437748 20403 38859 160809 49845 -31285 -211322 -62282
9512 -272236 82197 -183087 -58730 -135524 -59830 -109535 -64633 -122026 -169073 11026 -148225
9500 -190585 -181619 179356 86102 93166 -182892 -18995 -54934 115162 15987 47051 -142129
9488 -157719 -191881 -232180 -36672 -81544 218310 -198055 -138179 -217251 -274193 253358 -337226
9476 -41267 -61247 88036 -28114 -299957 -71839 268234 -285539 78778 9715 357324 -141120
9464 216182 -112908 70365 -291108 -124744 67928 -34651 -157508 -179814 -236245 -138843 -99489
$$ packed form
9546A13720a93641j18857A91506E2285d74220K28810B76549a50004k06653e2248
9535d34288a74458B46842B7023J8703J72372d45292a04132k69662a53366F1221
9524i0425G5699K81211b0854m16894B0403J8456J21950D9845c1285j80037f2282
9512b72236H2197a83087e8730p6794e9830m9705M4902n7393m7047A1026a48225
9500a90585Q966A79356H6102P064a82892a8995l5939A15162A5987L1064a42129
9488a57719l4162m0299c6672m4872B18310a98055N9876p9072n6942B53358c37226
9476d1267j9980H8036b8114k71843g1839B68234b85539G8778I715L47609a41120
9464B16182a12908G0365b91108a24744F7928c4651j22857k2306n6431R7402L9354
$$ plain form
9453 -99489 215040 -181029 161917 -201609 107539 71053 -133423 407383 35538 -98275
9442 -183772 -147599 -36852 9777 -48965 -226630 -254578 -262732 209022 -78951 -328384 -203150
9431 -203150 38995 -35980 -75370 -83792 -90654 56261 81956 -80585 -108290 -279034 57708 11390
9418 -285359 337652 -244763 -48677 66509 -34588 -100013 -80689 -106512 -7201 -15482 -253149
9407 -253149 91393 -57290 -129863 -261606 -191711 -208025 -199121 -10820 122278 297922 144190
9395 -161721 -74978 494544 -28480 -40823 53839 132435 -226060 -85637 -68430 95250 -288423
9383 -96165 -126595 -217167 269109 -94552 -134134 206237 -32961 -97903 -231040 -222570 -65948
9371 -47589 -207762 -394904 -150862 -172103 83843 207046 -95170 -170782 -184698 10079 -253836
$$ packed form
9453i9489B15040a81029A61917b01609A07539l6486a33423D07383C5538i8275
9442a83772L6173c6852I777d8965j77665k7948q154B09022g8951k49433J25234
9431b03150C8995c5980l9390q422o862E6261K5695h0585k7705j70744E7708A1390
9418b85359C37652b44763d8677F6509c4588o5425J9324k5823g201q281k37667
9407b53149I1393e7290p2573j31743O9895j6314Q904a0820A22278J75644A44190
9395a61721g4978D94544b8480j2343E3839P8596b26060h5637J7207I5250b88423
9383i6165l0430r0572B69109i4552l9582B06237c2961o4942j33137Q470f5948
9371d7589j60173j87142a50862k1241H3843J23203i5170p5612j3916A0079b53836
$$ plain form
9359 -35104 31754 7273 -183257 70972 220462 -1057 -276481 2777 213134 147076 -326715
9347 216448 -282760 -12453 -2307 -250181 -236291 64530 -59785 -126667 259336 242 -12566 -151172
9335 -151172 -255625 -29292 21359 -282547 296694 -114542 -214617 22917 -100467 -235211
9325 -235211 -109415 -182183 -477577 56509 -5252 -24543 17018 104728 -59418 -226673 97685
9313 -15493 -92703 14137 150686 -361246 -207199 129109 35898 -143544 -176767 -206958 152874
9301 179955 -3734 11446 287445 -17110 15369 -396975 -92798 10212 -182724 -101443 -158829
9290 -158829 -85146 55119 -27610 -34290 -25354 -393837 74108 -178998 -140191 -239416 145355
9278 -199321 -136715 329 215139 -82244 86090 -192433 -117395 -119783 -48992 -175625 91486 -39533
$$ packed form
9359c5104C1754G273a83257G0972J49490a057k75424B777K10357o6058c26715
9347B16448b82760a2453b307k47874J3890F4530e9785o6882B59336B42a2566j38606
9335a51172j04453b9292B1359b82547B96694a14542j00075B2917a00467j34744
9325b35211a09415p2768k95394E6509e252j9291A7018Q7710e9418j67255I7685
9313a5493p7210A4137J36549c61246J54047A29109C5898a43544l3223l0191A52874
9301A79955c734A1446K75999a7110A5369c96975i2798A0212a82724Q1281n7386
9290a58829P3683E5119b7610o680Q936l68483G4108a78998L8807r9225A45355
9278a99321O2606C29K14810h2244H6090a92433P5038k388d8992j26633I1486c9533
$$ plain form
9265 -281329 21795 -252379 25517 59008 -295427 -227769 -32677 51862 -178942 36994 212266
9254 212266 25879 -114181 -143891 -163498 2134 -127144 -226346 -75468 97933 -403558 206238
9242 79740 27876 118372 -141118 -405452 -103873 -243882 144270 -41610 -250188 176324
9231 -213149 -209134 -187275 -154526 -100569 232295 -160025 -29481 -137150 251508 -225088 -513326
9220 -513326 87285 79357 -339559 -122363 -178210 27393 -144797 -180517 -214716 -112359 78223
9208 29805 -271816 -353528 -119802 -34469 -45290 74517 22870 222902 -51508 -53941 -81902
9197 -81902 -63222 21805 -98322 180361 -266072 -206130 -291414 32693 -249129 1668 132987
9186 132987 -201033 39627 -22239 -50438 57028 135074 -87977 -115222 -80325 -74589 -1254 -158889
$$ packed form
9265b81329B1795b52379B5517L3491b95427O7658c2677E1862a78942C6994J75272
9254B12266B5879a14181k9710j9607B134a27144r9202g5468I7933d03558B06238
9242G9740B7876R0496a41118k64334a03873j40009A44270d1610k08578A76324
9231b13149M015K1859L2749N3957B32295a60025b9481j07669B51508b25088k88238
9220e13326H7285p928c39559a22363n5847B7393a44797l5720l4199J02357G8223
9208B9805b71816q1712a19802c4469j0821G4517B2870K00032e1508k433k7961
9197h1902J8680B1805i8322A80361b66072N9942q5284C2693b49129A668J31319
9186A32987b01033C9627b2239k8199E7028P8046h7977k7245L4897N736a254j57635
$$ plain form
9174 -158889 -263646 105493 132906 306541 3223 87029 154445 -100060 -200626 -315919 61717
9162 -141433 72981 -89837 -109168 138882 -34174 -93475 -62454 -60515 -5940 26514 -152112 -128440
9150 -128440 -218821 20134 -293292 30875 -45773 -292226 -305353 -39244 -46486 -31852 -82610
9139 -82610 336129 -268770 -232662 78851 -315535 142767 -517348 294849 -76644 80152 -133758
9127 147233 -87222 147334 -16135 -210009 -270691 -100722 -110468 -162595 -196171 230699 -139124
9115 21207 -107073 -89377 -8250 90943 -146552 20668 146807 24906 -79673 -79302 311314 -289125
9102 3910 -124750 -371935 38978 28284 59715 -129372 -144431 -47451 101286 -298127 -194598
9091 -194598 -344603 32326 131178 -429766 195409 136622 24242 -54272 -66378 -119576 68953
$$ packed form
9174a58889j04757A05493K7413J73635C223Q3806O7416a00060j00566j15293F1717
9162a41433G2981h9837j9331A38882c4174n9301L1021J939e940B6514a52112K3672
9150a28440r0381B0134b93292C0875d5773k46453j3127c9244p242J4634n0758
9139h2610C36129b68770L6108G8851c15535A42767e17348B94849g6644H0152a33758
9127A47233h7222A47334a6135j93874o0682a00722r746n2127l3576B30699a39124
9115B1207a07073J7696h250I0943a46552B0668J26139B4906g9673L71C11314b89125
9102C910a24750k47185C8978j0694L1431a29372j5059d7451A01286b98127J03529
9091a94598j50005C2326R8852d29766A95409n8787B4242e4272j2106n3198F8953
$$ plain form
9079 -63314 -76647 -11450 -213191 86955 -17592 108508 -123930 13507 -290660 -256557 -93182
9067 -185175 63493 -65148 -77977 -141677 -99282 -237395 90425 155306 -22533 -425971 14953
9055 -304054 105962 -11422 -34477 -91401 -228513 45282 12001 89645 30166 -40043 -19855
9043 -229332 -186048 -74415 -338700 75104 -14184 173784 -32269 -416812 -342213 -110357 34906
9031 -135021 -177558 220044 -158410 -87758 158145 57936 -185460 -70316 -391666 198385
9020 -17317 -42474 48515 -118897 -485764 229691 -431846 76404 -25862 28615 89403 -9158
9008 -165247 -161279 46946 -5325 -228666 61219 58030 -180525 24549 529 -94443 60889 -288768
8995 -259573 -70306 64799 -37371 59732 113426 -16242 41100 -217584 -298187 11002 55925
$$ packed form
9079f3314j3333a1450k01741H6955a7592A08508a23930A3507b90660L4103i3182
9067a85175F3493f5148j2829o3700M2395j38113I0425O4881b2533m03438A4953
9055c04054A05962a1422k3055n6924j37112D5282A2001P7644C0166d0043a9855
9043b29332M3284g4415k64285G5104a4184A73784c2269l84543P4599a10357C4906
9031a35021m2537B20044a58410P0652A58145E7936a85460g0316l21350A98385
9020a7317k5157D8515a18897l66867B29691d31846G6404b5862B8615O0788i158
9008a65247L968D6946e325k23341F1219l189a80525B4549E29i4443F0889b88768
8995b59573g0306F4799c7371E9732N3694a6242D1100b17584q0603A1002M4923
$$ plain form
8984 55925 -28638 85720 374099 88782 -143655 -174155 63813 -122756 -162647 27775 -204117
8972 -144220 17149 -80651 -9065 -161845 1181 -310217 -48832 34408 173736 -109360 -85946
8961 -85946 -200595 -154693 -66457 58239 -98498 203743 -88295 -111572 -34609 -124200 161643
8949 -93619 -223417 139946 -115974 -28018 -24190 297052 -45482 -12544 -238043 -156441 -212930
8938 -212930 132995 -120109 -135228 217453 -21643 14684 -190949 -193958 -166179 -2669 -91040
8927 -91040 -182078 253791 190780 504715 12939 19712 195665 267656 286358 370309 116788
8915 -25289 143436 -127143 214090 576281 476904 739976 1536351 2513704 4822648 9489264
8905 9489264 6597237 3775506 2504811 1644945 883632 762688 450341 417677 290260
$$ packed form
8984E5925b8638H5720K88379H8782a43655l0500F3813a22756l9891B7775b04117
8972a44220A7149h0651i065j52780A181c10217d8832C4408J39328a09360K3414
8961h5946j14649M5902f6457E8239i8498B03743h8295k3277c4609q9591A61643
8949i3619j29798A39946a15974b8018L828B97052d5482a2544k25499Q1602n6489
8938b12930A32995a20109j5119B17453b1643A4684a90949l009K7779b669q8371
8927i1040r1038B53791o3011L13935A2939O773J75953P1991J8702Q3951A16788
8915b5289A43436a27143B14090L62191r9377K63072P96375R77353K308944M666616
8905I489264k892027k821731j270695q59866p61313j20944l12347l2664j27417
$$ plain form
8896 290260 325839 -54778 217053 414724 41542 316296 -23925 -277665 18553 118175 96304
8885 96304 -349746 22488 -159009 12654 -479811 105229 -307214 241914 54074 172187
8875 172187 -500624 -200054 -57439 -135857 256857 -62529 177156 107728 -406363 -77081 15455
8863 -29617 -74125 208642 -78285 207885 -111362 205877 179523 -226511 -54868 -67313 161860
8851 -53183 -225550 -290931 -143492 -227806 14445 -196510 -165791 149048 -27730 -117609 -9424
8839 -77774 -182213 6629 -8285 -172767 -72617 -164129 77326 341242 -183890 311042 -15376
$$ packed form
8896B90260L5579e4778B17053J97671D1542K74754b3925k53740A8553R9622k1871
8885I6304c49746B2488a59009A2654d79811A05229c07214B41914E4074J18113
8875A72187e00624b00054e7439p8418B56857f2529A77156o9428d06363g7081A5455
8863b9617m4508B08642g8285B07885a11362B05877k6354b26511e4868j2445A61860
8851e3183j72367o5381a43492q4314A4445a96510L0719A49048b7730q9879i424
8839g7774j04439F629h285j64482g2617r1512G7326K63916a83890C11042a5376
$$ [...]
##END NTUPLES=NMR SPECTRUM
##END=
