
##TITLE=AC1039_TOCA02_5819308_gBNCuQGBMZ
##JCAMPDX= 6.0         $$ Bruker NMR JCAMP-DX V2.0
##DATA TYPE= NMR SPECTRUM
##DATA CLASS= NTUPLES
##ORIGIN= BRUKER
##OWNER= Administrator
$$ 1.72 TOPSPIN		Version 2.1
$$ 2012-03-24 20:16:13.156 -0500  Administrator@TOPSPIN
$$ Compression mode = diff/dup
##.OBSERVE FREQUENCY= 400.13188235
##.OBSERVE NUCLEUS= ^1H
##.ACQUISITION MODE= SIMULTANEOUS (DQD)
##.ACQUISITION SCHEME= undefined
##.AVERAGES= 8
##.DIGITISER RES= 22
##SPECTROMETER/DATA SYSTEM= spect
##.PULSE SEQUENCE= zg30
##.SOLVENT NAME= COFFEE_meoh
##.SHIFT REFERENCE= INTERNAL, COFFEE_meoh, 1, 14.98061
##AUDIT TRAIL= $$ (NUMBER, WHEN, WHO, WHERE, PROCESS, VERSION, WHAT)
$$ ##TITLE= Audit trail, TOPSPIN		Version 2.1
$$ ##JCAMPDX= 5.01
$$ ##ORIGIN= Bruker BioSpin GmbH
$$ ##OWNER= Administrator
$$ $$ C:\Bruker\TOPSPIN/data/COFFEE/nmr/AC1039_TOCA02_5819308_gBNCuQGBMZ/10/pdata/1/auditp.txt
$$ ##AUDIT TRAIL=  $$ (NUMBER, WHEN, WHO, WHERE, PROCESS, VERSION, WHAT)
(   1,<2012-03-24 20:16:04.843 -0500>,<Administrator>,<TOPSPIN>,<go>,<TOPSPIN 2.1>,
      <created by zg
	started at 2012-03-24 20:14:58.250 -0500,
	POWCHK enabled, PULCHK disabled,
       configuration hash MD5:
       1A 1E CE 29 27 FD 77 03 67 4E F0 E3 C4 B2 CB 90
       data hash MD5: 64K
       0A CE B8 96 4D 3D EC DC DD AA CD 70 E0 B9 EF 8A>)
(   2,<2012-03-24 20:16:08.312 -0500>,<Administrator>,<TOPSPIN>,<proc1d>,<TOPSPIN 2.1>,
      <Start of raw data processing
       efp LB = 0 FT_mod = 6 PKNL = 1 PHC0 = 0 PHC1 = 0 SI = 32K 
       data hash MD5: 32K
       C9 A8 63 60 C5 B3 87 AC 05 BC FA F1 C6 75 51 63>)
(   3,<2012-03-24 20:16:08.640 -0500>,<Administrator>,<TOPSPIN>,<proc1d>,<TOPSPIN 2.1>,
      <pk PHC0 = 213.7885 PHC1 = 0 
       data hash MD5: 32K
       54 DC 8C F4 6E 2D 24 C3 E9 CD F7 D6 17 C4 2A B1>)
(   4,<2012-03-24 20:16:08.812 -0500>,<Administrator>,<TOPSPIN>,<proc1d>,<TOPSPIN 2.1>,
      <abs ABSG = 1 
       data hash MD5: 32K
       6A D6 6F 1B 3C E7 71 76 36 EA D0 AC 44 6E 88 85>)
(   5,<2012-03-24 20:16:08.921 -0500>,<Administrator>,<TOPSPIN>,<proc1d>,<TOPSPIN 2.1>,
      <abs ABSG = 2 
       data hash MD5: 32K
       FF 90 4F 47 7C BA 5C 85 53 7F FF CA 1B 17 A0 8D>)
(   6,<2012-03-24 20:16:08.953 -0500>,<Administrator>,<TOPSPIN>,<proc1d>,<TOPSPIN 2.1>,
      <abs ABSG = 3 
       data hash MD5: 32K
       AC EE 1F D0 55 59 AD 18 49 D5 CE 06 6F F4 8A A3>)
(   7,<2012-03-24 20:16:08.984 -0500>,<Administrator>,<TOPSPIN>,<proc1d>,<TOPSPIN 2.1>,
      <abs ABSG = 4 
       data hash MD5: 32K
       4B 88 79 E9 4A 0D E6 F6 EB 04 E7 AC CD 54 DA D8>)
(   8,<2012-03-24 20:16:09.015 -0500>,<Administrator>,<TOPSPIN>,<proc1d>,<TOPSPIN 2.1>,
      <abs ABSG = 5 
       data hash MD5: 32K
       FA 5D 4B 8C 21 33 28 3F 52 79 4B CD B0 1A DC A7>)
$$ ##END=
$$ 
$$ $$ hash MD5
$$ $$ 3B 58 D4 D8 7C E5 8B 6E 6E B8 F0 C6 62 9C CF 13
##$RELAX= 
##$RELAX= 
##$RELAX= 
##$RELAX= 
##$RELAX= 
##$RELAX= 
##$RELAX= 
$$ Bruker specific parameters
$$ --------------------------
$$ [...]
150 150 150 150 150 150 150 150
##$TP07= 0
##$TPNAME0= <>
##$TPNAME1= <>
##$TPNAME2= <>
##$TPNAME3= <>
##$TPNAME4= <>
##$TPNAME5= <>
##$TPNAME6= <>
##$TPNAME7= <>
##$TPOAL= (0..7)
0.5 0.5 0.5 0.5 0.5 0.5 0.5 0.5
##$TPOFFS= (0..7)
0 0 0 0 0 0 0 0
##$TUNHIN= 0
##$TUNHOUT= 0
##$TUNXOUT= 0
##$USERA1= <user>
##$USERA2= <user>
##$USERA3= <user>
##$USERA4= <user>
##$USERA5= <user>
##$V9= 5
##$VALIST= <valist>
##$VCLIST= <CCCCCCCCCCCCCCC>
##$VD= 0
##$VDLIST= <DDDDDDDDDDDDDDD>
##$VPLIST= <PPPPPPPPPPPPPPP>
##$VTLIST= <TTTTTTTTTTTTTTT>
##$WBST= 2048
##$WBSW= 25
##$XGAIN= (0..3)
0 0 0 0
##$XL= 0
##$YL= 0
##$YMAX_a= 537136
##$YMIN_a= -652116
##$ZGOPTNS= <>
##$ZL1= 120
##$ZL2= 120
##$ZL3= 120
##$ZL4= 120
##$ABSF1= 14.98061
##$ABSF2= -5.57192
##$ABSG= 5
##$ABSL= 3
##$ALPHA= 0
##$AQORDER= 0
##$ASSFAC= 0
##$ASSFACI= 0
##$ASSFACX= 0
##$ASSWID= 0
##$AUNMP= <proc_prof1d_extract_pilot.lims>
##$AXLEFT= 0
##$AXNAME= <>
##$AXNUC= <1H>
##$AXRIGHT= 0
##$AXTYPE= 0
##$AXUNIT= <>
##$AZFE= 0.1
##$AZFW= 0.1
##$BCFW= 0
##$BC_mod= 0
##$BYTORDP= 0
##$COROFFS= 0
##$CY= 15
##$DATMOD= 1
##$DC= 0
##$DFILT= <>
##$DTYPP= 0
##$F1P= 0
##$F2P= 0
##$FCOR= 0.5
##$FTSIZE= 32768
##$FT_mod= 6
##$GAMMA= 0
##$GB= 0
##$INTBC= 1
##$INTSCL= 1
##$ISEN= 128
##$LB= 0
##$LEV0= 0
##$LPBIN= 0
##$MAXI= 10000
##$MC2= 0
##$MEAN= 0
##$ME_mod= 0
##$MI= 0
##$NCOEF= 0
##$NC_proc= -8
##$NLEV= 6
##$NOISF1= 0
##$NOISF2= 0
##$NSP= 0
##$NTH_PI= 0
##$NZP= 0
##$OFFSET= 14.98061
##$PC= 1
##$PHC0= 213.7885
##$PHC1= 0
##$PH_mod= 1
##$PKNL= yes
##$PPARMOD= 0
##$PPDIAG= 0
##$PPIPTYP= 0
##$PPMPNUM= 2147483647
##$PPRESOL= 1
##$PSCAL= 4
##$PSIGN= 0
##$PYNMP= <proc.py>
##$REVERSE= no
##$SF= 400.13
##$SI= 32768
##$SIGF1= 0
##$SIGF2= 0
##$SINO= 400
##$SIOLD= 32768
##$SPECTYP= <>
##$SREGLST= <1H.CDCl3>
##$SSB= 0
##$STSI= 32768
##$STSR= 0
##$SW_p= 8223.68421052632
##$SYMM= 0
##$S_DEV= 0
##$TDeff= 65536
##$TDoff= 0
##$TI= <>
##$TILT= no
##$TM1= 0
##$TM2= 0
##$TOPLEV= 0
##$USERP1= <user>
##$USERP2= <user>
##$USERP3= <user>
##$USERP4= <user>
##$USERP5= <user>
##$WDW= 1
##$XDIM= 32768
##$YMAX_p= 472701813
##$YMIN_p= -833497
##$CURPLOT= <Network HP LaserJet P1505>
##$CURPRIN= <$Network HP LaserJet P1505>
##$DFORMAT= <normdp>
##$LAYOUT= <+/1D_H.xwp>
##$LFORMAT= <normlp>
##$PFORMAT= <normpl>
##$SURQMSG= 1
$$ End of Bruker specific parameters
$$ ---------------------------------
##NTUPLES= NMR SPECTRUM
##VAR_NAME=  FREQUENCY,     SPECTRUM/REAL,   SPECTRUM/IMAG
##SYMBOL=    X,             R,               I
##VAR_TYPE=  INDEPENDENT,   DEPENDENT,       DEPENDENT
##VAR_FORM=  AFFN,          ASDF,            ASDF
##VAR_DIM=   32768,         32768,           32768
##UNITS=     HZ,            ARBITRARY UNITS, ARBITRARY UNITS
##FACTOR=    0.250966925370066, 1,           1
##FIRST=     8223.43324360095, -35139,       -33195
##LAST=      0,             55612,           -126957
##MIN=       0,             -833497,         0
##MAX=       8223.43324360095, 472701813,    0
$$ Real data points
##PAGE= N=1
##DATA TABLE= (X++(R..R)), XYDATA
$$ [...]
19457b61096B61015b5126j18368j00453A78251B0146J47677b15329G8155b61249
19446c2312E4569b01884P2930J634j8481j1871m3857d7782I0504c17713a28033
19434d10915J81019i7808j13050A79474b07266A01164b20737i5240m1969B20533
19423a11632B96847c12155R5013L3929H9794f7319q4462c8382j5378b4607k37757
19412b62364n2574J35152A8674K0218a64973N2419l23252A19975d246j40023c4491
19400a17146I3095Q1056H6959c04304A13822b32029C38966e5399d016E4242h5206
19388c31972H9632f7952i855A05772g4561a3775F4343J27017f6554C41465d81269
19376a00056i1k29242k3727k0a4865j25395E8015F916Q4060c92018a64236F874
$$ y = [-261096, 261015, -25126, -143494, -243947, 178251, 20146, 167823, -215329, 78155, -261249, -32312, 54569, -201884, -128954, -127320, -145801, -157672, -201529, -47782, 90504, -317713, -128033, -410915, -229896, -97808, -210858, 179474, -207266, 101164, -220737, -95240, -137209, 220533, -111632, 296847, -312155, -217142, -183213, 89794, -67319, -151781, -38382, -53760, -24607, -262364, -314938, -179786, 18674, 38892, -164973, -112554, -435806, 119975, -4246, -144269, -34491, -117146, 93095, 174151, 86959, -304304, 113822, -232029, 338966, -55399, -4016, 54242, -85206, -331972, 89632, -67952, -9855, 105772, -74561, -13775, 64343, 191360, -66554, 341465, -481269, -100056, -91, -229333, -253060, -253080, -14865, -140260, 58015, 6916, 90976, -392018, -164236, 6874]
19363B3933c67054h3968H5063K04157C0502K13683o2700F155Q433O363L449K29497
19351B53897a19717q0252B10102a29204B14536j06060A0688i0568A7866K13918
19341B31784E9033a36371o3900i5824C55874a6604A55530i358I9903a90950O9220
19330a21730F5047a59681j36768b9652p3895c1618j70330c7488j00780A24863
19319g6511r2371H5799a82002d1893n0454A25967a09731A89382a20206e5513A07951
19307A02127d01777a71043H3955K9965a33037C8368a26103A43265d1300l0108
19297g1408F0701a7171k86476J17256A60315E7039a39299R757L3493l30901C6229
19285b57458O8617F7164c08179g9591p8361D576d567B7967b61894A36405p069
$$ y = [23933, -367054, -83968, 85063, 289220, 30502, 244185, 181485, 6155, 14588, 20951, 24400, 253897, -119717, -199969, 210102, -129204, 214536, 108476, 10688, -90568, 17866, 231784, 59033, -136371, -200271, -95824, 355874, -16604, 155530, -9358, 99903, -190950, -121730, 65047, -159681, -296449, -29652, -103547, -31618, -201948, -37488, -138268, 124863, -76511, -168882, 85799, -182002, -41893, -92347, 125967, -109731, 189382, -120206, -55513, 107951, 102127, -401777, -171043, 83955, 113920, -133037, 38368, -126103, 143265, -41300, -71408, 60701, -17171, -303647, -186391, 160315, 57039, -139299, -129542, -96049, -426950, 36229, -257458, -188841, 67164, -308179, -79591, -157952, 4576, -4567, 27967, -261894, 136405, 129336]
19274A29336k7175c7889A30262a19364M5591j8169j41862L1721c2129j23687N602
19263a50214k8479A2865a00881r885J0964A65904H1979d4388E7575b80523B18652
19251f2426a1248j29744C5382b57278A34288B3323b35861j9868d0052A67157a83283
19239B1114a78530M2090j594B29649A5862c16896j05524c4724B02962d177j47973
19228a52150j48037A17481d83349D8797N469a98035O6406G5987Q9445a00562l630
19217a04192l6025O0120B21861g2833k27303B25758j4963d5707p92J3593C1580
19205a8253k55084b8507j08286B56911F8289b06030k74738a41945j13366c9573
19194G3421R9052j4994c09430a31041K8042l435M4993A41199b47914A64491i8154
$$ y = [129336, 102161, -37889, 130262, -119364, -73773, -91942, -233804, -202083, -32129, -155816, -150214, -178693, 12865, -100881, -110766, -99802, 165904, 81979, -44388, 57575, -280523, 218652, -62426, -11248, -140992, 35382, -257278, 134288, 23323, -235861, -255729, -40052, 167157, -183283, 21114, -178530, -136440, -138034, 229649, 15862, -316896, -422420, -34724, 202962, -4177, -152150, -300187, 117481, -483349, 48797, 54266, -198035, -131629, 75987, 165432, -100562, -104192, -140217, -80097, 221861, -72833, -300136, 225758, 210795, -45707, -46499, -32906, 31580, -18253, -273337, -28507, -136793, 256911, 68289, -206030, -480768, -141945, -255311, -39573, 73421, 172473, 157479, -309430, -131041, -102999, -106434, -61441, 141199, -247914, 164491, -98154]
19182a13857j54975j86935b17559a7428A3111e9011k0050F5091J45490b500j22493
19171a24993j15347K4475k14735E3584a85295n0585J2446a5666j96499f6993n2250
19160a19243B61445c03626A4819L00249j22980r5314d1036A21809a62380I1736
19149a35883j01502d286E6113b31414M9328j17090J47642A8323h1528a4552A00551
19137B51498G5271a78822A8761b29140J11208q1918d5619j54884i6219j9354I0525
19125a06189j78831R2103j7180B15407b42277e9366a6725b913j0673k63534a22491
19113B3219K7562B0271c65758f0457H3451b46835R6233j66854A33355C742a29190
19101b74027Q7854P8760q6395h8284k19631a45616f1505o0823K8981H2035a03797
$$ y = [-113857, -268832, -455767, -217559, -17428, 13111, -59011, -79061, 65091, 210581, -2500, -124993, -240340, -215865, -430600, 53584, -185295, -235880, -223434, -15666, -212165, -66993, -119243, 261445, -303626, 14819, 315068, 192088, 96774, -41036, 121809, -162380, 91736, -135883, -237385, -4286, 56113, -231414, -182086, -299176, -151534, 18323, -81528, -14552, 100551, 251498, 75271, -178822, 18761, -229140, -117932, -199850, -45619, -200503, -96219, -115573, 90525, -106189, -285020, -192917, -210097, 215407, -242277, -59366, -16725, -2913, -13586, -277120, -122491, 23219, 50781, 20271, -365758, -60457, 83451, -246835, -150602, -317456, 133355, 3742, -129190, -274027, -186173, -107413, -193808, -88284, -307915, -145616, -61505, -122328, -93347, 82035, -103797]
19089A4297J67754a16539F6135a70321g1189J7589k1035k50404d0150B01429a35987
19077c67372g0430D18497g5083B66584b73336j98869K10395a08854K555A02747
19066a49573L1661e0374B87690b2503j05498B70669H8622H699b72527a07866m882
19055a12748k56142F8015P2841a04143E3075a51251B77281c78241B45400e5194
19044h9010D2517h3058j49935A12479c59725l7594h0181j38077I3371b83910A10778
19032A13744G846b85400a7894n0851I6516a63580B10337a74270l1581a6582j93366
19021b09948j3470J09508d96j20261D20912J2522A52983b42915A25742m0256O6429
19010A51915b3114A42383m7374M0853P6334h9850j81577A94928B2968K76562c08145
$$ y = [14297, 182051, -116539, 66135, -170321, -71189, -53600, -74635, -325039, -40150, 201429, -135987, -367372, -70430, 418497, -75083, 266584, -273336, -472205, -261810, -108854, -106299, 102747, -149573, -117912, -50374, 287690, -22503, -128001, 270669, 88622, 8699, -272527, -107866, -112748, -368890, 68015, 140856, -104143, 53075, -151251, 277281, -378241, 245400, -55194, -89010, 42517, -83058, -232993, 112479, -359725, -397319, -80181, -218258, 93371, -283910, 110778, 113744, 7846, -285400, -17894, -68745, 96516, -163580, 210337, -174270, -205851, -16582, -209948, -223418, -113910, -496, -120757, 420912, 433434, 152983, -242915, 125742, 85486, 151915, -23114, 142383, 95009, 135862, 212196, -89850, -271427, 194928, 22968, 299530, -308145]
18998a3949l06171J7106D20544j60494a13521o3257a0570A52415F5810a73695
18987H1806M8769B4374N3363a91307k69532D7928K27979a57061e1404A28024e6035
18975a1007C75811C0334a06019m9042c8212l34617a82755B05174a22185m4A77711
18963B36440b16895h5030A21033O5219P191K48104J27828k38000j65242a04251
18952e3587o5408A1493R265d22325a69425I5350a27270C32535a06558A13944b01426
18940B13140J3391b31886C9507J6959P5247m5388l0113b31460c974j53214m4677
18929b01865B05058b92506J41503B10988B5604K86675C481b11536R9639C9268
18918a20111p6030b4386p1011D8982i5089E0127K31372a8910A91718A6025M4431
$$ y = [-13949, -320120, -303014, 420544, 260050, -113521, -176778, -10570, 152415, 65810, -173695, 81806, 130575, 24374, 77737, -191307, -460839, 47928, 275907, -157061, -51404, 128024, -56035, -11007, 375811, 30334, -106019, -155061, -38212, -372829, -182755, 205174, -122185, -122229, 177711, 236440, -216895, -85030, 121033, 186252, 193443, 441547, 569375, 331375, 166133, -104251, -53587, -118995, 11493, 20758, -422325, -169425, 95350, -127270, 332535, -106558, 113944, -201426, 213140, 226531, -231886, 39507, 56466, 131713, 86325, 56212, -231460, -3974, -157188, -201865, 205058, -292506, -151003, 210988, 25604, 312279, 3481, -211536, -111897, 39268, -120111, -196141, -24386, -95397, 48982, -95089, 50127, 281499, -18910, 191718, 16025, 60456]
18907F0456C0197a36984G7503M2353c05923C45833b10502i7101A39510N8143a2458
18895H4016K9117J86003M05654H3584J24587I8591J37553F3582j681b59084a9645
18883B5900J24864F9668f5602j49352j34666c2843A86194i3203C64183g3147J1374
18872f1773C84017c30374A5435b77525k58377a43268g0906C5599Q4591M1278a09947
18860a47085b4159j17397j60872l1613J60059G9741K9633A3735b29093j24292
18850c53385G4549d12866J93034a44j86988B59878E4967O9361M0556b0015O271
18839a3744A55484h0517I5322a7470m03978J86739a3432D5638L4304C8186J18747
18828A56933a36069O891C7301h0789H1610b25409A8003b26106d6487A78968b49373
$$ y = [60456, 30197, -136984, 77503, 119856, -305923, 345833, -210502, -97101, 139510, 197653, -12458, 84016, 113133, 299136, 704790, 83584, 208171, 98591, 236144, 63582, 61901, -259084, -19645, 25900, 150764, 69668, -65602, -214954, -349620, -32843, 186194, -93203, 364183, -73147, -61773, 384017, -330374, 15435, -277525, -535902, -143268, -70906, 35599, 120190, 161468, -109947, -147085, -24159, -141556, -302428, -334041, -173982, 79741, 109374, 13735, -229093, -353385, 74549, -412866, -219832, -144, -187132, 259878, 54967, 124328, 164884, -20015, -13744, 155484, -80517, 95322, -17470, -421448, -234709, -13432, 45638, 79942, 38186, 156933, -136069, -129178, 37301, -80789, 81610, -225409, 18003, -226106, -46487, 178968, -249373]
18816a97231l5468A26296N3838Q9263i1476B01375B2882f9681k70885A19171B3299
18804b96955d8972B8839i7818A2265b91712b6279k3362B61450r5339a94667B78805
18792A59049i0408B22412G2584d295k18833A43966D5917b80318A44342O4732B5945
18780a1564l81884E4487a9474F3139b9455i949k15550A8409a89568j65816A54420
18768A52799D6301K48144A45246a45418C9411d51F7984K9121b6881A06869a41901
18756a56071H0163K9938a21680A9439J08245a24105l08184N4980C42053a47117
18745B8752c16176J7803H6267b2987B85275e9972H7167P4485c7940k20113A70967
18733b24749g5345A86788I0272J31238D4078O2578b1217k49483B26027c42878
$$ y = [-197231, -232699, 126296, 180134, 269397, -91476, 201375, 22882, -69681, -340566, 119171, 23299, -296955, -48972, 28839, -97818, 12265, -291712, -26279, -49641, 261450, 166111, -194667, 278805, 159049, -90408, 222412, 72584, -4295, -223128, 143966, 45917, -280318, 144342, 209074, 25945, -11564, -393448, 54487, -19474, 63139, -29455, -9949, -225499, 18409, -189568, -355384, 154420, 152799, 46301, 294445, 145246, -145418, 39411, -451, 67984, 97105, -26881, 106869, -141901, -156071, 80163, 110101, -121680, 19439, 127684, -124105, -432289, -377309, 342053, -147117, 28752, -316176, -298373, 86267, -22987, 285275, -59972, 87167, 161652, -37940, -258053, 170967, -224749, -75345, 186788, 90272, 221510, 44078, 106656, -21217, -270700, 226027, -342878]
18722B36432c07885J34780J35I9865a02391E3289K30020a359j61729A11237g5522
18710b96339A78890q2069C3504d68198b03032F5319b02503b115B2907f5269k0661
18699h5930K7034j95178r2643a04928j31930c3969A01313b40578f7184B3409K15223
18688B38632C2156a15824B64394f6701J7379k30612a22386E6344a01070K8083
18678g2987a1881j02707j64812d7357a605B6784h0108J4618j24253a1400j13356
18667a24756a369p7151k17990D3761b30395F4474A0823g0394j74496L428p2708
18656c14170m1590A02759I825a84867i044q2694k1040f994k9228l6884K8732a8201
18643g7653H0934c17947a2244m5470m7023b7030k01591B26516b13613j17470J40686
$$ y = [236432, -307885, -173105, -172970, 99865, -102391, 53289, 283309, -1359, -163088, 111237, -75522, -296339, 178890, 96821, 33504, -468198, -203032, 65319, -202503, -2115, 22907, -65269, -85930, -58896, -254074, -346717, -104928, -236858, -33969, 101313, -240578, -67184, 23409, 238632, 32156, -115824, 264394, -66701, -49322, -279934, -122386, 56344, -101070, -72987, -11881, -114588, -279400, -47357, -1605, 26784, -80108, -65490, -189743, -11400, -124756, -1369, -78520, -296510, 43761, -230395, 64474, 10823, -70394, -244890, -241462, -314170, -355760, 102759, 9825, -184867, -9044, -91738, -112778, -6994, -36222, -73106, -44374, -18201, -77653, 80934, -317947, -12244, -57714, -104737, -27030, -228621, 226516, -213613, -331083, -190397]
18632a90397H313O1187k4163a7412K072q3856D1696i3578p2225m0179A43641B6671
18619B10513c4678p123j06595k90655B1249e5007B0906J75109a29258o8986A00578
18607c04808O9999e2890H5962J20545b85287b2097k15829a15829e4059B067b61528
18595h2282A21261c12655P0670Q6946C5187c62890g3632E6173a5804j77568c8609
18583B22759H7647d24479H7397i4950A90879f9595G4524j4762f7508C77161a81452
18571d53290B1563J07863j6420a95484M3978k2278E0864b4999d376n7580l13717
18560c75673b5955J0991l65956C35695B8731b18020j6978c6783j16047H423J36051
18549A44474a05486A55956n9997a1625G1025a22444N2334I3298e4990n0623L762
$$ y = [-190397, 8313, 69500, 45337, -17412, -15340, -99196, 41696, -93578, -165803, -205982, 143641, 26671, 210513, -34678, -41801, -148396, -439051, 21249, -55007, 20906, 196015, -129258, -198244, 100578, -304808, -234809, -52890, 85962, 206507, -285287, -22097, -237926, -115829, -54059, 2067, -261528, -82282, 121261, -312655, -241985, -155039, 35187, -362890, -73632, 56173, -15804, -193372, -38609, 222759, 87647, -424479, 87397, -94950, 190879, -69595, 74524, 59762, -67508, 377161, -181452, -453290, 21563, 129426, 113006, -195484, -151506, -173784, 50864, -24999, -4376, -61956, -375673, -25955, -14964, -380920, 335695, 28731, -218020, -234998, -36783, -152830, 8423, 144474, -105486, 155956, 95959, -11625, 71025, -122444, -70110, 93298, -54990, -105613, -101851]
18538a01851A20540C2181L0629j0205k1911J7079a81168L3249P789B07738c607
18526d2441o6884k82540B21348a02541q838e4177A01801b70122k0105a0468k56874
18515b67342q431c2066l8119K3052J7477B21765B7583c0604A89185n5736J07070
18504B40519D1602J93622c53313J68400e4626A65732J69520a15366G4276R1479
18494A65755J43167c17981a07166D9112J7562b61704b208r9814l3791G8401J28725
18483B07126a41055f2417j72803a00680j45521N2856M6056j18304J30994a9700
18472D0237A3669J65334G6690k1008h0525B5476b37689A67198h1973B92027a65232
18460h7366F8742J34408b39541A05693J79925A15221J5071Q8536a29205B98646
$$ y = [-101851, 120540, 32181, 62810, 52605, 30694, 47773, -181168, -147919, -140130, 207738, -3607, -42441, -109325, -391865, 221348, -102541, -111379, -54177, 101801, -270122, -290227, -10468, -267342, -275773, -32066, -70185, -47133, -29656, 221765, 27583, -30604, 189185, 133449, 240519, 41602, 235224, -353313, -184913, -54626, 165732, 335252, -115366, 74276, 165755, 308922, -317981, -107166, 49112, 66674, -261704, -2208, -102022, -135813, 78401, 207126, -141055, -62417, -235220, -100680, -246201, -193345, -147289, -265593, -134599, -19700, 40237, 13669, 179003, 76690, 55682, -80525, 25476, -237689, 167198, -81973, 292027, -165232, -87366, 68742, 203150, -239541, 105693, 285618, 115221, 130292, 218828, -129205, 298646]
18449G0087b45377d5143A1284e6450r2398N7838A67063e6801A85389A8880J12438
18438A31318d19814C3875M971P1035L07903B7747O8158b01253D10945h5507j42669
18427b28176H4742G972a10809k2614A16269N9459p5054b43344B68406E8799b92813
18415b03082g1863m6216n4122g5836H6993a09283B3794a71777k01213d8507k987
18404e1494m6352M5166A41359a24767m3837k7711K7782A59511J387b03618k1268
18393b24886a7136j27406B36884b8356m4857L0196E4347J21943f3835A42102b81357
18381a10630A22841J94014B8258h9554l15687d6826k0734B6624a94803A70261
18370c04429D3209K3526J93996c56738d0443a2370A52831F9907b0643A05087l5782
$$ y = [70087, -245377, -45143, 11284, -56450, -148848, -91010, 167063, -56801, 185389, 18880, 131318, -419814, 33875, 38846, 109881, 417784, 27747, 95905, -201253, 410945, -85507, -228176, 84742, 7972, -110809, -133423, 116269, 175728, 100674, -243344, 268406, 58799, -292813, -203082, -71863, -118079, -172201, -75836, 86993, -109283, 23794, -171777, -372990, -48507, -51494, -97846, -52680, 141359, -124767, -168604, -196315, -168533, 159511, 160898, -203618, -224886, -17136, -144542, 236884, -28356, -73213, -43017, 54347, 176290, -63835, 142102, -281357, -110630, 122841, 316855, 28258, -89554, -405241, -46826, -67560, 26624, -194803, 170261, -304429, 43209, 66735, 260731, -356738, -40443, -12370, 152831, 69907, -20643, 105087, 69305]
18359F9305P9944a9258K504j73819I060h7678A96319g8059C1911a73041B47151
18347e15594a70778C69044d7407d093H8334R8251b45899C6641i3518l2309K0564
18336a05263A89420a61879c7785j18964p0095A22676J08019a39551j28981A21502
18325a00773B27540B7332a93359j13972B24929a45416k46881A98910P7462c6979
18314b26893N1096b6493A52019p1540a13527q4825L4714O8261p8484M0779H3757
18302a21297A79893a66941A80917e73816a28949k55373J66639e8806p2135K5913
18292a05028A01728d2557B48183a14048A56940K13143F4151J54603c83157H7592
18281a15736l6362G0744g1457k6801B46454d4756j31911c1610k52636I0318j6567
$$ y = [69305, 149249, -19258, -16754, -190573, 9060, -87678, 196319, -78059, 31911, -173041, 247151, -515594, -170778, 369044, -47407, -4093, 88334, 186585, -245899, 36641, -93518, -125827, -105263, 189420, -161879, -37785, -156749, -226844, 122676, 230695, -139551, -268532, 121502, -100773, 227540, 27332, -193359, -307331, 224929, -145416, -392297, 198910, 276372, -36979, -226893, -175797, -26493, 152019, 80479, -113527, -198352, -163638, -95377, -173861, -133082, 83757, -121297, 179893, -166941, 180917, -573816, -128949, -384322, -217683, -58806, -130941, -105028, 101728, -42557, 248183, -114048, 156940, 370083, 64151, 218754, -383157, 87592, -115736, -152098, 70744, -71457, -98258, 246454, -44756, -176667, -31610, -284246, 90318, 73751]
18270G3751O1265K0380g2302B75083j22061a49030O5571k1557C9132a55629f7645
18258a8466k72428c1830A6387c12411d8879n515l6793p6906J1989P0768n1421
18247a36757B16656a90824E508c06896a3980j49825A23957N2813a1871A44341
18236d9633J4048A1178a85128k6079R8786c7274A96739b8890A73156q0930b00997
18224c12138i5089q9410F4509B2437J55107B5521K38526a48466j73460J58081
18214a63845j04109I2414a46333L6845B000a2952A981i0556k09650H9256b67194
18202A9149J74261a07664J9507C65952a51046C28625A10567a15917k910M8548
18192g0279A89544d3586a7332k79798A87807b1989k8507A44744d4060F8130a9084
$$ y = [73751, 135016, 155396, -72302, 275083, 153022, -149030, -83459, -105016, 39132, -155629, -67645, -18466, -290894, -31830, 16387, -312411, -48879, -54394, -91187, -168093, -156104, -85336, -136757, 216656, -190824, 5508, -306896, -13980, -163805, 123957, 176770, -11871, 144341, -49633, -35585, 11178, -185128, -211207, -112421, -37274, 196739, -28890, 173156, 92226, -200997, -312138, -95089, -184499, 64509, 22437, 177544, 25521, 264047, -148466, -321926, -163845, -267954, 92414, -146333, -109488, 2000, -12952, 1981, -90556, -300206, 89256, -267194, 19149, 193410, -107664, -88157, 365952, -151046, 328625, 110567, -115917, -118827, -70279, 189544, -43586, -17332, -297130, 187807, -21989, -50496, 144744, -44060, 68130, -19084]
18180a78646p4233a8325j76447L1877A62951d9987j39072R3617a8098B29324a06667
18168C81099f711k95849A13634K31753p5313a51670k8279A6585b54680j25110
18158c79790O7873A37624O9624O6171b22209G4235j0794M8162B6751L4917B8365
18146G8244a71082A21159B0278J77749a23951A05174R6055G8913K78774p0990
18136B86697c29637A06820B7215J97236b375j96848h1241n2370k17857h825A20859
18124B65329c3466j7676k2038B4349A1975b66938C0943c1052o7878b9529r8284
18113a27813A9237L2464K06767l762b51159A0533N5668b63109K6442R4901c9206
18101c07025R2005A12153f7805j90419h0582n0505j36163a01270B42292a03474
$$ y = [-178646, -252879, -18325, -194772, -162895, 162951, -49987, -189059, -95442, -18098, 229324, -106667, 381099, -6711, -302560, 113634, 345387, 270074, -151670, -179949, 16585, -254680, -379790, -311917, 137624, 207248, 273419, -222209, 74235, 63441, 111603, 26751, 61668, 28365, 78244, -171082, 121159, 20278, 198027, -123951, 105174, 201229, 78913, 357687, 286697, -329637, 106820, 27215, 224451, -2375, -199223, -81241, -133611, -351468, -8825, 120859, 265329, -33466, -51142, -73180, 24349, 11975, -266938, 30943, -31052, -98930, -29529, -127813, 19237, 51701, 258468, 254706, -251159, 10533, 66201, -263109, -236667, -141766, -39206, -307025, -215020, 112153, -67805, -258224, -80582, -131087, -267250, -101270, 242292, -103474]
18090F7774a06967F8699b80262L8495b9730B37684j15697j6538J27414B889b21681
18078F7116b1099B79072a25503c9055a5743E2471K30095f3205n3587P154j9013
18067a28651C46497b15639C58570A35506A049a14449G8552J19534G6821e636j4218
18056a9854C4646b86066D02388A89060a7643C71976A02298m2633a6993A40026
18045i4473A42182a02168d588B20408E9869h6558l21410B25510g8406A54148E8250
18033f3109k2931E5324P9999J6697b7474l40769g2679j05137a4378G2859P5569
18022A48428g2980j05089K8717C29970a73761O3380c5930p44B73626m5052L2719
18011B61293Q9962b56540K7316G8467j8661k1258J87970o5058J14038A25534b25637
$$ y = [67774, -106967, 68699, -280262, -241767, -29730, 237684, 121987, 105449, 232863, 2889, -221681, 67116, -21099, 279072, -125503, -39055, -15743, 52471, 282566, -63205, -116792, -109638, -128651, 346497, -215639, 358570, 135506, 1049, -114449, 78552, 198086, 76821, -5636, -19854, 34646, -286066, 402388, 189060, -17643, 371976, 102298, 59665, -16993, 140026, -94473, 142182, -102168, -4588, 220408, 59869, -86558, -407968, 225510, -78406, 154148, 58250, -63109, -86040, 55324, 135323, 152020, -27474, -368243, -72679, -177816, -14378, 72859, 148428, -72980, -178069, -149352, 329970, -173761, -110381, -35930, -36674, 273626, 228574, 261293, 351255, -256540, -229224, 78467, 59806, 38548, 226518, 161460, 275498, 125534, -225637]
17999G295J20579K22889a42311D75479F6960b16448P176O6790k61044B31518a1945
17987D9193K69016n4158a80972e0194j70820B0487F721a24886A4318b39996M5522
17976a94474l8956j70244C51423A52077a04754A6052a52901d3832j74281K603
17966b15510O5912d5344k38077j12464J05416b0119A92734J29622a40806O5910
17956g4896J8901J8644j56779G1191a24053n2781j66260A32358j5831h844k13350
17945b22194c7321j37576B16479b45108B17020a05545n9265B95414B1604J37751
17935A59355K23872A2195N4329J40772a30228e3407F4243a34636B35919F1785
17924B07108d0835B75393H0993e9114D9027J1989J34041A5414K9621J18398H1713
$$ y = [7295, 127874, 350763, -142311, 475479, 66960, -216448, -209272, -142482, -403526, 231518, -11945, 49193, 318209, 264051, -180972, -50194, -221014, 20487, 6721, -124886, 14318, -239996, -194474, -233430, -403674, 351423, 152077, -104754, 16052, -152901, -43832, -218113, -215510, -149598, -45344, -283421, -395885, -290469, -20119, 192734, 322356, -140806, -74896, -55995, -37351, -194130, 71191, -124053, -176834, -343094, 132358, 116527, -8844, -222194, -37321, -174897, 216479, -245108, 217020, -105545, -164810, 295414, 21604, 159355, 383227, 12195, 66524, 207296, -130228, -53407, 64243, -134636, 235919, 61785, 207108, -40835, 275393, 80993, -59114, 49027, 61016, 195057, 15414, 45035, 163433, 81713]
17912A54052F9786c94821f3438A95158c28656J32578j84349b6961C9720L64569
17902D04289C9205J78042D9877a16847A04194O2592f1930j67266I7424g1847C3275
17890A60835o1977C3115d0849q6378H0316m201J40508e8523a2773A19202n8072
17879F1130b6023A45072E5386b34336J05399F2945O2634i4520C8641e5326j6692
17868g2018C17911G0728P847j7902B8970N2535R9512a36778B7553I77a68899C81136
17855a39353E5043J20129C4871J7825J6351J37548F7559N0641h8057H3589M3528
17844A27117a277k88144h0418G5381a35789E30359C026Q3820P8820e6065l57551
17833d13616a87926e6671A82529o7134a9728A05660K48513A17153L4707p920b90822
$$ y = [154052, 69786, -394821, -63438, 195158, -328656, -196078, -380427, -26961, 39720, 404289, 39205, 217247, 49877, -116847, 104194, 166786, -61930, -229196, 97424, -71847, 33275, 160835, 98858, 33115, -40849, -127227, 80316, 76115, 216623, -58523, -12773, 119202, 61130, -26023, 145072, 55386, -234336, -128937, 62945, 125579, -94520, 38641, -55326, -72018, 317911, 70728, 78575, 60673, 28970, 81505, 181017, -136778, 27553, 977, -168899, 381136, -139353, 55043, 175172, 34871, 52696, 69047, 206595, 67559, 118200, -88057, 83589, 127117, -1277, -289421, -80418, 75381, -135789, 530359, 3026, 86846, 165666, -56065, -413616, -187926, -56671, 182529, 115395, -19728, 105660, 354173, 117153, 151860, 143940, -290822]
17821F470K15289o6518C6557b75469C7446L5218J7250O709C5383f8396A18721
17809e9731E1998h8192B6998L04401A09667a41900B50963a62372r8554A44790
17798a13698B15996c8048H3010b94820A97597g08C16600j17588a33190j02230
17788b35420B24952H9771J35670a25950o4374c5740D64862B30591f9455C39296
17777a4422D07062A64867a12353hH7261K76439A72287b03683C3133i4011r844
17766a03855o3104k27614c1178A39483o7465J15740e8559H0019b38973P5788e542
17754A76164J81895D6238h6286r7910I7375l2045p403M12160B25755K8729L3976
17743B88460E1060K68023j7949f1806i978C13102H6237a13296C61924F4534N6888
$$ y = [6470, 221759, 155241, 36557, -275469, 37446, 72664, 89914, 96623, 35383, -68396, 118721, -59731, 51998, -88192, 26998, 331399, 109667, -141900, 250963, -162372, -260926, 144790, -113698, 215996, -38048, 83010, -294820, 197597, -708, 316600, 199012, -133190, -235420, 224952, 89771, 225441, -125950, -190324, -35740, 464862, 230591, -69455, 339296, -14422, 407062, 164867, -112353, -8, 87261, 363700, 172287, -203683, 33133, -94011, -103855, -166959, -394573, -31178, 139483, 72018, 187758, -58559, 80019, -238973, -163185, -5542, 176164, 358059, 46238, -86286, -184196, 97375, 65330, 57927, 470087, 225755, 254484, 288460, 51060, 319083, 301134, -61806, -9978, 313102, 86237, -113296, 361924, 64534, 121422]
17732A21422J7413b2197C00392G1758a89712I8732e1615j17233A56985i7202M4270
17721e2932A85112a62365K8502E2019K53783B0510a42315G3931Q3269A3690a15931
17709a32124F6968J75595a38816A85387a1509j8253D145L18624Q5592G5330o268
17698F9062k584J62944f6070p9449D1634c211E06519A14250K1972l5413M08256
17687E09065I4973L7278f651A77118i5517d1058d572A53040a18564d8814F416
17675a17593B31247K7032C9611i9228A04180b47939Q129A43242a63144Q1367E7534
17663b9725A01963l3103K0670B3653a38916A78021p773Q7197A9408c44115I1428
17651A283L04542b42627B2856a02195F0208K39027J17090l9348m7702a05717B677
$$ y = [121422, 138835, -22197, 300392, 71758, -189712, 98732, -51615, -168848, 156985, -97202, -52932, 185112, -162365, -133863, 52019, 305802, 20510, -142315, 73931, 157200, 13690, -115931, -132124, 66968, 242563, -138816, 185387, -11509, -29762, 4145, 322769, 408361, 75330, 69062, 66478, 229422, -66070, -145519, 41634, -3211, 506519, 114250, 136222, 100809, 509065, 94973, 132251, -6651, 177118, -95517, -41058, -4572, 153040, -118564, -48814, 6416, -117593, 231247, 258279, 39611, -99228, 104180, -247939, -239810, 143242, -163144, -81777, 57534, -29725, 101963, 68860, 89530, 23653, -138916, 178021, 170248, 257445, 19408, -344115, 91428, 1283, 305825, -242627, 22856, -102195, 60208, 299235, 416325, 376977, 329275, -105717, 2677]
17639I083O0512K12198p5515P9620A5342e3508A91181J2244P7316N661A34260
17627B00077o5027i8193D4538h9374B2742a79388i767k0397l6159n1115A79664
17615B60916c3117B87700b249C76690A27141c3426A49978M0637o4279K1434E1393
17603A63416a5402m16698C34643j4820F2537N8980d3112B37534a06774B67497
17592A44969a7909D8359L32790I1331K40614K04382j56968I3565K38477a229j91577
17581a92806C33482Q7598a21685b5750E4039a955F9092d3191A70272E1130K07415
17570B58545G2084K99308f6775I3807K04470D9801P7839l8710J88740G4055l4479
17559C9576a70496C36048q7099L9933K6638k8615E6410O0171a40015O0834A23076
$$ y = [9083, 69595, 281793, 206278, 285898, 15342, -53508, 191181, 203425, 280741, 286402, 134260, 200077, 135050, -98193, 44538, -89374, 22742, -179388, -9767, -30164, -66323, -117438, 179664, 260916, -33117, 287700, -2249, 376690, 127141, -33426, 149978, 190615, 126336, 147770, 51393, 163416, -15402, -432100, 334643, 319823, 62537, 121517, -43112, 237534, -106774, 267497, 144969, -17909, 48359, 381149, 91331, 331945, 536327, 379359, 93565, 332042, -1229, -192806, 333482, 421080, -121685, -25750, 54039, -1955, 69092, -43191, 170272, 51130, 258545, 72084, 371392, -66775, 93807, 298277, 49801, 127640, 88930, 277670, 74055, 39576, -170496, 336048, 248949, 288882, 315520, 286905, 56410, 116581, -140015, -79181, 123076]
17547b17080H1056a15146A87867J60140F5663a45240B74855J49955C6874L1568
17537F8442J67710b5304a0151A52512L7626J04581b9147C08512r0714J97812j66694
17526B48916r4014J16312j25076K6113J47883M37638k84983j33542j16697R9619
17516C22169N6767A40972J39980Q8361N06034l52389L17029K62335j90240L08867
17506A220949n33014E4335Q4296K42064r5996M02188k75551l1323K85420j49720
17496E15713P1981J83876j12413J54807j80307J97524l57963L32581A03937J86967
17486B90904K29660o5660A89871P9378Q1166A35221K87145O3628j86604M5997
17476C45387A28098A5815L97259j66380P9262A58802N6700D5971K60427M66469
$$ y = [-217080, 81056, -115146, 187867, 348007, 65663, -145240, 274855, 424810, 36874, 68442, 236152, -25304, -10151, 152512, 190138, 294719, -29147, 308512, 217798, 415610, 248916, 154902, 271214, 146138, 172251, 320134, 757772, 472789, 339247, 222550, 322169, 378936, 140972, 280952, 369313, 875347, 522958, 839987, 1102322, 912082, 1220949, 687935, 54335, 138631, 380695, 284699, 686887, 411336, 380013, 665433, 515713, 587694, 771570, 659157, 813964, 633657, 831181, 473218, 805799, 103937, 290904, 520564, 454904, 189871, 269249, 350415, 135221, 422366, 485994, 299390, 345387, 128098, 15815, 413074, 246694, 325956, 158802, 215502, 45971, 306398, 772867]
17466G72867B86296N1283N6870o8230I404j559N96825B24327M4317I1590J64840
17455B56430K68473k27893A37001M18877k26677o0859A26041a0561A33963J90301
17445C24264K88882k92605J40030j72158j0744J58726k6723j15843J89545k34365
17435B49009J23947p9304J44272j85493L38942H6287K23376M2484j08568J77832
17425D21411p5271J45282j86066L4570J23940M0649k04734R3979r3025j08393
17415A92342E1683M03050A46335L7582o2515L30466r2252a00859C56867J26712
17405D83579j98516L7490r6910o8785L34825j08847A03381M22338k03611K35962
17395E58070j15568r5197j25692K15542A08136J70787C4584K83218q9010i021
$$ y = [772867, 286296, 337579, 394449, 326219, 9404, 7845, 604670, 224327, 268644, 91590, 256430, 524903, 297010, 137001, 555878, 329201, 268342, 126041, -10561, 133963, 324264, 613146, 320541, 460571, 288413, 277669, 436395, 409672, 293829, 483374, 249009, 372956, 293652, 437924, 252431, 591373, 86287, 309663, 352147, 243579, 421411, 346140, 491422, 305356, 339926, 463866, 504515, 299781, 393760, 300735, 192342, 51683, 454733, 146335, 183917, 121402, 451868, 359616, -100859, 356867, 483579, 285063, 322553, 225643, 156858, 491683, 382836, 103381, 525719, 322108, 558070, 442502, 347305, 221613, 437155, 108136, 278923, 34584, 317802, 228792, -9021]
17384A72416J38903q2065n2359J00571q78J3398a4917A18424J05325A04150N46082
17373F50232B13207k5958R6009m7793q7542M36972B85898O9611A71923l2441K69619
17362D09101G4745M22058k16912d5121C51707q7666f6709D17904B02418q5644
17352A16774K84589B4583M84631j89804j30168B3839b87778C32589A47038P94
17342A47832Q2217G6091L52689M200j51003K7769A49668i9901L7469C26480q783
17331C17697J3011m6929J58465N2273k32727j03309J17835H5042K51672j9806
17321C16908k0416N0985j13104D5052N59537k30988K4718P3439E7608L85885j28475
17310C15018J18800j90127K08506B6936o955L98852H8215L09005A81273M2569
$$ y = [172416, 311319, 229254, 176895, 277466, 276588, 289986, -14917, 118424, 223749, 104150, 650232, 213207, 187249, 283258, 235465, 147923, 584895, 285898, 355509, 171923, 139482, 409101, 74745, 496803, 279891, -45121, 351707, 264041, -66709, 417904, 202418, 116774, 401363, 24583, 509214, 319410, 189242, 23839, -287778, 332589, 147038, 147832, 230049, 76091, 428780, 432980, 281977, 309746, 149668, -99901, -62432, 326480, 317697, 330708, 283779, 442244, 494517, 261790, 158481, 276316, 85042, 336714, 316908, 296492, 347477, 234373, 45052, 604589, 373601, 398319, 471758, 57608, 443493, 315018, 433818, 243691, 452197, 26936, 19981, 418833, 88215, 397220, 181273, 223842]
17300B23842K38092H7259A1015J26115K6001K14903j6141j63301J41523j65146
17290A74969O5141J43824A86371L02212j57810q9040J32264j40651r4389K254
17280A41211N67296C23043J40766A17482L43436R362r8958D8499N05279j85778
17270C68000k0817r6978r3832m6872a1995G43408k48557A42093M2455M4897l9920
17259A89525Q9085L92965k01078j60414A25267J18554R857L00209p9387K02703
17249F77203j47649B08125j8487J60764L79472j65462k48670c6852C58420F1035
17238C08351L9950K12871j7333K66198B61818J31408A57978L88803G5653P4310
17228A49963J58027N7163j59483r7080J75000L70689k93465J72702k51664J20543
$$ y = [223842, 461934, 87259, 11015, 137130, 163131, 378034, 361893, 198592, 340115, 174969, 240110, 383934, 186371, 488583, 330773, 241733, 373997, 233346, 138957, 141211, 708507, 323043, 463809, 117482, 460918, 470280, 371322, 48499, 553778, 368000, 347183, 250205, 156373, 109501, -11995, 743408, 494851, 142093, 184548, 229445, 189525, 278610, 671575, 470497, 310083, 125267, 243821, 253678, 553887, 474500, 677203, 529554, 208125, 189638, 350402, 729874, 564412, 315742, -36852, 358420, 61035, 308351, 348301, 561172, 543839, 810037, 261818, 393226, 157978, 546781, 75653, 149963, 307990, 365153, 205670, 108590, 283590, 654279, 360814, 533516, 281852, 402395]
17218D02395K26137l10809Q8647K23902l00083J88676n2305J45843B61237J04411
17208C65648j79454J41650J06896k16767K92241J00965q8755B03694K04240o5504
17198C42430J57456k39135J36030j32227M17064M0211r6719j71066M8834E2601
17187D94355j44753P7351K87830M1624B87228K79441j39080k4799N2095j22500
17177C32385R502l1010r0467N4113K424j10300J03814L45918k59790q6157J00953
17166C71385m8533J28886A87886J97352m7839J19874J50254o4078j1980J59470
17156F90939j12660o3004J17498C03609O4901R851K89718k79454o5839N9447r5086
17145B87147Q0751L47871k04949o7900p1736L59235A04950K81395M0791L27989
$$ y = [402395, 628532, 317723, 406370, 630272, 330189, 518865, 466560, 612403, 261237, 365648, 186194, 327844, 434740, 217973, 510214, 611179, 522424, 203694, 407934, 342430, 499886, 260751, 396781, 264554, 681618, 721829, 625110, 454044, 502878, 52601, 494355, 349602, 426953, 714783, 756407, 287228, 566669, 427589, 402790, 454885, 332385, 341887, 310877, 220410, 274523, 276947, 166647, 270461, 616379, 356589, 270432, 371385, 322852, 451738, 187886, 385238, 337399, 457273, 607527, 543449, 531469, 690939, 578279, 515275, 632773, 303609, 368510, 378361, 668079, 388625, 322786, 382233, 287147, 367898, 715769, 510820, 442920, 371184, 730419, 104950, 386345, 427136, 755125]
17135G55125j79166r5338J60015m1680K42522m03360j743j34455L48027J19742
17125G69689k99511P535n8706M55077l73489M8000J09772J10121j46904j84628
17115D36956m7675L43899m3138p7753A73196L09770M8966n2189K2172K61845l20191
17104D43569N9669N3793j39661K58110l32777K41106l849Q309L1182P5260k40832
17093D53879j49030N10565k39815o9894j20988m1957L76063J30634P2467L3939
17083I55863k08461k62136J81475J94933j98977j21836K42931k41680K47002k7766
17073G61348j6029J68741k59607j8324j10370K91623j16591J7308l37586L53805
17063G34318j23418j57868P32850E53300K61446J28929k64669N604J19571K87279
$$ y = [755125, 575959, 480621, 640636, 598956, 841478, 438118, 436375, 301920, 649947, 769689, 470178, 477713, 419007, 874084, 500595, 548595, 658367, 768488, 621584, 436956, 389281, 733180, 690042, 612289, 173196, 482966, 531932, 479743, 501915, 763760, 443569, 503238, 557031, 417370, 675480, 342703, 583809, 579960, 588269, 619451, 694711, 453879, 304849, 815414, 575599, 505705, 384717, 342760, 718823, 849457, 921924, 955863, 747402, 485266, 666741, 861674, 662697, 540861, 783792, 542112, 789114, 761348, 745319, 914060, 654453, 636129, 525759, 817382, 700791, 718099, 380513, 734318, 610900, 453032, 1185882, 553300, 814746, 943675, 679006, 684610, 804181, 1091460]
17053A091460E26000M07230o2078q0279p8563J64899k068l29320J74526L5030
17043G55377q2068M15261k27686j01333J23877k84931L40852D64720N35605j06067
17033H94258k1165M0760j86992J20234J6420j97372O39351j17662j95004k60466
17023G32362N7676m5858K20860K80232l30481N648m5198L54940j14176j33081
17013I82924n8174M55930k81442j70358L9022J04175J82908k53806l47076L71420
17003A025523m8924K05885k91300L48368j68087R4372o2836k46302k6550M05700
16993A235849j14187j26020K09939J67684j63365K6269J94935k11133p2328K98423
16983A446066j84252q7945O3726K06342o0742j58265K68558m731j54774J84118
$$ y = [1091460, 526000, 933230, 871152, 790873, 712310, 877209, 875141, 545821, 720347, 755377, 673309, 1088570, 860884, 759551, 883428, 598497, 939349, 464720, 1000325, 894258, 873093, 913853, 726861, 847095, 863515, 666143, 1305494, 1187832, 992828, 732362, 790038, 744180, 965040, 1245272, 914791, 920439, 875241, 1230181, 1116005, 982924, 924750, 1380680, 1099238, 928880, 967902, 1072077, 1254985, 1001179, 654103, 1025523, 976599, 1182484, 891184, 1239552, 1071465, 1165837, 1103001, 856699, 830149, 1235849, 1121662, 995642, 1205581, 1373265, 1209900, 1236169, 1431104, 1219971, 1147643, 1446066, 1261814, 1173869, 1237595, 1443937, 1383195, 1224930, 1493488, 1488757, 1333983, 1518101]
16973A518101j34844P280l02560J99521J54278m9142k312j69009K47397q5673
16963A383037L0992j8489q2760J08675J38704R9514o9590q4745k27008M44881
16953A723211j58747n5732L81398j85737o7487Q621j22968L29497j59921J08722
16943A800857l54518L48354l77556L28077k31870M19829k37287R1391K07576l15464
16933A679389o064J69101J07735l11041J07792L5622J62020r0170J75838J36054
16923B166276k23955l8130L27007n13776L33618l35456M13535M8124k79137n7078
16913A841028P29385m46687j59983M35103m62458K45972J7590J64280J50992k50331
16903B264891P6521J88082j98302L07098r4050k81258J64815J77956o0900k38658
$$ y = [1518101, 1383257, 1390537, 1087977, 1287498, 1441776, 1392634, 1390322, 1221313, 1468710, 1383037, 1414029, 1395540, 1312780, 1421455, 1560159, 1659673, 1590083, 1505338, 1278330, 1723211, 1564464, 1508732, 1890130, 1704393, 1636906, 1645527, 1522559, 1852056, 1692135, 1800857, 1446339, 1794693, 1417137, 1745214, 1513344, 1933173, 1695886, 1787277, 1994853, 1679389, 1673325, 1842426, 1950161, 1639120, 1746912, 1782534, 1944554, 1854384, 2030222, 2166276, 1942321, 1904191, 2231198, 1717422, 2051040, 1715584, 2129119, 2177243, 1898106, 1841028, 2570413, 2123726, 1963743, 2398846, 1936388, 2182360, 2199950, 2364230, 2515222, 2264891, 2341412, 2529494, 2331192, 2638290, 2544240, 2262982, 2427797, 2605753, 2544853, 2306195]
16893B306195K59054j34059N43642p7083q225j25592l69281P9879J14112N96529
16883C185171k63233J62492J7152N8852q9852J98945K2607R4785p0147J70981
16873C487753p6818P6559l2966J54565k86997K63134k71135k1093L71081j61719
16863C502364N38165q6449j80126l7553L8929O5215J08485J33733J56161j91334
16853D047590P8997K46123L0223J19294L33p7124L29694l93432L28039j03085
16843D606652M70786k0070m337q4046J67613K9874o3686M08999k92557N10225
16833E729453K8K3530K70045l21785K03991J44099J34801J5641Q9245j35229M06336
16822F560155J77346K77454q4030j06533L54219n3329L93654n0742J35548K47191
$$ y = [2306195, 2565249, 2431190, 2974832, 2897749, 2889524, 2763932, 2394651, 2474530, 2588642, 3185171, 2921938, 3084430, 3101582, 3160434, 3070582, 3269527, 3292134, 3386919, 3316772, 3487753, 3410935, 3487494, 3454528, 3609093, 3322096, 3585230, 3314095, 3293002, 3664083, 3502364, 4040529, 3954080, 3773954, 3736401, 3775330, 3840545, 3949030, 4082763, 4238924, 4047590, 4126587, 4372710, 4402933, 4522227, 4522560, 4445436, 4775130, 4381698, 4709737, 4606652, 5077438, 5057368, 5053031, 4968985, 5136598, 5166472, 5102786, 5511785, 5219228, 5729453, 5729481, 5753011, 6023056, 5701271, 5905262, 6049361, 6184162, 6199803, 6289048, 6153819, 6560155, 6737501, 7014955, 6930925, 6824392, 7178611, 7125282, 7518936, 7468194, 7603742, 7850933]
16812G850933j18744O12736k09131L81051J43189J23290k88761K91695K59421
16803I045679L8791K20364L55149J13680J54578J94856L78473J32860K32369j81302
16793A0685497N95021L07416K15505N6460N32798J06969M54916L79604P187N47741
16783A3889114J30751K87011M81428K01944M62491K54263L87526J88227J262421
16774A7545176j48175L87907O97091N39351M25498P67144L07642M75236P38728
16765B1735598M93334L48671J206794L65036P54137R20603N22458J421594M98626
16756B8266851J126595O51565J026219Q78662J089855J067937J064924J620063
16748C6792671J181356R77027J292889J694030J790150J620705J359530J448849
$$ y = [7850933, 7732189, 8344925, 8135794, 8516845, 8660034, 8783324, 8494563, 8786258, 9045679, 9084470, 9304834, 9659983, 9773663, 9928241, 10123097, 10501570, 10634430, 10866799, 10685497, 11280518, 11587934, 11803439, 11859899, 12392697, 12499666, 12954582, 13334186, 13341373, 13889114, 14019865, 14306876, 14788304, 14990248, 15452739, 15707002, 16094528, 16282755, 17545176, 17397001, 17784908, 18481999, 19021350, 19446848, 20213992, 20521634, 20996870, 21735598, 22228932, 22577603, 23784397, 24149433, 24903570, 25824173, 26346631, 27768225, 28266851, 29393446, 30045011, 31071230, 31949892, 33039747, 34107684, 35172608, 36792671, 37974027, 38951054, 40243943, 41937973, 43728123, 45348828, 46708358, 48157207]
16740D8157207K323678J922790J715054J830512J997351K399973K570781K059356
16732F4976702K226537K741923L023155K398296K852492L044873K931610K660099
16724H6855687L321412L009319L331461K854442L261028L185585L358294K532674
16716A11709902K984321K881151K229727K353439K154591J982690J332282J575574
16708A29203677M85984O21024N22089k28394n73686n93443j274712j294063j649318
16699A25219158k211662k460527k247372k555802k906127k896594l136352l150799
16691A03653923l124352l155364l287465l092806l045461l291201k696654l061984
16683G8898636l048880k998844k498083k656124k586145k724114k204598j954732
$$ y = [48157207, 50480885, 52403675, 54118729, 55949241, 57946592, 60346565, 62917346, 64976702, 67203239, 69945162, 72968317, 75366613, 78219105, 81263978, 84195588, 86855687, 90177099, 93186418, 96517879, 99372321, 102633349, 105818934, 109177228, 111709902, 114694223, 117575374, 119805101, 122158540, 124313131, 126295821, 127628103, 129203677, 129689661, 130310685, 130832774, 130604380, 130030694, 129437251, 128162539, 126868476, 125219158, 123007496, 120546969, 118299597, 115743795, 112837668, 109941074, 106804722, 103653923, 100529571, 97374207, 94086742, 90993936, 87948475, 84657274, 81960620, 78898636, 75849756, 72850912, 70352829, 67696705, 65110560, 62386446, 60181848, 58227116]
16675E8227116k218453k404849j665345j798522k138024j773903j552735j932971
16667D2742314j083219j752023j434269j469791j142621r79225j640437q02788
16659C2437941j148923j179160q18111q89886j059689o45524j021623l45669r33165
16650B4396191o93599p65077q47839m06223o17335p48865n25328p39053m26556
16641A8626316m13268k23127p54343m70942l05019j45620m09884q31958j60745
16632A4911410m41954m17563k55210n72791m6946l30887k84688l54431l55942
16623A1850998n8286l75572k76221r3513p0421l44119l40731l0882m61500j11940
16613I687813l46439l95273M70259m62186l46114k80158j50549O0569m0476j22428
$$ y = [58227116, 56008663, 53603814, 51938469, 50139947, 48001923, 46228020, 44675285, 42742314, 41659095, 39907072, 38472803, 37003012, 35860391, 34881166, 33240729, 32437941, 31289018, 30109858, 29291747, 28401861, 27342172, 26696648, 25675025, 25329356, 24396191, 23702592, 22937515, 22089676, 21683453, 21066118, 20317253, 19791925, 19052872, 18626316, 18213048, 17989921, 17235578, 16764636, 16459617, 16313997, 15904113, 15072155, 14911410, 14469456, 14051893, 13796683, 13223892, 13176946, 12846059, 12561371, 12206940, 11850998, 11792712, 11417140, 11140919, 11047406, 10976985, 10632866, 10292135, 10261253, 9799753, 9687813, 9341374, 8946101, 9416360, 8954174, 8608060, 8327902, 8177353, 8237922, 8197446, 8075018]
16603H075018o68016J8265J25370k38011j0162m44678K32401l24469P749O9621
16593F843088k92493Q06n95870Q5644j59049J26569K09688k65436j95274j97280
16583E560393K01845m96575o4833Q1854Q7337l51066J04707m42293K36449j94708
16573D723110K29607k77671j21366K78483m58723N03814m73998k53692N0545j46475
16563D053634K6845m33619L22762j74064K19079k71036O0472j85464M22369j05057
16553C935921k68695j50250l50650N7648J39037J2289K71563k88718J18249k88088
16543C188306O1344j24037k92229K87249l41011j44144L92090k41457J87100j26718
16533B846493j02557P7610l941l62487J71091o2735K53806k39637M82l2700j78148
$$ y = [8075018, 7407002, 7425267, 7550637, 7312626, 7302464, 6857786, 7090187, 6765718, 6773467, 6843088, 6550595, 6551401, 5955531, 6041175, 5882126, 6008695, 6218383, 5952947, 5757673, 5560393, 5762238, 5265663, 5200830, 5282684, 5370021, 5018955, 5123662, 4681369, 4917818, 4723110, 4952717, 4675046, 4553680, 4832163, 4373440, 4877254, 4403256, 4149564, 4200109, 4053634, 4080479, 3646860, 3969622, 3795558, 4014637, 3743601, 3804073, 3618609, 4040978, 3935921, 3667226, 3516976, 3166326, 3223974, 3363011, 3375300, 3646863, 3358145, 3476394, 3188306, 3249650, 3125613, 2833384, 3120633, 2779622, 2635478, 3027568, 2786111, 2973211, 2846493, 2743936, 2821546, 2817605, 2455118, 2626209, 2563474, 2817280, 2577643, 2578125, 2545425, 2367277]
16522B367277m957J16028K12730n21518J55785Q2944l8561j8077k84640l9652
16512B027359K65522j21718k96722N17343m25572Q6006J72555K7061L1223k45059
16502B037998K38034k86487r1443K90155k33985j00742j85722M54548n35530K94439
16492A881265k71287K89054k67945j2820J67825m1190J0381j00755K34475j77226
16482A711777j55177P0406j30223K03577j28061K22472q9501L05095m64735j95927
16472A349703J03614R9332L2117q2471j73153Q7344m5808k76819O04923o73520
16462A025262L37964O1452J19669l39597j73624J13714J89323m2192J89365m86685
16452I94651J21259J41467j71384L57064k38074K26114L172j31020k56777j05062
$$ y = [2367277, 2362320, 2478348, 2691078, 2169560, 2325345, 2408289, 2369728, 2351651, 2067011, 2027359, 2292881, 2171163, 1874441, 2391784, 1966212, 2052218, 2224773, 2251834, 2283057, 2037998, 2276032, 1989545, 1898102, 2188257, 1954272, 1853530, 1667808, 2122356, 1586826, 1881265, 1609978, 1899032, 1631087, 1618267, 1786092, 1744902, 1755283, 1654528, 1889003, 1711777, 1556600, 1627006, 1496783, 1700360, 1572299, 1794771, 1705270, 2010365, 1545630, 1349703, 1453317, 1552649, 1584766, 1502295, 1329142, 1416486, 1370678, 1093859, 1698782, 1025262, 1363226, 1424678, 1544347, 1204750, 1031126, 1144840, 1334163, 1291971, 1481336, 994651, 1115910, 1257377, 1085993, 1443057, 1204983, 1431097, 1434269, 1303249, 1046472, 941410]
16442I41410M63168k49386k86220L45081n7815M1789K08956o27309J48044M407
16432I32125J28922P9137j45339k2155J82323P2676j94571r4755M9682p3079J64775
16421A079741j88528K04778K6501k62227o1321K22372p0150J23630j4510J20873
16411A181159m50369K47123j95564Q9142j6267j27964R5589J70115M9698J48629
16401A191291m50438K22886l61430K75536k26616j20920L49780l16515Q1587K76730
16391I21891k44216J25872K5933j39496L28811k00624p870J6585R4009j95646
16381G25249O1593k2103P4373l56868M15524j89281K65517k35705l55651L11052
16371F93700J57781r7787J81794m36237K65360j14998R4081o2501l12455O07439
$$ y = [941410, 1404578, 1155192, 868972, 1214053, 1156238, 1198027, 1406983, 779674, 927718, 932125, 1061047, 1140184, 994845, 972690, 1155013, 1227689, 1033118, 938363, 988045, 914966, 1079741, 891213, 1095991, 1122492, 860265, 798944, 1021316, 951166, 1074796, 1060286, 1181159, 730790, 977913, 782349, 871491, 855224, 727260, 822849, 992964, 1042662, 1191291, 740853, 963739, 602309, 877845, 651229, 530309, 880089, 563574, 645161, 921891, 677675, 803547, 829480, 689984, 1018795, 818171, 810301, 826886, 920895, 725249, 786842, 764739, 839112, 482244, 897768, 708487, 974004, 738299, 382648, 693700, 851481, 753694, 935488, 499251, 764611, 649613, 743694, 681193, 368738, 976177]
16361I76177l04733K45235l53438K9510L8642N4181J05891l33576j6241J85368
16351F27016K33277D29930K35079J8097M923j5767l10787P8300J77610q6823N0089
16340E80651B57386L37960K2285O9446C21557L86264j83685j06881J55964K40989
16330H14208D06135j1386K41015J29099k43557k13164R1544K75536j69192J10858
16320F16888P1783j9531J71476B84356L62776k6186p0778Q8049J77843A94345
16309E84382B32128M17465C21646j16705L42316A73638J2806L07549B46203Q6401
16299C32604J41106o1131j44368L77563C17453O7774K72090B92468Q5743L42313
16289G20524C24410K03484K19360k97174o0658J54315j58551m1862r7089J27617
$$ y = [976177, 671444, 916679, 563241, 592751, 631393, 685574, 791465, 457889, 441648, 627016, 860293, 429930, 665009, 683106, 688029, 672262, 361475, 439775, 617385, 530562, 580651, 257386, 595346, 617631, 687077, 321557, 707821, 524136, 417255, 573219, 814208, 406135, 394749, 635764, 764863, 521306, 308142, 399686, 675222, 506030, 616888, 688671, 669140, 840616, 284356, 647132, 620946, 550168, 638217, 816060, 194345, 584382, 232128, 649593, 321646, 204941, 547257, 173638, 186444, 493993, 246203, 332604, 473710, 412579, 268211, 645774, 317453, 385227, 657317, 292468, 378211, 720524, 324410, 527894, 747254, 450080, 389422, 543737, 385186, 343324, 246235, 373852]
16279C73852l0047M12044j67134j3183B31556a631D21388O29j36557j22447J761
16268A64774L7243M01912k71710N5454K24053j69140n0673A64651R9092M41318
16258G05061l48202L4460J20389k43207D5020K80246A06433M35026o0735J0447
16248D91171G8905L49402j38844G2784K46020k5068A5196J36305Q697M61286j94948
16237D26536J92208A87845K17794j61953o5882K46109l7117j78584K48994J48684
16227F05890A87936a9531A38658J91557L3967G9794g9338C58290G4091J89688
16217B63779j5079C2280J51065c5696G9735a68462B10650m4310K71111o9090A15434
16205D31497p7780j04777J12620M2253j96255k6035L55515k23730k2450M3223
$$ y = [373852, 343805, 755849, 588715, 575532, 231556, -1631, 421388, 422017, 285460, 163013, 164774, 202017, 603929, 332219, 387673, 611726, 442586, 391913, 164651, 263743, 705061, 356859, 391319, 511708, 268501, 45020, 325266, 106433, 541459, 480724, 491171, 78905, 428307, 289463, 72784, 318804, 293736, 15196, 151501, 160198, 621484, 426536, 618744, 187845, 405639, 243686, 177804, 423913, 386796, 208212, 457206, 605890, 187936, -19531, 138658, 330215, 364182, 79794, -79338, 358290, 74091, 263779, 248700, 32280, 183345, -35696, 79735, -168462, 210650, 166340, 437451, 368361, 115434, 431497, 353717, 248940, 361560, 403813, 207558, 181523, 537038, 313308, 290858, 334081]
16195C34081d4182D85631k42112C5548L93098A8301K02020J09498J26558A83064
16184B93715r5589D0492J19886K67022a06581B27104K1313j04678L6875m2658
16174A37956E7074J85402b12856C59897n0902A11546K74562q8347M8951A27452
16163a27103D8556K25795e0607A27687e0637A43860d5407B27916a81991F2454
16152B71420l6480A07703L07542A49212N0235P3462E5549b36979B13377L21586
16142E34963A74808e4635I5431J36882p908K40961k16275P9813C8259a4431A56194
16130C65732i5724I8853d9856B02536A3773N9012K12120D0871M4897P9979J20595
16119B86342a6701I6208I23K76137J22650I4153j0059d9928I2074e8589K1324
$$ y = [334081, -44182, 485631, 243519, 35548, 428646, 18301, 220321, 329819, 456377, 183064, 293715, 198126, 40492, 160378, 427400, -106581, 227104, 248417, 143739, 180614, 137956, 57074, 242476, -212856, 359897, 308995, 111546, 386108, 297761, 346712, 127452, -127103, 48556, 274351, -50607, 127687, -50637, 143860, -45407, 227916, -181991, 62454, 271420, 234940, 107703, 415245, 149212, 199447, 272909, 55549, -236979, 213377, 534963, 174808, -54635, 95431, 232313, 224405, 465366, 249091, 328904, 38259, -14431, 156194, 365732, -95724, 98853, -49856, 202536, 13773, 72785, 284905, 40871, 85768, 165747, 286342, -16701, 96208, 923, 277060, 399710, 94153, 84094, -49928, 92074, -58589, -37265]
16108c7265A28348b2770q339A53799h5582A80430J12449E8863J82098l3648K4291
16097B31604j6226D5071K06810L0422r3222H2105J3746J25568O4204B4373a4799
16085e33099D779M0805K2048J09107K2667o937r4553D1060A2389L35785A27414
16073B70175J40582j76154D5178K7668O7140k735a3158n0186j22880d4293j85283
16062b29576B00282g8384C77f0045j24902E7712k6492a6853A51950l3274g9040
16050A05023a07939C36004c0808A20159g5381H0570i6913A42616c59568g9410
16039C1427O6064N8256a89666F9343a14090L8980C26709c949I3874a70792e8386
16027B04635a5949B5143f6505G9587R1602b47592A63975h7330m718a8632A5359
$$ y = [-37265, 128348, -22770, -31109, 153799, -85582, 180430, 292879, 58863, 240961, 207313, 231604, 215378, 45071, 251881, 282303, 189081, 82105, 95851, 221419, 285623, 24373, -14799, -533099, 4779, 45584, 67632, 176739, 199406, 192469, 97916, 41060, 12389, 348174, 127414, 270175, 410757, 234603, 45178, 72846, 139986, 137251, -13158, -63344, -186224, -44293, -229576, 200282, -78384, 377, -60045, -184947, 57712, 31220, -16853, 151950, 118676, -79040, 105023, -107939, 336004, -30808, 120159, -75381, 80570, -96913, 142616, -359568, -79410, 31427, 97491, 155747, -189666, 69343, -114090, -75110, 326709, -3949, 93874, -170792, -58386, 204635, -15949, 25143, -66505, 79587, 171189, -247592, 163975, -87330, -92048, -18632, 15359]
16015A7076c7849o5810A08510D0787L33295E3398K19865e6371E9295b43820b2043
16003E9742J01398k9309m4418C2121l131c4214A38276J71138k6942A06530a08047
15991I1573b48059E4461J77230a08992A26567P7113m5883J47830a7488E8496J20910
15980A79406N2178J91190B8159J82017q7272J29470J839J94874M8574R3175L49520
15969I40356L81202m07226r3187k68448J0378k75538I4125c4197B70349b20757
15958A53443J84054f7673n8899n01B16421c1284n4581E4524h44B4922c940r2847
15946i6787K2263B51982a93292I6094a02926E6818M5515a21864n9740a2626q9952
15935a02578f572r0168a0637D5940N6872L4162l031l903A2062g3122A23743a6850
$$ y = [17076, -37849, -103659, 108510, 40787, 374082, 53398, 273263, -56371, 59295, -243820, -22043, 59742, 161140, 131831, 87413, 32121, 28990, -34214, 138276, 309414, 282472, 106530, -108047, 91573, -248059, 54461, 231691, -108992, 126567, 203680, 157797, 305627, -17488, 58496, 179406, 231584, 422774, 28159, 210176, 122904, 252374, 254213, 449087, 497661, 590836, 940356, 1321558, 914332, 821145, 552697, 563075, 287537, 94125, -34197, 270349, -220757, 153443, 337497, -67673, -126572, -127073, 216421, -31284, -85865, 54524, -844, 24922, -3940, -96787, -74524, 251982, -193292, 96094, -102926, 56818, 102333, -121864, -181604, -12626, -102578, -6572, -96740, -10637, 45940, 102812, 136974, 133943, 130040, 12062, -73122, 123743, -16850]
15922h9160H6760g0589l79510H3409b22704F2244a09080k2251j42313J0067D1497
15910c8946b801D1537h9255k8713C43966j63378e5971I8881h9457j05653e4923
15898a59005A57639F8505a2775k8353j6610B34723d1748I2316d9269I2973O2782
15887A55755K1191a28633a2863j63181d0321j04679J307e2790I3132J1211C1231
15875f64A68891M256k9995a5644A60020b74r9450c3641r6809k26341b6039n4392
15863h0431B95405a51221j90074A90083b28919B2246c00246a06397F6085b4466
15852A37740P3494a2365H6525f4839r6386A94451a8613A72142c7935I4270l6902
15841E7368b60249D8632B545a1255A31147b97722F4478h6108g931A98867d6835
$$ y = [-89160, 86760, -70589, -450099, 83409, -222704, 62244, -109080, -131331, -273644, -263577, 41497, -38946, -2801, 41537, -89255, -117968, 343966, 180588, -55971, 98881, -89457, -195110, -54923, -159005, 157639, 68505, -12775, -41128, -57738, 234723, -41748, 92316, -49269, 92973, 155755, 176946, -128633, -12863, -176044, -40321, -145000, -143693, -52790, 93132, 104343, 31231, -664, 168891, 173147, 143152, -15644, 160020, -274, -99724, -33641, -130450, -356791, -26039, -80431, 295405, -151221, -341295, 190083, -228919, 22246, -300246, -106397, 66085, -24466, 137740, 211234, -12365, 86525, -64839, -161225, 194451, -18613, 172142, -37935, 94270, 57368, -260249, 48632, 2545, -11255, 131147, -297722, 64478, -86108, -7931, 198867, -46835]
15829F4470P7590e0071p3141A47984a93419A2565P8756g4932H5682k0895J6712
15818H1499a0889k81962m3341C88276g8574l33909C82646a76463j4277g9481A28545
15806g5434l8112n4222A6421i408I6679a73532B03026b04365n1845A83284C0068
15794c15879a18251p5184J5896j1545I9128E462b85213H4127O5011G1384k2598
15783D8786a67389j29171K5951h3824j4268A46704B315i4082j21487A8481J23123
15772A41604i0985k8651H489L11705j5057d38609A06192a106k62470J04790d221
15760B58729j23373b5454B00493h634j30198j73717h6416j37557G321P7477d5886
15748d33660b0487B39910A15260C555a12245f884D0482K30802j8010q3487a05759
$$ y = [64470, 142060, -50071, -123212, 147984, -193419, 12565, 91321, -74932, 85682, 64787, 81499, -10889, -292851, -336192, 388276, -78574, -412483, 382646, -176463, -190740, -79481, 128545, -75434, -113546, -167768, 16421, -9408, 96679, -173532, 203026, -204365, -256210, 183284, 30068, -315879, -118251, -193435, -177539, -189084, 99128, 5462, -285213, 84127, 149138, 71384, 48786, -167389, -296560, -270609, -83824, -98092, 146704, 2315, -94082, -215569, 18481, 141604, -90985, -119636, 8489, 320194, 305137, -438609, 106192, -1106, -263576, -158786, -4221, 258729, 135356, -25454, 200493, -8634, -138832, -312549, -86416, -223973, 7321, 84798, -45886, -433660, -20487, 239910, 115260, 3555, -112245, -6884, 40482, 271284, 253274, 169787, -105759]
15736A71636E8094e64873A1790J97184G966k952i8096B61534E3248f4548a5599
15724a07792b721A92727r2862c3462a2901k22302C4263e9540J472B015P4855J12460
15712A89330a85931c3192j1980A72411P3183a73966A40912j8849O3138d09112
15701i9407A35168b63210a25163k02617G8677g9365D8854h2128J1515B55703I7229
15689B70175b33889A20587o530P0282c24488A02994i385D9558a24078r7797P8869
15678a43006H0545e7385n8880B44482e2773B49116a1132n9519L1846A4499J55480
15667A69979g6824j93856A40973m2206e5818B9501j1968d7158A43367a87181A11807
15655c79562H0240J04374B5767K84660a69940Q1941f832j07103A19848b09747
$$ y = [171636, 58094, -564873, 11790, 208974, 7966, 5014, -98096, 261534, 53248, -64548, -15599, -107792, -2721, 192727, 99865, -33462, -12901, -235203, 34263, -59540, -58068, 2015, 76870, 189330, -185931, -33192, -45172, 172411, 245594, -173966, 140912, 122063, 185201, -409112, -99407, 135168, -263210, -125163, -327780, 78677, -79365, 48854, -82128, -70613, 255703, 97229, 270175, -233889, 120587, 114057, 184339, -324488, 102994, -9385, 49558, -124078, -221875, -143006, 80545, -57385, -116265, 244482, -52773, 249116, -11132, -70651, -38805, 14499, 169979, -76824, -270680, 140973, 98767, -55818, 29501, 17533, -47158, 143367, -187181, 111807, -379562, 80240, 184614, 25767, 310427, -169940, -87999, -6832, -113935, 119848, -209747]
15644A16685Q5168g7072a5137f775k78854K9641C0102c02923e3442k56771h1320
15632a09866M6119A82166f2375F0808e14621a96108R5281D09949c51356J18181
15622b33175E1180J92830f8685A39621C5637a10211A33805a49153B17705H7855
15611B39376e0400j67803b5399j63982l6738D6796a15172L6901a2638j51496A73002
15599A21360a47663p0668I8200A0658b46035L5940L0068e6724B2278f4754K1180
15588d3574B40992f4707k41592b4308A11570h8698l1415j00731J2114H9536b25872
15576C0650J01561J6856b33915M7955K8143D9951O8469c8129n6357A32466A8969
15564a04037B12836K5457a05307A23925f7940f750B0832b43581A02524a76016
$$ y = [116685, 201853, -77072, -15137, -6775, -285629, -255988, 30102, -302923, -53442, -310213, -81320, -109866, -63747, 182166, -62375, 60808, -514621, -196108, -100827, 409949, -351356, -233175, 51180, 244010, -68685, 139621, 35637, -110211, 133805, -149153, 217705, 87855, 239376, -50400, -218203, -25399, -189381, -226119, 46796, -115172, -78271, -12638, -164134, 173002, 121360, -147663, -218331, 98200, 10658, -246035, -210095, -180027, -56724, 22278, -64754, -43574, 240992, -64707, -306299, -24308, 111570, -88698, -120113, -220844, -208730, 89536, -225872, 30650, 132211, 149067, -233915, -185960, -157817, 49951, 118420, -38129, -94486, 132466, 18969, -104037, 212836, 238293, -105307, 123925, -67940, -6750, 20832, -243581, 102524, -176016]
15553F8362k6030M4274a80006F6507K61710a07094G1825R3242E9060J46137o9303
15542A35894i2409j06281j28911f842q3940A51721a82816A15748E4278b4447G0700
15530C46671b49639j32158a28563D7460H799g250p3585D7668a36970j3731b0883
15518A25372a39415A12795e2257A97379E2807a55307g5503g924D8423h8256C0891
15506c68937a25650G6994J23248N440D2689b42175D3884M43524A71341l0245i1557
15494e8748A17769J43592J07852p9417I602b4962p549B32426c7263G6750K34289
15483C11039J54247B18040f3707A64302R3701K6569N8566j09671g4076C21324
15472C85168H7871L4015J509q409a25043B37959j2294A04378J73938j06217m3109
$$ y = [68362, 42332, 86606, -180006, 66507, 328217, -107094, 71825, 165067, 59060, 205197, 135894, -92409, -198690, -327601, -6842, -90782, 151721, -182816, 115748, 54278, -24447, 70700, 346671, -249639, -381797, -128563, 47460, 8799, -7250, -80835, 47668, -136970, -150701, -20883, 125372, -139415, 112795, -52257, 197379, 52807, -155307, -75503, -7924, 48423, -88256, 30891, -368937, -125650, 76994, 200242, 205682, 42689, -242175, 43884, 487408, 171341, 141096, -91557, -58748, 117769, 261361, 369213, 289796, 9602, -24962, -32511, 232426, -37263, 76750, 311039, 465286, 218040, -63707, 164302, 258003, 284572, 343138, 233467, -74076, 321324, 385168, 87871, 121886, 123395, 114986, -125043, 237959, 225665, 104378, 278316, 172099, 128990]
15461A28990N6666N73458A60124K83423k3878g616A65691J40992A38814l7090
15451A01724K50057g5524I1263b2682B7957Q6271g4221K504D5930a43269B42854
15439a4851B5924J73050b43814N8267a8421F9223N3907J34144i7983A35876K69570
15428D05446A08255N65116j08068M68146j81764k4086l43978b879B37144B8114
15417g3201h984D59088C4807b48288f0862j60035c1056k10842f093A07823Q255
15406A16078L95643A6213i6733l6176H8684b5353j19711j41353C43790A69386
15395C2017J56415O5681A07772k3586L25120c6405q3774B3912K56711m1709l8482
15384B00432C0491h4354K3866j13049P7198K06C7355b9971B02632p6920K5530
$$ y = [128990, 185656, 759114, 160124, 443547, 419669, -7616, 165691, 306683, 138814, 101724, 351781, -75524, 91263, -22682, 27957, 114228, -74221, -71717, 45930, -143269, 242854, -14851, 25924, 198974, -243814, -185547, -18421, 69223, 123130, 257274, -97983, 135876, 405446, 108255, 673371, 565303, 1033449, 851685, 827599, 483621, -2879, 237144, 28114, -73201, -8984, 459088, 34807, -248288, -60862, -220897, -31056, -241898, -6093, 107823, 116078, 511721, 16213, -96733, -132909, 88684, -25353, -145064, -286417, 343790, 169386, 32017, 188432, 254113, 107772, 84186, 409306, -36405, -120179, 23912, 280623, 238914, 200432, 30491, -84354, -60488, -173537, -96339, -96133, 37355, -29971, 202632, 125712, 151242]
15373A51242n2241a09808I6308j47C1332a70666C5046k362O8998g5702C06913
15361c49617A8148N2923K88192A06340b4149B64882c0567C71515A35255E4509
15350B11009K1015d25767A86817g0817B84338I0892C6862K03855A02651R2860
15340A95511A3640J23274J83927o317A32599I351J0730J1789K51983g3522B75930
15328B94546j30390G8105N29927Q6933A62455a9284A49901a05555A55853A373
15317B49720l7247J3204J35263a99287C1048L8193k4419M9797c9629A64641m1436
15306A23205b627k2826k63512A09999m5247n126c7325C30915d15158c355C69191
15294a7350B81435b3186C05979a54883j86029B19274k8474h0762A56792J45403
$$ y = [151242, 99001, -109808, 96308, 96161, 31332, -170666, 35046, 32684, 101682, -75702, 306913, -349617, 18148, 71071, 359263, 106340, -24149, 264882, -30567, 371515, 135255, 54509, 211009, 232024, -425767, 186817, -70817, 284338, 90892, 36862, 240717, 102651, 195511, 13640, 136914, 320841, 314524, 132599, 9351, 20081, 31870, 283853, -73522, 275930, 294546, 164156, 78105, 608032, 694965, 162455, -19284, 149901, -105555, 155853, 1373, 249720, 212473, 225677, 360940, -199287, 31048, 69241, 44822, 94619, -39629, 164641, 123205, -2627, -25453, -288965, 109999, 64752, 59626, -37325, 330915, -415158, -3355, 369191, -17350, 281435, -23186, 305979, -154883, -340912, 219274, 190800, -80762, 156792, 302195]
15284C02195L4313a17257B54081k3338j11720N2844Q1096J0855c3567r7143A8602
15272d1938C40446j68949p1061P0573F6471b04918G9357a52070e9731j31365j61472
15261c52568a09935B30790b07841I8506J54273a32457b5913D1388J13611P7524
15251B32523p4803J9900a52370d9992E7780e9932q8304P190q984b0168C8717b21918
15238A17299K1536f7408c63A13872a56379A10083M982J55499K82104K77855K53119
15227A083642O37005m33851J55522J52086F14925D7939J06359e4784G7681K32968
15217C10649e9286j5904c3767j82343c5841n726F3713b06963A27061J07605j8303
15206B16363l2724a50699d7271n6983H963O9324d0915A9469M6178d8157A57640
$$ y = [302195, 336508, -117257, 254081, 230743, 119023, 171867, 252963, 263818, -33567, -130710, 18602, -41938, 340446, 171497, 100436, 171009, 66471, -204918, 79357, -152070, -59731, -191096, -352568, -109935, 230790, -207841, 98506, 252779, -132457, -25913, 41388, 154999, 232523, 157720, 177620, -152370, -49992, 57780, -59932, -148236, -141046, -150030, -20168, 38717, -221918, 117299, 138835, -67408, -363, 113872, -156379, 110083, 115065, 270564, 552668, 830523, 1083642, 1720647, 1286796, 1442318, 1594404, 614925, 47939, 154298, -54784, 77681, 310649, -59286, -75190, -33767, -216110, -35841, -41567, 63713, -206963, 127061, 234666, 216363, 183639, -150699, -47271, -104254, 8963, 78287, -40915, 19469, 65647, -48157, 157640]
15194d11109P4419A58661a21614C42666A443J72006J82728a2730o8980A9209b34822
15182A50713J65672H9771A676M12397b67795E2963b03950A87124J27898A19571
15171g1139m7510F9619J74742J06708e7774K2866A59565E6397K23538A11145n0760
15160F0385O9780J04929p3689k5167d8594H711R2807N4700K04989c6789i102q9846
15148i8948o3531B63984A05986C0599a16858N4316G3210b5907D42929A59503J01081
15137B60584p9877l3297j1280b967D170a03358M6157q9687m8477O6145M3568E4976
15124H7858J16792J75605j21987E5708j1744J72349P4720l3705L1708k9233J6958
15113B76761J63952K7871f399D45673A40847N977j6828m541J71977o7382j0655
$$ y = [-411109, -336690, 158661, -121614, 342666, 1443, 173449, 356177, -12730, -81710, 19209, -234822, 150713, 316385, 89771, 1676, 414073, -267795, 52963, -203950, 187124, 315022, 119571, -71139, -118649, 69619, 244361, 351069, -57774, -34908, 159565, 56397, 279935, 111145, 60385, 130165, 235094, 161405, 136238, -48594, 8711, 101518, 156218, 361207, -36789, -9102, -98948, -162479, 263984, 105986, 30599, -116858, -62542, 73210, -25907, 442929, 159503, 260584, 180707, 147410, 136130, -2967, 4170, -103358, -57201, -146888, -195365, -129220, -85652, 54976, 87858, 204650, 380255, 258268, 55708, 43964, 216313, 291033, 257328, 289036, 259803, 276761, 440713, 468584, -6399, 445673, 140847, 146824, 129996, 125455, 297432, 230050, 219395]
15102B19395J94604A63748i7836j51691A76563H0995a04068a7155k2407C91834
15091C94768B8498d2578A33871n6374J0060L33220o9736D5849P2332J01269a55098
15079d6909D26278B6499J68357J06573O3284f7813B44429q0428K87229I5672f9153
15067a53165A37966o7882L27019j58136i6597B12706m8797g3506o4215C72327
15056a11836m264I2074d0604A4359K58401q3634E3201K15966A0261J38554D7470
15044F1330E791K60711k2438O4373D0445J1122J05546J83280j61989J83164j31802
15033B29766M8157L81104l06686J67376C8393O61053B35696J75792r1454A01237
15022B88184M0924o1233K35930e0616E07689K20395j73414J87339J44981l54710
$$ y = [219395, 413999, 163748, -97836, -249527, 176563, 80995, -104068, -17155, -39562, 391834, 394768, 28498, -42578, 133871, 77497, 87557, 420777, 351041, 45849, 118181, 219450, -155098, -46909, 426278, 26499, 194856, 301429, 364713, -67813, 244429, 164001, 451230, 95672, -69153, -153165, 137966, 70084, 397103, 238967, -96597, 212706, 163909, -73506, -137721, 372327, -111836, -116100, 92074, -40604, 14359, 272760, 189126, 53201, 269167, 10261, 148815, 47470, 61330, 5791, 266502, 244064, 308437, 40445, 51567, 157113, 340393, 178404, 361568, 229766, 277923, 659027, 352341, 519717, 38393, 699446, 235696, 411488, 320034, 101237, 288184, 329108, 267875, 503805, -50616, 507689, 728084, 554670, 742009, 886990, 532280]
15012E32280L39951l70514O1249j97368J51760B24901K77020j61347K57532j88227
15002D09879l7245q5866j39137M54429j62507A79112L02893N9017k56832J21417
14992D05607J08067p8953m7682R8558B07905R1886K56850k05143J68652m3510
14982D76640K17426l37029J00307N8841j71455k9607K87856A35985J12679L83276
14972F31940J69669l27639K94864j85258q2023K07784J17950l53164L34316j06809
14962G01630j63216J47911j87368r2364K28081k67545J97249M9077J03022l02030
14952D14447J85979k66604J16816n683j04987F543K59301L22060j73191Q2631
14942D97344A91143J68933J47683J22985B82831n0538l9271M5837R8369J04844
$$ y = [532280, 872231, 501717, 562966, 365598, 517358, 224901, 501921, 340574, 598106, 409879, 372634, 286768, 147631, 602060, 439553, 179112, 482005, 541022, 284190, 405607, 513674, 434721, 387039, 485597, 207905, 299791, 556641, 351498, 520150, 476640, 694066, 357037, 457344, 516185, 344730, 315123, 602979, 135985, 248664, 631940, 801609, 473970, 768834, 583576, 501553, 709337, 827287, 474123, 808439, 701630, 538414, 686325, 498957, 406593, 634674, 367129, 564378, 613455, 716477, 414447, 600426, 333822, 450638, 444955, 339968, 6543, 265844, 587904, 414713, 497344, 191143, 360076, 507759, 630744, 282831, 232293, 193022, 238859, 337228, 442072]
14932D42072A73053N17391C29960M65307C59903M155N05095k42414G6117J42863
14922B18980J39067L76697j29957k47758L14370k43552O14924K8207j00594L9066
14912A009450K42255J49362j88142M79319J56921o40122L76922r9623k2597j20862
14902A342883L27031m9196J37651O390m63047r5984J08705m32007j00724j56276
14892F25426j37872N2962J38605o7636Q1109l05265L13369m4264j45706B37685
14881F2444L19120K48700A70316J68858N4755o3636J30562o8665K52601j49850
14871D94941n970J41628O5871Q8375k09836J67373q052O0664Q498N9358k62495
14860F00355p3477K43446A73221J15484K11998J93228C20562M73035j37562J14168
$$ y = [442072, 173053, 690444, 329960, 795267, 359903, 364058, 869153, 626739, 76117, 218980, 358047, 734744, 604787, 357029, 671399, 427847, 1042771, 1070978, 970384, 1009450, 1251705, 1401067, 1212925, 1692244, 1849165, 1209043, 1585965, 1486342, 1463745, 1342883, 1669914, 1620718, 1758369, 1764759, 1301712, 1205728, 1314433, 882426, 781702, 625426, 487554, 540516, 679121, 611485, 692594, 387329, 700698, 656434, 510728, 237685, 62444, 381564, 630264, 170316, 339174, 393929, 330293, 460855, 392190, 644791, 494941, 488971, 630599, 696470, 784845, 575009, 742382, 734330, 794994, 803492, 862850, 600355, 526878, 770324, 173221, 288705, 500703, 693931, 320562, 793597, 656035, 770203]
14850G70203j01701j2267P4071p2803k8704k58930K97156r9765J18108j4834P6942
14839G47476j16073l07728L80620C16987J83536J06196K95918l79951L9545K02692
14829G64923J36263j5681P9179J04461k23400K26094j57993k50075N22912l67722
14819H18961m1962J2815m099l4156C47908L0290K61636o5927J94687k05537A83608
14807F78612k67979J64670O2692K4052k27243K05334k7786j00391K24505k65512
14797D70954L77345j79753k55390L68759K8576j63293K63322l98528J49852M62949
14787A124793l9560j71808o0843l87433K09640J77231j50826j96631R0250k24145
14777C70668R7512p6371p8791J44037J79333B75910M01759J37733k37958K3861
$$ y = [770203, 668502, 656235, 730306, 657503, 628799, 369869, 667025, 567260, 685368, 670534, 747476, 631403, 323675, 704295, 316987, 500523, 606719, 902637, 522686, 562231, 764923, 901186, 885505, 964684, 1069145, 845745, 1071839, 913846, 663771, 1186683, 818961, 776999, 789814, 785715, 751559, 347908, 378198, 639834, 573907, 768594, 563057, 183608, 678612, 410633, 575303, 637995, 662047, 434804, 640138, 612352, 511961, 736466, 470954, 848299, 668546, 413156, 781915, 810491, 647198, 910520, 511992, 661844, 1124793, 1085233, 913425, 852582, 465149, 674789, 852020, 701194, 504563, 594813, 370668, 468180, 391809, 313018, 457055, 636388, 275910, 677669, 815402, 577444, 601305]
14767F01305o5611K3671N5255N109j77417M76573l13873J49209L68744K04091
14757A327056o34762K4765O031J56530r1856n0338J17217J30083D83317L80251
14747H63568q8933R5537m22466K63177J93424m05224N9678L20165J88187k64914
14737H02199j47215j2944j6853O0563L2458k65720J37917k1898k4439O11972k44527
14726I11513k18023N8828L43460j64493j8042K32274m44278J21062j04185L3228
14716G51344R4398J73573M966Q0252L85315K23006K51349m28132k72046L78143
14706A642168l56438k83689P4417l74739J22740O4174J23676o7532k73676L60446
14696A031547j36651j16781P07187o55394J49004K26470j04210k26764O42798
$$ y = [601305, 535694, 559365, 614620, 619729, 442312, 918885, 605012, 754221, 1122965, 1327056, 692294, 717059, 723090, 879620, 787764, 737426, 854643, 984726, 483317, 863568, 774635, 870172, 447706, 710883, 904307, 499083, 558761, 878926, 1067113, 802199, 654984, 642040, 625187, 685750, 718208, 452488, 590405, 568507, 544068, 1156040, 911513, 693490, 752318, 1095778, 931285, 913243, 1145517, 701239, 822301, 718116, 751344, 845742, 1019315, 1024281, 1104533, 1489848, 1712854, 1964203, 1536071, 1264025, 1642168, 1285730, 1002041, 1076458, 701719, 824459, 888633, 1012309, 944777, 671101, 1031547, 894896, 778115, 1485302, 829908, 978912, 1205382, 1101172, 874408, 1517206]
14687A517206l47058K47022L51530l99854L32331j97768P1931k62428k69212J95027
14677A238727m14465M74601k81036K90744l78217J9848K97127k92537j90032O723
14667G71483K2030J28616K21484j74894K31030j07895J98572l93188J25586M01678
14657A424502j96326O3660l20580J11808j76717M25105k26787O0372j01148J90818
14647A254707l0199M4815l22570m5530K74474N2044l43243J86583K87500j49264
14637A209317j69125N10066j11554J8950m03785M79520m73530j2338L43723o5750
14627A325494N6572m13759L73747o833j42573K14041m16147N31198n3204j85759
14617A282777P5919j5216j27610J50659m5808j09366K85060j68551J73509P158
$$ y = [1517206, 1170148, 1417170, 1768700, 1368846, 1701177, 1503409, 1575340, 1312912, 1043700, 1238727, 824262, 1298863, 1017827, 1308571, 930354, 950202, 1247329, 954792, 764760, 771483, 793513, 922129, 1143613, 968719, 1199749, 1091854, 1290426, 897238, 1022824, 1424502, 1228176, 1291836, 971256, 1083064, 906347, 1331452, 1104665, 1165037, 1063889, 1254707, 1224508, 1269323, 946753, 901223, 1175697, 1227741, 884498, 1071081, 1358581, 1209317, 1040192, 1550258, 1438704, 1457654, 1053869, 1533389, 1059859, 1047521, 1391244, 1325494, 1382066, 968307, 1342054, 1335221, 1192648, 1406689, 990542, 1521740, 1468536, 1282777, 1358696, 1343480, 1215870, 1366529, 1320721, 1211355, 1496415, 1327864, 1501373, 1508531]
14607A508531j12033K8502k90947M42480l36317J37605r3709J02396n376J07157
14597A488289J77040J34593j86404k5210m6702p3573k41934L90671k87099L50717
14587A680388j15727M79418l36707o3123M42165k64699p480l84693K16235J90484
14577A836261p8064L11576l48792n6353K27728L9790j07049K12711J83560m03876
14567A817492K03374L4018r0960K6344L9875N8226J31024J1242k10869K28057
14557B247823n2729n8635L45756n63646O23113o1822k13728K02099K6009Q376
14547B502616L52416J5035L47204j99703J93002L14505K4834L25430P75868N18353
14537E169560K30449P94036J375445K312283M001165O655905J1525868J425694
$$ y = [1508531, 1396498, 1425000, 1134053, 1576533, 1240216, 1377821, 1284112, 1386508, 1381132, 1488289, 1665329, 1799922, 1613518, 1588308, 1541606, 1468033, 1226099, 1616770, 1329671, 1680388, 1564661, 2044079, 1707372, 1644249, 2086414, 1821715, 1814235, 1429542, 1645777, 1836261, 1758197, 2069773, 1720981, 1664628, 1892356, 1932146, 1825097, 2037808, 2221368, 1817492, 2020866, 2054884, 1963924, 1990268, 2030143, 2088369, 2219393, 2230635, 2019766, 2247823, 2195094, 2136459, 2482215, 1918569, 2541682, 2479860, 2266132, 2468231, 2494240, 2502616, 2855032, 2870067, 3217271, 3017568, 3210570, 3525075, 3549909, 3875339, 4651207, 5169560, 5400009, 6194045, 7569490, 9881773, 13882938, 20538843, 32064711, 33490405]
14529C3490405j4358706q216818m277568j719152n45503N6852M42155J70980j290622
14520C752023p34669n71463j47657K76744r2407J39047l03224J11474R3057N3427
14510B576352j35544L23752l66200o5513O7613N0692j75275J60422L36483k29914
14500B542868m2351J16292o8194J95333J28647M9970O0571M1371J60475k21427
14490B963555n0932M87008J62035n08184n7342L6001L20944r8172J23932n2678
14480C326167k10138L20320j481L16481l94133K51163P7R3273K04764j62660q1305
14469C662528K08012P5456r159j55289J54590j9465K38684q5418l2906K67560
14459D304593k74481M28702q4493j39622J59874L5911J97619j84844K78510K1968
$$ y = [33490405, 19131699, 10914881, 6637313, 4918161, 4372658, 4429510, 4871665, 5042645, 3752023, 3017354, 2445891, 2298234, 2574978, 2482571, 2621618, 2318394, 2429868, 2522925, 2576352, 2440808, 2764560, 2398360, 2332847, 2400460, 2451152, 2275877, 2436299, 2772782, 2542868, 2500517, 2616809, 2548615, 2743948, 2872595, 2922565, 2983136, 3024507, 3184982, 2963555, 2912623, 3399631, 3561666, 3053482, 2996140, 3032141, 3353085, 3254913, 3378845, 3326167, 3116029, 3436349, 3434868, 3751349, 3357216, 3608379, 3608456, 3701729, 3906493, 3743833, 3662528, 3870540, 3945996, 3936837, 3781548, 3936138, 3916673, 4155357, 4069939, 4037033, 4304593, 4030112, 4458814, 4374321, 4234699, 4394573, 4430484, 4628103, 4443259, 4721769, 4743737]
14449D743737p6496N56706l12137K14385l7143K18692m61793L02865m0913J22168
14439E230071j28666J08294K1408K08971L93172k15333j46263k2352M18160L07400
14429F174862k37330O3535K14708m448K53481n1558N5322R4141J02802k8651L25157
14418F962021J21575O2703k92157N37387j1216l39148L08018L33726J4153l6382
14408G660680J3608K61615J08224M84910J52202K61434j34047J11428j69829L82592
14398I132817L15526m71390N11239L12675k21953L77979L464m8213M76304j5269
14388A0373179N73385j3967J99814j23259L81384M8461l8784L52000K23630k6034
14378A1949809K13084P4520M46382M53769n9023K42796N24058k49935M05672L73491
$$ y = [4743737, 4667241, 5223947, 4911810, 5126195, 5089052, 5307744, 4845951, 5148816, 5107903, 5230071, 5101405, 5209699, 5231107, 5440078, 5833250, 5617917, 5471654, 5449302, 5867462, 6174862, 5937532, 6001067, 6215775, 6211327, 6464808, 6413250, 6468572, 6562713, 6665515, 6636864, 6962021, 7083596, 7146299, 6854142, 7391529, 7380313, 7041165, 7349183, 7682909, 7697062, 7660680, 7674288, 7935903, 8044127, 8529037, 8681239, 8942673, 8808626, 8920054, 8750225, 9132817, 9448343, 8976953, 9488192, 9800867, 9578914, 9956893, 9960357, 9912144, 10388448, 10373179, 10946564, 10932597, 11132411, 11009152, 11390536, 11438997, 11400213, 11752213, 11975843, 11949809, 12162893, 12237413, 12683795, 13137564, 13078541, 13321337, 13845395, 13595460, 14001132, 14374623]
14368A4374623K9049K69623Q14025J93970N2164K32447P27013j2950L66275P3379
14358A7119618Q21454K77375l28109R11584K89198J29419P70179N85123M65779
14349B1041620O61083J84070J53317O94602L22490M67890O3622J016460R0335
14340B4695489R27587M22415R31233N78997M65000Q83040P77802P66389P00273
14331C1148225Q11524J012402N77688J150513Q29924P65261J114387J039743J217817
14322C9667484R30845J305152J216061J183156J506078J312907J352623J803846
14314E0278152J743363J565791J645932J585371K406849K175434K031833K152857
14306F5585582K136739K797114K772026K374265K958091L168156L021791L181633
$$ y = [14374623, 14403672, 14673295, 15487320, 15681290, 15733454, 15965901, 16692914, 16679964, 17046239, 17119618, 17941072, 18218447, 17890338, 18801922, 19091120, 19220539, 19990718, 20575841, 21041620, 21702703, 21886773, 22040090, 22734692, 23057182, 23525072, 23588694, 24605154, 24695489, 25623076, 26045491, 26976724, 27555721, 28020721, 28903761, 29681563, 30447952, 31148225, 31959749, 32972151, 33549839, 34700352, 35530276, 36295537, 37409924, 38449667, 39667484, 40598329, 41903481, 43119542, 44302698, 45808776, 47121683, 48474306, 50278152, 52021515, 53587306, 55233238, 56818609, 59225458, 61400892, 63432725, 65585582, 67722321, 70519435, 73291461, 75665726, 78623817, 81791973, 84813764, 87995397]
14298H7995397L881020L565509M148572M079113M489317M667000N117022N071164
14290A23014114N733019N848122O115235O951292P116164P467769P908217Q429915
14282A78583847R060672R225317R897257J1220941J0996515J1850331J2512846
14275B53347726J2889073J3690346J4400749J4477348J4328199J4414643J4982874
14268C52530958J4280320J4020664J3170324J2051000J1273609J0161793R961213
14261D37449881R018806Q574243P684401M389641K465954J428368J690519j810998
14253D70890815p036273n760128p817178r632848j2709448j2380179j3310882
14246D02243879j4048259j4392082j3688710j4601680j4476793j4156696j4009947
$$ y = [87995397, 91876417, 95441926, 99590498, 103669611, 108158928, 112825928, 117942950, 123014114, 128747133, 134595255, 140710490, 147661782, 154777946, 162245715, 170153932, 178583847, 187644519, 196869836, 206767093, 217988034, 228984549, 240834880, 253347726, 266236799, 279927145, 294327894, 308805242, 323133441, 337548084, 352530958, 366811278, 380831942, 394002266, 406053266, 417326875, 427488668, 437449881, 446468687, 455042930, 462727331, 467116972, 469582926, 471011294, 472701813, 470890815, 463854542, 458094414, 450277236, 440644388, 427934940, 415554761, 402243879, 388195620, 373803538, 360114828, 345513148, 331036355, 316879659, 302869712]
14239C02869712j3597712j3325780j2469398j2067579j1674378j1152946j0442926
14232B18138993j0718239j0878105r805907q988652q946329q429113p636613p281011
14224A45455024o691886o276871o030017n545188n411515n163617m546036m063111
14216A01726783l897540m121993l841024l600444l225790l115830l186750k624148
14208G4113264k678492k707517k031403k059514k305149k509719j567853k117289
14200E6136328j883065j347220j352794j727939j572524j464539j573589j188481
14192D4026177q12987j035665j203834j332576j167363j032692o80559q64254
14184C5896247j449223q62931m35111j308248n15629q95108o06016p67824m29781
$$ y = [302869712, 289272000, 275946220, 263476822, 251409243, 239734865, 228581919, 218138993, 207420754, 196542649, 186736742, 177748090, 168801761, 160372648, 152736035, 145455024, 138763138, 132486267, 126456250, 120911062, 115499547, 110335930, 105789894, 101726783, 97829243, 93707250, 89866226, 86265782, 83039992, 79924162, 76737412, 74113264, 71434772, 68727255, 66695852, 64636338, 62331189, 59821470, 58253617, 56136328, 54253263, 52906043, 51553249, 49825310, 48252786, 46788247, 45214658, 44026177, 43213190, 42177525, 40973691, 39641115, 38473752, 37441060, 36760501, 35896247, 34447024, 33584093, 33148982, 31840734, 31325105, 30429997, 29823981, 29056157, 28626376]
14175B8626376r43216q33882k07541j132852j77522o46663q02169l32123m68093
14166B3082315k26830n95286k40881o70517o98963l06428o98002k00275l4056
14157A9411077m56641m00422l68113l30427n22975m52304j55930k05086n26554
14148A5992625M4795R669q18762l42906R578m03602k25936Q9995q59495k31033
14138A3264928k02904M2094k54748j88231l04782k73643K3685m18489m0774j21771
14128A1525365o3131o5628p0576k18948j87279m89039j62614J33419l06905j16313
14118I978351k45053j9764K2098q68159M31344j89676l29851K96948l13794j65849
14108H596595j92768q6832q8469r7741J84600o9606o21110M62676l98430j82872
$$ y = [28626376, 27683160, 26849278, 26641737, 25508885, 25331363, 24684700, 23882531, 23550408, 23082315, 22855485, 22260199, 22019318, 21348801, 20649838, 20343410, 19645408, 19445133, 19411077, 18954436, 18554014, 18185901, 17855474, 17332499, 16880195, 16724265, 16519179, 15992625, 16037420, 16047089, 15228327, 14885421, 14894999, 14491397, 14265461, 14355456, 13495961, 13264928, 13062024, 13104118, 12849370, 12661139, 12356357, 12082714, 12106399, 11687910, 11647136, 11525365, 11462234, 11396606, 11326030, 11107082, 10919803, 10430764, 10268150, 10401569, 10094664, 9978351, 9733298, 9713534, 9735632, 8867473, 9298817, 9109141, 8779290, 9076238, 8762444, 8596595, 8403827, 8316995, 8228526, 8130785, 8315385, 8245779, 7624669, 8087345, 7688915, 7506043]
14098G506043k93515L2464j0578l45036K99800m08185n8675j7559j72187L11861
14088F844433l42220J44810j73687R168n04050K1213L21002l68303K75716o44816
14078E583266J65958m2375J60721k35570J52713o21201M28988o5644q6577n46300
14068D893979J61782K16190l41240o5085L34589k28584j18479J3800k36585q2279
14058D548088L83460k84989k35155J25075J7433M65673m83452l44568L87799l49222
14048D230142k0815P5419J43654j10419r2892L9471j93788o7943O9832L01937
14038D374598m81009k64560P7048K64244r0753j38978k54843K93075l22881J98381
14028C654322j21840n46886J30864Q8968k3331O0136P5772J34479k9978k45466
$$ y = [7506043, 7212528, 7244992, 7234414, 6889378, 7189178, 6780993, 6722318, 6704759, 6532572, 6844433, 6502213, 6647023, 6473336, 6482504, 5978454, 5999667, 6320669, 5952366, 6228082, 5583266, 5749224, 5706849, 5867570, 5632000, 5784713, 5163512, 5592500, 5526856, 5440279, 4893979, 5055761, 5271951, 4930711, 4865626, 5200215, 4971631, 4853152, 4866952, 4630367, 4548088, 4931548, 4646559, 4411404, 4536479, 4553912, 5019585, 4536133, 4191565, 4579364, 4230142, 4209327, 4284746, 4428400, 4317981, 4225089, 4264560, 4070772, 4002829, 4072661, 4374598, 3893589, 3629029, 3706077, 3970321, 3879568, 3740590, 3485747, 3778822, 3455941, 3654322, 3532482, 2985596, 3116460, 3205428, 3182097, 3242233, 3318005, 3452484, 3422506, 3177040]
14018C177040k84257L45570P9732K11107j43776k48688R2727l08779J19233N7620
14008C097529j56636O2708l13975J16101q6507k87247K13307L1850R1970k21061
13998B548039j20847L78926k55492K57563k59873L34726l05265j27495l1859L0478
13988B448901R6257M5902k50171k5746L4905K3250L51534j18483O7591L78695
13978C052635n8664K41235N05287J126878J307807L487824N680884J0958383R687998
13969C5990267j2323690q487348n091891k540394j450163j129140k01639r82516
13961C783486K28898m85313m23737J06033m25275K75600j9406m98248K7351J56529
13951B725918k03679J23934m10470k483k7032K56114k31332j72804r0811M599
$$ y = [3177040, 2892783, 3238353, 3318085, 3529192, 3385416, 3136728, 3229455, 2920676, 3039909, 3097529, 2940893, 3003601, 2689626, 2805727, 2719220, 2431973, 2645280, 2677130, 2769100, 2548039, 2427192, 2806118, 2550626, 2808189, 2548316, 2883042, 2577777, 2450282, 2418423, 2448901, 2545158, 2591060, 2340889, 2315143, 2350048, 2373298, 2724832, 2606349, 2673940, 3052635, 2993971, 3235206, 3740493, 4867371, 6175178, 9663002, 15343886, 26302269, 35990267, 23666577, 15179229, 10087338, 7546944, 6096781, 4967641, 4766002, 3783486, 4012384, 3527071, 3103334, 3209367, 2784092, 3059692, 3040286, 2542038, 2569389, 2725918, 2522239, 2646173, 2235703, 2233220, 2206188, 2462302, 2230970, 2058166, 1967355, 1971954]
13941A971954K57012j93001k10515K05625q946j34794o857J89669n696Q4395n69711
13930A579135L69558j07765j76904K61395m75444L82323J93510o8836j03780o7197
13920A785995j84631L48005j83868Q2678J21901m04387L81544l06572K28934k07265
13910A662334J24276n77938M27695K85367m72114K94059l37023K87329j40965
13901A553020J27465j98139p5667M19046m63187L51716m53162L6036o8266M55202
13891A684064l91668r1296M87077m23796L47355j68345r7165K66021l17281J37201
13881A432167j90795j07862J12290o9510K26460O087j48680j23801L23618m9341
13871A410633j26548K39315l04827p7992L32626k47796K84484j48912L9049K2741
$$ y = [1971954, 2228966, 2035965, 1825450, 2031075, 2022129, 1887335, 1880478, 2070147, 2064451, 2148846, 1579135, 1948693, 1840928, 1664024, 1925419, 1449975, 1832298, 2025808, 1956972, 1853192, 1785995, 1601364, 1949369, 1765501, 1848179, 1970080, 1565693, 1947237, 1640665, 1869599, 1662334, 1786610, 1208672, 1636367, 1921734, 1449620, 1743679, 1406656, 1693985, 1553020, 1680485, 1482346, 1406679, 1825725, 1362538, 1714254, 1261092, 1297128, 1228862, 1684064, 1292396, 1201100, 1688177, 1264381, 1611736, 1443391, 1346226, 1612247, 1294966, 1432167, 1241372, 1133510, 1245800, 1176290, 1402750, 1408837, 1260157, 1136356, 1459974, 1410633, 1284085, 1523400, 1218573, 1140581, 1473207, 1225411, 1509895, 1360983, 1400032, 1422773]
13861A422773o5103j25472M6441j33088Q9890l53680N23714j02115j22274K56268
13851A437354N2007l45903K80245j96233j93855j6293K50648l43440L48076J72316
13841A444922l20616j97328K01088O0669K8364k78887L9895K05756j28361m7477
13831A008025o6524K18177o0380Q241K16180o3007j82789J33460j06691j20579
13821I84113Q8854r3834j27889L17551k95461J98693j07204k36875J14578K31609
13811A074135k00657P3136J40304D50345J73164j15439K94644m9968o5171J71567
13801H59142o9648p7686M10227k21749K41295l32836Q7948K9885k9895n295K39909
13790A131297m89547R2962R6740k71368K83402j51495K37865m17159L7825K28982
$$ y = [1422773, 1357670, 1232198, 1278639, 1145551, 1235441, 881761, 1405475, 1303360, 1181086, 1437354, 1489361, 1143458, 1423703, 1227470, 1033615, 1017322, 1267970, 924530, 1272606, 1444922, 1124306, 926978, 1128066, 1188735, 1217099, 938212, 978107, 1183863, 1055502, 1008025, 941501, 1159678, 1099298, 1107539, 1323719, 1260712, 1077923, 1211383, 1104692, 984113, 1072967, 979133, 851244, 1168795, 873334, 1072027, 964823, 727948, 842526, 1074135, 873478, 946614, 1086918, 450345, 623509, 508070, 802714, 752746, 687575, 859142, 789494, 711808, 1122035, 900286, 1141581, 808745, 896693, 926578, 896683, 891388, 1131297, 641750, 734712, 831452, 560084, 843486, 691991, 929856, 512697, 550522, 779504]
13780G79504K23554j01560J28720j57717j32582q1850K11865m9362n2846O9006
13770H36732C51451J28334J26410M17307l85436M06224C27769M58729O4079l22024
13760E28553M59023l8911j15810j87998L53639D52675N7688J18101R0006J54778
13750H73248k47119J9609K84067O7960j94824l9526l20471L00807J0421n9004
13740F95168p0238j69733N0951L97170j37654m7175k13928J40345k17120M11995
13730H39781o3449o4332J25714l14688L3218L7091M28671D90042B37884L34099
13720E71983O3240K80129D17657K9959M1611L1035K75057j43120j74794K4148
13710E01553J06577r5873J1665A76194M88064O8204l10490B06355N29945k06404
$$ y = [779504, 1003058, 901498, 1030218, 872501, 739919, 658069, 869934, 820572, 767726, 836732, 351451, 479785, 606195, 1023502, 638066, 1044290, 327769, 786498, 850577, 528553, 987576, 948665, 832855, 644857, 998496, 452675, 510363, 628464, 718470, 873248, 626129, 645738, 929805, 997765, 802941, 763415, 442944, 743751, 754172, 695168, 624930, 455197, 506148, 903318, 765664, 718489, 504561, 644906, 427786, 839781, 776332, 712000, 837714, 523026, 556244, 593335, 1022006, 490042, 237884, 571983, 635223, 915352, 417657, 447616, 489227, 520262, 795319, 652199, 477405, 501553, 608130, 512257, 523922, 176194, 664258, 732462, 421972, 206355, 736300, 529896]
13700E29896j55188K11034j27787O9128J07269j770q9342j06869J92049k98383
13690C30037K39266A62535K78459L1911L09186k76600o8910J27667n9862L6537
13680E40923j36848J08509L18287l40371J08294M003B54053K46202J95629l16864
13670C79020M48836q0144k83158J813K25869J8155J3481B54244L94331m3886j61228
13659D43461n1628m5891J73316B47481P5630N3355r1637M60948j79719n8573K0609
13648E28094j62039J03659K4891k32819L76808K62068B58775J10896j15796k0037
13638B33838n2617L8781J20556j3150J90227f9509F35877B52497L79376N8225
13628F90098k97497j28668N45920l19401j40466P0936p505m535j62110K05959
$$ y = [529896, 374708, 585742, 457955, 527083, 634352, 632582, 543240, 436371, 628420, 330037, 569303, 162535, 440994, 472905, 782091, 505491, 436581, 564248, 504386, 540923, 404075, 512584, 830871, 490500, 598794, 602797, 254053, 500255, 695884, 379020, 827856, 747712, 464554, 466367, 692236, 710391, 723872, 254244, 648575, 604689, 443461, 391833, 345942, 519258, 247481, 323111, 376466, 284829, 745777, 566058, 507485, 528094, 366055, 469714, 494605, 261786, 638594, 900662, 258775, 369671, 253875, 233838, 181221, 220002, 340558, 327408, 517635, -69509, 635877, 252497, 631873, 690098, 392601, 263933, 809853, 490452, 349986, 420922, 413417, 408882, 246772, 452731]
13618D52731J02908j82836K95173j42078K2964j75228O3759r0157L07341j65312
13608D89265J36000m0624M4837J56204B34651P1833K07699L63992C97664r4047
13598C03617J0524j6095C495L48370K11933A65648N53659k41155j4859F4402J33485
13587A97887J17798P9423J13248A61165J52888J10309j3029O14r4068L12493k11060
13576D19312j71624M6735j22897M49718k83594R4353K15532j96825k4177j77234
13566B49299L14505a14060D88924B16480F694K97860r0085o8327J05850G1238
13555B72970j7708p7669Q1863n5690N04439j17169A76547L2524J71602j16635
13545B64038J08219J07572J60243k03270j73644Q9652I9413M19866J16444B34715
$$ y = [452731, 555639, 372803, 667976, 525898, 548862, 373634, 437393, 347236, 654577, 489265, 625265, 584641, 629478, 785682, 234651, 306484, 514183, 878175, 397664, 303617, 314141, 298046, 3495, 351865, 563798, 165648, 719307, 478152, 463293, 64402, 197887, 315685, 395108, 508356, 161165, 314053, 424362, 411333, 411947, 317879, 630372, 419312, 247688, 294423, 171526, 621244, 337650, 432003, 647535, 450710, 426533, 249299, 563804, -114060, 488924, 216480, 6694, 304554, 214469, 146142, 251992, 71238, 272970, 255262, 177593, 259456, 203766, 708205, 591036, 176547, 209071, 380673, 264038, 372257, 479829, 640072, 436802, 263158, 352810, 99413, 519279, 635723, 234715]
13534A65893L44050A21583J03493J96261j3036o530A39933Q1534j7441K47960
13524D51986H1532K29657p6544L2470G2890J31026L62034B79522r381j21131L78164
13513E27174F4180k2354K58468R4829F3909L59215D7097P6848K27373a53811B95657
13501A85006J03154l6632J77600j60421O6981J67420A93004j8787B4982K27193
13491B52175D453K18048L8152f1232C3052K64089A01609K83949j46278R257e9886
13479H20058m06999Q4851J03591A87407K18569H8662M59676g8253A52579K0506
13469A73085J22031p8356j432G59J92474J02524K08149F4628b5202A18859n5389
13458F3470K99200n4296A01360J45507k3412E8995K86013k1885D8659A6697N23430
$$ y = [165893, 509943, 121583, 225076, 421337, 408301, 401771, 139933, 221467, 204026, 451986, 81532, 311189, 234645, 267115, 72890, 203916, 565950, 279522, 270141, 149010, 527174, 64180, 41826, 300294, 395123, 63909, 423124, 47097, 123945, 351318, -153811, 295657, 185006, 288160, 251528, 429128, 268707, 335688, 503108, 193004, 174217, 24982, 252175, 4453, 222501, 260653, -61232, 33052, 297141, 101609, 385558, 239280, 248537, -59886, 820058, 413059, 497910, 601501, 187407, 405976, 88662, 548338, -78253, 152579, 173085, 295116, 216760, 215328, 759, 193233, 295757, 503906, 64628, -25202, 118859, 63470, 362670, 308374, 101360, 246867, 223455, 58995, 345008, 323123, 48659, 16697, 540127]
13447E40127k20248r0873d1135j10112A86268L09837A90692J37228J61093I7764
13436A9780J8713i9322A87239H8241K46713j17306l3558G2300R6509J88600A39672
13424C20586q0545a57077B81675q1655G2191J51614q2795A5698M28868A26314
13413B80058A17398J6559L07047B19503J00218D9776L14100E6600J51428J5276
13403B23304N8654L6372O1050o2284A52630J16400H5991L2095a6975k6025C60110
13391B43292A12542N3323a50979C24614j46178K4960a36264d1346D32240K49503
13381F81743l16171A70060J6776O7275p7615J92622j11106a28450A45629a05424
13370a74487A16K6653I006J01599J28219D6022J47327G6544K03587J438A26747
$$ y = [540127, 319879, 229006, -41135, -151247, 186268, 496105, 190692, 327920, 489013, 97764, 19780, 38493, -99322, 187239, 88241, 334954, 217648, 184090, 72300, 168809, 357409, 139672, 320586, 240041, -157077, 281675, 200020, 72191, 223805, 141010, 15698, 444566, 126314, 280058, 117398, 133957, 441004, 219503, 319721, 49776, 363876, 56600, 208028, 223304, 281958, 318330, 379380, 317096, 152630, 269030, 85991, 118086, -16975, -43000, 360110, 243292, 112542, 165865, -150979, 324614, 178436, 203396, -136264, -41346, 432240, 681743, 365572, 170060, 186836, 254111, 176496, 369118, 258012, -128450, 145629, -105424, -174487, 116, 26769, 9006, 110605, 238824, 46022, 193349, 76544, 280131, 281569, 126747]
13358E20504j35666A22908C8692K08265J28983j63572o2269L5909K70469e687
13347a80952E73899H4424L197K21828F6805K21491K80308B17483K7904J22567
13337C67954A59022L43011o2499A12222O3658K37005B02299L43580k7481k27052
13327B91346J02300A65785J76682p2927I4255J85158J01530A82971K87651j41246
13317C29376J29269I9353K12885r9438n0048L93060A6379h1520E63481H92L04245
13306C05137c5975H6716P7511K41807D3681d3622C89184b4921A73485J34742A8529
13294A61416B325L41120a69461G5000r460a80419l6490C42651A63010K0911D7426
13282A67528C3947J47001M4023q1836a6261C59551b3926D3548a06378A16844f7318
$$ y = [520504, 384838, 122908, 38692, 246957, 375940, 212368, 150099, 186008, 456477, -5687, -180952, 573899, 84424, 87621, 309449, 66805, 288296, 568604, 217483, 245387, 367954, 159022, 502033, 439534, 112222, 175880, 412885, 202299, 545879, 518398, 291346, 393646, 165785, 342467, 269540, 94255, 279413, 380943, 182971, 470622, 329376, 458645, 99353, 312238, 212800, 162752, 555812, 16379, -81520, 563481, 892, 305137, -35975, 86716, 164227, 406034, 43681, -43622, 389184, -24921, 173485, 308227, 18529, 161416, 2325, 343445, -169461, 75000, 65540, -180419, -216909, 342651, 163010, 183921, 47426, 167528, 33947, 180948, 224971, 143135, -16261, 359551, -23926, 43548, -106378, 116844, -67318]
13270A34372K68569j90685J778c2913B82416G9090J69781L2968a7775n6055C20050
13258A32657J30641A16801a26726C54723G3208i157H9060B3287K73440D4845J71273
13247B16118h9677C82856J7010p6310c8256A72641b123I5388N6659K91839C453
13235D77638b24640B35655Q9129J22464A07953a651B25053b9037j54572A23690
13224C20888r3898F1812J20972b17448C2661J18730K62235A76241R4176j13696
13214A56721b10607J00233E14088i0951G6813L83607k21588f8316C28316e3623
13203a25717A25674O3717f0930k1008H9141K71599G164h99k3456A98102K8163
13192B26265b52678A06121B0209J78363m2243h5752l3291A12094J06153d03970
$$ y = [134372, 402941, 212256, 214034, -32913, 282416, 79090, 248871, 281839, -17775, -73830, 320050, 132657, 263298, 116801, -126726, 354723, 73208, -9157, 89060, 23287, 296727, 44845, 216118, -89677, 382856, 399866, 323556, -38256, 172641, -2123, 95388, 152047, 443886, 3453, 477638, -224640, 235655, 324784, 447248, 107953, -1651, 225053, -29037, -183609, 123690, 320888, 226990, 61812, 182784, -217448, 32661, 151391, 413626, 176241, 270417, 156721, -210607, -110374, 514088, -90951, 76813, 460420, 238832, -68316, 328316, -53623, -125717, 125674, 189391, -60930, -81938, 89141, 360740, 7164, -899, -24355, 198102, 226265, -252678, 106121, 20209, 198572, 156329, -85752, -119043, 112094, 218247, -403970]
13181B86921A28602o1217K32616m1761a9955A80897c99961B67966a7540D4814
13170i5976B64556a84616O5639B41561F6907d832j5395F4285g4914B42461b38658
13158I6111K89042f5471A14922a57537j7341B32406a18359D9692J43376J9810
13148B12878K1349J81280A18603b4687r5796B28498r8151a76029I5449K60665
13138C56114c9108k3257K5410A82173a65625c9703a2943d380A06161O3003g0779
13126b08662A76395P1428N6153A41453P4697c6054j44519e0279H2623a41139m5519
13115a86658D1080K93974J19034H9938L7142J52953A3480J14000b45040B5931
13104i1875D12120f8147C60846J24787G4717Q3092L4884d5331p5292o5253A39547
$$ y = [286921, 128602, 67385, 300001, 258240, -19955, 180897, -399961, 267966, -17540, 44814, -95976, 264556, -184616, -118977, 241561, 66907, -4832, -20227, 64285, -74914, 242461, -238658, 96111, 385153, -65471, 114922, -157537, -174878, 232406, -118359, 49692, 193068, 212878, 234227, 415507, 118603, -24687, -120483, 228498, 130347, -176029, 95449, 356114, -39108, -62365, -36955, 182173, -165625, -39703, -12943, -4380, 106161, 169164, -70779, -208662, 176395, 247823, 303976, 141453, 216150, -36054, -180573, -50279, 82623, -141139, -186658, 41080, 335054, 454088, 89938, 127080, 280033, 13480, 127480, -245040, 25931, -91875, 412120, -68147, 360846, 485633, 74717, 157809, 192693, -45331, -120623, -185876, 139547]
13092e8379o4225C98380b8403A36138a01n1711E5978c84441A26372M6110J93158
13081C65640d5291H8891i8037B0575J24970a2359k7041A2453b5021B29863B2947
13069I110J7870J95552l3305e536k10400C24214h7335B41431h9500G0793b60208
13057a33838a991j6592C26329B9505m185K54176n8885I2125a23305C2781a4530
13045a05709A52454J49023c7631A18374k4834j4372J68246a16340b4415G2156
13034A66693L06070A65624K24306C5046J23271C1410N6262a59870C16682c0509
13023F8870C51L15485I5629c09595J09333N5340L4806B25174F4505M6283K17e687
13010D4948d6469C38296E2590J53840C12O0459K30641e8852A20019J4964n7068
$$ y = [-58379, -122604, 398380, -28403, 136138, -101, -51812, 55978, -384441, 126372, 172482, 365640, -45291, 88891, -98037, 20575, 145545, -12359, -39400, 12453, -25021, 229863, 22947, 9110, 26980, 222532, 189227, -5536, -215936, 324214, -87335, 241431, -89500, 70793, -260208, -133838, -1991, -18583, 326329, 29505, 25320, 279496, 220611, 92125, -123305, 32781, -14530, -105709, 152454, 301477, -37631, 118374, 93540, 79168, 247414, -116340, -24415, 72156, 166693, 472763, 165624, 389930, 35046, 158317, 31410, 87672, -159870, 316682, -30509, 68870, 351, 315836, 95629, -309595, -200262, -144922, -110116, 225174, 64505, 110788, 111005, -5687, 44948, -46469, 338296, 52590, 206430, 312, 60771, 291412, -58852, 120019, 134983, 77915]
12999G7915J10454E821K47593A21865c0959J5442k5559k22067C44747J22264A80520
12987a32276I6814a62720g773j4019I2846c5193J1294A8723g9844A46770n456
12976A41314J00626A13609J0463b7882F9094b7117j23540d302p7727N58J0701
12965g0770A51328f4845B72566o7821K42455a65236k1290A36433a5559B09524
12954A16510j0232a26961g848j43969e7766k31578a43382O7446r1095A11404c75322
12942B79019Q5459A01926K43116A01257J88885b0403F9111a94996B10776o1059
12932A49717h8626B82596H950e9424A4768P8957c2277j17360A33075b46841a18084
12920e94I3220a07973a557D82J44555c4516A49912l8903D3546a97245I5046B5168
$$ y = [77915, 188369, 5821, 253414, 121865, -30959, -15517, -41076, -263143, 344747, 467011, 180520, -132276, 96814, -162720, -7773, -21792, 92846, -35193, -23899, 18723, -79844, 146770, 141314, 241940, 113609, 124072, -27882, 69094, -27117, -150657, -4302, -82029, -81471, -70770, 151328, -64845, 272566, 204745, 447200, -165236, -186526, 136433, -15559, 209524, 116510, 106278, -126961, -7848, -151817, -57766, -289344, -143382, -75936, -167031, 111404, -375322, 279019, 364478, 101926, 345042, 101257, 290142, -20403, 69111, -194996, 210776, 149717, -88626, 282596, 8950, -59424, 14768, 93725, -32277, -149637, 133075, -246841, -118084, -594, 93220, -107973, -1557, 482, 145037, -34516, 149912, 111009, 43546, -197245, 95046, 25168]
12907a2502k81426A99933a49246N6112b0586A61494d42420H2716j4559J7615J24403
12896B10175N9202m4689a16805N5302j00143A44258L2004K5647b04713a8510p3141
12885i1651E943f3915p9561L3613r4266k9989Q1570B371J95768a87701j6900A47623
12872B30091a55475B03038G5382L35715b10252H2864b67129B18491H6122J01965
12862A88087i6932c8441j19769E3505a77445A72365a3536j04395j62630b8119
12851f9265k4425G900b2001j95994A1420g6717B3682b42743L4668Q9648C75023
12839I3969b22148F4156L9246a26016I2451c27518J18438F0002i9263B14735L1715
12828B46450E4939R6514R4080a0312B62885p01p8103l6676c20645A7276a53724
$$ y = [-12502, -293928, 199933, -149246, -93134, -20586, 161494, -442420, 82716, 68157, 85772, 210175, 269377, 224688, -116805, -61503, -161646, 144258, 176262, 201909, -204713, -18510, -91651, 5943, -63915, -143476, -109863, -204129, -234118, -152548, 2371, 198139, -187701, -204601, 147623, 230091, -155475, 203038, 75382, 411097, -210252, 82864, -267129, 218491, 86122, 188087, -96932, -38441, -158210, 53505, -177445, 172365, -13536, -117931, -280561, -28119, -69265, -93690, 7900, -22001, -217995, 11420, -76717, 23682, -242743, -208075, -118427, 375023, 93969, -222148, 64156, 103402, -126016, 92451, -327518, -209080, 60002, -99263, 214735, 246450, 54939, 151453, 245533, -10312, 262885, 262184, 184081, 147405, -320645, 17276, -153724]
12816b474r0275A95140J07425G5669R7844J4176p1953m8753c18402c0768p4476
12805a05244l4752C91164a76044B00630b52573A32682O4784r627n7463L5124f2902
12793a15917A80754d0106J0042j14049E4683f1093A82417D0840K4611a48216j79095
12782c27311A60847P0616B4548h3459j72188h5030C6851R1831A1217O4396d959
12770a71266k6902j63879A14574f4005G4529J73553K1967b41187B4796b61337
12759A99669J19049a67076f0286B00603b85656I1297b47417e1542A15992M280
12749A20272b87171F077a57026A41541a19899A22897Q4216j4610o581b56804d1647
12737b59798B2788a36709g235j04234k43704C09976B0268e2695A1726a943B09541
$$ y = [-2474, -92749, 195140, 302565, 75669, 173513, 187689, 115736, 66983, -318402, -30768, -105244, -139996, 391164, -176044, 200630, -252573, 132682, 197466, 187839, 130376, 165500, -62902, -115917, 180754, -40106, -30064, -144113, 54683, -61093, 182417, 40840, 65451, -148216, -327311, 160847, 231463, 24548, -83459, -255647, -85030, 36851, 128682, 11217, 75613, -4959, -171266, -198168, -362047, 114574, -64005, 74529, 248082, 270049, -241187, 24796, -261337, 199669, 318718, -167076, -60286, 200603, -285656, 91297, -247417, -51542, 115992, 120272, -287171, 6077, -157026, 141541, -119899, 122897, 207113, 192503, 185922, -256804, -41647, -259798, 22788, -136709, -7235, -111469, -355173, 309976, 20268, -52695, 11726, -1943, 209541]
12725h4879D0807J1569i6042F3388J3915b07828A8148g6141G6715a51764A42572
12713b24333P8255D01898a99130N6183b5840j7142A53215d08686A17196e889k87387
12702b93276a23738A12728e598m4282m0374M66b8217B76078A12672J43398I6870
12690B30139b6042p1411M5591F06466B37945F8538c43083a12693e0580B14235
12679D78255A88947J30497a5774j61688e1615D1597c9361A65588n2332L7120n9410
12668I0966B4186L293a34015A694J97818B7923K12574I2952K4002l4541L36083
12657D18496A4586N6058J30993J70811A30069a44111F1075a59689B40436J9341
12647B59777A24034J60659j10670a84015O0212A84709p7746J21927P1746b19996
$$ y = [-84879, 40807, 52376, -96042, 63388, 77303, -207828, 18148, -76141, 76715, -151764, 142572, -224333, -146078, 401898, -199130, -142947, -25840, -42982, 153215, -408686, 117196, -5889, -293276, -123738, 112728, -5598, -49880, -90254, -89788, -28217, 276078, 112672, 256070, 96870, 230139, -26042, -97453, -51862, 606466, 237945, 68538, -343083, -112693, -50580, 214235, 478255, 188947, 319444, -15774, -177462, -51615, 41597, -39361, 165588, 113256, 150376, 90966, 24186, 27479, -134015, 1694, 199512, 27923, 240497, 92952, 116954, 82413, 418496, 14586, 70644, 201637, 372448, 130069, -144111, 61075, -159689, 240436, 259777, 124034, 284693, 174023, -184015, -123803, 184709, 106963, 228890, 300636, -219996]
12636b96223C62830i8087j7300C939K36106j09414P511r83e4833d422k5802n36122
12624e66346C6548j3560M58376I3626O66a27232N5109H7956J05941n2377M1478
12613A82998q5955e7319C08321A41588m2211J29972j3534M7573a60123p7316H1744
12601B83223a33852O0491B4371J66215B0869M8031Q2396O9061b706k5126l4455
12590f2287k6026J0862c2811A35922L0691a83136c0742A04479J9883A6827Q321
12579B5148b23029a9898j85804b7157m6987B810b43038e077A65094K6060D7207
12567B41563f3632I428R1282D8871g0229r4206A23186c40678f171A67799E571
12555A44983a54589C36053h5930H3452M6014Q3108Q1580c04922n8113Q4913A13657
$$ y = [-296223, 362830, -98087, -115387, 3939, 240045, 130631, 138142, 137159, -54833, -4422, -30224, -566346, 36548, 22988, 481364, 93626, 94292, -127232, -72123, 87956, 193897, 141520, 182998, 97043, -57319, 308321, 141588, 99377, 229349, 215815, 263388, -160123, -237439, 81744, 283223, -133852, -73361, 24371, 190586, 20869, 68900, 151296, 220357, -2706, -27832, -62287, -88313, -77451, -32811, 135922, 166613, -183136, -30742, 104479, 124362, 16827, 25148, -223029, -19898, -205702, -27157, -74144, 2810, -243038, -5077, 165094, 191154, 47207, 241563, -63632, 9428, 100710, 48871, -70229, -164435, 123186, -340678, -6171, 167799, 5571, 144983, -154589, 336053, -85930, 83452, 129466, 212574, 294154, -304922, -363035, -278122, 113657]
12543B19143a26331c5433C4865i0840C1855J43279c07067G9149a39788c1144C81698
12531a74418O3668N3543D8797J82332O7805a76434g7958A52999h1788Q409c985
12519D1309K43669B953K0640L14976a1536A35414d8756j80154j53903a44396J2222
12508a32174a8321A96814a48270E7494b3611H3077K83903G5812j3415A9431K11350
12497B30781M8020i5085A34454J19140m2484r1828b89979B56988d6579C65320
12486H2733l1583d458n8062D13351d0734l02914A25787j1564a21487j4280J4526
12475a21241J3981H0311a54624L5586e9309r4954N7528e191k3730A18529e2597
12463A9368K17398h7013C12785o3835a03625I6495a19294D18499D1449O2899i0868
$$ y = [219143, -126331, -35433, 34865, -90840, 31855, 175134, -307067, 79149, -139788, -31144, 381698, -174418, -110750, -57207, 48797, 231129, 298934, -176434, -77958, 152999, -81788, -73379, -3985, 41309, 284978, 2953, 23593, 338569, -11536, 135414, -48756, -228910, -382813, -144396, -132174, -18321, 196814, -148270, 57494, -23611, 83077, 366980, 75812, 62397, 19431, 230781, 278801, -95085, 134454, 253594, 211110, 119282, -289979, 256988, -46579, 365320, 82733, 51150, -4458, -62520, 413351, -40734, -343648, 125787, 114223, -121487, -135767, -121241, -107260, 80311, -154624, -119038, -59309, -154263, -96735, -5191, -28921, 118529, -52597, 19368, 236766, -87013, 312785, 248950, -103625, 96495, -119294, 418499, 41449, 104348, -90868]
12451B12821C0634d25378F4369b05251A33115g8567l0842j6498K752A74746E4248
12439c11657D643J08352b06469P9493c4368G9198J4296a21048H0906b64008i1707
12427A13965b63378A77951k5222b4797l6352B18375J1624a1030m61647A48434
12416b01838R2082o8202A45919j1267c95041b6835j86175C19089c7096q5609d8736
12404H0948i0107j41423b9367B35523A00722b7653j23584B1472J94885a79947
12393A32627i4509I9796K9432a69754B09539e7709F5820a57050P8276b9448A39468
12381B04253c30807a6400H5529b1865E6774k2854h2018D5018Q9159g136j35975
12370a43111B46257i9502H0829M7366c1003C5068K46963a43430d8637D13J3926
$$ y = [212821, 30634, -425378, 64369, -205251, 133115, -78567, -109409, -125907, -123155, 174746, 54248, -311657, 4643, 112995, -206469, -126976, -34368, 79198, 93494, -121048, 80906, -264008, -91707, 113965, -263378, 177951, 152729, -24797, -61149, 218375, 229999, -11030, -472677, 148434, -201838, -109756, -177958, 145919, 134652, -395041, -26835, -213010, 319089, -37096, -122705, -48736, 80948, -90107, -231530, -29367, 235523, 100722, -27653, -151237, 21472, 216357, -179947, 132627, -94509, 99796, 129228, -169754, 209539, -57709, 65820, -157050, -78774, -29448, 139468, 204253, -330807, -16400, 85529, -21865, 56774, 33920, -82018, 45018, 134177, -7136, -143111, 246257, -99502, 80829, 128195, -31003, 35068, 282031, -143430, -48637, 413, 14339]
12359A4339a7699B7021a2113k8126A3652J92740c41546C92523d21035a21390L2322
12348h9068D2182a42622c5925a4942A44440b59957A32258J0368N4116C6304j1981
12337B4323J96754E2399a35177b443A06214K77272a60586A88091a28183j9417
12327a47600L0313K8607A76271a03922l8348C00099j01719b27548A74211H03h8362
12315B17862F8512J89606R2987j58319c5387D92121b03374B14639j8239m5842
12305A50558O5490a54911A56462O0434i1553B62063m2067I3558A4926a3739A10935
12293B57000I5525b951q5221r6516E3738J69442K62399a72344f8419k557j25975
12282a96951A74594a67382g792D235a5418j09003D92668A20376a85410D5885P8662
$$ y = [14339, -17699, 27021, -12113, -40239, 13652, 206392, -341546, 392523, -421035, -121390, -89068, 42182, -142622, -35925, -14942, 144440, -259957, 132258, 142626, 196742, 36304, 24323, 221077, 52399, -135177, -2443, 106214, 383486, -160586, 188091, -128183, -147600, -117287, -88680, 176271, -103922, -142270, 300099, 198380, -227548, 174211, 803, -88362, 217862, 68512, 258118, 351105, 192786, -35387, 492121, -203374, 214639, 196400, 150558, 216048, -154911, 156462, 216896, -91553, 262063, 219996, 93558, 14926, -13739, 110935, 257000, 95525, -2951, -88172, -184688, 53738, 223180, 485579, -172344, -68419, -70976, -196951, 174594, -167382, -7792, 4235, -15418, -124421, 492668, 120376, -185410, 45885, 124547]
12271A24547N5832f6649a9117A61982Q607K3423G3363d2221G5816a42307L6257
12260a06050A34449J24423l5700h854C61069j52900o8326R8490j17200O7126D7716
12248A80495j8236A6737J57646o5779B3869J08391b07112b9907A31517a52578
12237C1458J55090J61471j12036a85772a6828D4441J29621K43227a37A10623Q029
12226A18652c3560A85470N4395A04835D7075J57463l0860E3187J58855J22043
12216C34085b90004A40434E3364J26011A4826c568B41623A8761f0184A06943L60975
12205D67918H1371B8010L67634A3077L05750L26655k63360m5943e5951A09589
12194B02024a09314C18615m4726F1824L08136j46114I2488K77984I1406J17712
$$ y = [124547, 180379, -66649, -19117, 161982, 170589, 194012, 73363, -42221, 75816, -142307, -106050, 134449, 258872, 223172, -8854, 361069, 208169, 139843, 238333, 121133, 188259, 47716, 180495, 162259, 16737, 174383, 108604, 23869, 132260, -207112, -29907, 131517, -152578, 31458, 186548, 348019, 235983, -185772, -16828, 44441, 174062, 417289, -137, 110623, 118652, -33560, 185470, 239865, 104835, 47075, 204538, 173678, 53187, 212042, 334085, -290004, 140434, 53364, 179375, 14826, -3568, 241623, 18761, -60184, 106943, 467918, 81371, 28010, 395644, 13077, 318827, 645482, 382122, 336179, -55951, 109589, 202024, -109314, 318615, 273889, 61824, 369960, 223846, 92488, 370472, 91406, 209118]
12184B09118h690B60670a40571j19258B98592a18076A21209E8598J33520J70297
12174C62415E9449K37565j24511a3676F7462J58726K5755f4981A03522e7409G255
12162B6895J36912A6764a45342H4188b12405a01784C38060a61639G29L73227I8024
12150E83835j27877F9103J00817J50691J14164I4112J13647K02672b24551B20421
12139A6732M20305j8947j68163k4587n8487b9621M764G6031a02732G2264J21406
12128A93670n5780a9975A78215o8345J28612J17895A43930c19971H0289k1577
12118E8712c7422A31228c7558k4087D4184J76540a0323B23984j03208L87882B3562
12106a13838I8003J14181a14831B37478a4077B1825f5061C48701j30177I7296
$$ y = [209118, -8690, 260670, -140571, -259829, 298592, -118076, 121209, 58598, 192118, 362415, 59449, 297014, 172503, -13676, 67462, 226188, 251943, -64981, 103522, -57409, 7255, 26895, 163807, 16764, -145342, 84188, -212405, -101784, 338060, -161639, 729, 373956, 98024, 583835, 455958, 69103, 169920, 320611, 434775, 94112, 207759, 410431, -224551, 220421, 16732, 437037, 418090, 249927, 225340, 166853, -29621, -24857, 76031, -102732, 72264, 193670, 137890, -19975, 178215, 109870, 238482, 356377, 143930, -319971, 80289, 58712, -37422, 131228, -37558, -61645, 44184, 220724, -10323, 223984, 120776, 508658, 23562, -113838, 98003, 212184, -114831, 237478, -14077, 21825, -65061, 348701, 218524, 97296]
12095H4951J36456M5822m4022a8272A57852a37519D5686a22690d7603j16702d8696
12083A78438o2819b7640F2525b6837D2178K64820O77a0453A12798d3235k5321
12072f8556A60790F3676P0614F3117J45069a5256k9275A23168a30076B69305J12601
12061C81906A1142E202a98280A11354e228C65365b37021A17033K66005j47344
12051B35694c2420A96784b1420o3314B01050J55025C3684M2443N3128b05992K0937
12040a85055B67522B490h3964B50484a27004E7989J0279a48892C00089d2326o0816
12029a03142j26044o450N6530l8690j9426I6492d92521D2861J53675I3505l3680
12018E9825B7690K17278c9873E3473g1049F541M0541K37322H3736o535a30652
$$ y = [84951, 221407, 267229, 223207, -18272, 157852, -137519, 45686, -122690, -47603, -164305, -48696, 178438, 115619, -27640, 62525, -26837, 42178, 306998, 307675, -10453, 112798, -43235, -68556, 160790, 63676, 134290, 63117, 208186, -15256, -44531, 123168, -130076, 269305, 381906, 11142, 5202, -198280, 111354, -5228, 365365, -237021, 117033, 383038, 235694, -32420, 196784, -21420, -84734, 201050, 356075, 33684, 76127, 129255, -205992, -185055, 267522, 2490, -83964, 250484, -127004, 57989, 68268, -148892, 300089, -42326, -103142, -229186, -235636, -179106, -217796, -237222, 96492, -492521, 42861, 196536, 93505, 59825, 27690, 244968, -39873, 53473, -71049, 6541, 47082, 284404, 83736, 77201, -130652]
12006b23895e4370D74218D1500g8600L3813C998J04059O3311r934G896L01633
11995C09529E6089a41551m0269E4924J44047J90312D4554J67025h7915B69787
11984b34103B0843K47573a453B06480b04913a01395A16757J37843D3164a12288
11973C3510A867a80877a6943k90931h4931A24580K09888D6597J69328G8741K67336
11962C46077a12551B80073F2730a21472k8832H5568C7866a28192M7003D7259N3041
11951A00300D298J90738H8692a07840j02485j09531C795R0288O225L1876J0860
11940A43044c46050A86036M5882I3584l7933P5453E6456a65096M6063E3516C086
11928A03844K0031E1378a81026A12936J28624b71008J12768q0128i9631B14021
$$ y = [-223895, -54370, 474218, 41500, -78600, -44787, 3998, 108057, 171368, 161434, 7896, 309529, 56089, -141551, -181820, 54924, 198971, 389283, 44554, 211579, -87915, 269787, -234103, 20843, 268416, -1453, 206480, -204913, -101395, 116757, 254600, 43164, -112288, 33510, 1867, -180877, -16943, -307874, -84931, 124580, 334468, 46597, 215925, 78741, 346077, -112551, 280073, 62730, -121472, -150304, 85568, 37866, -128192, -81189, 47259, 100300, 4298, 195036, 88692, -107840, -210325, -319856, 3795, 94083, 100308, 132184, 143044, -346050, 186036, 231918, 93584, 55651, 131104, 56456, -165096, -119033, 53516, 3086, 103844, 123875, 51378, -181026, 112936, 241560, -271008, -158240, -238368, -99631, 214021]
11917F2765d5440K1226k07038j35756G5696d6683E5105B5084a19699n1682k623
11906a74004j11054B68875r5419D2544O2066c12944J43435O1102k332B12081a6346
11894B01990D0586O3334P8233a01045A11230L2771A804O7707K40142e2594I635
11882b03799O0419C1174b73873I156a04502j6713j73185R233B2178c26633F0916
11870a12462B41402n1610C3546c61159a73505C8506K41561G0734b07649b9406
11859b52211e0337A46290d6543k15351p7868A76598P354c75364b973A8871l485
11848A5386e6606k6737r8881A0085a00901o6364f7209C52304a75663A18784a85051
11836A30441e6237n458q9330d8745j79437G0246A8299a53706j8427K9499A19533
$$ y = [62765, -45440, -24214, -231252, -367008, 75696, -46683, 55105, 25084, -119699, -171381, -174004, -285058, 268875, 173456, 42544, 104610, -312944, -169509, -108407, -110739, 212081, -16346, 201990, 40586, 103920, 182153, -101045, 111230, 144001, 1804, 69511, 309653, -52594, 9635, -203799, -143380, 31174, -273873, 9156, -104502, -121215, -294400, -285167, 22178, -326633, 60916, -112462, 241402, 189792, 33546, -361159, -173505, 38506, 280067, 70734, -207649, -29406, -252211, -50337, 146290, -46543, -261894, -339762, 176598, 183952, -375364, -2973, 18871, 15386, -56606, -83343, -182224, 10085, -100901, -167265, -67209, 352304, -175663, 118784, -185051, 130441, -56237, -61695, -151025, -48745, -228182, 70246, 18299, -153706, -172133, -142634, 119533]
11824C9086P1645a28014C3699b10337r9370a45015E7016b33555a09722j29724
11814b39446a05041r862j68311b803D1172d63022A60775R1700d5544k43726A50508
11802B24852a62414A4418P0748J963J62696b38451E1807n966c20517D1596f0182
11790a22126l5108G8079a46919A11913K3090a02474C47829b21960j00868D0583
11779b5898n2385H4728J00270a15890B05533c8239C3240J35520a96884A65115
11768A51452J42222c70444A93227o4675m374b34029a5702B2914m936d2921k30661
11757b73582A89330G8771a3109E0591K97990b4169A16257P7633a26264j61582
11747b87846D04229b33428e5212A05490a70688P8063A58094B623L0832K49189
$$ y = [39086, 110731, -128014, 33699, -210337, -309707, -145015, 57016, -233555, -109722, -239446, -105041, -114903, -283214, -2803, 41172, -463022, 160775, 252475, -45544, -289270, 150508, 224852, -162414, 14418, 85166, 87129, 249825, -238451, 51807, 45841, -320517, 41596, -60182, -122126, -157234, 78079, -146919, 111913, 135003, -102474, 347829, -221960, -322828, 40583, -25898, -78283, 84728, 184998, -115890, 205533, -38239, 33240, 168760, -196884, 165115, 151452, 293674, -370444, 193227, 128552, 124178, -234029, -15702, 22914, 17978, -42921, -273582, 189330, 78771, -13109, 50591, 348581, -24169, 116257, 193890, -126264, -287846, 404229, -233428, -55212, 105490, -170688, -92625, 158094, 2623, 33455, 282644]
11737B82644d620q3195k98463B22825a48929A87661a36664B09821i9751j57848
11727b57599c2575I3270c5479B7145a30903d0871B39120o4797K06409c1967C99235
11715a51797F7750k6712a38925L1310n378m2076A61946b31778C9439a45779G327
11703I7309m27c58101a17965C146N3042J57027M02324A45596E6993b2619E25655
11691a70086G7134O132b289A20965b00799A95522a27160A07350R4002B5238a2216
11679B04576n9096b51626B8956J38015A2022h6848j69946M2811i8648j05475h3456
11667H7351J26218b24646e6186B18072M936f6550j27893A2871e9085j29872K9607
11656a59350j33094i6599J5405A38347b21192B70954b13151a8980j57061G5317
$$ y = [282644, -4620, -87815, -386278, 222825, -148929, 187661, -136664, 209821, -99751, -257599, -32575, 93270, -35479, 27145, -130903, -40871, 239120, 174323, 380732, -31967, 399235, -151797, 67750, 41038, -138925, -107615, -112993, -155069, 161946, -231778, 39439, -145779, 7327, 97309, 96882, -358101, -117965, 3146, 56188, 213215, 615539, 145596, 56993, -22619, 525655, -170086, 77134, 83266, -2289, 120965, -200799, 195522, -127160, 107350, 201352, 25238, -12216, 204576, 145480, -251626, 28956, 166971, 12022, -86848, -256794, -213983, -98648, -204123, -83456, 87351, 213569, -224646, -56186, 218072, 223008, -66550, -194443, 12871, -59085, -188957, -159350, -292444, -96599, -81194, 138347, -221192, 270954, -213151, -18980, -176041, 75317]
11645g3535j35643D40775j65502b4368A03779e1475b692B2466g0667q1853O7420
11634h5100p396A35583e5710j21282P4503r0094c7235j04277A42518g296j71983
11623a79279c3450o3420D2098b87177A1886J21189K6113A6700O7685b01477A92109
11611I6441b70946I3556M8282A1103J39917G5413a947l4600k27803f5519B2313
11599b41069E4983k1110i628B52894b40004A67159p8487g0737j27217f2367A69758
11587G6148J70087a32558D0581J62237e797A46095j7983R4822m725b0234k80581
11576c00815A94019a82141A00687b45774r3963H1350f3428j80353B48377j9095
11566B29282C0716K28783H8423a72731R563J8045A8207a1204I0187J21189M2453
$$ y = [-73535, -209178, 440775, 275273, -24368, 103779, -51475, -2692, 22466, -70667, -152520, -85100, -92496, 135583, -55710, -176992, -102489, -192583, -37235, -141512, 142518, -7296, -179279, -33450, -96870, 42098, -287177, 11886, 133075, 159188, 16700, 84385, -201477, 192109, 96441, -270946, 93556, 141838, 11103, 151020, 75413, -1947, -36547, -264350, -65519, 22313, -241069, 54983, 33873, -9628, 252894, -240004, 167159, 88672, -70737, -197954, -62367, 169758, 76148, 246235, -132558, 40581, 202818, -5797, 146095, 128112, 222934, 218209, -20234, -300815, 194019, -182141, 100687, -245774, -339737, 81350, -63428, -243781, 248377, 229282, 30716, 259499, 88423, -172731, -163168, -145123, 18207, -11204, 90187, 211376, 253829]
11555B53829b1148B55049A26395C6727O289j0465K19244F2351b50602d4048B69346
11543a8725C231Q3565K17831C5428J06586F0557c3019p1006I7892A7487d7591
11531E7769J39915I1250K20771l9472C6530K6197J49279b19757F8890a31399B25456
11519D48458A51738a5778k23392B9544P0145b79589B50974D7181b75036A80575
11508a69709j37202A35788e8000B13528E1378b56413B37056A9480K16974a52014
11497A67956n886J79796j58209J44808C6013J43480n2201a9448D602P5263k008
11486G7857e938A12806A7168Q9049b50369f981I1680A4202M6484J8534B4720F022
11473A00963L54848I3797j7279O0753J92983j41935q4767a9117B47669d9997J0102
$$ y = [253829, -21148, 255049, 126395, 36727, 43016, 32551, 251795, 62351, -250602, -44048, 269346, -18725, 3231, 86796, 304627, 35428, 142014, 60557, -33019, -104025, 97892, 17487, -47591, 57769, 197684, 91250, 312021, 272549, 36530, 62727, 212006, -219757, 68890, -131399, 225456, 448458, 151738, -15778, -239170, 29544, 99689, -279589, 250974, 47181, -275036, 180575, -169709, -306911, 135788, -58000, 213528, 51378, -256413, 237056, 19480, 236454, -152014, 167956, 162070, 341866, 183657, 328465, 36013, 179493, 127292, -19448, 4602, 79865, 77857, -5938, 112806, 17168, 106217, -250369, -6981, 91680, 14202, 60686, 79220, 24720, 6022, 100963, 455811, 93797, 76518, 137271, 330254, 188319, 103552, -19117, 247669, -49997, -39895]
11462c9895C30713j50542J45038F7197a75010G513K46633j0554A20176J07063
11452B27239j7301r6714J39113j14484p705O1811K2879q8114l6687b291E5116
11440a18627k5520A45505f1607A30810n0910k6967K69029h255C54803A16068J28239
11429B44307b94234m5399A94264a41228C19411a23632I8768J24884F1757g6373
11418f0885A28037d22903C98925d1206J0972A18171B5147a11450N4877A35911
11407B36294b3764j58162J5406C8878b07314E8564e0345B35096E2206d5677B72331
11395F474N219f259k4842C4169f8172m21647d6853B00166d11634A87506p5510
11384A11996J25107L1445E6680e7486J5647B38717d2258B2530J71245B2752a62907
$$ y = [-39895, 330713, 180171, 325209, 67197, -175010, 7513, 254146, 243592, 120176, 227239, 209938, 113224, 252337, 137853, 130148, 191959, 214838, 126724, 90037, -2291, 55116, -118627, -144147, 145505, -61607, 130810, 79900, 52933, 321962, -8255, 354803, 116068, 244307, -294234, -339633, 194264, -141228, 319411, -123632, 98768, 223652, 61757, -76373, -60885, 128037, -422903, 398925, -41206, -30234, 118171, 25147, -111450, -56573, 135911, 236294, -23764, -181926, -166520, 38878, -207314, 58564, -50345, 235096, 52206, -45677, 272331, 6474, 11693, -6259, -31101, 34169, -68172, -489819, -46853, 200166, -411634, 187506, 111996, 237103, 268548, 56680, -57486, -41839, 238717, -42258, 22530, 193775, 22752, -162907]
11372d9728m84n6651D0335L0592f3269j74372A65212b1483C9311L2338F31J10086
11360A10717J72546a5904D36885a75826l3836R4607l1066d6622I6034a96925j30907
11349c27832G4643J6192Q5812g7011B4501b28583j08114b2166A85483J21880a79801
11337A99029l2333J72965b34359E992g8337r4581b2291L72k3423O935A4524J90526
11325B05050F5939j2190f4334A12518a62520c319C3408b1839B309d1000m4641
11314h5641A27694h7045b577r1162q749k1792j37721J19899l454P1327J4717C6282
11301a49310C20064a28512J5200j86280A19173c00968J43342A15652b87491A04991
11290a2998k49963a18308A0795h7851E7562K4284o09g8993B0082a53746k11683
$$ y = [-49728, -50212, -106863, 40335, 70927, -63269, -237641, 165212, -21483, 39311, 71649, 631, 110717, 283263, -15904, 436885, -175826, -209662, -115055, -146121, -46622, 96034, -196925, -327832, 74643, 90835, 176647, -77011, 24501, -228583, -336697, -22166, 185483, 307363, -179801, 199029, 166696, 339661, -234359, 5992, -78337, -172918, -22291, -21919, -45342, -38407, 14524, 205050, 65939, 53749, -64334, 112518, -162520, -3319, 33408, -21839, 2309, -41000, -85641, 127694, -87045, -2577, -93739, -102488, -124280, -262001, -142102, -145556, -74229, -59512, 36282, -149310, 320064, -128512, -113312, -299592, 119173, -300968, -157626, 115652, -287491, 104991, -12998, -262961, -118308, 10795, -87851, 57562, 81846, 81237, -78993, 20082, -153746, -365429]
11279c65429J69749C8895c00327L5722B03082b14179Q792b5898B6643a39833A78084
11267f3059k85518F0562J11494d1441e845C5196Q7584O233b29920B58654c01932
11255a9052m70667B96220a79199m7386g5363j71308g686k05449A65814i0j72921
11244a73011D2217a12201H0245d1708I7140j2714a81820L5678D7242L309b02915
11232d44399A93260i4733M4557k05716L4581B97031b21983G2429d64508A30272
11221B7113J15256F7878a0314j42546a9974B75979a07269k25317L8698i1659A41104
11209a78104n8264p2712c3090n669I7400N642j390D277c3802C02148a80577B91780
11196f9051J0485A40137m5479a24511q1822f0983a2489j63179j74420J31939F9173
$$ y = [-365429, -195680, 38895, -300327, -264605, 203082, -214179, -205387, -25898, 26643, -139833, 178084, -63059, -348577, 60562, 172056, -41441, -5845, 35196, 122780, 129013, -229920, 258654, -301932, -19052, -489719, 296220, -179199, -226585, -75363, -246671, -7686, -213135, 165814, -90, -173011, 42217, -112201, 80245, -41708, 97140, 84426, -181820, -146142, 47242, 50551, -202915, -444399, 193260, -94733, -50176, -255892, -221311, 297031, -221983, 72429, -464508, 130272, 27113, 142369, 67878, -10314, -152860, -19974, 275979, -107269, -332586, -293888, -91659, 141104, -178104, -236368, -309080, -33090, -38759, 97400, 103042, 101652, 4277, -33802, 302148, -180577, 291780, -69051, -58566, 140137, 94658, -124511, -206333, -60983, -12489, -175668, -350088, -218149, 69173]
11184g5914A14143g5467F0205M0059a71276A45995D4896a82945L4019R860q3300
11173b22366e2871k30904f5606o0149k809A94478a34333M7509o1141E6597a64658
11161i0246E3479N7572a86799b843B14470c53395g0146p1995A62737a68396d6204
11149I2069e5695j33892i4709D39118B02363c01374i8948M2690D4112a94758h8438
11137B58384E5073A7164b38734d2806A16761i1299a8071k35743F5410m085J12711
11126A74036c9153a3458k8208A85624n4012K9122l6291A5236L44099b0951j52975
11115a73926m6395d8457j68305H6745a25146B69021d5606A86466q6367a88666
11104B18938J91644d0646B1407a67281g8389j27966p4816D2330B0696f6569k05780
$$ y = [-75914, 114143, -75467, 60205, 100264, -171276, 145995, 44896, -182945, -148926, -139066, -222366, -52871, -283775, -65606, -125755, -128564, 194478, -134333, -86824, -147965, 56597, -164658, -90246, 53479, 111051, -186799, -2843, 214470, -353395, -70146, -142141, 162737, -168396, -46204, 92069, -55695, -189587, -94709, 439118, 202363, -301374, -98948, -56258, 44112, -194758, -88438, 258384, 55073, 17164, -238734, -42806, 116761, -91299, -18071, -253814, 65410, 61325, 174036, -39153, -13458, -41666, 185624, 131612, 160734, 124443, 15236, 359335, -20951, -173926, -220321, -48457, -216762, 86745, -125146, 269021, -45606, 186466, 100099, -188666, 218938, 410582, -40646, 21407, -167281, -78389, -206355, -281171, 42330, 20696, -66569, -272349]
11093b72349A60518o1342e7607A48536e1883n7166B44902g9124c4969n208B47623
11081b234A22437O7060E9747a0074H1009K17197j2821H6965O5733a942C44672
11069A77897L1792P1678J16644j38924o298R4886k3482a94324c3250n1675F51925
11057C43802l7930j12322n5014K06230j01889A03572J46003J52131q4779m0953
11047B75974M84044C46115O0543A95096N16891L9336l59000L87253k00979l0371
11037E48226K42731o7963k08102K66260k74459J54912J86831k52872Q3226N7029
11027G35819J21904o3519j78387M86514k11692C79735J82498K67675j31203j47782
11017E50923K16223k1809N8513m782P2553l50148Q2938j06619M48326l31860m4407
$$ y = [-272349, 160518, 99176, -57607, 148536, -51883, -109049, 244902, -79124, -34969, -40177, 247623, -2234, 122437, 189497, 59747, -10074, 81009, 298206, 285385, 86965, 152698, -1942, 344672, 177897, 209689, 281367, 398011, 259087, 252789, 347675, 324193, -194324, -33250, -84925, 651925, 343802, 305872, 193550, 138536, 344766, 242877, 103572, 249575, 401706, 316927, 275974, 760018, 346115, 406658, 195096, 711987, 751323, 392323, 779576, 578597, 548226, 790957, 722994, 514892, 781152, 506693, 661605, 848436, 595564, 678790, 735819, 857723, 794204, 615817, 1102331, 890639, 379735, 562233, 829908, 698705, 550923, 767146, 745337, 803850, 799068, 871621, 521473, 604411, 497792, 946118, 614258, 569851]
11006E69851N75543n14648K0760J20056j0697k39044j08388O013K11569J16766
10996G47781j57041j59285J76055k03191L18352k95035L87550k38370j17360q7137
10986C72319M60642k16589j51648Q4843L69875k89615j29863L42744q2146P151
10976G67713k68652P0814K59013j380q3998k07307p5530N33550k35378Q3477l13650
10965E28672J26532L84703P6245L21517k08784q4263R7662J28915K10130P3090
10955A654419L42427J19344K65995p8300K19304j46788n15222P46522m39146l03694
10945A864861j07432l56469l08761R3160K43913k72646K26202K9365l8113n5666
10935A318414l5715k30487J52142l81252P7901J4357p1862j95354q9835q2969
$$ y = [569851, 1145394, 630746, 651506, 771562, 760865, 521821, 413433, 419446, 631015, 747781, 590740, 431455, 607510, 404319, 722671, 427636, 815186, 576816, 459456, 372319, 832961, 616372, 464724, 549567, 919442, 629827, 499964, 842708, 760562, 767713, 499061, 569875, 828888, 827508, 743510, 536203, 460673, 994223, 758845, 842322, 528672, 655204, 1039907, 1116152, 1437669, 1228885, 1144622, 1242284, 1371199, 1581329, 1654419, 1996846, 2116190, 2382185, 2303885, 2523189, 2376401, 1861179, 2607701, 2168555, 1864861, 1757429, 1400960, 1092199, 1185359, 1429272, 1156626, 1382828, 1412193, 1374080, 1318414, 1282699, 1052212, 1204354, 823102, 901003, 915360, 843498, 648144, 558309, 475340]
10925D75340j0725F5765K75559j36354Q70J94129A3478J07260E0722J40720a03673
10913H8046n038L89536g7878A10708O139b09728I8999A646a52760a9694A51776
10901A06851J84464C5537O0056a99469f3294A77138a48401C90e161k49937A6273
10889D0798J42546l6420l2388L0044E8091J32044Q2812A08526E2728i1034A39592
10877D8639Q1985a16984d3536j9035H1941a67452r5563m194A62078b52108i6015
10865b15603E4495b80401i0966j0997d1118k38617e3272l2132A3394c03918a11225
10853i8528B22356a10792q9223A32250b83625R9632j1438A79901e0210A68226
10842B8437B32J6894h8061k22085J37962A57376A920a61629g7884b6099k44790
$$ y = [475340, 464615, 65765, 341324, 204970, 205840, 399969, 13478, 120738, 50722, 191442, -103673, 88046, 83008, 472544, -77878, 110708, 116847, -209728, 98999, 1646, -152760, -19694, 151776, 106851, 291315, 35537, 95593, -199469, -63294, 177138, -148401, 390, -5161, -255098, 16273, 40798, 183344, 146924, 114536, 144580, 58091, 190135, 272947, 108526, 52728, -91034, 139592, 48639, 130624, -116984, -43536, -62571, 81941, -167452, -263015, -267209, 162078, -252108, -96015, -215603, 54495, -280401, -90966, -101963, -41118, -279735, -53272, -85404, 13394, -303918, -111225, -98528, 222356, -110792, -200015, 132250, -283625, -183993, -195431, 179901, -50210, 168226, 28437, 232, 17126, -88061, -310146, -172184, 157376, 1920, -161629, -77884, -26099, -270889]
10831b70889a3479D3248a50679O7738k04261c9189k23547P908i4170a2984B67992
10819d7773n9500B39804j18987B3248a2214j32876d7195E7628J01208A3013b17687
10807c56281c2890j38410Q1432M2365B37423N7627B3249I493c5358D0425a11250
10795C576g2302A32723e0372n7838j28482L6810O2224M6961r6981f392m38096
10784d44488f2406j59378O0181a9586A87448a85100D3877J98845a2567k2069J6915
10773a7721j67462B47525b62003J28356H5616p121i7392B07960b62835j2962a01496
10761g4538j4502F2755b38378C7499b1323k80541g9743k42216O3695B24922a1928
10749A15943a2929m3601j53721h9177A87872C5482L60088C2385J45973J957i6007
$$ y = [-270889, -13479, 43248, -150679, -82941, -287202, -39189, -262736, -254828, -94170, -12984, 267992, -47773, -107273, 239804, 120817, 23248, -12214, -145090, -47195, 57628, 158836, 13013, -217687, -356281, -32890, -171300, -89868, -47503, 237423, 295050, 23249, 9493, -35358, 40425, -111250, 3576, -72302, 132723, -50372, -108210, -236692, -199882, -137658, -90697, -187678, -6392, -444488, -62406, -221784, -161603, -19586, 187448, -185100, 43877, 242722, -12567, -34636, -17721, -185183, 247525, -262003, -133647, 85616, 78495, -97392, 207960, -262835, -275797, -101496, -74538, -89040, 62755, -238378, 37499, -21323, -301864, -79743, -321959, -258264, 224922, -11928, 115943, -12929, -56530, -210251, -89177, 187872, 35482, 395570, 32385, 178358, 180315, -96007]
10737a14983j56028C9319f8157B78481a1482k69663I5953O8920f9077G5748J33148
10726B08896a65398A08946J87209a91278D1337J9830g2304k88844a3927N461n1613
10715f0079I0640d5656k48020a34030D8362b03986D9364b45195r3925J53529q2081
10704b67672A61334c44833A94956G6784b91311B5390b99325f8455j69561A55136
10693a63099g6569j61846i2426D4304A156c14293e5245j01311G1802K07546C5189
10681a78385j80967c6562A33048k0126b20888H375a47307k50902d5020B4750b00982
10669b58736d2853k5943B15439A6049b29962A27135a88634B67449c3341E9315
10658F7154d44904B28611j1983a58365p5650M9921A09026J3489h2074A69237a53231
$$ y = [-114983, -271011, 39319, -68157, 278481, -11482, -281145, 95953, 164873, -69077, 75748, 208896, -165398, 108946, 296155, -191278, 41337, 61167, -72304, -361148, -13927, -8466, -60079, 90640, -45656, -293676, -134030, 48362, -203986, 49364, -245195, -339120, -185591, -267672, 161334, -344833, 194956, 76784, -291311, 25390, -299325, -68455, -238016, 155136, -163099, -76569, -238415, -92426, 44304, 1156, -314293, -55245, -156556, 71802, 279348, 35189, -178385, -359352, -36562, 133048, 112922, -220888, 8375, -147307, -398209, -45020, 24750, -200982, -258736, -42853, -68796, 215439, 16049, -229962, 127135, -188634, 267449, -33341, 59315, 67154, -444904, 228611, 216628, -158365, -234015, -184094, 109026, 122515, -82074, 169237, -153231]
10646F0892C0442c15959A44966g830j42508B47924D9537O0842g7227A74503J11199
10635B85702L9097a20538G4345c79555A12390b41056b0734C1850a66412g7031
10624A36367d87848J28502b8986D7416O7549Q4703H290a36670N4935p1836j8837
10613a72408a0061m3456A28646b2139D8304a68526N3467N6455E8370a09915A49768
10601a01887E0782A347e8318l36912a48488o9960P4192A76766b59315L5762B09109
10589a97141n8070j14040J27768j08769D922b64810I1202d31169A72518c47674
10578f7641E3637a10650l72741a88400A40440A53J65202R5990b26226d1727j3248
10567e4975B79088g7875r0501G7185J12594N2232A08066O0301c0974A6606f9111
$$ y = [60892, 30442, -315959, 144966, -7830, -150338, 247924, 49537, 110379, -77227, 174503, 285702, 324799, -120538, 74345, -379555, 112390, -241056, -20734, 31850, -166412, -77031, 136367, -487848, -359346, -28986, 47416, 114965, 199668, 8290, -136670, -81735, -153571, -172408, -10061, -53517, 128646, -22139, 48304, -168526, -115059, -58604, 58370, -109915, 149768, -101887, 50782, 1347, -58318, -395230, -148488, -218448, -144256, 176766, -259315, -223553, 209109, -197141, -255211, -369251, -241483, -350252, 4922, -264810, 91202, -431169, 172518, -347674, -67641, 53637, -110650, -483391, -188400, 140440, 153, 165355, 261345, -226226, -41727, -54975, 279088, -77875, -168376, 77185, 189779, 242011, 108066, 168367, -30974, 16606, -69111]
10555G6688J6778A5434Q2338J15930a82394f4518K9040C8559a34925k2951A71791
10543a35638l9687J3593G1353k9970J64237a96530q4025F167K0823a60443B69766
10531e9354A54661B0527a18615m741H3903c709l87432J93512B73510a19164o4349
10520a83513D6611A6392a54877k69877I6462L697f458p5905l14404a62232j00045
10509b62277e8821A50462a50651A94400c145l1949H3264c07091P7566I0210N8324
10498A48534a91692I4735d39463J89165J4248F7550N7130a15321A75022n0309
10488A24713C6388J49917g0732a0915n3225C1254e8692L228B15008A4365a26276
10476C4666i9752A16531J1507Q4984j04548e882k62797a00406o2869A80654k4389
$$ y = [76688, 93466, 15434, 97772, 213702, -182394, -64518, -35478, 38559, -134925, -157876, 171791, -135638, -175325, -161732, 71353, 41383, 205620, -196530, -280555, 6167, 26990, -160443, 269766, -59354, 154661, 20527, -118615, -123356, 83903, -3709, -391141, -197629, 273510, -119164, -183513, 46611, 16392, -154877, -424754, 96462, 100159, -6458, -82363, -396767, -162232, -262277, -58821, 150462, -150651, 194400, -3145, -35094, 83264, -307091, -229525, 90210, 148534, -191692, 94735, -439463, -250298, -236050, 67550, 124680, -115321, 175022, 124713, 36388, 186305, -70732, -10915, -64140, 31254, -58692, -55464, 215008, 14365, -126276, 34666, -99752, 116531, 128038, 213022, 108474, -5882, -268679, -100406, -163275, 180654, 156265]
10465A56265Q9332a3764B21935o1331L80591j05553j86527L0560D3556d589C6570
10453a59435A8440P0680e9642k3126k00175a36725k34182A02329i6122B07153
10442a06088A31802J25102f5702d825F0354K48629k9321h6793E6161b55605J13046
10431a42559A49496B1168c00264m6766a56037j21882D9259a96069A05598i9100
10420H1880b42114j17260B11853D9844i1201m635n5583A50061B8757b77624f3471
10408I9259e6402A02394O9038a45255C4982h1743L2930I6544b07802b8016B01670
10396b74298a00318G2745d5084l11936Q6240E1291B3781c10411i8725n4205D9782
10384F8641h6182b8025C02402e737B41965e18A43071b03244C31046A21184a10177
$$ y = [156265, 245597, -13764, 221935, 160604, 541195, 435642, 249115, 279675, 43556, -4589, 36570, -159435, 18440, 89120, -59642, -82768, -282943, -136725, -370907, 102329, -96122, 207153, -106088, 131802, 256904, -65702, -4825, 60354, 308983, 279662, -86793, 56161, -255605, -142559, 149496, 21168, -300264, -347030, -156037, -277919, 49259, -196069, 105598, -99100, 81880, -242114, -359374, 211853, 49844, -91201, -95836, -151419, 150061, 28757, -277624, -63471, 99259, -56402, 102394, 171432, -145255, 34982, -81743, -48813, 96544, -207802, -28016, 201670, -274298, -100318, 72745, -45084, -357020, -270780, 51291, 23781, -310411, -98725, -152930, 49782, 68641, -86182, -28025, 302402, -5737, 241965, -518, 143071, -203244, 331046, 121184, -110177]
10372a18241A73860m8148J13721H0268R191A5335L62639A27772b18299P3830b0866
10360a8215n7129P552A41367J01829k9856m5240K24350j69907A09327K6806K76246
10349D12379J92181k83667j1338q9947J21784J6298A73643n2611L54325j97108
10339B78249b15796B02575a78082B81105A18792L50308K0227J15484K165k15452
10329C91524E2284L92484k5437O5541j12511A14483D7276b9400D42668A73199
10318F9604r234B8118P1370m9692L79537B761Q0121c199j6518A81518D4169l12
10306D3857a4754D25091a97104B66077j15553M7637K68426A2731N3109j450N6588
10295A20978a15208J2887A43163g6986J9208j2734A39751c8747A27145a43580
$$ y = [-118241, 173860, 125712, 239433, 80268, 89459, 15335, 377974, 127772, -218299, -144469, -20866, -18215, -75344, -67792, 141367, 243196, 213340, 168100, 392450, 222543, 109327, 136133, 412379, 604560, 320893, 309555, 219608, 341392, 357690, 173643, 121032, 475357, 278249, -215796, 202575, -178082, 281105, 118792, 469100, 489327, 604811, 606976, 391524, 52284, 444768, 419331, 484872, 372361, 114483, 47276, -29400, 442668, 173199, 69604, 60370, 28118, 99488, 49796, 429333, 2761, 82882, -3199, -19717, 181518, 44169, 43857, -14754, 425091, -197104, 266077, 150524, 198161, 466587, 12731, 65840, 64390, 120978, -115208, -102321, 143163, -76986, -57778, -70512, 139751, -38747, 127145, -143580]
10284A35542l5073F655O3418A2218L34114i4735G0561a4450G8613J03676J6945
10273A99234d5751j06741O1125c2049F3152a94880G7054M4124g0853j00202C4691
10261b3319k622k46759A17335a2298m6782G1466a28644j36735J9i687A86413b8363
10248C46340B1990L2106a71673D3382b05132B67014d6322b77B9959L9623Q5984
10237A55566c0870j86860C41042J73707j54817A27538d0134B64109c0318o2777
10227i3095k38307e976j65835F9086I931J97979a11793C88774c29394Q0047d1846
10215b93326g59B63866d00135J87889i3416L2247o0410k48757p3925K15469J3703
10204b15089j58400a02998c2804j11591N814j3798j43651e3563r3675O8478K6692
$$ y = [135542, 100469, 6655, 70073, 12218, 346332, -94735, 70561, -14450, 78613, 182289, 199234, -45751, -152492, -91367, -32049, 63152, -194880, 77054, 121178, -70853, -171055, 34691, -23319, -25941, -272700, 117335, -12298, -59080, 71466, -128644, -265379, -265360, -9687, 186413, -28363, 346340, 21990, 54096, -171673, 43382, -205132, 267014, -46322, -277, 29959, 69582, 155566, -30870, -217730, 341042, 514749, 359932, 127538, -40134, 264109, -30318, -93095, -331402, -5976, -171811, 69086, 9931, 207910, -111793, 388774, -329394, -249347, -41846, -293326, -759, 263866, -400135, -212246, -93416, -61169, -121579, -370336, -444261, -228792, -215089, -373489, -102998, -32804, -144395, -138581, -152379, -296030, -53563, -147238, -78760, -52068]
10193e2068B28724I0132K3818l3291c4078B2949O1561J21853A1277f661E570a68162
10180b66119B2601i5784J0107A06903c24071A54688g6425K6100l06050c4256l0260
10169f4516D6407a17032A58054H758O1408b95029C83869E2836j3945b61662A04567
10157F4901d07250c7365j39207p6149H6725d07166A65393e11j63669N4627N3025
10146e6528m7985j73746A18007a86913d3585C01244F8394A862K81806G9290a17547
10134a55049e906I3711h9248j9611i895q3612p7028D8629a84321M2597j97282
10123c39006a13433r1001F2316g7693A72798d2396A25990O2811B4032c00800g837
10111A51795a55383O9095l67405a38322b5792i603j45289C46972C7919b10185
$$ y = [-52068, 228724, 90132, 113950, 80659, -34078, 22949, 84510, 206363, 11277, -6661, 5570, -168162, -266119, 22601, -95784, -85677, 106903, -324071, 154688, -76425, -50325, -356375, -34256, -64516, 46407, -117032, 158054, 8758, 70166, -295029, 383869, 52836, 38891, -261662, 104567, 64901, -407250, -37365, -176572, -252721, 86725, -407166, 165393, -511, -164180, -109553, -56528, -104513, -278259, 118007, -186913, -43585, 301244, 68394, 1862, 283668, 79290, -117547, -155049, -5906, 93711, -89248, -108859, -9895, -93507, -170535, 48629, -184321, -141724, -339006, -113433, -204434, 62316, -77693, 172798, -42396, 125990, 188801, 24032, -300800, -7837, 151795, -155383, -86288, -453693, -138322, -25792, -9603, -154892, 346972, 37919, -210185]
10100D7164b27612o4576C54582e9387A25486C3034a76302b2326A54007b98539
10089d0828r7445L233A17303a85837p1080h6161m9034j1437j45063J13181A82799
10077A52353F0551h3268a0079o1651l70270a88256M1053B9264b35137A03071b77474
10065G2693h1753r7486I8060L6151h3237E0536R2679J0364c481k28061g1335j49390
10053b20725C1268j3219a90042G5097b7925k49977B59170o8521b33044P0583l3278
10042a95739E014i0967o1092m9411B7762K53540A08620l506K7121C8023d80146
10030e8401k41202M0403B98574a04413C8037r097a7697A39706d24912h5795B29227
10018h0197E6359g3297k81247a16274o9966r3758e7967A9487a51648b9279j01146
$$ y = [47164, -227612, -292188, 354582, -59387, 125486, 33034, -176302, -22326, 154007, -298539, -40828, -138273, -135040, 117303, -185837, -256917, -86161, -135195, -146632, -291695, -178514, 182799, 152353, 60551, -83268, -10079, -71730, -442000, -188256, -147203, 29264, -235137, 103071, -277474, 72693, -81753, -179239, 98060, 134211, -83237, 50536, 143215, 153579, -3481, -231542, -71335, -220725, 31268, 18049, -190042, 75097, -27925, -277902, 259170, 190649, -233044, -162461, -195739, 5014, -90967, -152059, -201470, 27762, 281302, 108620, 105114, 132235, 38023, -480146, -58401, -299603, -259200, 298574, -104413, 38037, 28940, -17697, 139706, -424912, -85795, 229227, -80197, 56359, -73297, -354544, -116274, -186240, -279998, -57967, 19487, -151648, -29279, -130425]
10007a30425G8175b4931l0020C4052a10894o1601q2846a04966E6971f0010j9026
9996g9036j00486B07612b54368d968D7482K8340b11723A03522b44444m0504c6341
9984B41582a23805A67634a6792j29848l21198B4246a85037K7239b5087j12542
9974a37629j4002j305q9428k20987a75333A01002n092f3444J7776a1394j7088
9963b8482B17192d61474A48152a35187K5730j22320b7871A33646b36860Q9895
9953a46965l22019c2666l9536j2604B13885b23067K7740O1197M5143j58369A58629
9941g4927j33186d3746A15844J32411d52153J05012a08934o3892k1439G9607k4695
9930E4912K11889b33950Q2091E2056J85700a29945K9112k10480I6521A5080a53893
$$ y = [-130425, 78175, -24931, -54951, 34052, -110894, -172495, -255341, -104966, 56971, -60010, -79036, -179522, 207612, -254368, -4968, 47482, 75822, -211723, 103522, -244444, -284948, -36341, 241582, -123805, 167634, -16792, -146640, -467838, 24246, -185037, -157798, -25087, -137629, -151631, -152936, -242364, -463351, -175333, 101002, 95910, -63444, -45668, -11394, -28482, 217192, -461474, 148152, -135187, -109457, -231777, -27871, 133646, -236860, -146965, -468984, -32666, -72202, -84806, 213885, -223067, -195327, -134130, -88987, -247356, 158629, -74927, -208113, -43746, 115844, 248255, -452153, -347141, -108934, -172826, -194265, 79607, 54912, 266801, -233950, -151859, 52056, 237756, -129945, -100833, -311313, 96521, 15080, -153893]
9918e5376j17104g8847F228a11446q5735j23916L2349a2184n035j60095B45975
9906e8779A2362i4733D6464b34335a9077B7780a74907A78639i7302k20540J03924
9895b13918M9420G4714K9422c61823a06446n7198A32722c4630C7317a94449J1091
9884a83358o35k34291I6069a02006b4898j9363k04148A1657J24528E339e05411
9872F6192a29682A05633k3924J3609a65190r4255a24372j45034B66065d7817k7948
9861g5765j81406A60656A444K11259H9004i3705J4345m3962d2088j11967I1948
9849a6236o2873l37771a04449c2469j37986G5059b52393c7040B56165f7829I7796
9837B87351A01798l3929K1455a98991b5578l3682p9684j40858A0329J16495c2595
$$ y = [-55376, -172480, -78847, 6228, -111446, -197181, -321097, -288748, -12184, -17219, -177314, 245975, -58779, 12362, -94733, 46464, -234335, -19077, 27780, -174907, 178639, -97302, -317842, -213918, -164498, 74714, 104136, -361823, -106446, -163644, 132722, -34630, 37317, -194449, -183358, -183993, -418284, 96069, -102006, -24898, -44261, -248409, 11657, 136185, 5339, -505411, 66192, -129682, 105633, 81709, 95318, -165190, -259445, -124372, -269406, 266065, -47817, -75765, -257171, 160656, 1444, 212703, 89004, -93705, -79360, -123322, -42088, -154055, 91948, -16236, -79109, -416880, -104449, -32469, -170455, 75059, -252393, -37040, 256165, -67829, 97796, 287351, 101798, 67869, 89324, -198991, -25578, -59260, -138944, -279802, 10329, 126824, -32595]
9825B75467b58052A24271J1605O3765N537b21000N0726j59763i4923F0701e13793
9813A94610a03966B4022a06404K2828A24980J53719c16735B35346a06362k4783
9803a31145n352r3332P8150j96767a51895a9396j61573f9728k3473B56850J6806
9792B73656a88999j98035a83606I8153N246a97620H2136h657j60433O3933j43933
9781b49090j5453A72739a35611A8442d6761j65211a1976F1071c8687j06839C53186
9769c1063j5415C2752b71292f4992j22913M9155h676E8190f1557A26329g2344
9757F8998P938a26987A30019c00811D6172a39672j29584A16215b52297J00806
9747a51491B6697a81445N9400I7518Q1754F446L12044d4269j68618k1900j45210
$$ y = [275467, -258052, 124271, 135876, 199641, 205178, -221000, -170274, -330037, -94923, 60701, -513793, 194610, -103966, 24022, -106404, -83576, 124980, 278699, -316735, 235346, -106362, -131145, -136497, -229829, -151679, -348446, -151895, -19396, -180969, -69728, -93201, 256850, 273656, -188999, -387034, -183606, 98153, 103399, -197620, 82136, -8657, -169090, -105157, -249090, -264543, 172739, -135611, 18442, -46761, -211972, -11976, 61071, -38687, -145526, 353186, -31063, -46478, 32752, -271292, -64992, -187905, -138750, -8676, 58190, -61557, 126329, -72344, 68998, 76936, -126987, 130019, -300811, 46172, -139672, -269256, 116215, -252297, -151491, 26697, -181445, -122045, 97518, 179272, 6446, 318490, -44269, -212887, -234787, -379997]
9736c79997G2130c31767N6277g4677b6965j31141g6280k38855M325A89222b57346
9724b24913B67555b32241p6157J03569n3492o6309C25678b02837O5299j16347
9714b53885j5966d3012g251B71257a6022k01711a292k27872k6462f3043j89025
9703b52068j4710G8278K43994r6871e0966k87420G3363Q8789a71464h2849A10122
9691I6398O9925N660b12726a3444l08140a54611j06234j26764B6139q449g6138
9679A15413j166g3840k20718d5823m8225Q424j58030f4531A49367a83284k33908
9668d17192A5615K4739h2160b935H9768i7998C34144j30386I0481a48586A03567
9656c04078b8626k9668o5073A46910b64590H0774K671a34701B65153o5344D1869
$$ y = [-379997, 72130, -331767, -275490, -74677, -26965, -158106, -76280, -315135, -310810, 189222, -257346, -224913, 267555, -232241, -308398, -204829, -258321, -324630, 325678, -202837, -137538, -253885, -269851, -43012, -7251, 271257, -16022, -217733, -1292, -229164, -255626, -63043, -252068, -266778, 78278, 322272, 225401, -50966, -338386, 73363, 162152, -171464, -82849, 110122, 96398, 166323, 171983, -212726, -13444, -321584, -154611, -260845, -387609, 26139, 17690, -76138, 115413, 114247, -73840, -294558, -45823, -94048, -85624, -243654, -64531, 149367, -183284, -417192, 15615, 40354, -82160, -2935, 89768, -97998, 334144, 203758, 90481, -148586, 103567, -304078, -28626, -58294, -123367, 146910, -264590, 80774, 83445, -134701, 265153, 199809, 41869]
9644A70420a83232k9120E0204a97128f9792M131l2094p1181c1997j87936e0742
9632A77152l5262d40913A49796b66227B72546a47674j1369A73932C2808R6272
9622A29080D108c5471A9902c51447n6293i6597L3143j18979H6013b22051E3891
9610c94988H4625h1695o8856a4635k40705l568E6026a21829r391A37807L2884
9599A70691c65486c7654j44438A15539c73990a79763L7386N8317J3969k67210
9589c37301J30459a069E6423b49219D60299a07106l05150a99649B04775q1837
9579A22938E6210h9833B44113d20942B84024a76026P8576p9611h0336A1822Q0771
9568I2593M0675i4279E9872a45473o482l21624A31658B7602a59455D9550d7471
$$ y = [170420, -183232, -212352, 50204, -197128, -69792, -65661, -97755, -168936, -31997, -219933, -50742, 177152, 141890, -440913, 149796, -266227, 272546, -147674, -159043, 173932, 32808, 129080, 4108, -35471, 19902, -351447, -407740, -96597, -63454, -182433, 86013, -222051, 53891, -394988, 84625, -81695, -150551, -14635, -255340, -258908, 56026, -121829, -131220, 137807, 170691, -365486, -37654, -182092, 115539, -373990, -179763, -142377, -84060, -70091, -337301, -206842, -1069, 56423, -249219, 460299, -107106, -412256, -199649, 204775, 122938, 56210, -89833, 244113, -420942, 284024, -176026, -97450, -177061, -80336, 11822, 92593, 133268, -94279, 59872, -145473, -151955, -473579, 131658, 27602, -159455, 49550, -47471]
9556A4587f7764A3024b23587D8033L0907a19558B27162g9951A44386l4388a51571
9544B22433a27036k6093q738n0524l9112a20491n1107A17005O2492b30992D9792
9532H0483h6914l5612A46675h6697j45157m9831J02651b7909A65965B8743c6106
9520D4107b01179j67591F0715a20105J6526G4706c23011H7947h0085e160F331
9508A50442a61537L7392o3572q1696F9999a89595B34427P978b03716P8855k63323
9497c88184g5436p7621b485B15850o2240C2764c2019C7437J50447I2534b68696
9485a17932j45670d409k4099m2193j12787f8676k39587O4577j906b0520B76098
9473i4227o8211A74661f7972D9666g0300A14962b01155P0259C9454i2786L2451
$$ y = [14587, -67764, 13024, -223587, 48033, 78940, -119558, 227162, -79951, 144386, 109998, -151571, 222433, -127036, -153129, -161867, -212391, -251503, -120491, -171598, 117005, 179497, -230992, 49792, 80483, -86914, -122526, 146675, -86697, -231854, -281685, -179034, -27909, 165965, 28743, -36106, 44107, -201179, -368770, 60715, -120105, -103579, 74706, -323011, 87947, -80085, -5160, 6331, 150442, -161537, -124145, -187717, -269413, 69999, -189595, 234427, 242405, -203716, -124861, -388184, -75436, -153057, -2485, 215850, 153610, 32764, -32019, 37437, 187884, 92534, -268696, -117932, -263602, -4409, -28508, -70701, -183488, -68676, -308263, -243686, -245592, -20520, 276098, -94227, -162438, 174661, -67972, 49666, -70300, 114962, -201155, -130896, 39454, -92786, -60335]
9462f0335l939J5881a2211k83104M625d5296C9456b9615k23429J19232o9509n5872
9450b59193E0835d41879a99103e588k5793H7082J50592E8371c73902B80251c7911
9438F3869R1802a85054O8793e1534H6289C4477b05759F8072a32099E4009M5005
9427I9014l3001b15814d4687E1654a83612Q4235j3672G5414a76236j00517q4175
9416c60928K5921A30299k0567d63403J66210f1564G6612a9983A39626g6873k69964
9405c46837g4787q6751O3139m5451E7626c01698c948j15760b5189A24622l9128
9394H5494C3435c2806j27480f7103l474r2217G0717a02617B15515a63935A8403
9382b65362J03444p0390h0939j95700n1086J12608L7409h2914B88286a67051k42331
$$ y = [-60335, -64274, -48393, -12211, -295315, -290690, -45296, 39456, -29615, -253044, -133812, -203321, -259193, 50835, -441879, -199103, -5588, -31381, 87082, 237674, 58371, -373902, 280251, -37911, 63869, 155671, -185054, -116261, -51534, 86289, 34477, -205759, 68072, -132099, 54009, 99014, 66013, -215814, -44687, 51654, -183612, -99377, -113049, 75414, -176236, -276753, -360928, -335007, 130299, 109732, -463403, -297193, -61564, 76612, -19983, 139626, -76873, -346837, -74787, -161538, -98399, -143850, 57626, -301698, -3948, -119708, -25189, 124622, 85494, 33435, -32806, -160286, -67103, -70577, -162794, 70717, -102617, 215515, -163935, 18403, -265362, -161918, -232308, -80939, -276639, -327725, -215117, -177708, -82914, 288286, -167051, -409382]
9371d09382a94954A00792a64735A71681c4906j92655g6003j35759e5368j33151
9361a88519A26745d0067j72620R6252j40952a22491j29763b1225A9506e4364A08245
9349a30656A28051D3433j7287J19775n0760a177r4651m463C5815i6573b1166D50
9336g8238P398k6644A33549d0479D49565a18334B86949c00828c4552j33741j46607
9325c14900g8421B55116l072m7482d7224j41667C4908b4065l249a0835j58841
9314a69676l208A59515o2140Q6817c39741O1515B50742d6556p1003o3952A10338
9302b58541D7246b96198a00360L5408A27829c16240A431c91214J93128A7538a36543
9290I6275c9005k27806P539c976B62434d6556I6746J99866b48794I5401a47650
$$ y = [-409382, -194954, 100792, -164735, 171681, -34906, -227561, -76003, -211762, -55368, -188519, 126745, -40067, -212687, -116435, -257387, -122491, -252254, -21225, 19506, -54364, 108245, -130656, 128051, 43433, 26146, 145921, 95161, -1177, -95828, -100291, 35815, -96573, -21166, 450, -78238, -70840, -97484, 133549, -40479, 449565, -118334, 286949, -300828, -34552, -168293, -314900, -78421, 255116, 252044, 204562, -47224, -188891, 34908, -24065, -27314, -10835, -169676, -172884, 159515, 97375, 184192, -339741, -278226, 250742, -46556, -117559, -181511, 110338, -258541, 47246, -296198, -100360, -64952, 127829, -316240, 1431, -391214, -198086, 17538, -136543, 96275, -39005, -266811, -259272, -3976, 262434, -46556, 96746, 296612, -248794, 95401, -147650]
9278B57112b1514B23893d29182N8722i5954q6436A79778b21691Q5346A01236b39677
9266d03185A21372a78983o6554G3246a24414j60709f6211K8480A17550d0764L885
9255c6879A18748a33172r230k01282a8332j76949A3159K23120a25202m8379r9133
9244b72714N0751A72596B6108i6694o2264C12176c31216G7260a06996A31606e20266
9232g0530A64810b13477d7842C9469a5041G6677J38252b3614j55952A22735Q0730
9221B03465a16162E224a18619o0495O6928k19191J42229I8534b24865H6224b5895
9209d4966k9015E6185i5997j16809p5035a11236E3165g3622j23285d1081I655
9197c27286N3145B22201e4842l8A16580j3720k3043c91367A61307C9028A1905
$$ y = [257112, -21514, 223893, -429182, -370460, -95954, -182390, 179778, -221691, -136345, 101236, -239677, -403185, 121372, -178983, -245537, 73246, -124414, -285123, -66211, -37731, 117550, -40764, -36879, 118748, -133172, -142402, -343684, -18332, -195281, 13159, 236279, -125202, -173581, -272714, -221963, 172596, 26108, -96694, -158958, 312176, -331216, 77260, -106996, 131606, -520266, -70530, 164810, -213477, -47842, 39469, -15041, 76677, 214929, -23614, -179566, 122735, 203465, -116162, 5224, -118619, -179114, -112186, -331377, -189148, 98534, -224865, 86224, -25895, -44966, -73981, 56185, -95997, -212806, -287841, -111236, 53165, -73622, -196907, -41081, 9655, -327286, -274141, 222201, -54842, -54880, 116580, 102860, 79817, -391367, 161307, 39028, 11905]
9185G2902a1533l65918d8031a6456A74397j8035D4283a51302j5762j74881b4777
9173b49777f6692D4759g3742B35961a91977r9299E8892g705n0826A297a23389
9161a27688k11330a0871H4545B64a05907m49962d5075l2763l5309G1752a69900
9149d11721J27205m3600i1910D8914C303J0933a83466A83149a93547O2416l67524
9138d98655a9911k33421I0923D1258a67494B58620G5598a62733n5513k0544B6131
9126a4348D1735b52358C56839c5930B79061e7485B51174i2784p0700K3743A5951
9114a20121o7559B65432J84282A39192a40415k4512E7699b78060A97549a83645
9103a61281F8249b01997j62638R0980N8198J07473C36209a11782a3124e621j15708
$$ y = [72902, -11533, -377451, -48031, -16456, 174397, 156362, 44283, -151302, -167064, -341945, -24777, -249777, -66692, 44759, -73742, 235961, -191977, -291276, 58892, -7705, -58531, 1297, -123389, -127688, -339018, -10871, 84545, 264, -105907, -555869, -45075, -77838, -113147, 71752, -169900, -411721, -284516, -328116, -91910, 48914, 3303, 14236, -183466, 183149, -193547, -131131, -498655, -19911, -253332, 90923, 41258, -167494, 258620, 75598, -162733, -218246, -238790, 26131, -14348, 41735, -252358, 356839, -35930, 279061, -57485, 251174, -92784, -163484, -139741, 15951, -120121, -187680, 265432, 449714, 139192, -140415, -164927, 57699, -278060, 197549, -183645, -161281, 68249, -201997, -364635, -273655, -215457, -107984, 336209, -111782, -13124, -5621, -121329]
9092a21329a9306A35438b9736l2353D7495a49006A48347a1759l48497A70879k8585
9081A42294a64044A13060b39168R9459k63105A4329K832a6633A20923a55214j08843
9070b64057k0969B81888d1613j49035A85900a45996f2138k12514d6975A3995O6413
9059H0408a84676h5904o686o0923k70252a4601G5619a49891F1058A2789Q3538
9048I6327B8142d13773F2796f2386D24850A93633A7344J6606b40551a4642D8260
9036A85992J7888b72656n6798j27577J94240h4303p801j66039C9479a15817D15879
9024e394n2068D075a89244A03063i1069C1431J323g5480F3015a13430D43402E4647
9011i3013B48495c12514A59223c51986E3530M16213B17735L0004a10091k33325
$$ y = [-121329, -19306, 135438, -29736, -62089, 47495, -149006, 148347, -11759, -360256, 170879, 142294, -164044, 113060, -239168, -139709, -402814, 14329, 17161, -16633, 120923, -155214, -264057, -285026, 281888, -41613, -190648, 185900, -145996, -62138, -274652, -46975, 13995, 80408, -184676, -85904, -92590, -153513, -423765, -14601, 75619, -149891, 61058, 12789, 96327, 28142, -413773, 62796, -62386, 424850, 193633, 17344, 33950, -240551, -14642, 48260, 185992, 203880, -272656, -329454, -457031, -262791, -84303, -92104, -258143, 39479, -115817, 415879, -5394, -57462, 4075, -189244, 103063, -91069, 31431, 32754, -75480, 63015, -113430, 443402, 54647, -93013, 248495, -312514, 159223, -351986, 53530, 469743, 217735, 247739, -110091, -343416]
9001c43416f7497q5177j6653K5464k5663j19761K4262B9074a7954j66167A9292
8989B10910g2745q027p420j62782c1488j6409A38802a66305F214a22996B09014
8977a73074c0606H718J2071c30491d0711B28915b44694r0536J53739j91692H0325
8965a02505A85624n805a11991F0274a07825Q47D4530c09233h5365a0439C65014
8953B1151a0309j38755b126k23002a6661j52832B14064F0150c17467A13036g4161
8941d0616C4741a08469k15138B19313d5711D2263b09124H7395b21870i6524a8239
8929a86921j80991A50143J53805j18236c2411k81336H4094O0468g4591A06834
8918B04211F9516C0137J43330J86089A63492p8645l4190L49378j45579c4632E37812
$$ y = [-343416, -67497, -152674, -169327, -143863, -169526, -289287, -265025, 29074, -17954, -184121, 19292, 210910, -72745, -80772, -88192, -250974, -31488, -47897, 138802, -166305, 6214, -122996, 209014, -173074, -30606, 8718, 20789, -330491, -40711, 228915, -244694, -335230, -181491, -373183, 80325, -102505, 185624, 179819, -111991, 60274, -107825, -106978, 44530, -309233, -85365, -10439, 365014, 21151, -10309, -149064, -2126, -225128, -16661, -169493, 214064, 60150, -317467, 113036, -74161, -40616, 34741, -108469, -323607, 219313, -45711, 42263, -209124, 87395, -221870, -96524, -18239, -186921, -367912, 150143, 303948, 185712, -32411, -313747, 84094, 144562, -74591, 106834, 204211, 69516, 30137, 173467, 359556, 163492, 84847, 50657, 400035, 254456, -34632, 537812]
8906E88671P88756N24985K364301L904628j614997C251393A536369j73082F23928
8896E17008k50717b0057C43781I3805L60158A1951L12883j38449j537p422e0756
8884a31658A22208D5011g6679a6622n2379l805A16433J10863d97660G4881b08043
8872A78963a99587i4713E7162J4709e780n4778F4834g0383I2461K14505b1899
8860b10244I4538e0879j62459I4531g7203j58987J06407H3743a06667L7034j23851
$$ y = [588671, 1377427, 1902412, 4266713, 8171341, 6556344, 3251393, 1536369, 1363287, 623928, 517008, 266291, -20057, 343781, 93805, 453963, 11951, 324834, 186385, 184848, 177426, -50756, -131658, 122208, 45011, -76679, -16622, -69001, -72806, 116433, 227296, -497660, 74881, -208043, 178963, -199587, -94713, 57162, 71871, -5780, -60558, 64834, -70383, 92461, 306966, -21899, -210244, 94538, -50879, -213338, 94531, -77203, -236190, -129783, 83743, -106667, -69633, -193484]
$$ [...]
##END NTUPLES=NMR SPECTRUM
##END=
