
##TITLE=AC1039_TOCA02_5819308_gBNCuQGBMZ
##JCAMPDX= 6.0         $$ Bruker NMR JCAMP-DX V2.0
##DATA TYPE= NMR SPECTRUM
##DATA CLASS= NTUPLES
##ORIGIN= BRUKER
##OWNER= Administrator
$$ 1.72 TOPSPIN		Version 2.1
$$ 2012-03-24 20:29:48.203 -0500  Administrator@TOPSPIN
$$ Compression mode = diff/dup
##.OBSERVE FREQUENCY= 400.13188235
##.OBSERVE NUCLEUS= ^1H
##.ACQUISITION MODE= SIMULTANEOUS (DQD)
##.ACQUISITION SCHEME= undefined
##.AVERAGES= 64
##.DIGITISER RES= 22
##SPECTROMETER/DATA SYSTEM= spect
##.PULSE SEQUENCE= noesygpps1d.comp
##.SOLVENT NAME= COFFEE_meoh
##.SHIFT REFERENCE= INTERNAL, COFFEE_meoh, 1, 14.96861
##AUDIT TRAIL= $$ (NUMBER, WHEN, WHO, WHERE, PROCESS, VERSION, WHAT)
$$ ##TITLE= Audit trail, TOPSPIN		Version 2.1
$$ ##JCAMPDX= 5.01
$$ ##ORIGIN= Bruker BioSpin GmbH
$$ ##OWNER= Administrator
$$ $$ C:\Bruker\TOPSPIN/data/COFFEE/nmr/AC1039_TOCA02_5819308_gBNCuQGBMZ/12/pdata/1/auditp.txt
$$ ##AUDIT TRAIL=  $$ (NUMBER, WHEN, WHO, WHERE, PROCESS, VERSION, WHAT)
(   1,<2012-03-24 20:29:43.296 -0500>,<Administrator>,<TOPSPIN>,<go>,<TOPSPIN 2.1>,
      <created by zg
	started at 2012-03-24 20:18:11.671 -0500,
	POWCHK enabled, PULCHK disabled,
       configuration hash MD5:
       1A 1E CE 29 27 FD 77 03 67 4E F0 E3 C4 B2 CB 90
       data hash MD5: 64K
       77 47 AE 52 18 6A 0E 8C FD 17 ED 53 45 F9 CA D9>)
(   2,<2012-03-24 20:29:46.140 -0500>,<Administrator>,<TOPSPIN>,<proc1d>,<TOPSPIN 2.1>,
      <Start of raw data processing
       efp LB = 0.3 FT_mod = 6 PKNL = 1 PHC0 = 0 PHC1 = 0 SI = 128K 
       data hash MD5: 128K
       97 FE 3D F2 1A 71 9B 9E 8F 82 82 83 AD 5A 94 50>)
(   3,<2012-03-24 20:29:47.406 -0500>,<Administrator>,<TOPSPIN>,<proc1d>,<TOPSPIN 2.1>,
      <pk PHC0 = 36.10107 PHC1 = 0 
       data hash MD5: 128K
       5F 66 92 17 D7 87 2E E4 12 27 5A 57 64 4A 49 CA>)
(   4,<2012-03-24 20:29:47.875 -0500>,<Administrator>,<TOPSPIN>,<proc1d>,<TOPSPIN 2.1>,
      <abs ABSG = 1 
       data hash MD5: 128K
       AD 80 C1 C6 D6 21 64 3E 5A B5 71 08 10 EE 29 AE>)
(   5,<2012-03-24 20:29:47.953 -0500>,<Administrator>,<TOPSPIN>,<proc1d>,<TOPSPIN 2.1>,
      <abs ABSG = 2 
       data hash MD5: 128K
       C8 2E 5D 13 15 F1 D1 57 EA 4D A2 C8 85 17 EA 61>)
(   6,<2012-03-24 20:29:48.000 -0500>,<Administrator>,<TOPSPIN>,<proc1d>,<TOPSPIN 2.1>,
      <abs ABSG = 3 
       data hash MD5: 128K
       D5 D8 60 EC 7B DB 5C 3D 53 DB AD 91 E0 A2 5B 93>)
(   7,<2012-03-24 20:29:48.062 -0500>,<Administrator>,<TOPSPIN>,<proc1d>,<TOPSPIN 2.1>,
      <abs ABSG = 4 
       data hash MD5: 128K
       56 1A EF 57 D8 F8 AC 33 5B 2F BD 50 3B D1 33 92>)
(   8,<2012-03-24 20:29:48.125 -0500>,<Administrator>,<TOPSPIN>,<proc1d>,<TOPSPIN 2.1>,
      <abs ABSG = 5 
       data hash MD5: 128K
       5A FA C6 F2 A7 8E 00 E6 AE 89 75 FD 2B 61 CF 77>)
$$ ##END=
$$ 
$$ $$ hash MD5
$$ $$ 90 AD F6 01 2E E1 87 99 E2 0C D0 5A D0 A0 C2 C1
##$RELAX= 
##$RELAX= 
##$RELAX= 
##$RELAX= 
##$RELAX= 
##$RELAX= 
##$RELAX= 
##$RELAX= 
$$ Bruker specific parameters
$$ [...]
##$TP07= 0
##$TPNAME0= <>
##$TPNAME1= <>
##$TPNAME2= <>
##$TPNAME3= <>
##$TPNAME4= <>
##$TPNAME5= <>
##$TPNAME6= <>
##$TPNAME7= <>
##$TPOAL= (0..7)
0.5 0.5 0.5 0.5 0.5 0.5 0.5 0.5
##$TPOFFS= (0..7)
0 0 0 0 0 0 0 0
##$TUNHIN= 0
##$TUNHOUT= 0
##$TUNXOUT= 0
##$USERA1= <user>
##$USERA2= <user>
##$USERA3= <user>
##$USERA4= <user>
##$USERA5= <user>
##$V9= 5
##$VALIST= <valist>
##$VCLIST= <CCCCCCCCCCCCCCC>
##$VD= 0
##$VDLIST= <DDDDDDDDDDDDDDD>
##$VPLIST= <PPPPPPPPPPPPPPP>
##$VTLIST= <TTTTTTTTTTTTTTT>
##$WBST= 2048
##$WBSW= 25
##$XGAIN= (0..3)
0 0 0 0
##$XL= 0
##$YL= 0
##$YMAX_a= 15095066
##$YMIN_a= -6444799
##$ZGOPTNS= <>
##$ZL1= 120
##$ZL2= 120
##$ZL3= 120
##$ZL4= 120
##$ABSF1= 14.96861
##$ABSF2= -5.58392
##$ABSG= 5
##$ABSL= 3
##$ALPHA= 0
##$AQORDER= 0
##$ASSFAC= 0
##$ASSFACI= 0
##$ASSFACX= 0
##$ASSWID= 0
##$AUNMP= <proc_prof1d_extract.lims>
##$AXLEFT= 0
##$AXNAME= <>
##$AXNUC= <1H>
##$AXRIGHT= 0
##$AXTYPE= 0
##$AXUNIT= <>
##$AZFE= 0.1
##$AZFW= 0.1
##$BCFW= 0
##$BC_mod= 0
##$BYTORDP= 0
##$COROFFS= 0
##$CY= 15
##$DATMOD= 1
##$DC= 0
##$DFILT= <>
##$DTYPP= 0
##$F1P= 0
##$F2P= 0
##$FCOR= 0.5
##$FTSIZE= 131072
##$FT_mod= 6
##$GAMMA= 0
##$GB= 0
##$INTBC= 1
##$INTSCL= 1
##$ISEN= 128
##$LB= 0.3
##$LEV0= 0
##$LPBIN= 0
##$MAXI= 10000
##$MC2= 0
##$MEAN= 0
##$ME_mod= 0
##$MI= 0
##$NCOEF= 0
##$NC_proc= -3
##$NLEV= 6
##$NOISF1= 0
##$NOISF2= 0
##$NSP= 0
##$NTH_PI= 0
##$NZP= 0
##$OFFSET= 14.96861
##$PC= 1
##$PHC0= 36.10107
##$PHC1= 0
##$PH_mod= 1
##$PKNL= yes
##$PPARMOD= 0
##$PPDIAG= 0
##$PPIPTYP= 0
##$PPMPNUM= 2147483647
##$PPRESOL= 1
##$PSCAL= 4
##$PSIGN= 0
##$PYNMP= <proc.py>
##$REVERSE= no
##$SF= 400.130004803784
##$SI= 131072
##$SIGF1= 0
##$SIGF2= 0
##$SINO= 400
##$SIOLD= 131072
##$SPECTYP= <>
##$SREGLST= <1H.CDCl3>
##$SSB= 0
##$STSI= 131072
##$STSR= 0
##$SW_p= 8223.68421052632
##$SYMM= 0
##$S_DEV= 0
##$TDeff= 65536
##$TDoff= 0
##$TI= <>
##$TILT= no
##$TM1= 0
##$TM2= 0
##$TOPLEV= 0
##$USERP1= <user>
##$USERP2= <user>
##$USERP3= <user>
##$USERP4= <user>
##$USERP5= <user>
##$WDW= 1
##$XDIM= 131072
##$YMAX_p= 537668093
##$YMIN_p= -87542674
##$CURPLOT= <Network HP LaserJet P1505>
##$CURPRIN= <$Network HP LaserJet P1505>
##$DFORMAT= <normdp>
##$LAYOUT= <+/1D_H.xwp>
##$LFORMAT= <normlp>
##$PFORMAT= <normpl>
##$SURQMSG= 1
$$ End of Bruker specific parameters
$$ ---------------------------------
##NTUPLES= NMR SPECTRUM
##VAR_NAME=  FREQUENCY,     SPECTRUM/REAL,   SPECTRUM/IMAG
##SYMBOL=    X,             R,               I
##VAR_TYPE=  INDEPENDENT,   DEPENDENT,       DEPENDENT
##VAR_FORM=  AFFN,          ASDF,            ASDF
##VAR_DIM=   131072,        131072,          131072
##UNITS=     HZ,            ARBITRARY UNITS, ARBITRARY UNITS
##FACTOR=    0.0627417313425165, 1,          1
##FIRST=     8223.62146879498, -2970,        -98247
##LAST=      0,             347,             -100684
##MIN=       0,             -87542674,       0
##MAX=       8223.62146879498, 537668093,    0
$$ Real data points
##PAGE= N=1
##DATA TABLE= (X++(R..R)), XYDATA
$$ [...]
66845 3783963 3805854 3824929 3842265 3859377 3877326 3896106 3914769 3932377 3948748 3964094 3978219
66834 3978219 3990641 4001411 4011208 4020519 4029238 4037215 4044663 4051780 4058273 4063381 4066223 4066298 4064129 4061233
66820 4061233 4058796 4056370 4052567 4046897 4039992 4031973 4021934 4009583 3996238 3983220 3970118 3955753
66808 3955753 3940213 3924794 3910192 3895787 3880504 3863483 3844137 3822550 3799746 3776720 3753259
66797 3753259 3728570 3702814 3676920 3650996 3624292 3597023 3570812 3546506 3522526 3496424 3467543
66786 3467543 3437263 3406952 3376478 3344805 3311545 3277825 3245619 3215941 3187634 3158464 3127541
66775 3127541 3096044 3065279 3034960 3004135 2972979 2942511 2912860 2883080 2852738 2822580 2793346
66764 2793346 2764931 2737080 2709932 2683231 2655919 2627425 2598656 2570549 2542162 2511754 2479794
66753 2479794 2449322 2422507 2397993 2372635 2345103 2316747 2289455 2263905 2239651 2215646 2190571
66742 2190571 2163802 2136363 2110026 2085198 2060617 2035454 2010524 1986760 1963585 1939912 1916079
66731 1916079 1893510 1872754 1852920 1832987 1812699 1792197 1771727 1751910 1733378 1715726 1697445
66720 1697445 1677376 1655987 1634926 1615585 1598226 1582141 1566403 1550580 1534855 1519402 1503761
66709 1503761 1487100 1469131 1450480 1432113 1414546 1397565 1380591 1363429 1346823 1332069 1319709
66698 1319709 1308673 1296945 1283058 1266946 1249806 1233512 1219662 1208422 1198289 1187526 1175826
66687 1175826 1164122 1152971 1141833 1130048 1117813 1105796 1094263 1083022 1072033 1061598 1051835
66676 1051835 1042167 1031648 1019966 1008018 997138 987784 979369 971378 963963 957188 950389 942857 934629
66663 934629 925980 916663 906457 896106 886820 878875 871370 863380 854843 846424 838933 832652 826769 819892
66649 819892 811584 802926 794877 786819 777765 768426 760706 755323 751159 746916 742198 736994 731363 725750
66635 725750 720413 714467 706815 698143 690480 684475 678656 671907 665071 659308 654425 649948 646353 643793
66621 643793 640708 635414 628465 621926 616625 611457 605319 598519 592216 587330 584025 581544 578605 574582
66607 574582 570146 566221 562609 558419 553585 549060 545450 542142 538032 532709 526841 521642 517937 515589
66593 515589 513921 512553 511370 509744 506693 502199 497503 493435 489317 484338 479324 475968 474600 473788
66579 473788 472101 469395 466297 463185 459836 455737 450721 445555 441582 439423 438289 436904 434686 431679
66565 431679 428003 423973 420165 416740 413290 409970 407856 407191 406135 402712 397476 392783 389756 387585
66551 387585 385662 384485 384043 383046 380679 377924 376232 375799 375943 376253 376424 375674 373467 370470 367871 365902
66535 365902 363793 361111 358390 356290 354779 353465 352392 352056 352568 353083 352391 350169 347384 345243 343874
66520 343874 342271 339458 335570 331906 329975 330161 331163 331124 329580 327864 327344 327933 328815 329811 331072 331978
66504 331978 331531 329701 327311 324744 321843 318925 316598 314343 310645 305107 299423 295589 293921 293389 293077
66489 293077 292661 292028 291096 289656 287178 283407 279413 277095 277035 277611 276884 274640 271921 269377 267086 265367
66473 265367 264567 264288 263786 262932 261985 260720 258765 256585 255090 254329 253635 253015 253209 254167 254812 254834 255503 257641
66455 257641 259777 259680 257341 255036 254245 253703 251163 246369 241465 238625 237879 237394 235536 232462 229821 229086
66439 229086 230262 232186 233798 234834 235374 235261 234310 232760 231085 229467 227862 226452 225500 224715 223344
66424 223344 221170 218973 217764 217878 219078 221029 223195 224645 224583 223078 220983 219263 218547 218830 219127 217914
66408 217914 214721 211101 209231 209627 211040 212422 213902 215531 216317 215358 213189 211070 209372 207546 205464
66393 205464 203807 202977 202433 201532 200490 200001 200163 200261 199681 198621 197699 197079 196359 195274 194167 193608 193878
66376 193878 195018 196987 199328 200915 200678 198634 195776 193003 190745 189588 190348 192997 196056 197707 197313
66361 197313 195493 193031 190290 187509 185016 182993 181381 180130 179377 179369 180378 182521 185331 187625 188239
66346 188239 187020 184841 182709 181178 180531 180836 181447 180989 178517 174748 171726 171084 172724 175048 176238
66331 176238 175412 173034 170376 168377 166898 165255 163386 161926 161032 159886 157995 156512 157324 160874 165672
66316 165672 170021 173299 175294 175327 172983 169232 165849 163726 162390 161125 159845 158717 157588 156245 154968
66301 154968 154402 154944 156402 158226 159879 161011 161459 161257 160616 159706 158454 156888 155800 156408 158702 160550
66285 160550 159582 156025 152592 151218 151098 150547 149490 148890 148725 148229 147664 148009 148821 148153 145140 141223 138147
66268 138147 136037 134400 133744 134803 136870 138422 139213 140477 142931 145691 147449 147797 146946 144940 141904
66253 141904 138653 136340 135447 135546 136046 136811 137991 139560 141205 142525 143248 143419 143409 143479 143244 141922 139467
66236 139467 137144 136422 137318 138355 138275 137272 136389 136286 136959 138238 139894 141353 141696 140155 136708 132458
66220 132458 129323 128794 130670 133298 135181 135841 135189 133083 130237 128643 129951 133606 137401 139650 140152
66205 140152 139445 138163 137076 136715 136750 136407 135601 134922 134471 133454 131219 128186 125561 124458 125160 126736
66189 126736 127629 127337 127329 129417 133270 136520 137382 136155 133961 131224 128027 125053 123209 122649 122812 123303
66173 123303 124347 126448 129681 133201 135690 136685 137048 137481 137066 134454 130320 127183 126459 126924 126666 125369
66157 125369 123968 123142 123033 123515 123762 122290 118586 114380 112342 113626 117172 120999 123592 124544 124599 124869
66141 124869 125445 125122 122952 119682 117066 116183 116888 118370 119577 119632 118675 118044 118893 120847 122625 123662
66125 123662 124361 125062 125652 126177 126982 127947 128102 126420 123000 119356 117310 117323 118091 118258 118095 118619 119373 118713
66107 118713 116653 115624 117373 120575 122991 124562 126480 128183 127721 124976 122212 120985 120455 119447 118389
66092 118389 118052 117740 116101 113066 109871 107591 106533 106666 107698 108861 109405 109403 109513 109937 110103 109532 108636
66075 108636 108361 109070 110049 110285 109663 109101 109358 110014 109922 108495 106264 104401 104009 105558 108347 110529 110348
66058 110348 107739 104503 102738 103230 105286 107745 109937 111779 113179 113565 112294 109629 106944 105704 106328
66043 106328 108171 110139 111125 110388 108201 105895 104675 104467 104386 104055 103795 103667 103148 101934 100401 98907
66027 98907 97142 94672 91899 90036 89963 91274 92626 93118 93103 93489 94506 95692 96872 98330 99920 101020
66011 101020 101813 103537 106542 108980 108748 106400 104757 105537 107556 108613 108106 107201 107013 107374 107247 105967
65995 105967 103922 102112 101165 101064 101733 103195 104861 105482 104563 103302 103210 104166 104772 104359 103653 103530 104059
65978 104059 104765 104941 103838 101596 99974 100893 103932 106461 106763 105943 106092 107545 108887 108970 107964 106679
65962 106679 105758 105462 105652 105876 105772 105404 105146 105408 106473 108203 109883 110873 111545 112968 115385 117721 119041
65945 119041 119862 121277 123190 124282 123614 121577 119175 117009 115244 114127 114088 115341 117576 120057 121982
65930 121982 122772 122160 120221 117478 114857 113251 112957 113559 114419 115206 115906 116446 116531 115966 115013 114080 112969
65913 112969 110902 107720 104774 103925 105584 108346 110634 112108 113342 114889 117063 119943 123036 125421
65899 125421 126635 126979 126688 125443 123153 120463 117916 115375 112941 111590 112001 113416 114610 115356 115990
65884 115990 116291 116002 115921 117056 118998 120375 120676 120464 120208 120222 121333 123936 126540 126914 124876 122381 120746
65867 120746 119428 117878 116860 117207 118660 120643 122980 125277 126832 127694 128559 129188 128451 126627 125885 127303
65851 127303 128893 128138 125416 123330 123311 124448 125228 124980 123711 121815 120121 119295 118923 117742 114999 111401
65835 111401 108701 108263 109736 111241 111385 110909 111533 113410 114970 115357 115499 116225 116812 116370 115413 114961 115070
65818 115070 115308 115768 116486 116688 115810 114591 114066 114134 114219 114591 115748 117080 117501 117133 117102 117816 118531 118507 117703
65799 117703 116481 115376 114991 115425 116146 116828 117655 118164 116900 113370 109467 107549 107720 108390 108849 109620 110639
65782 110639 110999 110654 110820 112363 114954 117917 120641 122109 121457 119489 118507 120112 123858 128079 131094
65767 131094 131592 129170 124996 121118 118759 117908 118359 119962 121826 122767 123071 124529 127960 131719 133526
65752 133526 133063 131932 131547 131837 131860 131090 130035 129603 129827 129547 127842 125393 123685 123171 123228 123690 125051
65735 125051 126954 127865 126909 125009 123573 122872 122356 121723 120973 120040 119165 119121 120295 121807 122145 120607 117874
65718 117874 115398 114497 115636 118162 120732 122073 121444 118889 115521 113068 112304 112204 111558 110977 112013 114537
65702 114537 116718 117809 119038 120907 121459 118734 113798 109732 108275 108823 110144 111497 112260 111973 111042
65687 111042 110477 110703 111316 112062 113261 115053 116827 117732 117504 116661 116022 115924 115783 114704 112596 110256 108229
65670 108229 106347 104737 104304 105372 106631 106619 105732 105524 106278 106733 106314 106121 107133 108664 109503 109783 110631
65653 110631 112347 113964 114579 114328 113811 113192 112269 111127 110186 109531 108570 106637 103840 101066 99149 98266
65637 98266 98134 98508 99362 100790 102866 105403 107832 109606 110822 112103 113723 115214 116037 116236 116181 116081
65621 116081 116037 116104 115969 115076 113549 112427 112359 112620 112208 111411 111247 111678 111625 110662 109394 108027 105987 103456
65603 103456 101827 101701 101675 100408 98949 99366 101514 102932 102116 100349 99673 100324 101080 101325 101632 102590 103858
65586 103858 104450 103539 101180 98615 97554 98610 100492 101315 100693 100022 100587 101883 102158 100407 97467 95084
65570 95084 94153 94160 94384 95168 97396 100868 104098 106079 107502 109473 111560 112062 110136 106784 103642 101467
65554 101467 99953 98442 96622 94994 94717 96525 99770 103073 105801 108161 109932 110138 108280 105001 101194
65539 101194 97354 94150 92506 92337 92057 90209 87039 83855 81683 81266 83271 87230 91011 92809 93290
65524 93290 94465 96842 99064 100123 100355 100255 99874 99669 100402 101635 101653 99612 96725 94697 94032 94509 96081
65507 96081 98262 99622 99204 97921 97381 97706 97559 96188 94371 93251 93137 93593 94014 93747 92298 89868
65491 89868 87579 86818 88226 91227 94450 96689 97572 97391 96537 95420 94735 95222 96916 99053 100872 102096
65475 102096 102572 102201 101658 102468 105467 109432 112033 112175 110872 109781 109485 109378 108749 107552 106315 105636
65459 105636 105837 106897 108557 110478 112397 114229 115981 117478 118336 118335 117701 116866 116244 116443 118228 121580
65443 121580 125049 126962 127435 128399 131315 135532 139256 141429 142242 142491 143085 144569 146365 146867 145145 142343
65427 142343 140573 140617 141461 141937 141827 141218 139898 138138 137380 139220 143744 149386 154425 158201 160897 162747
65411 162747 163891 164725 165828 167385 168928 169849 170054 170050 170499 171719 173277 173903 172230 168126 163124 159011
65395 159011 156087 153333 150245 147684 146597 146510 145842 143469 139666 135713 132839 131240 129837 127251 123342
65380 123342 119605 117738 118033 119390 120592 121178 121196 120688 119547 117731 115538 113718 113141 114193 116498 119233
65364 119233 121544 122705 122305 120532 118022 115228 112221 109354 107730 108462 111466 115287 118135 118997 117992
65349 117992 116008 114109 113079 113328 114875 117147 119012 119623 119412 119763 121441 123840 125998 127761 129463
65334 129463 131076 132420 133835 135754 137707 138624 138185 137213 136586 136550 137333 139592 143539 148178 152257 155846
65318 155846 160156 165642 171014 174621 176478 178357 181957 187508 194198 201390 208997 216981 225016 232743
65304 232743 240157 247814 256808 268190 281786 295582 306940 314684 319599 322646 323271 320047 312690
65291 312690 302740 292184 281874 271465 260549 249557 239641 231882 226549 222944 219929 216689 213086
65278 213086 209445 206187 203700 202212 201358 199988 197015 192710 188579 185467 182330 177754 172191 167408
65264 167408 163708 159216 152534 144767 137956 132640 128274 125054 123558 122961 121430 118446 115319 113196
65250 113196 111985 111567 112528 114964 117712 119614 120669 121184 120677 118505 114995 111062 107160 103341 99981
65235 99981 97782 97245 98505 101292 104634 107017 107402 105980 103834 102144 101680 102329 102974 102578 101611 101548 102639
65218 102639 103195 101632 98341 94902 92333 90898 90745 91688 92843 93345 93125 92473 91522 90804 91498 94165
65202 94165 97782 100804 102615 103261 102670 101206 100188 100588 101780 102719 103702 105545 107634 108487 108044 107764
65186 107764 108448 109533 110673 112356 114542 116111 116275 115426 114069 112091 109660 107741 106940 106700 106351 106156
65170 106156 106551 107050 106811 105881 105116 105066 105530 105944 105724 104435 102212 100012 99123 100242 102987 106095 108145
65153 108145 108429 107292 105519 103512 101372 99541 98715 98962 99458 99363 98710 98282 98893 100749 103162 104807
65137 104807 104568 102324 98875 95347 92777 91753 91854 91745 90507 88769 87914 88382 89438 90342 90820 90512
65121 90512 89126 87410 86930 88340 90601 92416 93696 95022 96287 96685 95855 94455 93610 94101 95877 98077
65105 98077 99629 100151 100180 100425 100939 101238 101044 100642 100441 100447 100441 100700 102118 105126 108661 110912 111207 110536 110015
65086 110015 109733 109520 109884 111251 112994 114220 115027 115907 116336 115182 112391 109235 106974 106149 106853 108480
65070 108480 109396 108258 105847 104356 104661 105450 105329 104569 104282 104904 106055 107119 107624 107698 108244 109861 111672
65053 111672 112371 112309 113043 114699 115638 115369 115822 118526 122123 124265 124909 126029 128842 132904 137451 142071
65037 142071 146181 149307 152056 155754 160895 166698 172367 178123 184840 193077 202489 211930 220177 226777
65023 226777 232018 236169 239306 241885 244555 247055 248216 247583 246078 244353 241543 236642 230232 223704
65009 223704 217411 210798 203802 196831 189781 182390 175327 169562 164725 159360 152852 145942 139313 132996
64995 132996 127392 123586 121993 121590 120970 119470 117003 113768 110689 109247 110052 111952 113092 112487 110223
64980 110223 106789 102904 99649 97936 97743 98258 98792 99249 99703 99831 98927 96541 93087 89823 88027 88088
64964 88088 89253 90154 89655 87593 84970 83182 82691 82574 81677 79991 78478 77761 77663 78122 79843 83547 88790
64947 88790 93972 97628 99553 100702 102138 104268 107004 110221 113600 116177 116749 114986 111783 108283 105038
64932 105038 102299 100443 99410 98181 95649 92020 88797 87425 88334 91037 94486 97404 98918 99069 98438
64917 98438 97431 96349 95802 96225 97027 97086 96185 95162 94487 93697 92776 93120 96029 100626 104321 105424 104628
64900 104628 103765 103779 104301 104767 105302 106377 107884 108876 108398 106516 104276 102562 101189 99283 96430 93195
64884 93195 90631 89523 89970 91299 92386 92554 92361 93086 95127 97371 98600 99054 99850 101133 101779 101053
64868 101053 99650 98678 98362 98177 97563 96039 93386 90422 88833 89292 90364 90281 89279 88961 89799 90713 91000
64851 91000 91144 91525 91812 92110 93259 95264 96666 96331 94918 93774 93366 93625 94684 96119 96343 94256
64835 94256 91135 89559 90585 92956 94896 95679 95619 95608 96676 99032 101408 102162 101146 99745 99113 99252
64819 99252 99874 101168 103263 105632 107463 108136 107086 103890 99022 94169 91217 90875 92449 94666 96489
64804 96489 97360 97182 96309 95399 94980 94998 94886 94266 93473 93113 93253 93434 93393 93208 92774 91894 91088 91410 92978
64785 92978 94466 94746 94315 94254 94451 93993 92992 92708 93777 95327 96172 96044 95353 94452 93601 93125 93150 93355
64767 93355 93260 92628 91556 90419 89772 90024 91143 92841 94923 97100 98611 98641 97336 96074 96369 98529
64751 98529 101444 103607 104286 103811 102872 101800 100625 99519 98685 97924 96989 96445 97482 100492 104386 107709
64735 107709 109877 110886 110419 108034 104063 99683 96106 93863 92638 91597 90291 89464 90479 93656 97699
64720 97699 101034 103105 104115 104422 104701 105764 107375 108078 107044 105382 104677 105029 105600 106361 107987 110495
64704 110495 113284 116140 118964 120836 120696 118831 116533 114477 112634 111407 111410 112165 112443 111900 111162 110414
64688 110414 109432 108996 110501 113836 117216 119556 121405 123022 123293 121614 119396 118407 118547 118389 117221 115596
64672 115596 114473 114651 116443 119170 121434 122471 122637 122168 120461 117404 114563 113852 115302 117018 117135
64657 117135 115203 111936 108324 105043 102366 100582 100233 101374 102770 102837 101632 100887 101708 103325 104709
64642 104709 106226 108709 111845 114647 116858 118807 120430 121601 122940 125005 126933 127177 125608 123724
64628 123724 122605 121736 120217 118188 116485 115524 115165 115354 116291 117987 119946 121422 121921 121520 120783 120398
64612 120398 120775 121807 122873 123256 122750 121744 120595 119245 117720 116463 115519 113937 111126 108659 109218
64597 109218 113221 117665 119144 117249 114239 112138 111143 110426 109452 108488 108372 109630 111474 112135 110746 108518
64581 108518 107462 108304 110296 112607 114981 117205 118884 119935 120670 121188 121151 120277 118670 116653 114729 113688
64565 113688 114209 116054 118023 119031 119087 118951 118932 118462 117033 115228 114201 114088 113597 111682 109142 107897
64549 107897 108947 111761 115322 118791 121191 121693 120693 119756 119983 121019 121934 122312 122086 121176 119914 119049
64533 119049 118707 118062 116760 115906 116697 118570 119755 119480 118698 118660 119529 120538 120947 120688 120389 120875 122461
64516 122461 124708 126922 128662 129752 130209 130351 130579 130861 130780 130275 129871 130011 130579 131185 131373 130531 128329
64499 128329 125447 123129 121797 120997 120850 122319 125481 128715 130524 131245 132064 133194 134080 134585 134846 134564
64483 134564 133577 132690 132710 133059 132383 130294 127532 124822 122656 121794 122674 124388 125401 125385 125293 125664 125919 125517
64465 125517 124828 124516 124736 125162 125224 124262 122064 119341 117137 115763 114781 113935 113540 113985 115318 117180 118735
64448 118735 118977 117657 115670 114067 113079 112572 112768 113736 114800 115444 116300 118208 120770 122848 124053 124581
64432 124581 124085 122211 119972 119057 119764 121023 122464 124864 128223 130884 131287 129619 127336 125917 126189
64417 126189 127732 128716 127515 124785 122868 122947 124047 125011 125864 126760 127238 127404 128374 130433 132016 131667 129966
64400 129966 128350 127071 125692 124710 125126 126735 128171 128522 127937 126915 125956 125710 126447 127466 127772 127248
64384 127248 126590 126375 126844 128118 129822 130935 130963 130924 132200 134648 136871 138080 138541 138204 136350 133016
64368 133016 129711 128035 128190 129309 130657 132068 133706 135837 138525 141337 143742 145859 148113 149912
64354 149912 149579 146372 142043 139476 139836 141785 143460 144495 145792 147774 149348 148682 145026 139790 135621
64339 135621 134159 134740 135477 135307 134541 133718 132789 131595 130401 129493 128802 128357 128579 129568 130596 131041 131427
64322 131427 132662 134501 135750 135904 135580 135237 134688 134243 135106 137770 140836 142407 142120 141012 139890 138865
64306 138865 138238 138729 140655 143507 146518 149172 151128 152070 151708 149848 146706 143355 141294 141059 141672 142043
64290 142043 142508 144209 147265 150409 152349 152808 152331 151761 151862 152731 153501 153143 151574 149619 148168 147885
64274 147885 149293 152350 156184 159960 163723 167582 170586 171658 171431 171861 173964 177106 180424 183498 185478
64259 185478 185398 184165 184622 188419 193808 197724 199206 199487 199479 198751 196911 194508 192134 189552 186268 182469
64243 182469 178991 176597 175594 175910 177170 178716 179871 180480 181102 182303 183743 184442 184172 184058 185344 188108
64227 188108 191819 196546 202557 208997 214273 217955 221348 225818 231369 237092 242227 246440 249819 252941
64213 252941 256351 259738 262262 263789 264916 265610 264860 262159 258443 254943 251915 249015 246157 243310 240150
64198 240150 236640 233374 230755 228409 226021 224148 223479 223729 223907 223390 222363 221597 222048 223989 226246 227241
64182 227241 227248 228500 232288 237042 240417 242230 243934 246026 247841 249704 253329 259563 267035 273734 279107
64167 279107 284102 289854 296684 303775 309435 312273 312592 312246 312775 313977 314496 313409 310865 307498 303728
64152 303728 299654 295300 290743 286114 281652 277889 275618 275456 277301 280214 282806 283852 283044 281452 280839
64137 280839 281961 283923 285835 288577 293729 300933 307731 312303 315057 317072 318423 318974 319453 320280 320161
64122 320161 317318 311927 306175 302097 300277 300335 301547 302920 303561 303227 302179 300786 299713 299920 301645
64107 301645 303764 305028 305571 306381 307719 309105 310623 313098 317046 322380 329090 337195 346118 355121 364397
64092 364397 374753 386261 398266 410697 424139 438432 452423 465511 478354 491709 505640
64081 505640 520254 535855 551612 565169 574640 580195 582818 582407 578326 571179 562628 553592 543804
64068 543804 533137 522144 511000 499004 485774 472252 459898 449345 440405 432974 427100 422277
64056 422277 417554 412688 408598 406106 404683 403250 402227 403804 409565 418267 426752 432879 436930 440133
64042 440133 442822 444741 446665 450617 458118 468761 480955 493627 506599 519664 532346 544800
64030 544800 557909 571838 585362 597572 609514 622775 636708 648655 657107 663117 668014 671220
64018 671220 671499 669274 666297 663477 660177 655388 648613 639849 629644 619136 609278 600131 591524 584003
64004 584003 578267 573967 570109 566613 564472 564192 564986 565892 567013 569308 573561 579760 587173 594914 602692
63989 602692 610995 620419 631177 643564 658321 675757 694903 714377 733893 754165 775636 798291
63977 798291 822418 848213 874500 899161 921281 941751 961191 978402 991819 1001775 1010306 1018982
63965 1018982 1027756 1035830 1042992 1049993 1058084 1068246 1080627 1094586 1109371 1124811 1141429 1159966
63953 1159966 1180623 1202519 1223957 1243460 1260531 1275419 1288595 1300956 1314205 1330256 1350053
63942 1350053 1373316 1399350 1427648 1457797 1489441 1522672 1558187 1597037 1640220 1688256 1740861
63931 1740861 1797407 1858097 1924285 1997042 2075898 2159775 2248731 2343830 2445581 2553695 2668395
63920 2668395 2790787 2921645 3060811 3208116 3364055 3529233 3704019 3889221 4086488
63911 4086488 4297743 4524786 4769638 5034561 5321594 5632900 5971886 6343177 6751294
63902 6751294 7200346 7695532 8243987 8853440 9530645 10281637 11112693 12030016 13038474
63893 13038474 14140551 15335342 16617445 17976978 19401236 20876340 22387364 23917613
63885 23917613 25447728 26953970 28406190 29768464 31003936 32080818 32975410 33671525
63877 33671525 34158577 34429699 34480148 34306677 33908504 33289105 32457987 31432454 30238584
63868 30238584 28909221 27478895 25979246 24438009 22880132 21328075 19801442 18317638
63860 18317638 16892846 15541393 14274172 13098269 12017613 11032728 10140108 9333398
63852 9333398 8606034 7952347 7366425 6841195 6369336 5944582 5561808 5216567 4904977
63843 4904977 4623575 4368813 4136990 3924911 3730232 3550879 3384514 3228869 3082284
63834 3082284 2943616 2811858 2686227 2566497 2452992 2346043 2245317 2149534 2056995 1966762
63824 1966762 1879371 1796128 1717721 1643876 1574372 1509750 1450515 1395865 1343775 1292636 1242714
63813 1242714 1195771 1153206 1114660 1078567 1043895 1010975 980564 952559 926067 900520 876274
63802 876274 854117 834529 817435 802367 788718 775997 764013 752821 742643 733901 727097 722285
63790 722285 718704 715254 711480 707990 705840 705570 706685 707811 707291 703962 697630 688898 678502 666751
63776 666751 653551 638860 623065 606865 590761 574744 558554 542121 525579 509026 492640
63765 492640 477020 462945 450604 439337 428343 417433 406940 397150 387997 379079 369830 360024
63753 360024 350238 341449 333972 327265 321156 316646 314724 314606 313993 311219 306545 301295 296473 292547 289816
63738 289816 288225 287078 285644 284058 283037 282642 281980 280465 278794 277937 277429 275577 271567 266608 262531
63723 262531 259797 257545 255098 252530 249880 246873 243788 241848 242063 243941 245772 246069 244603 242356 240760
63708 240760 240667 241642 242252 241253 238540 235113 232454 231818 233468 236262 238454 239342 239840 241050 242703 243564
63692 243564 243143 242346 242434 243853 246222 248929 251327 252590 251956 249544 246913 246359 249153 254492 260525 266305
63676 266305 272228 278717 285447 292293 300104 309567 319861 329580 338842 349218 361308 373595 384428
63663 384428 394238 404698 416113 426779 434942 440311 443324 444018 442428 439405 435961 432017 426723 420026
63649 420026 412935 406096 399124 391808 384941 379195 373924 368003 361309 354433 347470 340237 333285 327352
63635 327352 321965 316030 310011 305955 304634 303929 301125 296105 291311 289055 289716 292305 295879 300319 306040
63620 306040 313054 320484 327527 334759 343563 354069 364762 374664 384683 395811 407068 416562 423888
63607 423888 429960 434883 437688 438241 437762 436888 434499 429280 421579 412870 403942 394469 384165 373712
63593 373712 364457 357426 352587 348965 345565 342147 338980 336111 333474 331659 331749 333994 337172 339836 341890
63578 341890 344488 348607 354293 361236 369509 379333 390367 401616 412237 422393 433151 445476 459372
63565 459372 474195 489774 506943 526771 549344 573551 598161 622979 648948 677286 708650
63554 708650 742810 778698 814673 849192 881414 910942 936940 957959 972963 982162 986535 986960
63542 986960 984287 979687 974130 967715 960242 952226 944418 936504 927299 916269 903713 889347 872157
63529 872157 852280 831737 812216 793108 772960 752228 733249 717696 705156 694211 683861
63518 683861 673771 663990 654868 646835 640103 634741 630778 627891 625373 623130 622431 624831 630369 637613
63504 637613 645601 655017 667179 682510 700412 720208 741685 764840 789531 815652 843632 874452
63492 874452 908753 945744 983313 1019347 1052615 1082231 1106935 1125595 1138282 1146426 1152040 1156950
63480 1156950 1162231 1167778 1172661 1176396 1179500 1182311 1183784 1182358 1177747 1170754 1161143 1146689 1124968
63467 1124968 1095683 1060882 1023294 984816 946319 908219 870793 833997 797529 761622 727645
63456 727645 697237 670647 646562 623825 602609 583548 566599 551507 538531 527736 518131 508583
63444 508583 499229 490958 483945 477855 473082 470329 469079 468053 467409 468851 472992 478066 482287 486378
63430 486378 492662 502419 515124 529615 544718 559122 572012 584114 597154 611773 626461 638915
63418 638915 648187 655146 661057 666071 669174 669292 666163 660138 651576 640769 628284 615034 601987
63405 601987 589991 579669 571130 563812 557083 551135 547007 545474 546019 547023 547081 546151 545396 545727 546649
63390 546649 546879 545995 544978 545092 546978 550936 557158 565117 573679 582674 593618 607957 625270 644287
63376 644287 664967 688226 714010 741223 769507 799671 832253 867117 904545 945131 988112
63365 988112 1031422 1074116 1117332 1162019 1207096 1250945 1293280 1333821 1370005 1397983 1415965
63354 1415965 1425233 1427854 1424719 1416259 1403948 1390225 1377036 1364672 1351793 1336557 1317967 1296208
63342 1296208 1271717 1244362 1213866 1180619 1145473 1109010 1071624 1034188 997929 963619 931429
63331 931429 901579 874451 849916 827230 805978 786667 770054 756442 746094 739744 737797 739136
63319 739136 741669 744388 748294 755000 765024 777865 793150 811009 831716 855631 883187 914045
63307 914045 946618 979504 1013387 1050261 1090571 1132412 1174016 1215514 1257182 1297174 1332543
63296 1332543 1361798 1384929 1401341 1409506 1408923 1401222 1389008 1374472 1359147 1343860 1328474 1312377
63284 1312377 1295382 1277523 1258042 1235580 1209606 1180827 1149988 1117143 1082385 1046461 1010273
63273 1010273 974417 939464 906046 874409 844481 816485 790816 767298 745457 725592 708409
63262 708409 693221 677732 660523 643003 628120 617631 611205 607590 605749 605131 605453 606304 606924 606796
63248 606796 606461 606997 608407 609283 608523 606606 604581 602470 599545 595767 592092 589330 587219 584676 580833
63233 580833 575869 570871 566683 563061 559389 555941 553581 552331 551339 550535 551120 553765 557268 559827 560956
63218 560956 561469 562284 564045 567300 572041 577330 582162 586554 591200 596336 601616 606947 612793 619564 626974
63203 626974 634028 639679 643896 648128 654176 662373 671441 680315 689440 699908 711985 724951 737856
63190 737856 750087 761818 774262 788746 805104 821685 837469 853354 870841 890331 911517
63179 911517 934623 960223 988234 1017882 1048388 1079265 1110557 1143393 1179433 1218958 1260115
63168 1260115 1300826 1340724 1380485 1420298 1460127 1500497 1541432 1581197 1617816 1651655 1684970
63157 1684970 1718888 1752290 1783783 1813222 1840850 1866245 1888755 1907935 1922913 1932105 1934208 1928941
63145 1928941 1916470 1896696 1869585 1835702 1796064 1751949 1705053 1657227 1609587 1562404 1516359
63134 1516359 1473483 1436130 1405122 1379356 1357292 1338372 1322790 1310309 1300006 1291436 1285579 1284018
63122 1284018 1287237 1294209 1303636 1314979 1328148 1342885 1358925 1376258 1394741 1413662 1431981 1448873
63110 1448873 1464095 1478284 1492842 1508685 1524899 1539376 1551021 1560440 1568163 1573326 1574697 1571845
63098 1571845 1564450 1551699 1533643 1512278 1489814 1466316 1440361 1411610 1381524 1351889 1323931
63087 1323931 1298568 1276105 1255599 1235706 1216293 1198331 1182291 1167707 1154233 1142029 1131037
63076 1131037 1120926 1111837 1104242 1097940 1092038 1085986 1079826 1073547 1067129 1061114 1056093 1051688 1047180 1043091
63062 1043091 1040854 1040770 1041587 1042417 1043821 1046557 1050414 1054866 1059823 1065149 1070393 1075672 1081967 1089862 1098675
63047 1098675 1107474 1116263 1125544 1135392 1145705 1156781 1168917 1181724 1194413 1206540 1218045 1228882
63035 1228882 1239074 1248958 1258999 1269413 1280035 1290286 1299353 1306880 1313620 1320894 1329263 1338102 1346533
63022 1346533 1354322 1361827 1369580 1377969 1386799 1395266 1403024 1411218 1421658 1434925 1450213 1467126 1486511
63009 1486511 1509011 1533780 1559400 1585476 1612686 1641770 1673076 1706751 1742897 1781746 1823938
62998 1823938 1870249 1920877 1975458 2033900 2096649 2163980 2235738 2311972 2392944 2478100 2565828
62987 2565828 2654783 2744758 2835745 2926932 3017319 3106606 3194641 3280598 3363609 3443773 3521629
62976 3521629 3597122 3670131 3741646 3813036 3883922 3951875 4014661 4071899 4123811 4168986 4204202
62965 4204202 4226270 4233411 4224944 4200510 4160150 4104859 4036423 3956555 3866516 3767768 3662791
62954 3662791 3554985 3447797 3343948 3245233 3152767 3067483 2990503 2922854 2864772 2815575 2774524
62943 2774524 2741517 2716754 2700101 2691153 2689543 2694725 2705691 2721383 2741085 2764083 2789399 2816462
62931 2816462 2845590 2877036 2909817 2942241 2973256 3002561 3029792 3054585 3077129 3097432 3114054
62920 3114054 3124681 3127852 3122875 3108273 3082152 3044779 2999195 2948095 2891190 2826745 2754855 2677915
62908 2677915 2598444 2517767 2436783 2356830 2279382 2205387 2135122 2068469 2005361 1946171 1891636
62897 1891636 1842201 1797525 1756686 1718722 1683015 1649466 1618368 1589914 1563956 1540582 1520665
62886 1520665 1505043 1493020 1482290 1470611 1457330 1443482 1430972 1421369 1414509 1408192 1400155 1390427
62874 1390427 1380821 1372092 1362953 1352375 1341514 1332382 1325473 1319611 1313370 1305693 1295755 1283456 1269942
62861 1269942 1256803 1244778 1233658 1223034 1212460 1201267 1189134 1176890 1166066 1157522 1150771 1144529
62849 1144529 1137571 1129302 1119979 1110420 1101163 1092065 1082909 1074222 1067105 1062293 1059583 1058140 1057200 1056570
62835 1056570 1056502 1057077 1057835 1058135 1057630 1056066 1052991 1048413 1043553 1040044 1038166 1036622 1034291 1031481 1029128
62820 1029128 1027418 1025771 1023874 1022339 1022383 1024774 1028827 1032721 1035367 1037589 1040661 1044078 1046036 1046109 1046089
62805 1046089 1047807 1051277 1055394 1059300 1062523 1064738 1065999 1066366 1065087 1061334 1056140 1052157 1050713 1050394
62791 1050394 1049422 1048045 1047417 1047410 1047122 1046663 1046783 1047211 1046873 1045532 1043957 1042609 1041242 1039664 1037881 1035671
62775 1035671 1032918 1030187 1028132 1026572 1024958 1023434 1022521 1022064 1021403 1020282 1018600 1015517 1010031 1002610 995322
62760 995322 990102 987439 986661 986651 986074 983703 979175 973497 968625 966271 966642 968373 970278 973178 979195
62745 979195 989018 1000918 1012875 1024658 1037213 1051182 1066926 1084845 1104490 1124321 1143701 1164357
62733 1164357 1188528 1216383 1246718 1279510 1316044 1356870 1401341 1449041 1500083 1554090 1610564
62722 1610564 1670465 1735854 1807614 1884871 1967022 2055006 2150056 2252344 2361428 2477045 2598919
62711 2598919 2726522 2859260 2995913 3133427 3267114 3392600 3507186 3609349 3697790 3771152
62701 3771152 3827627 3864447 3878637 3868882 3836237 3783006 3711698 3625035 3525701 3415474 3295471
62690 3295471 3167818 3036215 2904135 2773045 2643110 2515180 2391376 2273950 2164059
62681 2164059 2061420 1964813 1873161 1786548 1706147 1633015 1567021 1506887 1450913 1397750 1346998
62670 1346998 1299369 1256015 1217467 1183264 1152547 1124830 1100278 1079326 1061747 1045975 1030049
62659 1030049 1013792 999480 989518 983775 980077 977011 975146 975508 978072 982172 987583 994708 1004143 1016359
62645 1016359 1031427 1049003 1069017 1092379 1120428 1153561 1190848 1231074 1273823 1319601 1369324
62634 1369324 1423643 1482409 1544877 1610527 1679155 1749800 1820384 1889191 1955991 2020662 2081362
62623 2081362 2135330 2181136 2218693 2247227 2264684 2269262 2260272 2237483 2201106 2152888 2096055 2033610
62611 2033610 1967367 1898525 1827942 1755732 1681991 1608346 1537464 1470499 1406182 1343087 1281710
62600 1281710 1223635 1169622 1119207 1071502 1026011 983462 945989 915254 889980 866616 842972
62589 842972 819938 799037 779931 761391 743292 726279 710512 696072 683580 672962 662543
62578 662543 650986 639496 630315 623483 616849 609171 601326 594230 587377 580273 573940 569875 568191 567707
62564 567707 567506 567685 568743 570807 573501 576351 579345 583175 588758 596276 604781 612962 620354 627713 636090
62549 636090 645596 655332 664654 674245 685549 699371 715481 733559 753963 777412 804288 834358
62537 834358 866868 900972 936545 974607 1016456 1062394 1111898 1164945 1222255 1283987 1349089
62526 1349089 1416297 1484793 1553232 1619114 1680192 1736009 1786962 1832101 1868857 1894911 1909421
62515 1909421 1912300 1903396 1883111 1853245 1816256 1773478 1724714 1670033 1611565 1552659 1495074 1437854
62503 1437854 1379613 1321279 1265576 1214160 1166499 1121630 1079706 1041225 1005862 972981 942677
62492 942677 915397 890888 868280 847027 827116 808461 790652 773305 756275 739575 723410
62481 723410 708276 694760 683158 673263 664509 656512 649711 645206 643411 643020 642062 640084 638600 639186
62467 639186 641879 645816 650626 656540 663615 671577 680322 690115 701379 714491 729562 746296 764383
62454 764383 784157 806530 832204 861365 894013 929757 967127 1004192 1040506 1077735 1117558
62443 1117558 1159381 1200727 1239332 1274024 1303981 1328335 1346798 1359975 1368514 1372058 1369276 1358982
62431 1358982 1341286 1317688 1290114 1259952 1228088 1195472 1163104 1131521 1100709 1070570 1041163
62420 1041163 1012700 985747 961304 940056 921612 904980 889711 876043 864169 854063 845779
62409 845779 839155 833490 828455 824935 823772 823953 823602 822760 823443 826608 830840 834728 838893 844649 852056
62394 852056 860434 869608 879571 889953 900874 913267 927275 941442 954663 967735 981579 995021
62382 995021 1006007 1014177 1020382 1024164 1023619 1017776 1007534 994188 978319 960196 940102 918142 894715
62369 894715 871117 848731 827789 807875 789310 772834 758231 744664 732329 722454 715558 711066
62357 711066 708794 709386 712759 717326 721527 725388 730141 737026 746802 759479 773995 788837 803573
62344 803573 819216 836548 854636 871672 887006 901689 916938 932459 946612 958275 968251 978248
62332 978248 988327 996043 998630 995684 989225 981756 974952 969621 965682 962186 958304 954497 952068 951759
62318 951759 953525 957494 964085 973162 984185 997594 1015025 1037620 1064766 1095096 1128329 1165720
62306 1165720 1209069 1259600 1317465 1381821 1451305 1524510 1600170 1677409 1756184 1837005 1919450
62295 1919450 2001010 2077975 2147378 2207623 2257573 2296020 2322137 2335730 2336949 2326390 2305433
62284 2305433 2275680 2237889 2192235 2139725 2082460 2022147 1959154 1893590 1826666 1760422 1696562
62273 1696562 1636051 1579453 1527017 1478571 1433700 1392038 1353197 1316746 1282514 1250701 1221342
62262 1221342 1193860 1167571 1142606 1119935 1100409 1084007 1070243 1058946 1050166 1043305 1036973 1030165
62250 1030165 1023203 1016996 1011651 1006529 1001462 996882 992586 987423 980748 973329 966167 959094 951280 942586
62236 942586 933743 925584 918634 912977 908024 903034 898446 895953 896530 899200 902715 907668 915677 926925
62222 926925 939833 952925 965878 979034 993146 1009470 1028766 1050088 1071676 1093117 1115586
62211 1115586 1140056 1166522 1194965 1225610 1257886 1290599 1323834 1359603 1399821 1444563 1492972
62200 1492972 1545031 1601510 1662646 1727643 1795232 1864150 1933184 2000990 2065716 2124854 2175856
62189 2175856 2217024 2247409 2266031 2271945 2265197 2246985 2218655 2180998 2134657 2080647 2020379 1955674
62177 1955674 1888681 1821095 1753426 1685828 1619670 1557452 1500996 1450415 1404975 1364110 1327426
62166 1327426 1294615 1265753 1240934 1219476 1200342 1183650 1170778 1162409 1157135 1152438 1146435 1138430
62154 1138430 1128792 1118966 1110962 1106058 1104109 1104125 1104971 1105563 1105484 1105833 1108503 1114127 1121587 1129973 1139927 1152354
62138 1152354 1166893 1182626 1199425 1217603 1237087 1258156 1282323 1310993 1343422 1377247 1410969
62127 1410969 1444886 1479731 1515583 1552082 1588306 1622171 1651422 1676071 1698812 1721986 1744889
62116 1744889 1765214 1782694 1799868 1819208 1840909 1864193 1889614 1918812 1952477 1989845 2030279
62105 2030279 2074136 2121541 2171115 2220413 2267023 2308771 2343731 2371048 2391406 2405842 2414331
62094 2414331 2416302 2412314 2404250 2393646 2380366 2362988 2340209 2312127 2280698 2248706 2217802 2187911
62082 2187911 2159000 2132575 2110143 2090707 2071455 2051104 2031116 2013166 1996821 1980560 1963996
62071 1963996 1948013 1933336 1919958 1907805 1897138 1888217 1880957 1875056 1870488 1867983 1868860 1874000 1882994
62058 1882994 1894630 1907972 1922547 1937875 1953733 1970777 1990059 2011851 2035703 2061553 2089819
62047 2089819 2120408 2152711 2186771 2223341 2262477 2303204 2345144 2389528 2437962 2490916 2547991
62036 2547991 2608902 2673538 2741613 2812730 2886217 2960505 3033411 3103796 3172632 3242049 3313777
62025 3313777 3388752 3467604 3550781 3638113 3728249 3818398 3905292 3987478 4066566 4145211 4223969
62014 4223969 4301326 4376752 4451988 4528748 4606720 4684735 4762602 4840640 4918443 4995293 5071073
62003 5071073 5145657 5217906 5286120 5349133 5406468 5458166 5504955 5547693 5586010 5618562 5645388
61992 5645388 5668883 5691433 5713158 5733091 5751369 5768769 5785210 5800689 5817091 5837074 5861189
61981 5861189 5887855 5916228 5947478 5982997 6023009 6067408 6116423 6169467 6224367 6278926 6333055
61970 6333055 6388688 6447565 6509200 6570879 6629678 6684616 6736644 6786468 6833183 6875701 6914694
61959 6914694 6951823 6987319 7019665 7047738 7071988 7093182 7111282 7126307 7139250 7151131 7161613
61948 7161613 7169467 7174214 7176677 7178235 7180253 7184042 7190343 7198411 7206322 7212835 7218667 7225326 7232789 7238968
61934 7238968 7241546 7239707 7233922 7224916 7213524 7200879 7187729 7173769 7158493 7142620 7127953 7116017
61922 7116017 7107587 7103164 7102620 7104307 7105978 7107132 7109403 7114087 7120297 7126151 7130766 7134254 7136621 7137604
61908 7137604 7137048 7134627 7129591 7121406 7110180 7095936 7078048 7056014 7030316 7001931 6971508 6939379
61896 6939379 6905662 6869803 6830851 6789023 6746371 6705086 6665659 6627423 6590343 6555369 6523353
61885 6523353 6494320 6467689 6442797 6419717 6399852 6385028 6375630 6370428 6368579 6370671 6377238 6387604
61873 6387604 6401225 6418898 6441444 6468261 6498579 6533060 6572582 6616348 6663017 6713099 6768530
61862 6768530 6830465 6899404 6977038 7065822 7166714 7279300 7404384 7544671 7702770 7880477
61852 7880477 8080434 8306346 8560588 8843341 9155301 9499856 9881369 10302575 10765139
61843 10765139 11271897 11826850 12433105 13091802 13802549 14562920 15366134 16198758 17039904
61834 17039904 17861333 18627671 19297521 19827103 20176719 20318046 20239206 19946032 19460005
61825 19460005 18813810 18045222 17191251 16285239 15356980 14432559 13532066 12668074 11847812
61816 11847812 11076799 10359603 9698105 9091188 8536498 8031290 7571618 7152617 6770467
61807 6770467 6423076 6108348 5823164 5564848 5332389 5124937 4939903 4773863 4624851
61798 4624851 4492446 4375694 4272282 4180146 4098856 4028634 3968585 3916817 3872192 3834981 3805320
61787 3805320 3781566 3760830 3740862 3720835 3700577 3679919 3658754 3636745 3612840 3586160 3557880
61776 3557880 3531207 3508805 3491011 3477172 3467603 3463076 3463208 3466647 3472480 3480315 3489328 3498334 3506510
61763 3506510 3513074 3516730 3516661 3513782 3509687 3504571 3497480 3488559 3479663 3472666 3468545 3468466 3474366 3487629 3507946
61748 3507946 3534036 3565135 3601811 3646003 3700247 3765947 3842267 3927516 4021651 4126536 4243686
61737 4243686 4372783 4512626 4662606 4823047 4995055 5180408 5380790 5596770 5828237
61728 5828237 6076102 6342950 6632010 6946277 7288682 7662177 8069488 8513687 8999189
61719 8999189 9531312 10114911 10754671 11456859 12229210 13078387 14008842 15024935 16132709
61710 16132709 17337814 18641695 20040114 21523855 23078234 24680082 26294086 27870429
61702 27870429 29344710 30641152 31680143 32389785 32718876 32646954 32187003 31379670 30282950
61693 30282950 28962864 27486918 25918613 24312496 22711804 21149319 19649068 18227154
61685 18227154 16892822 15650569 14501846 13445466 12478107 11595633 10793547 10065809 9404482
61676 9404482 8801928 8253087 7754742 7303087 6893268 6521082 6183701 5878363 5601461
61667 5601461 5349552 5120246 4911174 4718785 4539489 4371908 4216669 4073531 3939937
61658 3939937 3813245 3693383 3581868 3478734 3382018 3290320 3204312 3125267 3053461 2988569
61648 2988569 2930282 2877609 2828689 2782284 2738596 2697830 2659068 2621592 2586154 2553549 2522755
61637 2522755 2491968 2460735 2429601 2398276 2365726 2331812 2297437 2263300 2229700 2196973 2164770
61626 2164770 2131501 2096158 2060315 2026706 1996115 1967274 1939391 1912875 1887714 1863088 1838727
61615 1838727 1814980 1791607 1768375 1746907 1729896 1718006 1709197 1701404 1694146 1687311 1680389 1673546
61603 1673546 1667793 1663486 1660149 1657947 1657560 1658306 1658451 1657897 1658524 1661285 1665060 1669061 1674054 1680177 1685893
61588 1685893 1690480 1695540 1702427 1709939 1716078 1720351 1722853 1722805 1719807 1715104 1709976 1704253 1698084 1693530
61574 1693530 1692371 1693519 1694658 1695478 1697385 1700991 1705910 1712181 1719817 1727528 1733993 1739969 1747114 1754895
61560 1754895 1760582 1762337 1760708 1757132 1752570 1747728 1743071 1738210 1732379 1725724 1719265 1713614 1708673 1704466
61546 1704466 1701261 1698805 1696255 1692892 1688412 1682858 1676917 1671765 1667796 1663914 1658876 1652934 1647287 1642389
61532 1642389 1637681 1632543 1626690 1620109 1613529 1608484 1605961 1605402 1605752 1606979 1609715 1614106 1620056 1628033
61518 1628033 1638528 1651152 1665238 1680839 1698271 1717442 1738679 1763500 1793225 1827433 1865022
61507 1865022 1906134 1951499 2000311 2050447 2100664 2151149 2201993 2252608 2302636 2351975 2399744
61496 2399744 2444697 2487100 2528936 2571600 2614174 2654623 2692014 2727096 2760908 2793090 2821565
61485 2821565 2844053 2860033 2870801 2877417 2879390 2875922 2867626 2856020 2841879 2825064 2805714 2784727
61473 2784727 2763338 2742864 2724488 2708653 2695111 2684234 2677623 2676643 2680945 2689274 2701131 2716776
61461 2716776 2736380 2760358 2790163 2827663 2873906 2929097 2993222 3066065 3147504 3238658 3341855
61450 3341855 3458429 3587576 3728622 3883443 4055135 4245064 4452777 4678048 4921328
61441 4921328 5182689 5461915 5759078 6073014 6399245 6730626 7059480 7377386 7673405
61432 7673405 7934801 8150326 8312255 8416340 8461984 8452443 8392929 8288152 8142907 7964526
61422 7964526 7762557 7545669 7320378 7092614 6868300 6651692 6444841 6249434 6068045
61413 6068045 5903298 5757102 5630827 5524713 5436927 5364841 5307691 5266666 5242281 5233317 5238567
61402 5238567 5257697 5289759 5332687 5385094 5447032 5518047 5595924 5678199 5763542 5850764 5937913
61391 5937913 6023540 6107765 6190959 6272346 6350992 6427257 6502111 6575744 6647916 6719040 6789664
61380 6789664 6859077 6925456 6987480 7045240 7099428 7149987 7195669 7234976 7267530 7294120 7315081
61369 7315081 7329242 7335249 7333415 7325138 7310809 7289601 7261348 7227247 7188487 7145478 7098924 7050612
61357 7050612 7002537 6955964 6911726 6870757 6833961 6802040 6775489 6754220 6737407 6724378 6715341
61346 6715341 6710344 6707929 6705804 6702437 6696873 6687819 6674626 6658749 6642354 6625785 6608357 6591447
61334 6591447 6578469 6571815 6572433 6582791 6607320 6648696 6706293 6779938 6872921 6989262 7129922
61323 7129922 7293877 7481529 7694617 7933602 8197297 8484633 8794776 9125346 9471758
61314 9471758 9828095 10187313 10540518 10876913 11184528 11451021 11665160 11819341 11910939 11940833
61304 11940833 11911219 11825406 11688619 11507305 11287415 11033854 10751221 10444373 10118660 9780304
61294 9780304 9436164 9092344 8753035 8420878 8097909 7785897 7486623 7202418 6935728
61285 6935728 6687676 6457892 6246306 6054088 5881973 5728698 5592270 5472141 5369046
61276 5369046 5283235 5213997 5160584 5122480 5098970 5089292 5093029 5109484 5136894 5173099 5216907 5268052
61264 5268052 5325778 5388048 5452294 5516661 5580608 5644428 5708027 5770170 5829258 5884634 5936290
61253 5936290 5983402 6024443 6059278 6089871 6117908 6142481 6161088 6172166 6175632 6171581 6159801 6140493
61241 6140493 6114433 6082248 6044164 6000497 5951775 5898267 5839793 5776151 5707704 5635651 5561687
61230 5561687 5487096 5412202 5337123 5262967 5191669 5124746 5062900 5006741 4956795 4912698 4873565
61219 4873565 4839503 4811528 4789399 4770797 4753561 4737718 4724209 4712387 4699897 4684640 4666022
61208 4666022 4644867 4623026 4602721 4585291 4570547 4557821 4547305 4539963 4536558 4537352 4542469 4552210
61196 4552210 4567534 4590518 4623608 4667869 4722680 4787758 4864810 4956377 5063468 5184941 5318556
61185 5318556 5461645 5610890 5762142 5910473 6050063 6174243 6275954 6348122 6384026 6378570
61175 6378570 6330144 6241145 6116581 5962492 5785442 5592170 5388744 5180207 4971110 4765711
61165 4765711 4567461 4378900 4202125 4038605 3888596 3751688 3627822 3516614 3415920
61156 3415920 3322853 3236652 3158851 3090138 3028916 2973741 2925163 2883802 2848452 2817901 2793283
61145 2793283 2776619 2767921 2765561 2768811 2778058 2792770 2810991 2830987 2852093 2873960 2896069 2917996
61133 2917996 2939044 2957493 2971049 2978360 2979799 2976901 2971331 2963981 2954661 2942886 2928886 2913088
61121 2913088 2894665 2871985 2844941 2815498 2785206 2753539 2719512 2683460 2645977 2606584 2565029
61110 2565029 2522757 2481197 2439365 2395016 2347828 2299724 2252226 2205155 2158015 2111270 2065825
61099 2065825 2022090 1979909 1939106 1900165 1864434 1832936 1804689 1777064 1748218 1718132 1686935
61088 1686935 1653932 1619273 1584847 1551984 1519760 1487277 1456187 1428665 1403949 1379509 1355309
61077 1355309 1334497 1319647 1310237 1304030 1299191 1294825 1291105 1289407 1291090 1295817 1302066 1309250 1318086
61064 1318086 1328876 1340783 1353059 1365853 1379545 1394241 1410109 1427220 1444968 1462501 1479833
61053 1479833 1497709 1516361 1535176 1553533 1571150 1587702 1602928 1617146 1630894 1643989 1655467
61042 1655467 1664266 1669512 1670509 1667165 1660317 1651213 1640904 1630260 1619888 1609689 1599224 1588770 1578967
61029 1578967 1569204 1557924 1545204 1533252 1523226 1513262 1501169 1487481 1474001 1460776 1446719 1432230
61017 1432230 1418885 1406962 1395188 1382632 1369333 1355751 1343150 1333578 1327592 1322790 1316593 1309724
61005 1309724 1304900 1302848 1302007 1301583 1302294 1304105 1305717 1306625 1307780 1309944 1313137 1317779 1324680 1333758 1344194
60990 1344194 1355606 1367752 1379690 1391055 1403535 1419077 1437127 1455560 1473718 1492367 1511391
60979 1511391 1530146 1549651 1571640 1595511 1618950 1641730 1666382 1694989 1727776 1764774 1806051
60968 1806051 1850034 1894418 1939265 1986627 2036897 2088408 2141051 2197135 2257722 2321054 2385792
60957 2385792 2453079 2524095 2598182 2675007 2756477 2844971 2941312 3045529 3157940 3278717 3408109
60946 3408109 3547673 3699368 3862992 4036432 4218655 4410219 4611103 4821217 5043499
60937 5043499 5283390 5544643 5828840 6139378 6481934 6859710 7272066 7719461 8206542
60928 8206542 8739902 9327809 9983947 10726275 11569538 12523765 13602721 14828174 16222954
60919 16222954 17807454 19608305 21662094 24002786 26654539 29643925 32989938 36624726
60911 36624726 40294861 43575816 46055161 47556358 48208417 48317868 48193156 48073242 48138073
60902 48138073 48473332 48966170 49267665 48935346 47675426 45484756 42595593 39315355 35907752
60893 35907752 32561421 29398381 26482534 23832752 21445798 19312767 17419906 15746691
60885 15746691 14271323 12976025 11844796 10859763 10002142 9253735 8595824 8010059 7482847
60876 7482847 7006572 6575138 6181008 5817949 5483580 5177003 4896135 4638939 4404548
60867 4404548 4190789 3992415 3804179 3624413 3453828 3292141 3137888 2990562 2850998
60858 2850998 2719942 2597435 2483158 2376473 2276626 2183609 2098181 2020501 1949526 1884180
60848 1884180 1824190 1769287 1718709 1672160 1630183 1592841 1558851 1526649 1495464 1464841 1434121
60837 1434121 1403159 1372703 1343479 1315678 1289882 1267468 1249237 1234279 1220949 1208491 1197188
60826 1197188 1187510 1179774 1174248 1171001 1169780 1170182 1171735 1173841 1176008 1178042 1179687 1180532 1180904 1182234 1185526
60811 1185526 1189881 1193658 1196640 1199759 1203179 1206344 1209630 1213840 1217750 1218172 1213321 1204635 1194691 1184884
60797 1184884 1175797 1168001 1161249 1154296 1146806 1140417 1136830 1135957 1137006 1140207 1146108 1154138 1163352 1173897
60783 1173897 1186343 1200132 1214153 1228414 1243713 1259777 1275067 1288478 1300254 1311267 1322481
60772 1322481 1335091 1349908 1366116 1381494 1394398 1405156 1415247 1425617 1436125 1446286 1456166
60761 1456166 1466479 1477751 1489340 1499601 1507451 1513583 1519692 1526570 1533486 1539456 1544461 1549062 1553163
60748 1553163 1555660 1555223 1551215 1544059 1535094 1525886 1517055 1507531 1495482 1480467 1464219 1448701 1433734
60735 1433734 1417498 1399333 1380959 1364525 1350567 1338517 1328197 1319625 1312129 1305121 1299574 1297343
60723 1297343 1298816 1302459 1307017 1313087 1321855 1333104 1345311 1357372 1369577 1382943 1397996 1414196
60711 1414196 1430397 1445840 1460584 1474871 1488413 1500783 1512154 1522923 1532709 1540605 1546643 1552153
60699 1552153 1558228 1564497 1569957 1574580 1579497 1585854 1593964 1603348 1613088 1622306 1630862 1639756 1650456 1663610
60685 1663610 1678474 1693541 1707467 1719309 1728298 1733913 1736293 1736271 1734842 1732812 1731005 1730242 1730664 1731428
60671 1731428 1731577 1730946 1729617 1726909 1721906 1714893 1707134 1699056 1689854 1679324 1668824 1659620 1651213 1642201
60657 1642201 1631957 1620557 1607939 1594359 1581068 1569171 1558095 1546344 1533611 1520941 1508863
60646 1508863 1496525 1482855 1467753 1451956 1436440 1422002 1408810 1396428 1384805 1374931 1367762 1362912
60634 1362912 1359408 1357417 1357980 1361098 1365432 1370061 1375251 1381102 1386692 1391214 1394876 1397814 1398900 1396633
60620 1396633 1390848 1382815 1373747 1363649 1351402 1335682 1316132 1294088 1271937 1251494 1233109 1216434
60608 1216434 1201517 1188740 1178117 1169305 1162204 1156922 1153029 1149499 1145933 1143537 1144090 1147751 1152593
60595 1152593 1156729 1160261 1164360 1169127 1173576 1177546 1182127 1187924 1194228 1200416 1206714 1212814 1217079 1218404
60581 1218404 1217941 1217773 1218629 1220040 1221897 1224428 1227292 1230228 1234186 1240387 1248545 1257534 1267566 1280113
60567 1280113 1295605 1312720 1330249 1348353 1367677 1388434 1410735 1434787 1460299 1486430 1512543
60556 1512543 1538331 1563336 1587389 1611412 1636521 1662065 1685622 1705296 1721097 1734008 1744700
60545 1744700 1753317 1759302 1761081 1757094 1747669 1734915 1720310 1703328 1682928 1659364 1633850 1607236
60533 1607236 1579884 1552485 1526355 1502961 1483259 1467188 1453831 1442396 1432899 1425628 1420541 1417887
60521 1417887 1418625 1422879 1428448 1432443 1434320 1435795 1437815 1439466 1440117 1440699 1442053 1443761 1445642 1448910 1454544
60506 1454544 1461611 1468484 1474885 1481649 1489230 1497590 1506906 1517211 1527667 1537164 1545473 1553178 1560766
60493 1560766 1568244 1575162 1580622 1583947 1585927 1588672 1593601 1600378 1608612 1619687 1635786 1657624 1684456
60480 1684456 1715985 1752888 1795231 1841438 1889317 1937391 1984661 2029388 2068768 2099982 2121372
60469 2121372 2132451 2133104 2123579 2105711 2083485 2061248 2041163 2022963 2006174 1991837 1981990 1978323
60457 1978323 1981667 1992060 2008734 2030338 2055477 2083020 2112233 2143209 2176970 2214383 2255129
60446 2255129 2298563 2345415 2397589 2456467 2522675 2597630 2683858 2783369 2897049 3026192 3173294
60435 3173294 3340643 3529429 3741032 3977731 4240880 4529567 4842528 5180562 5545438
60426 5545438 5936695 6350351 6779222 7211532 7628314 8004009 8311602 8528130 8636900
60417 8636900 8627768 8498709 8258372 7926106 7527625 7088785 6631651 6174010 5729903 5309091
60407 5309091 4916599 4554163 4222437 3921430 3649463 3403273 3179787 2977168 2794141
60398 2794141 2629292 2481412 2349509 2231852 2125723 2028811 1940455 1861062 1790677 1728362
60388 1728362 1672526 1621573 1574603 1531600 1492527 1456404 1422045 1389585 1360167 1333993 1309831
60377 1309831 1286864 1265777 1247228 1230192 1212889 1194900 1177530 1162297 1149655 1139110 1130132
60366 1130132 1122814 1117432 1113287 1108605 1102440 1096197 1092147 1090621 1089997 1089421 1089949 1092588 1096718 1101231 1106083
60351 1106083 1111905 1118946 1127026 1135679 1143873 1150597 1156257 1162460 1169884 1177430 1184027 1190087 1196451 1203064
60337 1203064 1209633 1216605 1224577 1233454 1242809 1252183 1260544 1266662 1270772 1274695 1279433 1283897 1286941 1289379
60323 1289379 1292743 1297163 1301765 1306167 1310188 1312872 1313280 1311680 1308894 1305157 1300755 1296937 1294842 1294105
60309 1294105 1293762 1293893 1295087 1296988 1298840 1301105 1305136 1311455 1319399 1328057 1336461 1343377 1348389 1352992
60295 1352992 1359466 1368700 1379905 1391937 1403907 1415141 1425767 1436995 1449633 1462919 1475930 1489340
60283 1489340 1504006 1518405 1529630 1536987 1542534 1547572 1550532 1549427 1544975 1540006 1536601 1534979 1534635
60270 1534635 1535312 1536747 1538434 1540300 1543400 1549196 1557785 1567144 1574675 1579315 1581575 1581812 1579568 1574675
60256 1574675 1567728 1559004 1548140 1535770 1524325 1515987 1510369 1505174 1498765 1491368 1484326 1478839 1474940
60243 1474940 1471152 1465833 1459442 1454611 1453343 1455134 1458488 1462872 1468032 1472663 1475493 1477055 1478985 1482023
60229 1482023 1485847 1490064 1494031 1496383 1496340 1495135 1494933 1496703 1500193 1505199 1511458 1518000 1524143 1530655 1538532
60214 1538532 1547286 1556017 1565508 1577355 1591394 1605930 1620471 1636356 1654590 1674680 1695871 1718144
60202 1718144 1741810 1767431 1796086 1828493 1864043 1902071 1943802 1991358 2044882 2102429 2162871
60191 2162871 2227241 2296981 2372501 2453930 2541794 2636496 2738354 2848518 2968515 3098523
60181 3098523 3237267 3383746 3537593 3697552 3861344 4027776 4197551 4371040 4546183
60172 4546183 4719255 4886623 5045039 5191113 5321620 5434355 5528643 5605318 5665880 5710882
60162 5710882 5739327 5750443 5745705 5728151 5700323 5664395 5623858 5582994 5544332 5508369 5476300
60151 5476300 5451353 5436777 5434039 5443903 5467935 5507769 5563752 5635304 5722226 5825028 5944258
60140 5944258 6079587 6228918 6388340 6553654 6721915 6890688 7056112 7212963 7356651
60131 7356651 7483927 7591784 7677259 7738752 7776238 7789755 7778786 7743338 7684509 7604034 7504844
60120 7504844 7392275 7272952 7151768 7031265 6914229 6805126 6708299 6626445 6561661 6516191
60110 6516191 6491015 6485270 6498401 6531573 6585615 6658742 6747695 6849957 6963250 7083709 7206244
60099 7206244 7326331 7440060 7542982 7630746 7701217 7754939 7793293 7816950 7826259 7822496 7808548
60088 7808548 7788669 7767558 7749223 7736634 7732392 7739472 7761369 7801950 7865109 7954017 8070487
60077 8070487 8215440 8389862 8594744 8830500 9097570 9397556 9732473 10102564 10505984
60068 10505984 10940983 11406998 11902711 12423946 12964229 13516554 14073744 14627749 15169601
60059 15169601 15689930 16179338 16628931 17031051 17379063 17666263 17885802 18032192 18102234
60050 18102234 18094142 18006755 17840515 17598932 17288700 16918930 16500674 16046512 15569836 15084312
60040 15084312 14603428 14139125 13700077 13291728 12918284 12584078 12292908 12047152 11848106
60031 11848106 11696333 11590983 11529309 11507580 11522080 11568797 11642387 11735840 11840962 11949319
60021 11949319 12053347 12146881 12224530 12281108 12312533 12317055 12294611 12245106 12168300 12065189 11938215
60010 11938215 11789970 11622707 11438885 11240694 11028960 10804057 10568352 10326388 10082434
60001 10082434 9839419 9600714 9371190 9155577 8956959 8777499 8619243 8483457 8370636
59992 8370636 8281992 8219543 8183753 8172533 8183748 8217448 8274427 8353845 8453749 8572855 8710034
59981 8710034 8862236 9024011 9188823 9350074 9501533 9637895 9754910 9848662 9915397 9952588
59971 9952588 9959369 9935333 9879782 9792821 9676451 9534027 9369471 9187491 8993528 8792856
59961 8792856 8590573 8392731 8205913 8034784 7881265 7746728 7633368 7542513 7473533 7426252
59951 7426252 7403056 7406694 7436877 7490936 7567281 7666595 7790104 7938181 8110242 8304573 8518384
59940 8518384 8748879 8993445 9247606 9503689 9753098 9989291 10207145 10400512 10562840
59931 10562840 10690273 10782171 10838253 10856792 10836005 10775826 10677870 10544937 10381292 10192831
59921 10192831 9986689 9771049 9554830 9346165 9150606 8971360 8811267 8673763 8561921
59912 8561921 8477505 8421268 8393479 8393724 8420737 8472868 8548674 8646949 8766214 8904090 9057106
59901 9057106 9221256 9392745 9568009 9743346 9915266 10081111 10238487 10384219 10515176
59892 10515176 10630562 10732165 10821924 10900570 10969449 11032223 11093592 11157331 11226835 11306619 11402026
59881 11402026 11518204 11660477 11834744 12045917 12296450 12587734 12922216 13302507 13728665
59872 13728665 14197793 14705823 15247677 15815117 16395597 16973554 17531903 18052175 18514596
59863 18514596 18899246 19187756 19365300 19422969 19359413 19180206 18895699 18519518 18068168 17560287
59853 17560287 17015035 16450447 15882364 15323914 14785777 14276985 13805117 13375571 12991338
59844 12991338 12654088 12365133 12125162 11933894 11790726 11695208 11646467 11642739 11681896 11761578
59834 11761578 11878177 12026372 12200202 12393709 12599717 12808832 13010469 13194117 13348818
59825 13348818 13462424 13522953 13521040 13451287 13312611 13108292 12844802 12529468 12169615 11774249
59815 11774249 11355020 10924005 10490893 10062852 9645760 9244217 8861269 8499470 8161628
59806 8161628 7849575 7563209 7302016 7066591 6857348 6672740 6510266 6368386 6245859
59797 6245859 6139967 6047037 5964142 5888773 5817777 5748601 5681190 5616871 5555702 5496623 5439833
59786 5439833 5387045 5339531 5297700 5262420 5234607 5212939 5193564 5172674 5148293 5119382 5084478
59775 5084478 5041750 4989904 4929249 4862619 4794715 4729274 4667196 4608416 4554876 4510026 4475799
59764 4475799 4451785 4437103 4431172 4432510 4438745 4448597 4462798 4482709 4509043 4542122 4582359 4630265
59752 4630265 4686672 4752519 4827248 4907605 4989410 5070673 5152115 5234788 5318152 5400041 5477299
59741 5477299 5546738 5606850 5658520 5703157 5740758 5771064 5795893 5818698 5842408 5869438 5903068
59730 5903068 5946375 5999983 6063277 6138173 6229452 6340893 6473291 6627001 6804261 7007852
59720 7007852 7239300 7499808 7791714 8117752 8479716 8878610 9314844 9786717 10288594
59711 10288594 10810229 11335976 11843075 12301586 12678659 12945985 13086518 13097576 12989721
59702 12989721 12782848 12501868 12173177 11821177 11464920 11117295 10787713 10484696 10214977
59693 10214977 9981436 9784119 9623257 9499856 9413763 9363028 9345376 9359079 9402684 9475600
59683 9475600 9578862 9713617 9878843 10072372 10294243 10547213 10833567 11153326 11506138
59674 11506138 11893262 12316823 12778461 13279558 13821833 14407160 15037787 15716973 16448245
59665 16448245 17233401 18071948 18962432 19903059 20890636 21919706 22982553 24068798 25165024
59656 25165024 26256310 27328934 28371526 29375147 30334803 31251553 32131920 32985144 33821917
59647 33821917 34654635 35495637 36353552 37231596 38128333 39037436 39946195 40836413 41687889
59638 41687889 42480189 43191860 43801300 44290715 44649238 44872994 44964803 44934875 44800159 44581889
59628 44581889 44304153 43993652 43677376 43378708 43116776 42909516 42774801 42727632 42778507 42935806
59618 42935806 43207811 43601099 44118867 44762403 45532498 46427466 47440223 48557516 49759399
59609 49759399 51017033 52291599 53536676 54701082 55729179 56561561 57140227 57416929
59601 57416929 57360278 56959761 56226649 55191299 53897884 52399689 50755715 49025663 47262889
59592 47262889 45509928 43799381 42156522 40599282 39136589 37767659 36481779 35257976
59584 35257976 34067152 32878275 31665655 30413435 29117380 27785130 26434040 25086256
59576 25086256 23763759 22485615 21266472 20115384 19036332 18030705 17098966 16240077
59568 16240077 15450902 14727221 14064831 13459545 12907373 12405097 11949503 11535879 11158950
59559 11158950 10815818 10506328 10229738 9982592 9760597 9560818 9380709 9216328 9062976
59550 9062976 8916925 8775706 8637504 8500827 8363907 8224277 8080099 7931825 7780858
59541 7780858 7626637 7467441 7304619 7143323 6987830 6838462 6694542 6558006 6432010
59532 6432010 6317775 6214901 6123415 6043549 5974498 5915347 5866633 5829761 5805499 5793801 5793862
59521 5793862 5803557 5820340 5843652 5874806 5913695 5957662 6004833 6056122 6112159 6170547 6228612
59510 6228612 6286982 6347899 6411691 6477930 6548974 6629221 6720981 6823537 6936178 7060018 7196870
59499 7196870 7348193 7515317 7699200 7900038 8118311 8355958 8615482 8898299 9204796
59490 9204796 9534932 9887525 10259986 10650313 11058339 11483269 11920837 12364765 12810336
59481 12810336 13254477 13692614 14117590 14522261 14902079 15254871 15578707 15869986 16123558
59472 16123558 16335736 16507718 16644943 16752630 16833594 16891174 16932009 16963985 16993065 17024327
59462 17024327 17064705 17122139 17202432 17308569 17441904 17601252 17780668 17969820 18156458 18327405
59452 18327405 18468140 18563769 18600917 18568186 18456146 18259067 17976597 17612612 17173117 16666614
59442 16666614 16105600 15505592 14882419 14250997 13625291 13017249 12435597 11886436 11374192
59433 11374192 10901066 10466997 10071939 9717378 9404153 9129930 8890689 8683963 8509046
59424 8509046 8365096 8251031 8166636 8111910 8085689 8086290 8112830 8164833 8241833 8344823 8476521
59413 8476521 8638162 8827311 9040762 9278080 9539866 9823998 10126368 10444178 10775269
59404 10775269 11114466 11453142 11781783 12090298 12366522 12597909 12775326 12893121 12945805
59395 12945805 12927633 12836011 12673178 12444556 12157689 11822828 11451712 11054541 10639312 10213858
59385 10213858 9786525 9364712 8954319 8560317 8185992 7832093 7498805 7188065 6901631
59376 6901631 6637661 6392298 6164642 5957233 5771386 5605156 5456486 5325290 5211154
59367 5211154 5111640 5024522 4949797 4888011 4838120 4798366 4768199 4748207 4738808 4739462 4748492 4763698
59355 4763698 4784126 4811118 4846712 4891483 4944906 5006457 5074106 5142628 5206255 5263389 5316968
59344 5316968 5370784 5427849 5491765 5566390 5653546 5753532 5868095 5999800 6147450 6304933
59334 6304933 6466321 6630711 6801626 6984046 7183182 7403990 7650032 7923596 8227396
59325 8227396 8564823 8938199 9348648 9798413 10291641 10831946 11420378 12056313 12739076
59316 12739076 13468169 14242772 15060562 15915066 16793771 17680184 18557987 19412407 20229177
59307 20229177 20995413 21702201 22344656 22919728 23426206 23866595 24246038 24568706 24836807
59298 24836807 25052140 25215072 25321762 25365797 25343375 25253910 25095239 24862321 24552565 24169573
59288 24169573 23720308 23211943 22653452 22056578 21431612 20783422 20113633 19424992 18721682
59279 18721682 18007452 17286067 16562596 15842428 15130231 14431460 13753407 13102750 12482980
59270 12482980 11895565 11342324 10825047 10344003 9898549 9488371 9112920 8770794 8460899
59261 8460899 8182993 7935736 7715498 7518711 7344434 7193312 7064935 6957522 6869214 6798376
59251 6798376 6743465 6703762 6679516 6670537 6675617 6694021 6726295 6772647 6831902 6903127 6987061 7084730
59239 7084730 7195753 7319200 7455161 7604295 7766608 7941520 8128254 8325363 8530695
59230 8530695 8742431 8959188 9178753 9397991 9614424 9826437 10031504 10226084 10408160
59221 10408160 10578302 10737497 10885732 11023671 11153806 11278566 11398778 11515037 11628792
59212 11628792 11740463 11847586 11945769 12029972 12093856 12129916 12132341 12099151 12030841 11928530 11794700
59201 11794700 11634231 11453124 11257034 11051749 10843437 10637158 10436530 10245864 10070877
59192 10070877 9915966 9782380 9670395 9581626 9517754 9478775 9464272 9474886 9510769 9569938
59182 9569938 9649842 9749186 9866567 9998903 10143173 10298429 10464000 10636934 10813550 10992786
59172 10992786 11176021 11364203 11557268 11756046 11962916 12180660 12412064 12660596 12930346
59163 12930346 13225247 13548537 13901663 14282533 14685449 15103230 15527842 15947701 16345779
59154 16345779 16702231 16998526 17218593 17348061 17375051 17291980 17096001 16788821 16377442 15874426
59144 15874426 15296175 14660889 13987583 13294563 12597045 11906972 11235414 10593023 9986832
59135 9986832 9418597 8888096 8396593 7945614 7534132 7159183 6818079 6508147 6225501
59126 6225501 5966243 5728392 5511250 5313796 5134953 4974151 4830003 4699510 4580010
59117 4580010 4470773 4371406 4280365 4196831 4122401 4058708 4004430 3956620 3913961 3876866 3845670
59106 3845670 3820903 3804222 3796762 3797212 3803459 3815302 3833614 3857913 3887026 3921464 3962970 4012213
59094 4012213 4068822 4133008 4205142 4284298 4369204 4460130 4558059 4662682 4773137 4890075 5015034
59083 5015034 5148397 5289944 5440672 5601747 5771955 5948393 6129671 6316533 6509428
59074 6509428 6707186 6907925 7109416 7308533 7501880 7687066 7862302 8025186 8173318
59065 8173318 8305888 8423553 8527205 8617927 8697390 8767205 8828780 8885067 8941231 9001980 9069213
59054 9069213 9143918 9229154 9329123 9446141 9580490 9732447 9902390 10089414 10291771 10508131
59044 10508131 10736671 10973283 11212054 11446485 11668594 11868097 12034811 12161435 12242599
59035 12242599 12272984 12249433 12174458 12055100 11898564 11711001 11499767 11273842 11041531 10809454
59025 10809454 10583443 10368078 10165120 9974095 9794335 9624959 9463557 9306982 9153240
59016 9153240 9000700 8845821 8683759 8511253 8327315 8131531 7923602 7704401 7475872
59007 7475872 7240070 6999598 6758019 6518090 6280287 6044861 5814310 5591789 5378070
58998 5378070 5172437 4975770 4790253 4616636 4454099 4302131 4160098 4025769 3897133
58989 3897133 3775204 3662231 3557533 3458126 3363247 3275091 3194813 3120836 3051642 2987518 2928907
58978 2928907 2875544 2827950 2787371 2753469 2724063 2697811 2675288 2657001 2642306 2630741 2622549
58967 2622549 2617456 2614662 2614307 2617123 2622378 2627868 2632175 2635279 2637097 2637277 2636435 2635656 2634661 2632289 2628753
58952 2628753 2625621 2623698 2622769 2623189 2625696 2629856 2634650 2640296 2647464 2655193 2661930 2667995 2674420 2679724
58938 2679724 2680842 2677362 2672088 2667216 2662624 2658137 2654610 2652295 2650686 2650509 2653419 2659344 2666575 2674755
58924 2674755 2685279 2698512 2713356 2729950 2749972 2773573 2798576 2823424 2848523 2874293 2900546
58913 2900546 2928363 2959856 2995365 3033396 3073717 3117643 3164765 3212700 3261105 3312709 3369045
58902 3369045 3428198 3488380 3550787 3616906 3685463 3754177 3822667 3891883 3962439 4035227 4112053
58891 4112053 4194117 4281167 4373164 4471267 4576335 4688215 4807306 4934931 5071308 5215186
58881 5215186 5366515 5527536 5700305 5885156 6082500 6293909 6520267 6761072 7016740
58872 7016740 7289478 7580709 7889923 8217567 8566957 8941825 9343954 9774767 10237164
58863 10237164 10733969 11266393 11835971 12446503 13102071 13804278 14553077 15349256 16194435
58854 16194435 17089218 18032435 19021113 20049675 21109226 22187833 23270397 24337774
58846 24337774 25367138 26333544 27210259 27968243 28578534 29017414 29269380 29326225 29186379
58837 29186379 28856599 28352496 27695702 26910671 26023386 25060141 24045449 23001242 21947522
58828 21947522 20901846 19877825 18885672 17934007 17029176 16173321 15366094 14608725 13903842
58819 13903842 13251076 12645886 12083529 11561498 11077452 10627909 10210272 9823368 9464733
58810 9464733 9130090 8816828 8525444 8256223 8007146 7776275 7563322 7367330 7185762
58801 7185762 7017787 6865719 6730967 6610854 6501578 6402235 6313904 6236883 6170976 6116747
58791 6116747 6074381 6042762 6021345 6011386 6013863 6027841 6052273 6087638 6134487 6192332 6261329 6343078
58779 6343078 6438302 6545841 6665323 6798631 6947178 7110009 7286298 7477494 7685202 7909212
58769 7909212 8149541 8408258 8687127 8985544 9302990 9641875 10005852 10396989 10816535
58760 10816535 11266781 11750136 12267928 12822058 13416478 14055274 14740632 15474018 16257515
58751 16257515 17092034 17975414 18903522 19871368 20871248 21890839 22914056 23922078 24892545
58742 24892545 25799766 26617035 27317545 27873669 28259845 28459146 28465766 28280850 27909657 27364717
58732 27364717 26667954 25846102 24925243 23930707 22888189 21821113 20748211 19685493 18647870
58723 18647870 17646261 16685574 15768451 14899143 14081539 13315893 12600334 11933607 11313839
58714 11313839 10736969 10199194 9699020 9234447 8800519 8392509 8009268 7650663 7314170
58705 7314170 6997227 6700632 6425886 6170762 5930875 5704269 5491455 5292514 5107273
58696 5107273 4936798 4781512 4639064 4506962 4385828 4277235 4179919 4091158 4010284 3937604
58686 3937604 3871367 3809106 3750733 3697184 3647255 3598937 3552540 3509292 3468111 3427117 3387132
58675 3387132 3350064 3314561 3276674 3234392 3188612 3140305 3089913 3039181 2990702 2945538 2903074
58664 2903074 2862256 2821033 2776187 2726489 2674883 2625018 2576888 2528384 2479465 2431706 2385082
58653 2385082 2338488 2292474 2248411 2205872 2163731 2122875 2084889 2049052 2013484 1978275 1944645
58642 1944645 1912222 1880117 1849565 1822369 1797688 1773367 1749407 1727124 1705933 1684091 1661692
58631 1661692 1639985 1618780 1597443 1577266 1559865 1544566 1530494 1519616 1514099 1511974 1509299 1505655
58619 1505655 1503810 1504980 1508352 1514414 1524419 1536752 1547752 1556274 1563934 1571074 1576097 1578865 1581252
58606 1581252 1584001 1585955 1586595 1586686 1586506 1585862 1585310 1584902 1582706 1577387 1571111 1566856 1564139 1560874 1558100 1558848
58590 1558848 1563286 1569304 1577425 1590607 1609033 1629299 1649371 1670654 1694581 1720659 1748686 1779772
58578 1779772 1814413 1852154 1893560 1939990 1991225 2045735 2103364 2165469 2232718 2305046 2383271
58567 2383271 2468355 2559813 2657351 2763174 2879981 3007593 3144394 3291245 3451206 3626543
58557 3626543 3818812 4030499 4263202 4515236 4784028 5069421 5371241 5684999 6003456
58548 6003456 6320716 6630850 6924021 7188162 7413392 7591105 7710880 7763835 7748884 7671942
58538 7671942 7540154 7360990 7144953 6903299 6643177 6369398 6089977 5814820 5549544
58529 5549544 5295500 5055075 4831578 4624483 4430489 4249386 4083709 3932829 3793013
58520 3793013 3663430 3546488 3441905 3346147 3258256 3180463 3111984 3047816 2985110 2925619 2870491
58509 2870491 2817704 2766247 2718134 2674596 2634370 2597032 2563930 2534735 2506939 2479383 2452189
58498 2452189 2422919 2387446 2345326 2300019 2253501 2205182 2156139 2109148 2064018 2018246 1972960
58487 1972960 1932808 1898868 1867098 1835036 1804782 1777977 1753016 1728893 1707060 1687981 1670295
58476 1670295 1654449 1642543 1633857 1625432 1617674 1613975 1613986 1612969 1608994 1605148 1603319 1601500 1598545 1595642
58462 1595642 1591465 1581827 1566134 1548557 1531077 1511179 1488111 1465234 1444042 1422028 1398840 1378288
58450 1378288 1361529 1344478 1325112 1307464 1295003 1285578 1276259 1267859 1261357 1255021 1248495 1244845 1245323
58437 1245323 1246750 1246954 1248017 1251458 1255219 1258134 1262215 1267771 1271594 1272815 1275217 1280814 1286543 1290122
58423 1290122 1293381 1296724 1296449 1291368 1286294 1284877 1284404 1281679 1278561 1277386 1276178 1272982 1270343 1271217 1274736
58408 1274736 1279690 1287459 1297816 1306681 1311964 1316870 1323855 1330368 1334323 1338381 1344492 1349244 1349073 1345443
58394 1345443 1340778 1334053 1324469 1314582 1305604 1294531 1280040 1266276 1256597 1248664 1239969 1232929 1229827
58381 1229827 1227841 1223985 1220299 1219589 1220729 1222517 1227091 1234961 1241817 1244994 1247969 1253665 1258557 1258521 1255373
58366 1255373 1252363 1248201 1240994 1233395 1228523 1225163 1221885 1221220 1224817 1229326 1231983 1235480 1242598 1251311
58352 1251311 1260132 1272706 1291743 1313715 1334898 1357066 1381903 1405735 1425801 1445928 1469677
58341 1469677 1493387 1512143 1526918 1539467 1546197 1544298 1538466 1534225 1529597 1520481 1509058 1499444 1490029
58328 1490029 1477752 1465441 1457388 1451926 1445562 1440078 1438355 1437536 1433623 1428580 1425959 1423923 1419655 1416003
58314 1416003 1416609 1419015 1419781 1421586 1427975 1435927 1441126 1445706 1453316 1461667 1467812 1475639 1489806 1507016
58300 1507016 1521520 1534545 1550171 1566789 1580984 1594996 1611914 1628404 1640722 1652820 1669688
58289 1669688 1687740 1700882 1710961 1722857 1734175 1739574 1740792 1742828 1744622 1742954 1740883 1742859 1746205
58276 1746205 1747029 1749441 1758877 1771422 1780227 1787570 1799807 1815279 1828341 1840912 1858686 1879959
58264 1879959 1899210 1917849 1940597 1965434 1987889 2010848 2039103 2068776 2093294 2115129 2140427
58253 2140427 2167171 2190410 2213750 2243103 2274148 2298873 2319709 2344198 2370628 2392361 2411613
58242 2411613 2435135 2460838 2482528 2503341 2530399 2560860 2587734 2614749 2650438 2692019 2730603
58231 2730603 2768055 2812963 2864049 2913567 2963134 3019847 3080538 3136419 3189655 3248749 3311540
58220 3311540 3370000 3427859 3495448 3570582 3642847 3713557 3792879 3880316 3967057 4054753 4152596
58209 4152596 4258247 4361088 4461959 4570303 4684635 4796011 4908138 5033395 5171465
58200 5171465 5312731 5459985 5625133 5807212 5995904 6193849 6412320 6647623 6885922
58191 6885922 7129113 7391175 7671251 7956026 8246908 8558420 8891300 9234426 9592289
58182 9592289 9982604 10407371 10854431 11326519 11839334 12391869 12969411 13575539 14229512
58173 14229512 14932156 15666955 16434780 17253665 18124264 19031150 19978984 20990803 22070057
58164 22070057 23202637 24396930 25681194 27060063 28516093 30055555 31707627 33476366
58156 33476366 35341233 37307915 39408726 41650638 44018240 46533567 49256270 52219358
58148 52219358 55425976 58916005 62769694 67037345 71737089 76934410 82752317 89297174
58140 89297174 96659581 104997567 114523746 125400566 137760291 151846085 168006554
58133 168006554 186521743 207561885 231326162 258070343 288067043 321863404 360464064
58126 360464064 404294127 450949109 493983967 524947236 537668093 531200866 509212683
58119 509212683 477155647 439953661 401252662 363471942 327940055 295161415 265252949
58112 265252949 238234071 214036896 192485195 173393232 156632540 142070421 129514800
58105 129514800 118757574 109622109 101943726 95552024 90305994 86122285 82942398 80676420
58097 80676420 79199454 78434445 78446648 79368512 81078454 82908226 83802171 82920199 80120415
58088 80120415 75867373 70781175 65348973 59929794 54793502 50072682 45768081 41854077
58080 41854077 38334039 35191271 32366096 29813996 27533624 25516612 23720782 22112732
58072 22112732 20688674 19432645 18297985 17250494 16290983 15417805 14605356 13837235 13124470
58063 13124470 12472700 11863741 11285676 10749571 10260554 9802240 9364906 8960426 8594691
58054 8594691 8252487 7923222 7614607 7327400 7043428 6753174 6470493 6206333 5951679
58045 5951679 5699522 5459724 5238346 5024840 4813372 4615272 4437197 4267922 4099839
58036 4099839 3943169 3805739 3678249 3552561 3435655 3332478 3233142 3130194 3031516 2943789
58026 2943789 2859722 2773528 2692572 2621824 2552797 2479678 2410822 2352677 2297547 2238887 2183710
58015 2183710 2138153 2095250 2048718 2004853 1969033 1933957 1893064 1852946 1821003 1792916 1763312
58004 1763312 1736830 1717732 1700054 1678680 1658993 1645491 1632063 1613528 1595467 1582615 1568686
57993 1568686 1548013 1526468 1510566 1496171 1478113 1460743 1448658 1436807 1419994 1402889 1390768
57982 1390768 1379514 1364455 1350099 1341446 1334398 1324211 1314919 1311119 1308902 1303981 1300470 1302562 1305798
57969 1305798 1305398 1304916 1307785 1308750 1302870 1295046 1291499 1289546 1284675 1279854 1278771 1277455 1271665 1265251 1262378
57954 1262378 1258950 1250608 1241835 1237941 1235279 1228640 1221346 1218591 1217316 1212073 1204730 1199318 1193376 1183460
57940 1183460 1173295 1167571 1163393 1156446 1149675 1146989 1144357 1136239 1125333 1117028 1109618 1098981 1087678
57927 1087678 1080298 1074593 1066076 1056778 1050909 1046539 1040044 1034120 1032960 1034056 1033127 1032442 1035911 1040791
57913 1040791 1042817 1044709 1050698 1057206 1058167 1055323 1054050 1052965 1047162 1038290 1032087 1028785 1024757 1020714
57899 1020714 1019528 1018827 1014467 1008612 1005821 1003857 997223 987413 980818 978292 975266 970582 967105 965063
57885 965063 962469 960657 962024 964158 963516 962721 966647 973427 977141 977476 978670 980589 979019 973722 968305
57870 968305 962869 954302 943147 932939 923310 910753 895658 881958 870470 858984 848096 840525
57858 840525 835486 829956 824538 822073 821788 820990 820987 824874 830933 834918 837549 843077 851574 859403 866134
57843 866134 874293 883381 890960 898609 909787 922525 931218 935061 937984 940895 940988 938268 935728 933114
57829 933114 927358 919188 912580 907544 900185 890171 881475 875213 868219 859455 851593 845456 838900 832065
57815 832065 828015 827257 826926 825973 826005 826775 826295 825660 828293 834056 839467 843904 850091 858270 865577 871603
57799 871603 878918 887465 893947 897542 900993 905257 907999 907971 906159 902364 895583 887822 882466 878821 873227
57784 873227 865448 858578 852984 846160 838602 833735 831440 827567 820597 813183 806432 798396 789116 781389
57770 781389 775437 768225 759155 751057 744581 736996 727586 718924 711683 703489 693912 685329 677828 668627
57756 668627 657688 648543 642421 636878 631173 627433 625412 621917 616865 614101 614608 614702 612765 611892 613738
57741 613738 615534 615690 616897 620990 625906 630437 636983 646837 657433 666901 676684 687032 694579 697329
57727 697329 697810 698710 699540 700018 702227 706599 710030 710839 711623 714361 716669 715767 712545 708922 704674 699449
57711 699449 694579 690416 685142 678265 671893 666742 660753 653699 649068 648996 651242 653435 656352 660586 664150
57696 664150 666322 670073 677695 687398 696798 706185 715598 722440 725157 726200 728546 732239 736720 743053
57682 743053 751153 758239 762973 768035 775793 784483 791349 796484 800941 804224 806586 810838 818981 829575
57668 829575 840727 852734 865610 877468 888008 900320 916459 934468 952457 972129 995180
57657 995180 1019657 1043297 1067387 1093819 1121170 1147264 1173017 1200361 1228851 1257610 1288194
57646 1288194 1322160 1358223 1395178 1435236 1480944 1530992 1582702 1636775 1696010 1760922 1830065
57635 1830065 1903321 1981646 2064837 2152575 2246776 2350327 2464532 2589900 2727983 2880202
57625 2880202 3046343 3226358 3422130 3635556 3866575 4114887 4381301 4665064 4961609
57616 4961609 5265019 5570660 5873256 6164519 6435131 6677565 6885673 7054381 7182242
57607 7182242 7271595 7323039 7330996 7286582 7183106 7017963 6793384 6519106 6212059 5889838
57597 5889838 5565082 5246989 4944447 4664068 4407343 4173064 3961126 3771756 3603508
57588 3603508 3454960 3326367 3216988 3122922 3040416 2969281 2910522 2863045 2825557 2799254 2785218
57577 2785218 2781179 2784006 2793674 2811904 2838960 2874765 2920995 2978723 3045856 3120089 3202684 3296315
57565 3296315 3401186 3516571 3644223 3786609 3943178 4111727 4292031 4484768 4687904
57556 4687904 4896981 5107488 5313849 5507210 5677198 5814992 5912914 5963570 5962824 5912395
57546 5912395 5817033 5681091 5510284 5313963 5101641 4878790 4649070 4418385 4192932 3975099
57536 3975099 3765104 3565083 3377796 3202909 3038532 2885204 2744700 2616239 2497646
57527 2497646 2389005 2291385 2203177 2121443 2045771 1977100 1914009 1854112 1798021 1747934 1703256
57516 1703256 1661522 1622745 1588710 1558711 1530072 1502423 1477562 1455595 1435198 1417191 1403743
57505 1403743 1394147 1385314 1376452 1369532 1365201 1362051 1360123 1361381 1366192 1372696 1380096 1389628 1401975 1416525
57491 1416525 1433353 1453246 1475779 1499951 1526547 1557367 1592540 1630899 1672147 1716072 1760923
57480 1760923 1805727 1853151 1906746 1966362 2029725 2097279 2171542 2252617 2338549 2429690 2528668
57469 2528668 2636353 2751822 2875950 3010919 3156221 3309164 3469071 3636613 3808704
57460 3808704 3978228 4139220 4288135 4419471 4524371 4594905 4626807 4618012 4568661 4483453
57450 4483453 4370332 4235703 4083720 3920049 3752155 3585044 3420310 3260038 3107795
57441 3107795 2964987 2830257 2703869 2589160 2488289 2399875 2321985 2254192 2195461 2143494
57431 2143494 2097778 2060347 2032027 2010636 1994196 1983127 1977901 1977142 1979551 1985567 1996098 2011609
57419 2011609 2033131 2061769 2096645 2135701 2179110 2229499 2288404 2355017 2428722 2510198 2599621
57408 2599621 2696493 2801601 2916439 3040398 3171266 3308583 3453333 3603978 3755814 3904339
57398 3904339 4045810 4174011 4280084 4356711 4399818 4406142 4372960 4301347 4196594 4064446
57388 4064446 3909648 3738405 3558425 3375311 3191710 3010586 2835980 2669867 2511759
57379 2511759 2362522 2225277 2101512 1989281 1886108 1790718 1701541 1617180 1539220 1471015
57369 1471015 1412598 1360056 1310754 1265719 1225972 1190104 1156594 1125146 1094808 1064176 1034312
57358 1034312 1007972 985216 963324 941479 921441 903095 883968 864141 846868 832819 818485
57347 818485 802066 786328 773604 762484 751601 742229 734738 726844 717923 710915 707416 704930 701444
57334 701444 698496 697098 694956 690743 686959 685473 684239 681595 679672 680087 680283 677909 675057 674187 673445
57319 673445 670202 666148 664545 665086 665457 665563 666296 666484 664841 662852 662240 661648 659164 655773 652988 649496
57303 649496 643734 637574 633772 631698 629068 625979 623837 622199 620215 619422 621638 625539 628566 630819
57289 630819 634152 638853 644020 649694 656050 662090 667605 674509 683700 692658 698744 702870 707303 712051
57275 712051 716117 720131 724934 729668 733919 739549 747677 756121 762545 767839 773758 779764 785069 791157
57261 791157 799104 806902 812634 817947 825245 833786 841641 849113 857121 864703 871331 879236 890283 902914
57247 902914 915156 927877 942027 955835 968286 982328 1000823 1022182 1043693 1066070 1090714
57236 1090714 1115774 1139412 1164105 1192974 1224558 1256001 1288862 1326692 1369025 1412748 1457485
57225 1457485 1504757 1553665 1602296 1651831 1704629 1759715 1814424 1868620 1922976 1975209 2022599
57214 2022599 2066087 2107152 2142933 2169598 2188433 2203345 2214274 2218550 2216930 2212535 2205115 2192015
57202 2192015 2173739 2153262 2130955 2105490 2078552 2053206 2028749 2002697 1976902 1956219 1941935
57191 1941935 1931898 1926167 1926836 1932923 1941021 1950709 1964159 1980935 1998265 2015711 2034336 2052144
57179 2052144 2065912 2077002 2090047 2106477 2124512 2144563 2168994 2197246 2226827 2258652 2296024
57168 2296024 2339095 2385717 2436655 2494071 2555899 2617917 2680501 2746966 2815966 2882123 2943609
57157 2943609 3002566 3058503 3108247 3152358 3194844 3236600 3275875 3314961 3359072 3408162 3457119
57146 3457119 3504742 3555507 3611715 3671068 3733059 3800677 3874300 3950498 4028277 4110262 4196651
57135 4196651 4284149 4371609 4460410 4548800 4632475 4711177 4787953 4861709 4927884 4986927 5044489
57124 5044489 5102818 5159937 5217920 5283161 5356821 5433495 5511211 5594333 5684397 5776449 5867122
57113 5867122 5958401 6050917 6141461 6229825 6320422 6414645 6509153 6603716 6702503 6805303 6906001
57102 6906001 7002600 7100505 7203236 7308320 7415170 7528270 7649294 7774363 7902234 8036840
57092 8036840 8178956 8323969 8470559 8622196 8776851 8924669 9059468 9183648 9298977
57083 9298977 9402618 9495655 9585253 9674306 9758744 9838495 9920520 10007314 10093315 10176293 10260635
57072 10260635 10345366 10421196 10484042 10538921 10585632 10613674 10616564 10597491 10554787 10475642 10350648
57061 10350648 10180603 9962658 9684685 9340388 8934669 8466706 7923642 7298273 6595670
57052 6595670 5814225 4938837 3962216 2893671 1736903 479544 -884494 -2343968 -3892729
57043 -3892729 -5539091 -7279469 -9087494 -10942915 -12843455 -14772957 -16689415 -18563568
57035 -18563568 -20397909 -22192200 -23932011 -25630446 -27328422 -29027097 -30680663 -32275496
57027 -32275496 -33809457 -35154096 -36165358 -37215055 -39541547 -44641462 -52962918 -63199371
57019 -63199371 -73015357 -80518571 -85111423 -87219836 -87542674 -86598077 -84712283 -82174278
57011 -82174278 -79332850 -76567459 -74146675 -72085682 -70152763 -68029872 -65470519 -62348909
57003 -62348909 -58650641 -54469584 -49983531 -45385017 -40824444 -36411049 -32231746 -28344010
56995 -28344010 -24767972 -21506298 -18562635 -15931275 -13586177 -11495868 -9638523 -7992408
56987 -7992408 -6525551 -5207859 -4023408 -2960844 -2002479 -1132847 -347566 356579 991536
56978 991536 1569163 2091831 2560807 2985580 3375889 3731821 4050070 4333280 4585909 4807658
56968 4807658 4998447 5163837 5308964 5432944 5534999 5619775 5691026 5746746 5786495 5817078
56958 5817078 5844985 5869259 5887437 5902140 5915886 5925675 5929116 5930354 5933829 5937310 5936604 5931635 5922492
56945 5922492 5905584 5879925 5851511 5825596 5801615 5783265 5785589 5818334 5861794 5868077 5789288 5603311
56933 5603311 5318337 4962377 4569289 4167002 3773021 3398431 3051947 2737627 2452789
56924 2452789 2192815 1955925 1740344 1540636 1351384 1171542 1000955 835948 673290
56915 673290 515619 367620 229211 97755 -25254 -135469 -232147 -317840 -392593 -453805 -501438
56904 -501438 -538379 -565769 -582511 -589448 -589618 -583959 -570658 -549343 -522743 -494076 -465997 -442202
56892 -442202 -426658 -420388 -421186 -426555 -434972 -444953 -455452 -466655 -477986 -486258 -488649 -486606 -483646
56879 -483646 -479944 -472418 -459741 -443614 -424992 -402580 -375566 -344523 -308870 -266877 -219990 -174988
56867 -174988 -140327 -121355 -119016 -130663 -151146 -175230 -200403 -226428 -252048 -274084 -290482 -302406
56855 -302406 -312220 -320819 -327857 -333297 -337469 -340326 -341591 -341268 -339464 -336063 -330936 -324215 -316342 -308132
56841 -308132 -300492 -293537 -286247 -277484 -266941 -254632 -240279 -223939 -206355 -187515 -165688 -139246
56829 -139246 -108803 -76121 -41467 -3762 36910 78425 118018 152946 180001 196462 202089 198936
56817 198936 189069 173829 155404 137111 121110 106994 93455 80460 69261 61298 57877 60148
56805 60148 68498 82292 100643 123280 150676 183885 223928 269810 316459 355648 380291 388083
56793 388083 381166 363327 338303 309957 282444 259255 241991 230189 222444 217926 216999 220522 228964
56780 228964 242560 262061 288831 324203 368986 423097 484859 550684 616080 676911 729016
56769 729016 767082 785598 781991 758466 720487 674108 624763 576877 532916 493028 456770 425170
56757 425170 400331 383316 373482 369872 372143 379980 392767 410391 433472 462048 494598 528831
56745 528831 562537 592762 614924 624191 618102 597452 565023 524360 479467 434332 391963 353946
56733 353946 320659 291450 265175 241681 222566 209395 201446 196699 194980 198187 206958 219251
56721 219251 233444 250748 272341 295143 312790 320654 318332 307606 290182 267844 242911 217348
56709 217348 192088 167701 144910 124034 104793 87161 71743 58838 47735 37471 27749 18612
56697 18612 9581 -176 -10733 -20806 -28541 -33108 -35621 -38213 -42075 -46529 -50059 -51735 -51399 -49249
56683 -49249 -46078 -43474 -42836 -44127 -46185 -48121 -49870 -51632 -53517 -55618 -57717 -59026 -58968 -58135 -57776 -58405
56667 -58405 -59660 -61391 -63956 -67272 -70554 -73402 -76422 -80298 -84704 -88588 -91253 -92822 -93704 -93859 -92715
56652 -92715 -89967 -86409 -83531 -82046 -81353 -80799 -80815 -82048 -83894 -84870 -84323 -82859 -81145 -79154 -76642 -73585
56636 -73585 -69981 -65944 -62198 -59775 -58926 -58808 -58485 -57798 -56968 -55840 -53967 -51383 -49034 -48224 -49487 -52005
56620 -52005 -54388 -56086 -57766 -60273 -63582 -66872 -69134 -69757 -69182 -69085 -70955 -74149 -76292 -76114 -74848 -74142
56604 -74142 -73811 -72898 -72002 -72870 -76044 -80343 -84607 -88723 -92911 -97241 -102069 -107895 -114373 -120311 -125193
56589 -125193 -130258 -137581 -148044 -160223 -171399 -179950 -186650 -193109 -199207 -203105 -203933 -202984 -201601 -199306
56575 -199306 -195183 -189927 -184994 -180423 -175005 -168247 -160929 -154066 -148407 -144482 -141935 -139164 -134774 -129072
56561 -129072 -123148 -117098 -110400 -103568 -97881 -93619 -89857 -86002 -82429 -79613 -77659 -76690 -76771 -77425 -77818
56546 -77818 -77316 -75553 -72590 -69486 -67607 -66579 -64143 -59195 -53753 -50382 -48801 -46908 -44220 -42144 -41340
56531 -41340 -41008 -40708 -40877 -41276 -40539 -37654 -32866 -27160 -21797 -17935 -15538 -13243 -10436 -8479 -8404 -8404 -5692
56514 -5692 -204 5697 10597 14908 18760 21565 23829 27196 32277 38125 43957 49731 55205 60301 66203
56499 66203 74080 82898 90491 96567 102422 107960 111728 114069 117501 123297 130011 135930 140580 143304
56485 143304 142971 140239 137892 137784 139236 141130 143373 145272 144753 140793 135078 129939 125928 122443 119346
56470 119346 116881 115088 114066 113787 113280 111333 108263 105455 102983 99523 94950 90968 88529 86649 84554
56455 84554 82956 82205 81084 78613 75543 73094 71615 71233 72175 73639 73902 72449 70617 69521 68760 67706
56439 67706 66528 65510 64964 65908 68761 71184 69780 64652 59786 58069 58421 58892 59774 62040 65246 68880
56423 68880 73652 79507 84256 86166 86320 86666 87372 87904 89060 91781 95201 97831 99775 102070 104753
56408 104753 107140 109239 111555 114213 117331 121342 126083 130710 135282 141026 148093 154601 159112 162628
56394 162628 166778 171328 174796 176426 176421 175273 173825 172981 172575 171697 170620 170808 172498 174144 174953 175863
56378 175863 177052 176795 174263 171410 170369 170714 170813 170266 169400 168000 166131 164901 164915 165238 165009 164589 164076
56361 164076 162493 159607 156721 154379 151278 146829 142746 140545 139476 138516 138238 138797 138264 135206 131150
56346 131150 128348 126804 125646 125594 127559 130267 131832 132586 134003 135807 136507 136077 136052 137392 139788 142403
56330 142403 143977 143232 140597 138446 138398 139472 140003 139867 139527 138615 136956 135455 134437 132786 130277 129042
56314 129042 131038 135679 141475 148103 155255 161556 166639 172476 180528 189264 196416 201864 206332 209313
56300 209313 210597 212022 215167 218858 221250 222751 224727 227079 229500 233311 239331 245483 249227 251155
56286 251155 253746 257782 262320 266835 271001 273680 274554 275580 278635 283045 287453 292402 298776 305444
56272 305444 311033 316492 323330 330756 337152 342979 349791 357789 366623 376936 388742 400075 409784
56259 409784 419804 431992 444788 455957 466633 479327 493643 507354 520321 534067 548689
56248 548689 563237 577770 592124 604281 613180 621466 632006 643229 651541 657017 662987 671022 679912
56235 679912 688703 697266 704723 710675 717217 726732 738714 751579 766015 783260 801867 819954 839178
56222 839178 862495 889327 917034 945973 978758 1015469 1053911 1094064 1138001 1185849 1235939
56211 1235939 1288713 1346487 1409566 1476544 1548309 1627994 1716807 1813255 1916380 2026710 2144671
56200 2144671 2271314 2409754 2562378 2727597 2902950 3090035 3292088 3507738 3731866
56191 3731866 3962089 4199549 4443266 4688276 4929567 5163467 5384683 5586153 5762682
56182 5762682 5911548 6029639 6113713 6163642 6182001 6170623 6130982 6067236 5984794 5886042 5771352
56171 5771352 5643807 5508723 5368783 5223847 5075272 4925943 4776102 4623630 4468705
56162 4468705 4313964 4159830 4003894 3845253 3685511 3525557 3365567 3208178 3057233
56153 3057233 2912953 2772236 2633762 2498931 2368311 2241722 2121609 2011541 1911170
56144 1911170 1817149 1728856 1648394 1575125 1505608 1439450 1379999 1328386 1281691 1237839 1197563
56133 1197563 1160834 1126145 1094088 1066830 1043159 1018856 993009 969370 950514 935161 922190
56122 922190 912624 906505 902128 899387 899830 902831 905969 909527 916051 925099 933299 940148 948890 960984
56108 960984 974516 988703 1005059 1023455 1041839 1060368 1080985 1102611 1121908 1139060 1157439
56097 1157439 1177267 1195318 1211310 1228689 1248334 1267349 1284910 1303486 1323633 1343777 1365897
56086 1365897 1394812 1430561 1468003 1505485 1547532 1597421 1653749 1716244 1788306 1871343 1962708
56075 1962708 2061667 2171658 2294397 2427152 2567363 2713823 2861489 3001520 3129044 3245626
56065 3245626 3352808 3449502 3537191 3620480 3699569 3767969 3819818 3853813 3868716 3862041 3835670
56054 3835670 3796473 3749002 3693113 3629527 3560479 3483377 3391473 3283195 3163995 3037771 2904589
56043 2904589 2768751 2640202 2524542 2419265 2322488 2237330 2164748 2100620 2043447 1996883
56033 1996883 1961148 1929969 1899522 1872390 1849513 1826736 1802885 1782473 1766627 1750103 1731204
56022 1731204 1715439 1705032 1694178 1679656 1666901 1660108 1655279 1648805 1644385 1645594 1649685 1654257 1662072
56009 1662072 1674104 1686062 1696840 1711844 1732983 1754315 1772811 1794089 1821885 1851308 1878497
55998 1878497 1907522 1941431 1975723 2007100 2039778 2076980 2115249 2152898 2194469 2240976 2285893
55987 2285893 2326897 2371169 2422744 2475356 2524306 2574156 2627848 2679980 2728358 2780340 2839801
55976 2839801 2899773 2956223 3016903 3087739 3162814 3237076 3316457 3405727 3498640 3590157 3686256
55965 3686256 3791801 3901295 4011743 4131578 4266382 4409172 4555461 4713843 4890244
55956 4890244 5076260 5265423 5466274 5686158 5916659 6148803 6388332 6642136 6904323
55947 6904323 7170065 7448360 7746562 8057522 8376796 8716554 9087063 9480986 9891970
55938 9891970 10331349 10809428 11318207 11850579 12418128 13031070 13679528 14354466 15067555
55929 15067555 15829681 16630391 17460952 18337035 19275578 20270880 21317694 22434815 23639456
55920 23639456 24921624 26271292 27706577 29246396 30881407 32602947 34433315 36394761
55912 36394761 38478940 40684416 43054448 45638803 48450695 51504000 54858630 58582895
55904 58582895 62708230 67273585 72378897 78144158 84661125 92043862 100473563 110124238
55896 110124238 121106482 133574431 147835173 164273040 183256803 205236283 230813720
55889 230813720 260541082 294732590 333570153 376893943 422951251 466982006 501766186
55882 501766186 520720877 521211787 505255690 477491485 442719365 404760545 366389768
55875 366389768 329430974 294850962 263064255 234269948 208528373 185705625 165552316
55868 165552316 147844152 132381944 118918991 107188664 96976085 88094132 80326287
55861 80326287 73464037 67374709 61974758 57163968 52839816 48947878 45461254 42328530
55853 42328530 39488297 36913772 34596300 32501017 30579812 28811615 27190895 25691908
55845 25691908 24281739 22955074 21721279 20569699 19479646 18451459 17496063 16605415
55837 16605415 15762799 14970865 14241049 13565962 12929023 12330461 11777621 11260330 10761841
55828 10761841 10284578 9840319 9424490 9024252 8642572 8290208 7962196 7645561 7342444
55819 7342444 7063018 6802930 6549665 6304280 6075634 5859902 5646543 5438128 5243903
55810 5243903 5059941 4875564 4693551 4524396 4366042 4208452 4052944 3908073 3771287
55801 3771287 3633486 3497420 3373390 3260789 3151680 3048590 2960645 2885016 2809519 2731183
55791 2731183 2655925 2582588 2503811 2420866 2342122 2268509 2195010 2124117 2063164 2010462 1958403
55780 1958403 1908176 1867422 1835515 1805064 1775794 1753104 1734900 1713696 1690103 1670769 1654566
55769 1654566 1633988 1608717 1584795 1561896 1534467 1503997 1477134 1452726 1423572 1390071 1359463
55758 1359463 1332302 1302237 1268761 1237921 1210658 1182407 1153987 1131045 1112832 1093213 1072737
55747 1072737 1058103 1049528 1040235 1028881 1021221 1018674 1016194 1012339 1010916 1011735 1009953 1005398 1002520 1000466
55733 1000466 993255 980669 969046 960353 950064 936747 924069 912190 896645 877110 858433 841915
55721 841915 824306 806107 792027 782434 773096 763797 758084 753988 744632 729193 713839 700501 684243
55708 684243 663567 643895 628300 613439 597338 583081 572144 561721 550973 542581 536076 526987
55696 526987 514644 503528 495024 485120 472187 459634 448645 435596 419096 402833 389053 375733
55684 375733 362321 351728 344472 337122 328674 322335 319101 315763 311329 309266 311183 313950 315080 315638
55670 315638 316284 315811 314893 315792 317294 315528 310599 306525 303885 298904 290936 284255 280947 278218 274306
55655 274306 270924 268403 264568 259988 258227 259403 259704 258747 260964 267874 275355 280650 285713 291401 294654
55640 294654 294229 293540 295045 296991 297938 299372 301689 302785 302598 303972 307238 309188 309119 310394 314246 317651
55624 317651 319286 321887 326544 330338 331947 334043 337623 339315 336913 332545 327981 321922 314296 308075
55610 308075 304284 300141 294537 290402 289435 289567 289969 293279 300174 306791 310339 312550 315076 316397 315946
55595 315946 316456 319286 321969 322903 323970 326074 326911 325697 325247 326698 326944 323971 319863 315833 309303
55580 309303 299081 288550 280445 273065 264841 257897 253614 249113 241794 233233 225293 216679 206661
55567 206661 197900 191889 185729 177158 168713 163115 158499 152289 146123 142658 140600 137055 132186 127844
55553 127844 124034 120100 116915 114910 112458 108954 106612 106606 106569 104767 103399 104578 106234 105451 103025 101282
55537 101282 99982 97816 95751 95565 96877 98264 99565 100907 101473 101152 101211 101839 101607 100559 100621 101615 100616
55520 100616 96917 93600 92315 90851 88180 87192 89478 91887 91651 90672 91101 90878 87778 84108 83095
55505 83095 83832 83938 84059 85444 86133 84137 81904 83161 87309 90970 93105 94650 95010 92966 89689 87361
55489 87361 86026 84676 83705 83512 82646 80240 78306 78848 80755 82160 83490 85460 86738 86643 87485 91011
55473 91011 95069 97120 98409 101261 104911 107733 111009 116438 122099 125023 125981 127848 131032 134268 138084
55458 138084 143355 147940 148935 147287 146543 147917 149863 151366 152305 151602 148214 143095 137547 130941 122656
55443 122656 114415 107801 101273 92748 83337 75355 68613 62126 57415 56131 56052 53631 49448 47216 48134
55428 48134 49895 50514 49616 46716 41760 36892 34399 33340 31136 27806 25531 24749 23768 21865 19932
55413 19932 18441 17192 16515 16437 15612 13167 10352 8264 5813 2522 1166 4217 9357 12098 11588 10360
55397 10360 9675 8828 8065 8403 9068 8485 7179 6521 5485 2207 -1900 -3154 -446 4067 8558 12514
55381 12514 14671 13565 10295 7706 6703 5998 5124 4860 4974 4507 4132 5385 7645 8532 7296 5336
55365 5336 3630 2103 1208 1534 2052 1189 -510 -1026 180 1956 3653 5390 6758 7463 8556 10939 13486
55348 13486 14683 15009 15509 15388 13548 11159 9974 9414 8181 7433 9198 12725 15535 17090 18293 18466
55332 18466 16332 13132 11342 10891 9928 8612 8663 9735 9718 8332 7146 6338 4660 2286 537 -796 -2801
55315 -2801 -4616 -4463 -2873 -1675 -512 2155 5271 6210 5143 4559 4808 4134 2899 3526 5994 7485
55299 7485 7067 6695 6941 5743 2554 37 230 2070 3812 5003 5141 3318 190 -2245 -3524 -4774 -5716
55282 -5716 -4683 -2141 -1109 -3176 -6820 -10210 -12767 -13606 -11630 -8027 -5659 -5088 -4020 -1474 439
55266 -151 -2533 -5191 -7274 -7609 -5174 -1424 570 192 -85 1224 2661 2648 1442 -470 -3113 -5346 -5319
55249 -5319 -3468 -2319 -2620 -2587 -1686 -1859 -3829 -5497 -5451 -4968 -4991 -4124 -1515 912 1167 -108 -1341 -2314
55231 -2314 -3131 -3034 -1904 -1126 -1495 -1947 -1546 -835 -192 1173 3426 5307 6263 7452 9556 11519 12448
55214 12448 12785 12650 11247 9012 8159 9643 11494 11408 9269 6070 2302 -1355 -3633 -4335 -4985 -6755
55198 -6755 -9065 -10826 -11581 -10982 -8881 -6314 -4495 -2663 857 5325 7970 8178 8470 10550 13224 15187
55182 15187 16926 18542 18493 16258 13835 12931 12714 11785 10321 8836 6854 4197 1805 246 -692 -308
55165 2627 6845 8740 6945 4215 3389 4072 4753 5323 5637 4318 1199 -1318 -1566 -1094 -1735 -2353 -947
55147 1947 4368 5849 6956 7347 6677 6204 7203 8686 8700 7129 5508 4830 4998 5710 6631 7431 8491
55130 8491 10488 12642 13037 11621 11037 13141 16303 17567 16049 12936 9659 7368 6792 7208 6802 5043
55114 5043 3384 2815 2503 1799 1629 2711 4182 5264 6479 8034 8826 8348 7753 7857 7899 7318 6705 5882
55096 5882 3430 -416 -2799 -1831 966 3333 5014 6143 5550 3001 926 1438 3365 4469 4734 5165 5155
55079 5155 3680 1725 1092 1814 2748 3528 4111 3791 2555 2006 3075 4389 4681 5115 7147 9814 11453
55062 11453 12520 14370 16678 18421 20083 22543 24993 26223 26778 27789 28976 29934 31744 34914 37257
55047 37257 36568 34134 32878 33129 33048 32189 31667 31437 30391 28850 28236 28366 27564 25525 23935 24139 25973
55030 25973 28763 31792 33988 34772 35038 36072 37976 40255 42962 45969 48246 49371 50529 52385 53389
55015 53389 52109 49868 48944 49360 49708 49862 50476 50850 49990 48973 49713 51878 53496 54048 54596 55237 54879
54998 54879 53378 51823 50883 50742 52172 55720 60204 63834 66349 68387 69629 69544 69016 69018 68457 65717 61675
54981 61675 58779 57641 56934 56191 56191 56850 57143 57000 57107 57017 55710 53830 53096 53560 53543 52311 50752 49488
54963 49488 48314 47448 47354 47388 46541 45466 45981 48671 52677 57480 62935 67823 70380 70315 68733 66483 64206
54946 64206 63327 64878 67601 69134 68744 67260 65069 62191 59551 57933 56374 53800 51367 50665 50466
54931 50466 48246 44361 41612 40910 40528 39739 39927 41683 43814 45882 48869 52551 54985 55537 55940 57363
54915 57363 58831 59587 60765 63468 67061 70533 73988 77871 82115 86658 91381 95141 96491 95835 95349
54900 95349 96455 98863 102178 106602 111842 117148 122801 129863 138338 147425 157545 170063 184855 200372
54886 200372 216275 233722 252733 271760 290317 309473 328839 345553 357331 364399 367401 365663
54874 365663 358875 348497 335948 320965 303148 283794 264960 247775 232546 219343 207620 196389
54862 196389 185506 175785 167469 159904 153060 147842 144369 141528 138821 137257 137767 140030 143387 147597
54848 147597 152488 158190 165956 177059 190674 204624 218524 234205 252514 271701 289652 305730
54836 305730 319550 329857 335763 337604 335576 328929 317472 302668 286541 270491 255363 241152
54824 241152 226425 209823 192546 177443 165171 153286 139838 125943 113979 105177 99774 97492
54812 97492 96730 95122 92031 88971 86838 84601 81648 79265 78497 78406 77795 76938 76322 75369 73828 72824
54796 72824 73081 73528 72988 71746 70201 67646 63922 60750 59729 60213 60662 60854 61220 61262 60274 58672 57092
54779 57092 55085 52029 48452 45235 42629 41182 42234 45796 49165 49590 47620 46124 46605 48222 50003
54764 50003 52218 55457 59574 63745 66966 68697 69562 70860 72874 74382 74457 73962 74455 76395 79123 81851
54748 81851 83914 84900 85353 86705 89837 94502 100540 108521 118416 128795 138346 147246 156193 165177 174288
54733 174288 184807 198192 214472 232545 251532 271095 290969 310821 330035 347288 361085
54722 361085 370994 377447 380193 378269 371854 362546 351216 337240 320755 303926 288763 275056 261792
54709 261792 249279 238498 229550 222220 217122 214791 214391 214611 215144 216169 217293 218370 220598 225440
54695 225440 232848 241700 251451 262330 274471 287997 303609 322076 343324 366606 391195 416418
54683 416418 441582 466259 489901 510905 526921 536435 538982 533699 519399 496959 470107 442692
54671 442692 416145 390303 365165 340735 316551 292870 271327 253135 237519 223062 209693
54660 209693 198195 188654 180525 173426 166914 160307 153618 147715 142869 138304 133946 131075 130124 129328
54646 129328 127011 123844 121352 119490 117402 115585 115399 116919 118759 119633 119145 117731 116744 117640 120051
54631 120051 121746 121519 120836 121404 122621 123055 123087 124176 126459 128965 131427 134089 136352 137377 137644 138396
54615 138396 140020 142238 145223 149169 153452 157507 161819 166812 171704 175799 179901 184917 190094 194258
54601 194258 197811 201702 205452 208164 210740 214994 221087 227663 233992 240067 245186 248507 250834 254082
54587 254082 259125 265627 273447 282440 291424 299265 306726 315550 326162 337996 351441 367300 384687
54574 384687 401780 418704 437402 458162 478096 493564 502742 505564 502627 494601 481804 464353
54562 464353 443453 421750 401074 380555 358602 336029 315341 297621 282287 269369 259401 251133
54550 251133 242033 231690 222582 216910 214596 214630 216104 217205 215604 211167 206577 203969 202348 199428
54536 199428 194685 189353 184485 180272 176526 172789 168417 163314 158158 153459 148974 144453 140404 137617
54522 137617 136284 135780 134966 132768 129075 125061 121984 119767 117356 114225 110794 107553 104615 102044 99824
54507 99824 97645 95330 93290 92025 91671 92525 95143 98938 101703 101772 99916 97835 95760 93122 90614
54492 90614 89512 89581 89775 90623 93554 98025 101685 103577 104915 106385 107176 107390 108983 112972 117538 120306
54476 120306 121134 121523 122601 124992 129492 136412 144780 153293 161742 170806 180870 191583 202221 212104
54462 212104 220998 229198 236876 243478 248356 251562 253133 252018 246996 238504 228251 217198 205405
54449 205405 193776 184035 176468 169370 161487 153620 146942 141132 135248 129502 124982 122187 120668 119708
54435 119708 118679 117124 115152 113590 113335 114513 116251 117112 116083 113560 111133 109943 109569 108912 107535
54420 107535 105583 103305 101678 102499 106391 111324 114717 116628 119285 123777 128885 133077 135975 137826
54406 137826 139060 140402 142002 142581 140974 138319 136902 136933 136398 134141 131042 127916 124522 121248 119602
54391 119602 119991 120770 120425 119116 117286 114526 110966 108197 107489 108222 109130 109973 111014 111891 111962 110983 108780
54374 108780 105298 101527 99068 97989 96337 92766 88554 86036 86034 87719 90043 92166 93256 93001 92089
54359 92089 91469 91413 91656 92063 92898 94848 98609 103743 108216 110160 109999 109778 110747 112963 116691 122058 127388
54342 127388 130337 131216 132944 136869 141007 143575 145971 150495 156978 163629 169849 176220 182637 188339
54328 188339 193262 197872 202093 205484 207968 209371 208953 206386 202580 198631 194663 190498 186503 182811
54314 182811 178545 172904 166375 159983 154137 149022 145175 142642 140461 138030 136116 135436 135170 134137 132678
54299 132678 131977 132079 131998 131408 130889 130582 129845 128380 126943 126823 128983 133410 138787 143218 145770 147103
54283 147103 148321 149796 151369 152919 154211 155033 156075 158812 163691 169153 173377 176468 179994 184546
54269 184546 188556 189668 186975 181943 177162 173978 171567 168594 165047 161590 157822 152733 146587 140654
54255 140654 135063 128656 121246 114248 108706 104456 101562 100620 100896 100177 97513 94415 92322 90611 88145
54240 88145 84961 81300 76832 72264 69837 70528 72364 73199 73551 74901 76763 77626 77540 77473 76970 74778 71315
54223 71315 68518 67485 67812 68818 69916 70342 70071 70459 72486 74961 76014 75724 75644 76261 76618 76157 75359
54206 75359 74828 75059 76640 79364 81684 82435 82478 83208 84171 83874 82267 80589 79281 78105 77967 80319 84591
54189 84591 88197 89632 89970 90790 91973 92126 90236 86611 82839 80751 80676 81089 80782 80672 82282 85205
54173 85205 87696 89157 90229 90787 89952 88198 87475 88801 91302 93848 95982 96957 95752 92870 90546
54158 90546 90197 90833 90892 90506 90895 92403 94283 96071 98138 100844 103706 105612 105681 103902 100924 97393
54142 97393 93988 92027 92965 96495 99896 100442 98277 95990 95561 96672 97899 98469 98525 98381 98033 97283 96243
54125 96243 95500 95325 94814 92694 89192 86087 84501 83808 83370 83907 85965 88280 89180 88773 88228 87665 86339
54108 86339 84350 82539 81059 79661 79122 80699 84099 87419 89236 89689 89534 89240 89077 89177 89483 90238
54092 90238 91935 94040 94618 92590 89708 88765 90203 91926 92097 90659 88350 85808 83766 82825 82818 83135
54076 83135 83310 82584 79804 75046 70505 68220 67640 66983 66075 65783 65457 63593 60877 60020 62105 65250
54060 65250 67381 68353 68805 68871 68815 69321 70384 71078 70886 70115 68833 66829 64776 63923 64354 65009 65523 66408
54042 66408 67385 67433 66872 67392 69308 70558 69288 65985 62445 60093 59857 61952 64896 66207 65094 63303
54026 63303 62633 62941 63236 63273 63182 62832 62535 63259 65298 67635 69321 70587 72085 73999 76186 77966 77620
54009 77620 73691 67432 62513 61646 64623 69788 75561 80039 81367 79859 78152 78075 78851 79388 80534 83544
53993 83544 87886 92205 96172 99753 101929 102003 101299 101744 103367 104784 105613 106851 109307 113033 117934 123584
53977 123584 128820 132874 136678 141893 148823 156315 163383 169908 176127 182546 190139 199516 209980 220357
53963 220357 230619 241647 253381 264267 272833 279221 284886 291088 297655 303060 305859 306237 305795 305618
53949 305618 305166 303408 300407 297097 293968 290775 287374 284127 281321 278483 274470 268468 261068 254074
53935 254074 248806 244903 241252 237530 233894 229797 224693 219605 216169 213990 210899 206348 202403 200396
53921 200396 198693 195442 191865 190620 191880 193161 192721 191281 190458 191023 192865 195374 197511 198349 197833
53906 197833 196638 195432 194747 195166 196896 199340 201644 203455 204779 205625 206307 207417 208821 209387 208595 207821
53890 207821 208914 211830 214713 216204 216667 217250 218689 221248 225032 229941 235525 241065 245799 249361 252281
53875 252281 255688 260296 265944 272269 279150 286111 292036 296240 299362 302459 305454 307216 307129 306046 305654
53860 305654 307136 310327 313988 317084 319899 323642 328912 334985 340749 345902 351008 356664 362723 368086
53846 368086 371525 373234 375266 379649 386326 393788 401202 408562 415050 419257 421305 422816 423984 422582
53832 422582 417177 409854 404140 401156 399239 396528 392388 386759 379650 371384 362386 352692 342231 331458
53818 331458 321245 312341 305118 299321 293905 287884 281643 276493 272592 268408 262763 256311 250336 245202
53804 245202 240674 236551 232123 226240 218926 211843 206152 201071 195553 190029 185198 180523 175576 171577
53790 171577 169614 168319 165512 161513 158578 157272 155689 152508 148743 145932 144273 143250 142736 142629 142338
53775 142338 141393 139965 138374 136604 134608 132702 131447 131348 132560 134604 136639 138331 140038 141854 143195
53760 143195 143822 144473 145675 146720 146713 145969 145340 144911 144487 144699 146288 148742 151046 153474 157301 162818 168810
53743 168810 173904 177457 179461 180748 183096 187907 194781 202305 209870 217577 224745 230141 233808 237410
53729 237410 242477 249155 256544 263260 267859 269996 271268 273811 277999 282423 285942 288614 290789 292669
53715 292669 294844 297930 301421 304025 305278 305685 305115 302462 297256 290494 283439 276676 270707 266240 263099
53700 263099 259787 255060 249534 245229 243742 245001 247271 248191 246374 242336 237768 234067 231837 231225 231792
53685 231792 232348 231921 230812 229839 228790 226693 223557 220702 219320 219708 221795 225119 228112 228850 227030
53670 227030 224205 221647 219072 215910 212657 210101 208050 205679 202661 199395 196485 194448 193498 193288 193215
53655 193215 193196 193634 194552 195451 196221 197531 199947 203306 207202 211488 215885 219710 222596 225194 228709 233838
53639 233838 240234 246812 252477 256853 260386 263644 266689 269425 272263 276054 281582 289431 299736 311417
53625 311417 322221 330560 337095 343630 350671 357061 361731 364517 365283 363708 360466 357479 356236 356450
53611 356450 356857 356742 356217 355524 354603 353149 350910 348137 345696 344368 344060 344084 344032 343845 343281 342055 340472
53594 340472 339243 338558 337895 336735 335037 333078 331269 329938 328886 327520 325894 324960 325112 325178 323865 321710
53578 321710 320376 320476 321365 322781 325237 328771 332605 336131 339231 341665 343276 344609 346117 347060 346756
53563 346756 346762 349913 356816 364934 371589 376345 379921 382598 384738 387452 391532 396570 401942 407767 414178
53548 414178 420666 427019 433934 441792 449689 456660 463215 470667 479367 488429 496843 504272 511067 517966
53534 517966 525445 533118 540288 547256 555323 565193 576167 587277 598350 609475 620218 629915 638083
53521 638083 644101 647368 648380 648881 650371 653141 657186 662991 670459 677934 683565 687374 691066 695874
53507 695874 701355 706292 710159 713547 717385 721801 725890 728858 731201 734169 738110 742228 746042 750182
53493 750182 755290 760944 766280 771012 775256 778846 781618 784120 787402 791891 796684 800074 801064 800533 800640
53478 800640 802683 805942 808951 811313 813551 815954 818712 822521 827578 832389 835367 837667 842601 851880
53464 851880 864107 877355 891346 906243 921165 935402 949896 966167 984581 1004760 1026832
53453 1026832 1051048 1076787 1103106 1129935 1157835 1186962 1217185 1248898 1282898 1319484 1358072
53442 1358072 1397549 1436964 1476370 1517120 1560740 1607335 1655682 1704741 1754166 1803588 1852875
53431 1852875 1903266 1956539 2012340 2067812 2120677 2171375 2221321 2270605 2318619 2365708 2412733
53420 2412733 2459948 2507518 2556247 2606431 2656840 2706169 2754752 2803409 2851345 2896779 2939200
53409 2939200 2979451 3017753 3053240 3085432 3114754 3141321 3164402 3183552 3199428 3213078 3224952
53398 3224952 3234798 3242051 3246076 3246422 3243034 3236070 3225566 3211382 3193462 3172154 3148378 3123197 3096679
53385 3096679 3067417 3033937 2996612 2957410 2917816 2877907 2837333 2795877 2752892 2707714 2661136
53374 2661136 2615129 2570400 2525622 2479816 2434156 2390441 2349200 2310498 2275312 2244543 2217450
53363 2217450 2192426 2168695 2146208 2124751 2104564 2087102 2073780 2064356 2057718 2053747 2053185 2056132
53351 2056132 2062005 2070720 2082799 2098443 2117322 2139006 2162987 2188843 2217057 2248898 2284635 2322760
53339 2322760 2361960 2402888 2446784 2493391 2541865 2593033 2648905 2710148 2775511 2843577 2913824
53328 2913824 2986181 3060912 3138784 3220125 3303945 3389171 3476472 3567531 3662627 3760222 3858854
53317 3858854 3958147 4057934 4157576 4256357 4353704 4449068 4542389 4634318 4724996 4812980 4896536
53306 4896536 4975581 5050994 5122154 5186665 5242788 5290988 5332928 5369809 5401771 5427891 5446591
53295 5446591 5456723 5458320 5451787 5436881 5413335 5381993 5344253 5300787 5251794 5197832 5138963 5073616
53283 5073616 5000111 4919343 4834356 4747162 4657484 4564838 4470278 4375537 4281708 4189278 4098414
53272 4098414 4008675 3919322 3830296 3742249 3655633 3570702 3488447 3410292 3336443 3265495 3196176
53261 3196176 3128828 3064990 3006119 2952833 2904716 2860696 2820099 2783133 2749795 2718873 2689042
53250 2689042 2660490 2634142 2609626 2585594 2562119 2541184 2524345 2511115 2500122 2490744 2483147 2477757
53238 2477757 2475232 2476111 2479985 2485604 2491994 2498844 2505891 2512965 2520872 2531226 2545007 2561885 2581023
53225 2581023 2601821 2624011 2648063 2675450 2707288 2742533 2778673 2814486 2850928 2888910 2927440
53214 2927440 2964670 2999846 3033569 3066884 3100744 3135557 3170352 3202755 3230548 3253417 3273026
53203 3273026 3291499 3309727 3326763 3340736 3350485 3356247 3358762 3358289 3354773 3348282 3338585 3324989 3307281
53190 3307281 3286294 3262789 3236544 3207322 3175753 3142067 3104887 3062908 3017150 2970062 2922978
53179 2922978 2875986 2829529 2784097 2738723 2691995 2644524 2598388 2554208 2510880 2468249 2427676
53168 2427676 2389482 2352102 2314556 2277759 2242613 2208827 2176489 2146690 2119308 2091967 2062790
53157 2062790 2032869 2004739 1979502 1956601 1935238 1914719 1894281 1873677 1853275 1832828 1811101
53146 1811101 1787392 1762373 1736704 1709953 1681736 1652801 1623965 1594913 1565009 1534474 1503931
53135 1503931 1473554 1443393 1413760 1384715 1355968 1327582 1299680 1271155 1240196 1206806 1173329
53124 1173329 1141668 1111390 1081309 1051287 1021321 990538 958648 927166 897694 869972 843049
53113 843049 817275 793654 772055 751582 732026 713568 695786 678305 661875 647448 634610
53102 634610 621914 608307 593447 577581 561963 548342 536834 525441 512919 500860 491333 483612
53090 483612 475216 465351 455285 445943 437240 429526 423508 418566 412962 406058 398928 392656 387380 383086
53076 383086 379837 376999 373516 369267 365071 361338 357912 355178 353781 352999 350888 346689 341894 338246
53062 338246 335730 333344 330945 329363 328958 328976 328416 327151 325918 325197 324377 322497 319742 317436 316348 315931
53046 315931 315797 316933 320355 325214 329470 332048 333297 333735 333634 333701 334900 337369 340357 343233 345692
53031 345692 346983 345863 341608 334731 326887 320346 316735 315285 313007 307829 301131 295837 292419 288575
53017 288575 282806 276379 271148 267081 262880 257852 252078 245647 238857 232718 228326 225852 224601 223809
53003 223809 222959 221747 220275 219041 218326 217842 217328 217110 217463 217571 215887 211821 206632 202179 199115 196932
52987 196932 195628 196166 198569 200557 199514 195602 191540 189190 187839 186229 184629 183810 183361 182468 181487
52972 181487 181253 181467 181284 181030 181766 183248 183926 183252 182726 184130 187493 191093 192902 192001 189211 186372
52956 186372 184583 183400 182219 181718 182885 185175 187076 188315 190061 192798 195468 197116 198162 199432
52942 199432 200883 201920 202261 202111 202190 203859 208275 214788 220878 224332 225034 224344 223397 222621 222224 222206 222002
52925 222002 220870 218814 216724 215435 214898 214508 214156 214499 215942 217767 218914 219500 220609 222486 223962
52910 223962 224171 223755 223638 223671 223651 224710 228171 233455 238676 243135 247835 253532 259677 265406 270321 274167
52894 274167 277015 280037 284840 291611 298866 305319 310975 316275 321418 326838 332949 338811 342304 342433
52880 342433 340455 338104 335848 333707 332451 332582 332901 331593 328496 325182 322910 321484 320038 317986 315171
52865 315171 311885 308999 307418 307103 307021 306256 304968 304120 304515 306119 308091 309263 308748 306489 303384 300735
52849 300735 299176 298191 297050 296208 297002 299616 302114 302369 300469 298263 296923 296149 295613 295771 296754 297615
52833 297615 297419 296334 295029 293710 292415 291689 292071 293182 294085 294494 295040 296280 297890 299032 299280 298985
52817 298985 298793 298984 299411 299913 300352 300314 299381 298072 297803 299240 301175 301905 301323 300647 300374 299758 298404 297120
52799 297120 296628 296528 296201 295950 296397 297239 297495 296893 296401 297122 298889 300211 299908 298806 299162 302027 305886
52782 305886 308795 311148 314897 320320 325354 328516 330872 334318 339253 344975 351163 357607 363305 367335
52768 367335 370336 373889 378508 383273 387357 390763 393371 394277 392671 388880 384087 379249 374533 369504
52754 369504 363612 356635 348948 341325 334275 327526 320336 312483 304748 298110 292571 287341 282256 278253
52740 278253 275906 274215 271721 268363 265209 262593 259720 256160 252582 249774 247885 246974 247138 247615 246834
52725 246834 244057 240289 236971 234579 232981 232082 231162 228622 223715 217982 213695 211151 208703 205280 201565
52710 201565 198646 196710 195428 194633 194063 193258 192226 191615 191658 191412 189660 186272 182118 177880 173626 169548
52694 169548 166386 164697 163956 162881 160666 157596 154444 151589 148937 146417 144105 141872 139338 136467
52680 136467 134065 133324 134644 136940 138362 137933 136402 135236 134894 134480 133084 130860 128558 126579 124963
52665 124963 123794 122979 121961 120343 118585 117460 117044 116936 117208 118272 119807 120684 120156 118395 115785 112506
52649 112506 109132 106826 106328 107127 108042 108378 108244 108119 108355 108981 109866 111176 113382 116402 119004 119750 118461
52632 118461 116176 113971 112766 114005 118933 126612 133958 138694 141514 144575 148657 152856 156409 159517
52618 159517 162447 164993 167128 169348 171884 173947 174238 172188 168548 164770 161803 159474 156982 153852
52604 153852 150338 147058 144520 142856 141665 140158 137746 134495 130798 126826 122700 118881 115761 113008
52590 113008 110009 106905 104451 102857 101600 100550 100366 101430 103074 104298 104600 103748 101503 98246 95388
52575 95388 94383 95420 97426 99144 99925 99743 98981 98225 98053 98883 100802 103306 105436 106551 106851 106754 106088
52558 106088 104606 103068 102882 104496 106928 109043 110614 111888 112941 113771 114377 114387 113132 110475 107185
52543 107185 104279 102314 101279 100772 100320 99934 100068 100553 100308 99100 98851 101496 105839 108477 108118 107060
52527 107060 107776 109924 111783 112976 114328 116113 117898 119434 120661 121495 122499 124902 128941 132975 135260
52512 135260 135905 136204 136816 137703 139054 141055 143199 144871 146121 147012 146968 145845 144985 145909 148336 150673
52496 150673 152164 153440 155212 157514 160099 162714 165017 166967 169033 171456 173697 175277 176608 178208
52482 178208 179674 180324 180360 180501 180892 181229 181493 181808 182109 182700 184364 186982 188875 188738 187474 186894 187315
52465 187315 187862 188428 189628 191209 192312 193263 195439 199154 203045 205684 206681 206219 204835 203634 203408 203387
52449 203387 202062 199341 196648 194835 193211 190811 187469 183543 179677 176846 175421 174194 171690 168512
52435 168512 166866 167540 168872 169237 169122 170049 172601 176163 179616 181831 182459 182638 183937 186274 188032 188481
52419 188481 188782 190119 192246 194434 196446 197855 197848 196688 196000 196582 197244 197002 197103 199191 202440 204344
52403 204344 203928 202609 202158 203268 205984 209933 213898 216451 217432 217893 218368 218201 216985 215689 215660 217105
52387 217105 219212 221478 224201 227559 230671 231953 230572 227433 224468 222910 222476 222248 221848 221397 220744
52372 220744 219454 217618 216103 215691 216230 216869 216996 216689 216315 216061 216006 216371 217271 218230 218441 217695 216752 216574
52354 216574 217529 219600 222801 226820 230636 233281 234933 236609 238638 240095 240029 238751 237623 237732 238886
52339 238886 239756 238827 235454 230178 224200 218741 214735 212506 211374 210122 208373 207175 207689 209713 212118
52324 212118 214385 216994 220395 224263 227695 229634 229466 227896 226884 227812 229850 231037 230871 230841 232409
52309 232409 235395 238510 240591 241154 240664 240613 242596 246949 252733 258996 265339 271258 275991 279400 282185
52294 282185 284941 287644 290233 292959 295887 298853 302134 306282 311017 315152 318028 320256 322617 325080
52280 325080 327379 329808 332749 336094 339746 344225 350126 357258 364675 371259 376167 379206 381057 382786
52266 382786 385142 388748 394491 402471 410728 416666 420248 424325 431035 439269 446791 453503 461207 471073
52252 471073 482940 496423 510999 525243 537663 548548 559756 572390 585764 599000 612620
52241 612620 627970 645681 665322 686225 708129 730979 754412 777783 800939 824746 850239
52230 850239 877149 904091 930720 958813 990236 1024297 1058232 1090170 1120528 1150429 1179956
52219 1179956 1208519 1236043 1262933 1289164 1314083 1337136 1358385 1378376 1397632 1416189 1433405
52208 1433405 1448350 1460668 1471179 1481382 1492196 1503116 1512788 1520377 1526220 1531023 1534653 1536179
52196 1536179 1535189 1532836 1531294 1532159 1535356 1539538 1543495 1547177 1551336 1556322 1561593 1566542 1571505 1577627
52182 1577627 1585882 1596458 1608869 1622411 1636690 1652004 1668952 1687486 1706779 1726346 1746572
52171 1746572 1767533 1787987 1806623 1823839 1840989 1858056 1873517 1886642 1898353 1909253 1918209
52160 1918209 1923953 1927080 1929140 1930228 1928692 1923254 1914507 1904079 1892833 1880272 1865637 1849363 1833024
52147 1833024 1817559 1801824 1783577 1761884 1737997 1713886 1690657 1668505 1647307 1626811 1606829
52136 1606829 1587626 1569654 1552735 1536174 1520038 1505551 1493786 1484415 1476125 1467715 1458592 1448855
52124 1448855 1439340 1430981 1423744 1416814 1410080 1404469 1400296 1396251 1390992 1385058 1380175 1377011 1374583 1371644
52110 1371644 1367815 1363380 1358757 1354324 1350283 1346523 1342731 1338591 1333780 1328103 1321858 1315774 1310360 1305547
52096 1305547 1301013 1296513 1291838 1287026 1282654 1279366 1276956 1274630 1272226 1270276 1268634 1266087 1261883 1256728
52082 1256728 1251648 1246754 1241883 1237740 1235462 1235512 1237510 1240527 1242976 1243112 1240526 1236595 1232764 1229150 1225553
52067 1225553 1222754 1221495 1220983 1219874 1218275 1217227 1216509 1214644 1211374 1208578 1208131 1209929 1212759 1216300 1221408
52052 1221408 1228707 1237582 1246675 1255109 1263108 1271379 1280072 1288791 1297685 1308006 1321228 1338012 1358257
52039 1358257 1381563 1407158 1433915 1461093 1488718 1516842 1544929 1572576 1600305 1628991 1658904
52028 1658904 1689856 1721785 1754510 1787401 1819922 1851966 1883023 1911812 1937698 1961777 1985396
52017 1985396 2008153 2028529 2046032 2061259 2074207 2084096 2090826 2094974 2096159 2093110 2085997 2077188 2068590
52004 2068590 2059361 2047318 2031950 2014918 1998022 1981771 1965892 1950229 1934833 1919750 1905154
51993 1905154 1891490 1879206 1868274 1858181 1848506 1839537 1832163 1827138 1824579 1824171 1825647 1828889 1833830
51980 1833830 1840415 1848534 1857904 1868184 1879250 1891029 1903079 1914686 1925489 1935579 1945016 1953806
51968 1953806 1962277 1970623 1977807 1981915 1982219 1980255 1978234 1977017 1975998 1974106 1970158 1963124 1953042 1941182
51954 1941182 1928419 1914081 1897332 1878929 1860237 1840857 1818715 1792671 1763905 1734391 1704909
51943 1704909 1674811 1643071 1609215 1573746 1537947 1503029 1469412 1436886 1405113 1373650 1341920
51932 1341920 1309756 1277723 1246454 1215984 1186118 1156979 1128630 1100629 1072668 1045321 1019527
51921 1019527 995544 972871 950781 928524 905681 883040 862576 845799 832341 820515 808632
51910 808632 795373 780021 763286 747110 732690 719400 706431 694393 684128 675020 665910 656771
51898 656771 647926 638600 628164 618089 610350 604176 596613 586565 576289 568427 563333 559820 556857
51885 556857 553708 549670 544518 538561 532006 525027 518323 512561 507380 502109 497230 493699 490971 487471
51871 487471 483135 479699 478007 476696 474205 470585 466639 462630 458640 455077 452051 449022 445515 441422
51857 441422 436577 431183 426639 424415 423880 422809 420377 417998 416729 415712 414058 412472 411802 411383 410119
51842 410119 408139 406299 404982 404238 404068 403828 402573 400852 400740 402983 405517 406142 405300 404688 404419 403513
51826 403513 402357 402435 403855 405078 405245 405091 405177 404712 402899 400448 398940 399156 400622 402546 404660 407146
51810 407146 410154 413698 417929 422978 428239 432367 434631 436007 438194 441793 446221 451160 456986 463830
51796 463830 471256 478841 486069 491785 495144 497182 500010 504185 508390 511943 515817 520479 524529 526673
51782 526673 527511 528072 527911 526263 524088 523276 524171 525153 524558 522166 519079 516765 515880 515532 514188 511617
51766 511617 509261 508397 508857 509875 511032 511853 511711 510780 509982 509370 507958 505843 504897 506265 508649 510364
51750 510364 511599 513148 514339 514055 512765 511573 510001 506723 502117 498299 496674 496762 497234 496904 495121
51735 495121 492398 490282 489563 489168 487929 486613 486793 488459 490280 491596 492477 492379 490636 488088 486457 486097
51719 486097 485896 485298 484797 484385 483148 480716 477861 475393 473467 472033 470847 469139 466373 463222 460753
51704 460753 459038 457716 457353 458566 460151 460027 458073 456191 455412 454935 454452 455355 458584 462916 466632 469817
51688 469817 473783 478964 484279 488218 490096 490835 492729 497576 504577 510817 514223 515181 514908 513334 509541
51673 509541 503575 496825 490719 485719 481532 477790 474405 471432 468813 466405 464180 461989 459086 454572
51659 454572 448608 442528 437332 432823 428692 425294 422409 418522 412891 407409 404534 403885 402843 400295
51645 400295 397651 396006 394470 392084 389556 388057 387514 387047 386104 384428 381760 378331 375085 372938 372376
51630 372376 373736 376824 380134 381728 381446 381243 382891 386341 390757 395948 402026 408577 415107 421699 428582
51615 428582 435544 442091 447675 451543 453194 453364 453811 455675 458673 462120 465950 470416 475454 480566 484742
51600 484742 486572 485383 482181 478373 473700 466922 458506 450778 444930 439752 434106 428672 423944 418433
51586 418433 410802 402443 395838 391132 386422 381009 376262 373142 370816 368263 365679 363423 360698 356449
51572 356449 351109 346460 343802 342881 342809 343406 344982 346991 347860 346695 344542 343096 342547 341726 340131 338643
51556 338643 338039 337966 337791 337456 337112 336938 337878 341389 347503 353988 358455 360850 362959 365872 368877 370777
51540 370777 371558 372560 375163 379250 383060 385044 385822 387576 391416 396287 400874 405629 412171 421294 432200
51525 432200 443213 452780 460399 467270 475629 486862 500347 514193 526601 536520 543794 548972 552313
51512 552313 553040 550586 546480 543449 542149 540416 536496 531446 527216 523962 520839 518196 517035 517035 516974 516792
51496 516792 517597 519860 523147 527506 533571 541175 549189 556925 564605 572395 580161 588291 597469 607214
51482 607214 615657 621225 623890 624451 623372 620640 616213 610324 603746 597892 594157 593026 594051 596497
51468 596497 599641 602847 606065 609999 615079 620476 624882 628030 630697 633391 635916 637975 639228 638857
51454 638857 636133 631520 626232 620584 613744 605305 596093 587068 578285 569415 560524 551889 543613 535716
51440 535716 528042 519940 510917 501907 494941 490862 488157 484790 480504 476521 473486 470827 468013 465343
51426 465343 463166 461106 458566 455607 452916 451185 450947 452682 456324 460508 463253 464090 465006 468304 473770
51411 473770 479107 483312 488151 495582 504982 514185 522330 530052 537394 543438 548254 553419 559851 566490
51397 566490 572150 577501 583802 590385 594978 596564 596544 596576 596359 594450 590619 586346 582981 580436 578143
51382 578143 576581 576978 579748 584005 588685 593292 597316 599773 600031 598573 596204 592801 587528 580191 571701
51367 571701 563149 554851 546357 537089 526921 516325 505808 495206 484049 472846 463191 455881 449584
51354 449584 442394 434321 427095 421754 417739 414467 412351 411786 412371 413996 417679 424157 432265 439838 446075
51339 446075 452039 458803 465915 471947 475981 478299 479918 481645 483368 484133 483038 479983 475396 469337
51325 469337 461322 451159 439544 427456 415189 402447 389356 376737 365047 353658 341927 330754
51313 330754 322016 316168 311252 304838 296325 286758 277154 268117 260669 256005 253992 252896 251083 248416
51299 248416 245698 243497 241989 241176 240588 239219 236540 233290 230674 228998 227712 226497 225527 224709 223477
51284 223477 221528 219197 216955 215141 214306 215114 217470 220341 222958 225667 229015 232503 235124 236838 238522
51269 238522 240468 242002 242961 244537 248006 253320 259663 266750 274664 282837 290288 296920 303717 311618
51255 311618 320883 331461 342994 354178 363162 369259 373744 378330 383089 386300 386138 382207 375711 368426
51241 368426 361307 353922 345376 335749 326068 316859 307473 297247 286633 276589 267420 258900 251213
51228 251213 245019 240693 237992 236308 234771 232423 228978 225413 223200 222772 223053 222553 220683 218038 215748
51213 215748 214626 214691 215311 215770 215693 215067 214174 213456 213129 212887 212336 211684 211544 212077 212923 213987 215503 217194
51195 217194 218325 218898 219731 220809 220674 218482 215713 214606 215416 216403 216096 214423 212006 209683 208565 209179
51179 209179 210423 210452 208721 206133 203250 199697 195695 192796 192320 193858 195901 197212 197115 195438 193054
51164 193054 191908 193530 197507 201837 204626 205303 204708 204429 205628 208009 210017 210347 209050 207127 205606
51149 205606 205302 206875 210421 215209 220253 224943 228792 231053 231441 231196 232406 235577 238304 237339 232195
51134 232195 226087 222720 222609 223259 222629 221287 220950 222229 224569 227454 230452 232665 233353 232935 232401 231962
51118 231962 231310 230861 231376 232347 232229 230591 228816 228285 229096 230935 233772 236891 238631 238292 237268 237056
51102 237056 236993 235362 232119 229000 227071 225611 223516 220619 217403 214413 212247 211209 210697 209719 208311
51087 208311 207571 207935 208272 207301 205207 203121 201581 200351 199467 199555 201022 203574 206604 209533 211629 212155
51071 212155 211102 209519 208773 209680 212423 216860 222365 227603 231088 232155 231250 229392 227674 227058 227846
51056 227846 229050 228875 226429 222764 219789 218232 217092 215025 211840 208484 205867 204082 202784 201976 202035
51041 202035 202875 203646 203655 203309 203433 203836 203476 202219 201518 202802 205867 209470 212849 215878 218288 219763 220712
51024 220712 222078 224343 227161 229864 231770 232259 231247 229506 227944 226775 225929 225862 227020 228748 229829
51009 229829 230132 230694 232100 233796 235243 236691 238442 240362 242534 245310 248177 249645 249146 248134 248266
50994 248266 249206 249436 248776 248816 250905 254792 259311 263414 266347 267900 268990 271218 275169 279694 283431
50979 283431 286459 289610 292500 293443 291690 288802 287136 287512 289082 290961 292812 293926 293182 290668 288337
50964 288337 288003 289126 289701 289156 289208 291530 295472 298696 299738 299545 300578 304640 311410 318964 325577 330929
50948 330929 335592 339874 343639 347048 350978 356545 364305 373689 383176 391467 398707 406090 414022 421515
50934 421515 427921 434317 442212 451697 462197 474375 489554 507407 526013 544504 564054 585698
50922 585698 608702 632043 656151 682134 710200 739988 771715 805857 842172 880215 920687
50911 920687 965296 1015231 1070337 1129837 1193336 1261033 1333284 1410034 1490719 1574917 1663002
50900 1663002 1755632 1852544 1952372 2053662 2155210 2255152 2350706 2439551 2520880 2594479 2659330
50889 2659330 2713826 2756972 2788680 2809266 2819328 2819861 2811852 2795900 2772715 2743758 2710873 2675463
50877 2675463 2638408 2600447 2562075 2523233 2483641 2443383 2402875 2362412 2321989 2281185 2238924
50866 2238924 2193846 2145549 2095054 2043286 1989234 1930482 1865832 1796978 1727329 1659418 1593627
50855 1593627 1529191 1466025 1405306 1348327 1295238 1245272 1197887 1153108 1111014 1071766 1036245
50844 1036245 1005690 980161 958045 937638 918749 902286 888835 878322 870602 865553 862646 861147
50832 861147 860788 861789 864131 867249 870628 874453 879322 885339 891856 898452 905934 915607 927425 939789
50818 939789 951824 964861 980608 998692 1017535 1037133 1059001 1083374 1108610 1133933 1160881
50807 1160881 1191026 1223997 1259057 1297180 1339935 1387318 1438234 1492546 1551224 1614969 1683966
50796 1683966 1758747 1840273 1929562 2028091 2137849 2259772 2392508 2533923 2683550 2842649
50786 2842649 3012370 3193055 3384834 3587376 3798932 4016696 4238163 4461226 4682970
50777 4682970 4899183 5104937 5295083 5464718 5610277 5729980 5822483 5885772 5918667 5923000
50767 5923000 5902799 5861454 5800990 5724027 5634856 5538214 5438254 5338971 5244206 5156285 5075168
50756 5075168 4999254 4926446 4854497 4781382 4705733 4626300 4541006 4447472 4344594 4232648 4111711
50745 4111711 3981225 3841636 3695590 3546767 3397969 3250664 3105775 2964502 2828712
50736 2828712 2700691 2582090 2473051 2372947 2281979 2201399 2132091 2073627 2024791 1984421
50726 1984421 1951705 1926355 1908605 1898419 1894700 1895852 1900838 1908816 1918067 1926566 1933634 1939786 1944703
50713 1944703 1946689 1944556 1938788 1930176 1918529 1903664 1886822 1869949 1853816 1837502 1819529 1799150
50701 1799150 1776899 1754284 1732632 1712065 1691993 1672637 1655411 1641636 1631570 1624875 1621415 1621489
50689 1621489 1625974 1636412 1654101 1678848 1709336 1744683 1784698 1828654 1875263 1924318 1977040
50678 1977040 2034206 2095358 2160669 2232069 2311078 2396637 2486650 2581117 2682227 2791677 2909138
50667 2909138 3033096 3161872 3293806 3427485 3561744 3694496 3821712 3938674 4042409
50658 4042409 4132076 4206945 4265122 4304509 4323995 4323173 4301690 4259862 4199846 4125751 4042534 3954718
50646 3954718 3865748 3778061 3693568 3613969 3540498 3473548 3412895 3358304 3309571 3265860 3225134
50635 3225134 3184403 3140556 3091154 3034887 2971601 2902025 2827329 2748706 2667205 2584046 2501126
50624 2501126 2420892 2345336 2275143 2210141 2150506 2097205 2051411 2013973 1985512 1966505 1957106
50613 1957106 1957192 1966532 1984461 2009497 2040210 2076839 2121312 2174977 2236589 2302969 2371311 2440404
50601 2440404 2509824 2578572 2644592 2705455 2759555 2806802 2848168 2884598 2916566 2944478 2969061
50590 2969061 2991214 3011780 3031457 3050434 3068053 3083417 3096684 3109509 3124078 3142036 3164305
50579 3164305 3191267 3222777 3258347 3297532 3339864 3384508 3430526 3477493 3525217 3572773 3618623
50568 3618623 3661804 3702185 3739262 3771611 3797940 3817884 3831299 3837800 3837724 3832822 3825171 3815987 3806094
50555 3806094 3796746 3789022 3783154 3779525 3779811 3785860 3797537 3812694 3829066 3845233 3859796 3870877 3876842
50542 3876842 3876824 3870284 3856572 3835028 3804915 3765181 3714858 3653885 3583082 3503206 3414532 3317550
50530 3317550 3213670 3105078 2994093 2882776 2772926 2666429 2565348 2471049 2382954 2298940
50520 2298940 2217845 2141245 2071934 2010934 1956887 1908133 1864226 1825367 1791559 1762958 1740190
50509 1740190 1723641 1712837 1706893 1705143 1707037 1712169 1720998 1734909 1754812 1780012 1809261 1842716
50497 1842716 1881857 1927306 1977537 2030378 2085350 2143933 2207656 2276629 2350030 2427276 2508131
50486 2508131 2592017 2678043 2765734 2854967 2944791 3032909 3116926 3195862 3270048 3340087 3406815
50475 3406815 3472173 3538977 3609128 3682421 3757594 3834246 3913280 3995663 4081450 4170367 4262981
50464 4262981 4360720 4464423 4573033 4684122 4795822 4907968 5021058 5134340 5245520 5352415
50454 5352415 5454185 5550383 5639076 5716786 5780423 5828660 5860951 5875819 5871054 5845582 5800407
50443 5800407 5737533 5658770 5566106 5462657 5352340 5238652 5124286 5011857 4904504 4805714
50433 4805714 4718833 4646656 4590918 4552033 4529333 4521255 4524973 4536355 4551261 4567004 4581892 4593173
50421 4593173 4596016 4584762 4554826 4503492 4429840 4334738 4220765 4091709 3951753 3804629 3653033
50410 3653033 3498835 3344232 3192488 3046967 2909453 2779934 2657935 2543518 2437118
50401 2437118 2339233 2250381 2170731 2099722 2036699 1981773 1935318 1896801 1865140 1839954 1821067
50390 1821067 1806893 1795198 1786089 1782408 1785997 1795099 1806829 1820861 1838989 1861960 1888752 1918492
50378 1918492 1951119 1986186 2022801 2061188 2102785 2148041 2195045 2241101 2285191 2328454 2372665
50367 2372665 2418516 2465138 2511064 2555678 2599550 2643234 2686280 2727760 2767266 2804822 2840443
50356 2840443 2874594 2908525 2943230 2978519 3014213 3051849 3093770 3140414 3189728 3239603 3289782
50345 3289782 3341065 3393627 3446715 3499189 3549751 3597130 3640438 3679016 3711801 3737454 3755229
50334 3755229 3765073 3766645 3758955 3741149 3712810 3673091 3620465 3554033 3474587 3383935 3283979 3177271
50322 3177271 3067766 2959703 2855725 2756914 2664642 2581390 2509340 2448855 2398901 2358511 2327341
50311 2327341 2305100 2291165 2284767 2284996 2290353 2298594 2307211 2313866 2316298 2312367 2300679 2280869 2252914
50298 2252914 2216509 2171852 2120823 2066498 2011289 1956101 1901279 1847413 1794931 1743826 1694491
50287 1694491 1648217 1606234 1568606 1534550 1503228 1473578 1444129 1414148 1385013 1359499 1339416
50276 1339416 1324330 1312508 1302587 1294209 1287569 1282800 1279935 1279319 1281690 1287421 1295938 1306525 1319551
50263 1319551 1335992 1355588 1376683 1398322 1421238 1445877 1470568 1493096 1513574 1534423 1557759
50252 1557759 1583837 1611783 1640661 1669786 1698964 1728515 1758491 1788056 1816230 1842848 1868068
50241 1868068 1891555 1913127 1933551 1953320 1971078 1984792 1994315 2001110 2005402 2005390 1999881 1990162 1978377
50228 1978377 1965247 1950295 1933359 1914814 1894793 1872912 1848571 1821162 1790560 1757762 1724429
50217 1724429 1691348 1657846 1623092 1587437 1551997 1517513 1484158 1452109 1421626 1392601 1364359
50206 1364359 1336014 1307169 1278559 1251914 1228775 1209388 1192964 1178804 1166707 1156582 1148274
50195 1148274 1141685 1136530 1132152 1128126 1124682 1121838 1118601 1114125 1109398 1106532 1106410 1108119 1110637 1113654
50181 1113654 1116604 1118354 1118392 1117191 1114959 1111151 1105697 1099529 1093333 1086831 1079926 1073379 1067609 1061796
50167 1061796 1055013 1047412 1039642 1031981 1024731 1018512 1013322 1008169 1002448 996890 992446 989213 987262 987353
50153 987353 989639 992663 995068 997581 1001851 1007771 1013447 1017550 1020275 1022080 1022840 1022478 1021270 1019364 1016911
50138 1016911 1014705 1013594 1013073 1011431 1007682 1002510 996979 991187 984785 978222 972657 968758 966053 963464
50124 963464 960160 955890 950792 945206 939665 934586 929540 923094 914171 903637 893767 885843 879037 872063
50110 872063 865034 858938 854023 849760 846135 843955 843885 845824 849103 852579 854621 853844 850031 843922 836124
50095 836124 826776 816200 805166 794312 783765 773504 763709 754639 746535 739784 734876 731989 730693
50082 730693 730086 729173 727322 724653 721964 720064 719120 718683 718167 717222 715852 714417 713527 713928 716499 721930
50066 721930 729779 738061 744667 749447 754181 760267 767393 774951 783687 794877 808500 823332 838496
50053 838496 853849 868981 883006 895544 907120 918370 929410 940126 950448 960165 969065 977511
50041 977511 986264 995365 1003658 1009992 1014729 1019502 1025331 1031282 1035408 1036988 1037431 1038782 1041759 1045728
50027 1045728 1050229 1055572 1061927 1068787 1075779 1083238 1091439 1099930 1108406 1117759 1129434 1143831 1159912
50014 1159912 1176404 1192993 1210448 1229859 1251639 1275073 1298933 1322550 1345978 1369293 1392518
50003 1392518 1416216 1441115 1466755 1491612 1515219 1539025 1564227 1589838 1614257 1637856 1662294
49992 1662294 1687635 1711948 1733878 1753990 1773116 1790711 1805611 1817454 1826695 1833979 1840135 1846117
49980 1846117 1852141 1857207 1860200 1861439 1862810 1866424 1873348 1883442 1896206 1911781 1931192 1955612 1985532
49967 1985532 2020773 2061200 2107195 2159442 2218216 2282515 2349673 2416204 2479333 2537504 2589353
49956 2589353 2633084 2667604 2693767 2713675 2729151 2741724 2753558 2766940 2782478 2798633 2813082
49945 2813082 2823624 2827593 2821600 2802789 2770008 2723511 2664122 2593251 2513201 2426763 2336507 2244600
49933 2244600 2152906 2062891 1975681 1892459 1814456 1742138 1674767 1611280 1551506 1495985 1444596
49922 1444596 1396065 1349345 1305102 1265137 1230305 1199627 1171742 1146455 1124134 1104143 1085154
49911 1085154 1067074 1051438 1039336 1029960 1021912 1014962 1009429 1004432 998174 990033 981379 974057 968691
49898 968691 964529 960251 954770 947962 940967 935353 931632 928841 925761 922252 919200 917405 916869 917190 918418
49883 918418 921194 925972 932420 939910 948306 957783 968092 978801 990255 1003414 1018500 1034662 1051281
49870 1051281 1068743 1087518 1107472 1128685 1151958 1177698 1205162 1233746 1264277 1298072 1335331
49859 1335331 1375441 1418252 1464082 1513117 1565944 1624210 1689667 1762901 1843778 1932395 2028531
49848 2028531 2131090 2239389 2354085 2475055 2599005 2720982 2837789 2948035 3049610
49839 3049610 3139952 3219183 3290430 3356214 3416605 3471724 3523733 3574679 3623847 3668631 3706663
49828 3706663 3735602 3752022 3752288 3734296 3697568 3642542 3570799 3485216 3388655 3282869 3169438
49817 3169438 3050934 2930132 2808674 2687510 2567961 2451264 2337622 2226924 2120025
49808 2120025 2018309 1922383 1832247 1748317 1671054 1599869 1533719 1472749 1418074 1369792 1326508
49797 1326508 1287163 1252121 1221703 1194676 1169173 1144539 1121323 1099727 1079128 1059110 1040032
49786 1040032 1022155 1004998 988126 971943 956835 942011 926358 910399 896059 884103 873106
49775 873106 861677 850437 840542 831352 821348 810810 801727 795031 789680 784713 780496 777342 774555
49762 774555 771781 770099 770629 772967 775898 778884 781962 785031 788314 792911 799756 808253 816893 825007
49748 825007 833127 841894 851533 862404 875143 889873 905798 922037 938736 957071 978115 1001955
49736 1001955 1028236 1057377 1090417 1127389 1166854 1207970 1252310 1302271 1358161 1418411 1482440
49725 1482440 1551488 1626216 1705264 1786790 1869697 1952177 2030498 2100642 2160460 2209511 2248075
49714 2248075 2277681 2301497 2322557 2341857 2359079 2374365 2388174 2400125 2409223 2414396 2413229 2400845
49702 2400845 2372119 2325414 2263016 2188158 2103161 2010518 1913857 1816749 1721367 1629002 1541107
49691 1541107 1459155 1383861 1315184 1252954 1197283 1148525 1106875 1071763 1041675 1014834 990108
49680 990108 967077 945633 925978 908788 894712 883653 874842 867602 861726 857217 854006 851932 850757
49667 850757 850234 850272 850884 851951 853269 854664 855542 854575 850841 845463 841010 838793 837752 836471 835032 833991
49651 833991 832763 830485 827720 825819 824973 824288 823524 823332 823847 824326 824360 824385 824799 825533 826719 828929 832372
49634 832372 836330 839688 841840 843238 845251 849048 854199 858946 862332 865331 869212 873728 877992 882152
49620 882152 886802 891395 894936 897774 901065 904746 907818 910479 914074 918806 923448 927617 932252 937124
49606 937124 940044 939838 938408 938297 939495 940306 940366 940972 942780 944895 946397 947564 949230 951641 954182 955912
49590 955912 956359 956081 956196 957065 957712 956837 953998 949536 943875 937551 931580 927081 924511 923568 923664 924195 924578
49573 924578 924511 924176 924023 924461 925737 927750 929869 931424 932574 934189 936593 938952 940423 941379 942867 945163
49557 945163 947624 949931 952825 957373 963888 971805 980371 989170 998085 1007117 1016523 1026918 1038729 1051377
49543 1051377 1063522 1074614 1085872 1099179 1115193 1133126 1152158 1172250 1193578 1216030 1239621
49532 1239621 1264649 1291025 1317998 1345099 1373006 1402912 1435161 1468978 1503642 1539668 1578479
49521 1578479 1620751 1665300 1710243 1755480 1803310 1856148 1914244 1976360 2041804 2110549 2181975
49510 2181975 2255249 2331026 2410979 2495077 2580962 2666962 2754361 2845507 2940756 3038604 3138092
49499 3138092 3239545 3343253 3448694 3555082 3661591 3766936 3869552 3968286 4062231 4149967
49489 4149967 4229675 4300041 4360368 4409831 4447353 4472299 4484707 4484800 4473023 4450700 4419899 4382146
49477 4382146 4337825 4287330 4232450 4176028 4120336 4066239 4014038 3964707 3919829 3880326 3845707
49466 3845707 3815093 3788844 3768628 3755692 3749709 3749811 3756225 3770083 3791737 3820172 3854345 3894449
49454 3894449 3941354 3995147 4054700 4118566 4185881 4256374 4329709 4404824 4479765 4552244 4620688
49443 4620688 4684711 4744168 4797602 4841960 4874220 4893109 4898816 4891268 4869428 4832493 4781091 4716697
49431 4716697 4640192 4551607 4451155 4340028 4220246 4094158 3964148 3832423 3700869 3571052
49421 3571052 3444063 3320144 3198869 3080280 2965701 2856825 2754166 2656964 2564503 2476723
49411 2476723 2393559 2314559 2239489 2168649 2102259 2040067 1981783 1927186 1875464 1825200 1775711
49400 1775711 1727855 1682943 1641337 1602785 1567528 1536084 1508119 1482529 1458704 1436858 1416942
49389 1416942 1398193 1380351 1364518 1351800 1341186 1329705 1315183 1298511 1282730 1270076 1260414
49378 1260414 1252448 1245514 1239510 1233709 1226931 1219307 1212977 1210184 1210973 1213429 1215971 1218604 1221882 1225662
49364 1225662 1229738 1235189 1243961 1256767 1272196 1288446 1305224 1322995 1340824 1356405 1368600 1378645
49352 1378645 1388021 1396191 1401816 1405635 1410534 1418597 1429333 1441148 1453397 1466373 1480234 1494863
49340 1494863 1510325 1526681 1543672 1561097 1579232 1598239 1617428 1635683 1652535 1668284 1683217
49329 1683217 1697337 1711022 1725287 1740902 1757331 1772935 1786387 1797907 1809059 1821414 1835447
49318 1835447 1850613 1866202 1881989 1898328 1915852 1934890 1954937 1974984 1994730 2015258 2037981
49307 2037981 2063025 2089252 2115925 2143801 2174394 2208671 2246635 2287705 2331107 2376132 2422382
49296 2422382 2469901 2519268 2571736 2628801 2690832 2756112 2822047 2887825 2955478 3028073 3107217
49285 3107217 3192549 3282983 3377783 3476639 3579364 3685793 3795978 3910377 4029827 4155213
49275 4155213 4287214 4426350 4572764 4725598 4883048 5043940 5209193 5380806 5559113
49266 5559113 5741735 5925535 6109023 6292431 6475967 6658473 6837542 7010590 7175920
49257 7175920 7332737 7479840 7614419 7732924 7833376 7916217 7982638 8032664 8065184 8079251
49247 8079251 8074917 8053345 8016801 7968288 7910714 7846389 7777237 7705069 7631456 7557898 7486281
49236 7486281 7418603 7355993 7298699 7247324 7203411 7168249 7141788 7123394 7113217 7112164 7120933 7139723
49224 7139723 7168573 7207218 7254790 7310326 7373540 7444542 7522797 7606867 7695184 7786663 7880314
49213 7880314 7974424 8066395 8153649 8234765 8309319 8376174 8432241 8473716 8498499 8506482 8497416 8469820
49201 8469820 8422735 8357595 8277182 8183030 8074784 7952091 7816458 7671156 7519790 7365031
49191 7365031 7208447 7051287 6895232 6742143 6593341 6449657 6312011 6181108 6056540
49182 6056540 5937199 5823037 5715529 5615953 5523987 5438608 5359560 5287022 5220298 5157646 5097300
49171 5097300 5038282 4980594 4925058 4872682 4823923 4778796 4737485 4699900 4664591 4629487 4594283
49160 4594283 4560973 4531254 4504599 4479880 4457620 4439128 4424048 4410240 4395894 4380768 4365687
49149 4365687 4351778 4339837 4329553 4319747 4310039 4301630 4295544 4290993 4286609 4282414 4279108 4276191 4272544
49136 4272544 4268471 4265390 4263602 4262105 4260734 4260666 4262424 4264842 4266536 4267187 4266860 4265163 4261631 4256206 4249009
49121 4249009 4240447 4231582 4223379 4215431 4206489 4196523 4187186 4179979 4174962 4171480 4169143 4167763 4167435 4169015
49107 4169015 4173421 4180048 4186975 4193400 4200825 4211187 4224817 4241076 4260117 4282915 4309840 4340016
49095 4340016 4371926 4404318 4436763 4469738 4503978 4539658 4576562 4614940 4655460 4698192 4742454
49084 4742454 4788000 4835462 4885100 4935770 4985804 5034582 5082674 5130609 5178114 5224732 5271030
49073 5271030 5318669 5368669 5419724 5469355 5517191 5565871 5617567 5670933 5723288 5774830 5828166
49062 5828166 5883878 5939250 5992113 6043537 6095616 6148640 6201870 6255187 6308174 6358996 6406280
49051 6406280 6451347 6496773 6543199 6589087 6633168 6675537 6716463 6755598 6792513 6826969 6858608
49040 6858608 6887279 6913655 6938789 6963160 6986733 7009621 7031825 7052723 7071949 7090736 7111358
49029 7111358 7135018 7160881 7187171 7212540 7236392 7258873 7280989 7304367 7330507 7360102 7392767
49018 7392767 7427249 7462328 7497969 7535250 7574777 7615640 7656459 7696984 7737891 7779281 7820132
49007 7820132 7859052 7894966 7927316 7956367 7983240 8008824 8032462 8052179 8066306 8074527 8077539 8076253
48995 8076253 8071364 8063106 8051159 8035036 8014740 7991078 7965280 7938187 7909618 7878753 7845570 7811545
48983 7811545 7778178 7745193 7711513 7677999 7647409 7620951 7596674 7572575 7549617 7529816 7512592
48972 7512592 7495501 7478101 7462588 7450387 7440373 7431086 7422762 7416160 7410953 7406509 7403262 7402243 7403924
48959 7403924 7408213 7414814 7422876 7431181 7439483 7448980 7460742 7474446 7489491 7506518 7526672 7549808
48947 7549808 7574594 7600201 7626882 7654954 7684114 7713798 7743417 7772216 7799584 7825546 7850349
48936 7850349 7873613 7894647 7913605 7931397 7948121 7962426 7972930 7979638 7983219 7983341 7978483 7967342
48924 7967342 7949853 7926843 7899192 7867396 7831427 7790710 7744490 7692489 7635134 7573124 7506993
48913 7506993 7437134 7364013 7288236 7210650 7132446 7054754 6977776 6900472 6821533 6740611 6658452
48902 6658452 6576059 6494230 6413861 6336130 6262029 6191828 6125220 6061934 6002219 5946845 5896593
48891 5896593 5851570 5810989 5773830 5739806 5709696 5684804 5666045 5653216 5644901 5639376 5635965 5635418
48879 5635418 5638767 5646190 5657268 5671697 5688966 5707893 5727721 5749583 5775641 5806378 5839807 5873790
48867 5873790 5908288 5944877 5984972 6029035 6076506 6125762 6175062 6224556 6276646 6333284 6393441
$$ [...]
##END NTUPLES=NMR SPECTRUM
##END=
