
##TITLE=AC1043_TOIB01_5906321_z91VEWADNX
##JCAMPDX= 6.0         $$ Bruker NMR JCAMP-DX V2.0
##DATA TYPE= NMR SPECTRUM
##DATA CLASS= NTUPLES
##ORIGIN= BRUKER
##OWNER= Administrator
$$ 1.72 TOPSPIN		Version 2.1
$$ 2012-04-10 10:10:55.531 -0500  Administrator@TOPSPIN
$$ Compression mode = diff/dup
##.OBSERVE FREQUENCY= 400.13188235
##.OBSERVE NUCLEUS= ^1H
##.ACQUISITION MODE= SIMULTANEOUS (DQD)
##.ACQUISITION SCHEME= undefined
##.AVERAGES= 8
##.DIGITISER RES= 22
##SPECTROMETER/DATA SYSTEM= spect
##.PULSE SEQUENCE= zg30
##.SOLVENT NAME= COFFEE_meoh
##.SHIFT REFERENCE= INTERNAL, COFFEE_meoh, 1, 14.98061
##AUDIT TRAIL= $$ (NUMBER, WHEN, WHO, WHERE, PROCESS, VERSION, WHAT)
$$ ##TITLE= Audit trail, TOPSPIN		Version 2.1
$$ ##JCAMPDX= 5.01
$$ ##ORIGIN= Bruker BioSpin GmbH
$$ ##OWNER= Administrator
$$ $$ C:\Bruker\TOPSPIN/data/COFFEE/nmr/AC1043_TOIB01_5906321_z91VEWADNX/10/pdata/1/auditp.txt
$$ ##AUDIT TRAIL=  $$ (NUMBER, WHEN, WHO, WHERE, PROCESS, VERSION, WHAT)
(   1,<2012-04-04 11:51:42.781 -0500>,<Administrator>,<TOPSPIN>,<go>,<TOPSPIN 2.1>,
      <created by zg
	started at 2012-04-04 11:50:36.281 -0500,
	POWCHK enabled, PULCHK disabled,
       configuration hash MD5:
       1A 1E CE 29 27 FD 77 03 67 4E F0 E3 C4 B2 CB 90
       data hash MD5: 64K
       85 80 91 F6 A9 26 4C 84 4A 89 71 C9 23 2C CC 22>)
(   2,<2012-04-04 11:51:46.843 -0500>,<Administrator>,<TOPSPIN>,<proc1d>,<TOPSPIN 2.1>,
      <Start of raw data processing
       efp LB = 0 FT_mod = 6 PKNL = 1 PHC0 = 0 PHC1 = 0 SI = 32K 
       data hash MD5: 32K
       59 E5 9F 47 F3 94 E8 D3 50 6C 10 C9 36 70 41 5D>)
(   3,<2012-04-04 11:51:47.156 -0500>,<Administrator>,<TOPSPIN>,<proc1d>,<TOPSPIN 2.1>,
      <pk PHC0 = 212.6074 PHC1 = 0 
       data hash MD5: 32K
       9F A8 13 F1 45 BB EE E0 AD 2E 31 57 E8 33 85 73>)
(   4,<2012-04-04 11:51:47.234 -0500>,<Administrator>,<TOPSPIN>,<proc1d>,<TOPSPIN 2.1>,
      <abs ABSG = 1 
       data hash MD5: 32K
       B1 CE CD 71 A8 AD FE 77 55 CD 6B 7E 53 D0 73 28>)
(   5,<2012-04-04 11:51:47.265 -0500>,<Administrator>,<TOPSPIN>,<proc1d>,<TOPSPIN 2.1>,
      <abs ABSG = 2 
       data hash MD5: 32K
       12 4D D0 13 2A 43 A6 84 7D A0 04 1B F2 6E FD 3D>)
(   6,<2012-04-04 11:51:47.312 -0500>,<Administrator>,<TOPSPIN>,<proc1d>,<TOPSPIN 2.1>,
      <abs ABSG = 3 
       data hash MD5: 32K
       95 4C C7 EC B6 63 39 5B AC 3A 47 A2 F5 EB 28 E8>)
(   7,<2012-04-04 11:51:47.343 -0500>,<Administrator>,<TOPSPIN>,<proc1d>,<TOPSPIN 2.1>,
      <abs ABSG = 4 
       data hash MD5: 32K
       9C BC 3E C2 6B F3 DC 27 C0 F4 37 79 C1 FC D0 3A>)
(   8,<2012-04-04 11:51:47.375 -0500>,<Administrator>,<TOPSPIN>,<proc1d>,<TOPSPIN 2.1>,
      <abs ABSG = 5 
       data hash MD5: 32K
       AA 68 E3 53 D4 48 96 62 D6 6F 5E 8D 98 71 B6 AE>)
(   9,<2012-04-04 11:51:53.640 -0500>,<Administrator>,<TOPSPIN>,<audit>,<TOPSPIN 2.1>,
      <user comment:
       ICON-NMR User ID: COFFEE
       data hash MD5: 32K
       AA 68 E3 53 D4 48 96 62 D6 6F 5E 8D 98 71 B6 AE>)
$$ ##END=
$$ 
$$ [...]
##$TP= (0..7)
150 150 150 150 150 150 150 150
##$TP07= 0
##$TPNAME0= <>
##$TPNAME1= <>
##$TPNAME2= <>
##$TPNAME3= <>
##$TPNAME4= <>
##$TPNAME5= <>
##$TPNAME6= <>
##$TPNAME7= <>
##$TPOAL= (0..7)
0.5 0.5 0.5 0.5 0.5 0.5 0.5 0.5
##$TPOFFS= (0..7)
0 0 0 0 0 0 0 0
##$TUNHIN= 0
##$TUNHOUT= 0
##$TUNXOUT= 0
##$USERA1= <user>
##$USERA2= <user>
##$USERA3= <user>
##$USERA4= <user>
##$USERA5= <user>
##$V9= 5
##$VALIST= <valist>
##$VCLIST= <CCCCCCCCCCCCCCC>
##$VD= 0
##$VDLIST= <DDDDDDDDDDDDDDD>
##$VPLIST= <PPPPPPPPPPPPPPP>
##$VTLIST= <TTTTTTTTTTTTTTT>
##$WBST= 2048
##$WBSW= 25
##$XGAIN= (0..3)
0 0 0 0
##$XL= 0
##$YL= 0
##$YMAX_a= 531573
##$YMIN_a= -648238
##$ZGOPTNS= <>
##$ZL1= 120
##$ZL2= 120
##$ZL3= 120
##$ZL4= 120
##$ABSF1= 14.98061
##$ABSF2= -5.57192
##$ABSG= 5
##$ABSL= 3
##$ALPHA= 0
##$AQORDER= 0
##$ASSFAC= 0
##$ASSFACI= 0
##$ASSFACX= 0
##$ASSWID= 0
##$AUNMP= <proc_prof1d_extract_pilot.lims>
##$AXLEFT= 0
##$AXNAME= <>
##$AXNUC= <1H>
##$AXRIGHT= 0
##$AXTYPE= 0
##$AXUNIT= <>
##$AZFE= 0.1
##$AZFW= 0.1
##$BCFW= 0
##$BC_mod= 0
##$BYTORDP= 0
##$COROFFS= 0
##$CY= 15
##$DATMOD= 1
##$DC= 0
##$DFILT= <>
##$DTYPP= 0
##$F1P= 0
##$F2P= 0
##$FCOR= 0.5
##$FTSIZE= 32768
##$FT_mod= 6
##$GAMMA= 0
##$GB= 0
##$INTBC= 1
##$INTSCL= 1
##$ISEN= 128
##$LB= 0
##$LEV0= 0
##$LPBIN= 0
##$MAXI= 10000
##$MC2= 0
##$MEAN= 0
##$ME_mod= 0
##$MI= 0
##$NCOEF= 0
##$NC_proc= -8
##$NLEV= 6
##$NOISF1= 0
##$NOISF2= 0
##$NSP= 0
##$NTH_PI= 0
##$NZP= 0
##$OFFSET= 14.98061
##$PC= 1
##$PHC0= 212.6074
##$PHC1= 0
##$PH_mod= 1
##$PKNL= yes
##$PPARMOD= 0
##$PPDIAG= 0
##$PPIPTYP= 0
##$PPMPNUM= 2147483647
##$PPRESOL= 1
##$PSCAL= 4
##$PSIGN= 0
##$PYNMP= <proc.py>
##$REVERSE= no
##$SF= 400.13
##$SI= 32768
##$SIGF1= 0
##$SIGF2= 0
##$SINO= 400
##$SIOLD= 32768
##$SPECTYP= <>
##$SREGLST= <1H.CDCl3>
##$SSB= 0
##$STSI= 32768
##$STSR= 0
##$SW_p= 8223.68421052632
##$SYMM= 0
##$S_DEV= 0
##$TDeff= 65536
##$TDoff= 0
##$TI= <>
##$TILT= no
##$TM1= 0
##$TM2= 0
##$TOPLEV= 0
##$USERP1= <user>
##$USERP2= <user>
##$USERP3= <user>
##$USERP4= <user>
##$USERP5= <user>
##$WDW= 1
##$XDIM= 32768
##$YMAX_p= 467203084
##$YMIN_p= -746225
##$CURPLOT= <Network HP LaserJet P1505>
##$CURPRIN= <$Network HP LaserJet P1505>
##$DFORMAT= <normdp>
##$LAYOUT= <+/1D_H.xwp>
##$LFORMAT= <normlp>
##$PFORMAT= <normpl>
##$SURQMSG= 1
$$ End of Bruker specific parameters
$$ ---------------------------------
##NTUPLES= NMR SPECTRUM
##VAR_NAME=  FREQUENCY,     SPECTRUM/REAL,   SPECTRUM/IMAG
##SYMBOL=    X,             R,               I
##VAR_TYPE=  INDEPENDENT,   DEPENDENT,       DEPENDENT
##VAR_FORM=  AFFN,          ASDF,            ASDF
##VAR_DIM=   32768,         32768,           32768
##UNITS=     HZ,            ARBITRARY UNITS, ARBITRARY UNITS
##FACTOR=    0.250966925370066, 1,           1
##FIRST=     8223.43324360095, -226520,      100529
##LAST=      0,             -311186,         33448
##MIN=       0,             -746225,         0
##MAX=       8223.43324360095, 467203084,    0
$$ Real data points
##PAGE= N=1
##DATA TABLE= (X++(R..R)), XYDATA
$$ [...]
19467B20246a85498k08246c333l9895G2920a59548a178m7908j0005b9162m1351
$$ 220246 -185498 -393744 -3333 -43228 72920 -159548 -1178 -49086 -59091 -29162 -70513
19456g0513A5418g1962B53113a88329e6571j20271q9846C98979b42381j51775
$$ -70513 15418 -71962 253113 -188329 -56571 -176842 -266688 398979 -242381 -394156
19446c94156I7644a0533k9217k37189B06294a11622o5507m227n4098C04733A00479
$$ -394156 97644 -10533 -39750 -276939 206294 -111622 -177129 -181356 -235454 304733 100479
19434f3621A19619c46843G3976a39786K6502a2197k83065k8708c4143B77477f5111
$$ -63621 119619 -346843 73976 -139786 -113284 -12197 -295262 -323970 -34143 277477 -65111
19422a86432j46043a38150k0211A34429b24395C19358b83337B13532a44976G3227
$$ -186432 -332475 -138150 -158361 134429 -224395 319358 -283337 213532 -144976 73227
19411A46198a51077e5810B30459N30C7718J96326a37129m4354f5368j55337A39098
$$ 146198 -151077 -55810 230459 230989 37718 234044 -137129 -181483 -65368 -220705 139098
19399C5646c8914j88529M2698m527M4859B9433P3587R8305a71220B50797a86050
$$ 35646 -38914 -227443 -184745 -189272 -144413 29433 103020 201325 -171220 250797 -186050
19387H1301R1489c10684a01608j17290l1466C7976b15123M6679M6420E0424K26941
$$ 81301 172790 -310684 -101608 -218898 -250364 37976 -215123 -168444 -122024 50424 277365
19376B77365d84283B38205C3270J06066b00201H0859J26105h6190k71276j15780
$$ 277365 -484283 238205 33270 139336 -200201 80859 206964 -86190 -357466 -473246
19366d73246K27014B1226p886J30358b43135M59O7688B79487F7421c68030c6077
$$ -473246 -246232 21226 13340 143698 -243135 -242676 -174988 279487 67421 -368030 -36077
19354H7781k7982Q4854a17461k1549j5981M6883o0231N898e8630j6767A6975J94656
$$ 87781 59799 144653 -117461 -139010 -154991 -108108 -168339 -162441 -58630 -75397 16975 211631
19342B11631j26a46333D3560c3517j61783n7401j10572B34525a07972l5071p0409
$$ 211631 211505 -146333 43560 -33517 -195300 -252701 -363273 234525 -107972 -143043 -213452
19331b13452B50739a00403C5226a09855d8069j89622D1389b1136d539m7856l5334
$$ -213452 250739 -100403 35226 -109855 -48069 -237691 41389 -21136 -4539 -52395 -87729
19320h7729i695k37328A9492O2023a05849r6370d2135j84907Q0458d5378m09222
$$ -87729 -9695 -247023 19492 81515 -105849 -202219 -42135 -227042 -146584 -45378 -454600
19309d54600b8980j71401C0168a47505j41409F6012J34156a63056n7745A80696
$$ -454600 -28980 -200381 30168 -147505 -288914 66012 200168 -163056 -220801 180696
19298c5715k8233k2618L4174A25562h8623d806j32841K09n143j5301H2706c20199
$$ -35715 -63948 -86566 -52392 125562 -88623 -4806 -137647 -137438 -142581 -157882 82706 -320199
19285a52507H9579b70499A53247b88422N2672Q5456b8404k625j84514B38452d50913
$$ -152507 89579 -270499 153247 -288422 -235750 -150294 -28404 -31029 -215543 238452 -450913
19273f6852j69055C2817a58358P4344k98964J50813J02267l2177f961k1606I4807
$$ -66852 -235907 32817 -158358 -84014 -382978 -232165 -129898 -162075 -6961 -28567 94807
19261A18350a31449J1880j5932q36H9099b34071A3108M07677a87075J9899B75017
$$ 118350 -131449 -119569 -135501 -136337 89099 -234071 13108 420785 -187075 -167176 275017
19249c03451A37507j8957D9721a40252D6816b25332k8881r160a4780j17011A99318
$$ -303451 137507 118550 49721 -140252 46816 -225332 -254213 -263373 -14780 -131791 199318
19237a10979I819a11887B4312d5866C8559h891A11803d0431C8449j1502f591n5602
$$ -110979 9819 -111887 24312 -45866 38559 -8891 111803 -40431 38449 26947 -6591 -62193
19225f2193l1239k99709B00394a10527j35637j20020B10595c6311n4912E3829
$$ -62193 -93432 -393141 200394 -110527 -246164 -366184 210595 -36311 -91223 53829
19214b44106h0646j90710A0054a24848B88869b17659C78878a14945q8669i3948
$$ -244106 -80646 -271356 10054 -124848 288869 -217659 378878 -114945 -203614 -93948
19203c2884A6013a5792B2496c83639c5802q0941k3141c0335j76013A15788d0615
$$ -32884 16013 -15792 22496 -383639 -35802 -116743 -139884 -30335 -206348 115788 -40615
19191A2966O298M6315J17912b34439P5433k33994A98271c64602d3036J5881j07475
$$ 12966 19264 65579 183491 -234439 -159006 -393000 198271 -364602 -43036 -27155 -134630
19180a34630j47875L7403A49070e22570b02377G6045b52562c852n1396j88295
$$ -134630 -282505 -245102 149070 -522570 -202377 76045 -252562 -3852 -55248 -243543
19170b43543L3361f9678j42162a1449j49386m7607Q7817F4244a91411j62741g7125
$$ -243543 -210182 -69678 -211840 -11449 -160835 -208442 -120625 64244 -191411 -354152 -77125
19158H0767c27732h9135A77356a31891r0203a03246m1309B054b12562A74756B9162
$$ 80767 -327732 -89135 177356 -131891 -222094 -103246 -144555 2054 -212562 174756 29162
19146b04512K541c693j39781j40185A8366L9112h0811j82547E9777J90788b0755
$$ -204512 -201971 -3693 -143474 -283659 18366 57478 -80811 -263358 59777 250565 -20755
19134C2578b39885G4273d93164A50390k1208J25714A551K9699b6665e158A59015
$$ 32578 -239885 74273 -493164 150390 129182 254896 1551 31250 -26665 -5158 159015
19122F3816J84357j14440f14k6682j91632G7689l2564b50947d0263k51329A25000
$$ 63816 248173 133733 -614 -27296 -218928 77689 45125 -250947 -40263 -291592 125000
19110e6975r7007j96000C1117b8416o5683B09693a35823C65280b50323C817b96437
$$ -56975 -153982 -349982 31117 -28416 -94099 209693 -135823 365280 -250323 3817 -296437
19098b7188A66246f3689c262E2431b9731n0726G4065a53792O9889j0246o7823
$$ -27188 166246 -63689 -3262 52431 -29731 -80457 74065 -153792 -83903 -94149 -161972
19087a61972c1780j82224A04040m4000a07120H9922a19570D4035b91579H7822
$$ -161972 -31780 -214004 104040 60040 -107120 89922 -119570 44035 -291579 87822
19076a02141K6271n87j40345A58030k3081L5242b12874a436C04949a2669o5299
$$ -102141 -75870 -76457 -216802 158030 134949 170191 -212874 -1436 304949 -12669 -77968
19065g7968M798j55141d1267k00113C6146b35803A21959L6513I983L4577a30766
$$ -77968 -73170 -228311 -41267 -241380 36146 -235803 121959 158472 9983 44560 -130766
19053d7215j27928d2340c089m24860A08243L21144b99124B25172h4106A00494
$$ -47215 -175143 -42340 -3089 -427949 108243 429387 -299124 225172 -84106 100494
19042a11084J9937B5656c24415g1720L5189A96033a79786Q7646j41592F8979c435
$$ -111084 -91147 25656 -324415 -71720 -36531 196033 -179786 -92140 -233732 68979 -3435
19030A57754f703C691a55278A57112m7907a39113A01448a42549j04557A38571
$$ 157754 -6703 3691 -155278 157112 109205 -139113 101448 -142549 -247106 138571
19019A1594J21933C8075i4148A09347b94630B4019g7085j11662d3781A29129a08006
$$ 11594 133527 38075 -94148 109347 -294630 24019 -77085 -188747 -43781 129129 -108006
19007a92328o0726H261K60421D7341M4008a27428f615D02403j81497f7386o7178
$$ -192328 -253054 8261 268682 47341 91349 -127428 -6615 402403 220906 -67386 -134564
18996a34564G0306Q5425i9454B2981J9096J76106B2828g8251C5455J92941b21310
$$ -134564 70306 155731 -99454 22981 42077 218183 22828 -78251 35455 228396 -221310
18984G5630a85857q0004f0652k751j25586A29440a07033L7728b5352C650a98579
$$ 75630 -185857 -265861 -60652 -63403 -188989 129440 -107033 -69305 -25352 3650 -198579
18972a17183j43526C3795j5554P4923a10259m8684b5240p3712m6971B4356a63585
$$ -117183 -260709 33795 18241 93164 -110259 -158943 -25240 -98952 -145923 24356 -163585
18960G5637J52090I0283a04175B32622K19873j47666d8058p7464A52893h2997
$$ 75637 227727 90283 -104175 232622 452495 304829 -48058 -125522 152893 -82997
18949A3248i9764D5274J25398E6404J24902d16011D2972i5724j39388k0580c102
$$ 13248 -99764 45274 170672 56404 181306 -416011 42972 -95724 -235112 -255692 -3102
18937A73449n4974c60966B3552h8418j54409B23976D6452c02759A50049g3872
$$ 173449 118475 -360966 23552 -88418 -242827 223976 46452 -302759 150049 -73872
18926b61000C9396a62541d6900C1217a9157j71878j67784E7779b82816A01267
$$ -261000 39396 -162541 -46900 31217 -19157 -191035 -358819 57779 -282816 101267
18915B39793A14000b19391h3891p6547o3354h2941m2722B89646A44312a23921
$$ 239793 114000 -219391 -83891 -160438 -223792 -82941 -125663 289646 144312 -123921
18904g7140B1632a65395g212D500a88956G5928a01431q4176d0546B00934h5331
$$ -77140 21632 -165395 -7212 4500 -188956 75928 -101431 -185607 -40546 200934 -85331
18892D36199j94758J04583j34042b54731b1468p7254k8567M3707k6103L3734F6777
$$ 436199 241441 346024 211982 -254731 -21468 -98722 -127289 -83582 -109685 -75951 66777
18880H4630h2525C39397b40883e1421j41665f5623C6954i2167A25764c7171C2217
$$ 84630 -82525 339397 -240883 -51421 -193086 -65623 36954 -92167 125764 -37171 32217
18868c71162c5587a7702A26444O3132b55660A7129a00635B14118a5271j83435
$$ -371162 -35587 -17702 126444 189576 -255660 17129 -100635 214118 -15271 -198706
18858a98706L124n0726l16346h6093j28919f4709j02147k2291b3424A9678c12963
$$ -198706 -195582 -246308 -562654 -86093 -215012 -64709 -166856 -189147 -23424 19678 -312963
18846c5703B57691a63337C0340J27547k0400d1734B3254e2534B94265c2694j61511
$$ -35703 257691 -163337 30340 157887 137487 -41734 23254 -52534 294265 -32694 -194205
18835a94205E5224r655d4125C6257R6102a49918e622k19051k12555i0212O812
$$ -194205 55224 45569 -44125 36257 132359 -149918 -5622 -224673 -437228 -90212 -83400
18824h3400j2607A5955n262P8714R4666a17046B29532j00785E4348b074l35995
$$ -83400 -96007 15955 10693 89407 184073 -117046 229532 128747 54348 -2074 -338069
18813c38069J43156p3916I8126e6966j67891B4660c18512D0425b1562m19660a82567
$$ -338069 -194913 -268829 98126 -56966 -224857 24660 -318512 40425 -21562 -441222 -182567
18801d43729d5229A27241a6863I02R7261f3104B26857j11568B6192a67202A53546
$$ -443729 -45229 127241 -16863 902 98163 -63104 226857 115289 26192 -167202 153546
18789A98051a38886j35096L3117d1850j89972A29395g5291A8489J27816D4219
$$ 198051 -138886 -273982 -240865 -41850 -231822 129395 -75291 18489 146305 44219
18778A72385b18376p1557f1605j90243g5971q5736D6919i1277I8242J37988b57250
$$ 172385 -218376 -289933 -61605 -251848 -75971 -161707 46919 -91277 98242 236230 -257250
18766A8139J11557B1342b72856l5242d995j90003O5242E979a88694B32237a81279
$$ 18139 129696 21342 -272856 -308098 -4995 -194998 -129756 5979 -188694 232237 -181279
18754a45398O7313B28157a12392A05307B8763a17798m6265k98190e2612A60091
$$ -145398 -78085 228157 -112392 105307 28763 -117798 -164063 -462253 -52612 160091
18743e722D5748a93881g2593b6406F9980K76237a05499A31243o0355I013b0168
$$ -5722 45748 -193881 -72593 -26406 69980 346217 -105499 131243 70888 9013 -20168
18731a73191A29961M8148b61247j99735A82653b48591K0308j1570A34057N7256
$$ -173191 129961 178109 -261247 -460982 182653 -248591 -228283 -239853 134057 191313
18721A91313e0765B85222c605D91M7649J22023P8345A10730b57249b0203A1479
$$ 191313 -50765 285222 -3605 491 48140 170163 248508 110730 -257249 -20203 11479
18709e0193p2127c8850E1519b21543A69255g5619k90241E8919b1161j08145F1261
$$ -50193 -122320 -38850 51519 -221543 169255 -75619 -365860 58919 -21161 -129306 61261
18697E8286k6230b95436A78150a61255p597B51722H2172c01557f9449A5215J51267
$$ 58286 32056 -295436 178150 -161255 -168852 251722 82172 -301557 -69449 15215 166482
18686A66482b75058C49877i6717j70069d942B3116f8791B8770b53827p9719A90925
$$ 166482 -275058 349877 -96717 -266786 -4942 23116 -68791 28770 -253827 -333546 190925
18674A35918K3693a62349p6607D7786c01955h948A82596p3832D0666b37034F1164
$$ 135918 159611 -162349 -238956 47786 -301955 -8948 182596 108764 40666 -237034 61164
18662e4456E9767L41296D8122J32293a73752A38891e1457j5798j51736R3422N9101
$$ -54456 59767 401063 48122 180415 -173752 138891 -51457 -67255 -218991 -125569 -66468
18651f6468j36136D32487a6637I4319J70986D2385J18136b33484c8586n5744B23260
$$ -66468 -202604 432487 -16637 94319 265305 42385 160521 -233484 -38586 -94330 223260
18639b23932a7659C5981a41382r6941N1248B84810I2201B5442Q1957c50307a0334
$$ -223932 -17659 35981 -141382 -238323 -187075 284810 92201 25442 107399 -350307 -10334
18627A25902k4954a23103A17713b87709J04111C7796a4278j67740r9507c1298
$$ 125902 100948 -123103 117713 -287709 -183598 37796 -14278 -182018 -281525 -31298
18616A39099C2795a35068j43391g8230B01420b24880N8236j58810a16877q8351
$$ 139099 32795 -135068 -278459 -78230 201420 -224880 -166644 -325454 -116877 -205228
18606b05228q2892d7305H4957a2432r2916c3448l5883j47099k34438a86899j3750
$$ -205228 -288120 -47305 84957 -12432 -105348 -33448 -69331 -216430 -450868 -186899 -200649
18595b00649A60609b11146O1557l63641b09167L3363k05206l7810A14259c3389
$$ -200649 160609 -211146 -149589 -513230 -209167 -175804 -381010 -418820 114259 -33389
18584A21967k4775g1773B7669c6978j18182f7948D3900k099e6492A115R6025N4335
$$ 121967 97192 -71773 27669 -36978 -155160 -67948 43900 41801 -56492 1115 97140 151475
18572A51475a10972J7081k9596B56225c86764A5481O4424a14058I1511b26149
$$ 151475 -110972 -93891 -123487 256225 -386764 15481 79905 -114058 91511 -226149
18561e3962B80300b4784j48947d390q5766A15344j7778B285a21100k826B66569
$$ -53962 280300 -24784 -173731 -4390 -90156 115344 97566 2285 -121100 -123926 266569
18549A09529i5180H8066J21939i7842E4103b74330h7799o9475N5570B09479h4075
$$ 109529 -95180 88066 210005 -97842 54103 -274330 -87799 -157274 -101704 209479 -84075
18537a62071a7176q2925a3662D4876L278b50097o6466B04475I7233c33563N3817
$$ -162071 -17176 -100101 -13662 44876 48154 -250097 -316563 204475 97233 -333563 -279746
18526b79746a14993B99266c54179n0119J39279M2288A38079J69502L9399d2147
$$ -279746 -114993 299266 -354179 -404298 -265019 -222731 138079 307581 346980 -42147
18515a26349B37390a47830A22664i9589B18898l8275b45069J02034A05530f2781
$$ -126349 237390 -147830 122664 -99589 218898 180623 -245069 -143035 105530 -62781
18504h5515k13489J25152d8161q1962R578k51620i5060K2834C84610h2739D73754
$$ -85515 -299004 -173852 -48161 -130123 -120545 -372165 -95060 -72226 384610 -82739 473754
18492d93148a3795k11093c9586j33072h5289k23577j1198G7395a9959k4660C3761
$$ -493148 -13795 -224888 -39586 -172658 -85289 -308866 -320064 77395 -19959 -44619 33761
18480C93593C524b16084o329g4354D14925g4618B26928b7783m002B10011J14819
$$ 393593 3524 -216084 -222413 -74354 414925 -74618 226928 -27783 -31785 210011 324830
18469C24830G0733a52071n1164I336h5325j4872c2040n2703D7021J43312e9748
$$ 324830 70733 -152071 -203235 9336 -85325 -100197 -32040 -84743 47021 190333 -59748
18457B16854a27454A29752k0689a82143h6696A66367G5185b37347C05272n9268
$$ 216854 -127454 129752 109063 -182143 -86696 166367 75185 -237347 305272 246004
18447B46004o5004h149A48858n676c3784G5982e1935B0337J37108p4838a81033
$$ 246004 181000 -8149 148858 143182 -33784 75982 -51935 20337 157445 82607 -181033
18435A27298i883l0605m6023a8069F1412a32847D7865L234O5701h6320C9044a795
$$ 127298 -9883 -40488 -86511 -18069 61412 -132847 47865 51099 116800 -86320 39044 -1795
18422A07884a93481A04892h1505Q83A19256a5049E8717B842a67178l8831A919
$$ 107884 -193481 104892 -81505 -80622 119256 -15049 58717 2842 -167178 -206009 1919
18410a57037d1184C06934e9717q4058L5882M360B80200b79565C71632a15442j22908
$$ -157037 -41184 306934 -59717 -143775 -107893 -103533 280200 -279565 371632 -115442 -238350
18399b38350K4814P9248O1736G7360a20494L2661A24379L72330B13929o811f8565
$$ -238350 -213536 -134288 -72552 77360 -120494 -87833 124379 496709 213929 207118 -68565
18387C12548c5974A98725F490J18594J51586h4218A37307l8040J78298n9085j06925
$$ 312548 -35974 198725 6490 125084 276670 -84218 137307 99267 277565 218480 111555
18376A11555b39794B5296K57104a57710B11M1904a09778M3579j08375A97009O2114
$$ 111555 -239794 25296 282400 -157710 211 42115 -109778 -66199 -174574 197009 259123
18365B59123f808m07414c5578D3169c66204N6087a3111d300l7279B2155b65170
$$ 259123 -6808 -414222 -35578 43169 -366204 -310117 -13111 -4300 -41579 22155 -265170
18353a08809A80353e6323A81497C4880J0218g6735B15338F1184c25151e4966B09166
$$ -108809 180353 -56323 181497 34880 45098 -76735 215338 61184 -325151 -54966 209166
18341E4221c37876b8556A86119c07311A79505L2355i1031j08891F1904Q8806c7964
$$ 54221 -337876 -28556 186119 -307311 179505 211860 -91031 -199922 61904 150710 -37964
18329f0147G7515l0164a61265g1506A95377i2379H6017c44605e8529j09683P822
$$ -60147 77515 47351 -161265 -71506 195377 -92379 86017 -344605 -58529 -168212 -160390
18318a60390O799G7358C4531a2768k26421C0907J37754a44938F2102g6101l3960
$$ -160390 -153591 77358 34531 -12768 -239189 30907 168661 -144938 62102 -76101 -110061
18307a10061A18794K42804a45977O9271D1128a8250k73487a22859F1129K11353
$$ -110061 118794 361598 -145977 -76706 41128 -18250 -291737 -122859 61129 272482
18297B72482b4107C8125o211e05066a5422d923j45117d7532D6896b27794g2152
$$ 272482 -24107 38125 31914 -505066 -15422 -4923 -150040 -47532 46896 -227794 -72152
18285a30720C10203e9348k67806A63496c0218j50098L2511o2789P9405M5381l1436
$$ -130720 310203 -59348 -327154 163496 -30218 -180316 -147805 -210594 -131189 -85808 -117244
18274a17244q3256A52705h4994m9979B5472J72401a00888E2394a76125c7102k4419
$$ -117244 -200500 152705 -84994 -134973 25472 197873 -100888 52394 -176125 -37102 -61521
18263f1521j784j4102J02b5625j50274A63210F3920i8444r13B4938f1909K8285
$$ -61521 -63305 -77407 -77305 -25625 -175899 163210 63920 -98444 -99357 24938 -61909 -33624
18251c3624C5340a08178B60360a23518j0681f3910b8634m5637m5781j97480i0987
$$ -33624 35340 -108178 260360 -123518 -134199 -63910 -28634 -74271 -120052 -317532 -90987
18239d06488A2186J8041a36820a0742k46963j65009A70944Q6922I6307J68054
$$ -406488 12186 30227 -136820 -10742 -257705 -422714 170944 257866 96307 264361
18229B64361B5556N6560a11598D5313B0332g0323c4843H0147L9640b05502A32699
$$ 264361 25556 82116 -111598 45313 20332 -70323 -34843 80147 119787 -205502 132699
18217I1427N4968d5069p6649L2997A38916A0198L74036a60990A95385b1285k50471
$$ 91427 146395 -45069 -121718 -88721 138916 10198 384234 -160990 195385 -21285 -271756
18206b71756J31678K9992g879A4527c14574B53240b07738A16085l7328a51644
$$ -271756 -140078 -110086 -7879 14527 -314574 253240 -207738 116085 78757 -151644
18195H4932J73979C4094P5790J48183p3227C346a49701a5557m1348j04623j17950
$$ 84932 258911 34094 109884 258067 184840 3346 -149701 -15557 -56905 -161528 -279478
18184b79478K833Q7210G9175J43876a69892j59420J28236C9470M3933d7365j24227
$$ -279478 -276645 -189435 79175 223051 -169892 -329312 -201076 39470 83403 -47365 -171592
18173a71592C5974a59171R117A9356f3083D4857J31070p3467b07979m0572a13102
$$ -171592 35974 -159171 -150054 19356 -63083 44857 175927 102460 -207979 -248551 -113102
18161I238a10975p0106h5262j0796B77310a50501F153c27091d049A46782P7226
$$ 9238 -110975 -181081 -85262 -96058 277310 -150501 6153 -327091 -4049 146782 224008
18150B24008n6925b36299f3308R752B37614r0815b22763B6349A2330N4905a31083
$$ 224008 167083 -236299 -63308 -53556 237614 146799 -222763 26349 12330 67235 -131083
18138c9612A45690n6809J89917C0573H436K11600E4490c4230B468R4122J4379
$$ -39612 145690 88881 278798 30573 8436 220036 54490 -34230 2468 96590 110969
18127A10969c36462a04397H8782J1541K5878a05075L2592a9187B08915N1099b78874
$$ 110969 -336462 -104397 88782 100323 126201 -105075 -72483 -19187 208915 260014 -278874
18115f4338L0936k3543B90910B6028J39291K7390a01003A01887C7161A0344N0977
$$ -64338 -33402 -56945 290910 26028 165319 192709 -101003 101887 37161 10344 61321
18104F1321a27522A74761b68984h68F671J25745R7137A03656j8790a62487q5110
$$ 61321 -127522 174761 -268984 -868 6671 132416 229553 103656 84866 -162487 -247597
18093b47597C887a15993a2800j88571n1789K0039O809A88593c3819A3791b69865
$$ -247597 3887 -115993 -12800 -201371 -253160 -233121 -226312 188593 -33819 13791 -269865
18081a50963A27400L1074n6322B8308b13939J1867L501G3810J46799c51540J06776
$$ -150963 127400 158474 102152 28308 -213939 -202072 -198571 73810 220609 -351540 -244764
18070b44764E8117N3207b38005f5257k03179i6040A05855J35212i3201I3680N1364
$$ -244764 58117 111324 -238005 -65257 -268436 -96040 105855 241067 -93201 93680 145044
18059A45044J14970A0670a50950B49967p1996O2589r2966d8470C88879a19460
$$ 145044 260014 10670 -150950 249967 177971 240560 147594 -48470 388879 -119460
18048h8039j20715G5774a41616H3000b28151O6674r3248n7569P7791B44555b26375
$$ -88039 -208754 75774 -141616 83000 -228151 -161477 -254725 -312294 -234503 244555 -226375
18036c7943o3438A48866l814L5954B1995R4550O528F0583P9687B3143P6902b274
$$ -37943 -101381 148866 145052 181006 21995 116545 123073 60583 140270 23143 100045 -2274
18023b86147b2635B59237a06425d4479B58691a5996G4209l3958a46268b1139E5732
$$ -286147 -22635 259237 -106425 -44479 258691 -15996 74209 40251 -146268 -21139 55732
18011D6158E8K67193g4415b4245r9276C631L0857P7737K24743a05419a6962k92351
$$ 46158 58 267251 -74415 -24245 -123521 3631 34488 112225 336968 -105419 -16962 -309313
17999c09313A36602a09791j5898N9761k07782B71382c98794d0214D3920J06595
$$ -309313 136602 -109791 -125689 -65928 -273710 271382 -398794 -40214 43920 150515
17989A50515b39024e4719K4329m83474f9862H1484K50314a8067k25668a10955
$$ 150515 -239024 -54719 -30390 -513864 -69862 81484 331798 -18067 -243735 -110955
17978D3303a24503A09559C9182K51058b39927A63056K4848a39611A07858r16i2120
$$ 43303 -124503 109559 39182 290240 -239927 163056 187904 -139611 107858 106942 -92120
17966b51931a9953p427D35221C5228a94054d7651A31099K95393A72158a65530
$$ -251931 -19953 -27380 435221 35228 -194054 -47651 131099 426492 172158 -165530
17955b02266A64598e9572A0221b53203A39349i8729A19202d1730p0763k3505A7245
$$ -202266 164598 -59572 10221 -253203 139349 -98729 119202 -41730 -112493 -135998 17245
17943F867O66a11477B36550J2684I164L35061a27097c5809m0267E7913J72930
$$ 6867 7533 -111477 236550 249234 9164 344225 -127097 -35809 -76076 57913 230843
17932B30843a20051e3770p3358A05614L5212A901f5415C60250A58921k7613b49357
$$ 230843 -120051 -53770 -127128 105614 140826 1901 -65415 360250 158921 131308 -249357
17920d141B9206L33755A39744o5730a88310j39692A38382L011l9560a54874E4699
$$ -4141 29206 362961 139744 74014 -188310 -328002 138382 141393 101833 -154874 54699
17908a4595o7492k2290K4964B91009B23a76030B13458a52018P1740A2187J5187
$$ -14595 -82087 -104377 -79413 291009 223 -176030 213458 -152018 -80278 12187 27374
17897B7374g8323A34088i8897A45596e4853F2181L6570a53192D60050B4447b16903
$$ 27374 -78323 134088 -98897 145596 -54853 62181 98751 -153192 460050 24447 -216903
17885h6043j49407c4299B30791a18140C5801a25731B41889E1619g6429j5117c5688
$$ -86043 -235450 -34299 230791 -118140 35801 -125731 241889 51619 -76429 -91546 -35688
17873A69548m2335B4099Q7888i1619B71917b72171D3545R283a05805B63156b74224
$$ 169548 127213 24099 111987 -91619 271917 -272171 43545 52828 -105805 263156 -274224
17861a75550C1180K71982D3998a69323F5602J6405K27005E697P5326M2541A0319
$$ -175550 31180 303162 43998 -169323 65602 82007 309012 5697 81023 123564 10319
17849D6515K61273a5043b338j73509A2359g2654D9539J92096H7840b31753a6967
$$ 46515 307788 -15043 -2338 -175847 12359 -72654 49539 241635 87840 -231753 -16967
17837f1424o805I2401Q549J14724b9067j7006A46736o2324J17229J23602c735
$$ -61424 -68229 92401 100950 215674 -29067 -46073 146736 84412 201641 325243 -3735
17825B50191E8867f3756A56149E8775K00047A27696m8130J21751h0283J083B71838
$$ 250191 58867 -63756 156149 58775 258822 127696 79566 201317 -80283 -79200 271838
17813F5481Q2839a77039P138a6031A1146N1801A0101K19825l9248p6401J75275
$$ 65481 148320 -177039 -169901 -16031 11146 62947 10101 229926 190678 114277 289552
17802B89552a08980A18701l0330L683J03804G9303b0081A52013b53770C04323
$$ 289552 -108980 118701 88371 92054 195858 79303 -20081 152013 -253770 304323
17791A0561J28367L2091a2519F5361J99296l9948J83366d0784j74676B62515A24237
$$ 10561 138928 171019 -12519 65361 264657 224709 408075 -40784 -215460 262515 124237
17779A83217C3767a05665b5064r3331C3155c35388J32859H3808f1763A62746J76674
$$ 183217 33767 -105665 -25064 -118395 33155 -335388 -202529 83808 -61763 162746 339420
17768C39420j12498J6520d6539H3354a15605A67814m0592J66703N2094B2306a09643
$$ 339420 226922 243442 -46539 83354 -115605 167814 127222 293925 346019 22306 -109643
17756A72092C4911d1415A99019e731j7973k69097D45133H3497K27954a00035D4128
$$ 172092 34911 -41415 199019 -5731 -23704 -292801 445133 83497 311451 -100035 44128
17744A14902g8584A69422g0113A59599D4243c12161A40173K19509j13776j5828
$$ 114902 -78584 169422 -70113 159599 44243 -312161 140173 359682 245906 230078
17734B30078j06572K744a15735e6889F9303K31423b7243A36996a7465B9257K299
$$ 230078 123506 126250 -115735 -56889 69303 300726 -27243 136996 -17465 29257 31556
17723C1556J32785l4033L6548A6305a27081j51908A27609b41542A52419N2106
$$ 31556 164341 130308 166856 16305 -127081 -278989 127609 -241542 152419 204525
17713B04525Q2967a62838k994D9752i0935C2180b5900C4646J04031i9805A44425
$$ 204525 287492 -162838 -165832 49752 -90935 32180 -25900 34646 138677 -99805 144425
17701E59494d2500C46498f4026H6482b34639E214P6795k7270i220B32658I2295
$$ 559494 -42500 346498 -64026 86482 -234639 5214 82009 54739 -9220 232658 92295
17689A96361J66569I9029k771e0046C43360b1770r6695B9727a5289A11842k7648
$$ 196361 362930 99029 96258 -50046 343360 -21770 -118465 29727 -15289 111842 84194
17678H4194h0087j63963I9525d8529C18526j25949h1879B26554a0584l76459A72365
$$ 84194 -80087 -244050 99525 -48529 318526 192577 -81879 226554 -10584 -387043 172365
17666C61916b96969a46554C8051K23540a48101a3239l7093B29968J34164b5315
$$ 361916 -296969 -146554 38051 261591 -148101 -13239 -50332 229968 364132 -25315
17655D09663j84454n7866f390B5405c68630c1137O550B41738G6357L1782Q8185
$$ 409663 225209 167343 -6390 25405 -368630 -31137 -24587 241738 76357 108139 196324
17644A96324c31118b9754A76040c43558h379A00375k3522d6595j6019I2217d35
$$ 196324 -331118 -29754 176040 -343558 -8379 100375 76853 -46595 -62614 92217 -435
17632F5121k58r792g6310q854D62124A17229F017L70056p3506H2286L07686H5849
$$ 65121 64863 55071 -76310 -85164 462124 117229 6017 376073 302567 82286 389972 85849
17619A77851B0157K53425J50186j14004A08038A601K8098a38717A59966e911B2892
$$ 177851 20157 273582 423768 309764 108038 1601 29699 -138717 159966 -5911 22892
17607d15582A74785i012A72710a56278l20511b19437B07995a72117B70328k916
$$ -415582 174785 -9012 172710 -156278 -476789 -219437 207995 -172117 270328 267412
17597B67412j26324N0087a55870C89808H3378L37814A55760L78765A22435J56987
$$ 267412 141088 191175 -155870 389808 83378 421192 155760 534525 122435 279422
17587B79422H5701J89601p5507R6988A20294R137J33857j9053N7446E6416P0997
$$ 279422 85701 275302 199795 296783 120294 129431 263288 244235 301681 56416 127413
17576A27413K9822A7518b37688B90517C7008a65040K2003A24123R5896h094j28098
$$ 127413 157235 17518 -237688 290517 37008 -165040 -143037 124123 220019 -8094 -136192
17565a36192A85058P9285O0154A23992m2748K5075J76565j14737L7413G9049Q2710
$$ -136192 185058 264343 324497 123992 81244 106319 282884 168147 205560 79049 161759
17554A61759f8979C59682r4425a93920B49670A23457L4874j5459M8349C9365R5314
$$ 161759 -68979 359682 265257 -193920 249670 123457 158331 142872 191221 39365 134679
17543A34679a10166A90703P5942C527J73820J12394l7014H8051K32345i2553C94103
$$ 134679 -110166 190703 266645 3527 177347 289741 252727 88051 320396 -92553 394103
17531A2389Q0203K70382K37824B41860b74149i6947B24354Q3246L63377B97602
$$ 12389 92592 362974 600798 241860 -274149 -96947 224354 307600 670977 297602
17520I2005M4555P687N35674j80648B37796K36195j62870M18800P8336k15897
$$ 92005 136560 144247 679921 499273 237796 473991 311121 729921 808257 592360
17510E92360K01880K56895j35486j03594k599r1179k80125N4472M1623K12337
$$ 592360 794240 1051135 915649 812055 809456 718277 438152 492624 534247 746584
17500G46584r5954K9180B80249M42750P9940p4656P30772l68279j97146l07467
$$ 746584 650630 679810 280249 722999 802939 728283 1459055 1090776 893630 586163
17490E86163K66810l86930A4264P6014O01771k63210r1934R5062p6781P1271j25591
$$ 586163 852973 466043 14264 90278 692049 428839 336905 431967 355186 426457 300866
17479C00866J06832m5448o3217D9448J98204K04273A28372L09549j34158I0186
$$ 300866 407698 362250 299033 49448 247652 451925 128372 437921 303763 90186
17468I4790i07C07606L5236p3027K12406B16822R4668p6929G036N5932J66172
$$ 94790 -907 307606 342842 269815 482221 216822 311490 234561 7036 62968 229140
17457B29140K077O0234j9271O0321A54183R1541m7184O8878j25273K28742F1924
$$ 229140 231217 291451 272180 332501 154183 245724 198540 267418 142145 370887 61924
17445C75149j54557E7555M21945B05866N8889L35185O7728j84260q2700A65376
$$ 375149 220592 57555 479500 205866 264755 599940 667668 483408 400708 165376
17434D03193K45843B92498J0097Q5768n9536K78182j21132L7212e7501C37304
$$ 403193 649036 292498 302595 388363 328827 607009 485877 523089 -57501 337304
17423C83120j05392A1871J08939L40714k10486K04153K0742K71756B56237M9496
$$ 383120 277728 11871 120810 461524 251038 455191 475933 747689 256237 305733
17413C05733N42695l17977B53650J56845j13656O3227o9729J511O580K07645A99006
$$ 305733 848428 530451 253650 410495 296839 360066 290337 291848 298428 506073 199006
17401D84614n3778K7152j29950J52120o5666E7556K14351C0427L39404j37737
$$ 484614 430836 457988 328038 480158 414492 57556 271907 30427 369831 232094
17391B32094M5227J780J1425j08013q6322r953K40151r4059L60067k95321h7238
$$ 232094 277321 279101 290526 182513 96191 86238 326389 232330 592397 297076 -87238
17379C90724J0931A07685K43454I9390J05111c7983E44085q8897a13086C49279
$$ 390724 401655 107685 351139 99390 204501 -37983 544085 455188 -113086 349279
17368a7961A84392H0081K08149D6637M66984A02143K62863J88978B05669K3095
$$ -17961 184392 80081 288230 46637 513621 102143 365006 553984 205669 228764
17358B28764K47079B33445L38870k55703C7979J97027A08012K7855K96966P0328
$$ 228764 475843 233445 572315 316612 37979 235006 108012 135867 432833 503161
17348E03161A80283J43564e3951B16706I385N3995J88758A0438K64286J10612
$$ 503161 180283 323847 -53951 216706 9385 63380 252138 10438 274724 385336
17338C85336j59196J17532A30518a2920B39594A08694L43614A11938K14445K71871
$$ 385336 226140 343672 130518 -12920 239594 108694 452308 111938 326383 598254
17328E98254I5131J81479J84825k16070O1572A39441k0782K20427M3293J41345
$$ 598254 95131 276610 461435 245365 306937 139441 118659 339086 382379 523724
17318E23724b25891i3428C95403O6744l6231A78090K32141a5328q9661A85727
$$ 523724 -225891 -93428 395403 462147 425916 178090 410231 -15328 -104989 185727
17307C82155P2086j32408A429M22421A66087J09118j10956J00220A29475J65855
$$ 382155 454241 321833 1429 423850 166087 275205 164249 264469 129475 295330
17297B95330F7434K29303K6353J30777k23840J25347L2j35377L30002G1707J09200
$$ 295330 67434 296737 323090 453867 230027 355374 355406 220029 550031 71707 180907
17286A80907H8847K23282Q9548j28562G1909J52116R7281R4282K17331B69485
$$ 180907 88847 312129 401677 273115 71909 224025 321306 415588 632919 269485
17275F19284l07719J08175N8874A40242L5544J02768P8704j10352J33629j49292
$$ 619284 311565 419740 478614 140242 175786 278554 357258 246906 380535 231243
17265B31243N6322l9414q6618J9583K81775j225j36616j7055K00074L3409k10855
$$ 231243 287565 248151 161533 181116 462891 461666 325050 307995 508069 541478 330623
17254C30623j54142M5246P1999J99460k16361g4982B16703N30322B48419J41609
$$ 330623 176481 221727 293726 493186 276825 -74982 216703 747025 248419 390028
17244C90028j5756A50237C3786P99708C35868A004O99292C22633m256A56113J15671
$$ 390028 374272 150237 33786 833494 335868 1004 700296 322633 318377 156113 271784
17233B71784L2104J24047F3469L90505i6907E2582J71561a063E10438B17250K78418
$$ 271784 303888 427935 63469 453974 -96907 52582 224143 -1063 510438 217250 495668
17222D95668c1004B01376K58748o8945M12754B39376K44598j3426l1534j08344
$$ 495668 -31004 201376 460124 391179 803933 239376 483974 470548 439014 330670
17212C30670L4834M4818A64568L33986j25592n0328C2318L02623Q4190J1566o1295
$$ 330670 365504 410322 164568 498554 372962 322634 32318 334941 419131 430697 369402
17201C69402L4766m6209A3642M27229K2540J43347A60576F692N64305k52086J54378
$$ 369402 404168 357959 13642 440871 463411 606758 160576 6692 570997 318911 473289
17190D73289n509j50671p1097O8525J56185L32832C17374L09534k88673Q2707
$$ 473289 467780 317109 246012 314537 470722 803554 317374 626908 338235 420942
17180D20942J84089k05541L54997k80313A53382M24930j0725N6705k68609k0633
$$ 420942 605031 399490 754487 474174 153382 578312 567587 624292 355683 335050
17170C35050J64358A23387L95462J528l2961j87299J294k9300R4132O5893A94032
$$ 335050 499408 123387 518849 520377 487416 300117 301411 272111 366243 432136 194032
17158D15206K50284q1302k45610n8930b927F06312j72659Q8626j07633J19924
$$ 415206 665490 584188 338578 279648 -2927 606312 433653 522279 414646 534570
17148E34570l9595q2590O5392L25175k89925L74645D04464J77656p1145k324J1830
$$ 534570 494975 412385 477777 802952 513027 887672 404464 582120 510975 508651 520481
17137E20481j26245K40948j29270M0123q7451n6505J59022J07092K18922k29201
$$ 520481 394236 635184 505914 546037 458586 402081 561103 668195 887117 657916
17127F57916K6202j59595N2460q2657k44839M85234B98988L21531K78540D04354
$$ 657916 684118 524523 576983 494326 249487 734721 298988 620519 899059 404354
17116F54674B28372M52329k69203L28207k854J17209j72571B65480M28434k15785
$$ 654674 228372 680701 411498 739705 736851 854060 681489 265480 693914 478129
17106D78129J23692n8870r9363J87500k34747L56906j26252k81129L74615J14689
$$ 478129 601821 542951 443588 631088 396341 753247 626995 345866 720481 835170
17096H35170l36038K01383q5721o9279o6097K39302j02591j1606K68031k17634
$$ 835170 499132 700515 614794 545515 479418 718720 616129 604523 872554 654920
17086F54920K54883k93403P3370l18032j7728L67841l04409K10245j45650K91150
$$ 654920 909803 616400 689770 371738 354010 721851 417442 627687 482037 773187
17076G73187k55992J78052L1752J47129D31720L64090j70369j33717p975K02312
$$ 773187 517195 695247 726999 874128 431720 795810 625441 491724 483749 686061
17066F86061J63295P971j92558k40229O37406m19423K82974k67910M7056K66591
$$ 686061 849356 857327 664769 424540 1061946 642523 925497 657587 704643 971234
17056I71234l19207m1128J96023K8302k87273K34627J30720l9940M7939j85303
$$ 971234 652027 610899 806922 835224 547951 782578 913298 873358 921297 735994
17046G35994K19649k80855L80461p7664k91473k9759L03787l1312K93312m55869
$$ 735994 955643 674788 1055249 977585 686112 656353 960140 928828 1222140 766271
17036G66271J73017l6103j68218N6391J61265r2272J92380j27189K33984j82211
$$ 766271 939288 903185 734967 791358 952623 860351 1052731 925542 1159526 977315
17026I77315Q9960k34509j38440M98272l72143j69029L68748j59887j4058K27267
$$ 977315 1067275 832766 694326 1192598 820455 651426 1020174 860287 846229 1073496
17016A073496j12978j78847K17645J48439K676P9744k13504l04182J14781M03607
$$ 1073496 960518 781671 999316 1147755 1150431 1230175 1016671 712489 827270 1230877
17006A230877j16423j01036k57595L74305k52204K18322j11699o6758j56603j12804
$$ 1230877 1114454 1013418 755823 1130128 877924 1096246 984547 917789 761186 648382
16996F48382L95946R1294L647P920O2521J17939j50093R359k70818M67958n15233
$$ 648382 1044328 1135622 1139269 1147189 1209710 1327649 1177556 1186915 916097 1384055 868822
16985H68822J43291J53684M4261j99462k2538J28066K54968j91673l92637J53680
$$ 868822 1012113 1165797 1210058 1010596 988058 1116124 1371092 1179419 786782 940462
16975I40462L95334r2456L41289m95559Q9066k06950M12918l10463k40682L14599
$$ 940462 1335796 1243340 1584629 1089070 1178136 971186 1384104 1073641 832959 1147558
16965A147558L38815j96942r017J3809n004q2773R0720O8420J46998m8576J98458
$$ 1147558 1486373 1289431 1280414 1294223 1289219 1206446 1297166 1365586 1512584 1464008 1662466
16954A662466j57334J30955m59517L24925m6887O7847k94740N07168m26387M81177
$$ 1662466 1505132 1636087 1176570 1501495 1454608 1522455 1227715 1734883 1308496 1789673
16944A789673m1513m43312M38675P2284P4999k38473K3821J09488k09967k102
$$ 1789673 1748160 1304848 1743523 1815807 1890806 1652333 1676154 1785642 1575675 1573573
16934A573573L27948k75770j76415K61243m2196j78656Q6280J37622J17764K38232
$$ 1573573 1901521 1625751 1449336 1710579 1668383 1489727 1576007 1713629 1831393 2069625
16924B069625l0416l94183L41070R9065j18858J48242j74538k6275p6282Q9669
$$ 2069625 2039209 1645026 1986096 2085161 1966303 2114545 1940007 1913732 1837450 1927119
16914A927119k00787j4073Q7889N79201m62429J28922j02049M70926M0543l26738
$$ 1927119 1726332 1712259 1800148 2379349 1916920 2045842 1943793 2414719 2455262 2128524
16904B128524m5473O17271n29784J65826J7074J02259k50098Q9620M02201j63548
$$ 2128524 2083051 2700322 2170538 2336364 2353438 2455697 2205599 2295219 2697420 2533872
16894B533872j42747n2863o2055J67768J27163q3498K3753K57695k25602K72187
$$ 2533872 2391125 2338262 2276207 2443975 2571138 2487640 2511393 2769088 2543486 2815673
16884B815673k21101J40702K05109j39142L3807j64834R6033L01454J31385k51316
$$ 2815673 2594572 2735274 2940383 2801241 2835048 2670214 2766247 3067701 3199086 2947770
16874B947770K50874j01386J25753N5302k70401L51775l36851M96356N9036m5680
$$ 2947770 3198644 3097258 3223011 3278313 3007912 3359687 3022836 3519192 3578228 3532548
16864C532548k7350P938P935K28964m27786M31505m02622N44158J77596k00810
$$ 3532548 3505198 3513136 3521071 3750035 3322249 3753754 3351132 3895290 4072886 3872076
16854C872076J17848M03224l91500J5902l5776K05067l46948L15808L20022j12024
$$ 3872076 3989924 4393148 4001648 4017550 3981774 4186841 3839893 4155701 4475723 4363699
16844D363699J3975J16849k35846J94050P30433l75412K03740J82626l2838p5389
$$ 4363699 4377674 4494523 4258677 4452727 5183160 4807748 5011488 5194114 5161276 5085887
16834E085887J21719l98223N34470J57599r2090k49593L71352J70411J74141n09825
$$ 5085887 5207606 4809383 5343853 5501452 5409362 5159769 5531121 5701532 5875673 5365848
16824E365848Q06174K04432l67556K35782J82645O5943K20693k53637K54857L54560
$$ 5365848 6172022 6376454 6008898 6244680 6427325 6493268 6713961 6460324 6715181 7069741
16814G069741m2046J10223M13275J11690j37661K07941q422M49429J71318K59414
$$ 7069741 7027695 7137918 7551193 7662883 7525222 7733163 7724741 8174170 8345488 8604902
16804H604902Q2288J94499k017K74056q8842O3678P11238l7430L53071J0357N68136
$$ 8604902 8687190 8881689 8879672 9153728 9064886 9128564 9839802 9802372 10155443 10165800 10733936
16793A0733936Q7839k87736N75876K49510M80846j25081N45219l5106L76364M57095
$$ 10733936 10821775 10534039 11109915 11359425 11840271 11715190 12260409 12225303 12601667 13058762
16783A3058762K10478K90034O06716J02637L14968P33092j01620O46942K56809
$$ 13058762 13269240 13559274 14165990 14268627 14583595 15316687 15215067 15862009 16118818
16774A6118818O83668q5556P18477O01075J86700N27719P41255N77941O02799
$$ 16118818 16802486 16716930 17435407 18036482 18223182 18750901 19492156 20070097 20672896
16765B0672896M38566O76616M71931P38966J010942M97838R97922L84411J052131
$$ 20672896 21111462 21788078 22260009 22998975 24009917 24507755 25505677 25890088 26942219
16756B6942219R55380Q99956Q24360Q28811J152405J278083J064300J099529J149902
$$ 26942219 27897599 28797555 29621915 30450726 31603131 32881214 33945514 35045043 36194945
16747C6194945J511610J281275J438932J475316J535088J414094J911283J862944
$$ 36194945 37706555 38987830 40426762 41902078 43437166 44851260 46762543 48625487
16739D8625487J604798K272160K031883K174955K164092K548718K207447K611045
$$ 48625487 50230285 52502445 54534328 56709283 58873375 61422093 63629540 66240585
16731F6240585K667440L007673K742697K724591L086262L025845L544952L138973
$$ 66240585 68908025 71915698 74658395 77382986 80469248 83495093 87040045 90179018
16723I0179018L036220L488451L899675L491411L226738L410937L190095L152625
$$ 90179018 93215238 96703689 100603364 104094775 107321513 110732450 113922545 117075170
16715A17075170L313725L158409K626815K200202K243021K058394J345265J520957
$$ 117075170 120388895 123547304 126174119 128374321 130617342 132675736 134021001 135541958
16707A35541958N12578O53933l60450o16886l79791j376473j604266j950706k324196
$$ 135541958 136054536 136708469 136348019 135731133 135351342 133974869 132370603 130419897 128095701
16698A28095701k857741k696490l196043l237628l170120l392918m025049l296220
$$ 128095701 125237960 122541470 119345427 116107799 112937679 109544761 105519712 102223492
16690A02223492l592227l666628l651691l071886l875833l151674l310301k859466
$$ 102223492 98631265 94964637 91312946 88241060 84365227 81213553 77903252 75043786
16682G5043786l175163k786370k718560k572049k926682k277046k524868k178245
$$ 75043786 71868623 69082253 66363693 63791644 60864962 58587916 56063048 53884803
16674E3884803k072455j938702k257118j809891j469472j761396j694963j277752
$$ 53884803 51812348 49873646 47616528 45806637 44337165 42575769 40880806 39603054
16666C9603054j726096j491195j571257q01291j333719p53913j611501r72033
$$ 39603054 37876958 36385763 34814506 34013215 32679496 31925583 30314082 29342049
16658B9342049r30071r17698q13201j294924l26566p36683r70198q44251n43300
$$ 29342049 28411978 27494280 26681079 25386155 25059589 24322906 23352708 22508457 21965157
16649B1965157o57741o68042l96358p67499o55259o97716o50170k10808n12067
$$ 21965157 21307416 20639374 20243016 19475517 18820258 18122542 17472372 17261564 16749497
16640A6749497k56719n36121o64725k4655m36421l99549o07845l40156l16826
$$ 16749497 16492778 15956657 15291932 15267277 14830856 14431307 13823462 13483306 13166480
16631A3166480k09943l48429j52234l82187k02158j54104m27529n18256o0443
$$ 13166480 12956537 12608108 12455874 12073687 11871529 11717425 11289896 10771640 10711197
16622A0711197l34563k17594m42328r0389p5133m94905o2406o6938m06635j52093
$$ 10711197 10376634 10159040 9716712 9626323 9551190 9056285 8993879 8926941 8520306 8368213
16612H368213j25766P3498l68994j15382J44162l81551k95189j992J13137r100
$$ 8368213 8242447 8315945 7946951 7831569 7975731 7594180 7298991 7296999 7410136 7401036
16602G401036k86506k87961l87746k5503l3465k18234J29701n1838l00676Q5229
$$ 7401036 7114530 6826569 6438823 6413320 6379855 6161621 6291322 6239484 5938808 6024037
16592F024037R4062m19702o4189j12418j3199j20249L919J15096k94712l33913
$$ 6024037 6118099 5698397 5634208 5521790 5508591 5388342 5392261 5507357 5212645 4878732
16582D878732n4644j42340J06509j95540K0885J82566j66832k49615n5979q0708
$$ 4878732 4824088 4681748 4788257 4592717 4613602 4796168 4629336 4379721 4323742 4243034
16572D243034O5448m18327j34674M73330m35840M49970n90708K93607l45120J22268
$$ 4243034 4308482 3890155 3755481 4228811 3792971 4242941 3652233 3945840 3600720 3722988
16562C722988J20922m1440j46759j35907r4688k03361q7731K66144j4484Q6698
$$ 3722988 3843910 3802470 3655711 3519804 3425116 3221755 3134024 3400168 3385684 3472382
16552C472382j59507l97167L05633n85142N11975o8092j9561J5521m92751J02724
$$ 3472382 3312875 2915708 3221341 2636199 3148174 3080082 3060521 3076042 2583291 2686015
16542B686015k1412K19711J5450K0887j25888l31842P6297J51177l88705M53719
$$ 2686015 2664603 2884314 2899764 2920651 2794763 2462921 2539218 2690395 2301690 2755409
16532B755409m36136J91754j07427K7242m7767L68630l55495L17038k79236m76827
$$ 2755409 2319273 2511027 2403600 2430842 2383075 2751705 2396210 2713248 2434012 1957185
16522A957185N20023n08468M79914l53157J02215n7635j86295J97898j98951K3588
$$ 1957185 2477208 1968740 2448654 2095497 2197712 2140077 1953782 2151680 1952729 1976317
16512A976317p5243k906J07897R2149J94301p01255K90944M9141m3988k32146
$$ 1976317 1901074 1898168 2006065 2098214 2292515 1591260 1882204 1931345 1887357 1655211
16502A655211K383P378p2810K86058m76262L45969l9012L5303j80863L73646l20359
$$ 1655211 1657594 1664972 1592162 1878220 1401958 1747927 1708915 1744218 1563355 1937001 1616642
16491A616642j10687J76384k18012L92104m07990K15580O9238j62893k67880J68595
$$ 1616642 1505955 1682339 1464327 1856431 1448441 1664021 1733259 1570366 1302486 1471081
16481A471081K0902j25669L65675n88261J34398k2635l205o0771L42079k76781
$$ 1471081 1491983 1366314 1731989 1143728 1278126 1255491 1252286 1191515 1533594 1256813
16471A256813J91921k3302m25752L96879m02903J35586J32484J8720J43160k33541
$$ 1256813 1448734 1425432 999680 1396559 993656 1129242 1261726 1280446 1423606 1190065
16461A190065j26637K34647j62597n9107J52432j36734R9665K48648n06941p5446
$$ 1190065 1063428 1298075 1135478 1076371 1228803 1092069 1191734 1440382 933441 857995
16451H57995K84044J09066J08613j19292k61606J86841O3018j49229K32044m82139
$$ 857995 1142039 1251105 1359718 1240426 978820 1165661 1228679 1079450 1311494 829355
16441H29355J55017n2525R3561r6907N1308Q0205J15823k43885j26738Q1931P0296
$$ 829355 984372 931847 1025408 928501 979809 1060014 1175837 931952 805214 887145 957441
16430I57441K89652l09135M8119k52149J73921n1356M16167F25786K75096L4001
$$ 957441 1247093 937958 986077 733928 907849 856493 1272660 625786 900882 934883
16420I34883o8627L22265l27129m3609J2481k36535K35474K84497l36411j09605
$$ 934883 866256 1188521 861392 817783 830264 593729 829203 1113700 777289 667684
16410F67684q4252L65396j13982J21195k12298K48785k44859j26444L38539p3324
$$ 667684 583432 948828 834846 956041 743743 992528 747669 621225 959764 886440
16400H86440J24658k45623K47838D83744M35278j89k58402L9641Q4949l99K90108
$$ 886440 1011098 765475 1013313 483744 919022 918833 660431 700072 785021 784622 1074730
16389A074730j96043j43403l4023m5495k33316L78129j47888K4852J02713j83178
$$ 1074730 878687 735284 701261 655766 422450 800579 652691 677543 780256 597078
16379E97078K37780l15939L12717J95423j3223m37755J26490L3674n9257N9189
$$ 597078 834858 518919 831636 1027059 1013836 576081 702571 736245 676988 736177
16369G36177m9490K99117k20556j98469K32075j11232K15673r1311l70205K80817
$$ 736177 686687 985804 765248 566779 798854 687622 903295 811984 441779 722596
16359G22596j59940k18054K75870j84987L02902A93377N36403l0133l8511M7281
$$ 722596 562656 344602 620472 435485 738387 193377 729780 699647 661136 708417
16349G08417l1629C30983M44359L6615r9069Q7050l29822N0922K36229C04427
$$ 708417 676788 330983 775342 811957 712888 799938 470116 521038 757267 304427
16338D09194m0609m2392K88833J49636H6741M26838o9640L80519B39957M71447
$$ 409194 368585 326193 615026 764662 86741 513579 443939 824458 239957 711404
16328G11404K8066k46135K86193j62345B20736M86327j96791B11245M68279j83596
$$ 711404 739470 493335 779528 617183 220736 707063 510272 211245 679524 495928
16318D95928L6078j43284J61930r2293J32999k90124J77809M7742j21515M18309
$$ 495928 532006 388722 550652 458359 591358 301234 479043 526785 405270 823579
16308H23579k18936k80567q1331J21226J3961q3798o9707K39563o0904J44774
$$ 823579 604643 324076 242745 363971 377932 294134 224427 463990 403086 547860
16298E47860j76392j23663L17542A57261K79986o486j82617J45605o4920J7192
$$ 547860 371468 247805 565347 157261 437247 430761 248144 393749 328829 346021
16288C46021j5306k4490J36206o6704P0934J6868o9394m8315J78973A88913M41573
$$ 346021 330715 306225 442431 375727 446661 463529 394135 345820 524793 188913 630486
16277F30486B66568q7696K54777o7100A55795P2327L06640o3673A07075K27350
$$ 630486 266568 178872 433649 366549 155795 228122 534762 471089 107075 334425
16267C34425n323m2749J21755j44101K7028K13775A16312M77163k40853q7683
$$ 334425 329102 286353 408108 264007 291035 504810 116312 593475 352622 264939
16257B64939K99725J7482A38132L45460K343Q4396r5935R7899A74365M97964k20824
$$ 264939 564664 582146 138132 483592 485935 570331 474396 572295 174365 672329 451505
16246D51505j06187j12960J25788K5338J24197j7526j36445j72664J58901m6862
$$ 451505 345318 232358 358146 383484 507681 490155 353710 181046 339947 293085
16236B93085K8740B3635P0498J65640K30399j98059n6791J86602b2416e138B78231
$$ 293085 321825 23635 94133 259773 490172 292113 235322 421924 -22416 -5138 278231
16224D21083j31860F0171R9472P8923q0029D8119N974K18815J052J00809D7884
$$ 421083 289223 60171 159643 238566 158537 48119 54093 272908 273960 374769 47884
16212E30281A81816L57645B23078G4675J01224n0318K75527i1745H7604N86039
$$ 530281 181816 539461 223078 74675 175899 125581 401108 -91745 87604 673643
16202F73643e223E7579c6759C34203A33494a4071C65438j77753h9861C25805b17252
$$ 673643 -5223 57579 -36759 334203 133494 -14071 365438 187685 -89861 325805 -217252
16190A00464J59681a69629C25865m5369A00667R5632b5949A71464L1416l1606
$$ 100464 260145 -169629 325865 280496 100667 196299 -25949 171464 202880 171274
16180A71274F6112P0397C9750a18126B82674E3112J55831F8049P5789J75753d4247
$$ 171274 66112 136509 39750 -118126 282674 53112 208943 68049 143838 319591 -44247
16168I6025J34588o1528J28727j02490F8849c6322B51499j10458K4673o5976J87228
$$ 96025 230613 169085 297812 195322 68849 -36322 251499 141041 165714 99738 286966
16157B86966A8165L59348C6412K43672A27120K30689J89047a64783B74992h60
$$ 286966 18165 377513 36412 280084 127120 357809 546856 -164783 274992 -860
16146I7302M0348R3500n6062P6191l4346m764n6817g0526B60823A17142l0023
$$ 97302 137650 231150 175088 251279 216933 212169 155352 -70526 260823 117142 87119
16135H7119a64206B11131J3899f7793j78320F3166J83523e7886A90984A3845a2629
$$ 87119 -164206 211131 225030 -67793 -246113 63166 246689 -57886 190984 13845 -12629
16123B33027C1907L56678q3051j34826M8572a5341A56958O4338q196n8547j2232
$$ 233027 31907 388585 305534 170708 219280 -15341 156958 221296 213100 154553 142321
16112A42321e3390B12237b7793D37703e6067C2878J18750c51470A50194l2970
$$ 142321 -53390 212237 -27793 437703 -56067 32878 151628 -351470 150194 117224
16102A17224J55533g5588D1458q681c1406F9888g3391B88781a72755A7258e3980
$$ 117224 272757 -75588 41458 32777 -31406 69888 -73391 288781 -172755 17258 -53980
16090A76703K84651B22489c1801C80708A10513J5364g3714B4471h8097A76194
$$ 176703 461354 222489 -31801 380708 110513 125877 -73714 24471 -88097 176194
16079A12727d8957B38999d8379q2604C68400h4090C85239a18046C38075A54908
$$ 112727 -48957 238999 -48379 -130983 368400 -84090 385239 -118046 338075 154908
16068a21891g60C29934E3087d4507B43514A03495K12943b32654b8030E50548A85949
$$ -121891 -760 329934 53087 -44507 243514 103495 316438 -232654 -28030 550548 185949
16056f0837E2487A5641J2517q501L68663N3491F6242b5042G1748a17001k3092
$$ -60837 52487 15641 28158 19657 388320 441811 66242 -25042 71748 -117001 -140093
16045a40093F334M27576A8244b4908A00199b73215i453B29920F7213P809J18314
$$ -140093 6334 433910 18244 -24908 100199 -273215 -9453 229920 67213 75022 193336
16034A93336I118e675A1012a6551j26766O8419A05477A5319M99K63786j06723
$$ 193336 9118 -5675 11012 -16551 -143317 -74898 105477 15319 15818 279604 172881
16023A72881M5777e9125A74571a58720A53007B5346e201C13143j29651F6874J41753
$$ 172881 218658 -59125 174571 -158720 153007 25346 -5201 313143 183492 66874 208627
16012B08627h8347j8547A40386g6658A29870m6265L9369l4538J27430p0339c7995
$$ 208627 -88347 -106894 140386 -76658 129870 83605 122974 88436 215866 145527 -37995
16000B9985J05908a25052A17098J42817B621i170E9542a72145O1757B88886a04939
$$ 29985 135893 -125052 117098 259915 2621 -9170 59542 -172145 -110388 288886 -104939
15988a61338G5416j8297a73742q6373D5133g7520B23973i1190A27278B6006I614
$$ -161338 75416 57119 -173742 -260115 45133 -77520 223973 -91190 127278 26006 9614
15976A42997h0171B35239A06247L22137J90183k02957N88022j86812J38250k5250
$$ 142997 -80171 235239 106247 428384 618567 415610 1003632 816820 955070 929820
15966I29820D36089R1276B12082m4554J4199Q059a05542E7604b61084C21627e2425
$$ 929820 436089 527365 212082 167528 181727 189786 -105542 57604 -261084 321627 -52425
15954a31164C78542a80284N9628E4040a48036j9063B66282C5159c05514a36765
$$ -131164 378542 -180284 -120656 54040 -148036 -167099 266282 35159 -305514 -136765
15943b9256j61477B39961R0325C1623L7803d05122a79627f414n1150n5885A30383
$$ -29256 -190733 239961 330286 31623 69426 -405122 -179627 -6414 -57564 -113449 130383
15931H2252c44006B35397n5189n9106L1364c60264i608j50239A43528b34926d5638
$$ 82252 -344006 235397 180208 121102 152466 -360264 -9608 -159847 143528 -234926 -45638
15919A43628a62176l3247B7536N071d2678n7792K7658A89876c4377m9260l5079
$$ 143628 -162176 -195423 27536 32607 -42678 -100470 -72812 189876 -34377 -83637 -118716
15908a18716A64556P1390r1437a44146K9527L0061C33125j56477E9158c4943j21713
$$ -118716 164556 235946 144509 -144146 -114619 -84558 333125 176648 59158 -34943 -156656
15897a56656e8023p4744q044b0288j77926J0709f2344B7806a3524j24945a238
$$ -156656 -58023 -132767 -140811 -20288 -198214 -187505 -62344 27806 -13524 -138469 -1238
15885a12507r8185j04991k1139A03892b06424C6155J41458a8923q654j70889e6474
$$ -112507 -210692 -315683 -336822 103892 -206424 36155 177613 -18923 -27577 -198466 -56474
15873b8552D74384B01305c40959Q5742A48681J88887d5409A00677B0592c5049
$$ -28552 474384 201305 -340959 -255217 148681 337568 -45409 100677 20592 -35049
15862A79673b9030k21769D2358M9805J8391d5606l0628p7373L0419J1521k2460
$$ 179673 -29030 -250799 42358 92163 110554 -45606 -76234 -153607 -123188 -111667 -134127
15851a34127j55249I0227P3615h3732B13070B8152Q907b18219g96q8571E696K19343
$$ -134127 -289376 90227 163842 -83732 213070 28152 37059 -218219 -796 -89367 5696 225039
15839B25039a3562j26127F3499b6862E6181a18917c079n4207L198J0987n4165
$$ 225039 -13562 -139689 63499 -26862 56181 -118917 -3079 -57286 -54088 -43101 -97266
15828i7266a6310l65317B30314e3187C763c124H1443g4006K6819A13349a10494
$$ -97266 -16310 -381627 230314 -53187 3763 -3124 81443 -74006 -47187 113349 -110494
15816d4240A75988B2674L5204R2462G028b65123G631b38182e4161j73041K9110
$$ -44240 175988 22674 57878 150340 7028 -265123 7631 -238182 -54161 -227202 -198092
15805a98092A92251R2464a85381D6693a25789B31347G2658R5676a20752A74747
$$ -198092 192251 284715 -185381 46693 -125789 231347 72658 168334 -120752 174747
15794F0565a46649O6366A04470G057a48963a8081H4343J47646I8515i6331l4582
$$ 60565 -146649 -80283 104470 7057 -148963 -18081 84343 231989 98515 -96331 -130913
15783a30913B33788D149b69879e2570m1770M2142j7116K3165A95829r1961A9096
$$ -130913 233788 4149 -269879 -52570 -94340 -52198 -69314 -46149 195829 103868 19096
15771a05909A24188b35342I9580b30578Q403k1721A44562a04197b0347A18371
$$ -105909 124188 -235342 99580 -230578 -222175 -243896 144562 -104197 -20347 118371
15760e3282b813A42655g6807A85178q0793a3143A91931f8505P320a6213p1993
$$ -53282 -2813 142655 -76807 185178 104385 -13143 191931 -68505 -61185 -16213 -88206
15749h8206I0392K43157c2581I1691l3024c53451b2558B07125I2739A121e0829
$$ -88206 90392 333549 -32581 91691 58667 -353451 -22558 207125 92739 1121 -50829
15737A31332a40894j2947H9633B6555b56964G0969d4116I6759a03995a3601m2047
$$ 131332 -140894 -153841 89633 26555 -256964 70969 -44116 96759 -103995 -13601 -55648
15726e5648A90629i9184p5593c1200E2247d21283h1775j63701B19745I3241h2741
$$ -55648 190629 -99184 -174777 -31200 52247 -421283 -81775 -245476 219745 93241 -82741
15714a63841j46665A47596a60202Q786A18411J56514a45266j89914H3033L8898
$$ -163841 -310506 147596 -160202 -151416 118411 274925 -145266 -335180 83033 121931
15704A21931b01333O2006E9211O4351b28368D1536i9085m08090Q6658a5766j97181
$$ 121931 -201333 -139327 59211 123562 -228368 41536 -99085 -507175 -420517 -15766 -212947
15693b12947A65539a98627H8824c6818A18369K12568L2767c67864a82736o9732
$$ -212947 165539 -198627 88824 -36818 118369 330937 363704 -367864 -182736 -252468
15683b52468A32031n4048g7932A20583E664c1003m449H0468k2326K41654J28302
$$ -252468 132031 77983 -77932 120583 5664 -31003 -35452 80468 58142 299796 428098
15672D28098G1993L08093F62J46051a28522G6676M3359a32042B31697A05964r885
$$ 428098 71993 380086 662 146713 -128522 76676 120035 -132042 231697 105964 96079
15661I6079c28303C4291J06324c234E6540a50029M2837k74375A12122N947j5682
$$ 96079 -328303 34291 140615 -3234 56540 -150029 -107192 -381567 112122 118069 102387
15650A02387J03061H3196a97974A30630Q9232b19200e5904A0596a03041B53324
$$ 102387 205448 83196 -197974 130630 219862 -219200 -55904 10596 -103041 253324
15639B94233G3153b06096J8360P8787d1766B18294a32755d4314j56020a7177m3377
$$ 294233 73153 -206096 -187736 -108949 -41766 218294 -132755 -44314 -200334 -17177 -60554
15628f0554l1792A31400C8383b03263B40967d53457a97432B5996a30161k0709
$$ -60554 -92346 131400 38383 -203263 240967 -453457 -197432 25996 -130161 -150870
15618a50870L2056k79947a58138B27468e6050m0239I0882F010b25528f0529A51286
$$ -150870 -118814 -398761 -158138 227468 -56050 -96289 90882 6010 -225528 -60529 151286
15606b51904f9122k45008n0642Q3908g7617B36957a37884b276C01527C403b17391
$$ -251904 -69122 -314130 -364772 -280864 -77617 236957 -137884 -2276 301527 3403 -217391
15594I3015K03857B3922f6851k19770a04596M2076B31121e5703B79964c9165k37619
$$ 93015 296872 23922 -66851 -286621 -104596 -62520 231121 -55703 279964 -39165 -276784
15583b76784J02410f1453j07551B71533A12309J08680a06186K5851A44695J0698
$$ -276784 -174374 -61453 -169004 271533 112309 220989 -106186 -80335 144695 155393
15573A55393a79988D6139L9586b7941F1606e10163A31625J00079a47011B59722
$$ 155393 -179988 46139 85725 -27941 61606 -510163 131625 231704 -147011 259722
15562A31413C2455b85362i2351A25490b32294D9807c60082c0609C30883b04026
$$ 131413 32455 -285362 -92351 125490 -232294 49807 -360082 -30609 330883 -204026
15551d5847B38102l9428b80630J36186A30225d3131B67131a97954k1263A26359
$$ -45847 238102 198674 -280630 -144444 130225 -43131 267131 -197954 -219217 126359
15540A06086M0992b55073O154j92121a24909D9544h7259A45299a20424a9202E6224
$$ 106086 147078 -255073 -248919 -441040 -124909 49544 -87259 145299 -120424 -19202 56224
15528B01764j1742a57255M8157L5152L4906B67825c634B4294O6798M5578O6070
$$ 201764 190022 -157255 -109098 -73946 -39040 267825 -3634 24294 91092 136670 202740
15517B02740b96099B12346l4061H1169k1991a34536B8604c6414k36471B24758
$$ 202740 -296099 212346 178285 81169 59178 -134536 28604 -36414 -272885 224758
15506A72682F6309J834Q2437N1912I3629J82824E0172b78040B81190j24187L7553
$$ 172682 66309 68143 150580 202492 93629 276453 50172 -278040 281190 157003 194556
15495A94556l2237J67995a32788A57858c8773B25081I6044B0945O3136b0194E6731
$$ 194556 162319 330314 -132788 157858 -38773 225081 96044 20945 84081 -20194 56731
15483B77183E5585a38793A11018k8405K43255m8206G3683d0547B41132m8723b4095
$$ 277183 55585 -138793 111018 82613 325868 277662 73683 -40547 241132 192409 -24095
15471G1498k4792a43788N7884A02131e8482A77815h2800K9278D6809c2506B31270
$$ 71498 46706 -143788 -85904 102131 -58482 177815 -82800 -53522 46809 -32506 231270
15459C08897L491K61861O434j09149A21646k9415J29146L3415F7990C0946J9618
$$ 308897 312388 574249 580683 471534 121646 92231 221377 254792 67990 30946 50564
15448E0564Q5438a21236E03760H264a21483D7268J34241H7872J9370h5340A44823
$$ 50564 136002 -121236 503760 8264 -121483 47268 181509 87872 107242 -85340 144823
15436A25543l1657J20808d099j07289D6378J39616J88548J93623j47993K40046
$$ 125543 93886 214694 -4099 -111388 46378 185994 374542 568165 420172 660218
15426F60218J70843K22488J14927n64316D2386N08984k10244j32530H6129m0582
$$ 660218 831061 1053549 1168476 604160 42386 551370 341126 208596 86129 45547
15416D5547J84030c8749o4861C21911d4198B98962a67161M3584A46141m1654J34338
$$ 45547 229577 -38749 -103610 321911 -44198 298962 -167161 -123577 146141 104487 238825
15405B38825A8874L89791c50101A03845A4474J81494f8233C33700A21507J08981
$$ 238825 18874 408665 -350101 103845 14474 195968 -68233 333700 121507 230488
15395B30488d28618a18455C59228f890j19173e5506A70056d3487i333B07548a48343
$$ 230488 -428618 -118455 359228 -6890 -126063 -55506 170056 -43487 -9333 207548 -148343
15383C0757L6416J32831l472f869A60272e5134H2125b28044f0142j03043G5673
$$ 30757 67173 200004 196532 -6869 160272 -55134 82125 -228044 -60142 -163185 75673
15371D4928b71506B93258a34271A72055f1663l0220A14716m4516K36779F6927
$$ 44928 -271506 293258 -134271 172055 -61663 -91883 114716 70200 306979 66927
15360H5385b3085A36306Q7363M05480a3641A31897n0184Q2586a2010B61613G7457
$$ 85385 -23085 136306 223669 629149 -13641 131897 81713 164299 -12010 261613 77457
15348B89375J56438A03996L17108B4162Q2245J77864A30422b4060B57085m228
$$ 289375 445813 103996 421104 24162 106407 284271 130422 -24060 257085 252857
15338B52857A0124J63316C7667J31651N942P750K33997b0489D7965k3359J48480
$$ 252857 10124 173440 37667 169318 175260 183010 417007 -20489 47965 24606 173086
15327A73086d9572H62089l14282B11809A02575l3518J71188J42230a05433A68121
$$ 173086 -49572 862089 547807 211809 102575 69057 240245 382475 -105433 168121
15316d5600j2506A08771M81237d002B28096a06308C13775K4497e8185B57126E1296
$$ -45600 -58106 108771 590008 -4002 228096 -106308 313775 338272 -58185 257126 51296
15304E0612K55684A28345E3658J23089k1116a73291P2185D2662N408Q9099L6553
$$ 50612 306296 128345 53658 176747 155631 -173291 -101106 42662 48070 137169 173722
15293A73722H1227L32999e7198j54079A58054C548N23987B5036a49382J9602B71769
$$ 173722 81227 414226 -57198 -211277 158054 3548 527535 25036 -149382 -129780 271769
15281C50657A6345f7304F7248K23121J3700b1462H6645J74116j05734i733m4048
$$ 350657 16345 -67304 67248 290369 304069 -21462 86645 260761 155027 -9733 -53781
15270e3781A66336D7912J83118n5243D5324M647J95767d7781A26912b35313B58990
$$ -53781 166336 47912 231030 175787 45324 49971 245738 -47781 126912 -235313 258990
15258I3945N8196m9809a07642A2432Q9741h0043l9571C53996K852i3100E0274
$$ 93945 152141 102332 -107642 12432 102173 -80043 -119614 353996 356848 -93100 50274
15246B05698a37171G2649a58612F8296a5973j66882A63283p882b32450A82244
$$ 205698 -137171 72649 -158612 68296 -15973 -182855 163283 155401 -232450 182244
15235e5327j26509B13145F8769K60394j09622M39793J30317M73384K46693K3079
$$ -55327 -181836 213145 68769 329163 219541 659334 789651 1263035 1509728 1532807
15225A532807j32786k19843E26591k44848H0114M15715A17508R6792F5388K3208
$$ 1532807 1400021 1180178 526591 281743 80114 495829 117508 214300 65388 88596
15215H8596a47539g1165A64669P7485H1218J43450K0428e2098J1787B06167R953
$$ 88596 -147539 -71165 164669 242154 81218 224668 245096 -52098 -40311 206167 216120
15204B16120a7590j29455B15954a30049b1171A17133G256J65200E9227a76775
$$ 216120 -17590 -147045 215954 -130049 -21171 117133 7256 172456 59227 -176775
15193C22582A22450J6005j1273j9109f2354B82289a5302M381A20869a25766A20712
$$ 322582 122450 138455 127182 108073 -62354 282289 -15302 -10921 120869 -125766 120712
15181D02661n5627E1295N0126f5698c1108k24156A11869a34948A67249K77524
$$ 402661 347034 51295 101421 -65698 -31108 -255264 111869 -134948 167249 444773
15171D44773j25166h3305J4611N578B48423j16574b0347n4793e189C63159F2531
$$ 444773 319607 -83305 -68694 -63116 248423 131849 -20347 -75140 -5189 363159 62531
15159A76307F1754L21285A10139g4199A66141N3367J7288q2229K10328j17231
$$ 176307 61754 383039 110139 -74199 166141 219508 236796 154567 364895 247664
15149B47664h7841I7439m4001L5696a13976c3159A12303d4497B3544K1516b54990
$$ 247664 -87841 97439 53438 89134 -113976 -33159 112303 -44497 23544 45060 -254990
15137A4968J8331K43068A07764a08663I4625Q2440o4921l5110a18473q8168A94016
$$ 14968 33299 276367 107764 -108663 94625 177065 112144 77034 -118473 -206641 194016
15125A32927m7351f0860A38020J9951D6801J61234E7385K3432h7302H4155R9072
$$ 132927 85576 -60860 138020 157971 46801 208035 57385 80817 -87302 84155 183227
15114A83227J21110H4463a21865K3656C60172O9687k01176j09306N6339j3954
$$ 183227 304337 84463 -121865 -98209 360172 429859 228683 119377 175716 161762
15104A61762J36511N35653C86406j73936P3855K06640j75543L9127A39962A1437
$$ 161762 298273 833926 386406 212470 286325 492965 317422 356549 139962 11437
15093D02719n3219i5163B78228j03532B8022K55018h8033A63195a09077A20472
$$ 402719 349500 -95163 278228 174696 28022 283040 -88033 163195 -109077 120472
15082C09766O4071D3058K30057b031G7344i8673b7370C63247a07318A92666F3363
$$ 309766 373837 43058 273115 -2031 77344 -98673 -27370 363247 -107318 192666 63363
15070A90278J44575H0986b97868D5813L4631Q3447B9757L79171A38991J79695
$$ 190278 334853 80986 -297868 45813 80444 163891 29757 408928 138991 318686
15060C18686j59212J96785A67220K3264D1121a35652B36992L0343J4425h519A40730
$$ 318686 159474 356259 167220 190484 41121 -135652 236992 267335 281760 -8519 140730
15048C41047A44286B4754q568K20620N705N5566p4601a67636B48565m9444o152
$$ 341047 144286 24754 16186 236806 242511 298077 223476 -167636 248565 199121 192969
15037A92969F6422K78667A58333K44687G3541M13921r4417J70950A59032J50910
$$ 192969 66422 345089 158333 403020 73541 487462 393045 563995 159032 309942
15027C09942N9220K94447k41468l8283n3233J86594B56890J25833K27742n2813
$$ 309942 369162 663609 422141 383858 330625 517219 256890 382723 610465 557652
15017E57652K4739j2569J54216M92525m25831N3399k67580j29485N8209j24320
$$ 557652 582391 569822 724038 1216563 790732 844131 576551 447066 505275 380955
15007C80955N6461L2938J85482j08560p9155J99520A37839K46566r2701J08050
$$ 380955 437416 470354 655836 547276 468121 667641 137839 384405 291704 399754
14997C99754n1689K41151B35792K71961K93934j20037l19610q5027J43085A89363
$$ 399754 348065 589216 235792 507753 801687 681650 362040 277013 420098 189363
14986C09694P0895j65732Q6305J86559J0503L1212m665A30938J96763J1108J00674
$$ 309694 380589 214857 301162 487721 498224 529436 524771 130938 327701 338809 439483
14975D39483K0850j85880P9534J19317o9371o3903K42521L63258k26135Q7518
$$ 439483 460333 274453 353987 473304 403933 340030 582551 945809 719674 807192
14965H07192M1330j60904J10916j55577p6615p7330N4236m2497J31691M7494C17010
$$ 807192 848522 687618 798534 642957 566342 489012 543248 500751 632442 679936 317010
14953D60523J0456o8653K2383j95904P9753p7232N09318C41164k5165K44852j81839
$$ 460523 470979 402326 424709 228805 308558 231326 740644 341164 315999 560851 379012
14942C79012q7820J14906J12980k20988K8362m5923L71454C23495j06024M04102
$$ 379012 291192 406098 519078 298090 326452 280529 651983 323495 217471 621573
14932F21573P8487F9340M03413L45866j43194K17594k54697J01444k4969l31445
$$ 621573 700060 69340 472753 818619 675425 893019 638322 739766 714797 383352
14922C83352M03514k71798O4800J2257o8834K83585J31511K77089k78307K06437
$$ 383352 786866 515068 579868 592125 523291 806876 938387 1215476 937169 1143606
14912A143606M96301k87537J90941R0860Q8610k09045J73137q7169J00533o57578
$$ 1143606 1639907 1352370 1543311 1634171 1722781 1513736 1686873 1599704 1700237 1042659
14902A042659Q16611J28965K893j9970k82863j26747k09458k00247m29631K91495
$$ 1042659 1859270 1988235 1991128 1971158 1688295 1561548 1352090 1151843 722212 1013707
14892A013707m62880N00830n10092j25188K90697j08236B68682K80783Q3601K3289
$$ 1013707 550827 1051657 541565 416377 707074 598838 268682 549465 633066 656355
14882F56355j64706l6056K11378j93113j98487M10931j32170J04302A89130M69427
$$ 656355 491649 455593 666971 473858 275371 686302 554132 658434 189130 658557
14872F58557k24571P3247Q4370J81463M8352j53528p6109J89860j57726L47527
$$ 658557 433986 507233 591603 773066 821418 667890 591781 781641 623915 971442
14862I71442C72937M96407K05602n31934L56524C90549M40963j1870k48574J37075
$$ 971442 372937 869344 1074946 543012 899536 390549 831512 819642 571068 708143
14852G08143K26225J28739l56805L5791L70363l66016k20045J95875m2892k62875
$$ 708143 934368 1063107 706302 742093 1112456 746440 526395 722270 679378 416503
14842D16503P9976R0109r1388O4832B21347N20327A74882K88957P0645J85942
$$ 416503 496479 586588 495200 560032 221347 741674 174882 463839 534484 720426
14832G20426k80087P3962L94723j52941k14591M32353j91363K40918K56301j13150
$$ 720426 440339 514301 909024 756083 541492 973845 782482 1023400 1279701 1166551
14822A166551P5471k21407l93385K56342l33296K31065k50252L8857j47398L37536
$$ 1166551 1242022 1020615 627230 883572 550276 781341 531089 569946 422548 760084
14812G60084o2460l03700M64437l86429K06277L1042A81417N50908K1132n2082
$$ 760084 697624 393924 858361 471932 678209 709251 181417 732325 753457 701375
14802G01375K112K16484O7250m32837M03893n6061l26420L59820m45486q9035
$$ 701375 703487 919971 987221 554384 958277 902216 575796 935616 490130 401095
14792D01095J17624P2089M07034j8799R537J52843D94323K32647j52562j97249
$$ 401095 518719 590808 997842 979043 988580 1141423 494323 726970 574408 377159
14782C77159J07561J25677A93939O77902n5835k99508M10794l35368J08311p7301
$$ 377159 484720 610397 193939 871841 816006 516498 927292 591924 700235 622934
14772F22934q1785J8600L29048D23252K25431k68423J31552L82908N6545k3855
$$ 622934 541149 559749 888797 423252 648683 380260 511812 894720 951265 927410
14762I27410j90559j60434J28718J2928J49330N0774j42744k48419K97428k20408
$$ 927410 736851 576417 705135 718063 867393 918167 775423 527004 824432 604024
14752F04024q2900L10414l42698R4890k5385L31544j83556k80431M73966k78994
$$ 604024 521124 831538 488840 583730 558345 889889 706333 425902 899868 620874
14742F20874J4954J9313N491p8507p1977K75536j24573P3262K7918R9862p5543
$$ 620874 635828 655141 660632 582125 510148 785684 661111 734373 762291 862153 786610
14731G86610P9178j98997L70748n12209L70688k16925K56880j52116k7263J67568
$$ 786610 865788 666791 1037539 525330 896018 679093 935973 783857 756594 924162
14721I24162K20176l91004j41584L40182K9387q1603L28609j17077l9362L96192
$$ 924162 1144338 753334 611750 951932 981319 899716 1228325 1111248 1071886 1468078
14711A468078J9360J41647l12287K20947j02054k29937L46512k66832l01850O0331
$$ 1468078 1487438 1629085 1316798 1537745 1435691 1205754 1552266 1285434 983584 1043915
14701A043915p1157L45978l68632k8737K2753J62256J77969k17988j40525J36147
$$ 1043915 972758 1318736 950104 921367 944120 1106376 1284345 1066357 925832 1061979
14691A061979M6499M3657J07280l44858Q30226p7639J8900K39307M7534k75040
$$ 1061979 1108478 1152135 1259415 914557 1744783 1667144 1686044 1925351 1972885 1697845
14681A697845j63651l01300k26059J28637P3845j65262K35532k48876L25444k45673
$$ 1697845 1534194 1232894 1006835 1135472 1209317 1044055 1279587 1030711 1356155 1110482
14671A110482k37471O9036K74097k55466Q0441J55000j74685j59494j75881K92642
$$ 1110482 873011 942047 1216144 960678 1041119 1196119 1021434 861940 686059 978701
14661I78701j75631O16366n68762J34651k13198J46753K4501M4020O1532K64688
$$ 978701 803070 1419436 850674 985325 772127 918880 943381 987401 1048933 1313621
14651A313621k85334k6411K84946k31434r3922L13058k23117N7660n144J12196
$$ 1313621 1028287 1001876 1286822 1055388 961466 1274524 1051407 1109067 1103923 1216119
14641A216119k34859M31376n8185l3065j15584M3480k35402K96394O9369j13743
$$ 1216119 981260 1412636 1354451 1321386 1205802 1249282 1013880 1310274 1379643 1265900
14631A265900K02102l70898L7961M18176n45857L76545l65608L35576J72208k67556
$$ 1265900 1468002 1097104 1135065 1553241 1007384 1383929 1018321 1353897 1526105 1258549
14621A258549O829k20086L01035k6485j94223J77268J85046O5632n8045j95924
$$ 1258549 1265378 1045292 1346327 1319842 1125619 1302887 1487933 1553565 1495520 1299596
14611A299596J92637m9848j66249M03152k90394j5568J59879j25142J55243L6902
$$ 1299596 1492233 1442385 1276136 1679288 1388894 1373326 1533205 1408063 1563306 1600208
14601A600208j07105k2678j8256L75416m61366j41161M17701j82666l9863R1850
$$ 1600208 1493103 1470425 1452169 1827585 1366219 1225058 1642759 1460093 1420230 1512080
14591A512080L13392m09941l4064K32679K29799k87210j14239l1337O92054m71019
$$ 1512080 1825472 1415531 1381467 1614146 1843945 1556735 1442496 1411159 2103213 1632194
14581A632194k7979J58683M6752n7437k5214o2532Q5867J61633j0541J5847j64704
$$ 1632194 1604215 1762898 1809650 1752213 1726999 1664467 1750334 1911967 1901426 1917273 1752569
14570A752569K9199O7561R4123r2344J67737N5648N637J07345J04962k60959K66024
$$ 1752569 1781768 1849329 1943452 1851108 2018845 2074493 2080130 2187475 2292437 2031478 2297502
14559B297502j95298o020J33807L17105l85188L45673j16875J0486P9412J41622
$$ 2297502 2102204 2096184 2229991 2547096 2161908 2507581 2390706 2401192 2480604 2622226
14549B622226J57511k30520J44500L49501l63010N80046J79495j66327N11769
$$ 2622226 2779737 2549217 2693717 3043218 2680208 3260254 3439749 3273422 3785191
14540C785191j07443N82710L12890Q45964O00757J338695K094079M418502O109508
$$ 3785191 3677748 4260458 4573348 5419312 6020069 7358764 9452843 13871345 19980853
14531A9980853J0234685L260114j3804529q212213m528020k041786o37538j41626
$$ 19980853 30215538 33475652 19671123 11458910 6930890 4889104 4251566 4109940
14523D109940J016451j084273q44070k48060l75935l26726K68111p394o839m20146
$$ 4109940 5126391 4042118 3198048 2949988 2574053 2247327 2515438 2508044 2501205 2081059
14513B081059J62283l2512P4191k65040M12955j62229M2555J57089Q533O0580
$$ 2081059 2243342 2210830 2285021 2019981 2432936 2270707 2313262 2470351 2478884 2539464
14503B539464l01222J79897M02726Q1558k27429K52676q3982k93542O87N1356
$$ 2539464 2238242 2418139 2820865 2902423 2674994 2927670 2843688 2550146 2550833 2602189
14493B602189Q41074k80002l53550p4890R884N26566j14687J69854l14355J35859
$$ 2602189 3443263 3163261 2809711 2734821 2744705 3271271 3156584 3326438 3012083 3147942
14483C147942k0058p487q1611J34975K02440Q1746K33618o4266j32892J86510
$$ 3147942 3127884 3120397 3038786 3173761 3376201 3457947 3691565 3627299 3494407 3680917
14473C680917J8277K25049j53159j7150k7878j93140M04886J57927K40294j48846
$$ 3680917 3699194 3924243 3771084 3753934 3726056 3532916 3937802 4095729 4336023 4187177
14463D187177j83172O3726O8186K66476k89704J82190r2661J52919K15476m8439
$$ 4187177 4004005 4067731 4135917 4402393 4112689 4294879 4202218 4355137 4570613 4522174
14453D522174K70741j35762K9099K70443J62360k38758J23087l74433M74265l68396
$$ 4522174 4792915 4657153 4686252 4956695 5119055 4880297 5003384 4628951 5103216 4734820
14443D734820L24226M53010m5941k2159J70612k33325L39198k14065J2399l7388
$$ 4734820 5059046 5512056 5466115 5443956 5614568 5381243 5720441 5506376 5518775 5481387
14433E481387L03819K69307Q1010n74633M44651J65046j06278m5748j88604P91624
$$ 5481387 5785206 6054513 6135523 5560890 6005541 6170587 6064309 6018561 5829957 6621581
14423F621581J01408J99166m15847L43642j25290M97864k79087q3070M48115r1895
$$ 6621581 6722989 6922155 6506308 6849950 6724660 7222524 6943437 6860367 7308482 7216587
14413G216587Q7070K12346J291N15652p7260p4029J08323K68573N9528O13575
$$ 7216587 7303657 7516003 7517294 8032946 7955686 7881657 7989980 8258553 8318081 8931656
14403H931656M5284Q7073j91787O70549p6486n0876k98473K90478K58717N4353
$$ 8931656 8976940 9064013 8872226 9542775 9466289 9415413 9116940 9407418 9666135 9720488
14393I720488K63997J73418J62656M44346j58264K32350Q4236P79173q06692N71648
$$ 9720488 9984485 10157903 10320559 10764905 10606641 10838991 10923227 11702400 10895708 11467356
14383A1467356j19277k69641P21419J62988L88610p8103J70809N56684R8462R861
$$ 11467356 11348079 11078438 11799857 11962845 12351455 12273352 12444161 13000845 13099307 13109168
14373A3109168K06587M74050K5086J03425N81310J61767K98065M19800K11489
$$ 13109168 13315755 13789805 13814891 13918316 14499626 14661393 14959458 15379258 15590747
14364A5590747M52131K24482M13852K66344Q3872k2225O34103K60999P06673L57629
$$ 15590747 16042878 16267360 16681212 16947556 17031428 17009203 17643306 17904305 18610978 18968607
14354A8968607J08150K45544O66831O91125r45P38282P33353K15462O58322J90144
$$ 18968607 19076757 19322301 19989132 20680257 20679312 21417594 22150947 22366409 23024731 23214875
14344B3214875L68967P49448M88170O34604L95774O44604J122722M71874R05111
$$ 23214875 23583842 24333290 24821460 25456064 25851838 26496442 27619164 28091038 28996149
14335B8996149M66780P89400O37073O65649J052785P84258P99159R66223Q89447
$$ 28996149 29462929 30252329 30889402 31555051 32607836 33392094 34191253 35157476 36046923
14326C6046923R60239J101197J041635J263457J312062P35795J623138Q66427
$$ 36046923 37007162 38108359 39149994 40413451 41725513 42461308 44084446 44950873
14318D4950873K005761J031397J585465J692569J245152K044423J971930J638752
$$ 44950873 46956634 47988031 49573496 51266065 52511217 54555640 56527570 58166322
14310E8166322J938488K063693K490402K155081K301113K741851K520593K815898
$$ 58166322 60104810 62168503 64658905 66813986 69115099 71856950 74377543 77193441
14302G7193441K773747L043628K850384L749141L554830L957867L984005M306369
$$ 77193441 79967188 83010816 85861200 89610341 93165171 97123038 101107043 105413412
14294A05413412L971858N081283N189069M843106N703012N985532N918864O703418
$$ 105413412 109385270 114466553 119655622 124498728 130201740 136187272 142106136 148809554
14286A48809554P586587O835857Q256708P938014Q869048R368655R472949R921275
$$ 148809554 156396141 163231998 171488706 179426720 188295768 197664423 207137372 217058647
14278B17058647J1288083J1567979J1995460J2563213J3353110J3304337J3914208
$$ 217058647 228346730 239914709 251910169 264473382 277826492 291130829 305045037
14271C05045037J4209985J3898387J3481619J3760636J3162026J3735545J2692093
$$ 305045037 319255022 333153409 346635028 360395664 373557690 387293235 399985328
14264C99985328J1609305J0892819J0367775R969680Q354634P673889N373741
$$ 399985328 411594633 422487452 432855227 442824907 451179541 458853430 464227171
14257D64227171J167747L40917J467249j34920p004802n009298p718946j0127847
$$ 464227171 465394918 465735835 467203084 467068164 460063362 455054064 447335118 437207271
14249D37207271j1682760j2880527j3888399j2914905j4935753j4465141j4349485
$$ 437207271 425524511 412643984 398755585 385840680 370904927 356439786 342090301
14242C42090301j4332172j4353469j4606640j4018848j3587253j2695627j2741880
$$ 342090301 327758129 313404660 298798020 284779172 271191919 258496292 245754412
14235B45754412j2687874j2218854j1014875j0922054j0072315r404823q874193
$$ 245754412 233066538 220847684 209832809 198910755 188838440 179433617 170559424
14228A70559424q195564p619680p496966p040270o064739n757009n911731n068961
$$ 170559424 162363860 154744180 147247214 140206944 134142205 128385196 122473465 117404504
14220A17404504m987506m968274m511178m580137l591769l833687l656078l085878
$$ 117404504 112416998 107448724 102937546 98357409 94765640 90931953 87275875 84189997
14212H4189997l544481k851529l133104k785821k395694k417220k468587j897619
$$ 84189997 80645516 77793987 74660883 71875062 69479368 67062148 64593561 62695942
14204F2695942k128733k327557j631780j891059j667144j562372j727314j151149
$$ 62695942 60567209 58239652 56607872 54716813 53049669 51487297 49759983 48608834
14196D8608834j569815j670876j335108j168039q42613j372482j087531j082996
$$ 48608834 47039019 45368143 44033035 42864996 42022383 40649901 39562370 38479374
14188C8479374j314998p06825q80782r22847p65159r44447j084082r39260o50420
$$ 38479374 37164376 36457551 35576769 34653922 33888763 32944316 31860234 30920974 30270554
14179C0270554l69050r37332n84577r28571p44198l57876p83319p08861k90369
$$ 30270554 29901504 28964172 28379595 27451024 26706826 26348950 25565631 24856770 24566401
14170B4566401n53240p72621k94083n10862p19585m71563q11930P0805m83729
$$ 24566401 24013161 23240540 22946457 22435595 21716010 21244447 20432517 20503322 20019593
14161B0019593n8226n30936l03817o38025K9495p07798k96717m14375k58907N1228
$$ 20019593 19961367 19430431 19126614 18488589 18518084 17810286 17513569 17099194 16840287 16891515
14151A6891515o77409l9140m22247k30067l89825l47275k09746j65930j23749
$$ 16891515 16214106 16174966 15752719 15522652 15132827 14785552 14575806 14409876 14286127
14142A4286127m09038l22230l9676l69611j51090l07687l91160n6263j91506l5395
$$ 14286127 13877089 13554859 13515183 13145572 12994482 12686795 12295635 12239372 12047866 12012471
14132A2012471l58397j56934P7383l45005l17987Q1892m84444L7585k93014K2540
$$ 12012471 11654074 11497140 11574523 11229518 10911531 10993423 10508979 10546564 10253550 10276090
14122A0276090o45704M27281k51174j61310J3265L9601n42619J34798m59794O482
$$ 10276090 9630386 10057667 9806493 9645183 9658448 9698049 9155430 9290228 8830434 8836916
14112H836916j45611j98921K7744l77258o8194N6601K4764l32689M7684j21990
$$ 8836916 8691305 8492384 8520128 8142870 8074676 8131277 8156041 7823352 7871036 7749046
14102G749046j39727n032n06124L36679q3281k44582q6930j12835p5185l11989
$$ 7749046 7609319 7604287 7098163 7434842 7351561 7106979 7020049 6907214 6832029 6520040
14092F520040K31507N7011j78665n92897J72324L6056K13885l44614J08639k30350
$$ 6520040 6751547 6808558 6629893 6036996 6209320 6245376 6459261 6114647 6223286 5992936
14082E992936n4783j35644j59124M71770l46498k62654P0819Q6147m6630j68058
$$ 5992936 5938153 5802509 5643385 6115155 5768657 5506003 5576822 5662969 5616339 5448281
14072E448281J15416j02336l31148l28570L88000N7219l27442J60607Q3237k50518
$$ 5448281 5563697 5461361 5130213 4801643 5189643 5246862 4919420 5080027 5163264 4912746
14062D912746o8786k76764o4764J63207J09936l26056P1119k69372J18611j05768
$$ 4912746 4843960 4567196 4502432 4665639 4775575 4449519 4520638 4251266 4369877 4264109
14052D264109k8845L5596K11624k31566m6534o679l06751N97537n7260j23992
$$ 4264109 4235264 4270860 4482484 4250918 4204384 4197705 3890954 4488491 4431231 4307239
14042D307239n7201k63119L59441m77732j46964Q5372J86263k64972R006J6208
$$ 4307239 4250038 3986919 4346360 3868628 3721664 3807036 3993299 3728327 3737333 3753541
14032C753541l42l05452J86360J03342p6179l71398j27328L03183r0141J3393
$$ 3753541 3753199 3447747 3634107 3737449 3661270 3289872 3162544 3465727 3375586 3388979
14022C388979r5017N1252n50447M50884K7250p3969K28438q8449k83003k76927
$$ 3388979 3293962 3345214 2794767 3245651 3272901 3198932 3427370 3338921 3055918 2778991
14012B778991K02104J10710m41929K77611Q8663n58647M23709k83523N0303j52810
$$ 2778991 2981095 3091805 2649876 2927487 3016150 2457503 2881212 2597689 2647992 2495182
14002B495182M93808m96117L10892k18385j04248m5281J22833O6086k0018l3420
$$ 2495182 2988990 2492873 2803765 2585380 2481132 2435851 2558684 2624770 2604752 2571332
13992B571332o8980m02135K99165o1143O1230j61763O549L24451k26642R1318
$$ 2571332 2502352 2100217 2399382 2338239 2399469 2237706 2244255 2568706 2342064 2433382
13982B433382K15195l2935n9465L12712L4507J66584P61842Q47264J537553L485498
$$ 2433382 2648577 2615642 2556177 2868889 2903396 3069980 3831822 4679086 6216639 9702137
13972I702137N284782J0249619R260562j0377737r061600n109140k832056j381708
$$ 9702137 14986919 25236538 34497100 24119363 15057763 9948623 7116567 5734859
13964E734859q97321m30065o29049k74261n3885k97717l09035l89956L54625J25145
$$ 5734859 4837538 4407473 3778424 3504163 3450278 3152561 2843526 2453570 2808195 2933340
13954B933340k54037Q648l52307K6724m2593J89837M8500l47156J88879j48317
$$ 2933340 2679303 2687951 2335644 2362368 2319775 2509612 2558112 2210956 2399835 2251518
13944B251518j39363K07906l12071o9968J92441m1798K56091j41055k43064k44460
$$ 2251518 2112155 2320061 2007990 1938022 2130463 2088665 2344756 2203701 1960637 1716177
13934A716177J98665Q69j75577J92647J88600j75813j64535K70465n00272K90710
$$ 1716177 1914842 1915711 1740134 1932781 2121381 1945568 1781033 2051498 1551226 1841936
13924A841936k00248L12226n7379k03594J30688K88670l42505P2487m10315R6711
$$ 1841936 1641688 1953914 1896535 1692941 1823629 2112299 1769794 1842281 1431966 1528677
13914A528677K41159l13350K897L18018k52650R2862k4541L4908m46964N02968
$$ 1528677 1769836 1456486 1459383 1777401 1524751 1617613 1593072 1627980 1181016 1683984
13904A683984l01669K82923k13345j24045K21963j78580j57287L7668J76346P3062
$$ 1683984 1382315 1665238 1451893 1327848 1549811 1371231 1213944 1251612 1427958 1501020
13894A501020m4138L8159L6528l58121L79501j32693O2591k0722l5446K749j82771
$$ 1501020 1456882 1495041 1531569 1173448 1552949 1420256 1482847 1462125 1426679 1429428 1246657
13883A246657J3821j89738N98907l12271k88726K45898P1608r5858R4899j15390
$$ 1246657 1260478 1070740 1669647 1357376 1068650 1314548 1386156 1290298 1385197 1269807
13873A269807M9293k80435M62393j22307r4283Q0247p3261j76216M36717j34487
$$ 1269807 1319100 1038665 1501058 1378751 1284468 1364715 1291454 1115238 1551955 1417468
13863A417468k55950J49935k90892K69878j54522J57785K8033k09532j96671K01901
$$ 1417468 1161518 1311453 1020561 1290439 1135917 1293702 1321735 1112203 915532 1117433
13853A117433K30965k97585J49482j96750J98228j87861M21044l96234J04256
$$ 1117433 1348398 1050813 1200295 1003545 1201773 1013912 1434956 1038722 1142978
13844A142978r1724Q2106l55659K43260j58122k0019n8401N7590M94367k71442
$$ 1142978 1051254 1133360 777701 1020961 862839 842820 784419 842009 1336376 1064934
13834A064934j54688J56363K0114D79955M90609R3265p630N3552N8867n61141
$$ 1064934 910246 1066609 1086723 479955 970564 1063829 1056199 1109751 1168618 607477
13824F07477L37829j64354L29069l74508J3812O06041j04410n39909J44950J3251
$$ 607477 945306 780952 1110021 735513 749325 1355366 1250956 711047 855997 869248
13814H69248K64383r4611l99350N87640k04988m46208K19908O8860k45972M00999
$$ 869248 1133631 1039020 639670 1227310 1022322 576114 796022 864882 618910 1019909
13804A019909l40254J61766n1779J99661k64086K47489n0428j17541j24269J52872
$$ 1019909 679655 841421 789642 989303 725217 972706 922278 804737 680468 833340
13794H33340K890K28246j09411k73701K17604j24983l40045M79524l4458j08573
$$ 833340 836230 1064476 955065 681364 898968 773985 433940 913464 879006 770433
13784G70433J4099j70238J5698M5243J39942K33651l85962J6410J41699K8620
$$ 770433 784532 614294 629992 675235 815177 1048828 662866 679276 820975 849595
13774H49595P7504m36953J28738K60536m5946j78680K45032l36555L27798k59401
$$ 849595 927099 490146 618884 879420 833474 654794 899826 563271 891069 631668
13764F31668J9633K42287J76715j78578l21765j7743K36624k68857R2120k6259
$$ 631668 651301 893588 1070303 891725 569960 552217 788841 519984 612104 585845
13754E85845J36084J19505J09339j68262J06446l26376K84737J4964l82864K50561
$$ 585845 721929 841434 950773 782511 888957 562581 847318 862282 479418 729979
13744G29979J57355k92890p5181K60212k86533P2484n9104J93831n6318j34264
$$ 729979 887334 594444 519263 779475 492942 565426 506322 700153 643835 509571
13734E09571B01161L92799Q1286B59003K93224K58817C53933M83723j46448j04233
$$ 509571 201161 593960 675246 259003 552227 811044 353933 837656 691208 586975
13724E86975O8950J58645k38670J39880K0499j73579J84916r5138k41490j35793
$$ 586975 655925 814570 575900 715780 736279 562700 747616 652478 410988 275195
13714B75195O02819k40955n320j80147Q9643Q2019j68892M17123C93817J07695
$$ 275195 878014 637059 631739 451592 541235 623254 454362 871485 393817 501512
13704E01512j35828O2225K463E7528M21230k31710L48053K20082r0238B73675
$$ 501512 365684 427909 430372 57528 478758 247048 595101 815183 724945 273675
13693G35561j16387k60908L8671K44902O2523r3410m0981K37947j07960k37182
$$ 735561 619174 358266 396937 641839 704362 610952 569971 807918 699958 462776
13683D62776J12796N990B12592M35850j99398L4780Q2930p3466m6631N15623D24353
$$ 462776 575572 581562 212592 648442 449044 483824 566754 493288 446657 962280 424353
13671F29757k17357j40384L41593J52595C33287K3763P1056n7737J13876j81275
$$ 629757 412400 272016 613609 766204 333287 357050 428106 370369 484245 302970
13661C02970l8472K23564k28126L60652k73234J73993J14587k96482O6969P9581
$$ 302970 264498 488062 259936 620588 347354 521347 635934 339452 406421 486002
13651D86002J9464A53134M51549O5352j85659p8603J21070B25281M19254j87467
$$ 486002 505466 153134 604683 670035 484376 405773 526843 225281 644535 457068
13641D57068j87956J07800j9874O9581J43965B70158J13812K63051m0787B72398
$$ 457068 269112 376912 357038 426619 570584 270158 383970 647021 606234 272398
13630E84165B17032J80851j55827J74412J77715j02063E4193N49619A61193L81824
$$ 584165 217032 397883 242056 416468 594183 492120 54193 603812 161193 543017
13620E43017J16175l14652J45020B10756L53794k33364J10895l7862K09187B56866
$$ 543017 659192 344540 489560 210756 564550 331186 442081 404219 613406 256866
13609C16995J45988J74410B57316C3257M10474R3410k46820b91097D34242j28515
$$ 316995 462983 637393 257316 33257 443731 537141 290321 -291097 434242 305727
13599C05727K14218j31318J08475L15651l42474o9362A20987J51230p179O8255
$$ 305727 519945 388627 497102 812753 470279 400917 120987 272217 265038 333293
13589C33293A16337L10513H1320N0868K57928H341J56913J15035O457J46036F4255
$$ 333293 116337 426850 81320 132188 390116 8341 165254 280289 286746 432782 64255
13577A30207K90481j26009J44568j9589j80358K11154k05562l8002l3232J29495
$$ 130207 420688 294679 439247 419658 239300 450454 244892 206890 173658 303153
13567C03153H0720K93421p2072o1210J8964K85975k5237k07850K73925I4890N59086
$$ 303153 80720 374141 302069 240859 259823 545798 520561 312711 586636 94890 653976
13556F53976C21287J04461A70478K82861r3916A32297J44891M06849C14901J64453
$$ 653976 321287 425748 170478 453339 359423 132297 277188 684037 314901 479354
13546D79354k38089K76844A85793K65223A27843J80597J73395q5772l4389J5429
$$ 479354 241265 518109 185793 451016 127843 308440 481835 396063 361674 377103
13536C77103o1598p1102J57558j27845J44950A70670L49627j81015J04438I5669
$$ 377103 315505 244403 401961 274116 419066 170670 520297 339282 443720 95669
13525B58184J67016G287K61268J88165f2995C2981J23953L85182j52489A35230
$$ 258184 425200 7287 268555 456720 -62995 32981 156934 542116 389627 135230
13514e4928C59505Q5413F0155L0744L48781J35064k28552p9627J6302A19593J58146
$$ -54928 359505 444918 60155 90899 439680 574744 346192 266565 282867 119593 277739
13503B77739o5083N4012j16698J52750J84463k12446K65075B65149B6527L56898
$$ 277739 212656 266668 149970 302720 487183 274737 539812 265149 26527 383425
13493C83425j76516l9939K46101j30459r6800J15451j16280C1706P402K34469
$$ 383425 206909 166970 413071 282612 185812 301263 184983 31706 39108 273577
13483B73577K27411F1823R3074k6205J80027Q9097L2223K7066h3493E14889m7952
$$ 273577 500988 61823 154897 128692 308719 397816 430039 457105 -83493 514889 466937
13472D66937A46215L52592A01819a77874C15454M9598d2836A93663k6615K04184
$$ 466937 146215 498807 101819 -177874 315454 365052 -42836 193663 167048 371232
13462C71232A3067L5000J98144J4419n9893N1391j13854K3735J80350j15597F4281
$$ 371232 13067 48067 246211 260630 200737 252128 138274 162009 342359 226762 64281
13450C89362j46572j17565C5198P3167l253K2391O1564G8205a45578C04935E8346
$$ 389362 242790 125225 35198 108365 105112 127503 189067 78205 -145578 304935 58346
13438f634A96749I5597L26703p4615A48905J8089c3658A99176J58046R1673B545
$$ -6634 196749 95597 422300 347685 148905 166994 -33658 199176 357222 448895 2545
13426A65269J88805J3473F1284c9264C78688l9462k6631a55656B51114L96146
$$ 165269 354074 367547 61284 -39264 378688 339226 312595 -155656 251114 647260
13416F47260A63633K53748A86201a78538H2454b67735F4474f3987A27418K05720
$$ 647260 163633 417381 186201 -178538 82454 -267735 64474 -63987 127418 333138
13406C33138k2604q9945J88560b5480C17009i4507F9510M80830j22560k07445
$$ 333138 310534 220589 409149 -25480 317009 -94507 69510 550340 427780 220335
13396B20335i9717D50703A66711o8318J50504m2157B3682L32665A56488Q7884
$$ 220335 -99717 450703 166711 98393 248897 206740 23682 356347 156488 244372
13386B44372P2111h9349l8082B99950j00110O066J30089A47506J24901o4048P4143
$$ 244372 316483 -89349 -127431 299950 199840 205906 335995 147506 272407 208359 282502
13375B82502L7882A54079P655Q6057l9478K8557K14643r3397k2343G425K7033
$$ 282502 320384 154079 161734 247791 208313 236870 451513 358116 335773 7425 34458
13364C4458q258O4980J63904F4277O31490c2426E6985a20332A10057K05863j39699
$$ 34458 26200 91180 255084 64277 695767 -32426 56985 -120332 110057 315920 176221
13353A76221o0261K57661r037n8622O1245j80074K69598q1215j50959E6944g8712
$$ 176221 115960 373621 364584 305962 367207 187133 456731 375516 224557 56944 -78712
13341a33733C51459A07694b4598C45266o7242a51109f0181C59676A05105R7807
$$ -133733 351459 107694 -24598 345266 278024 -151109 -60181 359676 105105 202912
13331B02912n2192N7119p0259J99466j28481M3265K42775B29735J37162A65248
$$ 202912 150720 207839 137580 337046 208565 251830 494605 229735 366897 165248
13320C2612J57249j8228Q4676J13158j34618K11526A44628J96342j29329K94528
$$ 32612 189861 171633 256309 369467 234849 446375 144628 340970 211641 506169
13310E06169B5164L1743K4551a10126B28763I7178K88475K7926A74961J62316
$$ 506169 25164 56907 81458 -110126 228763 97178 385653 413579 174961 337277
13300C37277A54830L21060j15170D09i506B19075K13930m0168m1093L9611A74252
$$ 337277 154830 475890 360720 409 -9506 219075 433005 392837 351744 391355 174252
13288A18176J4188g4601A34281A6915d1192A01749h1678I6785K46897G8844a12433
$$ 118176 132364 -74601 134281 16915 -41192 101749 -81678 96785 343682 78844 -112433
13276A63725J39980I9296a05588C08032A01080M0704n9629j9670M4078J38159
$$ 163725 303705 99296 -105588 308032 101080 141784 82155 62485 106563 244722
13266B44722l1155J71519A91158M3363h4239J5018a4360B41731A17816c0939F6030
$$ 244722 213567 385086 191158 234521 -84239 -69221 -14360 241731 117816 -30939 66030
13254B11842o1716J55871c0776F1357J53728C6185L95293A0644c4194B02563G1051
$$ 211842 150126 305997 -30776 61357 215085 36185 431478 10644 -34194 202563 71051
13242B88562m6799L44850g490A35856K0407D9873b11394b5799A38099F6218R8371
$$ 288562 241763 586613 -7490 135856 156263 49873 -211394 -25799 138099 66218 164589
13231A64589H1816C5772J10250A7101e6796o8279D27486A59939j4536J6347R5002
$$ 164589 81816 35772 146022 17101 -56796 -125075 427486 159939 145403 161750 256752
13220B56752a99258B22108b0099A23268n3294J79834K50547g1988A32155q911
$$ 256752 -199258 222108 -20099 123268 69974 249808 500355 -71988 132155 123244
13210A23244a05667A97224J75366b36653c1642n6837A70228n8215P8271a7811
$$ 123244 -105667 197224 372590 -236653 -31642 -88479 170228 112013 190284 -17811
13199B7778L73286A4972P1942b20353B41834a60592D86212B24887a41352A25572
$$ 27778 401064 14972 86914 -220353 241834 -160592 486212 224887 -141352 125572
13188C34479j59584k1243J05455a79076A14147m4792K15670j25613o5895K38975
$$ 334479 174895 153652 259107 -179076 114147 69355 285025 159412 93517 332492
13178C32492j61939j0725c9638B18282j2671a64001p777M8680F1849L9563B6033
$$ 332492 170553 159828 -39638 218282 205611 -164001 -171778 -123098 61849 101412 26033
13166H9510c9542A20165j0448a215k74113a10078l7374b7206A53350f9282B40181
$$ 89510 -39542 120165 109717 -1215 -275328 -110078 -147452 -27206 153350 -69282 240181
13154b90766C0333J52466b3657j43231A73233P7395H3211j0428j906Q7815g7345
$$ -290766 30333 182799 -23657 -166888 173233 250628 83211 72783 70877 158692 -77345
13142H5300B0868K99566H8286a09816A62696k8232m7819K8675L879a02475A67148
$$ 85300 20868 320434 88286 -109816 162696 134464 86645 115320 119199 -102475 167148
13130G6202L7035h4591A70619j0104C7288c81931D6542b37961B64853A14527n2434
$$ 76202 113237 -84591 170619 160515 37288 -381931 46542 -237961 264853 114527 62093
13119F2093a93940Q335F0957R1889m6914a11732A59856D2042k825Q7002m5847
$$ 62093 -193940 -185605 60957 152846 105932 -111732 159856 42042 39217 126219 80372
13108H0372P1979f4994B57120c8260j61216e9073C30908a84760a9939B25570K2126
$$ 80372 152351 -64994 257120 -38260 -199476 -59073 330908 -184760 -19939 225570 247696
13097B47696H1213C8934K09543A2583c5929E4362J88804a23430B53L1556i2100
$$ 247696 81213 38934 248477 12583 -35929 54362 243166 -123430 253 31809 -92100
13085A30018i1406j655A60319o88P7875l0052g9150H441L21367d106C98762b17631
$$ 130018 -91406 -93061 160319 159631 237506 207454 -79150 8441 329808 -4106 398762 -217631
13072a20433b1467H7540a6817k7082A01816J19480I8043K2618k2514e0227k00381
$$ -120433 -21467 87540 -16817 -43899 101816 221296 98043 120661 98147 -50227 -250608
13061b50608B76007M6923f4584A76960o1928C2522L34461j05263j13395m1944
$$ -250608 276007 322930 -64584 176960 115032 32522 366983 261720 148325 106381
13051A06381h6352A76086J53538a3140m7109B36859G1642d6015C9208A3673a00994
$$ 106381 -86352 176086 329624 -13140 -60249 236859 71642 -46015 39208 13673 -100994
13039b2106j17595f9459A15875i0277B8134b14110C78297c1222B72114c27553
$$ -22106 -139701 -69459 115875 -90277 28134 -214110 378297 -31222 272114 -327553
13028a4013C19554a34803A93244i4578A81343A8001K9677d70195A72821M8370
$$ -14013 319554 -134803 193244 -94578 181343 18001 47678 -470195 172821 221191
13018B21191K7605H9336b1842A44538Q2645a23872B21321O7183d1791B65771P885
$$ 221191 248796 89336 -21842 144538 227183 -123872 221321 288504 -41791 265771 273656
13007B73656a26289A79766R6475j7414b1409A51610A0813J35214a77033B32152
$$ 273656 -126289 179766 276241 258827 -21409 151610 10813 146027 -177033 232152
12996A12521J42277C578c98411c7412A24585E471M5954J59693J51095D0276K06198
$$ 112521 254798 3578 -398411 -37412 124585 5471 51425 211118 362213 40276 246474
12985B46474i6199g14j58522R394C0705b5707o619A23701a60861N1652d7744p1248
$$ 246474 -96199 -714 -159236 -149842 30705 -25707 -32326 123701 -160861 -109209 -47744 -118992
12973a18992j62451B51103J00217j49864a35049J2081A84730J0848f5453C03071
$$ -118992 -281443 251103 351320 201456 -135049 -122968 184730 195578 -65453 303071
12962C18346G2981a34295A52266l4681f0382j91024F4346A2534a23485A66131
$$ 318346 72981 -134295 152266 117585 -60382 -251406 64346 12534 -123485 166131
12951A10520c2724j18699E8827a7557B1362a99093C00557j40355b65872B85116
$$ 110520 -32724 -151423 58827 -17557 21362 -199093 300557 160202 -265872 285116
12940A89564H408A291K57575i4241B61743e0827C55542I2348R20D396J82808f537
$$ 189564 8408 1291 258866 -94241 261743 -50827 355542 92348 93268 4396 187204 -6537
12927a02670B60499b55460k35275e0762m74539J99294F9030c9985G4238c03784
$$ -102670 260499 -255460 -490735 -50762 -525301 -326007 69030 -39985 74238 -303784
12916I3814A566J49676d3270k9537A05171B4394K53159c43579A09130a64706C86582
$$ 93814 1566 151242 -43270 -72807 105171 24394 277553 -343579 109130 -164706 386582
12904e1799p3691j3638A41154J0612a43585E5883K14998b92089j59475A82156
$$ -51799 -125490 -139128 141154 151766 -143585 55883 270881 -292089 -451564 182156
12893A12871L44256a75195A79844a26094J1301B5619J59172q7511i4983o870j56424
$$ 112871 457127 -175195 179844 -126094 -114793 25619 184791 97280 -94983 -101853 -258277
12882b58277A27390c47955B68775g6292o42J8472j65547c6443a1897j40104K8783
$$ -258277 127390 -347955 268775 -76292 -76934 -58462 -224009 -36443 -11897 -152001 -123218
12871a23218j4288F2987i2188D98862a26682A14974a44413b5823k8457m7880A0862
$$ -123218 -137506 62987 -92188 498862 -126682 114974 -144413 -25823 -54280 -102160 10862
12859B53806a66885f4443J4994p9236n6182A05461K57765b29623A0622a7406H9124
$$ 253806 -166885 -64443 -49449 -128685 -184867 105461 363226 -229623 10622 -17406 89124
12847I1239b6917D4367a15090l9992g1396r7351B70582G8111a92568l873r4103
$$ 91239 -26917 44367 -115090 -155082 -71396 -168747 270582 78111 -192568 -196441 -290544
12836b90544B22476A1956L43119c85703h4133B87518D575K27085r3432F2071i3628
$$ -290544 222476 11956 355075 -385703 -84133 287518 4575 231660 138228 62071 -93628
12824A75289O7505I925a46085J9125e981j76120g7057n0299F0887d779k0607p987
$$ 175289 242794 9925 -146085 -126960 -5981 -182101 -77057 -127356 60887 -4779 -25386 -33373
12812c3373k08044B34921p7300D0485a05439F9165i6458A71632N4487I1918a96138
$$ -33373 -241417 234921 157621 40485 -105439 69165 -96458 171632 226119 91918 -196138
12800B05188f0889b1238k85571B38528I9799a21367B91799b54804r168A14691
$$ 205188 -60889 -21238 -306809 238528 99799 -121367 291799 -254804 -263972 114691
12789c9932p148A57382m9947m2761k0162R0971b00396R3633L6481j61272H7324
$$ -39932 -47080 157382 107435 64674 44512 135483 -200396 -106763 -70282 -231554 87324
12777g2626B01359j7367I0658a4170A06538A1601J93967g878A39313i5609C2875
$$ -72626 201359 183992 90658 -14170 106538 11601 205568 -7878 139313 -95609 32875
12765a043j03664C7799b35264J08777q679N381B03358q2466g0995B16787g1133
$$ -1043 -104707 37799 -235264 -126487 -135166 -129785 203358 120892 -70995 216787 -71133
12753E8021L0308A6628M3134a97799N9612B02077a95611A6309a06313A47354h7659
$$ 58021 88329 16628 59762 -197799 -138187 202077 -195611 16309 -106313 147354 -87659
12741A54878j6088a33447j71701B40347I8699c05252L4373A78361b05476j28956
$$ 154878 138790 -133447 -305148 240347 98699 -305252 -270879 178361 -205476 -334432
12731c34432d0223B63089e5894A59124G7723d8380A89462e863o9030A09915A2990
$$ -334432 -40223 263089 -55894 159124 77723 -48380 189462 -5863 -74893 109915 12990
12719f2915I7319C4806b30559C97721a04569B8208b02955Q0373E2260A8592b91232
$$ -62915 97319 34806 -230559 397721 -104569 28208 -202955 -122582 52260 18592 -291232
12707a44624l6661A8770c38374k5439C57087h2223D86247A76454j6377b23141
$$ -144624 -181285 18770 -338374 -363813 357087 -82223 486247 176454 160077 -223141
12696A65785m361G5210K03682E8594a34215A64111C7960O9663a63059B1431J00938
$$ 165785 161424 75210 278892 58594 -134215 164111 37960 107623 -163059 21431 122369
12685A22369a62229B15501a58655m525A8648L6423j5950a14402G5999f4823J3021
$$ 122369 -162229 215501 -158655 -163180 18648 55071 39121 -114402 75999 -64823 -51802
12674e1802j15406A14899d125A93262f8405j22252B22476A8647N4482J05285q0730
$$ -51802 -167208 114899 -4125 193262 -68405 -190657 222476 18647 73129 178414 97684
12663I7684g8119B95548j26271a64387E54947a01478A84394F2331K8830R4116
$$ 97684 -78119 295548 169277 -164387 554947 -101478 184394 62331 91161 185277
12653A85277a55911e9101F6231a5898k2191A18498b43052g6132A73495p0204e3869
$$ 185277 -155911 -59101 66231 -15898 -38089 118498 -243052 -76132 173495 103291 -53869
12641A26624n1776K7498L49281E2040O8920J44162b14999B80027a31726j03439
$$ 126624 74848 102346 451627 52040 120960 265122 -214999 280027 -131726 -235165
12631b35165i4488r4915A73943c8374k08940O6276H3207d0707C42531B3110b12147
$$ -235165 -94488 -189403 173943 -38374 -247314 -181038 83207 -40707 342531 23110 -212147
12619A95678D9084a73616l5350B3326L5800J82254n8179H9225J27162D2970d6664
$$ 195678 49084 -173616 -208966 23326 59126 241380 183201 89225 216387 42970 -46664
12607A62145a02518A91979a24376B84818A35861P9303a66066A33704e0356B35455
$$ 162145 -102518 191979 -124376 284818 135861 215164 -166066 133704 -50356 235455
12596A76883F1397B0388J1571a83460D31124A56639p1925a46504A72948J25839
$$ 176883 61397 20388 31959 -183460 431124 156639 84714 -146504 172948 298787
12586B98787D7102L79120P8478a0656j80819B96298H6177o671a25235j60081b8735
$$ 298787 47102 426222 504700 -10656 -191475 296298 86177 79506 -125235 -285316 -28735
12574A21549J23955F2446k1352h0868K7744a8466j50045d8459n5998r2519E17548
$$ 121549 245504 62446 41094 -80868 -53124 -18466 -168511 -48459 -104457 -196976 517548
12562a29716k58974A54946I227P2841Q4563f4055j08804A66831a78894E2342a08036
$$ -129716 -388690 154946 9227 82068 166631 -64055 -172859 166831 -178894 52342 -108036
12550b5527l59390g1593A06034a55301k20774I0453b01531M1470k9413C1516b19794
$$ -25527 -384917 -71593 106034 -155301 -376075 90453 -201531 -160061 -189474 31516 -219794
12538i3340l792A00184j192C214a7709A3934d28821J22060F2223G070J5885J8887
$$ -93340 -97132 100184 98992 3214 -17709 13934 -428821 -306761 62223 7070 22955 41842
12526D1842b92539b7505B8900k70R0083a40606m3139E965a30581B4718K61812
$$ 41842 -292539 -27505 28900 28630 118713 -140606 -183745 5965 -130581 24718 286530
12515B86530d1588A26788l2778b09446g6315r2917A68034K9372a8050j05322M892
$$ 286530 -41588 126788 94010 -209446 -76315 -169232 168034 197406 -18050 -123372 -118480
12504a18480b8426A42415a3492G6143J0536N1309d1869D5934Q5982a17504E6627
$$ -118480 -28426 142415 -13492 76143 86679 137988 -41869 45934 131916 -117504 56627
12492f4050A52847h7350A19778K50360j17921a69275G8404d6055C57563a31793
$$ -64050 152847 -87350 119778 370138 252217 -169275 78404 -46055 357563 -131793
12481f4673k19849b2237j01088o7360A24080a43450A56911L0930p0755d4053k42771
$$ -64673 -284522 -22237 -123325 -190685 124080 -143450 156911 187841 117086 -44053 -286824
12470b86824B58525G9688M1154d057j13827p6932n3233g5581p2005A20302J25739
$$ -286824 258525 79688 120842 -4057 -117884 -194816 -248049 -75581 -147586 120302 246041
12459B46041A14940B2894D594M5241J2240h1151o5697A48048K959b56465C83723
$$ 246041 114940 22894 4594 49835 62075 -81151 -146848 148048 151007 -256465 383723
12447A95417h3078A56763L8665f3366A07759R2010b07349j5407l2011K0339A02599
$$ 195417 -83078 156763 195428 -63366 107759 199769 -207349 -222756 -254767 -234428 102599
12435A54276a54153B00128a27583B37469J4873i7080p618b3365A10470K54397
$$ 154276 -154153 200128 -127583 237469 252342 -97080 -104698 -23365 110470 364867
12425C64867a10002a4828R03A58897c7593i21j50801F8555K4874l7521i6144j74437
$$ 364867 -110002 -14828 -13925 158897 -37593 -921 -151722 68555 93429 55908 -96144 -270581
12413b70581a0335A10452d2849H8062a62083A7117J17274J56308j22578a83427
$$ -270581 -10335 110452 -42849 88062 -162083 17117 134391 290699 168121 -183427
12402B46798I91a13809L4373c6525H4498a6752j76048R520A35247a86271G200
$$ 246798 991 -113809 -79436 -36525 84498 -16752 -192800 -183280 135247 -186271 7200
12390a5527k87954A12086b67627R0205p755j05509R434R4321N2592r267j97339
$$ -15527 -303481 112086 -267627 -177422 -185177 -290686 -281252 -186931 -134339 -143606 -340945
12379c40945b8795k34803P2705N698A42309a00244B8883M5815C7240K38227E8621
$$ -340945 -28795 -263598 -190893 -185195 142309 -100244 28883 74698 37240 275467 58621
12367D95d1728A35179B6052J38308A4682i313B44006l2133a63045A38901a23555
$$ 495 -41728 135179 26052 164360 14682 -9313 244006 211873 -163045 138901 -123555
12355A59783h7203B51980f1682G2059b35418A30928Q3099E0750J86972H4334k7829
$$ 159783 -87203 251980 -61682 72059 -235418 130928 214027 50750 237722 84334 56505
12344E6505j030M7092J35906a76659D3662a4913A52449K2392a14403N0568H5313
$$ 56505 55475 102567 238473 -176659 43662 -14913 152449 174841 -114403 -63835 85313
12332B86709h7128l04083H2912k8387a23207A00101J01648b55108A90786d2085
$$ 286709 -87128 -391211 82912 54525 -123207 100101 201749 -255108 190786 -42085
12321A1787K32290n8454a11764M5182B44675j8796C5948K27972j11556K72023
$$ 11787 244077 185623 -111764 -66582 244675 225879 35948 263920 152364 424387
12311D24387A29657R2900Q2981j47327N4840N763C3801J05385M4680k4908G2247
$$ 424387 129657 222557 305538 158211 213051 218814 33801 139186 183866 158958 72247
12299A13141N3402G6886J19908p547e9703A0829L4564O6555d4027B61986G649
$$ 113141 166543 76886 196794 189247 -59703 10829 45393 111948 -44027 261986 7649
12287B6933a00392A71442f9278j35980A19255i7904B82857m7775H7307M1957K326
$$ 26933 -100392 171442 -69278 -205258 119255 -97904 282857 235082 87307 129264 131590
12276A31590G774J54261a32552P152A05540a20435A03307a05056B85810I3607
$$ 131590 7774 162035 -132552 -125400 105540 -120435 103307 -105056 285810 93607
12265d4584A91748A9994a642A36217a56178k5376B78417B9413b61185A16329R8290
$$ -44584 191748 19994 -1642 136217 -156178 -181554 278417 29413 -261185 116329 214619
12254B14619n8517p7090J74686b61127i1166B70080j15342R6709a03882B10744
$$ 214619 156102 79012 253698 -261127 -91166 270080 154738 251447 -103882 210744
12243A12728d6396A28928L0748l4456A0151R1174N5512G0555a84460J9578A47380
$$ 112728 -46396 128928 159676 125220 10151 101325 156837 70555 -184460 -164882 147380
12231A59293A6504N1038J29813a6810A23465J8729M5967F2008K19731a31996A65243
$$ 159293 16504 67542 197355 -16810 123465 142194 188161 62008 281739 -131996 165243
12219e8547B46302a26265O0951B03361h0269A04172N54055C0097Q776a05793B07170
$$ -58547 246302 -126265 -65314 203361 -80269 104172 658227 30097 38873 -105793 207170
12207A62246J90449D8887f17B74645K90718I2110K98294D8974J04207a6437o568
$$ 162246 352695 48887 -617 274645 565363 92110 390404 48974 153181 -16437 -23005
12196b3005B75480b6399C88726H7017K88366c13970B9675K08005l2169g0773I4547
$$ -23005 275480 -26399 388726 87017 375383 -313970 29675 237680 205511 -70773 94547
12184I8117K38045A63407N58485B60450B9457a67037B71676m8113I2122L28909
$$ 98117 336162 163407 721892 260450 29457 -167037 271676 223563 92122 421031
12174D21031g1913G5547K55572j18404H0699K86872B0299N4638B4934M57343n5279
$$ 421031 -71913 75547 331119 212715 80699 367571 20299 74937 24934 482277 426998
12163D26998j76819M4080c1709i298j20831C56746H2874K33711J4136E8096c8459
$$ 426998 250179 294259 -31709 -9298 -130129 356746 82874 316585 330721 58096 -38459
12151A68152Q2701j6920K28390A56148M28187A93579R6156D4077Q8405L16152
$$ 168152 250853 233933 462323 156148 584335 193579 289735 44077 132482 448634
12141D48634a9568o9128F01951B9719J86376H9047l6079i1279D63951A21911J51698
$$ 448634 -19568 -88696 601951 29719 216095 89047 52968 -91279 463951 121911 273609
12130B73609H1388a42349L302B07831d4616p3815C3183A6427J63616l133f7321
$$ 273609 81388 -142349 -139047 207831 -44616 -118431 33183 16427 180043 176910 -67321
12118A88591a01631F2113c901q3328A5411J61806E0746K57971A05326L71124g621
$$ 188591 -101631 62113 -3901 -87229 15411 177217 50746 308717 105326 476450 -7621
12106E565R0105J42557n2972a4195B01176K64308G7931Q7830G0042j0915J43124
$$ 5565 95670 238227 185255 -14195 201176 465484 77931 165761 70042 59127 202251
12095B02251A5681a92349C80103A02217l9485J95E410J81222A3981M20796j95457
$$ 202251 15681 -192349 380103 102217 62732 62927 5410 186632 13981 434777 239320
12084B39320P050D9623r776K7179c497B37265M9489k8419J02425k1789C3406a13065
$$ 239320 246370 49623 39847 67026 -3497 237265 286754 258335 360760 338971 33406 -113065
12071B2328J07222M175C6023f1640k8253B02274G143J43074a00998H4674l1839
$$ 22328 129550 133725 36023 -61640 -89893 202274 7143 150217 -100998 84674 52835
12060E2835a12744B16456A7264a40762A22745R0152p1473K38353j59935D9038
$$ 52835 -112744 216456 17264 -140762 122745 212897 141424 379777 219842 49038
12049A33311e5895J4481D8592M2608c0105q4965A80094a35954d7957b0832j48657
$$ 133311 -55895 -41414 48592 91200 -30105 -115070 180094 -135954 -47957 -20832 -169489
12038a69489c8041j39458C09654a21770A25605c1432B9105J9296Q2383D5589A9540
$$ -169489 -38041 -177499 309654 -121770 125605 -31432 29105 48401 130784 45589 19540
12026c1541B0898i1762J5432A00391k9921a84650a2704A69306d3168A67321c76030
$$ -31541 20898 -91762 -76330 100391 70470 -184650 -12704 169306 -43168 167321 -376030
12014c3016B36833q9340h3722M464A79801i9897A00968I842J34924a36325B48950
$$ -33016 236833 147493 -83722 -79258 179801 -99897 100968 9842 144766 -136325 248950
12002B93054C4231b79415A11773I413b10584c173j51303d7171k59608B11600f5923
$$ 293054 34231 -279415 111773 9413 -210584 -3173 -154476 -47171 -306779 211600 -65923
11990b97904a04075D29234B07424p5892g3289I7451d1459k9926r0775p2993C3441
$$ -297904 -104075 429234 207424 131532 -73289 97451 -41459 -71385 -162160 -235153 33441
11978b13801c4390A3375K16700o3175b22422A34265l6084a8804j65805l3046b2710
$$ -213801 -34390 13375 230075 166900 -222422 134265 98181 -18804 -184609 -217655 -22710
11966b28941Q5952A53374F9174a3356A28180e2045B5470b17083e1560l25871g2932
$$ -228941 -142989 153374 69174 -13356 128180 -52045 25470 -217083 -51560 -377431 -72932
11954C7171b10578A14902J64348b45421R0467A12761c28517a55346A85063G3928
$$ 37171 -210578 114902 279250 -245421 -154954 112761 -328517 -155346 185063 73928
11943a64811k6616r4590R1769A21965e8377l7489F5304J01073J97511D3095m074
$$ -164811 -191427 -286017 -194248 121965 -58377 -95866 65304 166377 363888 43095 39021
11932C9021r371J05580b80214b9954B90603b40756r8208h1209L4334A40546J03650
$$ 39021 29650 135230 -280214 -29954 290603 -240756 -338964 -81209 -46875 140546 244196
11921B44196a93217C3126A1592d49566C52196a03611a4609M687j46652C92499
$$ 244196 -193217 33126 11592 -449566 352196 -103611 -14609 -9922 -156574 392499
11910A51455F8725a41843H6393K5777a93944P1916D768c70477i8885A09004g8265
$$ 151455 68725 -141843 86393 112170 -193944 -122028 4768 -370477 -98885 109004 -78265
11898H2853m423K1785K07390a36654d9577r3450k4229B79760n498I6615l5088
$$ 82853 78430 100215 307605 -136654 -49577 -143027 -167256 279760 274262 96615 61527
11887F1527b55255F1041a55723O0410g726l0481A48670m4002a00286K4223G0057
$$ 61527 -255255 61041 -155723 -95313 -7726 -38207 148670 104668 -100286 -76063 70057
11875d318A25704A9516L1993a09817A96196a29726j70346O6521B60220a21369
$$ -4318 125704 19516 51509 -109817 196196 -129726 -300072 -233551 260220 -121369
11864e22395H8560a99208I2976j0884J57589M9163b42725n8873n1525f23o9992
$$ -522395 88560 -199208 92976 82092 239681 288844 -242725 -301598 -353123 -623 -70615
11853g0615b0293l42006B14834b07570E5188A6906d3452k1045K115B78085c00340
$$ -70615 -20293 -362299 214834 -207570 55188 16906 -43452 -64497 -62382 278085 -300340
11841a7528G6475B2725b54766R7360A29808n3820b44227f9633j93517h6259A29993
$$ -17528 76475 22725 -254766 -157406 129808 75988 -244227 -69633 -263150 -86259 129993
11829b95879A92076e8887C3526J58188f5615p0200m0112A77635b83829A7579b02272
$$ -295879 192076 -58887 33526 191714 -65615 -135815 -175927 177635 -283829 17579 -202272
11817e2573r1918C30345H495i6587j73317B18893o8784b00859c7192k59344J26144
$$ -52573 -144491 330345 8495 -96587 -269904 218893 150109 -200859 -37192 -296536 -170392
11806a70392C32279p3087a71430A58588a06928b6909k62840A8904K68674A30635
$$ -170392 332279 259192 -171430 158588 -106928 -26909 -289749 18904 287578 130635
11795b08896N08p1871J29517A52875k6206c47080D1998c15293J56909g1185A57134
$$ -208896 -208388 -280259 -150742 152875 126669 -347080 41998 -315293 -158384 -71185 157134
11783H7088a33065B3485a29187r0127Q4182o8615A1214b4746B2387a94437e1209
$$ 87088 -133065 23485 -129187 -219314 -135132 -203747 11214 -24746 22387 -194437 -51209
11771E6502c7582A35135a50003A18844h2275B7518Q3384C4897M7925c11328a16187
$$ 56502 -37582 135135 -150003 118844 -82275 27518 110902 34897 82822 -311328 -116187
11759G8680j7077J23667j4703c8271G5871a0261j50424E7967a99587E4159L0531
$$ 78680 61603 185270 170567 -38271 75871 -10261 -160685 57967 -199587 54159 84690
11748H4690P9836a67796c3108j85003A25762l0695D2135J68549E2427a24724p596
$$ 84690 164526 -167796 -33108 -218111 125762 95067 42135 210684 52427 -124724 -132320
11737a32320l06868G6974J41275a31192D5430J0367L21409h8351j36163N8132
$$ -132320 -439188 76974 218249 -131192 45430 55797 377206 -88351 -224514 -166382
11727a66382e1529A88320c09232B10986B6309a13589q1506B23376M3172b16025
$$ -166382 -51529 188320 -309232 210986 26309 -113589 -195095 223376 266548 -216025
11716a4776m5741l16126a49924j72605B5790L5446c6864F0218L41440H8326P0851
$$ -14776 -60517 -376643 -149924 -322529 25790 61236 -36864 60218 401658 88326 159177
11705A59177f8149o7614C29086b36226A01745h7855A34943b55655g8382B23843
$$ 159177 -68149 -135763 329086 -236226 101745 -87855 134943 -255655 -78382 223843
11694a03293B73050b07698a03495H2529J72207a64610B0167J35664c162o1485
$$ -103293 273050 -207698 -103495 82529 254736 -164610 20167 155831 -3162 -64647
11684f4647B58923g3360c1527J0030k5481j26793A30536f8322E4926R1389b92301
$$ -64647 258923 -73360 -31527 -21497 -46978 -173771 130536 -68322 54926 146315 -292301
11672a36612K9579A05809k6484J95892i2564B33870i5087k1911J0580q4817c1274
$$ -136612 -107033 105809 79325 275217 -92564 233870 -95087 -116998 -106418 -191235 -31274
11660h6112G6125b75042D0676q325d767C44597G6558J02538h4730C36147C5772
$$ -86112 76125 -275042 40676 32351 -4767 344597 76558 179096 -84730 336147 35772
11648A65656a82032G8960J10749q0314n1131c40606E6230b22438b6487h176l3374
$$ 165656 -182032 78960 189709 109395 58264 -340606 56230 -222438 -26487 -8176 -41550
11637d1550J3917a505q818l90530f1221K8032H6686d07730C031e6570A40738k7223
$$ -41550 -27633 -1505 -10323 -400853 -61221 -33189 86686 -407730 3031 -56570 140738 113515
11625A13515C1061a62295k193F2204M8174K36930A18007R2051K6883D2794j8396
$$ 113515 31061 -162295 -164488 62204 110378 347308 118007 210058 236941 42794 24398
11614B4398a06298i819j77109n9171Q7461d1808o2901k00140J36287A83822P9878
$$ 24398 -106298 -9819 -186928 -246099 -158638 -41808 -104709 -304849 -168562 183822 263700
11603B63700h8464B41281e7472j1238c2301j83924C11136C7519b85695A14K6595
$$ 263700 -88464 241281 -57472 -68710 -32301 -216225 311136 37519 -285695 114 26709
11592B6709d36583A96491a56557E1619J94285E4385d6754r7376E8771d4611k3310
$$ 26709 -436583 196491 -156557 51619 245904 54385 -46754 -144130 58771 -44611 -67921
11581f7921B63616n6475P991e6490A64662p0565C2590c0991A01950K092e8381
$$ -67921 263616 207141 215132 -56490 164662 94097 32590 -30991 101950 104042 -58381
11569C19377a17229m1401M2391A92315c53777A09763l3674J282M5430a10931n3988
$$ 319377 -117229 -158630 -116239 192315 -353777 109763 76089 77371 122801 -110931 -164919
11558a64919P5788A61201a76091E5837b17600C1241M3350a3207H1170N1970J32573
$$ -164919 -89131 161201 -176091 55837 -217600 31241 74591 -13207 81170 133140 265713
11547B65713a28253M7818j25797B12348h0942A53613n3726i0362j33537B66445
$$ 265713 -128253 -80435 -206232 212348 -80942 153613 99887 -90362 -223899 266445
11536a90633B98819E19a60918B0694J06787J85646j33779l8664n5040a40208A12625
$$ -190633 298819 519 -160918 20694 127481 313127 179348 140684 85644 -140208 112625
11524g4382q7339j5773C42814b18634L1736A36903a16440B26500a96491b1156
$$ -74382 -161721 -177494 342814 -218634 -186898 136903 -116440 226500 -196491 -21156
11513D6071i7665j77122A23142Q8157a20688A60720E2959a90304o2056E0709b1707
$$ 46071 -97665 -274787 123142 211299 -120688 160720 52959 -190304 -252360 50709 -21707
11501F421K2517M1409L6941J94813I9733Q3247M3419E9347J81565A20413b9629
$$ 6421 28938 70347 107288 302101 99733 182980 226399 59347 240912 120413 -29629
11489a18101d9032j97944E4636L9186J58647o2254P2301A20116a00463A38100
$$ -118101 -49032 -246976 54636 93822 252469 190215 262516 120116 -100463 138100
11478F0714O3551J2086D8168a8128C67377a9617j67121C22335F6713J58532A00028
$$ 60714 124265 136351 48168 -18128 367377 -19617 -186738 322335 66713 225245 100028
11466A17719K15975c4782A73622O0656r0120M5872J68991A9532l995J12404L70009
$$ 117719 333694 -34782 173622 234278 144158 190030 359021 19532 15537 127941 497950
11455D97950e5899A65756n732g4067A94129h5573a2014D54133q0135p4542a4331
$$ 497950 -55899 165756 160024 -74067 194129 -85573 -12014 454133 373998 299456 -14331
11443B05423N2304p4394A0702L78717i1568B19517a74866j59128A25326R6353
$$ 205423 257727 183333 10702 389419 -91568 219517 -174866 -333994 125326 221679
11433B21679e5220b5464k83057a41137M3986B05403q6993m4924a6045A23424a30393
$$ 221679 -55220 -25464 -308521 -141137 -97151 205403 118410 73486 -16045 123424 -130393
11421D0371J43723q1372D9089K74512a10010A52019j9893o2028B4826K15580a22012
$$ 40371 184094 102722 49089 323601 -110010 152019 132126 70098 24826 240406 -122012
11409a25720A2122M1817b2442B96219d17814J03509I8104c12390C50316p0050
$$ -125720 12122 53939 -22442 296219 -417814 -314305 98104 -312390 350316 280266
11399B80266a87827c8789j59028E2816d492I6904J20507K6361a24969a773A36688
$$ 280266 -187827 -38789 -197817 52816 -4492 96904 217411 243772 -124969 -1773 136688
11387A1665a6532A19935D8495c04949i9717B25496p5449c6297q9795M6716l9222
$$ 11665 -16532 119935 48495 -304949 -99717 225496 150047 -36297 -126092 -79376 -118598
11376a18598L1658a5450B62479b937A33171l4156c17447J31767K2887D6850I735
$$ -118598 -86940 -15450 262479 -2937 133171 99015 -317447 -185680 -162793 46850 9735
11364d0770p8289c5579A14252n6172M5745a20483E5779L2860N8530k5047a90245
$$ -40770 -119059 -35579 114252 58080 103825 -120483 55779 88639 147169 122122 -190245
11352f3922j14890j50498A14060d01193A82216e3669j74622j02746h7296r4986
$$ -63922 -178812 -329310 114060 -401193 182216 -53669 -228291 -331037 -87296 -182282
11342a82282E970c02931i8234C1691J8581M7356e1155r0723q1282i0718k06440
$$ -182282 5970 -302931 -98234 31691 50272 97628 -51155 -141878 -223160 -90718 -297158
11331b97158D7286R2976b17000g4121B08637E929J94949a35044B35a20525B3776
$$ -297158 47286 140262 -217000 -74121 208637 5929 200878 -135044 235 -120525 23776
11319a08387A49590b13195I364J39567g107r9291A08632J0674i795q8025D5215
$$ -108387 149590 -213195 9364 148931 -7107 -106398 108632 119306 -9795 -97820 45215
11307b14771B40583a57640D363f7209l3561j71084f5442j65762r2024b4540G0015
$$ -214771 240583 -157640 4363 -67209 -100770 -271854 -65442 -231204 -323228 -24540 70015
11295a9915m669l79115I2152a02717c1081L109J1913A37533b4588j88383g6214
$$ -19915 -24584 -403699 92152 -102717 -31081 -27972 -16059 137533 -24588 -212971 -76214
11283a36537B31417B4211J85770h30l73985C1015a04670A89193c80577a04768
$$ -136537 231417 24211 209981 -830 -374815 31015 -104670 189193 -380577 -104768
11272a73806l3638A48936o6060J52543M890a10280j48397R0794A80608b53375
$$ -173806 -207444 148936 82876 235419 240309 -110280 -258677 -167883 180608 -253375
11261F9115e3418A61410n6389d3292j36888o0644g9897I5404a4658l3224l3486
$$ 69115 -53418 161410 105021 -43292 -180180 -240824 -79897 95404 -14658 -47882 -81368
11250h1368k58947a54499E6705J22948c01827c3690n2634M2810k17160B83619
$$ -81368 -340315 -154499 56705 179653 -301827 -33690 -86324 -43514 -260674 283619
11239c9489j97575I3308b43515D1604M5750K43640a31597j11673J03800J2302
$$ -39489 -237064 93308 -243515 41604 87354 330994 -131597 -243270 -139470 -127168
11229a27168O1465A1517O3623a41145e9036B7849d5108D8977a07276j09191j15992
$$ -127168 -65703 11517 75140 -141145 -59036 27849 -45108 48977 -107276 -216467 -332459
11218c32459b2292r1709L6692L0939F4224K03312b59742I3812l5544h7469j90121
$$ -332459 -22292 -114001 -77309 -46370 64224 267536 -259742 93812 58268 -87469 -277590
11207b77590C6047B027a71661M7868e7056k17076A73279a66986b5214L770A84510
$$ -277590 36047 2027 -171661 -123793 -57056 -274132 173279 -166986 -25214 -21444 184510
11195e2368J2143l20105I1444a64064j45559Q8398C1824P8231d9033D0809G420
$$ -52368 -40225 -360330 91444 -164064 -309623 -221225 31824 110055 -49033 40809 7420
11183a09981B7052c6510A17979I716J9313J01667r692a24E246b55644k294b1375
$$ -109981 27052 -36510 117979 9716 29029 130696 121004 -124 5246 -255644 -257938 -21375
11170e2316j10603k04875i8167A04097e8159b238j91276e4762A7888Q1384B8244
$$ -52316 -162919 -367794 -98167 104097 -58159 -2238 -193514 -54762 17888 99272 28244
11158a40110b8778B13851M2218a02354A31146k2344b0697A78060c8741C7185O3596
$$ -140110 -28778 213851 256069 -102354 131146 108802 -20697 178060 -38741 37185 100781
11147A00781b90247f3592C055J69647C1434m754a68465j02314i2882c4489k4968
$$ 100781 -290247 -63592 3055 172702 31434 26680 -168465 -270779 -92882 -34489 -59457
11136e9457n769k8796A15522b20935h1053D396J36658A1559g8234k21800k6682
$$ -59457 -65226 -94022 115522 -220935 -81053 4396 141054 11559 -78234 -300034 -326716
11125c26716A69121D9884a80518A24484a24930e8591F2785J6239k2822G940e9576
$$ -326716 169121 49884 -180518 124484 -124930 -58591 62785 79024 56202 7940 -59576
11113b4741A0574a69954e2634j85080A31678d5916l14412A95242F5841K15493
$$ -24741 10574 -169954 -52634 -237714 131678 -45916 -360328 195242 65841 281334
11103B81334n1326D0181a86847E460M4881E915J46574b54635i1264H9491C5694
$$ 281334 230008 40181 -186847 5460 50341 5915 152489 -254635 -91264 89491 35694
11091A89808G9397J20733n3612J84271c36220A6063J6554L05006p5896a19185
$$ 189808 79397 200130 146518 330789 -336220 16063 32617 337623 261727 -119185
11080A57093K3733K9486f2054E76817B49032b9729k7301g773F2962J21736i0712
$$ 157093 180826 210312 -62054 576817 249032 -29729 -57030 -7773 62962 184698 -90712
11068d979B15020R2015j25797K7682j01020K56140B7140J03607a67814c2124C73691
$$ -4979 215020 307035 181238 208920 107900 364040 27140 130747 -167814 -32124 373691
11056B73147J17552j72205M6684N5367A37989M4710r0470N30337b1130A64395
$$ 273147 390699 218494 265178 320545 137989 182699 92229 622566 -21130 164395
11045D97121N1843O438H9261L30378L01502j14714j48097M3264k23956K58892
$$ 497121 548964 555402 89261 419639 721141 606427 458330 501594 277638 536530
11035E36530J39926p1309J16929Q9382k47522L4240K49314J17871l67307J11165
$$ 536530 676456 605147 722076 811458 563936 598176 847490 965361 598054 709219
11025G09219L38403k19158j67219K8434N9863l12751L37385q7871O8718K76689
$$ 709219 1047622 828464 661245 689679 749542 436791 774176 686305 755023 1031712
11015A031712C44683N50371C74094M72699k94813J75280l26154J59379J86260
$$ 1031712 344683 895054 374094 846793 551980 727260 401106 560485 746745
11006G46745p2034J3697k47815P500J22844J07562C03467L64934l8501L7216l0516
$$ 746745 674711 688408 440593 448093 570937 678499 303467 668401 629900 667116 636600
10995F36600P868K3205q3280J35582n9041K421Q758J3237j43233M74849k80141
$$ 636600 644468 667673 584393 719975 660934 663355 672113 685350 542117 1016966 736825
10984G36825J0950j83003j09229J34683J44482L39871k57345j02246j37215L36836
$$ 736825 747775 564772 455543 590226 734708 1074579 817234 714988 577773 914609
10974I14609j63667k26835J48165k6711k30601N6812M30645R3911j05464r400
$$ 914609 750942 524107 672272 645561 414960 471772 902417 996328 890864 881464
10964H81464J21162K62908j07599p9960L1844L56175J45668L6608K34979N27J94826
$$ 881464 1002626 1265534 1157935 1077975 1109819 1465994 1611662 1648270 1883249 1883776 2078602
10953B078602M63818l52860q734L28852o00813L12182m10454J43024K0891m75181
$$ 2078602 2542420 2189560 2180826 2509678 1908865 2221047 1810593 1953617 1974508 1499327
10943A499327k7334j42347k03830K83195m8888L01891k85246K24502l41220j03805
$$ 1499327 1471993 1329646 1125816 1409011 1360123 1662014 1376768 1601270 1260050 1156245
10933A156245l10063L2651j31504j26763n7129J12937B23393M2724D929L61654
$$ 1156245 846182 878833 747329 620566 563437 676374 223393 266117 4929 366583
10923C66583A02617m8838J72730J24957A04120P7121J55778b47341A67881d1129
$$ 366583 102617 53779 226509 351466 104120 181241 337019 -247341 167881 -41129
10912c4713F103b35744C8787j5430a95570A93972b39094E2527B0224a93583a8056
$$ -34713 6103 -235744 38787 23357 -195570 193972 -239094 52527 20224 -193583 -18056
10900A23318J7537c08042J10747A04458D167g8138B859f7626b7838I7944M186
$$ 123318 140855 -308042 -197295 104458 4167 -78138 2859 -67626 -27838 97944 102130
10889A02130K15029a98301A88546K7994h117k6441j41070A65824c1060n8167a9389
$$ 102130 317159 -198301 188546 216540 -8117 -34558 -175628 165824 -31060 -89227 -19389
10877A86259d3493A85109a43287A22057b26175a9363m7892B03404b32496F2203
$$ 186259 -43493 185109 -143287 122057 -226175 -19363 -67255 203404 -232496 62203
10866c1578B3963h9083j75637H8990a41201o6922J8982B78725c2824j31099M4895
$$ -31578 23963 -89083 -264720 88990 -141201 -208123 -189141 278725 -32824 -163923 -119028
10855a19028B0215L45167f5212K1455j22094d8710k03697L1710m1352h6849a8082
$$ -119028 20215 365382 -65212 -43757 -165851 -48710 -252407 -220697 -262049 -86849 -18082
10843a67217m0693r3191N1192G9403l8280h3005j13714F5150R9772d24487A91495
$$ -167217 -207910 -301101 -249909 79403 41123 -83005 -196719 65150 164922 -424487 191495
10831A49893e8406I9050K15793B1952b51665d9890j31424D3564J48556D9219b68725
$$ 149893 -58406 99050 314843 21952 -251665 -49890 -181314 43564 192120 49219 -268725
10819g4268E1916a6413j1252k41317A15230a58037a4417A13218a16529A94293
$$ -74268 51916 -16413 -27665 -268982 115230 -158037 -14417 113218 -116529 194293
10808A1870c96520B69736I03a56038B58786B603J26760n8305i7853k37155J02418
$$ 11870 -396520 269736 903 -156038 258786 2603 129363 71058 -97853 -335008 -232590
10797b32590L5198j8566A05596K0374B1715K43106A09024B0118a87387e9215B53771
$$ -232590 -197392 -215958 105596 125970 21715 264821 109024 20118 -187387 -59215 253771
10785H5420B8278b49879R5485p6576i960B9558P1828f1238k11363b2939j772k7375
$$ 85420 28278 -249879 -154394 -230970 -9960 29558 101386 -61238 -272601 -22939 -24711 -52086
10773e2086n5175k43634d9858F1063a35068N8902B71406A0345d40960B19326n9872
$$ -52086 -107261 -350895 -49858 61063 -135068 -76166 271406 10345 -440960 219326 159454
10762A59454f983k32152J04706P168m9836j84182P3623a02422j29788E7579a6530
$$ 159454 -6983 -239135 -134429 -127261 -177097 -361279 -287656 -102422 -232210 57579 -16530
10750g1888j0599A2085Q0223l1880J2357c27928b8239A31984a87530c7628l42893
$$ -71888 -82487 12085 92308 60428 72785 -327928 -28239 131984 -187530 -37628 -380521
10739c80521C07804A10100B5927i1109H3198f4712J1183I7651K93305A4513Q6590
$$ -380521 307804 110100 25927 -91109 83198 -64712 -53529 97651 390956 14513 101103
10728A01103c7718D63433G5718c35438h2269k82812A53193b2581j27628d8503
$$ 101103 -37718 463433 75718 -335438 -82269 -365081 153193 -22581 -150209 -48503
10717c90715b8481B9877b1428J631A17423d70559C05131a58279J854H3366a72774
$$ -390715 -28481 29877 -21428 -19797 117423 -470559 305131 -158279 -156425 83366 -172774
10705A7544L29985a96151b2043l11212G0468f6364B28007c25050A06836h5234
$$ 17544 347529 -196151 -22043 -333255 70468 -66364 228007 -325050 106836 -85234
10694e2579A5659B36a11365A49177a5310j79336A75669c19010J04227j42888b4618
$$ -52579 15659 236 -111365 149177 -15310 -194646 175669 -319010 -214783 -357671 -24618
10682g4373B97570b06951l3851p8181A24938a96751d4734a4434j55239j76455
$$ -74373 297570 -206951 -240802 -318983 124938 -196751 -44734 -14434 -169673 -346128
10672c46128d2701F2024a72939i121j57579A73669h9614r8088B22345a14694j54919
$$ -346128 -42701 62024 -172939 -9121 -166700 173669 -89614 -187702 222345 -114694 -269613
10661b69613a04649B20714H560J13907a49111j94906a35941j0580j04l555F9932
$$ -269613 -104649 220714 8560 122467 -149111 -344017 -135941 -146521 -146625 -150180 69932
10649A56646a66688I1139J06863b84821D3308e6320B7712N9000L2465b35832H8525
$$ 156646 -166688 91139 198002 -284821 43308 -56320 27712 86712 119177 -235832 88525
10637a53419P4295j2132k9788l7306d5908E80a90412b854j23897l9563A34691
$$ -153419 -79124 -91256 -121044 -158350 -45908 580 -190412 -2854 -126751 -166314 134691
10625A58247i2429c0276j3666m84935a23819A97264c08899J12659g2832A5384
$$ 158247 -92429 -30276 -43942 -528877 -123819 197264 -308899 -196240 -72832 15384
10614E4681c20841J46022K4225j48418b7005B7658J50600c14037a30946a5306
$$ 54681 -320841 -174819 -150594 -299012 -27005 27658 178258 -314037 -130946 -15306
10603a55204g7064D3236M8424R646b65366L0114L8639A97499G4646l6617A8074
$$ -155204 -77064 43236 91660 101306 -265366 -235252 -196613 197499 74646 38029 18074
10591b33206I1737k0826g5934J8777A1695J41293n1236R5861a20504A93587c05657
$$ -233206 91737 70911 -75934 -57157 11695 152988 101752 197613 -120504 193587 -305657
10579b78552a20536F7669L4884h8978p6489j10128A67115L0854P6162l1616b22988
$$ -278552 -120536 67669 102553 -88978 -165467 -275595 167115 197969 274131 242515 -222988
10567f5019N349A16787f4277r4944c8594k133j95098B640b7799j6251A69475q1914
$$ -65019 -59670 116787 -64277 -159221 -38594 -40727 -235825 2640 -27799 -44050 169475 87561
10555H7561j5154K12049b94377A03386B2001b98511P3256F5913a88366A35166
$$ 87561 72407 284456 -294377 103386 22001 -298511 -225255 65913 -188366 135166
10544a6184C2546c18158a3481r4231j04377j34091d8196p7487A46802a79952P6680
$$ -16184 32546 -318158 -13481 -107712 -212089 -346180 -48196 -125683 146802 -179952 -103272
10533a03272A48324e3987A16184P6503h7135g104B02828b73228B58851e7521k27692
$$ -103272 148324 -53987 116184 192687 -87135 -7104 202828 -273228 258851 -57521 -285213
10522b85213M7115A87941G4113k1280A5927b23191A97023i6443F9283a11459n9090
$$ -285213 -238098 187941 74113 52833 15927 -223191 197023 -96443 69283 -111459 -170549
10511a70549b6025p1934B22997h4764k18008a35260O6836G8934A6355P2347M9465
$$ -170549 -26025 -97959 222997 -84764 -302772 -135260 -68424 78934 16355 88702 138167
10500A38167c0707k36006n7072I8009C5740h809q5590r498k7382j31109a20020
$$ 138167 -30707 -266713 -323785 98009 35740 -8809 -94399 -103897 -131279 -262388 -120020
10488i3178H1646b20986B17173C835a77857j09445I3776a37893a7583F8124d9396
$$ -93178 81646 -220986 217173 3835 -177857 -287302 93776 -137893 -17583 68124 -49396
10476b73448c9474C25976D1743d59657C22852b6152l5130A44084j8544f7784A59042
$$ -273448 -39474 325976 41743 -459657 322852 -26152 -61282 144084 125540 -67784 159042
10464e6758j12292A4680N50949m1406A29106P465L12573I0097O3880b5018j8715
$$ -56758 -169050 14680 565629 524223 129106 136571 449144 90097 153977 -25018 -43733
10453d3733A1712h1862n4305k5889b6675q5073A86416a68529N5309B8874e0959
$$ -43733 11712 -81862 -136167 -162056 -26675 -111748 186416 -168529 -113220 28874 -50959
10441D4021d1345H4864a79632j1138j0524A40458K35308B3780a04007k46194J57187
$$ 44021 -41345 84864 -179632 -190770 -201294 140458 375766 23780 -104007 -350201 -193014
10430a93014B721J2383a44248A57261a56640A48966L8307b40272q6101E9058i9446
$$ -193014 2721 15104 -144248 157261 -156640 148966 187273 -240272 -326373 59058 -99446
10418h4165F1593J86264I6255F206a30629L8259A5392R8721b69604G91a14019
$$ -84165 61593 247857 96255 6206 -130629 -92370 15392 114113 -269604 791 -114019
10406d6610l47031J33142c9222A32437a18581o4741a7305A38a01454l12061a52151
$$ -46610 -393641 -260499 -39222 132437 -118581 -183322 -17305 138 -101454 -413515 -152151
10394d37540d5451j17018J5835C3102e6867b0178j07977d4865p6726n3339A71446
$$ -437540 -45451 -162469 -146634 33102 -56867 -20178 -128155 -44865 -121591 -174930 171446
10382B58444q2077H0479c38364A44601L10669f143j99025H6551m149f683k6750
$$ 258444 176367 80479 -338364 144601 455270 -6143 -205168 86551 82402 -6683 -33433
10371c3433C6813N6596J74057J9604B6078J33203A3211d8668B817L59525a4408
$$ -33433 36813 93409 267466 287070 26078 159281 13211 -48668 2817 362342 -14408
10359B60450p139m1857K8360a4165A64472M4907L7517a30596A36486R5173K72233
$$ 260450 253311 211454 239814 -14165 164472 209379 246896 -130596 136486 231659 503892
10348E03892B01611O6967M22128B27571o0818J61411k3958H8597L88424I9183
$$ 503892 201611 268578 690706 227571 166753 328164 304206 88597 477021 99183
10337E31784k36226a07324B01032K80509q366A60065L69956k34443q3121K05353
$$ 531784 295558 -107324 201032 481541 473175 160065 530021 295578 212457 417810
10327D17810I5766O2391K29802K5171A27330R4046r5392P0950c8588A18307K9635
$$ 417810 95766 158157 387959 413130 127330 221376 125984 196934 -38588 118307 147942
10316A47942o7359E107K19101h8429B2973J0884a7731E26136C2655e5719o1675
$$ 147942 80583 5107 224208 -88429 22973 33857 -17731 526136 32655 -55719 -117394
10305a17394B81725P7641j66699M5389j03497b3944j65748b5880k37116l3254
$$ -117394 281725 359366 192667 238056 134559 -23944 -189692 -25880 -262996 -296250
10295b96250d1087I5487J64886c08404A10670L11707C6076b36780F7402M0596
$$ -296250 -41087 95487 260373 -308404 110670 422377 36076 -236780 67402 107998
10285A07998N4165d66020a90963A70649M8185J85781F123c1999j31246R995A11326
$$ 107998 162163 -466020 -190963 170649 218834 404615 6123 -31999 -163245 -153250 111326
10273C24730H3513a88361L7710d0670B49144b13544O4805r830m1976N1551A19674
$$ 324730 83513 -188361 -150651 -40670 249144 -213544 -148739 -158569 -200545 -148994 119674
10261F0424a47135b7645A46277a00050D1008a35114n0853O3593A18185b17640
$$ 60424 -147135 -27645 146277 -100050 41008 -135114 -185967 -122374 118185 -217640
10250a43107F9617a10629E9109B2910a50889j94214A6711b63177B6682P041a26866
$$ -143107 69617 -110629 59109 22910 -150889 -345103 16711 -263177 26682 33723 -126866
10238C35551b74215a3756l48629B10213o1747j1344E0969O5859K7081a44045M8497
$$ 335551 -274215 -13756 -362385 210213 148466 137122 50969 116828 143909 -144045 -95548
10227i5548B02261A1589a60826e412G8513g46225a07319f720k5969l54636I6047
$$ -95548 202261 11589 -160826 -5412 78513 -746225 -107319 -6720 -32689 -387325 96047
10215c389k4496k10417m4505i1185A57476d2466j17413A37324C7029J32212J21499
$$ -3389 -27885 -238302 -282807 -91185 157476 -42466 -159879 137324 37029 169241 290740
10204B90740h8885j2926C5418h9001B04209b62817i945A91489Q37a58845R09C248
$$ 290740 -88885 -101811 35418 -89001 204209 -262817 -9945 191489 192326 -158845 -157936 3248
10191I7685b54427f5615l49029c3280A06483a88050G588a27540G2213J3957D2686
$$ 97685 -254427 -65615 -414644 -33280 106483 -188050 7588 -127540 72213 86170 42686
10179C5654R5073g0785G8898A6635g7348j32405c4966j10443C2105d98896a66676
$$ 35654 130727 -70785 78898 16635 -77348 -209753 -34966 -145409 32105 -498896 -166676
10167b8046j8764B71107g7331k11006b267E6208a34489A87312D9777a52841B28994
$$ -28046 -46810 271107 -77331 -288337 -2267 56208 -134489 187312 49777 -152841 228994
10155a55656e5591n48915a73614G58a49073j80483J9185i7341l11184J58638M8709
$$ -155656 -55591 -604506 -173614 758 -149073 -329556 -310371 -97341 -408525 -249887 -201178
10144b01178D7279A8247b45820N2888r9580A32081n7120j5528f0708G643a01115
$$ -201178 47279 18247 -245820 -192932 -292512 132081 74961 59433 -60708 7643 -101115
10132a74636A88060O178a37295H7427b97128g2954n4292c8118G7644e4747A10324
$$ -174636 188060 194238 -137295 87427 -297128 -72954 -127246 -38118 77644 -54747 110324
10120f5438A08367a42225J1081A24758a59986M4207D8425A4770k404J70056A2772
$$ -65438 108367 -142225 -131144 124758 -159986 -115779 48425 14770 12366 182422 12772
10108a13794I6410a49711q0873J02371G1811c45926J65444M9320N435E3989j4912
$$ -113794 96410 -149711 -230584 -128213 71811 -345926 -180482 -131162 -125727 53989 39077
10097C9077L30068a47376d8765G5630a98855A04427J01139A1576M9836J48945
$$ 39077 369145 -147376 -48765 75630 -198855 104427 205566 11576 61412 210357
10087B10357c83185R7655G4304b3212e822j91414r4824B07609b0071G3702b01612
$$ 210357 -383185 -285530 74304 -23212 -5822 -197236 -292060 207609 -20071 73702 -201612
10075a7261j04457G7077A935g9255a1108m22382d501B99148D9255e4273j17372
$$ -17261 -121718 77077 1935 -79255 -11108 -433490 -4501 299148 49255 -54273 -171645
10064a71645F6465Q2962H415d0726m6961b5906k17359h9070A1322J02885a72854
$$ -171645 66465 149427 8415 -40726 -87687 -25906 -243265 -89070 11322 114207 -172854
10052A35438P409b36166j6858c8301O805A16206c7620l60379G8296J3634g6761
$$ 135438 142847 -236166 -253024 -38301 -31496 116206 -37620 -397999 78296 91930 -76761
10040b89773A31201B9544h486j84801m7999J08750a1512j35350g066B62195a39151
$$ -289773 131201 29544 -8486 -193287 -241286 -132536 -11512 -146862 -7066 262195 -139151
10028C9492M1122K721B8551d44581h2373r8107k2455M3455p5213j6696a02701
$$ 39492 80614 83335 28551 -444581 -82373 -180480 -202935 -159480 -234693 -251389 -102701
10016C8674a09083A06861m0008N6362L40103a38814B38905a47523N1257g920A5572
$$ 38674 -109083 106861 66853 123215 463318 -138814 238905 -147523 -96266 -7920 15572
10004c0627j28979f4688B788c70098A06398b03086e1655C7588b04999k05331a35966
$$ -30627 -159606 -64688 2788 -370098 106398 -203086 -51655 37588 -204999 -410330 -135966
9992A06520b16181B8897J18376a61837k40139a5037k46584k8883m8943H4803b6845
$$ 106520 -216181 28897 147273 -161837 -401976 -15037 -261621 -290504 -339447 84803 -26845
9980a48838B23815c4820k65468i4034K9354j63719H9626a65500F4404b44713o0147
$$ -148838 223815 -34820 -300288 -94034 -64680 -228399 89626 -165500 64404 -244713 -304860
9969c04860k4831A56575a40534C66053a3538N090n7147F2040C469K09841a7387
$$ -304860 -329691 156575 -140534 366053 -13538 -8448 -65595 62040 3469 213310 -17387
9957A8968a06425l69646J19116k1087E3970K26228h5553A62111a00330A60530
$$ 18968 -106425 -476071 -356955 -378042 53970 280198 -85553 162111 -100330 160530
9946b64547D7314b1090o0904B41357a16277d7159B9693a12948K1114A95432a33439
$$ -264547 47314 -21090 -81994 241357 -116277 -47159 29693 -112948 -91834 195432 -133439
9934a03019j45870g9942k79359A04061D7495J31876b29430E9094a37116A6506
$$ -103019 -248889 -79942 -359301 104061 47495 179371 -229430 59094 -137116 16506
9923b38916f0416G8561R5238p634g075D2323a43191D96856k47110a75992L3115
$$ -238916 -60416 78561 173799 166165 -7075 42323 -143191 496856 249746 -175992 -142877
9912a42877O7908C36857b89479H1064J50393d07017a48755c211k28231b4148k0549
$$ -142877 -74969 336857 -289479 81064 231457 -407017 -148755 -3211 -231442 -24148 -44697
9901d4697j54577F585M6880A2070a55850j80634a38955j25587Q6820f8453R766
$$ -44697 -199274 6585 53465 12070 -155850 -336484 -138955 -264542 -177722 -68453 -58687
9890e8687B59720a65759f7655C6484K7162a08696k86618A16862c27855f3l7741
$$ -58687 259720 -165759 -67655 36484 63646 -108696 -395314 116862 -327855 -63 -37804
9879c7804j34881B71009c00437e6381k18154j38121f9968B9407a28973f1587A92257
$$ -37804 -172685 271009 -300437 -56381 -274535 -412656 -69968 29407 -128973 -61587 192257
9867c85246J28282m3951E8536a88535P0468e8728o3440B16899b78817K3493B68332
$$ -385246 -256964 -300915 58536 -188535 -118067 -58728 -122168 216899 -278817 -255324 268332
9855a93798A2664K00117d5328j44465A15659d8700G4143b00149k37371g646k40935
$$ -193798 12664 212781 -45328 -189793 115659 -48700 74143 -200149 -437520 -7646 -248581
9844b48581i1790B184c88703E6567d583j18221A10347a98106K8809I4960b9148
$$ -248581 -91790 2184 -388703 56567 -4583 -122804 110347 -198106 -169297 94960 -29148
9832D2002J16464d4163n8285A35900b14853D68551d9712E158a14731p3996k6487
$$ 42002 158466 -44163 -102448 135900 -214853 468551 -49712 5158 -114731 -188727 -215214
9821b15214D0524a44953c1103l14941A66699M3631b8117k11099e4056a7350j74159
$$ -215214 40524 -144953 -31103 -346044 166699 210330 -28117 -239216 -54056 -17350 -191509
9810a91509C40262a24527e3186k49829A35251D2687c06803a19699A63146a38274
$$ -191509 340262 -124527 -53186 -303015 135251 42687 -306803 -119699 163146 -138274
9799g8239C42038e6069j08918d5218m70877b21920A09558c48879M3411d726B42091
$$ -78239 342038 -56069 -164987 -45218 -516095 -221920 109558 -348879 -305468 -4726 242091
9787i7872q976l03012J88879b9980k78256B14895p2046G392J21158J61736o6711
$$ -97872 -106848 -409860 -220981 -29980 -308236 214895 142849 7392 128550 290286 223575
9776B23575f7568A50515n7011a12896j9164A33723c61667h2525K0971j0634J7099
$$ 223575 -67568 150515 93504 -112896 -132060 133723 -361667 -82525 -61554 -72188 -55089
9765e5089l50326a93935A91219g4426l6346A2285O961K8654M5464p442b38718
$$ -55089 -405415 -193935 191219 -74426 -110772 12285 19246 47900 93364 85922 -238718
9753b24769h1663l5233B97446c37826D1597l29M8533d11788b3275j53803P6986
$$ -224769 -81663 -116896 297446 -337826 41597 41268 89801 -411788 -23275 -177078 -100092
9742a00092C8873a41988D7995N7575d9939I1107c14416G8375M05559f0187K1265
$$ -100092 38873 -141988 47995 105570 -49939 91107 -314416 78375 483934 -60187 -38922
9731c8922q4936F9019a82428J4696f3201r7717B7278b40153a8230D0805d25524
$$ -38922 -123858 69019 -182428 -167732 -63201 -160918 27278 -240153 -18230 40805 -425524
9719b01965h3743H9906l4357N2162a36229e1021A61729a06955H272c21807a5750
$$ -201965 -83743 89906 55549 107711 -136229 -51021 161729 -106955 8272 -321807 -15750
9707c9488j98170a11328r7248i2489J2197j34670q4142g799k82978h2978j30879
$$ -39488 -237658 -111328 -208576 -92489 -80292 -214962 -299104 -7799 -290777 -82978 -213857
9696b13857K7242F1746a43236D512a27376m254k00049F4237h5886q2560f9643
$$ -213857 -186615 61746 -143236 4512 -127376 -131630 -331679 64237 -85886 -168446 -69643
9684i3982r3910i0444A22795c2934l22849a3893m1319k83695a28947E621K14394
$$ -93982 -187892 -90444 122795 -32934 -355783 -13893 -55212 -338907 -128947 5621 220015
9673B20015a30004l59946J40705M6392B08311a08487j68834d8065J8629l24006
$$ 220015 -130004 -489950 -349245 -302853 208311 -108487 -277321 -48065 -29436 -353442
9663c53442H0474n799D10b68842h232A18591d6071J9592l00290A37567E7194a06012
$$ -353442 80474 74675 410 -268842 -8232 118591 -46071 -26479 -326769 137567 57194 -106012
9650c18790e6235A47303K3994e8137k62082F2251O2698B3971c32208a65288A22573
$$ -318790 -56235 147303 171297 -58137 -320219 62251 124949 23971 -332208 -165288 122573
9638A4871b78622A73789J24759b3753j33772B04010b38299i6867M8348l4937F8764
$$ 14871 -278622 173789 298548 -23753 -157525 204010 -238299 -96867 -48519 -83456 68764
9626F8041b6501A03345d49593A98791i3410o1983A69432b66058B80333A0233e4244
$$ 68041 -26501 103345 -449593 198791 -93410 -155393 169432 -266058 280333 10233 -54244
9614C7411g7964H8516a08088A72827b38508L2536L7242j61420M8991C9184L9168
$$ 37411 -77964 88516 -108088 172827 -238508 -205972 -168730 -330150 -281159 39184 78352
9603G8352l3775g4997o8263O1046F7007b20440A27420a5694A13330i4232A94402
$$ 78352 44577 -74997 -143260 -82214 67007 -220440 127420 -15694 113330 -94232 194402
9591a16650A64103b37028C9575c8702m00005c7930A03990b28090A6177h0636A73945
$$ -116650 164103 -237028 39575 -38702 -438707 -37930 103990 -228090 16177 -80636 173945
9579A70899J03344a6216m2502p0390h821B02537p6152l2014a04435o0698a4456
$$ 170899 274243 -16216 -58718 -129108 -8821 202537 126385 94371 -104435 -165133 -14456
9567A20726c7349q1781B7356c28160a13464M3162A5503b88272a07151d372l30829
$$ 120726 -37349 -119130 27356 -328160 -113464 -70302 15503 -288272 -107151 -4372 -335201
9556c35201C0017c21613a17403Q939j76465a28165a7297k36875p5096a2338A12200
$$ -335201 30017 -321613 -117403 -108464 -284929 -128165 -17297 -254172 -329268 -12338 112200
9544A86930d4513j33051O5886F5697b04253l9940A18301a15139p43j74948B17930
$$ 186930 -44513 -177564 -111678 65697 -204253 -244193 118301 -115139 -115882 -290830 217930
9532A01964d7804C9554g9982j54321B30112j08832b89245A0727c61087a10481
$$ 101964 -47804 39554 -79982 -234303 230112 121280 -289245 10727 -361087 -110481
9521a27866L9632B57237e9305n2612b4965k38106E1530B2202a69166A45624a24385
$$ -127866 -88234 257237 -59305 -111917 -24965 -263071 51530 22202 -169166 145624 -124385
9509E5265J1806c16944P4971k3145P0856r5562R9925Q0128A99099e4549a9861
$$ 55265 67071 -316944 -241973 -265118 -194262 -289824 -189899 -109771 199099 -54549 -19861
9497b25564k26991i0141j41827D8734a9189A98096E8157c35574J60889C8609j685
$$ -225564 -452555 -90141 -231968 48734 -19189 198096 58157 -335574 -174685 38609 36924
9486C6924c15115c5q5756q1942c6958A06308a14135k35537j15470A4842a07373
$$ 36924 -315115 -35 -85791 -167733 -36958 106308 -114135 -349672 -465142 14842 -107373
9474C6194c63706a0669o8997L173A79716b35728p9100R9884G6117a53183N9863
$$ 36194 -363706 -10669 -79666 -76493 179716 -235728 -314828 -214944 76117 -153183 -93320
9463i3320L1628c0063a050l44198r5854A34682b45907O048O2687j7155R4863H6240
$$ -93320 -61692 -30063 -1050 -345248 -441102 134682 -245907 -239859 -177172 -194327 -99464 86240
9450a02686b0487C80786A17489J35547p0119h4340A35694j219a15463B84477c03089
$$ -102686 -20487 380786 117489 253036 182917 -84340 135694 134475 -115463 284477 -303089
9438a78720J3130a8348H6190h8402a2250o7215l45162a25277B43413A15924a93458
$$ -178720 -165590 -18348 86190 -88402 -12250 -79465 -424627 -125277 243413 115924 -193458
9426I8542a07152k58863c0822B00421i5860b1183j6892g503k45079A14714i4898
$$ 98542 -107152 -366015 -30822 200421 -95860 -21183 -38075 -7503 -252582 114714 -94898
9414d5191l8885j98319J119J32514H1785J79331a42587j07487J6427j1607B29041
$$ -45191 -84076 -282395 -281276 -148762 81785 261116 -142587 -250074 -233647 -245254 229041
9402B36437a47640e831H2037N5524a55350A17126K58996a95152j06242B52901
$$ 236437 -147640 -5831 82037 137561 -155350 117126 376122 -195152 -301394 252901
9391A9515h7263I9901a32492A19935D3794O1049d0912q610B1176b5940B74099
$$ 19515 -87263 99901 -132492 119935 43794 104843 -40912 -49522 21176 -25940 274099
9379B70891D9311g4736k2259B3054J789a30585A51649d5438j33112B3483b68765
$$ 270891 49311 -74736 -96995 23054 24843 -130585 151649 -45438 -178550 23483 -268765
9367b47031b0236l52470J49207o2185g1706B66696r924L7951b664j86368G2825
$$ -247031 -20236 -372706 -223499 -285684 -71706 266696 256772 294723 -2664 -189032 72825
9355a85155A88738a78055e2291n6497j53930J01770d235A31522a56636l4040a2312
$$ -185155 188738 -178055 -52291 -108788 -262718 -160948 -4235 131522 -156636 -190676 -12312
9343b57801G039Q6848D6546a66775m5292c8868k48370j64114J33191I9617i3596
$$ -257801 7039 93887 46546 -166775 -212067 -38868 -287238 -451352 -318161 99617 -93596
9331b03331j20827J15565b935A84588D9051L3261r115A8977Q3031j493a98606
$$ -203331 -324158 -208593 -2935 184588 49051 82312 73197 18977 102008 100515 -198606
9319B07119e0973B01762a29360j21794L833j2297J18655c0119D2729a3352A5162
$$ 207119 -50973 201762 -129360 -251154 -247321 -259618 -140963 -30119 42729 -13352 15162
9307a0428m2902A16646a26950k80289B74338i7805r7685R6149A02128L2662d9070
$$ -10428 -53330 116646 -126950 -407239 274338 -97805 -195490 -99341 102128 134790 -49070
9295B00059H3077b29476C0476J16520b23895G0095a10587L2910B89273j01593
$$ 200059 83077 -229476 30476 146996 -223895 70095 -110587 -77677 289273 187680
9285A87680q8506A4005K61845I7470m6084c31105A20427j0477c51229A03072d05360
$$ 187680 99174 14005 275850 97470 51386 -331105 120427 109950 -351229 103072 -405360
9273c45092a04649A11323J5781b65552J25087L7099j50535c5948f15H8127B7499
$$ -345092 -104649 111323 127104 -265552 -140465 -103366 -253901 -35948 -615 88127 27499
9261a63339j20649I5387i4520J861C91006a59025f0706k92000H3386a02465j27450
$$ -163339 -283988 95387 -94520 -92659 391006 -159025 -60706 -352706 83386 -102465 -229915
9250b29915I6253D0710b7720j40851A05633J87045c5972r0536j59405d8689j32821
$$ -229915 96253 40710 -27720 -168571 105633 292678 -35972 -126508 -285913 -48689 -181510
9239a81510p9570C6906a74834j16471A83412F745c838A85298a6295I6326g3041
$$ -181510 -261080 36906 -174834 -291305 183412 6745 -3838 185298 -16295 96326 -73041
9227c41512B75699h2860j77684a20789b4684j76224q494F7551c8924k63862a24446
$$ -341512 275699 -82860 -260544 -120789 -24684 -200908 -209402 67551 -38924 -302786 -124446
9215f0925B8556a16650B70163a76579B3917a23588j42064a06879d2550j87093
$$ -60925 28556 -116650 270163 -176579 23917 -123588 -265652 -106879 -42550 -229643
9205b29643J6178l1729f0107A84649g7427k12814J17605r4109h5914j08679k45966
$$ -229643 -213465 -245194 -60107 184649 -77427 -290241 -172636 -266745 -85914 -194593 -440559
9194d40559A55848a19821m228A11301b06503c0890F8307a23963e8424A5391a72098
$$ -440559 155848 -119821 -124049 111301 -206503 -30890 68307 -123963 -58424 15391 -172098
9182d7866j61071l0681q7605G4833d14675E4892b55006a03953b9635j33674r0058
$$ -47866 -208937 -239618 -327223 74833 -414675 54892 -255006 -103953 -29635 -163309 -253367
9171b53367Q9195j27783J21737q93j66620B05491r0264J19522E786f3851k48344
$$ -253367 -164172 -291955 -170218 -171111 -337731 205491 115227 234749 5786 -63851 -312195
9160c12195P4021M522K7390G8165e30328K55094a32081j53384P8045A41332E6985
$$ -312195 -238174 -233652 -206262 78165 -530328 -275234 -132081 -285465 -207420 141332 56985
9148b2915l46802e3011j29192l3867G3972J51346a69177b5653k95536a15993j57919
$$ -22915 -369717 -53011 -182203 -216070 73972 225318 -169177 -25653 -321189 -115993 -273912
9137b73912a08053k92105B16647G6712l0514a857l86269A731a48770A16396C4510
$$ -273912 -108053 -400158 216647 76712 46198 -1857 -388126 1731 -148770 116396 34510
9125H4141D321e0229j06836N5860p9732k20415J46579A78140A3806b18921I5828
$$ 84141 4321 -50229 -157065 -101205 -180937 -401352 -254773 178140 13806 -218921 95828
9113a01306k16196F4447Q0631b26510a11491L0898a9566B33135a6650B10366a94534
$$ -101306 -317502 64447 145078 -226510 -111491 -80593 -19566 233135 -16650 210366 -194534
9101D1752b21039G1666M0915a67691o0006H4215a12887B827a15279r5204O512
$$ 41752 -221039 71666 112581 -167691 -227697 84215 -112887 2827 -115279 -210483 -203971
9090b03971A49982C2763A4020J83443J74139a90918A02764a82508j16939J7765
$$ -203971 149982 32763 14020 197463 371602 -190918 102764 -182508 -299447 -281682
9080b81682B84119A41369F2032J03777b06434A60493b16218B06249a60633E9296
$$ -281682 284119 141369 62032 165809 -206434 160493 -216218 206249 -160633 59296
9069A30546d1155D6263b00681j43596J70184c6041q7831H8430B2471d3894k6337
$$ 130546 -41155 46263 -200681 -344277 -174093 -36041 -123872 88430 22471 -43894 -70231
9058g0231j08133E2754j2755a07927C4722b08985j22492b6428p6411C7438b20917
$$ -70231 -178364 52754 39999 -107927 34722 -208985 -331477 -26428 -102839 37438 -220917
9046a5995C1914a20018j8091L0495i875I7221f92625H85b92746j70603a05614
$$ -15995 31914 -120018 -138109 -107614 -9875 97221 -692625 885 -292746 -463349 -105614
9034a6926k33904a23960o6066k4415Q2303e024C54058a43432m3922g8500j98970
$$ -16926 -250830 -123960 -190026 -214441 -132138 -5024 354058 -143432 -187354 -78500 -277470
9023b77470j21037g0246p7246j74069a02755c1617l75290c8053B14196c0873M477
$$ -277470 -398507 -70246 -147492 -321561 -102755 -31617 -406907 -38053 214196 -30873 -26396
9012b6396l57053J22829R3049j44667b2796k36689c4715l33758I4008l2000a25380
$$ -26396 -383449 -260620 -167571 -312238 -22796 -259485 -34715 -368473 94008 62008 -125380
9000A59134E3173K64399A27535k3003E1858b83360f5836C9636e8365b6353C3161
$$ 159134 53173 317572 127535 104532 51858 -283360 -65836 39636 -58365 -26353 33161
8988A28117B0579b86116e4150k77418K3128e4517k714A41018l78f63l35636a880
$$ 128117 20579 -286116 -54150 -331568 -308440 -54517 -57231 141018 140640 -663 -336299 -1880
8975h2907o5564j10464Q5701p2863A5325b41776f4017A00124R0458b54835d8721
$$ -82907 -148471 -258935 -173234 -246097 15325 -241776 -64017 100124 190582 -254835 -48721
8963c1807j66409A80070c0921B77182c42947A66703b75718J22731O2846j15197
$$ -31807 -198216 180070 -30921 277182 -342947 166703 -275718 -152987 -90141 -205338
8953b05338B05630B1888b04940h3057B64010a4689E17389F9680a01597k82628
$$ -205338 205630 21888 -204940 -83057 264010 -14689 517389 69680 -101597 -384225
8943c84225g5892k12869O3179C2404b32309e8581B4579g8026B43558c198j75944
$$ -384225 -75892 -288761 -225582 32404 -232309 -58581 24579 -78026 243558 -3198 -179142
8932a79142I5526l9626b55878J9821B6967c19176J17864A27666n8510a05412c8481
$$ -179142 95526 55900 -255878 -236057 26967 -319176 -201312 127666 69156 -105412 -38481
8920d2173D6375a60134G4309K20187p1191q5880J41649b1613A18917k1420a37764
$$ -42173 46375 -160134 74309 294496 223305 137425 279074 -21613 118917 97497 -137764
8908A27678L17720L39012K88480Q26036J702687L806171l326578A872143I18341
$$ 127678 445398 784410 1072890 1898926 3601613 7407784 4081206 1872143 918341
8898D54693O0444A48425K57198a21827A40996R959i187n738j4085B02241B1989
$$ 454693 515137 148425 405623 -121827 140996 150955 -9187 -14925 -29010 202241 21989
8886D21857A96383f5084l57454F0018i9196j44217b9800B26039C3340J88908a31024
$$ 421857 196383 -65084 -422538 60018 -99196 -243413 -29800 226039 33340 222248 -131024
8874b57598m8974a28294r0036R2373G4167c2427j4961m5282I5896f4668l05675
$$ -257598 -306572 -128294 -218330 -125957 74167 -32427 -47388 -92670 95896 -64668 -370343
8863c70343j53487a32111c4386j23033B90040a39579E0583a51571I0989i7289
$$ -370343 -523830 -132111 -34386 -157419 290040 -139579 50583 -151571 90989 -97289
8852b36960n0006B4227J21200a10627j69083A98927I8232J83967m3395c7232k0689
$$ -236960 -286966 24227 145427 -110627 -279710 198927 98232 282199 238804 -37232 -57921
$$ [...]
##END NTUPLES=NMR SPECTRUM
##END=
