
##TITLE=AC1068_TOPL01_6519229_qYJ3gEzVqc
##JCAMPDX= 6.0         $$ Bruker NMR JCAMP-DX V2.0
##DATA TYPE= NMR SPECTRUM
##DATA CLASS= NTUPLES
##ORIGIN= BRUKER
##OWNER= Administrator
$$ 1.72 TOPSPIN		Version 2.1
$$ 2012-07-13 14:31:14.125 -0500  Administrator@TOPSPIN
$$ Compression mode = diff/dup
##.OBSERVE FREQUENCY= 400.02188249412
##.OBSERVE NUCLEUS= ^1H
##.ACQUISITION MODE= SIMULTANEOUS (DQD)
##.ACQUISITION SCHEME= undefined
##.AVERAGES= 8
##.DIGITISER RES= 22
##SPECTROMETER/DATA SYSTEM= spect
##.PULSE SEQUENCE= zg30
##.SOLVENT NAME= COFFEE_meoh
##.SHIFT REFERENCE= INTERNAL, COFFEE_meoh, 1, 14.98509
##AUDIT TRAIL= $$ (NUMBER, WHEN, WHO, WHERE, PROCESS, VERSION, WHAT)
$$ ##TITLE= Audit trail, TOPSPIN		Version 2.1
$$ ##JCAMPDX= 5.01
$$ ##ORIGIN= Bruker BioSpin GmbH
$$ ##OWNER= Administrator
$$ $$ C:\Bruker\TOPSPIN/data/COFFEE/nmr/AC1068_TOPL01_6519229_qYJ3gEzVqc/10/pdata/1/auditp.txt
$$ ##AUDIT TRAIL=  $$ (NUMBER, WHEN, WHO, WHERE, PROCESS, VERSION, WHAT)
(   1,<2012-07-13 14:31:06.765 -0500>,<Administrator>,<TOPSPIN>,<go>,<TOPSPIN 2.1>,
      <created by zg
	started at 2012-07-13 14:30:00.250 -0500,
	POWCHK enabled, PULCHK disabled,
       configuration hash MD5:
       6B 1B 68 BB D9 2E 58 E2 7F 35 AD 54 07 DF 0E 41
       data hash MD5: 64K
       8D D0 4D 61 E9 1C C2 D5 99 75 7A F2 5E F1 46 74>)
(   2,<2012-07-13 14:31:09.765 -0500>,<Administrator>,<TOPSPIN>,<proc1d>,<TOPSPIN 2.1>,
      <Start of raw data processing
       efp LB = 0 FT_mod = 6 PKNL = 1 PHC0 = 0 PHC1 = 0 SI = 32K 
       data hash MD5: 32K
       9F 9B FB 14 D0 5C CB 2F 9E 53 BD 31 88 A0 35 0E>)
(   3,<2012-07-13 14:31:10.093 -0500>,<Administrator>,<TOPSPIN>,<proc1d>,<TOPSPIN 2.1>,
      <pk PHC0 = 176.2482 PHC1 = 0 
       data hash MD5: 32K
       01 9F 47 63 45 5C 53 C9 64 D1 62 55 D3 4E 4B 65>)
(   4,<2012-07-13 14:31:10.171 -0500>,<Administrator>,<TOPSPIN>,<proc1d>,<TOPSPIN 2.1>,
      <abs ABSG = 1 
       data hash MD5: 32K
       D9 AF 80 A0 48 C7 9E 3E A7 4A 72 6C B4 BF 3A 4E>)
(   5,<2012-07-13 14:31:10.203 -0500>,<Administrator>,<TOPSPIN>,<proc1d>,<TOPSPIN 2.1>,
      <abs ABSG = 2 
       data hash MD5: 32K
       B3 C5 75 C5 4A C7 25 04 73 CA C1 6A 3A BA 39 66>)
(   6,<2012-07-13 14:31:10.234 -0500>,<Administrator>,<TOPSPIN>,<proc1d>,<TOPSPIN 2.1>,
      <abs ABSG = 3 
       data hash MD5: 32K
       17 F0 DD F0 C4 56 95 EF 7E 56 8F 14 A5 9D 5F 01>)
(   7,<2012-07-13 14:31:10.265 -0500>,<Administrator>,<TOPSPIN>,<proc1d>,<TOPSPIN 2.1>,
      <abs ABSG = 4 
       data hash MD5: 32K
       41 49 1B B6 C7 F3 B4 DB EA 88 FE 71 0F D9 E8 8E>)
(   8,<2012-07-13 14:31:10.296 -0500>,<Administrator>,<TOPSPIN>,<proc1d>,<TOPSPIN 2.1>,
      <abs ABSG = 5 
       data hash MD5: 32K
       D4 06 C7 80 E2 83 D0 4E 61 50 40 07 20 8C 86 0A>)
$$ ##END=
$$ 
$$ $$ hash MD5
$$ $$ BB E5 CD 83 AD E1 FA 98 A6 51 11 B1 64 26 6E 1D
##$RELAX= 
##$RELAX= 
##$RELAX= 
##$RELAX= 
##$RELAX= 
##$RELAX= 
##$RELAX= 
##$RELAX= 
$$ Bruker specific parameters
$$ --------------------------
$$ [...]
150 150 150 150 150 150 150 150
##$TP07= 0
##$TPNAME0= <>
##$TPNAME1= <>
##$TPNAME2= <>
##$TPNAME3= <>
##$TPNAME4= <>
##$TPNAME5= <>
##$TPNAME6= <>
##$TPNAME7= <>
##$TPOAL= (0..7)
0.5 0.5 0.5 0.5 0.5 0.5 0.5 0.5
##$TPOFFS= (0..7)
0 0 0 0 0 0 0 0
##$TUNHIN= 0
##$TUNHOUT= 0
##$TUNXOUT= 0
##$USERA1= <user>
##$USERA2= <user>
##$USERA3= <user>
##$USERA4= <user>
##$USERA5= <user>
##$V9= 5
##$VALIST= <valist>
##$VCLIST= <CCCCCCCCCCCCCCC>
##$VD= 0
##$VDLIST= <DDDDDDDDDDDDDDD>
##$VPLIST= <PPPPPPPPPPPPPPP>
##$VTLIST= <TTTTTTTTTTTTTTT>
##$WBST= 2048
##$WBSW= 25
##$XGAIN= (0..3)
0 0 0 0
##$XL= 0
##$YL= 0
##$YMAX_a= 494989
##$YMIN_a= -643820
##$ZGOPTNS= <>
##$ZL1= 120
##$ZL2= 120
##$ZL3= 120
##$ZL4= 120
##$ABSF1= 14.98509
##$ABSF2= -5.573092
##$ABSG= 5
##$ABSL= 3
##$ALPHA= 0
##$AQORDER= 0
##$ASSFAC= 0
##$ASSFACI= 0
##$ASSFACX= 0
##$ASSWID= 0
##$AUNMP= <proc_prof1d_extract_pilot.lims>
##$AXLEFT= 0
##$AXNAME= <>
##$AXNUC= <1H>
##$AXRIGHT= 0
##$AXTYPE= 0
##$AXUNIT= <>
##$AZFE= 0.1
##$AZFW= 0.1
##$BCFW= 0
##$BC_mod= 0
##$BYTORDP= 0
##$COROFFS= 0
##$CY= 15
##$DATMOD= 1
##$DC= 0
##$DFILT= <>
##$DTYPP= 0
##$F1P= 0
##$F2P= 0
##$FCOR= 0.5
##$FTSIZE= 32768
##$FT_mod= 6
##$GAMMA= 0
##$GB= 0
##$INTBC= 1
##$INTSCL= 1
##$ISEN= 128
##$LB= 0
##$LEV0= 0
##$LPBIN= 0
##$MAXI= 10000
##$MC2= 0
##$MEAN= 0
##$ME_mod= 0
##$MI= 0
##$NCOEF= 0
##$NC_proc= -8
##$NLEV= 6
##$NOISF1= 0
##$NOISF2= 0
##$NSP= 0
##$NTH_PI= 0
##$NZP= 0
##$OFFSET= 14.98509
##$PC= 1
##$PHC0= 176.2482
##$PHC1= 0
##$PH_mod= 1
##$PKNL= yes
##$PPARMOD= 0
##$PPDIAG= 0
##$PPIPTYP= 0
##$PPMPNUM= 2147483647
##$PPRESOL= 1
##$PSCAL= 4
##$PSIGN= 0
##$PYNMP= <proc.py>
##$REVERSE= no
##$SF= 400.02
##$SI= 32768
##$SIGF1= 0
##$SIGF2= 0
##$SINO= 400
##$SIOLD= 32768
##$SPECTYP= <>
##$SREGLST= <1H.CDCl3>
##$SSB= 0
##$STSI= 32768
##$STSR= 0
##$SW_p= 8223.68421052631
##$SYMM= 0
##$S_DEV= 0
##$TDeff= 65536
##$TDoff= 0
##$TI= <>
##$TILT= no
##$TM1= 0
##$TM2= 0
##$TOPLEV= 0
##$USERP1= <user>
##$USERP2= <user>
##$USERP3= <user>
##$USERP4= <user>
##$USERP5= <user>
##$WDW= 1
##$XDIM= 32768
##$YMAX_p= 484834616
##$YMIN_p= -756183
##$CURPLOT= <Network HP LaserJet P1505>
##$CURPRIN= <$Network HP LaserJet P1505>
##$DFORMAT= <normdp>
##$LAYOUT= <+/1D_H.xwp>
##$LFORMAT= <normlp>
##$PFORMAT= <normpl>
##$SURQMSG= 1
$$ End of Bruker specific parameters
$$ ---------------------------------
##NTUPLES= NMR SPECTRUM
##VAR_NAME=  FREQUENCY,     SPECTRUM/REAL,   SPECTRUM/IMAG
##SYMBOL=    X,             R,               I
##VAR_TYPE=  INDEPENDENT,   DEPENDENT,       DEPENDENT
##VAR_FORM=  AFFN,          ASDF,            ASDF
##VAR_DIM=   32768,         32768,           32768
##UNITS=     HZ,            ARBITRARY UNITS, ARBITRARY UNITS
##FACTOR=    0.250966925370066, 1,           1
##FIRST=     8223.43324360094, -51706,       -99748
##LAST=      0,             30648,           -189173
##MIN=       0,             -756183,         0
##MAX=       8223.43324360094, 484834616,    0
$$ Real data points
##PAGE= N=1
##DATA TABLE= (X++(R..R)), XYDATA
$$ [...]
19473c58242A6304L271Q8513a71656r5856G1046L52655j59791b48093B27910J95725
19462D23635j65779o4178a32505j70161A45250a23053A63370e5485D3819b79637
19451D7926A7503i8600j0170A32879J61465b76057E8035b0498A7309L790c35150
19439A16694C4364a45970f2743K5395A60221f2317D09415b2332l6003H8405a46756
19427A52334b03288A8871h5364J9658j6504C2444a73913j67031Q3880B21296b70459
19415c61094R5101B06069A8528R5291g409A42470j554a51649a8328k19588C30342
19403A05485D7551b4603j60766Q0643A12503a93176B9942J37866q052a5529k67092
19392b82621a9313j72746B7315a71903B25190c59176B13365b58546k0309q8708
$$ y = [-358242, 16304, 19575, 108088, -171656, -267512, 71046, 423701, 263910, -248093, 227910, 423635, 257856, 193678, -132505, -302666, 145250, -123053, 163370, -55485, 43819, -279637, 47926, 17503, -98600, -108770, 132879, 294344, -276057, 58035, -20498, 17309, 21099, -335150, 116694, 34364, -145970, -62743, -37348, 160221, -62317, 409415, -22332, -58335, 88405, -146756, 152334, -203288, 18871, -85364, -65706, -82210, 32444, -173913, -340944, -257064, 221296, -270459, -361094, -265993, 206069, 18528, 113819, -7409, 142470, 140916, -151649, -18328, -237916, 330342, 105485, 47551, -24603, -185369, -104726, 112503, -193176, 29942, 167808, 159756, -15529, -282621, -19313, -192059, 27315, -171903, 225190, -359176, 213365, -258546, -278855, -367563]
19382c67563h3082o9523l99961a92486o1857n1868R7088C04063a85098E7600d80920
19370I1666g310j27173k51530A6298c54345a22858r1428J06848O007j83052J23848
19359a60635j18040n9969a36562j47127A67678A5511a08197j11893B5713c03754
19348g9482A2937g9430j25838j67410h8860C0300n566c427C6602M4122B6205a86981
19335C13380a11917A52413a0139l15536J56244a7006k28992i5674j15634D8296
19324a30680q110e5453A48684d35227J89728B1611a05744B71759J0895j30640
19314A52014a4067p9201B61207a22644K5743j50361A29052J00369b2889E6599
19303a99876B4647h3480C192J72037f9730j13778n6210K9708k03741g2888I6958
$$ y = [-367563, -83082, -152605, -552566, -192486, -254343, -306211, -209123, 304063, -185098, 57600, -480920, 91666, -7310, -134483, -386013, 16298, -354345, -122858, -214286, -107438, -101431, -284483, -160635, -278675, -338644, -136562, -283689, 167678, 15511, -108197, -220090, 25713, -303754, -79482, 12937, -79430, -205268, -372678, -88860, 30300, 24734, -3427, 36602, 80724, 26205, -186981, 313380, -111917, 152413, -10139, -325675, -169431, -17006, -245998, -95674, -211308, 48296, -130680, -138790, -55453, 148684, -435227, -245499, 21611, -105744, 271759, 282654, 152014, -14067, -93268, 261207, -122644, -96901, -247262, 129052, 229421, -22889, 56599, -199876, 24647, -83480, 3192, 175229, -69730, -183508, -239718, -210010, -413751, -72888, 96958]
19291a144n8107i071n7028q2575B20150a03033M9013J2820j18631P7744K0990
19280f1097J9776C1712b1588D3589c49234I8305c222l49482M5477a32049l6977
19269a69026M3774e9501l68695D8218a7026A03203P6360l0149a64059o698j23512
19258b94269c6223A67926p0126f9977n0383n1894C45133D532a66881D7795k1812
19247B5983e6260A08015B3187b44561g9947k25497J16911l6777B10920a84436
19236c7006j61088R7262B98686g8723B6548J6881f5514D3690i110n7904K3519
19225d3495A76203A5385g8015b8863l03959A28946b45707a12983K099F8608f9265
19213A67287b88012B06367F7405H905L63430A1195P0922b46150b4287A23988b88860
$$ y = [-1144, -59251, -9071, -66099, -148674, 220150, -103033, -54020, -41200, -159831, -82087, -61097, -41321, 31712, -21588, 43589, -349234, 98305, -3222, -352704, -307227, -132049, -169026, -125252, -59501, -428196, 48218, -17026, 103203, 179563, 149414, -164059, -170757, -294269, -36223, 167926, 97800, -69977, -120360, -172254, 345133, 4532, -166881, 47795, 25983, -56260, 108015, 23187, -244561, -79947, -305444, -188533, -225310, 210920, -184436, -37006, -198094, -100832, 298686, -78723, 26548, 43429, -65514, 43690, -9110, -67014, -43495, 176203, 15385, -78015, -28863, -332822, 128946, -245707, -112983, -110884, 68608, -69265, 167287, -288012, 206367, 67405, 8905, 372335, 11195, 82117, -246150, -24287, 123988, -288860]
19201A32275J91107E1344J1365a74691b2426j28790e4902r8159a8332H5556a41636
19189b26702K6557f1623a7588A19111a3456K140F2804L5660e5123B5471J10621
19178A36092n2485a84828K1065c0765p7543e2318j9325k34996A54868e2915j57337
19167b10252d8066B75659E2639g1238A82049F2407B3285K27152I0234a48591N1639
19156i6952A05698d019G0911O9349b07059j68250J36115a4669o1686c632l05018
19145c08650a37594j8032M5863j32473J19598j51052a21122M827e2819A13788
19134a62560j04241J06653A76455G6191J0144b77580a00562L0483k7812k02609
19124c00500a16682D5589J06175b5905B7696P6765L7522a97105l4088m693N0819
$$ y = [132275, 323382, 51344, 62709, -174691, -22426, -151216, -54902, -153061, -18332, 85556, -141636, -226702, -200145, -61623, -17588, 119111, -13456, -11316, 62804, 98464, -55123, 25471, 136092, 83607, -184828, -163763, -30765, -108308, -52318, -71643, -306639, 154868, -52915, -210252, -48066, 275659, 52639, -71238, 182049, 62407, 23285, 250437, 90234, -148591, -96952, 105698, -4019, 70911, 140260, -207059, -375309, -239194, -14669, -76355, -3632, -308650, -137594, -155626, -109763, -242236, -122638, -273690, -121122, -116295, -52819, 113788, -162560, -266801, -160148, 176455, 76191, 86335, -277580, -100562, -70079, -97891, -300500, -116682, 45589, 151764, -25905, 27696, 104461, 141983, -197105, -231193, -235886, -185067]
19113a85067C84233a47664j18157j23925n4973f1828A10956b08160j2513J06915
19103a13758k3166l41133d1792A22845c12248H075J48091a74816Q2579j1987m2789
19092a47013j69044B8322L91229b8940E319e7219A26521C0910J67457b03135b4147
19080a1687k38370b8472k50633B06275o6495f9770A16597C0047e0397A42543D3526
19068a39476b4281k30599d7040D491M7764g3848b0859m37890I1637G017a43328
19056b75503b7410A14751h1542j40742I0811Q5416n3827L2285g0456k3883j89984
19045b84323C8623f631C17147A50921D7058H13b28382M440c3020l09354A49461
19033D0410a411j01333J7031c0322A13648o925K10738a33464b3502j0854A20240
$$ y = [-185067, 384233, -147664, -265821, -389746, -444719, -61828, 110956, -208160, -220673, -113758, -136924, -478057, -41792, 122845, -312248, 8075, 156166, -174816, -92237, -104224, -147013, -316057, 28322, 419551, -28940, 5319, -57219, 126521, 30910, 198367, -203135, -24147, -11687, -250057, -28472, -279105, 206275, 139780, -69770, 116597, 30047, -50397, 142543, 43526, -139476, -24281, -254880, -47040, 4491, 52255, -73848, -20859, -458749, 91637, 7017, -143328, -275503, -27410, 114751, -81542, -222284, 90811, 176227, 122400, 154685, -70456, -94339, -284323, 38623, -6631, 317147, 150921, 47058, 813, -228382, -223942, -33020, -342374, 149461, 40410, -1411, -102744, -85713, -30322, 113648, 106723, 317461, -133464, -23502, -34356, 120240]
19021A13969B898d8754A93727l7618d7438p8047k58854h6617A90305D8752M2587
19010I1339h7278j80727o354B89910b44715A44964E0870R2258b55563g8569E5175
18998C991b33369C01130j24433F8413b37138o979A07615a21829L4410n978D4367
18986h0126D5387h3032q331j08472H613e2383l8299m51891a32142m5534h4259
18974e7810I1648J99088j03390N42502J60608j84114k94519j91286D1860J62926
18964B04786r4228b64388a03883F9114g5338C8335c72731B3229b32420l4173a20437
18952B62K1695c10795B68714a1447k40456O2731j35170a08083k76615g2666j86722
18941b59388A97714e8502a550k4419l4017G4722J82179b30375g2792A03410K12389
$$ y = [113969, 2898, -48754, 193727, 156109, -47438, -125485, -384339, -86617, 190305, 48752, 91339, -87278, -268005, -274359, 289910, -244715, 144964, 50870, 143128, -255563, -78569, 55175, 3991, -233369, 301130, 176697, 68413, -237138, -244117, 107615, -121829, -87419, -93397, 44367, -80126, 45387, -83032, -91363, -199835, 8613, -52383, -90682, -542573, -132142, -177676, -84259, -57810, 91648, 290736, 187346, 729848, 890456, 706342, 411823, 220537, 41860, 204786, 110558, -264388, -103883, 69114, -75338, 38335, -372731, 23229, -232420, -266593, -120437, 262, 21957, -310795, 268714, -11447, -251903, -189172, -324342, -108083, -384698, -72666, -259388, 197714, -58502, -1550, -25969, -59986, 74722, 256901, -230375, -72792, 103410, 315799]
18930C15799a53856j46433a45821C9189b85902G4600a58050A09508J1934h6448
18919A96351I5530c20744A06581a9428h433A17002J50605a73003B65594A02563
18908A81397P7566L22599J2518B96715C0211Q8653J43659j09947c28436J16978
18898b11458j18588e9745o0959A0539O0784a23753B4018b53926j404L8682c9635
18886g6407k3422p3106O6761b9760A84147F9998a11918d6563p1831G8370r141
18875F9229b79740B66008g5812j44085C27460a06331b7915j1235k73955b7546
18864H218c5808k40798a18329C5296A7504J39743B1038b6051j92483i4840c7049
18852a89579A85290H7080b30750I7908D1210b6819j38110g916j6514f514n7613
$$ y = [315799, -153856, -300289, -145821, 39189, -285902, 74600, -158050, 109508, 121442, -86448, 196351, 95530, -320744, 106581, -19428, -8433, 117002, 267607, -173003, 265594, 102563, 181397, 258963, 581562, 594080, 296715, 30211, 118864, 262523, 152576, -328436, -211458, -330046, -59745, -120704, 10539, 71323, -123753, 24018, -253926, -255330, -216648, -39635, -76407, -99829, -172935, -106174, -29760, 184147, 69998, -111918, -46563, -118394, 78370, 69229, -279740, 266008, -75812, -219897, 327460, -106331, -27915, -39150, -313105, -27546, 8218, -35808, -276606, -118329, 35296, 17504, 157247, 21038, -26051, -218534, -94840, -37049, -189579, 185290, 87080, -230750, 97908, 41210, -26819, -164929, -7916, -24430, -6514, -64127]
18841f4127K7330D3705d9052p3195I6034a2076k25649Q2822c2080B32336a98973
18829D20112c20050h2015D88K5482J94883I0334m0765f547k9326C4113b31446
18817D9758A9366J37187a3624j04637e6225L035q8465l21679A77910H7312J29476
18806B16788a9355A31727J1469a14494n7049c0132p2357A8705h1338H3445g1759
18794a5746A40227a06493C11815a9255C6241M579f2340q143b9283C0220d63675
18782B36141a33916a3695o7479J0067A9636j520L5790b8642n9998A19232e3197
18770b0201j14585I6216l0031b09288O7240B54108q6168J40772A12415a72169
18759c22546h3044F1035O8855e2382H748J28552E511R3481a22908m5259K4342
$$ y = [-64127, -36797, 43705, -49052, -122247, 96034, -12076, -237725, -154903, -32080, 232336, -198973, 420112, -320050, -82015, 488, 25970, 220853, 90334, 49569, -6547, -35873, 34113, -231446, 49758, 19366, 156553, -13624, -118261, -56225, -53190, -141655, -463334, 177910, 87312, 216788, -19355, 131727, 143196, -114494, -171543, -30132, -102489, 18705, -81338, 83445, -71759, -15746, 140227, -106493, 311815, -19255, 36241, 40820, -62340, -70483, -29283, 30220, -463675, 236141, -133916, -13695, -81174, -71107, 19636, 18116, 53906, -28642, -88640, 119232, -53197, -20201, -134786, 96216, 66185, -209288, -142048, 254108, 167940, 308712, 112415, -172169, -322546, -83044, 61035, 129890, -52382, 8748, 137300, 5511, 98992, -122908, -168167, -143825]
18748a43825L5105A12720J65191C3971c7135r4686g490c569q5233G6644a30116
18736C16059A08106m1930r333d73407O5905A82228a15175M3010G9154b06697D8442
18724a47169j1814I8198b34487C7928L399m936a35173F292M1151b47711e8865
18712a30388G1014J8565i8706r839d5167k56829a2526q1248L169k0897L3072I8877
18699B01955b66140f6970c194l7383j7530l33852a90221h1168A19132B8360h6047
18687A00213c26412K7034A67227b86834D3839d8152l0897A56387F1393b76874
18676C6215K9050d44940J92345A75283c58602h9797E2540n161i3338J2458A32599
18664A14515b1112j00937c1549C5031a13756B25343b5861r8037j51730j38541
$$ y = [-143825, -108720, 112720, 277911, 33971, -37135, -131821, -7490, -3569, -88802, 76644, -130116, 316059, 108106, 66176, 56843, -473407, -407502, 182228, -115175, -72165, 79154, -206697, 48442, -147169, -158983, 98198, -234487, 37928, 41327, 36391, -135173, 6292, 47443, -247711, -58865, -130388, 71014, 89579, -98706, -108545, -45167, -301996, -12526, -93774, -90605, -111502, -78430, 98877, 201955, -266140, -66970, -3194, -40577, -58107, -391959, -190221, -81168, 119132, 28360, -86047, 100213, -326412, -299378, 167227, -286834, 43839, -48152, -79049, 156387, 61393, -276874, 36215, 65265, -444940, -252595, 175283, -358602, -89797, 52540, 47379, -93338, -80880, 132599, 114515, -21112, -122049, -31549, 35031, -113756, 225343, -25861, -123898, -275628, -414169]
18654d14169a80885A68138b56910E34329C3460M1538B7471j1230a38142e757k33909
18643b39666E8533a17046r1793G3850K04369A2488a38412r8002j82806b2615m7999
18632g0614k93071J56835K3579A49774a27872b0144I7560M1588a5562j2699j72640
18621b00901j7820J05248k20833A1414C581b49694J24717j0634B8379c07367J13700
18610a93667P7899H7043L8939g6084j54139D2171b00518b4345a0147I4034D1142
18598A7847l31g0785j78654C9652J14574c74846c5903A72280a29748l4302H9065
18586a79889J2313A38796c30128i4779A62398B2054h2381C4834Q6589c49j4866
18575a5215E9527J48672b72704a05900b542o0109j96697i2894b3612B57355c68088
$$ y = [-414169, -180885, 168138, -256910, 534329, 33460, 74998, 27471, 16241, -138142, -5757, -239666, 58533, -117046, -208839, 73850, 278219, 12488, -138412, -236414, -419220, -22615, -70614, -363685, -206850, -183271, 149774, -127872, -20144, 97560, 139148, -15562, -28261, -200901, -218721, -113473, -334306, 11414, 3581, -249694, -124977, -135611, 28379, -307367, -193667, -115768, 87043, 125982, -76084, -230223, 42171, -200518, -24345, -10147, 94034, 41142, 17847, 17516, -70785, -249439, 39652, 154226, -374846, -35903, 172280, -129748, -164050, 89065, -179889, -167576, 138796, -330128, -94779, 162398, 22054, -82381, 34834, 121423, -349, -15215, 59527, 208199, -272704, -105900, -2542, -62651, -259348, -92894, -23612, 257355, -368088]
18563B4117c41412d059l86654c625l2176l1307B7554b77456a2559l3081H7765
18551d54376A01160b14508J01522k48718J80800P7153b8870D25945c52776J48284
18541b04492d9013o8762N3416b2016A01900b03258a4515A34116c6079F5051b105
18529A04098J59866f2845B5684K53914a57372m792B1036h9439C6731a43785B10363
18517f5194H6652e7962J2478G7706b52489A40437c33104a16167e5065p7328B28924
18505h1208l02191a0210l186D6101f8164k06387N5176G4855a87814A59263b08747
18493a58161A30281J2966M5158h1677M0557l6889j50280B79819E2494a06360j76188
18482b82548F6744h0492A4953d1149C7675d1425E5804K19391d7744I8285J44094
$$ y = [24117, -341412, -4059, -390713, -3625, -35801, -67108, 27554, -277456, -12559, -45640, 87765, -454376, 101160, -214508, -112986, -361704, -180904, -103751, -28870, 425945, -352776, -204492, -49013, -117775, -64359, -22016, 101900, -203258, -14515, 134116, -36079, 65051, -2105, 104098, 263964, -62845, 25684, 279598, -157372, -162164, 21036, -89439, 36731, -143785, 210363, -65194, 86652, -57962, -45484, 77706, -252489, 140437, -333104, -116167, -55065, -132393, 228924, -81208, -383399, -10210, -13396, 46101, -68164, -274551, -219375, 74855, -187814, 159263, -208747, -158161, 130281, 143247, 188405, -81677, -41120, -78009, -228289, 279819, 52494, -106360, -282548, 66744, -80492, 14953, -41149, 37675, -41425, 55804, 275195, -47744, 98285, 242379]
18471B42379A9301f5613j22444m7148A95111g4550A5053c2856J292k19865l7310
18460b88739D862a81902L52e9552k52349P4287l4489B3292d5620l3458r9630B15374
18447a45022B5845a04622b3277D86743e2152m7277j72203a19972a0235k182A13821
18435c49669a73323g1330j55202B57323h5209K2964B77923C4099f0925B4718e6840
18423A79809B9838a17451I4912a02808J9863A80903m4787C6985a70706B4958b77723
18411a38453A32704Q4106o6744E0044c06360A82945E4283b37344m7944g6380r9342
18400a75722C6247N5142B3343a14772C74306E6055A6428b49988B4350a77370D4633
18388a34343r0595B26734F3081c0530j47540A02708a11530A57217C730J90717
$$ y = [242379, 19301, -65613, -188057, -235205, 195111, -74550, 15053, -32856, -31564, -251429, -288739, 4862, -181902, -181550, -59552, -311901, -237614, -272103, 23292, -45620, -79078, -178708, 215374, -145022, 25845, -104622, -23277, 486743, -52152, -99429, -271632, -119972, -10235, -12417, 113821, -349669, -173323, -71330, -226532, 257323, -85209, -62245, 277923, 34099, -60925, 24718, -56840, 179809, 29838, -117451, 94912, -102808, -82945, 180903, 136116, 36985, -170706, 24958, -277723, -138453, 132704, 216810, 150066, 50044, -306360, 182945, 54283, -237344, -285288, -76380, -175722, 36247, 91389, 23343, -114772, 374306, 56055, 16428, -249988, 24350, -177370, 44633, -134343, -224938, 226734, 63081, -30530, -178070, 102708, -111530, 157217, 3730, 194447]
18378A94447C2405O7252L3842O101R8279H8711a95576l4457c8285F8195P6149
18367A44344C6191J03294b32151e9358p9709L3238l6407C04546e3127C22144A42899
18355a23928C4972d1948j50780d460q5387A18104C5584M5694O0714C3216b37670
18343g6597A27420l2535d9445e29j84769A74188b11989F3073f643A67283b55695
18331B2541b9446F7298b64335A01352a64446l66122A42522N4698I1000a36410
18320e05457C80413i4221C31849d1315j98449a00293A79971a5746r5343q7662
18310a98751A38872N4512N8746D81a00501B85580B1570J84608b87928B186L2073
18299C4259M116d01151A71580J63095A20893E3462J80176a94916B82482B1437
$$ y = [194447, 32405, 99657, 133499, 139600, 237879, 88711, -195576, -230033, -38285, 68195, 144344, 36191, 139485, -232151, -59358, -139067, -105829, -142236, 304546, -53127, 322144, 142899, -123928, 34972, -41948, -192728, -4460, -89847, 118104, 35584, 81278, 141992, 33216, -237670, -76597, 127420, 94885, -49445, -529, -185298, 174188, -211989, 63073, -6643, 167283, -255695, 22541, -29446, 67298, -264335, 101352, -164446, -530568, 142522, 197220, 91000, -136410, -505457, 380413, -94221, 331849, -41315, -239764, -100293, 179971, -15746, -111089, -198751, 138872, 193384, 252130, 481, -100501, 285580, 21570, 206178, -287928, 2186, 34259, 38375, -401151, 171580, 334675, 120893, 53462, 233638, -194916, 282482, 21437]
18288a97020a5293j24987r2056G7040a54646A58107m4399a67472F4511K16399
18278B80910a63260p700Q3924c1253H2258b7085m58164B1062c96111A7300M1836
18267E9136a55090f6350A91374a30081j28548b603p1178I3613b30324B39942b35808
18255B6930d7780q7601A0296K66265c32933J5356d5132C90496b56567O6118j38228
18244c28677a15939D7040b9308B63619b3753F4852j2750a23245A46163c65819
18233a26552C1308a19205n4676N8929j54225A0686J54238R66E6332g0831j2236
18222h3067B16860b59062l4951A56804f276k33890o5675B01190d81382a45003
18211b80259a32588d2640H4826a94002g754k48388g0584D37091A05398m9815d24746
$$ y = [-197020, -15293, -140280, -232336, 77040, -154646, 158107, 113708, -167472, 64511, 280910, -163260, -170960, -87036, -31253, 82258, -27085, -485249, 21062, -396111, 17300, 59136, -155090, -66350, 191374, -130081, -258629, -2603, -73781, 93613, -230324, 239942, -235808, 26930, -47780, -135381, 10296, 276561, -332933, -317577, -45132, 390496, -256567, -190449, -328677, -115939, 47040, -29308, 263619, -23753, 64852, 52102, -123245, 146163, -365819, -126552, 31308, -119205, -173881, -114952, -269177, 10686, 164924, 165890, 56332, -70831, -83067, 216860, -259062, -294013, 156804, -6276, -240166, -305841, 201190, -481382, -145003, -280259, -132588, -42640, 84826, -194002, -7754, -256142, -70584, 437091, 105398, 55583, -424746]
18199a56725A00140R100a85062A23923c6946q492F7500R5865C0881J49312a2571
18187A18718J74285j02031a84861A72823c31324J02614o022j04868A52989I935
18176A19919b19490A2677c94592f3112j78381C78519B3592a24837C7105N1253
18166H8358a74746m2324c5698D60088a669A91640G7513M5849m8171d66730C4901
18154f8791c2196j263o3308J3923l880d1007A21075c42933M8902A47299b04119
18142H4670b75738L1700C0698B651Q7988K06847A22130a47222G8035f6733l0081
18131i6814M7373B37343a4869D49178h0218j86067A56466a74280B48642g9237
18120A43527Q0244a36786A89231a48899A41262J9676b39738c1026C27570G0086
$$ y = [-156725, 100140, 109240, -185062, 123923, -36946, -45438, 67500, 163365, 30881, 180193, -12571, 118718, 293003, 190972, -184861, 172823, -331324, -228710, -234732, -339600, 152989, 9935, 119919, -219490, 12677, -394592, -63112, -241493, 378519, 23592, -124837, 37105, 88358, -174746, -217070, -35698, 460088, -1669, 191640, 77513, 123362, 75191, -466730, 34901, -68791, -32196, -33459, -96767, -82844, -86724, -41007, 121075, -342933, -294031, 147299, -204119, 84670, -275738, -244038, 30698, 2651, 90639, 297486, 122130, -147222, 78035, -66733, -96814, -49441, 237343, -14869, 449178, -80218, -266285, 156466, -174280, 248642, -79237, 143527, 223771, -136786, 189231, -148899, 141262, 160938, -239738, -31026, 327570, 70086]
18109A74481b10798H7386l4973g042m3287k2467k9890C96778A69118C2904K41679
18098B74583a02065j01902A37755c8841D1433d4928r3701e6045H8299L41515a4690
18086b96500I9164b0342i585A06340b43164j8465J04724p706M3218L4953E84613
18074B4670f4231A68538h8552A58798D3101m511b25498F9783K86603D2977J50872
18063A93849O5765b7103A6249a4607A24179P1836a44414A54561D0517A4900a7754
18051B101J32899g6628F3988A1525b35353a6319H7859B1119c38092B50029h027
18039a32874F7713M8366b51098A56183a65018g4077A19314J56451a46960N2589
18029i4371K7200j8129m1740c9350k0722C98074f4708m2831B1082M8452J1486
$$ y = [174481, -210798, 87386, 52413, -7042, -50329, -72796, -102686, 396778, 169118, 32904, 274583, -102065, -203967, 137755, -38841, 41433, -44928, -138629, -56045, 88299, 429814, -14690, -296500, 99164, -20342, -9585, 106340, -243164, -261629, -156905, -164611, -121393, -86440, 584613, 24670, -64231, 168538, -88552, 158798, 43101, 38590, -225498, 69783, 356386, 42977, 193849, 259614, -27103, 16249, -14607, 124179, 196015, -144414, 154561, 40517, 14900, -17754, 2101, 135000, -76628, 63988, 11525, -235353, -16319, 87859, 21119, -338092, 250029, -8027, -132874, 67713, 116079, -251098, 156183, -165018, -74077, 119314, 275765, -146960, -94371, -67171, -85300, -127040, -39350, -60072, 398074, -64708, -107539, 21082, 69534, 81020]
18018H1020J4451K08849p8737j00293b99762B12309c7539D0226a30996B19949
18007B97933A07586B5979K40452i1126l9654A6531O557a8991B31377i6381B76488
17995a92970D0868a4252F313K38176H0320b20580n9053G3579K77815A28189b32902
17983g4136B80240c08836B62461b8505l0972F6365J02247k924L107Q2717E870
17971h1488F2492a95916L8072f3284l03224e7860b6948k08910i4339n6454L5933
17960a14860o6015C9500f2900B16559A07100h1284c8958p2709l0727b0850l3070
17949e3920A72152j0951J85767E0719a36625A08703A1400O1910l2337h2610c4724
17937g3837B8688c2759m5031q9744A42071a4872o0443A57303D9630b97460a04849
$$ y = [81020, 95471, 304320, 225583, 125290, -299762, 212309, -37539, 40226, -130996, 219949, 297933, 107586, 25979, 266431, -91126, -130780, 16531, 23088, -18991, 231377, -96381, 276488, -192970, 40868, -14252, 6313, 244489, 80320, -220580, -279633, 73579, 351394, 128189, -232902, -74136, 280240, -308836, 262461, -28505, -59477, 66365, 168612, 165688, 168795, 251512, 5870, -81488, 62492, -195916, -157844, -63284, -366508, -57860, -26948, -235858, -94339, -150793, -114860, -180875, 39500, -62900, 216559, 107100, -81284, -38958, -111667, -142394, -20850, -53920, 172152, 161201, 346968, 50719, -136625, 108703, 11400, 73310, 40973, -82610, -34724, -73837, 28688, -32759, -77790, -167534, 142071, -14872, -75315, 157303, 49630, -297460, -104849]
17925c2497J4078m75701a63308b3858e634q6312j6558o7124B62254b70342B34288
17913A422a17972B83942A05468K33639a65958A40095a59621B38095d18154A38664
17902b18589O2000B4083e545A39986c15815A51492K0837M9010q9140J64933i3657
17890d4956o1593B7537K00181A5794D497K0168a8809k11243A46131C6910a31276
17878B23248m9557F787b41968C2096M3611d2860B93502F3077B291a78657e5926
17866B39444n0777f2289A34173a7726I8215M8087O6786p8326R3626b72501C00561
17854h7047P26A01019a80659m0161B3495M07357j42590j28862e3746g931A82466
17842b64667E6781R8411g53l4256D6186a66166A84383b9646m02849a31354I1262
$$ y = [-32497, -18419, -494120, -163308, -23858, -5634, -91946, -108504, -175628, 262254, -270342, 234288, 1422, -117972, 283942, 105468, 339107, -165958, 140095, -159621, 238095, -418154, 138664, -218589, -156589, 24083, -5545, 139986, -315815, 151492, 172329, 221339, 132199, 297132, -93657, -44956, -106549, 27537, 227718, 15794, 4497, 24665, -18809, -230052, 146131, 36910, -131276, 223248, 173691, 6787, -241968, 32096, 75707, -42860, 293502, 63077, 2291, -178657, -55926, 239444, 188667, -62289, 134173, -17726, 98215, 146302, 213088, 134762, 228388, -272501, 300561, -87047, -86321, 101019, -180659, -220820, 23495, 430852, 288262, 159400, -53746, -7931, 182466, -264667, 56781, 155192, -753, -35009, 46186, -166166, 184383, -29646, -432495, -131354, 91262]
17830e3934o3685m9168B41667b03997j0401B00902G6340d6622l6104j0313b5808
17818A14143J80368r0847b00524A02300P4740a49145C81728I0205g7230j12550
17808a89780A33546a57009B10669m3185a70046I5187J7983J30011F5440J78708
17798B44148C9232K06324c6821B5298J75694A7632a70920B10396G0111C3494f2006
17786D1368K00032O8059a863j24155d3545A14508i8512J2588M2437j28992C19386
17774B55397b37834B13859i8218B51186A21367L9950a19921e2392k1554m8375
17764a22321H4548K43393b69026A1348L53989j33295H9143k1868P1142D1589e8670
17752c9826q1772j6398o0759N1956d9611B9927r131K1084a8663A87999e9356F5326
$$ y = [-53934, -117619, -166787, 241667, -203997, -214398, 200902, 76340, -46622, -82726, -93039, -25808, 114143, 294511, 203664, -200524, 102300, 177040, -149145, 381728, 90205, -77230, -189780, 133546, -157009, 210669, 167484, -170046, 95187, 113170, 243181, 65440, 244148, 39232, 245556, -36821, 25298, 200992, 17632, -170920, 210396, 70111, 33494, -62006, 41368, 241400, 309459, -1863, -126018, -43545, 114508, -98512, -85924, -43487, -172479, 319386, 255397, -237834, 213859, -98218, 251186, 121367, 161317, -119921, -52392, -73946, -122321, 84548, 327941, -269026, 11348, 365337, 232042, 89143, 67275, 138417, 41589, -58670, -39826, -121598, -137996, -198755, -146799, -49611, 29927, 20796, 41880, -18663, 187999, -59356, 65326]
17739c4394m6635B46601f4085B56129m4318i7806I8051a95781A01356B3876J03040
17728A26916b6442B25794P4954A28510Q8293K15589A43083L02636a86351a7626
17717a90170p6376F6344c97261J82076A51266a10918i3B27265F6672c26204B31963
17705I3155a5935G9716b0612E1601K3828b32918B0790O929b31369J04927d1448
17693b89616A9929M87731A76969P4836c51064d7099a6036B90494j24385C2785
17682F1527r113c5694j1650j71297A17241J30861h5119O323A31845R4098F93b2472
17669a75128B13251m3327Q3951J05919A26312f9983A6853A275i8646C68202e9452
17657D29303A46362D8132L29959A26976K5055K39032C8062c76453C9378a65219
$$ y = [-34394, -81029, 246601, -64085, 256129, 211811, -97806, 98051, -195781, 101356, 23876, 126916, -26442, 225794, 300748, 128510, 216803, 432392, 143083, 445719, -186351, -17626, -190170, -266546, 66344, -397261, -215185, 151266, -110918, -93, 227265, 66672, -326204, 231963, 93155, -15935, 79716, -20612, 51601, 75429, -232918, 20790, 27719, -231369, -126442, -41448, -289616, 19929, 507660, 176969, 251805, -351064, -47099, -16036, 290494, 166109, 32785, 61527, 52414, -35694, -47344, -218641, 117241, 248102, -85119, -78796, 131845, 225943, 693, -22472, -175128, 213251, 169924, 253875, 359794, 126312, -69983, 16853, 1275, -98646, 368202, -59452, 429303, 146362, 48132, 378091, 126976, 152031, 391063, 38062, -376453, 39378, -165219]
17646c4953H9272K53913A66387E7856b976k35839C8821A8124K64871j02634a11416
17634I8141J13900a6282E86580I0411a676C97470a35433C83686o8541j17943J95149
17623C92351A2520P5568q013e919j04972c9596l12813A91607g2756j35678B50045
17611A08696a19083B86707a07553A88808J50053l9995F7008a53748A97966e8747
17600A12289J21295f9772M193A51641J29955a26310C68316h8727E1992L07161
17590C59153a29249j57400H5539J62808E8651J85465H3550b50319D29252A0512
17579B39004B2630b22261H5508f3096I6706A5131P5746J18605d0150A57093d5185
17567I5827P3420b20806A23155L83781B0051Q3207C0465J00094F2452N4439Q7764
$$ y = [-34953, 89272, 343185, 166387, 57856, -2976, -238815, 38821, 18124, 282995, 180361, -111416, 98141, 212041, -16282, 586580, 90411, -1676, 397470, -135433, 383686, 315145, 197202, 392351, 12520, 88088, 80075, -5919, -110891, -39596, -352409, 191607, -72756, -208434, 250045, 108696, -119083, 286707, -107553, 188808, 338861, 298866, 67008, -153748, 197966, -58747, 112289, 233584, -69772, -65579, 151641, 281596, -126310, 368316, -88727, 51992, 359153, -129249, -286649, 85539, 248347, 58651, 244116, 83550, -250319, 429252, 10512, 239004, 22630, -222261, 85508, -63096, 96706, 15131, 90877, 209482, -40150, 157093, -45185, 95827, 169247, -220806, 123155, 506936, 20051, 103258, 30465, 130559, 62452, 116891, 204655]
17556B04655m9981A771b5329C39076d8890D74108A67425o4335a12901c0277A6986
17544B57568K5696j00743J58466E7047J09028l420K47606A41834L06133A76212
17533B19243O6883Q5008q7855j6237M0653L20751B92712K70382L66136M91323
17523A420553l17209l16363J58676m40841J80283B62277K22211k24949I1327M27098
17513E18425J20J09395N00602l16290L23165j9625j44001m5773k72417j979j50139
17502E01483p4368j05987M28415j36314j91517J45767j49029A7484K52089D2067
17491D17283A08102K79632j70423K11212A11505N9828K52435B05104L1111J12380
17481C48595j00528J92695A76979M14454k48891q0246g947B70651J32812j91396
$$ y = [204655, 154674, 1771, -25329, 339076, -48890, 474108, 167425, 103090, -112901, -30277, 16986, 257568, 283264, 182521, 340987, 57047, 166075, 162655, 410261, 141834, 447967, 176212, 219243, 286126, 371134, 283279, 267042, 307695, 628446, 292712, 563094, 929230, 1420553, 1103344, 786981, 945657, 504816, 685099, 262277, 484488, 259539, 91327, 518425, 518545, 627940, 1128542, 812252, 1135417, 1115792, 971791, 926018, 653601, 651622, 501483, 427115, 321128, 749543, 613229, 421712, 567479, 418450, 17484, 269573, 42067, 417283, 108102, 387734, 217311, 428523, 111505, 171333, 423768, 205104, 236215, 348595, 248067, 440762, 176979, 591433, 342542, 262296, -7947, 270651, 403463, 212067]
17471B12067J48264a00731C14035j15778K92951p8947F7052L45225k6710q2840
17461C02727A01785R3184J18995K52225B62991J92249k19925J3361J53696L9561
17451D41933o8481J61679K89211A40417K76356j34258p7582O72950B65747R6581
17441C62328J66520p780j08963J10272j03240r0077K4653j43033J7496R1966j10094
17430B10048L9422K55126m54K4829j81188J17193j06262K8134j78101K70142O4088
17419E42977j48350j4273j29797k9466M0049K71595j49420M31205A57731K49706
17409D07437j46310K35377J02675A75848K85049j2601N8312A34566J00431J30010
17399C65007k8853j17213J81604j46167K9852O5265a23401C13246A28900Q2331
$$ y = [212067, 360331, -100731, 314035, 198257, 491208, 412261, 67052, 412277, 385567, 302727, 101785, 194969, 313964, 566189, 262991, 455240, 235315, 248676, 402372, 441933, 373452, 535131, 824342, 140417, 416773, 282515, 204933, 877883, 265747, 362328, 528848, 521068, 412105, 522377, 419137, 329060, 353713, 210680, 228176, 320142, 210048, 249470, 504596, 504142, 528971, 347783, 464976, 358714, 386848, 208747, 478889, 542977, 394627, 380354, 250557, 221091, 261140, 532735, 383315, 814520, 157731, 407437, 261127, 496504, 599179, 175848, 460897, 448296, 506608, 134566, 234997, 365007, 336154, 218941, 400545, 254378, 284230, 349495, -123401, 313246, 128900, 211231]
17389B11231K56953D0139J50414R6378P5417L08634B61373p5406K54472r7880
17379C42559J38006j54782g3618C81246j85367K18504j35113a15457A84121J26139
17369C10260A51002M95884K5861r9249k78593p3114J08068f1651E39376d080o8913
17358g2993A76203M0586M04983G7037L94105M2043a60659C25375b62785A8806
17347B61759E8807M58670k44535L2862K65921B4803L44879o4600J92966k08085
17337B89963p8782K34076J46895A72215D7307J35450L7530R0968r8826O3467o4383
17326B11513J28511q0910j08691R9065n3727l743J72556k3511J11030B17350K73606
17315D90956k19525J07835f2774E06148k39590j18282J12806o2023a7980E79610
$$ y = [211231, 468184, 40139, 190553, 286931, 362348, 670982, 261373, 185967, 440439, 342559, 480565, 325783, -73618, 381246, 195879, 414383, 279270, -115457, 184121, 310260, 151002, 646886, 672747, 573498, 294905, 221791, 329859, -61651, 539376, -4080, -72993, 176203, 216789, 621772, 77037, 471142, 513185, -160659, 325375, -262785, 18806, 261759, 58807, 517477, 272942, 305804, 571725, 24803, 369682, 305082, 498048, 289963, 211181, 445257, 592152, 172215, 47307, 182757, 220287, 311255, 212429, 275896, 211513, 340024, 259114, 150423, 249488, 195761, 192018, 364574, 341063, 452093, 217350, 490956, 271431, 379266, -62774, 506148, 266558, 148276, 261082, 199059, -17980, 579610]
17304C33668r3165k2711K72682q1790J77238j50275p0520j02777A29849K07745
17294C37594j65646j3676J21441A14922K70797J56282B11343L01812D8657J34192
17284A82849P1327L4460J98402a47398D10972j86694k3565J02417M6404l6667
17274C12867M04013q3436j42047k00369J8825J2313N8761R0290I2004L16246I7233
17262C46041J73877J4959B19950C5001K72607Q000j23063l3435k7469K16462J1313
17251C59416j09115J53319R0949J76124J7420C12203A36748K89145P1828l4992
17241D62729N0246j00875m5932L76878P9863B91916K23042B34768J76498R7563
17231E08829j70039N8124J64095q0897q1582j18763l4366M17650B66731J64005
$$ y = [333668, 240503, 217792, 490474, 408684, 585922, 435647, 365127, 262350, 129849, 337594, 171948, 158272, 279713, 114922, 385719, 542001, 211343, 513155, 48657, 182849, 254176, 288636, 487038, -147398, 410972, 224278, 200713, 303130, 349534, 312867, 716880, 633444, 491397, 291028, 309853, 322166, 380927, 471217, 92004, 408250, 97233, 346041, 519918, 534877, 219950, 35001, 307608, 315608, 192545, 159110, 131641, 348103, 359416, 250301, 403620, 494569, 670693, 688113, 312203, 136748, 425893, 497721, 462729, 512975, 412100, 366168, 743046, 822909, 291916, 514958, 234768, 411266, 508829, 338790, 396914, 561009, 480112, 398530, 279767, 245401, 663051, 266731, 430736]
17221D30736r6339j4668J24854L2106J76868B82134l2244Q4453L87478k99499
17211D22322M0265Q4913J65462k61611K83899B72655A30664M57675D486O96946
17201G01432B35105J33308Q5158j3637K4320N6867k04818j9003J03187j9446J39946
17190E20987A7468L62311L8615O28L76055J17011C99968Q9031p9988K77234j10055
17179E76190A47095K38127j17632J63559N5664l329B29624N16766C63410M07636
17169G71046l75077P6499O414K25610k53662J41484k29486J49658k2183J09639
17159E99942m1443M69359l75668k47786O433j62248J00666L82870K6183B77753
17148F57606O508k67440R6699K0571K23660J41795l63402L9862l0825K78277m204
$$ y = [430736, 334397, 319729, 444583, 476689, 653557, 282134, 249890, 334343, 721821, 422322, 462587, 547500, 712962, 451351, 735250, 272655, 130664, 588339, 4486, 701432, 235105, 368413, 453571, 439934, 464254, 521121, 316303, 297300, 400487, 381041, 520987, 17468, 379779, 418394, 419022, 795077, 912088, 399968, 488999, 409011, 686245, 576190, 147095, 385222, 267590, 431149, 486813, 483484, 229624, 746390, 363410, 771046, 395969, 472468, 478882, 704492, 450830, 592314, 362828, 512486, 490303, 599942, 558499, 1027858, 652190, 404404, 410837, 248589, 349255, 732125, 758308, 277753, 657606, 664114, 396674, 493373, 513944, 737604, 879399, 515997, 555859, 525034, 803311, 799107]
17137G99107B39808P70975B52374J71875J07508m9686L9868N1479j23745L46458
17127G96131Q9436k69445J26710j28854n0799N1273Q538k2739L2190M472K46249
17116H83162p4911j38948r5244n5250K00353P7109C78355J58299J62002j70150
17106E28506Q0394B60472N92747l04216K09024J17044J71285k28420k00542K35280
17096H52674l75766L37508n9423k74287K76369P3261j22746o0357j43047M99305
17086A003491k49030R1063o9716M8065j37608j12829N32350D91230L28167M320
17076H23717Q1954J45135k14607j9295J98509P7511n4159j88517k2286J24844
17066I52806K20048k56433k25476J2662K37800k30487J41177D21004O20887m14400
$$ y = [799107, 239808, 1010783, 252374, 424249, 531757, 482071, 521939, 573418, 449673, 796131, 885567, 616122, 742832, 613978, 563179, 614452, 622990, 600251, 632441, 636913, 883162, 808251, 669303, 574059, 518809, 719162, 796271, 378355, 536654, 698656, 528506, 608900, 260472, 853219, 549003, 758027, 875071, 1046356, 817936, 617394, 852674, 476908, 814416, 754993, 480706, 757075, 830336, 707590, 647233, 504186, 1003491, 754461, 845524, 775808, 823873, 686265, 573436, 1105786, 491230, 819397, 823717, 905671, 1050806, 836199, 816904, 1015413, 1092924, 1038765, 850248, 827962, 952806, 1172854, 916421, 690945, 703607, 941407, 710920, 852097, 421004, 1041891, 627491]
17056F27491K15540j7828m737J9819K32290p1134Q4198N3328m09464M9776K77363
17045A056642j99206r3207K57748k3003k40449p8977P08421j79827k44380k22059
17035G41703K64303Q9213m6R5108l54995K60963J35975l22155K15548k07444L21833
17024A240006k24751J08287j09556J00494k40180K72613l2055J04966K0243m6635
17014A193432J59760l0858K29399k59774j9040K74517j05956m07349P12034l06537
17004A439628J75728l23224j357L42056j33799j02966N3885k52570J80799j10358
16994A267822K19380J28478j83118J07628k9319q4799q6055J08401J77005N4220
16984A679643j87566K36668m4838m07330L58888n28495K30133J93714J6139k8720
$$ y = [627491, 843031, 825203, 820466, 840285, 1072575, 1001441, 1085639, 1138967, 729503, 779279, 1056642, 857436, 764229, 1021977, 998974, 758525, 679548, 1387969, 1208142, 963762, 741703, 1006006, 1095219, 1095173, 1190281, 835286, 1096249, 1232224, 910069, 1125617, 918173, 1240006, 1015255, 1123542, 1013986, 1114480, 874300, 1146913, 1114858, 1219824, 1240067, 1193432, 1353192, 1322334, 1551733, 1291959, 1272919, 1547436, 1441480, 1034131, 1746165, 1439628, 1615356, 1292132, 1290775, 1632831, 1499032, 1396066, 1449951, 1197381, 1378180, 1267822, 1487202, 1615680, 1432562, 1540190, 1510871, 1426072, 1340017, 1448418, 1625423, 1679643, 1492077, 1728745, 1683907, 1276577, 1635465, 1106970, 1337103, 1530817, 1546956, 1518236]
16974A518236m67952N88048j2847J06504k02052M27504l19832L91034l03835n5750
16964A669058r6848Q7529n6844j64949L16393K6762K22837j78030N5736J00725
16954A982369m9919j42097J57627q193p77k00887L68908k56934L79930m73254
16944A756773L06833l3534K26636l20420M0944K9946O4950J33125k87060M00439
16934B318632q069j23495j02986J25064O1012l22712P45798m15953L5029j37955
16924B174365K56210o9779K08705j80858O01867j68259l53908J93459j62944L62762
16914B861620j56697j41004L43448k99984K90582L23019l90498j4825K77206l94870
16904B697997L11390M54759l2315j34077l89281J09270j078L98219n5511n9155
$$ y = [1518236, 1050284, 1638332, 1625485, 1731989, 1529937, 1957441, 1637609, 2028643, 1724808, 1669058, 1572210, 1659739, 1602895, 1437946, 1754339, 1781101, 2003938, 1825908, 1881644, 1982369, 1932450, 1790353, 1947980, 1939787, 1939010, 1738123, 2107031, 1850097, 2230027, 1756773, 2063606, 2030072, 2256708, 1936288, 1977232, 2007178, 2072128, 2205253, 1918193, 2318632, 2310563, 2187068, 2084082, 2209146, 2270158, 1947446, 2693244, 2277291, 2312320, 2174365, 2430575, 2360796, 2569501, 2388643, 2990510, 2822251, 2468343, 2661802, 2498858, 2861620, 2704923, 2563919, 2907367, 2607383, 2897965, 3220984, 2830486, 2815661, 3092867, 2697997, 3009387, 3464146, 3431831, 3297754, 2908473, 3017743, 3016665, 3414884, 3359373, 3300218]
16894C300218J87233K82683k71779j61271J74326J01314K47886k59692K4719L51538
16884C977175k21212L86166J7242n27832K87725N6733m7238o5774K7214K73533
16874D163732K21856K9854N7612K21913k27331j56668L16002K25713j28074K34104
16864D958713k67642k05093L62046L79476l4535j16085L77064N6176K4328J31760
16854E666208j66582j52926L80264Q4805K43629q32j5911q1177K42576M5738K54345
16843F500137L66889j26872J11827j82612K84895Q7614N9064n49M15772L59270
16833G875435m07374L98221J29146J72789L248K99258J93102K07150j18086L7194
16823H790083K28592K16917k0329P05659k34549P80917j27125J14804M84126l76165
$$ y = [3300218, 3487451, 3770134, 3498355, 3337084, 3511410, 3612724, 3860610, 3600918, 3625637, 3977175, 3755963, 4142129, 4159371, 3631539, 3919264, 3975997, 3928759, 3862985, 3890199, 4163732, 4385588, 4415442, 4473054, 4694967, 4467636, 4310968, 4626970, 4852683, 4724609, 4958713, 4691071, 4485978, 4848024, 5227500, 5192965, 5076880, 5453944, 5510120, 5534448, 5666208, 5499626, 5346700, 5726964, 5811769, 6055398, 6054566, 6038655, 5957478, 6200054, 6245792, 6500137, 6867026, 6740154, 6851981, 6669369, 6954264, 7041878, 7100942, 7100393, 7516165, 7875435, 7468061, 7866282, 7995428, 8168217, 8171465, 8470723, 8663825, 8870975, 8752889, 8790083, 9018675, 9235592, 9215263, 9920922, 9686373, 10467290, 10340165, 10454969, 10939095, 10562930]
16813A0562930N07400K44643K83759Q3492J53717K04414M41052N38980k4532K73652
16803A3269507K80179M96426J80691M73009N64210j39246M65533M83457K07390
16794A6281156L16344L80139L68756N01758R06291M5374N94889M04476L16484
16785B0115667P15690O32978K99545N08516J121716O80302O66489J50208J019702
16776B5910813O07038P51686Q23231P48938R62645J015807R56436Q38623J159825
16767C3775042J211579N42107J094402J530105J069944J279998J460015J365326
16759D3328518J457323J479146J698803J518308J907212J398630K018932J851697
16751E6658569J901210J927089K570879J792679K377296K877722K066672K367341
$$ y = [10562930, 11070330, 11314973, 11598732, 11682224, 11835941, 12040355, 12481407, 13020387, 12995855, 13269507, 13549686, 14046112, 14226803, 14699812, 15264022, 15124776, 15590309, 16073766, 16281156, 16597500, 16977639, 17346395, 17848153, 18754444, 18799818, 19394707, 19799183, 20115667, 20831357, 21464335, 21763880, 22272396, 23394112, 24074414, 24740903, 24891111, 25910813, 26517851, 27269537, 28092768, 28841706, 29804351, 30820158, 31776594, 32615217, 33775042, 34986621, 35528728, 36623130, 38153235, 39223179, 40503177, 41963192, 43328518, 44785841, 46264987, 47963790, 49482098, 51389310, 52787940, 54806872, 56658569, 58559779, 60486868, 63057747, 64850426, 67227722, 70105444, 72172116, 74539457]
16743G4539457K531241K243936K945840K740144K761703K310219K673061L036933
16735I5782534K346283K850909K431579K188057K672573K307895J894263J723423
16727A14197516J785162J354407J178394J290330K23029K72422J87501K2757m28459
16718A20083059o54468j428505j261294j357407j694780k183037j878343k476336
16710A07148889k778329k399147k592310k475131k913499k699017k787652k640685
16702H5863119k807828k701097k585213k805534k077818k678771k607045k328617
16694F5271196k417530k029490k453232j771628j756442k300980j501210k217239
16686D8823445j227718j693167j542118j477602j727338j001220j262924j559864
$$ y = [74539457, 77070698, 79314634, 82260474, 85000618, 87762321, 90072540, 92745601, 95782534, 98128817, 100979726, 103411305, 105599362, 108271935, 110579830, 112474093, 114197516, 115982678, 117337085, 118515479, 119805809, 120028838, 120301260, 120488761, 120511518, 120083059, 119428591, 118000086, 116738792, 115381385, 113686605, 111503568, 109625225, 107148889, 104370560, 101971413, 99379103, 96903972, 93990473, 91291456, 88503804, 85863119, 83055291, 80354194, 77768981, 74963447, 72885629, 70206858, 67599813, 65271196, 62853666, 60824176, 58370944, 56599316, 54842874, 52541894, 51040684, 48823445, 47595727, 45902560, 44360442, 42882840, 41155502, 40154282, 38891358, 37331494]
16678C7331494j261223r32836j461128j077972q89911p51405j171677q98319o21987
16669B8265036q23010p81229p49013j109830p01074o61909q49416k13580p30195
16660B1645780n74823l21278m61717p89943q07852k00050j76096j021192m00632
16651A6892197j86147n03994l61753m05085n38902k01784n52398r3256l63871
16642A3685007J39249q42821l7783j44800o18688k26716N8532n09621m94009j3393
16632A0994957l56443N8353n03860j72965n2675n36918k32184O3557j49501j30279
16622H982042J75306n27225j42678J76097n94774l23167K09622l47809o6931q9258
16612G451225j69076K38284n24815k96806k34948J19614J66616j95932k33862
$$ y = [37331494, 36070271, 35137435, 33676307, 32598335, 31708424, 30957019, 29785342, 28887023, 28265036, 27442026, 26660797, 25911784, 24801954, 24100880, 23438971, 22589555, 22375975, 21645780, 21070957, 20749679, 20287962, 19498019, 18690167, 18490117, 18314021, 17292829, 16892197, 16706050, 16202056, 15840303, 15435218, 14896316, 14694532, 14142134, 14048878, 13685007, 13824256, 12981435, 12943652, 12798852, 12180164, 11953448, 12011980, 11502359, 11008350, 10994957, 10638514, 10696867, 10193007, 10020042, 9967367, 9430449, 9198265, 9261822, 9112321, 8982042, 9157348, 8630123, 8487445, 8663542, 8068768, 7745601, 7955223, 7607414, 7540483, 7451225, 7282149, 7520433, 6995618, 6698812, 6463864, 6583478, 6750094, 6554162, 6320300]
16603F320300J77683j80540k93257n5715j52208m04253K42531k01531K45572m47265
16593E251317N21708n72592J04366m37526J75950m4483j28556P1192k12434l41372
16583D387570m3579L50855j30189j74352J50084m64959L80431n77655M23511m72802
16573C828915L22604m59621N37456l33156Q8169l02957L71224k54761o8851k63743
16563C465279J57171r3670j10895m5073m14021J55870K36233j34549k15548j23319
16553B877478J12310J93439K1974L7854p0127l83877p2554J01308K89441k8426
16543C078820j98129k51743L71140l85382K94255n81025K71903R6686j51383j91200
16533B353942k4465j9920q1428J52860k1787k30347j81298M47930j37587L42865
$$ y = [6320300, 6497983, 6317443, 6024186, 5968471, 5816263, 5412010, 5654541, 5453010, 5698582, 5251317, 5773025, 5200433, 5304799, 4867273, 5043223, 4998740, 4870184, 4941376, 4728942, 4387570, 4343991, 4694846, 4564657, 4390305, 4540389, 4075430, 4455861, 3878206, 4301717, 3828915, 4151519, 3691898, 4229354, 3896198, 3984367, 3681410, 4052634, 3797873, 3729022, 3465279, 3622450, 3528780, 3417885, 3372812, 2958791, 3114661, 3350894, 3216345, 3000797, 2877478, 2989788, 3183227, 3205201, 3243055, 3172928, 2789051, 2716497, 2817805, 3107246, 3078820, 2880691, 2628948, 3000088, 2614706, 2908961, 2327936, 2599839, 2696525, 2545142, 2353942, 2329477, 2309557, 2228129, 2380989, 2359202, 2128855, 1947557, 2395487, 2257900, 2600765]
16523B600765p7445j03535k38252O5636l11143L15264J13820l08404p4150R0073
16513B072629J07386k46161L81654m42616J11721o5336K21888l26636J30844m06504
16503A538869O8144J05058j18009K0744J57300m5829M5682k92400L08462n310
16493A782711P6710n07293M11728R01k58317m8721k9932R4078Q7184j28951N3063
16482A533161N6186p9878l70070O61898m59906q3027Q9996O0093j1799M44385
16472A841039m92900F48160Q83769j48028k47423K59337j32921j5406L6238J76107
16462A459833m04978L68191q3305j36699K69261q0390k28128J93541j23188k26130
16452A008008K28343k08531M64771n48280K81230q7987J81198k96380m28j84940
$$ y = [2600765, 2523320, 2419785, 2181533, 2247169, 1936026, 2251290, 2365110, 2056706, 1982556, 2072629, 2180015, 1933854, 2315508, 1872892, 1984613, 1919277, 2141165, 1814529, 1945373, 1538869, 1607013, 1712071, 1594062, 1614806, 1772106, 1726277, 1771959, 1479559, 1788021, 1782711, 1859421, 1352128, 1763856, 1764757, 1506440, 1457719, 1427787, 1521865, 1609049, 1480098, 1533161, 1589347, 1509469, 1139399, 1801297, 1341391, 1258364, 1348360, 1408453, 1396654, 1841039, 1348139, 648160, 1531929, 1383901, 1136478, 1395815, 1262894, 1247488, 1283726, 1459833, 1054855, 1423046, 1339741, 1203042, 1472303, 1391913, 1163785, 1357326, 1234138, 1008008, 1236351, 1027820, 1492591, 944311, 1225541, 1137554, 1318752, 1022372, 1021944, 837004]
16442H37004N26082k18407j98615M3214p4080K8981m1843L63201l24602J17215
16432A058150j94053M1404Q6440p3332j70415n1615L77513j54848l55451P02248
16422A266041j71519n9349L0757j89704j87725k9411M24668m08207P516K91709
16412I74776j49666k40882L42179l5551K3193l27814K62217K64206k06832k11214
16402F94612K38472k04558k94131O19546j03300j30361l66090K60177J40764j18843
16392G36288j31838k78891N68278m4687j82530K20258r9039j83515J29470j98999
16382E34795J89469j78265o88J97452P3336j94041K51355k25200j58988K06495
16372F95720k38990J60329J24664M7687j94843j96502P39979n53929j58598O2754
$$ y = [837004, 1363086, 1144679, 946064, 989278, 915198, 944179, 902336, 1265537, 940935, 1058150, 864097, 905501, 991941, 918609, 748194, 696579, 1074092, 919244, 563793, 1266041, 1094522, 1035173, 1065930, 876226, 688501, 659090, 1083758, 675551, 683067, 974776, 825110, 584228, 926407, 890856, 914049, 586235, 848452, 1112658, 905826, 694612, 933084, 728526, 434395, 1053941, 950641, 820280, 454190, 714367, 855131, 736288, 604450, 325559, 893837, 849150, 666620, 886878, 787839, 604324, 733794, 534795, 724264, 545999, 545311, 742763, 816099, 622058, 873413, 648213, 489225, 695720, 456730, 617059, 741723, 789410, 594567, 398065, 1138044, 584115, 425517, 488271]
16362D88271K70628k22973N4068j61222K73162k68723L50745k77693K70846r4401
16352F82708J45081k48442k8066K46165l29572K10903B54361P3347J76982L14026
16342H18716k62286K4695k43256Q9892k3879j91678o718N72090l40462L52931
16332G90045A47576P12132A3016N97682j55242N6832M9053o1874J9671j3582D8548
16320G37521l39326P3167j05564R5601k29654K11346J68420B24809M15157j01962
16310E38004B51764j7473M70234C18600P0304p5765J88401B12797K25188H944
16299C92389j8670J27395B18216p2800N47013l43261K59514j89437p2692k704
16289C43849J75581j25606K82960l05689k720M5985J64565a09680E65175L2389
$$ y = [488271, 758899, 535926, 589994, 428772, 701934, 433211, 783956, 506263, 777109, 682708, 827789, 579347, 551281, 797446, 467874, 678777, 254361, 327708, 504690, 818716, 556430, 581125, 337869, 427761, 403882, 212204, 205486, 777576, 437114, 790045, 147576, 859708, 13016, 610698, 455456, 512288, 561341, 499467, 519138, 505556, 48548, 737521, 398195, 471362, 365798, 461399, 231745, 443091, 611511, 224809, 639966, 538004, 251764, 234291, 704525, 318600, 388904, 313139, 501540, 212797, 437985, 8944, 392389, 373719, 501114, 218216, 145416, 692429, 349168, 608682, 419245, 346553, 343849, 519430, 393824, 676784, 371095, 368375, 414360, 578925, -109680, 565175, 597564]
16279E97564j91289J98304k30965j1255J25954k0664B33157L442J23146J36358
16269D96103k44761l340J38505p4010j12116J23752j21982I589O46234q2116j71182
16258D02525P2315j49692A55595L31335n8929e876I6722L14271p1571H9490K09715
16247B99205N9282Q9093j26149j3815r4908M04286k61461O8958j06417A56267
16236C65067q8798b16838A28594M16470H6239L44973l1650o8591N2239o1668l8208
16225B83334a02685H9137N6275P9510B377L13748H1432J21305J64647O6534j13646
16214C20272q9061J50751j31092l9232j02974K96433b10034E638M06705j90345
16204B21998e2394K2530C18065J54834A79381M2846L47878I7259K17174c9902
$$ y = [597564, 406275, 604579, 373614, 362359, 488313, 467649, 233157, 236599, 359745, 496103, 251342, 248002, 386507, 312497, 200381, 324133, 202151, 9589, 655823, 573707, 402525, 474840, 325148, 155595, 486930, 428001, -5876, 96722, 410993, 339422, 89490, 299205, 358487, 447580, 321431, 307616, 212708, 616994, 355533, 424491, 318074, 156267, 365067, 276269, -216838, 128594, 545064, 86239, 431212, 399562, 330971, 383210, 321542, 283334, -102685, 89137, 145412, 224922, 2377, 316125, 81432, 202737, 367384, 433918, 320272, 231211, 381962, 250870, 211638, 108664, 405097, -210034, 5638, 412343, 221998, -52394, -29864, 318065, 472899, 179381, 222227, 570105, 97259, 314433, -39902]
16193A49459J30015j37553J2242P7299i6706B78158A13617O0950l5686J24521
16183B63402M8498A34272K69846j89678E1670P8554B9781N64063A91073K17348
16173D08421j51139j14685J82344l7826c633m8171B17249F497c4124o5648D62693
16161h9171j617l8944B37410A14888A6111d7726I6172J10046L1504c1499j73153
16150b04652K4022a3139D1111K49638A0960a9124B33417E3818a83682E87300b2530
16138E0512N31714k80558D2610J10992P4265M7992O9206Q4395a43175D05496m3060
16127C62436j42823m4387b67648A15972C7567j3166K0209b45617C79500h2780
16116e642j24411F9897C3156l952J7208a25690B74144r0895a54528H042a07724
$$ y = [149459, 279474, 141921, 154163, 231462, -96706, 278158, 113617, 174567, 138881, 263402, 311900, 134272, 404118, 214440, 51670, 130224, 29781, 593844, 191073, 408421, 257282, 142597, 324941, 287115, -3633, -51804, 217249, 6497, -34124, -99772, 462693, -89171, -90788, -129732, 237410, 114888, 16111, -47726, 96172, 206218, 237722, -31499, -204652, -180630, -13139, 41111, 290749, 10960, -19124, 233417, 53818, -183682, 587300, -22530, 50512, 582226, 301668, 42610, 153602, 227867, 275859, 345065, 429460, -143175, 405496, 362436, 219613, 175226, -267648, 115972, 37567, 24401, 44610, -245617, 379500, -82780, -5642, -130053, 69897, 33156, 29204, 46412, -125690, 274144, 183249, -154528, 8042, -107724]
16104C6823a30347B36940A13785E4981b6161B88721p8674J15585b935n3637B2830
16092B17467J2f0990a8175j56349a2817A14543K29242H7115K5134J36170c0644
16080A4253a83976b3573C67098H0108K24005g4686J77R083k22997J32692k755
16069a58486A9897M510J28617C4202L4017e0338F3308J55701M8586r6092d1968
16057c05953C31223j39964h3401A14772a63609E0358B1161J87661K0425b24431
16046A00444m0960J61726p0410J82568d2640j05819j7363C29068a3311A04335
16035A07487C8192J96975j14769D2924e7102B42850b61381D04437q2457r0910
16025B31070r728N2591h4987H0349a25216B8601J06870c6863C02392h3895N492
$$ y = [36823, -130347, 236940, 113785, 54981, -26161, 288721, 210047, 325632, -2935, -56572, 22830, 217467, 217479, -60990, -18175, -174524, -12817, 114543, 343785, 87115, 112249, 248419, -30644, 14253, -183976, -23573, 367098, 80108, 304113, -74686, -74509, -65426, -288423, -155731, -158486, 19897, 24407, 153024, 34202, 68219, -50338, 63308, 219009, 267595, 171503, -41968, -305953, 331223, 191259, -83401, 114772, -163609, 50358, 21161, 208822, 229247, -224431, 100444, 59484, 221210, 150800, 333368, -42640, -148459, -165822, 329068, -13311, 104335, 107487, 38192, 235167, 120398, 42924, -57102, 242850, -261381, 404437, 321980, 231070, 221342, 273933, -84987, 80349, -125216, 28601, 135471, -36863, 302392, -83895, -78403]
16014g8403c9103j08171H729J55243m6705K98114a41359k26991d537G2439a59757
16002B16082d2751B99188c48282A88939J0493k4820a24549L6256C76450a19788
15991g787D05837A47068K18492P1775k9992L65296M96346K31162l43429k91690
15981H65028n9290k52224n1356a07175B2011a67120E2070L0511a17573B6053J64518
15970A90571a95366A59197o0756k3637N5953e873F5231O1852a53201C03698b87708
15958b58259g3246D1292a4018A90060g2331J7508J9721A50780a18536j87332A65410
15946a54415H1116j7203j8756N1621n091K19364A27785m9141J80306a02064I4800
15934a48778d2942A17734K20519B6000f0262F7836a52226j65667H5707a76386
$$ y = [-78403, -39103, -147274, 8729, 163972, 117267, 415381, -141359, -368350, -4537, 72439, -159757, 216082, -42751, 299188, -348282, 188939, 199432, 174612, -124549, -88293, 376450, -119788, -7787, 405837, 147068, 365560, 437335, 407343, 772639, 1268985, 1500147, 1156718, 865028, 805738, 553514, 502158, -107175, 22011, -167120, 52070, 82581, -117573, 26053, 190571, -195366, 159197, 98441, 74804, 130757, -5873, 65231, 127083, -153201, 303698, -287708, -258259, -73246, 41292, -14018, 190060, -72331, -54823, -35102, 150780, -118536, -305868, 165410, -154415, 81116, 63913, 45157, 96778, 91687, 311051, 127785, 78644, 258950, -102064, 94800, -148778, -42942, 117734, 338253, 26000, -60262, 67836, -152226, -317893, 85707, -176386]
15923c78448f4729J5449F1798L22995B5848J39937b75536F2142c36267A88576
15912b8237C65395D4330j5057j4003K09495B8844L35928d03977E28494A31591
15901A4421a08145l6696L8304J7863A8674a5193k54852a8993B80022A07282k4406
15890H2876l7327a1009B70978a30075A4388J97754m7303o1313C3605b4778F947
15878B7371b59317B5203b35188g3584B33515a16671k56245C24752a02168A58198
15867A4046Q8097b56412E5920a11916j61930I9598g1355l1861m6220C7592L9916
15856G7508J2834g1684p7232F8092O8329b73749a4730l21A80122d10905a05714
15844a89883c9432A81158J7359d2832C88892a19487A04304M3806l4878J12139
$$ y = [-378448, -64729, -49280, 61798, 384793, 25848, 165785, -275536, 62142, -336267, 188576, -28237, 365395, 44330, 29273, 15270, 224765, 28844, 364772, -403977, 528494, 131591, 14421, -108145, -144841, -106537, -88674, 18674, -15193, -270045, -18993, 280022, 107282, 82876, 45549, -11009, 270978, -130075, 14388, 212142, 164839, 103526, 33605, -24778, 6947, 27371, -259317, 25203, -235188, -73584, 233515, -116671, -372916, 324752, -102168, 158198, 14046, 102143, -256412, 55920, -111916, -273846, 99598, -71355, -103216, -149436, 37592, 77508, 90342, -71684, -148916, 68092, 136421, -273749, -14730, -15051, 180122, -410905, -105714, -189883, -39432, 181158, 198517, -42832, 388892, -119487, 104304, 148110, 113232, 225371]
15834B25371I0738d3870l24919J79352A36530Q278c40792d4716B39915G921a20910
15822b54584a26656e5961I8388d2513k69003A24574D5594K6309a44273k34095
15812c78368a76913g8593k34160B99835b50082f1059J2148k37590m2605f9268
15801c72732B23195A796f3562A9010n229b40816B07328g7318D80452a6200l0137
15790d6337j87605H7288B7265K98547c13177a04796l03692E6294N6451c33787
15779B79809A34401b9026R997q3516B77858a91595b3711I1387M4941a9881A88298
15767H4889f5185J0631b7117A05031K73695a711k04323d3178A43568f8687B51125
15755A82080f634B63143J8994m9286J2393a94167E2897b8537C54198d5424C19765
$$ y = [225371, 90738, -43870, -368789, -189437, 136530, 144808, -340792, -44716, 239915, 7921, -120910, -254584, -126656, -55961, 98388, -42513, -311516, 124574, 45594, 71903, -144273, -378368, -176913, -78593, -312753, 299835, -250082, -61059, -48911, -286501, -329106, -69268, -372732, 223195, 1796, -63562, 19010, 13781, -240816, 207328, -77318, 480452, -16200, -46337, -233942, 87288, 27265, 325812, -313177, -104796, -408488, 56294, 112745, -333787, 279809, 134401, -29026, -19029, -102545, 277858, -191595, -23711, 91387, 136328, -19881, 188298, 84889, -65185, -54554, -27117, 105031, 378726, -1711, -206034, -43178, 143568, -68687, 251125, 182080, -6634, 263143, 282137, 232851, 245244, -194167, 52897, -28537, 354198, -45424, 319765]
15743B54089E0002j0911a44117O9899B07177a30305e8873o0231H507N4588J2315
15732G5410N7137b75220a02651H0273a3872j72919D863a04232k10727A41668b61519
15720A56585c15491I1522R3021E1592B0981g7506r8165A79949c57162A20977N7172
15709A78149J33907b0557p6006j30951L431B0602Q0024D3722h3421m2542n4245
15698a80208k36420F4189b7861k19340B18192c946B21968j04280L4359j135b0104
15686A41103K05365a5683G2096J18484K4864l6421m5023r078a05214I8689a19551
15674H2675b57899F9689L08127A85942H1208J83487K81544q9559a17438j0524
15664a27962a7147k055F4575J02733f2141l44804J86678A6169b4982j96416A07570
$$ y = [254089, 50002, 39091, -144117, -74218, 207177, -130305, -58873, -119104, 8507, 63095, 75410, 132547, -275220, -102651, 80273, -13872, -186791, 4863, -104232, -314959, 141668, -261519, 156585, -315491, 91522, 184543, 51592, 20981, -77506, -175671, 179949, -357162, 120977, 178149, 312056, -20557, -96563, -227514, -224083, 20602, 100626, 43722, -83421, -125963, -180208, -416628, 64189, -27861, -247201, 218192, -3946, 221968, 117688, 152047, 150912, -20104, 141103, 346468, -15683, 72096, 190580, 215444, 179023, 134000, 124922, -105214, 98689, -119551, 82675, -257899, 69689, 377816, 185942, 81208, 264695, 546239, 456680, -117438, -127962, -17147, -19202, 64575, 167308, -62141, -406945, -220267, 16169, -24982, -221398, 107570]
15652f9872l5327I1260i8216E7804b23322J8673p0559P4241L9779A24836J2747
15641A37583f2418j88222M0570A79722a28667k97332e4919k16120R1580c586j07326
15630a10912E4941j4432N3312R4316K6916C7956a38569J7374E1858c45336h871
15618a04908a5787j37635P2595B73443d47991C9357A623b64234a19297a7735k98498
15607c16233B64710o5363a73190d8925Q056A248e0636j89722g7313B11081D091
15595D0084l306K3865g8825b141A72283q4236a30489A16881b73411F2886A5820
15583a5741j54699B30576b26234N2675k07d2337j33983r0848B53194a99845C3284
15571g757k59023e2383j7199D01747F64Q5985a18507e1717D2150M4016b14397
$$ y = [-69872, -105199, 91260, -98216, 57804, -223322, -204649, -275208, -200967, -161188, 124836, 137583, -62418, -250640, -210070, 179722, -128667, -425999, -54919, -271039, -179459, -3586, -110912, 54941, 40509, 93821, 188137, 215053, 37956, -138569, -121195, 51858, -345336, -8871, -104908, -15787, -153422, -80827, 273443, -447991, 39357, 1623, -264234, -119297, -17735, -316233, 264710, 199347, -173190, -48925, -40869, 1248, -50636, -240358, -77313, 211081, 4091, 40084, 36778, 60643, -78825, -2141, 172283, 88047, -130489, 116881, -273411, 62886, 15820, -15741, -170440, 230576, -226234, -173559, -173766, -42337, -176320, -267168, 253194, -199845, 33284, -7757, -266780, -52383, -69582, 401747, 664, 86649, -118507, -51717, 42150, 86166, -214397]
15559b25069F945J63531B5936a59068J3293A43884f8629i112B00937J63523i8288
15547B47182f795r264B25017p5338c7400M785B92117a04276E7979c28928A07692
15535b43691A46167a85946C00169a44785J7168A25909b3271B30413c02628A99074
15524I0735a29499C41983d6760r3903F2835a83515A16713L22329k11188K37399
15514D65253B13991l3306a0909B01925c9274k1987C1042c24180h9435A91982k8240
15503A63742K09489A86256J61519j28121D9187K76354b4164A03164J61278r4631
15493A69811g581B48468o8196a40132C88519j17161j12378J6600f7884A02462
15482A76137J27265i5566F7084a18872A42581L66331A73467N53731m3656J54958
$$ y = [-225069, 6945, 170476, 25936, -159068, -145775, 143884, -68629, -9112, 200937, 364460, -98288, 247182, -6795, -16059, 225017, 149679, -37400, -32615, 292117, -104276, 57979, -328928, 107692, -243691, 146167, -185946, 300169, -144785, -127617, 125909, -23271, 230413, -302628, 199074, 90735, -129499, 341983, -46760, -140663, 62835, -183515, 116713, 439042, 227854, 465253, 213991, 180685, -10909, 201925, -39274, -61261, 31042, -324180, -89435, 191982, 163742, 373231, 186256, 347775, 219654, 49187, 325541, -24164, 103164, 264442, 169811, -7581, 248468, 180272, -140132, 388519, 271358, 158980, 175580, -67884, 102462, 176137, 303402, -95566, 67084, -118872, 142581, 508912, 173467, 727198, 683542, 838500]
15472H38500k08637k4282A55838K82000b0053C53295j35243m4395K20411a50548
15461A50555G3345J02777N6168n2380l4445b2656j56401C24909a72283P7408o6780
15450a61655B10628A05299a69593A69616B0769J75313K2302I7877L17156P38636
15440A153669P37956q12151l05037k06531j99168A11041Q3206d3739C36053c6357
15429A13948b17801G0224J05143G2050K07071a46042A47701c44974A43698a76468
15418a45658C57625j36807J52750j72299j0238A1039a21428d6179D2080J31188
15408A73268l430i3910A72071a67976A12424m4521J13656D9651a10416A93170
15397b57154A61709f1337K3652I6518h1729L5608b2993A21771b65228A09888b73606
$$ y = [838500, 629863, 605581, 155838, 437838, -20053, 353295, 218052, 173657, 394068, -150548, 150555, 73345, 176122, 232290, 179910, 145465, -22656, -179057, 324909, -172283, -94875, -161655, 210628, 105299, -169593, 169616, 20769, 196082, 218384, 97877, 415033, 1153669, 1891625, 1079474, 774437, 567906, 368738, 111041, 194247, -43739, 336053, -36357, 113948, -217801, 70224, 175367, 72050, 279121, -146042, 147701, -344974, 143698, -176468, -145658, 357625, 220818, 373568, 201269, 191031, 11039, -121428, -46179, 42080, 173268, 169838, -93910, 172071, -167976, 112424, 67903, 181559, 49651, -110416, 193170, -257154, 161709, -61337, -37685, 96518, -81729, -46121, -22993, 121771, -265228, 109888, -273606]
15385h2234A44777J32497h7528K0460l0968G3475o654b20194D796L55382r8671
15374B61507a74664B66039Q6811o3170j11627j5814i7810C43019c35998a15340
15363h285D59830d44684h9639K2166F15477G6923R1335J5247K29573j02626b8035
15351C9051b151A2903b6723B79348k1343b47715B05458L38015B44210L05889n2001
15340D98098l5474A38606J08158P2683r7803a48932n1978B56763J5204p6754I0084
15328B03753N0213H0458K38180L2503m4674m6729a66517B79928F3899J3286a12071
15316B94868h5982B67966k9992J90714k10940I2626J00246c7928H4384K00002
15306B84386J24526C5000K13909J68959G5158a51724E4181K72140L925a02248
$$ y = [-82234, 144777, 277274, -87528, -67068, -98036, 73475, 66821, -220194, 4796, 360178, 261507, -174664, 266039, 352850, 289680, 178053, 162239, -97810, 343019, -335998, -115340, -8285, 459830, -444684, -89639, -67473, 615477, 76923, 168258, 183505, 413078, 310452, -28035, 39051, -2151, 12903, -26723, 279348, 258005, -247715, 205458, 543473, 244210, 550099, 498098, 462624, 138606, 246764, 319447, 221644, -148932, -200910, 256763, 271967, 195213, 90084, 203753, 253966, 80458, 318638, 351141, 306467, 259738, -166517, 279928, 63899, 77185, -112071, 294868, -85982, 267966, 237974, 428688, 217748, 92626, 192872, -37928, 84384, 284386, 408912, 35000, 248909, 417868, 75158, -151724, 54181, 326321, 330246, -102248]
15295a34075F5742i5123E5047M54215h2370A3537a9240j2325B20852H8190L50159
15284D38349C9167M13595d96716C2468c82793F3754a40894J1231e2510I3034c9250
15272C52880a68627n3475C52674c3078j93964C13799A05119R171a82124H348M47494
15261D55842c3496A30544c39069A09586A3074h3241b1386b907A29919a73227B19092
15249C0330J51806a25939E2516b58500D78345j66207L74242J35516J424129n82518
15239A663507K00401L5763G00776B88042N4013j16546n1490o1022B9087b19055
15228h9849C2652K00634a77203A11981N0383k9302H943J21498b4553k80744C42412
15216C03540G9575h5143j22820c3846A13612b61031g4868A43282a32648A46554
$$ y = [-134075, 65742, -95123, 55047, 509262, -82370, 13537, -19240, -31565, 220852, 88190, 438349, 39167, 452762, -496716, 32468, -382793, 63754, -140894, -129663, -52510, 93034, -39250, 352880, -168627, -222102, 352674, -33078, -227042, 313799, 105119, 114290, -182124, 8348, 455842, -33496, 130544, -339069, 109586, 13074, -83241, -21386, -2907, 129919, -173227, 219092, 30330, 182136, -125939, 52516, -258500, 478345, 312138, 686380, 821896, 2246025, 1663507, 1863908, 1899671, 700776, 288042, 342055, 225509, 174019, 112997, 29087, -219055, -89849, 32652, 233286, -177203, 111981, 162364, 133062, 8943, 130441, -24553, -305297, 342412, 303540, 79575, -85143, -207963, -33846, 113612, -261031, -74868, 143282, -132648, 146554]
15205B40832F4228J23756G3470K45796l8608G1120K32235e9530k9064j01200O8536
15194a21258H6144B8563L5805P7682a02317M5255K1400j21111B26867b00989A2512
15182A76983J26112b69279I2041J74173J05737i4693j18092A1493e0174D19171
15171a52783A31356j7103a1073j7088J3499D99753b375m1819h194H3415a24092
15159I9120R9705k3629q1286J58602l7197L855K57321A33463H584i4128C1665
15147G9661J70343P597A07014b16377M722A2498a29973H6221K64145j09395b76880
15135B33730g9067a8266A33077B2428a46598G1698C635J09536L00526a25845A55655
15123E62381G7239L45804A94972h5911D72587A79314L0936e5056C76093m9942
$$ y = [240832, 64228, 187984, 73470, 319266, 280658, 71120, 303355, -59530, -88594, -189794, -121258, 86144, 28563, 64368, 142050, -102317, -57062, -35662, -156773, 226867, -200989, 12512, 176983, 303095, -269279, 92041, 266214, 371951, -94693, -212785, 11493, -50174, 419171, -152783, 131356, 114253, -11073, -28161, -14662, 499753, -2375, -44194, -8194, 83415, -124092, 99120, 198825, 175196, 93910, 252512, 215315, 219170, 476491, 133463, 8584, -94128, 31665, 79661, 250004, 257601, 107014, -216377, -211655, 12498, -129973, 86221, 350366, 240971, -276880, 233730, -79067, -18266, 133077, 22428, -146598, 71698, 3635, 113171, 413697, -125845, 155655, 562381, 77239, 423043, 194972, -85911, 472587, 179314, 210250, -55056, 376093, 326151]
15113C26151J72161A21612b05936C20321A47776K26149F4648A2450a38238A17513
15102A06684b8650D91990k44871g0741D7859b56555A53865n7586m6356L72000
15092D21923A42307o3951b72958A99572C3474a69070d9236H3193L27764A37607
15081B81158d3613A52637K91750A28200J44206A5514i2475A62938C4100p957e0051
15069B96181a10578B91070K7992B8590a7045B31835d97D68730E4232M75215k07515
15058C21932N832J72390H0881K48685j05162C1440J70770J21587J35607B12637
15047f7708E40215B26258J16746A36089a18061C49148J76866A46226N4510o065
15037A94671J88707j1656J36294J60100k71878J52214L72121k97391L43565l1913
$$ y = [326151, 498312, 121612, -205936, 320321, 147776, 373925, 64648, 12450, -138238, 117513, 106684, -28650, 491990, 247119, -70741, 47859, -256555, 153865, 96279, 49923, 421923, 142307, 78356, -272958, 199572, 33474, -169070, -49236, 83193, 410957, 137607, 281158, -43613, 152637, 444387, 128200, 272406, 15514, -92475, 162938, 34100, 26143, -50051, 296181, -110578, 291070, 319062, 28590, -17045, 231835, -497, 468730, 54232, 529447, 321932, 327764, 500154, 80881, 329566, 224404, 31440, 202210, 323797, 459404, 212637, -67708, 540215, 226258, 343004, 136089, -118061, 349148, 526014, 146226, 200736, 194671, 383378, 371722, 508016, 668116, 396238, 548452, 920573, 623182, 966747, 934834]
15027I34834j04749j06827k29838j10476j69971K75230J72002q4897A97192J77436
15017C74628o7396Q0404H4999K27000J70933K60296k83909o3579J32542k49173
15007B79109L92228j83597j26268M04924C24844J4502m8104K93682N256B23731
14996A85945L58152k56048K13568q7501K28945A62438L43390O14965m92067j56535
14986D72191p0787J41034k48299K23849L39900j70225M74150m61132k82282j03781
14976C14618R6612M07498C58098J51457K77454k26170J73950j56602m8073o6756
14966D63358j80747K48750Q1644k10137q6932L83618j12730B37882A11774J76478
14956B88252Q6265A73222a33315f5083A28531M34809j14767j57392P0836m0636
$$ y = [934834, 830085, 723258, 493420, 382944, 212973, 488203, 660205, 575308, 197192, 374628, 307232, 387636, 84999, 311999, 482932, 743228, 459319, 395740, 528282, 279109, 671337, 487740, 361472, 766396, 324844, 339346, 291242, 584924, 590180, 223731, 185945, 544097, 288049, 501617, 414116, 643061, 162438, 505828, 1120793, 628726, 472191, 401404, 542438, 294139, 517988, 857888, 687663, 1161813, 700681, 418399, 314618, 411230, 818728, 358098, 509555, 787009, 560839, 734789, 578187, 530114, 463358, 282611, 531361, 613005, 402868, 315936, 699554, 586824, 237882, 111774, 288252, 374517, 173222, -133315, -65083, 128531, 563340, 448573, 291181, 362017, 321381]
14946C21381K71501A24283J87896P80320m2372n02784k67202Q9070j25129J91339
14936D35421R7736J2974n3009K10052K577J76293R4208r4741N00000J03640J44242
14925A629393O695l4684J77350m52715J77212k9110Q5905K18752O95271J04515
14915B578584j80130m29451p25854l8920O6118j93543l33119K25248l86670m6114
14905E36149j24986Q6203J88421l18432R0514R0675l0470A73446M98784C8204
14894C38295K50937P3656J99895B70630L21988j61428P8242O3162j54863j49848
14884B67883K46869K02397K37852l54549K77030J91959k84252N0417O5818k16854
14874F84570k84970L01935C0839O77197l48742Q7895O3680j71067L63725O0842
$$ y = [321381, 592882, 124283, 312179, 1092499, 1050127, 547343, 280141, 369211, 244082, 435421, 533157, 546131, 493122, 703174, 705751, 882044, 976252, 881511, 1381511, 1485151, 1629393, 1636088, 1601404, 1778754, 1326039, 1503251, 1474141, 1560046, 1778798, 2474069, 2578584, 2398454, 1969003, 1243149, 1204229, 1270347, 1076804, 743685, 968933, 582263, 536149, 411163, 497366, 685787, 367355, 457869, 548544, 518074, 173446, 672230, 38204, 338295, 589232, 662888, 862783, 270630, 592618, 431190, 509432, 572594, 417731, 267883, 514752, 717149, 955001, 600452, 877482, 1069441, 785189, 835606, 901424, 684570, 399600, 701535, 30839, 708036, 359294, 447189, 510869, 339802, 703527, 764369]
14864G64369J81149l38268K4758B05861J62312K77274l03890K13640A29662M19975
14854E49637j96642L53092k50559K2627Q8536k58314L87705j77673j96864N85032
14844I06577o5297M53380k64889M0178J64572j87452q3619l0926O3836l33672
14834F62688k5205p8254J23306Q2082j66641J59044A21975E5623J29106O51641
14824H36370Q2714j66589P5991C89679M60582l41354J80447O640N16721k91556
14814I21159l33849o5274J39205O0864m6945M1436K5441L45695k17050K2051J80153
14803A072886j09822k18801J26688D00248K21982k01666O8595L6387J5209j06315
14793D34440N1776P8863j89353Q7107j76044L55150l6673L38018k13942l5208
$$ y = [764369, 945518, 607250, 632008, 205861, 368173, 645447, 341557, 555197, 129662, 549637, 352995, 706087, 455528, 478155, 566691, 308377, 696082, 518409, 321545, 906577, 841280, 1294660, 1029771, 1069949, 1234521, 1047069, 963450, 932524, 996360, 662688, 637483, 559229, 682535, 764617, 597976, 757020, 121975, 55623, 184729, 836370, 919084, 752495, 828486, 389679, 850261, 508907, 689354, 695994, 1212715, 921159, 587310, 522036, 661241, 722105, 675160, 716596, 742037, 1087732, 870682, 892733, 1072886, 963064, 744263, 870951, 400248, 622230, 420564, 489159, 525546, 540755, 434440, 486216, 565079, 375726, 462833, 286789, 641939, 605266, 943284, 729342, 694134]
14783F94134K90701D91571J34954j48356M31115M8253J12302Q4047k58366m0338
14773H55182o2262M8064j30968k2590k20894J24779M4115P2679L5923M6915k9610
14762G61333l25971L51078k97275L25974l45759J92427k37898K21479J19143N3344
14752H17875j21981k40630K15443o2537j44678M97141k82696q8940K94440l26417
14742E57020L6511J56584L89986m01371r0064J24276K6163j85085K71250K67168
14732A152438n1235j68709J38186L09221J22292L74746K828j94255j84546k58350
14722A242616k27344K8263j01854j26791n9532P1130p7162j31883N76271j62633
14712A031081j78329K2174j64515K35149O279l24803M51441L66653m51055N56471
$$ y = [694134, 984835, 491571, 626525, 478169, 909284, 957537, 1069839, 1153886, 895520, 855182, 792920, 840984, 710016, 687426, 466532, 591311, 635426, 708105, 744028, 790943, 761333, 435362, 786440, 489165, 815139, 469380, 661807, 423909, 645388, 764531, 817875, 695894, 455264, 670707, 608170, 463492, 960633, 677937, 588997, 883437, 557020, 593531, 750115, 1140101, 738730, 648666, 772942, 799105, 614020, 885270, 1152438, 1101203, 932494, 1070680, 1379901, 1502193, 1876939, 1879767, 1685512, 1500966, 1242616, 1015272, 1043535, 941681, 814890, 755358, 826488, 749326, 617443, 1193714, 1031081, 852752, 874926, 710411, 945560, 951839, 627036, 1078477, 1445130, 994075, 1550546]
14702A550546K42680K34118j98420P2543r8350l37580n02167K61322j31563j6625
14692A076504l01101n8151K38023k48339K57514p5530R357R7215K18355m96337
14682G17510K18530m8328l4894o2893K67691C65867Q73601k66466j4842K33681
14672A191841l05553K79470n0817j32152j44991M11057k10175J63397j55591K36394
14662A282880m04820L30954n3493Q8196l22716R5274p5891M89653j41158j75684
14652A113195M49455l35302L55074j67970k93791J04939j23360L16989m74980
14643I44249L97710k37145J93913l38977K2721J85703K1862P3482j7567O4187
14633A310138L3258o3665J10341k2601l65484O36109j27453r975j14515l56906
$$ y = [1550546, 1793226, 2027344, 1828924, 1901467, 1803117, 1465537, 963370, 1224692, 1093129, 1076504, 775403, 717252, 955275, 706936, 964450, 888920, 898277, 995492, 1213847, 717510, 936040, 887712, 852818, 789925, 1057616, 365867, 1239468, 973002, 958160, 1191841, 886288, 1165758, 1114941, 982789, 837798, 1248855, 1038680, 1202077, 1046486, 1282880, 878060, 1209014, 1155521, 1243717, 921001, 1016275, 940384, 1430037, 1288879, 1113195, 1562650, 1227348, 1582422, 1414452, 1120661, 1225600, 1102240, 1419229, 944249, 1341959, 1104814, 1298727, 959750, 982471, 1168174, 1190036, 1263518, 1245951, 1310138, 1343396, 1279731, 1390072, 1367471, 1001987, 1638096, 1510643, 1500668, 1386153, 1029247]
14623A029247L13307k11537L13180j81382j31463J86391o003K48096n9830j73273
14613A326733O1718r405k09287O03684j9903m40785K89969k41271M4981L51702
14603A758136k4652j53992k7102J41590k37078M09159P909k62864j395J63134
14593A772845Q4941L2203j24006P2343J33962j93549N3895K24605m20387j19351
14583A517501O2913J59569J62118R6704k53188K25956L88729l45505K71077m51743
14573A834131N32036j39288m26498M23259k1636K45519n2555p7445K9029j09663
14563B236889J11292j4638O70534j91296j34153K52268j4229J17795K51811r4527
14553C191746L95132K97931N04949R88638J361904K393653Q123157K1098730J9609020
$$ y = [1029247, 1342554, 1131017, 1444197, 1262815, 1131352, 1317743, 1311740, 1559836, 1500006, 1326733, 1388451, 1379046, 1169759, 1773443, 1753540, 1312755, 1602724, 1361453, 1406434, 1758136, 1733484, 1579492, 1552390, 1693980, 1456902, 1866061, 1873970, 1611106, 1609711, 1772845, 1857786, 1889989, 1765983, 1838326, 1972288, 1778739, 1832634, 2057239, 1636852, 1517501, 1580414, 1739983, 1902101, 1998805, 1745617, 1971573, 2360302, 2014797, 2285874, 1834131, 2366167, 2226879, 1800381, 2223640, 2202004, 2447523, 2394968, 2317523, 2346552, 2236889, 2348181, 2333543, 3004077, 2812781, 2678628, 2930896, 2916667, 3034462, 3286273, 3191746, 3586878, 3884809, 4389758, 5378396, 6740300, 9133953, 17257110, 38355840, 57964860]
14544E7964860B1813185G672543C606196q50838m04797J22578O79461K111983
14536E264583J55409k516035o22031r9611j38951J69931n1467J72054k8083K00759
14526B506558k33013L53123J763J06195k49920l93768K5127L08680K29872k72893
14516B381724m4222L91316j9446j58001K43302j54026p6655L91118j57527n1080
14506B746503K44903j41949M4099K15990k02713J78196K52271m0328M5877J22837
14496C465686l04454M25834m84816R1371K02476j79318L01626j46004q0231J71951
14486C464121R9795K27263J81759k53891n5130J1732J92303O3590J47888m1529
14476D037901J22142k02719N074O0069K18015L56109j44585k1009j43544J23155
$$ y = [57964860, 21813185, 7672543, 3606196, 2755358, 2350561, 2473139, 3152600, 5264583, 5419992, 2903957, 2281926, 2182315, 2043364, 2213295, 2161828, 2333882, 2305799, 2506558, 2273545, 2626668, 2628431, 2734626, 2484706, 2090938, 2116065, 2424745, 2654617, 2381724, 2337502, 2728818, 2709372, 2551371, 2794673, 2640647, 2563992, 2955110, 2797583, 2746503, 2991406, 2849457, 2893556, 3109546, 2906833, 3085029, 3337300, 3296972, 3342849, 3465686, 3161232, 3587066, 3102250, 3193621, 3396097, 3216779, 3518405, 3372401, 3292170, 3464121, 3563916, 3791179, 3972938, 3719047, 3663917, 3675649, 3867952, 3931542, 4079430, 4037901, 4160043, 3957324, 3962398, 4022467, 4240482, 4596591, 4452006, 4430997, 4287453, 4410608]
14466D410608L3513M55808j50302k6577j78207M70011p2366K53006j80796L75626
14456E390324k23491j36503J35279J35863J21017l37176L98255q0892N35401j15226
14446E822851l14169L78684K1157J6055o0822K26122j16186K38536o966K12494
14436F417756j06015L87479J35554p6763L79783Q5329k48047o3743L84148r9251
14426G196230N45095k15358L35177J42190Q7279L09418P9537L44084l3764J05892
14416H895780p1530M2700R8787m62117L42895K52816K39578O3605L10628L74906
14406A0088048m03293P23645L84581J14019m13104L89458r928L55211l39499P61213
14396A1650351R0882m8172M83750K6756k58265O10064j75938L75009P66692j19831
$$ y = [4410608, 4444121, 4899929, 4749627, 4723050, 4544843, 5014854, 4942488, 5195494, 5014698, 5390324, 5166833, 5030330, 5165609, 5301472, 5422489, 5085313, 5483568, 5402676, 5938077, 5822851, 5508682, 5887366, 5908523, 5924578, 5863756, 6089878, 5973692, 6212228, 6205262, 6417756, 6311741, 6699220, 6834774, 6758011, 7137794, 7223123, 6975076, 6911333, 7295481, 7196230, 7741325, 7525967, 7861144, 8003334, 8090613, 8400031, 8479568, 8823652, 8789888, 8895780, 8824250, 8866950, 8965737, 8503620, 8846515, 9099331, 9338909, 9402514, 9713142, 10088048, 9684755, 10408400, 10792981, 10907000, 10493896, 10883354, 10873426, 11228637, 10889138, 11650351, 11741233, 11693061, 12176811, 12203567, 11945302, 12555366, 12379428, 12754437, 13521129, 13401298]
14386A3401298J70349M41754K18060L72075M53446L28063K47076R8876O5255L79572
14376A6175824L3606P14021L00382J00930N21354M96794M40762J73481L52230
14367A9309384O92439K33134P80551L19358L85934k3645N03077P51149K21644
14358B3173025M20557Q97674J34831Q03435M43643Q98675O11339R48337K26701
14349B8558217P01365Q51534P95483N83276J226854O32313P78700R44577R93761
14340C6066080J099315P99140J555899N69617J225713J453677J129385J387542
14332D5286368J401384J371393J360350J905079J476659J472182K310174J903415
14324E8487004J834527K217693K154057K532744K379531K298114K971630K494405
$$ y = [13401298, 13571647, 14013401, 14231461, 14603536, 15056982, 15385045, 15632121, 15730997, 15796252, 16175824, 16209430, 16923451, 17223833, 17324763, 17846117, 18342911, 18783673, 18957154, 19309384, 20001823, 20234957, 21015508, 21334866, 21720800, 21697155, 22200232, 22951381, 23173025, 23593582, 24491256, 24626087, 25429522, 25873165, 26771840, 27383179, 28331516, 28558217, 29259582, 30111116, 30906599, 31489875, 32716729, 33349042, 34127742, 35072319, 36066080, 37165395, 37964535, 39520434, 40090051, 41315764, 42769441, 43898826, 45286368, 46687752, 48059145, 49419495, 51324574, 52801233, 54273415, 56583589, 58487004, 60321531, 62539224, 64693281, 67226025, 69605556, 71903670, 74875300, 77369705]
14316G7369705L319523K942859K988051L375256L809952L573257M795137L994861
14308A06168601M095951N711003M539618N542461N528599O256549O313080O833938
14300A50989800P378881P209309P938804Q925851Q929847R441089J0353947J0608752
14292B21776280J1377172J1934892J2471429J2893614J3570661J4352674J4363573
14285C12740295J5281244J4925259J5601465J5504512J5311107J5442720J4842848
14278D19649450J4335938J2926852J2023230J0403734Q082774N967455J445183
14271D84834616j509208k166747k858933n750453o282614q925352j1203987j3200748
14263D32936574j4504898j5351252j6231762j6525013j6698733j6781266j6137507
$$ y = [77369705, 80689228, 83632087, 86620138, 89995394, 93805346, 97378603, 102173740, 106168601, 110264552, 115975555, 120515173, 126057634, 131586233, 137842782, 144155862, 150989800, 158368681, 165577990, 173516794, 182442645, 191372492, 200813581, 211167528, 221776280, 233153452, 245088344, 257559773, 270453387, 284024048, 298376722, 312740295, 328021539, 342946798, 358548263, 374052775, 389363882, 404806602, 419649450, 433985388, 446912240, 458935470, 469339204, 477421978, 483389433, 484834616, 483325408, 481158661, 478299728, 472549275, 466266661, 457341309, 446137322, 432936574, 418431676, 403080424, 386848662, 370323649, 353624916, 336843650, 320706143]
14256C20706143j5772826j5149753j4392718j3974175j3253389j2768227j2189126
14249B23205929j1606528j0238065q130064r771783r437492q129998p896248p381836
14241A50613915p485822o462684n772333n326048n453396n406554n175890m455239
14233A05075949m554743m012007l434961l294135l912090l366709l422514k717595
14225G6361195k983998k255243k810953k461544k153350j616840k361199k424628
14217E7293440j427440k191517j146035j646030j338033j638897j321856j730733
14209D4852899j274254j212594n20274j034947j562801j490303n76103j247833
14201C5933790r13764l31978j703210o16770j037756p50256n51159o86246p36238
$$ y = [320706143, 304933317, 289783564, 275390846, 261416671, 248163282, 235395055, 223205929, 211599401, 201361336, 193231272, 183459489, 174021997, 165891999, 157995751, 150613915, 143128093, 136665409, 130893076, 125567028, 120113632, 114707078, 109531188, 105075949, 100521206, 96509199, 93074238, 89780103, 85868013, 82501304, 79078790, 76361195, 73377197, 71121954, 68311001, 65849457, 63696107, 62079267, 59718068, 57293440, 55866000, 53674483, 52528448, 50882418, 49544385, 47905488, 46583632, 44852899, 43578645, 42366051, 41845777, 40810830, 39248029, 37757726, 37181623, 35933790, 35020026, 34688048, 32984838, 32368068, 31330312, 30580056, 30028897, 29342651, 28606413]
14192B8606413o63885q30848n74930p46513n10370n38700n31262o63505m13877
14183B3132523m58963m38161m60197m81421m71968l18666n32978l41922k48131
14174A9380116n44448j12388n29146o85333q240n72894j33318l39436l33209l61670
14164A5760034n84304K9326k24212k82397k63073j11328l82658k64724j70832
14155A3505832M2163m83543k89662n0003m26956j27079k57341r0529q4734n61645
14145A1176503P2271k08676j87915L16389n95768j33003K1566M6552k77577n61288
14135I669054m4437J17992k91374k35896j77724m7960j62537J11734j82074l47679
14125H409099J8823N225j04010k7895K2499j44491l07737k94295J44664j58714
$$ y = [28606413, 27942528, 27111680, 26536750, 25790237, 25279867, 24741167, 24209905, 23546400, 23132523, 22673560, 22235399, 21775202, 21293781, 20821813, 20503147, 19970169, 19628247, 19380116, 18835668, 18723280, 18194134, 17508801, 17500561, 16927667, 16794349, 16454913, 16121704, 15760034, 15175730, 15205056, 14980844, 14698447, 14435374, 14324046, 13941388, 13676664, 13505832, 13547995, 13064452, 12774790, 12724787, 12297831, 12170752, 11913411, 11822882, 11738148, 11176503, 11248774, 11040098, 10852183, 11168572, 10572804, 10439801, 10461367, 10507919, 10230342, 9669054, 9624617, 9742609, 9451235, 9215339, 9037615, 8989655, 8827118, 8938852, 8756778, 8409099, 8427922, 8433147, 8329137, 8301242, 8323741, 8179250, 7871513, 7577218, 7721882, 7563168]
14115G563168l3092l82187M2521J91586n57320Q3648K36744K552j60249k85584
14105F701787L84719n36077J25385n47387K02638o7424r5769o6798k28647j78540
14095E693887J18108M3906l7824k34345P3873p5719j35724j54205j19915k2167
14085E149875J89524m3964k21043J33209j52926M5362l24304J0831K04391J63944
14075E154899m42541l1016l10551Q581J31478p2836k23080J74104o4344k27880
14065D096814l0334J68286L43822m61566J80207R954J43923M9925m71287P2599
14055D102343R3142j63308j10084k00685J08441K8147m63381Q5359l4098L52113
14045C797989m09984j71398p60R6796m625n1335k734j09109J86867o684j16955
$$ y = [7563168, 7530076, 7147889, 7190410, 7381996, 6824676, 6908324, 7145068, 7147620, 6987371, 6701787, 7086506, 6550429, 6675814, 6128427, 6331065, 6263641, 6167872, 6101074, 5872427, 5693887, 5811995, 5855901, 5818077, 5583732, 5657605, 5581886, 5446162, 5291957, 5172042, 5149875, 5339399, 5295435, 5074392, 5207601, 5054675, 5100037, 4775733, 4786564, 4990955, 5154899, 4712358, 4681342, 4370791, 4379372, 4510850, 4438014, 4214934, 4389038, 4324694, 4096814, 4066480, 4234766, 4578588, 4117022, 4297229, 4307183, 4451106, 4501031, 4029744, 4102343, 4195485, 4032177, 3922093, 3721408, 3829849, 3857996, 3394615, 3479974, 3445876, 3797989, 3388005, 3216607, 3215847, 3312643, 3308018, 3256683, 3253949, 3144840, 3331707, 3325023, 3208068]
14034C208068j87079J04702j64312J04540J56931J39873Q720j76789m72745K75400
14024B997309J1379m13103M0869J59132J75944j88085j80759l1232K6582J43588
14014B741624l59044l8808K98039l10506Q3944Q9845Q3217r4912M54904o11568
14004B336735O6885j45583o2252L1176j26328L63112r166n50062K96655r9290
13994B101882P5241J42776k34858M51444l29680P86886J527260N072454J6706075
13985B6299480L2775943k7457174A3566661n824456j787802j239841p00361m43656
13977C570545j24505j99920j54191n5849l61986R1645m0723j67523L94670n38122
13967B414041o0665q1351j25432j6578j05373J92189L15673q48575N76413k6943
$$ y = [3208068, 3020989, 3125691, 2961379, 3065919, 3222850, 3362723, 3371443, 3194654, 2721909, 2997309, 3008688, 2595585, 2636454, 2795586, 2971530, 2783445, 2602686, 2571454, 2598036, 2741624, 2382580, 2343772, 2641811, 2331305, 2415249, 2505094, 2588311, 2493399, 2948303, 2336735, 2403620, 2258037, 2195785, 2226961, 2100633, 2463745, 2454579, 1904517, 2201172, 2101882, 2177123, 2319899, 2085041, 2536485, 2206805, 2993691, 4520951, 9593405, 26299480, 59075423, 31618249, 13566661, 7742205, 5954403, 4714562, 4014201, 3570545, 3446040, 3246120, 3091929, 3036080, 2674094, 2765739, 2725016, 2557493, 2952163, 2414041, 2353376, 2272025, 2146593, 2130015, 2024642, 2216831, 2532504, 1683929, 2260342, 2233399]
13957B233399k28296J95073j27440K2505j28788J56606J10164l41309K41340j42300
13947A990954j80873l7493K15026j08703M0601P9134K84578o5283j75468k87286
13937A755187K72907n73049O44486k25993m8095L35555l02772l82018K98523R0958
13927A865689j96147j99064K58492k57266K95607j54181K80389l05112j2490j33912
13917A442005P0058J94787q3117j40435Q7083L6550K44993j48185l31635p6327
13907A295777J25807L75263k07637j58334n0233J96873J75622l48907N5807J60972
13897A621010m40044j42900L50337m03855M08192J42664j50766j13935J96478
13888A467181k52130n3882j72264M88428l86850J83518L17033m74490M32667l60558
$$ y = [2233399, 2005103, 2200176, 2072736, 2095241, 1966453, 2123059, 2233223, 1891914, 2133254, 1990954, 1810081, 1772588, 1987614, 1878911, 1919512, 1998646, 2283224, 2217941, 2042473, 1755187, 2028094, 1455045, 2099531, 1873538, 1825443, 2160998, 1858226, 1476208, 1774731, 1865689, 1669542, 1470478, 1728970, 1471704, 1767311, 1613130, 1893519, 1588407, 1575917, 1442005, 1512063, 1706850, 1623733, 1483298, 1570381, 1606931, 1851924, 1703739, 1372104, 1295777, 1421584, 1796847, 1589210, 1430876, 1380643, 1577516, 1753138, 1404231, 1460038, 1621010, 1180966, 1038066, 1388403, 984548, 1392740, 1535404, 1384638, 1270703, 1467181, 1215051, 1161169, 988905, 1477333, 1090483, 1274001, 1591034, 1116544, 1549211, 1188653]
13878A188653K65968k13713r7346j36719M0884k9996j4117M49195j67734J60445
13868A445520n18657Q2436J91815J65237k37121m5332J72583O2864k7969j80307
13858A111069k55053P4188K49188o2211J67022l75781K74361l75656M072k91990
13848E19209L85275J48805K7044j78218l7889j54831L79784K38308n44687K30279
13838A013079L86866n28170L20742k04194P5503k33909o3669K51933k4071k81475
13828G12635L43400L8602M4542O0498m01196k4259J43957p7207J29322K01004
13818A171298l88884J50024q3292K8257M52580m61520J18391m19552K79706j42534
13808G04474J65685J56347k20919J08649p691L5207k01383J87819k09299r9050
$$ y = [1188653, 1454621, 1240908, 1143562, 1006843, 1047727, 1017731, 1003614, 1452809, 1285075, 1445520, 926863, 1009299, 1201114, 1366351, 1129230, 1083898, 1256481, 1319345, 1291376, 1111069, 856016, 930204, 1179392, 1117181, 1284203, 908422, 1182783, 807127, 811199, 519209, 904484, 1053289, 1080333, 902115, 864226, 709395, 1089179, 1327487, 782800, 1013079, 1399945, 871775, 1192517, 988323, 1063826, 829917, 766248, 1018181, 994110, 712635, 1056035, 1094637, 1139179, 1199677, 798481, 774222, 918179, 840972, 970294, 1171298, 782414, 932438, 849146, 877403, 1329983, 868463, 986854, 567302, 847008, 704474, 870159, 1026506, 805587, 914236, 906545, 941752, 740369, 928188, 718889, 619839]
13798F19839K47227K19234l85486q7848M86369k74088j10201m9641j15713J88325
13788G38017j56961L89129C38871N44505K2894O1002k14451K35052K1791l40834
13778F68830J55924J54829j67584l55497L07855N772K876J47590k07621j44946
13768E68028j32335J62149L37132D65057N86646m27716m9088m1169L57317l93964
13758D97083J85300L7904M5371J02593n7010j56433J72336m05528r7013M22713
13748G47316C11966K84585n889J16554k20559K19428J35936C31848M94538k27790
13738E98596k1955O0715m2171L36306j82554k93568M39123l31892L97195j746
13728I58049k4893l58601J33888m4584R1435j58094J18566r4513j77995Q7318
$$ y = [619839, 867066, 1086300, 700814, 612966, 1099335, 825247, 715046, 665405, 549692, 738017, 581056, 970185, 338871, 883376, 906270, 967272, 752821, 987873, 1009664, 668830, 824754, 979583, 811999, 456502, 764357, 770129, 773005, 920595, 712974, 568028, 435693, 597842, 934974, 465057, 1051703, 623987, 574899, 533730, 891047, 497083, 682383, 720287, 765658, 868251, 811241, 654808, 827144, 421616, 324603, 747316, 311966, 596551, 590662, 707216, 486657, 706085, 842021, 331848, 826386, 598596, 576641, 637356, 595185, 931491, 748937, 455369, 894492, 562600, 959795, 958049, 933156, 574555, 708443, 663859, 755294, 597200, 715766, 621253, 443258, 530576]
13718E30576L56491l54236J1437K50503l68980K31318r6529K39602k48664j02031
13708D49487j52028M14615n0137r1192n7484K34328j29273K09497j25126B04071
13697G51361r7810k15345J8899k4162J47909o0062j95513J64206R1566j84357
13687C96692K64622C14240J22531k4282j24555K77133J4149j86773K92987j77267
13677E08163L7720A91645P5284N9785K75475B53270L94905k22513I6149J18430
13667B14579J82868m5277J58212Q7926P9694k48209K04129j82841K06582j71250
13657D86413K06215j62544J03318k98415K46032O2777B56236L93799M2289q185
13647F84139k62849J20907m2541k6164k02281K52393j61633j57488J01936L18464
$$ y = [530576, 887067, 532831, 544268, 794771, 425791, 657109, 560580, 800182, 551518, 449487, 297459, 712074, 661937, 570745, 513261, 747589, 618316, 827813, 702687, 204071, 751361, 653551, 438206, 457105, 432943, 580852, 520790, 325277, 489483, 581049, 396692, 661314, 314240, 436771, 412489, 287934, 565067, 579216, 392443, 685430, 508163, 545883, 191645, 266929, 326714, 602189, 253270, 648175, 425662, 96149, 214579, 397447, 352170, 510382, 598308, 678002, 429793, 633922, 451081, 657663, 486413, 692628, 530084, 633402, 334987, 581019, 643796, 256236, 650035, 692324, 684139, 421290, 542197, 499656, 473492, 271211, 523604, 361971, 204483, 306419, 624883]
13637F24883B34456K71808R3734k10638j19400J44362K0016l567J24766k22314
13627C33223P1243J28779P5810r265N6484k62786j4084K57112k0567Q5397l50411
13616C50935K45996K04415I5659J78436m1005K44375B35895K79870A20186C2406
13605E37973R0039C03515J58920B15684L8333M0584q6896L12931m8241R7497k53615
13594C16277K94534B43536j6493K28198j29348q1626J10050M6559j48675J1973
13584B64174j2403J30539A19616K47943B3744L06384J60866A37019J24270J56807
13574D18096J46591I2491N2150F2936K41108L1907J12636F2805L98742j08774
13564C52773H1656J22157J71342K69543F4958N3099J3216K75293M5959L19J15190
$$ y = [624883, 234456, 506264, 599998, 389360, 269960, 414322, 434338, 430771, 555537, 333223, 404466, 533245, 609055, 599790, 656274, 393488, 379404, 636516, 615949, 701346, 350935, 596931, 801346, 95659, 274095, 233090, 477465, 235895, 515765, 120186, 32406, 537973, 628012, 303515, 462435, 215684, 254017, 294601, 207705, 520636, 472395, 569892, 316277, 610811, 243536, 227043, 455241, 325893, 244267, 354317, 400876, 252201, 264174, 251771, 382310, 119616, 367559, 23744, 330128, 490994, 137019, 261289, 418096, 564687, 92491, 144641, 62936, 304044, 335951, 448587, 62805, 461547, 352773, 81656, 203813, 375155, 644698, 64958, 118057, 131273, 406566, 452525, 452844, 568034]
13553E68034H3329P72985B36301o6495N5335J84912k5194j33975L0784K37307
13543E18975k03549F9335K11536J47557K52579B83791Q4342J15349m6790j29500
13533C07192Q9531m8307F3930J79098J35767j22214I6793M00731A10879L42973
13523D53852j4488e9997A06476L78544k1204j32785j2186r7352L44824B77046
13512C71720j19912J39123b7690C14992M46613a01800H6389L24383p3831N4927
13502C91868j88159J51996o4765e6216A64379K75146A6430Q1588O73174B11577
13491B70110J39534H7258L79785r4906g044D23723r1562J49627B33318N6333A32323
13479A10331M69285A99254J51177j57168J67364N57463a7495A84363a90301B21306
$$ y = [568034, 83329, 856314, 236301, 169806, 225141, 410053, 384859, 250884, 281668, 518975, 315426, 69335, 280871, 428428, 681007, 283791, 368133, 483482, 436692, 307192, 396723, 348416, 63930, 243028, 378795, 256581, 96793, 497524, 110879, 453852, 439364, -59997, 106476, 485020, 463816, 331031, 318845, 221493, 566317, 277046, 371720, 251808, 390931, -27690, 314992, 761605, -101800, 86389, 410772, 336941, 391868, 203709, 355705, 290940, -56216, 164379, 439525, 16430, 98018, 771192, 211577, 270110, 409644, 87258, 467043, 372137, -7044, 423723, 332161, 481788, 233318, 289651, 132323, 110331, 579616, 199254, 350431, 193263, 360627, 918090, -17495, 184363, -190301, 221306]
13468a11260A43343J27104J41711H8978M16778j84808c0361E37973B63480D6821
13457C97244j96566J2151N7191L6962A37436K6145O779J76645q8228k0256O97
13446B39218j01034J82480A10395L35221D8090K73453M785A46230O5756J24282
13436C36268J04805r2175A60258L83946a39183B34136K1566j14814m768J96459
13426C32579I7889A0139J5607L69607I4360n795l1594K37276K56704B2893R4659
13415A17552d5351L846C81772A40222J64172J97144A58402O5648k2289J25499
13405C27260r0987D9345J73761M2316c6235A64678J19937G301J58532M25765A06778
13393B34213l4166l2084h5507E26675b1592j06178C50058J24072B8992b1569D70068
$$ y = [-111260, 143343, 270447, 412158, 88978, 505756, 320948, -30361, 537973, 263480, 46821, 397244, 200678, 212829, 270020, 306982, 137436, 163581, 170360, 347005, 258777, 238521, 239218, 138184, 320664, 110395, 445616, 48090, 321543, 326328, 146230, 211986, 336268, 441073, 348898, 160258, 544204, -139183, 234136, 255702, 140888, 136120, 332579, 97889, 10139, 25746, 395353, 94360, 88565, 56971, 294247, 550951, 22893, 117552, -45351, -41505, 381772, 140222, 304394, 501538, 158402, 224050, 201761, 327260, 236273, 49345, 223106, 265422, -36235, 164678, 284615, 7301, 165833, 591598, 106778, 234213, 200047, 167963, -85507, 526675, -21592, -127770, 350058, 474130, 28992, -21569, 470068]
13381C33029D2611K20625K3978p7030k5780J33273A12831J34874m5208p0623F4166
13369d795B59968A04767K39526A58372F7232K83475j3952j08338K08874a46161
13358D96554A06673N5923K29361Q2989I5403d9498B38390j02461i8072B42535
13347B07743D1691K22495j27495a00316C37294n5900O6126M8168m1654j10591
13337B43443J66354J08756k27300g267F40194A46255a43993B83454J4423K3741
13327C21618j02076K86413b9995A24060d5954G2842K46292j37993q8313J60058
13317B52886d7856B47662O6522J00266A71289j6104K48692l404B7476L48321j15044
13306B60753K07971b4988C84616I5956A7160M30384D57K39338I6045M07700G9830
$$ y = [333029, 42611, 263236, 287214, 210184, 184404, 317677, 112831, 247705, 202497, 131874, 64166, -4795, 259968, 104767, 344293, 158372, 67232, 350707, 336755, 228417, 437291, -146161, 496554, 106673, 162596, 391957, 474946, 95403, -49498, 238390, 135929, -98072, 242535, 207743, 41691, 264186, 136691, -100316, 337294, 281394, 347520, 395688, 354034, 243443, 409797, 518553, 291253, -7267, 640194, 146255, -143993, 283454, 297877, 321618, 219542, 505955, -29995, 124060, -45954, 72842, 319134, 181141, 92828, 252886, -47856, 247662, 314184, 414450, 171289, 155185, 403877, 400473, 27476, 375797, 260753, 468724, -24988, 384616, 95956, 17160, 447544, 457, 239795, 96045, 503745, 79830]
13294A61780G016f271D39735A59077p3632J89146k3562K69797d8204A33149L65463
13283D98612A26698l0881R2980E0051d5051k5759H9183J99343C3010a02587A74383
13271A02776i9418j1695c6190I2264K55679a86617O6211A24240a54066D01747
13260f2182B07211E4627O0140J00332m1862l3928C0553e2525j30568C32282j25965
13249B06317Q3893a501B48215b63034A66153g3615j74269A37908K18446b25962
13238h467A33422g796A07039a07095d5682B00959p9473C6817N52981B29801j00207
13227A29594J69013H2008i1139A58828g3095p8420A10779K31020a09326I8080
13216g4299B53141M8085A24928g6366k6328l302B32103j14402A7644J79000R8918
$$ y = [161780, 7016, -6271, 439735, 159077, 85445, 274591, 251029, 520826, -48204, 133149, 498612, 126698, 95817, 188797, 50051, -45051, -70810, 89183, 288526, 33010, -102587, 174383, 102776, -99418, -111113, -36190, 92264, 347943, -186617, -120406, 124240, -154066, 401747, -62182, 207211, 54627, 114767, 215099, 173237, 139309, 30553, -52525, -183093, 332282, 206317, 290210, -1501, 248215, -263034, 166153, -73615, -247884, 137908, 356354, -225962, -8467, 133422, -7796, 107039, -107095, -45682, 200959, 121486, 36817, 589798, 229801, 129594, 298607, 82008, -91139, 158828, -73095, -151515, 110779, 341799, -109326, 98080, -74299, 253141, 301226, 124928, -76366, -102694, -105996, 232103, 117701, 17644, 196644, 295562]
13205B95562N2160e0032k1848B04171H9039J70267J2116G4729a36475B72137J48721
13194D20858C2197d5012J0957B79775a78547c4431j98341B87372c4325j31120
13184a65445A18087J3812o0050g0191H9404q494l698K49911G9593J14976a84813
13172A69416O7530a39580A65177o1974M9660K60461b79802C27495I6906J25829
13162B22735j5096K70837a45793A73161o7122K51453A00571M5218J8107Q3193
13152B47089j7799b27499I2101a98859F6898J87266a85860D05071A52015d1607
13141b8864A33744O5076i2684B29424a6199B9258J67961E8012P7173b60352H8025
13129b4145k44231A38185a95803B85219C2780O0312Q2093c26969F0542a11386
$$ y = [295562, 347722, -50032, -71880, 204171, 89039, 259306, 271422, 74729, -136475, 272137, 420858, 32197, -45012, -34055, 279775, -178547, -34431, -232772, 287372, -34325, -165445, 118087, 131899, 71849, -70191, 89404, 80910, 77212, 327123, 79593, 194569, -184813, 169416, 236946, -139580, 165177, 103203, 152863, 413324, -279802, 327495, 96906, 222735, 207639, 478476, -145793, 173161, 106039, 357492, 100571, 145789, 163896, 247089, 229290, -227499, 92101, -198859, 66898, 254164, -185860, 405071, 152015, -41607, -28864, 133744, 198820, -92684, 229424, -16199, 29258, 197219, 58012, 135185, -260352, 88025, -24145, -268376, 138185, -195803, 285219, 32780, 93092, 175185, -326969, 60542, -111386]
13118B42712m5492N512h0147C8245N7920J4449J69684D9110L4822R0258J24414
13107B98604E3258J46254r5095a24255G1943M17236B29712b42537J21002C6605
13096D2a11758F4841J05855k4676b03145B72845K31407A42138j2466L72597i3117
13084a0036B2901e8453A16802f5951m4848l5219B36883A7728M36835A37974f4272
13072B91986a49135C77028D857a18204D3334L52165A15676K86998C7641P2135
13062A09776L8888J90855c02834J38019p2237A69275M1992a1334B55222a08291
13051A85303a16600L8782j5484C36334G2449e7824G2153l0451J85515f613D90498
13039D21743I1917C6147B801d4243A9453b44436B78613i5580A84622G8343L00530
$$ y = [242712, 197220, 202732, -80147, 38245, 96165, 110614, 280298, 49110, 83932, 174190, 298604, 53258, 199512, 104417, -124255, 71943, 489179, 229712, -242537, -121535, 36605, 42, -111758, 64841, 170696, 146020, -203145, 272845, 504252, 142138, 129672, 502269, -93117, -10036, 22901, -58453, 116802, -65951, -110799, -146018, 236883, 17728, 454563, 137974, -64272, 291986, -149135, 377028, 4857, -118204, 43334, 395499, 115676, 402674, 37641, 109776, 148664, 339519, -302834, -164815, -237052, 169275, 211267, -11334, 255222, -108291, 185303, -116600, -77818, -93302, 336334, 72449, -57824, 72153, 41702, 227217, -6613, 490498, 421743, 91917, 36147, 2801, -44243, 19453, -244436, 278613, -95580, 184622, 78343, 378873]
13028C78873H7131J78480H7807b25997B32537B2757h2074K3144k2510B39562J5800
13017B55362k2479J35118A50443O5385d9883J5491B99261K55315A67239K7954
13007A95193E5720K47226A14197J75938a84780A00680a91040D9879J71372a64477
12996I8033h5503D53055A47652h6586A38131c05440a20040c3591j24280F6293
12985a69067E080J6441M41433j83796G0995A2646M1704k5925g3733D32414F7532
12973b19282B33908a03340A30784K25516A03870g5982B00551J11371K0677g9240
12962H4856R8194B2158b27222d7870k6106I4157k2253R9850c89426A099a19433
12950d5112n0771A3430M43149f8817B20126b96943a14179D0111J60000b49559
$$ y = [378873, 87131, 265611, 87807, -225997, 232537, 22757, -82074, -58930, -81440, 239562, 255362, 232883, 368001, 150443, 215828, -49883, -34392, 299261, 554576, 167239, 195193, 55720, 302946, 114197, 290135, -184780, 100680, -191040, 49879, 221251, -164477, 98033, -85503, 453055, 147652, -86586, 138131, -305440, -120040, -33591, -157871, 66293, -169067, 5080, 21521, 462954, 279158, 70995, 12646, 54350, 28425, -73733, 432414, 67532, -219282, 233908, -103340, 130784, 356300, 103870, -75982, 200551, 311922, 332599, -79240, 84856, 183050, 22158, -227222, -47870, -73976, 94157, 71904, 171754, -389426, 1099, -119433, -45112, -95883, 13430, 456579, -68817, 220126, -296943, -114179, 40111, 200111, -249559]
12939C62969B9325O5363a89077G6513K739A056c7004A29531D1382K6720d7540
12927B24084E1260b3117A02716Q9391A5764b90868l5868C6360p454J33884o1903
12916A00887a49060N3290b2751q9309r5200A43247e163l162I1695J53972c65204
12904a04970E7010a10537a5896B28490g6717A46031a28985m6710O9897A44432
12893C81790A62411A6535d9911r5049A37851b90628B19844O9501C8836K2175g9073
12881A47657g3433A84956O5460n9899f2890B0939J57308H4306e2276B34440j16082
12870A18358j1234E3322c1307e949j261l5498G1620i0671r0118N4968d7164a5089
12857c74389a3162D6483K41692d2658k39438J37096c8103F8047J05528j0356M6351
$$ y = [362969, 29325, 94688, -189077, 76513, 79252, 1056, -37004, 129531, 41382, 68102, -47540, 224084, 51260, -23117, 102716, 192107, 15764, -290868, -326736, 36360, 28906, 162790, 100887, -149060, -95770, -22751, -112060, -207260, 143247, -5163, -8325, 91695, 245667, -365204, -104970, 57010, -110537, -15896, 228490, -76717, 146031, -128985, -175695, -105798, 144432, 381790, 162411, 16535, -49911, -144960, 137851, -290628, 219844, 289345, 38836, 61011, -79073, 147657, -73433, 184956, 250416, 190517, -62890, 20939, 178247, 84306, -52276, 234440, 118358, 107124, 53322, -31307, -5949, -7210, -42708, 71620, -90671, -180789, -125821, -47164, -15089, -374389, -13162, 46483, 288175, -42658, -282096, -145000, -38103, 68047, 173575, 163219, 209570]
12846B09570d1799C6578a07219M7354n2493H6861b75345H1687c17355n1733J71779
12835a97309B8337b483p2030A23159J33978g1577I1161b3083r7985A28883a1943
12823f2248k1299j37559A85954J20201n5666b5757A08118j0951a47268B63820
12812B31659L6164a51272d4636B94243J75755c02788A10903C5160c4460j63750
12802a98210A54969a46990f884k64676A31101i2712l4375A18245c51533A12488
12791B67264a42779C5607d2518p7421B13168E8705I772c6207C52918j55098M2709
12780B40529Q1284c91461G017J78418J35875a73686C5180K42167a37982e4792
12769e3341m50575A79610C5341L7144h4174A11205E1138g4665H3671c8976r8378
$$ y = [209570, -41799, 36578, -107219, -59865, -112358, 86861, -275345, 81687, -317355, -369088, -197309, 28337, -2483, -74513, 123159, 257137, -71577, 91161, -23083, -121068, 128883, -11943, -62248, -83547, -221106, 185954, 306155, 250489, -25757, 108118, 97167, -147268, 263820, 231659, 267823, -151272, -44636, 294243, 469998, -302788, 110903, 35160, -34460, -198210, 154969, -146990, -6884, -271560, 131101, -92712, -127087, 118245, -351533, 112488, 267264, -142779, 35607, -42518, -119939, 213168, 58705, 9772, -36207, 352918, 197820, 240529, 321813, -391461, 7017, 185435, 321310, -173686, 35180, 277347, -137982, -54792, -53341, -503916, 179610, 35341, 72485, -84174, 111205, 51138, -74665, 83671, -38976, -137354]
12758a37354A69429h5326m7409B06268H6233L69L7867c8651k1410j08158A14620
12746c74639J84399I0514b04788I2721E35O3818d9745A35390J91370A26019e8188
12734C43963A63128m8725B8409J62202a51506A49894J07899A0316d4201I9005
12723B29931b70k93714a04916B3721a80685B5817j0041K28490a44693A78834g5904
12711C12306e5801A49619D6143R5364a17013E0993K53214K6278j00793K3413a0854
12699H6541I101a892j35062A60703L3707b1048A33829f9128p3274j66372c8849
12687a2293j16470k3863e6586A7220J39614B4580b7683A53944K1301b51082A3394
12675A033J3822J34511J83748m676A8268N0268N9468b3359B09959A8508J68482
$$ y = [-137354, 169429, -85326, -132735, 206268, 86233, 86602, 124469, -38651, -60061, -168219, 114620, -374639, -190240, 90514, -204788, 92721, 535, 64353, -49745, 135390, 326760, 126019, -58188, 343963, 163128, 114403, 28409, 190611, -151506, 149894, 257793, 10316, -44201, 99005, 229931, -270, -293984, -104916, 23721, -180685, 25817, 15776, 244266, -144693, 178834, -75904, 312306, -55801, 149619, 46143, 141507, -117013, 50993, 304207, 330485, 229692, 253105, -10854, 86541, 9101, -1892, -136954, 160703, 194410, -21048, 133829, -69128, -142402, -308774, -38849, -12293, -128763, -152626, -56586, 17220, 156834, 24580, -27683, 153944, 175245, -251082, 13394, 1033, 14855, 149366, 333114, 328438, 18268, 68536, 128004, -23359, 209959, 18508, 186990]
12664A86990O1309A06449a3254B00079A8630L36211b271j26492I4213N6962o6750
12653H4425J47101p5563e374D112f9116A94464p7420e9139C00722C0832K65635
12642B96467a0217q2965D35176D1975G365c68692B47575g401I2268O1697O424
12631A60389a82560A44990O8571C0101K14439K08584F7997K9418J84860M8550
12621C30825r5564B8015J42893O9682k9063O9586L0541L9822g1811M583C41170
12609A91016E6570J88559q7087M81F0599J51399c60642a45118G5244a48095D17418
12597B84311Q049j40093K39375c36159D26396B5865a00016c7270A7852b09354
12586c43855a67796c9034B30656b92929A39075a63054M9944D0377h8886k75194
$$ y = [186990, 248299, 106449, -13254, 200079, 18630, 354841, -2271, -128763, 94213, 151175, 84425, 231526, 155963, -5374, 4112, -69116, 194464, 117044, -59139, 300722, 30832, 296467, -10217, -93182, 435176, 41975, 7365, -368692, 247575, -7401, 92268, 153965, 160389, -182560, 144990, 213561, 30101, 244540, 453124, 67997, 97415, 282275, 330825, 235261, 28015, 170908, 240590, 211527, 281113, 311654, 351476, -71811, -67228, 341170, 191016, 56570, 245129, 158042, 158523, 60599, 211998, -360642, -145118, 75244, -148095, 417418, 284311, 292360, 152267, 391642, -336159, 426396, 25865, -100016, -37270, 17852, -209354, -343855, -167796, -39034, 230656, -292929, 139075, -163054, -113110, 40377, -88886, -364080]
12576c64080D5590a26731o3182B41582b50731B46889k7090j04994a00053J9841
12566h0212E12076C615b8674j32582A85117a68199a100j22349B636b03036L1208
12555a71828k6905b6598B82373b41024A57912a23287A48464l3813A9179f621D17460
12543B07946F7696l2897b93598c1849o0786l47715b17086a00279B37286a23178
12532A54873A4640a34030l13657a54014F2244J25242a59310B61242b65853e1770
12521A63223f3337k36990J00540g653k88718C35963c6908n3122r1419k3520C63466
12509a18295k5327O8793q8646A54182F5041N36133B20500p9858c14441A15406
12498H3663O7217a21700B75638A35320a14701C9709J33973p9030P0254h1648K3237
$$ y = [-364080, 45590, -126731, -189913, 241582, -250731, 246889, 219799, 114805, -100053, -80212, 512076, 3615, -28674, -161256, 185117, -168199, -1100, -123449, 2636, -203036, -171828, -198733, -26598, 282373, -241024, 157912, -123287, 148464, 114651, 19179, -6621, 417460, 207946, 67696, 34799, -293598, -31849, -92635, -440350, -217086, -100279, 237286, -123178, 154873, 14640, -134030, -447687, -154014, 62244, 187486, -159310, 261242, -265853, -51770, 163223, -63337, -300327, -199787, -7653, -296371, 335963, -36908, -90030, -181449, -204969, 363466, -118295, -143622, -74829, -163475, 154182, 65041, 601174, 220500, 140642, -314441, 115406, 83663, 150880, -121700, 275638, 135320, -114701, 39709, 173682, 94652, 164906, -81648, -58411]
12487e8411A8473K8021K0186K11599b727j02014A46717b4520B18722e262A85186
12475B23817M29743A80314q936d250B65903c2300o096o8473d1724q3314H0041
12463A68561p734B2442J86776a02229j39434D445a095F3153c6445A87958b83589
12451A95619Q636L2880I5680m3087J3061b49361A58154c9292B16097A07048A2816
12439d698j19865c8230C74840b18070C8080c3825m72820a53081f4871I3610a17686
12427A40123K0351C3580b42819Q7659j40599D86105A51539B043J11035P298P0299
12416A90675d9656j85230c1422B51607a68088A08283O8505J1222a07685B9547
12405a82159c9431B01530B2966g6950B07652i4884j5632j99569i448H179M68061
$$ y = [-58411, 18473, 46494, 66680, 278279, -2727, -104741, 146717, -24520, 218722, -5262, 185186, 223817, 653560, 180314, 171378, -4250, 265903, -32300, -38396, -106869, -41724, -125038, 80041, 168561, 160827, 22442, 209218, -102229, -241663, 4445, -1095, 63153, -36445, 187958, -283589, 195619, 204255, 237135, 95680, 52593, 65654, -249361, 158154, -39292, 216097, 107048, 12816, -4698, -124563, -38230, 374840, -218070, 38080, -33825, -506645, -153081, -64871, 93610, -117686, 140123, 160474, 33580, -242819, -155160, -295759, 486105, 151539, 2043, 113078, 120376, 190675, -49656, -234886, -31422, 251607, -168088, 108283, 176788, 188010, -107685, 29547, -182159, -39431, 201530, 22966, -76950, 207652, -94884, -110516, -310085, -9448, 8179, 476240]
12394D76240b37203C84719A79846a03959m7720r077E8529L66346f7840B63052
12383B14894D9681e5959J2946k5080I5443B7282J93866p1119J12357N1433A53142
12371a22930j27561B03086E2240C260N9579a67156j18277A31402d1474A21423
12360b67621j57432A66135i5322L9653D06678a0940C35676A54861c9733A5966
12349H1467a48648R257A09126R150n1351J04974a18474A11854a30199A9451L20971
12338C40422k2148b66000A45848A8692J42946a2278j95598j39398D46756B17570
12327H1227h1769A66776J28222j06007a0546I9496P0695N0490h2926A13517B5787
12315A88962K0349J68772j86473H4668K6847c041E0132a03553F6300j9603d5590
$$ y = [476240, -237203, 384719, 179846, -103959, -151679, -160756, 58529, 424875, -67840, 263052, 214894, 49681, -55959, -43013, -68093, 95443, 27282, 221148, 150029, 262386, 313819, 153142, -122930, -250491, 203086, 52240, 3260, 62839, -167156, -285433, 131402, -41474, 121423, -267621, -425053, 166135, -95322, -55669, 406678, -10940, 335676, 154861, -39733, 15966, 81467, -148648, -139391, 109126, 118276, 66925, 171899, -118474, 111854, -130199, 19451, 340422, 318274, -266000, 145848, 18692, 161638, -12278, -207876, -347274, 446756, 217570, 81227, -81769, 166776, 294998, 188991, -10546, 99496, 170191, 220681, -82926, 113517, 25787, 188962, 209311, 378083, 191610, 84668, 111515, -3041, 50132, -103553, 66300, 46697, -45590]
12303C9801J33846J12708H8210j6995a65695D4701I767K04061l9183a47859C9622
12291I1812L26525A01290N9283P4124r0272A905L5151c9991B8339K4128a04458
12279A37060a35579A74190a12867B28155i7759B44550r2268l4830J33962A07018
12268A67810m3739O8324K92216j91245D4110a87207B20434b38898g9586D64308
12257E654K3555M20788p2092I7147D1875N0632a2399B43629J30654D8565M04224
12246D52789p8187l8182j37886c74207C57223k4536R5508F2862J96195I6565l9142
12235E7423L61942A79945o6953J25986d782B3808R9311a1242C2248A0048a7696
12223E9228k7028O5035K72151j4747K45975A69292Q2497J25962j16911j02276
$$ y = [39801, 173647, 286355, 88210, 71215, -165695, 44701, 9767, 213828, 174645, -147859, 39622, 91812, 418337, 101290, 160573, 234697, 144425, 1905, 37056, -39991, 28339, 52467, -104458, 137060, -135579, 174190, -112867, 228155, -97759, 244550, 152282, 117452, 251414, 107018, 167810, 124071, 192395, 484611, 293366, 44110, -187207, 220434, -238898, -79586, 464308, 5654, 29209, 449997, 377905, 97147, 41875, 92507, -12399, 243629, 374283, 48565, 452789, 374602, 336420, 198534, -374207, 357223, 332687, 428195, 62862, 259057, 96565, 57423, 419365, 179945, 112992, 238978, -4782, 23808, 123119, -11242, 32248, 10048, -17696, 59228, 32200, 97235, 369386, 354639, 600614, 169292, 251789, 377751, 260840, 158564]
12213A58564L39188A23299D1086L45094F9252k0297J50685a31235A44360N8711
12203B03071L66584A64843m5836K6302C8905L14907H2772M614J79193L0656j1437
12192B85798K24583J31060k47742J13089k07532j45215D1308m505L72650Q7251
12182D96704m4561B24429D6107J26823i7392A16464K2747L49099A21142K56158
12172C77300j66635b15233A29725L06189j05352j37353J37344L2800J08340L2303
12162E03996A9039J65453M6819J33004h3942B39082O3813C4985a37926A6477a29756
12150d162C1948d8011A00832N9872m9989e0705a352B60562E9987L70499j09355
12139C21131b6552j30162B36246O3450f412A8560b6173B67645H7139i7490f309
$$ y = [158564, 497752, 123299, 41086, 386180, 69252, 48955, 199640, -131235, 144360, 203071, 569655, 164843, 119007, 145309, 38905, 353812, 82772, 87386, 266579, 297235, 285798, 510381, 641441, 393699, 506788, 299256, 154041, 41308, 36803, 409453, 496704, 452143, 224429, 46107, 172930, -97392, 116464, 139211, 488310, 121142, 377300, 210665, -215233, 129725, 435914, 330562, 193209, 330553, 363353, 471693, 503996, 19039, 184492, 231311, 364315, -83942, 239082, 302895, 34985, -137926, 16477, -129756, -4162, 31948, -48011, 100832, 160704, 110715, -50705, -1352, 260562, 59987, 430486, 321131, -26552, -156714, 236246, 299696, -6412, 18560, -26173, 267645, 87139, -97490, -6309]
12127A20761i8288B06963e1791A73782L73622B54109k4395p450e980j43430r315
12116a58725D14229n0425K37794k63837j67482R5219E3556L8359l5403J09772
12106A66284g8554J9391F1786L8546J39562d3348B45597F5498a91317O6741A62684
12094G0137J1615K49373G8011L03716A32767O9524h38A55896N9700I3244K7884
12083A21128K26172I1953B8629L14469f7185j4269C33184A59996J12273M0646
12073C12915a54596A28439J91210i0239A43365L59085A61816O9595A04749j7723
12063H7026M97508A06339i9685I3532K01228g823A29952K54127j70851o9724G745
12051c51960A15364q758d3890I0862a95910E4181L2952l6595a77290A91272c79465
$$ y = [120761, -98288, 206963, -51791, 173782, 547404, 254109, 229714, 222264, -5980, -149410, -158725, 414229, 363804, 601598, 337761, 170279, 265498, 53556, 91915, 56512, 166284, -78554, -59163, 61786, 100332, 239894, -43348, 245597, 65498, -191317, -124576, 162684, 70137, 81752, 331125, 78011, 381727, 132767, 202291, -838, 155896, 215596, 93244, 121128, 347300, 91953, 28629, 343098, -67185, -81454, 333184, 159996, 272269, 312915, -154596, 128439, 319649, -90239, 143365, 502450, 161816, 231411, 104749, 87026, 584534, 106339, -99685, 93532, 294760, -7823, 129952, 384079, 213228, 143504, 7745, -351960, 115364, 106606, -43890, 90862, -195910, 54181, 87133, 50538, -177290, 191272, -379465]
12039a41830c2070A27913k6471b27723A30259L0444b01826B2377a52970B86026
12028a96335R2315B0527a2245H4189g5718A8970K447N6894b12990D0065K99480
12017C39545i0689r0621A81436e3875B06468C8969b8588A32721A9435J49475C0931
12005A91747a31496D36696c4792i502B53853h2596A62202F642K70887a9479D135
11993a24021j56282g9033B7872a38597A23568E4821c17765A01122g578C4439d47955
11981a65459g7697b3348j3423E6584a04563n2258K8082o8129i0754c5953k32352
11970b68305H550e11313A2402J67740D2644b55434J0712e7876j52387Q6713d4181
11958a88546b9081A3811h0530G1393K11675b39838e4364B68889r2574e3231a2338
$$ y = [-141830, -32070, 127913, 101442, -227723, 130259, 160703, -201826, 22377, -152970, 286026, -196335, -104020, 20527, -12245, 84189, -75718, 18970, 21417, 78311, -212990, 40065, 339545, -90689, -181310, 181436, -53875, 206468, 38969, -28588, 132721, 19435, 168910, 30931, 191747, -131496, 436696, -34792, -9502, 253853, -82596, 162202, 6642, 277529, -19479, 4135, -124021, -280303, -79033, 27872, -138597, 123568, 54821, -317765, 101122, -7578, 34439, -447955, -165459, -77697, -23348, -36771, 56584, -104563, -156821, -128739, -196868, -90754, -35953, -268305, 8550, -511313, 12402, 180142, 42644, -255434, -244722, -57876, -210263, -123550, -44181, -188546, -29081, 13811, -80530, 71393, 283068, -239838, -54364, 268889, 176315, -53231, -12338]
11946a25575j75135K0808K5991E2399a19707q0882i8314N983G5254d9326B17292
11934A66119K4507k2604a45808f5235r1412L945B54550a38190A74405a70456m2804
11923b13260I1458i6901G3616J17764R7791q9930c78086B35366J76012C1101R8895
11912A29996E6899d6339G6833a72451j44062C1218e5808m9773d0626D3735a13859
11900a95999l53861h6744J3583A18340J76286a38308A43374A1758a99504E1126
11889a22193B5366a48403j99010F5765A9630J91596b48143g1254o4935C38706
11878g6577O248J9046j03431N1852A1784a65747j51763a29675m2890B981a03328
11866b08413r5240b3783p8182m2715b495j96729A04972J05810d07243N093g8159
$$ y = [-125575, -300710, -279902, -253911, 52399, -119707, -200589, -98314, -92331, 75254, -49326, 217292, 166119, 190626, 168022, -145808, -65235, -156647, -152702, 254550, -138190, 174405, -170456, -213260, 91458, -96901, 73616, 191380, 289171, 199241, -378086, 235366, 411378, 31101, 129996, 56899, -46339, 76833, -172451, -316513, 31218, -55808, -105581, -40626, 43735, -113859, -195999, -549860, -86744, -73161, 118340, 294626, -138308, 143374, 11758, -199504, 51126, -122193, 25366, -148403, -347413, 65765, 19630, 211226, -248143, -71254, -136189, 338706, -76577, -70329, -51283, -154714, -102862, 11784, -165747, -317510, -129675, -172565, 2981, -103328, -208413, -303653, -23783, -101965, -144680, -2495, -199224, 104972, 210782, -407243, -402150, -78159]
11854b9932B07233a83187j96471I2022c7878o4270k7006q9695d0889b083k15882
11843b17965e7492b4010f080B7419d2211j69465c4746k93864A30628a17356G2426
11831b211A36204B4316g9761A10559K2613A3827N9183c30023J21271d0285l0625
11820g0910P484l195r3037N8666j35095a4772A78067a58124A2833L67862a55341
11808E4431K0269J34536b79077E349L78397j03335a62421c1067k32839D9721a43451
11796a42347f4159j1858A08111b66131d8558F9741g0796F207J46910J57928E4075
11784c54572C2817c9973k0622b3881A99050C941K40497a59845B13594i1672A87446
11772E10008d5679J5862A09281b53365C5179R3510b58666B68533C1371e7031J0592
$$ y = [-29932, 207233, -183187, -379658, 92022, -37878, -102148, -129154, -218849, -40889, -2083, -217965, -57492, -24010, -6080, 27419, -42211, -211676, -34746, -328610, 130628, -117356, 72426, -2211, 136204, 24316, -79761, 110559, 133172, 13827, 73010, -330023, -208752, -40285, -70910, -63426, -66621, -159658, -100992, -236087, -14772, 178067, -158124, 12833, 380695, -155341, 54431, 74700, 209236, -279077, 5349, 383746, 280411, -162421, -31067, -263906, 49721, -143451, -142347, -64159, -76017, 108111, -266131, -48558, 69741, -70796, 6207, 153117, 311045, 54075, -354572, 32817, -39973, -60595, -23881, 199050, 3941, 244438, -159845, 213594, -91672, 187446, 510008, -45679, -29817, 109281, -253365, 35179, 128689, -258666, 268533, 31371, -57031, -46439]
11761d6439A81853c02984A72361R4595Q9266G2390N2603a60993H0451B311a3068
11749c043n3897B9783d7250k44902J29383a8800A75556B3047b30876o5319B1898
11737i0895B0865b10178j23818B26211c62891g7176n4058A6464J07300L8759A9334
11725e400A2108b90630h7564A49936a65180E9445d1720j58024R3390j14404L684
11714b17074g4616K4994m2365B4140Q1049L6733d5152p4969n3293A0577f0838
11702B45194p9110a84613G8536a0868j99088C14247A23630Q4789n6475N485a40182
11690A8660J32253A4248J6144a71538F3884Q1504C2758d0551j27492m4602D4484
11678d14881B4323f043B81517K12107e3378A42760J00658a4543j7401n5339l29592
$$ y = [-46439, 181853, -302984, 172361, 266956, 356222, 72390, 124993, -160993, 80451, 2311, -13068, -3043, -56940, 29783, -47250, -292152, -162769, -18800, 175556, 23047, -230876, -296195, 21898, -90895, 20865, -210178, -333996, 226211, -362891, -77176, -131234, 16464, 123764, 162523, 19334, -5400, 12108, -290630, -87564, 149936, -165180, 59445, -41720, -199744, -106354, -220758, -217074, -74616, -49622, -91987, 24140, 105189, 141922, -45152, -120121, -173414, 10577, -60838, 245194, 166084, -184613, 78536, -10868, -209956, 314247, 123630, 208419, 151944, 157429, -140182, 18660, 150913, 14248, 30392, -171538, 63884, 145388, 32758, -40551, -168043, -212645, 44484, -414881, 24323, -6043, 281517, 493624, -53378, 142760, 243418, -14543, -31944, -87283, -416875]
11667d16875J61417K0718f8933a2319n9166j35883c2819j67369A11480e5119A59366
11655i6634B25623P4885A3576b16048c0568q1223n2998E8873J91149a26438B29363
11643B81235A1217M9288h4453m4965A61770C694c14493A31695D1744c01967a45911
11631a20961A57951G3691a17866A95682m5653H570a56232A48688o96E4124o072
11620D8052a39398O7628A11429B3786K3163P0317h330H1900J45313b17588Q1279
11609a36309B03555O8383F2012a9561B70639A14092J61634h0334m9243N0414A7152
11597B8897e680F23727a84236A81400J8396d7914B19301M5822a72483C38466a49898
11585c2788F7212l0629K32264a66071A56840a5872j23455r7129h4356L4849C459
$$ y = [-416875, -255458, -234740, -68933, -12319, -71485, -207368, -32819, -200188, 111480, -55119, 159366, -96634, 225623, 300508, 13576, -216048, -30568, -111791, -164789, 58873, 250022, -126438, 229363, 281235, 11217, 60505, -84453, -129418, 161770, 3694, -314493, 131695, 41744, -301967, -145911, -120961, 157951, 73691, -117866, 195682, 150029, 8570, -156232, 148688, 147992, 54124, 48052, -139398, -71770, 111429, 23786, 46949, 117266, -8330, 81900, 227213, -217588, -136309, 203555, 271938, 62012, -19561, 270639, 114092, 275726, -80334, -129577, -79163, 17152, 28897, -5680, 623727, -184236, 181400, 199796, -47914, 219301, 265123, -172483, 338466, -149898, -32788, 67212, 36583, 268847, -166071, 156840, -15872, -139327, -236456, -84356, -49507, 3459]
11573a88805q7341A6038M4104B5493C029e4102A51874K17996p2118Q7869E119
11561A00904f3292k07070A69051a0368k12001d2734A63646D0431K60346g2154
11550c28681a7212A47088b24870k9976H7874K04258i9568B290b24785a5200k11521
11539b26721Q6167A44922B7112M4122N8439L8417A1310L48610g8685A24944L991
11528A28935J7987a4606r7769B64825d4744C47211b52213a16024k02058f6355
11517C65844E6137a93422k07546a85178N9866A61834E8563L4580A5313K36118
11507B51431c409m0732A76469k3681O241L00497G6138L17611j58087L50906I9743
11495a22207A12191K28249J213j35245B843f8187A60129j8971m598a0615C6018
$$ y = [-188805, -276146, 16038, 60142, 25493, 3029, -54102, 151874, 369870, 297752, 385621, 5119, 100904, -63292, -270362, 169051, -10368, -222369, -42734, 163646, 40431, 300777, -72154, -328681, -17212, 147088, -224870, -254846, 87874, 292132, -99568, 2290, -224785, -15200, -226721, -140554, 144922, 27112, 71234, 129673, 168090, 11310, 359920, -78685, 124944, 128935, 146922, -14606, -112375, 264825, -44744, 347211, -252213, -116024, -318082, -66355, 365844, 56137, -193422, -400968, -185178, -125312, 161834, 58563, 93143, 15313, 251431, -3409, -44141, 176469, 152788, 159029, 459526, 76138, 393749, 235662, 586568, 99743, -122207, 112191, 340440, 341653, 206408, 2843, -68187, 160129, 141158, 136560, -10615, 36018]
11483I5700J52410K16550j97339m109a3767l42213B0120g9886C37813b9554A82270
11471C13137M1952C8790M88531D1431J60992J37262j14291P9598a51309B05743
11460i8296C36316E3734N1092B107K41698n8602f4082N939B33576L1159A05743
11448B28432D4569J92410j09877J23441a5301B19346D538M4756K27660A2074a2184
11436f1750A94259Q079o7647j1279R0340E8550a25147I0778P1329b13315I1812
11424b51621c7897k12403h7060j47572N894C4996J66534k0669a62153d8386j36809
11413a85195n035C9863N0057a54348n2515j06855C41836a19723A78543c25703
11402a23782n3026a5721B72855D3135P7676a82487j01957A48598n5119m5126J42544
$$ y = [95700, 248110, 464660, 267321, 263212, -13767, -355980, 20120, -79886, 337813, -29554, 182270, 313137, 355089, 38790, 527321, 41431, 202423, 339685, 225394, 304992, -151309, 205743, -98296, 336316, 53734, 104826, 2107, 243805, 185203, -64082, -58143, 233576, 264735, 105743, 228432, 44569, 236979, 127102, 250543, -15301, 219346, 4538, 49294, 276954, 12074, -12184, -61750, 194259, 202338, 134691, 123412, 213752, 58550, -125147, 90778, 162107, -213315, 91812, -251621, -37897, -250300, -87060, -234632, -228738, 34996, 201530, 180861, -162153, -48386, -185195, -190230, 39863, 89920, -154348, -206863, -313718, 341836, -119723, 178543, -325703, -123782, -176808, -15721, 272855, 43135, 120811, -182487, -284444, 148598, 93479, 48353, 190897]
11391A90897J70736A03486K29523b31588B40336f1550A8763N1809b75892g9681
11380b75906B3271d5198k27682C09465e8756B07899a56611a6628G3663B4617Q496
11369C3113c98351G6959a3785B14807p8268a9747n08338I2470A5489d08694D2140
11357b53462a3284C52956O0669c04805m1130L2954J27527A3573P136a9398B60967
11345f4484F594J0653a26825k94D90252A60292j7133c00389B41322p3603H2110
11333f8444A32022m8957L5931c3264l4676m6936C8849J41570a6246k75750b0343
11321A23449A5577O8073e1143H8649f5809k8410o0457P4823B69759a14765N2579
11310f2186j33587g6301k11752H08c38774A26081d7652a7178j29146B0416a10559
$$ y = [190897, 361633, 103486, 333009, -231588, 240336, -61550, 18763, 70572, -275892, -79681, -275906, 23271, -45198, -272880, 309465, -58756, 207899, -156611, -16628, 73663, 24617, 33113, -398351, 76959, -13785, 214807, 136539, -19747, -528085, 92470, 15489, -408694, 42140, -253462, -13284, 352956, 413625, -304805, -345935, -312981, -185454, 13573, 20709, -19398, 260967, -64484, 6594, 17247, -126825, -127119, 490252, 160292, 143159, -300389, 241322, 167719, 82110, -68444, 132022, 83065, 118996, -33264, -67940, -114876, 38849, 180419, -16246, -291996, -20343, 123449, 15577, 83650, -51143, 88649, -65809, -94219, -154676, -79853, 269759, -114765, -62186, -195773, -76301, -288053, 808, -338774, 126081, -47652, -17178, -146324, 20416, -110559]
11298b019m6209A33449a20532H1811B3291h8368G8041g6139k75686h1991k98641
11287c80632I4332D6119a1936j36220A03583L42037A88605N7858F9260b03416
11276b75288c8409A83423d7900j23239M2265A73120d97250B22625c60709A43931
11265D915K5430J33231a61497F2816a4054j55509b5476j98530a08413d2819j37197
11254a80016A10736M5228i0388C18398a40286j39433D4848b77281B0476b14119
11243A32329P7105K6058A08044a44050e8231j39908b6834j36753A04402d5757
11232a53113B01258b82104a30184J2323n3730I4129b91913a36740j98597l6972
11222c72309F7925f505A24340a57288j05546E5084I23b56914N9291F149P3731
$$ y = [-2019, -48228, 133449, -120532, 81811, 23291, -88368, 78041, -76139, -351825, -81991, -380632, 94332, 46119, -11936, -148156, 103583, 445620, 188605, 246463, 69260, -203416, -275288, -38409, 183423, -47900, -171139, -128874, 173120, -497250, 222625, -360709, 143931, 4915, 30345, 163576, -161497, 62816, -14054, -169563, -25476, -224006, -108413, -42819, -180016, 110736, 155964, -90388, 318398, -140286, -279719, 44848, -277281, 20476, -214119, 132329, 209434, 235492, 108044, -144050, -58231, -198139, -26834, -163587, 104402, -45757, -153113, 201258, -282104, -130184, -117861, -171591, 94129, -291913, -136740, -335337, -372309, 67925, -6505, 124340, -157288, -262834, 55084, 923, -256914, -197623, 6149, 79880]
11211G9880a56619f15l1361m4769m5468A54653c09074J5061N2327C0510j507K39047
11199B68050g877r3142A8943a14926a5703A89592C8980J51556P842d45167H4339
11187A46292a12655b7753A4925a04154k3003k61947a24245p1159K0706l7791B3537
11175b6446q1389F5392c33637g4057D6954b6356E9194a21597G8316a43870r4529
11164b38399e8169l24900a31498A78769a64311P4249C1806b46947J11096M5849
11154i0002A02814C4548L2455K86962i4087E5736O5374L6890l3571i812j91610
11143b01422A91514b62353A67232h7555l480G6044h9506M737e242C10721c7180
11131i2006D35605A98023D4527Q5544k6928R6797c84273B78875I8783j5451C9300
$$ y = [79880, -156619, -615, -31976, -76745, -122213, 154653, -309074, -294013, -241686, 30510, 29003, 268050, -7877, -101019, 18943, -114926, -15703, 189592, 38980, 190536, 198378, -445167, 84339, 146292, -112655, -27753, 14925, -104154, -127157, -389104, -124245, -195404, -174698, -212489, 23537, -26446, -107835, 65392, -333637, -74057, 46954, -26356, 59194, -121597, 78316, -143870, -238399, -58169, -383069, -131498, 178769, -164311, -90062, 31806, -246947, -135851, -90002, 102814, 34548, 67003, 353965, -94087, 55736, 121110, 158000, 124429, -9812, -201422, 191514, -262353, 167232, -87555, -91035, 76044, -89506, -84769, -5242, 310721, -37180, -92006, 435605, 198023, 44527, 130071, 103143, 199940, -384273, 278875, 98783, 83332, 39300]
11119A6615K92898A4329O0804J41112r7869b9473k07665a3758B24490F1261J41862
11108B03123I2498J03365o7446J30465A4653o121K53375r4543C1568K16669G2991
11096B12390p5804J58453r0087l3808k170M2526J12086j44851j5765I676M13664
11085D23340E1186a58578C13565d2248j915B11172R1426E7832P4573K82419A49085
11073C01843J23766j40025L22782B97715J52877J64216j32458L03812C59000K76076
11063F35076j91565j8742P7702o0264j93874K34185R5467j43667K67045J19930
11053H21293j55464k65385L48055K18518J12846n0600k1865q6659J1130j41966
11043G89903J49000L56450k97042J83485j84969N59490n76925k82193K68537K51346
$$ y = [16615, 309513, 14329, 75133, 216245, 118376, -29473, -237138, -13758, 224490, 61261, 203123, 92498, 195863, 128417, 258882, 14653, 8532, 261907, 167364, 31568, 248237, 72991, 212390, 136586, 295039, 204952, 171144, 168974, 211500, 323586, 178735, 162970, 9676, 423340, 51186, -158578, 313565, -42248, -44163, 211172, 302598, 57832, 132405, 414824, 149085, 301843, 425609, 285584, 608366, 297715, 450592, 614808, 482350, 786162, 359000, 635076, 443511, 424769, 502471, 442207, 248333, 482518, 577985, 434318, 701363, 821293, 665829, 400444, 748499, 967017, 1079863, 1029263, 1007398, 920739, 931869, 789903, 938903, 1295353, 998311, 1181796, 996827, 1556317, 979392, 697199, 965736, 1217082]
11033A217082k99696j69797L50064m09520K05294L68990n79716L66936o8837l3173
11023I47627o9290j25821M03802j38790K42723n49668O5496L8825J01539C41685
11012H29562k41479R3122J68893P2583j87497l47256J82614J03327J1835P561
11002F93265K70793D80660L71104J9605R0632l52523O8890J54851k05213l90L85235
10991A012851l10073J77561K11921j33563j68272n502q4033L33461k5273L4295
10981A043373J91994l73689L02323L7836K8465M25067l1523K11336j0328L77747
10971B202601K44550L04744J10595O21545J30318Q077k7484k8717m45946K2698
10961C142981k39471l86953q94092N5586M79112k01434n09807K99744J13960k70835
$$ y = [1217082, 917386, 747589, 1097653, 688133, 893427, 1262417, 682701, 1049637, 980800, 947627, 878337, 752516, 1156318, 1017528, 1260251, 710583, 776079, 814904, 916443, 341685, 829562, 588083, 681205, 850098, 922681, 735184, 387928, 570542, 673869, 685704, 693265, 964058, 480660, 851764, 871369, 962001, 609478, 678368, 833219, 628006, 627616, 1012851, 702778, 880339, 1092260, 958697, 790425, 784923, 700890, 1034351, 1009078, 1043373, 1235367, 861678, 1164001, 1201837, 1230302, 1655369, 1623846, 1835182, 1824854, 2202601, 2447151, 2751895, 2862490, 3484035, 3614353, 3622430, 3594946, 3566229, 3120283, 3142981, 2903510, 2516557, 1622465, 1678051, 2157163, 1955729, 1445922, 1745666, 1859626, 1588791]
10951A588791j43336j28733K03647l41817k78364K96868m38267C44153o5561K3156
10941C01748q5314K07272A64143N1739K02678j18220L82096e1752B03649o7112
10931A36537L26166E0328K95013b77384B57837H3275J67933J03744B8084K21916
10921B50000a12914C8396J03671b6914A4117c97301C83219A23585b61252B2058
10910A71767d10745A02788J19834C1543J62916d8008p3960B6339N2807b26005
10899A78182f3508A35449b01922e7032C0387h5371B1653b45484m385j16025i210
10887a92839r8443a00715A90996g8574D972J09513m6522g6899A2550i4011j91241
10876b85252R1508g9627G1609h6477a9062o660E5346b89392A53072f4875l12206
$$ y = [1588791, 1445455, 1316722, 1520369, 1178552, 900188, 1197056, 758789, 344153, 278592, 301748, 216434, 423706, 164143, 215882, 418560, 300340, 682436, -51752, 203649, 136537, 462703, 50328, 345341, -277384, 257837, 83275, 251208, 354952, 28084, 250000, -112914, 38396, 142067, -26914, 14117, -397301, 383219, 123585, -261252, 22058, 171767, -410745, 102788, 222622, 31543, 194459, -48008, -121968, 26339, 79146, -226005, 178182, -63508, 135449, -201922, -57032, 30387, -85371, 21653, -245484, -249869, -365894, -9210, -192839, -291282, -100715, 190996, -78574, 4972, 114485, 67963, -76899, 12550, -94011, -285252, -193744, -79627, 71609, -86477, -19062, -25722, 55346, -289392, 153072, -64875, -377081]
10865c77081A39859D1367j4984J61723g7673l0057A03764D7892M3022R1901D0990
10853C7330K80351E7130a6672A51738b20185J05416K3927E497O2751c99901B13546
10841B16077F4308a7589l293k81907B36764D1085f5704A44217a30350F408O9779
10830G6187J09019d18447A95919a40276B890a51752c1797k51058D12716b06319
10819d5138q6652d071G2692a20079j28555A98600b05625m797d7714C39374b47169
10807d03238A16584d12362a4192k35664a13168k3197A65876K2876c31638A32620
10796a28421E424N7554N302a16913k5731A45437D9594a17237F8363B8046J26584
10785A54630k2301E6589h1316A0055a37433j33111r5545I1891B237L35733a56632
$$ y = [-377081, 139859, 41367, 26383, 188106, -77673, -107730, 103764, 47892, 90914, 182815, 40990, 37330, 317681, 57130, -16672, 151738, -220185, -114769, -90842, 5497, 68248, -399901, 213546, 216077, 64308, -17589, -20882, -302789, 236764, 41085, -65704, 144217, -130350, 6408, 76187, 185206, -418447, 195919, -140276, 2890, -151752, -31797, -282855, 412716, -206319, -45138, -131790, -4071, 72692, -120079, -248634, 198600, -205625, -210422, -47714, 339374, -247169, -403238, 116584, -412362, -14192, -249856, -113168, -136365, 165876, 188752, -331638, 132620, -128421, 5424, 62978, 68280, -116913, -142644, 145437, 49594, -117237, 68363, 28046, 154630, 132329, 56589, -81316, 10055, -137433, -270544, -366089, 91891, 2237, 337970, -156632]
10773A45548n8585b83340a17436B22889b92073i7295B25621g4399A88371h1587
10762C6873a10427j02022A18789D5232b38519A15295m6755J7712M6212b45479
10751f4707l34399J36180h2812b6463n2050j76510e2944A8140f8073a9661j5346
10740c5007r7666O0281l02760J75891h7679C43656a25581D7216a4274j50427b7841
10728b53392a2702k89471P1268A50303Q030d7046C07484b19523A38712O3238j5117
10717A86833b26906i4558A10187B2998d8041q290j9121j46557K65A32953d0424
10705b5863B6565e9792j30324B79361A05815f8011k86421i49o9420O869l57719
10694d21219e9261b3588k31653P509g3174k94851A46572h9986k31631J19607k34542
$$ y = [145548, 86963, -283340, -117436, 222889, -292073, -97295, 225621, -74399, 188371, -81587, 36873, -110427, -212449, 118789, 45232, -238519, 115295, 68540, 86252, 132464, -245479, -64707, -399106, -262926, -82812, -26463, -78513, -255023, -52944, 18140, -68073, -19661, -35007, -132673, -72392, -375152, -199261, -87679, 343656, -125581, 47216, -14274, -164701, -27841, -253392, -12702, -302173, -230905, 150303, 158333, -47046, 307484, -219523, 138712, 201950, 186833, -226906, -94558, 110187, 22998, -48041, -56331, -75452, -222009, -221744, 132953, -40424, -25863, 26565, -59792, -190116, 279361, 105815, -68011, -354432, -949, -70369, -63500, -421219, -59261, -23588, -255241, -247732, -73174, -368025, 146572, -89986, -321617, -202010, -436552]
10683d36552a60859g7004j03435A66895G2090j2773a11847c3033f96j77740F8181
10671B34362f1928A42381d80132g5402k91834e1569n821F5702J59175B8994a86681
10659h8727L635A41823c26535B33039A07230r812b59907A4366f8188k54069a54617
10647a90898q9146E8285g2203j0146F1149J53923A01540g0112j18001q9389J28710
10636a48792M5995A29446i6003P034j51384j06757J0670B7046a49633O9361k1055
10625a01327l46818A27291i845a465J63m4510J9795M969A2741a80099m76344a05954
10612i7269B36192a1697q7978j05733E9805f3074j19513a8035j40519j89449B16291
10600b14722E0783b3805F0179b8879E5189o920b20834o6582A58385f5126H0448
$$ y = [-436552, -160859, -77004, -180439, 166895, 72090, 59317, -111847, -33033, -696, -178436, 68181, 234362, -61928, 142381, -480132, -75402, -367236, -51569, -57390, 65702, 224877, 28994, -186681, -88727, -85092, 141823, -326535, 233039, 107230, 97418, -259907, 14366, -68188, -322257, -154617, -190898, -280044, 58285, -72203, -82349, 61149, 215072, 101540, -70112, -188113, -277502, -148792, -102797, 129446, -96003, -88969, -240353, -347110, -336440, 27046, -149633, -80272, -101327, -448145, 127291, -9845, -1465, -1302, -45812, -26017, -21048, 12741, -180099, -656443, -105954, -97269, 236192, -11697, -99675, -205408, 59805, -63074, -182587, -18035, -158554, -348003, 216291, -214722, 50783, -23805, 60179, -28879, 55189, 48269, -220834, -287416, 158385, -65126, 80448]
10588g222m6193C7982g9013j38415M3244c7618o896H6690b69655M9637C5730a5435
10575i441k78958J9506A10124A3984b19032A88862H3570a32088D4366b26378e151
10563b45658r3815a46638B27546O7483c02490f6451N750A19916D7074N9688e7392
10551E4313b91253C19291j42441J05100E5813J939K0652c74529a48832d17j42881
10540a43298H3223a57164n7560j26031M7671a43530o937I3932G446M9340a99949
10528a0267l00218A45972K01690G6293a2627r7447M2605n5345j64086b1174O36
10517b0538j88314A60842p6108b2200A93452b7502r8153l027j2843o0543n1429
10506b53497A65401J20880E239J25364a19011N21I8571K85599c00791J48874k32926
$$ y = [-7222, -53415, 37982, -79013, -217428, -174184, -37618, -44514, 86690, -269655, -220018, 35730, -15435, -9441, -288399, -268893, 110124, 13984, -219032, 188862, 83570, -132088, 44366, -226378, -5151, -245658, -339473, -146638, 227546, 295029, -302490, -66451, -60701, 119916, 47074, 106762, -57392, 54313, -291253, 319291, 176850, 281950, 55813, 57752, 78404, -374529, -148832, -417, -143298, 83223, -157164, -214724, -340755, -293084, -143530, -150467, 93932, 7446, 56786, -199949, -10267, -310485, 145972, 347662, 76293, -12627, -110074, -67469, -122814, -286900, -21174, -20538, -208852, 160842, 84734, -22200, 193452, -27502, -125655, -128682, -141525, -202068, -253497, 165401, 286281, 5239, 130603, -119011, -118490, 98571, 384170, -300791, -151917, -384843]
10495c84843B46247a72707P9738c1098E8291d5479n2918F1491b3692p8N212A74369
10482a4465l3419J5253H7640J20600a81643F8534J39855e831D88641B22460J3963
10471B36423o3956N16211A30367J73883b13589K9046B43210j5228A2855J28031
10461A40886b49606a00581C3766a67387G1939B6770a95241k11075d1124e169B17727
10449e3409A8755O578a40113B6707a51276j67985f9041A89515j3818d33571a74841
10437d5053A79966D9924J44464d80654a55538P0095H6044f0453B72807e0632G746
10425a82431P6608B017a56158F3144a07553C5550a20567j5871e2895D1136c85614
10413c4705I4705J45029b716j07261j77044J31186e1368D2469c57917A04639a76613
$$ y = [-384843, 246247, -172707, -92969, -31098, 58291, -45479, -98397, 61491, -23692, -23770, -18558, 174369, -14465, -47884, -32631, 87640, 208240, -181643, 68534, 208389, -5831, 488641, 222460, 236423, 172467, 688678, 130367, 304250, -213589, -184543, 243210, 227982, 12855, 140886, -249606, -100581, 33766, -167387, 71939, 26770, -195241, -406316, -41124, -5169, 217727, -53409, 18755, 25333, -140113, 26707, -151276, -319261, -69041, 189515, 175697, -433571, -174841, -45053, 179966, 49924, 194388, -480654, -155538, -85443, 86044, -60453, 272807, -50632, 7746, -182431, -105823, 2017, -156158, 63144, -107553, 35550, -120567, -136438, -52895, 41136, -385614, -34705, 94705, 239734, -2716, -109977, -287021, -155835, -51368, 42469, -357917, 104639, -176613]
10401d5644j88762j53292a47232A48729c73174i3408B80250a3891r375A76323
10390b1271A61639E5407K68081j2357J2403b38398A65516K53290A77177F2799
10379B98387j331a49801H7546M2728L35470k30470q8883J52687Q5677l507K94693
10368F75941A0380a56836C27349n7538L97649k81160J23686J6091L38351C63795
10357A80137N7164L2234J99634A65302J25320K18586H3524M94508j82053N37351
10347I33330l97554L8933B74482o7585J12516p7806j224K48927E6962k760Q464
10336F2666M06859j99316i6053B32916J27488j65171m2715m5892O9207k3291a25029
10324b38530A69611E3259J20091m0715Q0579K73832A14185J13378B2520K0900
$$ y = [-45644, -234406, -387698, -147232, 148729, -373174, -93408, 280250, -13891, -23266, 176323, -21271, 161639, 55407, 323488, 311131, 323534, -238398, 165516, 418806, 177177, 62799, 298387, 297056, -149801, 87546, 130274, 465744, 235274, 146391, 299078, 384755, 381248, 675941, 10380, -156836, 327349, 269811, 667460, 386300, 509986, 526077, 864428, 363795, 180137, 237301, 269535, 469169, 165302, 290622, 509208, 83524, 578032, 395979, 933330, 535776, 574709, 274482, 206897, 319413, 241607, 240383, 489310, 56962, 54202, 62666, 469525, 270209, -96053, 232916, 360404, 195233, 152518, 106626, 175833, 152542, -125029, -238530, 169611, 53259, 173350, 132635, 213214, 487046, 114185, 227563, 22520, 43420]
10314D3420b60444C23740E2801b68962B69696Q3812O4137e0957j9237r8372B67269
10302D6504L98902a49633J4146l80435A56653e5097H3059a86509j39912I7477
10291I2070O4964P1628f6600b860l5864C5147a05882A73193L8726N4157a84348
10279A54018F5775J250a15467j02150j25554c747A73248E6610b4806D4220c9370
10267d5681j76222Q1670j1376B5681i1627B37215c66687B4803c2811k99709J11832
10256b20688A6428K8681d7955D87055j09554r0977J58015A68443D4403O3760J58689
10245B66852a20632A37082a14730Q760A61934j9878c54967f2229m35397a29705
10234b68193B35021c90885B01183C0220N5227a60919P8024B14572F9966a34972
$$ y = [43420, -260444, 323740, 52801, -268962, 269696, 353508, 417645, -50957, -70194, -168566, 267269, 46504, 445406, -149633, -135487, -515922, 156653, -55097, 83059, -186509, -326421, 97477, 92070, 157034, 228662, -66600, -2860, -38724, 35147, -105882, 173193, 211919, 266076, -184348, 154018, 65775, 67025, -115467, -217617, -343171, -3747, 173248, 56610, -24806, 44220, -39370, -45681, -221903, -140233, -151609, 25681, -91627, 237215, -366687, 24803, -32811, -332520, -220688, 16428, 45109, -47955, 487055, 377501, 286524, 444539, 168443, 44403, 108163, 266852, -120632, 137082, -114730, -105970, 161934, 142056, -354967, -62229, -497626, -129705, -268193, 235021, -390885, 201183, 30220, 85447, -160919, -82895, 214572, 69966, -134972]
10223g9305B697a06537B66871F0382a19097A45892C5093d5062F1148J99837h6343
10211a53774j8210k11604b1048p4664A52929K4222b28895N1665q3573N5757G9169
10199c5070H4476f8956j12330m1135E2460a28157b10r2502D9162a92950B12877
10187a5348A3240b2102j3667E6527e5338A6724f8106k5998G8686J46174b04145
10175E365b22967C5840d5307k51255J42912b6696k75200a7533k3145j65053C69620
10163b42316k04797J18681J22173j977n2865A48370D9400D265a53805n6790q6911
10152b97506C3068a91883A00675a64478O6174L5842C66749A25261b11503A80959
10141f2294k36390O8407M8785k0002A9006a08798F2082c7360H5516K2556A2018
$$ y = [-79305, 2697, -106537, 266871, 60382, -119097, 145892, 35093, -45062, 61148, 260985, -86343, -153774, -171984, -383588, -21048, -95712, 152929, 177151, -228895, -177230, -260803, -205046, 79169, -35070, 84476, -68956, -181286, -222421, 52460, -128157, -210, -92712, 49162, -192950, 212877, -15348, 13240, -22102, -35769, 56527, -55338, 16724, -68106, -94104, 78686, 224860, -204145, 5365, -222967, 35840, -45307, -296562, -153650, -26696, -301896, -17533, -40678, -205731, 369620, -242316, -447113, -328432, -206259, -208236, -261101, 148370, 49400, 4265, -153805, -210595, -297506, 33068, -191883, 100675, -164478, -98304, -62462, 366749, 125261, -211503, 180959, -62294, -298684, -230277, -181492, -201494, 19006, -108798, 62082, -37360, 85516, 108072, 12018]
10129a41130M109c045I4830h6985A21049A7446b5751q8685j58425r3665h2231
10117c0574F2922a01814j9831A63287b556F9338a55687j59633f4927K0668B09988
10105c28086g5601K7345B16381j01606J03976L561B7817a08106b4719A11215d54537
10093A35683B8870K43001i0699k6568L3708l00878B77665c68396J49456J00039
10083a18901B4375b35142m7421A29112R091l9980f10627c7543a0014j77909L2307
10072a55616R347B00308a95657A7161e3373A51181a65726j96828g7032I0355l8497
10061E1858a49638C34757b96485J41701j00383j37824B42424a76123j39155a5170
10050d04601B4265d0133A78667a87190k9985d4228p2119l4608I401a3828G5321
$$ y = [-141130, -137021, -3045, 94830, -86985, 121049, 17446, -25751, -114436, -272861, -366526, -82231, -30574, 62922, -101814, -121645, 163287, -2556, 69338, -155687, -315320, -64927, -44259, 209988, -328086, -75601, -48256, 216381, 114775, 218751, 222312, 27817, -108106, -24719, 111215, -454537, 135683, 28870, 271871, -90699, -117267, -83559, -384437, 277665, -368396, -218940, -118901, 24375, -235142, -282563, 129112, 138203, 98223, -610627, -37543, -10014, -187923, -155616, -146269, 200308, -195657, 17161, -53373, 151181, -165726, -362554, -77032, 90355, 51858, -149638, 334757, -296485, -154784, -255167, -392991, 242424, -176123, -315278, -15170, -404601, 24265, -40133, 178667, -187190, -217175, -44228, -116347, -150955, 9401, -13828, 75321]
10038a63245I7282e6113k4518p6164F1962a61463q8355j68604a71435b4294a0106
10026a32183m3543B7536c04367p4502a32242c9725C0569h5855r7133I2571a12049
10014C02639c83940B04893d26385g2791j51452R4752f0497j91646I7441d56659
10003h283l00154F705J29917o1546f7338j47450b4766F5214d4813k71688b9074
9991A4463R0343B8491P4990f1373j09906A47358a21558j63372i8480c1853l92487
9980d24340h4988A81889b89168B62299a69560I8005J7930e1268j19174A65145
9969i8798F2413a4378j06119N3008C8052b17915m6570D9459A1712a79719k1249
9958b00968A45025a9120P131j9940k54225A78997p6413A7083K17699A0662J36747
$$ y = [-163245, 97282, -56113, -80631, -156795, 61962, -161463, -249818, -418422, -171435, -24294, -10106, -132183, -175726, 27536, -304367, -378869, -132242, -39725, 30569, -85855, -182988, 92571, -112049, 302639, -383940, 204893, -426385, -72791, -224243, -129491, -60497, -252143, 97441, -456659, -8283, -308437, 6705, 136622, 75076, -67338, -214788, -24766, 65214, -44813, -316501, -29074, 14463, 104806, 28491, 103481, -61373, -171279, 147358, -121558, -284930, -98480, -31853, -424340, -84988, 181889, -289168, 262299, -169560, 98005, 115935, -51268, -170442, 165145, -98798, 62413, -14378, -120497, -67489, 38052, -217915, -264485, 49459, 11712, -179719, -200968, 145025, -19120, -11989, -31929, -286154, 178997, 102584, 17083, 234782, 10662, 147409]
9947A47409I873h9420n6612M908j84620Q1121k91194B95963c0252A88524G9884
9935F6206j671b2531A53214o6676K3530c00530R2817B0992b08334J6073j0739
9924b03000L89F3570J48739e41017B6302c04554A86410I3191b44838k06512A23439
9912a61436A05778f9880A48941a28086C7236b5734j65557c401F8053a8408j94241
9901b12649B14734c41793A21005C1176d921H586b12636A36687k4855a14980l4081
9890a49061j3409l3541A80581R695b65771f0262j86187c7358j52884E642a3276
9878e7655r0267r5448B45541H9686b3123D24148b3473B62241b46866b0712j1806
9867c2518j59402a2513j54671H8790K5168c26206a00262B85L34545a79056e7036
$$ y = [147409, 9873, -89420, -146032, -141124, -325744, -244623, -535817, 295963, -30252, 188524, 79884, 66206, 64535, -22531, 153214, 86538, 110068, -300530, -207713, 20992, -208334, -192261, -203000, -202611, 63570, 212309, -541017, 26302, -304554, 186410, 93191, -244838, -451350, 123439, -161436, 105778, -69880, 148941, -128086, 37236, -25734, -191291, -3401, 68053, -18408, -212649, 214734, -341793, 121005, 31176, -4921, 8586, -212636, 136687, 111832, -114980, -149061, -162470, -196011, 180581, 190276, -265771, -60262, -246449, -37358, -190242, 5642, -13276, -57655, -147922, -243370, 245541, 89686, -23123, 424148, -23473, 262241, -246866, -20712, -32518, -191920, -12513, -167184, 88790, 113958, -326206, -100262, 285, 334830, -179056, -57036]
9855a60213L1077k25275a55374A50970a33132n3181b6519E5321c7865j87147p484
9844b32496l86596B71957c06969B86906f402j8057j15881A60992c13693a36027
9833A83081D0136Q3021c36615a43540C054e0950A22915e3981j49935d4650A17061
9821B59517C910c895l19D11501g9530j21381p3930i1635d2022A6892a7851l22525
9809c40376B10115A5218J64893a09648A32829m1091e059l1072j5652p2612A09748
9797c55719m7306A20241a14354B32463g7169A09298i3372H2616a01501j42615
9787b44116a16564j25751f7432E1119a41751B15005a86088A40644F5535b16039
9776d8846m27479a80424c8789C009a13453C4173N0241a99316C33702i7215d0910
$$ y = [-160213, -129136, -354411, -155374, 150970, -133132, -186313, -26519, 55321, -37865, -225012, -232496, -619092, 271957, -306969, 286906, -6402, -24459, -140340, 160992, -313693, -136027, 183081, 40136, 123157, -336615, -143540, 3054, -50950, 122915, -53981, -203916, -44650, 117061, 259517, 3910, -3895, -4214, 411501, -79530, -200911, -274841, -91635, -42022, 16892, -17851, -340376, 210115, 15218, 180111, -109648, 132829, 91738, -5059, -36131, -51783, -124395, 109748, -355719, -403025, 120241, -114354, 232463, -77169, 109298, -93372, 82616, -101501, -244116, -116564, -242315, -67432, 51119, -141751, 215005, -186088, 140644, 65535, -216039, -48846, -476325, -180424, -38789, 3009, -113453, 34173, 84414, -199316, 333702, -97215, -40910]
9764A02215f9116k58120C1999b17368h910j92282B17281m1901a39588A73196A6849
9752b50037l5014e1007k22347d3407k33494C2517f1794n5996o6760C166g613E635
9739b8471p480I6679H35c0941H6786C7389b2449k9361m5490j20228j10647J38593
9727a89582l836k1254E9438g3152F1764a73712j3962P7984n9079B29671A8303
9715d7111n0061B05534c20335R2446j15291c0250r2037j49818A54718c398j34132
9704a37530p6575e3070k4072r5160n4904a1054j76906j70850j89056a56645a3488
9692B56812b54389C5599P2888K30126j13980a27502K1684l9834B04415C8447N657
9681D4104J06536d7549o7002a0514j89336P0873l34267K24529B5592a79176A21747
$$ y = [102215, -69116, -327236, 31999, -217368, -8910, -201192, 217281, 175380, -139588, 173196, 16849, -250037, -285051, -51007, -273354, -43407, -276901, 32517, -61794, -117790, -184550, 3166, -7613, 5635, -28471, -35951, 96679, 835, -30941, 86786, 37389, -22449, -51810, -97300, -217528, -328175, -189582, -193418, -214672, 59438, -73152, 61764, -173712, -187674, -109690, -168769, 229671, 18303, -47111, -97172, 205534, -320335, -227889, -343180, -30250, -122287, -272105, 154718, -3398, -137530, -214105, -53070, -77142, -172302, -227206, -11054, -187960, -358810, -547866, -156645, -13488, 256812, -254389, 35599, 108487, 338613, 224633, -127502, -105818, -145652, 204415, 38447, 44104, 150640, -47549, -114551, -10514, -199850, -128977, -463244, -238715, 25592, -179176, 121747]
9669a85920P5979A09811d1923j51511I5265K64638a73025r2463c8449k47490a03029
9657c18198C80801A2630a57660K9262a0641q5925j99716A00368k6761K7948b25405
9645b87842a41125b3341F3684g6354I3013d55312i0105C17179d4130B91517B1360
9633f3717A73482a31180j48881A55484m7260J51998I845a33295j80657C66249
9622e575k03384j45476A61403b22075L4768j04905J19484N3806l168b6262l60378
9611c86640J71121G5470h9879k28687b6637k83660A05534d7588k9512k10427A12810
9599b75680A05282b26963C4740f49864a58839N0110B20143e07314B57116p5435
9589A81681h4030j204E2360O321a14323m1857g5288G4860d3243j99036p8738L1976
$$ y = [-185920, -109941, 109811, -41923, -193434, 95265, 359903, -173025, -265488, -38449, -285939, -103029, -318198, 380801, 12630, -157660, -128398, -10641, -96566, -296282, 100368, 73607, 101555, -225405, -287842, -141125, -23341, 63684, -76354, 93013, -455312, -90105, 317179, -44130, 291517, 21360, -63717, 173482, -131180, -280061, 155484, 108224, 260222, 9845, -133295, -313952, 366249, -5575, -208959, -354435, 161403, -222075, -187307, -292212, -172728, -118922, -122090, -26262, -386640, -215519, 75470, -89879, -318566, -26637, -310297, 105534, -47588, -77100, -287527, 112810, -275680, 105282, -226963, 34740, -649864, -158839, -108729, 220143, -507314, 257116, 181681, -84030, -85234, 52360, 58681, -114323, -156180, -75288, 74860, -43243, -242279, -321017, -289041]
9577b89041Q3701k9735i0971B99887A39456c8717E72926D2266P1025J38204D2274
9565b02826l9306K532a2780j71356M0059B36850a81877m9318f0833m5395m33574
9554e39802a37685d0111n8530r8535q1036J35675j6383B46390a15208A9248i866
9542h6621r1879N7906n9673D1941J4425a58944k67989b08432O0756j4382k7273
9531a89331g3713k05040c2135q3282J4574C2558K6837a97044d3492k1514L3A10711
9518A1290N1751a97666G4806b9252l07638l8003e1945j48956Q6955a7375j15229
9507a32604o7655c5247F388L21857c822l49257H7122L19026a96070d3898A65594
9495b25947A5232R1595O3044A6065K21105f8253D975e3754j01958j07833I4018
$$ y = [-289041, -205340, -235075, -90971, 299887, 139456, -38717, 572926, 42266, 113291, 251495, 42274, -202826, -242132, -239600, -12780, -184136, -144077, 236850, -181877, -231195, -60833, -106228, -539802, -137685, -40111, -98641, -197176, -278212, -142537, -158920, 246390, -115208, 19248, -9866, -86621, -178500, -120594, -180267, 41941, 56366, -158944, -426933, -208432, -147676, -162058, -189331, -73713, -278753, -32135, -115417, -100843, 32558, 59395, -197044, -43492, -65006, -64973, 110711, 11290, 63041, -197666, 74806, -29252, -336890, -374893, -51945, -200901, -113946, -17375, -132604, -200259, -35247, 6388, 328245, -3822, -353079, 87122, 406148, -196070, -43898, 165594, -225947, 15232, 106827, 169871, 16065, 237170, -68253, 4975, -53754, -155712, -263545, 94018]
9483f8472A74797d5213J0258A64106E3990j9187a55252A37784b44217H6401A3094
9471d1450F7929c2381j65414N0442N7018j54979J03866K4994c630j77386o9836
9460b50852B53804a31812n8790q0695J25676A23919l2667e2087j17171j02873
9450b72131C2120L25152g7272p3065O4516Q050k5518p8568h8199k2323j31535
9439b42057P4066N0069d1533A12473l6866K50617i4239b0447j41919A89621c05064
9427f5101I2232A4271J58407b21482A55414N2908a27880K6602j06476G8734N2678
9416A31412a65194A31811B7941h8829n3232r7199d4898k08536C1945a54718B00198
9404D3928d9836k38799c5727p6739I5155b7921r6370d6120J5243F8653C128J50942
$$ y = [-68472, 174797, -45213, -34955, 164106, 53990, 34803, -155252, 137784, -244217, 86401, 13094, -41450, 67929, -32381, -197795, -147353, -90335, -245314, -141448, -116454, -3630, -181016, -250852, 253804, -131812, -190602, -271297, -145621, 123919, 91252, -52087, -169258, -272131, 32120, 357272, -77272, -150337, -85821, -77771, -103289, -181857, -88199, -110522, -242057, -167991, -117922, -41533, 112473, 75607, 326224, -94239, -20447, -162366, 189621, -305064, -65101, 92232, 14271, 172678, -221482, 155414, 208322, -127880, -101278, -207754, 78734, 131412, -165194, 131811, 27941, -88829, -142061, -239260, -44898, -253434, 31945, -154718, 200198, 43928, -49836, -288635, -35727, -112466, 95155, -27921, -124291, -46120, -30877, 68653, 3128, 154070]
9392A54070l3461b12302j09167D6488a11588B01708g2095k2194M1738k06103i1959
9380d9581j4404k08206d7687A39565m1084d0207k77080C0154a13828o344e5522
9368C02833c4975e409j509j06416k97945a66548l5306l1817k5387j1181J10727
9357a59512B59932F3989K1838a16928C5749a06564o6128A94466b2812A4773e5460
9345D3923J01929g3009j71445C67231H8354a21741C20935a81250m08841F7525
9334B97315b42417A76591a6439j77441J3725N8718M2044A33688a45446A16534
9323g7899r1997O6542d4051A95252B9127b61408b6124m562A09766a75367A76091
9311c0771k72274a02063H968a1674k11739a6752k59306R7021g0663E039c22127
$$ y = [154070, 120609, -212302, -321469, 46488, -111588, 201708, -72095, -94289, -52551, -258654, -91959, -49581, -63985, -272191, -47687, 139565, 98481, -40207, -317287, 30154, -113828, -120172, -55522, 302833, -34975, -5409, -6918, -113334, -411279, -166548, -201854, -233671, -259058, -270239, -159512, 259932, 63989, 85827, -116928, 35749, -106564, -172692, 194466, -22812, 14773, -55460, 43923, 145852, -73009, -244454, 367231, 88354, -121741, 320935, -181250, -590091, 67525, 297315, -242417, 176591, -16439, -193880, -180155, -121437, -79393, 133688, -145446, 116534, -77899, -169896, -103354, -44051, 195252, 29127, -261408, -26124, -30686, 109766, -175367, 176091, -30771, -303045, -102063, 8968, -11674, -223413, -16752, -276058, -179037, -70663, 5039, -322127]
9299D6089a37833o6697K9799A76105f6407m7179j42937F6219P668f9444H2243
9287a12757j25080i7083C98196A12618K08736a92591n7072A3167M49186a84163
9276B18077G3739O1263b6983C9173i929B26595n2043b41798d3912F1908b91372
9264a08172j91634A21928R266Q377M1085a09101n0697F7695K70086H4380A3129
9252C9037b65832I3560a80552e2592b0451A520a47459A50322a10305l66849b26077
9240b90501J33747c6911j62447o0994B2245b23003b9033j01040l0343q8307E4
9228B06352c44101a08430j36523q6504B3716c04322l4845A31207a89785H0095
9217b30956E4870Q1004b29576A01635b183A21037n4217K65612H2542D15c71295
$$ y = [46089, -137833, -204530, -174731, 176105, -66407, -113586, -256523, 66219, 73887, -69444, 82243, -112757, -237837, -97083, 398196, 112618, 321354, -192591, -249663, 13167, 462353, -184163, 218077, 73739, 135002, -26983, 39173, -9929, 226595, 174552, -241798, -43912, 61908, -291372, -108172, -299806, 121928, 131194, 139571, 180656, -109101, -159798, 67695, 337781, 84380, 13129, 39037, -265832, 93560, -180552, -52592, -20451, 1520, -147459, 150322, -110305, -477154, -226077, -290501, -156754, -36911, -199358, -260352, 22245, -223003, -29033, -130073, -160416, -248723, 54, 206352, -344101, -108430, -244953, -331457, 23716, -304322, -339167, 131207, -189785, 80095, -230956, 54870, 135874, -229576, 101635, -2183, 121037, 66820, 332432, 82542, 415, -371295]
9205e46871b50374I6530g8751B57536L6991A10824b32057I020L93614B6950K43640
9194B70590D3242a17366j34460H1177b6108m9107k02162a3189C172c13712A7019
9182A9802g4456j39270J05251n4863Q0207C73861a60541k11914D1040b1303r2032
9171a13335E5397J14485e7075l84452A03461h1367j35071B28780a26556A75070
9160A97587b22811A3778c9448o274j25635Q1022k0678j2624m1198A80909b94508
9148b82577J01448A65467a85811A23999b33962f2504b2136A2995d213k9721p5068
9137a09002j38887l8950b5356k19890B69983a55582b7912j56498q0827B65471
9126c02326j2456d2475a7977B1540c64367b7656q5717F0704N9665R80d5072b161
$$ y = [-546871, -250374, 96530, -78751, 257536, 294527, 110824, -232057, 9020, 402634, 26950, 270590, 43242, -117366, -251826, 81177, -26108, -75215, -277377, -13189, 3172, -313712, 17019, 19802, -74456, -213726, -108475, -163338, -83131, 373861, -160541, -372455, 41040, -21303, -113335, 55397, 169882, -57075, -441527, 103461, -81367, -216438, 228780, -126556, 175070, 197587, -222811, 13778, -39448, -45722, -171357, -90335, -111013, -123637, -164835, 180909, -294508, -282577, -181129, 165467, -185811, 123999, -233962, -62504, -22136, 12995, -4213, -33934, -109002, -247889, -286839, -25356, -245246, 269983, -155582, -27912, -184410, -265237, 265471, -302326, -314782, -42475, -17977, 21540, -364367, -27656, -113373, 60704, 120369, 121349, -45072, -2161]
9113A4484a816B8851K5813J30683d26723J64742Q4021j89383F7270e0732j07946
9102a58678j92171a06920l8987e0738A0402a8467j96165R0803c7464j41842M0929
9091a38377M2753A53249a14957d2797k86801a46136J0567n0163r5783f0058b6408
9079C62758a7536k16568N5468l6815g6930H4238C8723a790j07551k162M8413l86775
9067d49865a68061E34808c84046A52544o4927b49196h2307F4050m604a44260A07517
9055b46186J7899K2156G9993d8942q4556A31282c8324k1999g187k968m6191A26747
9042A02786i9789j27799J08015F0034R149K26560b27224J04287b5018j71480E9428
9030a37155j71519J27069C7708F97N5112L6173h7926A44468f5964G6990R9851
$$ y = [14484, -1816, 28851, 54664, 185347, -426723, -261981, -177960, -367343, 67270, -50732, -158678, -350849, -106920, -145907, -50738, 10402, -18467, -214632, -123829, -37464, -179306, -138377, -95624, 153249, -114957, -42797, -329598, -146136, -135569, -185732, -281515, -60058, -26408, 362758, -17536, -234104, -178636, -215451, -76930, 84238, 38723, -1790, -109341, -111503, -63090, -449865, -168061, 534808, -384046, 152544, 87617, -249196, -82307, 64050, 59446, -144260, 107517, -246186, -228287, -206131, 79993, -48942, -133498, 131282, -38324, -60323, -7187, -10155, -56346, 126747, 102786, -99789, -227588, -119573, 60034, 69183, 295743, -227224, -122937, -25018, -196498, 59428, -137155, -308674, -181605, 37708, 697, 55809, 91982, -87926, 144468, -65964, 76990, 176841]
9019A76841c24356A93973c47412L0180C0286a35220K4210A70416h5928J8577k76956
9008c44307b8006B03410a5730m0209k06429D2219a4044n6861n0943k81512C4491
8996b29219a1308C05121m0471p4187F132P1326j6671c72799k71180a1758m2484
8985e4242R817B15916a51843k47248e2879B03816b21603A61360E481a97304F6418
8973G165M6086b30427E9188a67248d8057D9550B3508R3813d72676B6278b35188
8961e3167A5663b05170o6797H3359a12214p7655f7129a1102e141A17369b2609
8949b45345i9020A43280a15669r7477G2347J87213D0429J49972a28775j90273
8939c19048i0383A14561m2359c23396a14923d5993A01079J6028C1395a20995c1548
$$ y = [176841, -324356, 193973, -347412, -317232, 30286, -135220, -111010, 170416, -85928, -67351, -344307, -28006, 203410, -15730, -55939, -262368, 42219, -14044, -70905, -121848, -403360, 34491, -229219, -11308, 305121, 264650, 190463, 6132, 77458, 60787, -372799, -643979, -11758, -54242, -44425, 215916, -151843, -399091, -52879, 203816, -221603, 161360, 5481, -197304, 66418, 7165, 53251, -230427, 59188, -167248, -48057, 49550, 23508, 117321, -472676, 26278, -235188, -53167, 15663, -205170, -271967, 83359, -112214, -189869, -67129, -11102, -5141, 117369, -22609, -245345, -99020, 143280, -115669, -213146, 72347, 259560, 40429, 190401, -128775, -319048, -90383, 114561, 72202, -323396, -114923, -45993, 101079, 117107, 31395, -120995, -31548]
8927a3220l2726p206B38594j00881O22386B49359P38215J556203J1130492o258854
8917G415415A625818F05822k55670f0633D9499J34791A3136L1479b5015I154K84151
8906B93305b35817D11483G319J29882c0250A84940a75708J8081b5417o764n0135
8895h2316k86913b8038C06123f8816b9739B1243J6740J983j0261c68475B7549
8883F3710B4925J15590k1146B4938D167a38635n13750a39467N1323j48356A90956
8871C1178J80147e8016D9760d2373j28573P3757K1024k0130j24530J05296A6759
$$ y = [-13220, -45946, -53152, 238594, 137713, 760099, 249359, 987574, 2543777, 13674269, 7415415, 1625818, 605822, 350152, -60633, 49499, 184290, 13136, 44615, -25015, 9154, 293305, -235817, 411483, 7319, 137201, -30250, 184940, -175708, -157627, -25417, -32181, -82316, -369229, -28038, 306123, -68816, -29739, 21243, 37983, 39966, 29705, -368475, 27549, 63710, 24925, 140515, 119369, 24938, 4167, -138635, -652385, -139467, -88144, -236500, 190956, 31178, 211325, -58016, 49760, -42373, -170946, -97189, -76165, -96295, -220825, -115529, 16759]
$$ [...]
##END NTUPLES=NMR SPECTRUM
##END=
