
##TITLE=AC1068_TOPL01_6519229_qYJ3gEzVqc
##JCAMPDX= 6.0         $$ Bruker NMR JCAMP-DX V2.0
##DATA TYPE= NMR SPECTRUM
##DATA CLASS= NTUPLES
##ORIGIN= BRUKER
##OWNER= Administrator
$$ 1.72 TOPSPIN		Version 2.1
$$ 2012-07-13 14:44:17.812 -0500  Administrator@TOPSPIN
$$ Compression mode = diff/dup
##.OBSERVE FREQUENCY= 400.02188249412
##.OBSERVE NUCLEUS= ^1H
##.ACQUISITION MODE= SIMULTANEOUS (DQD)
##.ACQUISITION SCHEME= undefined
##.AVERAGES= 64
##.DIGITISER RES= 22
##SPECTROMETER/DATA SYSTEM= spect
##.PULSE SEQUENCE= noesygpps1d.comp
##.SOLVENT NAME= COFFEE_meoh
##.SHIFT REFERENCE= INTERNAL, COFFEE_meoh, 1, 14.96263
##AUDIT TRAIL= $$ (NUMBER, WHEN, WHO, WHERE, PROCESS, VERSION, WHAT)
$$ ##TITLE= Audit trail, TOPSPIN		Version 2.1
$$ ##JCAMPDX= 5.01
$$ ##ORIGIN= Bruker BioSpin GmbH
$$ ##OWNER= Administrator
$$ $$ C:\Bruker\TOPSPIN/data/COFFEE/nmr/AC1068_TOPL01_6519229_qYJ3gEzVqc/12/pdata/1/auditp.txt
$$ ##AUDIT TRAIL=  $$ (NUMBER, WHEN, WHO, WHERE, PROCESS, VERSION, WHAT)
(   1,<2012-07-13 14:44:12.484 -0500>,<Administrator>,<TOPSPIN>,<go>,<TOPSPIN 2.1>,
      <created by zg
	started at 2012-07-13 14:32:42.296 -0500,
	POWCHK enabled, PULCHK disabled,
       configuration hash MD5:
       6B 1B 68 BB D9 2E 58 E2 7F 35 AD 54 07 DF 0E 41
       data hash MD5: 64K
       AC 7A C0 84 F8 29 27 A8 5B AC 4A 29 C6 C3 DF 40>)
(   2,<2012-07-13 14:44:15.562 -0500>,<Administrator>,<TOPSPIN>,<proc1d>,<TOPSPIN 2.1>,
      <Start of raw data processing
       efp LB = 0.3 FT_mod = 6 PKNL = 1 PHC0 = 0 PHC1 = 0 SI = 128K 
       data hash MD5: 128K
       31 29 85 0A BE 38 C0 9C CF 12 0D 20 5E DC 1A 0C>)
(   3,<2012-07-13 14:44:16.953 -0500>,<Administrator>,<TOPSPIN>,<proc1d>,<TOPSPIN 2.1>,
      <pk PHC0 = -1.988525 PHC1 = 0 
       data hash MD5: 128K
       81 B6 2D 84 1B EB A0 E0 FD 2E E1 7F 98 AD AF 47>)
(   4,<2012-07-13 14:44:17.484 -0500>,<Administrator>,<TOPSPIN>,<proc1d>,<TOPSPIN 2.1>,
      <abs ABSG = 1 
       data hash MD5: 128K
       4D 2C D3 C3 29 48 68 C3 44 46 C9 A5 F5 11 38 31>)
(   5,<2012-07-13 14:44:17.562 -0500>,<Administrator>,<TOPSPIN>,<proc1d>,<TOPSPIN 2.1>,
      <abs ABSG = 2 
       data hash MD5: 128K
       54 AD 1B 74 51 E9 8C 2B D8 DD D5 92 31 03 98 4E>)
(   6,<2012-07-13 14:44:17.609 -0500>,<Administrator>,<TOPSPIN>,<proc1d>,<TOPSPIN 2.1>,
      <abs ABSG = 3 
       data hash MD5: 128K
       8C 99 34 EE 24 40 C8 62 AA A9 DE 8B 8F DC E0 05>)
(   7,<2012-07-13 14:44:17.671 -0500>,<Administrator>,<TOPSPIN>,<proc1d>,<TOPSPIN 2.1>,
      <abs ABSG = 4 
       data hash MD5: 128K
       6A 2E FB C4 CF CE EA AA 58 22 17 E3 33 11 0B 49>)
(   8,<2012-07-13 14:44:17.718 -0500>,<Administrator>,<TOPSPIN>,<proc1d>,<TOPSPIN 2.1>,
      <abs ABSG = 5 
       data hash MD5: 128K
       1D 49 C2 1A 5C 3F 7A 52 0E 44 AA 98 15 3D E4 D5>)
$$ ##END=
$$ 
$$ $$ hash MD5
$$ $$ 90 E4 78 71 43 08 FF 62 21 E7 8D B8 E8 2F 7A 6F
##$RELAX= 
##$RELAX= 
##$RELAX= 
##$RELAX= 
##$RELAX= 
##$RELAX= 
##$RELAX= 
##$RELAX= 
##$RELAX= 
$$ Bruker specific parameters
$$ [...]
##$TP07= 0
##$TPNAME0= <>
##$TPNAME1= <>
##$TPNAME2= <>
##$TPNAME3= <>
##$TPNAME4= <>
##$TPNAME5= <>
##$TPNAME6= <>
##$TPNAME7= <>
##$TPOAL= (0..7)
0.5 0.5 0.5 0.5 0.5 0.5 0.5 0.5
##$TPOFFS= (0..7)
0 0 0 0 0 0 0 0
##$TUNHIN= 0
##$TUNHOUT= 0
##$TUNXOUT= 0
##$USERA1= <user>
##$USERA2= <user>
##$USERA3= <user>
##$USERA4= <user>
##$USERA5= <user>
##$V9= 5
##$VALIST= <valist>
##$VCLIST= <CCCCCCCCCCCCCCC>
##$VD= 0
##$VDLIST= <DDDDDDDDDDDDDDD>
##$VPLIST= <PPPPPPPPPPPPPPP>
##$VTLIST= <TTTTTTTTTTTTTTT>
##$WBST= 2048
##$WBSW= 25
##$XGAIN= (0..3)
0 0 0 0
##$XL= 0
##$YL= 0
##$YMAX_a= 17306180
##$YMIN_a= -11097637
##$ZGOPTNS= <>
##$ZL1= 120
##$ZL2= 120
##$ZL3= 120
##$ZL4= 120
##$ABSF1= 14.96263
##$ABSF2= -5.595551
##$ABSG= 5
##$ABSL= 3
##$ALPHA= 0
##$AQORDER= 0
##$ASSFAC= 0
##$ASSFACI= 0
##$ASSFACX= 0
##$ASSWID= 0
##$AUNMP= <proc_prof1d_extract.lims>
##$AXLEFT= 0
##$AXNAME= <>
##$AXNUC= <1H>
##$AXRIGHT= 0
##$AXTYPE= 0
##$AXUNIT= <>
##$AZFE= 0.1
##$AZFW= 0.1
##$BCFW= 0
##$BC_mod= 0
##$BYTORDP= 0
##$COROFFS= 0
##$CY= 15
##$DATMOD= 1
##$DC= 0
##$DFILT= <>
##$DTYPP= 0
##$F1P= 0
##$F2P= 0
##$FCOR= 0.5
##$FTSIZE= 131072
##$FT_mod= 6
##$GAMMA= 0
##$GB= 0
##$INTBC= 1
##$INTSCL= 1
##$ISEN= 128
##$LB= 0.3
##$LEV0= 0
##$LPBIN= 0
##$MAXI= 10000
##$MC2= 0
##$MEAN= 0
##$ME_mod= 0
##$MI= 0
##$NCOEF= 0
##$NC_proc= -2
##$NLEV= 6
##$NOISF1= 0
##$NOISF2= 0
##$NSP= 0
##$NTH_PI= 0
##$NZP= 0
##$OFFSET= 14.96263
##$PC= 1
##$PHC0= -1.988525
##$PHC1= 0
##$PH_mod= 1
##$PKNL= yes
##$PPARMOD= 0
##$PPDIAG= 0
##$PPIPTYP= 0
##$PPMPNUM= 2147483647
##$PPRESOL= 1
##$PSCAL= 4
##$PSIGN= 0
##$PYNMP= <proc.py>
##$REVERSE= no
##$SF= 400.020008985788
##$SI= 131072
##$SIGF1= 0
##$SIGF2= 0
##$SINO= 400
##$SIOLD= 131072
##$SPECTYP= <>
##$SREGLST= <1H.CDCl3>
##$SSB= 0
##$STSI= 131072
##$STSR= 0
##$SW_p= 8223.68421052631
##$SYMM= 0
##$S_DEV= 0
##$TDeff= 65536
##$TDoff= 0
##$TI= <>
##$TILT= no
##$TM1= 0
##$TM2= 0
##$TOPLEV= 0
##$USERP1= <user>
##$USERP2= <user>
##$USERP3= <user>
##$USERP4= <user>
##$USERP5= <user>
##$WDW= 1
##$XDIM= 131072
##$YMAX_p= 495276231
##$YMIN_p= -11064
##$CURPLOT= <Network HP LaserJet P1505>
##$CURPRIN= <$Network HP LaserJet P1505>
##$DFORMAT= <normdp>
##$LAYOUT= <+/1D_H.xwp>
##$LFORMAT= <normlp>
##$PFORMAT= <normpl>
##$SURQMSG= 1
$$ End of Bruker specific parameters
$$ ---------------------------------
##NTUPLES= NMR SPECTRUM
##VAR_NAME=  FREQUENCY,     SPECTRUM/REAL,   SPECTRUM/IMAG
##SYMBOL=    X,             R,               I
##VAR_TYPE=  INDEPENDENT,   DEPENDENT,       DEPENDENT
##VAR_FORM=  AFFN,          ASDF,            ASDF
##VAR_DIM=   131072,        131072,          131072
##UNITS=     HZ,            ARBITRARY UNITS, ARBITRARY UNITS
##FACTOR=    0.0627417313425164, 1,          1
##FIRST=     8223.62146879497, -1221,        -68001
##LAST=      0,             1323,            -68558
##MIN=       0,             -11064,          0
##MAX=       8223.62146879497, 495276231,    0
$$ Real data points
##PAGE= N=1
##DATA TABLE= (X++(R..R)), XYDATA
$$ [...]
60948A9705298k807835k457261k091644j749249j447333j191707r80432q06409
$$ 19705298 16897463 14440202 12348558 10599309 9151976 7960269 6979837 6173428
60940F173428o62767n46109m53982l82125l26132k83524k52076k28032k07897
$$ 6173428 5510661 4964552 4510570 4128445 3802313 3518789 3266713 3038681 2830784
60931B830784j90380j74941j60070j44754j29938j16675j04201r1622q0196p2005
$$ 2830784 2640404 2465463 2305393 2160639 2030701 1914026 1809825 1718203 1638007 1566002
60921A566002o7322o4933o3956o3676o2572n9395n4718m9966m5568m1274l7409
$$ 1566002 1498680 1433747 1369791 1306115 1243543 1184148 1129430 1079464 1033896 992622 955213
60910I55213l4266l1047k7013k2993k0263j8485j6403j4001j2325j1494j0563
$$ 955213 920947 889900 862887 839894 819631 801146 784743 770742 758417 746923 736360
60899G36360r325q642q726q509p080m810k580o80J185L223N145O337O557O509
$$ 736360 727035 718393 709667 701158 694078 689268 686688 686008 687193 690416 695561 701898 708455 714964
60885G14964P211Q575R351Q864P939P525P272O314M732L150J517n81k817m394
$$ 714964 722175 730750 740101 748965 756904 764429 771701 778015 782747 785897 787414 786833 784016 779622
60871G79622n236n970o933p963r042j0258j1311j1764j1723j1598j1266j0189
$$ 779622 774386 768416 761483 753520 744478 734220 722909 711145 699422 687824 676558 666369
60859F66369q292o166m366k983j959j313r84o33K50J968M183O082P286Q400J0143
$$ 666369 658077 651911 647545 644562 642603 641290 640306 639673 639923 641891 646074 652156 659442 667842 677985
60844F77985J2258J4037J5683J7994K0809K2947K3909K4209K3863K1979J8568
$$ 677985 690243 704280 719963 737957 758766 781713 805622 829831 853694 875673 894241
60833H94241J5268J3366J2360J1404J0827J1077J1271J0258Q249O108L824J028
$$ 894241 909509 922875 935235 946639 957466 968543 979814 990072 998321 1004429 1008253 1009281
60821A009281j556k695k387j754j454j262j051j119j704k935n070q037j1068j3458
$$ 1009281 1007725 1005030 1002643 1000889 999435 998173 997122 996003 994299 991364 986294 978257 967189 953731
60807I53731j5236j6572j7137j6870j6625j7021j7267j6294j4428j2792j1453
$$ 953731 938495 921923 904786 887916 871291 854270 837003 820709 806281 793489 782036
60796G82036r584p203n352m483l810k436l63J806L475M345M775N734P783J0263
$$ 782036 772452 765249 759897 755414 751604 749168 748805 750611 754086 758431 763206 768940 776723 786986
60782G86986J2045J2808J2976J2759J2035J0944R796Q569P061N400L930K887K594
$$ 786986 799031 811839 824815 837574 849609 860553 870349 878918 885979 891379 895309 898196 900790
60769I00790L439N103O393O560O228O376O951P337P484P708P915P941Q118Q578
$$ 900790 904229 909332 915725 922285 928513 934889 941840 949177 956661 964369 972284 980225 988343 996921
60755I96921Q601P666O572O326O520O064N092M684M981N016M430L941L917L686
$$ 996921 1005522 1013188 1019760 1026086 1032606 1038670 1043762 1048446 1053427 1058443 1062873 1066814 1070731 1074417
60741A074417K645J090m08j673k723l518m045m232l903l251l175m407o558q620
$$ 1074417 1077062 1078152 1077744 1076071 1073348 1069830 1065785 1061553 1057650 1054399 1051224 1046817 1040259 1031639
60727A031639j0075j0924j1067j0509r848r687r779r551r122r011r194r392r830
$$ 1031639 1021564 1010640 999573 989064 979216 969529 959750 950199 941077 932066 922872 913480 903650
60714I03650j0704j1241j0469q799p719p906q570q689q012o916n966n551n297
$$ 903650 892946 881705 871236 862437 854718 846812 838242 829553 821541 814625 808659 803108 797811
60701G97811m098j427J834M525O545Q242R208Q980Q277Q124Q069O727L883O16
$$ 797811 793713 792286 794120 798645 805190 813432 822640 831620 839897 848021 856090 862817 866700 867316
60687H67316k463n575q527j0607j1963j3555j5494j6777j6993j6936j7090j6817
$$ 867316 864853 859278 850751 840144 828181 814626 799132 782355 765362 748426 731336 714519
60675G14519j5546j3737j2028j0354q403o245m084k047m38N10J205K286L535M085
$$ 714519 698973 685236 673208 662854 654451 648206 644122 642075 641637 642147 643352 645638 649173 653258
60661F53258L775L436L591L756L318K382J494J051J105J288J031L56J70J145K718
$$ 653258 657033 660469 664060 667816 671134 673516 675010 676061 677166 678454 679485 679841 680011 681156 683874
60646F83874L928M702N345N385M284K805K301K838L476M109N429P243Q536R326
$$ 683874 687802 692504 697849 703234 707518 710323 712624 715462 718938 723047 728476 735719 744255 753581
60632G53581J0638J2448J3480J3522J4130J6198J8436J9240J8723J7942J7228
$$ 753581 764219 776667 790147 803669 817799 833997 852433 871673 890396 908338 925566
60621I25566J6371J5439J4435J2844J0374P568N031K645Q3k523m872o906q524
$$ 925566 941937 957376 971811 984655 995029 1002597 1007628 1010273 1010356 1007833 1002961 996055 987531
60608I87531r550j0230j1015j1664j1357r890q011o342m896l763l230l115k983
$$ 987531 977981 967751 956736 945072 933715 923825 915814 909472 904576 900813 897583 894468 891485
60595H91485l255m914p735j0048j0723j0203r208p642n479l433j914l56J662L497
$$ 891485 888230 883316 875581 865533 854810 844607 835399 827757 822278 818845 816931 816575 818237 821734
60581H21734M428M656M580L981K767J705J523J825J714J024L53K13O35J159J085
$$ 821734 826162 830818 835398 839379 842146 843851 845374 847199 848913 849937 850290 850503 851138 852297 853382
60566H53382J65q91j346j712l144n503p374q186q879j0022j0736j0248r187q425
$$ 853382 853547 852656 851310 849598 846454 840951 833577 825391 816512 806490 795754 785506 776319 767894
60552G67894p781o706n263l519j082J827L883M336M325N514Q034J0853J3424J5990
$$ 767894 760113 753407 748144 744625 743543 745370 749253 753589 757914 763428 771462 782315 795739 811729
60538H11729J8857K2354K7096L3344M0262M6362N0280N0872M7317L9822K9604
$$ 811729 830586 852940 880036 913380 953642 1000004 1050284 1101156 1148473 1188295 1217899
60527A217899J7702M511r085k1128k9878l4942l6639l5201l1326k6476k1620j6366
$$ 1217899 1235601 1240112 1231027 1209899 1180021 1145079 1108440 1073239 1041913 1015437 993817 977451
60515I77451j0126l364L002Q477J2519J4246J3688J2474J2149J2493J2493J2190
$$ 977451 967325 963961 966963 975440 987959 1002205 1015893 1028367 1040516 1053009 1065502 1077692
60503A077692J2379J3271J4755J7459K2181K8552L5456M2669N1105O1625P4482
$$ 1077692 1090071 1103342 1118097 1135556 1157737 1186289 1221745 1264414 1315519 1377144 1451626
60492A451626Q9754J07360J26653J46776J67480J89353K13454K41091K73457L10728
$$ 1451626 1541380 1648740 1775393 1922169 2089649 2279002 2492456 2733547 3007004 3317732
60482C317732L51228L90893M22538M35974M20927L71723K89435J80046N2245q2463
$$ 3317732 3668960 4059853 4482391 4918365 5339292 5711015 6000450 6180496 6232741 6150278
60472F150278k09902l16423l92957m36446m49001m36749m07990l70201l28388
$$ 6150278 5940376 5623953 5230996 4794550 4345549 3908800 3500810 3130609 2802221
60463B802221k86206k47079k12992j83453j57270j34581j15883j00278q6523p4939
$$ 2802221 2516015 2268936 2055944 1872491 1715221 1580640 1464757 1364479 1277956 1203017
60453A203017o6376n9881n3407m6490m0299l5292l0711k6435k3379k1748k0532
$$ 1203017 1136641 1076760 1023353 976863 936564 901272 870561 844126 820747 798999 778467
60442G78467j9085j7823j7003j6129j4880j3511j2098j0562r517r758j0688j0651
$$ 778467 759382 741559 724556 708427 693547 680036 667938 657376 647859 638101 627413 616762
60430F16762r078p121n754m612l217k041j604j549j307q92m06M29J567K275K180
$$ 616762 607684 600563 594809 590197 586980 584939 583335 581786 580479 579587 579181 579610 581177 583452 585632
60415E85632K058K869M388N420N178L884K330J204Q62J299K288L489M468M893
$$ 585632 587690 590559 594947 600367 605545 609429 611759 612963 613825 615124 617412 620901 625369 630262
60401F30262M899M981N189M880L758K763L138M760O192O357N554M769M582M774
$$ 630262 635161 640142 645331 650211 653969 656732 659870 664630 670822 677179 682733 687502 692084 696858
60387F96858M559L354J633P85J449K439K092M46r46j260j309j999k971l328k941
$$ 696858 701417 704771 706404 707189 708638 711077 713169 713615 712669 711409 710100 708101 705130 701802 698861
60372F98861k413k111j845j285l99N23J141J439J733K168K348J877J005M61O72
$$ 698861 696448 694337 692492 691207 690808 691331 692472 693911 695644 697812 700160 702037 703042 703503 704175
60357G04175J503K582L527L989L896L624L647M102M919O095P467Q585R113R186
$$ 704175 705678 708260 711787 715776 719672 723296 726943 731045 735964 742059 749526 758111 767224 776410
60343G76410R110Q985Q836Q642P992O310L814J589J75j130k914m408m507l459
$$ 776410 785520 794505 803341 811983 819975 826285 830099 831688 831863 830733 827819 823411 818904 815445
60329H15445k427j794r26N92K550M829P417R662J0405R147O505L450O45j589l247
$$ 815445 813018 811224 810298 810890 813440 818269 825686 835348 845753 854900 861405 864855 865500 863911 860664
60314H60664m665o119p441q301q593q226o999n188l726l223l195k935k530k326
$$ 860664 855999 849880 842439 834138 825545 817319 810320 805132 801406 798183 794988 792053 789523 787197
60300G87197j976r92K81J162J782K723L870M660N168N891O610O553N650M664M030
$$ 787197 785221 784229 784510 785672 787454 790177 794047 798707 803875 809766 816376 822929 828579 833243 837273
60285H37273L434K535J352J1j181j611j018r4L83O57J424K531L254L593M196N199
$$ 837273 840707 843242 844594 844605 843424 841813 840795 840701 841084 841741 843165 845696 848950 852543 856739 861938
60269H61938O139O888P722Q553R172J0018J1693J3860J5699J7307J9498K2316
$$ 861938 868077 874965 882687 891240 900412 910430 922123 935983 951682 968989 988487 1010803
60257A010803K5045K7621L0815L4836L9000M2977M7165N1725N6358O1336O7569
$$ 1010803 1035848 1063469 1094284 1129120 1168120 1211097 1258262 1309987 1366345 1427681 1495250
60246A495250P5159Q3011R0284R7340J04780J12447J19802J26498J32008J35423
$$ 1495250 1570409 1653420 1743704 1841044 1945824 2058271 2178073 2304571 2436579 2572002
60236B572002J36085J33996J29353J22171J12619J01133Q8019P3321N7231M0250
$$ 2572002 2708087 2842083 2971436 3093607 3206226 3307359 3395378 3468699 3525930 3566180
60226C566180K2952N922j0270k5383l9435n1818o1022o5989o7313o6247o3036
$$ 3566180 3589132 3595054 3584784 3559401 3519966 3468148 3407126 3341137 3273824 3207577 3144541
60215C144541n7112m8507l7914k5742j2217J898J5810K9724M4272N9308P4304
$$ 3144541 3087429 3038922 3001008 2975266 2963049 2964947 2980757 3010481 3054753 3114061 3188365
60204C188365Q9421J04804J19242J31070J39988J46423J49475J47411J40143J29275
$$ 3188365 3277786 3382590 3501832 3632902 3772890 3919313 4068788 4216199 4356342 4485617
60194D485617J15637R8662P8440N6401L3552R834j4274l7333n8646p8543r6362
$$ 4485617 4601254 4699916 4778356 4834757 4868309 4878143 4863869 4826536 4767890 4689347 4592985
60183D592985j10006j18369j22441j23161j19939j12412j01849q9497p4980n7741
$$ 4592985 4482979 4364610 4242169 4119008 3999069 3886657 3784808 3695311 3620331 3562590
60173C562590l8771j9522j71J9635L9313N7871P4922Q9944J01393J08003J10229
$$ 3562590 3523819 3504297 3504126 3523761 3563074 3620945 3695867 3785811 3887204 3995207 4105436
60162D105436J09157J04615R5586Q1995O4973M5818K5756O216j1750k8065m2760
$$ 4105436 4214593 4319208 4414794 4496789 4561762 4607580 4633336 4639552 4627802 4599737 4556977
60151D556977n4854o2944o6531o5978o1527n3197m1428k7013j0571P458K6625
$$ 4556977 4502123 4439179 4372648 4306670 4245143 4191946 4150518 4123505 4112934 4120392 4147017
60140D147017M6804O8375R1601J16157J41569J67716J94628K22342K51221K81681
$$ 4147017 4193821 4262196 4353797 4469954 4611523 4779239 4973867 5196209 5447430 5729111
60130E729111L13227L44440L74104M01494M25151M42504M51484M51766M43788
$$ 5729111 6042338 6386778 6760882 7162376 7587527 8030031 8481515 8933281 9377069
60121I377069M27370M02115L68454L27419K79913K26790J69138J07879M3642k2573
$$ 9377069 9804439 10206554 10575008 10902427 11182340 11409130 11578268 11686147 11729789 11707216
60111A1707216q9236j55140k19388k79886l32816l74570m03623m19973m23742
$$ 11707216 11617980 11462840 11243452 10963566 10630750 10256180 9852557 9432584 9008842
60102I008842m15365l96490l69464l36170k98090k56949k14415j71368j28131
$$ 9008842 8593477 8196987 7827523 7491353 7193263 6936314 6721899 6550531 6422400
60093F422400q5160m3037k212L6680P2608J04610J31964J53550J67652J72957
$$ 6422400 6337240 6294203 6291991 6328671 6401279 6505889 6637853 6791403 6959055 7132012
60083G132012J69272J57011J36717J09576P7710M3402Q541k5056n5778q3122j07723
$$ 7132012 7301284 7458295 7595012 7704588 7782298 7825700 7834241 7809185 7753407 7670285 7562562
60072G562562j29981j49501j66133j80387j92319k01090k06346k08755k08477
$$ 7562562 7432581 7283080 7116947 6936560 6744241 6543151 6336805 6128050 5919573
60063E919573k04349j95650j83551j69672j54174j36542j17289r7561p7651n7239
$$ 5919573 5715224 5519574 5336023 5166351 5012177 4875635 4758346 4660785 4583134 4525895
60053D525895l6554j6160M087K4765M5867O6900Q7555J07467J25674J41017J52614
$$ 4525895 4489341 4473181 4477268 4502033 4547900 4614800 4702355 4809822 4935496 5076513 5229127
60042E229127J59441J60211J54465J42963J26427J04776P8487M9542J9860j0298
$$ 5229127 5388568 5548779 5703244 5846207 5972634 6077410 6155897 6205439 6225299 6215001
60032F215001m1169p1625r9738j24481j45457j61652j71936j76444j76132j71402
$$ 6215001 6173832 6102207 6002469 5877988 5732531 5570879 5398943 5222499 5046367 4874965
60022D874965j62408j50250j36440j21394j04710q6706o8502n0719l3199j5758
$$ 4874965 4712557 4562307 4425867 4304473 4199763 4113057 4044555 3993836 3960637 3944879
60012C944879J895K0640M1231O3195Q5440J07600J29892J52014J73276J93291
$$ 3944879 3946774 3967414 4008645 4071840 4157280 4264880 4394772 4546786 4720062 4913353
60002D913353K11223K24771K31250K29568K20062K02944J78489J48511J15871
$$ 4913353 5124576 5349347 5580597 5810165 6030227 6233171 6411660 6560171 6676042
59993F676042Q2201M7403J1547k4168n8629r1671j23038j51289j74359j90691
$$ 6676042 6758243 6805646 6817193 6793025 6734396 6642725 6519687 6368398 6194039 6003348
59983F003348j99710k01793j97901j88736j74353j55173j32944j09746q6256o1994
$$ 6003348 5803638 5601845 5403944 5215208 5040855 4885682 4752738 4642992 4556736 4494742
59973D494742l7062j2532J0910L3469N5131P5075R2566J07569J20110J29753J36097
$$ 4494742 4457680 4445148 4456058 4489527 4544658 4619733 4712299 4819868 4939978 5069731 5205828
59962E205828J39196J39130J35482J27639J15520J00023Q2825O5493M8497L1529
$$ 5205828 5345024 5484154 5619636 5747275 5862795 5962818 6045643 6111136 6159633 6191162
59952F191162J4915J07j1617k0076k5183k5873k1078j1146K896K1060M4242P2618
$$ 6191162 6206077 6206184 6194567 6174491 6149308 6123435 6102357 6091211 6094107 6115167 6159409 6232027
59940F232027J05298J41485J80988K23618K68965L16571L65549M14066M59934
$$ 6232027 6337325 6478810 6659798 6883416 7152381 7468952 7834501 8248567 8708501
59931H708501N01183N35136N57207N61853N44839N04104M39115L50846K42643
$$ 8708501 9209684 9744820 10302027 10863880 11408719 11912823 12351938 12702784 12945427
59922A2945427J20313q694j35942k52866l52673m31745m88811n23474n36641n31574
$$ 12945427 13065740 13057046 12921104 12668238 12315565 11883820 11395009 10871535 10334894 9803320
59912I803320n12772m83663m46493m04011l59441l14598k69487k24204j79880
$$ 9803320 9290548 8806885 8360392 7956381 7596940 7282342 7012855 6788651 6608771
59903F608771j37382r6281n5747j5599K3915O2542R9813J35080J68043J98497
$$ 6608771 6471389 6375108 6319361 6303762 6327677 6390219 6490032 6625112 6793155 6991652
59893F991652K25362K46497K59604K62634K53548K30599J93344J42892Q1296J1479
$$ 6991652 7217014 7463511 7723115 7985749 8239297 8469896 8663240 8806132 8887428 8898907
59883H898907o2401j35388k02913k61448l08463l42711l64437l74542l73753l63183
$$ 8898907 8836506 8701118 8498205 8236757 7928294 7585583 7221146 6846604 6472851 6109668
59873F109668l45218l22739k97603k70692k43053k15846j89384j63468j38627
$$ 6109668 5764450 5441711 5144108 4873416 4630363 4414517 4225133 4061665 3923038
59864C923038j15999r6048p8502o3517n1846m3895l9533l8704m1146m5515m9898
$$ 3923038 3807039 3710991 3632489 3568972 3517126 3473231 3433698 3394994 3353848 3308333 3258435
59853C258435n3164n4953n4665n1689m6380l9571l1254k1105j0194o70O192J0249
$$ 3258435 3205271 3150318 3095653 3043964 2997584 2958013 2926759 2905654 2895460 2894790 2900982 2911231
59841B911231J0802O508k641j4652k7288l9202m9159n5729n8564n8730n7142n3650
$$ 2911231 2922033 2928541 2925900 2911248 2883960 2844758 2795599 2739870 2681306 2622576 2565434 2511784
59829B511784m8133m1316l3912k5981j7630r372j282P255J6497K5906L4998M3566
$$ 2511784 2463651 2422335 2388423 2362442 2344812 2335440 2334158 2341413 2357910 2383816 2418814 2462380
59817B462380N0885N5950N9042O1848O5488O9490P3213P6975Q0748Q2786Q0589
$$ 2462380 2513265 2569215 2628257 2690105 2755593 2825083 2898296 2975271 3056019 3138805 3219394
59806C219394P2902O0230M4131K6674J0001m380j5810k3943k8558k9854k8267
$$ 3219394 3292296 3352526 3396657 3423331 3433332 3428952 3413142 3389199 3360641 3330787 3302520
59795C302520k3910j6898q115J359J1577K3522L7469N2730O9133Q7470J08280
$$ 3302520 3278610 3261712 3253597 3254956 3266533 3290055 3327524 3380254 3449387 3536857 3645137
59784C645137J31473J57591J88051K23601K63597L07413L55220M06342M57223
$$ 3645137 3776610 3934201 4122252 4345853 4609450 4916863 5272083 5678425 6135648
59775F135648N01036N28045N26189M83897L95551K66038J10692m9140j92440l04507
$$ 6135648 6636684 7164729 7690918 8174815 8570366 8836404 8947096 8897956 8705516 8401009
59765H401009l79874m20458m31142m17499l86441l45986l02592k59463k18041
$$ 8401009 8021135 7600677 7169535 6752036 6365595 6019609 5717017 5457554 5239513
59756E239513j79842j45937j15930q8815o4264m2246k2161l289J4484L1207M7551
$$ 5239513 5059671 4913734 4797804 4708989 4644725 4602479 4580318 4577029 4591513 4622720 4670271
59745D670271O4176Q0962R7561J14188J31289J48980J67405J87118K08543K31526
$$ 4670271 4734447 4815409 4912970 5027158 5158447 5307427 5474832 5661950 5870493 6102019
59735F102019K55909K82126L10911L42865L78473M17945M60759N05881N52450
$$ 6102019 6357928 6640054 6950965 7293830 7672303 8090248 8551007 9056888 9609338
59726I609338N99471O44817O85379P18150P40220P47966P38051P09868O66121
$$ 9609338 10208809 10853626 11539005 12257155 12997375 13745341 14483392 15193260 15859381
59717A5859381O10977N49318M88003M35620L99261L82133L84762M06970M47476
$$ 15859381 16470358 17019676 17507679 17943299 18342560 18724693 19109455 19516425 19963901
59708A9963901N02647N66994O34336O97921P50456P85165P96333P78696P27874
$$ 19963901 20466548 21033542 21667878 22365799 23116255 23901420 24697753 25476449 26204323
59699B6204323O42906N27772L89757K37263P9857p1344k05619l15316l96268m46546
$$ 26204323 26847229 27375001 27764758 28002021 28081878 28010534 27804915 27489599 27093331 26646785
59689B6646785m66044m56783m22409l67151k95308k10814j16451j3777R6013K12020
$$ 26646785 26180741 25723958 25301549 24934398 24639090 24428276 24311825 24298048 24394061 24606081
59679B4606081L34622M65108O03305P46304Q90020J030504J162299J276131J359252
$$ 24606081 24940703 25405811 26009116 26755420 27645440 28675944 29838243 31114374 32473626
59670C2473626J397636J377438J286175J115504Q64872N43926J72777k19995o02167
$$ 32473626 33871262 35248700 36534875 37650379 38515251 39059177 39231954 39011959 38409792
59661C8409792r44273j224205j428553j552626j600191j581390j508899j395784
$$ 38409792 37465519 36241314 34812761 33260135 31659944 30078554 28569655 27173871
59653B7173871j256217j105902r60325q33681p39871o91589o94950p44321q23103
$$ 27173871 25917654 24811752 23851427 23017746 22277875 21586286 20891336 20147015 19323912
59644A9323912r09618r83387j029883j043501j026919r86572r28718q59411p85446
$$ 19323912 18414294 17430907 16401024 15357523 14330604 13344032 12415314 11555903 10770457
59635A0770457p12483o42768n76441n14610m59284m10906l67939l28948k93622
$$ 10770457 10057974 9415206 8838765 8324155 7864871 7453965 7086026 6757078 6463456
59626F463456k61747k32620k05686j80782j57777j36674j17792j01044q5545p0836
$$ 6463456 6201709 5969089 5763403 5582621 5424844 5288170 5170378 5069334 4983789 4912953
59616D912953n7843m7711m0339l5163l2588l3384l7366m3865n2889o4356p6811
$$ 4912953 4855110 4807399 4767060 4731897 4699309 4665925 4628559 4584694 4531805 4467449 4390638
59605D390638q8303r8024j05836j10847j12180j10633j07823j03993r8228r0634
$$ 4390638 4302335 4204311 4098475 3987628 3875448 3764815 3656992 3552999 3454771 3364137
59595C364137q2485p4273o5355n5679m6218l7428k8707j9772j1313l843K989R533
$$ 3364137 3281652 3207379 3142024 3086345 3040127 3002699 2973992 2954220 2942907 2939064 2942053 2951586
59583B951586J5561K0798K5169K8370L0022L0380L0082K9144K7076K4028K1051
$$ 2951586 2967147 2987945 3013114 3041484 3071506 3101886 3131968 3161112 3188188 3212216 3233267
59572C233267J9138J8730K0051K3182K7863L3845M1257N0041N9401O8627P8073
$$ 3233267 3252405 3271135 3291186 3314368 3342231 3376076 3417333 3467374 3526775 3595402 3673475
59561C673475Q8433R9566J10967J23050J36848J52758J70524J90055K11135K32761
$$ 3673475 3761908 3861474 3972441 4095491 4232339 4385097 4555621 4745676 4956811 5189572
59551E189572K53979K75003K96257L16645L34139L47771L57584L62859L62038
$$ 5189572 5443551 5718554 6014811 6331456 6665595 7013366 7370950 7733809 8095847
59542H095847L54699L42122L25596L05584K83002K60049K38771K19193J99286
$$ 8095847 8450546 8792668 9118264 9423848 9706850 9966899 10205670 10424863 10624149
59533A0624149J76609J50436J23078R9130Q2661P5132P6212Q5494J02082J23090
$$ 10624149 10800758 10951194 11074272 11173402 11256063 11331195 11407407 11492901 11594983 11718073
59523A1718073J44155J61416J71747J71509J56962J26423Q0865K2253m7340j24732
$$ 11718073 11862228 12023644 12195391 12366900 12523862 12650285 12731150 12753403 12706063 12581331
59513A2581331k05227k83996l57180m21470m73756n11862n35024n43614n39067
$$ 12581331 12376104 12092108 11734928 11313458 10839702 10327840 9792816 9249202 8710135
59504H710135n24078n01724m73986m41739m06090l68873l31747k95717k61626
$$ 8710135 8186057 7684333 7210347 6768608 6362518 5993645 5661898 5366181 5104555
59495E104555k30167k01348j74773j50465j28617j08690q9820p2048n5914m0945
$$ 5104555 4874388 4673040 4498267 4347802 4219185 4110495 4020675 3948627 3892713 3851768
59485C851768k5831j0193N160J9976L5171N1262O7601Q3873J01078J20106J40257
$$ 3851768 3825937 3815744 3820904 3840880 3876051 3927313 3994914 4078787 4179865 4299971 4440228
59474D440228J60271J80206K01325K24388K48815K73276K96316L16252L30952
$$ 4440228 4600499 4780705 4982030 5206418 5455233 5728509 6024825 6341077 6672029
59465F672029L38061L35629L22386K97325K59285K07763J44483P3529o69p4925
$$ 6672029 7010090 7345719 7668105 7965430 8224715 8432478 8576961 8650490 8649821 8574896
59455H574896j46468k11614k66516l09045l38976l56813l63535l61187l52340
$$ 8574896 8428428 8216814 7950298 7641253 7302277 6945464 6581929 6220742 5868402
59446E868402l38701l21021l00280k78027k55520k33368k12041j91966j73151
$$ 5868402 5529701 5208680 4908400 4630373 4374853 4141485 3929444 3737478 3564327
59437C564327j55426j38954j23893j09895r6575q4149p2845o2250n2150m3357
$$ 3564327 3408901 3269947 3146054 3036159 2939584 2855435 2782590 2720340 2668190 2624833
59427B624833l6480l0454k3683j6291r803m802l70M153Q365J1896J5038J7996
$$ 2624833 2588353 2557899 2534216 2517925 2508122 2503320 2502950 2507103 2515468 2527364 2542402 2560398
59415B560398K0704K3602K7644L3296M0167M7219N2498N3250M8092L9160L0915
$$ 2560398 2581102 2604704 2632348 2665644 2705811 2753030 2805528 2858778 2906870 2946030 2976945
59404B976945K6707K7372L2608M1964N4580O9620Q7047J06400J24755J37974J44891
$$ 2976945 3003652 3031024 3063632 3105596 3160176 3229796 3316843 3423243 3547998 3685972 3830863
59393C830863J49060J55835J68807J89159K16732K50570K89360L32187L78578
$$ 3830863 3979923 4135758 4304565 4493724 4710456 4961026 5250386 5582573 5961151
59384E961151M27840M79080N31563N83787O32153O71807O98783P10311P03724
$$ 5961151 6388991 6868071 7399634 7983421 8615574 9287381 9986164 10696475 11400199
59375A1400199O77467O33694N77964N15632M49886L83624L21013K65732K18678
$$ 11400199 12077666 12711360 13289324 13804956 14254842 14638466 14959479 15225211 15443889
59366A5443889J78385J42582J08579P3287L4129j0411o1400j19559j83932k51038
$$ 15443889 15622274 15764856 15873435 15946722 15980851 15970440 15909040 15789481 15605549 15354511
59356A5354511l15737l72388m15537m41187m48471m39558m17952l87797l54643
$$ 15354511 15038774 14666386 14250849 13809662 13361191 12921633 12503681 12115884 11761241
59347A1761241l24868l03198k91484k90011k98573l15596l37649l60739l81523
$$ 11761241 11436373 11133175 10841691 10551680 10253107 9937511 9599862 9239123 8857600
59338H857600l97137m05375m05897m00059l88831l71824l49106l22705k95411
$$ 8857600 8460463 8055088 7649191 7249132 6860301 6488477 6139371 5816666 5521255
59329E521255k68734k42774k17250j92073j67565j44733j24652j07218r1220p5892
$$ 5521255 5252521 5009747 4792497 4600424 4432859 4288126 4163474 4056256 3965036 3889144
59319C889144o1529m8411l6139k4349j3072k106R000K0109L0633M0635N0750O0985
$$ 3889144 3827615 3779204 3743065 3718716 3705644 3703538 3712538 3732647 3763280 3803915 3854665 3915650
59307C915650P0869Q0728R1227J01621J10120J16269J21114J24606J24860J20736
$$ 3915650 3986519 4067247 4158474 4260095 4370215 4486484 4607598 4732204 4857064 4977800
59297D977800J13223J03393R0817P5226N7950M0482K3100O276p999j7771k2903
$$ 4977800 5091023 5194416 5285233 5360459 5418409 5458891 5481991 5488267 5480268 5462497 5439594
59286E439594k4052k1064j3753l152R461K4009M0909N9701P9483R9716J19539
$$ 5439594 5415542 5394478 5380725 5377573 5387034 5411043 5451952 5511653 5591136 5690852 5810391
59275E810391J37152J50999J60670J65622J64145J54968J39064J18334R3075O2062
$$ 5810391 5947543 6098542 6259212 6424834 6588979 6743947 6883011 7001345 7094420 7156482
59265G156482K5015j6037n7369r4722j24337j44040j53517j53481j45138j30513
$$ 7156482 7181497 7165460 7108091 7013369 6889032 6744992 6591475 6437994 6292856 6162343
59255F162343j12093r1511o9374m6775k5755p661P755K0824L0761L6809L9313
$$ 6162343 6050250 5958739 5889365 5842590 5816835 5809174 5816929 5837753 5868514 5905323 5944636
59244E944636L8791L5159K9031K2509J7484J4251J2960J5283K3147L6676N4849
$$ 5944636 5983427 6018586 6047617 6070126 6087610 6101861 6114821 6130104 6153251 6189927 6244776
59233F244776P7578J05730J39618J78680K22230K69307L18049L65914M09999M46412
$$ 6244776 6322354 6428084 6567702 6746382 6968612 7237919 7555968 7921882 8331881 8778293
59223H778293M70112M76423M62526M27122L69834K91906J96714Q8671k7739j47097
$$ 8778293 9248405 9724828 10187354 10614476 10984310 11276216 11472930 11561601 11533862 11386765
59213A1386765k62457l66821m54945n23296n69623n93789n98233n86397n61242
$$ 11386765 11124308 10757487 10302542 9779246 9209623 8615834 8017601 7431204 6869962
59204F869962n25849m84280m40508l97018l55245l16447k81173k48923k19438
$$ 6869962 6344113 5859833 5419325 5022307 4667062 4350615 4069442 3820519 3601081
59195C601081j93517j71504j52041j33562j16347j01738r0083q0555p2470o5567
$$ 3601081 3407564 3236060 3084019 2950457 2834110 2732372 2642289 2561734 2489264 2423697
59185B423697n9493n4029m9340m5318m1295l7103l3434l0407k6847k1968j6670
$$ 2423697 2364204 2310175 2260835 2215517 2174222 2137119 2103685 2073278 2046431 2024463 2007793
59174B007793j2127q131l971L8L253O079R451J3639J8480K3857K9060L2832L5206
$$ 2007793 1995666 1987535 1983564 1983602 1986855 1992934 2002385 2016024 2034504 2058361 2087421 2120253 2155459
59161B155459L8109M2869M8327N2808N6649O1243O6680P2170P7859Q4365R1198
$$ 2155459 2193568 2236437 2284764 2337572 2394221 2455464 2522144 2594314 2672173 2756538 2847736
59150B847736R7412J03288J09779J16717J22960J27832J31027J31723J29219J23851
$$ 2847736 2945148 3048436 3158215 3274932 3397892 3525724 3656751 3788474 3917693 4041544
59140D041544J16047J05123R0363P2617N3555L4139J5088k160j6496k8292l7941
$$ 4041544 4157591 4262714 4353077 4425694 4479249 4513388 4528476 4526316 4509820 4481528 4443587
59129D443587m4193m5680m3149l8347l1417k1337q196O971K4100M3802O5448Q7549
$$ 4443587 4399394 4353714 4310565 4272218 4240801 4219464 4211268 4218239 4242339 4286141 4351589 4439138
59117D439138J09818J33077J57368J81864K06368K31096K55062K76423K94101
$$ 4439138 4548956 4682033 4839401 5021265 5227633 5458729 5713791 5990214 6284315
59108F284315L07455L14432L11876K97602K70772K30661J77274J13499M5133k1630
$$ 6284315 6591770 6906202 7218078 7515680 7786452 8017113 8194387 8307886 8353019 8331389
59098H331389q1742j31108j67027j89468k00635k03091j99203j91985j84629j78912
$$ 8331389 8249647 8118539 7951512 7762044 7561409 7358318 7159115 6967130 6782501 6603589
59088F603589j75125j73526j74683j78512j84199j91022j98170k04148k07621
$$ 6603589 6428464 6254938 6080255 5901743 5717544 5526522 5328352 5124204 4916583
59079D916583k08718k08376k06776k03512j98736j92814j85336j75934j65556
$$ 4916583 4707865 4499489 4292713 4089201 3890465 3697651 3512315 3336381 3170825
59070C170825j55594j46107j36341j26430j17058j07929r8266q8451p9643p2123
$$ 3170825 3015231 2869124 2732783 2606353 2489295 2381366 2283100 2194649 2115006 2042883
59060B042883o5424n9607n4886n0579m6034m1974l9291l7239l4743l2620l2320
$$ 2042883 1977459 1917852 1862966 1812387 1766353 1724379 1685088 1647849 1613106 1580486 1548166
59049A548166l3026l2409k9971k7274k4993k2221j8684j5216j1783p449k744J57
$$ 1548166 1515140 1482731 1452760 1425486 1400493 1378272 1359588 1344372 1332589 1325140 1322396 1322553
59037A322553L72n14q63p45o36q9J496M107P686J2280J7217K1259K3704K4463
$$ 1322553 1322925 1322411 1321548 1320803 1320167 1320078 1321574 1325681 1333367 1345647 1362864 1384123 1407827 1432290
59023A432290K3257K0089J6110J2488Q737L827j433n045o497o818o168l763j42
$$ 1432290 1455547 1475636 1491746 1504234 1512971 1516798 1515365 1510320 1503823 1497005 1490837 1487074 1486932
59010A486932K907N009P559J0999J3922J5414J6141J6429J5286J2194Q056L696
$$ 1486932 1489839 1494848 1502407 1513406 1527328 1542742 1558883 1575312 1590598 1602792 1610848 1614544
58998A614544r26n414q584j0117j0975j1591j1254r728p827n890l381n08J495
$$ 1614544 1613618 1608204 1599620 1589503 1578528 1566937 1555683 1545955 1538128 1532238 1528857 1528349 1529844
58985A529844K351L278M981O728Q003R339J0855J1715J1776J2151J3410J4760
$$ 1529844 1532195 1535473 1540454 1547182 1555185 1564524 1575379 1587094 1598870 1611021 1624431 1639191
58973A639191J5709J6996J9140K1535K3705K6043K8713L1204L3529L6310L9199
$$ 1639191 1654900 1671896 1691036 1712571 1736276 1762319 1791032 1822236 1855765 1892075 1931274
58962A931274M0813M0872M0757M1355M1945M1895M1793M2090M2277M2302M3265
$$ 1931274 1972087 2012959 2053716 2095071 2137016 2178911 2220704 2262794 2305071 2347373 2390638
58951B390638M5754M8799N1467N4244N8066O3121O9314P6718Q4912R3055J01177
$$ 2390638 2436392 2485191 2536658 2590902 2648968 2712089 2781403 2858121 2943033 3036088 3137265
58940C137265J10283J20695J31578J42428J53785J65985J78701J92060K07032
$$ 3137265 3247548 3368243 3499821 3642249 3796034 3962019 4140720 4332780 4539812
58931D539812K24218K43650K65939K92087L21854L53946L88241M26162M68482
$$ 4539812 4764030 5007680 5273619 5565706 5887560 6241506 6629747 7055909 7524391
58922G524391N14411N63411O16017O72195P30404P88828Q45875Q98674R42519
$$ 7524391 8038802 8602213 9218230 9890425 10620829 11409657 12255532 13154206 14096725
58913A4096725R72242R82790R68341R22868Q42581P26837N77201L98006J98262
$$ 14096725 15068967 16051757 17020098 17942966 18785547 19512384 20089585 20487591 20685853
58904B0685853r431k12979m02720n69940p06876q09767q79870r20404r34378r25935
$$ 20685853 20676422 20463443 20060723 19490783 18783907 17974140 17094270 16173866 15239488 14313553
58894A4313553r01010q64740q19760p68151p13129o57510o02371n48555m97822
$$ 14313553 13412543 12547803 11728043 10959892 10246763 9589253 8986882 8438327 7940505
58885G940505m51305m08528l69162l34086l03609k76453k51747k30313k12670
$$ 7940505 7489200 7080672 6711510 6377424 6073815 5797362 5545615 5315302 5102632
58876E102632j97480j83284j70159j58412j47215j35884j24921j14721j04731
$$ 5102632 4905152 4721868 4551709 4393297 4246082 4110198 3985277 3870556 3765825
58867C765825r5040q6956q0813p5022o8534o2364n7325n2267m6195m0219l5577
$$ 3765825 3670785 3583829 3503016 3427994 3359460 3297096 3239771 3187504 3141309 3101090 3065513
58856C065513l1324k5961j9867j4235q845k807L611R705J5946K3081L0535L7233
$$ 3065513 3034189 3008228 2988361 2974126 2965281 2962474 2966085 2975790 2991736 3014817 3045352 3082585
58844C082585M3379N0032N7498O5291P3055Q0570Q7597R4478J02121J10801J20057
$$ 3082585 3125964 3175996 3233494 3298785 3371840 3452410 3540007 3634485 3736606 3847407 3967464
58833C967464J30102J41920J55516J69688J84167K00177K18245K37442K57730
$$ 3967464 4097566 4239486 4395002 4564690 4748857 4949034 5167279 5404721 5662451
58824E662451K80958L08352L38955L71906M08325M49514M95125N44525N98215
$$ 5662451 5943409 6251761 6590716 6962622 7370947 7820461 8315586 8860111 9458326
58815I458326O56177P16222P75269Q30796Q79748R17541R39297R40516R15661
$$ 9458326 10114503 10830725 11605994 12436790 13316538 14234079 15173376 16113892 17029553
58806A7029553Q58412P65188O37211M78457K94073R2289j14603l13628m94561
$$ 17029553 17887965 18653153 19290364 19768821 20062894 20155183 20040580 19726952 19232391
58797A9232391o49467p71934q59335r14179r41052r43458r24946q90905q46802
$$ 19232391 18582924 17810990 16951655 16037476 15096424 14152966 13228020 12337115 11490313
58788A1490313p96035p41258o86008o32954n82134n32961m86512m44052m05056
$$ 11490313 10694278 9953020 9267012 8634058 8051924 7518963 7032451 6588399 6183343
58779F183343l68671l35487l05985k78928k53304k30214k10886j94626j80576
$$ 6183343 5814672 5479185 5173200 4894272 4640968 4410754 4199868 4005242 3824666
58770C824666j69516j61670j54766j46614j37847j29752j21413j11595j01585
$$ 3824666 3655150 3493480 3338714 3192100 3054253 2924501 2803088 2691493 2589908
58761B589908r3250q5913p7992p0152o3867n8171n1036m2921l5981l0568k5390
$$ 2589908 2496658 2410745 2332753 2262601 2198734 2140563 2089527 2046606 2010625 1980057 1954667
58750A954667k0386j6658j4078j1438q524n822k957L60K753K734J040p88l122
$$ 1954667 1934281 1917623 1903545 1892107 1883583 1877761 1874804 1875164 1877917 1880651 1881691 1880903 1877781
58737A877781p329j3041j8644k3459k7342k9228k8506k6820k6190k6277k5776
$$ 1877781 1870452 1857411 1838767 1815308 1787966 1758738 1730232 1703412 1677222 1650945 1625169
58726A625169k5281k6306k8471l0227l1511l3257l5184l6309l6740l6802l5589
$$ 1625169 1599888 1573582 1545111 1514884 1483373 1450116 1414932 1378623 1341883 1305081 1269492
58715A269492l2636k9630k8050k6562k3392j9728j7879j7464j6528j5120j4529
$$ 1269492 1236856 1207226 1179176 1152614 1129222 1109494 1091615 1074151 1057623 1042503 1027974
58704A027974j4124j2290r668q160p468o005m322m261n234m925l309k497k752
$$ 1027974 1013850 1001560 991892 983732 976264 970259 965937 961676 956442 951517 948208 945711 942959
58691I42959k138k23J085P17n60k431n475r070j1552j2678j3470j3731j2246r484
$$ 942959 940821 940598 941683 942400 941840 939409 933934 924864 913312 900634 887164 873433 861187 851703
58677H51703p356o293m931k705m03J747M087N792N581L979K731K259J937K286
$$ 851703 844347 838054 833123 830418 830015 831762 835849 841641 847222 851201 853932 856191 858128 860414
58663H60414M239O765P769P081O015M545J614k146m673n264m659l037l76J876
$$ 860414 864653 871418 879187 886268 892283 896828 898442 896296 891623 886359 881700 878663 878287 880163
58649H80163K367K417M310P716J0636J2919J5728J8323J8941J8358J9112K1462
$$ 880163 882530 884947 889257 896973 907609 920528 936256 954579 973520 991878 1010990 1032452
58637A032452K3522K5095K7875L1999L5875L9477M4442N0840N7161O3518P1577
$$ 1032452 1055974 1081069 1108944 1140943 1176818 1216295 1260737 1311577 1368738 1432256 1503833
58626A503833Q1257R0804J00261J11623J25559J41118J58561J79156K02170K25407
$$ 1503833 1585090 1675894 1776155 1887778 2013337 2154455 2313016 2492172 2694342 2919749
58616B919749K48457K71964K93811L09690L17173L15344L00789K68719K18834
$$ 2919749 3168206 3440170 3733981 4043671 4360844 4676188 4976977 5245696 5464530
58607E464530J56093Q5270R045o7856j37523j93997k36285k65088k80280k83004
$$ 5464530 5620623 5705893 5714938 5647082 5509559 5315562 5079277 4814189 4533909 4250905
58597D250905k76757k64497k47282k26793k06058j86567j67594j49293j33421
$$ 4250905 3974148 3709651 3462369 3235576 3029518 2842951 2675357 2526064 2392643
58588B392643j20207j07753r5530q5122p6544o7234n6053m5085l6116k8335k0818
$$ 2392643 2272436 2164683 2069153 1984031 1907487 1840253 1784200 1739115 1702999 1674664 1653846
58577A653846j4447j0035p152n821o774r209j1086j2230j4142j6273j5859j2240
$$ 1653846 1639399 1629364 1622212 1616391 1609617 1600408 1589322 1577092 1562950 1546677 1530818 1518578
58565A518578q014n016k531n64j288n820j2542j9795k7292l3882l7168l6667l4439
$$ 1518578 1510564 1505548 1503017 1502453 1501165 1495345 1482803 1463008 1435716 1401834 1364666 1327999 1293560
58552A293560l1735k7839k2894j8588j5304j1870q818q310j0103j1364j1359j2415
$$ 1293560 1261825 1233986 1211092 1192504 1177200 1165330 1156512 1148202 1138099 1126735 1115376 1102961
58540A102961j5239j7363j7629j8084j9790k0719j9644j8352j8052j7187j4843
$$ 1102961 1087722 1070359 1052730 1034646 1014856 994137 974493 956141 938089 920902 906059
58529I06059j2833j2414j2288j1646j1899j3509j4453j3772j3330j4198j4550
$$ 906059 893226 880812 868524 856878 844979 831470 817017 803245 789915 775717 761167
58518G61167j3096j1375j0688r869p970o137n046l520j336k76q06q11P59K255
$$ 761167 748071 736696 726008 716139 708169 702032 696986 693466 692130 691854 691048 690237 690996 693251
58504F93251K737L661N639O994P153Q004J0311J2247J2997J4163J6124J6900J6322
$$ 693251 695988 699649 705288 712282 719435 727439 737750 749997 762994 777157 793281 810181 826503
58491H26503J7280K0889K4266K5062K4399K3477K1333J7932J5356J3759J0267
$$ 826503 843783 864672 888938 914000 938399 961876 983209 1001141 1016497 1030256 1040523
58480A040523M028j920o012j0769j7447k2707k3846k3139k3607k4361k3502k2012
$$ 1040523 1044551 1042631 1036619 1025850 1008403 985696 961850 938711 915104 890743 867241 845229
58468H45229k1309k0237j7718j5359j4517j3716j1703r917r542r337q598q728
$$ 845229 823920 803683 785965 770606 756089 742373 730670 720753 711211 701874 693276 684548
58456F84548r644q591m911k040k107k741j754p63j241j273O28K583L332M959Q623
$$ 684548 674904 666313 661402 659362 657255 654514 652760 651997 650756 649483 650111 652694 656026 660985 669608
58441F69608J1843J3107J4835J8483K1214K0974K0276K1210K1140J7394J2016
$$ 669608 681451 694558 709393 727876 749090 770064 790340 811550 832690 850084 862100
58430H62100P881M251J00k469k171j762l246m054k093k00j207k946k779k646m839
$$ 862100 869981 874232 874332 871863 869692 867930 864684 860630 858537 858337 857130 854184 851405 848759 843920
58415H43920o816n482k837k277k716j334J178K898M867Q389J1342J1563J0615
$$ 843920 837104 831622 828785 826508 823792 822458 823636 826534 831401 839790 851132 862695 873310
58402H73310J0130Q111L161j704l843n488q930j1634j1004r654j0612j1594r483
$$ 873310 883440 891551 894712 893008 889165 883677 874747 863113 852109 842455 831843 820249 810766
58389H10766o402n645n547l195m47m55j671j054J07p40k039j263K3l74l11K717
$$ 810766 804364 798719 793172 789977 789530 789075 787404 786350 786457 785717 783678 782415 782438 782064 781753 784470
58373G84470O319P403P770J0091J2267J1516J0037J0782J1644R781P560Q158R430
$$ 784470 790789 798192 805962 816053 828320 839836 849873 860655 872299 882080 889640 897798 907228
58360I07228Q285O849Q001R351Q179P671J1276J5560J5899J4667J6129J7768J4779
$$ 907228 915513 922362 930363 939714 947893 955564 966840 982400 998299 1012966 1029095 1046863 1061642
58347A061642R017N281K604k444p587q495p117p997r574p491l307j532j123J750
$$ 1061642 1070659 1075940 1078544 1076100 1068513 1060018 1052901 1044904 1035330 1027839 1024532 1023000 1021877 1023627
58333A023627N609O705O843R847J3450J3224J1308J2615J5612J5553J3634J4224
$$ 1023627 1029236 1035941 1042784 1052631 1066081 1079305 1090613 1103228 1118840 1134393 1148027 1162251
58321A162251J6200J5864J5050J7498K0664K0152J8614K0942K4538K3930K1084
$$ 1162251 1178451 1194315 1209365 1226863 1247527 1267679 1286293 1307235 1331773 1355703 1376787
58310A376787K1079K1547J7002R968O994P029M604J124J821M834M633L119O022
$$ 1376787 1397866 1419413 1436415 1446383 1453377 1460406 1465010 1466134 1467955 1472789 1477422 1480541 1486563
58297A486563J1398J3220J3050J6349K0734K0126J7212J9104K3846K4233K1858
$$ 1486563 1497961 1511181 1524231 1540580 1561314 1581440 1598652 1617756 1641602 1665835 1687693
58286A687693K4001K9462L1230L0572L4518M1682M4770M4871M9076N5985N8066
$$ 1687693 1711694 1741156 1772386 1802958 1837476 1879158 1923928 1968799 2017875 2073860 2131926
58275B131926N6261N7698O0995N8682N2139M8999M7941M1553L1992K7860K7917
$$ 2131926 2188187 2245885 2306880 2365562 2417701 2466700 2514641 2556194 2588186 2616046 2643963
58264B643963K4278J9341K2368L1413L6327L7618M4196N4533N9014N9172O4935
$$ 2643963 2668241 2687582 2709950 2741363 2777690 2815308 2859504 2914037 2973051 3032223 3097158
58253C097158P4296P6031P1519P3062Q1229Q5244Q5111R1239J02195J05698J02260
$$ 3097158 3171454 3247485 3319004 3392066 3473295 3558539 3643650 3734889 3837084 3942782 4045042
58242D045042J04911J14714J19932J20141J27112J40705J48668J51439J61727
$$ 4045042 4149953 4264667 4384599 4504740 4631852 4772557 4921225 5072664 5234391
58233E234391J78521J87853J90520K01592K21191K34308K41056K57166K82940
$$ 5234391 5412912 5600765 5791285 5992877 6214068 6448376 6689432 6946598 7229538
58224G229538L02866L17685L43980L80054M06972M25707M56832N01093N39249
$$ 7229538 7532404 7850089 8194069 8574123 8981095 9406802 9863634 10364727 10903976
58215A0903976N73524O27358P00419P68352Q31537R16925J026961J137788J253598
$$ 10903976 11477500 12104858 12805277 13573629 14405166 15322091 16349052 17486840 18740438
58206A8740438J407474J601861J808443K034959K327077K696521L121218L627395
$$ 18740438 20147912 21749773 23558216 25593175 27920252 30616773 33737991 37365386
58198C7365386M291093N148444O197522P500315R173886J1269624J3800036J6916065
$$ 37365386 41656479 46804923 53002445 60502760 69676646 80946270 94746306 111662371
58190A11662371K0917624K6090908L2719350M1079958N0661487N8825345O0788987
$$ 111662371 132579995 158670903 191390253 232470211 283131698 341957043 402746030
58183D02746030N2247115L2895087P387999j7404721l6247460m7287208n1265740
$$ 402746030 454993145 487888232 495276231 477871510 441624050 394336842 343071102
58176C43071102n0009373m5525801l9589734l3441774k7720934k2699376j8500446
$$ 343071102 293061729 247535928 207946194 174504420 146783486 124084110 105583664
58169A05583664j5108805j2373008j0137076q326508o879466n690627m677478
$$ 105583664 90474859 78101851 67964775 59638267 52758801 47068174 42390696
58162D2390696l826451l123283k503036j913215j361958q54852l39712K40168
$$ 42390696 38564245 35440962 32937926 31024711 29662753 28807901 28468189 28708357
58154B8708357Q98034J665294K630222L793937M868464N308687M643890K836840
$$ 28708357 29606391 31271685 33901907 37695844 42564308 47872995 52516885 55353725
58146E5353725L53379k107145l987119n072515n438159n277646m790489m153421
$$ 55353725 55707104 53599959 49612840 44540325 39102166 33824520 29034031 24880610
58138B4880610l503087k910885k393683j956085j605565j332996j111695r25351
$$ 24880610 21377523 18466638 16072955 14116870 12511305 11178309 10066614 9141263
58130I141263p75654o59068n60109m72997m06775l62385l26105k91851k68597
$$ 9141263 8365609 7706541 7146432 6673435 6266660 5904275 5578170 5286319 5017722
58121E017722k58881k50575k37032k25537k18520k05876j83901j63129j49181
$$ 5017722 4758841 4508266 4271234 4045697 3827177 3621301 3437400 3274271 3125090
58112C125090j33527j11405r1742q0904p2989o4490o2601p0174p7521p7812p6525
$$ 3125090 2991563 2880158 2788416 2707512 2634523 2570033 2507432 2437258 2359737 2281925 2205400
58101B205400p7729p5284o5949n7489n5179n3040m6595m1739m2898m4504m2267
$$ 2205400 2127671 2052387 1986438 1928949 1873770 1820730 1774135 1732396 1689498 1644994 1602727
58090A602727m1275m4945m7187m3464l8913l7985l6480l1258k7518k9055l0956
$$ 1602727 1561452 1516507 1469320 1425856 1386943 1348958 1312478 1281220 1253702 1224647 1193691
58079A193691k9090k7327k8675k8806k4993k2085k3091k3094j8873j5269j5704
$$ 1193691 1164601 1137274 1108599 1079793 1054800 1032715 1009624 986530 967657 952388 936684
58068I36684j5639j1879r123j0722j1931r078o606q263r859p572n173o286p480
$$ 936684 921045 909166 900043 889321 877390 868312 861706 853443 843584 836012 830839 824553 817073
58055H17073n761n056q532j2073j1937j1437j3602j4675j1478p978p927p991m676
$$ 817073 811312 806256 797724 785651 773714 762277 748675 734000 722522 714544 706617 698626 693950
58042F93950j202j043j376P60K376R06j3K730N639N472N436Q326J0129P145L130
$$ 693950 692748 691705 690329 691089 693465 694371 694358 697088 702727 708199 713635 721961 732090 739235 742365
58027G42365K590L116J101r10M01K158P01j237K28K736K295O03J057J994M78j479
$$ 742365 744955 748071 749172 748262 748663 750821 751522 750285 750513 753249 755544 756147 757204 759198 759676 758197
58011G58197r09J02j404l200k135m05j388l166k258j66j94j326j012o16k500n013
$$ 758197 757288 757390 755986 752786 750651 750246 748858 745692 743434 743268 743074 741748 740736 740120 737620 732607
57995G32607n762o471r311j1961j1610j0319j1129j2348j0942q250p065o434m396
$$ 732607 726845 720374 711063 699102 687492 677173 666044 653696 642754 634504 627439 621005 616609
57982F16609k493k566k523k26J963J574J106L586O707O882N571N948O694M831
$$ 616609 614116 611550 609027 608801 610764 612338 613444 617030 623737 630619 636190 642138 648832 653663
57968F53663J664K04m59k628m704l967k072k340l948m057l247l730m596l889k963
$$ 653663 655327 655531 655072 652444 647740 643773 641701 639361 635413 631356 628109 624379 619783 615894 612931
57953F12931l866m934l842k344l007m063k688n97r57k348j394J004J592O89O85
$$ 612931 609065 604131 600289 597945 594938 590875 588187 587590 586633 584285 582891 583895 585487 586176 586861
57938E86861P59j343m215m904m374n449p198o770n151n638p983r371r769j1111
$$ 586861 587620 586277 582062 577158 572784 567335 560137 553367 548216 542578 534595 525224 515455 504344
57924E04344j2541j1662r345q190p514m871j208N55R13K585N138N916N317O007
$$ 504344 491803 480141 470796 462606 455092 450221 449013 449568 450481 453066 458204 464120 469437 475444
57910D75444P722P905O787O955Q500R288R246R827J0099Q140N459N219O827O995
$$ 475444 483166 491071 497858 504813 513313 522601 531847 541674 551773 559913 565372 570591 577418 584413
57896E84413N441M591M431K732o1j211q44j781m320n899n999o765q538r211q330
$$ 584413 589854 594445 598876 601608 601547 600336 599492 597711 593391 587492 581493 574728 566190 556979 548649
57881E48649p706p694o838n263m609m615l625k146k061k643j430J276K881L128
$$ 548649 540943 533249 526411 521148 516539 511924 508299 506153 504092 501449 500019 501295 504176 507304
57867E07304M077N777O269N699O129P246O667M553L659M485M557K912J312N72
$$ 507304 511381 517158 523427 529126 535255 542501 549168 553721 557380 561865 566422 569334 570646 571218
57853E71218l79j478j378o16j167k705k938j806j449k113j968j085j440k863l078
$$ 571218 570839 569361 567983 567367 566200 563495 560557 558751 557302 555189 553221 552136 550696 547833 544755
57838E44755k045k100l440l813l004l306m914n374m391m711p116q914q785q881
$$ 544755 542710 540610 537170 533357 530353 527047 522133 516759 512368 507657 500541 491627 482842 473961
57824D73961j0525j1805j1258j0333j0314j0089q799p639p440p159o192n460n074
$$ 473961 463436 451631 440373 430040 419726 409637 400838 393199 385759 378600 372408 366948 361874
57811C61874l729j546o46j763k984k913k290j704n24R18J101K12M15K250L704
$$ 361874 358145 356599 355953 354190 351206 348293 346003 344299 343775 344693 345794 346006 346421 348671 352375
57796C52375L923M796P681J1326J4312J6764J8447J7862J4592J0227N958J529
$$ 352375 356298 361094 368775 380101 394413 411177 429624 447486 462078 472305 478263 479792
57784D79792k676n169n817o223o933o781n689n245n744n543m265l743m762n657
$$ 479792 477116 471947 466130 459907 452974 446193 440504 435259 429515 423972 419707 415964 411202 405545
57770D05545n269m569m330l838k897k477k439j268J006K399K270K268L118L487
$$ 405545 400276 395707 391377 387539 384642 382165 379726 378458 379464 381863 384133 386401 389519 393006
57756C93006L031L492N455O939O657N841N608N134L882K951K885K646J921J905
$$ 393006 396037 399529 404984 411923 418580 424421 430029 435163 439045 441996 444881 447527 449448 451353
57742D51353K821L352L425M612O729P276N524L920L983M136L242K872M029M908
$$ 451353 454174 457526 460951 465563 472292 479568 485092 489012 492995 497131 500373 503245 507274 512182
57728E12182M221L829N501P796Q661Q687R292R938R698R636J1145J3582J5675
$$ 512182 516403 520232 525733 533529 542190 550877 560169 570107 579805 589441 600586 614168 629843
57715F29843J7625J9904K1627K2066K2104K2649K3290K3943K5737K8805L1444
$$ 629843 647468 667372 688999 711065 733169 755818 779108 803051 828788 857593 889037
57704H89037L3081L5744M0732M6284N0613N4924O1219O9249P7926Q7763R9623
$$ 889037 922118 957862 998594 1044878 1095491 1150415 1211634 1280883 1358809 1446572 1546195
57693A546195J12880J27000J43208J62413J83307K04614K27313K52293K77459
$$ 1546195 1659075 1786075 1929283 2091696 2275003 2479617 2706930 2959223 3236682
57684C236682K99282L15358L23125L18059K96100K56975K03250J37919O5328p113
$$ 3236682 3535964 3851322 4174447 4492506 4788606 5045581 5248831 5386750 5452078 5444965
57674E444965p1144j21192j54366j68782j64183j42883j08376o5336k3685J25
$$ 5444965 5373821 5252629 5098263 4929481 4765298 4622415 4514039 4448703 4425018 4425143
57664D425143q634n1734j16256j83322k37441k70145k79972k70949k49467k21133
$$ 4425143 4416509 4364775 4248519 4065197 3827756 3557611 3277639 3006690 2757223 2536090
57654B536090j90247j60523j34229j11200r0368p1869n6460m3754l2680k2970
$$ 2536090 2345843 2185320 2051091 1939891 1849523 1777654 1721194 1677440 1644760 1621790
57644A621790j4726p224L89P933J5062K2388L0564L9249M8286N8657P0921Q3947
$$ 1621790 1607064 1599840 1600229 1608162 1623224 1645612 1676176 1715425 1763711 1822368 1893289 1977236
57632A977236R6800J10636J26984J45371J64407J84105K05065K26194K45033K59522
$$ 1977236 2074036 2184672 2311656 2457027 2621434 2805539 3010604 3236798 3481831 3741353
57622C741353K67800K67084K54445K28162J87373J32013O4965p037p6622j39190
$$ 3741353 4009153 4276237 4530682 4758844 4946217 5078230 5143195 5136158 5059536 4920346
57612D920346j92017k32062k57257k68945k70542k64392k51865k35360k17690
$$ 4920346 4728329 4496267 4239010 3970065 3699523 3435131 3183266 2947906 2730216
57603B730216j99817j81447j63299j46763j31844j17573j04089r2361q2320p3217
$$ 2730216 2530399 2348952 2185653 2038890 1907046 1789473 1685384 1593023 1510703 1437486
57593A437486o5396n9643n5138n0158m4650m0097l6932l3956l0421k6885k3906
$$ 1437486 1372090 1312447 1257309 1207151 1162501 1122404 1085472 1051516 1021095 994210 970304
57582I70304k1399j9371j7940j6633j4935j3294j2459j2019j0960r301p914o990
$$ 970304 948905 929534 911594 894961 880026 866732 854273 842254 831294 821993 814079 807089
57570H07089o011m884l945l024j671M0J794L603N291O221O489P402R631J1892
$$ 807089 801078 796194 792249 789225 787554 787594 789388 792991 798282 804503 810992 818394 828025 839917
57556H39917J2774J2850J3575J5166J7073J9462K2524K5314K7025K8615L1462
$$ 839917 852691 865541 879116 894282 911355 930817 953341 978655 1005680 1034295 1065757
57545A065757L5298L9164M3535M9617N7292O5606P4580Q4759R5747J06997J19251
$$ 1065757 1101055 1140219 1183754 1233371 1290663 1356269 1430849 1515608 1611355 1718352 1837603
57534A837603J33322J48301J62886J77521J92993K07616K18078K22402K19647
$$ 1837603 1970925 2119226 2282112 2459633 2652626 2860242 3078320 3300722 3520369
57525C520369K07401J82489J44451R6247M1627j6005p2181j21575j60474j87871
$$ 3520369 3727770 3910259 4054710 4150957 4192584 4176579 4104398 3982823 3822349 3634478
57515C634478k04106k10158k08137k00630j89253j75060j59931j45691j32233
$$ 3634478 3430372 3220214 3012077 2811447 2622194 2447134 2287203 2141512 2009279
57506B009279j18334j04231r1538q0800p1091o1967n3893m6714l9614l2634k6573
$$ 2009279 1890945 1786714 1695176 1614376 1543285 1481318 1427425 1380711 1341097 1308463 1281890
57495A281890k1353j6123j0871o287k227J974N985R124J2228J6776K2325K6983
$$ 1281890 1260537 1244414 1233543 1227256 1225029 1227003 1232988 1242112 1254340 1271116 1293441 1320424
57483A320424L0468L4543M0285M7042N4313O2657P2332Q2922R4622J08171J23181
$$ 1320424 1350892 1385435 1425720 1472762 1527075 1589732 1662064 1744986 1839608 1947779 2070960
57472B070960J38376J53507J69262J84984J98385K07534K11163K06855J91263
$$ 2070960 2209336 2362843 2532105 2717089 2915474 3123008 3334171 3541026 3732289
57463C732289J62816J22677P2877J5781m4170j00501j47800j83656k07463k19434
$$ 3732289 3895105 4017782 4090659 4106440 4062270 3961769 3813969 3630313 3422850 3203416
57453C203416k21420k16650k07463j94488j78578j61860j46089j31406j17395
$$ 3203416 2981996 2765346 2557883 2363395 2184817 2022957 1876868 1745462 1628067
57444A628067j04167r1875q0531p0686o2973n6697n0350m3823l8466l4712l1388
$$ 1628067 1523900 1432025 1351494 1280808 1217835 1161138 1110788 1066965 1028499 993787 962399
57433I62399k7746k4441k1887j9454j6906j5002j3935j2826j1398j0544j0515
$$ 962399 934653 910212 888325 868871 851965 836963 823028 810202 798804 788260 777745
57422G77745j0159q765p145o058n046l738k896l121l728l770l229k501j695j004
$$ 777745 767586 758821 751676 745618 740572 736834 733938 730817 727089 723319 720090 717589 715894 714890
57408G14890q02q75n48J98Q09J438K763M387M973M287L533L414L404L361L988
$$ 714890 714088 713213 712665 712863 713672 715110 717873 722260 727233 731520 735053 738467 741871 745232 749220
57393G49220N160N590M919M455N023N721N667N451N812O260O082N554N333N497
$$ 749220 754380 759970 764889 769344 774367 780088 785755 791206 797018 803278 809360 814914 820247 825744
57379H25744N875O343O426N735M968N235O214O521N962N747O221O399O108O427
$$ 825744 831619 837962 844388 850123 855091 860326 866540 873061 879023 884770 890991 897390 903498 909925
57365I09925P402P553O502N882O563P180O739O476P551Q832Q797Q014P897Q360
$$ 909925 917327 924880 931382 937264 943827 951007 957746 964222 971773 980605 989402 997416 1005313 1013673
57351A013673Q516Q548R103R808R935R694R560R247Q633Q645R871J1249J1578
$$ 1013673 1022189 1030737 1039840 1049648 1059583 1069277 1078837 1088084 1096717 1105362 1115233 1126482 1138060
57338A138060J1355J1768J2672J3069J2840J2679J2869J3250J3855J4534J4666
$$ 1138060 1149415 1161183 1173855 1186924 1199764 1212443 1225312 1238562 1252417 1266951 1281617
57327A281617J4164J3988J4729J5601J5806J5894J6597J7298J7016J6176J6021
$$ 1281617 1295781 1309769 1324498 1340099 1355905 1371799 1388396 1405694 1422710 1438886 1454907
57316A454907J6759J7536J7890J8101J8340J8453J8428J8500J8901J9834K1226
$$ 1454907 1471666 1489202 1507092 1525193 1543533 1561986 1580414 1598914 1617815 1637649 1658875
57305A658875K2434K2899K3182K4237K5651K5984K5241K5276K7071K9288L0482
$$ 1658875 1681309 1704208 1727390 1751627 1777278 1803262 1828503 1853779 1880850 1910138 1940620
57294A940620L1232L2741L4724L6198L7293L8903M1236M3891M6615M8961N0102
$$ 1940620 1971852 2004593 2039317 2075515 2112808 2151711 2192947 2236838 2283453 2332414 2382516
57283B382516N0011N0047N1284N3007N3750N3046N1244M8492M4905M0920L6599
$$ 2382516 2432527 2482574 2533858 2586865 2640615 2693661 2744905 2793397 2838302 2879222 2915821
57272B915821L1319K4988J8707J3525R370N870L216J559O47P60K779O580J0563
$$ 2915821 2947140 2972128 2990835 3004360 3013730 3019600 3022816 3024375 3025022 3025782 3028561 3035141 3045704
57259C045704J3619J6334J9424K2355K4505K6337K8370L0234L1696L3356L5249
$$ 3045704 3059323 3075657 3095081 3117436 3141941 3168278 3196648 3226882 3258578 3291934 3327183
57248C327183L6255L5920L5509L6063L6865L7055L7222L8079L8950L9088L9124
$$ 3327183 3363438 3399358 3434867 3470930 3507795 3544850 3582072 3620151 3659101 3698189 3737313
57237C737313L9764M0350M0117L9649L9668L9800L9878M0950M3413M5707M6614
$$ 3737313 3777077 3817427 3857544 3897193 3936861 3976661 4016539 4057489 4100902 4146609 4193223
57226D193223M7320M9254N1462N2211N1904N2046N2424N1700N0036M8731M7852
$$ 4193223 4240543 4289797 4341259 4393470 4445374 4497420 4549844 4601544 4651580 4700311 4748163
57215D748163M6303M3931M1598L9629L7893L7052L7906L9920M1897M3642M5596
$$ 4748163 4794466 4838397 4879995 4919624 4957517 4994569 5032475 5072395 5114292 5157934 5203530
57204E203530M7568M9271N1307N3967N5993N6202N5480N5481N6143N6307N5884
$$ 5203530 5251098 5300369 5351676 5405643 5461636 5517838 5573318 5628799 5684942 5741249 5797133
57193E797133N5504N4815N3073N0863M9319M8335M7222M6479M7017M8399M9624
$$ 5797133 5852637 5907452 5960525 6011388 6060707 6109042 6156264 6202743 6249760 6298159 6347783
57182F347783N0944N3045N5276N6683N7851N9624O0785N9448N6111N3013N0946
$$ 6347783 6398727 6451772 6507048 6563731 6621582 6681206 6741991 6801439 6857550 6910563 6961509
57171F961509M8907M6559M4699M3473M2284M1232M0713L9840L7361L3807L0735
$$ 6961509 7010416 7056975 7101674 7145147 7187431 7228663 7269376 7309216 7346577 7380384 7411119
57160G411119K8209K5000K0904J6751J2502P523K480j159l371n263o911p506p383
$$ 7411119 7439328 7464328 7485232 7501983 7514485 7522008 7524488 7523329 7519958 7514695 7507784 7500278 7492895
57147G492895p701q338q146p073o006m888l020q61O48K032M319O567O780M786
$$ 7492895 7485194 7476856 7468710 7461637 7455631 7450743 7447723 7446862 7447510 7449542 7453861 7460428 7467208 7471994
57133G471994J804k360q924j7171k4763l0928l6592m1227m2471l9390l3610k6715
$$ 7471994 7473798 7471438 7462514 7445343 7420580 7389652 7353060 7311833 7269362 7229972 7196362 7169647
57121G169647j8853j0412k857K723O024O325K925k912q221j0548q423m60J3812
$$ 7169647 7150794 7140382 7137525 7140248 7146272 7152597 7155522 7152610 7144389 7133841 7125418 7124958 7138770
57108G138770L2593N3607P6798J03374J33251J66175K04439K51694L09977L80901
$$ 7138770 7171363 7224970 7301768 7405142 7538393 7704568 7909007 8160701 8470678 8851579
57098H851579M68790N79195P15230Q78749J073760J304182J568472J859926K170876
$$ 8851579 9320369 9899564 10614794 11493543 12567303 13871485 15439957 17299883 19470759
57089A9470759K492094K809474L106454L368451L579337L715734L752135L669330
$$ 19470759 21962853 24772327 27878781 31247232 34826569 38542303 42294438 45963768
57081D5963768L448395L060513K483141J737970R02257O8773p04175j399879k013888
$$ 45963768 49412163 52472676 54955817 56693787 57596044 57664817 56960642 55560763 53546875
57072E3546875k534513k950077l258645l463552l567058l573533l493961l343211
$$ 53546875 51012362 48062285 44803640 41340088 37773030 34199497 30705536 27362325
57064B7362325l136139k888595k618404k341758k069893j810469j569982j353263
$$ 27362325 24226186 21337591 18719187 16377429 14307536 12497067 10927085 9573822
57056I573822j162294r96862q55477p35390o33287n46623m73541m11906l59705
$$ 9573822 8411528 7414666 6559189 5823799 5190512 4643889 4170348 3758442 3398737
57047C398737l15991k79985k49770k23368k00416j81142j64355j48350j33167
$$ 3398737 3082746 2802761 2552991 2329623 2129207 1948065 1783710 1635360 1502193
57038A502193j19985j08724r8201q8199p9515p2136o5223n8647n2930m7938m3198
$$ 1502193 1382208 1273484 1175283 1087084 1007569 935433 870210 811563 758633 710695 667497
57027F67497l9006l5763l2790k9329k6030k3777k1912j9420j7052j6236j6541
$$ 667497 628491 592728 559938 530609 504579 480802 458890 439470 422418 406182 389641
57016C89641j6369j5569j5168j5005j3903j1990j0557r649p837m419R5N590J2534
$$ 389641 373272 357703 342535 327530 313627 301637 291080 281431 273594 269175 269270 274860 287394
57003B87394K0617K9259L9479N3291P1494R4451J24934J66319K14928K55134K64870
$$ 287394 308011 337270 376749 430040 501534 595985 720919 887238 1102166 1357300 1622170
56992A622170K28604J47816M1518o3188j44157j92074k09228k03167j82006j53091
$$ 1622170 1850774 1998590 2040108 1976920 1832763 1640689 1431461 1228294 1046288 893197
56982H93197j22632r5314p4585o2692n9261o0547o1819o0648n7055n1363m3584
$$ 893197 770565 675251 600666 537974 478713 418166 356347 295699 238644 187281 143697
56971A43697l4629k6228j9285j3447q289l723N80N022R341J3032J6343J9957K4102
$$ 143697 109068 82840 63555 50108 41819 38096 38676 43698 53039 66071 82414 102371 126473
56958A26473K8889L4846M1602M6484M5848L8006K4125P017r778k2669k9786l2200
$$ 126473 155362 190208 231810 278294 324142 362148 386273 393290 383512 360843 331057 298857
56946B98857l2196l0654k7240k2437j7655j3483r493n674k518L59M231R613J5788
$$ 298857 266661 236007 208767 186330 168675 155192 145699 140025 137507 137866 142097 151710 167498
56933A67498K2161K9163L7532M7060N5583N8773N2142L4797J1015j2720l1778
$$ 167498 189659 218822 256354 303414 358997 417770 469912 504709 515724 503004 471226
56922D71226m4162m9311m8147m3483l8185l3051k7710k2749j9214j6783j4344
$$ 471226 427064 377753 329606 286123 247938 214887 187177 164428 145214 128431 114087
56911A14087j1956j0411r297p501n238l721l020k168j068m34n9Q87K065K386K145
$$ 114087 102131 91720 82423 74922 69684 65963 62943 60775 59707 59273 59214 60101 62166 64552 66697
56896F6697K733M324N840P216R590J3027J6168J8605K1696K6468L2349L8193M2805
$$ 66697 69430 73754 79594 86810 96400 109427 125595 144200 165896 192364 224713 262906 305711
56883C05711M4009L9231K8057J3207j602j3742k1778k5252k5072k2940j9840j5886
$$ 305711 349720 388951 417008 430215 428613 414871 393093 367841 342769 319829 299989 284103
56871B84103j1587p940n048j836K543P957J4005K0534K7523L5509M5935N9869
$$ 284103 272516 264576 259528 257692 260235 268192 282197 302731 330254 365763 411698 471567
56859D71567P6090R0757R8368R3044P1208L5516m603l8611o1293p2976p5432p0338
$$ 471567 547657 638414 736782 829826 901034 936550 931947 893336 832043 759067 683635 613297
56847F13297o0614m9749l9218k8578j7983q312R40J1329K2920L4569M6673O1188
$$ 613297 552683 502934 463716 435138 417155 408843 409783 421112 444032 478601 525274 586462
56835E86462P9013R9822J23698J48599J65511J60671J26265O7959Q77n9945j05003
$$ 586462 665475 765297 888995 1037594 1203105 1363776 1490041 1558000 1558877 1498932 1393929
56824A393929j30689j38504j33384j20595j03774q5685o8880n4376m1155k8211
$$ 1393929 1263240 1124736 991352 870757 766983 681298 612418 558042 516887 488676
56814D88676j5930m658O633J9097L2699M7249O3685Q2797J02678J17551J18995
$$ 488676 472746 468088 474721 493818 526517 573766 637451 720248 822926 940477 1059472
56803A059472R9848N9832Q184m1134p8080j00183j09152j07195r7333q3967p0590
$$ 1059472 1159320 1219152 1227336 1186202 1108122 1007939 898787 791592 694259 610292 539702
56792E39702n8001m5975l5196k6278j8414j0437k312N483J3082K1036K9846M0091
$$ 539702 481701 435726 400530 374252 355838 345401 343089 348572 361654 382690 412536 452627
56780D52627N1428O0761O2934N4378L5538R840j7951m2317n8526o5308o4953o0248
$$ 452627 504055 564816 627750 682128 717666 727506 709555 667238 608712 543404 478451 418203
56768D18203n2659m3803l6181l1009k6988k2537j7921j4089j1032q504o993o711
$$ 418203 365544 321741 285560 254551 227563 205026 187105 173016 161984 153480 146487 139776
56756A39776o786o475o068n765m981l582k513k290k129j372m99p6k4m52j683k947
$$ 139776 132990 126515 120447 114682 109701 106119 103606 101316 99187 97815 97316 97240 97216 96764 95081 92134
56740I2134k828j588j152k100k819k367j994k679l376l103k672k817k639j473
$$ 92134 89306 87718 86566 84466 81647 79280 77286 74607 71231 68128 65456 62639 60000 58527
56726E8527m89p01j125o28M7j89p59p23o27j290k096k115j724j605j384p77o80
$$ 58527 58038 57337 56212 55584 55631 55442 54683 53960 53333 52043 49947 47832 46108 44503 43119 42342 41662
56709D1662j565k238j758j191j761k692k660k097k126k425k031j272j023r65k98
$$ 41662 40097 37859 36101 34910 33149 30457 27797 25700 23574 21149 19118 17846 16823 15858 15560
56694A5560O29J050J236J797K352K392K499L319M202M279L978M096M338M042L420
$$ 15560 16189 17239 18475 20272 22624 25016 27515 30834 35036 39315 43293 47389 51727 55769 59189
56679E9189K851K055J069P29J075P13q80k079j624p84j295k647l351l453l802
$$ 59189 62040 64095 65164 65893 66968 67681 66801 64722 63098 62314 61019 58372 55021 51568 47766
56664D7766m024l325k211j571j044n2O55L21j10N31J638K161K628L823M716M024
$$ 47766 43742 40417 38206 36635 35591 35539 36194 36515 36405 36936 38574 40735 43363 47186 51902 55926
56648E5926K739K750L756L968L183K768L036K976K351K059K392K716K740K703
$$ 55926 58665 61415 65171 69139 72322 75090 78126 81102 83453 85512 87904 90620 93360 96063
56634I6063K541K201K179K580K426J222J71L85R78N44m60o89j74J60L38Q27J032
$$ 96063 98604 100805 102984 105564 107990 109212 109383 109768 110746 111290 110830 110141 109967 110127 110465 111292 112324
56617A12324J56j118j632j521j450j093j30L70n18j671j502m56N7P2M30P04O8
$$ 112324 112480 111362 109730 108209 106759 105666 105536 105906 105388 103717 102215 101759 101816 101888 102318 103022 103090
56600A03090p81o35Q9K96K64P25R57M3j059j054p39j472k371j709j38L36k08r7
$$ 103090 102309 101674 101763 102059 102323 103048 104005 104048 102989 101935 101196 99724 97353 95644 95506 95842 95634 95537
56582I5537O64N97j57K9J247J908J584J342J395R97N69J317K764L225K710K814
$$ 95537 96201 96798 96641 96670 97917 99825 101409 102751 104146 105143 105712 107029 109793 113018 115728 118542
56566A18542L781M234L892L986M787N156M842M877N410N450M913M808N111M708
$$ 118542 122323 126557 130449 134435 139222 144378 149220 154097 159507 164957 169870 174678 179789 184497
56552A84497L568K867K815K461J718J427J389N46p78j120n16p13k385m237n138
$$ 184497 188065 190932 193747 196208 197926 199353 200742 201288 200510 199390 198874 198161 195776 191539 186401
56537A86401n269m881l887k841k640l017l036k788k936l016k181j209j498k441
$$ 186401 181132 176251 172364 169523 166883 163866 160830 158042 155106 152090 149909 148700 147202 144761
56523A44761k175o91J64k81r15j248k043l287l817l222k282j495r05j056k205
$$ 144761 142586 141895 142059 141778 140863 139615 137572 134285 130468 127246 124964 123469 122564 121508 119303
56508A19303l090k483j337j221j496n84Q29Q32j75j14R85J154K20KP56P18m25
$$ 119303 116213 113730 112393 111172 109676 109092 109921 110753 110578 110464 111449 112603 112823 112825 113581 114299 113874
56491A13874q99j56K50l45o73j02M87Q41J690K648K433J451J378K050J751P03
$$ 113874 112975 112819 113069 112724 112051 111949 112436 113277 114967 117615 120048 121499 122877 124927 126678 127381
56475A27381J033K906L994L408K892L432L856L572L537L680K544M11l67R38K362
$$ 127381 128414 131320 135314 138722 141614 145046 148902 152474 156011 159691 162235 162646 162279 163217 165579
56460A65579K714L000L563L127J754J424K435K483P10o22n5O37k08j355j167k78
$$ 165579 168293 171293 174856 177983 179737 181161 183596 186079 186789 186167 186112 186749 186541 185186 184019 183741
56444A83741K06P81J940K622J991R63O13P53J037J551J579ok374l234k351k025
$$ 183741 183947 184728 186668 189290 191281 192244 192857 193610 194647 196198 197777 197771 195397 192163 189812 187787
56428A87787l320m557m450l880l584k932k092k533m243n180m536l724l268j869
$$ 187787 184467 179910 175460 171580 167996 165064 162972 160439 156196 151016 146480 142756 139488 137619
56414A37619L90J276K01m97M01R62k18j573j627j371j614j052Q45J907N49j464
$$ 137619 138009 139285 139486 138989 139390 140352 140134 138561 136934 135563 133949 132897 133742 135649 136198 134734
56398A34734j735m75Q40J791K306J820P74P47J786K012R34N53J934L548M205M646
$$ 134734 132999 132524 133364 135155 137461 139281 140055 140802 142588 144600 145534 146087 148021 151569 155774 160420
56382A60420M984L835J434L27J315K086J478J524L441N148M971M311M369L765
$$ 160420 165404 169239 170673 171000 172315 174401 175879 177403 180844 185992 190963 195274 199643 203408
56368B03408J789O16J561K524J808J204K444L807L291K082J892J684K47q00K48
$$ 203408 205197 205813 207374 209898 211706 212910 215354 219161 222452 224534 226426 228110 228357 227557 227805
56353B27805J903K065J530J975K786K689K344K593K370R43r4M84J282J083J316
$$ 227805 229708 231773 233303 235278 238064 240753 243097 245690 248060 249003 248909 249393 250675 251758 253074
56338B53074L169N007N227N023N703O075N165M614N617O386N518M872O111P414
$$ 253074 256243 261250 266477 271500 277203 283278 288443 293057 298674 305060 310578 315450 321561 328975
56324C28975O879O204P477R190Q988P801P691P999P145N911N572N044L139J312
$$ 328975 335854 342058 349535 358725 367713 375514 383205 391204 398349 404260 409832 414876 418015 419327
56310D19327R94P33r34k410k099j675k905l996k791q69p19j412q42K90N27J094
$$ 419327 420321 421054 420120 417710 415611 413936 411031 407035 404244 403375 402656 401244 400402 400692 401219 402313
56294D02313L352N349M863L527M041N629O152O350P933R844J0396J0838J2864
$$ 402313 405665 411014 415877 419404 423445 429074 435226 441576 449509 459353 469749 480587 493451
56281D93451J4957J5190J5153J7087J9664K0831K2147K5889L0395L2959L4879
$$ 493451 508408 523598 538751 555838 575502 596333 618480 644369 674764 707723 742602
56270G42602L8851M3705M6731M9156N4251O1821O9474P7572Q7981R9586J09970
$$ 742602 781453 825158 871889 921045 975296 1037117 1106591 1184163 1272144 1371730 1481700
56259A481700J20103J32632J46967J60505J73129J85860J96878K03539K06751
$$ 1481700 1601803 1734435 1881402 2041907 2215036 2400896 2597774 2801313 3008064
56250C008064K08577K07277J99416J85277J67368J45374J17670Q6183N4779K4260
$$ 3008064 3216641 3423918 3623334 3808611 3975979 4121353 4239023 4325206 4379985 4404245
56240D404245o121l4025n6010p2730q7024r8362j04362j06243j07428j08086j06289
$$ 4404245 4398124 4364099 4308089 4235359 4148335 4049973 3945611 3839368 3731940 3623854 3517565
56229C517565j03283j02323j03386j04266j05559j09389j14459j17675j19467
$$ 3517565 3414282 3311959 3208573 3104307 2998748 2889359 2774900 2657225 2537758
56220B537758j22208j24838j24405j21652j19495j17273j12122j04832r8617r3288
$$ 2537758 2415550 2290712 2166307 2044655 1925160 1807887 1695765 1590933 1492316 1399028
56210A399028q6268p8211p1827o6379n9242n1738m7320m5015m0893l5096l1140
$$ 1399028 1312760 1234549 1162722 1096343 1037101 985363 938043 893028 852135 817039 785899
56199G85899k9097k5808k1336j8774j8029j5950j2483j0618j0434r105o612n636
$$ 785899 756802 730994 709658 690884 672855 656905 644422 633804 623370 614265 607653 602017
56187F02017o115n493l874l336k978l89K955L836L593N948R783J0837R498R887
$$ 602017 595902 590409 586535 583199 580221 579832 582787 586623 590216 596164 605947 616784 626282 636169
56173F36169J1985J1926R579Q578R180Q223N970N735O922N764K805K258L956L532
$$ 636169 648154 660080 669659 678237 687417 695640 701610 707345 714267 720031 722836 725094 729050 732582
56159G32582O87l13J271J741M83R26L383M480M140N807R246J0744J0820J3909
$$ 732582 733269 732956 734227 735968 736451 737377 740760 745240 749380 755187 764433 775177 785997 799906
56145G99906J9909K4017K5738L0016L8450M7403N5905O7546Q3248R9896J17056
$$ 799906 819815 843832 869570 899586 938036 985439 1041344 1108890 1192138 1292034 1409090
56134A409090J36978J56770J68548J68892J60870J46347J24726J00243Q1503P1696
$$ 1409090 1546068 1702838 1871386 2040278 2201148 2347495 2472221 2572464 2653967 2725663
56124B725663O6587O2858O0319N5480M2530K2479K988j2110k4799l4398l7279
$$ 2725663 2792250 2855108 2915427 2970907 3013437 3035916 3038904 3026794 3001995 2967597 2930318
56113B930318l6486m1394n5486p3582r2427j13699j34594j46471j46341j40078
$$ 2930318 2893832 2852438 2796952 2723370 2630943 2517244 2382650 2236179 2089838 1949760
56103A949760j31479j18130j00797q6291p7156o8368n7768n0033m6814m2885l5967
$$ 1949760 1818281 1700151 1599354 1513063 1435907 1367539 1309771 1259738 1212924 1170039 1134072
56092A134072l0632k8707k5494j9286j4964j4440j3154r505p929r251q107l448
$$ 1134072 1103440 1074733 1049239 1029953 1014989 1000549 987395 977890 969961 960710 952603 949155
56080I49155j101k543j790K913N468L748L637P235Q658O057N909J0497J3030J0402
$$ 949155 948054 945511 943721 946634 952102 955850 959487 966722 975380 981437 987346 997843 1010873 1021275
56066A021275Q941J2005J3759J1072R706J2755J4675J2767J2808J7250J9720J7289
$$ 1021275 1030216 1042221 1055980 1067052 1076758 1089513 1104188 1116955 1129763 1147013 1166733 1184022
56054A184022J6268J9695K1343J8258J6761J9750K0809J7318J6329K0850K3740
$$ 1184022 1200290 1219985 1241328 1259586 1276347 1296097 1316906 1334224 1350553 1371403 1395143
56043A395143K1928K2808K9397L3439L0826K9447L3716L6063L2163K9738L3444
$$ 1395143 1417071 1439879 1469276 1502715 1533541 1562988 1596704 1632767 1664930 1694668 1728112
56032A728112L5931L2943L2203L7970M2206M0474M0966M7983N2605M9911M8966
$$ 1728112 1764043 1796986 1829189 1867159 1909365 1949839 1990805 2038788 2091393 2141304 2190270
56021B190270N5105N9296N6083N4798O1282O6090O2991O1358O7525P2059O8650
$$ 2190270 2245375 2304671 2360754 2415552 2476834 2542924 2605915 2667273 2734798 2806857 2875507
56010B875507O7153P4315Q0395P8740P9330Q8513R5380R3200R3707J04585J14053
$$ 2875507 2942660 3016975 3097370 3176110 3255440 3343953 3439333 3532533 3626240 3730825 3844878
55999C844878J14042J16533J29790J41367J42764J47260J64143J79575J83167
$$ 3844878 3958920 4075453 4205243 4346610 4489374 4636634 4800777 4980352 5163519
55990E163519J88366K05421K20214K22446K27841K48679K70072K80258K95350
$$ 5163519 5351885 5557306 5777520 5999966 6227807 6476486 6746558 7026816 7322166
55981G322166L27589L59347L76877L98456M39485M82679N14306N54983O20621
$$ 7322166 7649755 8009102 8385979 8784435 9223920 9706599 10220905 10775888 11396509
55972A1396509O89702P45608Q12682R11503J020070J121449J245337J416561J610330
$$ 11396509 12086211 12831819 13644501 14556004 15576074 16697523 17942860 19359421 20969751
55963B0969751J808751K050408K370239K748525L180428L732799M465947N373442
$$ 20969751 22778502 24828910 27199149 29947674 33128102 36860901 41326848 46700290
55955D6700290O475611P885258R691707J1888935J4539004J7896484K2259065
$$ 46700290 53175901 61061159 70752866 82641801 97180805 115077289 137336354
55948A37336354K7872756L5077471M3981986N3162259N8701594N5648134M1583891
$$ 137336354 165209110 200286581 244268567 297430826 356132420 411780554 453364445
55941D53364445J9047967n772004k6815379m0901082m7794003m8839324m5883867
$$ 453364445 472412412 466640408 439825029 398923947 351129944 302290620 256406753
55934B56406753m0767278l4947413k9279055k4151552j9755463j6152104j3243902
$$ 256406753 215639475 180692062 151413007 127261455 107505992 91353888 78109986
55927G8109986j0872590q948396p423359o207635n203727m379196l729627l208657
$$ 78109986 67237396 58289000 50865641 44658006 39454279 35075083 31345456 28136799
55919B8136799k759656k377713k077741j834646j610829j410811j255332j129805
$$ 28136799 25377143 22999430 20921689 19087043 17476214 16065403 14810071 13680266
55911A3680266j007197q94975q12868p48415o77802o07874n56882n15387m65000
$$ 13680266 12673069 11778094 10965226 10216811 9539009 8931135 8374253 7858866 7393866
55902G393866m15207l84364l63286l33048l00570k82459k71013k49382k24226
$$ 7393866 6978659 6594295 6231009 5897961 5597391 5314932 5043919 4794537 4570311
55893D570311k11395k04381j87834j67996j59882j57569j46136j30583j24955
$$ 4570311 4358916 4154535 3966701 3798705 3638823 3481254 3335118 3204535 3079580
55884C079580j24517j15757j02996r8900r8918r0601p8519p5408p7651p3190o4969
$$ 3079580 2955063 2839306 2736310 2637410 2538492 2447891 2369372 2293964 2216313 2143123 2078154
55873B078154o3451o4397n6769m4851m0565m1155l5864k7660k7382l2755l3464
$$ 2078154 2014703 1950306 1893537 1848686 1808121 1766966 1731102 1703442 1676060 1643305 1609841
55862A609841l1023l3968l9176l7212l0851k9758l1998k8514k0704j6153j2414
$$ 1609841 1578818 1544850 1505674 1468462 1437611 1407853 1375855 1347341 1326637 1310484 1298070
55851A298070k584Q077Q477K45o459j0782j8500k6447k6535k1564k0892k3846
$$ 1298070 1295486 1303563 1312040 1312285 1305826 1295044 1276544 1250097 1223562 1201998 1181106 1157260
55839A157260k2823j9157k0438k5316k6285k4417k6615l1107l0344k5563k4226
$$ 1157260 1134437 1115280 1094842 1069526 1043241 1018824 992209 961102 930758 905195 880969
55828H80969k5548k2716j6912j5212j6794j4932j0579j0495j3796j3595j0287
$$ 880969 855421 832705 815793 800581 783787 768855 758276 747781 733985 720390 710103
55817G10103j0179j2570j1026o215m825o839n971j861L8l43J875N856O098L262
$$ 710103 699924 687354 676328 670113 665288 658449 652478 650617 650655 650312 652187 658043 664141 667403
55803F67403K977M893L676j77j238K11j063m890o545o671r993j5156j6349j4080
$$ 667403 670380 675273 678949 678772 677534 677745 676682 671792 665247 658576 648583 633427 617078 602998
55789F02998j4139j6667j6460j3417j2542j4052j3304j0088q515q348n669j364
$$ 602998 588859 572192 555732 542315 529773 515721 502417 492329 483814 475466 469797 468433
55777D68433L32M52L043N707K320n765j1266j2791j5147j8601j8268j4231j2020
$$ 468433 468765 469217 472260 477967 480287 474522 463256 450465 435318 416717 398449 384218 372198
55764C72198j2574j1335p794o439p681p097m305l582m988l943k59J138p03j680
$$ 372198 359624 348289 340495 334056 326375 319278 314973 311391 306403 302460 302201 303339 302636 300956
55750C00956j171k949o848q112o097n251o555o269m001l748n863o202m199l750
$$ 300956 299785 296836 289988 281876 275779 270528 263973 257704 253703 249955 244092 237890 233691 229941
55736B29941n092m062m64R38q68j467O33J838J010J341L194K767m37k310j816
$$ 229941 224849 220787 220323 221261 220393 218926 219559 221397 222407 223748 226942 229709 229272 226962 225146
55721B25146k590n304n968l605k264l510l984k353j611k553j927R15K282J089
$$ 225146 222556 217252 211284 207679 205415 201905 197921 195568 193957 191404 189477 190392 192674 193763
55707A93763R56L432N509N807O768Q880R047O592M758M574L348Q01K62K120K561
$$ 193763 194719 198151 203660 209467 216235 225115 234162 240754 245512 250086 253434 254235 254497 256617 259178
55692B59178O19k0J875K670O48j147j109j774m032m747k678r83j287q16K073M876
$$ 259178 259797 259777 261652 264322 264970 263823 262714 260940 256908 252161 249483 248500 247213 246397 248470 253346
55676B53346N750O224P042O441M411L577M078K800p89l342l578l943m975l897
$$ 253346 259096 265320 272362 278803 283214 286791 290869 293669 292880 289538 285960 282017 277042 273145
55662B73145n74J101k44j326m72j64j328j105J379K807J640O85J364J046j504
$$ 273145 272571 273672 273428 272102 271630 271466 270138 269033 270412 273219 274859 275544 276908 277954 276450
55647B76450l686m459o462j0250j2148j0610r156j0092j0915r813r171j0411j0748
$$ 276450 272764 268305 261843 251593 239445 228835 219679 209587 198672 188859 179688 169277 158529
55634A58529q402o014n611n157l252k267l535m305k876j946l407m541k952p91
$$ 158529 150127 144113 138502 133345 130093 127826 124291 119986 117110 115164 111757 107216 104264 103473
55620A03473n17p70J4J36j659l055k223j208j960k746j697k69p2R1J049R40j088
$$ 103473 102956 102186 102200 102336 100677 97622 95399 94191 92231 89485 87788 87519 87447 87538 88587 89527 88439
55603H8439k553j911j257k062k263n28P04l42j336j38J367J053L67R93J400J31
$$ 88439 85886 83975 82718 80656 78393 77865 78569 78227 76891 76753 78120 79173 79540 80533 81933 82064
55587H2064j035n70l08j702k525q57J064N75r73j038j93j60l35L78R12L04k9R21
$$ 82064 81029 80459 80151 78449 75924 75067 76131 76706 75733 74695 74502 74342 74007 74385 75297 75601 75572 76493
55569G6493J482N21p5J091K094J245L52J350K709K292R94M22k02j874l236k994
$$ 76493 77975 78496 78421 79512 81606 82851 83203 84553 87262 89554 90548 90970 90768 88894 85658 82664
55553H2664k384k571k386j064k60q77j033L16J037j88j093J06J390Q47L95K247
$$ 82664 80280 77709 75323 74259 73999 73122 72089 72405 73442 73254 72161 72267 73657 74504 74899 77146
55537G7146M902O083O621Q001Q993Q129O699O059M857K104M6O03J865J448L87
$$ 77146 82048 88131 94752 102753 111746 119875 126574 132633 137490 139594 139640 140243 142108 143556 143943
55522A43943L79J65j803l986m616n033o719p933o895n423n671o061m418k292k286
$$ 143943 144322 144487 142684 138698 134082 129049 122330 114397 107502 102079 96408 90347 85929 83637 81351
55507H1351l543l894l958n115n868m232j570j97N46K097K986J406q82j296q58
$$ 81351 77808 73914 69956 64841 58973 54741 53171 52974 53520 55617 58603 60009 59127 57831 56973
55492E6973j776k936k112n19p10j781j202K65p2j953k975k996l554m103k982j104
$$ 56973 55197 52261 50149 49630 48920 47139 45937 46202 46130 44177 41202 38206 34652 30549 27567 26463
55476B6463o16r27J10K094K906K589K676K760J468k14l38L39l07j761j905r96
$$ 26463 25847 24920 25030 27124 30030 32619 35295 38055 39523 39309 38971 39310 39003 37242 35337 34341
55460C4341r22j468j002m7m30j664j713p21n11j063q25J33M26M8j67o87j977k420
$$ 34341 33419 31951 30949 30902 30472 28808 27095 26374 25863 24800 23975 24108 24534 24582 24415 23728 21751 19331
55442A9331o94J243R34m13j03J281J284K63M25J338P53q94j136l7P4r40r71J57
$$ 19331 18637 19880 20814 20401 20298 21579 22863 23126 23551 24889 25642 24748 23612 23575 23649 22709 21738 21895
55424B1895M97k05k99K67k9q21k05J515K034J062O00J215J489J218J642K483K182
$$ 21895 22392 22187 21888 22155 22126 21305 21100 22615 24649 25711 26311 27526 29015 30233 31875 34358 36540
55407C6540J065R56J643J205k45o17K81M69l75m48N35P09l72q82j17L59l22j081
$$ 36540 37605 38561 40204 41409 41164 40547 40828 41297 40922 40474 41009 41718 41346 40464 40347 40706 40384 39303
55389C9303j253j483j846j577j015j261j844j273R7N13oJ54R25N54r82j632p23
$$ 39303 38050 36567 34721 33144 32129 30868 29024 27751 27848 28361 28355 28509 29434 29988 29006 27374 26651
55372B6651J55J12O2M58N59L28M97N92o01k482l053j997q51k08N89J251O98n57
$$ 26651 26806 26918 26980 27438 27997 28325 28822 29414 28813 26331 23278 21281 20430 20222 20811 22062 22760 22203
55354B2203r81p26j083j528m56J436J716J80r65r52j162j851j576k78K83k38k71
$$ 22203 21222 20496 19413 17885 17429 18865 20581 20761 19796 18844 17682 15831 14255 13977 14260 14022 13751
55337A3751N23O83O3K85J483J744N47k79K04P30N43N27R07O27k11j00R73J177
$$ 13751 14274 14957 15020 15305 16788 18532 19079 18800 19004 19734 20277 20804 21711 22338 22127 22027 23000 24177
55319B4177O0o64k42L6m16n44j50m33j248p80J116K128J115k55m96k24j11M07
$$ 24177 24237 23573 23331 23367 22951 22407 22257 21824 20576 19796 20912 23040 24155 23900 23404 23180 23069 23476
55301B3476J318J425N98J65L45j71j361j445j30O71K36J98J134J189m73j780j085
$$ 23476 24794 26219 26817 26982 27327 27156 25795 24350 24220 24891 25127 25325 26459 27648 27175 25395 24310
55284B4310K66M47j39m10o55j262j377m27O29R05P65N24k21j151j145l66l22j197
$$ 24310 24576 25023 24884 24474 23819 22557 21180 20753 21382 22287 23052 23576 23355 22204 21059 20693 20371 19174
55266A9174j430o23k68p67n28Q96J619O61l37q5K82k50n65K91J101O98j1Q9M08
$$ 19174 17744 17121 16853 16086 15558 16454 18073 18734 18397 18312 18594 18344 17779 18070 19171 19869 19858 19947 20355
55247B0355L22N93J503J546r8j710j541l94L8j85m6M20N64M02J21m57r07k32J277
$$ 20355 20677 21270 22773 24319 24221 22511 20970 20576 20614 20429 20383 20803 21367 21769 21890 21433 20526 20294 21571
55228B1571J878J059M38J004J564J187R52J740K342J479l1p86q63q65n03L47P19
$$ 21571 23449 24508 24946 25950 27514 28701 29653 31393 33735 35214 35183 34397 33534 32669 32166 32513 33232
55211C3232J34l86j22R1l55o21k10j66j047j579q39k7m18j260j329r39p48j71
$$ 33232 33366 32980 32858 32949 32594 31973 31763 31597 30550 28971 28132 28105 27687 26427 25098 24159 23411 23240
55193B3240J232K263J731L82m19o67r23q67j29N87O27N12P18O48l3m12K7L19k38
$$ 23240 24472 26735 28466 28848 28429 27762 26839 25972 25843 26430 27057 27569 28287 28935 28902 28490 28517 28836 28598
55174B8598o98j80N02L46j19NM21N37O39R43Q08N7l07J77M61j78q75q50o43o24
$$ 28598 27900 27720 28222 28568 28449 28454 28875 29412 30051 30994 31802 31859 31552 31729 32190 32012 31137 30287 29644 29020
55154B9020j45P01M90r79j644k56J463J558P17N29O82P7q27r56o90r37j318j055
$$ 29020 28875 29576 30066 29087 27443 27187 28650 30208 30925 31454 32136 32213 31386 30430 29740 28803 27485 26430
55136B6430n04k26K39J109J344M74q7P19J707J558J158J764K483J921Q64R05J557
$$ 26430 25926 25700 25939 27048 28392 28866 28779 29498 31205 32763 33921 35685 38168 40089 40953 41858 43415
55119D3415J199k2o91o62q73j198p88o1k43j250j808j437p05K0O67Q12L61K05
$$ 43415 44614 44592 43901 43239 42366 41168 40380 40319 40076 38826 37018 35581 34876 34896 35563 36375 36736 36941
55101C6941R35J701J634J328J549J628P84j16R3P47M85l66m36L70J005J184J364
$$ 36941 37876 39577 41211 42539 44088 45716 46500 46384 46477 47224 47709 47343 46907 47277 48282 49466 50830
55084E0830J426R64L96K99K53l17q72p26m31p32j051m81N30J028J179J564J791
$$ 50830 52256 53220 53616 53915 54168 53851 52979 52253 51822 51090 50039 49558 50088 51116 52295 53859 55650
55067E5650J346Q53R95J105M37k52J8O73P36O76J251J723J112J95J61L61m81j728
$$ 55650 56996 57849 58844 59949 60386 60134 60152 60825 61561 62237 63488 65211 66323 66518 66679 67040 66559 64831
55049F4831j861j228j377k199k120q99M9M6j40k6M3J2K26M46K22p7N2k0j100k469
$$ 64831 62970 61742 60365 58166 56046 55147 55196 55242 55102 55076 55119 55131 55357 55803 56025 55948 56000 55980 54880 52411
55029E2411k730j878r88l79L38R10Q06M61O58J054Q85M41L84L42j82m19M10J276
$$ 52411 49681 47803 46815 46436 46774 47684 48490 48951 49609 50663 51548 51989 52373 52715 52533 52114 52524 53800
55011E3800Q04k82k76N89O77j82o53m65o35j198j020k3M81L5l54j13J06q4k04
$$ 53800 54604 54322 54046 54635 55312 55130 54477 54012 53377 52179 51159 51136 51617 51652 51298 51185 51291 51207 51003
54992E1003q8k47p73j040p30n9Q81J951K375J582L31j39K36O83J031J517J782
$$ 51003 50915 50668 49895 48855 48125 48066 48947 50898 53273 54855 55186 55047 55283 55966 56997 58514 60296
54975F0296J440J066J277J510J126Q97J665K473J897N91L81J371K051J936K014
$$ 60296 61736 62802 64079 65589 66715 67612 69277 71750 73647 74238 74619 75990 78041 79977 81991
54960H1991K779L736M779O211P606Q357R121J0940J3293J4859J5783J7156J8635
$$ 81991 84770 88506 93285 99496 107102 115459 124580 135520 148813 163672 179455 196611 215246
54947B15246J8624J6714J3856J0264N189j122p178j2109j6016j8587j9178j8192
$$ 215246 233870 250584 264440 274704 279893 278771 271593 259484 243468 224881 205703 187511
54935A87511j6702j4873j2409j0158r253r022p858n901m729m566m123l093k397
$$ 187511 170809 155936 143527 133369 124116 115094 107236 101335 96606 92040 87917 84824 82427
54922H2427j944n69J540K731K543K327K813L219L191L570M735O126P694R932J2267
$$ 82427 80483 79914 81454 84185 86728 89055 91868 95087 98278 101848 106583 112709 120403 130335 142602
54907A42602J3515J4068J5389J7043J6732J3688R619N697J100m520r622j3014
$$ 142602 156117 170185 185574 202617 219349 233037 242656 248353 249453 244933 235311 222297
54895B22297j5371j7269j7682j5856j3061j1058j0060r246q123o542m588l036
$$ 222297 206926 189657 171975 156119 143058 132000 121940 112694 104571 98029 93441 90405
54883I0405k809l465l548k708k000j862j509o89k18k82r7K90j72j374j761r56
$$ 90405 87596 84131 80583 77875 75875 74013 72504 71815 71597 71315 71218 71508 71336 69962 68201 67245
54867F7245n22j257j864j426j035j645k291j947j387j585j817j091j40j75p97
$$ 67245 66723 65466 63602 62176 61141 59496 57205 55258 53871 52286 50469 49378 49238 49063 48266
54852D8266p85k06j17p46j285j233q36m63l28m23l16M68J528J755P96m15r57q61
$$ 48266 47481 47275 47158 46412 45127 43894 43058 42595 42267 41844 41528 41996 43524 45279 46075 45660 44703 43842
54834D3842m90N0N50O91O87J074J667J797J545J562J667J075N4k31K95M56r1l00
$$ 43842 43352 43402 43952 44643 45330 46404 48071 49868 51413 52975 54642 55717 55771 55540 55835 56291 56200 55900
54816E5900L14R41J170J621K344K385J717J731K970M081L977L410L425L917M711
$$ 55900 56214 57155 58325 59946 62290 64675 66392 68123 71093 75174 79151 82561 85986 89903 94614
54801I4614O433R020J0959J1384J1602J3217J5863J8004J8950J8714J6968J3411
$$ 94614 101047 110067 121026 132410 144012 157229 173092 191096 210046 228760 245728 259139
54789B59139Q554L219k133o903j0182j1834j2826j3766j4084j3267j1817j0368
$$ 259139 267693 270912 268779 261876 251694 239860 227034 213268 199184 185917 174100 163732
54777A63732q909p511o672o257n325l676k329j836j472p22k09k66n2J026K299
$$ 163732 154823 147312 140640 134383 129058 125382 123053 121217 119745 119023 118814 118548 118496 119522 121821
54762A21821L141M021N379O735P858R464J1815J3986J5491J7268J9952K2479K3589
$$ 121821 124962 128983 134362 141097 148955 158419 170234 184220 199711 216979 236931 259410 282999
54749B82999K3459K2610K0394J5881R374J941n652j2601j7720k0547k1890k2498
$$ 282999 306458 329068 349462 365343 374717 376658 371006 358405 340685 320138 298248 275750
54737B75750k2119k0639j8898j7467j5834j3690j1813j0724r651p919o157n109
$$ 275750 253631 232992 214094 196627 180793 167103 155290 144566 134915 126996 120839 115730
54725A15730m420l675l354l694l763k832j592r87q93r41j384k121k149j107j77
$$ 115730 111310 107635 104281 100587 96824 93992 92400 91413 90520 89579 88195 86074 83925 82818 82641
54710H2641l17q21o90j31L46R73J690J555M62n2Q89J839J190l21r48m96J04O24
$$ 82641 82324 81503 80813 80682 81028 82001 83691 85246 85708 85656 86545 88384 89574 89253 88305 87809 87913 88537
54692H8537J218J335N96o9K25P72N16j62l52l18o78r45m38K77M81P93J957L103
$$ 88537 89755 91090 91686 91617 91842 92614 93130 92968 92616 92298 91620 90675 90237 90514 90995 91788 93745 96848
54674I6848K979K005J458J494J623K200L600M780M583L781L939M981N628N630
$$ 96848 99827 101832 103290 104784 106407 108607 112207 116987 121570 125351 129290 134271 139899 145529
54660A45529N688N776N356M755M624M532L831L230L747M725M798M243M413N315
$$ 145529 151217 156993 162349 167104 171728 176260 180091 183321 187068 191793 196591 200834 205247 210562
54646B10562N818N897O716Q629J0923J3240J5494J6757J6099J4262J2559J0443
$$ 210562 216380 222277 228993 237622 248545 261785 277279 294036 310135 324397 336956 347399
54634C47399O201r7o431j1537j5751j9073k0594k0195j8979j7578j5669j3430
$$ 347399 353600 353503 347072 335535 319784 300711 280117 259922 240943 223365 207696 194266
54622A94266j1767j0780r581p994o836o172n038l247j889j463j051k4Q81R54P93
$$ 194266 182499 171719 162138 154144 147308 141136 136098 132851 130962 129499 128448 128424 129305 130259 131052
54607A31052J338K531L632M163M077L566K979K437J536K4j464k091k061k252k872
$$ 131052 132390 134921 138553 142716 146793 150359 153338 155775 157311 157335 155871 153780 151719 149467 146595
54592A46595l508m100m803n143m602l781l715m188m125l470l167l330l073k261
$$ 146595 143087 138987 134184 129041 124439 120658 116943 112755 108630 105160 101993 98663 95590 93329
54578I3329j849k149k215j554r99j252j694j474q38o81j291k126k419j772n19
$$ 93329 91480 89331 87116 85562 84563 83311 81617 80143 79305 78624 77333 75207 72788 71016 70497
54563G0497M18M93K31M51J095J465J293P65q9j093j414m52R84J513J025O04Q08
$$ 70497 70915 71408 71639 72090 73185 74650 75943 76708 76619 75526 74112 73660 74644 76157 77182 77786 78594
54546G8594J184J418J698J984K002K036K575L268L364L117L576M833N764N753
$$ 78594 79778 81196 82894 84878 86880 88916 91491 94759 98123 101240 104816 109649 115413 121166
54532A21166N551O012O948P669P819P354O271M669K675L13k204m271n525o273
$$ 121166 126717 132729 139677 147346 155165 162519 168790 173459 176134 176447 174243 169972 164447 158174
54518A58174o860p079o848o754p093p092o137m993m643m618l858k591j914j921
$$ 158174 151314 144235 137387 130633 123540 116448 110311 105318 100675 96057 92199 89608 87694 85773
54504H5773j796j387j198j119o80k79o48j304j089o5O35O38N42M93J72n4M48J172
$$ 85773 83977 82590 81392 80273 79593 79314 78666 77362 76273 76208 76843 77481 78023 78516 78688 78634 79082 80254
54486H0254J204J029J756K782K385O83k21O15J801K112K038K191K104J483R61
$$ 80254 81458 82487 84243 87025 89410 90093 89872 90487 92288 94400 96438 98629 100733 102216 103177
54471A03177P83L05m68m91M29R73L49n18p57q96j464j732j066k53k93q83j200
$$ 103177 103960 104265 103797 103306 103735 104708 105057 104539 103782 102886 101422 99690 98624 98371 98078 97195 95995
54454I5995j210j206r60l47mm02j018j223j263j575j838j569j006p48r79j532
$$ 95995 94785 93579 92619 92272 92268 91866 90848 89625 88362 86787 84949 83380 82374 81626 80647 79115
54438G9115k124k191j191M29J436J319Q46P98R72Q64M92M4m22o09q0Q85J357J002
$$ 79115 76991 74800 73609 74038 75474 76793 77639 78437 79409 80273 80765 80809 80387 79778 79698 80583 81940 82942
54420H2942M68K80K38J47J77K64J37J02P58J698J787R24L41P88J692K443L121
$$ 82942 83410 83690 83928 84075 84252 84516 84653 84755 85513 87211 88998 89922 90263 91051 92743 95186 98307
54403I8307L567L218K401K361L335M083M032M286N540O569O073M767M198M526
$$ 98307 101874 105092 107493 109854 113189 117272 121304 125590 131130 137699 143772 148539 152737 157263
54389A57263M780M498L843K754J187l22j333k195l263m068m170m100m543n127
$$ 157263 162043 166541 170384 173138 174325 174003 172670 170475 167212 163144 158974 154874 150331 145204
54375A45204n114m639m314m075l431k554k068k013j871j528j431j816k331k455
$$ 145204 140090 135451 131137 127062 123631 121077 119009 116996 115125 113597 112166 110350 108019 105564
54361A05564j977j118m00k02l45l88k92l14l53m1N36R15J067J440K097K686L169
$$ 105564 103587 102469 102069 101867 101522 101134 100842 100528 100175 100134 100670 101585 102652 104092 106189 108875 112044
54344A12044L690L885L398K965L672N058N492M625L921M193M406L667K774K618
$$ 112044 115734 119619 123017 125982 129654 134712 140204 144829 148750 152943 157349 161016 163790 166408
54330A66408K490J314m68j609j952k315l111m142n296o437o987o589n827n561
$$ 166408 168898 170212 169744 168135 166183 163868 160757 156615 151319 144882 137895 131306 125479 119918
54316A19918n768n689m867l600k612k514l227l839l536k670k203k275k223j915
$$ 119918 114150 108461 103594 99994 97382 94868 91641 87802 84266 81596 79393 77118 74895 72980
54302G2980j844j895j363m57k73r59j353r60o86j058j313r81p72r44m91R56J985
$$ 72980 71136 69241 67878 67421 67148 66189 64836 63876 63190 62132 60819 59838 59066 58122 57631 58587 60572
54285F0572J441K57k09k65q30j489j263m43n2j77k28k60n72o62J09J240J765J708
$$ 60572 62013 62270 62061 61796 60966 59477 58214 57771 57719 57542 57314 57054 56482 55820 55929 57169 58934 60642
54267F0642J744J886J713J405J417J538J276Q13O33O56N79N30O04M03j68l52K66
$$ 60642 62386 64272 65985 67390 68807 70345 71621 72434 73067 73723 74302 74832 75436 75839 75671 75319 75585
54250G5585Q48N09k64m78j33J05Q5m3m47j033r91oR20Q37K79K20N61P65R93J336
$$ 75585 76433 76942 76678 76200 76067 76172 76257 76214 75767 74734 73743 73737 74657 75494 75773 75993 76554 77319 78312 79648
54230G9648R48n56j812j458l56l10j274j717j189o43n52n05n00r30j350r35j8
$$ 79648 80596 80040 78228 76770 76414 76104 74830 73113 71924 71281 70729 70224 69724 68794 67444 66509 66491
54213F6491L84L75Q77J638J406J63o71m74j76l84m86j21K7m13p60n97n74j089
$$ 66491 66875 67250 68127 69765 71171 71334 70663 70189 70013 69629 69143 69022 69049 68636 67876 67279 66705 65616
54195F5616j326n67N33Q77N01K75N75R83J101R79P91N17K4o31j068q83k05K74
$$ 65616 64290 63723 64256 65133 65634 65909 66484 67467 68568 69547 70338 70855 70879 70248 69180 68297 68092 68366
54177F8366M0p17j486j955j920j268m03r3m68q04p70j024j854k225j248K36Q36
$$ 68366 68406 67689 66203 64248 62328 61060 60657 60564 60096 59292 58522 57498 55644 53419 52171 52407 53243
54160E3243P17J090J996K189J210J10j46K11N43P44R55J072R63P06M38L14N22
$$ 53243 53960 55050 57046 59235 60445 60555 60409 60620 61163 61907 62862 63934 64897 65603 66041 66355 66877
54143F6877R24R25J68r10j658j962j960j534p54j97r0K16J132J825J388L64j19
$$ 66877 67801 68726 68894 67984 66326 64364 62404 60870 60116 59919 59829 60045 61177 63002 64390 64754 64635
54126F4635j14n35j403j860j639j263q62j51M61J05j038j656j027J11O50L09m49
$$ 64635 64521 63986 62583 60723 59084 57821 56959 56808 57269 57374 56336 54680 53653 53764 54414 54723 54274
54109E4274r34o57J95P81P10O57J207J669J115R7m6P21J092M56l91o67m60p3M05
$$ 54274 53340 52683 52878 53659 54369 55026 56233 57902 59017 59114 59068 59789 60881 61337 60946 60279 59819 59746 60151
54090F0151O07M9r93j637j627j521j591j449r04l47o8L4O9J19M91J249J706J258
$$ 60151 60758 60807 59814 58177 56550 55029 53438 51989 51085 50738 50670 50704 50773 50892 51383 52632 54338 55596
54072E5596M36K25N65O18K70J75M66O20O07R13J406J344O69J46J20J83K19N93
$$ 55596 56032 56257 56822 57440 57710 57885 58351 58971 59578 60491 61897 63241 63910 64056 64176 64359 64578 65171
54054F5171J172J274Q43N85P86R44Q22Q00J025J163J153J287J415J067M76M47
$$ 65171 66343 67617 68460 69045 69831 70775 71597 72397 73422 74585 75738 77025 78440 79507 79983 80430
54038H0430J099J774K232K840L550L887M055M814N973O412N858N404N697N989
$$ 80430 81529 83303 85535 88375 91925 95812 99867 104681 110654 117066 122924 128328 134025 140014
54024A40014N568N000N165N885O345O222N761N238M815M528M138L486K946K903
$$ 140014 145582 150582 155747 161632 167977 174199 179960 185198 190013 194541 198679 202165 205111 208014
54010B08014K834J842J39j016j072r29j606k974m205m757m687m455m582n003m928
$$ 208014 210848 212690 212829 211813 210741 209812 208206 205232 201027 196270 191583 187128 182546 177543 172615
53995A72615l971l028l127l800l759k922k452k818l214l049k663k297j638p61
$$ 172615 168644 165616 162489 158689 154930 152008 149556 146738 143524 140475 137812 135515 133877 133116
53981A33116l74p63j391j808j996j815j098l65k83n22k84J66j17r37j118m65Q4
$$ 133116 132742 131979 130588 128780 126784 124969 123871 123506 123223 122701 122417 122583 122466 121529 120411 119946 120030
53964A20030L36J041J973J846O65J87J271K607K953K811K827K344R06l66l14N67
$$ 120030 120366 121407 123380 125226 125891 126078 127349 129956 132909 135720 138547 140891 141797 141431 141117 141684
53948A41684J229J658K146K203J582J252K014L103L486L598M386N473N798N378
$$ 141684 142913 144571 146717 148920 150502 151754 153768 156871 160357 163955 168341 173814 179612 184990
53934A84990M980M525L266J256o38j971k950l658l946l887l580k809j574m89N6
$$ 184990 189970 194495 197761 199017 198379 196408 193458 189800 185854 181967 178387 175578 174004 173515 173571
53919A73571N48J492K431K713K689L229M397N517O206O601O780O682O480O471
$$ 173571 174119 175611 178042 180755 183444 186673 191070 196587 202793 209394 216174 222856 229336 235807
53905B35807O767P309P819P654O360M584L603L533K997J142j052k174k157j792
$$ 235807 242574 249883 257702 265356 271716 276300 279903 283436 286433 287575 286523 284349 282192 280400
53891B80400j381r20q59j525k320k494k381k919m267n740o833p525p794p608p184
$$ 280400 279019 278099 277240 275715 273395 270901 268520 265601 261334 255594 248761 241236 233442 225834 218650
53876B18650o793o438o101n989o111o049n497m641l798l186l099l621m047l520
$$ 218650 211857 205419 199318 193329 187218 181169 175672 171031 167233 164047 160948 157327 153280 149760
53862A49760k379j886k369k891l041l548m491m575l248j964k053k578j973o12
$$ 149760 147381 145495 143126 140235 137194 133646 129155 124580 121332 119368 117315 114737 112764 112152
53848A12152q3o28j114j046r33r26o57l75p60j579j760r48M1M47K82j50o56r84
$$ 112152 112069 111441 110327 109281 108348 107422 106765 106390 105630 104051 102291 101343 101384 101831 102113 101963 101307 100323
53830A00323r29o88n29l42k9Mn24r58m18Q82J739J422L96l58k85L83Q99P48L35
$$ 100323 99394 98706 98177 97835 97806 97810 97286 96328 95910 96792 98531 99953 100349 99991 99706 100089 100988 101736 102071
53811A02071M70J144J482J146Q43J063J319J289J612K699L769M025L946M288M669
$$ 102071 102541 103685 105167 106313 107156 108219 109538 110827 112439 115138 118907 122932 126878 131166 135835
53796A35835M390L906M144M904N264N138N127N173M679L768L191L066K829K337
$$ 135835 140225 144131 148275 153179 158443 163581 168708 173881 178560 182328 185519 188585 191414 193751
53782A93751J976J718J178N40N24J318K284K698K233R14p12j715j783j682k113
$$ 193751 195727 197445 198623 199163 199687 201005 203289 205987 208220 209134 208422 206707 204924 203242 201129
53767B01129k668k720k652l152l848l851l284k987l102l099k972l099l124k332
$$ 201129 198461 195741 193089 189937 186089 182238 178954 175967 172865 169766 166794 163695 160571 158239
53753A58239j088o23j264k031k137j768j248n46J55L93K07J15J63j05o12n80K64
$$ 158239 157151 156528 155264 153233 151096 149328 148080 147534 147689 148082 148289 148404 148567 148462 147850 147270 147534
53736A47534J165J390J127R86J117J217J057P24M67L52N8p34j658j900j380j015
$$ 147534 148699 150089 151216 152202 153319 154536 155593 156317 156784 157136 157194 156460 154802 152902 151522 150507
53720A50507j393j855j580q07k40Q3M14M91J47N3P24J406J200O83J021J898J966
$$ 150507 149114 147259 145679 144872 144632 144715 145129 145620 145767 145820 146544 147950 149150 149833 150854 152752 154718
53703A54718J121P02J383K398L110L807M610M937M593M303M525M713M265L466
$$ 154718 155839 156541 157924 160322 163432 167239 171849 176786 181379 185682 190207 194920 199185 202651
53689B02651K930K822L016L505M277N171O039O688O764O175N470N230N247M907
$$ 202651 205581 208403 211419 214924 219201 224372 230411 237099 243863 250038 255508 260738 265985 270892
53675B70892M177L430K660J683Q22M89L59j04n58l44J70Kq25j347j339j543k166
$$ 270892 275069 278499 281159 282842 283664 284153 284512 284408 283850 283506 283676 283678 282853 281506 280167 278624 276458
53658B76458k462k078j637j541j393j020r88j614k376k770k874k737k063r73j52
$$ 276458 273996 271918 270281 268740 267347 266327 265339 263725 261349 258579 255705 252968 250905 249932 249780
53643B49780J28L40O49M26o86j932k303j635m82N88J174J070N09M3q6n3P4M29
$$ 249780 249908 250248 250897 251323 250637 248705 246402 244767 244285 244873 246047 247117 247626 247669 247583 247530 247604 248033
53625B48033R26J305J665K260K800K634J732P43J22j63l5P04J732K428K804L398
$$ 248033 248959 250264 251929 254189 256989 259623 261355 262098 262220 262057 262022 262726 264458 266886 269690 273088
53609B73088M243M814N082N607O393O680O228N786N899O156O161O300O980P768
$$ 273088 277331 282145 287227 292834 299227 305907 312135 317921 323820 329976 336137 342437 349417 357185
53595C57185P937P337O335N386N016N638O986Q142Q493Q242P802P252O632O177
$$ 357185 365122 372459 378794 384180 389196 394834 401820 409962 418455 426697 434499 441751 448383 454560
53581D54560N928N582N050M683M707M876M874M704M474M238M085M059L874L171
$$ 454560 460488 466070 471120 475803 480510 485386 490260 494964 499438 503676 507761 511820 515694 518865
53567E18865K108J325J258J803K497K734K041O77l54l98M8J62j9K0J81J3l63n23
$$ 518865 520973 522298 523556 525359 527856 530590 532631 533308 532954 532556 532604 532766 532747 532767 532948 532961 532598 532075
53549E32075n96q82r29k05O15L27r37j852j867j749k047k316k132j661r83L9J037
$$ 532075 531479 530597 529668 529463 530078 530405 529468 527616 525749 524000 521953 519637 517505 515844 514861 514900 515937
53532E15937J375J296J643K314K337J638J452K474L953N018N772O506P021P326
$$ 515937 517312 518608 520251 522565 524902 526540 527992 530466 534419 539437 545209 551715 558736 566062
53518E66062P987R217J0443J1270J1956J2710J3437J4351J5821J7430J8335J8738
$$ 566062 574049 583266 593709 604979 616935 629645 643082 657433 673254 690684 709019 727757
53506G27757J9666K1112K1963K2091K2834K4744K6559K7348K8042K9687L1567
$$ 727757 747423 768535 790498 812589 835423 860167 886726 914074 942116 971803 1003370
53495A003370L2482L2683L3192L4097L4838L5515L6619L7883L8461L8014L6899
$$ 1003370 1035852 1068535 1101727 1135824 1170662 1206177 1242796 1280679 1319140 1357154 1394053
53484A394053L5654L4861L4922L5479L5718L5679L6340L7962L9319L9356L8557
$$ 1394053 1429707 1464568 1499490 1534969 1570687 1606366 1642706 1680668 1719987 1759343 1797900
53473A797900L7900L7303L6085L4158L1924K9683K7775K6611K5865K4510K2298
$$ 1797900 1835800 1873103 1909188 1943346 1975270 2004953 2032728 2059339 2085204 2109714 2132012
53462B132012K0219J8839J7357J5198J3322J2766J2892J2330J0828Q883O369K938
$$ 2132012 2152231 2171070 2188427 2203625 2216947 2229713 2242605 2254935 2265763 2274646 2281015 2283953
53450B283953q09l987o868j0296j4033j6958j8804k0507k2847k5715k8733l1725
$$ 2283953 2283144 2279157 2272289 2261993 2247960 2231002 2212198 2191691 2168844 2143129 2114396 2082671
53438B082671l4405l6287l7065l6871l6362l6581l8125m0180m1142m0501l9349
$$ 2082671 2048266 2011979 1974914 1938043 1901681 1865100 1826975 1786795 1745653 1705152 1665803
53427A665803l8595l7792l6338l4692l3400l1920k9544k6708k4282k2284k0318
$$ 1665803 1627208 1589416 1553078 1518386 1484986 1453066 1423522 1396814 1372532 1350248 1329930
53416A329930j8576j7247j5638j2989r719o704l952j063J632L642N569Q453J2236
$$ 1329930 1311354 1294107 1278469 1265480 1255761 1249057 1245105 1244042 1245674 1249316 1254885 1263338 1275574
53403A275574J6007J9411K2638K5428K7306K8585K9997L1552L2902L4417L6725
$$ 1275574 1291581 1310992 1333630 1359058 1386364 1414949 1444946 1476498 1509400 1543817 1580542
53392A580542L9448M1720M3684M6195M9187N1772N3887N6471N9753O2804O5167
$$ 1580542 1619990 1661710 1705394 1751589 1800776 1852548 1906435 1962906 2022659 2085463 2150630
53381B150630O7741P1373P5540P9092Q1685Q3843Q5953Q7692Q8396Q7899Q6912
$$ 2150630 2218371 2289744 2365284 2444376 2526061 2609904 2695857 2783549 2871945 2959844 3046756
53370C046756Q6404Q6498Q6427Q5689Q4558Q3064Q0319P5653O9736O3779N8199
$$ 3046756 3133160 3219658 3306085 3391774 3476332 3559396 3639715 3715368 3785104 3848883 3907082
53359C907082N2955M8448M4912M1443L6895L1482K6162K0755J4123O295j008o462
$$ 3907082 3960037 4008485 4053397 4094840 4131735 4163217 4189379 4210134 4224257 4230552 4229544 4223082
53347D223082j0746j5649k2342l0930m1002n2102o3788p5303q5110r1378r3562
$$ 4223082 4212336 4196687 4174345 4143415 4102413 4050311 3986523 3911220 3826110 3734732 3641170
53336C641170r3271r2754r2780r2614r1711r0383q8970q7327q5336q3199q1153
$$ 3641170 3547899 3455145 3362365 3269751 3178040 3087657 2998687 2911360 2826024 2742825 2661672
53325B661672p9361p8016p7040p5843p3962p1603o9076o6042o2089n7553n2930
$$ 2661672 2582311 2504295 2427255 2351412 2277450 2205847 2136771 2070729 2008640 1951087 1898157
53314A898157m7949m2240l6644l2616l0438k8996k7338k5458k3513k1329j8798
$$ 1898157 1850208 1807968 1771324 1738708 1708270 1679274 1651936 1626478 1602965 1581636 1562838
53303A562838j6049j3078r860o777m254k156j83J383K110K353K808L463L941M549
$$ 1562838 1546789 1533711 1523851 1517074 1512820 1510664 1510481 1511864 1513974 1516327 1519135 1522598 1526539 1531088
53289A531088N875P517Q541R112J0426J2885J5674J8375K1640K5809K9974L3161
$$ 1531088 1536963 1544480 1553021 1562133 1572559 1585444 1601118 1619493 1641133 1666942 1696916 1730077
53277A730077L5495L7600L9535M0944M1673M1755M1230M0411L9831L9639L9419
$$ 1730077 1765572 1803172 1842707 1883651 1925324 1967079 2008309 2048720 2088551 2128190 2167609
53266B167609L8830L7876L6450L4192L1145K8047K5629K3930K2483K0848J8789
$$ 2167609 2206439 2244315 2280765 2314957 2346102 2374149 2399778 2423708 2446191 2467039 2485828
53255B485828J6243J3308J0091O575K785j077m884q778j2876j7074k1392k6083
$$ 2485828 2502071 2515379 2525470 2532045 2534830 2533753 2528869 2520091 2507215 2490141 2468749 2442666
53243B442666l1027l5558l9245m2333m4874m6268m6380m6390m7483m9208n0186
$$ 2442666 2411639 2376081 2336836 2294503 2249629 2203361 2156981 2110591 2063108 2013900 1963714
53232A963714m9955m9033m7642m5677m3580m1977m0646l8982l7369l6803l7241
$$ 1963714 1913759 1864726 1817084 1771407 1727827 1685850 1645204 1606222 1568853 1532050 1494809
53221A494809l7609l7491l7522l7998l8296l7871l6777l5035l2495k9526k6831
$$ 1494809 1457200 1419709 1382187 1344189 1305893 1268022 1231245 1196210 1163715 1134189 1107358
53210A107358k4561k2563k1326k1449k2211k2082k0857j9898j9968k0225j9785
$$ 1107358 1082797 1060234 1038908 1017459 995248 973166 952309 932411 912443 892218 872433
53199H72433j9032j8696j8809j9097j9469j9536j8630j6858j5336j4842j5052
$$ 872433 853401 834705 815896 796799 777330 757794 739164 722306 706970 692128 677076
53188F77076j5361j5636j5804j5663j5450j5654j6059j5929j5373j5337j5879
$$ 677076 661715 646079 630275 614612 599162 583508 567449 551520 536147 520810 504931
53177E04931j5806j4569j3248j2927j3145j2818j1785j0595r644r179r387r736
$$ 504931 489125 474556 461308 448381 435236 422418 410633 400038 390394 381215 371828 362092
53165C62092r112p323n700n462o239o881o945o629o005n167m568m463m432m085
$$ 362092 352980 345657 339957 334495 328256 321375 314430 307801 301796 296629 292061 287598 283166 279081
53151B79081l653l416l193k902k947l373l465k782j928j551j333p22pJ56k47q18
$$ 279081 275428 272012 268819 265917 262970 259597 256132 253350 251422 249871 248538 247816 247809 247965 247718 246900
53135B46900j383j690j119M82K154K880K841K941L492M079M369M282L832L352
$$ 246900 245517 243827 242708 243190 245344 248224 251065 254006 257498 261577 265946 270228 274060 277412
53121B77412L471M150M322L175J347L7n67j147k032l013m056n248o203o357n793
$$ 277412 280883 285033 289355 292530 293877 293914 293347 292200 290168 287155 283099 277851 271648 265291 259498
53106B59498n064m425l833l494l660m043m115l902l834l994m125m179m203m014
$$ 259498 254434 250009 246176 242682 239022 234979 230864 226962 223128 219134 215009 210830 206627 202613
53092B02613l580l539m413n510n544m298k872k164k020k101k557l335l580k530
$$ 202613 199033 195494 191081 185571 180027 175729 172857 170693 168673 166572 164015 160680 157100 154570
53078A54570o41P27P44k63j390k015k064j801j497j208p76j53L90M84J30k97n58
$$ 154570 153929 154656 155400 155137 153747 151732 149668 147867 146370 145162 144386 144233 144623 145107 145237 144940 144382
53061A44382p82j050r50o8J177J707J050j2m19r1K12J6l47k86L73J238J681J374
$$ 144382 143600 142550 141600 141532 142709 144416 145466 145454 145035 144944 145156 145172 144825 144539 144912 146150 147831 149205
53043A49205O01j25p60j621k565k920k480j805j186k10J067J571P70j83j11K70
$$ 149205 149806 149681 148921 147300 144735 141815 139335 137530 136344 136134 137201 138772 139542 139359 139248 139518
53027A39518m17j742k043j112m38p05r34l95K84M47L49K05k62p73m64N17P67j84
$$ 139518 139101 137359 135316 134204 133766 133061 132127 131732 132016 132463 132812 133017 132755 131982 131518 132035 132802 132618
53009A32618r60m67M46N41J50K62P80J003J057J472J953J820J236R11R52R99J121
$$ 132618 131658 131191 131637 132178 132328 132590 133370 134373 135430 136902 138855 140675 141911 142822 143774 144773 145894
52992A45894J554J911J604Q85N19P06J016J268J673K314L074L947M883N479N404
$$ 145894 147448 149359 150963 151848 152367 153073 154089 155357 157030 159344 162418 166365 171248 176727 182131
52977A82131M910M551M557M796N030M921M174K924J619L97q83j927k185j902j996
$$ 182131 187041 191592 196149 200945 205975 210896 215070 217994 219613 220010 219127 217200 215015 213113 211117
52962B11117k571k682k085k006l208m518m405l160k210j952j579p53j21k51r26
$$ 211117 208546 205864 203779 201773 198565 194047 189642 186482 184272 182320 180741 179988 179867 179616 178690
52947A78690j560j668j123m50m90j269j669q26O55J561J543J079N22Qj75P2L55
$$ 178690 177130 175462 174339 173889 173399 172130 170461 169635 170290 171851 173394 174473 174995 175003 174828 174900 175255
52930A75255M17N73R22Q58J44l25K14J091J151L92m06r84j418j296m53P2p54k134
$$ 175255 175672 176245 177167 178025 178169 177844 178058 179149 180300 180692 180286 179302 177884 176588 176135 176207 175453 173319
52912A73319k304j071J6j4n09o81o91p87n70K15R81J019M42j0J78Q56J374J205
$$ 173319 171015 169944 169960 169946 169437 168756 168065 167278 166708 166923 167904 168923 169365 169355 169533 170389 171763 172968
52894A72968N93L37O97J007P71M71O54Q99O07J73K96O49M37j16j39K50O4q07j275
$$ 172968 173561 173898 174595 175602 176373 176844 177498 178397 179004 179177 179473 180122 180559 180443 180304 180554 180618 179811 178536
52875A78536p21K54R79J512J957J978J529J194J389J851K201K360K242J749J266
$$ 178536 177815 178069 179048 180560 182517 184495 186024 187218 188607 190458 192659 195019 197261 199010 200276
52860B00276J460K329L080L251L243L534L942M099M051M058M099L881L141J829
$$ 200276 201736 204065 207145 210396 213639 217173 221115 225214 229265 233323 237422 241303 244444 246273
52846B46273L13p66j152j361j911k409k063r70j45k06p72j314j813k362k741k849
$$ 246273 246586 245820 244668 243307 241396 238987 236924 235954 235809 235603 234831 233517 231704 229342 226601 223752
52830B23752l042l597m135l982l074k152k009k630l241l195k666k237k086j991
$$ 223752 220710 217113 212978 208996 205922 203770 201761 199131 195890 192695 190029 187792 185706 183715
52816A83715j946k182k550k602k377k322k300j713q21p91j823k434j492Q3P22
$$ 183715 181769 179587 177037 174435 172058 169736 167436 165723 164902 164111 162288 159854 158362 158445 159167
52801A59167L24j57n25j259k155k417j920j299r37q22j061j622j939j642j283
$$ 159167 159491 159334 158809 157550 155395 152978 151058 149759 148822 148000 146939 145317 143378 141736 140453
52786A40453j391j438q02j62n05j386j619j316j573k352k387j304k83k73q75j277
$$ 140453 139062 137624 136822 136660 136155 134769 133150 131834 130261 127909 125522 124218 123935 123662 122787 121510
52770A21510j158m87M87R53K87q19j104n09j25m82j152j931k929l484k576o68
$$ 121510 120352 119865 120352 121305 121592 120773 119669 119160 119035 118553 117401 115470 112541 109057 106481 105813
52754A05813L91k68j574k363k709k919k627j673p78n78q05r50r15o46m6M19K9
$$ 105813 106204 105936 104362 101999 99290 96371 93744 92071 91293 90715 89910 88960 88045 87399 87353 87772 87801
52737H7801r33j323p78j66l8R4N29O89K83l4J72L16r4n40l82J85P08J188J609
$$ 87801 86868 85545 84767 84601 84563 84657 85186 85875 86158 86124 86296 86612 86518 85978 85596 85781 86489 87677 89286
52718H9286J595J083O45O36Q31J180J968K891L069K454K135K743L566L845L772
$$ 89286 90881 91964 92609 93245 94076 95256 97224 100115 103184 105638 107773 110516 114082 117927 121699
52703A21699L633L117K177J439J020P2j697l172l398k912k596k344j865j727k338
$$ 121699 125332 128449 130626 132065 133085 133157 131460 128288 124890 121978 119382 117038 115173 113446 111108
52688A11108k860k409j561j417j871k097k122k542l109k957k051j250j056j181
$$ 111108 108248 105839 104278 102861 100990 98893 96771 94229 91120 88163 86112 84862 83806 82625
52674H2625j310j374j275j022r74j345j756j836j777j721j197QJ032R65J63l59
$$ 82625 81315 79941 78666 77644 76670 75325 73569 71733 69956 68235 67038 67046 68078 69043 69206 68847
52658F8847m55p22j180j239p78k65J20N36P19J38r92j679j307k53P00J004N80
$$ 68847 68392 67670 66490 65251 64473 64208 64328 64864 65583 65721 64729 63050 61743 61490 62190 63194 63774
52641F3774j58m76j11K73n7p91r93m10L13P27J094J672K129K013J471J110J189
$$ 63774 63616 63140 63029 63302 63245 62454 61461 61051 61364 62091 63185 64857 66986 68999 70470 71580 72769
52624G2769J265P27l11j013r17p15j274k183k112p24P88J359J294J287J218P37
$$ 72769 74034 74761 74450 73437 72520 71805 70531 68348 66236 65512 66300 67659 68953 70240 71458 72195
52608G2195K42K45L64p1p08n00P25J885J916Q69k91n69K22J207J219J60p87o32
$$ 72195 72437 72682 73046 72975 72267 71767 72492 74377 76293 77162 76871 76302 76524 77731 78950 79110 78323 77691
52590G7691K70J006J474K098K616K217Q75k39n1J195K255K216J323O03O92J188
$$ 77691 77961 78967 80441 82539 85155 87372 88247 88008 87957 89152 91407 93623 94946 95549 96241 97429
52574I7429J357J282J622K345K494J650P53Q98J835K369J933J012L16M9Kn7j40
$$ 97429 98786 100068 101690 104035 106529 108179 108932 109830 111665 114034 115967 116979 117295 117344 117346 117289 117149
52557A17149m5K84M91L01J25O11J541K002J709J390J507J584J153O15N09P51J035
$$ 117149 117104 117388 117879 118180 118305 118916 120457 122459 124168 125558 127065 128649 129802 130417 130926 131677 132712
52540A32712J292J337Q33J14P4P40R21oj005r77m32m38p98n52K96Q37P40M57K06
$$ 132712 134004 135341 136174 136288 136362 137102 138023 138017 137012 136035 135603 135165 134367 133815 134111 134948 135688 136145 136351
52521A36351k13o71p47m33r4O0k4m36r47r54l71K1j90k65M16J080O95l21p06k17
$$ 136351 136138 135467 134720 134287 134193 134253 134229 133793 132846 131892 131521 131542 131352 131087 131503 132583 133278 132957 132251 132034
52501A32034L51N99P54P49L53j3K74Q68Q87L28o2j59n40j153j174l04P48J298
$$ 132034 132385 132984 133738 134487 134840 134827 135101 135969 136856 137184 137122 136963 136423 135270 134096 133792 134540 135838
52483A35838J304R41L77O0L30P51O04l7m57l86n2N64J520K220J967J232J079J503
$$ 135838 137142 138083 138460 138520 138850 139601 140205 140168 139711 139325 139273 139837 141357 143577 145544 146776 147855 149358
52465A49358J476P57K90O27J192J463J743K239K443K055J611J578J602J222O79
$$ 149358 150834 151591 151881 152508 153700 155163 156906 159145 161588 163643 165254 166832 168434 169656 170335
52450A70335M96P67J243J648J661J059J63l63l50k64m31p45j223k088l109l583
$$ 170335 170831 171598 172841 174489 176150 177209 177372 177009 176659 176395 175964 175219 173996 171908 168799 165216
52434A65216l235k591k189k059k115k408k720k599k059j674j670j607j208q80
$$ 165216 161981 159390 157201 155142 153027 150619 147899 145300 143241 141567 139897 138290 137082 136202
52420A36202j031j431j622j492j091l83M60R30P66L46J77K75L19J14k86p23r74
$$ 136202 135171 133740 132118 130626 129535 129152 129612 130542 131308 131654 131831 132106 132425 132539 132253 131530 130556
52403A30556q47m09K4K23J98N7j31l50o33r15q68j61R84J852K142K337K785L000
$$ 130556 129709 129300 129324 129547 129745 129802 129671 129321 128688 127773 126905 126744 127728 129580 131722 134059 136844 139844
52385A39844K438J428O85L21J51M48J442K415K356J424P08O75Q55J009J465K134
$$ 139844 142282 143710 144395 144716 144867 145315 146757 149172 151528 152952 153660 154335 155190 156199 157664 159798
52369A59798K303J800J374J541J808J588J177J321K169L134L586L438L173L274
$$ 159798 162101 163901 165275 166816 168624 170212 171389 172710 174879 178013 181599 185037 188210 191484
52355A91484L542L264K357J731K002K437K024J096P89J220J534J553K026L075
$$ 191484 195026 198290 200647 202378 204380 206817 208841 209937 210726 211946 213480 215033 217059 220134
52341B20134L700L278K462K140K317K537K596K473K192K064K411K870K730K052
$$ 220134 223834 227112 229574 231714 234031 236568 239164 241637 243829 245893 248304 251174 253904 255956
52327B55956J663J855J978J601J151J060J148J211J484K059K533K694K854L299
$$ 255956 257619 259474 261452 263053 264204 265264 266412 267623 269107 271166 273699 276393 279247 282546
52313B82546L896M455M866M839M262L875M627O216P307P368P299P851Q652R225
$$ 282546 286442 290897 295763 300602 304864 308739 313366 319582 326889 334257 341556 349407 358059 367284
52299C67284R876J0933J2021J2822J3662J4730J5501J5584J5349J5121J4669J4113
$$ 367284 377160 388093 400114 412936 426598 441328 456829 472413 487762 502883 517552 531665
52287E31665J4386J5844J7294J7425J6581J6064J6214J6210J5519J4533J3864
$$ 531665 546051 561895 579189 596614 613195 629259 645473 661683 677202 691735 705599
52276G05599J3749J4048J4299J3920J2829J1645J0848J0149R141Q088P406O839
$$ 705599 719348 733396 747695 761615 774444 786089 796937 807086 816227 824315 831721 838560
52264H38560N836M486L386K764K370K030J744J313M95m55r38p68m36n70j307k223
$$ 838560 844396 848882 852268 855032 857402 859432 861176 862489 862984 862529 861591 860823 860387 859817 858510 856287
52248H56287k700k440j698r44k97M97J518K426K909L068L287L951N293P207R198
$$ 856287 853587 851147 849449 848505 848208 848705 850223 852649 855558 858626 861913 865864 871157 878364 887562
52233H87562J0748J1711J2146J2065J1753J1846J2484J2790J2053J1014J0861
$$ 887562 898310 910021 922167 934232 945985 957831 970315 983105 995158 1006172 1017033
52222A017033J1240J0591Q581O677N941N647M760L546K799K425J749N60j000k971
$$ 1017033 1028273 1038864 1047445 1054122 1060063 1065710 1070470 1074016 1076815 1079240 1080989 1081549 1080549 1077578
52208A077578n202o966p680p644p549p672p997q583r303r732r755r785j0021j0059
$$ 1077578 1072376 1065410 1057730 1050086 1042537 1034865 1026868 1018285 1008982 999250 989495 979710 969689 959630
52194I59630r646r072q439p350n856m851m852n140m822m047l408k881k187j656
$$ 959630 949984 940912 932473 925123 919267 914416 909564 904424 899602 895555 892147 889266 887079 885423
52180H85423j774k321k679k649k322j631o93j22l15q41j117j216j405j507j358
$$ 885423 883649 881328 878649 876000 873678 872047 871354 871232 870917 870076 868959 867743 866338 864831 863473
52165H63473j331j701k102k287k752l813m755m820m396m219m097l546l160l899
$$ 863473 862142 860441 858339 856052 853300 849487 844732 839912 835516 831297 827200 823654 820494 816595
52151H16595n264n664m595l215k552k363k172k242k871l490l303k499k114k748
$$ 816595 811331 805667 801072 797857 795305 792942 790770 788528 785657 782167 778864 776365 774251 771503
52137G71503l827m284l770k981k763l106l335l042k463j952j682j823k406k984
$$ 771503 767676 763392 759622 756641 753878 750772 747437 744395 741932 739980 738298 736475 734069 731085
52123G31085l026k755k877l420l672l401l114k939k353j450j219j905k329j684
$$ 731085 728059 725304 722427 719007 715335 711934 708820 705881 703528 702078 700859 698954 696625 694941
52109F94941q25p35p73J97J860L038L601M383N607O664P248P583P755P813Q279
$$ 694941 694116 693381 692608 692805 694665 697703 701304 705687 711294 717958 725206 732789 740544 748357 756636
52094G56636R581J1252J2647J4012J5902J7907J9165J9755K0383K1037K1123K0760
$$ 756636 766217 777469 790116 804128 820030 837937 857102 876857 897240 918277 939400 960160
52082I60160K0652K0785K0456J9552J8646J7821J6589J5010J3719J2681J1117
$$ 960160 980812 1001597 1022053 1041605 1060251 1078072 1094661 1109671 1123390 1136071 1147188
52071A147188Q859O731N248L989K572J247J78r89k399l619m431n308o646q078
$$ 1147188 1156047 1162778 1168026 1172015 1174587 1175834 1176012 1175023 1172624 1169005 1164574 1159266 1152620 1144542
52057A144542r015r428r695r996j0102r619q343o646n341m928n078n111m683l702
$$ 1144542 1135527 1126099 1116404 1106408 1096306 1086687 1078344 1071698 1066357 1061429 1056351 1051240 1046557 1042855
52043A042855k101k66Q23O66O6J49Q89J505J917K730L951M855N210N610O402P155
$$ 1042855 1040754 1040488 1041311 1041977 1042043 1042192 1043081 1044586 1046503 1049233 1053184 1058039 1063249 1068859 1075261 1082416
52027A082416P370P109O651O162N785N558N210M548L851L434L015K196J241O16
$$ 1082416 1089786 1096895 1103546 1109708 1115493 1121051 1126261 1130809 1134660 1138094 1141109 1143305 1144546 1145162
52013A145162P0j028k637m221n751p599r556j0918j1564j2109j3028j4344j5982
$$ 1145162 1145232 1144204 1141567 1137346 1131595 1123996 1114440 1103522 1091958 1079849 1066821 1052477 1036495
52000A036495j7673j8782j9100j9511k0851k2518k3270k3029k2637k2136k0936
$$ 1036495 1018822 1000040 980940 961429 940578 918060 894790 871761 849124 826988 806052
51989H06052j9500j9145j9948k0517k0199j9898k0202k0283j9491j8633j8625
$$ 806052 786552 767407 747459 726942 706743 686845 666643 646360 626869 608236 589611
51978E89611j9010j8803j7912j6866j5839j4834j4132j3810j3377j2522j1703
$$ 589611 570601 551798 533886 517020 501181 486347 472215 458405 445028 432506 420803
51967D20803j1288j0824r697q091o684n794n329n162n144n118n123n199m940l906
$$ 420803 409515 398691 388994 380903 374219 368425 363096 357934 352790 347672 342549 337350 332410 328504
51953C28504k624k261l105m117m332l863l181k383j666j600k223k641k161j251
$$ 328504 325880 323619 320514 316397 312065 308202 305021 302638 300972 299372 297149 294508 292347 291096
51939B91096o94n03k27J71M43N89O43L38n25j692k766l547l818l380k618k337
$$ 291096 290402 289899 289672 289843 290286 290875 291518 291856 291331 289639 286873 283326 279508 276128 273510 271173
51923B71173k718l006k638j989j596j424j356j705k574l300l198k385j416o36
$$ 271173 268455 265449 262811 260822 259226 257802 256446 254741 252167 248867 245669 243284 241868 241232
51909B41232k23l34o56m86K35N96K9p49p50j02K71p3q23j555j939j672q40p3J03
$$ 241232 241009 240675 240019 239533 239768 240364 240393 239644 238894 238792 239063 238990 238167 236612 234673 233001 232161 232088 232191
51890B32191j49l56l35n6N59J290J510R59K12k8K77P43J146J338J149P22M94M81
$$ 232191 232042 231686 231351 231295 231854 233144 234654 235613 235825 235797 236074 236817 237963 239301 240450 241172 241666 242147
51872B42147J94m14o29j19M08K73j16rN03Q45R82J276J684J872J847J800J671
$$ 242147 242341 241927 241298 241179 241587 241860 241744 241735 242238 243083 244065 245341 247025 248897 250744 252544 254215
51855B54215J466J574K169K703K654K346K385K691K809K734K684K430J720R86
$$ 254215 255681 257255 259424 262127 264781 267127 269512 272203 275012 277746 280430 282860 284580 285566
51841B85566P64O64j52j549k472k460k185k299k455j869m38J037J624J117K39
$$ 285566 286330 286994 286842 285293 282821 280361 278176 275877 273422 271553 271115 272152 273776 274893 275132
51826B75132j04K42O93Q50R84J353J656J517J109Q30Q13J078J668K223J977P50
$$ 275132 275028 275270 275963 276813 277797 279150 280806 282323 283432 284262 285075 286153 287821 290044 292021 292771
51810B92771n18q86n66m05o39r27j124j328j445j383j438j831k202k190k047j994
$$ 292771 292253 291367 290801 290396 289757 288830 287706 286378 284933 283550 282112 280281 278079 275889 273842 271848
51794B71848j513j99J136J354P01M93J121J559J082L06J50N68Q62O69J26n40j227
$$ 271848 270335 270136 271272 272626 273327 273820 274941 276500 277582 277888 278038 278606 279468 280137 280263 279723 278496
51777B78496j954k739l306l058j769j70P17P37N17L21k15j080j453p44M77J110
$$ 278496 276542 273803 270497 267439 265670 265500 266217 266954 267471 267792 267577 266497 265044 264300 264777 265887
51761B65887P51o9o56p58n29k24mQ7J25K85P82J668K729L688M462M916M530K827
$$ 265887 266638 266569 265913 265155 264626 264402 264398 264485 264610 264895 265677 267345 270074 273762 278224 283140 287670 290497
51743B90497L08j692k435k565l013l648l680k997k295j979j686r88p7M53K23n70
$$ 290497 290805 289113 286678 284113 281100 277452 273772 270775 268480 266501 264815 263827 263750 264203 264426 263856
51727B63856j206r89m8O42L35o12j305j446j401j418j437j549k012k703l113l062
$$ 263856 262650 261661 261613 262255 262590 261978 260673 259227 257826 256408 254971 253422 251410 248707 245594 242532
51711B42532k945l082l191k822k136j904k679m037m820m319l009j961j632j621
$$ 242532 239587 236505 233314 230492 228356 226452 223773 219736 214916 210597 207588 205627 203995 202374
51697B02374j466j131o93j83J45kl27j82M35Q81J063J675K828L527L314L368M887
$$ 202374 200908 199777 199084 198901 199046 199044 198717 198535 198970 199851 200914 202589 205417 208944 212258 215626 220513
51680B20513P097Q127P350N769M343L212K413K190K425K665K836L277M069M884
$$ 220513 227610 235737 243087 248856 253199 256411 258824 261014 263439 266104 268940 272217 276286 281170
51666B81170N477N713N352M445L634L330K909J533n58k524m282o223p842q037
$$ 281170 286647 292360 297712 302157 305791 309121 312030 313563 313005 310481 306199 299976 292134 284097
51652B84097o869n814n852o430o644o408o003n370m466l616l041k582k167j952
$$ 284097 277228 271414 265562 259132 252488 246080 240077 234707 230241 226625 223584 221002 218835 216883
51638B16883j814j386q49r25j722k343k051j224p34r53j672k395k421j290M38
$$ 216883 215069 213683 212834 211909 210187 207844 205793 204569 203835 202882 201210 198815 196394 195104 195542
51623A95542J428J025n8p70q66o48l04Rl6m06m91R6Q98J305J406J579J674J295
$$ 195542 196970 197995 197937 197167 196301 195653 195349 195358 195322 194916 194425 194521 195419 196724 198130 199709 201383 202678
51605B02678O74N20J027J573J531R71N04O08J187J725J910K060K735L925M955
$$ 202678 203352 203872 204899 206472 208003 208974 209478 210086 211273 212998 214908 216968 219703 223628 228583
51590B28583N283N115N002N246N817O601P450Q158Q579Q667Q457Q231Q477R232
$$ 228583 233866 238981 243983 249229 255046 261647 269097 277255 285834 294501 302958 311189 319666 328898
51576C28898R578Q421N885L307J649N45p40k116l026l388l590l789l860l866l970
$$ 328898 338476 346897 352782 356089 357738 358283 357543 355427 352401 349013 345423 341634 337774 333908 329938
51561C29938l982l465k338r48M47J988L822N697P054P572P499P462P815Q272Q333
$$ 329938 325956 322491 320153 319205 319652 321640 325462 331159 338213 345785 353284 360746 368561 376833 385166
51546C85166P981P612P305O577N109L379K188J731J426O88m51j488k085k369k606
$$ 385166 393147 400759 408064 414641 419750 423129 425317 427048 428474 429162 428711 427223 425138 422769 420163
51531D20163k641k023o89P15J537J856K128K315J935R52n6p23j421k623m208n643
$$ 420163 417522 415499 414810 415525 417062 418918 421046 423361 425296 426248 426192 425469 424048 421425 417217 411574
51515D11574o633p233p610p875q011p816p088o051n371n507o194o677o441n588
$$ 411574 404941 397708 390098 382223 374212 366396 359308 353257 347886 342379 336185 329508 323067 317479
51501C17479m663m139m019l915l590l283l265l283k813j846j025r28j526k351
$$ 317479 312816 308677 304658 300743 297153 293870 290605 287322 284509 282663 281638 280710 279184 276833
51487B76833k904k812k038j058n53o96r89q68k26O72J515K069K296K431K799L413
$$ 276833 273929 271117 269079 268021 267468 266772 265783 264915 264689 265361 266876 268945 271241 273672 276471 279884
51471B79884M018M487M956N536O127O528O579O246N844N982O910Q001Q327P718
$$ 279884 283902 288389 293345 298881 305008 311536 318115 324361 330205 336187 343097 351098 359425 367143
51457C67143O823O130N512M804M244M022L813L088J722J34j009j219n52L63R34
$$ 367143 373966 380096 385608 390412 394656 398678 402491 405579 407301 407435 406426 405207 404655 405018 405952
51442D05952J167J335J282N71o92j804k366k764l581m944o617q337r806j0735
$$ 405952 407119 408454 409736 410307 409615 407811 405445 402681 399100 394156 387539 379202 369396 358661
51428C58661j1074j0982j0540r809r079q622q172p179n668m332l717l697l824
$$ 358661 347587 336605 326065 316256 307177 298555 290383 283204 277536 273204 269487 265790 261966
51415B61966l634k647p48J366K741L326L908M850N729O385P321Q577R222Q704
$$ 261966 258332 255685 254937 256303 259044 262370 266278 271128 276857 283242 290563 299140 308362 317066
51401C17066P857P697P844P114N208K821L71k374n402q065r781j0532j0626j0446
$$ 317066 324923 332620 340464 347578 352786 355607 355978 353604 348202 340137 330356 319824 309198 298752
51387B98752j0429j0836j1348j1407j0838r891q702p280n943n223n198n382n410
$$ 298752 288323 277487 266139 254732 243894 234003 225301 218021 212078 206855 201657 196275 190865
51374A90865n420n577n673n438m945m409l787k915j920j249j185j506j676j361
$$ 190865 185445 179868 174195 168757 163812 159403 155616 152701 150781 149532 148347 146841 145165 143804
51360A43804p29k36j66l85n77o09n35m14k11Q3M53R02J361J478Q71k24q01q2J373
$$ 143804 143075 142839 142673 142288 141711 141102 140567 140153 139942 140025 140478 141380 142741 144219 145090 144866 144065 143983 145356
51341A45356K016J083m50j066m38N22J070J308J557J870K343L163M029M306M034
$$ 145356 147372 148455 148005 146939 146501 147023 148093 149401 150958 152828 155171 158334 162363 166669 170703
51326A70703M153N157O302O737O778P309Q386R274R525R212Q364O992N427L966
$$ 170703 174856 180013 186315 193052 199830 207139 215525 224799 234324 243536 251900 258892 264319 268285
51312B68285K405N27j279k660m081o047p943q671q254p665p301o827o372o596
$$ 268285 270690 271217 269938 267278 263197 257150 249207 240536 232282 224617 217316 210489 204117 197521
51298A97521p376p742p312o645n912m512k431p40j81k37k06j54k52j92R4j7p91
$$ 197521 190145 182403 175091 168446 162534 158022 155591 154851 154670 154433 154227 154073 153821 153629 153723 153706 152915
51281A52915j502j507j216j271j570j713j738j724j390p33l97o98j023q50n63
$$ 152915 151413 149906 148690 147419 145849 144136 142398 140674 139284 138551 138154 137456 136433 135583 135020
51266A35020n50l11N89J458J345N09l3R9N42J017J317R75r0r67p66K9J39p92j921
$$ 135020 134470 134159 134748 136206 137551 138060 138027 138126 138668 139685 141002 141977 141887 140920 140154 140183 140322 139530 137609
51247A37609k432k219j580j004j052j694k039j460o02m42p24m49M18Q46L85k27
$$ 137609 135177 132958 131378 130374 129322 127628 125589 124129 123527 123085 122361 121912 122330 123176 123561 123334
51231A23334l08j00p6j31J12O86J238J298O21m07q53k36P18R03K14n38q67r96
$$ 123334 123026 122926 122850 122719 122831 123517 124755 126053 126674 126267 125414 125178 125896 126799 127013 126475 125608 124612
51213A24612j064q21k38L52Q50J480K103K121J363M93K67P34J411J843J779J176
$$ 124612 123548 122727 122489 122841 123691 125171 127274 129395 130758 131251 131518 132252 133663 135506 137285 138461
51197A38461K51o09j079r58j98Q20J262O33m49p81N3J187J537R69K62J07L92M51
$$ 138461 138712 138103 137024 136066 135868 136688 137950 138583 138134 137353 137406 138593 140130 141099 141361 141468 141860 142311
51179A42311L9k16L91J504J978J445Q66J083J587J349L92l41l77j89l57r59j738
$$ 142311 142350 142134 142525 144029 146007 147452 148318 149401 150988 152337 152729 152388 152011 151822 151465 150506 148768
51162A48768k351k530k369k288k403k338j975j830k063j880p77K73P2q66r61L3
$$ 148768 146417 143887 141518 139230 136827 134489 132514 130684 128621 126741 125964 126237 126309 125443 124482 124515
51146A24515P34L41l19l07R6K89M54J047J840K314K471K657K943L193L330L148
$$ 124515 125249 125590 125271 124964 125060 125349 125803 126850 128690 131004 133475 136132 139075 142268 145598 148746
51130A48746K226N64j034j697j490j205j383j882k343k644k829k851k596k118
$$ 148746 150972 151536 150502 148805 147315 146110 144727 142845 140502 137858 135029 132178 129582 127464
51116A27464j692j469j221o66k5J35l30r12j172j161r40k64P35J280J025Q21J533
$$ 127464 125772 124303 123082 122416 122391 122526 122196 121284 120112 118951 118011 117747 118482 119762 120787 121608 123141
51099A23141K539K440J089j88m12M0L45K69Nk19r1N45J210J208P05O69J502K383
$$ 123141 125680 128120 129209 129021 128609 128649 128994 129263 129268 129049 128958 129503 130713 131921 132626 133295 134797 137180
51081A37180K401J668R08M63K21N7p5k74m62l39K51J030J660K109K466K638K430
$$ 137180 139581 141249 142157 142620 142841 142898 142823 142549 142087 141748 141999 143029 144689 146798 149264 151902 154332
51064A54332J837J098N40L30K61q7p83j264r37J28J335K220K613K434J798J217
$$ 154332 156169 157267 157807 158137 158398 158311 157528 156264 155327 155455 156790 159010 161623 164057 165855 167072
51048A67072J197J613J880J635J012L26j49l66o79j465k273j973l46J189J258
$$ 167072 168269 169882 171762 173397 174409 174735 174586 174220 173541 172076 169803 167830 167484 168673 169931
51033A69931L84L7M41N68N0l09m9K68J57j12k47l36k48L38J032R06k4n26J87J426
$$ 169931 170315 170352 170793 171361 171411 171102 171053 171321 171478 171366 171119 170783 170535 170873 171905 172811 172787 172261 172448 173874
51013A73874K141K176J849J224M41P7M79J220J759K105K410K593K692L021L529
$$ 173874 176015 178191 180040 181264 181705 181782 182261 183481 185240 187345 189755 192348 195040 198061 201590
50998B01590L688L375L184L414L562L305L211L857M955O014P122Q326Q960Q550
$$ 201590 205278 208653 211837 215251 218813 222118 225329 229186 234141 240155 247277 255603 264563 273113
50984B73113P852Q038R158J0265J0861J1372J2244J3405J4719J6414J8805K1781
$$ 273113 280965 289003 298161 308426 319287 330659 342903 356308 371027 387441 406246 428027
50972D28027K4747K7088K8900L1169L4825L9618M4303M7995N0766N3050N5163
$$ 428027 452774 479862 508762 539931 574756 614374 658677 706672 757438 810488 865651
50961H65651N7574O0651O3749O5414O4946O2981O0143N6086N0493M4089L7676
$$ 865651 923225 983876 1047625 1113039 1177985 1240966 1301109 1357195 1407688 1451777 1489453
50950A489453L1022K3629J6058R337L573j814o744j0476j2800j4181j4788j4213
$$ 1489453 1520475 1544104 1560162 1569499 1573072 1571258 1564514 1554038 1541238 1527057 1512269 1498056
50938A498056j2360r855p473n750n115n778p469r762j2728j6726k1572k6444l0752
$$ 1498056 1485696 1475841 1468368 1462618 1457503 1451725 1444256 1434494 1421766 1405040 1383468 1357024 1326272
50925A326272l4678l8715m3035m7261n0700n2745n3266n2620n1192m9154m6702
$$ 1326272 1291594 1252879 1209844 1162583 1111883 1059138 1005872 953252 902060 852906 806204
50914H06204m4105m1291l7901l4068l0599k7923k5355k2088j8501j5741j4219
$$ 806204 762099 720808 682907 648839 618240 590317 564962 542874 524373 508632 494413
50903D94413j3151j1583r299o751m573l213k658k459k203j774j173m37P6j67j025
$$ 494413 481262 469679 460380 453629 449056 445843 443185 440726 438523 436749 435576 435139 435215 435048 434023
50888D34023j500q34N75J873K783L473L831L686L379L462M014M816N882P193Q238
$$ 434023 432523 431689 432264 434137 436920 440393 444224 447910 451289 454751 458765 463581 469463 476656 484894
50873D84894Q579Q582Q874R366R645J0017J1231J3243J5198J6701J8295K0514
$$ 484894 493473 502055 510929 520295 529940 539957 551188 564431 579629 596330 614625 635139
50861F35139K3222K6043K8830L1600L4604L8499M3826N0279N7090O4140P1957
$$ 635139 658361 684404 713234 744834 779438 817937 861763 912042 969132 1033272 1105229
50850A105229Q0614Q9467R8146J07027J16313J25310J33004J38907J43085J45768
$$ 1105229 1185843 1275310 1373456 1480483 1596796 1722106 1855110 1994017 2137102 2282870
50840B282870J47095J46725J43382J35472J22427J05210Q5301O3868M2088K1477
$$ 2282870 2429965 2576690 2720072 2855544 2977971 3083181 3168482 3232350 3274438 3295915
50830C295915L198j2572k6052l6868m4163m7439m6845m2873l6169k7569j7950
$$ 3295915 3299113 3286541 3260489 3223621 3179458 3132019 3085174 3042301 3006132 2978563 2960613
50819B960613q272M1N095N524J484n767j5230k6641l9808n4013o8333q2079r4645
$$ 2960613 2952341 2952382 2957477 2963001 2964485 2958718 2943488 2916847 2877039 2823026 2754693 2672614 2577969
50806B577969j05302j13531j19281j22523j22764j19524j13253j05227r6369q6709
$$ 2577969 2472667 2359136 2239855 2117332 1994568 1875044 1761791 1656564 1560195 1473486
50796A473486p6163o5324n4947m5013l4974k4693j4609m981M410J3669K2445L0336
$$ 1473486 1397323 1331999 1277052 1232039 1197065 1172372 1157763 1152782 1157192 1170861 1193306 1223642
50784A223642L7182M2767M6741M8982M9671M8741M5728M0428L3384K5488J7464
$$ 1223642 1260824 1303591 1350332 1399314 1448985 1497726 1543454 1583882 1617266 1642754 1660218
50773A660218R910L283k452p754j2711j6877k0237k3770k8374l3634l8325m1821
$$ 1660218 1670128 1673411 1670959 1663205 1650494 1633617 1613380 1589610 1561236 1527602 1489277 1447456
50761A447456m4342m5983m6339m5185m2863l9831l6214l1986k7324k2637j8419
$$ 1447456 1403114 1357131 1310792 1265607 1222744 1182913 1146699 1114713 1087389 1064752 1046333
50750A046333j5011j2280r625o566l204NK865N536Q238J1172J4604J8752K3594
$$ 1046333 1031322 1019042 1009417 1002851 999647 999652 1002517 1008053 1016291 1027463 1042067 1060819 1084413
50737A084413K9023L5021M1491M8149N4757O1411O8340P5619Q3085R0307R6408
$$ 1084413 1113436 1148457 1189948 1238097 1292854 1354265 1422605 1498224 1581309 1671616 1768024
50726A768024J00343J01646J00577R7376R1778Q3561P3069O0746M6688L1126J4942
$$ 1768024 1868367 1970013 2070590 2167966 2259744 2343305 2416374 2477120 2523808 2554934 2569876
50715B569876r54j6362l1185m4325n4026n9313o0553n8609n4046m7247l8788k9498
$$ 2569876 2568922 2552560 2521375 2477050 2423024 2363711 2303158 2244549 2190503 2143256 2104468 2074970
50703B074970k0363j2350o081j730N99N82k014p080j4389k3758l4547m5418n5030
$$ 2074970 2054607 2042257 2036176 2034446 2035045 2035627 2033613 2026533 2012144 1988386 1953839 1908421 1853391
50690A853391o2751o8301p1190p1002o7965o2765n6108m8859m1927l5395k8249
$$ 1853391 1790640 1722339 1651149 1580147 1512182 1449417 1393309 1344450 1302523 1267128 1238879
50679A238879j9765j0645k024O143J4672K3654L2641M2089N3218O6211P9695R2299
$$ 1238879 1219114 1208469 1206445 1212588 1227260 1250914 1283555 1325644 1378862 1445073 1524768 1617067
50667A617067J03703J13857J22140J27754J30118J28535J22316J11772R8508Q4259
$$ 1617067 1720770 1834627 1956767 2084521 2214639 2343174 2465490 2577262 2675770 2760029
50657B760029O9960N6200M3781L3221K4211J6033Q173K13q354j7688k7286l6532
$$ 2760029 2829989 2886189 2929970 2963191 2987402 3003435 3011608 3011821 3003467 2985779 2958493 2921961
50645B921961m5195n3065n9403o3241o4218o2778n9601n4930m8451l9918k9913
$$ 2921961 2876766 2823701 2764298 2701057 2636839 2574061 2514460 2459530 2411079 2371161 2341248
50634B341248j9898j1230m264J254N303P556Q026P103N025J918j689n108q218
$$ 2341248 2321350 2310120 2305856 2307110 2312413 2319969 2327995 2335098 2340123 2342041 2340352 2335244 2327026
50621B327026j1248j3853j5120j4667j2950j0300o408j111N007J1206J7117K2319
$$ 2327026 2315778 2301925 2286805 2272138 2259188 2248888 2242480 2241369 2246376 2257582 2274699 2297018
50609B297018K5985K7476K6863K4514K0647J5670J0376N292J62n562j2068j9516
$$ 2297018 2323003 2350479 2377342 2401856 2422503 2438173 2448549 2453841 2454003 2448441 2436373 2416857
50597B416857k8397l8964n0441o1367p0701p8148q3635q6985q8177q7512q5362
$$ 2416857 2388460 2349496 2299055 2237688 2166987 2088839 2005204 1918219 1830042 1742530 1657168
50586A657168q1937p7385p2002o6265o0651n5410n0450m5517m0450l5348l0559
$$ 1657168 1575231 1497846 1425844 1359579 1298928 1243518 1193068 1147551 1107101 1071753 1041194
50575A041194k6502k3179j9900j5845j1145o910l853j381J478M722P751J0617
$$ 1041194 1014692 991513 971613 955768 944623 937713 933860 932479 933957 938679 946430 957047
50563I57047J3980J7902K1655K4828K7804L1036L4637L8847M4107N0338N6817
$$ 957047 971027 988929 1010584 1035412 1063216 1094252 1128889 1167736 1211843 1262181 1318998
50552A318998O3145O9716P6963Q4672R2276R9199J04624J07524J07349J04307
$$ 1318998 1382143 1451859 1528822 1613494 1705770 1804969 1909593 2017117 2124466 2228773
50542B228773R8844R1334Q2395P2819O3014N3221M4366L7870L4075L1657K9040
$$ 2228773 2327617 2418951 2501346 2574165 2637179 2690400 2734766 2772636 2806711 2838368 2867408
50531B867408K5769K2029J7781J3191R370P674Q547J1572J6369K2753L0211L7916
$$ 2867408 2893177 2915206 2932987 2946178 2955548 2963222 2971769 2983341 2999710 3022463 3052674 3090590
50519C090590M5195N1605N6676O0010O1412O0591N6940N0029M0184K8210J4798
$$ 3090590 3135785 3187390 3244066 3304076 3365488 3426079 3483019 3533048 3573232 3601442 3616240
50508C616240M58j4345k9394m4800o0364p5017q7325r6440j02183j04404j02724
$$ 3616240 3616698 3602353 3572959 3528159 3467795 3392778 3305453 3209013 3106830 3002426 2899702
50497B899702r7008q7753p5881o2184m7105l1033j4797M04J3748K5172L4693M1644
$$ 2899702 2802694 2714941 2639060 2576876 2529771 2498738 2483941 2484345 2498093 2523265 2557958 2599602
50485B599602M5188M5198M1900L4800K2951O425j3397l5049n7428p8757r6420
$$ 2599602 2644790 2689988 2731888 2766688 2789639 2796064 2782667 2747618 2690190 2611433 2515013
50474B515013j08791j16440j20835j22477j21067j16773j10397j02765r4648q6809
$$ 2515013 2406222 2289782 2168947 2046470 1925403 1808630 1698233 1595468 1500820 1414011
50464A414011p9354p1525o2971n4622m7525m1399l5350k9537k4866k1284j7706
$$ 1414011 1334657 1263132 1200161 1145539 1098014 1056615 1021265 991728 966862 945578 927872
50453I27872j3691r969p043m338j199K154N188P953J0782J3629J6082J7925J9316
$$ 927872 914181 904212 897169 892831 891632 893786 898974 906927 917709 931338 947420 965345 984661
50440I84661K0578K1912K3249K4381K5422K6961K9381L2187L4445L5833L6713
$$ 984661 1005239 1027151 1050400 1074781 1100203 1127164 1156545 1188732 1223177 1259010 1295723
50429A295723L7249L7125L6272L5320L4951L5200L5600L5698L5192L3927L2030
$$ 1295723 1332972 1370097 1406369 1441689 1476640 1511840 1547440 1583138 1618330 1652257 1684287
50418A684287K9843K7584K5297K3283K2286K2929K5001K7509K9433L0479L1176
$$ 1684287 1714130 1741714 1767011 1790294 1812580 1835509 1860510 1888019 1917452 1947931 1979107
50407A979107L2336L4183L6039L6937L6510L5125L3205L0754K7603K3703J9002
$$ 1979107 2011443 2045626 2081665 2118602 2155112 2190237 2223442 2254196 2281799 2305502 2324504
50396B324504J3272O431j193r253j7976k7910l8937m9973n9841o8270p5564q1592
$$ 2324504 2337776 2344207 2343014 2333761 2315785 2287875 2248938 2198965 2139124 2070854 1995290 1913698
50384A913698q5560q6842q5484q1722p5633o7631n8776n0014m1264l1926k2079
$$ 1913698 1828138 1741296 1655812 1574090 1498457 1430826 1372050 1322036 1280772 1248846 1226767
50373A226767j2602m105L650J1076J7976K3579K7008K7585K5134K0067J3024M364
$$ 1226767 1214165 1210060 1213710 1224786 1242762 1266341 1293349 1320934 1346068 1366135 1379159 1383523
50361A383523n615j6028k5458l2836l8012m1443m3587m4662m4600m3270m0973
$$ 1383523 1377908 1361880 1336422 1303586 1265574 1224131 1180544 1135882 1091282 1048012 1007039
50350A007039l8513l6417l4297l1614k8737k6504k4842k2756j9785j6585j3906
$$ 1007039 968526 932109 897812 866198 837461 810957 786115 763359 743574 726989 713083
50339G13083j1807j0101q712p317n471l392j802o99P63K835M599N487O377Q317
$$ 713083 701276 691175 682463 675146 669675 666283 664481 663782 664545 667380 671979 677466 683843 692160
50325F92160J1000J3341J4956J6131J6872J7006J6859J6995J7482J8041J8664
$$ 692160 703160 716501 731457 747588 764460 781466 798325 815320 832802 850843 869507
50314H69507J9510K0486K1517K2796K4248K5318K5798K6285K7069K7216K5776
$$ 869507 889017 909503 931020 953816 978064 1003382 1029180 1055465 1082534 1109750 1135526
50303A135526K3319K1187J9569J7534J4751J1988R674P162L772k59m222p687j0441
$$ 1135526 1158845 1180032 1199601 1217135 1231886 1243874 1253548 1260710 1264482 1264223 1260001 1252314 1241873
50290A241873j2242j3121j3626j4452j5927j7944k0213k2472k4536k6229k7321
$$ 1241873 1229631 1216510 1202884 1188432 1172505 1154561 1134348 1111876 1087340 1061111 1033790
50279A033790k7702k7580k7154k6217k4530k2592k1355k1010k0781k0149j9471
$$ 1033790 1006088 978508 951354 925137 900607 878015 856660 835650 814869 794720 775249
50268G75249j9070j8615j7892j7249j6607j5008j2097r151p561o977o088m590
$$ 775249 756179 737564 719672 702423 685816 670808 658711 649560 641999 635022 628934 624344
50256F24344l154j964o82M46P85N54O26J201J752K181K841L526L649L449L776
$$ 624344 621190 619226 618544 618990 619775 620329 620955 622156 623908 626089 628930 632456 636105 639554 643330
50241F43330M554M680L693K391J383K41j419k969l584l307k827k677l004l630
$$ 643330 647884 652564 656257 658648 660031 660272 658853 655884 652300 648993 646166 643489 640485 636855
50227F36855m094m076l909m183m899n542n907o122o019n340m492m055l599k075
$$ 636855 632761 628685 624776 620593 615694 610152 604245 598123 592104 586764 582272 578217 574618 572543
50213E72543M79K709L695L824L658L158K516K554L526M456M417L697K949K075
$$ 572543 573022 575731 579426 583250 586908 590066 592582 595136 598662 603118 607535 611232 614181 616256
50199F16256Q30j94k11M98Q81M52m31j362k251k958l307l516m115n248o374o757
$$ 616256 617086 616892 616681 617179 618060 618512 618081 616719 614468 611510 608203 604687 600572 595324 588950 582193
50183E82193o244n419n075n409n890o069o231o862p726q089p748p148o460n337
$$ 582193 575949 570530 565455 560046 554156 548087 541856 534994 527268 519179 511431 504283 497823 492486
50169D92486l746k282j335n86L11J114J473J455J203N65n25j663k426k876l325
$$ 492486 488740 486458 485123 484537 484848 485962 487435 488890 490093 490658 490133 488470 486044 483168 479843
50154D79843l881m475n028n339n124m342l309k354j665j438j683j920j569p98
$$ 479843 475962 471487 466459 461120 455996 451654 448345 445991 444326 442888 441205 439285 437716 436918
50140D36918m15q11j508j869j680r88K2Q73J172J286J963L157M007M224M560N533
$$ 436918 436503 435692 434184 432315 430635 429647 429669 430542 431714 433000 434963 438120 442127 446351 450911 456444
50124D56444O557O932O849O789O631O126N673N782O123N930N183M610M656M956
$$ 456444 463001 469933 476782 483571 490202 496328 502001 507783 513906 519836 525019 529629 534285 539241
50110E39241M852M072K829J667J028Q10N04q3n11l09L76R38R59M93o8l01j53j2
$$ 539241 544093 548165 550994 552661 553689 554499 555003 554920 554409 554100 554476 555414 556373 556866 556798 556497 556344 556332
50092E56332o9J95J402L231M676N358N894O830P951Q868R587J0192J0626J1018
$$ 556332 556263 556458 557860 561091 565767 571125 577019 583849 591800 600668 610255 620447 631073 642091
50078F42091J1662J2451J2969J3227J3554J3715J3189J2482J2887J4498J5717
$$ 642091 653753 666204 679173 692400 705954 719669 732858 745340 758227 772725 788442
50067G88442J5482J4732J4741J5196J5083J4516J4259J4162J3546J2726J2727
$$ 788442 803924 818656 833397 848593 863676 878192 892451 906613 920159 932885 945612
50056I45612J3638J4586J5237J6137J7514J8951K0355K2259K4886K7841L0974
$$ 945612 959250 973836 989073 1005210 1022724 1041675 1062030 1084289 1109175 1137016 1167990
50045A167990L4766L9575M5215N1563N8955O7620P7213Q7189R7151J06548J14205
$$ 1167990 1202756 1242331 1287546 1339109 1398064 1465684 1542897 1630086 1727237 1833785 1947990
50034A947990J18426J17455J10083R6315P7630N6447L5306J6535K165o589r808
$$ 1947990 2066416 2183871 2293954 2390269 2467899 2524346 2559652 2576187 2578352 2571763 2561955
50023B561955q527m012K263Q214J1394R910K937r459k6459m6447o7218q6500j02345
$$ 2561955 2553428 2549416 2551679 2559893 2571287 2581197 2584134 2574675 2548216 2501769 2434551 2348051 2245706
50010B245706j13366j19047j19687j15883j08315r8272q7786p8478p0378o2430
$$ 2245706 2132340 2013293 1893606 1777723 1669408 1571136 1483350 1404872 1334494 1272064
50000A272064n4218m6570m0543l6306l3170l0374k7613k5072k3105k1846k1146
$$ 1272064 1217846 1171276 1130733 1094427 1061257 1030883 1003270 978198 955093 933247 912101
49989I12101k0842k0768k0473j9393j7622j6011j5133j4530j3485j2132j1208
$$ 912101 891259 870491 850018 830625 813003 796992 781859 767329 753844 741712 730504
49978G30504j0988j1025j0755r810q028n709l767k934k882k684k032j383j020
$$ 730504 719516 708491 697736 687926 679898 674189 670422 667488 664606 661922 659890 658507 657487
49965F57487n96K16J235K106K665K946L145L622M481N181N057M267L787M301N479
$$ 657487 656891 657107 658342 660448 663113 666059 669204 672826 677307 682488 687545 691812 695599 699900 705379
49950G05379O524P103P538Q303R431J0434J0850J0943J1548J3092J5075J6858
$$ 705379 711903 719006 726544 734847 744278 754712 765562 776505 788053 801145 816220 833078
49938H33078J8526K0483K2629K4533K6334K8639L1650L5088L9084M4384N1414
$$ 833078 851604 872087 894716 919249 945583 974222 1005872 1040960 1080044 1124428 1175842
49927A175842N9720O8714P8663R0535J05023J21889J39941J57397J72337J82930
$$ 1175842 1235562 1304276 1382939 1473474 1578497 1700386 1840327 1997724 2170061 2352991
49917B352991J87480J84665J74251J57532J36909J15028R4421P7390O5457N8762
$$ 2352991 2540471 2725136 2899387 3056919 3193828 3308856 3403277 3480667 3546124 3604886
49907C604886N6392N7202N9847O2143O1117N4155L9957J8552q887l9939p1246
$$ 3604886 3661278 3718480 3778327 3840470 3901587 3955742 3995699 4014251 4005364 3965425 3894179
49896C894179r9651j23174j41002j53052j59955j63057j63709j62446j59224j54380
$$ 3894179 3794528 3671354 3530352 3377300 3217345 3054288 2890579 2728133 2568909 2414529
49886B414529j48773j42755j35649j26854j17209j08355j00745r3130q4457p5487
$$ 2414529 2265756 2123001 1987352 1860498 1743289 1634934 1534189 1441059 1356602 1281115
49876A281115o7752o1506n5703m9708m3982l9010l4618l0666k7448k5023k2894
$$ 1281115 1213363 1151857 1096154 1046446 1002464 963454 928836 898170 870722 845699 822805
49865H22805k0817j9260j8551j8243j7799j7313j6992j6551j5707j4792j4170
$$ 822805 801988 782728 764177 745934 728135 710822 693830 677279 661572 646780 632610
49854F32610j3537j2361j0684q901p234n910n368n581n722n131m194l666l581
$$ 632610 619073 606712 596028 587127 579893 573983 568615 563034 557312 552181 547987 544321 540740
49841E40740l525l430l382l111k513k160k367k288j021P51J478Q94K65N12J272
$$ 540740 537215 533785 530403 527292 524779 522619 520252 517964 516943 517694 519172 520066 520331 520843 522115
49826E22115J921K393K768K980L274M092N306O315P108Q385J0378J2405J3834
$$ 522115 524036 526429 529197 532177 535451 539543 544849 551164 558272 566657 577035 589440 603274
49813F03274J4801J5662J6550J7894K0563K5029L0740L6706M2377M7906N4087
$$ 603274 618075 633737 650287 668181 688744 713773 744513 781219 823596 871502 925589
49802I25589O2046P2340Q4255R6532J08714J20853J31762J38613J38821J31662
$$ 925589 987635 1059975 1144230 1240762 1349476 1470329 1602091 1740704 1879525 2011187
49792B011187J17865R8647P5856N2231L0590J2892N03n401m555J488R851J7675
$$ 2011187 2129052 2227699 2303555 2355786 2386376 2399268 2399771 2394370 2389815 2391303 2401154 2418829
49780B418829K2576K2256J4623j166k4006n1123p9013j04351j24598j38195j44553
$$ 2418829 2441405 2463661 2478284 2477118 2453112 2401989 2322976 2218625 2094027 1955832 1811279
49769A811279j44160j38598j29869j19418j07811r5408q3024p1717o2090n3980
$$ 1811279 1667119 1528521 1398652 1279234 1171423 1076015 992991 921274 859184 805204
49759H05204m6783m0019l3754k8441k4323k1126j8384j5893j3658j1623r815q458
$$ 805204 758421 718402 684648 656207 631884 610758 592374 576481 562823 551200 541385 532927
49747E32927p544o581n221l927l375l417l305k821k434k264j751n99O13J208J207
$$ 532927 525383 518802 513581 509654 506279 502862 499557 496736 494302 492038 490287 489688 490301 491509 492716
49732D92716J059R49P54M15K6k95m55m49m04m33m82n58q68j504k169k523k574
$$ 492716 493775 494724 495478 495893 495919 495624 495169 494720 494316 493883 493401 492843 491975 490471 488302 485779 483205
49715D83205k390j826j010o63j172j764j456n43j42m56o12k09J95L31P46J607
$$ 483205 480815 478989 477979 477316 476144 474380 472924 472381 472239 471783 471171 470962 471157 471488 472234 473841
49699D73841K115J738J142J203J847K452K804K972K888K582K455K660K735K361
$$ 473841 475956 477694 478836 480039 481886 484338 487142 490114 493002 495584 498039 500699 503434 505795
49685E05795J982K119K465K287J497P13M48P15J229J628J619J192O33K12jN6M25
$$ 505795 507777 509896 512361 514648 516145 516858 517306 518021 519250 520878 522497 523689 524322 524534 524533 524589 525014
$$ [...]
##END NTUPLES=NMR SPECTRUM
##END=
