
##TITLE=AC1068_TOPL01_6519229_qYJ3gEzVqc
##JCAMPDX= 6.0         $$ Bruker NMR JCAMP-DX V2.0
##DATA TYPE= NMR SPECTRUM
##DATA CLASS= NTUPLES
##ORIGIN= BRUKER
##OWNER= Administrator
$$ 1.72 TOPSPIN		Version 2.1
$$ 2012-07-13 16:08:12.343 -0500  Administrator@TOPSPIN
$$ Compression mode = diff/dup
##.OBSERVE FREQUENCY= 400.02188249412
##.OBSERVE NUCLEUS= ^1H
##.ACQUISITION MODE= SIMULTANEOUS (DQD)
##.ACQUISITION SCHEME= undefined
##.AVERAGES= 8
##.DIGITISER RES= 22
##SPECTROMETER/DATA SYSTEM= spect
##.PULSE SEQUENCE= zg30
##.SOLVENT NAME= COFFEE_meoh
##.SHIFT REFERENCE= INTERNAL, COFFEE_meoh, 1, 14.98509
##AUDIT TRAIL= $$ (NUMBER, WHEN, WHO, WHERE, PROCESS, VERSION, WHAT)
$$ ##TITLE= Audit trail, TOPSPIN		Version 2.1
$$ ##JCAMPDX= 5.01
$$ ##ORIGIN= Bruker BioSpin GmbH
$$ ##OWNER= Administrator
$$ $$ C:\Bruker\TOPSPIN/data/COFFEE/nmr/AC1068_TOPL01_6519229_qYJ3gEzVqc/20/pdata/1/auditp.txt
$$ ##AUDIT TRAIL=  $$ (NUMBER, WHEN, WHO, WHERE, PROCESS, VERSION, WHAT)
(   1,<2012-07-13 16:08:02.234 -0500>,<Administrator>,<TOPSPIN>,<go>,<TOPSPIN 2.1>,
      <created by zg
	started at 2012-07-13 16:06:54.859 -0500,
	POWCHK enabled, PULCHK disabled,
       configuration hash MD5:
       6B 1B 68 BB D9 2E 58 E2 7F 35 AD 54 07 DF 0E 41
       data hash MD5: 64K
       74 5D 58 F8 DB 11 EC 64 18 B2 60 44 9D 00 8A F9>)
(   2,<2012-07-13 16:08:06.968 -0500>,<Administrator>,<TOPSPIN>,<proc1d>,<TOPSPIN 2.1>,
      <Start of raw data processing
       efp LB = 0 FT_mod = 6 PKNL = 1 PHC0 = 0 PHC1 = 0 SI = 32K 
       data hash MD5: 32K
       F3 1E F0 9C EE 32 44 D7 33 BD 68 D4 D3 AF 67 D1>)
(   3,<2012-07-13 16:08:07.296 -0500>,<Administrator>,<TOPSPIN>,<proc1d>,<TOPSPIN 2.1>,
      <pk PHC0 = 180.1703 PHC1 = 0 
       data hash MD5: 32K
       2B 8E B5 AF E2 F2 AB 05 29 0D 77 8C 54 12 FA 0D>)
(   4,<2012-07-13 16:08:07.390 -0500>,<Administrator>,<TOPSPIN>,<proc1d>,<TOPSPIN 2.1>,
      <abs ABSG = 1 
       data hash MD5: 32K
       87 CC C0 A8 1B 33 E1 EA D3 20 F5 CB 11 2E 94 2B>)
(   5,<2012-07-13 16:08:07.437 -0500>,<Administrator>,<TOPSPIN>,<proc1d>,<TOPSPIN 2.1>,
      <abs ABSG = 2 
       data hash MD5: 32K
       A6 FF C7 CC B8 1F D3 4F 59 89 1E A5 AE 46 5F C6>)
(   6,<2012-07-13 16:08:07.468 -0500>,<Administrator>,<TOPSPIN>,<proc1d>,<TOPSPIN 2.1>,
      <abs ABSG = 3 
       data hash MD5: 32K
       F8 48 7C 0A 12 93 A5 6D 1C B2 BC 03 BA 37 63 42>)
(   7,<2012-07-13 16:08:07.500 -0500>,<Administrator>,<TOPSPIN>,<proc1d>,<TOPSPIN 2.1>,
      <abs ABSG = 4 
       data hash MD5: 32K
       8A 87 18 5B B6 ED 96 A0 AF E7 19 68 B4 34 17 D6>)
(   8,<2012-07-13 16:08:07.531 -0500>,<Administrator>,<TOPSPIN>,<proc1d>,<TOPSPIN 2.1>,
      <abs ABSG = 5 
       data hash MD5: 32K
       0D BE A8 E8 45 BF 61 CA 9D D1 37 28 FD 3B C5 C2>)
$$ ##END=
$$ 
$$ $$ hash MD5
$$ $$ B6 7F 2C C5 09 EA 76 7A 3D 4F 62 7E 5D C9 CE A3
##$RELAX= 
##$RELAX= 
##$RELAX= 
##$RELAX= 
##$RELAX= 
##$RELAX= 
##$RELAX= 
##$RELAX= 
$$ Bruker specific parameters
$$ --------------------------
$$ [...]
150 150 150 150 150 150 150 150
##$TP07= 0
##$TPNAME0= <>
##$TPNAME1= <>
##$TPNAME2= <>
##$TPNAME3= <>
##$TPNAME4= <>
##$TPNAME5= <>
##$TPNAME6= <>
##$TPNAME7= <>
##$TPOAL= (0..7)
0.5 0.5 0.5 0.5 0.5 0.5 0.5 0.5
##$TPOFFS= (0..7)
0 0 0 0 0 0 0 0
##$TUNHIN= 0
##$TUNHOUT= 0
##$TUNXOUT= 0
##$USERA1= <user>
##$USERA2= <user>
##$USERA3= <user>
##$USERA4= <user>
##$USERA5= <user>
##$V9= 5
##$VALIST= <valist>
##$VCLIST= <CCCCCCCCCCCCCCC>
##$VD= 0
##$VDLIST= <DDDDDDDDDDDDDDD>
##$VPLIST= <PPPPPPPPPPPPPPP>
##$VTLIST= <TTTTTTTTTTTTTTT>
##$WBST= 2048
##$WBSW= 25
##$XGAIN= (0..3)
0 0 0 0
##$XL= 0
##$YL= 0
##$YMAX_a= 497382
##$YMIN_a= -650786
##$ZGOPTNS= <>
##$ZL1= 120
##$ZL2= 120
##$ZL3= 120
##$ZL4= 120
##$ABSF1= 14.98509
##$ABSF2= -5.573092
##$ABSG= 5
##$ABSL= 3
##$ALPHA= 0
##$AQORDER= 0
##$ASSFAC= 0
##$ASSFACI= 0
##$ASSFACX= 0
##$ASSWID= 0
##$AUNMP= <proc_prof1d_extract_pilot.lims>
##$AXLEFT= 0
##$AXNAME= <>
##$AXNUC= <1H>
##$AXRIGHT= 0
##$AXTYPE= 0
##$AXUNIT= <>
##$AZFE= 0.1
##$AZFW= 0.1
##$BCFW= 0
##$BC_mod= 0
##$BYTORDP= 0
##$COROFFS= 0
##$CY= 15
##$DATMOD= 1
##$DC= 0
##$DFILT= <>
##$DTYPP= 0
##$F1P= 0
##$F2P= 0
##$FCOR= 0.5
##$FTSIZE= 32768
##$FT_mod= 6
##$GAMMA= 0
##$GB= 0
##$INTBC= 1
##$INTSCL= 1
##$ISEN= 128
##$LB= 0
##$LEV0= 0
##$LPBIN= 0
##$MAXI= 10000
##$MC2= 0
##$MEAN= 0
##$ME_mod= 0
##$MI= 0
##$NCOEF= 0
##$NC_proc= -8
##$NLEV= 6
##$NOISF1= 0
##$NOISF2= 0
##$NSP= 0
##$NTH_PI= 0
##$NZP= 0
##$OFFSET= 14.98509
##$PC= 1
##$PHC0= 180.1703
##$PHC1= 0
##$PH_mod= 1
##$PKNL= yes
##$PPARMOD= 0
##$PPDIAG= 0
##$PPIPTYP= 0
##$PPMPNUM= 2147483647
##$PPRESOL= 1
##$PSCAL= 4
##$PSIGN= 0
##$PYNMP= <proc.py>
##$REVERSE= no
##$SF= 400.02
##$SI= 32768
##$SIGF1= 0
##$SIGF2= 0
##$SINO= 400
##$SIOLD= 32768
##$SPECTYP= <>
##$SREGLST= <1H.CDCl3>
##$SSB= 0
##$STSI= 32768
##$STSR= 0
##$SW_p= 8223.68421052631
##$SYMM= 0
##$S_DEV= 0
##$TDeff= 65536
##$TDoff= 0
##$TI= <>
##$TILT= no
##$TM1= 0
##$TM2= 0
##$TOPLEV= 0
##$USERP1= <user>
##$USERP2= <user>
##$USERP3= <user>
##$USERP4= <user>
##$USERP5= <user>
##$WDW= 1
##$XDIM= 32768
##$YMAX_p= 474231412
##$YMIN_p= -794160
##$CURPLOT= <Network HP LaserJet P1505>
##$CURPRIN= <$Network HP LaserJet P1505>
##$DFORMAT= <normdp>
##$LAYOUT= <+/1D_H.xwp>
##$LFORMAT= <normlp>
##$PFORMAT= <normpl>
##$SURQMSG= 1
$$ End of Bruker specific parameters
$$ ---------------------------------
##NTUPLES= NMR SPECTRUM
##VAR_NAME=  FREQUENCY,     SPECTRUM/REAL,   SPECTRUM/IMAG
##SYMBOL=    X,             R,               I
##VAR_TYPE=  INDEPENDENT,   DEPENDENT,       DEPENDENT
##VAR_FORM=  AFFN,          ASDF,            ASDF
##VAR_DIM=   32768,         32768,           32768
##UNITS=     HZ,            ARBITRARY UNITS, ARBITRARY UNITS
##FACTOR=    0.250966925370066, 1,           1
##FIRST=     8223.43324360094, -61955,       -36245
##LAST=      0,             67727,           -79553
##MIN=       0,             -794160,         0
##MAX=       8223.43324360094, 474231412,    0
$$ Real data points
##PAGE= N=1
##DATA TABLE= (X++(R..R)), XYDATA
$$ [...]
19498a63171j51967A00089f3668B15110F1930e9125k67640a1552n8052D4373a51238
19486a32385C1371b92156N6047E2349i827j50542B54991I3036P1537c3024R508
19475b3516m5344k3039A85052l046e0083r030j19884j4669j57466q3111A43433
19463a37085p657g614j74650P3720N0668J549A79095e5482m3244j0468F0779d9575
19450B72631a28737A53656c3566A53792c19743i5458o8141N2568d9054j19062
19440a68116j3549g6196j76480j8138d8668j63909j57293E8865c7111E0054a91313
19428E7543c21338J34144L4971A1685J89331c02392a12491r5475h1816k7610D9217
19416A44998n1270a30930A06306F4b59823A57282a50258j79329d6455r5766a0278
$$ plain form
19498 -163171 -315138 100089 -63668 215110 61930 -59125 -326765 -11552 -69604 44373 -151238
19486 -132385 31371 -292156 -236109 52349 -9827 -160369 254991 93036 164573 -33024 -23516
19475 -23516 -68860 -91899 185052 182006 -50083 -59113 -178997 -193666 -351132 -434243 143433
19463 -137085 -144742 -7614 -182264 -108544 -57876 -56327 179095 -55482 -98726 -109194 60779 -49575
19450 272631 -128737 153656 -33566 153792 -319743 -95458 -163599 -111031 -49054 -168116
19440 -168116 -181665 -76196 -252676 -270814 -48668 -212577 -369870 58865 -37111 50054 -191313
19428 57543 -321338 -187194 -152223 11685 201016 -302392 -112491 -207966 -81816 -109426 49217
19416 144998 93728 -130930 106306 64 -259823 157282 -150258 -329587 -46455 -142221 -10278
19404b00958B74825a64544B48548A5629f8422j67537k37722b13747Q1841N5169
19394g6737B2398J33380h7714m3452n5481f0699K4797A92939a8754A10297b43784
19382H9724B4724a04458o3051C3883g4335j9216j11306M3285a3202A66398n2544
19371A13854h4690A01941A6455O6107l4804J82529c16354G9316a57113r1488B56348
19359H314a49774I9545N4070b40003i2286j11404D3029e6332E6240b56873B91220
19347f8227B9384J40124h1227p12933b56381a19436k21402A221e1157a794D3236
19335f03554A32416d13346E6261k7057h3495D3978b22894j19908d4149j05860
19325a50009q5339K4309k15851A71241E8903K07610a91674e6889l5455G2917k3445
$$ plain form
19404 -200958 274825 -164544 248548 15629 -68422 -235959 -473681 -213747 -131906 -76737
19394 -76737 22398 155778 -87714 -131166 -186647 -60699 -35902 192939 -18754 110297 -243784
19382 89724 24724 -104458 -167509 33883 -74335 -93551 -204857 -161572 -13202 166398 113854
19371 113854 -84690 101941 16455 82562 47758 230287 -316354 79316 -157113 -248601 256348
19359 8314 -149774 99545 153615 -240003 -92286 -203690 43029 -56332 56240 -256873 291220
19347 -68227 29384 169508 -81227 -794160 -256381 -119436 -340838 1221 -51157 -1794 43236
19335 -603554 132416 -413346 56261 29204 -83495 43978 -222894 -342802 -44149 -150009
19325 -150009 -235348 -211039 -426890 171241 58903 266513 -191674 -56889 -92344 72917 49472
19314D9472c48185n0840B51438K6795j24821j5088b48118a9857j38969j11746
19304b70572A81062b22257k76796a48112G1842J99225D1536K22568a31163J2090
19294a19073j2746C290J35594b65951a18355j01337p1615a16371l0663d7735A66318
19282a45576k82032a55668M3798L6729n1189b8703B5727K9079e906G9239a05106
19270a35828q8120Q7195j74043O6617a6799j54297A92309b2914l86514g7376C0443
19258A84493e6391B2474d51323d9591q7553D6788b63669M9703e9891I7804c84083
19246B96247j22674F6845k1224a7215B05607H2735a90152F2118d5320C6368b99740
19234B40011E2746a05534A79377n7996m4554b9123A40438L9082G2244b15981h3136
$$ plain form
19314 49472 -348185 -399025 251438 278233 153412 138324 -248118 -19857 -158826 -270572
19304 -270572 181062 -222257 -499053 -148112 71842 271067 41536 264104 -131163 -119073
19294 -119073 -131819 3290 138884 -265951 -118355 -219692 -291307 -116371 -147034 -47735 166318
19282 -145576 -427608 -155668 -111870 -75141 -126330 -28703 25727 54806 -5906 79239 -105106
19270 -135828 -223948 -136753 -310796 -244179 -16799 -171096 192309 -22914 -409428 -77376 30443
19258 184493 -56391 22474 -451323 -49591 -137144 46788 -263669 -213966 -59891 97804 -384083
19246 296247 173573 66845 45621 -17215 205607 82735 -190152 62118 -45320 36368 -299740
19234 240011 52746 -105534 179377 121381 76827 -29123 140438 179520 72244 -215981 -83136
19222D03974f3241p6515E3416J4069a50207B96M9673a31870A73303m4886A2721
19210b49933J02130j0764l72123B34855a7180j06867r2919g0D44678c20940E3167
19198H5461b11074k7159a08103q9402l52525K53211f3394j06751E6936f7333k47545
19187c14878N642I014h0666r5666h6198D0374a65031H0834a99442h1897k58530
19176c40427d8447l5952a4343I2898d5725A4126L01045g1154b4638l5099r1419
19165a51156I1622g291j04505A20224g7949P197K0258b3296H922N5384O9251e3049
19152F3698K06803c22475L6818b9591k18849h5492b4928r1132F5548a35967A76518
19140c79346k03223a30690F7360j2399e9304B8121b49193d2815r8057f19A7060
$$ plain form
19222 403974 -63241 -139756 53416 67485 -150207 296 49969 -131870 173303 128417 12721
19210 -249933 -147803 -158567 -530690 234855 -17180 -124047 -216966 -70 444678 -320940 53167
19198 85461 -211074 -238233 -108103 -197505 -550030 -296819 -63394 -170145 56936 -67333 -314878
19187 -314878 -309236 9014 -80666 -176332 -86198 40374 -165031 80834 -199442 -81897 -340427
19176 -340427 -48447 -84399 -14343 92898 -45725 14126 315171 -71154 -24638 -59737 -151156
19165 -151156 91622 -7291 -111796 120224 -77949 -70752 -50494 -23296 8922 64306 133557 -53049
19152 63698 270501 -322475 -285657 -29591 -248440 -85492 -24928 -116060 65548 -135967 176518
19140 -379346 -582569 -130690 67360 54961 -59304 28121 -249193 -42815 -140872 -619 17060
19128A97420b1496j45691B70772D8367a28147j66378N1718J19482b5299B15979
19117a36566B43149c29083I1856g9109A6001J02860a62568A03107P904a85832
19106a94329A02352c95530c5712j3355J8429n3371D4668h1983p268K8723l40211
19095d00739a33946I195J47709e4339a8236C74522c8058A21933a92649D7647a42846
19083G1295e9032K3368Q513j43083D5295a68972B39790b49781c0972B92387e904
19071c68389a26997H2787g1156H5793a73657D7181b01758k08544J92294b368k63089
19060b65457j91151b15145i9809c4117j32851A90795c79098E5028i3600F7061
19049b03537F9730a19362M4634E2679b15179o2268E7833p025j3231J00700L12336
$$ plain form
19128 197420 -21496 -167187 270772 48367 -128147 -294525 -242807 -123325 -25299 215979
19117 -136566 243149 -329083 91856 -79109 16001 118861 -162568 103107 111011 -185832
19106 -194329 102352 -395530 -35712 -49067 -30638 -84009 44668 -81983 -89251 -60528 -400739
19095 -400739 -133946 9195 156904 -54339 -18236 374522 -38058 121933 -192649 47647 -142846
19083 71295 -59032 -35664 -27151 -170234 45295 -168972 239790 -249781 -30972 292387 -5904
19071 -368389 -126997 82787 -71156 85793 -173657 47181 -201758 -410302 -218008 -2368 -265457
19060 -265457 -456608 -215145 -99809 -34117 -166968 190795 -379098 55028 -93600 67061
19049 -203537 69730 -119362 -74728 52679 -215179 -277447 57833 50808 37577 138277 450613
19038D50613a78409c9980j56881B30118a57697A18215A5561c65152J11029g7662
19027D6578h110A41342M2106D2776K36568b68050A74843b03451C01749o5669b43088
19015C9182b30238i6988H0274P043i4515G9519i2732A18704g4820h834B06042
19003i5796A11490e9430D2716c32709c8893J0848q5601J1056j36404B78992e7857
18991D1710b7467H5271b49812O4158B98961b15255K39o5800p952H3144A7218b04409
18978A25874f7827L1292C9798g6970A1336J54309K40220K433K28931C15904B5041
18966h0647r856A36543b56122F0743h4280l26475M1472a68409B30328C811b87505
18954A7225J02572E010b9133l9401r2368a4646A76978e34218C4046i8830o7498
$$ plain form
19038 450613 -178409 -39980 -196861 230118 -157697 118215 15561 -365152 -254123 -77662
19027 46578 -8110 141342 183448 42776 279344 -268050 174843 -203451 301749 236080 -243088
19015 39182 -230238 -96988 80274 87317 -94515 79519 -92732 118704 -74820 -8834 206042
19003 -95796 111490 -59430 42716 -332709 -38893 -28045 -113646 -102590 -238994 278992 -57857
18991 41710 -27467 85271 -249812 -185654 298961 -215255 -215016 -280816 -288768 83144 17218 -204409
18978 125874 -67827 -36535 39798 -76970 11336 165645 405865 408298 637229 315904 25041
18966 -80647 -90503 136543 -256122 60743 -84280 -410755 -369283 -168409 230328 3811 -287505
18954 17225 119797 5010 -29133 -68534 -160902 -14646 176978 -534218 34046 -98830 -166328
18943a66328A18023b93474c0645B97525C9794K03319a9956A6690K0689b63653
18932G698f6712A91546a08188F2463M7600c51177a26871c7585H7371a25092f1951
18920a59112E635b2081K108A22171n7407a31001B6354J12812b84139i2938H8227
18908E07644r2270K20878C05530j25821K31965f6483E0734a48871K3033B68643
18897b25484N5169j4826P9264G8298h6202j13427R6463A98115o3641d33268A50635
18885a69938N5949c1873j35198A76019J20909a30619m9904A54766e69049K00149
18875c68900a75106P8318b4628A55473a75844L0238A80691b994B28888H1374a18330
18863B97897A15999a83964c6822j77424C86898a8161A4793b3723o0874j99408
$$ plain form
18943 -166328 118023 -293474 -30645 297525 39794 243113 -19956 16690 37379 -263653
18932 7698 -66712 191546 -108188 62463 110063 -351177 -126871 -37585 87371 -125092 -61951
18920 -159112 5635 -22081 -19973 122171 64764 -131001 26354 139166 -284139 -92938 88227
18908 507644 415374 636252 305530 179709 411674 -66483 50734 -148871 -125838 268643
18897 -225484 -170315 -185141 -105877 78298 -86202 -199629 -103166 198115 134474 -433268 150635
18885 -169938 -113989 -31873 -167071 176019 296928 -130619 -180523 154766 -569049 -368900
18875 -368900 -175106 -96788 -24628 155473 -175844 -145606 180691 -2994 228888 81374 -118330
18863 297897 115999 -183964 -36822 -214246 386898 -18161 14793 -23723 -84597 -284005
18853b84005j52978A55722m5911a93246j22829A87110l3267h2976o6194I7594
18842a20673j13111D686g0655A15698f703j32268J344q1629A6673Q1257R3J19062
18830B17085a48620A0675K19545b08943O110A00859O1273B528b48620a10020A18514
18818b82364i6416K0103r3374F9324K70451j08945j11653C5942a43782A8493h9537
18806A42496a55704E2435h6636D29018b1629B4149a40712B97K1062Q7308B4780
18794g9837B66464D1773b34027A4549a29550D8707a00060H2988h5581p8808g1599
18782d14814K04533L2061p7008I1077L7355d9090B80173E0519b94415Q6234O4068
18771a44113A73736m5892J7802b63111h4098j70941g1896j32577M9705A82004
$$ plain form
18853 -284005 -436983 155722 109811 -193246 -316075 187110 153843 -82976 -149170 97594
18842 -120673 -233784 4686 -70655 115698 -6703 -138971 -137627 -219256 16673 97930 98023 217085
18830 217085 -148620 10675 230220 -208943 -202833 100859 162132 2528 -248620 -110020 118514
18818 -282364 -96416 -76313 -169687 69324 339775 230830 119177 35942 -143782 18493 -89537
18806 142496 -155704 52435 -86636 429018 -21629 24149 -140712 297 21359 108667 24780
18794 -79837 266464 41773 -234027 14549 -129550 48707 -100060 82988 -85581 -164389 -71599
18782 -414814 -210281 -178220 -255228 91077 128432 -49090 280173 50519 -294415 -208181 -144113
18771 -144113 173736 127844 145646 -263111 -84098 -255039 -71896 -204473 -154768 182004
18760A30030a97801e1288A68960n4488c32624d9028A18444k0796A4186a38845
18749A00922a57163N3568B94835J02105h8810I0636a90413b7339B7781b34079
18738a63514A87806b19609N6088Q1555j41494l4844k44215a08338j29365a09050
18727a7167j691C04202A41287a91951A35174h406n404q9077K0586R848l33989
18716d06442a41157n4817B3669D932c110l2493B07548m712c38417c1048B08342
18704D8919M2017C8289a42159M4258c8825h551r3955E1514O4271a59632N1301
18693a08331d2957a192j2134l80026a47068c5108B20702C9937c88300J27160f5493
18681H489P1388K68471g215m38706B4426L5998a5361j91901D216L1288D330b4801
$$ plain form
18760 130030 -197801 -51288 168960 114472 -332624 -49028 118444 97648 14186 -138845
18749 100922 -157163 -103595 294835 396940 -88810 90636 -190413 -27339 27781 -234079
18738 -163514 187806 -219609 -163521 -81966 -223460 -258304 -502519 -108338 -237703 -109050
18727 -17167 -18858 304202 141287 -191951 135174 -8406 -13810 -102887 -82301 -72453 -406442
18716 -406442 -141157 -195974 23669 4932 -3110 -35603 207548 202836 -338417 -31048 208342
18704 48919 90936 38289 -142159 -97901 -38825 -8551 -102506 51514 115785 -159632 -108331
18693 -108331 -42957 -1192 -13326 -393352 -147068 -35108 220702 39937 -388300 -261140 -65493
18681 8489 79877 348348 -7215 -445921 24426 60424 -15361 -207262 4216 35504 4330 -24801
18668H4104b26995G0008b36635A80796F9903c00198a06842A5562K6824J6141b403
18656c4578k40970B21330F9539J64223q1452j0941K5974i9315H1290C3450b80276
18644I7647k0124B155b70672a0392l22015f1749A185R6321D1006a14706A52688
18632e2460A5916e4848k6985E3015d4854k10195B56207h756m5506k13006J9880
18621b47388J22858C8648a08545j77996A81161E9940b456k4872B800a34693M8335
18610h6358a5217j6863A39552J14573g7065L5340A34303a3979q2412H2886M5012
18599A27898F3480a4560A064c12201B6975J9283d857l05694c2495k87260d5140
18587e5476B58507a58791j15535b6120j52650l8733h5073e105k87800a5553l11773
$$ plain form
18668 84104 -226995 70008 -236635 180796 69903 -300198 -106842 15562 42386 58527 -2403
18656 -34578 -275548 221330 69539 233762 152310 141369 167343 -99315 81290 33450 -280276
18644 97647 77523 2155 -270672 -10392 -332407 -61749 1185 97506 41006 -114706 152688
18632 -52460 15916 -54848 -81833 53015 -44854 -255049 256207 -8756 -54262 -267268 -247388
18621 -247388 -124530 38648 -108545 -286541 181161 59940 -2456 -27328 2800 -134693 -86358
18610 -86358 -15217 -32080 139552 254125 -77065 -41725 134303 -13979 -96391 82886 127898
18599 127898 63480 -14560 1064 -312201 26975 46258 -4857 -310551 -32495 -319755 -45140
18587 -55476 258507 -158791 -274326 -26120 -178770 -217503 -85073 -5105 -292905 -15553 -327326
18576c27326A12746K5560c8870k90386A4997g7510r6911b9614j08108m7847j9668
18565b05237B2340c9256l53334J80904I2522Q7468c37383A2528b07828k9596o70
18554b38094a3903j8020k9331J6529G9713P2460h7031k448A16261d5434j35682
18543a81116J5450p1702C58619i7983j38703A4759K4113J408d8743A56739b2893
18531A37698B9519a90233N6143A89866c29506I9476b12103A42225a23787A71539
18520a3618B22212d8535k41908G7846d7432b3035E6174J43294D3544K14511f25482
18508a19782B59312c27931h0513k89494B92007f8686b1275n0644E4823J20133
18498A74956e9933C57247i3474j27468e0364H1198c87049D5450L9891a29044i749
$$ plain form
18576 -327326 112746 138306 -38870 -329256 14997 -77510 -174421 -29614 -137722 -185569 -205237
18565 -205237 22340 -39256 -392590 -211686 92522 179990 -337383 12528 -207828 -237424 -238094
18554 -238094 -13903 -31923 -61254 -44725 79713 152173 -87031 -89479 116261 -45434 -181116
18543 -181116 -165666 -237368 358619 -97983 -236686 14759 38872 40280 -48743 156739 -22893
18531 137698 29519 -190233 -134090 189866 -329506 99476 -212103 142225 -123787 171539
18520 -13618 222212 -48535 -290443 77846 -47432 -23035 56174 199468 43544 258055 -625482
18508 -119782 259312 -327931 -80513 -370007 292007 -68686 -21275 -71919 54823 174956
18498 174956 -59933 357247 -93474 -220942 -50364 81198 -387049 45450 85341 -129044 -9749
18486b42540H833c27552A12472b25913m6676l7457H6986J21643k4884a4230k70780
18475b85010A0614f3673a9324k3826j42760G7365J21701r8369m2995P9968a30159
18463A94051E3719p297a78603A2078g7040D7863a44111j3398O2616J5643k9256
18452a08506B33128b36817C11023j26978E5646b20646J07220H9749c8320k5426
18442f3746G275e3526H7594M3723C8983L8517L1604D2681M5721C5917a49095e6131
18429e077r9478j39467p1855b1960j14538A88147G4607M8871g0702j67590O9232
18418a69060H2683J0587k2274K32618i8127k05136A39552F5470J18491c00761
18407i1149A29632j6175a21688B97680a89755B9994Q9886a53922H5066f5580A12452
$$ plain form
18486 -242540 8833 -327552 112472 -225913 -272589 -310046 86986 208629 183745 -14230 -285010
18475 -285010 10614 -63673 -19324 -43150 -185910 77365 199066 100697 57702 137670 -130159
18463 194051 53719 46422 -178603 12078 -77040 47863 -144111 -157509 -94893 -79250 -108506
18452 -108506 233128 -236817 311023 184045 55646 -220646 -113426 89749 -38320 -63746
18442 -63746 7275 -53526 87594 131317 38983 77500 109104 42681 88402 35917 -149095 -56131
18429 -5077 -104555 -244022 -315877 -21960 -136498 188147 74607 123478 -70702 -238292 -169060
18418 -169060 82683 93270 70996 303614 -98127 -303263 139552 65470 183961 -300761
18407 -91149 129632 113457 -121688 297680 -189755 29994 119880 -153922 85066 -65580 112452
18395a90710n350A5515E987O9523h0326p5637B92633r5794d2079o4076I5631L8129
18383A33760b34363R31B00918A0134f8661D3701g2807A85577f1264b846A71387
18371b45034J22231E2104a6484B56132B7185e1104g316j86671n7639D0703Q6021
18360A26724N451a30837A60867b46501n0298B746d44094a53231j78417h8433H8937
18348g8027B61375h7247H5051C2066e2408l3898j33292C12726K19735g6028E6820
18336G2846K0884c07011J49809O9467A31354a65972O8968I2662b501p657C8868
18324a7104k7220A19449m2081c92520c1263E4512J19680a33814B05687c73385
18313a00163C2310c96917a66159D1806c29966g1934b4894A24461m0489C6780A8091
$$ plain form
18395 -190710 -196060 15515 5987 75510 -80326 -155963 292633 196839 -42079 -106155 95631 133760
18383 133760 -234363 -233432 200918 10134 -68661 43701 -72807 185577 -61264 -2846 171387
18371 -245034 -122803 52104 -16484 256132 27185 -51104 -7316 -193987 -251626 40703 126724
18360 126724 132175 -130837 160867 -246501 -296799 2746 -444094 -153231 -331648 -88433 88937
18348 -78027 261375 -87247 85051 32066 -52408 -86306 -219598 312726 532461 -76028 56820
18336 72846 93730 -307011 -157202 -87735 131354 -165972 -97004 92662 -2501 -10158 38868
18324 -17104 -44324 119449 77368 -392520 -31263 54512 174192 -133814 205687 -373385
18313 -100163 32310 -396917 -166159 41806 -329966 -71934 -24894 124461 83972 36780 18091
18301B25938F3797O4159g3059p4066l29740E1091a90853B39250b14689d4842j54688
18290a99530N1310O7550E4441e737B01743l3489a89083A91059a08974k3249L4248
18279i7975B2971L1367b07857l2805A65397J25913E4152i1611A66511q0518d23931
18267a88798j84016G0633R9045f0548l74901E7943Q5458a54717A54889k9828a08571
18255C4518a86456A69438b70103g4904k086m8573A68887D9539a26496E602i0071
18243b92031A92460B5689a1052j00271J1382M9381A6073K1691b54571N6863k7518
18232b25226h3571l6949H4119b84871I2446r492n193N1189b40986Q7637P0385
18221h2964l11935B336K21520G4746c89379h8791B48956i2494J9635j96907R4640
$$ plain form
18301 225938 63797 127956 -73059 -147125 -476865 51091 -190853 239250 -214689 -44842 -199530
18290 -199530 -148220 -80670 54441 -5737 201743 168254 -189083 191059 -108974 -132223 -97975
18279 -97975 22971 54338 -207857 -240662 165397 291310 54152 -91611 166511 85993 -423931
18267 -188798 -372814 70633 169678 -60548 -435449 57943 143401 -154717 154889 125061 -108571
18255 34518 -186456 169438 -270103 -74904 -76990 -125563 168887 49539 -126496 5602 -90071
18243 -292031 192460 25689 -11052 -111323 -99941 -50560 16073 37764 -254571 -197708 -225226
18232 -225226 -83571 -120520 84119 -284871 92446 82954 77761 128950 -240986 -153349 -82964
18221 -82964 -394899 2336 223856 74746 -389379 -88791 248956 -92494 -72859 -269766 -175126
18210a75126d1803B06750b30888c9848a5420A42290o260i9107B55578l8273a35746
18198A43702a6582j64899L4515A2760M0230M1979J1581f0486J8775j01892a2160
18186f1192j42669A06987d1807j9200J5751p8274k09338H5161c00819B6205P5902
18175A02107B8559i4052j50455d5567B19946H2531K93077H2918e3179l5908o5500
18164a54587A02995D9899a01805m4390A0835b27489i5258L8326a5983G3953B7316
18152d6476k60154k02454f4961p2816j22235J00394n7405m2193F494J37951C0450
18140F94b9522B36674G3084f5036A00852c6184E4500b76594A48295K6941E9608
18128b59934J5733a18525B28231L0007l4969d9042A7956J2029K83019h1882a9164
$$ plain form
18210 -175126 -41803 206750 -230888 -39848 -15420 142290 136030 -99107 255578 217305 -135746
18198 143702 -16582 -181481 -146966 12760 52990 94969 106550 -60486 -41711 -143603 -12160
18186 -61192 -203861 106987 -41807 -61007 -45256 -123530 -332868 85161 -300819 26205 102107
18175 102107 28559 -94052 -244507 -45567 219946 82531 375608 82918 -53179 -89087 -154587
18164 -154587 102995 49899 -101805 -146195 10835 -227489 -95258 -56932 -15983 73953 27316
18152 -46476 -306630 -509084 -64961 -137777 -260012 -159618 -217023 -259216 6494 144445 30450
18140 694 -29522 236674 73084 -65036 100852 -36184 54500 -276594 148295 175236 59608
18128 -259934 -244201 -118525 228231 258238 223269 -49042 17956 29985 313004 -81882 -19164
18116B46438o5285P6492A24736B3714K04674b71508e5359j75998e5420A23036
18105a63714C2117J07339B4391c1164F1513c57267A00944f3832E4984i8727m8780
18094a47507a9120E2508J33332l616j1866O4354c5710C32023a61288A13336b2856
18082a41240B39980b6554F2897J80185j17561c16711i7800G0433a32771A99855
18071A23744D2847h2668A77046I373K65659a39941B78688G0021Q6183l4926C8658
18059A05867b81178e7100j4504G8290k1534f2166I5204J94356g0634F1758a24191
18047C27144F2318j2318A518a58266C3232i5760d7355r9919A48125g7625A41217
18035e1518o5540K9448c7691c041k41942B1624R829l709a5643n5690k1489E3717
$$ plain form
18116 246438 181153 257645 124736 23714 228388 -271508 -55359 -231357 -55420 123036
18105 -163714 32117 139456 24391 -31164 61513 -357267 100944 -63832 54984 -98727 -147507
18094 -147507 -19120 52508 185840 182224 170358 234712 -35710 332023 -161288 113336 -22856
18082 -141240 239980 -26554 62897 243082 125521 -316711 -97800 70433 -132771 199855
18071 123744 42847 -82668 177046 9373 275032 -139941 278688 70021 156204 121278 38658
18059 105867 -281178 -57100 -71604 78290 56756 -62166 95204 289560 -70634 61758 -124191
18047 327144 62318 50000 1518 -158266 33232 -95760 -47355 -147274 148125 -77625 141217
18035 -51518 -117058 -87610 -37691 -3041 -244983 21624 31453 27744 -15643 -71333 -92822 53717
18022B15495b5085k1681l03613B83737A30038f4438B4857c18041a23384A36661
18011C53292c35210K3860E5044K0051b45644a18890c3641B17240f3142j04924
18001a68066H3421J24170N5852n6939D9630j3574K50343a14114M6049j44176g4318
17989A88667E2647b66841N4424j943R3471A11994i2111I5883l1320e7010k3466
17978h0476C0392J0120J87741F7653J38870h4609A74537d2851l1195K0485A89228
17966b08784F1059b2139B58381i3587C710a23062B2200J89282b73559J11883k74551
17955d36227I404C835e3805B31478c43722A3524J8367a11502F3614a01660A9379
17943I17a67391C78926b587k01133D9202B3264J42680a58315b0759A90500j4624
$$ plain form
18022 215495 -25085 -46766 -350379 283737 130038 -64438 24857 -318041 -123384 136661
18011 353292 -335210 -311350 55044 75095 -245644 -118890 -33641 217240 -63142 -168066
18001 -168066 83421 207591 263443 206504 49630 36056 286399 -114114 -68065 -212241 -74318
17989 188667 52647 -266841 -212417 -214360 -120889 111994 -92111 95883 64563 -57010 -80476
17978 -80476 30392 40512 228253 67653 206523 -84609 174537 -42851 -74046 -53561 189228
17966 -208784 61059 -22139 258381 -93587 3710 -123062 22200 211482 -273559 -161676 -436227
17955 -436227 9404 3835 -53805 231478 -343722 13524 31891 -111502 63614 -101660 19379
17943 917 -167391 378926 -2587 -203720 49202 23264 165944 -158315 -20759 190500 175876
17932A75876P1272a3611A97242J38866a24035j1843k04596A95876A6081M0446
17922E6527N4556j2809a163A15894b11124N8447d7845D076a19297B09075E0383
17910A94898b24283A80441b2066B00988n0836c9489n9335A60231G2149K06933
17900B79082a57160C3223a70389P0630H5332J63598f9244j01340D2632P5753E5785
17888c6733A75044b84997A70744L24037B30109J32716C5018O190J37803i2862
17877G1554h1109C39605H1956i9118c1794j704j34608d2527l05247a09807A58658
17865h9690d52j34015B32257b28123C0160p183K15616a12142B35700d76656C0483
17853b78086D0810O3378h8785A63893P2354I8867e1893q3448A8228a01679d2234
$$ plain form
17932 175876 247148 -13611 197242 336108 -124035 -135878 -340474 195876 16081 56527
17922 56527 111083 98274 -1163 115894 -211124 -152677 -47845 4076 -119297 209075 50383
17910 194898 -224283 180441 -22066 200988 150152 -39489 -98824 160231 72149 279082
17900 279082 -157160 33223 -170389 -99759 85332 248930 -69244 -170584 42632 118385 55785
17888 -36733 175044 -284997 170744 494781 230109 362825 35018 41208 179011 -92862
17877 71554 -81109 339605 81956 -99118 -31794 -33498 -168106 -42527 -347774 -109807 158658
17865 -89690 -452 -134467 232257 -228123 30160 22977 238593 -112142 235700 -476656 30483
17853 -278086 40810 104188 -88785 163893 236247 98867 -51893 -135341 18228 -101679 -42234
17841B29680j6698J70804B2830K11416A05909a52913A46141a71525i63C9378J45045
17830A84423H2553a9698A9994L2331a01194q3179C91322A22867F1136c8280l2344
17819g0624r5212C93507A1539J69883k4277m1165N8565a20193L398q0027f8598
17807h3868B36748b66284I1156L4425J84748A9731K36100j05863E0750K18118
17797B68868M6045A45311d6488B48935i3694B12462G7678k041g7293m7075D4842
17785a36861j98439F5994K09205A00998b04716I6271R2704a76245A84530J40568
17775C25098E5238a46677B88422b4659j33423B76479a44863A09552k4555d1014
17764a56020A648O5982i8948C54265C7542c4329B35873b30758C94900A4797e4276
$$ plain form
17841 229680 212982 383786 22830 234246 105909 -152913 146141 -171525 -963 39378 184423
17830 184423 82553 -19698 19994 52325 -101194 -184373 391322 122867 61136 -38280 -70624
17819 -70624 -165836 393507 11539 181422 157145 115980 174545 -120193 -116795 -196822 -68598
17807 -83868 236748 -266284 91156 125581 310329 19731 255831 149968 50750 268868
17797 268868 314913 145311 -46488 248935 -93694 212462 77678 75637 -77293 -124368 44842
17785 -136861 -335300 65994 275199 100998 -204716 96271 188975 -176245 184530 325098
17775 325098 55238 -146677 288422 -24659 -158082 276479 -144863 109552 84997 -41014
17764 -156020 1648 67630 -98948 354265 37542 -34329 235873 -230758 394900 14797 -54276
17752G9955K63775r7425G3931B6483L4918K23448F2921L1029D1814a04780C06536
17740I9867B4420J53813g4718P883I928N8624b9936j53239A92M30947a2450I4851
17727g8896E3237k1685I912N1199b13033A39167O1528j425J37840d35627G7576
17715a64300b8716j04900j40469C88525b7953B49186a00412A34622E0754M18232
17705D68986b3621F8187J73490a47011A80086e1671A06520R067m8267i3241k51346
17694c44587B60163f6843A49906p869K10618H9557J05602I6606k1499L7711K5709
17683A38527b67128B22408c8079B68216j18135d4565A21661b95316A32358i7916
17672B81771H2073P6105K63329a18522D9441J81429J03140a81580A61968c2708
$$ plain form
17752 79955 343730 246305 73931 26483 61401 284849 62921 93950 41814 -104780 306536
17740 99867 24420 178233 -74718 -66835 9928 68552 -29936 -183175 192 431139 -12450 94851
17727 -78896 53237 31552 9912 61111 -213033 139167 200695 199270 337110 -435627 77576
17715 -164300 -28716 -133616 -274085 388525 -27953 249186 -100412 134622 50754 468986
17705 468986 -23621 68187 241677 -147011 180086 -51671 106520 115587 67320 -93241 -344587
17694 -344587 260163 -66843 149906 142037 352655 89557 195159 96606 75107 112818 138527
17683 138527 -267128 222408 -38079 268216 150081 -44565 121661 -295316 132358 -97916
17672 281771 82073 158178 421507 -118522 49441 230870 334010 -181580 161968 -32708
17661B13809b8363k59837A38373m0776D8029N6833K40800b0265B35390R566P5919
17650C20875a68738C38640j60328b00484O8452e3331D57806i9036A22381Q2179
17640B04560d6864j15823A31843j375a15461j20576f5396B89559A26976a26866
17629B81102H8973J90251F2037J30799e6326C5218M4265M767a16600j9167f659
17617a26870N1519f107E8662N1658C9272L15848A14173a38803B91771A20893r822
17606A11071M2009L3931c2309E03937b0628A23244a03370B44495D8247b58397
17595B16575i1716C3478h6705D6284d3293E8472k8303b34859B41798p4002H354
17583A22035J12316E6666b8535a2231D2410M60192a20020b436j54557a0423B59814
$$ plain form
17661 213809 -28363 -288200 138373 97597 48029 104862 345662 -20265 235390 244956 320875
17650 320875 -168738 338640 178312 -200484 -132032 -53331 457806 -99036 122381 204560
17640 204560 -46864 -162687 131843 130468 -115461 -236037 -65396 289559 126976 -126866
17629 281102 88973 279224 62037 192836 -56326 35218 79483 84250 -116600 -135767 -6659
17617 -126870 -75351 -6107 58662 110320 39272 355120 114173 -138803 291771 120893 111071
17606 111071 153080 187011 -32309 503937 -20628 123244 -103370 244495 48247 -258397
17595 216575 -91716 33478 -86705 46284 -43293 58472 30169 -234859 241798 167796 8354
17583 122035 234351 56666 -28535 -12231 42410 502602 -120020 -2436 -156993 -10423 259814
17571a01882A64890N3868A05914k0014L79879d4869D68247c95815D19748A17369
17560c4876H7927d063A13758J12992I281N01136c6020A03070N9501J65401j53413
17549A74559O324e4823B09501q8936J14084J94816J43737N0300C04717B232L93882
17538C96114D8063J93756p3211N3570J8110L9765A3758L5772K02881J00592J1765
17527C64768K59742j22355M78859Q1565K9752r6742K22865o05826J25901j27851
17517F10678k40576l3312J24194G4756N17207k27478L90241J08998L1776J37682
17507A033182O3133q1859k73453n1876B28470K84067K8632j37289O5192A11433
17496C13807M2857p6888n2901J53753j33759k5344L6159J83646A27929J25555
$$ plain form
17571 -101882 164890 218758 105914 85900 465779 -44869 468247 -395815 419748 117369
17560 -34876 87927 -4063 113758 226750 9281 510417 -36020 103070 162571 327972 174559
17549 174559 180883 -54823 209501 120565 234649 429465 573202 623502 304717 2232 396114
17538 396114 48063 241819 168608 222178 240288 280053 13758 49530 252411 353003 364768
17527 364768 624510 502155 981014 1062579 1092331 995589 1218454 612628 738529 610678
17517 610678 370102 336790 460984 74756 591963 364485 754726 863724 895500 1033182
17507 1033182 1096315 1014456 741003 689127 228470 512537 541169 403880 469072 111433
17496 313807 356664 279776 226875 380628 246869 221525 257684 441330 127929 253484
17486B53484J15516J5475m1756L5074j05624J35170k0001j54123M4156K07763
17476D85134j68651p5699o053M19805j76893h2414B23853K92562B12820I9028
17465F32280B26860p696q2376K22069q4361Q5723J28748A73582N08271B64611
17454B91389Q815k2192A31858J05183N954O4634K82323B01654L19529B51399J88767
17443D40166L28752k32247p4587J2689m5315O4699j05736R8629M4091k46246K63808
17432E48703q5566m1831R3439k598j68414q969J32356j94657q0263L46159j97851
17421C40508K83627k64389K31956k38637j08494L44356M112k58208L86539k13094
17411E08276J05445B91574K9684K2064J10430k1004r3353j36083J15630M1055
$$ plain form
17486 253484 369000 384475 342719 377793 272169 407339 387338 233215 277371 485134
17476 485134 316483 240784 234731 654536 477643 -82414 223853 516415 212820 99028
17465 632280 226860 219164 136788 358857 274496 360219 488967 173582 681853 264611
17454 291389 300204 278012 131858 237041 242995 307629 589952 201654 521183 251399 440166
17443 440166 768918 536671 462084 474773 429458 494157 388421 487050 531141 284895 548703
17432 548703 463137 421306 514745 512147 343733 334764 467120 272463 192200 538359 340508
17421 340508 624135 359746 591702 353065 244571 588927 593039 334831 721370 508276
17411 508276 613721 291574 321258 343322 453752 432748 339395 203312 318942 359997
17401C59997j28280A12895L05763p0970k5954A5006M11514j68942J63980Q726
17391D30284A06259K15187L12072B17667J80876A68681N21157j88105j25544A67566
17380e2874a5300p563C95050K3765j81710j1348Q893o3996J7355C2884J61103
17369A93987J72979q3879P046M34728B61106B1019M57462I6793K87845J5537r2142
17358C08033q7167h4039D49764j29616J4057C2836J57964J03589A04953N6740
17348A61693d3546I4050l3028B3001M0710M22359D8501J14333J29693A37029K6857
17337A63886o3651J62857A014M4672K49684G6952J90185K13389K06526C42155
17326C34277k9809F4563J45285R6186A22506J88583J1146M7461A79301l6579B1305
$$ plain form
17401 359997 231717 112895 418658 347688 321734 15006 426520 257578 421558 430284
17391 430284 106259 321446 633518 217667 398543 168681 689838 501733 376189 167566
17380 -52874 -15300 -22863 395050 418815 237105 225757 234650 170654 188009 32884 193987
17369 193987 366966 283087 290133 724861 261106 21019 478481 96793 384638 400175 308033
17358 308033 220866 -84039 449764 320148 334205 32836 190800 294389 104953 161693
17348 161693 -43546 94050 61022 23001 63711 486070 48501 162834 292527 137029 163886
17337 163886 100235 263092 1014 45686 295370 76952 267137 480526 687052 342155
17326 334277 304468 64563 209848 306034 122506 311089 322235 369696 179301 142722 21305
17314C26907k8041j20324l4079a92591A59208N4699O9332I2706J11093H813L28396
17303C37209R1760J9891j66628j24509J669j6267N70109B82351k7832B8625N82864
17292F11489A50772C3727N70239A00648K86680N5715j0439A98119J01125j04623
17282A94621K99792B29685J95910j03791k6003j27348K27295L14924A73562Q7209
17272B60771n2180K54692r9004M01722A56865M09692k19357E5720K8286J13003
17262A97009K40949A23063K33550M53976B35328I0744M07393l648J87608k94529
17252C87568L46874k57016a1542A69177Q0576O9642K2301A61230K74266P7874
17242E13370B56611J73622L40117k92458J08974j69152j03970J68157B13313J65212
$$ plain form
17314 326907 298866 178542 144463 -192591 159208 213907 283239 92706 203799 8813 337209
17303 337209 428969 448860 282232 157723 159392 143125 713234 282351 254519 28625 611489
17292 611489 150772 33727 603966 100648 387328 443043 432604 198119 299244 194621
17282 194621 494413 229685 425595 321804 295801 168453 395748 710672 173562 260771
17272 260771 208591 463283 364279 766001 156865 566557 347200 55720 84006 197009
17262 197009 437958 123063 356613 810589 235328 90744 498137 494489 682097 387568
17252 387568 734442 477426 -11542 169177 249753 319395 341696 161230 435496 513370
17242 513370 256611 430233 770350 477892 586866 417714 313744 481901 213313 378525
17232C78525A87236M94141k34601j35019J97771I4869J78095J86297L02678k87405
17222D74534Q816B0631R9321K84127A33330K13752M1697m5118j2258N58429B28262
17210D12571j27972K03072k00763L03582p9110Q041A53559L97470A84074M408
17200A88482N2275N7334J3344l5966Q5505K55980L63245m06569A14632M21575
17190E36207j52037J23336J44487k45920J50209k71757J01018A42393Q5685L87267
17180F15345J33217k86364m0872r5375L30638j53742L39609D20935Q9853J16642
17170F27430A00263N65925J3235j57791Q2474n4428l075J83988r1699B70481L25477
17159E95958k76382M94153l75658n2255O8953Q8310k32868R7551L65192k85966
$$ plain form
17232 378525 187236 681377 446776 311757 509528 94869 272964 459261 761939 474534
17222 474534 483350 20631 119952 404079 133330 347082 388779 343661 331403 889832 228262
17210 412571 284599 487671 286908 590490 511380 519421 153559 551029 184074 188482
17200 188482 240757 298091 311435 275469 360974 616954 980199 573630 114632 536207
17190 536207 384170 507506 651993 406073 556282 284525 385543 142393 228078 615345
17180 615345 748562 462198 421326 325951 656589 502847 842456 420935 510788 627430
17170 627430 100263 666188 679423 521632 604106 549678 546603 730591 638892 270481 595958
17159 595958 319576 813729 438071 385816 454769 543079 310211 407762 772954 486988
17149D86988J5825K20692j82885K62655n4403j06907j33598m5632L995L13421
17139G80151k15077m8482q2245L63429R7753l95071n8757Q5561l0564Q2192J05791
17128F84681j32458K69007l14048M0084j3714l2264k22297N05781A92898L78452
17118E71350j0966j70319l7981K16680L23939j47411l5858O153j25495J90404
17108G80496p1418P0865j66054k45898N27398k44102j69453L81818j61468J72279
17098H74463k36422j50351J18418M08947j26471J37370j19344k34067O505r9527
17088E79521J89708j71378J46352K5451j37159N7293j46256J6082K66385J43620
17078I69619J38586m77648k58415L18160j24983M83642j5410k5598j35613K39440
$$ plain form
17149 486988 502813 723505 540620 803275 748872 641965 508367 462735 466730 780151
17139 780151 565074 516592 434347 797776 895529 500458 441701 527262 496698 578890 684681
17128 684681 552223 821230 507182 547266 533552 501288 278991 784772 192898 571350
17118 571350 560384 390065 352084 568764 892703 745292 709434 715587 590092 780496
17108 780496 709078 779943 613889 367991 895389 651287 481834 863652 702184 874463
17098 874463 638041 487690 606108 1015055 888584 1025954 906610 672543 679048 579521
17088 579521 769229 597851 744203 769654 632495 689788 543532 559614 825999 969619
17078 969619 1108205 630557 372142 690302 565319 1048961 1033551 1007953 872340 1111780
17068A111780m70494J2211K91423k76645j57075N85586k97872Q2105k4761k15459
17058F40799K14612O2894m36732M82069M8644j45025R6502L4380K69498m14795
17048H52846r0286p5842K03211N7886p3857Q8726q3318J54843k65763M22313l93088
17037G97671L15865j35119m2422J51150j07727K39458M6965n94933K88168J52051
17027A111127n5620m13779L20180K12725m51139J80502l5473J53317k99004L98478
17017A121314k89053L25945L10752k83923l19806N62324j22815o06759N74138
17008A272117k34685K18897j23342Q4451j76653K56278J55309m01116K13434k84250
16998I80440K41969j41802L51784p9055J68564J10930j59403K0412k61515O5738
$$ plain form
17068 1111780 641286 653497 944920 668275 511200 1096786 798914 881019 856258 640799
17058 640799 855411 918305 481573 963642 1012286 867261 963763 998143 1267641 852846
17048 852846 762560 686718 889929 947815 873958 962684 879366 1034209 768446 1190759 797671
17037 797671 1113536 978417 935995 1087145 979418 1218876 1265841 670908 959076 1111127
17027 1111127 1055507 641728 961908 1174633 723494 903996 868523 1021840 722836 1121314
17017 1121314 832261 1158206 1468958 1185035 865229 1427553 1304738 697979 1272117
17008 1272117 1037432 1256329 1132987 1217438 1040785 1297063 1452372 1051256 1264690 980440
16998 980440 1222409 1080607 1432391 1353336 1521900 1632830 1473427 1493839 1232324 1298062
16988A298062J63353J17251N0059m25341K7446K0329K94253o3746j66008L84195
16978A699853k48215O2437K20554n6365k38451K71827j42547P4513l38204O24611
16968A930013l45581M17682l32730L00947k67960p3128n3811P948K92574k52431
16958A623523N4131o7469l806L87196j93442K0421l6792K57896j96564K48337
16948B093431p1655L4264l38627J35146o112R549M35840l58224j76978J71470
16938A928104K15300L74290k22576k21933J99055j93508j96528l101M95729N1527
16928B426359l44114M55851J44822l82394q3179j23420M89491l41219L07070J60515
16918B709782K0442k21418L47025k69533K46193j26914k05900M01386j90867l553
$$ plain form
16988 1298062 1461415 1578666 1628725 1203384 1230830 1251159 1545412 1481666 1315658 1699853
16978 1699853 1451638 1514075 1734629 1678264 1439813 1711640 1569093 1643606 1305402 1930013
16968 1930013 1584432 2002114 1669384 1970331 1702371 1629243 1575432 1583380 1875954 1623523
16958 1623523 1677654 1610185 1606379 1993575 1800133 1820554 1783762 2041658 1845094 2093431
16948 2093431 2021776 2056040 1717413 1852559 1846447 1855996 2291836 1933612 1756634 1928104
16938 1928104 2143404 2517694 2295118 2073185 2272240 2078732 1882204 1879103 2374832 2426359
16928 2426359 2082245 2538096 2682918 2300524 2217345 2093925 2583416 2242197 2549267 2709782
16918 2709782 2730224 2508806 2855831 2586298 2832491 2705577 2499677 2901063 2710196 2706643
16908B706643L617N40555p02954K64083r5358K22769j97851K70673O2820J94322
16898C269319k63643K85893J81810l80098K49255K39198j88301j21305K229K36126
16888C510483M8358J77724k74265l2785L31001l25106O28896k66145K47643m22928
16878C622876N22934m97107K25628L5241M73505j71600K7675l83778L54546J95216
16868D405136q8841K42658m5981j44600L89751j47906Q6117M05458l74374L57548
16858E084966J04936L5004k7407J88347k26490K94785K35079j65532m8903J87004
16848E661789K35642K26284j90234P9975M79168k78734K63003J25249k65874J01753
16838F438021L45465m05684N63551J51141J26753n6737R1466Q2311K29495L57703
$$ plain form
16908 2706643 2710260 3250815 2547861 2811944 2716586 2939355 2741504 3012177 3074997 3269319
16898 3269319 3005676 3291569 3473379 3093281 3342536 3581734 3393433 3272128 3274357 3510483
16888 3510483 3558841 3736565 3462300 3429515 3760516 3435410 4064306 3798161 4045804 3622876
16878 3622876 4145810 3648703 3874331 3909572 4383077 4211477 4239152 3855374 4209920 4405136
16868 4405136 4316295 4558953 4512972 4368372 4758123 4610217 4696334 5101792 4727418 5084966
16858 5084966 5189902 5224906 5197499 5385846 5159356 5454141 5689220 5523688 5474785 5661789
16848 5661789 5897431 6123715 5933481 6013456 6492624 6213890 6476893 6602142 6336268 6438021
16838 6438021 6783486 6377802 6941353 7092494 7219247 7162510 7253976 7336287 7565782 7923485
16828G923485l0168M30956o3375j75538M74445p5589J38833N37034J36324q8813
16818I207594K05345r4327J70883N77802L86066j40248J73238J75540M71893M5492
16808A1179278L90016K80558J63771k0182N76778N06309K4885O6034O36903J12253
16798A3916603N23410J64102r204L68819N03273M16577N19848O6728Q13210R8309
16788A7381675N79598P13101k15194Q26769O50231L86966M67172M96575J114370
16779B2401263J87996J048701K75027O56768O57336J000446Q13604N14316Q78716
16770B8434173P91126J024610J157893N26890R36202J208537J380519Q71045J467007
16761C7798002R56227J124171J672742J287210J488369J887744J183427K197555
$$ plain form
16828 7923485 7893317 8324273 8260898 8085360 8559805 8484216 8623049 9160083 9296407 9207594
16818 9207594 9412939 9318612 9489495 10067297 10453363 10313115 10486353 10661893 11133786 11179278
16808 11179278 11569294 11849852 12013623 11993441 12570219 13076528 13101413 13167447 13804350 13916603
16798 13916603 14440013 14604115 14594911 14963730 15467003 15883580 16403428 16470156 17283366 17381675
16788 17381675 17961273 18674374 18459180 19285949 19936180 20323146 20790318 21286893 22401263
16779 22401263 22589259 23637960 23912987 24569755 25227091 26227537 27041141 27555457 28434173
16770 28434173 29225299 30249909 31407802 31934692 32870894 34079431 35459950 36330995 37798002
16761 37798002 38754229 39878400 41551142 42838352 44326721 46214465 47397892 49595447
16753D9595447J602688J655634J853274K188552J705753K081881K321320K097161
16745F5101710K269718K636760K331390K329883K806061K770294K394556L022291
16737H5662663K582135L253028K593015K777494K595895K815154K582443K639706
16729A07501533K508223J909665K341256K133672J088267J825587J351428L83553
16721A21043184O97352M36860k59303k30712m50421j128519r90816j642490j593600
16712A15881535k001448k169079k604534j902042l167266k371127k934592k860350
16704I5871097k554729l261150k751182k936688k790332k887601k759071k720798
16696G3209546k302316k324368k838919k045381k355947k313131k242198j664627
$$ plain form
16753 49595447 51198135 52853769 54707043 56895595 58601348 60683229 63004549 65101710
16745 65101710 67371428 70008188 72339578 74669461 77475522 80245816 82640372 85662663
16737 85662663 88244798 91497826 94090841 96868335 99464230 102279384 104861827 107501533
16729 107501533 110009756 111919421 114260677 116394349 117482616 119308203 120659631 121043184
16721 121043184 121740536 122177396 121918093 121687381 121236960 120108441 119117625 117475135 115881535
16712 115881535 113880087 111711008 109106474 107204432 104037166 101666039 98731447 95871097
16704 95871097 93316368 90055218 87304036 84367348 81577016 78689415 75930344 73209546
16696 73209546 70907230 68582862 65743943 63698562 61342615 59029484 56787286 55122659
16688E5122659k105732k068841j598074j751384j834891j349855j829939q17350
16680D1766593j868167j067723j794420r37526j210104j222385j430953q00915
16672C1434400r71781o80891j450265n91439r71484p53908o78164p28175q57359
16663B3750934o80725q22822l96331n74413n93137o51830j71186p28710l36787
16654A8794993p13838m57211q27651l18221j36223n92331n24220l24932k68373
16645A4631993k90775o29804l64504J60663l52722l38621l74737R8436n39093
16636A2000836m69635M552k85969l40494r7381m70584k59668P57k14121k54180
16626I614113k47752k68953j19578q8964m33487j62195L57472j51355n93784K98342
$$ plain form
16688 55122659 53016927 50948086 49350012 47598628 45763737 44413882 42583943 41766593
16680 41766593 39898426 38830703 37036283 36098757 34888653 33666268 32235315 31434400
16672 31434400 30462619 29781728 28331463 27740024 26768540 26014632 25336468 24608293 23750934
16663 23750934 23070209 22247387 21851056 21276643 20683506 20031676 19860490 19131780 18794993
16654 18794993 18081155 17623944 16796293 16478072 16341849 15749518 15225298 14900366 14631993
16645 14631993 14341218 13711414 13346910 13507573 13154851 12816230 12441493 12539929 12000836
16636 12000836 11531201 11535753 11249784 10909290 10811909 10341325 10081657 10082414 9868293 9614113
16626 9614113 9366361 9097408 8977830 8888866 8455379 8293184 8650656 8499301 7905517 8203859
16616H203859m45750J56972j63949l43509k04338k64366n7877k47618j8587j63516
16606F451321j39388j82582K95638k84270j02344p8115l45193M90968J24n42918
16596E563241K03921l55982m34850M28696l9615l41974n9085n6775m99540K88285
16586D696322J05300m62610K31659m4731j73432L27751n99782N7360J31839K41983
16576D511659l76466q1044J23115R0335m30756O3653k26011K04399k91565J05819
16566C693138k84881k14725N24941P9137l88167R6202j45030m0428J22316n29231
16556B913272K53461j00689Q8705J42940j52857k00063j82358J27564j18179K85606
16546C057402q8123l46091O670j02744K73927j69808J5815j00099k3293K16724
$$ plain form
16616 8203859 7758109 7915081 7751132 7407623 7203285 6938919 6881042 6633424 6614837 6451321
16606 6451321 6311933 6129351 6424989 6140719 6038375 5960260 5615067 6106035 6106159 5563241
16596 5563241 5767162 5411180 4976330 5405026 5365411 5023437 4964352 4907577 4408037 4696322
16586 4696322 4801622 4339012 4570671 4525940 4352508 4680259 4080477 4137837 4269676 4511659
16576 4511659 4135193 4054149 4177264 4267599 3836843 3900496 3674485 3878884 3587319 3693138
16566 3693138 3408257 3193532 3718473 3797610 3409443 3505645 3360615 3320187 3442503 2913272
16556 2913272 3166733 3066044 3154749 3297689 3144832 2944769 2762411 2889975 2771796 3057402
16546 3057402 2969279 2623188 2629858 2527114 2801041 2631233 2647048 2546949 2523656 2740380
16536B740380l21850j28089K99077q3802l93901N05734m08209O215J06402R4775
16526B416732q8463J26688j16204k30398N9228J37765K47660j87454k09227O8172
16516B224499j29313k13869Q8305j928m2232j79459k36588L50699j71361K91097
16506A979850k46851j86913L29698l58989L06776N1487j23886n0593j05374M4257
16496A639462j74841L97658j86947o8173J18037k79246J55731r0078k33518J63270
16486A441355L52589k86297p7566L10491n67335K37455n9854K16480j99235k30433
16476A137650L71286n43869L33539k40326m7847J83169j76793k9156L03077n761
16466A284969P0950K7528M2494q4301j79630J91878j81552M2262j80540m266o7583
$$ plain form
16536 2740380 2418530 2290441 2589518 2505716 2111815 2617549 2209340 2215555 2321957 2416732
16526 2416732 2328269 2454957 2338753 2108355 2167583 2305348 2553008 2365554 2156327 2224499
16516 2224499 2095186 1881317 1969622 1967694 1925462 1746003 1509415 1860114 1688753 1979850
16506 1979850 1732999 1546086 1875784 1516795 1823571 1875058 1751172 1700579 1595205 1639462
16496 1639462 1464621 1862279 1675332 1607159 1725196 1445950 1601681 1511603 1278085 1441355
16486 1441355 1793944 1507647 1430081 1740572 1173237 1410692 1350838 1567318 1368083 1137650
16476 1137650 1508936 965067 1298606 1058280 1010433 1193602 1016809 987653 1290730 1284969
16466 1284969 1355919 1383447 1425941 1341640 1162010 1353888 1172336 1214598 1034058 1029792 962209
16455I62209l1936N7149j96173M17583K96644n24311r628n2838o2447Q3972J60245
16444A100469L98643j44436l97932N1536N86921n02725j35572N7647M6575k10448
16434H50678Q9935l15975K87848N8310N9807l1654J00678k41450J14734k67881
16424G05030j24797K07370J5728n1276N5586k52213K12071J53930q1407P4466
16414I14488j71377k7570L01552j92571J43588j86628K05133j62964q4017N3922
16404G93556J49968l63825N8349j07065L88792l51443P3736J95443l32881O5647
16394E70277N40309m43517J46873J47224l83353N7673R958J5824j2472N9918K12
16383G08926J15411j26682o3514k86561K27071l5395M26010m72616J38569P5586
$$ plain form
16455 962209 930273 987422 791249 1208832 1505476 981165 971537 918699 856252 940224 1100469
16444 1100469 1499112 1354676 956744 1008280 1595201 1092476 956904 1014551 1061126 850678
16434 850678 940613 624638 912486 970796 1030603 998949 1099627 858177 972911 705030
16424 705030 580233 787603 803331 752055 807641 555428 767499 921429 840022 914488
16414 914488 743111 715541 1017093 824522 968110 781482 986615 823651 739634 793556
16404 793556 943524 579699 638048 530983 919775 568332 642068 837511 504630 570277
16394 570277 1110586 667069 813942 961166 577813 635486 645444 661268 648796 708714 708926
16383 708926 824337 697655 634141 347580 574651 539256 965266 492650 631219 706805
16373G06805C30648K69157M56504k14559r4554C19807M43138q7999k72627N6744
16363D59063J57051j8906q7436A68703J00180N7844J62827O473Q3680j75262L08033
16352G12478l26227j6427J50273j7352M149N5024r2458J56359j07679J41670k27710
16341D32100J24357r0369j22587L82844k28401L07246C35048K0907J00158J44629
16331F00742k57287A07653L85437j85580J99853B26786M18058k27876J70845l1785
16321E56028j68097R8011B27281N3790L3139J57983J40236A77175K6446K55472
16311D59093R3271k53068J26027k05483J93882Q2110R8760J51425B19465L18015
16301E37480j57523k6384l1328A3217K34307K85151k60680L13704O653k14931
$$ plain form
16373 706805 330648 599805 1056309 841750 747196 319807 762945 674946 402319 459063
16363 459063 616114 597208 509772 168703 268883 326727 489554 496027 579707 404445 712478
16352 712478 386251 369824 520097 502745 506894 561918 469460 625819 518140 659810 432100
16341 432100 556457 466088 343501 726345 497944 805190 335048 355955 456113 600742
16331 600742 343455 107653 493090 307510 507363 226786 644844 416968 587813 556028
16321 556028 387931 485942 227281 281071 314210 472193 612429 177175 203621 459093
16311 459093 552364 299296 425323 219840 413722 495832 594592 746017 219465 537480
16301 537480 379957 353573 322245 13217 247524 532675 271995 585699 592352 377421
16291C77421A15750J87548K51731j75286j03966J22649A03982K47663j03415L9058
16281B87288R2757A66750K88581j50731L4382N28707a3449B54258J62888K23726
16271F40872C8894Q6543D3767L36025j27647I7666L42422N6842j7179l7682M2042
16260D84111k11974A28993J97419j49076k664L25795A54887K02311q1622R5496
16250C71072E945M61731l2022A04257L541J76863A25614J48601A25834L40147
16240D65981A93544P7085J85676B25531l304d6086E10624B37527j01490J10479
16230B46516J64939N918r7015j27005J13269K17050B32129m1362K19343j36520
16220B73590k4188j9857c4600A60667F8083k05K91991j77445n0208J89400i2101
$$ plain form
16291 377421 115750 303298 555029 379743 275777 398426 103982 351645 248230 287288
16281 287288 380045 166750 455331 304600 338982 867689 -13449 254258 417146 640872
16271 640872 38894 125437 43767 379792 252145 97666 440088 496930 479751 442069 484111
16260 484111 272137 128993 326412 177336 174672 500467 154887 357198 275576 371072
16250 371072 5945 467676 435654 104257 107798 284661 125614 274215 125834 465981
16240 465981 193544 270629 456305 225531 222227 -46086 510624 237527 136037 246516
16230 246516 411455 417373 320358 193353 306622 523672 232129 190767 410110 273590
16220 273590 249402 229545 -34600 160667 68083 67878 359869 182424 132216 321616 -92101
16208A1737M01605A15156R1898I5570J96058P7835j42987a01712A15116K77900
16198C93016h5230B27253A6307J19349P5012j9495a78777C5837c28795A74132
16187C33516j35968K70455C7625K21871b2663A87016J79476A73633J3073K44930
16177D31636a22894C94784a45797I9425L05627C7592K36359J17264a38920O1929
16167g6991C22192F3230K11684Q8601r3946a2792D9711b59584b8942C86716a94964
16155A21304n9817M77836a35016B46181j12572J73822B4527K84798j21540A616
16144A2902a47123C97866j96962M526M6491r9516c96225B88166J31742E4833B4837
16132b44441C48559A30252F4866P9023k9171J01332n145m3409a21681C65249j39657
$$ plain form
16208 11737 413342 115156 207054 95570 291628 369463 226476 -101712 115116 393016
16198 393016 -85230 227253 16307 135656 210668 191173 -178777 35837 -328795 174132
16187 333516 197548 468003 37625 259496 -22663 187016 366492 173633 186706 431636
16177 431636 -122894 394784 -145797 99425 405052 37592 273951 391215 -138920 -76991
16167 -76991 322192 63230 274914 363515 269569 -12792 49711 -259584 -28942 386716 -194964
16155 121304 61487 539323 -135016 246181 133609 307431 24527 309325 187785 1616
16144 12902 -147123 397866 200904 205430 251921 152405 -396225 288166 419908 54833 24837
16132 -244441 348559 130252 64866 143889 114718 216050 210905 167496 -121681 365249 225592
16121B25592a19868C67049B6398R1803C3517K18626b9002L340A99973a29102A35449
16109B72953A14955j0992n177O4251L5549E2002a57519A58900o7743c4239k4640
16098e8879D89852h2003C40597o7198I338J52516M0161K63703A73690b15109A97465
16086H8734K128c0904A71361E0933J84677C5982a34777j6164C78927A31079a5312
16074A14463b55951A31849E4611c50571C27435a4537D3056A3610J9027N05758
16064E38395A5436J21642F5238K08670A048i341E1249J23343d3441A33216J16336
16053B49552A06148m0941K08911b26553d9485B92151C9389j2630L158F408a21855
16041H3888f4026C86730F4381R3700L8520O4543K35951a32587e5419B01876O787
$$ plain form
16121 225592 -119868 367049 26398 118201 33517 252143 -29002 -25662 199973 -129102 135449
16109 272953 114955 103963 98786 163037 198586 52002 -157519 158900 91157 -34239 -58879
16098 -58879 489852 -82003 340597 273399 9338 161854 202015 465718 173690 -215109 197465
16086 88734 90862 -30904 171361 50933 235610 35982 -134777 -150941 378927 131079 -15312
16074 114463 -255951 131849 54611 -350571 327435 -14537 43056 13610 32637 538395
16064 538395 15436 137078 65238 273908 1048 -9341 51249 174592 -43441 133216 249552
16053 249552 106148 65207 274118 -226553 -49485 292151 39389 26759 29917 6408 -121855
16041 83888 -64026 386730 64381 158081 196601 261144 497095 -132587 -55419 201876 208663
16030B08663l6060b28795B54000a33747M4573C00306q1586m3851b5015m8665K8203
16019d5477A58938a70829B05683c5970A47359a72539B79562b14065B38268d48535
16008B10721a37876A23734J40687K88039A6201M9195P8479o9019a64072C80a01161
15996I8408i4122j60705B38538b29274m3688a0373k0428C4819J84529K96511K36492
15985G52351K57694L92303j99459k70063m27387J09427A84152E3106b0854A94892
15974B90424A27697F2499h4383B26369e245A43373a14794c8961G150K29702c66611
15962b02654C354c38D4043a54321J8442d9755j17719J4142A03373J77618I0210
15950b59131A82613F0505g5465A32919j2063B9298f9561c4347j6983b1473A8227
$$ plain form
16030 208663 172603 -228795 254000 -133747 -89174 300306 218720 174869 -25015 -73680 -45477
16019 -45477 158938 -170829 205683 -35970 147359 -172539 279562 -214065 238268 -448535
16008 210721 -137876 123734 264421 552460 16201 65396 143875 74856 -164072 380 -101161
15996 98408 -94122 -254827 238538 -229274 -272962 -10373 -30801 34819 219348 515859 752351
15985 752351 1010045 1402348 1202889 932826 505439 614866 184152 53106 -20854 194892
15974 290424 127697 62499 -84383 226369 -5245 143373 -114794 -38961 7150 236852 -366611
15962 -202654 3354 -338 44043 -154321 -135879 -49755 -167474 -153332 103373 280991 90210
15950 -259131 182613 60505 -75465 132919 120856 29298 -69561 -34347 -51330 -21473 18227
15938a43737k63380b7807j2269p350A35335e3236l50823E2931B549P3578h3715
15926i314I8010O7024j4684h6031o2934B16823j9632k0969d3993A43022F0501
15914A4414a80404B06521F0584a26466D5969a26675F8329K12339c0979B24457
15903C1270j748b7374n1973p4789l3537m615i971F6512l673a7415q1132l77251
15891d75798a67612q1013G1742J02098a35813A5243a94675R7225A26139J56751
15881B82890l2066f8195m018m1693j72922B10387i0545J5632A4945K21464I4383
15869b72162J15676m462k8481f9519i020j28858L3901b3676k83377a37489a5568
15857g9358j14724L652B25175b61208G1932e7033p5473d9610p9048L7988n8801
$$ plain form
15938 -143737 -407117 -27807 -40076 -47426 135335 -53236 -404059 52931 2549 76127 -83715
15926 -9314 98010 165034 150350 -86031 -148965 216823 197191 176222 -43993 143022 60501
15914 14414 -180404 206521 60584 -126466 45969 -126675 68329 280668 -30979 224457
15903 31270 29522 -27374 -79347 -154136 -187673 -192288 -9971 66512 62839 -17415 -98547 -475798
15891 -475798 -167612 -248625 71742 173840 -135813 15243 -194675 -97450 126139 282890
15881 282890 250824 -68195 -72213 -113906 -286828 210387 -90545 -74913 14945 236409 94383
15869 -272162 -156486 -160948 -189429 -69519 -9020 -137878 -103977 -23676 -307053 -137489 -15568
15857 -79358 -194082 -190430 225175 -261208 71932 -57033 -132506 -49610 -128658 -90670 -149471
15846a49471k29105J05117H8663e8888K4527k7990B30529H6381a5490E3513d552
15834I0758c22114A44975a08290B3773J48441L4538b6343l0354j19238M9938d2662
15822D5505c02834G5077B1649a52583A3736Q4306b86514K0999B1935J37274J9601
15811A78810J2733L2380H5679a05299a3938F9632L300a11709H4353J85531a42254
15799a71402N667B42284p2924b12431A13422O9318a31065B40774I1703R2952b61121
15787G1100d584A53327C9149P2652c4463e461C6081K32565q6962a60400C11194
15775a65149l0195B87614b6550q7155a5964l28793h7799A8536O1611a15596o2846
15764a78442f4506E2586J7233b94962O2052N6273d0605A51251D9237M57279C4997
$$ plain form
15846 -149471 -378576 -273459 88663 -58888 -34361 -62351 230529 86381 -15490 53513 -4552
15834 90758 -322114 144975 -108290 23773 172214 206752 -26343 -56697 -175935 -125997 -42662
15822 45505 -302834 75077 21649 -152583 13736 98042 -286514 -265515 21935 159209 178810
15811 178810 191543 223923 85679 -105299 -13938 69632 72932 -111709 84353 269884 -142254
15799 -171402 -165735 242284 169360 -212431 113422 182740 -131065 240774 91703 184655 -261121
15787 71100 -4584 153327 39149 111801 -34463 -5461 36081 268646 181684 -160400 311194
15775 -165149 -195344 287614 -26550 -113705 -15964 -344757 -87799 18536 80147 -115596 -178442
15764 -178442 -64506 52586 69819 -294962 -232910 -176637 -40605 151251 49237 506516 34997
15752C01277C7768M2939B0156G038J4933K32731J69994f02560a29590C43769A58259
15740A6437J4215b35869P6188A62014N5284h6480A13523a99543g9919r6996c2343
15728e02052e4196m37744H1892c59072A95812A6452K30770n2150a64749L5129
15718a29620L6938A54769J01463b36383A48042J7473b36126F0421R0661G169e2479
15706b04160j76873C15298C388b12822L3127A11065C5584c88472L7358c6893n4213
15695i1106A22987a13500A34323a859F9616h2241l5382M8805r3637F2439K00884
15684B63323a85017A91992c05281A21240b2078r7243d3615j23667F939a72894
15673b08006b6296k8562A14012C6666K64897b73632a31446A30316h5058A80648
$$ plain form
15752 301277 37768 80707 20156 7038 21971 254702 424696 -602560 -129590 343769 158259
15740 16437 30652 -235869 -159681 162014 217298 -86480 113523 -199543 -79919 -176915 -32343
15728 -502052 -54196 -491940 81892 -359072 195812 16452 247222 195072 -164749 -129620
15718 -129620 -92682 154769 256232 -236383 148042 165515 -236126 60421 151082 7169 -52479
15706 -204160 -381033 315298 3388 -212822 -179695 111065 35584 -388472 -351114 -36893 -91106
15695 -91106 122987 -113500 134323 -1859 69616 -82241 -117623 -68818 -162455 62439 263323
15684 263323 -185017 191992 -305281 121240 -22078 -119321 -43615 -167282 6939 -172894
15673 -208006 -26296 -54858 114012 36666 301563 -273632 -131446 130316 -85058 180648
15662e0967B52676c85289B39773a64684O9973B62208A15365j5309c40996e4273
15651c7254j65066P9105A12737a20219p6136g8880A53863a17426k8898F1012b40824
15639c1379j22487B44657i0728p8509n9453g9710k88470A92362h7345a0565B30258
15627B49205c19759a51479k6558A4369a07281j4269J090A10368h5308B45469m0957
15616B04512c34798e6847j55067h2588A29758c9768l27115I6248d1764q9300j19688
15605b50752D674J97798B2977a5466G5829a75648j45608G3477a3166q4427k16726
15594c14319A3704J7279d01154g507A36492b52341h460A0406a12893A33464a3573
15582B4839J6151K1213l0847L5432g2546l5293A7809a00319L8494B8109J55314
$$ plain form
15662 -50967 252676 -385289 239773 -164684 -94711 262208 115365 100056 -340996 -54273
15651 -37254 -202320 -123215 112737 -120219 -196355 -78880 153863 -117426 -146324 61012 -240824
15639 -31379 -153866 244657 -90728 -169237 -228690 -79710 -368180 192362 -87345 -10565 230258
15627 249205 -319759 -151479 -178037 14369 -107281 -121550 -120460 110368 -85308 245469 204512
15616 204512 -334798 -56847 -211914 -82588 129758 -39768 -366883 96248 -41764 -131064 -250752
15605 -250752 4674 202472 22977 -15466 75829 -175648 -321256 73477 -13166 -97593 -314319
15594 -314319 13704 30983 -401154 -7507 136492 -252341 -8460 10406 -112893 133464 -13573
15582 24839 40990 62203 31356 66788 -72546 -107839 17809 -100319 -61825 28109 183423
15571A83423a16579C4294d74425a97330R0410G589J13068J97385a31525F0052
15560b2668A91527h8705A09798D613h6821K0907a3838j27561M7911A00097J9201
15549A19298n1962a33883n4008A24674D5885f7681B01366I4149a67393A55767
15538B63488j31289b67268G2008c9680I8462a14101B7568a16976A46116c9337
15527A77413k8545a04417A47542J60168l9266r9265e5161B49947l8266l1860H3905
15515a12996I4911J7362f3013C87231A73173L0987a40919f3639E86884B09628
15504I781J47055L4205K14801A68119K03271A59964L10064k17974K45072A79407
15493D02317B2008e5900H5850J04218m3127P5445b5980j69146h2799P966D18191
$$ plain form
15571 183423 -116579 34294 -474425 -197330 -106920 7589 120657 318042 -131525 60052
15560 -22668 191527 -88705 109798 4613 -86821 -65914 -13838 -141399 -93488 100097 119298
15549 119298 67336 -133883 -187891 124674 45885 -67681 201366 94149 -167393 155767
15538 263488 132199 -267268 72008 -39680 98462 -114101 27568 -116976 146116 -39337
15527 177413 148868 -104417 147542 307710 268444 169179 -55161 249947 211681 179821 83905
15515 -112996 94911 112273 -63013 387231 173173 204160 -140919 -63639 586884 209628
15504 9781 156836 191041 405842 168119 371390 159964 470028 252054 497126 179407
15493 402317 22008 -55900 85850 190068 146941 222386 -25980 -195126 -82799 -74833 418191
15481B58656d4222D68369p4414b3155B21602L21446A64141K8613L85375k5607
15471E52522j27185J70339k87848G3294d6351B15800a16197E1584e927E68136
15460B42285b02054A26934K1809J98649e467A55279J78772A39538D9304J18721
15450A68025g9217n5166A45148P3218e0396D0649Q7430J1950K61003L33679M08923
15439A143634J36771j31675D63564j21690l7097a42752M6631b6100A29211b03338
15428H8939J11388k6695c3157A9490e5226B77064G8210J3334K6925K35342b03695
15416C4233J26423J44561b32778R6825C23596G777N3208a23239c6393A77487b17411
15404I3215K41569a49831l10073F4891O6500J45353B3430N6891J84510c4556a1750
$$ plain form
15481 258656 -44222 468369 393955 -23155 221602 543048 164141 192754 578129 552522
15471 552522 425337 595676 307828 73294 -46351 215800 -116197 51584 -5927 568136
15460 242285 -202054 126934 148743 347392 -5467 155279 334051 139538 49304 168025
15450 168025 -79217 -134383 145148 218366 -50396 40649 128079 140029 401032 734711 1143634
15439 1143634 1280405 1148730 463564 341874 304777 -142752 -96121 -26100 129211 -203338
15428 88939 200327 173632 -33157 19490 -55226 277064 78210 91544 118469 353811 -203695
15416 34233 160656 305217 -232778 -135953 323596 7777 60985 -123239 -36393 177487 -217411
15404 93215 334784 -149831 -459904 64891 131391 276744 23430 80321 264831 -34556 -11750
15392A973K13931f0758j95797H6289R5689r0243a79357B3853J39229j630h877
15380A46162a76721d0340A30887c07355A44831K02043k913L20719G3364P7811
15370A51175O757P5200J0648A11356f7253K5371k40534D5365K14408l6102d0780
15358F5780J02951l8597b32709C26022H9905d7156C05076E4529J91949A00881
15347A27537b1535A13410d820A87199m1834L66869N2102k44645j15691K38881
15337D42881C3577M0081B4701J49848f0205B88208e9145B26090a52849G5539j5350
15326F0189R5542i6929L3269C10671A12602n2763g1412A32181K04439a15491A39452
15314C63863L39E839J86059a56850D9076k0279K70005d3538D8019J47245c17915
$$ plain form
15392 1973 215904 -60758 -256555 86289 181978 91735 -179357 23853 163082 161452 -8877
15380 146162 -176721 -40340 130887 -307355 144831 346874 343961 664680 73364 151175
15370 151175 157932 233132 243780 111356 -67253 -41882 -282416 45365 259773 223671 -40780
15358 65780 168731 130134 -232709 326022 89905 -47156 305076 54529 246478 100881
15347 127537 -21535 113410 -4820 187199 145365 512234 564336 319691 204000 442881
15337 442881 33577 73658 24701 174549 -60205 288208 -59145 226090 -152849 75539 60189
15326 60189 155731 -96929 -63660 310671 112602 59839 -71412 132181 336620 -115491 139452
15314 363863 364202 5839 191898 -156850 49076 28797 298802 -43538 48019 195264 -317915
15302H5262J00352H9135R4442a54243A99607o6374m2504K64430E3491e5264B46447
15290B31280J64140F161N6102b36761c677l6734A85888e9746B8630b35644Q5343
15279a50301p5926d71l4179l01561A04419b68138A22936Q6827O9612p7258R3930
15268B96047B6597K13092d3608J8811A49536a32202B392J43003Q611r824k0284
15257A23898d38593B49751I7441b30255G5355i861A41853m8180c6803n8947A30776
15245h3316n9891A40644N16518R39582L34146p67012Q83976q17423D4136R2267
15235A36403n1656K28541j15020G0866H44a67432B36234b6959G3136a0470j10491
15224a20961A02091P355M6460b73522h4255I4890A9976K22768E7371a94327A4709
$$ plain form
15302 85262 185614 89135 183577 -154243 199607 133233 90729 355159 53491 -55264 246447
15290 231280 395420 6161 62263 -236761 -3677 -40411 185888 -59746 28630 -235644 -150301
15279 -150301 -226227 -471 -34650 -336211 104419 -268138 122936 209763 279375 202117 296047
15268 296047 26597 239689 -43608 -24797 149536 -132202 2392 145395 154006 144182 123898
15257 123898 -438593 249751 97441 -230255 75355 -9861 141853 93673 -36803 -95750 130776
15245 -83316 -143207 140644 657162 1596744 1930890 1163878 2047854 1230431 44136 136403
15235 136403 84747 313288 198268 70866 844 -167432 236234 -26959 73136 -10470 -120961
15224 -120961 102091 109446 155906 -273522 -84255 94890 19976 242744 57371 -194327 14709
15212a8257B24229L2743J01385j0068b6581H545K87547D713a16534C8591a09503
15200B4579O4055a15599k83529A61287J25991A4636K3711b40721b4395I6746J55254
15189B52000r9023e8234B28170g3206A27796D4316J82610C4932g0541B20650P5050
15178B95700a98226h3141j71987B38773F6112q655b05654F10637A65276K79311
15168D44587B10233e6728l1878c3759l8163B525J2165K62929H3084L0143O5537
15157A78764f5623B68294A18839a80102g9239B0537E091a75320I870R192d73080
15145C7060J27094l0579P5516J94237A13332J75615O3491N1320I2477h9314B31706
15133A03668K03230q9265K446d6398B15767N3558E8377J39872a58327A52262E5061
$$ plain form
15212 -18257 224229 256972 358357 348289 -26581 8545 296092 4713 -116534 38591 -109503
15200 24579 88634 -115599 -399128 161287 287278 14636 38347 -240721 -24395 96746 252000
15189 252000 152977 -58234 228170 -73206 127796 44316 226926 34932 -70541 220650 295700
15178 295700 -198226 -83141 -255128 238773 66112 57457 -205654 610637 165276 444587
15168 444587 210233 -56728 -88606 -33759 -71922 2525 14690 277619 83084 113227 178764
15157 178764 -65623 268294 118839 -180102 -79239 20537 5091 -175320 9870 19062 -473080
15145 37060 164154 133575 209091 403328 113332 288947 352438 403758 92477 -89314 231706
15133 103668 306898 217633 220079 -46398 215767 269325 58377 198249 -158327 152262 55061
15121h8594E49534B28455K82874k52468K00553N6795j90400J61770A83630J90422
15111C74052m8840l7897k5623j6214J0299b39940a02507r3928f4925C60544d5991
15099C13558j28931J0500J56706H2274J20282D024R7651l216L77085A77710b5546
15087a8473A20349J09490J9709J06839j9799a87444B46426J52591n8675A14767
15076C58887a37577A54970L45414e613B2545L33479A57125K56301a09432A85278
15065C07223D1770j3840P6643b93356A29516C2554N12491H7520J57010E3114J92950
15054B46064K32582p9229n9339A61112M1135K58526k00880J31389j01334A33986
15043B68318d2314B95859O4069j1669P4315N4050n2538m4335j84530L0203M2385
$$ plain form
15121 -88594 549534 228455 511329 258861 459414 516209 325809 487579 183630 374052
15111 374052 325212 287315 261692 245478 255777 -239940 -102507 -196435 -64925 360544 -45991
15099 313558 184627 195127 351833 82274 202556 4024 101675 98459 475544 177710 -25546
15087 -18473 120349 229839 249548 356387 336588 -187444 246426 399017 340342 114767
15076 358887 -137577 154970 500384 -5613 22545 356024 157125 413426 -109432 185278
15065 307223 41770 27930 104573 -293356 129516 32554 545045 87520 244530 53114 246064
15054 246064 478646 399417 340078 161112 202247 460773 259893 391282 289948 133986
15043 268318 -42314 295859 359928 348259 422574 476624 424086 379751 195221 225424 267809
15032B67809q0926L00683L65086Q6158j55128j92216J75540B72155K56301k43554
15022B84902R5284r141j1334p771K11635k46451Q1028Q0157j69275n4522C1627
15010D16765K16334k16060L01422C51148E3842O6426M0406J11801K06043j77695
15000C00823O926A37611O22656j19216k84661p6823J57588A79472a03681D05595
14989C50912K45179k34532k0054L67678l21466K45868P717J65915p4398N2282
14979G85101j49081k23624J73507j25798d7032D39142J44195j87090K22575p0030
14969E48792L14277A80393K26798L59777C56873J74473p6356J23353O386h85E61293
14957A10078J5996L63083j99824L15818J4963k38789K55613j27814J25648B51018
$$ plain form
15032 267809 186883 487566 852652 938810 783682 591466 767006 272155 528456 284902
15022 284902 380186 371045 359711 351940 563575 317124 398152 478309 309034 254512 31627
15010 416765 633099 417039 718461 351148 53842 120268 160674 272475 478518 300823
15000 300823 307749 137611 760267 641051 356390 279567 437155 179472 -103681 405595
14989 350912 596091 361559 341505 709183 387717 633585 641302 807217 732819 785101
14979 785101 636020 412396 585903 460105 -47032 439142 583337 396247 618822 548792
14969 548792 863069 180393 407191 766968 356873 531346 454990 578343 584729 -885 561293
14957 110078 126074 489157 289333 605151 620114 381325 636938 509124 634772 251018
14946C71675o5596l2892N00797C66994M20796p9739l39701l9072J88803J7899
14936E35980J15653m6427j0525j58818M32555K91675k9795k65796M04119q2838
14926A185783J84947K02511K59347j12196j95762k5716k08967J03039n6475O83123
14916B019634L43919J66140n40130n98701n05424L07482k30066j50304n4052J85699
14906I44197C08528J7183j55954L87381j0177n8703j04346j46260L38490j63435
14896D12707j76337K54898A84765N1994J18175N9851J88461p106n189J12956l4007
14885F69900J40437J05831j41828j75430J63346L69840l25349J79765k17770q2932
14875F85810K2487A77138L08119Q8282O3055j63715M6416j78425A18594Q42599
$$ plain form
14946 371675 306079 273187 773984 366994 787790 708051 368350 329278 518081 535980
14936 535980 651633 605206 594681 435863 868418 1160093 1130298 864502 1268621 1185783
14926 1185783 1370730 1573241 1832588 1720392 1524630 1498914 1289947 1392986 1336511 2019634
14916 2019634 2363553 2529693 1989563 1390862 885438 1192920 962854 812550 758498 944197
14906 944197 308528 325711 169757 557138 546961 488258 383912 237652 576142 412707
14896 412707 236370 491268 184765 236759 354934 414785 603246 596140 590951 703907 669900
14885 669900 810337 916168 774340 598910 762256 1132096 806747 986512 768742 685810
14875 685810 708297 177138 485257 573539 636594 472879 519295 340870 118594 961193
14865I61193j16002k00163N0464C12524O98096D19916K8681j98812J72751R0038
14855E12574j63728N9145j6061A73700L18298A46865N77815l20119J96296n1400
14845E49457Q3931K20066R1181j34550P69284n21482O3671p2353J02971m85523
14835F66653M4301J18691k37795j37889r3493O59302l50799l28428L30307k27132
14825D43718q1535L41081J43273q0359r6892J34356l17859J04924K06524L08715
14815A105946q4748j09696j77066j24016J4784J55884k25604J34789j03327N85327
14805A172273j30782j0277l8804o1333K01013m55119C01068K77046j37242J22811
14795E63683K1029K45704k74176k10689O15978D35424K36768j13146J23225C22989
$$ plain form
14865 961193 845191 645028 695492 312524 1010620 419916 448597 249785 422536 512574
14855 512574 348846 407991 391930 173700 491998 146865 724680 404561 600857 549457
14845 549457 633388 853454 944635 810085 1579369 1057887 1121558 1049205 1152176 666653
14835 666653 710954 829645 591850 453961 360468 1019770 668971 340543 670850 443718
14825 443718 362183 703264 846537 766178 669286 803642 485783 590707 797231 1105946
14815 1105946 1021198 911502 734436 610420 625204 781088 555484 690273 586946 1172273
14805 1172273 1041491 1031214 992410 931077 1132090 676971 301068 578114 440872 563683
14795 563683 584712 830416 556240 345551 961529 435424 672192 559046 682271 322989
14784F39361K06044L15617l46546j73470J16521k33707L85321m19668O2233L42809
14774H94515M6537R0313k47134J8590C13657M24150J72863k22185K40791l84057
14764E45219K72804j07528J14092j69547K71424l03683j71926P00559E37615k215
14754E35400M3516J17228J1144K08433q7263j50167j13016K90301l87580P29763
14744A197759m75157L08306l42251K29032r1053o1272K82607j36321j17755j48894
14734F45001m2366K67948j27286J46824R5884L74817J42043K42857M11583k32603
14724A924702l72294j836n40263J31370q3280M925j35551J9652j89195K57301
14714A015531k0633r4892j074J15346j25128l09568K61587k2143J81900L2885
$$ plain form
14784 639361 845405 1161022 814476 641006 757527 523820 909141 489473 551706 894515
14774 894515 941052 1031365 784231 802821 313657 737807 910670 688485 929276 545219
14764 545219 818023 710495 824587 655040 926464 622781 450855 1151414 537615 535400
14754 535400 578916 696144 707288 915721 828458 678291 565275 855576 467996 1197759
14744 1197759 722602 1030908 688657 917689 826636 765364 1047971 911650 793895 645001
14734 645001 602635 870583 743297 890121 986005 1360822 1502865 1745722 2157305 1924702
14724 1924702 1552408 1550572 1010309 1141679 1058399 1063324 927773 947425 758230 1015531
14714 1015531 994898 900006 898932 1014278 889150 579582 841169 819026 1000926 1033811
14704A033811J89283k61150O44831L39498j49007J0479k98646K81298n37250j94772
14694A058375K89299k2097n95829J60659k8060O9990j89136L10774j77522p731
14684H68722o4707K05931l6677K29622j24921k88192J59886K88689m74134M14215
14674A178434j98714J28984k99948M09646k53010P1742J09976n5564K0744J18552
14664A230842l49864K82209m64093N78852m86361J53396L56335j26931M7114j16090
14654A105409r3779M52012l23122K96384l066p5430j25404j17019J43247J3091
14644A272323r4773K05186k83966K18249j65143K7619j65615N15756G34319N53239
14634A287558K48925o21382N05182O314r2057j20928K83700k25796k47735K30745
$$ plain form
14704 1033811 1223094 961944 1606775 1946273 1797266 1807745 1509099 1790397 1253147 1058375
14694 1058375 1347674 1325577 729748 890407 862347 932337 743201 1053975 876453 868722
14684 868722 804015 1009946 973269 1202891 1077970 789778 949664 1238353 764219 1178434
14674 1178434 979720 1108704 808756 1218402 965392 1037134 1147110 1091546 1112290 1230842
14664 1230842 880978 1163187 699094 1277946 791585 944981 1301316 1174385 1221499 1105409
14654 1105409 1011630 1463642 1140520 1436904 1433838 1358408 1233004 1115985 1259232 1272323
14644 1272323 1177550 1382736 1098770 1317019 1151876 1179495 1013880 1529636 734319 1287558
14634 1287558 1536483 915101 1420283 1426597 1334540 1213612 1497312 1271516 1023781 1254526
14624A254526J15801k28386K70620J56929j46088Q1826J02041m15666K90475n616
14614A476462R7179n6665J00238P9077k70809J65646M3823m43422J99178L53968
14604A744675J07986q3315l44607K79141J45046J64417n58596O36809l57718R6212
14594A830050J898p8072Q4814j91723Q5035P2142N8048J21477J30094l12617J61174
14583A962320j59117J42513l6166J57203j31950m3675R3160L00946o68185N24646
14573B141695J63442k92755N5065L53935j52395n9976J3682J17491J10207M6595
14563B496986k63387M18375J2560l60922O74493q6901J20510R7467J24357J15848
14553C349386K88204M4936R90495J086982J103555L046441O628497J7687608J7229926
$$ plain form
14624 1254526 1370327 1141941 1412561 1569490 1423402 1505228 1607269 1191603 1482078 1476462
14614 1476462 1573641 1516976 1617214 1696291 1425482 1591128 1634951 1191529 1390707 1744675
14604 1744675 1852661 1769346 1424739 1703880 1848926 2013343 1454747 2091556 1733838 1830050
14594 1830050 1831948 1753876 1838690 1646967 1732002 1804144 1862192 1983669 2113763 1801146 1962320
14583 1962320 1803203 1945716 1909550 2066753 1934803 1891128 1984288 2285234 1617049 2141695
14573 2141695 2305137 2012382 2067447 2421382 2268987 2209011 2222693 2340184 2450391 2496986
14563 2496986 2233599 2651974 2664534 2303612 2978105 2891204 3011714 3109181 3233538 3349386
14553 3349386 3637590 3682526 4673021 5760003 6863558 9909999 16538496 34226104 51456030
14544E1456030B5461529I019464D503766j194669l90362J09930R86337J957997
14536E972999k404343j232446k81002j54025J24287K41461j28145l9695J30364
14527B229455L7952j63188L05485l8706Q6517j57685J47696j65419K84578Q662
14517B575347J42274k66064L93949l215j17219J4226q8794o5101M90861j79505
14507B896759j62666L12799J4906j98736L44437m56963P14741l02440M86522m22562
14497C226797J29485l8895j54492j5411K19577N2766O111Q6589J92781j08902
14487C596406l1841O1722J78840P7877j66274j27085L24125M2545J20716l00181
14477C776850K40295k65198N29228k85306L05873k7857J16842o0447M9303N6456
$$ plain form
14544 51456030 25461529 9019464 4503766 3309097 2918735 3028665 4015002 5972999
14536 5972999 3568656 2336210 2055208 1901183 2025470 2266931 2138786 2099091 2229455
14527 2229455 2267407 2104219 2409704 2370998 2457515 2299830 2447526 2282107 2566685 2575347
14517 2575347 2717621 2451557 2845506 2842291 2725072 2739298 2650504 2585403 3076264 2896759
14507 2896759 2734093 3046892 3061798 2863062 3207499 2750536 3465277 3162837 3649359 3226797
14497 3226797 3356282 3317387 3162895 3147484 3367061 3419827 3425938 3512527 3705308 3596406
14487 3596406 3564565 3626287 3805127 3883004 3716730 3589645 3913770 3956315 4077031 3776850
14477 3776850 4017145 3751947 4281175 3995869 4301742 4273885 4390727 4330280 4379583 4436039
14467D436039J03564J23525J72870n9109k25200J49728K07033n74934N33246K32808
14457E099570J47555o3718o1872J83181j98830J55790K53405K60533j57569Q2672
14447E700717r6734k86507P00337k12212J55744Q1316j18484J06788M80263k48626
14437F262602l9222Q8876M43040j06787K97071j57787M00376M9589j37881L71296
14427G471173J39365m1143J58484j19774N8826O31687k16556O82646l1532J10799
14417H843975k66282K35056J66585R1383o32060N50359L36852m6688K92624K33879
14407I805683K31430M5888j04021O48400K43468j22868M4078J63399R8135K38692
14397A1292284j12180N23266M730J55222M5590Q48136r5756j03505L68625j3011
$$ plain form
14467 4436039 4539603 4663128 4835998 4776889 4551689 4701417 4908450 4333516 4866762 5099570
14457 5099570 5247125 5183407 5121535 5304716 5105886 5261676 5515081 5775614 5618045 5700717
14447 5700717 5603983 5317476 6017813 5805601 5961345 6042661 5924177 6030965 6511228 6262602
14437 6262602 6223380 6312256 6755296 6648509 6945580 6787793 7188169 7237758 7099877 7471173
14427 7471173 7610538 7569395 7727879 7608105 7666931 8298618 8082062 8764708 8733176 8843975
14417 8843975 8577693 8812749 8979334 9070717 8438657 8989016 9325868 9279180 9571804 9805683
14407 9805683 10037113 10083001 9978980 10627380 10870848 10747980 10792058 10955457 11053592 11292284
14397 11292284 11180104 11703370 11708100 11863322 11908912 12757048 12661292 12557787 12926412 12913401
14387A2913401L49594M33884K91293L90563M13785j20575L46099O55113o5413
14378A5607744O8707L41719O2043O88792M52420K9669M58954P1140M49023L64364
14368A8594575O22347N40253J39837L65391R88216L10360J30231J95751P11429
14359B2598390N00997L25468J60011M84802J219157N74212N62667M43690M54016
14350B7323410P07963N05544Q93530N41631R49549N15144J192567O46000J076537
14341C4351875Q84903J074636Q73345J159754R77201J394626O89681J361164J254544
14332D4021729J202613J426225J373640J614616J697035J306064K138822J482444
14324E6263188J968857K038047K211344J762945K863652K048340K578067K493424
$$ plain form
14387 12913401 13262995 13696879 13988172 14378735 14792520 14671945 15018044 15673157 15607744
14378 15607744 15676451 16018170 16080213 16769005 17221425 17251094 17710048 17781188 18230211 18594575
14368 18594575 19216922 19757175 19897012 20262403 21250619 21560979 21691210 21886961 22598390
14359 22598390 23099387 23424855 23584866 24069668 25288825 25863037 26425704 26869394 27323410
14350 27323410 28031373 28536917 29430447 29972078 30921627 31436771 32629338 33275338 34351875
14341 34351875 35236778 36311414 37184759 38344513 39321714 40716340 41406021 42767185 44021729
14332 44021729 45224342 46650567 48024207 49638823 51335858 52641922 54780744 56263188
14324 56263188 58232045 60270092 62481436 64244381 67108033 69156373 71734440 74227864
14316G4227864K650487K841218L133455K982967L257617L885059L370354M241097
14308A00590118M352848M380602M525559N004959N368961N615326N905160O300873
14300A42044406O431557P195041P438987P938440Q219093R253865R714655R962423
14292B08198467J0285970J0940751J1624036J2369917J2860395J3208734J3619590
14285B93107860J4694862J4494896J5009825J5440453J5631111J5609749J5027130
14278C99015886J4645689J3828490J3059821J1832508R693955O846457L595747
14271D72518553J198262N14597m35643l448075k642164p464434r485449j0999549
14263D39756098j2284836j3612820j5236838j5557467j5963912j6452593j6058980
$$ plain form
14316 74227864 76878351 79719569 82853024 85835991 89093608 92978667 96349021 100590118
14308 100590118 104942966 109323568 113849127 118854086 124223047 129838373 135743533 142044406
14300 142044406 148475963 155671004 163109991 171048431 179267524 188521389 198236044 208198467
14292 208198467 218484437 229425188 241049224 253419141 266279536 279488270 293107860
14285 293107860 307802722 322297618 337307443 352747896 368379007 383988756 399015886
14278 399015886 413661575 427490065 440549886 452382394 462076349 468922806 472518553
14271 472518553 473716815 474231412 473795769 470347694 467705530 460241096 450755647 439756098
14263 439756098 427471262 413858442 398621604 383064137 367100225 350647632 334588652
14256C34588652j5963199j5552001j5016478j4346550j3760595j3479191j2220056
14249B34250582j1979588r871525r941661j0318471r854619q365680q301049p955970
14241A57662019p393252o649786p252427n716184n487878n486189n325733n131944
14233A09218626m570576m091862l473916l998177l916583l648663l248014l455889
14225G8814946k422627l243567k580006k392187k548252k116223j993907k049270
14217E9468907k118077j924716j637758j735394r86377j739800j844024j212259
14209D6270502j808526q58472q43907r69259j503976j111538j515998j266802
14201C6392024q17226m6787j222510j130688j080798r32762o13482l98245o68688
$$ plain form
14256 334588652 318625453 303073452 288056974 273710424 259949829 246470638 234250582
14249 234250582 222270994 212399469 202457808 192139337 182284718 173919038 165617989 157662019
14241 157662019 150268767 143618981 136366554 130650370 125162492 119676303 114350570 109218626
14233 109218626 104648050 100556188 97082272 93084095 89167512 85518849 82270835 78814946
14225 78814946 76392319 73148752 70568746 68176559 65628307 63512084 61518177 59468907
14217 59468907 57350830 55426114 53788356 52052962 51066585 49326785 47482761 46270502
14209 46270502 44461976 43603504 42759597 41790338 40286362 39174824 37658826 36392024
14201 36392024 35574798 35528011 34305501 33174813 32094015 31161253 30547771 30149526 29480838
14192B9480838p38848n64120j074954m32656j052004m45569n44224o84138n25389
14183B3418936k81665m23936m92201n30743p36493l98090l86721m13683o03069
14174A9152335j83845m21356l89746k57122l96964j80290l42319l00209m21520
14165A6258964j01396l06964m35026l78686n49876o5623p3721j54550n79203o888
14155A3607031m15049k05623K00240p26403l14640K55306n51330n7389j52859
14146A1639284j59555m22956j57958N22382n18187j64056k73811k27382j80587
14137A0057174K38227n50201J96243J39369n88980k61483j41947L67338l68185
14128I087555j04751j17282r9298l59543J44166q669n01989j87967L182L6445
$$ plain form
14192 29480838 28741990 28177870 27102916 26670260 25618256 25172687 24628463 23944325 23418936
14183 23418936 23137271 22713335 22221134 21690391 20953898 20555808 20169087 19755404 19152335
14174 19152335 18968490 18547134 18157388 17900266 17503302 17323012 16980693 16680484 16258964
14165 16258964 16157568 15850604 15415578 15036892 14487016 14421393 14347672 14193122 13613919 13607031
14155 13607031 13191982 12986359 13186599 12460196 12145556 12400862 11849532 11792143 11639284
14146 11639284 11479729 11056773 10898815 11421197 10903010 10738954 10465143 10237761 10057174
14137 10057174 10295401 9745200 9941443 10080812 9491832 9230349 9088402 9455740 9087555
14128 9087555 8982804 8865522 8766224 8406681 8550847 8542178 8040189 7852222 7855404 7891849
14118G891849l54630J44470l94559J41152k46417J84774k46526Q2393l12046j5378
14108F875082m4381p0885J97189k52116l00263J30113p3530j64777j31596k9332
14098F135504N9832j62864k76354J11079l42705J38704J45629n09850k02517L18217
14088E414675k55702L7954P049j50765j23196K39861j06027j13957k17840K24753
14078D956805j16481K29766m33692J02480J9077m37729K24831j84771K47972m85585
14068D122673J47890O6532j7202o2813j20492O9712K57318r8332j71773k50478
14058C943035N19907o93777M38357j98278M0596N9929J448l04778k76144n7478
14048C472817K9970L44600n84528J56999k7178J93014n63989J45632K92538m30668
$$ plain form
14118 7891849 7537219 7681689 7287130 7428282 7181865 7366639 7120113 7202506 6890460 6875082
14108 6875082 6830701 6759816 6957005 6704889 6404626 6534739 6461209 6296432 6164836 6135504
14098 6135504 6195336 6032472 5756118 5867197 5524492 5663196 5808825 5298975 5096458 5414675
14088 5414675 5158973 5196927 5203976 5053211 4930015 5169876 5063849 4949892 4732052 4956805
14078 4956805 4840324 5070090 4636398 4738878 4757955 4320226 4545057 4360286 4608258 4122673
14068 4122673 4270563 4337095 4319893 4257080 4136588 4206300 4463618 4365286 4193513 3943035
14058 3943035 4462942 3769165 4207522 4009244 4049840 4109769 4111217 3806439 3530295 3472817
14048 3472817 3502787 3847387 3262859 3419858 3392680 3585694 3021705 3167337 3459875 3029207
14038C029207K48495k05402K05406K31945k54836j82350o1425O8208K79493l62471
14028B996270O3054l89116q8278K53134N5551j99248J9225j08382q8224K47018
14018B761004j00267J05436k89053j2097n3699K41576k23972K8817m2208M05744
14008B821281k88375J04690m21178J91716k32601M45368l71717K5775P3272o1049
13998B287182o7377J96291k68252k06368J58674J86879O6446r3076J80724P93753
13988C234876J661382M924282J4486972K7091542j7596077A5677973o904822k583767
13980F189384j075842p94991o41880j59918n29228j13884l58613O0655J03818
13971B679501j6257l9425l47708K74794o5816k14349K42492n22609K81096k14055
$$ plain form
14038 3029207 3277702 3072300 3277706 3509651 3254815 3072465 3011040 3079248 3358741 2996270
14028 2996270 3059324 2670208 2581930 2835064 2890615 2691367 2710592 2602210 2513986 2761004
14018 2761004 2660737 2766173 2477120 2465023 2411324 2652900 2428928 2457745 2415537 2821281
14008 2821281 2532906 2637596 2216418 2408134 2175533 2620901 2249184 2274959 2348231 2287182
13998 2287182 2219805 2416096 2147844 1941476 2100150 2287029 2353475 2260399 2441123 3234876
13988 3234876 4896258 9820540 24307512 51399054 33802977 15677973 8773151 6189384
13980 6189384 5113542 4318551 3676671 3516753 2987525 2873641 2515028 2575683 2679501
13971 2679501 2663244 2623819 2276111 2550905 2485089 2270740 2513232 1990623 2271719 2057664
13961B057664O2240l99577M44770J04593k24928N0558j66637N8968j69849K69113
13951B086915j2461k40128J98885O6117K21k59981O3963J46413l51622P7348Q0895
13940A856565J9229j91291J2989L7355K4649m20278L77009J33554l49190K20134
13930A720725l33319L21380p8295J53578k68473O5038K08023m07152L42835L101
13920A727441k07378m5622J04969j16990j0329K75223j6453l87191N4563o0614
13910A317619J45721K25283l50874j33272K67800j7735N9126j50485q2808n38275
13900G42100M46415J33898j17918M62370l64700k23703J75219J91481j77377j40307
13890A127478L40747m28255K02294K96551j73171j33315k301l67784j22634O44826
$$ plain form
13961 2057664 2119904 1720327 2165097 2269690 2044762 2095320 1928683 1987651 1817802 2086915
13951 2086915 2074454 1834326 2033211 2099328 2099549 1839568 1903531 2049944 1698322 1775670 1856565
13940 1856565 1875794 1684503 1697492 1734847 1759496 1339218 1716227 1849781 1500591 1720725
13930 1720725 1387406 1708786 1630491 1784069 1515596 1580634 1788657 1381505 1724340 1727441
13920 1727441 1520063 1474441 1579410 1462420 1452091 1727314 1710861 1323670 1378233 1317619
13910 1317619 1463340 1688623 1337749 1204477 1472277 1454542 1513668 1363183 1280375 742100
13900 742100 1188515 1322413 1204495 1666865 1302165 1078462 1253681 1445162 1267785 1127478
13890 1127478 1468225 1039970 1242264 1538815 1365644 1232329 1230028 862244 739610 1384436
13880A384436j08793l72701M97154j30981j24026K58729m27617R4945L26206k38289
13870A159063J03110O9358j07687Q7650n41855K50097J44009K51451m20578k9157
13860I65461J03085L1931N3558J82233j67688l8133k20065k49824L31582l1080
13850I61060n7764p3634M15996j53635k68339j01601J16785J99082k76845J38686
13840H99791J90369Q5432j47051m25885J81056j06355R5711O69136m64651L03
13830I77856l3268m36838M68388l99660O60634E88822p9598O18449l49587q1414
13820F96672K32807p9163o654R0686l7437l1839j01906M2198J32918j06984k21052
13809F10246J83288K16272k68825k7607n394j88715N72594m00436L59109k88662
$$ plain form
13880 1384436 1275643 902942 1400096 1269115 1145089 1403818 976201 1071146 1397352 1159063
13870 1159063 1262173 1331531 1223844 1311494 769639 1019736 1163745 1415196 994618 965461
13860 965461 1068546 1100477 1154035 1336268 1168580 1130447 910382 660558 992140 961060
13850 961060 903296 829662 1245658 1092023 823684 722083 838868 1037950 761105 899791
13840 899791 1090160 1175592 1028541 602656 783712 677357 773068 1442204 977553 977856
13830 977856 944588 507750 976138 576478 1237112 588822 509224 1127673 778086 696672
13820 696672 929479 850316 843662 934348 896911 865072 763166 805364 938282 831298 610246
13809 610246 793534 1009806 740981 713374 707980 519265 1091859 691423 1050532 761870
13799G61870M15317k92862j22773J55486l70305J88938o6577O1551r4141J83587
13789H20091N0288j86242Q7785J44987l24952J34217K19801D17883M43025j80305
13779F80603K4997K226n1745k20498M96934q5958l65598L84656j91135j13385
13769E61097L82087j96273n5789k17906L29019k00885M5578J02187M3518K3794
13759H16427k79608P3068L54114m05372O3697M8037O3548k32828K0340k4322K53360
13748G50461o2628j52443K14544k52098P1470j96165J25595M4150J54802J4384
13738G12072j34491L38461k96457J3482K8015J58711k08241j39551P9222k2552
13728E28671j43560L30591j42712R5371B22735M05101M7029Q1655C12484J62179
$$ plain form
13799 761870 1177187 884325 761552 917038 546733 735671 669094 730645 636504 820091
13789 820091 870379 684137 771922 916909 591957 726174 945975 417883 860908 680603
13779 680603 705600 707826 656081 435583 932517 846559 480961 865617 674482 561097
13769 561097 943184 746911 691122 473216 802235 601350 646928 749115 792633 816427
13759 816427 536819 609887 964001 558629 622326 670363 733911 501083 521423 497101 750461
13748 750461 687833 535390 749934 497836 569306 373141 498736 542886 697688 712072
13738 712072 577581 916042 619585 633067 661082 819793 611552 472001 551223 528671
13728 528671 385111 715702 572990 668361 222735 627836 674865 756520 312484 474663
13718D74663J99441B64149J72080O4939L8132k15556K40198j30650j41856M01307
13708F92743k79189K06014k88011L79540C09990k3061K86661J29313k9203C10254
13697F09628k86267o4182N47975k71130J95481l11029J09553n9674Q8361B42942
13686F85869o5390p8814A77651J15859K30977p6268C2481K19932O28203B35516
13675C84137K17032j25334O6835K8990k6453j10319p4291o1235L19201l9284A95076
13663F04891B53199L91939j94509L06642C17323K28495K13B29368l8844L72094
13653E62618k4907r7442L4809J5341p330P9681A97181R1664o967K60583L13048
13642H55509C52455A70947Q3960M03654k03695l2288j57761K50958B18965J26343
$$ plain form
13718 474663 674104 264149 436229 501168 539300 323744 563942 433292 291436 692743
13708 692743 413554 619568 331557 711097 309990 286929 573590 702903 673700 310254
13697 609628 323361 259179 807154 536024 731505 420476 530029 470355 558716 242942
13686 685869 620479 541665 177651 293510 524487 448219 32481 252413 880616 235516
13675 384137 601169 475835 542670 571660 545207 434888 360597 299362 618563 579279 195076
13663 604891 253199 645138 450629 757271 317323 545818 546031 229368 190524 562618
13653 562618 537711 440269 475078 490419 483089 562770 197181 288845 281878 542461 855509
13642 855509 352455 170947 254907 658561 454866 422578 264817 515775 218965 345308
13632C45308J12518j82637L8083K56537q3216p9805J03709I3929K79723k7854
13622C45798J83746k61809N9145j33190c698A04042J52231L70105m9387Q8141
13612F65132k45501j55703O0223Q4316m1531K80126k15568q895R359j20587P9394
13601C90765r3825b4646E31196r6796J14261j91860P621J75766j71785O9093k2849
13590D14647n1461j19981m3694C7836L18313E9505J57157L11800j08572r5347
13580C24543o3086J56750O6358j21460j62606b4534C04001L47841r4727q1913
13570D75202p8764j12193J98259j37617j3651A3574M70878A77296Q5454L53556
13560F16306B48691J81754h4634B33995D6838J21368a18016C41768b4682I13N32133
$$ plain form
13632 345308 457826 275189 313272 569809 486593 406788 510497 93929 373652 345798
13622 345798 529544 267735 326880 193690 -3698 104042 256273 626378 576991 665132
13612 665132 419631 263928 324151 408467 366936 647062 431494 422599 431958 311371 390765
13601 390765 296940 -24646 531196 434400 548661 356801 364422 540188 368403 437496 414647
13590 414647 363186 243205 199511 37836 356149 59505 216662 528462 419890 324543
13580 324543 261457 418207 484565 363105 200499 -24534 304001 651842 557115 475202
13570 475202 396438 284245 482504 344887 331236 13574 484452 177296 262750 616306
13560 616306 248691 430445 -84634 233995 46838 168206 -118016 341768 -24682 913 533046
13549E33046k32100J91156M7143B01039J50897F5396b07021A96499i762A15213
13538C10992i776j01981D10732A77854K16225A35094a878k6223B34293P0684J14484
13527D19461j17238j17194r248N3598C9983M3309K55575J5310p4227G4027J78621
13516B52648k7121J06160q0789J1113l2030J52622N2760N9494e2489A80637K14465
13505C95102F7432l2902J84958C5863L36809o4193q9713p0087c40424B01448C7617
13493D98215A62647a7606D44217d7601B27955J82551k9423j02808A29118J22192
13483B51310f3242E45017B0899K4318L32093n5405k5002A21227B9304O60548B58573
13471I9088J62520C2400L00226L8120F7737L05975E2727O07866B10413K08394
$$ plain form
13549 533046 300946 492102 539245 201039 351936 65396 -207021 196499 -9762 115213
13538 310992 -9776 -111757 410732 177854 394079 135094 -1878 -28101 234293 304977 419461
13527 419461 302223 185029 175781 229379 39983 83292 338867 354177 279950 74027 252648
13516 252648 225527 331687 250898 262011 229981 382603 435363 494857 -52489 180637 395102
13505 395102 67432 34530 219488 35863 372672 308479 218766 148679 -340424 201448 37617
13493 498215 162647 -17606 444217 -47601 227955 410506 381083 278275 129118 251310
13483 251310 -63242 545017 20899 45217 377310 321905 296903 121227 29304 689852 258573
13471 99088 261608 32400 332626 370746 67737 373712 52727 660593 210413 418807
13461D18807A19015e0599G9753K91613G2382c6496o1034B77239Q8825a18463D90942
13449D37512A10069J98765c3576B52401K878F1445J59873e270n3349C80942a77563
13437C75178j33213p648J51681F9641a03432E0475K51208j18490M3681C4180L44017
13426C78197A64044h2449B82225a07770B22662a41607A83220p7393K9449K09970
13416C45246b55067a22138C37713G9804j1936J17809J47880K11728k32108j19583
13406A93594N2154j00054K79908h5042B90498a2458B81559a7543j25926e6990
13395C9842O0468K52546C3127L14967A49150J22189k097I6031l6158B1269J80397
13384B01666a88343F2309D857K24074i287C41696r2037m2490b17207B33799N6614
$$ plain form
13461 418807 119015 -50599 79753 371366 72382 -36496 -97530 277239 366064 -118463 490942
13449 437512 110069 308834 -33576 252401 255279 61445 221318 -5270 -58619 380942 -177563
13437 375178 241965 234317 385998 69641 -103432 50475 301683 183193 226874 34180 378197
13426 378197 164044 -82449 282225 -107770 222662 -141607 183220 105827 135276 345246
13416 345246 -255067 -122138 337713 79804 67868 185677 333557 545285 313177 193594
13406 193594 245748 145694 425602 -85042 290498 -12458 281559 -17543 -143469 -56990
13395 39842 100310 352856 33127 348094 149150 271339 269242 96031 59873 21269 201666
13384 201666 -188343 62309 4857 228931 -9287 341696 249659 207169 -217207 233799 290413
13373B90413j25049R1388j06392J36703Q6407A83522K79884o9377j49441E0031
13362B25301K60635j85670M1914m070A00663C5330J89981p5673J53511j09431
13352A93718N8229o5548E5408M69006E9781M3368K48613L9991j9269q438H6992
13340E54362j26692A83945O9181J75820J84528l05593o8361A16374k3135K98666
13330C91905j4878J23546h3304B04579Q4677j23941J22905j9512L06732a795H2716
13318B52975L30996k33548L28029j57857j08689j43477g3190D37670J581d3447
13307E25975B10196q0559J99449O1407c8797B42727j16659f0171B64382A4347
13296a76824A51774J40441g06B07955Q5991I4383M9567K35769C4433M3697K60824
$$ plain form
13373 290413 165364 256752 150360 287063 373470 183522 463406 394029 244588 50031
13362 225301 485936 300266 342180 338110 100663 35330 225311 149638 303149 193718
13352 193718 251947 186399 55408 524414 59781 103149 351762 391753 372484 364046 86992
13340 554362 427670 183945 253126 428946 613474 307881 239520 116374 93239 391905
13330 391905 377027 500573 -83304 204579 289256 165315 288220 268708 575440 -1795 82716
13318 252975 583971 350423 678452 520595 411906 268429 -73190 437670 439251 -43447
13307 525975 210196 129637 329086 390493 -38797 242727 126068 -60171 264382 14347
13296 -176824 151774 292215 -706 207955 293946 94383 143950 379719 34433 78130 338954
13285C38954a71374c5863l626A49484K54253A25046i5043B08671b50187E918Q8603
13274I4521j4340a90591a0699C55302c5259B11854r9951D4138b36068h5856D10183
13262G7578M8781d0652n009A44010f9614A12101l5317R1183K58095D0496J6435
13251E6931g2138A83777l5142K07990j67178f209A98116E388J761J38708L8583
13240A84440J67225a05922j41047a07251a4761B56557I9341L09614A19809b50085
13229A79826h9573n2120c2643h923A40788N2387C2459L00427A04617p528L00420
13218C97509b59280B53735M3224c4717A34365E3122b1482A53713O4157M0923i1914
13206A83983a73015A11892B7597J44047o2055q00C601J58469F0845a53042B64310
$$ plain form
13285 338954 -171374 -35863 -39489 149484 403737 125046 -95043 208671 -250187 5918 94521
13274 94521 80181 -190591 -10699 355302 -35259 211854 111903 44138 -236068 -85856 410183
13262 77578 126359 -40652 -45661 144010 -69614 112101 76784 167967 426062 40496 56931
13251 56931 -72138 183777 148635 356625 189447 -6209 198116 5388 7149 145857 184440
13240 184440 351665 -105922 -246969 -107251 -14761 256557 99341 408955 119809 -250085
13229 179826 -89573 -141693 -32643 -8923 140788 193175 32459 332886 104617 97089 397509
13218 397509 -259280 253735 296959 -34717 134365 53122 -21482 153713 217870 258793 -91914
13206 183983 -173015 111892 27597 171644 109589 108789 3601 162070 60845 -153042 264310
13194B96665A24531b3669F3422Q6869B0234K67374A13533a36817F1274k0872K35672
13183B76074n9391a38565A91650a59477A4684J72091M6455g3298B4865M7968J97418
13172B70251b8194B58079A26364a55111A13509B5442a2184o4289A06105e1720
13161A17063M8478p0412K48393a7207A08199a56720E0053M79143c3713H3776J05557
13150A89333K52095i1442j01872R783B09568b625B88870A08252c01541a42937
13139A3664b5507o6199a2972A98912d6973I6082a74971D838a81237F2133K0171
13128H2304c5467q8228B20620h0466j4738k45186d5609J8936G7441M9467J10618
13117B37526N6763b61418A26919C9303f4044K5324a5245A04330a60820A97449
$$ plain form
13194 296665 124531 -23669 63422 150291 20234 287608 113533 -136817 61274 40402 276074
13183 276074 216683 -138565 191650 -159477 14684 186775 233230 -73298 24865 72833 270251
13172 270251 -28194 258079 126364 -155111 113509 25442 -12184 -76473 106105 -51720
13161 117063 165541 95129 343522 -17207 108199 -156720 50053 529196 -33713 83776 189333
13150 189333 441428 -91442 -193314 -183531 209568 -2625 288870 108252 -301541 -142937
13139 13664 -25507 -91706 -12972 198912 -46973 96082 -174971 4838 -181237 62133 82304
13128 82304 -35467 -123695 220620 -80466 -95204 -340390 -45609 -26673 77441 126908 237526
13117 237526 294289 -261418 126919 39303 -64044 -38720 -15245 104330 -160820 197449
13106C5686n266M82290k20093p6291n5655i8513B15535H2585B4271d644l1564
13095c6208p6940A14113J66011b01786A23628K16117A07988N3084d2640A83238
13084D1855J6294P2464O6343j7120N793r2267k2866b09390n6319J22464A11376
13072A32865c06819C32798A52495K95617j70144M2922M1487A27144b6445F283
13061B25433c15680D7186J1514f9891l5160K3977B3248N3204M16477C7979J01788
13050A39767m1773K52997A61724J0766a38759b6666B22287h2341D41718c0658
13039B41178R6972d0745B09709O5420b2153C6523b3650m3208j140A46332R0708
13028B37040a00954G1325M19292H4124K24489F5269k8936J46219R1424d3983k21338
$$ plain form
13106 35686 30420 512710 292617 216326 160671 -98513 215535 82585 24271 -4644 -36208
13095 -36208 -113148 114113 280124 -201786 123628 339745 107988 161072 -42640 183238
13084 41855 58149 130613 196956 179836 185629 93362 70496 -209390 -265709 -143245 111376
13072 132865 -306819 332798 152495 448112 277968 320890 362377 127144 -26445 6283
13061 225433 -315680 47186 58700 -69891 -105051 -81074 23248 76452 492929 37979 139767
13050 139767 97994 350991 161724 172490 -138759 -26666 222287 -82341 441718 -30658
13039 241178 338150 -40745 209709 275129 -22153 36523 -23650 -66858 -67998 146332 237040
13028 237040 -100954 71325 490617 84124 308613 65269 36333 182552 273976 -43983 -265321
13017b65321B08390C7700J27115K52374b19495B30695C5243N66634a3490C71663
13006B69074L7937a66132A50867J87649f5646F0565O6030J05640E6868a04488
12995G641g5146A17216g6989q5995G0626N8482b0997k43162O7993A20621E0056
12983b79184A67949l4389i0524p5001P8448A31997l4260d6172p9145o7919D14462
12971A73650F7113a87604A44220a46002A82320f049j84073A62273m9674a05955
12960e3502k43349O152R2994E3291i7780A99101n1885K5842m1620c63004B53343
12948a18252A25863k5392a09740k64891B31623a87537P2780C93546b1274B76522
12937B19486b38465B87214b41515d1787A8607a12964A6579f4234C11007f0972
$$ plain form
13017 -265321 208390 37700 164815 417189 -219495 230695 35243 601877 -13490 371663
13006 269074 307011 -166132 150867 338516 -65646 60565 126595 232235 56868 -104488
12995 7641 -75146 117216 -76989 -162984 70626 129108 -20997 -264159 -196166 120621 50056
12983 -279184 167949 133560 -90524 -165525 -87077 131997 97737 -46172 -125317 -193236 414462
12971 173650 67113 -187604 144220 -146002 182320 -6049 -190122 162273 112599 -105955
12960 -53502 -296851 -290699 -197705 53291 -97780 199101 147216 173058 131438 -363004 253343
12948 -118252 125863 100471 -109740 -374631 231623 -187537 -114757 393546 -21274 276522
12937 219486 -238465 287214 -241515 -41787 18607 -112964 16579 -64234 311007 -60972
12926h0579A74120a17773A0877a220q821A1753N3605J22889a18292A52362G1252
12914A67375R756a17269C76037A71368a36125D0837c7951j13506A25205a4509
12903b01956p7410H5842K66274A70767a4878B10976H2700a60410B56768E6613
12892B683b00378C09544b06117a735m4296C61309A21329a66901A83362r059c6923
12880g3623q887A19333J52600M8671A01812P394j067K82547B3537a314D4570M910
12868D9480h5080B7223L9095A7812R6269E2554a34982m3785d697A15827E6342
12856C12754i3970k709H9784K2070Q8670N116o7093A6689c7844A84566L9991R9331
12844C23888c48127a4771C4807J17668B7114J47503a52252n1499B32844M8870
$$ plain form
12926 -80579 174120 -117773 10877 -1220 -10041 11753 65358 188247 -118292 152362 71252
12914 167375 177131 -117269 376037 171368 -136125 40837 -37951 -151457 125205 -14509
12903 -201956 -279366 85842 352116 170767 -14878 210976 82700 -160410 256768 56613
12892 2683 -200378 309544 -206117 -1735 -46031 361309 121329 -166901 183362 174303 -36923
12880 -73623 -82510 119333 271933 320604 101812 109206 108139 390686 23537 -1314 44570 49480
12868 49480 -85080 27223 66318 17812 114081 52554 -134982 -178767 -4697 115827 56342
12856 312754 -93970 -96679 89784 111854 200524 205640 138547 16689 -37844 184566 224557 323888
12844 323888 -348127 -14771 34807 152475 27114 174617 -152252 -203751 232844 281714
12834B81714b70533A87130a18877B64222Q7103B6964b84432B90951b5988q5307
12824a11295p9805N1623A97533a87183f3612m8530B91846b6195B42779a35933
12813a03695p9301A15780P2327O2515a98400d6352j42938A01657g1350B35335
12802a41488L2957j76607B96089e6626K4208j18320A9700f5217H0435J03085c6659
12790b21225J09725B27209c7020a7228k9874F3342a50969F434a28369q2118B72486
12778a54734A90419D2274a43256r517B32675b11946C4799F740P2836a9555l03609
12767c23164b1625A099L29988f015k10946M8387M0537r2673g0476J8911e369D7937
12754D6090K26797b28j06241d1866A31550c70108B50223d14248a50420N4575C5326
$$ plain form
12834 281714 -270533 187130 -118877 264222 351325 26964 -284432 290951 -25988 -111295
12824 -111295 -191100 -139477 197533 -187183 -63612 -112142 291846 -26195 242779 -135933
12813 -103695 -182996 115780 188107 250622 -198400 -46352 -189290 101657 -71350 235335
12802 -141488 -108531 -285138 296089 -56626 -32418 -150738 19700 -65217 80435 183520 -36659
12790 -221225 -111500 227209 -37020 -17228 -47102 63342 -150969 6434 -128369 -210487 272486
12778 -154734 190419 42274 -143256 -152773 232675 -211946 34799 6740 79576 -19555 -323164
12767 -323164 -21625 1099 331087 -6015 -216961 -168574 -128037 -220710 -70476 -51565 -5369 47937
12754 46090 272887 -228 -106469 -41866 131550 -370108 250223 -414248 -150420 -95845 35326
12742d24710D741P3083a15475B30161o9449a47958a3609C28249c9840r6562N5793
12731h0609A58314B198P3235k6168j5390L2921e6893b5467j35329A45266o8448
12720G6818d5338E0769K39344a97983e9341k39460B735J53395a45307A30047n197
12709A24850J92234j52467L4545b9165A30239K00567B4717a71278D24305J59957
12699E84262A78246G6189i7470L2404a7789O260D28579d33324d3509B90209D7150
12687a22505K3705c9504H1876C7869L72344A11593a91617A17575R3679r7958j9452
12676I3844J11355J748P8202p2730k4081i7828j57651A63173b09374b2398A29189
12664A13907A5688a20688A2295J80779G2178J08709A5337M77228f8500n1917A0630
$$ plain form
12742 -424710 4741 77824 -115475 230161 160712 -147958 -13609 328249 -39840 -136402 -80609
12731 -80609 158314 2198 75433 49265 33875 66796 -56893 -25467 -160796 145266 76818
12720 76818 -45338 50769 290113 -197983 -59341 -298801 2735 156130 -145307 130047 124850
12709 124850 317084 164617 199162 -29165 130239 330806 24717 -171278 424305 584262
12699 584262 178246 76189 -97470 -65066 -17789 -11529 428579 -433324 -43509 290209 47150
12687 -122505 -98800 -39504 81876 37869 410213 111593 -191617 117575 211254 113296 93844
12676 93844 205199 206947 285149 212419 188338 -97828 -255479 163173 -209374 -22398 129189
12664 113907 15688 -120688 12295 193074 72178 180887 15337 492565 -68500 -120417 10630
12652A07603a1778B23418b69441C264J46728J08571a488D2711J29701m2147b43171
12640a42162p035F6643J5696J07315j3768P8016J00463A18465J3509K4042J70933
12629C26949h033D64047I8247O7441J60916b19109d0292A33356D311i191A05403
12617a56414A81729c1518m0501L5685k2401A4970a01486C7521Q0200B8982L327
12606C2309K06158J33110l3649a2250A95770E4627A7437a01534H268i3949A44823
12594G0837h7232B55228o3961D9419b48528J17461A63225i0041I0697P5391P5503
12583B41591F8288a2729B0455a31556A29405P4049b09179a501A56042o0189P4830
12572A70683q530b6690B93708C5973a36556j52304B0155K0761b44250A28025n7539
$$ plain form
12652 107603 -11778 223418 -269441 3264 149992 258563 -1488 42711 172412 130265 -243171
12640 -142162 -149197 66643 82339 189654 175886 253902 354365 118465 131974 156016 326949
12629 326949 -8033 464047 98247 165688 326604 -219109 -40292 133356 4311 -9191 105403
12617 -156414 181729 -31518 -72019 -36334 -58735 14970 -101486 37521 117721 28982 32309
12606 32309 238467 371577 337928 -12250 195770 54627 17437 -101534 8268 -93949 144823
12594 70837 -87232 255228 191267 49419 -248528 -131067 163225 -90041 90697 166088 241591
12583 241591 68288 -12729 20455 -131556 129405 203454 -209179 -1501 156042 95853 170683
12572 170683 162153 -26690 293708 35973 -136556 -288860 20155 40916 -244250 128025 70486
12561G0486b81089a34615e7926j71783m9124R4293O4928H5334b49306i6167j59
12550i6326A23009F0044J27365D0685a63356D78739j96075k8045E6306d8071j50039
12539a98110B14005c52168A16527n2763a04806m0607P0974k59506A82705n3534
12529A29171I161c4875B45996A05555a39193j9565C75774a39177A74425a54168
12518A88148K98520c65449b8992l54764J73937g9041k30810g5409B73576k8903
12508B44673K2361c2033G2738J98281q8847m5325f1140C07492a13383d687p1256
12497g5943B702h354B8633a52138A268R9406a27772k19205a21479A81681f4716
12485b34048j52589a65694A61707o0580b14694B45161a38094j4752A22870J26317
$$ plain form
12561 70486 -281089 -134615 -57926 -229709 -278833 -184540 -119612 85334 -249306 -96167 -96326
12550 -96326 123009 60044 187409 40685 -163356 478739 282664 254619 56306 -48071 -198110
12539 -198110 214005 -352168 116527 63764 -104806 -145413 -74439 -333945 182705 129171
12529 129171 9161 -34875 245996 105555 -139193 -158758 375774 -139177 174425 -154168
12518 188148 486668 -365449 -28992 -383756 -209819 -79041 -309851 -75409 273576 244673
12508 244673 267034 -32033 72738 271019 182172 136847 -61140 307492 -113383 -4687 -75943
12497 -75943 2702 -8354 28633 -152138 1268 100674 -127772 -346977 -121479 181681 -64716
12485 -234048 -386637 -165694 161707 101127 -214694 245161 -138094 -152846 122870 249187
12475B49187I5719J56438a17255E7110J4790l2595J47559b02076j1673A22505
12464i2085C89601A02152g4987K9319j0478j6899j4117c3023j62507A03560a69331
12452g4416r0011G0728r590B7639K9587a56138B00335a2700A19851K52017q4305
12441B87563b09444A32286e7065D231M0632a4572m3181D25000j97283c77556B53147
12429i9927j33258J03293B30715B5009h9559l87824e5801q8113l8668A99940c33195
12417a64016B31515b7861k4720A6982b57505A885L1806b29953j07622A13062a15555
12405e1837j80365i4160e102C3688J87234D1010M4925k7522L12672B7536b15251
12393c33283C49780r8757o438J05210b0174B23129c592A40343d3810p1104k987
$$ plain form
12475 249187 95719 252157 -117255 57110 71900 39305 186864 -202076 -213749 122505
12464 -92085 389601 102152 -74987 -45668 -56146 -73045 -87162 -33023 -195530 103560 -169331
12452 -74416 -164427 70728 61138 27639 57226 -156138 200335 -12700 119851 371868 287563
12441 287563 -209444 132286 -57065 4231 44863 -14572 -57753 425000 227717 -377556 253147
12429 -99927 -233185 -129892 230715 25009 -89559 -477383 -55801 -143914 -182582 199940 -333195
12417 -164016 231515 -27861 -52581 16982 -257505 1885 33691 -229953 -337575 113062 -115555
12405 -51837 -232202 -94160 -5102 33688 220922 41010 85935 58413 371085 27536 -215251
12393 -333283 349780 251023 244585 349795 -20174 223129 -3592 140343 -43810 -114914 -117901
12382a17901A79832d562B10620O2322f431C29159a08087D5198R4665l6982d0884
12370b3649j7675A93469J005a83289b4163A87779j439I1156A8011J24097o7191
12359G4917a51591A81650a22604k56410J55068m2702A52809a64748Q0506L3326
12349e0916A9835N4707K46644e5464o8999j8164k1389K0734L3116A01066h2551
12337I5093K2864J82229b51196A1744a34698d1167A29934K81767c3359A95914
12326H6406J1050a45839B04495I8922a9397q5596B96618l8013H7122L66416A38740
12314B3259K35105J65792e1264B66860J3555C038a08263a7485F8380B1656L06692
12303C28348j54640J11779h08n8030b0680C72636G9958p763J31331k2298g9509
$$ plain form
12382 -117901 179832 -4562 210620 272942 -6431 329159 -108087 45198 139863 102881 -40884
12370 -23649 -41324 193469 194474 -183289 -24163 187779 186340 91156 18011 142108 74917
12359 74917 -151591 181650 -122604 -379014 -223946 -266648 152809 -164748 -84242 -50916
12349 -50916 19835 74542 321186 -55464 -124463 -142627 -164016 -143282 -110166 101066 -82551
12337 95093 117957 300186 -251196 11744 -134698 -41167 129934 411701 -33359 195914
12326 86406 97456 -145839 204495 98922 -19397 -104993 296618 258605 87122 453538 138740
12314 23259 258364 424156 -51264 266860 280415 3038 -108263 -17485 68380 21656 328348
12303 328348 173708 285487 -808 -58838 -20680 372636 79958 72195 203526 181228 -79509
12291I9427J7520A1599c7043j39235I5954J84313P858A31502b43313a09935A66220
12279B3431E377Q6795B8520g7619A90343r3569H680K45152A25751J32948b840
12267a0275A49593k7943a82966A27051c1774B10655A588J28679b06345A41354
12256G7465J99935F6534K45143q673H6751f7767B20424f1547B29319E4530M8325
12245A02855J49689J23120j79076n7884J28039L6482j49041h8418B75184C7021
12234A96295g7197k6570C06261j50099B1408K50923g1873A97663R0646A38290
12223b19014A30207B9384L27546p0151J51792L6853B05889n2663p5959K85153
12213C62420j53984p4096J22173J35323E3746M3246B2654L23184a39480A47838
$$ plain form
12291 99427 116947 11599 -37043 -176278 95954 280267 288125 131502 -243313 -109935 166220
12279 23431 5377 92172 28520 -77619 190343 96774 8680 253832 125751 258699 -2840
12267 -10275 149593 121650 -182966 127051 -31774 210655 1588 130267 -206345 141354
12256 77465 277400 66534 311677 303004 86751 -67767 220424 -61547 229319 54530 102855
12245 102855 252544 375664 196588 138704 266743 303225 154184 -88418 275184 37021
12234 196295 -77197 -103767 306261 156162 21408 272331 -71873 197663 288309 138290
12223 -219014 130207 29384 356930 286779 438571 475424 205889 153226 77267 362420
12213 362420 208436 134340 256513 391836 53746 96992 22654 345838 -139480 147838
12202B69752N299J07699E5790Q6878f8725C1175K6057K39833m8570M9988o6850
12191B31633c2286F78407d1150D28396j03087A29615J59381h9399n4448C33805
12180F6306J32109J1601G8097J6373e2459B19215j685c0841C58616h7387A05105
12168B58279r8555L94562j21563F3529L00379p2786D834J22349P0152B8323L55197
12157C83520A81071J02334a32841B44611O8383A5990f2552j40171C08947b66586
12146B00055k4775q154K7209A0662m051c293j89289c9026B29556b28686B04482
12134a7577D1430J98810q521M0920h039A92514a99092J7177B73534C8326j6448
12123B1878K62121j37666J06196F3737L77547j58406E0450L00674p8992J22931
$$ plain form
12202 269752 275051 382750 55790 142668 -68725 31175 57232 297065 248495 298483 231633
12191 231633 -32286 678407 -41150 428396 325309 129615 288996 -89399 -143847 333805
12180 66306 198415 210016 78097 94470 -52459 219215 217530 -30841 358616 -87387 105105
12168 258279 159724 554286 432723 63529 363908 291122 4834 127183 197335 28323 383520
12157 383520 181071 283405 -132841 244611 312994 15990 -62552 -202723 308947 -266586
12146 200055 175280 167126 194335 10662 6611 -3293 -192582 -39026 229556 -228686 204482
12134 -17577 41430 240240 231719 272639 -8039 192514 -199092 -181915 273534 38326 21878
12123 21878 283999 146333 252529 63737 441284 282878 50450 351124 272132 395063
12113C95063A52583k901a92364A05136K81523c33882B19091H658f4963J7454A31538
12101A60827a08776A21460E4429e1842H1893a2501r724G4544K17741b7075r440
12090c6515A30939K6411m338a39599B30574P8960f8036A06552L58824A07227K9192
12079A36419a11321a8393k34685C67157C817J85622c94109A28762J1077J67784
12069C07623J05827g5882A26186A1499K55580f4146A20130L8342N8179a55746
12058A15156B144K88940E0911M4446A9694K92669a86618A97034G8704J22813P0987
12047B72504j10891N8623A02356b7994k08002B03043f1726q0247N2712a9898o7935
12036h7833j39154a9751D2295c77960a52268O4343G427K97298b08435N5319Q635
$$ plain form
12113 395063 152583 149682 -192364 105136 386659 -333882 219091 8658 -64963 -47509 131538
12101 160827 -108776 121460 54429 -51842 81893 -12501 -22225 74544 292285 -27075 -36515
12090 -36515 130939 157350 153012 -139599 230574 309534 -68036 106552 465376 107227 136419
12079 136419 -111321 -18393 -253078 367157 3817 189439 -394109 128762 139839 307623
12069 307623 413450 -75882 126186 11499 267079 -64146 120130 158472 216651 -155746
12058 115156 2144 291084 50911 95357 19694 312363 -186618 197034 78704 201517 272504
12047 272504 161613 220236 102356 -27994 -235996 203043 -61726 -141973 -89261 -19898 -87833
12036 -87833 -226987 -19751 42295 -377960 -152268 -87925 7427 304725 -208435 -153116 -144481
12025a44481A7990L16768b5524B03962P1992b20774c6304A06405J80908C9203
12014a38699A2320d0459j45292M4820e583B30418J91222g4375L638p9883B63300
12002B15406n8229N1963G2971a03881E1026E971a32309c132H871a49593r5990
11991b45583A63049e9477k97173d6085q8738A39419C8634J33571e7288P775J364
11980d8149A08598c10601J2530A46751D8964h9053k4259d9045A38796D7321a21695
11968a97713A85400f7821A09271K26532r0765a03017c0946N063j01895K7906m2207
11957a42079N4301A71899E3221L20026f0813H5695a07479H8889L6244e1097k00636
11946b51733a2735B17978a09932A22855a81567C50844b30124j9122G7462E304
$$ plain form
12025 -144481 17990 334758 -25524 203962 275954 -220774 -36304 106405 287313 39203
12014 -138699 12320 -40459 -185751 -140931 -5583 230418 421640 -74375 -70737 -150620 263300
12002 215406 157177 209140 72971 -103881 51026 5971 -132309 -3132 8871 -149593 -245583
11991 -245583 163049 -59477 -356650 -46085 -134823 139419 38634 172205 -57288 -49513 -48149
11980 -48149 108598 -310601 -298071 146751 48964 -89053 -113312 -49045 138796 47321 -121695
11968 -197713 185400 -67821 109271 335803 245038 -103017 -30946 -25883 -127778 -99872 -142079
11957 -142079 -87778 171899 53221 373247 -60813 85695 -107479 88889 125133 -51097 -251733
11946 -251733 -12735 217978 -109932 122855 -181567 350844 -230124 -249246 77462 5304
11935b89947a14447A54515a48781e8093j6560E8651J8756K48070g3060l7920k0638
11924a31618A57325b73381O8103i5600A00928i7369j99835e6399A36912c21813
11913a90328B75496p9134n0304a42263C33088A19644J25061a22706B61393I7532
11902b60144C75504a84462A74935D0912K26999b3772A52683a0391J970j45823
11892a54244O9621m3428d2484D1994a36345O7360k47589k7328e0202n4875e1951
11880b26141e3430A51511c42827A50571l5229a31150C4628b3697l0126k05933
11870b59756e2613k29809a31026N093J1035j93349c9175j60754B32325a01823
11859I8286D0134L3601a74642B94699A42646c89822a75109D7642A5861b18458
$$ plain form
11935 -289947 -114447 154515 -148781 -58093 -74653 58651 77407 325477 -73060 -110980 -131618
11924 -131618 157325 -273381 -205278 -95600 100928 -97369 -297204 -56399 136912 -321813
11913 -190328 275496 196362 146058 -142263 333088 119644 244705 -122706 261393 97532
11902 -260144 375504 -184462 174935 40912 267911 -23772 152683 -10391 -8421 -154244
11892 -154244 -84623 -128051 -42484 41994 -136345 -68985 -316574 -343902 -50202 -105077 -51951
11880 -226141 -53430 151511 -342827 150571 115342 -131150 34628 -23697 -53823 -259756
11870 -259756 -52613 -282422 -131026 -125933 -114898 -308247 -39175 -199929 232325 -101823
11859 98286 40134 73735 -174642 294699 142646 -389822 -175109 47642 15861 -218458
11848E5072j0153a18794J7431j33904B06643b84959A3688a32180j60969F1471
11837a12490d0466B13158H4901J05541O7098A25717R7931h9226a135A9993i0912
11825G3805c4735n6928j78064A0501a76854B12450I6048e8510r9800c8945A83255
11813f6547C8478R9604a02433j04588A39141J54945a26604G723L11570d0959J5787
11802b5172H8032F000J52065a5842l5085D02430i4387A527g449k89338i6338A24741
11789b12680I3144f9678A14537i8947M0209A029f4504E5786p875h2128A16096
11777A2175P1191a08746A02030b10757G7879b30802A51223L9237d25407A27615
11766c02167C2973a7823E7305A8646K05299b2684r9521I2701b40947i7251C8671
$$ plain form
11848 55072 44919 -118794 -101363 -235267 206643 -284959 13688 -132180 -293149 61471
11837 -112490 -40466 213158 84901 190442 257540 125717 223648 -89226 -1135 19993 -90912
11825 73805 -34735 -91663 -269727 10501 -176854 212450 96048 -58510 -158310 -38945 183255
11813 -66547 38478 138082 -102433 -207021 139141 294086 -126604 7723 319293 -40959 -25172
11802 -25172 88032 6000 158065 -15842 -50927 402430 -94387 1527 -7449 -296787 -96338 124741
11789 -212680 93144 -69678 114537 -98947 -58738 1029 -64504 55786 47911 -82128 116096
11777 12175 83366 -108746 102030 -210757 77879 -230802 151223 190460 -425407 127615
11766 -302167 32973 -17823 57305 18646 223945 -22684 -122205 92701 -240947 -97251 38671
11754a63179k53304A30390i5640j87341F02765c26072f1530q246K4258A37590
11743a56450a408k40973G8071M6047a76878A19608b8061m5988J3244A9339a1727
11731A49452a55197N2851l91743J64065a62933D5922a48329E5206P7357b07547
11720c8265B09701b1685I7336g4708o4617N8391k290B69828o7591k312a0054J525
11708h529m2554B5138a81835O6763d1916E3223K10819a4714j40185d1640R198
11697c2442F7300d3162B19337I1860b082D24792c6278b011j3681D2824k1048D638
11684C80699H7371g0901j70048B83428l369A17096L7254a70850B793a74023A39842
11672a18450j23010A41689d3886o2006B2480J0260M2701d3097A17493a739l74964
$$ plain form
11754 -163179 -416483 130390 -95640 -282981 602765 -326072 -61530 -69776 -45518 137590
11743 -156450 -1408 -242381 78071 124118 -176878 119608 -28061 -74049 -60805 19339 -11727
11731 149452 -155197 -102346 -494089 -330024 -162933 45922 -148329 55206 132563 -207547
11720 -38265 209701 -21685 97336 -74708 -139325 -80934 -83224 269828 202237 199925 -10054 -8529
11708 -8529 -51083 25138 -181835 -115072 -41916 53223 264042 -14714 -154899 -41640 -32442
11697 -32442 67300 -43162 219337 91860 -2082 424792 -36278 -2011 -15692 42824 21776 4638
11684 380699 87371 -70901 -240949 283428 280059 117096 154350 -170850 2793 -174023 139842
11672 -118450 -241460 141689 -43886 -105892 22480 32740 75441 -43097 117493 -1739 -376703
11661c76703J15095D9601g9217j32668E8270R6862B5627e4217I6346O232c72777
11649b15844I9066a09956j44975a21917A95648a05749H3579b72157J0066a08611
11638C5808f6542B05142H0629a57638c449m71064a9781B48703o7332b14708A12628
11626i4832J6647k2598A87039l2514k9184i5211A08452j1428k845J72009m7b24296
11613a65280i43B23304j3129E0438M2310j9800b88669B239a00178l10288M1607
11602c68859A62674c15517a49821o6568g4000I3442a63832c788o7384B92959n5333
11591B37626a60536B13373a29425A90997c54146E5948M21331A53955c9142A14275
11580g0297B64411A27121F559L4681K39967h2865A23600a26187C6171J55755B4606
$$ plain form
11661 -376703 -261608 49601 -79217 -211885 58270 155132 25627 -54217 96346 102578 -372777
11649 -215844 99066 -109956 -254931 -121917 195648 -105749 83579 -272157 -262091 -108611
11638 35808 -66542 205142 80629 -157638 -3449 -474513 -19781 248703 181371 -214708 112628
11626 -94832 -78185 -100783 187039 154525 125341 -95211 108452 97024 94179 266188 266141 -224296
11613 -165280 -943 223304 210175 50438 92748 72948 -288669 2239 -100178 -410466 -368859
11602 -368859 162674 -315517 -149821 -216389 -74000 93442 -163832 -3788 -71172 292959 237626
11591 237626 -160536 213373 -129425 190997 -354146 55948 477279 153955 -39142 114275
11580 -70297 264411 127121 6559 41240 281207 -82865 123600 -126187 36171 191926 24606
11568D07760E3234N9990A297a07254A21083a07543c0685C0922b04303A01458a71872
11556G9312b02026G5128d6550j37033J6936k5701H6984K26528I4268K0869b63328
11544C09663o586d2719j05218o7189G4600j6444c76531F6675D439L97846E4674
11532A77797C2255Q1064g3626A90014b1442j46874L8041A28819P191N9109D719
11520B56868A15214Q5835F8430k1563a25909A61848N414c02566B98416H1099d12931
11508I5586J60387c46813H5588K1229a00992A33318g3032q1291L7399L4711L3967
11497d8246A99331m3480R0200a04517D9291K35080r6354H0621K04364C6355d5537
11485E26123F147J77668B1714K64323j36752J18408b47756I8558O6957i9561F4895
$$ plain form
11568 407760 53234 113224 1297 -107254 121083 -107543 -30685 30922 -204303 101458 -171872
11556 79312 -202026 75128 -46550 -183583 -166647 -192348 86984 313512 94268 115137 -263328
11544 309663 303077 -42719 -147937 -215126 74600 58156 -376531 66675 4439 402285 54674
11532 177797 32255 113319 -73626 190014 -21442 -168316 -130275 128819 136010 195119 4719
11520 256868 115214 201049 68430 46867 -125909 161848 167262 -302566 298416 81099 -412931
11508 95586 255973 -346813 85588 106817 -100992 133318 -73032 -154323 -116924 -82213 -48246
11497 -48246 199331 155851 246051 -104517 49291 284371 188017 80621 284985 36355 -45537
11485 526123 6147 183815 21714 286037 149285 267693 -247756 98558 165515 -99561 64895
11473B38623a65459A86660j6202m0564M1660K91167a345E82782A24397q72M04441
11462E27966j01988c7423C50823n5943c6427R307Q735A67205a48705E6658L63348
11451D20006G396Q6510B1959i0314c3054B85238A4081b99644J42186A45300a79683
11439A50442J07757i7051B81076d4315n6758a448A87114m4084A0203a75711B42023
11427A17076D3019a87555C28756P4761A3692g0737j56471A21047b40451H8938
11416h6180a1056k29058A12035b08811b1824b664j99406a0488A97693m0224a44925
11404B8415J8673a35417A25194b43935P8433C09814j1723H2829h7273M3144j12257
11393a56386B8878J17153Q736P380b38509D4046a71695k92923A60357d26331G893
$$ plain form
11473 238623 -165459 186660 170458 129894 171554 462721 -1345 582782 124397 123525 527966
11462 527966 425978 -37423 350823 294880 -36427 -27120 -18385 167205 -148705 56658 420006
11451 420006 7396 93906 21959 -90314 -33054 285238 14081 -299644 -157458 145300 -179683
11439 150442 258199 -97051 281076 -44315 -101073 -1448 187114 143030 10203 -175711 242023
11427 117076 43019 -187555 328756 403517 13692 -70737 -227208 121047 -240451 88938
11416 -86180 -11056 -240114 112035 -208811 -21824 -2664 -202070 -10488 197693 157469 -144925
11404 28415 47088 -135417 125194 -243935 -165502 309814 298091 82829 -87273 -44129 -156386
11393 -156386 28878 146031 154767 162147 -238509 44046 -171695 -464618 160357 -426331 7893
11381B56241l6925N2293A6720a05869k1478L1086B3051a15012G1296b47278A88420
11369a00731H6105J72738f42751I0677P5953b96667I2236m887g052C7760J42587
11358A80347e6087j30382E9068b63610a20943K244k78274H1673b54294J04208
11348a50086C1904a22051N0834n4577j35418R6544D90907B42278R8544f6461L0374
11337c6087d654j56969A02924c747C37439q6396b3552k43037f1705d306k2921
11326b7227j99976g9690c3554I8729a63981C5246N235b17708G2711a09171B53895
11314G7547L1727a68480h0202j26878A6558h9269G2171J18578c73890O1736g9295
11302A21671b15077J03864A21403E4160K76772c99679a91863g0325E1605b11996
$$ plain form
11381 256241 219316 271609 16720 -105869 -127347 -96261 23051 -115012 71296 -247278 188420
11369 -100731 86105 258843 -642751 90677 166630 -296667 92236 87349 -7052 37760 180347
11358 180347 -56087 -186469 59068 -263610 -120943 -118699 -396973 81673 -254294 -150086
11348 -150086 31904 -122051 -71217 -125794 -261212 -164668 490907 242278 340822 -66461 -36087
11337 -36087 -4654 -161623 102924 -3747 337439 251043 -23552 -266589 -61705 -4306 -27227
11326 -27227 -227203 -79690 -33554 98729 -163981 35246 40481 -217708 72711 -109171 253895
11314 77547 109274 -168480 -80202 -207080 16558 -89269 72171 190749 -373890 -312154 -79295
11302 121671 -215077 -111213 121403 54160 330932 -399679 -191863 -70325 51605 -211996
11291E2116a45240k4540A98116K637A2984a9367F023J27557d43229g1642C949
11279a49371A20210J25695h4988l0112k68423J35264c2832A64677g5699n6218
11269a31917q4633m8209g7642C79656A44709c10A2114J320a83927o4532C6961
11257b9457A79338B6339b86625a18548A34023R2474A12513f1911k97610E11650
11246i5534k14810e1137C12926j18417E0341J33337b34672H3284d20802a83708
11235a30040b074B24519i7575j64447A1092h6717A15608a24952d6289h641l27985
11224c36626C4662g2666j79289a03179b5344F6994b12737E6455b8639a0326I3605
11212f807k44473C9085b38691A35871K69580a55625D272c77271A72626g576l83169
$$ plain form
11291 52116 -145240 -169780 198116 200753 12984 -19367 6023 133580 -443229 -71642 3949
11279 -149371 120210 245905 -84988 -115100 -383523 -248259 -32832 164677 -75699 -131917
11269 -131917 -216550 -264759 -77642 379656 144709 -310 12114 13434 -183927 -248459 36961
11257 -29457 179338 26339 -286625 -118548 134023 226497 112513 -61911 -359521 511650
11246 -95534 -310344 -51137 312926 194509 50341 183678 -234672 83284 -420802 -183708
11235 -130040 -2074 224519 -97575 -262022 11092 -86717 115608 -124952 -46289 -8641 -336626
11224 -336626 34662 -72666 -251955 -103179 -25344 66994 -212737 56455 -28639 -10326 93605
11212 -6807 -251280 39085 -238691 135871 405451 -155625 4272 -377271 172626 -7576 -390745
11201c90745d8170D4473b5490r6526J8202o9215A31457b52395g2868F2954b87676
11189E0310a47330F0867a20764D51224a02779b5237G881e9113l76541a7284k02657
11178b19941J998k7375E7479k924a84238A44807e8344m7570A34282g9063b3535
11166a50151k19841a57217B94556f8112k67756D1450i6550c7431A7675b07805
11155A60538E3640f1657j27878B12689a81858o9388R8556D814a32262O5965j62939
11144b29236l9673N4056i4554A66512a68791C83352a9166j93830i0186q5929A76717
11132a19447A29517J62281a65718D85634c27805A98573D4464K17963g4483C63940
11121B71696q8046c03185A9112M7385J04998a64396A23786R0645q1679Q9855m6852
$$ plain form
11201 -390745 -48170 44473 -25490 -122016 -103814 -173029 131457 -252395 -72868 62954 -287676
11189 50310 -147330 60867 -120764 451224 -102779 -25237 7881 -59113 -435654 -17284 -219941
11178 -219941 -217943 -245318 57479 54555 -184238 144807 -58344 -105914 134282 -79063 -23535
11166 -150151 -369992 -157217 294556 -68112 -335868 41450 -96550 -37431 17675 -207805
11155 160538 53640 -61657 -189535 212689 -181858 -251246 -152690 4814 -132262 -66297 -229236
11144 -229236 -268909 -214853 -94554 166512 -168791 383352 -19166 -212996 -90186 -176115 176717
11132 -119447 129517 291798 -165718 485634 -327805 198573 44464 262427 -74483 363940
11121 271696 183650 -303185 19112 66497 171495 -164396 123786 214431 132752 222607 175755
11110A75755P376e5251j24050B37361a51589B30087I3090K52598a15990B27571
11099B4444i2233E23391A12333c8391j3634D88124j00783m1657a94828C51803
11088a21996B72695J24462j85634k1816A524K75447j01024K55410j65425b10128
11077B59694J65356j73517K60587j88682I5512J85517k3350o9357J44053j43498
11067A88877k3302L59250o7945m3501J85346k98972K19999J42871L5734o2308
11057F36049j28859m7846l083L65961l16340j0630J51133K28756j34904j7959
11047G22278k89320P48959n07426L91229l2993l05063L95078j86403J99586k30438
11037I05487j63229Q864K00569k76042K89009R3004m0271k2393J59709m77250
$$ plain form
11110 175755 183131 -55251 -179301 237361 -151589 230087 93090 345688 -115990 227571
11099 24444 -92233 523391 112333 -38391 -52025 488124 387341 345684 -194828 351803
11088 -121996 272695 397157 211523 189707 1524 276971 175947 431357 265932 -210128
11077 259694 425050 251533 512120 323438 95512 281029 257679 188322 332375 188877
11067 188877 165575 524825 456880 413379 598725 299753 519752 662623 698357 636049
11057 636049 507190 459344 456261 822222 505882 495252 646385 875141 740237 722278
11047 722278 432958 1181917 674491 1065720 1032727 727664 1122742 936339 1135925 905487
11037 905487 742258 751122 951691 675649 964658 1057662 1017391 994998 1154707 677457
11027F77457K72593J23948l95192K19941r2343K56767J04266k45474p1555M9539
11017H99947k07915o9756j73975M58782K34503n11244K7506L71686l42784j23557
11007E63193L66862k30965n1284J09194P9564l22558R681J52601j87032K81462
10997G70718j21632j92854K99930K14148l08473M0959k75954N84856j03129k26027
10987F82542M96304m19022o9549L13117j2436R3454l58014L50976J15962k31456
10977I61878J30661M74184j79196l50008Q83665O0701K28581L37886J01281L61938
10967C011571L33026l9773M06999n36623k51682l53862q9477k01651o24859J56667
10957A810336k33089k72941M63880l69225L02403l25638J73863j23202j44544
$$ plain form
11027 677457 950050 1073998 678806 898747 806404 1063171 1167437 921963 850408 899947
11017 899947 692032 622276 448301 907083 1141586 630342 657848 1029534 686750 563193
11007 563193 930055 699090 647806 757000 836564 514006 523687 676288 489256 770718
10997 770718 649086 456232 756162 970310 661837 702796 426842 1011698 908569 682542
10987 682542 1178846 759824 690275 1003392 990956 1084410 726396 1077372 1193334 961878
10977 961878 1092539 1566723 1387527 1037519 1921184 1981885 2210466 2548352 2649633 3011571
10967 3011571 3344597 3304824 3711823 3175200 2923518 2569656 2480179 2278528 1653669 1810336
10957 1810336 1577247 1304306 1768186 1398961 1701364 1375726 1549589 1426387 1281843
10948A281843k34295o4148k44766r5952j03865r5276j58480K84720J51185B44114
10937A77980a46040A62094D5918O4449J30146D7001C031J80222h5612C36099A4793
10925B3181p230N8088b0196l9357A18644O7592a88322A6788R931g073A03242l9345
10913F3897R5077c88983G6061c6236n9139c4093k06169E9344i8333B57332C9437
10901C2435a04852o9978A11871J82733j30261J1624j3762l4791D6789h3660K6377
10890e7283l92452d1620l3259F1447G398i4829G2194e7257A23952e6181J1292
10879d4889A24563c90986h2514C45512N6098F7839b17347B92368e62746N9955
10869e02791d1071j31735h6066q9728A31139a27188f0629b9999k15143L9106D27028
$$ plain form
10948 1281843 1047548 983400 738634 642682 538817 443541 285061 569781 720966 244114
10937 177980 -146040 162094 45918 110367 240513 47001 3031 183253 -85612 336099 14793
10925 23181 15951 74039 -20196 -59553 118644 186236 -188322 16788 26719 -7073 103242 63897
10913 63897 158974 -388983 76061 -36236 -95375 -34093 -240262 59344 -98333 257332 39437
10901 32435 -104852 -174830 111871 294604 164343 175967 162205 127414 46789 -83660 -57283
10890 -57283 -449735 -41620 -74879 61447 7398 -94829 72194 -57257 123952 -56181 -44889
10879 -44889 124563 -390986 -82514 345512 401610 67839 -217347 292368 -562746 -502791
10869 -502791 -41071 -172806 -86066 -175794 131139 -127188 -60629 -29999 -245142 -206036 427028
10857a11266B52671q5595d4139A64199a08114j24290C02837h1022A06210f676
10846h3344c6306k37117H5900a48997r7472F2349R3428D9630P1552h0188K9822
10835e0366C05285f659G8932J9115J45398n0406C0203a8880A49881b33753j24522
10824c58275J78438M7249B844d4088j88315R8134A41352g7952A5743i1398j89731
10813b81129j7503B26613a56878b2483F3431N1148a95256O0212E8307b5622E5362
10801A16251b2130k45460a6922k04010A22232N1368a55673A11594a24087A62084
10790I2763R3242G1587a27052N9315A1239R659q897a06597B6436N6020B8645a61066
10777b31528M7581A11804f645m0396r2049B22958b19566j2768I2525g9944o7204
$$ plain form
10857 -111266 252671 167076 -44139 164199 -108114 -232404 302837 -81022 106210 -6676
10846 -83344 -36306 -273423 85900 -148997 -246469 62349 155777 49630 121182 -80188 -50366
10835 -50366 305285 -6659 78932 98047 243445 193039 30203 -18880 149881 -233753 -358275
10824 -358275 -179837 -132588 2844 -44088 -232403 -134269 141352 -77952 15743 -91398 -281129
10813 -281129 -298632 226613 -156878 -22483 63431 114579 -195256 -135044 58307 -25622 55362
10801 116251 -22130 -267590 -16922 -220932 122232 173600 -155673 111594 -124087 162084
10790 92763 186005 71587 -127052 -67737 11239 20898 12001 -106597 26436 82456 28645 -161066
10777 -231528 -183947 111804 -6645 -47041 -139090 222958 -219566 -232334 92525 -79944 -147148
10766a47148E0908c8783j45053J5900J5700d0550j05768p5693j03852L9967J41797
10755a44099j32241D1639C408a40368C25262j04638b7269l72843f5851n8631D9558
10743B24825b26062A56754p5623L0156D6460b90713D3589b39200l0940O7989A13059
10731a54286O7931F1218a03197c7941j53652h75j50971M4008C21693e9716E6396
10719A08439i0015A3847i3422c3661F0871M9166c86352A321P631L1701a3552j9033
10707c2585C4760J53161h5217B1834a46919k40549E8875b80167R8264c1416o1802
10696i3218A52946A5808N1823i8380k4920A80970J3044a58394j7063q9479B91476
10684a55819A12124g2732j1230B3952K79982b25431f7809A392b60419j14029c7014
$$ plain form
10766 -147148 50908 -38783 -183836 -167936 -152236 -40550 -146318 -222011 -325863 -285896 -144099
10755 -144099 -276340 41639 3408 -140368 325262 220624 -27269 -400112 -65851 -124482 49558
10743 224825 -226062 156754 81131 111287 46460 -290713 43589 -239200 -270140 -202151 113059
10731 -154286 -86355 61218 -103197 -37941 -191593 -875 -151846 -107838 321693 -59716 56396
10719 108439 -90015 13847 -93422 -33661 60871 110037 -386352 1321 8952 40653 -13552 -32585
10707 -32585 34760 187921 -85217 21834 -146919 -387468 58875 -280167 -181903 -31416 -93218
10696 -93218 152946 15808 67631 -98380 -123300 180970 194014 -158394 -175457 -264936 291476
10684 -155819 112124 -72732 -83962 23952 303934 -225431 -67809 1392 -260419 -374448 -37014
10672d22293a546m402j56477a2752j16634p8827G7350b6318n4751C9119b18286
10660h0159A40400k5401c2789k81294J03342f900j62332a3797k90715B16427H0032
10648a28720P674o8999h4438C2069K4718k1348J75629a84826q7002c1966j45914
10637a77880H0346J26293b21660R5073A41584K9694a87197j7777l9476c9828r1211
10626a31039A2249b36613L7829K5175g9574a7518q9336C48654f8008C63363c08655
10614C46858o2839B7877K15769b02349k32089B9265h3319B14979b90151L0691
10604b59460O1732J6667c9756B16344e3890B68406j1241A23624b36793D0320b0406
10592b28369e2129p4134a7961n1293j20581R0952k9780p5794D4562Q7579l1435
$$ plain form
10672 -422293 -1546 -5948 -162425 -12752 -129386 -208213 77350 -26318 -81069 39119 -218286
10660 -80159 140400 114999 -32789 -314083 -210741 -6900 -169232 -13797 -304512 216427 80032
10648 -128720 -121046 -190045 -84438 32069 56787 35439 211068 -184826 -271828 -31966 -177880
10637 -177880 80346 206639 -221660 -126587 141584 171278 -187197 -204974 -244450 -39828 -131039
10626 -131039 12249 -236613 -198784 -173609 -79574 -17518 -106854 348654 -68008 363363 -308655
10614 346858 284019 27877 243646 -202349 -434438 29265 -83319 214979 -290151 -259460
10604 -259460 -197728 -181061 -39756 216344 -53890 268406 257165 123624 -236793 40320 -20406
10592 -228369 -52129 -126263 -17961 -69254 -189835 -98883 -128663 -204457 44562 132141 100706
10581A00706j0129b79362h5592l37729f2769o5421e6509G8686B1888K77062b43132
10569g2508p93K4958E7169a47108H789b9720R875m3958A10070D770J85750c4820
10556a877A4312J56698a61685A88948h9723j51940b0587F2356K19151a24466B92532
10544c4845B44107I347a88839Q3872c0864k22323e4877m29654K22064J02893C2854
10532H4474a30417L2438c9800J6413I670N8631j4061d17537h1842r3056Q1266
10521i3632l8695d2988B910e656j75277A04933e31354B04575A4974b4353j79383
10510b03736N4718A99277C8568L4255B0639a02292B26895E2255c95742H1321i7811
10498c17480I6595l2326R1200l981E1695a8242j2408A37701o2116c1901C7137
$$ plain form
10581 100706 90577 -279362 -85592 -423321 -62769 -128190 -56509 78686 21888 298950 -243132
10569 -72508 -73301 -48343 57169 -147108 8789 -29720 -19845 -63803 110070 4770 190520 -34820
10556 -1877 14312 171010 -161685 188948 -89723 -241663 -20587 62356 281507 -124466 292532
10544 -34845 244107 9347 -188839 -104967 -30864 -253187 -54877 -484531 -262467 -159574 32854
10532 84474 -130417 -97979 -39800 -23387 9670 68301 54240 -417537 -81842 -174898 -93632
10521 -93632 -132327 -42988 2910 -5656 -180933 104933 -531354 204575 14974 -24353 -203736
10510 -203736 -149018 199277 38568 72823 20639 -102292 226895 52255 -395742 81321 -97811
10498 -317480 96595 64269 155469 151488 51695 -18242 -30650 137701 75585 -31901 37137
10486b4885j74221R8939m5539A81823A3090a33124g249k40299A77434a18331B87227
10474F51266A41374L90762A74584M36067k57912I4156B2182K7703J5749h5650
10463C6707b20480a04915A28231b35470c5879j48009a1600D138J41625a42652
10452A00903b06616k2380b4538F4239J5184B0588e1723C3557b3632m9252m0066
10441a12950l11990K07451G7093a82211P992P5441K5104A04252b90346J39614
10431a50732j98771O2554a32284D20705c123C84303a62597g0154o8983A94062
10420H5174f7711A42885a83025j79698J80628C74587a19416d0436C4624a47024
10409d2426j65178f5889j04620A59301a23365c8361H8597k7373b50859d3339A74683
$$ plain form
10486 -24885 -199106 -100167 -145706 181823 13090 -133124 -7249 -247548 177434 -118331 287227
10474 651266 141374 532136 174584 610651 352739 94156 22182 49885 65634 -85650
10463 36707 -220480 -104915 128231 -235470 -35879 -183888 -11600 4138 145763 -142652
10452 100903 -206616 -228996 -24538 64239 79423 20588 -51723 33557 -23632 -72884 -112950
10441 -112950 -424940 -217489 77093 -182211 -174219 -98778 -73674 104252 -290346 -150732
10431 -150732 -349503 -286949 -132284 420705 -3123 384303 -162597 -70154 -139137 194062
10420 85174 -67711 142885 -183025 -362723 -182095 374587 -119416 -40436 34624 -147024
10409 -42426 -207604 -65889 -170509 159301 -123365 -38361 88597 61224 -250859 -43339 174683
10397A47570h0418D7355a69085A12229J32742J8080H1994d7657A79353K8873K5325
10386B33551E4285Q2669K05014K8951A23359Q6157H4580K37330A31171N3757Q2012
10375B66940p4267n1673E3797J1612R5204J63247E9903L72042R1895F2690J19462
10364A82152J29919L20071j06634K8729n25g3506A04982M02617A82089J24245
10354C06334o6053J22020A61526M44556A31527j3332P49413j44501k1760q6498
10344F14849k67083D0393L08480M3521A74451K40474A57250a1024j37676B89164
10333C70885A7527N36162A49236d9909B6945K85890A15664K7618N0857D3126L1699
10322G4825K4102L57919G3932d7835A31102i8449C60789e376C7061J27548D9594
$$ plain form
10397 147570 -80418 47355 -169085 112229 244971 263051 81994 -47657 179353 208226 233551
10386 233551 54285 136954 341968 370919 123359 209516 84580 321910 131171 184928 266940
10375 266940 192673 141000 53797 65409 160613 323860 59903 431945 523840 62690 182152
10364 182152 312071 632142 525508 554237 553712 -73506 104982 507599 182089 306334
10354 306334 240281 362301 161526 606082 131527 118195 867608 723107 701347 614849
10344 614849 347766 40393 348873 392394 174451 414925 157250 -11024 -148700 289164
10333 370885 17527 553689 149236 -49909 26945 312835 115664 143282 194139 43126 74825
10322 74825 98927 456846 73932 -47835 131102 -98449 360789 -5376 37061 164609 49594
10310C72403R0375b4853A11999j3720e6006j14830H6171k4995d3929k40241D7952
10298b09183H6798L9546a74781a2136j90628C7724c31711B01215a22818D7612
10287I6074a57372e4145E6055c65257a64115A05949B0323M9243a8160j86227d9898
10275d9911a9616j44990I7072A4983b01651j4761f3288o8296l8765A18651Q1598
10264B00249Q4374b01686C2885d941A84188e0155A27593J73416j26516F6091J87452
10253B53543k655J07786J25047j98444A37406K1354g8299B70901c32070A44570
10242a28997j96758g1716l21821a28782A41638K2002a62375A34562l5777a15254
10231b5664k47564F9992c79803A2803c49783a17103a8845A56961c57156i358k4276
$$ plain form
10310 372403 462778 -24853 111999 98279 -56006 -170836 86171 61176 -43929 -284170 47952
10298 -209183 86798 126344 -174781 -12136 -202764 37724 -331711 201215 -122818 47612
10287 96074 -157372 -54145 56055 -365257 -164115 105949 20323 69566 -18160 -204387 -49898
10275 -49911 -19616 -164606 97072 14983 -201651 -216412 -63288 -131584 -170349 118651 200249
10264 200249 284623 -201686 32885 -4941 184188 -50155 127593 301009 174493 66091 253543
10253 253543 250888 358674 483721 285277 137406 158760 -78299 270901 -332070 144570
10242 -128997 -325755 -71716 -393537 -128782 141638 163640 -162375 134562 98785 -115254
10231 -25664 -273228 69992 -379803 12803 -349783 -117103 -18845 156961 -357156 -9358 -33634
10220c3634j43967c1839k4198B2404K30898c8436l40368a0578j38160p395n7480
10209b13613F0976c47588f9542E7195a20504k87540J74350A00677a76031p2891
10199b48922J20478k13085Q8984N8643A6189c06934B05471C8199b19628J03702
10189a15926F6928J66708K0144d44838e1879a6972H8462g4359A3052e2514j68300
10178b20814h0699A75193o0935c96212a62943g5664J6694j73592c746C4823K0494
10167E5317M3521J96887j46064a54822H7500a66505o4914M1733j28282g0985a6616
10155b58475A44505k3041b11356h7869B63809b00441A06838A8143i8150M5000
10145e3150j84201G3469i6620B4356i9257r7713B48656b3295C5049O7910f3909
$$ plain form
10220 -33634 -177601 -31839 -56037 22404 253302 -38436 -378804 -10578 -148738 -156133 -213613
10209 -213613 60976 -347588 -69542 57195 -120504 -408044 -233694 100677 -176031 -248922
10199 -248922 -128444 -341529 -252545 -193902 16189 -306934 205471 38199 -219628 -115926
10189 -115926 66928 233636 253780 -444838 -51879 -16972 88462 -74359 13052 -52514 -220814
10178 -220814 -80699 175193 114258 -396212 -162943 -75664 -58970 -232562 -3746 34823 55317
10167 55317 98838 295725 149661 -154822 87500 -166505 -231419 -189686 -317968 -70985 -16616
10155 -258475 144505 121464 -211356 -87869 263809 -200441 106838 18143 -98150 -53150
10145 -53150 -237351 73469 -96620 24356 -99257 -196970 248656 -23295 35049 102959 -63909
10133i0606j10490l2933f6887B23751e2590k86177d8628k87068a43079j33447
10123b76526j93366A53455a18491r3016Q9883o4410N1931o5619E3085a10479B5489
10111g3752j14016A74758b10758F02c36176B07819a43258H7081c58503a02618
10100I50a84824O8943j30056j66307E3433a2558A53264b04890I1643a57191p5926
10089b33117F6315R0853i228r9135r3659A25289g2090o1782d6473m6146m031r8166
10077a94816C0849b70018A00089c94650R7360h7552M0848j96914j01823C69921
10066b69296J23573n293o7819O5986G0412O5195g0380k7125m6354j6426b3004
10054B39858A17756a57543F7207c32021B37814a37725e3902B1096J89717c44497
$$ plain form
10133 -90606 -201096 -234029 -66887 223751 -52590 -338767 -48628 -335696 -143079 -276526
10123 -276526 -469892 153455 -118491 -211507 -121624 -186034 -134103 -199722 53085 -110479 25489
10111 -73752 -187768 174758 -210758 602 -336176 207819 -143258 87081 -358503 -102618
10100 950 -184824 -115881 -245937 -412244 53433 -12558 153264 -204890 91643 -157191 -233117
10089 -233117 66315 157168 -9228 -108363 -202022 125289 -72090 -133872 -46473 -92619 -96650 -194816
10077 -194816 30849 -270018 100089 -394650 -297290 -87552 -46704 -243618 -345441 369921
10066 -269296 -145723 -151016 -218835 -152849 70412 135607 -70380 -97505 -143859 -160285 -23004
10054 239858 117756 -157543 67207 -332021 237814 -137725 -53902 21096 210813 -344497
10043G2946F349a64247A08357f9373C9407j5352b88965O8454h6379j49082q6868
10032c22329J01361R7545d0896j45460F382J16427K3694f4267k08800j18865B25396
10020G7748a06029m76267a39550A44977c3270J1744j98714g6756G2951e0647A08565
10008b35400q0073J01890A4228J35493a04395B52253g4550I0648a32101a7766
9997a6938o275l48810a18048M8691B30067H8845h7949C6910c17679J31152j02851
9986b89378F1365a68417n6001B46098c38478a7555B10682b1621k68339o0248k3302
9975c73510A41106g751A67476c77932a10415E2105a16529j94495J37929A84292
9964i7334A47757f6985J8926l8543A4253a45677G9434c29997B0516g988k18639
$$ plain form
10043 72946 6349 -164247 108357 -69373 39407 24055 -288965 -220511 -86379 -235461 -322329
10032 -322329 -220968 -123423 -40896 -186356 6382 122809 146503 -64267 -273067 -391932 225396
10020 77748 -106029 -582296 -139550 144977 -33270 -21526 -220240 -76756 72951 -50647 108565
10008 -235400 -315473 -213583 14228 149721 -104395 252253 -74550 90648 -132101 -17766
9997 -16938 -23213 -372023 -118048 -69357 230067 88845 -87949 36910 -317679 -186527 -289378
9986 -289378 61365 -168417 -224418 246098 -338478 -17555 210682 -21621 -289960 -350208 -373510
9975 -373510 141106 -7751 167476 -377932 -110415 52105 -116529 -311024 -173095 184292
9964 -97334 147757 -66985 -48059 -86602 14253 -145677 79434 -329997 20516 -7988 -226627
9953b26627c9888k06700A11149h3810K3000j75059F8593P2838m8726c22856a22545
9941a08839c409k64153e0578m6913D08022c04389g0739C47700c44232a50520f0307
9929b72167k34067a83069d1424j23719G5432a64803O6469C03383d26208b5696
9918c95929A02341j397a82150C32990a98348P9953j52622a4884k25259a7430E8789
9906b7316k13321a2568I0113i7683F3185a06868q5678C32363a91775r098N9656
9895a41217I2316Q8502g0812h064j2657j61488c7714A26818a14764h497C07879
9883A5483J19211j3097J2148C8434a57244O2073A6531b89117B28992j06814c81066
9871a43729e1488H6374b33710A12615L3433P6058E8466B1639J79094D9274e2148
$$ plain form
9953 -226627 -39888 -246588 111149 -83810 -60810 -235869 68593 141431 92705 -322856 -122545
9941 -108839 -3409 -267562 -50578 -97491 408022 -304389 -70739 347700 -344232 -150520 -60307
9929 -272167 -506234 -183069 -41424 -165143 75432 -164803 -98334 303383 -426208 -25696
9918 -395929 102341 100944 -182150 332990 -198348 -118395 -271017 -14884 -240143 -17430 58789
9906 -27316 -240637 -12568 90113 -97683 63185 -106868 -192546 332363 -191775 -200873 -141217
9895 -141217 92316 180818 -70812 -8064 -20721 -182209 -37714 126818 -114764 -8497 307879
9883 15483 134694 121597 133745 38434 -157244 -95171 16531 -289117 228992 122178 -381066
9871 -143729 -51488 86374 -233710 112615 146048 222106 58466 21639 200733 49274 -52148
9859a73712j21066e6306k98335A67415M20C1843L0774a51144j34266A05717a97419
9847I2344b0571m3706K3587E707b71528f4876l34141P6128D7279b75630e5350
9835c46600a60362q1187D3426d26993d7742A04789P4805d00776B10930A8779J63349
9824A82128e7168k30881h5717E4921B3135b03292j11856L8232A26640h543j71439
9813a79982a7567j27522l7489p4628A32584b3809j46098e2814A4926a4765j89982
9802b04747A70860a04187J1788k94373C3186B544a24018L8956l50183g1827P276
9791f4551k15719j01388A50558I398a41036P0300r441j29004A30168a5784j30856
9780a46640k8096A27092a69382D0515d72502h170F1565b10295D3906a6534j00585
$$ plain form
9859 -173712 -294778 -56306 -354641 167415 167835 31843 62617 -151144 -285410 105717 -197419
9847 92344 -20571 -64277 -40690 5707 -271528 -64876 -399017 -322889 47279 -275630 -55350
9835 -346600 -160362 -241549 43426 -426993 -47742 104789 179594 -400776 210930 18779 182128
9824 182128 -57168 -288049 -85717 54921 23135 -203292 -315148 -276916 126640 -8543 -179982
9813 -179982 -17567 -145089 -182578 -257206 132584 -23809 -169907 -52814 14926 -14765 -204747
9802 -204747 170860 -104187 -92399 -386772 33186 2544 -124018 -85062 -435245 -71827 -64551
9791 -64551 -280270 -381658 150558 9398 -141036 -70736 -80177 -209181 130168 -15784 -146640
9780 -146640 -174736 127092 -169382 40515 -472502 -8170 61565 -210295 43906 -16534 -117119
9769a17119B77444d086B80660C663M4599a83864f1167E7281J08643d45840i240
9757g5149o626m7642A84384b2753l24081l92978A91899d17411a78537q9930j8903
9746b87370a29018j01978Q2512E6085j1537a93263c2646A59919h9877l5004K0629
9735a04252N0953F8967i8718a9141k42956k9706b028j1591r486j44815e9407j99117
9723b58524i8764H3639a00997m01894b05595m7655J01819H1524b84674P2871A24335
9711A2352c7158H1895j1272L917a41639d2694j20566d9500j83655A30303h406
9699a2681B03354a6255j35665A56581N3874a53134F497e49085a76448a3951j69193
9688a83144A15592f5361j66980a9169m22463b00018H0088N8072a47070k9501A50429
$$ plain form
9769 -117119 277444 -4086 280660 3663 48262 -183864 -61167 57281 165924 -445840 -9240
9757 -75149 -81775 -129417 184384 -22753 -346834 -739812 191899 -417411 -178537 -268467 -287370
9746 -287370 -129018 -230996 -148484 56085 44548 -193263 -32646 159919 -89877 -124881 -104252
9735 -104252 -53299 68967 -98718 -19141 -262097 -291803 -2028 -13619 -23105 -167920 -59407 -258524
9723 -258524 -98764 83639 -100997 -502891 -205595 -253250 -151431 81524 -284674 -211803 124335
9711 12352 -37158 81895 70623 74540 -141639 -42694 -163260 -49500 -233155 130303 -8406
9699 -12681 203354 -16255 -151920 156581 210455 -153134 6497 -549085 -176448 -13951 -183144
9688 -183144 115592 -65361 -232341 -19169 -441632 -200018 80088 138160 -147070 -176571 150429
9676a13414E4526a93020A09261j8782K8121Q5861g759j83298P5760A90363J0224
9665B00587a08952k71342F8410b55431C4374d5560k32577e065m03640A1150b52376
9653A7038b4206k92889J17532B05830a40111e1415k0729o1713B48942B1661a15134
9641A70595a26690A39063a92175A35410B8624d35831a66726C4931J39768b54210
9630A47246a05062L7833C91636E8442K12753i5000k01009A27115e4636n7571o155
9619a18362C1981i959A99195C7249g2659G157c24108a2238B68620b3978j12288
9608a36266L2776C73591F9918d5303j99578c6302A63357E7198B4474d34156a18452
9596F4966D093b79971J01353g5350a927A52250e0157A51349c10912A16183a47150
$$ plain form
9676 -113414 54526 -193020 109261 90479 118600 204461 -7759 -191057 -115297 190363 200587
9665 200587 -108952 -380294 68410 -255431 34374 -45560 -278137 -5065 -408705 11150 -252376
9653 17038 -24206 -317095 -199563 205830 -140111 -51415 -72144 -133857 248942 21661 -115134
9641 170595 -126690 139063 -192175 135410 28624 -435831 -166726 34931 174699 -254210
9630 147246 -105062 -67229 391636 58442 271195 -95000 -296009 127115 -54636 -112207 -118362
9619 -118362 31981 -9959 199195 37249 -72659 7157 -324108 -12238 268620 -23978 -136266
9608 -136266 -103490 373591 69918 -45303 -244881 -36302 163357 57198 24474 -434156 -118452
9596 64966 4093 -279971 -178618 -75350 -1927 152250 -50157 151349 -310912 116183 -147150
9584A15127a97057B91001J10479f1953j57776B03638a55111k06851E132h5338
9573A02918G573a38264K1464A14021M2233b72243A25500Q6193q9047b34897f1885
9561c15759J04049k1041J04839D52888B18919a55360l1677q0952r8167e232m77284
9550d82516J38674a58579A76302O1014f5355D562b69747A19848b61658C59365
9539c76856B23634c62678B87075D1085a93833o3596J2814p579p1115B8494c01986
9527c24213K8839N1099A14432J62402b1702p3605o5837j38036J00697L642e3827
9515A45592F1179a6430l47088J4978K9168P4842a15355E4024e3323j47694j01847
9504c02864h967C5749b43470a05008J1269b6371R769I507K21996f2587j24515
$$ plain form
9584 115127 -197057 291001 401480 -61953 -219729 203638 -155111 -361962 5132 -85338
9573 102918 7573 -138264 -116800 114021 156254 -272243 125500 211693 122646 -234897 -61885
9561 -315759 -211710 -232751 -127912 452888 218919 -155360 -187037 -267989 -366156 -5232 -482516
9550 -482516 -343842 -158579 176302 237316 -65355 4562 -269747 119848 -261658 359365
9539 -376856 223634 -362678 287075 41085 -193833 -257429 -244615 -252194 -323309 28494 -301986
9527 -324213 -295374 -244275 114432 276834 -21702 -95307 -161144 -299180 -198483 -194841 -53827
9515 145592 61179 -16430 -363518 -348540 -319372 -244530 -115355 54024 -53323 -201017 -302864
9504 -302864 -8967 35749 -243470 -105008 -93739 -26371 -16602 9507 231503 -62587 -187102
9493a87102G8550c4791D9143d7465l32574O9089C91417h4982H5853J447a88626
9481e3633j7839q4205a4296B74622C8959M0956a30401C7272K30335A06666d48524
9469a33166j21433G7106a41902g421A89096b67506K3083g2394A45829i5522p0615
9458a66137j13107e4586j21119j24240a40427i523j91367B30454q1078K3823O3870
9447B37069l2810f9506j02210b3368n4510j74913i958j16846A51176a79061c7013
9435a62999F0363a63613P2489o0764j02015g848A42132a33481k9880E2245a08848
9423a97641j42613E9333b03499C64867A09885g3916J3904o9454O2143p7370A62819
9411b46809B40200j04559a58752m1319R7224K3121A58252B2676a01501B38598
$$ plain form
9493 -187102 78550 -34791 49143 -47465 -380039 -310950 391417 -84982 85853 87300 -188626
9481 -53633 -71472 -155677 -14296 274622 38959 79915 -130401 37272 267607 106666 -448524
9469 -133166 -254599 77106 -141902 -7421 189096 -267506 -244423 -72394 145829 -95522 -166137
9458 -166137 -279244 -54586 -175705 -299945 -140427 -9523 -200890 230454 149376 173199 237069
9447 237069 204259 -69506 -171716 -23368 -77878 -252791 -9958 -126804 151176 -179061 -37013
9435 -162999 60363 -163613 -91124 -151888 -253903 -7848 142132 -133481 -163361 52245 -108848
9423 -197641 -340254 59333 -203499 364867 109885 -73916 -60012 -129466 -67323 -144693 162819
9411 -246809 240200 135641 -158752 -200071 -102847 -79726 158252 22676 -101501 238598
9400b66007d9014m8450n3886p8951d362j65678g8012j69336A8026c08703j51142
9389d59845i7925A50841A8792b10053B68381a57328j01160A21651A0934K9983
9379D0917a7990r0106b4969B59228r8228i8410C7273J75762e6639m3041N905A15326
9366a55054j56989L9921g1382H2719D0665A9408g7359j09399B07907l8918a75753
9354A91665n115b16783o2520a26580A15308j5461b95421M7665b6676n8337n569
9343i0582l83656B80374G2605M2395k7866N395b12970k19847b04986q6414a32362
9331H9812A1146M2137a86484A10831B9946a6991k06366g1162n5837k4917A46005
9319a03444E3847R7072d8558A79306c6136k55575A42025J09190a21587J0919j48834
$$ plain form
9400 -266007 -49014 -97464 -151350 -230301 -4362 -170040 -78012 -247348 18026 -308703 -459845
9389 -459845 -97925 150841 18792 -210053 268381 -157328 -258488 121651 10934 40917
9379 40917 -17990 -108096 -24969 259228 161000 -98410 37273 213035 -56639 -99680 -93775 115326
9366 -155054 -312043 -272122 -71382 82719 40665 19408 -77359 -186758 207907 168989 -175753
9354 191665 186550 -216783 -279303 -126580 115308 99847 -295421 -247756 -26676 -85013 -90582
9343 -90582 -474238 280374 72605 115000 87134 92529 -212970 -432817 -204986 -291400 -132362
9331 89812 11146 53283 -186484 110831 29946 -16991 -223357 -71162 -126999 -151916 146005
9319 -103444 53847 150919 -48558 179306 -36136 -291711 142025 251215 -121587 -110668 -259502
9308b59502I5119m6680a93327g8428j07503h1978Q297j12555g6942A657b15821
9296c06586e6675q5859k58137i4444A47606a48932C8432K0901a23696m621B42786
9284e6968j86893a11313p1569C8386c64411j2341c8503p6448j68007a13841A97870
9272b27294G5000f5112C5748b45800q025e6099j02824B43933a69108J5021C79818
9260C43989A54515a04288k38867J59093h5933A74108n8112O3477q3734a33324
9249a14218q4946d2677r7716k48449e1887m824A96254n819D543a60015B27195
9237b4244A04714a70118A29677a70096m0472L063J1402N9112A27158E4902b13375
9225a51321B91918b84410i8882J4636k9715A4088M837d1395o5216k25619a47496
$$ plain form
9308 -259502 95119 48439 -193327 -78428 -185931 -81978 -73681 -186236 -76942 1657 -215821
9296 -306586 -56675 -142534 -400671 -94444 147606 -148932 38432 59333 -123696 -128317 242786
9284 -56968 -243861 -111313 -182882 38386 -364411 -376752 -38503 -114951 -282958 -113841 197870
9272 -227294 75000 -65112 35748 -245800 -253825 -56099 -158923 243933 -169108 -154087 379818
9260 343989 154515 -104288 -343155 -184062 -85933 174108 115996 179473 95739 -133324
9249 -114218 -199164 -42677 -140393 -388842 -51887 -56711 196254 190435 4543 -160015 227195
9237 -24244 104714 -170118 129677 -170096 -210568 -207505 -196103 -136991 127158 54902 -213375
9225 -151321 291918 -284410 -98882 -84246 -113961 14088 18925 -41395 -106611 -332230 -147496
9213F0142g6263b3851k40958d8166C9260a72492C06602c11799O243A4595J21483
9202A36078B7554b7934k1642k25576B54652I2068K41659a41124A19575a80240
9191C9292g57806L61712g2470I9573c23533a27669B04738A1662c918B4911K47457
9180B72368a35261B2131n247b10694E2271a09942B4671b16180A46831b55652A27340
9168C8671b55926a13727e0462A77983c0118j21872B52143G7251h2306j14620A14590
9156i7669d1776o6354C49375a95297i7429j17411P1299K9407A37428b92196a32174
9144d3497A64541c80350B3920h5898I1156B0409J1039c06803a25814J39i509A73244
9131A45731J09833I4204b64125J5893G2185a97061b3905j16105j38079H559e3934
$$ plain form
9213 60142 -76263 -23851 -264809 -48166 39260 -172492 306602 -311799 -305556 14595 136078
9202 136078 27554 -27934 -49576 -275152 254652 92068 333727 -141124 119575 -180240
9191 39292 -757806 -396094 -72470 99573 -323533 -127669 204738 11662 -3918 24911 272368
9180 272368 -135261 22131 16884 -210694 52271 -109942 24671 -216180 146831 -255652 127340
9168 38671 -255926 -113727 -50462 177983 -30118 -151990 252143 77251 -82306 -196926 114590
9156 -97669 -41776 -108130 349375 -195297 -97429 -214840 -143541 -114134 137428 -292196 -132174
9144 -43497 164541 -380350 23920 -85898 91156 20409 31448 -306803 -125814 -125675 -9509 173244
9131 145731 255564 94204 -264125 -248232 72185 -197061 -23905 -140010 -278089 8559 -53934
9119A15519b93819A10954k8602a16717G1868k2141F924L06099a94978R3358r9649
9108b01269h2745l68381A0208a5842A09200d5563j33990n828a5993A41824i723
9096d7649j02837j80940b876C9899K6553b13627O3815J2211g596H4568d1999a8383
9083a82617B12823b42017g1203j63882O087a8212k690I7991c59693a23672L5676
9072h7996m1345G7718B7268N8136k1036f5397A03175b959A6271O4909a10776n4099
9060a64875q9377J20274A67262c2980B08617e8331A31912b3751l25371B70828
9049B12522d65788f0714A18588c4146m3365K1950A21462c71504A54800l6599d8934
9037d7659o8389c7419m6027C0340Q6028a97379K992p8328b0809n3282A44682b89878
$$ plain form
9119 115519 -293819 110954 82352 -116717 71868 49727 6924 313023 -194978 -101620 -201269
9108 -201269 -82745 -451126 10208 -15842 109200 -45563 -179553 -185381 -15993 141824 -9723
9096 -47649 -150486 -331426 -2876 39899 66452 -213627 -149812 -137601 -7596 84568 -41999 -18383
9083 -182617 212823 -242017 -71203 -235085 -228998 -18212 -20902 97991 -359693 -123672 -87996
9072 -87996 -129341 77718 27268 85404 64368 -65397 103175 -2959 16271 81180 -110776 -164875
9060 -164875 -254252 -133978 167262 -32980 208617 -58331 131912 -23751 -349122 270828
9049 212522 -465788 -60714 118588 -34146 -77511 -55561 121462 -371504 154800 118201 -48934
9037 -47659 -116048 -37419 -83446 30340 116368 -197379 -194387 -272715 -20809 -74091 144682 -289878
9024a20938b5751k17167E0481a7049n5180D1603c78660d1886A27324a61567A3481
9012H2712b83913B42162b51352a18809d0473o7104j1183j47034f5495k63219a63004
9000C0376a31827G0003O5311b25273R8098G922L8129a52265b3208j92681f5823
8988g2122A65877F6813h6729m6154N8155g928G1880a33761b3190A05022P7845
8977A82867o3582J3421i6628A679a81139c6915p9960A06544a64561M6435j95437
8966c13563M9214a2943k02875I3961M6193c18223E1941b58242k03921a74343l6062
8955b10405A78556b77039j87202a74385D1440Q6028a71279g5411p3363M7749B21641
8943i5026a26k14311H5978Q9124e33971a82224Q1867d5713a5524A54734O2996
$$ plain form
9024 -120938 -25751 -242918 50481 -17049 -72229 41603 -378660 -41886 127324 -161567 13481
9012 82712 -283913 242162 -251352 -118809 -40473 -107577 -118760 -265794 -65495 -328714 -163004
9000 30376 -131827 70003 135314 -225273 -127175 7922 46051 -152265 -23208 -215889 -65823
8988 -72122 165877 66813 -86729 -132883 -74728 -7928 71880 -133761 -23190 105022 182867
8977 182867 119285 132706 -96628 1679 -181139 -36915 -116875 106544 -164561 -118126 -313563
8966 -313563 -264349 -12943 -215818 93961 140154 -318223 51941 -258242 -462163 -174343 -210405
8955 -210405 178556 -277039 -464241 -174385 41440 127468 -171279 -75411 -148774 -101025 221641
8943 -95026 -126 -214437 85978 175102 -533971 -182224 -100357 -45713 -15524 154734 217730
8932B17730K20837D1060K30851H8559a74237C18473r3867C8422j4038J92711K23027
8921D40122R18332J997403R482405o387457A885756F03582k27732j71937a838
8911A28184C6922b11815B31782B479g6453I1810J08319a1414k72923R0180l1522
8900b25679L3760a4793j42696o2925G1922p309K8220L9410c4784k81154B51578
8888b01811B67973J6225A09707n1685f4775A1780c928j54089F1688a89429I7818
$$ plain form
8932 217730 438567 41060 271911 88559 -174237 318473 224606 38422 24384 217095 440122
8921 440122 1358454 3355857 12838262 6450805 1885756 603582 375850 203913 -1838
8911 128184 36922 -211815 231782 2479 -76453 91810 200129 -11414 -284337 -194157 -225679
8900 -225679 -191919 -14793 -157489 -220414 71922 64613 92833 132243 -34784 -315938 251578
8888 -201811 267973 284198 109707 58022 -64775 11780 -3928 -158017 61688 -189429 97818
$$ [...]
##END NTUPLES=NMR SPECTRUM
##END=
