
##TITLE=AC1068_TOPL01_6519229_qYJ3gEzVqc
##JCAMPDX= 6.0         $$ Bruker NMR JCAMP-DX V2.0
##DATA TYPE= NMR SPECTRUM
##DATA CLASS= NTUPLES
##ORIGIN= BRUKER
##OWNER= Administrator
$$ 1.72 TOPSPIN		Version 2.1
$$ 2012-07-13 16:21:17.046 -0500  Administrator@TOPSPIN
$$ Compression mode = diff/dup
##.OBSERVE FREQUENCY= 400.02188249412
##.OBSERVE NUCLEUS= ^1H
##.ACQUISITION MODE= SIMULTANEOUS (DQD)
##.ACQUISITION SCHEME= undefined
##.AVERAGES= 64
##.DIGITISER RES= 22
##SPECTROMETER/DATA SYSTEM= spect
##.PULSE SEQUENCE= noesygpps1d.comp
##.SOLVENT NAME= COFFEE_meoh
##.SHIFT REFERENCE= INTERNAL, COFFEE_meoh, 1, 14.96256
##AUDIT TRAIL= $$ (NUMBER, WHEN, WHO, WHERE, PROCESS, VERSION, WHAT)
$$ ##TITLE= Audit trail, TOPSPIN		Version 2.1
$$ ##JCAMPDX= 5.01
$$ ##ORIGIN= Bruker BioSpin GmbH
$$ ##OWNER= Administrator
$$ $$ C:\Bruker\TOPSPIN/data/COFFEE/nmr/AC1068_TOPL01_6519229_qYJ3gEzVqc/22/pdata/1/auditp.txt
$$ ##AUDIT TRAIL=  $$ (NUMBER, WHEN, WHO, WHERE, PROCESS, VERSION, WHAT)
(   1,<2012-07-13 16:21:11.250 -0500>,<Administrator>,<TOPSPIN>,<go>,<TOPSPIN 2.1>,
      <created by zg
	started at 2012-07-13 16:09:40.390 -0500,
	POWCHK enabled, PULCHK disabled,
       configuration hash MD5:
       6B 1B 68 BB D9 2E 58 E2 7F 35 AD 54 07 DF 0E 41
       data hash MD5: 64K
       74 82 43 8D 8F 2C 1B 97 D9 AB 2A FF 6E B8 AC 72>)
(   2,<2012-07-13 16:21:14.562 -0500>,<Administrator>,<TOPSPIN>,<proc1d>,<TOPSPIN 2.1>,
      <Start of raw data processing
       efp LB = 0.3 FT_mod = 6 PKNL = 1 PHC0 = 0 PHC1 = 0 SI = 128K 
       data hash MD5: 128K
       F8 26 E5 AE 84 AC BA 9A B7 5E 6F 93 88 79 0E D2>)
(   3,<2012-07-13 16:21:15.796 -0500>,<Administrator>,<TOPSPIN>,<proc1d>,<TOPSPIN 2.1>,
      <pk PHC0 = 2.730103 PHC1 = 0 
       data hash MD5: 128K
       87 0E DF 31 67 71 12 25 01 0E 49 C4 FE 84 93 2A>)
(   4,<2012-07-13 16:21:16.421 -0500>,<Administrator>,<TOPSPIN>,<proc1d>,<TOPSPIN 2.1>,
      <abs ABSG = 1 
       data hash MD5: 128K
       2A 66 55 18 80 D8 4E E9 29 F5 4B 22 8A 57 63 8E>)
(   5,<2012-07-13 16:21:16.500 -0500>,<Administrator>,<TOPSPIN>,<proc1d>,<TOPSPIN 2.1>,
      <abs ABSG = 2 
       data hash MD5: 128K
       EA 1E A5 DB 55 72 08 BB E8 ED 2D DA B6 54 B5 DB>)
(   6,<2012-07-13 16:21:16.781 -0500>,<Administrator>,<TOPSPIN>,<proc1d>,<TOPSPIN 2.1>,
      <abs ABSG = 3 
       data hash MD5: 128K
       51 73 6C 54 09 68 CE 5A D0 90 50 11 BA AC 78 AA>)
(   7,<2012-07-13 16:21:16.906 -0500>,<Administrator>,<TOPSPIN>,<proc1d>,<TOPSPIN 2.1>,
      <abs ABSG = 4 
       data hash MD5: 128K
       4F 0E 51 54 03 8A 48 6B D8 F9 35 F9 05 D0 19 26>)
(   8,<2012-07-13 16:21:16.953 -0500>,<Administrator>,<TOPSPIN>,<proc1d>,<TOPSPIN 2.1>,
      <abs ABSG = 5 
       data hash MD5: 128K
       CA 9E 4A 6A 25 0B 3D 60 C5 40 5A 68 FA 7B 48 AB>)
$$ ##END=
$$ 
$$ $$ hash MD5
$$ $$ 0E 86 0B 91 7F 5C 7C 9C FB 9B 0A EB E3 C7 5D 65
##$RELAX= 
##$RELAX= 
##$RELAX= 
##$RELAX= 
##$RELAX= 
##$RELAX= 
##$RELAX= 
##$RELAX= 
##$RELAX= 
$$ Bruker specific parameters
$$ [...]
##$TP07= 0
##$TPNAME0= <>
##$TPNAME1= <>
##$TPNAME2= <>
##$TPNAME3= <>
##$TPNAME4= <>
##$TPNAME5= <>
##$TPNAME6= <>
##$TPNAME7= <>
##$TPOAL= (0..7)
0.5 0.5 0.5 0.5 0.5 0.5 0.5 0.5
##$TPOFFS= (0..7)
0 0 0 0 0 0 0 0
##$TUNHIN= 0
##$TUNHOUT= 0
##$TUNXOUT= 0
##$USERA1= <user>
##$USERA2= <user>
##$USERA3= <user>
##$USERA4= <user>
##$USERA5= <user>
##$V9= 5
##$VALIST= <valist>
##$VCLIST= <CCCCCCCCCCCCCCC>
##$VD= 0
##$VDLIST= <DDDDDDDDDDDDDDD>
##$VPLIST= <PPPPPPPPPPPPPPP>
##$VTLIST= <TTTTTTTTTTTTTTT>
##$WBST= 2048
##$WBSW= 25
##$XGAIN= (0..3)
0 0 0 0
##$XL= 0
##$YL= 0
##$YMAX_a= 17539206
##$YMIN_a= -10463357
##$ZGOPTNS= <>
##$ZL1= 120
##$ZL2= 120
##$ZL3= 120
##$ZL4= 120
##$ABSF1= 14.96256
##$ABSF2= -5.595622
##$ABSG= 5
##$ABSL= 3
##$ALPHA= 0
##$AQORDER= 0
##$ASSFAC= 0
##$ASSFACI= 0
##$ASSFACX= 0
##$ASSWID= 0
##$AUNMP= <proc_prof1d_extract.lims>
##$AXLEFT= 0
##$AXNAME= <>
##$AXNUC= <1H>
##$AXRIGHT= 0
##$AXTYPE= 0
##$AXUNIT= <>
##$AZFE= 0.1
##$AZFW= 0.1
##$BCFW= 0
##$BC_mod= 0
##$BYTORDP= 0
##$COROFFS= 0
##$CY= 15
##$DATMOD= 1
##$DC= 0
##$DFILT= <>
##$DTYPP= 0
##$F1P= 0
##$F2P= 0
##$FCOR= 0.5
##$FTSIZE= 131072
##$FT_mod= 6
##$GAMMA= 0
##$GB= 0
##$INTBC= 1
##$INTSCL= 1
##$ISEN= 128
##$LB= 0.3
##$LEV0= 0
##$LPBIN= 0
##$MAXI= 10000
##$MC2= 0
##$MEAN= 0
##$ME_mod= 0
##$MI= 0
##$NCOEF= 0
##$NC_proc= -2
##$NLEV= 6
##$NOISF1= 0
##$NOISF2= 0
##$NSP= 0
##$NTH_PI= 0
##$NZP= 0
##$OFFSET= 14.96256
##$PC= 1
##$PHC0= 2.730103
##$PHC1= 0
##$PH_mod= 1
##$PKNL= yes
##$PPARMOD= 0
##$PPDIAG= 0
##$PPIPTYP= 0
##$PPMPNUM= 2147483647
##$PPRESOL= 1
##$PSCAL= 4
##$PSIGN= 0
##$PYNMP= <proc.py>
##$REVERSE= no
##$SF= 400.020009014218
##$SI= 131072
##$SIGF1= 0
##$SIGF2= 0
##$SINO= 400
##$SIOLD= 131072
##$SPECTYP= <>
##$SREGLST= <1H.CDCl3>
##$SSB= 0
##$STSI= 131072
##$STSR= 0
##$SW_p= 8223.68421052631
##$SYMM= 0
##$S_DEV= 0
##$TDeff= 65536
##$TDoff= 0
##$TI= <>
##$TILT= no
##$TM1= 0
##$TM2= 0
##$TOPLEV= 0
##$USERP1= <user>
##$USERP2= <user>
##$USERP3= <user>
##$USERP4= <user>
##$USERP5= <user>
##$WDW= 1
##$XDIM= 131072
##$YMAX_p= 448744306
##$YMIN_p= -12168
##$CURPLOT= <Network HP LaserJet P1505>
##$CURPRIN= <$Network HP LaserJet P1505>
##$DFORMAT= <normdp>
##$LAYOUT= <+/1D_H.xwp>
##$LFORMAT= <normlp>
##$PFORMAT= <normpl>
##$SURQMSG= 1
$$ End of Bruker specific parameters
$$ ---------------------------------
##NTUPLES= NMR SPECTRUM
##VAR_NAME=  FREQUENCY,     SPECTRUM/REAL,   SPECTRUM/IMAG
##SYMBOL=    X,             R,               I
##VAR_TYPE=  INDEPENDENT,   DEPENDENT,       DEPENDENT
##VAR_FORM=  AFFN,          ASDF,            ASDF
##VAR_DIM=   131072,        131072,          131072
##UNITS=     HZ,            ARBITRARY UNITS, ARBITRARY UNITS
##FACTOR=    0.0627417313425164, 1,          1
##FIRST=     8223.62146879497, -2568,        -64558
##LAST=      0,             -329,            -66213
##MIN=       0,             -12168,          0
##MAX=       8223.62146879497, 448744306,    0
$$ Real data points
##PAGE= N=1
##DATA TABLE= (X++(R..R)), XYDATA
$$ [...]
$$ plain form
60947 11505979 9928664 8616052 7531954 6638759 5901670 5292222 4787594 4367576 4013579
60938 4013579 3709900 3444413 3208117 2994873 2801081 2624197 2461363 2310121 2170049
60929 2170049 2042406 1927946 1825815 1734485 1652474 1577751 1507485 1439274 1372295 1306948 1243915
60918 1243915 1183954 1127916 1076235 1028647 984904 945384 910420 879343 850908 824612 800992
60907 800992 780513 762676 746431 731192 717250 705337 695781 687977 680676 672932 664712 656601 649206
60894 649206 643000 638348 635239 633189 631863 631646 633189 636529 641102 646516 652785 659839 667356 675157
60880 675157 683269 691489 699340 706514 712934 718329 722306 725049 727369 729688 731348 731231 728753 724050
60866 724050 717629 710116 702034 693454 684184 674495 665314 657337 650278 643372 636370 629769 624339 620710
$$ packed form
60947A1505979j577315j312612j084098q93195p37089o09448n04628m20018l53997
60938D013579l03679k65487k36296k13244j93792j76884j62834j51242j40072
60929B170049j27643j14460j02131r1330q2011p4723p0266o8211o6979o5347o3033
60918A243915n9961n6038n1681m7588m3743l9520l4964l1077k8435k6296k3620
60907H00992k0479j7837j6245j5239j3942j1913r556p804p301p744q220q111p395
60894F49206o206m652l109k050j326k17J543L340M573N414O269P054P517P801
60880F75157Q112Q220P851P174O420N395L977K743K320K319J660j17k478m703
60866G24050o421p513q082q580r270r689r181p977p059o906p002o601n430l629
$$ plain form
60852 620710 619100 619111 620070 621881 625195 630476 637364 645448 655146 667101 681122 696506 713191 731545
60838 731545 750913 769319 785068 798098 809461 820110 830627 841580 853371 865787 878139
60827 878139 889805 900325 909080 915388 919097 920867 921655 922065 922364 922914 924248 926628 929797 933301 936707
60812 936707 939286 939876 937682 933072 926922 919246 909273 897053 884034 871402 858615 844378 828567
60799 828567 812316 796554 781541 767728 755918 746238 737765 729667 722195 716229 712292 710301 709870
60786 709870 710594 712423 715955 721935 730266 739949 750216 761154 772866 784605 795347 804904 813858
60773 813858 822599 830975 838801 846113 852896 859018 864633 870261 876272 882429 888164 893212 897904 902823
60759 902823 908192 913655 918774 923731 929310 936089 943851 951942 959988 968029 976134 984190 991933 998918
$$ packed form
60852F20710j610J1R59J811L314N281O888Q084R698J1955J4021J5384J6685J8354
60838G31545J9368J8406J5749J3030J1363J0649J0517J0953J1791J2416J2352
60827H78139J1666J0520Q755O308L709J770P88M10K99N50J334K380L169L504L406
60812I36707K579N90k194m610o150p676r973j2220j3019j2632j2787j4237j5811
60799H28567j6251j5762j5013j3813j1810r680q473q098p472n966l937j991m31
60786G09870P24J829L532N980Q331R683J0267J0938J1712J1739J0742R557Q954
60773H13858Q741Q376P826P312O783O122N615N628O011O157N735N048M692M919
60759I02823N369N463N119M957N579O779P762Q091Q046Q041Q105Q056P743O985
$$ plain form
60745 998918 1004584 1008774 1012195 1015915 1020177 1024008 1026200 1026506 1025613 1024192 1022294 1019598 1015901 1011291 1006139
60730 1006139 1001025 996345 991701 985856 977748 967664 957184 947793 939647 931772 923289 914290 905575
60717 905575 897775 890795 884006 876904 869584 862581 856248 850322 844131 837149 829323 820943 812295 803466
60703 803466 794457 785457 776998 769793 764466 761414 760799 762492 766104 771291 778034 786406 795990 805691
60689 805691 814256 820882 825361 827819 828348 826684 822237 814623 804149 791529 777175 761184 744046
60676 744046 726843 710541 695434 681507 668873 657554 647304 638075 630343 624565 620675 618479
60664 618479 618083 619397 621685 624279 627397 631456 635818 639143 640908 641780 642451 643037 643739 645119 647290
60649 647290 649620 651770 654389 658221 662939 667383 670581 672149 672204 671489 671263 672398 674651 677270 680220
$$ packed form
60745I98918N666M190L421L720M262L831K192L06q93j421j898k696l697m610n152
60730A006139n114m680m644n845q108j0084j0480r391q146p875q483q999q715
60717I05575p800o980o789p102p320p003o333n926o191o982p826q380q648q829
60703H03466r009r000q459p205n327l052o15J693L612N187O743Q372R584R701
60689H05691Q565O626M479K458N29j664m447p614j0474j2620j4354j5991j7138
60676G44046j7203j6302j5107j3927j2634j1319j0250r229p732n778l890k196
60664F18479l96J314K288K594L118M059M362L325J765Q72O71N86P02J380K171
60649F47290K330K150K619L832M718M444L198J568N5p15k26J135K253K619K950
$$ plain form
60634 680220 684363 690477 698474 707580 717012 726544 736655 748069 761006 775022 789723 805290 822022
60621 822022 839671 857653 875736 893961 911925 928630 943269 955815 966694 976034 983324 987721
60609 987721 988673 986435 982011 976500 970443 963846 956685 949138 941369 933343 924972 916261 907106 896982
60595 896982 885053 870874 855116 839420 825231 812785 801456 791046 782321 776140 772524 770875
60583 770875 770716 771761 773568 775706 778157 780973 783567 784970 784965 784441 784326 784633 784919 785302 786555 789288
60567 789288 793409 798262 803006 806969 810032 812661 815203 817168 817538 815842 812555 808347 803359 797495
60553 797495 791056 784660 778758 773631 769794 767847 767849 769193 771361 774586 779610 787049 797190 810214
60539 810214 826374 846093 870125 899456 934547 974438 1016732 1058537 1097323 1130863 1156713
$$ packed form
60634F80220M143O114P997R106R432R532J0111J1414J2937J4016J4701J5567J6732
60621H22022J7649J7982J8083J8225J7964J6705J4639J2546J0879R340P290M397
60609I87721R52k238m424n511o057o597p161p547p769q026q371q711r155j0124
60595H96982j1929j4179j5758j5696j4189j2446j1329j0410q725o181l616j649
60583G70875j59J045J807K138K451K816K594J403nn24j15L07K86L83J253K733
60567G89288M121M853M744L963L063K629K542J965L70j696l287m208m988n864
60553G97495o439o396n902n127l837j947KJ344K168L225N024P439J0141J3024
60539H10214J6160J9719K4032K9331L5091L9891M2294M1805L8786L3540K5850
$$ plain form
60528 1156713 1172386 1176364 1168867 1151539 1126561 1096331 1063687 1031644 1002420 976971 955782 939749
60516 939749 929813 925986 927392 933192 942815 955255 968944 982708 996352 1009972 1023277 1036125
60504 1036125 1049323 1064345 1082407 1104197 1130278 1161336 1198199 1242039 1294461 1357114 1431404
60493 1431404 1518910 1621822 1742448 1882364 2042374 2223252 2426327 2653652 2908099 3192927
60483 3192927 3510116 3857798 4227922 4604867 4965640 5282449 5527472 5677696 5717982 5642846
60473 5642846 5457944 5180142 4834426 4448611 4048847 3657044 3289186 2954319 2655452
60464 2655452 2392166 2162669 1964191 1792966 1645071 1517267 1406867 1311213 1227757 1154491
60454 1154491 1090014 1033219 983095 938737 899496 865072 835244 809281 785846 763828 743100
$$ packed form
60528A156713J5673L978p497j7328k4978l0230l2644l2043k9224k5449k1189j6033
60516I39749r936l827J406N800R623J2440J3689J3764J3644J3620J3305J2848
60504A036125J3198J5022J8062K1790K6081L1058L6863M3840N2422O2653P4290
60493A431404Q7506J02912J20626J39916J60010J80878K03075K27325K54447K84828
60483C192927L17189L47682L70124L76945L60773L16809K45023J50224M0286p5136
60473E642846j84902k77802l45716l85815l99764l91803l67858l34867k98867
60464B655452k63286k29497j98478j71225j47895j27804j10400r5654q3456p3266
60454A154491o4477n6795n0124m4358l9241l4424k9828k5963k3435k2018k0728
$$ plain form
60443 743100 724153 707267 692439 679678 668622 658155 647248 636102 625600 615761 605735 595425
60431 595425 585960 578201 571762 566050 561368 558289 556594 555490 554420 553088 551246 549073 547403 546982
60417 546982 547743 549181 551137 553816 557377 561826 566941 572053 576353 579721 582754 585760 588372 590535
60403 590535 593097 596796 601286 605845 610455 615397 620372 624963 629652 635371 642098 648720 654330 659032
60389 659032 663444 667971 672631 677139 681074 684244 686777 688678 689616 689424 688436 686919 684676 681748 678941
60374 678941 676882 674978 672218 668835 666172 664922 664417 663862 663439 663818 665132 666862 668458 669857 671523
60359 671523 673986 677110 680015 682070 683845 686549 690672 695678 700970 706527 712542 719056 726142 733937
60345 733937 742249 750546 758610 766831 775528 784136 791359 796166 798585 799516 799681 798812 796101 791497 786237
$$ packed form
60443G43100j8947j6886j4828j2761j1056j0467j0907j1146j0502r839j0026j0310
60431E95425r465p759o439n712m682l079j695j104j070j332j842k173j670m21
60417E46982P61J438J956K679L561M449N115N112M300L368L033L006K612K163
60403E90535K562L699M490M559M610M942M975M591M689N719O727O622N610M702
60389F59032M412M527M660M508L935L170K533J901R38j92r88j517k243k928k807
60374F78941k059j904k760l383k663j250n05n55m23L79J314J730J596J399J666
60359F71523K463L124K905K055J775K704M123N006N292N557O015O514P086P795
60345G33937Q312Q297Q064Q221Q697Q608P223M807K419R31J65q69k711m604n260
$$ plain form
60330 786237 781928 779502 779259 781413 786020 792768 801377 811924 824107 836425 846811 854071 858114
60317 858114 858921 856067 849466 839954 828928 817780 807727 799593 793412 788463 783885 779153 774161 769219
60303 769219 764925 761648 759150 757029 755400 754718 755041 755928 757084 758641 760818 763656 767117 771053 775095
60288 775095 778866 782285 785440 788405 791489 795315 800056 804885 808758 811550 813805 815655 816730 817018
60274 817018 817051 817347 818411 821098 826027 832534 839140 845216 851443 858616 866984 876943 889249 904033
60260 904033 920451 937864 956700 977740 1001270 1027359 1056242 1087954 1122353 1160033 1202390
60249 1202390 1250144 1302630 1359371 1421563 1490929 1567627 1650436 1738782 1833421 1935070 2043323
60238 2043323 2157144 2275571 2397463 2520992 2643724 2763028 2876336 2981363 3076257 3159484
$$ packed form
60330G86237m309k426k43K154M607O748Q609J0547J2183J2318J0386P260M043
60317H58114Q07k854o601r512j1026j1148j0053q134o181m949m578m732m992m942
60303G69219m294l277k498k121j629o82L23Q87J156J557K177K838L461L936M042
60288G75095L771L419L155K965L084L826M741M829L873K792K255J850J075K88
60274H17018L3K96J064K687M929O507O606O076O227P173Q368R959J2306J4784
60260I04033J6418J7413J8836K1040K3530K6089K8883L1712L4399L7680M2357
60249A202390M7754N2486N6741O2192O9366P6698Q2809Q8346R4639J01649J08253
60238B043323J13821J18427J21892J23529J22732J19304J13308J05027R4894Q3227
$$ plain form
60228 3159484 3229655 3285698 3327091 3353706 3365565 3363038 3347149 3319389 3281361 3234995 3182938
60217 3182938 3128266 3073674 3021229 2972911 2930921 2897300 2873450 2860179 2858049 2867573 2889307 2923909
60205 2923909 2972014 3033938 3109551 3198478 3300266 3414083 3538115 3669236 3803373 3936289
60195 3936289 4064116 4183330 4290566 4382735 4457390 4512912 4548401 4563460 4557989 4532082 4486283
60184 4486283 4422001 4341601 4248027 4144628 4035491 3925371 3818640 3718387 3626924 3546879
60174 3546879 3481001 3430860 3396490 3377563 3374426 3387796 3418035 3465055 3528328 3606360 3696268
60163 3696268 3794142 3895632 3996068 4090663 4175361 4247523 4305589 4348243 4374317 4383397 4376180
60152 4376180 4354227 4319714 4275426 4224647 4170764 4116955 4066306 4022159 3988176 3967726 3962993
$$ packed form
60228C159484P0171N6043M1393K6615J1859k527j5889k7760l8028m6366n2057
60217C182938n4672n4592n2445m8318m1990l3621k3850j3271k130R524K1734L4602
60205B923909M8105O1924P5613Q8927J01788J13817J24032J31121J34137J32916
60195C936289J27827J19214J07236R2169P4655N5522L5489J5059n471k5907m5799
60184D486283o4282q0400r3574j03399j09137j10120j06731j00253r1463q0045
60174C546879o5878n0141l4370j8927l137J3370L0239M7020O3273P8032Q9908
60163C696268R7874J01490J00436R4595Q4698P2162N8066M2654K6074R080p217
60152D376180k1953l4513m4288n0779n3883n3809n0649m4147l3983k0450m733
$$ plain form
60141 3962993 3974760 4003286 4049365 4114349 4199474 4305656 4434041 4586286 4764052 4968458
60131 4968458 5200179 5459676 5746988 6061315 6400880 6763043 7144332 7540286 7945242
60122 7945242 8352255 8753449 9140752 9506445 9843224 10144320 10404002 10617738 10781500
60113 10781500 10891202 10943322 10935856 10868205 10740594 10554644 10314632 10027504 9701658 9346445
60103 9346445 8972677 8592284 8216516 7854619 7514156 7201521 6921558 6677328 6470864
60094 6470864 6303713 6176391 6088035 6037305 6023209 6044458 6098318 6180578 6286247 6409788
60084 6409788 6545080 6685763 6825420 6957181 7073688 7168331 7236663 7276605 7287911 7271856
60074 7271856 7230734 7166666 7080889 6974573 6849853 6709352 6555025 6388324 6211420 6027560
$$ packed form
60141C962993J1767K8526M6079O4984Q5125J06182J28385J52245J77766K04406
60131D968458K31721K59497K87312L14327L39565L62163L81289L95954M04956
60122G945242M07013M01194L87303L65693L36779L01096K59682K13736J63762
60113A0781500J09702N2120p466o7651j27611j85950k40012k87128l25846l55213
60103I346445l73768l80393l75768l61897l40463l12635k79963k44230k06464
60094F470864j67151j27322q8356n0730j4096K1249N3860Q2260J05669J23541
60084F409788J35292J40683J39657J31761J16507R4643O8332L9942J1306j6055
60074G271856m1122o4068q5777j06316j24720j40501j54327j66701j76904j83860
$$ plain form
60064 6027560 5840248 5652771 5468521 5290963 5122973 4966624 4823717 4696034 4584812
60055 4584812 4490449 4413116 4353482 4312638 4291366 4289695 4307186 4343604 4399158 4473787 4566160
60044 4566160 4673647 4793398 4923064 5060089 5200498 5338742 5468684 5584686 5682221 5758019
60034 5758019 5809715 5835261 5832939 5802219 5744324 5661541 5556205 5430763 5288734 5135088 4975500
60023 4975500 4815293 4658880 4509773 4370933 4245075 4134436 4040114 3961960 3899411 3852372
60013 3852372 3821249 3806444 3808159 3826532 3861811 3914647 3986275 4077945 4189860 4321033 4470350
60002 4470350 4637092 4819749 5014676 5216494 5419459 5617782 5804982 5974082 6119032
59993 6119032 6235862 6322634 6378687 6403796 6397483 6358963 6288057 6186275 6057006 5904929 5735611
$$ packed form
60064F027560j87312j87477j84250j77558j67990j56349j42907j27683j11222
60055D584812r4363p7333n9634m0844k1272j671J7491L6418N5554P4629R2373
60044D566160J07487J19751J29666J37025J40409J38244J29942J16002R7535P5798
60034E758019N1696K5546k322l0720n7895q2783j05336j25442j42029j53646j59588
60023D975500j60207j56413j49107j38840j25858j10639r4322p8154o2549m7039
60013C852372l1123j4805J715J8373L5279N2836P1628R1670J11915J31173J49317
60002D470350J66742J82657J94927K01818K02965J98323J87200J69100J44950
59993F119032J16830Q6772N6053K5109o313l8520p0906j01782j29269j52077j69318
$$ plain form
59982 5735611 5555327 5370623 5187752 5012492 4850076 4704754 4579339 4475414 4393786 4334584
59972 4334584 4297297 4281300 4286263 4311747 4356679 4419598 4499069 4593313 4699687 4815113 4936870
59961 4936870 5062374 5188394 5311180 5427365 5534141 5628728 5708590 5772549 5821178 5855828
59951 5855828 5877619 5887544 5887095 5878549 5864992 5850289 5838870 5835325 5844238 5870116 5917043 5988363
59939 5988363 6087087 6216680 6381142 6584174 6828385 7115082 7444310 7814782 8223728 8666564
59929 8666564 9136260 9622757 10112788 10589932 11034888 11426656 11744808 11971677 12093785
59920 12093785 12103413 12000714 11794374 11499085 11131706 10709560 10251013 9775203 9299667 8838107
59910 8838107 8400351 7993526 7622673 7290823 6999384 6748716 6538402 6367440 6234665
$$ packed form
59982E735611j80284j84704j82871j75260j62416j45322j25415j03925q1628n9202
59972D334584l7287j5997M963K5484M4932O2919P9471R4244J06374J15426J21757
59961D936870J25504J26020J22786J16185J06776R4587P9862O3959M8629L4650
59951E855828K1791R925m49q546j3557j4703j1419l545Q913K5878M6927P1320
59939E988363R8724J29593J64462K03032K44211K86697L29228L70472M08946M42836
59929H666564M69696M86497M90031M77144M44956L91768L18152K26869J22108
59920A2093785R628j02699k06340k95289l67379m22146m58547m75810m75536m61560
59910H838107m37756m06825l70853l31850k91439k50668k10314j70962j32775
$$ plain form
59901 6234665 6139162 6080309 6057589 6070330 6117436 6197410 6308763 6450017 6618760 6810684
59891 6810684 7019844 7239568 7462341 7678765 7877380 8045951 8172879 8247955 8263364 8215302
59881 8215302 8104740 7936299 7716486 7453132 7155819 6835684 6503968 6170417 5842670
59872 5842670 5526647 5227075 4947575 4690557 4457455 4249131 4065837 3906777 3770107
59863 3770107 3653653 3555433 3473457 3405450 3349047 3301901 3261349 3224448 3188775 3152841 3115470
59852 3115470 3075474 3032606 2988382 2945202 2904960 2869087 2839248 2816848 2801977 2793764 2791456 2793991
59840 2793991 2798545 2800780 2796971 2785145 2764273 2733739 2694185 2647862 2597407 2544874 2492290 2442242
59828 2442242 2397134 2358361 2326677 2302820 2287300 2280146 2281323 2290824 2307813 2330279 2356245 2384954
$$ packed form
59901F234665r5503n8853k2720J2741M7106P9974J11353J41254J68743J91924
59891F810684K09160K19724K22773K16424J98615J68571J26928P5076J5409m8062
59881H215302j10562j68441k19813k63354k97313l20135l31716l33551l27747
59872E842670l16023k99572k79500k57018k33102k08324j83294j59060j36670
59863C770107j16454r8220q1976o8007n6403m7146m0552l6901l5673l5934l7371
59852C115470l9996m2868m4224m3180m0242l5873k9839k2400j4871q213k308K535
59840B793991M554K235l809j1826k0872l0534l9554m6323n0455n2533n2584n0048
59828B442242m5108l8773l1684k3857j5520p154J177R501J6989K2466K5966K8709
$$ plain form
59816 2384954 2416556 2451310 2489850 2533708 2584627 2643367 2709455 2781498 2856875 2931482 3000870
59805 3000870 3062050 3113868 3155805 3187086 3207075 3216048 3215372 3207234 3194267 3179061 3163758 3150139
59793 3150139 3140019 3135365 3137998 3149366 3170617 3202833 3247258 3305383 3378848 3469273 3578472
59782 3578472 3708872 3863527 4045614 4258161 4504398 4787965 5112153 5478362 5884401
59773 5884401 6322688 6778226 7227092 7637081 7971834 8198248 8294753 8256726 8096518 7838665
59763 7838665 7513311 7150470 6776190 6410715 6068405 5758494 5485759 5251137 5052968
59754 5052968 4888617 4755381 4650496 4571136 4514841 4479736 4464229 4466786 4486096 4521285 4571890
59743 4571890 4637830 4719334 4816690 4930175 5060397 5208417 5375101 5560685 5765664 5991945
$$ packed form
59816B384954L1602L4754L8540M3858N0919N8740O6088P2043P5377P4607O9388
59805C000870O1180N1818M1937L1281J9989Q973o76q138j2967j5206j5303j3619
59793C150139j0120m654K633J1368K1251L2216M4425N8125P3465R0425J09199
59782C578472J30400J54655J82087K12547K46237K83567L24188L66209M06039
59773E884401M38287M55538M48866M09989L34753K26414R6505l8027j60208k57853
59763G838665l25354l62841l74280l65475l42310l09911k72735k34622j98169
59754E052968j64351j33236j04885p9360n6295l5105j5507K557J9310L5189N0605
59743D571890O5940Q1504R7356J13485J30222J48020J66684J85584K04979K26281
$$ plain form
59733 5991945 6242396 6519338 6824326 7159436 7527812 7932576 8375922 8859528 9384846
59724 9384846 9952089 10559072 11201243 11871983 12562060 13259063 13948241 14614542 15244623
59715 15244623 15828564 16361481 16844664 17285696 17697485 18096327 18499189 18921403 19375924
59706 19375924 19873318 20420518 21018479 21661089 22336066 23025912 23707982 24355486 24940668
59697 24940668 25438321 25827667 26093503 26228013 26232265 26115807 25895042 25591866 25232044 24842431
59687 24842431 24448270 24072400 23735506 23455412 23245766 23116160 23073872 23125329 23276478 23533011
59677 23533011 23900727 24385148 24990248 25717456 26565174 27527648 28592533 29738211 30932196
59668 30932196 32130817 33280014 34317686 35178333 35799890 36131545 36140781 35818149 35178994
$$ packed form
59733E991945K50451K76942L04988L35110L68376M04764M43346M83606N25318
59724I384846N67243O06983O42171O70740O90077O97003O89178O66301O30081
59715A5244623N83941N32917M83183M41032M11789L98842M02862M22214M54521
59706A9375924M97394N47200N97961O42610O74977O89846O82070O47504N85182
59697B4940668M97653L89346K65836J34510M252j16458k20765l03176l59822l89613
59687B4842431l94161l75870l36894k80094k09646j29606m2288N1457J51149K56533
59677B3533011L67716M84421O05100P27208Q47718R62474J064885J145678J193985
59668C0932196J198621J149197J037672Q60647O21557L31655R236l22632o39155
$$ plain form
59659 35178994 34261580 33121465 31823345 30433125 29012479 27615494 26285844 25054577
59651 25054577 23939985 22949024 22077707 21309775 20616370 19959468 19298634 18598787 17837015
59642 17837015 17006656 16116981 15188694 14247844 13320549 12428929 11588524 10808238 10092424
59633 10092424 9442556 8857100 8331453 7859703 7436796 7058819 6721915 6421871 6154670
59624 6154670 5916817 5705233 5517323 5350998 5204335 5075545 4963540 4867937 4787894 4721291
59614 4721291 4665393 4617722 4575760 4536585 4497665 4457458 4414286 4365181 4307035 4238760 4161398
59603 4161398 4076301 3984323 3886708 3785616 3683434 3582287 3484339 3391704 3305705 3226784 3155270
59592 3155270 3091717 3036426 2989350 2950594 2920416 2898576 2884291 2876935 2876190 2881405 2891506 2905824
$$ packed form
59659C5178994r17414j140115j298120j390220j420646j396985j329650j231267
59651B5054577j114592r90961q71317p67932o93405o56902o60834o99847p61772
59642A7837015q30359q89675r28287r40850r27295q91620q40405p80286p15814
59633A0092424o49868n85456n25647m71750m22907l77977l36904l00044k67201
59624F154670k37853k11584j87910j66325j46663j28790j12005r5603q0043o6603
59614D721291n5898m7671m1962l9175l8920m0207m3172m9105n8146o8275p7362
59603D161398q5097r1978r7615j01092j02182j01147r7948r2635q5999p8921p1514
59592C155270o3553n5291m7076l8756l0178k1840j4285p356p45N215J0101J4318
$$ plain form
59580 2905824 2924444 2947343 2973559 3001492 3029711 3057284 3083723 3108876 3132759 3155448 3177390
59569 3177390 3199733 3223951 3251152 3282133 3318043 3360469 3410790 3469880 3538448 3617172 3706423
59558 3706423 3806387 3917668 4041427 4178879 4331137 4499585 4685839 4891012 5115343 5358675
59548 5358675 5620738 5900601 6196163 6504492 6822330 7145915 7470601 7791200 8102797
59539 8102797 8401145 8682610 8944414 9185237 9405087 9603763 9779107 9927343 10045910
59530 10045910 10136277 10203835 10255375 10297208 10335486 10376959 10428415 10495593 10582828 10692716 10824715
59519 10824715 10973893 11131495 11286619 11427008 11539131 11609298 11625800 11580156 11466873 11283199
59509 11283199 11029757 10711074 10335216 9912934 9456766 8979834 8494506 8011748 7541239
$$ packed form
59580B905824J8620K2899K6216K7933K8219K7573K6439K5153K3883K2689K1942
59569C177390K2343K4218K7201L0981L5910M2426N0321N9090O8568P8724Q9251
59558C706423R9964J11281J23759J37452J52258J68448J86254K05173K24331K43332
59548E358675K62063K79863K95562L08329L17838L23585L24686L20599L11597
59539H102797K98348K81465K61804K40823K19850J98676J75344J48236J18567
59530A0045910R0367O7558N1540M1833L8278M1473N1456O7178Q7235J09888J31999
59519A0824715J49178J57602J55124J40389J12123P0167J6502m5644j13283j83674
59509A1283199k53442l18683l75858m22282m56168m76932m85328m82758m70509
$$ plain form
59500 7541239 7091366 6668734 6277714 5920437 5597091 5306542 5047348 4818435 4618696
59491 4618696 4446127 4297852 4171108 4063959 3975146 3903689 3848788 3809791 3786097 3777209 3782963
59480 3782963 3803612 3839678 3891681 3959814 4043935 4144211 4261810 4398461 4555197 4732081
59470 4732081 4929290 5147573 5386938 5645442 5919778 6206274 6500240 6794689 7080575
59461 7080575 7347976 7586307 7784178 7930846 8018509 8042923 8002446 7897994 7734190 7519221
59451 7519221 7262784 6974455 6663805 6340612 6013906 5691020 5377626 5077955 4794637
59442 4794637 4529025 4282201 4055320 3848770 3661669 3492621 3340529 3204345 3082609
59433 3082609 2973789 2876875 2791345 2716732 2652413 2597573 2551244 2512600 2481220 2456736 2438281
$$ packed form
59500G541239m49873m22632l91020l57277l23346k90549k59194k28913j99739
59491D618696j72569j48275j26744j07149q8813p1457n4901l8997k3694q888N754
59480C782963K0649L6066N2003O8133Q4121J00276J17599J36651J56736J76884
59470D732081J97209K18283K39365K58504K74336K86496K93966K94449K85886
59461G080575K67401K38331J97871J46668Q7663K4414m0477j04452j63804k14969
59451G519221k56437k88329l10650l23193l26706l22886l13394k99671k83318
59442D794637k65612k46824k26881k06550j87101j69048j52092j36184j21736
59433C082609j08820r6914q5530p4613o4319n4840m6329l8644l1380k4484j8455
$$ plain form
59422 2438281 2424735 2415566 2410993 2411276 2416238 2425462 2438422 2454402 2472883 2494255 2519824 2550952
59410 2550952 2588171 2630523 2674936 2716563 2751096 2777556 2798741 2819087 2842566 2872319 2911015
59399 2911015 2960922 3023882 3101132 3192244 3294095 3401938 3512469 3626021 3746129 3877872
59389 3877872 4026657 4197328 4393450 4617679 4873091 5163603 5492810 5863070 6276070
59380 6276070 6733459 7235966 7781893 8366469 8981853 9617007 10257938 10889056 11495043
59371 11495043 12062333 12580286 13042263 13445992 13792800 14086412 14331991 14535215 14701251
59362 14701251 14833927 14935125 15004049 15036976 15028393 14972826 14865684 14703302 14483964 14209922
59352 14209922 13888289 13529879 13147464 12754412 12362821 11981175 11613370 11259597 10917221
$$ packed form
59422B438281j3546r169m573K83M962R224J2960J5980J8481K1372K5569L1128
59410B550952L7219M2352M4413M1627L4533K6460K1185K0346K3479K9753L8696
59399B911015M9907O2960P7250R1112J01851J07843J10531J13552J20108J31743
59389C877872J48785J70671J96122K24229K55412K90512L29207L70260M13000
59380F276070M57389N02507N45927N84576O15384O35154O40931O31118O05987
59371A1495043N67290N17953M61977M03729L46808K93612K45579K03224J66036
59362A4701251J32676J01198O8924L2927q583n5567j07142j62382k19338k74042
59352A4209922l21633l58410l82415l93052l91591l81646l67805l53773l42376
$$ plain form
59343 10917221 10580779 10242894 9896972 9539358 9168963 8785983 8392051 7991179 7589395
59334 7589395 7193223 6808581 6440466 6092702 5767868 5467690 5193266 4944638 4720639
59325 4720639 4519733 4340815 4182953 4044844 3925013 3822212 3735177 3662329 3602244 3554204
59315 3554204 3517892 3492768 3478029 3472907 3476668 3488680 3508825 3537526 3575042 3621024 3675051 3737217
59303 3737217 3807914 3887390 3975820 4073289 4179190 4291845 4408981 4528266 4647274 4763543
59293 4763543 4875008 4979875 5075725 5159436 5228709 5283420 5325093 5355569 5376715 5390969 5401343
59282 5401343 5410942 5422931 5440798 5468102 5507844 5562099 5631925 5717329 5817438 5930715 6054703
59271 6054703 6185542 6318116 6446437 6563215 6659311 6725186 6754075 6743865 6696234 6615221
$$ packed form
59343A0917221l36442l37885l45922l57614l70395l82980l93932m00872m01784
59334G589395l96172l84642l68115l47764l24834l00178k74424k48628k23999
59325D720639k00906j78918j57862j38109j19831j02801q7035p2848o0085m8040
59315C554204l6312k5124j4739n122L761J2012K0145K8701L7516M5982N4027O2166
59303C737217P0697P9476Q8430R7469J05901J12655J17136J19285J19008J16269
59293D763543J11465J04867R5850Q3711O9273N4711M1673L0476K1146J4254J0374
59282E401343R599J1989J7867K7304L9742N4255O9826Q5404J00109J13277J23988
59271F054703J30839J32574J28321J16778R6096O5875K8889j0210m7631q1013
$$ plain form
59261 6615221 6506970 6379321 6240108 6095772 5951723 5813090 5684366 5569015 5470008 5389895
59251 5389895 5329616 5288146 5264314 5258224 5269842 5296965 5335796 5383172 5437105 5495643 5556452
59240 5556452 5617376 5676467 5731833 5782669 5830319 5877362 5926016 5978587 6039291 6114154 6208835
59229 6208835 6327489 6473745 6651595 6864797 7116022 7406450 7734921 8096823 8484035
59220 8484035 8885655 9287778 9672816 10020860 10313076 10533922 10670756 10713229 10654658 10493930
59210 10493930 10235817 9890011 9470301 8993762 8479191 7945210 7408864 6884668 6383749
59201 6383749 5913569 5478547 5080943 4721336 4398843 4111451 3856350 3630199 3429585
59192 3429585 3251581 3093863 2954327 2830767 2720960 2622857 2534740 2455337 2383748 2319098
$$ packed form
59261F615221j08251j27649j39213j44336j44049j38633j28724j15351r9007q0113
59251E389895o0279m1470k3832o090J1618K7123L8831M7376N3933N8538O0809
59240E556452O0924N9091N5366N0836M7650M7043M8654N2571O0704P4863R4681
59229F208835J18654J46256J77850K13202K51225K90428L28471L61902L87212
59220H484035M01620M02123L85038L48044K92216K20846J36834M2473n8571j60728
59210A0493930k58113l45806m19710m76539n14571n33981n36346n24196n00919
59201F383749m70180m35022l97604l59607l22493k87392k55101k26151k00614
59192C429585j78004j57718j39536j23560j09807r8103q8117p9403p1589o4650
$$ plain form
59182 2319098 2260371 2206768 2158016 2114074 2074688 2039480 2008249 1980854 1957021 1936597 1919791
59171 1919791 1906744 1897100 1890427 1886905 1887148 1891487 1899877 1912345 1929011 1949725 1974218 2002584 2035200
59158 2035200 2072152 2113146 2157940 2206453 2258541 2314158 2373774 2438221 2508035 2583251 2663825
59147 2663825 2749868 2841449 2938506 3041032 3149058 3262277 3379669 3499416 3619101 3736271
59137 3736271 3848973 3955551 4053862 4141114 4214847 4273814 4317695 4346433 4360355 4360778 4350104
59126 4350104 4331445 4308347 4284452 4263044 4247033 4239426 4243211 4260617 4293133 4342541 4411054 4499850
59114 4499850 4608378 4735906 4882983 5050395 5237435 5442464 5664552 5902839 6154019
59105 6154019 6411467 6666768 6910881 7133717 7324189 7472033 7569900 7614122 7604604 7544696
$$ packed form
59182B319098n8727n3603m8752m3942l9386l5208l1231k7395k3833k0424j6806
59171A919791j3047r644o673l522K43M339Q390J2468J6666K0714K4493K8366L2616
59158B035200L6952M0994M4794M8513N2088N5617N9616O4447O9814P5216Q0574
59147B663825Q6043R1581R7057J02526J08026J13219J17392J19747J19685J17170
59137C736271J12702J06578R8311Q7252P3733N8967M3881K8738J3922M23j0674
59126D350104j8659k3098k3895k1408j6011p607L785J7406L2516M9408O8513Q8796
59114D499850J08528J27528J47077J67412J87040K05029K22088K38287K51180
59105F154019K57448K55301K44113K22836J90472J47844R7867M4222r518n9908
$$ plain form
59095 7544696 7440879 7302142 7139132 6962733 6781995 6602829 6428625 6261519 6102535
59086 6102535 5951226 5806361 5666758 5530603 5394499 5254757 5109719 4959660 4804466
59077 4804466 4643000 4475147 4303008 4129240 3955307 3782149 3611505 3445445 3285137
59068 3285137 3131006 2983788 2844598 2714224 2592946 2480854 2377776 2282956 2195369 2114317
59058 2114317 2039557 1970946 1908198 1850814 1798034 1748990 1703054 1659979 1619690 1582078 1546926
59047 1546926 1513768 1481926 1451066 1421724 1395051 1372010 1353019 1338016 1326444 1317400 1310358 1305610
59035 1305610 1303449 1303149 1303400 1303665 1304446 1306380 1309934 1315955 1325494 1338671 1354385 1371413 1389211 1407324
59021 1407324 1424627 1439520 1450578 1456945 1458671 1456847 1452963 1447955 1442319 1436998 1433400 1432332 1433662
$$ packed form
59095G544696j03817j38737j63010j76399j80738j79166j74204j67106j58984
59086F102535j51309j44865j39603j36155j36104j39742j45038j50059j55194
59077D804466j61466j67853j72139j73768j73933j73158j70644j66060j60308
59068C285137j54131j47218j39190j30374j21278j12092j03078r4820q7587q1052
59058B114317p4760o8611o2748n7384n2780m9044m5936m3075m0289l7612l5152
59047A546926l3158l1842l0860k9342k6673k3041j8991j5003j1572r044p042m748
59035A305610k161l00K51K65P81J934L554O021R539J3177J5714J7028J7798J8113
59021A407324J7303J4893J1058O367J726j824l884n008n636n321l598j068J330
$$ plain form
59008 1433662 1437272 1443566 1452684 1463911 1476371 1489702 1503426 1516115 1525881 1531654 1533643 1532632 1529124
58995 1529124 1523128 1514651 1504395 1493874 1484591 1477112 1471192 1466634 1463629 1462404 1463044 1465589 1469838 1475139
58981 1475139 1480944 1487557 1495745 1505650 1516714 1528681 1541900 1556470 1571853 1587651 1604202 1622105
58969 1622105 1641630 1662904 1686232 1711923 1740097 1770782 1803812 1838499 1873820 1909030 1943816
58958 1943816 1977963 2011477 2045033 2079626 2115588 2152494 2190223 2229510 2271237 2315728 2363072
58947 2363072 2413747 2468616 2528579 2594335 2666172 2743928 2827539 2917660 3015407 3121566 3236442
58936 3236442 3360350 3493738 3636980 3790736 3956561 4136501 4332032 4544044 4774044
58927 4774044 5024802 5299597 5601240 5931962 6293875 6689469 7121929 7594807 8111052
$$ packed form
59008A433662L610O294R118J1227J2460J3331J3724J2689R766N773J989j011l508
58995A529124n996q477j0256j0521r283p479n920m558l005j225O40K545M249N301
58981A475139N805O613Q188R905J1064J1967J3219J4570J5383J5798J6551J7903
58969A622105J9525K1274K3328K5691K8174L0685L3030L4687L5321L5210L4786
58958A943816L4147L3514L3556L4593L5962L6906L7729L9287M1727M4491M7344
58947B363072N0675N4869N9963O5756P1837P7756Q3611R0121R7747J06159J14876
58936C236442J23908J33388J43242J53756J65825J79940J95531K12012K30000
58927D774044K50758K74795L01643L30722L61913L95594M32460M72878N16245
$$ plain form
58918 8111052 8672552 9280899 9937898 10644334 11398243 12194682 13026237 13882138 14746627
58909 14746627 15598906 16414512 17166118 17824059 18358775 18744859 18963980 19006089 18870483
58900 18870483 18566572 18112300 17530693 16847457 16089977 15285392 14457717 13626755 12809131
58891 12809131 12018530 11264454 10552343 9885802 9267840 8699725 8180210 7706800 7276844
58882 7276844 6887005 6533065 6211215 5918593 5652103 5407949 5183035 4975574 4783531
58873 4783531 4603987 4435148 4277734 4132995 4000277 3877803 3764891 3661840 3568179 3482488
58863 3482488 3403692 3331397 3265128 3204254 3148526 3097927 3052227 3011418 2976213 2947337 2924591
58852 2924591 2907205 2894790 2887373 2884984 2887875 2896703 2911795 2932633 2958772 2990855 3030054 3076894
$$ packed form
58918H111052N61500O08347O56999P06436P53909P96439Q31555Q55901Q64489
58909A4746627Q52279Q15606P51606O57941N34716L86084K19121M2109j35606
58900A8870483l03911m54272n81607o83236p57480q04585q27675q30962q17624
58891A2809131p90601p54076p12111o66541o17962n68115n19515m73410m29956
58882G276844l89839l53940l21850k92622k66490k44154k24914k07461j92043
58873D783531j79544j68839j57414j44739j32718j22474j12912j03051r3661q5691
58863C482488p8796p2295o6269o0874n5728n0599m5700m0809l5205k8876k2746
58852B924591j7386j2415p417k389K891Q828J5092K0838K6139L2083L9199M6840
$$ plain form
58840 3076894 3131258 3193146 3262712 3339870 3424555 3517165 3618243 3728037 3846810 3975217
58830 3975217 4113973 4263563 4424745 4598962 4787894 4993079 5216287 5459684 5725368
58821 5725368 6015417 6332759 6681197 7064134 7484113 7944072 8447980 8999307 9599447
58812 9599447 10248158 10944442 11685691 12466160 13276494 14103527 14929142 15729724 16477938
58803 16477938 17145419 17704263 18128203 18395281 18491202 18411089 18159530 17749907 17202824 16543363
58793 16543363 15798514 14995782 14161765 13319779 12488243 11681194 10909446 10180549 9498539
58784 9498539 8864820 8279232 7740185 7244942 6790834 6375740 5996866 5650077 5331479
58775 5331479 5039034 4771703 4527557 4303539 4096425 3903232 3721462 3549982 3389148
$$ packed form
58840C076894N4364O1888O9566P7158Q4685R2610J01078J09794J18773J28407
58830C975217J38756J49590J61182J74217J88932K05185K23208K43397K65684
58821E725368K90049L17342L48438L82937M19979M59959N03908N51327O00140
58812I599447O48711O96284P41249P80469Q10334Q27033Q25615Q00582P48214
58803A6477938O67481N58844M23940K67078R5921q0113k51559m09623n47083o59461
58793A6543363p44849q02732q34017q41986q31536q07049p71748p28897o82010
58784I498539o33719n85588n39047m95243m54108m15094l78874l46789l18598
58775E331479k92445k67331k44146k24018k07114j93193j81770j71480j60834
$$ plain form
58766 3389148 3239215 3099214 2968064 2845871 2733085 2629216 2533481 2445998 2367082 2295934
58756 2295934 2231245 2172657 2120557 2074856 2034974 2000539 1971059 1945449 1922866 1903529 1887747
58745 1887747 1874775 1863645 1854386 1847274 1841570 1836271 1831420 1827209 1822231 1814045 1801245 1783922 1762677
58732 1762677 1738483 1712968 1687354 1661360 1634382 1607249 1581447 1557003 1532618 1507568 1482005
58721 1482005 1455712 1428138 1399471 1370233 1340029 1308283 1276034 1245340 1216856 1189553 1162876
58710 1162876 1137562 1114215 1092638 1072913 1055599 1040412 1026071 1011952 998738 987108 976914
58699 976914 967960 960311 953357 945709 936697 927156 918360 910904 904837 900011 895992 892446 889833 888961
58685 888961 889753 891285 893032 895123 897261 898396 897691 894982 890209 883441 875662 868590 863343 859992 858470
$$ packed form
58766C389148j49933j40001j31150j22193j12786j03869r5735q7483p8916p1148
58756B295934o4689n8588n2100m5701l9882l4435k9480k5610k2583j9337j5782
58745A887747j2972j1130r259p112n704n299m851m211m978q186j2800j7323k1245
58732A762677k4194k5515k5614k5994k6978k7133k5802k4444k4385k5050k5563
58721A482005k6293k7574k8667k9238l0204l1746l2249l0694k8484k7303k6677
58710A162876k5314k3347k1577j9725j7314j5187j4341j4119j3214j1630j0194
58699I76914q954p649o954p648r012r541q796p456o067m826m019l546k613q72
58685H88961P92J532J747K091K138J135p05k709m773o768p779p072n247l351j522
$$ plain form
58670 858470 858970 861185 864063 866737 869110 871384 873665 876183 879283 883000 887067 891228 895026 897476
58656 897476 897670 895584 891708 886168 878942 870645 862298 854541 847786 842768 840071 839498 840875 845128 853533
58641 853533 866223 882390 901539 923471 947502 973003 1000526 1031132 1064829 1100858 1139346
58630 1139346 1181478 1228206 1279977 1337450 1401233 1471148 1547175 1630993 1725272 1831488 1949744
58619 1949744 2080602 2225758 2387040 2566028 2764412 2983066 3220518 3473356 3737661
58610 3737661 4008291 4276678 4530887 4758055 4945823 5082440 5158493 5169983 5118970 5011381
58600 5011381 4855604 4662733 4445463 4215189 3980751 3749566 3527823 3318953 3123634
58591 3123634 2942111 2775249 2622987 2483562 2355248 2237729 2131107 2034831 1948321 1871636
$$ packed form
58670H58470N00K215K878K674K373K274K281K518L100L717M067M161L798K450
58656H97476J94k086l876n540p226q297q347p757o755n018k697n73J377M253Q405
58641H53533J2690J6167J9149K1932K4031K5501K7523L0606L3697L6029L8488
58630A139346M2132M6728N1771N7473O3783O9915P6027Q3818R4279J06216J18256
58619A949744J30858J45156J61282J78988J98384K18654K37452K52838K64305
58610C737661K70630K68387K54209K27168J87768J36617P6053J1490n1013j07589
58600E011381j55777j92871k17270k30274k34438k31185k21743k08870j95319
58591C123634j81523j66862j52262j39425j28314j17519j06622r6276q6510p6685
$$ plain form
58581 1871636 1804915 1748004 1700750 1662551 1631480 1605106 1582361 1563437 1547845 1534177 1521847
58570 1521847 1511368 1502633 1494686 1487556 1482430 1479411 1476850 1473550 1469816 1465457 1458525 1447123 1430934
58557 1430934 1409932 1383214 1350456 1313396 1274671 1236087 1198967 1165016 1135619 1110915 1090471
58546 1090471 1074156 1061718 1052279 1045020 1039670 1035832 1032622 1029472 1026507 1023649 1020127 1015200 1008634
58533 1008634 1000276 990027 978336 965833 952483 938162 923749 910232 896832 881735 864794
58522 864794 847783 831746 815951 799849 784202 769614 755736 742683 731553 722711 715085 707910
58510 707910 701729 696951 692956 689410 687051 686428 687200 689255 693014 698056 703062 707875 713983 722237 731619
58495 731619 740997 750491 760418 770630 781760 795304 811400 828049 843482 857739 871113 882823
$$ packed form
58581A871636o6721n6911m7254l8199l1071k6374k2745j8924j5592j3668j2330
58570A521847j0479q735p947p130n126l019k561l300l734m359o932j1402j6189
58557A430934k1002k6718l2758l7060l8725l8584l7120l3951k9397k4704k0444
58546A090471j6315j2438r439p259n350l838l210l150k965k858l522m927o566
58533A008634q358j0249j1691j2503j3350j4321j4413j3517j3400j5097j6941
58522H64794j7011j6037j5795j6102j5647j4588j3878j3053j1130q842p626p175
58510G07910o181m778l995l546k359o23P72K055L759N042N006M813O108Q254R382
58495G31619R378R494R927J0212J1130J3544J6096J6649J5433J4257J3374J1710
$$ plain form
58483 882823 892404 900751 908578 915269 920357 924658 928808 932096 933771 934174 933540 931114 926408 919974 912026
58468 912026 901755 888947 874715 859725 843292 825235 807073 790334 775098 761143 748979
58457 748979 738828 730143 722932 717972 714987 712474 710029 708790 708737 707878 705254 702511 701178 700731 700710
58442 700710 702372 706482 711761 717480 725473 737424 751965 766538 780508 794353 807305 817902
58430 817902 825669 830464 831476 828617 823733 818885 814657 811319 809965 811075 813643 817189 822876 831203
58416 831203 840592 849851 860026 872028 884499 895873 906481 916650 924901 930342 934868 940532 946485
58403 946485 950808 953612 955919 957125 956079 953173 949039 942626 932971 921415 909843 898244 886261
58390 886261 875474 867577 861790 856582 852563 851149 851696 852546 853763 856423 860283 864399 868947 874309
$$ packed form
58483H82823R581Q347P827O691N088M301M150L288J675M03o34k426m706o434p948
58468I12026j0271j2808j4232j4990j6433j8057j8162j6739j5236j3955j2164
58457G48979j0151q685p211m960k985k513k445j239n3q59k624k743j333m47k1
58442G00710J662M110N279N719P993J1951J4541J4573J3970J3845J2952J0597
58430H17902P767M795J012k859m884m848m228l338j354J110K568L546N687Q327
58416H31203R389R259J0175J2002J2471J1374J0608J0169Q251N441M526N664N953
58403I46485M323K804K307J206j046k906m134o413r655j1556j1572j1599j1983
58390H86261j0787p897n787n208m019j414N47Q50J217K660L860M116M548N362
$$ plain form
58376 874309 879529 883633 887083 890171 891685 891229 890972 892922 896391 900259 905526 913028 920921 927344 933591
58361 933591 941657 950642 958683 966521 975860 985995 995412 1005125 1017049 1030596 1044193 1058605 1075188
58348 1075188 1092199 1106366 1116960 1125089 1130353 1131740 1130631 1129348 1127725 1124340 1120023 1116871 1115031
58335 1115031 1113791 1114530 1119076 1126317 1133876 1141939 1152017 1163269 1173783 1184294 1196954 1211485 1226149
58322 1226149 1241318 1258382 1276248 1292769 1308630 1326147 1345303 1364652 1384952 1407920 1432342
58311 1432342 1455283 1476319 1496916 1516638 1533624 1547738 1559775 1568960 1574925 1580514 1588672 1598149
58299 1598149 1606329 1614504 1625955 1640541 1655866 1672250 1691717 1713438 1734988 1756871 1781128 1806837
58287 1806837 1831784 1857077 1885231 1915241 1944613 1974703 2008713 2045952 2083489 2121910 2163960
$$ packed form
58376H74309N220M104L450L088J514m56k57J950L469L868N267P502P893O423O247
58361I33591Q066Q985Q041P838R339J0135R417R713J1924J3547J3597J4412J6583
58348A075188J7011J4167J0594Q129N264J387j109j283j623l385m317l152j840
58335A115031j240P39M546P241P559Q063J0078J1252J0514J0511J2660J4531J4664
58322A226149J5169J7064J7866J6521J5861J7517J9156J9349K0300K2968K4422
58311A432342K2941K1036K0597J9722J6986J4114J2037R185N965N589Q158R477
58299A598149Q180Q175J1451J4586J5325J6384J9467K1721K1550K1883K4257K5709
58287A806837K4947K5293K8154L0010K9372L0090L4010L7239L7537L8421M2050
$$ plain form
58276 2163960 2209154 2255533 2305135 2361603 2423715 2487269 2551682 2618378 2684294 2743901 2796654
58265 2796654 2845929 2891988 2932902 2971090 3011590 3054773 3097860 3142478 3193236 3249848 3308346
58254 3308346 3369135 3436077 3508461 3581999 3657030 3737609 3823368 3910642 4000879 4099222 4205403
58243 4205403 4314817 4427875 4549290 4679024 4813450 4954668 5108654 5274717 5446961
58234 5446961 5625617 5816410 6019341 6229272 6447329 6680334 6929210 7189654 7464071
58225 7464071 7760619 8080652 8419770 8780926 9173023 9596777 10046312 10525020 11045264
58216 11045264 11612375 12224407 12887890 13617534 14420137 15295951 16256392 17322794 18508472
58207 18508472 19822236 21290203 22954035 24849512 27011576 29501127 32401055 35784944
$$ packed form
58276B163960M5194M6379M9602N6468O2112O3554O4413O6696O5916N9607N2753
58265B796654M9275M6059M0914L8188M0500M3183M3087M4618N0758N6612N8498
58254C308346O0789O6942P2384P3538P5031Q0579Q5759Q7274R0237R8343J06181
58243D205403J09414J13058J21415J29734J34426J41218J53986J66063J72244
58234E446961J78656J90793K02931K09931K18057K33005K48876K60444K74417
58225G464071K96548L20033L39118L61156L92097M23754M49535M78708N20244
58216A1045264N67111O12032O63483P29644Q02603Q75814R60441J066402J185678
58207A8508472J313764J467967J663832J895477K162064K489551K899928L383889
$$ plain form
58199 35784944 39717915 44292383 49641066 55925577 63353980 72213414 82855283 95666820
58191 95666820 111119263 129855122 152706453 180679772 214926532 256325107 304232045
58184 304232045 354903191 401180458 434568472 448744306 442066108 417515429 380689065
58177 380689065 337573222 293178419 251026090 213132879 180300172 152551932 129503363
58170 129503363 110566964 95080326 82421400 72070043 63597072 56644263 50933263
58163 50933263 46266887 42500573 39518650 37238072 35615451 34638732 34319915 34706112
58155 34706112 35896742 38021816 41123046 44946279 48803677 51715513 52828114 51808276
58147 51808276 48910567 44732971 39924282 35024807 30415613 26306233 22761127 19764524
$$ packed form
58199C5784944L932971M574468N348683O284511P428403Q859434J0641869J2811537
58191I5666820J5452443J8735859K2851331K7973319L4246760M1398575M7906938
58184C04232045N0671146M6277267L3388014J4175834o678198k4550679l6826364
58177C80689065m3115843m4394803m2152329l7893211l2832707k7748240k3048569
58170A29503363j8936399j5486638j2658926j0351357q472971o952809n711000
58163E0933263m666376l766314k981923k280578j622621r76719l18817L86197
58155C4706112J190630K125074L101230L823233L857398K911836J112601j019838
58147E1808276k897709m177596m808689m899475m609194m109380l545106k996603
$$ plain form
58139 19764524 17271447 15216939 13519956 12107080 10927247 9939224 9101484 8383173
58131 8383173 7770101 7249727 6800858 6404426 6052139 5737025 5446256 5170068 4907838
58122 4907838 4659312 4419318 4186435 3967237 3766298 3580481 3407511 3251112 3113007
58113 3113007 2988663 2875486 2776410 2690628 2609296 2525440 2440493 2356951 2272806 2187961 2108050
58102 2108050 2036584 1970184 1906241 1848353 1799555 1756982 1718018 1685200 1660170 1638708 1616361
58091 1616361 1593348 1569709 1541475 1506295 1467621 1429050 1389581 1348421 1309104 1274416 1241926
58080 1241926 1208646 1175661 1144383 1112927 1080199 1049248 1022662 998669 975305 954204 936663
58069 936663 920118 902340 885356 871650 860058 848813 838995 831656 824991 817702 811778 808746 806308
$$ packed form
58139A9764524k493077k054508j696983j412876j179833r88023q37740p18311
58131H383173o13072n20374m48869l96432l52287l15114k90769k76188k62230
58122D907838k48526k39994k32883k19198k00939j85817j72970j56399j38105
58113C113007j24344j13177r9076q5782q1332q3856q4947q3542q4145q4845p9911
58102B108050p1466o6400o3943n7888m8798m2573l8964l2818k5030k1462k2347
58091A616361k3013k3639k8234l5180l8674l8571l9469m1160l9317l4688l2490
58080A241926l3280l2985l1278l1456l2728l0951k6586k3993k3364k1101j7541
58069I36663j6545j7778j6984j3706j1592j1245r818p339o665p289n924l032k438
$$ plain form
58056 806308 801660 795023 787254 777372 765241 753305 742778 731353 717407 703238 691408 681176
58044 681176 671270 662921 657299 653000 648814 645943 644939 643616 640721 638594 639532 642519 646075 651053
58030 651053 657830 663895 667242 669307 671796 673556 673457 673423 675525 678675 681091 683416 686550 688996 689251
58015 689251 688405 687652 685781 681950 678356 677061 676517 674252 670818 668040 665481 661713 657367 653982 651394
58000 651394 648778 646633 645370 643582 639960 635102 629387 621250 609814 597122 585396 574315 563391
57987 563391 554620 549937 548047 546599 545684 546451 548142 549309 550421 552576 555168 557333 560128 564785 570386
57972 570386 575619 581084 587363 592626 594840 594829 594512 593710 591329 588102 585295 582082 576969 570622 564683
57957 564683 559055 552980 547443 543690 540518 535894 530385 526310 524291 523187 522610 523018 524018 525009 526773
$$ packed form
58056H06308m648o637p769r882j2131j1936j0527j1425j3946j4169j1830j0232
58044F81176r906q349n622m299m186k871j004j323k895k127R38K987L556M978
58030F51053O777O065L347K065K489J760r9l4K102L150K416K325L134K446K55
58015F89251q46p53j871l831l594j295n44k265l434k778k559l768m346l385k588
58000F51394k616k145j263j788l622m858n715q137j1436j2692j1726j1081j0924
57987E63391q771m683j890j448r15P67J691J167J112K155K592K165K795M657N601
57972E70386N233N465O279N263K214j1l17q02k381l227k807l213n113o347n939
57957E64683n628o075n537l753l172m624n509m075k019j104n77M08J000R91J764
$$ plain form
57942 526773 530153 533913 536167 537111 538085 538767 537711 534997 532003 529032 525346 521027 516719 511944 505549
57927 505549 497406 488084 477611 466158 454990 445042 435612 426237 418599 414496 413090 412307 411894 412894
57913 412894 415241 418326 422980 430339 439425 448325 457217 467802 480187 492666 504276 515322 525666
57900 525666 534640 542433 549638 555730 559884 562826 565910 568742 569656 568189 565228 561125 555570 548966
57886 548966 542071 534691 526485 518539 512265 507253 502121 496942 492778 489360 485444 481190 478035 476305
57872 476305 475052 474133 474453 476122 478294 480998 485340 491714 499280 507233 515160 522278 527855 532327 536625
57857 536625 540601 543451 545329 547087 548736 549601 549658 549315 548340 546467 544523 543418 542534 540665 537954 535319
57841 535319 532647 529360 526130 524104 522917 521350 519438 517912 516092 512565 507756 503622 500750 497668
$$ packed form
57942E26773L380L760K254R44R74O82j056k714k994k971l686m319m308m775o395
57927E05549q143r322j0473j1453j1168r948r430r375p638m103j406p83m13J000
57913D12894K347L085M654P359R086Q900Q892J0585J2385J2479J1610J1046J0344
57900E25666Q974P793P205O092M154K942L084K832R14j467k961m103n555o604
57886E48966o895p380q206p946o274n012n132n179m164l418l916m254l155j730
57872D76305j253r19L20J669K172K704M342O374P566P953P927P118N577M472M298
57857E36625L976K850J878J758J649Q65N7l43r75j873j944j105q84j869k711k635
57841E35319k672l287l230k026j187j567j912j526j820l527m809m134k872l082
$$ plain form
57827 497668 493086 487009 479728 471524 463388 456305 449788 442665 435031 427832 420951 413629 406389 400454
57813 400454 395551 390437 385510 382574 381951 381966 381553 381224 381226 380890 380321 380761 382744 385700 389722 395853 404116
57796 404116 413126 422303 432691 444878 457611 469132 478547 485398 489315 490723 490783 490284 489585 489410
57782 489410 490183 490642 488876 484846 480121 475038 468225 459399 450507 443218 437090 431198 425954 422184 419720
57767 419720 417958 416822 416303 416023 415959 416721 418496 420556 422315 424012 425974 428028 430059 432320 434852
57752 434852 437383 439968 442991 446478 450215 454399 459266 464266 468742 473179 478586 484820 490823 496305
57738 496305 501799 507248 512162 517106 523359 530907 538341 544951 551387 558157 565065 572471 581445 592163
57724 592163 603407 613999 623565 631861 638767 645068 651805 658786 665234 671789 680139 690637 702245
$$ packed form
57827D97668m582o077p281q204q136p083o517p123p634p199o881p322p240n935
57813D00454m903n114m927k936o23J5m13l29Kl36n69M40J983K956M022O131Q263
57796D04116R010R177J0388J2187J2733J1521R415O851L917J408O0m99o99j75
57782D89410P73M59j766m030m725n083o813q826q892p289o128n892n244l770k464
57767D19720j762j136n19k80o4P62J775K060J759J697J962K054K031K261K532
57752D34852K531K585L023L487L737M184M867N000M476M437N407O234O003N482
57738D96305N494N449M914M944O253P548P434O610O436O770O908P406Q974J0718
57724E92163J1244J0592R566Q296O906O301O737O981O448O555Q350J0498J1608
$$ plain form
57711 702245 714982 730351 748911 769503 791519 815970 843454 872955 903644 936258 971836
57700 971836 1010575 1052808 1099662 1151847 1209218 1272285 1342812 1422232 1510820 1609129 1718785
57689 1718785 1841233 1977221 2128198 2296634 2484133 2690585 2915735 3159665 3420555
57680 3420555 3693190 3970144 4242514 4498583 4724122 4906381 5037667 5115145 5139773 5117460
57670 5117460 5060029 4982959 4901701 4828848 4770422 4720929 4662528 4572436 4433890 4242528 4005938
57659 4005938 3739718 3462615 3191659 2939059 2711956 2513375 2342834 2197648 2075150
57650 2075150 1973540 1890524 1822630 1766874 1721995 1687210 1661022 1642275 1631173 1627993 1631721
57639 1631721 1641059 1655880 1676724 1703910 1738155 1780966 1833268 1894618 1964998 2046278 2140627
$$ packed form
57711G02245J2737J5369J8560K0592K2016K4451K7484K9501L0689L2614L5578
57700I71836L8739M2233M6854N2185N7371O3067P0527P9420Q8588R8309J09656
57689A718785J22448J35988J50977J68436J87499K06452K25150K43930K60890
57680C420555K72635K76954K72370K56069K25539J82259J31286P7478K4628k2313
57670E117460n7431p7070q1258p2853n8426m9493n8401r0092j38546j91362k36590
57659D005938k66220k77103k70956k52600k27103j98581j70541j45186j22498
57650B075150j01610q3016o7894n5756m4879l4785k6188j8747j1102l180L728
57639A631721R338J4821K0844K7186L4245M2811N2302O1350P0380Q1280R4349
$$ plain form
57628 2140627 2248408 2368979 2502730 2650942 2814328 2992977 3186977 3395442 3614921
57619 3614921 3839398 4061024 4269890 4454048 4601495 4702514 4750321 4741201 4675708 4559201
57609 4559201 4400001 4207336 3991415 3763619 3534318 3310435 3095964 2893978 2706804
57600 2706804 2535050 2378237 2236191 2108715 1994346 1890916 1797226 1713122 1638213 1571555
57590 1571555 1512294 1459578 1412103 1368712 1329139 1293352 1260671 1230462 1203137 1179405 1158915
57579 1158915 1140650 1124175 1109547 1096460 1084604 1074372 1066157 1059354 1053125 1047743 1044025 1041791
57567 1041791 1040016 1038302 1037126 1036895 1037723 1039975 1044027 1049606 1056185 1063823 1072873 1083174 1094298 1106242
57553 1106242 1119164 1132871 1147352 1163243 1180920 1199745 1219196 1240183 1264188 1291651 1322381
$$ packed form
57628B140627J07781J20571J33751J48212J63386J78649J94000K08465K19479
57619C614921K24477K21626K08866J84158J47447J01019M7807r120o5493j16507
57609D559201j59200j92665k15921k27796k29301k23883k14471k01986j87174
57600B706804j71754j56813j42046j27476j14369j03430r3690q4104p4909o6658
57590A571555n9261n2716m7475m3391l9573l5787l2681l0209k7325k3732k0490
57579A158915j8265j6475j4628j3087j1856j0232q215o803o229n382l718k234
57567A041791j775j714j176k31Q28K252M052N579O579P638R050J0301J1124J1944
57553A106242J2922J3707J4481J5891J7677J8825J9451K0987K4005K7463L0730
$$ plain form
57542 1322381 1357105 1397329 1443820 1496393 1555100 1620670 1693884 1775461 1866475 1968048 2080690
57531 2080690 2204547 2340009 2487419 2646522 2816701 2996977 3184710 3374431 3558526
57522 3558526 3728561 3875512 3990034 4064261 4093606 4076689 4014810 3912715 3778798 3622769
57512 3622769 3453041 3276855 3101372 2932539 2773247 2624365 2487376 2364387 2255845
57503 2255845 2160098 2075457 2001197 1936502 1880043 1831100 1789865 1756206 1729141 1707834 1692119
57492 1692119 1681833 1676551 1676189 1681025 1690905 1705135 1723109 1744353 1768181 1794278 1823485 1856982
57480 1856982 1894798 1936181 1981397 2032104 2089826 2155021 2227692 2308020 2396406 2493849 2602285
57469 2602285 2723558 2857937 3004336 3161665 3328730 3502598 3677849 3847304 4002440
$$ packed form
57542A322381L4724M0224M6491N2573N8707O5570P3214Q1577R1014J01573J12642
57531B080690J23857J35462J47410J59103J70179J80276J87733J89721J84095
57522C558526J70035J46951J14522P4227K9345j6917o1879j02095j33917j56029
57512C622769j69728j76186j75483j68833j59292j48882j36989j22989j08542
57503B255845r5747q4641p4260o4695n6459m8943m1235l3659k7065k1307j5715
57492A692119j0286n282l62M836R880J4230J7974K1244K3828K6097K9207L3497
57480A856982L7816M1383M5216N0707N7722O5195P2671Q0328Q8386R7443J08436
57469B602285J21273J34379J46399J57329J67065J73868J75251J69455J55136
$$ plain form
57460 4002440 4133345 4229963 4284561 4293075 4254815 4172304 4051684 3901934 3732659 3552464
57450 3552464 3368842 3188205 3015318 2853101 2703208 2566577 2443572 2334136 2237794 2153295
57440 2153295 2078752 2012684 1954462 1903318 1857748 1816787 1781049 1751373 1727080 1706703 1689765
57429 1689765 1676381 1665665 1656127 1647404 1640035 1633812 1627929 1622651 1619078 1617137 1615435 1613309 1611517
57416 1611517 1610612 1610173 1610108 1611238 1614009 1617874 1622473 1628222 1635112 1642058 1648148 1653718 1659734 1666822 1675228
57401 1675228 1684906 1695307 1705791 1716426 1727689 1739453 1751154 1762899 1775286 1788204 1800957
57390 1800957 1813606 1826956 1841136 1855462 1869801 1884711 1900036 1914808 1928870 1943180 1958053
57379 1958053 1972471 1985738 1998529 2011789 2025822 2040915 2057471 2074772 2090934 2105019 2118184
$$ packed form
57460D002440J30905R6618N4598Q514l8260q2511j20620j49750j69275j80195
57450C552464j83622j80637j72887j62217j49893j36631j23005j09436r6342q4499
57440B153295p4543o6068n8222n1144m5570m0961l5738k9676k4293k0377j6938
57429A689765j3384j0716r538q723p369o223n883n278l573j941j702k126j792
57416A611517r05m39o5J130K771L865M599N749O890O946O090N570O016P088Q406
57401A675228R678J0401J0484J0635J1263J1764J1701J1745J2387J2918J2753
57390A800957J2649J3350J4180J4326J4339J4910J5325J4772J4062J4310J4873
57379A958053J4418J3267J2791J3260J4033J5093J6556J7301J6162J4085J3165
$$ plain form
57368 2118184 2132043 2146899 2162301 2178198 2194640 2211261 2227922 2245106 2262950 2280672 2297691
57357 2297691 2314512 2331770 2349146 2365968 2382214 2398338 2414694 2431691 2449763 2468662 2487500
57346 2487500 2506042 2525175 2545551 2566534 2587124 2607222 2627368 2647825 2668563 2689564 2710659
57335 2710659 2731524 2752262 2773502 2795667 2818615 2842081 2865724 2888746 2910459 2931429 2953077
57324 2953077 2975927 2999208 3022316 3045469 3068765 3091958 3115590 3140890 3167963 3195445 3222615
57313 3222615 3250351 3279182 3307905 3335336 3362227 3390116 3419333 3449359 3480247 3512338 3545286
57302 3545286 3578685 3613073 3649047 3685850 3722060 3757468 3793279 3830656 3869866 3910624 3952488
57291 3952488 3995162 4038954 4084622 4132338 4181348 4231118 4282114 4334883 4389131 4444402 4500916
$$ packed form
57368B118184J3859J4856J5402J5897J6442J6621J6661J7184J7844J7722J7019
57357B297691J6821J7258J7376J6822J6246J6124J6356J6997J8072J8899J8838
57346B487500J8542J9133K0376K0983K0590K0098K0146K0457K0738K1001K1095
57335B710659K0865K0738K1240K2165K2948K3466K3643K3022K1713K0970K1648
57324B953077K2850K3281K3108K3153K3296K3193K3632K5300K7073K7482K7170
57313C222615K7736K8831K8723K7431K6891K7889K9217L0026L0888L2091L2948
57302C545286L3399L4388L5974L6803L6210L5408L5811L7377L9210M0758M1864
57291C952488M2674M3792M5668M7716M9010M9770N0996N2769N4248N5271N6514
$$ plain form
57280 4500916 4558900 4617705 4676359 4734386 4791274 4845697 4896135 4941830 4982414 5017126 5045085
57269 5045085 5065946 5079693 5086438 5087067 5083474 5077459 5069923 5061665 5054176 5048823 5045904 5045241 5047072 5051589
57255 5051589 5058351 5067072 5078334 5092593 5109101 5126820 5145904 5167302 5191225 5216902 5243588 5271036
57243 5271036 5299226 5328247 5358172 5388595 5418735 5448382 5478093 5507980 5537116 5564756 5591315
57232 5591315 5617409 5642799 5667082 5690583 5713583 5735456 5755478 5773883 5791211 5807402 5822520
57221 5822520 5837580 5853550 5870224 5887201 5905245 5925407 5947310 5969614 5991832 6014582 6038378
57210 6038378 6063264 6089318 6116404 6143694 6170394 6196675 6223051 6249293 6274854 6299854 6324678
57199 6324678 6349042 6372449 6395005 6416738 6436733 6454189 6469948 6485705 6502041 6518378 6534542
$$ packed form
57280D500916N7984N8805N8654N8027N6888N4423N0438M5695M0584L4712K7959
57269E045085K0861J3747O745O29l593o015p536q258p489n353k919o63J831M517
57255E051589O762Q721J1262J4259J6508J7719J9084K1398K3923K5677K6686K7448
57243E271036K8190K9021K9925L0423L0140K9647K9711K9887K9136K7640K6559
57232E591315K6094K5390K4283K3501K3000K1873K0022J8405J7328J6191J5118
57221E822520J5060J5970J6674J6977J8044K0162K1903K2304K2218K2750K3796
57210F038378K4886K6054K7086K7290K6700K6281K6376K6242K5561K5000K4824
57199F324678K4364K3407K2556K1733J9995J7456J5759J5757J6336J6337J6164
$$ plain form
57188 6534542 6551110 6568401 6586282 6604834 6624136 6643563 6662298 6680345 6698103 6715269 6731208
57177 6731208 6746053 6760347 6773808 6785560 6795394 6803732 6810534 6815288 6817980 6819097 6818802 6816923 6813437
57164 6813437 6808139 6800324 6789781 6777633 6765070 6751672 6736106 6718002 6697838 6675351 6649441 6619535
57152 6619535 6585840 6548449 6507408 6463530 6418025 6371513 6324468 6278303 6234810 6194784 6158365
57141 6158365 6126319 6099572 6077726 6059479 6044482 6033509 6026823 6023565 6022602 6022775 6022380 6019665 6013836
57128 6013836 6004646 5991400 5973519 5951788 5927872 5902874 5877453 5852740 5829751 5808288 5787776
57117 5787776 5768731 5752165 5738277 5727205 5720232 5718480 5721160 5727068 5737322 5754865 5782105 5821225
57105 5821225 5876089 5951401 6050459 6176212 6334442 6534119 6785765 7102021 7498523 7990542
$$ packed form
57188F534542J6568J7291J7881J8552J9302J9427J8735J8047J7758J7166J5939
57177F731208J4845J4294J3461J1752R834Q338O802M754K692J117k95j879l486
57164F813437n298p815j0543j2148j2563j3398j5566j8104k0164k2487k5910k9906
57152F619535l3695l7391m1041m3878m5505m6512m7045m6165m3493m0026l6419
57141F158365l2046k6747k1846j8247j4997j0973o686l258r63J73l95k715n829
57128F013836r190j3246j7881k1731k3916k4998k5421k4713k2989k1463k0512
57117E787776j9045j6566j3888j1072o973j752K680N908J0254J7543K7240L9120
57105E821225N4864P5312R9058J25753J58230J99677K51646L16256L96502M92019
$$ plain form
57095 7990542 8589159 9304333 10151936 11154940 12338267 13725015 15334625 17177475 19249622
57086 19249622 21536383 24019230 26672697 29456846 32322634 35220778 38080987 40764724
57078 40764724 43053594 44720714 45641082 45843455 45463150 44649820 43505997 42078778 40380215
57069 40380215 38412150 36187367 33742526 31138799 28453548 25770263 23168981 20716591
57061 20716591 18459946 16425132 14620773 13041285 11670163 10484904 9461891 8578681
57053 8578681 7814490 7150830 6571763 6063136 5612350 5209457 4847437 4520493 4222849
57044 4222849 3949948 3699632 3470878 3261918 3070557 2895434 2735575 2589110 2453739
57035 2453739 2328385 2213328 2108732 2013931 1928135 1850870 1781527 1719256 1663532 1614215 1570812
$$ packed form
57095G990542N98617P15174Q47603J003004J183327J386748J609610J842850K072147
57086A9249622K286761K482847K653467K784149K865788K898144K860209K683737
57078D0764724K288870J667120R20368K02373l80305q13330j143823j427219j698563
57069D0380215j968065k224783k444841k603727k685251k683285k601282k452390
57061B0716591k256645k034814j804359j579488j371122j185259j023013q83210
57053H578681p64191o63660n79067n08627m50786m02893l62020l26944k97644
57044D222849k72901k50316k28754k08960j91361j75123j59859j46465j35371
57035B453739j25354j15057j04596r4801q5796p7265o9343o2271n5724m9317m3403
$$ plain form
57024 1570812 1532263 1497713 1467024 1440182 1416661 1395792 1377375 1361419 1347525 1335038 1323756
57013 1323756 1313981 1305926 1299716 1296070 1296392 1301889 1313078 1330415 1354840 1387508 1429821 1484302 1554774
57000 1554774 1645328 1760325 1905494 2084919 2291077 2496304 2658415 2740424 2728574 2634573
56990 2634573 2484455 2306273 2123445 1952191 1800898 1671883 1564772 1478690 1412078 1361776
56980 1361776 1322793 1288937 1254357 1215630 1172658 1127340 1081675 1037383 996368 960264 929589
56969 929589 904118 883879 869013 859018 853125 851310 854047 861199 872043 886349 904570 926988
56957 926988 953506 984142 1018445 1053843 1085335 1107477 1116705 1112159 1095341 1069529 1038892 1007335
56945 1007335 977742 951874 930381 912938 898935 888284 881355 878263 878694 882488 889935 901404
$$ packed form
57024A570812l8549l4550l0689k6842k3521k0869j8417j5956j3894j2487j1282
57013A323756r775q055o210l646L22N497J1189J7337K4425L2668M2313N4481P0472
57000A554774R0554J14997J45169J79425K06158K05227J62111Q2009j1850r4001
56990B634573j50118j78182j82828j71254j51293j29015j07111q6082o6612n0302
56980A361776l8983l3856l4580l8727m2972m5318m5665m4292m1015l6104l0675
56969I29589k5471k0239j4866r995n893j815K737P152J0844J4306J8221K2418
56957I26988K6518L0636L4303L5398L1492K2142R228m546j6818k5812l0637l1557
56945A007335k9593k5868k1493j7443j4003j0651o929l092M31L794P447J1469
$$ plain form
56933 901404 917151 937759 964437 998317 1038846 1082303 1121879 1149975 1161397 1154963 1132737 1098560
56921 1098560 1057264 1013830 971905 933095 898092 867891 843250 823597 807472 793901 782519
56910 782519 772740 763858 755939 749621 744904 741011 737585 735199 734342 734530 734778 734564 734090 733971 734847 737047
56894 737047 740489 745041 750841 758085 766833 777388 790587 807260 827673 851799 879424 908950
56882 908950 936385 956604 966042 963944 951585 931416 906888 881775 858764 838928 822619 810290
56870 810290 802264 798429 798586 802783 811114 823687 841104 864652 895854 936124 986958 1049720 1124091
56857 1124091 1205794 1285542 1350817 1390231 1397998 1375486 1329356 1268526 1202018 1137453 1079752
56846 1079752 1030969 991753 962712 944193 935703 936526 946634 966366 995852 1035672 1087624 1153960
$$ packed form
56933I01404J5747K0608K6678L3880M0529M3457L9576K8096J1422o434k2226l4177
56921A098560m1296m3434m1925l8810l5003l0201k4641j9653j6125j3571j1382
56910G82519r779q882p919o318m717l893l426k386q57J88K48k14m74j19Q76K200
56894G37047L442M552N800P244Q748J0555J3199J6673K0413K4126K7625K9526
56882I08950K7435K0219R438k098j2359k0169k4528k5113k3011j9836j6309j2329
56870H10290q026l835J57M197Q331J2573J7417K3548L1202M0270N0834O2762P4371
56857A124091Q1703P9748O5275L9414P767k2512m6130o0830o6508o4565n7701
56846A079752m8783l9216k9041j8519q490Q23J0108J9732K9486L9820N1952O6336
$$ plain form
56834 1153960 1236304 1335993 1453820 1586288 1720945 1837113 1913443 1936595 1905191 1828446
56824 1828446 1721859 1601830 1481240 1368146 1267263 1181279 1110721 1054187 1010103 978059
56814 978059 958193 950069 952954 966740 991919 1029060 1078976 1143153 1222711 1315643 1413963 1503233
56802 1503233 1566133 1589171 1568500 1510591 1427760 1332640 1235212 1142390 1058477 985705 924783
56791 924783 875283 836020 805844 784324 771342 766093 767192 774019 787415 808841 839291 878958
56779 878958 926643 978266 1026058 1060407 1073680 1063265 1031888 985522 930763 873255 817338
56768 817338 765893 720008 679281 643167 611989 586365 566010 549707 536231 524721 514442
56757 514442 504897 496172 488544 481898 476079 471535 468693 466784 464257 460494 456268 452387 448787 445192
$$ packed form
56834A153960Q2344R9689J17827J32468J34657J16168P6330K3152l1404p6745
56824A828446j06587j20029j20590j13094j00883q5984p0558n6534m4084l2044
56814I78059j9866q124K885J3786K5179L7141M9916O4177P9558R2932R8320Q9270
56802A503233O2900K3038k0671n7909q2831r5120r7428r2822q3913p2772o0922
56791I24783m9500l9263l0176k1520j2982n249J099O827J3396K1426L0450L9667
56779H78958M7685N1623M7792L4349J3273j0415l1377m6366n4759n7508n5917
56768H17338n1445m5885m0727l6114l1178k5624k0355j6303j3476j1510j0279
56757E14442r545q725p628o646n819m544k842j909k527l763m226l881l600l595
$$ plain form
56743 445192 441770 438703 435866 433350 431643 430783 429869 427943 425064 422187 420238 419440 419249 418789 417667
56728 417667 416371 415530 414968 414064 412875 412096 411921 411757 411249 410745 410481 410083 409277 408455 408147 408397 408911 409340
56710 409340 409273 408493 407394 406582 405948 404759 402764 400510 398460 396575 394940 393951 393562 393138 392415 391863 391767
56693 391767 391734 391521 391604 392438 393794 395263 396724 397908 398271 397888 397733 398441 399330 399279 398119 396567 395270
56676 395270 394438 393962 393348 391889 389414 386555 383946 381572 379209 377036 375419 374582 374795 376260 378433
56661 378433 380113 380757 381187 382447 384453 386256 387206 387282 386685 385688 384615 383565 382362 380973 379547 377827
56645 377827 375150 371403 367356 363661 360153 356611 353556 351607 350521 349545 348400 347333 346483 345670 344630
56630 344630 343112 341066 338910 337171 335604 333267 329773 325820 322092 318334 314034 309407 305034 301058
$$ packed form
56743D45192l422l067k837k516j707q60r14j926k879k877j949p98j91m60j122
56728D17667j296q41n62r04j189p79j75j64n08n04k64l98q06q22l08K50N14M29
56710D09340o7p80j099q12o34j189j995k254k050j885j635r89l89m24p23n52r6
56693C91767l3k13Q3Q34J356J469J461J184L63l83j55P08Q89n1j160j552j297
56676C95270q32m76o14j459k475k859k609k374k363k173j617q37K13J465K173
56661C78433J680O44M30J260K006J803R50P6n97r97j073j050j203j389j426j720
56645C77827k677l747m047l695l508l542l055j949j086r76j145j067q50q13j040
56630C44630j518k046k156j739j567k337l494l953l728l758m300m627m373l976
$$ plain form
56616 301058 297379 294264 292136 291003 290513 290319 290087 289636 289373 290067 291872 294087 296190 298412 300960 303410
56600 303410 305346 306832 307792 307770 306954 306598 307548 309066 309926 310064 310291 310954 311877 313096 314667 316020 316453
56583 316453 316114 315731 315582 315418 315163 315029 315072 315193 315408 315648 315674 315589 315997 317180 318644 320017 321770 324397
56565 324397 327513 330505 333540 337108 341050 344931 348963 353718 359159 364640 369538 373313 375485 376352
56551 376352 377238 379203 381876 384268 386182 387962 389358 389687 388815 387119 384746 381684 378198 374371 369692
56536 369692 363994 358345 354002 350844 347837 344589 341358 337954 333997 330107 327471 326184 325176 323893
56522 323893 322953 322893 323307 323522 323294 322541 321118 319168 317149 315365 313875 312753 311861 310511 308087 304962
56506 304962 302208 300439 299493 299028 298718 298060 296774 295292 294204 293330 292026 290232 288520 287269 286519 286379
$$ packed form
56616C01058l679l115k128j133m90j94k32m51k63O94J805K215K103K222K548K450
56600C03410J936J486R60k2q16l56R50J518Q60J38K27O63R23J219J571J353M33
56583C16453l39l83j49j64k55j34M3J21K15K40K6q5M08J183J464J373J753K627
56565C24397L116K992L035L568L942L881M032M755N441N481M898L775K172Q67
56551C76352Q86J965K673K392J914J780J396L29q72j696k373l062l486l827m679
56536C69692n698n649m343l158l007l248l231l404l957l890k636j287j008j283
56522C23893r40o0M14K15k28p53j423j950k019j784j490j122q92j350k424l125
56506C04962k754j769r46m65l10o58j286j482j088q74j304j794j712j251p50j40
$$ plain form
56490 286379 286836 287357 287483 287579 288222 289116 289547 289681 290342 291571 292459 292541 292477 293147 294774 297045 299462 301506
56472 301506 303045 304563 306558 308904 311250 313652 316200 318497 320331 322381 325317 328588 331105 332820
56458 332820 334555 336549 338280 339518 340472 341022 340892 340466 340384 340447 340015 339334 339309 340071 340989 341997 343664 345894
56440 345894 347873 349427 351163 352992 353828 353130 351729 350670 350130 349833 349622 349278 348487 347279 345887 344211
56424 344211 342086 339925 338170 336271 333259 329262 325399 322230 319483 317221 315930 315291 314134 311917
56410 311917 309116 305946 301873 296705 291038 285326 279609 274407 270689 268553 267012 265493 264539 264672 265585
56395 265585 266830 268315 269818 270957 271922 273281 274877 275959 276594 277780 279853 282001 283729 285656 288393
56380 288393 291682 295093 298510 301610 303920 305719 307797 310034 311435 311939 312832 314851 317162 318854 320142
$$ packed form
56490B86379M57N21J26R6O43Q94M31J34O61J229Q88Q2o4O70J627K271K417K044
56472C01506J539J518J995K346K346K402K548K297J834K050K936L271K517J715
56458C32820J735J994J731J238R54N50j30m26q2O3m32o81k5P62R18J008J667K230
56440C45894J979J554J736J829Q36o98j401j059n40k97k11l44p91j208j392j676
56424C44211k125k161j755j899l012l997l863l169k747k262j291o39j157k217
56410C11917k801l170m073n168n667n712n717n202l718k136j541j519r54J33R13
56395B65585J245J485J503J139R65J359J596J082O35J186K073K148J728J927K737
56380B88393L289L411L417L100K310J799K078K237J401N04Q93K019K311J692J288
$$ plain form
56365 320142 321330 321800 320977 319352 317752 316355 315188 314775 315560 317250 319288 321443 323640 325854 328344
56350 328344 331242 333885 335471 336301 337290 338356 338707 338741 339950 342650 345489 347715 350172 353427 356712
56335 356712 359624 363115 367601 371705 374187 375828 378069 381030 384241 388278 394108 401542 409614 417977
56321 417977 426814 435957 445111 454436 464067 473560 482509 491028 498985 505526 510048 512983 515064 516570
56307 516570 517740 518933 519831 519575 518252 517124 516778 516290 514987 513678 513227 513135 512636 512072 512143 512853 514253
56290 514253 517164 522075 528264 535053 542937 552478 563122 574209 586114 599263 613068 627039 642064
56277 642064 659346 678922 700301 723710 749589 777724 807995 841226 878239 918886 963035
56266 963035 1011668 1066066 1126751 1194070 1268861 1351722 1442839 1543399 1655701 1780720 1916948
$$ packed form
56365C20142J188M70q23j625j600j397j167m13P85J690K038K155K197K214K490
56350C28344K898K643J586Q30R89J066L51L4J209K700K839K226K457L255L285
56335C56712K912L491M486M104K482J641K241K961L211M037N830P434Q072Q363
56321D17977Q837R143R154R325R631R493Q949Q519P957O541M522K935K081J506
56307E16570J170J193Q98k56j323j128l46m88j303j309m51r2m99n64P1P10J400
56290E14253K911M911O189O789P884R541J0644J1087J1905J3149J3805J3971J5025
56277F42064J7282J9576K1379K3409K5879K8135L0271L3231L7013M0647M4149
56266I63035M8633N4398O0685O7319P4791Q2861R1117J00560J12302J25019J36228
$$ plain form
56255 1916948 2062862 2219004 2386009 2562069 2744063 2929781 3116960 3301150 3476812
56246 3476812 3639917 3787560 3915739 4019718 4096546 4145639 4167326 4162603 4134165 4086010 4021820
56235 4021820 3944732 3858250 3766000 3670660 3574009 3477515 3381865 3286542 3190910 3095120 2999027
56224 2999027 2901211 2800292 2696339 2589871 2480661 2369051 2257255 2147553 2039999 1933699
56214 1933699 1829447 1729189 1633646 1542532 1456577 1377212 1304431 1236875 1173972 1116322 1064121
56203 1064121 1016886 974654 937829 905784 877028 850768 827163 806204 787539 771135 756943
56192 756943 744188 732093 720961 711480 703488 696461 690596 686263 683101 680866 680311 681893 684475 686765
56178 686765 689231 693164 698730 705512 713989 724689 736649 748457 760083 771957 783140 792450 800755
$$ packed form
56255A916948J45914J56142J67005J76060J81994J85718J87179J84190J75662
56246C476812J63105J47643J28179J03979P6828M9093K1687m723k8438m8155o4190
56235D021820p7088q6482r2250r5340r6651r6494r5650r5323r5632r5790r6093
56224B999027r7816j00919j03953j06468j09210j11610j11796j09702j07554j06300
56214A933699j04252j00258r5543r1114q5955p9365p2781o7556o2903n7650n2201
56203A064121m7235m2232l6825l2045k8756k6260k3605k0959j8665j6404j4192
56192G56943j2755j2095j1132r481p992p027n865m333l162k235n55J582K582K290
56178F86765K466L933N566O782Q477J0700J1960J1808J1626J1874J1183R310Q305
$$ plain form
56165 800755 810030 820554 830835 839920 847917 854652 859654 863245 866130 868279 869635 871175 873773 876896
56151 876896 880070 884632 892206 902515 914733 929942 949965 974666 1002903 1035467 1074700 1121834
56139 1121834 1177166 1242310 1319766 1410539 1514371 1631597 1762004 1901940 2044805 2184215
56129 2184215 2314853 2431484 2530519 2612914 2683241 2745804 2803276 2857606 2908721 2952230 2981552
56118 2981552 2993252 2988742 2971454 2944934 2913065 2878556 2840071 2792683 2731514 2653615 2557651
56107 2557651 2444906 2320707 2192261 2064908 1942263 1828845 1729291 1645008 1574310 1515609
56097 1515609 1467852 1428454 1394092 1363544 1336904 1312450 1287616 1262854 1241037 1222861 1206233
56086 1206233 1190322 1176730 1166163 1157316 1149728 1144571 1141899 1140086 1138675 1138948 1141183 1144065 1147287
$$ packed form
56165H00755R275J0524J0281R085P997O735N002L591K885K149J356J540K598L123
56151H76896L174M562P574J0309J2218J5209K0023K4701K8237L2564L9233M7134
56139A121834N5332O5144P7456R0773J03832J17226J30407J39936J42865J39410
56129B184215J30638J16631R9035Q2395P0327O2563N7472N4330N1115M3509K9322
56118B981552J1700m510j7288k6520l1869l4509l8485m7388o1169p7899r5964
56107B557651j12745j24199j28446j27353j22645j13418r9554q4283p0698n8701
56097A515609m7757l9398l4362l0548k6640k4454k4834k4762k1817j8176j6628
56086A206233j5911j3592j0567q847p588n157k672j813j411K73K235K882L222
$$ plain form
56073 1147287 1151925 1157962 1164164 1170669 1178849 1188564 1198412 1208720 1221232 1235834 1250670 1265423 1281354
56060 1281354 1298280 1314841 1331493 1349734 1368665 1386018 1402326 1420227 1439926 1459405 1478841
56049 1478841 1500337 1523361 1545065 1565385 1587283 1611665 1636657 1662083 1689830 1719343 1747708
56038 1747708 1774767 1803269 1833555 1863369 1893489 1928052 1968314 2011513 2056818 2106728 2161250
56027 2161250 2216463 2270567 2326050 2384381 2443978 2504854 2569607 2638108 2706745 2774498 2844215
56016 2844215 2916484 2988127 3058247 3129716 3203174 3275923 3348330 3424701 3506040 3588790 3672648
56005 3672648 3762489 3860370 3962917 4069009 4182657 4305704 4435210 4570760 4716694 4874305
55995 4874305 5039620 5211658 5394771 5590108 5793399 6004149 6228030 6466999 6716482
$$ packed form
56073A147287M638O037O202O505Q180R715R848J0308J2512J4602J4836J4753J5931
56060A281354J6926J6561J6652J8241J8931J7353J6308J7901J9699J9479J9436
56049A478841K1496K3024K1704K0320K1898K4382K4992K5426K7747K9513K8365
56038A747708K7059K8502L0286K9814L0120L4563M0262M3199M5305M9910N4522
56027B161250N5213N4104N5483N8331N9597O0876O4753O8501O8637O7753O9717
56016B844215P2269P1643P0120P1469P3458P2749P2407P6371Q1339Q2750Q3858
56005C672648Q9841R7881J02547J06092J13648J23047J29506J35550J45934J57611
55995D874305J65315J72038J83113J95337K03291K10750K23881K38969K49483
$$ plain form
55986 6716482 6975877 7252194 7549622 7865525 8200440 8561441 8951620 9367384 9810368
55977 9810368 10290490 10813220 11376517 11984800 12652325 13387973 14191568 15070754 16045928
55968 16045928 17133070 18339727 19685544 21208988 22947405 24932231 27213817 29869212
55960 29869212 32974941 36595478 40811355 45738953 51521208 58337750 66441684 76157636
55952 76157636 87843718 101915199 118935727 139657967 165008865 196115560 234141033
55945 234141033 279367318 329558342 378907063 419128862 442614608 445574236 429055807
55938 429055807 397625464 357156580 313118322 269720436 229665450 194295455 163984270
55931 163984270 138544785 117487375 100171770 85943654 74231644 64558165 56515272
$$ packed form
55986F716482K59395K76317K97428L15903L34915L61001L90179M15764M42984
55977I810368M80122N22730N63297O08283O67525P35648Q03595Q79186R75174
55968A6045928J087142J206657J345817J523444J738417J984826K281586K655395
55960B9869212L105729L620537M215877M927598N782255O816542Q103934R715952
55952G6157636J1686082J4071481J7020528K0722240K5350898L1106695L8025473
55945B34141033M5226285N0191024M9348721M0221799K3485746K959628j6518429
55938D29055807l1430343m0468884m4038258m3397886m0054986l5369995l0311185
55931A63984270k5439485k1057410j7315605j4228116j1712010r673479q042893
$$ plain form
55924 56515272 49770075 44075168 39242591 35111598 31550283 28465344 25785499 23442154
55916 23442154 21377106 19553851 17944769 16516300 15237839 14093390 13071583 12153411
55908 12153411 11320433 10565358 9883666 9263353 8692691 8169681 7694193 7258317 6853240
55899 6853240 6478187 6134088 5815435 5516453 5238495 4983602 4747242 4524832 4318961
55890 4318961 4132819 3962454 3802547 3653908 3518237 3391127 3267330 3147931 3035861
55881 3035861 2929240 2825449 2726793 2635717 2548949 2462575 2378676 2301015 2228319 2157632 2090348
55870 2090348 2029233 1973102 1919908 1871441 1829566 1791112 1751588 1710839 1670542 1629798 1588151
55859 1588151 1549531 1518175 1493667 1474418 1462542 1460183 1463868 1467210 1466589 1460079 1444308 1417566
$$ packed form
55924E6515272o745197n694907m832577m130993l561315l084939k679845k343345
55916B3442154k065048j823255j609082j428469j278461j144449j021807r18172
55908A2153411q32978p55075o81692o20313n70662n23010m75488m35876m05077
55899F853240l75053l44099l18653k98982k77958k54893k36360k22410k05871
55890D318961j86142j70365j59907j48639j35671j27110j23797j19399j12070
55881C035861j06621j03791r8656r1076q6768q6374q3899p7661p2696p0687o7284
55870B090348o1115n6131n3194m8467m1875l8454l9524m0749m0297m0744m1647
55859A588151l8620l1356k4508j9249j1876k359L685L342o21o510j5771k6742
$$ plain form
55847 1417566 1383596 1347617 1310826 1272840 1236611 1205996 1180669 1157984 1137899 1121728 1107967
55836 1107967 1093732 1078747 1064018 1048284 1029626 1008959 988330 967357 944832 921993 900740
55825 900740 880402 859667 839829 822656 806843 790041 772684 756522 741271 726105 712474
55814 712474 701845 692433 681828 671185 663176 657430 651818 646813 644689 645416 647131 649823 654981 662089
55800 662089 668676 673376 676272 676977 675047 671388 666704 659577 648594 635103 621363 607416 592500
55787 592500 577964 565653 554712 543135 531376 521407 513327 506063 500421 498228 499087 500878 502607
55774 502607 503857 502318 495130 482391 466720 449962 432788 416537 402422 389505 376280 363747
55762 363747 354221 347656 341819 335557 329277 322827 315555 307909 300390 291672 280459 268511 258974 252308
$$ packed form
55847A417566l3970l5979l6791l7986l6229l0615k5327k2685k0085j6171j3761
55836A107967j4235j4985j4729j5734j8658k0667k0629k0973k2525k2839k1253
55825I00740k0338k0735j9838j7173j5813j6802j7357j6162j5251j5166j3631
55814G12474j0629r412j0605j0643q009n746n612n005k124P27J715K692N158P108
55800F62089O587M700K896P05j930l659m684p127j0983j3491j3740j3947j4916
55787E92500j4536j2311j0941j1577j1759r969q080p264n642k193Q59J791J729
55774E02607J250j539p188j2739j5671j6758j7174j6251j4115j2917j3225j2533
55762C63747r526o565n837o262o280o450p272p646p519q718j1213j1948r537o666
$$ plain form
55748 252308 246728 241973 239436 238772 237655 235098 232258 229795 227050 223990 221433 219206 216439 213764
55734 213764 212853 213733 214884 215952 217950 220769 222976 224184 225227 225762 224179 220278 215774 211749 207658
55719 207658 203204 199130 195706 192324 188974 186360 184350 182073 179721 178496 178684 179527 181052 184183 188975
55704 188975 194630 201315 209984 220134 229544 236588 241216 243663 244056 243499 243693 245020 246428 247342 248277
55689 248277 249526 250782 252073 253555 254464 253820 252001 250069 247808 244268 240099 237409 237256 238939 241617
55674 241617 244744 247076 247321 246029 245043 245022 245277 245916 248002 251344 254254 255927 257258 258883 260228 260953
55658 260953 261656 262655 263577 264534 266211 268496 270481 271973 273553 275016 275311 274063 271606 267552 261092
55643 261092 252764 244122 235527 226066 215721 205729 196587 187548 178369 169766 161915 154328 147423 142341
$$ packed form
55748B52308n580m755k537o64j117k557k840k463k745l060k557k227k767k675
55734B13764r11Q80J151J068J998K819K207J208J043N35j583l901m504m025m091
55719B07658m454m074l424l382l350k614k010k277k352j225J88Q43J525L131M792
55704A88975N655O685Q669J0150R410P044M628K447L93n57J94J327J408R14R35
55689B48277J249J256J291J482R09o44j819j932k261l540m169k690j53J683K678
55674B41617L127K332K45j292r86k1K55O39K086L342K910J673J331J625J345P25
55658B60953P03R99R22R57J677K285J985J492J580J463K95j248k457m054o460
55643B61092q328q642q595r461j0345r992r142r039r179q603p851p587o905n082
$$ plain form
55629 142341 138983 136121 133551 132053 131058 128718 124756 120979 118356 115886 113036 110933 110146 109495 108249
55614 108249 107412 107669 108016 107685 107565 108305 108753 107699 105645 103498 100997 97840 94950 93147 91740 89844
55598 89844 88015 87267 87478 87998 88847 90128 91179 91463 91452 91606 91380 90251 88882 88228 88276 88547 89008 89593
55580 89593 89642 88761 87514 86524 85720 85126 85394 86710 88076 88584 88555 88641 88720 88554 88641 89482 90733 91955 93495
55561 93495 95742 98212 100163 101524 102522 102990 102686 101702 100050 97479 94172 90895 88093 85633 83709
55546 83709 82941 83190 83471 83577 84548 86782 88925 89588 89186 89174 90290 92390 95127 97977 100455 103118 107475
55529 107475 114068 121377 127368 131397 134000 135736 136951 137807 137824 136176 133031 129676 126750 123432 118967
55514 118967 113825 108607 103088 97224 91821 87114 81886 75228 68118 62029 57026 52549 49055 47333
$$ packed form
55629A42341l358k862k570j498r95k340l962l777k623k470k850k103p87o51j246
55614A08249q37K57L47l31j20P40M48j054k054k147k501l157k890j803j407j896
55598H9844j829p48K11N20Q49J281J051K84j1J54k26j129j369o54M8K71M61N85
55580H9593M9q81j247r90q04n94K68J316J366N08k9Q6P9j66Q7Q41J251J222J540
55561I3495K247K470J951J361R98M68l04r84j652k571l307l277k802k460j924
55546H3709p68K49K81J06R71K234K143O63m02j2J116K100K737K850K478K663M357
55529A07475O593P309N991M029K603J736J215Q56J7j648l145l355k926l318m465
55514A18967n142n218n519n864n403m707n228o658p110o089n003m477l494j722
$$ plain form
55500 47333 46872 46436 45776 45515 45842 46520 47722 49636 51640 53029 54163 55814 57876 59853 62166 65747
55484 65747 70551 75506 79668 82422 82906 80415 75368 68963 61971 54494 46706 39053 31972 25999 21727
55469 21727 19068 17006 14791 12812 11624 10821 9746 8661 8157 7966 7406 6567 6074 6071 6411 7344 8964
55452 8964 10497 11254 11887 13458 15594 16801 16462 15312 14032 12658 11457 11192 12162 13781 15325 16432
55436 16432 16836 16411 15589 15064 14990 15018 15066 15395 16014 16675 17436 18501 19489 19594 18676 17677 17723 19053 20857
55417 20857 21899 21458 19927 18396 17542 17252 17360 18072 19304 20337 20812 21469 23166 25621 27836 29357
55401 29357 30381 30982 30995 30448 29468 27991 26096 24289 22912 21701 20413 19383 18908 18669 18414 18540 19173
55384 19173 19399 18461 17191 17072 18199 19291 19505 19145 18646 17946 16937 15705 14232 12553 11062 10034
$$ packed form
55500D7333m61m36o60k61L27O78J202J914K004J389J134J651K062J977K313L581
55484F5747M804M955M162K754M84k491n047o405o992p477p788p653p081n973m272
55469B1727k659k062k215j979j188q03j075j085n04j91n60q39m93lL40R33J620
55452H964J533P57O33J571K136J207l39j150j280j374j201k65R70J619J544J107
55436A6432M04m25q22n25p4K8M8L29O19O61P61J065R88J05r18r99M6J330J804
55417B0857J042m41j531j531q54k90J08P12J232J033M75O57J697K455K215J521
55401B9357J024O01J3n47r80j477j895j807j377j211j288j030m75k39k55J26O33
55384A9173K26r38j270j19J127J092K14l60m99p00j009j232j473j679j491j028
$$ plain form
55368 10034 9034 7586 6205 5943 7074 9016 11375 14090 16669 18265 18674 18579 18691 19230 20104 20932
55352 20932 21045 20195 19174 19008 19625 20007 19587 18795 18332 18617 19824 21729 23527 24392 24156 23014 20960
55335 20960 18241 15940 15087 15352 15528 15161 14798 14765 14713 14436 14184 14059 13838 13477 13050 12278 10928 9629
55317 9629 9377 10214 11230 11880 12362 12685 12425 11637 11095 11283 11961 12982 14638 16811 18546 19021 18444 17648
55299 17648 17276 17585 18531 19727 20676 21255 21653 21922 22101 22712 24358 26693 28467 28874 28391 28054 28399 29267
55281 29267 30149 30493 30018 28922 27611 26317 25293 25070 25916 27145 27652 27146 26305 25748 25441 25099 24562
55264 24562 23723 22686 21995 22114 22701 22970 22719 22400 22219 21925 21515 21441 22000 23094 24652 26590 28310 28895
55246 28895 28022 26212 24213 22625 21981 22422 23292 23797 24089 24943 26350 27320 27232 26543 25917 25429 24934 24540
$$ packed form
55368A0034j000j448j381k62J131J942K359K715K579J596M09r5J12N39Q74Q28
55352B0932J13q50j021j66O17L82m20p92m63K85J207J905J798Q65k36j142k054
55335B0960k719k301q53K65J76l67l63l3n2k77k52j25k21l61m27p72j350j299
55317I629k52Q37J016O50M82L23k60p88n42J88O78J021J656K173J735M75n77p96
55299A7648l72L09R46J196R49N79L98K69J79O11J646K335J774M07m83l37L45Q68
55281B9267Q82L44m75j096j311j294j024k23Q46J229N07n06q41n57l07l42n37
55264B4562q39j037o91J19N87K69k51l19j81k94m10p4N59J094J558J938J720N85
55246B8895q73j810j999j588o44M41Q70N05K92Q54J407R70q8o89o26m88m95l94
$$ plain form
55228 24540 24304 24032 23678 23463 23400 23261 23153 23539 24504 25523 26129 26339 26386 26613 27597 29629 31963 33327
55210 33327 33404 33102 33264 33895 34781 35882 36742 36443 34758 32677 31217 30304 29416 28746 28968 30142 31485
55193 31485 32211 32257 32224 32695 33503 33763 32930 31625 30848 30556 29828 28465 27438 27405 27685 27283 26280 25613 25914
55174 25914 27065 28525 29626 29843 29230 28375 27767 27449 27350 27424 27289 26350 24689 23330 23183 24075 25157 25874
55156 25874 26199 26266 26264 26437 26865 27346 27684 27848 27754 27252 26512 26057 26202 26680 26985 26829 26215 25404 24855 24820 24934
55135 24934 24642 24045 23829 24219 24544 24116 23139 22475 22814 24207 26127 27880 29255 30740 32809 35102 36792
55118 36792 37621 38047 38462 38875 39312 39877 40369 40535 40630 41030 41334 40728 39322 38138 37622 37146 36340 35933 36660
55099 36660 38197 39834 41552 43693 46027 47862 48900 49497 50254 51542 53187 54481 54853 54607 54615 55228
$$ packed form
55228B4540k36k72l54k15o3j39j08L86R65J019O06K10M7K27R84K032K334J364
55210C3327P7l02J62O31Q86J101Q60k99j685k081j460r13q88o70K22J174J343
55193C1485P26M6l3M71Q08K60q33j305p77k92p28j363j027l3K80m02j003o67L01
55174B5914J151J460J101K17o13q55o08l18r9P4j35r39j661j359j47Q92J082P17
55156B5874L25O7kJ73M28M81L38J64r4n02p40m55J45M78L05j56o14q11n49l5J14
55135B4934k92n97k16L90L25m28r77o64L39J393J920J753J375J485K069K293J690
55118C6792Q29M26M15M13M37N65M92J66R5M00L04o06j406j184n16m76q06m07P27
55099C6660J537J637J718K141K334J835J038N97P57J288J645J294L72k46QO13
$$ plain form
55083 55228 56028 56610 56950 56983 56601 56163 56196 56392 55817 54389 53231 53167 53697 53888 53496 52747 51823 51069 50966
55064 50966 51479 52112 52916 54543 56876 58704 59394 59852 61028 62458 63261 63671 64413 65221 65162 64088 62722
55047 62722 61575 60660 60000 59577 58956 57719 56061 54423 52910 51685 51390 52439 54292 56157 57864 59321
55031 59321 59769 58719 57174 56639 57077 57005 55637 53804 52635 52364 52725 53596 54786 55897 56873 58238 60327
55014 60327 62633 64213 64606 64198 63793 63858 64043 63493 61720 59094 56458 54499 53571 53604 53946 53704 52679
54997 52679 51612 51180 51174 51014 50620 50236 49883 49555 49625 50401 51508 52289 52576 52650 52719 52965 53736 55107 56527
54978 56527 57537 58507 59985 61596 62432 62420 62537 63606 65485 67564 69505 71334 73209 75240 77334 79262
54962 79262 81020 82972 85426 88346 91708 95761 100620 105996 111742 118245 125877 134459 143788 154285
$$ packed form
55083E5228Q00N82L40L3l82m38L3J96n75j428j158o4N30J91l92p49r24p54j03
55064E0966N13O33Q04J627K333J828O90M58J176J430Q03M10P42Q08n9j074j366
55047F2722j147r15o60m23o21j237j658j638j513j225k95J049J853J865J707J457
55031E9321M48j050j545n35M38p2j368j833j169k71L61Q71J190J111R76J365K089
55014F0327K306J580L93m08m05O5J85n50j773k626k636j959r28L3L42k42j025
54997E2679j067m32oj60l94l84l53l28P0P76J107P81K87P4O9K46P71J371J420
54978E6527J010R70J478J611Q36j2J17J069J879K079J941J829J875K031K094J928
54962G9262J758J952K454K920L362M053M859N376N746O503P632Q582R329J0497
$$ plain form
54948 154285 166536 180478 195485 210845 225590 238264 247537 252788 253662 249581 240433 227378 212264
54935 212264 196467 180844 166289 153413 141990 131508 122094 114157 107485 101562 96521 92823 90213
54922 90213 87914 85761 84249 83497 83145 83235 84268 86254 88546 90853 93677 97656 103126 110384 119612
54907 119612 130357 141746 153396 165628 178735 192504 206318 218996 228680 233775 234169 230917
54895 230917 224743 215640 203898 190629 177023 163748 151182 139476 128289 117227 106747 97913
54883 97913 91092 85644 81036 77468 75130 73639 72577 71908 71549 71156 70663 70386 70277 69679 68187 66138
54867 66138 63954 61583 59010 56754 55358 54782 54628 54540 54104 52842 50788 48693 47249 46329 45279 43777
54851 43777 42126 40962 40750 41346 41971 41878 41079 40110 39193 38056 36579 35111 34114 33932 34843 36810 39190
$$ packed form
54948A54285J2251J3942J5007J5360J4745J2674R273N251Q74m081r148j3055j5114
54935B12264j5797j5623j4555j2876j1423j0482r414p937o672n923n041l698k610
54922I0213k299k153j512p52l52R0J033J986K292K307K824L979N470P258R228
54907A19612J0745J1389J1650J2232J3107J3769J3814J2678R684N095L94l252
54895B30917o174r103j1742j3269j3606j3275j2566j1706j1187j1062j0480q834
54883I7913o821n448m608l568k338j491j062o69l59l93m93k77j09n98j492k049
54867F6138k184k371k573k256j396n76j54q8m36j262k054k095j444r20j050j502
54851D3777j651j164k12N96O25r3p99r69r17j137j477j468r97j82R11J967K380
$$ plain form
54834 39190 41222 42810 44318 45751 46869 47976 49651 51635 52920 53188 53226 53644 54111 54378 55028 56539
54818 56539 58320 59457 59894 60168 60471 60693 61048 61956 63438 65152 66902 68747 70814 73350 76701 80915
54802 80915 85574 90256 94962 99920 105408 111991 120515 131509 144771 159689 175600 191780 207579
54789 207579 222672 236540 247615 253812 254388 250588 243968 234849 223108 209737 196551 184622 173832
54776 173832 163837 154698 146659 139944 134819 131321 128996 127305 126174 125737 125727 125728 125896 126805 128541 130538
54760 130538 132473 134885 138642 144045 150661 157953 166019 175738 188152 203625 221637 241375 262195
54747 262195 283417 303992 322667 338275 349649 355530 354984 347931 335127 317821 297537 275861
54735 275861 254023 232749 212660 194607 179274 166605 155864 146209 137141 128659 121176 115105
$$ packed form
54834C9190K032J588J508J433J118J107J675J984J285K68L8M18M67K67O50J511
54818E6539J781J137M37K74L03K22L55R08J482J714J750J845K067K536L351M214
54802H0915M659M682M706M958N488O583Q524J0994J3262J4918J5911J6180J5799
54789B07579J5093J3868J1075O197N76l800o620r119j1741j3371j3186j1929j0790
54776A73832r995r139q039o715n125l498k325j691j131m37j0JJ68R09J736J997
54760A30538J935K412L757N403O616P292Q066R719J2414J5473J8012J9738K0820
54747B62195K1222K0575J8675J5608J1374N881n46p053j2804j7306k0284k1676
54735B75861k1838k1274k0089j8053j5333j2669j0741r655r068q482p483o071
$$ plain form
54723 115105 110344 106408 103150 100966 99965 99380 98263 96504 94647 92910 91041 89161 88118 88618 90259
54708 90259 91751 92063 91253 90229 89832 90164 90660 90670 89920 88634 87391 86739 86707 86765 86474 86083 86170 86835 87632
54689 87632 88251 88773 89236 89452 89366 89182 89024 88949 89356 90766 92980 95080 96606 98110 100160 102388 104157
54672 104157 105662 107643 110276 113039 115523 117730 119685 121455 123616 127043 131967 137643 143184 148434
54658 148434 153782 159366 164752 169333 172820 175288 176913 177976 179169 181450 185173 189473 193079 195815
54644 195815 198858 203398 209612 217170 226156 236919 249394 263107 277654 292587 306857 318821
54632 318821 326904 330053 327712 319824 307033 290701 272537 254138 236686 220870 206962 194920
54620 194920 184366 174724 165716 157753 151521 147131 144010 141595 139667 138011 136375 135081 135035 136644
$$ packed form
54723A15105m761l936l258k184j001n85j117j759j857j737j869j880j043N00J641
54708I0259J492L12q10j024l97L32M96J0p50j286j243o52l2N8k91l91Q7O65P97
54689H7632O19N22M63K16q6j84j58p5M07J410K214K100J526J504K050K228J769
54672A04157J505J981K633K763K484K207J955J770K161L427M924N676N541N250
54658A48434N348N584N386M581L487K468J625J063J193K281L723M300L606K736
54644A95815L043M540O214P558Q986J0763J2475J3713J4547J4933J4270J1964
54632C18821Q083L149k341p888j2791j6332j8164j8399j7452j5816j3908j2042
54620A94920j0554r642r008p963o232m390l121k415j928j656j636j294m6J609
$$ plain form
54606 136644 139124 141358 143153 145153 147787 150775 153484 155278 155695 154761 153099 151333 149404 146750 143038
54591 143038 138415 133248 128061 123596 120346 117907 115214 111615 107478 103658 100543 97800 94927 91936
54577 91936 89401 87759 86632 85079 82666 80053 78362 78108 78856 79683 79740 78670 76854 75209 74413 74274
54561 74274 74052 73368 72631 72541 73327 74547 75614 76449 77482 78956 80440 81290 81422 81283 81175 81019 80796 80712
54543 80712 80860 81148 81701 82856 84611 86547 88505 90855 93833 97095 100274 103628 107789 113152 119774
54528 119774 127511 135900 144223 151951 158878 164652 168565 170127 169481 166951 162559 156346 148839 140835
54514 140835 132956 125630 119113 113259 107675 102364 97821 94165 90779 87239 84128 82339 81917 82120 82287
54499 82287 82136 81527 80496 79351 78319 77336 76501 76357 77303 79064 81117 83189 84900 85559 84972 83982 83541
$$ packed form
54606A36644K480K234J795K000K634K988K709J794M17r34j662j766j929k654l712
54591A43038m623n167n187m465l250k439k693l599m137l820l115k743k873k991
54577I1936k535j642j127j553k413k613j691k54P48Q27N7j070j816j645p96j39
54561G4274k22o84p37r0P86J220J067Q35J033J474J484Q50J32j39j08j56k23q4
54543H0712J48K88N53J155J755J936J958K350K978L262L179L354M161N363O622
54528A19774P737Q389Q323P728O927N774L913J562o46k530m392o213p507q004
54514A40835p879p326o517n854n584n311m543l656l386l540l111j789m22K03J67
54499H2287j51o09j031j145j032r83q35j44R46J761K053K072J711O59n87r90m41
$$ plain form
54482 83541 83650 83936 84648 86159 87891 88867 89243 90221 92349 94873 96895 98319 99402 100216 100901 101800 102948
54465 102948 103886 104252 104190 103966 103612 103084 102399 101402 99805 97698 95766 94805 95127 96340 97529 97735 96642
54448 96642 94789 92854 90890 88562 85965 83727 82276 81433 80739 79903 78971 78297 78275 78854 79455 79584 79309
54431 79309 78893 78380 77960 78286 79774 81831 83377 84000 84045 83816 83351 82823 82486 82209 81662 80961 80579 80676 80997
54412 80997 81356 81801 82409 83408 85235 87900 90605 92614 94247 96311 98877 101453 104110 107445 111559
54397 111559 115972 120532 125445 130463 135048 139386 144142 149181 153609 157264 160911 164640 167351 168390
54383 168390 168490 168299 167065 163787 158895 153776 149172 144948 140998 137458 134254 131193 128401 126067 123908
54368 123908 121437 118611 115776 113130 110669 108493 106779 105564 104792 104389 104061 103314 101928 100214 98652
$$ packed form
54482H3541J09K86P12J511J732R76L76R78K128K524K022J424J083Q14O85Q99J148
54465A02948R38L66o2k24l54n28o85r97j597k107j932r61L22J213J189K06j093
54448I6642j853j935j964k328k597k238j451q43o94q36r32o74k2N79O01J29k75
54431G9309m16n13m20L26J488K057J546O23M5k29m65n28l37k77n47p01l82R7L21
54412H0997L59M45O08R99J827K665K705K009J633K064K566K576K657L335M114
54397A11559M413M560M913N018M585M338M756N039M428L655L647L729K711J039
54383A68390J00j91j234l278m892n119m604m224l950l540l204l061k792k334k159
54368A23908k471k826k835k646k461k176j714j215p72m03l28p47j386j714j562
$$ plain form
54353 98652 97612 97550 98913 101497 104345 106681 108590 110524 112564 114565 116592 118758 120996 123409 126426
54338 126426 130176 134094 137664 141225 145498 150623 156143 161554 166223 169132 169523 167746 164850 161373
54324 161373 157171 152352 147590 143240 138783 133498 127294 120585 113800 107434 102256 98898 97145 95965
54310 95965 94361 92067 89382 86592 83759 80916 78173 75603 73221 71185 69780 69117 69021 69325 70032 71002
54294 71002 71728 71719 70962 69822 68602 67430 66307 65047 63474 61977 61475 62353 63793 64698 64964 65200 65549
54277 65549 65657 65635 66057 66894 67359 67081 66662 66731 67142 67453 67623 67835 68137 68607 69401 70381 71149 71665 72359 73453
54257 73453 74693 75883 77081 78057 78313 77919 77625 77725 77538 76476 74953 73684 72751 71992 71667 72004 72516
54240 72516 72590 72441 72798 73852 75102 76078 76635 76709 76309 75643 74884 73944 72809 71828 71314 71124 70998 70987 71115
$$ packed form
54353I8652j040o2J363K584K848K336J909J934K040K001K027K166K238K413L017
54338A26426L750L918L570L561M273N125N520N411M669K909L91j777k896l477
54324A61373m202m819m762m350m457n285o204o709o785o366n178l358j753j180
54310I5965j604k294k685k790k833k843k743k570k382k036j405o63r6L04P07R70
54294G1002P26rp57j140j220j172j123j260j573j497n02Q78J440R05K66K36L49
54277F5549J08k2M22Q37M65k78m19O9M11L11J70K12L02M70P94R80P68N16O94J094
54257G3453J240J190J198R76K56l94k94J00j87j062j523j269r33p59l25L37N12
54240G2516P4j49L57J054J250R76N57P4m00o66p59r40j135r81n14j90j26j1J28
$$ plain form
54221 71115 70975 70150 68786 67329 65988 64923 64625 65445 66891 67969 68224 68074 68219 69053 70498 72033
54205 72033 73047 73448 73761 74314 74674 74306 73453 72846 72663 72338 71408 70120 69145 68881 69026 68779 67621 65996
54187 65996 64891 64705 65005 65502 66549 68222 69562 69484 68059 66222 64525 62839 61072 59463 58217 57430
54171 57430 57338 58120 59422 60527 60965 60730 60074 59467 59569 60753 62679 64610 66043 66824 66911 66384 65469 64304
54153 64304 62934 61685 61129 61373 61905 62482 63589 65480 67375 68254 68052 67394 66624 65844 65440 65686 66033
54136 66033 65671 64583 63292 61830 59874 57792 56527 56332 56428 56125 55519 54981 54641 54636 55270 56579 58069
54119 58069 59099 59347 58950 58365 57944 57439 56357 55051 54773 56026 57595 58129 58129 59178 61554 63921 65266
54102 65266 65847 66117 66036 65750 65728 65763 64909 62915 60752 59209 57958 56608 55770 56186 57513 58777 59581 60116
$$ packed form
54221G1115j40q25j364j457j341j065k98Q20J446J078K55j50J45Q34J445J535
54205G2033J014M01L13N53L60l68q53o07j83l25r30j288r75k64J45k47j158j625
54187F5996j105j86L00M97J047J673J340p8j425j837j697j686j767j609j246p87
54171E7430r2P82J302J105M38k35o56o07J02J184J926J931J433P81Q7n27r15j165
54153F4304j370j249n56K44N32N77J107J891J895Q79k02o58p70p80m04K46L47
54136F6033l62j088j291j462j956k082j265j95R6l03o06n38l40nO34J309J490
54119E8069J030K48l97n85m21n05j082j306k78J253J569N34%J049K376K367J345
54102F5266N81K70q1k86k2L5q54j994k163j543j251j350q38M16J327J264Q04N35
$$ plain form
54084 60116 60431 60423 60272 60248 60231 59856 58966 57618 55958 54381 53425 53158 53095 53078 53753 55647 58195 60296 61549
54065 61549 62381 63178 63924 64623 65503 66643 67812 68758 69404 69722 69675 69377 69123 69165 69508 70001 70609 71557 73113
54046 73113 75210 77442 79527 81549 83594 85470 87122 89004 91520 94302 96662 98636 100907 103690
54032 103690 106432 108837 111474 115049 119599 124726 130175 135811 141477 147196 153168 159299 165107 170311
54018 170311 175109 179644 183702 187301 191021 195216 199286 202286 204032 205126 206110 207021 207545 207141 205163
54003 205163 201445 196704 191928 187345 182424 176951 171559 166970 163084 159228 155162 151392 148412 146005
53989 146005 143644 141324 139526 138312 137067 135364 133590 132228 130930 128930 126245 123844 122617 122655 123455
53974 123455 124351 124757 124540 124160 124011 123765 122935 121960 121908 123012 124335 125166 125945 127391 129366 131190 132657
$$ packed form
54084F0116L15qj51k4j7l75q90j348j660j577r56k67o3j7O75J894K548K101J253
54065F1549Q32P97P46O99Q80J140J169R46O46L18m7k98k54M2L43M93O08R48J556
54046G3113K097K232K085K022K045J876J652J882K516K782K360J974K271K783
54032A03690K742K405K637L575M550N127N449N636N666N719N972O131N808N204
54018A70311M798M535M058L599L720M195M070L000J746J094R84R11N24m04j978
54003B05163l718m741m776m583m921n473n392m589l886l856m066l770k980k407
53989A46005k361k320j798j214j245j703j774j362j298k000k685k401j227L8Q00
53974A23455Q96M06k17l80j49k46q30r75n2J104J323Q31P79J446J975J824J467
$$ plain form
53957 132657 134176 136106 138316 140291 141564 142241 143073 144635 146431 147363 147073 146217 145409 144670 144120 144333
53941 144333 145563 147311 149119 151239 154110 157827 162503 168389 175048 181093 185385 187984 189361 189421 188059
53926 188059 186012 184190 182560 180614 178628 177468 177329 177615 178077 179279 181805 185655 190461 195719 200772
53911 200772 205143 209059 213277 218331 224237 230776 237720 244911 252381 260110 267399 272946 276135 277770
53897 277770 278916 279457 278623 276516 274000 271306 267991 264306 261404 259741 258334 256082 252928 249109 244155
53882 244155 237555 229876 222320 215400 208804 202382 196525 191480 186925 182488 178313 174815 172079 169691
53868 169691 167115 164096 160704 157080 153294 149496 146024 143140 140675 138181 135487 132923 130850 129156
53854 129156 127395 125331 123188 121364 120049 119128 118293 117159 115342 112727 109688 106868 104549 102441 100299
$$ packed form
53957A32657J519J930K210J975J273O77Q32J562J796R32k90q56q08p39n50K13
53941A44333J230J748J808K120K871L717M676N886O659O045M292K599J377O0j362
53926A88059k047j822j630j946j986j160j39K86M62J202K526L850M806N258N053
53911B00772M371L916M218N054N906O539O944P191P470P729P289N547L189J635
53897B77770J146N41q34k107k516k694l315l685k902j663j407k252l154l819m954
53882B44155o600p679p556o920o596o422n857n045m555m437m175l498k736k388
53868A69691k576l019l392l624l786l798l472k884k465k494k694k564k073j694
53854A29156j761k064k143j824j315r21q35j134j817k615l039k820k319k108k142
$$ plain form
53839 100299 98544 97841 98164 98750 99004 99011 99050 99191 99578 100561 102110 103549 104320 104699 105240 105822 105786 104860 103431
53820 103431 102016 100929 100395 100501 101029 101695 102502 103520 104494 105136 105715 106826 108522 110184 111343 112208
53804 112208 113249 114654 116358 118342 120693 123573 127192 131634 136682 141992 147448 153103 158809 164193
53790 164193 168972 173093 176579 179515 182121 184542 186586 188005 188977 189984 191205 192443 193620 194970
53776 194970 196631 198356 199760 200508 200278 198930 196884 194910 193328 191705 189534 186931 184375 182060 179862
53761 179862 177785 175989 174336 172261 169361 165954 162789 160159 157621 154763 152003 150198 149515 149155 148365
53746 148365 147325 146730 146847 147386 148054 148795 149589 150373 151162 151985 152743 153335 153838 154401 155115 156130 157539 158883
53728 158883 159128 157655 155040 152405 150230 148296 146532 145282 144750 144745 144943 144952 144293 142919 141627 141284 141707
$$ packed form
53839A00299j755p03L23N86K54PL9J41L87R83J549J439P71L79N41N82l6r26j429
53820A03431j415j087n34J06N28O66Q07J018R74O42N79J111J696J662J159Q65
53804A12208J041J405J704J984K351K880L619M442N048N310N456N655N706N384
53790A64193M779M121L486K936K606K421K044J419R72J007J221J238J177J350
53776A94970J661J725J404P48k30j348k046j974j582j623k171k603k556k315k198
53761A79862k077j796j653k075k900l407l165k630k538k858k760j805o83l60p90
53746A48365j040n95J17N39O68P41P94P84P89Q23P58N92N03N63P14J015J409J344
53728A58883K45j473k615k635k175j934j764j250n32nJ98Ro59j374j292l43M23
$$ plain form
53711 141707 142023 142105 142782 144508 146723 148877 151271 154368 157910 161255 164081 166340 168056 169730 172375
53696 172375 176496 181356 185884 190024 194521 199622 204765 209513 214139 219068 224236 229284 234101 238969
53682 238969 244241 249968 255755 260983 265272 268681 271431 273602 275242 276562 277776 278803 279316 279080 278096
53667 278096 276517 274508 272165 269511 266681 264106 262314 261441 261125 260923 260626 260096 259147 257807 256369 254987
53651 254987 253484 251886 250770 250616 250947 250665 249247 247216 245397 244168 243523 243421 243758 244230 244510 244538 244473
53634 244473 244466 244582 244803 244920 244558 243611 242597 242272 242730 243281 243463 243918 245704 248845 252111 254446 256050
53617 256050 257724 259631 261379 263071 265511 269218 273822 278646 283438 288240 292947 297396 301687 306122
53603 306122 310899 316081 321762 328048 334921 342199 349568 356648 363191 369296 375309 381445 387662 393885
$$ packed form
53711A41707L16Q2O77J726K215K154K394L097L542L345K826K259J716J674K645
53696A72375M121M860M528M140M497N101N143M748M626M929N168N048M817M868
53682B38969N272N727N787N228M289L409K750K171J640J320J214J027N13k36r84
53667B78096j579k009k343k654k830k575j792q73l16k02k97n30r49j340j438j382
53651B54987j503j598j116j54L31k82j418k031j819j229o45j02L37M72K80K8o5
53634B44473pJ16K21J17l62r47j014l25M58N51J82M55J786L141L266K335J604
53617B56050J674J907J748J692K440L707M604M824M792M802M707M449M291M435
53603C06122M777N182N681O286O873P278P369P080O543O105O013O136O217O223
$$ plain form
53589 393885 400158 406511 412965 419689 426856 434167 440875 446534 451526 456671 462474 468900 475545 481752
53575 481752 486809 490469 493292 496160 499404 502545 504872 506116 506607 506903 507289 507636 507767 507909 508537 509747
53559 509747 511080 512169 513266 514847 516837 518565 519496 519737 519839 520223 520791 520965 520174 518482 516650 515408
53543 515408 514693 513809 512335 510659 509487 508974 508577 507875 507329 507905 509891 512451 514636 516563 519057 522291
53527 522291 525544 528466 531821 536485 542236 548245 554459 561724 570574 580552 590914 601437 612345
53514 612345 623945 636686 651142 667466 685008 702916 721024 739855 759805 780781 802715
53503 802715 825971 850854 877002 903774 931210 960100 990894 1022964 1055336 1087901 1121457
53492 1121457 1156591 1192966 1229787 1266560 1303197 1339672 1375870 1411672 1447021 1481963 1516731
$$ packed form
53589C93885O273O353O454O724P167P311O708N659M992N145N803O426O645O207
53575D81752N057L660K823K868L244L141K327J244M91K96L86L47J31J42O28J210
53559E09747J333J089J097J581J990J728R31K41J02L84N68J74p91j692j832j242
53543E15408p15q84j474j676j172n13l97p02n46N76J986K560K185J927K494L234
53527E22291L253K922L355M664N751O009O214P265Q850R978J0362J0523J0908
53514F12345J1600J2741J4456J6324J7542J7908J8108J8831J9950K0976K1934
53503H02715K3256K4883K6148K6772K7436K8890L0794L2070L2372L2565L3556
53492A121457L5134L6375L6821L6773L6637L6475L6198L5802L5349L4942L4768
$$ plain form
53481 1516731 1551721 1587243 1623361 1659919 1696626 1733172 1769455 1805656 1841828 1877373 1911247
53470 1911247 1942780 1972029 1999282 2024681 2048511 2071365 2093524 2114435 2133244 2149724 2164327
53459 2164327 2177494 2189445 2200528 2211131 2220981 2228934 2233780 2235036 2232767 2226997 2217712 2205339 2190688
53446 2190688 2174222 2155636 2134382 2110419 2084182 2055973 2025782 1993743 1960338 1925941 1890539
53435 1890539 1854211 1817484 1780749 1743579 1705267 1665958 1626678 1588298 1551192 1515949 1483472
53424 1483472 1453884 1426092 1399101 1373233 1349354 1327424 1306777 1287541 1270758 1257015 1245878
53413 1245878 1236932 1230555 1227202 1226590 1228217 1232324 1239781 1251136 1266171 1284203 1304416 1326057 1348766
53400 1348766 1372814 1398780 1427009 1457567 1490528 1525909 1563291 1601993 1641846 1683543 1727992
$$ packed form
53481A516731L4990L5522L6118L6558L6707L6546L6283L6201L6172L5545L3874
53470A911247L1533K9249K7253K5399K3830K2854K2159K0911J8809J6480J4603
53459B164327J3167J1951J1083J0603R850P953M846J256k269n770r285j2373j4651
53446B190688j6466j8586k1254k3963k6237k8209l0191l2039l3405l4397l5402
53435A890539l6328l6727l6735l7170l8312l9309l9280l8380l7106l5243l2477
53424A483472k9588k7792k6991k5868k3879k1930k0647j9236j6783j3743j1137
53413A245878q946o377l353o12J627M107P457J1355J5035J8032K0213K1641K2709
53400A348766K4048K5966K8229L0558L2961L5381L7382L8702L9853M1697M4449
$$ plain form
53389 1727992 1775490 1825747 1878488 1933721 1991595 2052401 2116680 2184846 2256496 2330486 2405968
53378 2405968 2483098 2562423 2643859 2726713 2810479 2894981 2979697 3063590 3145977 3227126 3307601
53367 3307601 3387225 3465028 3539985 3611325 3678152 3739311 3793995 3842384 3885503 3924421 3959626
53356 3959626 3991004 4018128 4040334 4056689 4066329 4069076 4065562 4056453 4041672 4020584 3992689 3957567
53344 3957567 3914240 3861333 3798317 3726254 3647060 3562463 3474061 3383943 3294348 3206511 3120237
53333 3120237 3034791 2949983 2866250 2784002 2703182 2623548 2545238 2468978 2395573 2325211 2257309
53322 2257309 2191101 2126306 2063319 2002939 1946010 1893122 1844458 1799893 1759167 1721824 1687147
53311 1687147 1654567 1624243 1596867 1572713 1551187 1531524 1513661 1498151 1485503 1475886 1469258 1465382
$$ packed form
53389A727992M7498N0257N2741N5233N7874O0806O4279O8166P1650P3990P5482
53378B405968P7130P9325Q1436Q2854Q3766Q4502Q4716Q3893Q2387Q1149Q0475
53367C307601P9624P7803P4957P1340O6827O1159N4684M8389M3119L8918L5205
53356C959626L1378K7124K2206J6355R640K747l514r109j4781k1088k7895l5122
53344C957567m3327n2907o3016p2063p9194q4597q8402r0118q9595q7837q6274
53333C120237q5446q4808q3733q2248q0820p9634p8310p6260p3405p0362o7902
53322B257309o6208o4795o2987o0380n6929n2888m8664m4565m0726l7343l4677
53311A687147l2580l0324k7376k4154k1526j9663j7863j5510j2648r617o628l876
$$ plain form
53299 1465382 1463764 1463815 1465067 1467219 1470225 1474407 1480140 1487190 1494725 1502272 1510278 1519414 1529828 1541663
53285 1541663 1555814 1573276 1593832 1616285 1640138 1666372 1696243 1729871 1766310 1804496 1843717
53274 1843717 1883458 1923275 1962850 2002006 2040678 2078865 2116387 2152652 2186907 2218811 2248534
53263 2248534 2276272 2301901 2325200 2346159 2364928 2381643 2396364 2409018 2419331 2426966 2431719 2433324
53251 2433324 2431135 2424401 2412978 2397461 2378472 2356121 2330281 2300988 2268300 2232076 2192307 2149552
53239 2149552 2104820 2059136 2013368 1968146 1923524 1878898 1833718 1788348 1743916 1701239 1660223
53228 1660223 1620425 1581813 1544651 1508874 1473987 1439609 1405725 1372274 1338823 1305014 1271125
53217 1271125 1237824 1205533 1174501 1145489 1119628 1097168 1076878 1057232 1037900 1019406 1001587
$$ packed form
53299A465382j618N1J252K152L006M182N733P050P535P547Q006R136J0414J1835
53285A541663J4151J7462K0556K2453K3853K6234K9871L3628L6439L8186L9221
53274A843717L9741L9817L9575L9156L8672L8187L7522L6265L4255L1904K9723
53263B248534K7738K5629K3299K0959J8769J6715J4721J2654J0313P635M753J605
53251B433324k189o734j1423j5517j8989k2351k5840k9293l2688l6224l9769m2755
53239B149552m4732m5684m5768m5222m4622m4626m5180m5370m4432m2677m1016
53228A660223l9798l8612l7162l5777l4887l4378l3884l3451l3451l3809l3889
53217A271125l3301l2291l1032k9012k5861k2460k0290j9646j9332j8494j7819
$$ plain form
53206 1001587 983286 963721 943380 923148 903157 883109 863295 844513 826999 810004 792612
53195 792612 774611 756429 738546 721212 704510 688315 672192 655578 638261 620658 603531
53184 603531 587409 572230 557420 542253 526373 510191 494748 480928 468661 457107 445665
53173 445665 434586 424437 415257 406516 397729 388782 379773 370878 362331 354259 346472 338673 330918 323667
53159 323667 317324 311854 306860 301916 296911 292190 288209 284849 281268 276782 271734 267135 263532 260685
53145 260685 258238 256120 254188 252060 249605 247127 244874 242758 240828 239472 238739 237933 236399 234425 232767
53130 232767 231554 230246 228625 227197 226545 226819 227947 229879 232384 235088 237980 241557 246144 251269 256014
53115 256014 259841 262883 265631 268586 271994 275478 278017 278705 277591 275482 272876 269570 265432 261046
$$ packed form
53206A001587j8301j9565k0341k0232j9991k0048j9814j8782j7514j6995j7392
53195G92612j8001j8182j7883j7334j6702j6195j6123j6614j7317j7603j7127
53184F03531j6122j5179j4810j5167j5880j6182j5443j3820j2267j1554j1442
53173D45665j1079j0149r180q741q787q947r009q895q547q072p787p799p755p251
53159C23667o343n470m994m944n005m721l981l360l581m486n048m599l603k847
53145B60685k447k118j932k128k455k478k253k116j930j356p33q06j534j974j658
53130B32767j213j308j621j428o52K74J128J932K505K704K892L577M587N125M745
53115B56014L827L042K748K955L408L484K539O88j114k109k606l306m138m386
$$ plain form
53101 261046 257068 253257 248715 243098 237053 231383 226220 221226 216193 211122 205960 200666 195405 190400
53087 190400 185679 181209 177234 174171 172170 170892 169736 168177 165998 163345 160475 157414 154039 150670
53073 150670 148198 147275 147479 147699 147264 146317 145195 143955 142651 141655 141413 142035 143201 144339 144908 144771 144363
53056 144363 144226 144375 144383 144106 143893 143975 144057 143789 143330 143113 143238 143408 143309 142816 141949 140897 140010 139513 139194 138638
53036 138638 137795 137115 137003 137237 137064 135952 134238 132932 132801 133625 134418 134355 133484 132633 132719 134001 135795 136935
53018 136935 136731 135501 134127 133204 132815 132907 133449 134131 134331 133718 132770 132535 133780 136284 138853 140103 139478
53001 139478 137610 135679 134464 134019 134012 134102 134171 134459 135299 136510 137314 137293 137126 137812 139323 140733 141589 142330
52983 142330 143218 143801 143814 143859 144575 145761 146997 148686 151723 156293 161672 167154 172617 178202 183924 189709
$$ packed form
53101B61046l978l811m542n617o045n670n163m994n033n071n162n294n261n005
53087A90400m721m470l975l063k001j278j156j559k179k653k870l061l375l369
53073A50670k472r23K04K20m35r47j122j240j304r96k42O22J166J138N69j37m08
53056A44363j37J49Qk77k13Q2Q2k68m59k17J25J70r9m93q67j052q87m97l19n56
53036A38638q43o80j12K34j73j112j714j306j31Q24P93o3q71q51Q6J282J794J140
53018A36935k04j230j374r23l89R2N42O82K00o13r48k35J245K504K569J250o25
53001A39478j868j931j215m45pR0O9K88Q40J211Q04k1j67O86J511J410Q56P41
52983A42330Q88N83J3M5P16J186J236J689L037M570N379N482N463N585N722N785
$$ plain form
52967 189709 195495 201183 206596 211486 215429 217911 218671 217921 216136 213870 211747 210166 208800 206886 204356
52952 204356 202169 201013 200178 198434 195666 192817 190404 188003 185329 182900 181267 180229 179261 178256 177385
52937 177385 176588 175685 174787 174163 173783 173381 172960 172887 173408 174262 174928 175117 174900 174384 173542 172450 171515 171157 171309
52918 171309 171541 171709 172094 172774 173241 172971 172083 171140 170554 170540 171313 172785 174258 175001 175015 174720 174001 172331
52900 172331 169933 168020 167484 167921 168392 168624 168954 169480 169921 170193 170495 170870 171144 171398 172006 173086 174264
52883 174264 175161 175823 176390 176668 176382 175760 175395 175436 175288 174355 172909 171901 171972 172899 174015 174884 175483 175979
52865 175979 176542 177229 177952 178691 179773 181593 183905 185723 186283 185942 185775 186503 188186 190685 193857 197314
52849 197314 200705 204407 209336 215735 222582 228563 233285 237114 240205 242284 243274 243602 243786 244068 244464
$$ packed form
52967A89709N786N688N413M890L943K482P60p50j785k266k123j581j366j914k530
52952B04356k187j156q35j744k768k849k413k401k674k429j633j038r68j005q71
52937A77385p97r03q98o24l80m02m21p3N21Q54O66J89k17n16q42j092r35l58J52
52918A71309K32J68L85O80M67k70q88r43n86j4P73J472J473P43J4k95p19j670
52900A72331k398j913n36M37M71K32L30N26M41K72L02L75K74K54O08J080J178
52883A74264Q97O62N67K78k86o22l65M1j48r33j446j008P1R27J116Q69N99M96
52865A75979N63O87P23P39J082J820K312J818N60l41j67P28J683K499L172L457
52849A97314L391L702M929O399O847N981M722L829L091K079R90L28J84K82L96
$$ plain form
52834 244464 244744 244263 242243 238510 233818 229235 225327 221965 218689 215062 210909 206562 202786 200118 198191
52819 198191 195968 192789 189038 185653 183126 181149 179073 176501 173476 170331 167470 165186 163530 162344
52805 162344 161388 160444 159389 158255 157177 156190 155128 153834 152419 151116 149922 148615 147164 145847 144802
52790 144802 143658 141914 139618 137458 136111 135626 135517 135314 134888 134259 133281 131679 129414 126848 124511 122739
52774 122739 121558 120730 119838 118476 116606 114668 113206 112403 112080 111917 111536 110585 109101 107635 106614 105665
52758 105665 104047 101735 99541 98032 96869 95465 93874 92632 92030 91903 91931 91799 91192 89940 88233 86523
52742 86523 85253 84617 84395 84025 83123 81950 81016 80274 79196 77709 76421 75680 75086 74320 73805 73971 74451
52725 74451 74740 75188 76470 78391 80026 80940 81454 81802 81904 81989 82617 83843 85072 85935 86703 87626 88533 89361
$$ packed form
52834B44464K80m81k020l733m692m583l908l362l276l627m153m347l776k668j927
52819A98191k223l179l751l385k527j977k076k572l025l145k861k284j656j186
52805A62344r56r44j055j134j078r87j062j294j415j303j194j307j451j317j045
52790A44802j144j744k296k160j347m85j09k03m26o29r78j602k265k566k337j772
52774A22739j181q28q92j362j870j938j462q03l23j63l81r51j484j466j021r49
52758A05665j618k312k194j509j163j404j591j242o02j27K8j32o07j252j707j710
52742H6523j270o36k22l70r02j173r34p42j078j487j288p41n94p66n15J66M80
52725G4451K89M48J282J921J635R14N14L48J02Q5O28J226J229Q63P68R23R07Q28
$$ plain form
52707 89361 90397 91640 92474 92497 92307 93014 95243 98861 103347 108045 112339 115985 119143 121897 123977 125149
52691 125149 125574 125459 124678 123113 121191 119616 118643 117882 116795 115140 112984 110530 107941 105224 102325
52676 102325 99437 97037 95415 94240 92818 90802 88551 86743 85655 84856 83679 82004 80371 79204
52662 79204 78197 76779 75017 73519 72531 71667 70637 69644 68828 67834 66367 64811 63884 63892 64635 65813 67100
52645 67100 68068 68414 68239 67858 67449 67140 67138 67447 67620 67276 66777 66928 67982 69305 70160 70495 70780 71337 72063
52626 72063 72731 73300 73851 74326 74496 74296 74025 74000 74068 73736 72833 71717 70700 69670 68535 67682 67552 67971
52608 67971 68363 68606 69179 70438 72134 73803 75283 76633 77752 78387 78447 78134 77753 77475 77291 77148 77107 77401
52590 77401 78277 79748 81514 83163 84474 85473 86114 86070 85047 83420 82257 82408 83694 85216 86346 87084
$$ packed form
52707H9361J036J243Q34K3j90P07K229L618M486M698M294L646L158K754K080J172
52691A25149M25j15p81j565j922j575r73p61j087j655k156k454k589k717k899
52676A02325k888k400j622j175j422k016k251j808j088p99j177j675j633j167
52662G9204j007j418j762j498r88q64j030r93q16r94j467j556r27QP43J178J287
52645F7100R68L46j75l81m09l09kL09J73l44m99J51J054J323Q55L35K85N57P26
52626G2063O68N69N51M75J70k00k71k5O8l32r03j116j017j030j135q53j30M19
52608F7971L92K43N73J259J696J669J480J350J119O35O0l13l81k78j84j43m1K94
52590G7401Q76J471J766J649J311R99O41m4j023j627j163J51J286J522J130P38
$$ plain form
52574 87084 87601 88036 88794 90458 93036 95694 97638 98934 100176 101676 103441 105662 108605 112015 115114
52559 115114 117234 118234 118431 118506 119337 121391 124188 126718 128438 129506 130047 129774 128558 126976 125947 126032
52543 126032 127222 129100 130990 132270 132883 133379 134188 134990 135067 134151 132740 131644 131450 132263 133721 135239
52527 135239 136422 137229 137685 137698 137341 137122 137571 138612 139649 140235 140361 140139 139668 139239 139246 139614 139702 139050 137924
52508 137924 136778 135530 133904 132339 131881 132909 134420 134934 133951 132262 130981 130519 130436 130076 129241 128403
52492 128403 128275 129197 130894 132750 134201 134950 135078 135038 135339 136096 136991 137772 138603 139774 141244 142640 143619
52475 143619 144060 144063 143957 144187 144910 145731 146078 145907 145808 146332 147322 147998 147695 146528 145316 144800 144957 145193 145153
52456 145153 145085 145415 146289 147647 149370 151164 152657 153874 155247 156804 157816 157787 157391 157711 158760 159590
$$ packed form
52574H7084N17M35P58J664K578K658J944J296J242J500J765K221K943L410L099
52559A15114K120J000J97P5Q31K054K797K530J720J068N41k73j216j582j029Q5
52543A26032J190J878J890J280O13M96Q09Q02P7r16j411j096j94Q13J458J518
52527A35239J183Q07M56J3l57k19M49J041J037N86J26k22m71m29PL68Q8o52j126
52508A37924j146j248j626j565m58J028J511N14r83j689j281m62q3l60q35q38
52492A28403j28R22J697J856J451P49J28m0L01P57Q95P81Q31J171J470J396R79
52475A43619M41Lj06K30P23Q21L47j71r9N24R90O76l03j167j212n16J57K36m0
52456A45153o8L30Q74J358J723J794J493J217J373J557J012k9l96L20J049Q30
$$ plain form
52440 159590 159832 160259 161616 163647 165653 167356 168762 169683 169910 169561 168836 167707 166201 164694 163486 162311
52424 162311 160719 158808 157174 156134 155333 154100 151959 148915 145462 142344 140097 138794 138217 138113 138126
52409 138126 137743 136578 134736 132720 131005 129771 128902 128140 127267 126210 125000 123775 122979 123303 125008 127397
52393 127397 129515 131344 133664 136576 138910 139587 139028 138569 138899 139735 140720 141909 143335 144768 146057 147311
52377 147311 148626 149966 151345 152807 154163 155124 155775 156656 158237 160492 163070 165626 167862 169508 170563
52362 170563 171573 173424 176613 180678 184505 187354 189404 191215 192925 194381 195819 197810 200496 203493
52348 203493 206647 210185 213819 216486 217553 217819 218651 220442 222488 224122 225402 226823 228888 231801 235156
52333 235156 238165 240602 243147 246253 249115 250619 251037 251798 253549 255433 256551 257256 258485 260412 262370
$$ packed form
52440A59590K42M27J357K031K006J703J406R21K27l49p25j129j506j507j208j175
52424A62311j592j911j634j040q01j233k141l044l453l118k247j303n77j04J3
52409A38126l83j165j842k016j715j234q69p62q73j057j210j225p96L24J705K389
52393A27397K118J829K320K912K334O77n59m59L30Q36R85J189J426J433J289J254
52377A47311J315J340J379J462J356R61O51Q81J581K255K578K556K236J646J055
52362A70563J010J851L189M065L827K849K050J811J710J456J438J991K686K997
52348B03493L154L538L634K667J067K66Q32J791K046J634J280J421K065K913L355
52333B35156L009K437K545L106K862J504M18P61J751J884J118P05J229J927J958
$$ plain form
52318 262370 263844 265172 267357 271304 276999 283332 288984 293560 297701 302228 307577 313875 320946 328135
52304 328135 334796 341192 348430 357226 367140 377287 387408 397971 409573 422494 436564 451236
52292 451236 466046 481126 496998 513810 531149 548641 566223 583670 600505 616717 633087
52281 633087 650355 668441 686791 705004 722613 738740 752769 765252 777531 790364 803274
52270 803274 815250 825652 834416 841700 847522 851591 853523 853336 851690 849510 847497 846030 845228 844807
52256 844807 844071 842420 839894 837026 834273 831782 829548 827499 825497 823567 822143 821876 823219 826250 830789
52241 830789 836463 842871 849978 858279 868157 879130 890054 900182 909718 919268 929116 939283 949981
52228 949981 961522 973811 986193 997912 1008524 1017815 1025529 1031409 1035435 1037897 1039262 1040038 1040539
$$ packed form
52318B62370J474J328K185L947N695O333N652M576M141M527N349O298P071P189
52304C28135O661O396P238Q796R914J0147J0121J0563J1602J2921J4070J4672
52292D51236J4810J5080J5872J6812J7339J7492J7582J7447J6835J6212J6370
52281F33087J7268J8086J8350J8213J7609J6127J4029J2483J2279J2833J2910
52270H03274J1976J0402Q764P284N822M069J932j87j646k180k013j467q02m21
52256H44807p36j651k526k868k753k491k234k049k002j930j424k67J343L031M539
52241H30789N674O408P107Q301R878J0973J0924J0128R536R550R848J0167J0698
52228I49981J1541J2289J2382J1719J0612R291P714N880M026K462J365P76N01
$$ plain form
52215 1040539 1040523 1039209 1036059 1031528 1026626 1021660 1015939 1008916 1001019 992944 984611 975489 965594 955400
52201 955400 945001 934202 923489 913995 906208 899354 892417 885203 878127 871477 865293 859522 853940
52188 853940 848398 843470 840310 839359 839618 839664 839027 838021 836692 834738 832289 830040 828489 827621 827302 827418
52172 827418 827503 826815 825042 822632 820210 817928 815547 812919 810252 808045 806847 806853 807600 808191 807904 806601
52156 806601 804607 802310 799864 797191 794245 791225 788290 785096 780971 775822 770531 766090 762590 759437
52142 759437 756280 753183 749989 746231 741856 737526 733883 730849 727889 724766 721760 719241 717259 715529
52128 715529 713711 711738 709821 708072 706201 703794 700854 697811 694977 692223 689301 686293 683587 681561
52114 681561 680338 679725 679353 679042 679069 679984 682103 685294 689222 693589 698143 702705 707392 712630 718918 726642
$$ packed form
52215A040539j6j314l150m531m902m966n721p023p897q075q333r122r895j0194
52201I55400j0399j0799j0713r494p787o854o937p214p076o650o184n771n582
52188H53940n542m928l160r51K59M6o37j006j329j954k449k249j551q68l19J16
52172H27418Q5o88j773k410k422k282k381k628k667k207j198OP47N91k87j303
52156H06601j994k297k446k673k946l020k935l194m125n149n291m441l500l153
52142G59437l157l097l194l758m375m330l643l034k960l123l006k519j982j730
52128G15529j818j973j917j749j871k407k940l043k834k754k922l008k706k026
52114F81561j223o13l72l11K7R15K119L191L928M367M554M562M687N238O288P724
$$ plain form
52098 726642 736077 747221 759540 772245 785165 799183 815452 834150 854269 874642 894898 915347
52086 915347 936124 956739 976367 994433 1010867 1025974 1040188 1053842 1067026 1079546 1091030
52075 1091030 1101107 1109562 1116445 1122091 1126851 1130663 1132897 1132868 1130526 1126544 1121709 1116387 1110578 1104223
52061 1104223 1097245 1089478 1080815 1071480 1062080 1053299 1045532 1038683 1032330 1026179 1020385 1015335 1011175 1007757
52047 1007757 1005047 1003289 1002653 1003008 1004151 1006009 1008436 1011111 1013903 1017105 1021002 1025437 1030114 1035115
52033 1035115 1040708 1046731 1052590 1057882 1062700 1067312 1071865 1076386 1080748 1084571 1087460 1089416 1090724 1091380
52019 1091380 1090980 1089286 1086595 1083307 1079397 1074627 1069056 1063025 1056578 1049280 1040697 1030887 1020191 1008663
52005 1008663 995948 981818 966591 950841 934830 918470 901781 885017 868288 851364 834028
$$ packed form
52098G26642R435J1144J2319J2705J2920J4018J6269J8698K0119K0373K0256K0449
52086I15347K0777K0615J9628J8066J6434J5107J4214J3654J3184J2520J1484
52075A091030J0077Q455O883N646M760L812K234k9k342l982m835n322n809o355
52061A104223o978p767q663r335r400q781p767o849o353o151n794n050m160l418
52047A007757k710j758o36L55J143J858K427K675K792L202L897M435M677N001
52033A035115N593O023N859N292M818M612M553M521M362L823K889J956J308O56
52019A091380m00j694k691l288l910m770n571o031o447p298q583r810j0696j1528
52005A008663j2715j4130j5227j5750j6011j6360j6689j6764j6729j6924j7336
$$ plain form
51994 834028 816358 798502 780404 761965 743248 724300 705058 685648 666532 648067 630105
51983 630105 612378 595009 578221 561775 545201 528505 512191 496607 481679 467281 453466
51972 453466 440337 428059 416888 406829 397389 388183 379597 372259 365912 359554 352761 346116 340187
51959 340187 334865 330007 325899 322542 319223 315472 311880 309272 307445 305511 303161 300805 298571 295952
51945 295952 292570 288729 285114 282304 280564 279711 279183 278558 277930 277422 276613 275016 273034 271712 271457 271536
51929 271536 271012 269671 267834 265790 263684 261557 259185 256227 252764 249405 246661 244498 242689 241191
51915 241191 239921 238555 236935 235385 234228 233222 231883 230161 228362 226581 224688 222862 221660 221447
51901 221447 221974 222620 222883 222649 222203 221993 222190 222534 222715 222725 222663 222383 221717 220899 220346 220055 219646 219025 218542
$$ packed form
51994H34028j7670j7856j8098j8439j8717j8948j9242j9410j9116j8465j7962
51983F30105j7727j7369j6788j6446j6574j6696j6314j5584j4928j4398j3815
51972D53466j3129j2278j1171j0059r440r206q586p338o347o358o793o645n929
51959C40187n322m858m108l357l319l751l592k608j827j934k350k356k234k619
51945B95952l382l841l615k810j740q53n28o25o28n08q09j597j982j322k55P9
51929B71536n24j341j837k044k106k127k372k958l463l359k744k163j809j498
51915B41191j270j366j620j550j157j006j339j722j799j781j893j826j202k13
51901B21447N27O46K63k34m46k10J97L44J81J0o2k80o66q18n53k91m09o21m83
$$ plain form
51882 218542 218432 218568 218887 219600 220735 221833 222445 222586 222449 222014 221318 220813 221006 221888 223085 224454 226138
51865 226138 228124 230142 231971 233547 234856 236030 237476 239513 241888 244015 245726 247353 249076 250658
51851 250658 251992 253506 255734 258731 262117 265486 268598 271371 273876 276183 278095 279242 279505 279125 278298
51836 278298 276946 275065 272965 270964 269137 267618 266761 266598 266485 265846 265132 265454 267228 269641 271559 272507
51820 272507 272639 272308 271996 272326 273549 275158 276410 277273 278464 280406 282474 283561 283244 282043 280625 279131
51804 279131 277436 275619 273877 272171 270405 268828 267806 267155 266176 264615 263225 263074 264511 267023 269809
51789 269809 272152 273524 273858 273740 273915 274482 274840 274491 273637 272861 272504 272556 272955 273698 274634 275355 275452 274817 273664
51770 273664 272325 271150 270479 270398 270438 269843 268435 266941 266134 265853 265404 264740 264550 265122 265818 266024 265961 266118
$$ packed form
51882B18542j10J36L19P13J135J098O12J41j37m35o96n05J93Q82J197J369J684
51865B26138J986K018J829J576J309J174J446K037K375K127J711J627J723J582
51851B50658J334J514K228K997L386L369L112K773K505K307J912J147K63l80q27
51836B78298j352j881k100k001j827j519q57j63j13o39p14L22J774K413J918R48
51820B72507J32l31l12L30J223J609J252Q63J191J942K068J087l17j201j418j494
51804B79131j695j817j742j706j766j577j022o51r79j561j390j51J437K512K786
51789B69809K343J372L34j18J75N67L58l49q54p76l57N2L99P43R36P21R7o35j153
51770B73664j339j175o71q1M0n95j408j494q07k81m49o64j90N72O96K06o3J57
$$ plain form
51752 266118 266444 266732 267332 268798 271043 273531 276139 279176 282566 285688 288043 289491 289767 288455 285679
51737 285679 282320 279255 276755 274777 273395 272599 272068 271430 270586 269583 268463 267445 266892 266820 266684 266002
51721 266002 264984 264170 263620 262824 261438 259674 257775 255370 251785 247070 242426 239256 237791 236917 235403
51706 235403 232949 229966 226895 224121 222074 220789 219560 217702 215520 213918 213111 212489 211747 211331 211503
51691 211503 211773 211684 211535 211812 212459 213249 214473 216651 219832 223690 228093 233124 238645 244250 249510 254030
51675 254030 257548 260302 263002 266043 269100 271849 274738 278441 282913 287560 292071 296360 299926 302111
51661 302111 303000 303269 303016 301476 298085 293167 287357 281004 274447 268192 262386 256606 250612 244842 239801
51646 239801 235484 231801 228929 226595 223596 219088 214097 210717 209680 209561 208570 206305 203439 200560 197948
$$ packed form
51752B66118L26K88O00J466K245K488K608L037L390L122K355J448K76j312k776
51737B85679l359l065k500j978j382p96n31o38q44j003j120j018n53p2j36o82
51721B66002j018q14n50p96j386j764j899k405l585m715m644l170j465q74j514
51706B35403k454k983l071k774k047j285j229j858k182j602q07o22p42m16J72
51691B11503K70q9j49K77O47P90J224K178L181L858M403N031N521N605N260M520
51675B54030L518K754K700L041L057K749K889L703M472M647M511M289L566K185
51661C02111Q89K69k53j540l391m918n810o353o557o255n806n780n994n770n041
51646B39801m317l683k872k334k999m508m991l380j037j19r91k265k866k879k612
$$ plain form
51631 197948 195919 194624 193730 192922 192461 192687 193122 192843 191756 190866 191070 192186 193409 194220 194525 194352 193888
51614 193888 193597 193887 194731 195865 197160 198504 199488 199662 199131 198615 198871 200262 202698 205607 207969 208843
51598 208843 208172 206933 206417 207404 209943 213551 217518 221341 225147 229597 235165 241560 247996 254029 260046
51583 260046 266897 275037 284062 293132 301838 310466 319345 328149 336008 342174 346339 348502 348857 347730
51569 347730 345349 341702 336913 331619 326675 322533 319207 316695 314969 313687 312509 311791 312317 314222 316731
51554 316731 319233 322073 325924 330967 337067 344251 352465 361182 369762 377921 385452 391861 396867 400901
51540 400901 404403 406878 407455 406263 404435 402616 400344 397209 393835 391149 389247 387697 386697 387195 389790
51525 389790 393995 398651 402705 405492 406747 406671 405869 404845 403545 401463 398184 393701 388301 382362 376282
$$ packed form
51631A97948k029j295q94q08m61K26M35k79j087q90K04J116J223Q11L05j73m64
51614A93888k91K90Q44J134J295J344R84J74n31n16K56J391K436K909K362Q74
51598B08843o71j239n16R87K539L608L967L823L806M450N568O395O436O033O017
51583B60046O851Q140R025R070Q706Q628Q879Q804P859O166M165K163L55j127
51569C47730k381l647m789n294m944m142l326k512j726j282j178p18N26J905K509
51554C16731K502K840L851N043O100P184Q214Q717Q580Q159P531O409N006M034
51540D00901L502K475N77j192j828j819k272l135l374k686j902j550j000M98K595
51525C89790M205M656M054K787J255p6q02j024j300k082l279m483n400n939o080
$$ plain form
51510 376282 370336 364428 358133 351233 344105 337412 331469 326128 321260 317011 313532 310631 307836 304716
51496 304716 301144 297384 293857 290685 287494 283906 280144 276843 274338 272477 271126 270374 270090 269775 269196
51481 269196 268795 269131 270134 271247 272114 272850 273847 275593 278423 282131 286014 289639 293365 297820 303063
51466 303063 308678 314525 320891 327883 335139 342266 349257 356325 363504 370598 377389 383824 389875 395150
51452 395150 398758 399955 399062 397376 395897 394473 392551 390444 389218 389426 390559 391814 392878 393730 394075
51437 394075 393383 391444 388650 385647 382626 378965 373725 366584 358140 349223 340224 331283 322685 314594
51423 314594 306658 298478 290391 283250 277440 272619 268533 265455 263585 262473 261426 260259 259324 259001 259485
51408 259485 260997 263883 268336 274062 280328 286497 292571 299076 306311 313876 321087 327597 333266 337598
$$ packed form
51510C76282n946n908o295o900p128o693n943n341m868m249l479k901k795l120
51496C04716l572l760l527l172l191l588l762l301k505j861j351p52k84l15n79
51481B69196m01L36J003J113Q67P36R97J746K830L708L883L625L726M455N243
51466C03063N615N847O366O992P256P127O991P068P179P094O791O435O051N275
51452C95150L608J197q93j686j479j424j922k107j226K08J133J255J064Q52L45
51437C94075o92j939k794l003l021l661n240p141q444q917q999q941q598q091
51423C14594p936q180q087p141n810m821m086l078j870j112j047j167r35l23M84
51408B59485J512K886M453N726O266O169O074O505P235P565P211O510N669M332
$$ plain form
51394 337598 339765 339307 336517 332029 326237 319131 310525 300398 289152 277542 266311 255847 246176
51381 246176 237010 227813 218254 208902 201059 195474 191548 188165 184900 181805 178498 174444 170036 166372
51367 166372 163815 161598 159096 156656 154749 153077 151139 149145 147716 146942 146305 145402 144384 143716 143741 144360
51351 144360 145017 145188 144925 144625 144297 143530 142233 140868 139759 138799 138136 138454 140057 142225 144104 145783
51335 145783 147864 150335 152626 154559 156568 159044 162100 165870 170327 174805 178437 181244 184223 188194
51321 188194 193098 198603 204788 211826 219461 227221 234834 241982 247991 252341 255367 257867 259888 260403
51307 260403 258480 254416 249330 243865 237734 230483 222176 213182 203803 194534 186300 179860 174974 170617
51293 170617 166073 161463 157208 153460 150268 147869 146477 145991 146091 146459 146743 146597 145944 145032 144084 143174
$$ packed form
51394C37598K167m58k790m488n792p106q606j0127j1246j1610j1231j0464r671
51381B46176r166r197r559r352p843n585l926l383l265l095l307m054m408l664
51367A66372k557k217k502k440j907j672j938j994j429p74o37r03j018o68K5O19
51351A44360O57J71k63l00l28p67j297j365j109r60o63L18J603K168J879J679
51335A45783K081K471K291J933K009K476L056L770M457M478L632K807K979L971
51321A88194M904N505O185P038P635P760P613P148O009M350L026K500K021N15
51307B60403j923m064n086n465o131p251q307q994r379r269q234o440m886m357
51293A70617m544m610m255l748l192k399j392m86J00L68K84j46o53r12r48r10
$$ plain form
51277 143174 142513 142456 142932 143239 142754 141578 140158 138659 137151 136034 135583 135250 134189 132524 131443 131796
51261 131796 133150 134469 135235 135528 135499 135251 135018 134956 134845 134394 133796 133619 134043 134604 134785 134581 134260 133831 133030
51242 133030 131742 130123 128332 126431 124583 123081 122005 121047 119867 118541 117476 116953 116894 117039 117257 117676
51226 117676 118528 119789 120968 121528 121524 121482 121570 121348 120646 120093 120219 120481 119985 118963 118633 119615 121356 123237
51208 123237 125314 127579 129399 130299 130669 131037 131201 130780 130148 129989 130217 130174 129783 129656 130036 130371 130195 129828
51190 129828 129906 130617 131745 133148 134833 136646 138152 138912 138842 138335 137949 137945 138215 138630 139274 140237 141448 142854
51172 142854 144510 146281 147768 148828 149916 151476 153133 153950 153446 152070 150605 149391 148105 146121 143089
51157 143089 139377 135864 133188 131333 129960 128799 127502 125609 123133 120863 119549 119041 118712 118448 118563
$$ packed form
51277A43174o61n7M76L07m85j176j420j499j508j117m51l33j061j665j081L53
51261A31796J354J319P66K93k9k48k33o2j11m51n98j77M24N61J81k04l21m29q01
51242A33030j288j619j791j901j848j502j076r58j180j326j065n23n9J45K18M19
51226A17676Q52J261J179N60mm2Q8k22p02n53J26K62m96j022l30R82J741J881
51208A23237K077K265J820R00L70L68J64m21o32j59K28m3l91j27L80L35j76l67
51190A29828P8P11J128J403J685J813J506P60p0n07l86mK70M15O44R63J211J406
51172A42854J656J771J487J060J088J560J657Q17n04j376j465j214j286j984l032
51157A43089l712l513k676j855j373j161j297j893k476k270j314n08l29k64J15
$$ plain form
51142 118563 118888 118752 117941 117016 116580 116783 117643 119178 121031 122592 123876 125792 129129 133601 138150 141892
51126 141892 144480 145881 146237 145808 144831 143434 141709 139680 137193 134134 130753 127483 124465 121662 119441
51111 119441 118462 118805 119713 120420 120787 120910 120703 120221 119892 119993 120338 120863 122038 124104 126300 127520 127516 126911
51093 126911 126328 126147 126847 128711 131174 133214 134552 135785 137237 138411 138834 138733 138419 137621 136061 134339
51077 134339 133553 134149 135614 137153 138231 138587 138372 138320 139287 141327 143623 145502 147096 148748 150225 151067
51061 151067 151500 152326 153823 155250 155709 155145 154224 153570 153489 154210 155878 158291 161003 163739 166402 168668
51045 168668 170019 170412 170564 171231 172414 173565 174397 175064 175612 175738 175267 174470 173677 172813 171665 170430 169637
51028 169637 169537 169835 170081 170108 169971 169712 169347 168966 168693 168635 168966 169915 171487 173282 174794 175820 176494 177065
$$ packed form
51142A18563L25j36q11r25m36K03Q60J535J853J561J284J916L337M472M549L742
51126A41892K588J401L56m29r77j397j725k029k487l059l381l270l018k803k221
51111A19441r79L43R08P07L67J23k07m82l29J01L45N25J175K066K196J220mo05
51093A26911n83j81P00J864K463K040J338J233J452J174M23j01l14p98j560j722
51077A34339p86N96J465J539J078L56k15n2R67K040K296J879J594J652J477Q42
51061A51067M33Q26J497J427M59n64r21o54q1P21J668K413K712K736K663K266
51045A68668J351L93J52O67J183J151Q32O67N48J26m71p97p93q64j148j235p93
51028A69637j00K98K46K7j37k59l65l81k73n8L31R49J572J795J512J026O74N71
$$ plain form
51010 177065 177845 179225 181369 183876 186064 187669 189039 190612 192429 194251 195920 197539 199492 202330
50996 202330 206302 210953 215515 219771 224254 229447 235236 241373 248018 255412 263267 270952 278178 285268
50982 285268 292900 301814 312460 324586 337413 350542 364447 379806 396802 415577 436936 461794
50970 461794 490085 521009 554348 590765 630753 674080 720474 770104 823012 878647 936325
50959 936325 995583 1055681 1115286 1173169 1228850 1282040 1331755 1376521 1415222 1447309 1472330
50948 1472330 1489907 1500245 1504342 1503570 1499085 1491516 1481036 1467984 1453651 1440200 1429401 1421471
50936 1421471 1415399 1410165 1405178 1399639 1392201 1381650 1367633 1350389 1329903 1305652 1277186 1244654
50924 1244654 1208555 1169143 1126351 1080412 1032250 983034 933501 884080 835637 789614 747168
$$ packed form
51010A77065P80J380K144K507K188J605J370J573J817J822J669J619J953K838
50996B02330L972M651M562M256M483N193N789O137O645P394P855P685P226P090
50982B85268P632Q914J0646J2126J2827J3129J3905J5359J6996J8775K1359K4858
50970D61794K8291L0924L3339L6417L9988M3327M6394M9630N2908N5635N7678
50959I36325N9258O0098N9605N7883N5681N3190M9715M4766L8701L2087K5021
50948A472330J7577J0338M097p72m485p569j0480j3052j4333j3451j0799p930
50936A421471o072n234m987n539p438j0551j4017j7244k0486k4251k8466l2532
50924A244654l6099l9412m2792m5939m8162m9216m9533m9421m8443m6023m2446
$$ plain form
50913 747168 708411 672714 639651 609431 582575 559330 539337 521671 505376 490165 476566
50902 476566 465219 456099 448595 442261 437212 433703 431498 429875 428260 426771 425950 426026 426652 427449 428568
50887 428568 430406 432981 435912 438933 442003 444927 447334 449198 451014 453302 456335 460463 466177 473463
50873 473463 481475 489346 497188 505892 516106 527784 540624 554503 569533 586015 604443 625318
50861 625318 648912 675309 704596 736853 772096 810492 852699 899787 952868 1012857 1080425
50850 1080425 1155974 1239698 1331769 1432300 1540932 1656640 1778238 1904955 2036227 2170983
50840 2170983 2307332 2442747 2574191 2698093 2810737 2909010 2990854 3055132 3101360 3129603
50830 3129603 3140501 3135407 3116656 3087552 3051734 3012408 2972258 2933965 2900304 2873482 2854389
$$ packed form
50913G47168l8757l5697l3063l0220k6856k3245j9993j7666j6295j5211j3599
50902D76566j1347r120p504o334n049l509k205j623j615j489q21P6O26P97J119
50887D28568J838K575K931L021L070K924K407J864J816K288L033M128N714P286
50873D73463Q012P871P842Q704J0214J1678J2840J3879J5030J6482J8428K0875
50861F25318K3594K6397K9287L2257L5243L8396M2207M7088N3081N9989O7568
50850A080425P5549Q3724R2071J00531J08632J15708J21598J26717J31272J34756
50840B170983J36349J35415J31444J23902J12644R8273Q1844O4278M6228K8243
50830C129603J0898n094j8751k9104l5818l9326m0150l8293l3661k6822j9093
$$ plain form
50819 2854389 2842572 2836784 2835379 2836154 2836046 2831286 2818292 2794579 2758820 2710212 2648267 2573392 2487185
50806 2487185 2391741 2288860 2180302 2068467 1956147 1845592 1738405 1636437 1542141 1457620
50796 1457620 1383659 1320058 1266628 1223401 1190041 1165660 1149597 1142171 1144285 1156160 1176594 1203646
50784 1203646 1235970 1273233 1315154 1360381 1406467 1450727 1490991 1525791 1554301 1576131 1590979
50773 1590979 1598473 1598586 1592165 1580790 1565993 1548602 1528630 1505517 1478530 1447325 1412269 1374147
50761 1374147 1333587 1290995 1247037 1202971 1160437 1121013 1085771 1054971 1028254 1005439 987100
50750 987100 974032 966259 962978 963448 967403 974441 983629 994164 1006172 1020441 1037577 1057728 1081040
50737 1081040 1108009 1139396 1175969 1218320 1266761 1321486 1382880 1451494 1527437 1609872 1697233
$$ packed form
50819B854389j1817n788j405P75j08m760j2994k3713l5759m8608o1945p4875q6207
50806B487185r5444j02881j08558j11835j12320j10555j07187j01968r4296q4521
50796A457620p3961o3601n3430m3227l3360k4381j6063p426K114J1875K0434K7052
50784A203646L2324L7263M1921M5227M6086M4260M0264L4800K8510K1830J4848
50773A590979P494J13o421j1375j4797j7391j9972k3113k6987l1205l5056l8122
50761A374147m0560m2592m3958m4066m2534l9424l5242l0800k6717k2815j8339
50750I87100j3068p773l281M70L955P038R188J0535J2008J4269J7136K0151K3312
50737A081040K6969L1387L6573M2351M8441N4725O1394O8614P5943Q2435Q7361
$$ plain form
50726 1697233 1787809 1879943 1971781 2061117 2145552 2222717 2290499 2347309 2392102 2423954 2441657
50715 2441657 2444156 2431530 2405452 2368531 2323351 2272227 2217755 2163250 2112365 2068080 2031855
50704 2031855 2003641 1982598 1967818 1958435 1953286 1950686 1948599 1944906 1937510 1924339 1903527 1873753
50692 1873753 1834558 1786498 1731137 1670759 1607822 1544405 1482182 1422895 1368590 1321090 1281202
50681 1281202 1248698 1223215 1205011 1194780 1192885 1199093 1213099 1235178 1266231 1307265 1358889 1421342
50669 1421342 1494848 1579658 1675453 1780722 1892926 2009216 2126718 2242135 2351582 2451314
50659 2451314 2538694 2612494 2672593 2719738 2755374 2781233 2798779 2808942 2812189 2808621 2798109 2780599
50647 2780599 2756401 2726138 2690536 2650365 2606503 2560025 2512370 2465398 2420936 2380106 2343530
$$ packed form
50726A697233R0576R2134R1838Q9336Q4435P7165O7782N6810M4793L1852J7703
50715B441657K499j2626k6078l6921m5180n1124n4472n4505n0885m4285l6225
50704B031855k8214k1043j4780r383n149k600k087l693p396j3171k0812k9774
50692A873753l9195m8060n5361o0378o2937o3417o2223n9287n4305m7500l9888
50681A281202l2504k5483j8204j0231j895O208J4006K2079L1053M1034N1624O2453
50669A421342P3506Q4810R5795J05269J12204J16290J17502J15417J09447R9732
50659B451314Q7380P3800O0099M7145L5636K5859J7546J0163L247l568j0512j7510
50647B780599k4198l0263l5602m0171m3862m6478m7655m6972m4462m0830l6576
$$ plain form
50636 2343530 2312293 2288123 2272035 2263284 2260324 2262442 2269473 2280046 2291200 2300144 2305627 2307285 2304572
50623 2304572 2297168 2285866 2272176 2257148 2241157 2224698 2208857 2195055 2184836 2179823 2181265 2189370
50611 2189370 2203291 2221718 2243197 2266013 2288422 2309269 2328032 2343964 2355537 2361171 2360344 2353485
50599 2353485 2340644 2320548 2291227 2251391 2201072 2141169 2072915 1997883 1918104 1835705 1752444
50588 1752444 1669789 1589283 1512471 1440431 1373559 1311810 1254893 1202395 1154119 1110445 1071941
50577 1071941 1038526 1009359 983804 962101 944785 931718 922126 915382 911393 910297 912187 917188
50565 917188 925457 937021 951774 969666 990759 1015085 1042616 1073366 1107444 1145081 1186808 1233500
50553 1233500 1285981 1344578 1409256 1480194 1557869 1642347 1732595 1826640 1922305 2017605 2110462
$$ packed form
50636B343530l1237k4170j6088q751k960K118P031J0573J1154Q944N483J658k713
50623B304572p404j1302j3690j5028j5991j6459j5841j3802j0219n013J442Q105
50611B189370J3921J8427K1479K2816K2409K0847J8763J5932J1573N634q27o859
50599B353485j2841k0096k9321l9836n0319n9903o8254p5032p9779q2399q3261
50588A752444q2655q0506p6812p2040o6872o1749n6917n2498m8276m3674l8504
50577A071941l3415k9167k5555k1703j7316j3067r592o744l989j096J890N001
50565I17188Q269J1564J4753J7892K1093K4326K7531L0750L4078L7637M1727M6692
50553A233500N2481N8597O4678P0938P7675Q4478R0248R4045R5665R5300R2857
$$ plain form
50542 2110462 2198439 2279155 2351177 2414429 2469608 2517462 2558939 2595891 2630948 2666138 2701658
50531 2701658 2736196 2768290 2797111 2822257 2843589 2861752 2878705 2897297 2920160 2948850 2983796
50520 2983796 3024784 3071411 3123238 3179597 3239224 3299984 3359006 3413317 3460535 3498923 3526736
50509 3526736 3541755 3541835 3525970 3494572 3448640 3388966 3316364 3232489 3140102 3042604 2943473 2846021
50497 2846021 2753398 2668696 2595009 2535183 2491163 2463427 2451077 2452461 2465732 2489055 2520594
50486 2520594 2558313 2599643 2641202 2678857 2708051 2724280 2723675 2703597 2662900 2601883 2522293 2427396
50474 2427396 2321502 2208903 2093128 1977110 1863561 1754662 1651615 1554967 1465286 1383102
50464 1383102 1308349 1240457 1179134 1124527 1076560 1034601 998103 967057 941499 920913 904541
$$ packed form
50542B110462Q7977Q0716P2022O3252N5179M7854M1477L6952L5057L5190L5520
50531B701658L4538L2094K8821K5146K1332J8163J6953J8592K2863K8690L4946
50520B983796M0988M6627N1827N6359N9627O0760N9022N4311M7218L8388K7813
50509C526736J5019Q0j5865l1398m5932n9674p2602q3875r2387r7498r9131r7452
50497B846021r2623q4702p3687n9826m4020k7736j2350J384J3271K3323L1539
50486B520594L7719M1330M1559L7655K9194J6229o05k0078m0697o1017p9590r4897
50474B427396j05894j12599j15775j16018j13549j08899j03047r6648q9681q2184
50464A383102p4753o7892o1323n4607m7967m1959l6498l1046k5558k0586j6372
$$ plain form
50453 904541 891962 883013 877406 874885 875523 879279 885357 892654 901066 911768 925865 943095 962253
50440 962253 982602 1004304 1027480 1051528 1075717 1100200 1125911 1153450 1182440 1212144 1242407
50429 1242407 1273663 1306121 1339285 1372403 1405118 1437480 1469450 1500654 1530710 1559633 1587775
50418 1587775 1615362 1642161 1667753 1692180 1716258 1741095 1767314 1794822 1823396 1853335 1885374
50407 1885374 1919906 1956356 1993398 2029851 2065406 2100440 2135010 2168016 2197471 2221648 2239929
50396 2239929 2252508 2259384 2259797 2252528 2236449 2210672 2174491 2127597 2070477 2004391 1930916 1851758
50384 1851758 1769142 1686020 1605399 1529367 1459043 1395375 1339543 1292419 1254173 1224771 1204523
50373 1204523 1193637 1191502 1196972 1209255 1227800 1251176 1276653 1301213 1322517 1338623 1347512 1347633
$$ packed form
50453I04541j2579q949n607k521O38L756O078P297Q412J0702J4097J7230J9158
50440I62253K0349K1702K3176K4048K4189K4483K5711K7539K8990K9704L0263
50429A242407L1256L2458L3164L3118L2715L2362L1970L1204L0056K8923K8142
50418A587775K7587K6799K5592K4427K4078K4837K6219K7508K8574K9939L2039
50407A885374L4532L6450L7042L6453L5555L5034L4570L3006K9455K4177J8281
50396B239929J2579O876M13p269j6079k5777l6181m6894n7120o6086p3475p9158
50384A851758q2616q3122q0621p6032p0324o3668n5832m7124l8246k9402k0248
50373A204523j0886k135N470J2283J8545K3376K5477K4560K1304J6106Q889J21
$$ plain form
50361 1347633 1338788 1321828 1297554 1266492 1229714 1189115 1146576 1103231 1059825 1017327 976778
50350 976778 938853 903970 872557 844686 819574 796076 773743 752970 734026 716573 700493
50339 700493 686640 676016 668366 662299 656947 652887 651100 651490 653029 655062 657857 661859 667150 673890
50325 673890 682666 693806 706720 720515 735107 751034 768126 785157 801162 816573 832580 849802
50313 849802 868140 887611 908524 930829 953982 977634 1001864 1026473 1050549 1073135 1094007
50302 1094007 1113412 1131399 1147811 1162668 1175951 1187140 1195464 1200660 1203032 1202718 1199421 1193080 1184375
50289 1184375 1174227 1163014 1150545 1136544 1120789 1102893 1082390 1059243 1034144 1008192 982262
50278 982262 956583 930863 904863 878969 854164 831323 810520 791022 771951 752917 734091
$$ packed form
50361A347633q845j6960k4274l1062l6778m0599m2539m3345m3406m2498m0549
50350I76778l7925l4883l1413k7871k5112k3498k2333k0773j8944j7453j6080
50339G00493j3853j0624p650o067n352m060j787L90J539K033K795M002N291O740
50325F73890Q776J1140J2914J3795J4592J5927J7092J7031J6005J5411J6007J7222
50313H49802J8338J9471K0913K2305K3153K3652K4230K4609K4076K2586K0872
50302A094007J9405J7987J6412J4857J3283J1189Q324N196K372l14l297o341q705
50289A184375j0148j1213j2469j4001j5755j7896k0503k3147k5099k5952k5930
50278I82262k5679k5720k6000k5894k4805k2841k0803j9498j9071j9034j8826
$$ plain form
50267 734091 715880 698671 682836 668804 656920 647178 639177 632427 626659 621844 618077 615544 614400
50254 614400 614435 614998 615547 616308 618029 621064 624988 629244 633722 638343 642412 644953 645803 645926 646367 647087
50238 647087 647080 645557 642751 639503 636302 632963 629183 625057 620862 616524 611603 605824 599457 593076 587103
50223 587103 581591 576314 571067 565996 561728 559001 558068 558524 559778 561589 564113 567560 571909 576855 581954
50208 581954 586812 591205 595051 598335 601095 603322 604743 604961 604028 602686 601589 600394 598097 594310 589606
50193 589606 584560 579084 573088 567157 561976 557479 553161 548959 545117 541392 537117 532180 527267 522919
50179 522919 518838 514356 509119 503078 496235 488881 481809 475832 471095 467153 463725 461081 459679 459579
50165 459579 460331 461305 462072 462576 463056 463698 464196 463663 461213 456833 451535 446451 441872 437381 432788 428421
$$ packed form
50267G34091j8211j7209j5835j4032j1884r742q001o750n768m815l767k533j144
50254F14400L5N63N49P61J721L035L924M256M478M621M069K541Q50J23M41P20
50238F47087pj523k806l248l201l339l780m126m195m338m921n779o367o381n973
50223E87103n512n277n247n071m268k727r33M56J254J811K524L447M349M946N099
50208E81954M858M393L846L284K760K227J421K18r33j342j097j195k297l787m704
50193E89606n046n476n996n931n181m497m318m202l842l725m275m937m913m348
50179E22919m081m482n237o041o843p354p072n977m737l942l428k644j402j00
50165D59579P52R74P67N04M80O42M98n33k450m380n298n084m579m491m593m367
$$ plain form
50149 428421 424517 420873 417390 414469 412405 410761 408883 406858 405365 404656 404247 403673 403052 402733 402795 403074
50133 403074 403356 403432 403282 403307 404057 405652 407817 410577 414411 419458 425064 430550 436118 442475 449711 457062
50117 457062 463867 470366 477382 485413 494118 502543 509787 515538 520152 524281 528434 532748 536970 540646
50103 540646 543480 545596 547256 548374 548592 547934 547091 546815 547283 548276 549717 551675 554002 556438 559088 562385
50087 562385 566536 571385 576935 583588 591526 600166 608573 616343 623739 631082 638443 645989 654180 663358
50073 663358 673440 684261 695924 708444 721260 733703 745911 758752 772658 787070 801291
50062 801291 815381 829752 844304 858585 872595 886764 901167 915447 929633 944409 960269
50051 960269 976833 993358 1009595 1025861 1042573 1060083 1078716 1098585 1119524 1141576 1165546
$$ packed form
50149D28421l904l644l483k921k064j644j878k025j493p09m09n74o21l19O2K79
50133D03074K82P6j50K5P50J595K165K760L834N047N606N486N568O357P236P351
50117D57062O805O499P016Q031Q705Q425P244N751M614M129M153M314M222L676
50103E40646K834K116J660J118K18o58q43k76M68R93J441J958K327K436K650L297
50087E62385M151M849N550O653P938Q640Q407P770P396P343P361P546Q191R178
50073F63358J0082J0821J1663J2520J2816J2443J2208J2841J3906J4412J4221
50062H01291J4090J4371J4552J4281J4010J4169J4403J4280J4186J4776J5860
50051I60269J6564J6525J6237J6266J6712J7510J8633J9869K0939K2052K3970
$$ plain form
50040 1165546 1192770 1224330 1260704 1302131 1349032 1402098 1462249 1530554 1607854 1694076 1787727
50029 1787727 1885873 1984422 2078472 2162877 2233204 2286730 2322909 2343136 2350278 2348314 2341861 2335255
50017 2335255 2331575 2332421 2338322 2348725 2361170 2370805 2371489 2357781 2326239 2275589 2206611 2122073 2026203
50004 2026203 1923660 1818790 1715379 1616371 1523510 1437547 1358915 1287921 1224338 1167402 1116402
49993 1116402 1070833 1029789 991864 956089 922480 891273 862166 834886 809940 787938 768427
49982 768427 750246 732935 717010 702785 689742 677387 666054 656396 648478 641769 635819 630561
49970 630561 626041 622119 618524 615243 612807 611975 612812 614305 615248 615428 615520 615983 616699 617705 619521 622339
49954 622339 625408 627675 628786 629120 629275 629910 631799 635448 640713 647024 653940 661277 669002 677347 686837
$$ packed form
50040A165546K7224L1560L6374M1427M6901N3066O0151O8305P7300Q6222R3651
50029A787727R8146R8549R4050Q4405P0327N3526L6179K0227P142j964o453o606
50017B335255l680Q46N901J0403J2445R635O84j3708l1542n0650o8978q4538r5870
50004B026203j02543j04870j03411r9008r2861q5963p8632p0994o3583n6936n1000
49993A116402m5569m1044l7925l5775l3609l1207k9107k7280k4946k2002j9511
49982G68427j8181j7311j5925j4225j3043j2355j1333r658p918o709n950n258
49970F30561m520l922l595l281k436q32Q37J493R43J80R2M63P16J006J816K818
49954F22339L069K267J111L34J55O35J889L649N265O311O916P337P725Q345R490
$$ plain form
49939 686837 697810 710029 723128 737275 752973 770324 788976 808803 830243 853853 879917
49928 879917 908574 940069 974774 1013339 1056855 1106588 1163455 1228164 1302030 1387143 1485373
49917 1485373 1597421 1723082 1861954 2013156 2174256 2340779 2506778 2665708 2811276
49908 2811276 2938708 3046192 3135155 3208883 3270775 3323875 3371404 3416819 3462778 3509956 3556665
49897 3556665 3599188 3632322 3650103 3646953 3618945 3564575 3484828 3382722 3262667 3129700 2988720
49886 2988720 2843908 2698363 2553985 2411764 2272509 2137507 2008378 1886276 1771452
49877 1771452 1663672 1562874 1469196 1382606 1302907 1230046 1164045 1104554 1050828 1002321 958985
49866 958985 920794 887309 857966 832485 810539 791190 773176 755825 739216 723323 707499
$$ packed form
49939F86837J0973J2219J3099J4147J5698J7351J8652J9827K1440K3610K6064
49928H79917K8657L1495L4705L8565M3516M9733N6867O4709P3866Q5113R8230
49917A485373J12048J25661J38872J51202J61100J66523J65999J58930J45568
49908B811276J27432J07484Q8963P3728O1892N3100M7529M5415M5959M7178M6709
49897C556665M2523L3134J7781l150k8008n4370p9747j02106j20055j32967j40980
49886B988720j44812j45545j44378j42221j39255j35002j29129j22102j14824
49877A771452j07780j00798r3678q6590p9699p2861o6001n9491n3726m8507m3336
49866I58985l8191l3485k9343k5481k1946j9349j8014j7351j6609j5893j5824
$$ plain form
49855 707499 691078 674168 657498 641643 626705 612592 599313 586968 575647 565320 555740 546611
49843 546611 537994 530342 523906 518287 512893 507687 503127 499457 496485 494064 492363 491507 491233 491066 490627
49828 490627 489779 488799 488403 489187 490897 492636 494025 495739 498620 502654 507213 511991 517187 522959 529275
49813 529275 536235 544088 552890 562583 573518 586530 602378 621251 642882 666847 692804 720873
49801 720873 751997 787719 829426 877967 934032 998604 1072858 1157813 1254034 1361140 1477170
49790 1477170 1598482 1720461 1838167 1946310 2039394 2112951 2165170 2197364 2213023 2216657 2213248
49779 2213248 2207830 2204703 2206589 2214237 2226368 2239766 2249586 2249955 2234752 2198664 2138665 2055335 1952734
49766 1952734 1836665 1712821 1586308 1462003 1344209 1235575 1136827 1047856 968773 899755
$$ packed form
49855G07499j6421j6910j6670j5855j4938j4113j3279j2345j1321j0327r580r129
49843E46611q617p652o436n619n394n206m560l670k972k421j701q56k74j67m39
49828D90627q48r80l96P84J710J739J389J714K881M034M559M778N196N772O316
49813E29275O960P853Q802R693J0935J3012J5848J8873K1631K3965K5957K8069
49801G20873L1124L5722M1707M8541N6065O4572P4254Q4955R6221J07106J16030
49790A477170J21312J21979J17706J08143R3084P3557N2219L2194J5659L634l409
49779B213248n418l127J886P648J2131J3398R820L69j5203l6088n9999q3330j02601
49766A952734j16069j23844j26513j24305j17794j08634r8748q8971p9083o9018
$$ plain form
49756 899755 840370 789619 746410 709563 677573 649135 623997 602699 585171 570121 556221
49745 556221 543497 532939 524882 518366 512209 506286 501468 498538 497301 496675 495506 493416 491027 489400
49731 489400 489193 490223 491686 492731 492903 492242 491002 489306 487107 484490 481792 479321 477121 475192 473794
49716 473794 473148 472936 472400 471079 469164 467074 464984 462919 461040 459577 458571 457918 457596 457645 457945 458191
49700 458191 458143 457831 457514 457541 458261 459960 462781 466605 470998 475311 478962 481687 483581 485045 486709 489184
$$ packed form
49756H99755n9385n0751m3209l6847l1990k8438k5138k1298j7528j5050j3900
49745E56221j2724j0558q057o516o157n923m818k930j237o26j169k090k389j627
49731D89400k07J030J463J045J72o61j240j696k199k617k698k471k200j929j398
49716D73794o46k12n36j321j915k090k090k065j879j463j006o53l22M9L00K46
49700D58191m8l12l17K7P20J699K821L824M393M313L651K725J894J464J664K475
$$ [...]
##END NTUPLES=NMR SPECTRUM
##END=
