
##TITLE=AC1068_TOPL01_6519229_qYJ3gEzVqc
##JCAMPDX= 6.0         $$ Bruker NMR JCAMP-DX V2.0
##DATA TYPE= NMR SPECTRUM
##DATA CLASS= NTUPLES
##ORIGIN= BRUKER
##OWNER= Administrator
$$ 1.72 TOPSPIN		Version 2.1
$$ 2012-07-13 17:13:11.328 -0500  Administrator@TOPSPIN
$$ Compression mode = diff/dup
##.OBSERVE FREQUENCY= 400.02188249412
##.OBSERVE NUCLEUS= ^1H
##.ACQUISITION MODE= SIMULTANEOUS (DQD)
##.ACQUISITION SCHEME= undefined
##.AVERAGES= 8
##.DIGITISER RES= 22
##SPECTROMETER/DATA SYSTEM= spect
##.PULSE SEQUENCE= zg30
##.SOLVENT NAME= COFFEE_meoh
##.SHIFT REFERENCE= INTERNAL, COFFEE_meoh, 1, 14.98509
##AUDIT TRAIL= $$ (NUMBER, WHEN, WHO, WHERE, PROCESS, VERSION, WHAT)
$$ ##TITLE= Audit trail, TOPSPIN		Version 2.1
$$ ##JCAMPDX= 5.01
$$ ##ORIGIN= Bruker BioSpin GmbH
$$ ##OWNER= Administrator
$$ $$ C:\Bruker\TOPSPIN/data/COFFEE/nmr/AC1068_TOPL01_6519229_qYJ3gEzVqc/40/pdata/1/auditp.txt
$$ ##AUDIT TRAIL=  $$ (NUMBER, WHEN, WHO, WHERE, PROCESS, VERSION, WHAT)
(   1,<2012-07-13 17:13:04.515 -0500>,<Administrator>,<TOPSPIN>,<go>,<TOPSPIN 2.1>,
      <created by zg
	started at 2012-07-13 17:11:57.984 -0500,
	POWCHK enabled, PULCHK disabled,
       configuration hash MD5:
       6B 1B 68 BB D9 2E 58 E2 7F 35 AD 54 07 DF 0E 41
       data hash MD5: 64K
       73 57 C0 83 F4 DD C6 D2 24 22 D0 C0 80 BC 44 44>)
(   2,<2012-07-13 17:13:07.265 -0500>,<Administrator>,<TOPSPIN>,<proc1d>,<TOPSPIN 2.1>,
      <Start of raw data processing
       efp LB = 0 FT_mod = 6 PKNL = 1 PHC0 = 0 PHC1 = 0 SI = 32K 
       data hash MD5: 32K
       6E ED 6B 2F 3A BE D1 C5 E3 62 28 4B E7 07 E1 12>)
(   3,<2012-07-13 17:13:07.625 -0500>,<Administrator>,<TOPSPIN>,<proc1d>,<TOPSPIN 2.1>,
      <pk PHC0 = 177.1875 PHC1 = 0 
       data hash MD5: 32K
       0C C3 BA D5 27 2F AE E0 4C 8F 81 6A FF 02 47 28>)
(   4,<2012-07-13 17:13:07.718 -0500>,<Administrator>,<TOPSPIN>,<proc1d>,<TOPSPIN 2.1>,
      <abs ABSG = 1 
       data hash MD5: 32K
       FE DB FC E2 69 3D 36 78 B5 4E 8F BC C5 AF 17 4F>)
(   5,<2012-07-13 17:13:07.750 -0500>,<Administrator>,<TOPSPIN>,<proc1d>,<TOPSPIN 2.1>,
      <abs ABSG = 2 
       data hash MD5: 32K
       B1 30 18 49 36 D5 1B DA 48 DC AA C6 2A 77 85 A8>)
(   6,<2012-07-13 17:13:07.765 -0500>,<Administrator>,<TOPSPIN>,<proc1d>,<TOPSPIN 2.1>,
      <abs ABSG = 3 
       data hash MD5: 32K
       D6 DB 49 3F 46 9C EC 9A 0F F1 1F C5 2E C2 BA C7>)
(   7,<2012-07-13 17:13:07.812 -0500>,<Administrator>,<TOPSPIN>,<proc1d>,<TOPSPIN 2.1>,
      <abs ABSG = 4 
       data hash MD5: 32K
       8F 11 E3 3C 97 F5 40 36 D8 32 C5 7A AA BA DD 4E>)
(   8,<2012-07-13 17:13:07.828 -0500>,<Administrator>,<TOPSPIN>,<proc1d>,<TOPSPIN 2.1>,
      <abs ABSG = 5 
       data hash MD5: 32K
       00 35 85 5F B9 88 01 CE C2 F1 1A DE AA 04 9F 04>)
$$ ##END=
$$ 
$$ $$ hash MD5
$$ $$ 73 2C D1 E0 40 69 AD E6 ED 66 73 23 25 31 5D 91
##$RELAX= 
##$RELAX= 
##$RELAX= 
##$RELAX= 
##$RELAX= 
##$RELAX= 
##$RELAX= 
##$RELAX= 
$$ Bruker specific parameters
$$ --------------------------
$$ [...]
150 150 150 150 150 150 150 150
##$TP07= 0
##$TPNAME0= <>
##$TPNAME1= <>
##$TPNAME2= <>
##$TPNAME3= <>
##$TPNAME4= <>
##$TPNAME5= <>
##$TPNAME6= <>
##$TPNAME7= <>
##$TPOAL= (0..7)
0.5 0.5 0.5 0.5 0.5 0.5 0.5 0.5
##$TPOFFS= (0..7)
0 0 0 0 0 0 0 0
##$TUNHIN= 0
##$TUNHOUT= 0
##$TUNXOUT= 0
##$USERA1= <user>
##$USERA2= <user>
##$USERA3= <user>
##$USERA4= <user>
##$USERA5= <user>
##$V9= 5
##$VALIST= <valist>
##$VCLIST= <CCCCCCCCCCCCCCC>
##$VD= 0
##$VDLIST= <DDDDDDDDDDDDDDD>
##$VPLIST= <PPPPPPPPPPPPPPP>
##$VTLIST= <TTTTTTTTTTTTTTT>
##$WBST= 2048
##$WBSW= 25
##$XGAIN= (0..3)
0 0 0 0
##$XL= 0
##$YL= 0
##$YMAX_a= 495059
##$YMIN_a= -645219
##$ZGOPTNS= <>
##$ZL1= 120
##$ZL2= 120
##$ZL3= 120
##$ZL4= 120
##$ABSF1= 14.98509
##$ABSF2= -5.573092
##$ABSG= 5
##$ABSL= 3
##$ALPHA= 0
##$AQORDER= 0
##$ASSFAC= 0
##$ASSFACI= 0
##$ASSFACX= 0
##$ASSWID= 0
##$AUNMP= <proc_prof1d_extract_pilot.lims>
##$AXLEFT= 0
##$AXNAME= <>
##$AXNUC= <1H>
##$AXRIGHT= 0
##$AXTYPE= 0
##$AXUNIT= <>
##$AZFE= 0.1
##$AZFW= 0.1
##$BCFW= 0
##$BC_mod= 0
##$BYTORDP= 0
##$COROFFS= 0
##$CY= 15
##$DATMOD= 1
##$DC= 0
##$DFILT= <>
##$DTYPP= 0
##$F1P= 0
##$F2P= 0
##$FCOR= 0.5
##$FTSIZE= 32768
##$FT_mod= 6
##$GAMMA= 0
##$GB= 0
##$INTBC= 1
##$INTSCL= 1
##$ISEN= 128
##$LB= 0
##$LEV0= 0
##$LPBIN= 0
##$MAXI= 10000
##$MC2= 0
##$MEAN= 0
##$ME_mod= 0
##$MI= 0
##$NCOEF= 0
##$NC_proc= -8
##$NLEV= 6
##$NOISF1= 0
##$NOISF2= 0
##$NSP= 0
##$NTH_PI= 0
##$NZP= 0
##$OFFSET= 14.98509
##$PC= 1
##$PHC0= 177.1875
##$PHC1= 0
##$PH_mod= 1
##$PKNL= yes
##$PPARMOD= 0
##$PPDIAG= 0
##$PPIPTYP= 0
##$PPMPNUM= 2147483647
##$PPRESOL= 1
##$PSCAL= 4
##$PSIGN= 0
##$PYNMP= <proc.py>
##$REVERSE= no
##$SF= 400.02
##$SI= 32768
##$SIGF1= 0
##$SIGF2= 0
##$SINO= 400
##$SIOLD= 32768
##$SPECTYP= <>
##$SREGLST= <1H.CDCl3>
##$SSB= 0
##$STSI= 32768
##$STSR= 0
##$SW_p= 8223.68421052631
##$SYMM= 0
##$S_DEV= 0
##$TDeff= 65536
##$TDoff= 0
##$TI= <>
##$TILT= no
##$TM1= 0
##$TM2= 0
##$TOPLEV= 0
##$USERP1= <user>
##$USERP2= <user>
##$USERP3= <user>
##$USERP4= <user>
##$USERP5= <user>
##$WDW= 1
##$XDIM= 32768
##$YMAX_p= 480133789
##$YMIN_p= -777173
##$CURPLOT= <Network HP LaserJet P1505>
##$CURPRIN= <$Network HP LaserJet P1505>
##$DFORMAT= <normdp>
##$LAYOUT= <+/1D_H.xwp>
##$LFORMAT= <normlp>
##$PFORMAT= <normpl>
##$SURQMSG= 1
$$ End of Bruker specific parameters
$$ ---------------------------------
##NTUPLES= NMR SPECTRUM
##VAR_NAME=  FREQUENCY,     SPECTRUM/REAL,   SPECTRUM/IMAG
##SYMBOL=    X,             R,               I
##VAR_TYPE=  INDEPENDENT,   DEPENDENT,       DEPENDENT
##VAR_FORM=  AFFN,          ASDF,            ASDF
##VAR_DIM=   32768,         32768,           32768
##UNITS=     HZ,            ARBITRARY UNITS, ARBITRARY UNITS
##FACTOR=    0.250966925370066, 1,           1
##FIRST=     8223.43324360094, 133341,       -11057
##LAST=      0,             -10642,          -338360
##MIN=       0,             -777173,         0
##MAX=       8223.43324360094, 480133789,    0
$$ Real data points
##PAGE= N=1
##DATA TABLE= (X++(R..R)), XYDATA
$$ [...]
23760 147188 40433 -287395 134659 52402 -108552 142635 116320 105223 95925 -112471 -225600
23749 -225600 28093 9742 258373 -131036 249994 191819 175040 89455 229437 -78607 136061
23737 -233986 -131153 112063 334350 -83674 196889 -15388 127393 58815 -98920 -17343
23726 -144336 198111 -338114 395637 -184219 -9942 -136601 1980 174919 -272395 109757
23715 40508 -180416 112623 -344729 -91384 -220419 177347 -247780 160398 -119317 129374
23704 155757 -201916 100737 381167 -70086 77651 195999 165891 -182081 -8974 264322
23693 -100786 -80515 -380726 -234409 -158762 161301 -130681 -153112 -105490 -125785 -271073
23683 -271073 73169 -198678 -79793 -136223 -352472 -3263 -118960 183022 -62605 22592 287822
23672 287822 189810 221009 213548 92556 164883 125252 56452 -65318 -273577 -99820 101517
23660 149241 -8037 99734 -225987 -271878 217078 238679 -197749 113789 39906 -322180 -199303
23649 -199303 5689 -200461 -296401 163503 -54613 -51213 -38746 -88763 -313713 82952 209760
23638 209760 20507 -38753 191153 303945 -102199 -232020 191452 -218557 -153339 80193
23627 -53362 258474 -308598 243249 -71619 227456 193096 31784 -188616 -141176 -103226 270756
23615 41160 -139224 256214 19282 210741 134053 334666 -128638 22936 -40049 -192207
23605 -192207 -287152 -97502 -113173 322027 -424854 -116496 101695 -75539 69568 -50885 276656
23593 -142360 216435 198705 278324 -129804 178422 255312 190196 42280 279383 371740 111197
23581 -201617 -50162 86209 -38574 -332314 18671 46648 -165092 28773 2474 285214 -122592
23569 29656 348929 -20871 -72950 312524 -145788 -34849 -208577 -120241 94195 13665 228474
23558 228474 365268 -119660 -45217 301942 -59797 -208809 178755 119575 32475 -30215
23547 -132389 -18536 141229 -485313 310333 67691 -145211 -243233 258158 233122 303863
23537 303863 4355 243721 260036 -205644 -206027 81892 -175196 188264 42582 -121215 126191
23525 -90372 -218247 -101024 364057 -443869 58032 -201291 -61100 -255744 -18220 -311989
23515 -311989 -44085 -210776 -106473 -114967 235793 -60564 -162799 30841 114169 44104 -13684
23503 189647 -248690 -790 -360437 -310732 38425 -23337 28180 -287907 -53313 293355 -153089
23491 371440 -80494 -40210 392006 -38383 190048 -198159 9411 275625 206 -146370 36863
23479 422648 -2374 168922 -174411 -51219 -46976 18758 26118 -16810 -247232 37698 386621
23468 386621 103925 -120592 22061 177197 497700 -371743 51742 27033 -59948 355480
23457 -193112 -8518 -143079 407 -160777 -396925 -24717 111953 226205 -164786 235491 -79549
23445 540753 224223 -354307 -6885 -167715 91675 90850 -35182 -127045 -123879 16356 -1546 -139483
23433 -139483 -236071 -197565 -266506 203495 252487 -46192 -52181 -83276 -58367 -426132 30486
23421 111597 112851 -89990 -155680 25743 -373612 67887 83826 88668 -87701 138718 -45801
23409 -348196 -405548 -131147 -119849 228620 145622 34017 -38301 -62206 -35148 -164747 124447
23397 134434 -91116 -23786 242847 86801 45753 74371 -295975 -162806 34471 -70072 -126176
23386 -126176 61103 77971 -178136 -262581 -203052 200136 -302113 -54239 208815 -229218
23375 102038 67069 163187 68460 -410277 -239220 222654 -202545 -174487 -6536 -163348 -106432
23364 -106432 117542 14619 -256604 -18176 -153792 -265783 -223634 148337 133722 -254431
23353 137585 167524 -54996 -187426 -27189 -29994 -42723 -6015 119642 108073 -177603 -130010
23342 -130010 -191802 -44 84481 38882 -89609 -10377 214773 -134999 213528 -297330 -295925
23331 -295925 194053 -115529 55914 -289482 -268088 36906 -187628 -160960 -48628 -337316
23321 -337316 -107748 -542633 -52288 80342 -131776 -122162 -269009 132844 78031 376056
23311 376056 -51906 51800 -261471 206139 -12326 121981 -51461 24588 39894 -233731 -83088
23299 102983 73900 93854 65133 44432 -841 148474 -151542 -43577 -120376 -34557 218499
23287 88641 -226084 -204447 45452 304390 207661 -194721 -173865 -339217 -105364 166500
23276 375112 -203556 -46702 -305628 -274947 149595 -95968 -195726 -266755 15758 -29268 -94182
23265 -94182 41286 -316189 -26244 -161155 -273146 160171 101653 -335256 -155177 30736
23254 -224793 -262839 -278061 -301257 57608 2944 -122705 17326 146078 285956 -227887 32827
23242 -81013 40535 -215065 -161208 -189751 -14026 24015 -251848 195907 300965 174942 -127553
23230 -200219 -186529 -91934 -144886 -160508 -151036 27553 -6403 8795 56353 -71963 -706323 -156959
23217 205598 -20885 -20743 -46705 282534 291809 -170572 -48966 -220276 -166401 -7716 16008 4537
23204 87469 -107121 -97296 329572 -28408 273527 109000 -132683 -118561 -45628 -84448 -197666
23193 -197666 -182890 -95486 -108393 -344921 -54729 -291487 -188060 77798 -9692 53322 13638
23181 94043 -12371 -172976 -65763 120911 -36962 53137 -152104 231872 201934 90519 156021
23170 156021 -236335 47449 -106686 -75450 -95534 -88979 -86568 206978 -115634 -191460 -79676
23158 -170330 -137193 167286 -6564 55223 -303778 -137787 13043 -190273 -136047 -354111 180719
23146 117859 -30937 -196012 20674 182070 53354 784 -183232 19921 27159 -5562 -87333 -41537
23133 270554 -24630 -157586 94684 76993 275658 -124339 171266 -176486 13124 170767
23123 170767 -192121 58780 178080 -17031 -25935 -13949 -13048 -61059 -272864 68138 -38103
23111 30968 53368 -119180 -158275 6817 25856 324478 -11865 -43525 153243 48851 497778
23100 497778 165260 211096 23713 103604 413205 -134183 212617 62210 -217859 -27122
23089 124760 -38420 487995 -87771 -365001 194824 52050 -83260 -6630 -186612 -8015 397328
23077 73048 -165166 163645 -23117 -159091 180335 -54914 -318252 400121 122289 35055
23066 105088 165463 -33551 -298341 24008 370202 -224775 277787 -2043 -52332 5592 -81459
23054 236673 30823 -137623 351340 -162372 -126367 243347 56882 -355612 31907 -104019
23043 -253958 -207302 198827 33008 -175470 -292215 -67086 -1346 270086 -137225 -69789 105448
23031 219364 -180435 93537 -60156 97920 303386 -208029 55354 136088 -37175 350838 120661
23019 -301238 42417 112012 6256 220390 112736 216217 257630 26973 -160874 -114313 -364956
23008 -364956 72510 -276976 -876 32072 399593 -183866 -120894 -351409 -82152 359477 67016
22996 -74833 -366544 -194455 -139447 335116 30510 -216563 -47788 35135 -254813 -181503 -17148
22984 125700 177764 -141305 22132 21681 125971 -109054 58263 -53132 92955 87956 -160390
22972 123353 -285543 362806 75892 -256462 237805 -15100 -168662 -167181 -160955 -209574 -71887
22960 -325474 -91027 36399 -27234 -267606 357843 35299 -16894 -156152 122725 -362540
22949 81301 -105839 70660 -89978 -211521 -86860 32545 -226146 208044 42607 284479 320842
22938 320842 147157 -209501 18301 -114985 -35224 293975 65794 -277858 20080 -70431
22927 -76874 -239994 143536 -39369 -327930 -73121 140828 -268182 15937 4384 -75923 -136937
22916 -136937 -148504 8630 13121 507 -1224 168705 -67843 -199458 -81412 220818 -147597 -194907
22904 -194907 91999 67516 -322688 -148246 220590 -141525 75896 -155405 23449 -90127
22893 -172598 94239 -247018 -122198 -27300 152885 -27511 -41860 121675 11681 -271099
22882 179838 7264 39747 -100910 -368050 -89480 -414257 -49590 -9954 -24506 -289839 12985
22870 -14315 -217475 -11758 -375265 -256458 5932 41295 -204384 -139848 -319720 117513 391858
22859 391858 -6243 -103161 -199640 -190174 -334465 -19588 -495796 86853 -291712 57784 -266635
22847 87790 29714 -194218 -71304 -203101 153402 -133556 184411 60 -167927 32440 178904
22836 178904 -232194 272420 176089 298811 43218 110068 196812 51013 135150 -69867 6841
22824 258512 22771 25344 83778 -349071 -248847 -135269 -345979 -153651 93606 -5774 112988
22812 -68942 -63211 -32005 -5656 -13965 -201181 223660 -75944 91701 294162 35318 -91270 -115721
22800 -115721 -78678 -261142 -6692 -20235 -17022 117332 -248175 -90775 -48371 -317198 126065
22788 213979 -14859 -82741 -18108 -157994 257814 256597 -406620 -22774 -113829 89129 -245563
22776 -210862 121986 124132 -50220 -267393 166222 199673 -89079 69314 -44015 -8653 -188003
22765 -188003 -154632 -112188 8852 -259324 262853 217674 -17392 -90975 79778 -135341 -29642
22753 -179168 122469 289995 10574 -123698 43658 -52122 -9048 -48018 144427 -64561 -17737
22741 -365864 -258413 198678 -4993 -15554 54111 131821 149625 83907 -52780 -270895 -382026
22730 -382026 -199161 -57569 -134714 70799 183820 22515 4260 -87062 152545 -86899 -27834
22718 177457 -323385 -243785 23855 -148647 -193986 -33591 -253646 -209978 162664 -82936 -333833
22707 -333833 -31630 -224719 -407439 59664 -76248 57820 81983 -36135 78068 -189395 221102
22695 -155537 -33498 -326112 -110272 -340841 -301932 131715 27964 -137638 426690 -246415
22684 87606 268546 32488 -36539 343742 22306 194866 149040 -78010 -219748 -110064 -470206
22673 -470206 -154974 -80761 189184 -69091 -483266 162299 255106 -56617 61670 109232 -65155
22661 -15855 -210257 -248530 153911 -96430 253042 -83897 292504 23176 -87008 -118368 -9278
22649 137038 117851 -4424 68960 -136837 187848 -237558 58067 197071 107263 -161915 -138508
22638 -138508 -124298 -138810 -43298 108814 -49258 -170329 171242 -21838 -283769 78208 -66302
22626 54875 -243112 165678 223617 258405 -399148 159550 325065 283769 26250 -14524 245342
22614 -6441 158884 197890 -21249 264289 -12372 40989 279843 126831 63442 59163 -96036
22602 -131648 463712 -10276 -415930 -31097 -237820 -103840 -565546 48435 185535 61108
22591 108257 -125445 -74303 -234912 -101621 255126 -390108 -56488 130679 -59011 93745
22580 41742 117343 -52646 -22659 -338692 -209459 -381049 -168357 -263453 -214430 -250238 -291262
22569 -291262 93542 93023 -31970 -164451 -346536 -60271 -196585 66098 -24346 -15969 2313 146668
22557 146668 -215914 35819 -177950 -110988 196487 7081 27840 178898 -213393 -14312 26448
22545 302019 512511 -120277 43940 -242046 232812 -232422 30281 53031 -187264 -389579
22535 -389579 -233355 106488 -271847 -31288 -186390 -89495 59022 -293070 297892 91208
22524 -151024 -58933 -184372 -291792 -61922 -98050 135463 -337063 69193 -38198 -26736 -22734
22513 -22734 -46624 -148369 -81101 -24049 -378688 332170 95067 -201332 -38927 79018 -1026
22501 168922 72572 -198015 187637 25119 -56364 -74294 -95506 -410400 51127 -480436 -411113
22490 -411113 241165 -61294 102782 54100 -243723 -77725 -43429 -250601 76674 -71748 94165
22478 187532 -14356 50627 -98483 22925 -67439 -94174 -24504 76949 -359837 -96580 -211089
22467 -211089 137237 -8831 82804 -154005 183047 -245989 -61768 -101909 -143958 166665 88478
22456 88478 -38884 -66078 -224078 -18162 -128524 169514 -172050 139861 -318188 108119
22445 161970 63957 166136 228522 -81449 -228666 -191753 -136776 -213124 -205263 172477 282751
22434 282751 31536 6153 -174058 -48897 -110312 28212 -107838 -95994 137668 -136464 233700
22422 -119758 101867 161308 53340 114968 103272 71978 -164221 -285712 75260 -324083 -148498
22410 -20288 -215661 -120741 -63712 -263199 -124080 40823 3967 -167175 -31568 106064 22974
22398 -159261 37260 228372 -115016 -110545 -109000 -104212 -206793 -323459 -83885 -49105 -15293
22386 223845 102343 46215 38976 329687 -113147 -83484 80051 -55948 -66762 -128081 -352148
22375 -352148 121116 -275389 16753 -49198 52271 75709 -313979 -131493 -193347 -349987
22365 -349987 67362 -44981 185809 232055 22697 -168354 -29794 -126380 -131834 -96728 -108113
22354 -108113 -22167 -54316 -302805 -30584 -186721 -333498 -158681 -79530 -256582 46069
22343 -61036 30571 47503 5768 29647 -228343 56900 56826 -325244 -12940 -95502 -9569 -49240
22331 -49240 238296 -34608 -43208 51368 -57085 88688 -355443 347820 115584 -201816 -147015
22320 -147015 -33817 -104281 47612 -96716 -211912 -508620 108145 154669 -322499 7182 -160527
22308 154532 -38460 -194919 -45617 83069 192571 -369362 -49431 -119890 221637 303096 116407
22296 -80043 -42356 -80366 -256045 -178270 -58188 -531498 92277 -101837 30989 112871 -153569
22284 -197488 -114178 -75687 -377337 -8536 -253954 240407 -150936 -176717 -146318 84026 -119564
22272 -378006 127226 80132 68631 -49204 -54686 24679 -319598 -227974 103794 131054 -142985
22260 190263 -260921 188612 -225283 -102905 349837 240365 60706 -7109 -37160 256734
22249 -185581 134400 -84090 11995 76673 -105034 153734 144498 120850 324029 31962 -150334
22237 -178159 -13277 -885 -111035 -74780 -16202 88626 -55571 -282373 -190711 43220 131300
22226 131300 324434 -304728 85777 -10746 -384980 41659 98828 -187414 182415 60605
22215 143735 38744 37023 -217454 -325710 249498 58698 -23199 -218803 33317 15880 -98196
22203 -41636 -150189 -51818 -83754 -53828 51786 -84011 -73573 -176049 -170437 -79441 -167422
22192 -167422 51307 34781 144760 -64928 -38138 -59879 181852 -198790 -275672 -115657 -2509
22180 -93227 -269375 17236 -78132 38730 -119842 97113 223888 -452185 -273306 -48665 -365675
22169 -365675 324688 -54663 -116109 -183510 188763 159457 -37584 -275844 307399 -319488
22158 53727 -235414 -178752 -130507 242903 -409661 -15187 -240536 -411628 29354 -144639
22147 -57124 -162114 -75703 -56293 -107082 -102786 150774 -127497 277952 3119 161675 -270083
22135 -38833 -159090 88265 56106 -188574 -303458 -81458 6366 -225676 -118796 28707 63742
22124 63742 -350609 -492392 -282993 -42152 11824 172533 -176722 400905 -12554 172965
22113 132287 -33463 -30264 27841 41892 -171950 201254 -160592 -141845 -165840 4355 22170
22102 22170 -158769 106631 446565 292618 -472813 12134 -310832 192915 -17205 -267020
22092 -267020 143753 48783 93498 -332964 -249648 246062 -291979 -126277 79919 -234622
22081 89167 -24005 -223772 -46292 188862 -229673 31635 -8056 -109018 80216 295830 -244618
22069 -360978 -390292 92518 -1063 57832 217275 74164 -93168 170716 -156716 -48316 -393088
22058 -393088 -63872 4832 297605 -49841 -122065 31262 -199470 -151267 -155285 -257415 -179520
22047 -179520 -83005 -151286 75487 -291502 67459 -1313 59343 376065 98237 -41518 -147990
22036 -147990 143951 -161680 4090 -218024 -208772 -93747 -117532 15930 -11891 -153269 90716
22024 301399 -153413 -69293 38807 -369642 -124971 -8857 152019 -170162 -145018 -225029 -244128
22013 -244128 -76103 -296135 -111672 80152 130089 61538 -148811 -1959 98300 -135727 30583
22001 -234929 -182424 -501051 121486 -116174 -66819 -43677 191039 -276526 144586 381045
21991 381045 -193253 -178811 54513 -2206 -92547 36998 -184714 154801 -178054 198417 -71344
21979 -3984 -109387 -48676 105985 -267653 -59753 101854 110025 -55830 -336977 -349403 32206
21967 195136 -167715 -159081 191750 11002 -69745 -234764 42713 -256548 -156362 119664
21956 55846 33560 -65099 -95436 -394223 -133244 -119926 -281827 -10569 -255776 255769 -57521
21944 -104722 -19254 -134479 -307820 -3397 70605 164222 229669 -319287 127992 221197 -49361
21932 -8432 -22216 -256372 -4384 -230096 140389 -318250 41581 -381147 104516 330335 -146541
21920 -383210 -259533 14420 46795 -150725 160130 117848 4418 40632 -66534 -14535 -387954
21909 -387954 -77507 -199128 -211037 -76423 -121297 -30023 202318 -39324 -60797 -210837 -419172
21898 -419172 -8791 -557 188819 180761 127011 -156875 25 32093 72440 -139589 87926 -100845
21885 -247545 292110 -41822 -16234 -174925 -55001 -288715 42586 -56773 -33414 132002 -25563
21873 227197 -60190 18114 -132783 -68314 297124 -245048 -121718 -186715 -311166 -204285
21863 -204285 100047 -110329 -16565 -64999 -235634 -213945 75469 74336 -67538 21875 -84606
21851 -123977 49883 48741 -67821 318030 -20804 -116270 -107534 -58532 -159819 38354 51472
21840 51472 -50427 -85550 76182 151130 -74353 -54489 -230571 -236942 -24940 89879 78108 57443
21828 57443 -66905 -117370 53585 -80538 -301900 -159815 -167396 -169042 145628 -72525 4616 -174843
21815 155437 -159636 -312403 -267727 38908 59362 -361989 14690 158118 -408842 -221559
21805 -221559 105225 -15467 106868 -263810 -89289 -371225 -300641 -26961 281562 -173762
21794 331497 20977 -5322 -68075 -125121 -30097 -62324 189688 42698 163456 -290007 -28185
21782 -236486 350486 -15635 -64280 90683 11981 -193648 145288 -78580 -112302 -3252 -42351
21771 -42351 70745 86565 -150533 114211 -164271 -39556 238814 -125016 -110766 -49014 -96848
21760 -96848 187153 -162144 -103263 -86911 219609 -93329 27041 -205428 -195393 -193689 -298903
21749 -298903 1535 -108759 72048 23462 45968 155536 -62734 -178119 2640 -175067 -236400
21738 -236400 -44478 -73317 -204462 99441 46731 88492 251657 -9279 287760 -383397 274492
21726 55459 -2578 235925 278246 -426738 143442 39861 -110442 -237969 -166576 25598 -217507
21714 -239504 -175625 -86317 136196 79961 -306052 -246954 -364079 -351794 -270440 -18457 -35974
21703 -35974 -15568 -450604 -56173 199136 -133301 -383392 -105172 -355117 -111328 -51704
21692 -186423 106746 26111 137571 16989 -89344 175976 -246545 57840 -218418 190530
21681 -133745 -114090 -211988 -286827 -172815 56170 192771 105208 -204710 -47489 10155 -376448
21669 -199156 172742 19176 -53548 -83808 195035 -224383 22764 151651 20238 64985 -15138
21657 53097 -216387 -68085 -279182 -344978 92219 -31461 -189142 -19671 -192191 157761 -40096
21645 76 161178 -138692 -182603 -28909 5274 33680 -201767 -188270 59144 -223429 -160585 161808
21632 -231770 -225170 -225103 -240404 -40558 27277 2916 -11433 185967 84422 327501 -31795 -88928
21620 -88928 -289012 -17442 -92108 -79088 116658 -19963 -94286 -60520 -346230 -139389 90929
21608 260767 178086 -116167 -142427 62212 -205226 -140254 -92339 123681 53588 -15775 -63894
21597 -63894 -104998 -42538 261093 -196881 -230266 -123065 -52122 92615 -52310 70627 132293
21586 132293 -227915 -161425 44237 8220 -237739 73484 107949 -252499 -221734 -40605 -191857
21575 -191857 -155106 202283 202338 -50684 -80628 149560 -38080 -149852 -254452 -172959 -95694
21564 -95694 -52701 -218016 158207 -457197 100237 -145408 -231710 36201 -172339 138045
21553 -338975 -58718 -255517 41587 -311077 85334 -53889 39961 103916 -119116 91678 -112034
21541 -487707 -66576 -204852 116152 59099 -56204 207312 242649 181707 -66282 -45289 -231039
21530 -231039 -20337 78778 -49163 138195 89090 -153663 -240678 10843 -15933 52018 8089
21518 -28612 292119 -112640 211245 193749 88621 -232799 -33766 214336 -210346 -228874
21508 -228874 -138653 190993 -153753 348716 75636 234867 -77523 -220031 320633 -73186
21497 314876 -198393 -27189 -54207 -5264 199903 37841 -228206 23095 -280116 -116842 -128063
21486 -128063 -274587 210440 85367 -189796 30080 47760 -238394 -70635 17097 233226
21476 233226 80323 -132746 -75880 -36152 -26451 -204347 85059 27579 369965 -201024 64138
21464 -120203 91600 -328623 83602 -295939 -225372 -44088 -53634 -196459 -182599 -102029 31629
21452 27561 144624 68662 -105511 -66919 -145375 53858 210681 -201815 -104901 119540 -89226
21440 7818 -257425 -62889 195805 517976 441614 351018 117157 471736 233917 324261 169012
21429 169012 151662 71970 149949 -357299 -29508 78820 -185320 2335 -78451 308966 31058
21417 -125542 -322143 -3682 -300287 415593 8897 -163925 -47713 6887 151081 196227 -79138
21405 229062 39104 58093 -37177 65472 -30859 -155968 -241658 39065 225131 -76895 -145896
21394 -145896 -147745 93235 48016 -58659 195671 42068 317889 106233 6880 -139566 263217
21382 -260167 4599 -297076 -132362 81290 -157464 50775 146954 84363 -251212 -169697 11173
21370 -26410 -141903 308965 -125760 -208893 -157325 -6687 343771 -172455 -25355 147631 85512
21359 85512 -66372 -450786 -176823 -259176 70165 -15087 70324 -4001 -231812 -164279 -23595
21347 217563 -327325 -42713 181607 157359 -76904 282501 -101217 -24164 -246663 -138466
21337 -138466 -49130 -209433 -140212 136633 95706 47327 -265940 103374 -225442 18953
21326 -634749 -211538 -144414 -162986 -169766 -115445 -316601 -550 8722 -79178 -83021 223188 -181558
21313 -128523 12964 55221 -56783 -7933 -177985 -44816 23998 129790 60605 -55811 133462
21301 -244735 225266 -117280 -67119 -22237 -83059 92875 -49903 -172006 -278978 43551 149564
21290 149564 -103639 -237455 22434 -184699 72800 -234286 152827 55038 -109382 19237
21279 -348215 -211258 -72117 151393 96150 -287824 -7248 308616 110121 79702 -124883
21268 104447 274699 254747 -284234 104755 -7649 -96011 -225376 261592 -82161 -30910 -24333
21257 -24333 58601 -91945 67301 -220879 -200010 -261313 -50358 159344 -43120 -77568 -59196
21246 -59196 57440 -237168 -95347 -450698 -459690 -87820 -128019 295229 91963 -60414 -259206
21235 -259206 -132690 -56780 376224 210746 -330155 105304 -165978 -211851 -369282 159262
21224 -235756 -193485 100184 -127069 -86378 -366912 137517 418258 72315 -112370 110127
21213 -264510 385676 -233303 -244673 -208371 -118152 -27352 -168922 113300 -119244 -331452
21203 -331452 -680844 -193019 -155077 90131 -60598 -266732 -246694 67462 -102532 -70081 147738
21191 -306962 -134107 53621 70861 75278 32583 16208 -345507 -150658 -314982 -119286 -345618
21180 -345618 -397905 -512776 51281 -189259 -215391 234090 48466 -31491 484971 -175073
21169 -42160 -94273 126230 -321905 89130 258696 -40334 248118 -3873 -4240 -63366 -215799
21158 -215799 22264 -112715 296080 -595117 -280953 133633 -132125 -18542 90258 -81569
21147 -99615 271276 236 47524 -47425 77891 -77151 -243836 -157565 133719 27944 96315
21136 96315 59259 60401 -468987 -153687 -112208 -30347 267076 394741 -49141 -46592 24208
21124 -171345 110941 1372 30955 173880 242472 36421 -171227 -3681 -1005 119854 101019
21113 101019 268983 -378475 -219283 51130 -197309 83309 -72402 109109 157493 6647 -4860
21101 165667 -228246 -225576 63072 54648 12800 14151 -317813 26774 40998 -171075 -148147
21090 -148147 83691 -84188 -202277 -284769 7712 45587 22396 -38760 -138459 117915 -55839
21078 -65083 148412 -140875 -138702 -26559 71009 -192131 31368 -116986 -485241 -30512 -109260
21067 -109260 -202887 -195133 -89775 -154468 -81194 -125587 -12642 -321391 -126104 133176 -116255
21055 -4944 -127003 -67472 167596 -277307 -99908 -18010 47754 18817 -435923 -55909 -123835
21044 -123835 60902 139650 127672 -262473 -26718 -64558 217768 186145 249857 -80275 190268
21032 1206 -145565 16864 139020 207226 12492 -20633 -148042 73757 -99748 -35894 -438562
21021 -438562 -17236 7817 -66078 -156675 -156633 -283984 153365 62824 -82757 166481 143596 -100045
21008 20579 -19678 241869 576646 346366 115609 -158923 -47369 410297 47039 127768
20998 127768 -75870 -346207 -20832 103329 -251549 -60017 96587 -293282 344557 36508
20987 -72647 -136744 -274442 -120702 9394 -17660 126116 -58607 -233059 -225208 -389149 -290
20975 -245472 144318 -214316 -16956 148703 -71873 -347601 36346 -27706 -179214 173329
20964 -22270 22768 -167484 83858 177021 -68942 -294827 -294021 -118592 297060 102891 -28787
20952 144396 300499 -205826 7663 31541 -147214 132726 -169444 318983 16957 176617
20942 176617 308414 665831 395019 543700 -116180 138446 215522 -13267 -73292 -228973
20932 -228973 97910 -167969 -24145 -173830 113167 -276003 -30674 -156149 -32721 -60399
20922 -60399 -97561 18710 -144722 -177577 -140255 -153807 -216551 -30526 -382970 34172 -116010
20910 -94580 -241482 -149823 135326 -92809 -258391 -52113 122829 -316340 -195087 40410
20899 26226 -268017 271047 -81786 54238 28295 -109906 58921 -176047 -127901 -112692 87744
20887 -344902 103519 115905 271896 71679 93821 67545 -100291 -7622 -165660 192414 62307
20875 152166 148084 67226 -227867 -183531 -162068 -333253 -34649 33351 -229114 55811 -106930
20863 -4988 -115737 -340753 -292780 -11511 -109945 -175391 -112897 -23165 93861 272779 163274
20852 163274 73450 129911 -154827 37248 -342008 70800 31783 -434536 -346071 -523740 -160470
20840 74 36464 -200976 -115643 -28141 -134372 -284166 -240260 206436 -164585 58290 9304
20828 285491 -88309 -446294 -191602 -141507 -403209 -24285 -297021 21966 198052 -158121
20817 108499 96051 -59467 235999 37413 -44989 65955 -56940 -96430 37002 -12805 -297360
20806 -297360 -302144 -14685 -42790 -40918 -288394 -343651 72082 -79917 99614 -154130 157369
20794 40344 41230 314073 46950 -37207 114420 -316460 -295652 -187402 7394 26729 -344297
20782 -189096 -120486 -57105 72775 -29488 323028 237492 103727 156279 -26816 -24131 -355866
20771 -355866 -336581 -249525 124744 98657 -256307 -116711 -237555 -6771 -57562 -11986 -240223
20760 -240223 -245922 35383 -341617 169344 -329706 -116860 281802 -130318 141862 6206
20749 239114 -44097 -191857 13519 -194181 -169397 -304449 -131359 -237657 -48785 -139946
20739 -139946 337312 117967 -190862 68027 -281156 469999 -255916 -105619 -369443 85457
20728 35131 452602 -244871 -354031 -313098 -100657 153590 16272 -171823 -98539 19435
20717 160356 -330939 -50161 -288998 249762 -206974 359014 -224417 58201 -93118 -164927
20707 -164927 -207025 -22806 -60727 1060 -107247 -34662 260834 -110944 344650 -20201 238583
20695 192566 135144 -153371 -162449 66817 132628 191143 -474611 139999 285952 -52836 -47975
20684 -47975 85135 -490960 -143245 -76640 90397 -319487 4583 93821 -156650 -390198 129682
20672 -124802 -97852 -124189 -9060 56198 -125634 -258891 -227243 -160157 -388114 -189247 -704
20660 63994 -180493 118301 -154327 -42168 -198980 -44013 192103 -311920 -194103 108729
20649 126839 -99389 50891 -225606 -29535 -229600 -45285 13926 -57512 154782 -489360 94142
20637 -94802 -318222 -77001 105172 -164433 154860 -163083 -147294 -61451 23719 -197261
20626 -222952 -23169 -154055 -136642 -18837 -33573 154003 114388 69770 -243455 -346545 41786
20614 -23609 78964 -20819 411928 -259353 95743 -29944 -37592 -281533 -37857 185076 -41340
20602 181184 267017 -374001 -224083 -282622 -391087 -59426 86787 -47979 -85258 240680 -241770
20590 -120022 -440817 108971 50287 -334368 118577 14621 -164482 49811 -231782 -273194
20580 -273194 -23226 196231 -190154 -214482 -105655 104402 -204987 -42589 -284799 -297405
20570 -297405 -62286 -74127 -37049 -111605 99347 -79672 -41464 -27264 355818 -16153 -251807
20559 -251807 16703 -234032 -196804 -466961 60330 -141452 89137 18190 38799 55208 60329
20548 60329 27332 -271549 -421674 -13324 28213 183790 70999 -86751 307342 -231044 -103557
20536 -96202 -39034 -69885 341244 -75135 143750 -210014 -449741 210122 -35189 114863
20525 -274147 11302 -151006 -94742 -53225 -198720 -547366 -162016 18179 -4524 -212095 241603
20513 -271918 -245031 -129925 4797 -269403 -133404 -184283 386091 -241574 -5561 -89603 -248367
20502 -248367 -13690 53930 66558 153356 -196834 270322 -251482 36304 31053 43806 204494
20491 204494 -239969 430975 -281109 -227601 -81677 -490858 34912 804 -257895 83835 -37919
20479 89571 -347481 -132528 133885 -276344 -38346 41167 -87582 -65601 192386 -157804
20468 82702 146979 -281070 -73047 -100618 71828 -153601 -257687 91512 28265 -173834 59849
20456 225273 -44227 -29122 324165 -81821 97231 -72679 238349 -322696 19299 28370 200169
20445 200169 -184928 -36369 -327389 -19394 199496 50638 155096 -59509 123959 199047
20435 199047 154025 -387550 -292249 144025 41897 -244074 149270 121213 -141431 -51271
20424 264215 -125579 -20508 -71949 66239 -132776 -143208 -182045 183090 32519 113074 119992
20413 119992 -81929 71347 -59210 56849 -52504 -60723 71373 -159301 -291271 162980 -178443
20401 -134178 150851 -145317 -5420 -66968 70230 -48856 -64543 -67929 -142376 22642 -123496
20389 49960 102966 92507 -47995 192216 -24510 -122032 -194729 -148251 -203886 -42873 16529
20377 -147548 -238769 366305 -31751 -123590 -487603 -268429 110231 -71496 155421 -244632
20366 -55125 -258518 -104010 42991 -142072 -85681 -40068 -127831 -177667 -265789 212895 180500
20355 180500 100900 110532 -46496 218629 -380607 100830 3401 -182072 9776 317556 429265
20344 429265 262541 33250 -185984 -170099 -83888 -137053 92729 -171330 -5493 -117591 48274
20332 37428 -173677 -138443 -73463 -232012 235729 -197857 -255996 -378944 -160750 -30110
20321 164620 -81789 272299 -28640 268902 -306329 -384556 176815 -8658 215730 203362 -65846
20309 -210806 -223128 -313162 -33322 217998 297817 103503 12649 -214226 -194597 9169 -76237
20297 -185533 1617 -139317 -164929 -106778 -225375 -134172 -83799 -201205 81188 176475 -261383
20285 -57606 -134170 -250142 193847 -79383 132766 -48379 105151 -6774 -245539 120408 -236351
20273 217383 -166121 56534 -136830 -214683 63655 -168318 -8054 97494 -304291 -143313 -69361
20261 -161078 -145467 -300476 -120597 -199913 180183 239050 -120540 7912 -3389 -6893 -315044
20250 -315044 65594 -66517 116564 2762 -35364 232299 -18930 162057 -32318 -125319 -177943
20239 -177943 25583 23806 30583 -174201 -78553 -216309 -26261 -46031 270820 137001 -47437
20227 -27924 -41458 -212282 -134538 -169982 -85885 -255058 -130280 -391354 -182405 71510 -42053
20215 19591 206929 272659 33965 -146490 -88200 -410505 -289022 38276 -84149 189742 292266
20204 292266 186982 -209027 26581 -184788 -228176 -71194 83175 1726 178343 -146082 89248
20192 176250 -340758 -208892 -139854 89784 -14320 -42504 247419 51951 332703 -264275
20181 34195 -122412 -80381 470448 -73315 189906 -180343 -350191 4489 133 138679 -240205
20169 -240499 -244731 -249837 111284 -64450 272193 -48662 -195843 227840 38723 96124 -25054
20157 -210349 -96588 12128 -203128 29919 38928 149043 -66664 -46474 403835 270251 421031
20146 421031 342944 151148 151185 390840 199809 105090 330425 488804 461320 246374 259685
20135 259685 345302 -70619 -98165 -156719 -400580 -143949 -343553 58432 49543 -37893 -223022
20124 -223022 388261 -5636 33772 63772 -132618 -133959 -155779 6973 -19243 -3333 65765 -199276
20111 -50639 -123994 -49039 -9325 21933 18047 -424308 224787 -48109 92857 53717 -145970
20099 446803 -146196 -117767 69555 68616 -133198 -597033 -133727 -136118 -423436 168545 -25973
20087 -67243 -98889 -48365 61223 7860 -245096 -53259 -111318 -81560 -409537 -275532 67530
20075 132554 -263924 -66103 -61669 170948 -156447 -37613 120435 -317162 141655 25894
20064 -167906 -55823 106861 -427540 -58913 -313917 81434 -289050 -55623 -55029 -182707 -405615
20053 -405615 -216040 -113336 -90709 88777 237448 -167155 -41493 5455 157129 -163066
20042 127446 104727 -138500 -1269 53869 -81281 87166 -15801 27745 -301625 161351 -71748
20030 66978 238179 199384 -251576 -18547 39303 142089 38780 -66959 342521 -134879 23546
20018 -186358 7651 -190958 -212298 131625 -122456 -30660 134478 262898 -107331 -1150 -52203
20007 -52203 -92910 -7253 215254 -18652 -363464 60528 -141294 138894 -413501 -170374 22646
19995 358848 257315 359139 387880 393347 181862 84735 260847 151048 218614 373936
19985 373936 80255 188050 -223435 15477 161465 69346 11183 18981 -384309 252127 -163898
19973 -80716 140428 -144317 -124485 -74498 125700 4908 -183232 50453 79907 -78841 57638
19961 529812 299044 -146927 26022 186619 -344680 -48167 167791 462223 403444 437129
19951 437129 182835 237501 37561 54770 260091 -98011 -40425 57312 -13767 -53149 -29434
19940 -29434 45898 -163099 -138780 -169029 40231 -17769 193501 -7640 -174518 79567 -7490
19928 -44656 130372 -128219 -133172 -64549 -203617 -44669 55511 -193812 -181147 -1287 -167874
19917 -167874 31333 -107458 152783 37073 -34181 23528 -3251 -145315 -146477 -136357 202414
19905 171787 -64143 70612 -200791 -91610 94923 -76423 17893 -119297 88274 98595 -339459
19893 -256804 -13138 169117 -109190 -120440 -195237 92530 -400518 -133494 241316 75753
19882 -230560 -231545 -18753 239798 -60078 43029 -134791 -49113 -43977 171632 8248 -104528
19870 -268081 25652 -208976 291544 -98481 37928 -84324 175017 -137267 361094 -90547
19859 73613 235982 -243944 -214458 -269588 -210558 -389588 -67118 -127923 -199478 -301092 -144375
19847 161868 -236311 -33376 -76601 170848 53464 -67550 1487 -171141 -211328 -160794 -81901
19836 -81901 94015 188042 -45289 -148043 -429202 -29737 -20624 -9017 -56192 -58788 -45011 -175467
19824 -175467 -55505 73200 -20021 -105308 -35137 -153926 7437 -31576 -123693 -46578 -138157
19813 -138157 -205458 139754 138053 -73188 -25687 84956 291432 -57045 92974 -237345 89535
19801 -187577 152203 -317699 -165530 -279738 115525 262134 -254010 -133840 -48669 -243150
19791 -243150 -201418 -171354 63760 -143574 -121771 -6080 -299850 142518 -84732 -191529 6252
19779 105993 -61027 145927 -271536 -144169 528682 -262900 -222641 -205204 -185046 338231
19768 -391547 258273 -175160 -121024 107869 51637 -155951 -110972 -116639 -2918 -81498 107172
19756 208874 82525 125613 -228037 -60780 -181286 -244372 -108024 -10049 -318097 -60073 -97921
19745 -97921 -92224 77296 60543 -154878 12381 198662 -35666 79241 137334 -142447 -83274
19734 -83274 73424 320778 249980 262912 769469 377227 503311 211203 170289 113354 213966
19723 213966 -167435 36656 56893 -75342 -220489 -19403 -79057 -348531 6872 -37865 -334075
19712 -334075 44554 -132974 2294 401876 -91299 -77946 53521 189140 -169271 78908 342698
19701 342698 47009 174632 215720 336052 563627 367744 342128 -41559 20790 175717
19691 175717 123082 -274767 -150713 116899 -16197 -9603 -29459 -91852 -198692 181822 -71585
19679 66170 -97475 -98021 -90928 62884 -147440 26195 -219586 -13390 -89911 -298444 4691 311132
19667 311132 97632 91802 141365 29517 -141056 100570 -68136 -40340 -162213 162983 15545
19655 25021 -119076 -26586 37214 -241355 -15650 47107 37044 -197087 -294315 -1740 -99415
19644 -99415 6145 144539 79108 -174212 -241212 -96495 -331870 23041 7599 122203 49739
19632 -44709 -291643 -45545 -73981 -300042 69891 -83806 58139 54365 -295566 -163093 -29762
19620 -150831 316570 234013 -75487 159964 -96558 -8649 130738 20579 -147370 -102112 -155155
19609 -155155 -67937 -60803 -35074 124132 347994 -121402 -35771 -173324 27092 -206140 -267063
19598 -267063 -80601 -59568 -7916 -155518 206058 -103918 -5879 -386299 -140781 -124373 209064
19586 60252 -208561 17382 -120659 -98384 86447 -159154 -145589 17887 72966 -60452 112141
19574 -106503 120093 42256 -82058 -108246 -85174 -226310 -354123 60151 -47606 -8551 335432
19562 -132021 137791 -157946 59062 25584 -108461 -77784 18702 133714 -200470 -161790
19552 -161790 -127525 -65389 -8052 -52932 -263156 186284 210585 -562 -199099 -135267 -81539
19541 -81539 -348556 -159797 165036 -27912 -3361 -51180 -147723 -200419 72926 9801 -365942
19529 -358289 200143 187356 -21507 104973 -301890 -369170 6702 171491 -68834 -463919 -10309
19517 -189528 56570 -567 31500 -378064 110507 -303757 -61249 24909 4601 213965 -80519
19505 -282983 -80637 252190 115916 30683 -278807 81391 -207598 -21143 -60512 -102737 -65418
19494 -65418 70883 -289727 32033 15967 -392922 -121013 338094 -143435 210413 -190213
19483 8937 -48684 403163 -69475 -5176 82468 -159945 -226267 -74495 -118040 -82964 -337124
19472 -337124 36282 11528 -79669 270529 12294 -152276 -19068 -336037 -143810 170697
19461 -187910 65481 73920 56845 103991 -379903 -326102 143742 -70963 -199031 -4006 85939
19449 59115 9444 15524 -133550 -13486 111500 182864 -417791 -119924 -16493 224080 -147383
19437 -175058 -72303 -126922 66904 -157869 -100687 -237199 -182450 52132 202511 -116936 174463
19425 -130408 -410802 -114312 -107605 107291 -52308 -344093 -205662 -23353 -15980 -283942 15168
19413 -222987 10547 -77442 11020 -202729 -158814 -171926 -5614 -167203 -112950 -224936 -338065
19402 -338065 5447 -309944 -22992 222015 77681 236275 -137407 -160741 -27753 91516 -219480
19390 -55772 -70055 -10773 -18446 48418 -266462 -101863 -115592 -382688 -226593 -57262 44214
19378 108853 -210501 -317320 -195745 -191983 76149 -15977 -59206 -168464 -86826 55203 -235670
19366 -139664 -216986 45586 -273024 -164027 207531 -278341 -41716 -48833 85929 -249482 225487
19354 -172356 -82189 6535 -122432 -92982 -82454 -57528 50598 -249149 -119381 8509 30617
19343 30617 47004 216723 -141919 -135221 -367912 -28295 -54376 -122613 97943 22568 -52515
19331 -75221 -96952 -220351 1393 90569 4633 -75664 -221600 -247652 -319823 424996 154154
19319 137985 -258840 -256652 88769 -116047 -133837 -246999 12513 62329 -40604 8950 77154
19308 77154 -109761 -88280 -317016 185851 -19719 99775 242615 -227169 -131529 100006
19297 7652 -121990 154597 -103017 296292 16952 -232226 -29046 -20161 -58161 73143 18570
19285 325432 -239174 16294 -66149 -32274 -21539 -37899 -44930 -134448 -28406 -220574 134428
19273 31461 176439 229768 35840 262143 31116 -108815 243616 -150311 -281183 -76986
19262 111544 -65005 -253375 32812 115841 -84880 -25790 85224 -313494 5863 -113567 -216511
19251 -216511 35565 37017 233399 -295023 -367767 -218633 -272031 -48979 -297007 -142175 45569
19239 206194 -36039 332186 -200038 -358852 23631 -386009 -94655 -173959 -160455 -36400 -83164
19228 -83164 -354226 -14530 -460508 118080 -188876 426758 -137177 84853 -427652 39339
19217 -54976 -111362 190711 -69201 -199350 -265050 -338319 1454 -224748 4939 116790 92483
19206 92483 18503 -138902 -298472 29506 -282531 -226286 131311 3660 -294701 -169587 -113000
19195 -113000 -283402 -573848 -192498 23259 91397 237371 56277 -62769 -52036 -114535 -109189
19184 -109189 538983 -123744 -71486 41116 -27150 -287872 -94805 -32935 -79433 17302 -51197
19172 -209900 -314525 277411 -119243 -61410 -85346 -136916 -364220 -321321 -45432 -90073 -160047
19161 -160047 61484 -6258 -149483 47459 -123809 142260 -336207 -124797 56018 -73217 -115282
19150 -115282 -116145 108775 -234749 -99001 83374 -59708 127938 -217535 -93787 -248710 -311375
19139 -311375 -128746 -162428 -102621 -128020 -84900 10554 -105343 -42645 -281778 -345679 -119209
19127 50530 85279 -260765 -92063 144834 -41330 -15684 28391 -257498 -413305 -112604 -385422
19116 -385422 -195759 -249279 -335597 -234409 -182810 -4385 -165104 155834 -94271 -413001 126318
19104 -94032 -14730 -182186 50768 -157082 532838 -134041 -163655 -229537 -321666 -85511 54298
19092 -423541 -6559 305048 -57666 21870 21649 7869 -166100 -315617 -232715 -211929 -195736 -149189
19080 -149189 58756 392282 92274 72990 -76596 -140223 102882 181971 -235017 278166 9511
19068 141489 -214770 -175583 -306965 -125428 58677 -50398 70000 -182079 -333769 172334
19057 150223 18118 119944 27869 181664 -39088 -370323 -375671 43128 16404 39684 61441
19046 61441 -47097 -358959 -207824 -173622 -93327 -147453 -49663 210127 505514 67768 178492
19035 178492 -247154 -249427 -73631 -176125 -251543 49828 63457 -350767 182631 -222960 -6933
19023 130682 -199047 329103 6981 -12154 -171956 -109668 21547 26092 17936 -540633 -114477
19011 -17285 -301709 -38757 154645 130466 269245 -22742 306510 -46143 -153655 -32820 247467
18999 16008 104855 -108566 60498 209281 -60891 51110 -331947 189127 -236058 -240124 -201974
18988 -201974 -73976 -205192 -9687 -248606 -95941 -152861 153454 -147193 91190 172887 -225118
18976 -52153 37178 148662 49186 201795 232148 453034 363150 109662 -20207 118122 -36278
18964 -338023 -231024 -257751 -256321 -130265 -105411 -218068 -59214 77649 -46369 -119981 -139458
18953 -139458 180299 -105883 -150396 250234 -23415 74447 20553 -365779 90138 -278388
18942 -47377 54378 -285859 101693 97170 355251 -117181 92050 -1384 -72219 39561 -187816
18930 60305 -125489 -367306 -16799 74727 196886 -272421 236888 -385834 18258 70174
18920 70174 92921 18586 -25235 -175084 -146138 -493546 56070 210212 -371320 88224 20001
18908 -120162 605623 524895 328505 376607 -47388 51773 -199033 -334370 -339832 -159445 -25896
18896 -97191 -147318 67220 -150529 -37925 -209669 -425923 -70818 -109550 -18703 115489 -331615
18884 211353 -182765 -66451 92752 45392 -17319 125246 -37132 -98597 -338759 73194 69553
18873 69553 -268830 -217073 57028 69561 -173743 47663 -198577 309004 -114290 -90275 4122
18861 76971 -355599 -184708 -78069 -307299 343874 215697 329724 115031 -123523 -78502
18851 -78502 -27602 -169286 -75915 146680 253656 159154 -38327 20297 -164788 -111539 -136760
18840 -136760 227822 -492927 -7484 -377701 103330 -144490 52878 69839 -261234 -98035
18829 -21616 -224754 -338233 -73086 -153412 272078 379952 -41826 -200363 70968 264280
18819 264280 -185784 -360054 -161481 128636 -31486 -53096 -346126 -332070 59343 351685
18809 351685 93596 -16316 -192348 354828 257913 -193734 163936 172437 82444 -136599 75487
18797 5286 -38166 73260 -182501 -104765 309143 -128343 -30617 -101733 -70255 178018 -323317
18785 -1822 140428 29470 88407 -220627 218359 448279 -99558 162970 106201 -502414 -91531
18773 43390 -326260 -318119 -205793 -118175 -77593 43014 -6166 -394425 102459 -74438 -87214
18762 -87214 -214859 -2507 120893 245993 243571 58057 -126350 -28622 87599 -90598 115271
18750 190461 -32576 -232227 -45319 -141653 -73219 116899 -5166 71487 -153354 -235610 145393
18738 -162053 -3610 172394 -322633 10898 -96042 -108203 -110869 -83097 69592 -8608 -267810
18727 -267810 266674 -167020 -137781 -65366 -271650 246369 166254 105763 -50051 76924 39115
18716 39115 232337 136686 -45102 -141979 -324313 -178773 1959 -397845 -262385 24971 -241907
18704 -58758 -252443 -129851 -112685 -20494 -134352 102651 -123016 260300 137741 -217924
18693 -156353 -207422 -54851 -162015 305313 107201 98646 -9951 -38252 -189753 13097 375767
18682 375767 -12806 -98641 -144814 12656 110094 316574 -140964 -252477 160182 -131814
18671 -10649 -207282 27000 337754 -24867 205114 -130049 -115484 -211943 -128507 -20644 -38254
18660 -38254 -145481 -368672 146971 -18641 -58092 19668 209620 -221135 22692 -33955 276247
18648 154414 -222951 102825 -12970 248489 -246333 -93951 -181368 -165518 167602 -383189
18637 337386 399674 -504597 -382784 -120741 23641 -177747 -339613 -139175 -113796 -95879
18627 -95879 15196 -69093 -17329 -407942 -14189 301905 -127070 -131364 263871 72258 144773
18616 144773 -66036 22194 -135898 68662 -221613 -141211 -56408 -62501 256882 -9150 55087
18604 90624 -53297 87167 -31839 -38963 -13764 29539 -304547 -310012 41916 119932 293235 -74853
18591 161807 171254 -133748 -126192 247481 -207715 -159376 54810 -111246 -384329 227269 12681
18579 -329461 158846 118695 149102 -195134 -88054 -48036 -81643 -95273 -183031 77528 -129611
18567 -23772 -183007 -15028 -347921 -248242 212655 25997 114106 -313948 -88657 64881 -157990
18555 85607 -99240 43160 -184405 -27927 25006 4814 27595 -183713 -129088 -38967 286334
18543 184687 128115 -309181 64840 165284 -393622 -321438 312677 131503 60264 -359428
18532 -286834 -125261 -173257 -19165 5942 384970 36776 -99337 53185 15171 42048 27255
18521 27255 -106044 6062 -119709 -221011 192564 -126847 259735 125432 -315763 3982
18510 279585 -186628 -524074 -46798 284396 -247 -25763 102572 129954 74587 -302662 -150322
18498 176890 -126903 -112680 -39893 205160 -105216 -255789 -154319 -202084 63897 -409726
18487 -100085 -191869 -86511 84255 -165642 34420 86204 49801 -163507 62386 62903 -248713
18475 -265079 -15923 -78658 -103755 -269539 -36148 92168 -305329 -162106 127018 -233263
18464 29007 35074 -176760 -121588 -149117 82216 -192819 30887 -107756 123919 -322823 -91670
18452 -302449 250868 126285 -158000 14477 358389 30601 -131314 341132 258209 -367244
18441 -18808 -281278 -114501 248117 36930 -87249 260841 -54329 -85437 8836 36969 -284355
18429 332008 -6275 -19784 383890 -112263 -60820 -274182 190330 37337 -167147 260085
18418 -426622 76897 45781 196850 47171 -140162 -289520 -50501 -22617 150216 47087 92574
18407 92574 143333 -381951 2114 114636 216877 179605 -218204 -2480 -281674 97333 242188
18396 242188 -104445 380355 27097 -37036 -87287 -386736 -50396 -37917 58747 -109412 -24411
18384 -40558 127440 -62779 83156 -365030 -6343 58495 -79173 -192455 -45948 372883 167892
18372 21300 159552 40708 -47787 9598 144491 -1104 -51466 -50283 -50332 -118218 -123550 307114
18359 -254331 97692 -42263 19130 102830 165605 117377 -20191 -442365 -222014 9088 166818
18348 166818 -8129 102734 -330784 -94161 -14954 4767 79189 -321357 -25179 99298 -174586
18336 -26392 -123375 -18126 177469 47395 38128 -328833 -192882 72874 148310 -162920 -238105
18325 -238105 161852 -112065 -130147 -183092 -27450 77759 -241595 148405 -105399 98787
18314 -45806 -13339 -200504 -402996 249356 192619 -295582 -188072 232522 114659 -292862
18303 -233028 -119763 -53377 -39964 -26395 114781 67828 50838 -62103 65147 132767 -106466
18291 -147850 -122657 -20496 -121248 -190392 -13905 245564 -217362 -52299 7773 377932 -124263
18279 132111 97989 58506 -255848 -156231 165691 353707 -14218 -127545 137867 101350
18269 101350 -72703 -13112 -6061 -32491 4688 44611 362845 -61920 -102988 155259 -144777
18257 -63490 70227 13420 -160103 -123740 153833 248274 -95006 -392499 -101 -149821 284512
18245 183147 -188010 -211394 -59937 -15121 -124499 -336134 135863 95046 -146963 85860
18234 77884 -38375 -108782 -166653 301066 -130577 -224551 -9850 28422 -151768 -174196 -59754
18222 -221311 14560 186485 -268541 34205 -263741 -96207 -163681 -299258 99830 -71771 130474
18210 159401 -43876 -65150 57917 -116786 73537 -236133 127535 -53005 118439 281034
18200 281034 -17819 46717 9397 -205592 315161 13797 60264 169867 146476 -268758 -419503
18189 -419503 41905 -53620 -44171 338760 -340840 27849 104921 -149724 58514 62701 -310883
18177 -85811 29262 -124322 -48548 -328703 24239 97643 117032 125886 76877 -122741 -288222
18166 -288222 -57930 65499 42676 -170892 -355385 -120363 130278 -392295 -31072 55352
18155 -21726 -79521 -367442 -233378 218782 -234731 -368244 323201 -48619 246855 -18609
18144 265567 129318 -80547 91837 -109052 254058 -145156 -142014 107842 68357 143676 -160027
18132 -198035 -218790 -82239 -80461 -55193 -58452 -134952 -11261 142632 2246 -187985 107552
18120 -367443 -211998 -177017 -79288 -54280 -188601 -240670 -171102 -187419 49848 35047 111536
18109 111536 -186932 -181380 318365 -93199 85287 -108487 282340 -289038 16945 -80996 -67338
18098 -67338 -126400 45343 75721 66316 156371 -11373 278334 275859 63012 -305016 56954 -110167
18085 -187118 -381145 -81233 233459 138063 -53062 280844 -67717 -277000 -326789 49851 56945
18074 56945 141042 123458 394552 160233 -29062 -212610 -212438 -282906 6158 166425 -182331
18062 -70 -138322 -69380 35162 102080 299486 -195046 17096 -81644 51205 108308 -9668 242723
18049 56770 -160404 293603 -5662 -267965 -44507 188984 -116436 -204670 181512 -118911
18038 144467 -17077 -103187 36424 -135967 -31927 129251 -97215 101513 100312 49663 226464
18027 226464 -171426 -171927 86667 -29591 61595 -27085 -117053 117958 -133108 151188 -33144
18015 72309 -68228 -40664 -69512 -264419 -426953 -170465 -35418 -150949 -104974 43774 -185757
18003 -283766 -121893 39734 180242 -34971 -454603 215720 -165428 283141 -88638 177198
17992 -16491 -120216 -315205 -130224 -333784 1029 330982 -67511 84834 285998 184098
17982 184098 69049 584668 -105896 242459 -70149 175010 164651 -100503 216569 57978
17971 74563 183967 -130379 -31959 -122260 220566 -129187 -329667 143441 -26118 -26601 -63064
17960 -63064 -34674 34226 -2263 -363861 -48714 -18495 36355 462724 -152636 -47808 55856
17948 58776 110327 62457 120914 -2105 154164 122467 -69432 -33846 28998 96719 -227966
17936 -170641 -224786 295143 2091 111860 -128391 425908 -138663 -62949 191444 -87469
17925 -42417 -216793 71908 332701 -163084 150798 189054 -179587 43163 -194093 428383
17914 -2237 262139 -182871 165192 -151611 -181527 -74847 60322 -341894 181951 117061 -200070
17902 122430 -122968 70297 -18935 -69535 -46951 -178043 105269 -82757 -86814 -87553 372677
17890 -2206 15111 164601 -47557 -69309 -185844 -56385 49635 82260 126091 -225379 105615
17878 -234080 -160392 -102158 75145 -312460 241688 -24069 -33037 -47871 -78365 74853 -240456
17866 111600 97827 118385 -258915 -36244 -29458 -150849 -437582 95644 -75438 132821 -175722
17854 -485406 54299 -306224 390788 -331956 -9964 231440 112789 -318899 -7913 129538
17843 -8015 120804 76825 120073 -23352 -308777 278459 -79079 32201 -254096 -123959 110152
17831 215409 -23034 145613 -55628 -62999 24393 -61302 199927 69622 -169782 172621 261493
17820 261493 52550 75861 146742 167929 217248 304466 115548 399178 -57322 -169488 4029
17808 -238976 226958 -195359 -11798 43867 53513 214788 -1890 -212321 -103121 -146093 -13782
17796 307670 239414 53983 -19696 133470 -607 105098 101155 106843 -64963 6024 -19995 88693
17783 58053 -235141 51055 59481 152378 80798 -119920 578347 -86899 298788 83844 -48233
17771 63898 5371 -132177 77820 63548 -52036 321390 -45644 -59711 118896 58213 -169485
17759 34424 -179521 -23405 27893 84357 152666 54773 126700 96790 -33676 279284 -147231
17747 253821 122674 -98888 -136128 278154 211414 -149543 246041 299964 128205 93974
17737 93974 172896 -106745 63792 61896 168359 -14148 -143414 163140 -180180 -142642 213617
17725 -104655 5101 -192190 -2368 130184 106940 -22654 340975 312491 166228 95787 190996
17714 190996 -12576 173627 26908 255680 352808 -33157 321560 -3680 318474 -20033 -209966
17703 -209966 -394788 190105 -125162 198870 -148683 173068 -36870 -13824 195299 186806
17693 186806 286560 -107096 24859 258149 69302 161766 242269 -154095 -23240 18158 354907
17682 354907 -97173 -3205 43839 310280 42955 417603 63518 8521 261191 -32442 -70219
17671 -70219 -15579 100109 57292 117005 212795 -35593 -240597 83964 18271 441250 -113717
17659 139804 190633 281319 311182 49251 -95015 411412 63539 371697 -268276 436863 3655
17647 142938 271949 -101677 160790 -171112 -170439 353130 197218 55757 683 82424 22912
17635 -235863 93389 64349 175153 322793 200647 188997 70138 -50019 179420 150061 386594
17624 386594 -109315 -277866 10310 198057 322878 377588 181112 -33424 486714 432685
17614 432685 38355 299572 -147092 358719 142867 125902 292929 274323 181856 160156
17604 160156 210990 166673 1830 -108598 399246 22807 91228 71525 227280 -29429 133886
17592 118400 -69196 -67946 96317 74552 -16178 -2347 114401 -31641 274423 400823 240495
17581 240495 25478 33870 278572 182492 317371 336357 91567 -13319 148399 11171 471102
17570 471102 61270 35432 346856 -28460 -130482 216657 243438 186947 210768 317770 402998
17559 402998 -17822 240835 272370 120680 198557 49270 374211 162642 252145 315803 287220
17548 287220 253010 86380 -154497 447947 316511 -30060 9572 96552 341607 62657 338062
17537 338062 150619 66702 169121 63234 130438 151490 367232 221719 433191 267711
17527 267711 538534 712534 1107948 1073229 1134540 795573 608621 803424 619315 686882
17517 686882 365780 239339 277665 207713 434456 493050 691112 1012621 795785 937821
17507 937821 1009795 551153 207234 553742 452391 532810 676498 222150 762080 440574
17497 440574 213737 37127 193746 742892 326294 318928 367965 171007 504502 168847
17486 638132 327071 215442 123650 189862 288694 274161 343751 467100 -31143 273095 479048
17475 479048 283697 359368 5242 203459 441816 186407 98605 192343 128972 500002 332473
17464 332473 193036 288605 163829 316939 433320 423730 110729 157986 389812 178217
17453 405567 483901 70129 375330 418352 471138 366698 -27536 535479 552373 239451 620573
17442 620573 725384 586050 680423 540692 520254 235655 397582 420000 425363 -17043 -1623
17430 551379 298784 467782 422214 459341 352974 311176 220522 296248 535026 598978 414985
17419 414985 16256 443354 527612 358138 411689 662217 632827 371807 462338 115424
17408 219309 213063 513690 496361 255906 376207 312847 365986 137013 284082 145158
17398 145158 501015 747 431721 86309 389125 286566 351305 435696 186942 441054 580801
17387 580801 463003 79463 203073 267110 503800 332854 316404 197016 -23449 608183
17376 392718 99044 357096 286797 245198 376864 226789 318436 358530 237241 407673
17366 407673 -68822 487603 594619 494710 104841 213301 318403 247388 408886 184566
17355 321974 369989 320401 579427 229814 336881 482668 238467 334446 341683 187340
17345 187340 464992 279175 205570 171457 411678 361723 231584 441205 205995 206374 149281
17334 149281 275715 85003 358198 174721 438694 11078 383247 132440 373452 209059
17324 209059 381979 117955 202610 317727 262333 162291 208198 316010 329375 289400
17314 289400 338412 191877 128317 207657 608314 517412 488344 677949 314931 176152
17304 176152 234332 111440 343119 110031 206852 444307 126039 28224 441693 73605
17293 -36636 650381 800841 536236 291580 441149 397623 529320 579715 227201 364651
17283 364651 365288 223675 414534 453789 267015 278628 321411 470608 339580 417267 372037
17272 372037 136925 552773 309889 506488 199740 82767 540133 606246 415572 224143
17262 224143 484805 332837 309212 176500 -35340 395628 94330 685115 594756 505939
17252 505939 223958 592108 494613 185573 406928 417926 432409 25492 133941 347888
17242 347888 454120 370319 513213 267639 288726 475499 120909 118008 313527 362872
17232 362872 270366 355917 804044 471896 537597 498889 245251 287009 240707 486289 329614
17221 329614 325210 260904 524577 400753 246650 430397 530859 350263 176428 937866
17211 937866 595397 330042 239315 148572 474194 263678 853194 358620 442441 703297
17201 703297 1070257 277762 600892 333390 747959 458752 207157 347380 335906 671318
17191 671318 358780 486980 437060 209037 697377 347712 442425 678400 620893 721070
17181 721070 627539 871502 736373 473578 519199 455058 510977 569212 493656 571560 345971
17170 345971 508572 632465 791092 369027 468944 530086 367513 465807 371052 951784
17160 951784 465639 483468 591608 948234 494251 563767 614574 673565 574556 763249
17150 763249 621218 499990 490591 662192 652889 838859 577870 534250 383140 784747
17140 784747 247299 552792 926859 444545 478830 582599 725706 508919 566590 373348
17130 373348 628758 818023 445895 719207 813550 720035 386832 415088 1109035 148182
17119 851518 740752 473996 314267 293407 730484 490943 578943 588545 450868 352520
17109 352520 313897 724592 859630 870200 693439 428714 684671 1099911 1051275 1091487
17099 1091487 573574 491661 729160 784125 703009 190108 649272 760910 811637 958665
17089 958665 714888 652694 636081 555195 754816 920480 607681 908405 879290 743767
17079 743767 1066320 846462 835011 448608 1121392 575020 857472 789397 1002324 685115
17069 685115 1049090 808815 1038531 631238 942030 1058125 903545 890080 803154 1284429
17059 1284429 965750 869508 663609 800926 912651 1371268 685595 1021547 682530 1268425
17049 1268425 857358 1133373 1323706 579020 935290 775008 933266 1177149 1054896
17040 1054896 1154823 1011275 866793 1256491 1063368 1228644 1247749 991930 1069023 1094470
17030 1094470 1135135 1345969 1198007 1437668 1023622 1105787 1286786 1314693 991140 1241504
17020 1241504 1076418 1276373 1132488 1255577 1068326 957433 1332737 1391458 1897233 979856
17010 979856 1428916 1576290 1333814 1383950 1218074 1312712 1111419 1765996 1378782 1673144
17000 1673144 1375054 1378600 1321571 1324830 1218002 1514649 1449828 1327487 1476714 1436160 1379401
16989 1379401 1406100 1557810 1609619 1686318 1619525 1646354 1586851 1797087 1629663 1585792 1700142
16978 1700142 1839741 1594956 1421382 2072477 1865222 1649202 2001111 1735366 1747666 1714068
16968 1714068 1865928 1648150 1664051 1818255 1399632 1619979 1767088 2022930 1760492 1766446
16958 1766446 1740849 1998178 1990112 1977382 2042860 1709906 1901856 2057098 1896735 1986595
16948 1986595 2139685 1659787 1833665 2227365 2209803 1958198 2210151 2238024 2420178 2052457
16938 2052457 2211570 2262865 2156577 2145782 2163513 2288761 2510430 2553642 2322175 2305519
16928 2305519 2568129 2135817 2408564 2225912 2732945 2408143 2585856 2520324 2743770 2825835
16918 2825835 2808391 2908880 3215479 2743942 2785650 2993640 3114788 2630459 2358815 2987178
16908 2987178 3204864 3301675 2864773 3397656 3418040 3232999 2974390 3176201 3254260 3393525
16898 3393525 3297768 3508970 3356459 3334826 3604627 3427982 3480582 3516055 3407123 3482123
16888 3482123 3762400 3974527 3749461 4167623 3999613 3756705 4055602 4065781 3914131 4272123
16878 4272123 3827774 3884186 4272397 4366097 4101490 4717345 4570965 4441463 4451895 4600922
16868 4600922 4682500 5045928 5075736 4758403 4816475 4855843 5527541 5191913 5571230 5228033
16858 5228033 5564340 5585885 5277305 5671537 5434091 5847034 5681016 5746647 6036627 6592840
16848 6592840 6459950 6504243 6463659 6671546 6682134 6675807 6983035 7031344 7130243 7174967 7248010
16837 7248010 7581169 7552944 7737497 7542121 8214691 8095267 8310464 8109642 8090665 8185229
16827 8185229 8995152 8834867 9235470 9545636 9470022 9359599 9512414 10021385 10209839 10413026
16817 10413026 10684469 10851434 10942816 11482328 11522186 11716839 11666561 11788711 12130754 12338914
16807 12338914 12432095 12991420 13842584 13744444 14041399 14150876 14515917 14889336 15038056 15265874
16797 15265874 16017845 16086280 16594281 17079309 17249532 17956689 18311975 18720568 18903950
16788 18903950 19780760 20264792 20747317 21201933 21973973 22476783 22997971 23347127 24580420
16779 24580420 24798503 25510618 26401281 27199971 28011244 28561794 29550023 30228523 31523014
16770 31523014 32216996 33195885 34229532 35185370 36355802 37593556 38991682 40203627
16762 40203627 41395902 42895066 44265195 45669375 47194542 48787798 50574045 52362336
16754 52362336 53797167 55498211 57451321 59591328 61869541 64098180 66151962 68260057
16746 68260057 70596537 73032062 75745669 77788471 80341151 82960870 85723982 88148966
16738 88148966 91027486 93778515 96563266 98893241 101618443 103735714 106259185 108512464
16730 108512464 110538593 112589776 114435364 115635253 117001956 117943648 118922108 119238737
16722 119238737 119704888 119768805 119117965 118385744 117399408 116194577 114616367 113406005 111364249
16713 111364249 109391514 107101909 104705241 102226092 99962981 96958762 93903692 91764294
16705 91764294 88979338 85926163 83452745 80619095 78310198 75365196 72919603 70091714
16697 70091714 67884461 65638216 63370972 61210081 58842453 57049492 55199108 53071889
16689 53071889 50817048 49260940 48049358 46356705 44586206 42967063 41582255 40252017
16681 40252017 38686641 37387856 36244291 35193849 34152982 32755856 31947001 31199790
16673 31199790 29936192 28830308 28183823 27454046 26632024 25694024 25043093 24083017 23750352
16664 23750352 22980128 22201081 21479169 21040045 20520977 19869969 19408302 18607572 18286073
16655 18286073 17785789 17286090 17020983 16828855 16338524 15729015 15420719 15242033 14413822
16646 14413822 14269276 14109010 13749586 13643609 13155241 12554058 12462046 12363959 11999616 11419649
16636 11419649 11561543 11400109 10934364 10897238 10560268 10214950 10105481 10017219 9756754 9331400
16626 9331400 9495652 9256490 8872347 8736015 8600864 8386697 8555543 8373813 7905777
16617 7905777 7462365 7909932 7191824 7467677 7357632 7079582 7164559 6828945 6676029 7002409
16607 7002409 6477046 6334139 6100213 6370336 6406088 5895835 5836161 6055171 6153014 5847737
16597 5847737 5678914 5422113 5884678 5431959 5414914 5021857 5049572 4954865 4934232 4730871
16587 4730871 4601687 5098020 4747069 4360154 4603418 4429162 4384873 4218802 4198538 4535797
16577 4535797 4238699 4237848 4026109 3785761 3508249 3860748 3892900 3832018 3610782 3878732
16567 3878732 3936169 3551346 3557696 3361608 3602872 3245983 3413725 3436931 3309415 3194825
16557 3194825 2936860 3360053 2945920 3108251 2896439 2846444 2777540 2905865 2738275 3038806
16547 3038806 2826288 2823343 2391546 2774623 2834703 2490463 2601768 2388076 2364345 2457013
16537 2457013 2447134 2356294 2408546 2293176 2082522 2170138 2471287 2415363 2243284 2317028 2025196
16526 2025196 2340175 2443006 2114944 2129644 2087165 2108668 2202734 2390448 1974350 2203102
16516 2203102 1799379 2074106 2051498 2074845 1853149 1747030 1910561 1818047 1857615 2071440
16506 2071440 1636355 1906278 1636044 2028439 1868739 2045545 1354443 1602890 1757420
16497 1757420 1801649 1792713 1804512 1877313 1788908 1571074 1656267 1710867 1659803 1440418 1562512
16486 1562512 1564930 1634013 1390085 1595932 1578677 1238740 1130607 1552539 1318717 1283546
16476 1283546 1297539 1520653 1673581 1236924 1413722 1152653 1513381 1394938 1506307 1141053
16466 1141053 1312125 1054712 692754 1315378 1334922 847828 1251466 1356087 1219086 1116721
16456 1116721 1176538 1132602 951355 1508227 1210469 1120425 1174444 963877 1077846 984688
16446 984688 1396652 1250183 1224591 1006909 1208867 1191687 771354 721353 1006587 899550
16436 899550 759844 1138083 1221612 1011728 435695 1035793 861595 1048714 1017077 929103
16426 929103 1323173 969495 998761 1009351 640656 1047286 968720 757920 707657 790468
16416 790468 733086 816323 1007182 791935 930668 978827 794496 832151 700741 746039
16406 746039 956999 655552 557788 712311 957371 884443 647950 681060 850702 577890
16396 577890 881733 1026399 436997 909570 504893 985609 921807 495283 764803 449333
16386 449333 279139 402027 818074 694880 657712 676090 491554 480840 1117414 800121
16376 800121 720026 808037 720038 450521 754319 869966 576902 717078 637343 627081
16366 627081 646077 733527 702238 404031 577974 254147 886475 768596 617979 576506
16356 576506 586797 473199 268741 512319 486013 600340 603012 489871 426023 517099 508103
16345 508103 724139 796045 408789 654906 719433 439245 80356 113058 248348 435989
16335 435989 456386 351613 601788 431360 596313 457245 784529 535848 565316 459979
16325 459979 661428 351144 535108 466445 519224 39865 716939 495060 430933 131902
16314 476567 232906 90119 429945 389133 266458 424208 184577 778377 246514 60897
16303 121928 129636 419133 141442 273379 166584 328873 461870 425461 574079 615572
16293 615572 327660 206271 634395 303034 357042 1288 373444 525948 473470 265246
16283 265246 -127146 805990 297749 479935 395647 319779 695005 348190 197265 55628
16272 358775 -49992 476687 352663 28444 480867 392150 240386 -50173 88280 498539
16262 498539 256955 427028 312651 236653 -252524 386340 476928 398593 452372 331202
16252 331202 145263 216182 260189 306071 303449 234245 254848 116260 281365 124949 258227
16241 258227 222827 447514 372094 -8850 330450 154497 337461 -91220 356243 65276 119663
16230 119663 -34276 443151 -272850 508085 420062 178036 547008 280091 67981 188424
16220 188424 259130 312811 338050 193293 4686 50717 265997 169746 424085 32192 -62165
16208 243182 165221 289109 239655 65326 374724 225981 -40322 89361 154430 161170 70018
16196 333041 -108143 210087 251327 130790 34578 334160 243317 -65469 -111404 321773
16185 620992 380815 171487 97002 496207 283443 141969 250371 -72432 -537 440413
16174 410507 38755 231640 282960 635582 53106 333889 32854 361067 136136 94500
16164 94500 -52401 42548 -33822 79394 85667 -231589 56285 -32195 -219038 -89204 96047
16152 482534 169029 314747 -355922 371491 4709 240834 461405 300990 15992 120971
16142 120971 123375 459253 -12795 31695 82219 238514 211180 -38545 26839 297308 397043
16131 397043 5813 57154 189428 404155 155324 174718 679585 172055 116733 396085
16121 396085 -202828 -315565 13747 110650 17008 221170 152049 -102995 17916 117201 152043
16110 152043 72017 129834 321819 -119763 71494 318087 217509 809 47060 26402 166674
16099 166674 -21362 -150665 5228 130603 -229745 124293 -24137 113642 120483 168346 5546
16087 201772 -107612 155560 85915 15118 85678 101279 -190308 211278 -344736 56615
16076 308324 -102467 92884 222189 -24575 348396 -13904 -94081 136553 41574 216852
16066 216852 8879 -49379 118911 184247 -28989 -11449 330318 220955 123475 143551 -66311
16054 -252847 316230 -443224 124372 42316 83734 -201698 148156 26860 62679 -195791
16043 -50829 325724 -172214 -73219 -20122 244157 254004 323054 -161719 241886 324501 68404
16031 163157 -220013 -189612 -79420 125736 162633 -4080 46290 192841 46830 118889 232088
16020 232088 69607 224862 -246541 -78253 -60850 -95724 74418 56643 144509 31658 -66143
16008 -61629 251293 -228748 -347889 -86313 8057 32417 46155 -122066 -11556 -122864 -66799
15997 -66799 62420 99650 -5749 160548 378933 -42033 54884 91440 66901 228251 402862
15986 402862 1149726 1100190 1444106 1205824 1212340 503489 78800 305652 -83443 200958
15975 -68449 15007 165460 -116505 -92481 8347 -332580 -29313 132336 284856 -152994 -19629
15963 -39209 -96426 -202131 -163564 -380088 -49249 239847 -126635 161885 214590 136991 226630
15952 226630 -177935 186455 -117049 -35499 -38363 -269934 53649 67671 92742 -61159 -8262
15940 119665 248985 -214136 -131766 126248 172283 -91300 69785 -143340 -3628 -99389 -19811
15928 5153 -159878 307297 -49946 -155245 -75802 22342 -295494 -142805 117168 -192591
15917 95744 255578 -215690 -78742 -362444 -208179 -109955 214998 55622 34405 -84907 159541
15905 -132035 -15249 -303318 234003 203573 -16361 9064 -145641 -111307 -22764 -177974 102908
15893 75426 -44196 -149250 28730 -405725 110971 -84799 66253 -323668 -203582 -109403 151197
15881 133384 -96183 -264784 -22129 176037 -407174 47812 802 -13644 -233366 -35464 -66473
15870 -66473 109394 126261 377842 -353851 -140609 2610 -86452 244313 178984 98679 4085
15858 177048 -17916 174025 -182727 -61221 70935 50323 163964 29147 103656 -308099 -312092
15847 -312092 184171 132782 -425745 350101 -54736 219145 285802 142045 -79022 -181007
15837 -181007 156752 138192 -76983 -91375 -398363 176445 281123 109101 -194516 -233714
15827 -233714 10990 173410 -212254 -144911 -52010 -68102 -135785 42896 118672 257314 -209966
15815 -114515 -326967 -125788 -179395 394171 150213 67319 -81866 306475 201787 -204067
15804 -219646 54459 -10371 7116 14157 90092 -10164 9774 244556 -301368 14514 -29182 47417
15791 -147401 -203888 219776 277296 -213389 100621 225015 -46533 -37203 20328 -347405 -109962
15779 -263472 -261763 75697 -86559 -306853 -163452 -280817 15376 -139267 66828 165622 -29264
15767 -127529 55603 126861 402448 280906 139006 -105010 35333 -43988 -147704 201932
15756 335595 149327 5225 94465 175024 -153877 -113388 250125 -78144 75116 57545 -45373
15744 124331 92790 -130007 56000 16187 -14474 43784 -85517 26548 -246141 47956 365109
15733 365109 -111671 59549 -126553 -14572 139908 108189 -116617 -114191 379266 196335
15723 196335 11035 207448 85983 -126784 -121941 70151 -34119 -181192 90546 280807 4641
15711 -362789 100319 111708 444396 219080 -3668 214473 -72719 -128302 -103681 -20350 -110141
15700 -110141 73406 235228 -245099 -277154 -24545 -135358 135232 242523 -172521 4511
15689 88388 161561 -208708 -407025 -80777 -89466 -41312 68278 -167149 125736 113265 -342053
15677 97238 246558 -44475 -41476 200947 98182 118197 -103587 18598 490386 -192466 163018
15665 89182 -160178 21040 -167323 -110884 221198 -64403 156466 -117152 394764 -151043
15654 143695 -128112 -19816 -55288 -99493 200171 229618 -93177 82385 310328 -18362 -64343
15643 -64343 190701 -351142 -126777 -302854 -106467 132384 41556 -283476 -57047 -186085
15633 -186085 86106 363051 229352 2600 105817 -80842 117460 308148 -437331 -61659
15622 49092 -165714 43929 10360 -77626 -64102 -98736 64228 92384 104130 129014 95745
15611 95745 -275907 -56618 35952 -133011 -109208 -119694 -216376 91585 88636 -79561 222741
15599 -88080 -38937 1215 123711 121526 12625 308980 162854 -4976 -204 -21085 -21176 184665
15586 -113681 65936 -86380 139401 55016 154078 39902 48418 224653 83778 -149931 148085
15574 19611 -175303 -77737 134505 -336374 118392 70834 38202 -171189 174707 17965
15563 -152352 -415001 -319907 -303593 99314 296943 -196958 -2995 190427 51716 86436 -128008
15551 -78936 -228069 -76129 -56173 -302494 -101476 477623 -85739 46896 -90229 257304 20183
15539 155796 22263 -146208 31971 119027 204988 -154731 265198 -159717 15294 108613 -187670
15527 -21941 52482 84239 265756 22531 -6269 72461 -31064 -46267 60293 60355 117799 98289
15515 98289 78863 83988 119892 136493 158847 125632 361459 39360 -196202 231627 268102
15504 268102 -344004 115935 455642 253960 52532 128268 91387 25313 211484 177280
15494 177280 75197 210028 222648 185834 298304 90608 229451 92038 286469 288954 -89453
15482 -109318 3502 103072 47083 -72568 59129 309471 55740 429736 492152 717062 785357
15471 785357 616570 443223 -166996 -22515 -86350 224483 -101940 83965 35932 60689
15461 60689 -302151 -16444 162911 -94236 197361 55169 207163 614263 242800 63321
15450 148593 264729 -103010 -21732 308355 129273 215778 173675 113334 752672 1072731
15440 1072731 1469621 688524 557375 556718 484494 21353 220097 154947 245702 -58155 25598
15428 172230 154832 66033 68986 -227424 -98151 -47034 80367 15687 121927 79320 -270959
15416 -1515 164912 -484847 121180 -9721 355683 -205966 79492 -96434 150754 -34019 -3662
15404 309426 158286 -85652 177627 -273408 -141637 96914 202262 254204 -156731 -9391
15393 70258 177790 -111573 -260835 -89104 62348 204647 68083 97773 122034 -101496 -113594
15382 -113594 86280 108477 122387 -14747 -69742 279342 111040 144596 250676 349902 210153
15371 210153 95996 219361 -105984 131979 304287 -38503 207456 287483 321114 54445
15360 22518 195852 87892 -225959 191874 260872 368848 351306 243894 359027 174013
15349 27409 104528 -7241 144288 78205 42928 82681 536736 392425 181649 498052 530796
15338 530796 449520 461893 283513 163313 152757 264 325877 122752 -36262 -45891 275839
15326 381085 518658 317537 121504 94027 166116 180523 -196195 -73038 82998 203293
15316 203293 101721 161991 124438 189869 194547 193233 651596 47336 366234 122588 157695
15305 157695 103667 258762 325743 323531 194275 521764 64004 57943 277837 5442 257742
15294 257742 71843 277146 -118032 84202 228798 -81812 -8493 35582 259137 7246 102658
15283 102658 -311114 321754 99806 63542 426648 69688 132455 -51695 -85581 -338014 117945
15271 268464 23758 148230 303964 191223 18154 108497 -8285 -26679 -121414 263763 -246534
15259 19496 328943 69788 -77342 -14374 131760 530880 347758 146655 29567 146087
15249 146087 265793 -255413 303376 -18588 28088 466128 573678 1211400 2635997 1559545
15239 1559545 2075105 1682098 301986 224524 256914 -192306 267341 88281 -16504 -81427
15229 -81427 -175221 314819 -380400 206933 -164374 300792 228949 256158 51960 -22195 -245531
15218 -245531 220863 -189216 169036 92405 -64639 -45441 40900 78188 14284 -205013 124445
15206 120773 -268578 366653 318116 177913 185232 -77193 209691 328930 181658 -65225
15195 -439564 -86038 36302 308382 -177303 -76588 95505 231200 67500 -189656 95114 -6446
15183 82736 155015 266867 205260 343761 185535 241376 96866 75428 134931 -14046 63129
15171 -223074 -92553 255756 41808 -121375 -67592 143635 107824 -137718 -13165 144530
15160 96305 441889 224911 116412 208000 161165 89974 103535 41778 144062 417188 310020
15149 310020 272341 257699 56745 58240 329404 119320 -137876 63564 -52 456486 20180
15137 23516 321110 -123712 39485 363498 228380 54981 92567 74359 58539 -68838 -204795
15126 -204795 50797 184456 -13789 127725 238664 153217 164425 447062 555367 445198
15116 445198 142148 280123 141888 225707 134897 3542 119448 189701 91509 104662 247101
15105 247101 88133 290210 32620 387286 -209803 288165 -26849 368066 300151 332556
15095 332556 238845 234855 132675 317753 -56837 373807 313775 172979 78160 317049 193785
15084 193785 -57668 133487 486283 248161 15320 -109437 286208 106804 256384 570616
15074 570616 -38087 224936 59493 71108 607613 113768 234297 -99485 377638 269550
15064 269550 139400 -97264 -88573 553577 261345 165854 191340 429901 347190 312516 493477
15053 493477 205323 57383 521837 757998 73283 219021 398483 597827 577468 206760
15042 238439 238714 463786 131574 328879 538073 53403 533635 127794 514736 483607
15032 483607 571880 388611 563229 600480 711468 616205 630995 479336 715202 719944 510771
15021 510771 408919 329332 678595 468361 430114 225849 503370 549338 531231 255474
15010 614595 441283 402991 573584 410256 248750 178331 523325 587533 239433 379725
15000 379725 539691 514695 539328 600995 544802 293145 142890 548040 403600 503075
14990 503075 649945 555182 573720 659997 517234 417416 544754 870526 748497 999541
14980 999541 767786 854001 702652 596448 457608 722535 613255 449649 386061 492897
14970 492897 479826 685736 754216 452299 486749 479482 284667 543666 182327 284615
14960 284615 350354 128772 366560 367606 678966 491462 431182 228050 371048 242845
14950 242845 454502 203877 642316 219003 253106 668756 525170 905537 815148 242811
14939 255517 617177 388074 584719 567190 868644 677401 544902 785388 674348 738769
14929 738769 1146180 1263531 1226508 1423484 1553645 1992667 1564930 1682778 1361950 1831221
14919 1831221 1635058 1584343 2481095 2787469 2174897 1310174 1447966 1236081 1111630 867172
14909 867172 527532 566426 510079 712342 701659 382072 291999 252550 618912 101139
14898 74066 482281 247151 284532 760614 69823 593729 465305 408431 765004 803699
14888 803699 488884 462887 867837 985278 743072 815860 707672 969646 947503 973273
14878 973273 981678 794129 874091 695622 204705 419644 469356 295817 511242 627509
14868 627509 765490 628257 717737 863273 401262 1124539 727445 760729 629094 562197
14858 562197 231880 834606 339300 353610 520554 709044 462252 417614 351488 499048
14848 499048 471356 481489 767246 919389 821603 1283896 1318564 1146560 1090460 1212436
14838 1212436 890850 924858 1320986 1142183 850100 623734 788914 265408 607502 575476
14828 575476 301831 629490 468356 698155 683728 600521 751671 850057 321703 1108565
14818 1108565 1284736 925308 854401 700656 438650 584206 665945 991289 771086 1019028
14808 1019028 202796 799702 1112602 1322837 1142342 1070509 929419 281839 675929 598269
14798 598269 617419 793750 895062 795787 847253 670457 842216 533692 475068 902977
14788 902977 683295 617516 907909 632517 912392 758897 477415 822757 1005729 696890
14778 696890 851788 750630 1088873 704347 1134935 761826 895430 706412 819203 637686
14768 637686 202117 816482 838956 709478 442830 584957 1064067 831117 644509 802419
14758 802419 449406 852679 711868 513184 478817 863067 1070553 867953 1028703 625540
14748 625540 403589 824607 741307 869183 893220 421994 817410 554497 671382 828118
14738 828118 914816 805057 863450 652548 916384 1083162 1264227 1162007 1287572 1465296
14728 1465296 1785029 2201012 1800062 1853924 1399107 1328128 1167945 1180674 1393839 768418
14718 768418 779295 874457 546351 1007841 636893 801820 1034290 788636 859998 1119859
14708 1119859 1167234 980556 1544026 1109857 1405232 1399518 1740699 1704143 2024810 1951687
14698 1951687 1481962 1302607 1357405 810912 964233 1056421 573736 912876 864814 1050898
14688 1050898 865718 1061393 985177 1307885 996635 817723 917373 1007127 1287098 1040857
14678 1040857 1240419 1168623 756083 819114 1219434 1214805 1220865 881457 1065355 912088
14668 912088 874127 1177322 949186 989677 966781 1041093 1184015 1282222 702159 919065
14658 919065 1356477 1010626 1033268 1236495 1199689 1404802 1408867 1367184 1311068 1097722 1395188
14647 1395188 1277276 1194715 1201073 1287705 1415249 1381617 1722081 1237084 1242815 1191548 1191676
14636 1191676 1603726 1203908 1668349 1472836 1457715 1489272 1354189 1304786 1348740 1360915
14626 1360915 1407512 1410773 1374809 1391885 1234265 1671062 1534735 1468284 1499415 1457654 1493725
14615 1493725 1352266 1194742 1425798 1608129 1933897 1561913 1652755 1698936 1490011 1422908
14605 1422908 1526094 1673307 1923634 1685356 1705780 1765160 1503424 1633180 1804840 1756588
14595 1756588 2044150 2114501 1689250 1935014 2130456 1729837 1963272 2014440 1912416 1950497
14585 1950497 1955575 1777387 1780525 2097078 1941306 2122495 2311924 1990735 2073677 2408817
14575 2408817 2349706 1811028 2242937 2403663 1938852 2482389 2478815 2456873 2378771 2136595
14565 2136595 2526668 2556035 2753226 2569583 2697987 2816638 3075163 2910614 2778586 3280509
14555 3280509 3363675 3622773 3639804 4006657 4699159 5429994 7506309 11614183 20854087
14546 20854087 42074159 47627481 17101012 7160105 4377509 3192048 2994527 2777930
14538 2777930 3636005 5744703 4987675 2907793 2686723 2152112 2306936 2390853 2665216
14529 2665216 2162352 2447734 2189156 2311120 2525104 2787939 2251219 2458208 2519685 2506419
14519 2506419 2591222 3001406 2646864 2586634 2783796 3305997 2851792 2901924 2646234 2835790
14509 2835790 2975717 2925162 2637080 3366062 2897495 3303902 2845703 3328869 3049713 3565986
14499 3565986 3051980 3379851 3499857 3647222 3706820 3208734 3683005 3261443 3475825 3327488
14489 3327488 3777520 4044832 3918941 3452634 3965676 3774268 4179267 4245131 4201508 4040403
14479 4040403 3943966 4242342 4355756 4246542 4044850 4108265 4388653 4597113 4453759 4568472
14469 4568472 4569374 4608696 4835866 4576739 4573824 5029198 4928721 5101011 5024319 5340853 5445031
14458 5445031 5334462 5072781 5074292 5283751 5108303 5775183 5363823 6061595 5360696 5582334
14448 5582334 5662792 5921045 5978596 6193760 6046590 6164994 6079966 6194565 6536252 6351039
14438 6351039 6851655 6661351 6479602 6649818 7061079 7122641 7230194 7061546 7073052 7604208
14428 7604208 7471822 7700036 7715884 8010241 7826604 8224081 8353873 8684820 9028895 8970260
14418 8970260 9009983 9194140 9252084 9381238 8904812 9413666 9169143 9786269 9471432 9835557
14408 9835557 10004116 10164739 10509252 10801717 10846726 10926113 10669299 11158064 11113493 11620344
14398 11620344 11448294 11435286 11650063 11853044 12269907 12166046 12434356 12679525 13097597
14389 13097597 13406853 13616208 13818133 14014298 14216941 14620688 15131574 15326635 15587942
14380 15587942 15754680 16105662 15920156 16444864 16698542 16825785 17594175 17850384 18004048
14371 18004048 18565232 18911772 19222694 19685886 20089308 20464760 21148233 21202705 21373609
14362 21373609 22164986 22847407 22941676 23479654 23722993 24540741 25228640 25962624 26546884
14353 26546884 27102580 28103916 28275571 29270983 29659039 30459077 31215229 32276683 33178979
14344 33178979 33542266 34675378 35748792 36282113 37788449 38603900 39768940 40782899
14336 40782899 41750295 43289989 44293803 45619823 46969385 48596323 49672704 51299907
14328 51299907 53373131 54734727 56535874 58482947 60402950 62265222 64992749 66489153
14320 66489153 69390451 71823622 74318049 77044515 79687150 82371404 85678723 88826916
14312 88826916 92307258 96313636 100329498 104394578 108499010 113245552 118282419 123374189
14304 123374189 128935598 134851634 141335284 147493453 154256613 161440246 169548004 177386761
14296 177386761 186525736 195606661 205402929 215985604 226774947 238468742 250491592
14289 250491592 263430408 276733934 290615585 305389472 320614018 335872641 351637790
14282 351637790 367706901 383655789 399532040 414839851 429671563 443566164 456269005
14275 456269005 467126055 475319166 479114220 480133789 479491248 477475812 476965890 471210346
14267 471210346 462218908 452507775 441951379 430272788 417639618 404077732 389027286
14260 389027286 373678679 357494658 341157983 324476910 308413638 292949185 278433379
14253 278433379 264124957 250102355 237768625 225232917 213431947 203310462 194730675
14246 194730675 184588022 175457669 166902822 159047300 151546829 144498032 137538656 131236367
14238 131236367 125730179 120160719 114775906 109825691 105489163 100947952 96872144 93465128
14230 93465128 89491917 85734251 82573518 79539234 76588135 73354711 70791076 68333783
14222 68333783 65765660 63901773 61764123 59701737 57444207 55509652 53869886 52296605
14214 52296605 51018462 49592094 47635831 46109980 44710912 43504362 42413971 42051148
14206 42051148 40629061 39081958 37538265 36865617 35615599 35059375 34404030 33164231
14198 33164231 32413187 31156902 30577023 29735098 29459828 28612793 28004833 26958389 26502197
14189 26502197 25736560 25205518 24552257 24303395 23612915 22687897 22520733 22044428 21692546
14180 21692546 21354984 20670771 20082769 20001782 19497641 19094153 18584774 18384963 18381790 17570801
14170 17570801 17243977 17153785 16615370 16712668 15865849 15688290 15625802 15070286 14812574 14476757
14160 14476757 14226958 14055191 13837576 13757394 13684138 13121632 12852651 12707070 12429981 12476387
14150 12476387 12244182 12001035 11991474 11568785 11453866 11284801 10873596 10819774 10829248 10747947
14140 10747947 10229344 10078854 10034164 9656281 9915197 9934621 9290278 9390929 8972515 9063449
14130 9063449 9012921 9114322 8616181 8536283 8300977 8624640 8430969 8141067 8084728 8070495
14120 8070495 7500931 7731245 7828655 7458482 7106926 7476016 7246169 7428148 6751936 7000340
14110 7000340 7049548 6911528 6725058 6695010 6616609 6603670 6470575 5973773 6226023 6029799
14100 6029799 6314490 5885044 5651772 5884540 5829327 5841104 5703906 5746380 5556758 5504396
14090 5504396 5026934 5418761 5337101 5263422 5179195 4961110 5158592 5107496 5231087 4937754
14080 4937754 4910338 4706611 4531764 4781493 4368092 4480089 4260433 4511813 4193807 4202876
14070 4202876 4377640 4440028 4065652 4340306 4451476 4250050 4104070 4114602 4255869 4174255
14060 4174255 4141854 4203521 4434778 4072937 4274770 4264490 3852141 3581662 3693367 3711659
14050 3711659 3618346 3727705 3299306 3505892 3752736 3479040 3293061 3293767 3152397 3501282
14040 3501282 3375591 3452723 3444628 3156675 3097402 3322163 2842181 3152536 3152231 3162543 3082657
14029 3082657 2739407 3278855 3219976 2771925 2658150 2511880 2654060 2797063 2777209 2726024
14019 2726024 2595539 2651445 2778032 2486680 2646521 2634770 2459407 2678498 2575676 2195233
14009 2195233 2502228 2387689 2458500 2351308 2190456 2231341 2267436 2286701 1812558 2218780
13999 2218780 2182079 2063484 1969703 1955520 2267906 2380921 2303011 2189824 2261126 2664732
13989 2664732 3595701 6075956 12690195 32778885 50919189 25881333 12111433 7739230
13981 7739230 6407315 5060644 4196185 3801129 3174813 3338040 2514611 3088715 2521374
13972 2521374 2780377 2398705 2411893 2242045 2526789 2311797 2217211 2166901 2463821 2234113
13962 2234113 2181666 2100492 2298779 2082444 2026663 2051623 1928261 1848798 2039744 1876837
13952 1876837 1754896 2084844 1943460 2142388 2204816 1741836 1769249 1794342 1815148 1977438
13942 1977438 1488211 1697756 2058956 1637320 1691813 1808481 1639778 2025290 1476143 1345237
13932 1345237 1863560 1586583 1542518 1729462 1621860 1748777 1500664 1144242 1531238 1449197
13922 1449197 1346507 1699637 1776327 1409410 1322248 1310739 1497795 1634072 1716275 1585812
13912 1585812 1396670 1409543 1367296 1908498 1635654 1481924 1535073 1424288 1431280 1544884
13902 1544884 1163867 1112006 1352508 1256724 1085135 1382419 1248313 1498020 1483707 1348142
13892 1348142 1314978 1181300 1134656 1190372 1125869 1653828 1277027 1240885 1375673 1137597
13882 1137597 1331029 864189 1400860 1176534 1308776 1175275 1338389 1165898 1210501 1036077
13872 1036077 1275794 1148351 1203588 857222 1052114 1092105 1060186 897838 1321259 1202357
13862 1202357 1187129 931530 1292206 1295274 1145108 978152 1181611 1099567 948588 1382004
13852 1382004 1216916 738090 1253539 1040925 1220820 854525 1026040 941153 1014842 1331222
13842 1331222 937382 1027669 666825 853865 933755 1026102 1000447 933519 823364 1051460
13832 1051460 839199 905968 876723 1037117 514406 737004 974468 964532 1061638 342030
13821 1121936 785962 850597 800431 950478 793989 731056 845939 946554 732242 616391
13811 616391 656686 891894 775760 1075182 707478 667835 744863 771703 803190 336820
13800 1121036 766034 781861 908369 878532 582381 507644 746407 744641 686247 433543
13790 433543 967785 775037 980210 1074734 758119 862857 601869 700138 841955 821430
13780 821430 879098 448917 476559 891600 598186 537701 284059 679828 726685 421935
13770 421935 681471 733184 629906 698731 603621 528715 655407 740244 741264 445938 434385
13759 434385 567490 625045 879149 413426 795278 567188 898805 550219 787195 640539
13749 640539 737223 690996 346079 181219 892869 737127 511349 578648 714226 414508
13739 414508 409882 606005 772913 534138 820500 556429 804949 388811 394846 584454
13729 584454 421433 814424 485576 668150 452723 294211 734379 529170 872979 829372
13719 829372 377347 328835 749594 621674 656611 558265 450629 415098 822998 565647
13709 565647 567653 617276 600422 393618 381359 456385 561469 168074 167570 507843 409936
13698 409936 138020 442859 525381 515301 541483 376191 329309 301198 519662 326447
13688 326447 521780 490297 577920 492732 540945 328943 207050 330349 482812 359078
13678 359078 322438 679950 256985 760131 449884 422168 204880 240513 484340 478656
13668 478656 640078 216971 151866 356204 371013 716536 480317 166587 481853 565638
13658 565638 327086 419998 730484 459347 318392 197193 389140 281833 315308 485731
13648 485731 384629 512608 227776 147704 410824 722649 507510 415989 722580 257466
13637 286235 447661 407829 152879 420527 181246 203098 493508 423639 435990 454032
13627 454032 496481 473162 198667 -48146 65794 562994 392989 449284 276111 762395
13617 762395 446201 501209 353821 400231 597354 337623 162815 456759 385806 374722
13607 374722 337639 257718 603172 478423 226152 347424 358288 297084 225366 229443 412277
13596 412277 334017 435019 250431 562713 339394 221475 470707 229014 265771 188631
13586 188631 208401 438623 162944 317190 148302 130640 461837 114802 212766 303011
13576 303011 400213 232853 384822 263730 240049 85348 78128 133546 104020 404780 258701
13565 258701 674843 216424 14019 120571 324329 440832 555373 136060 442470 28635
13554 105170 177500 203105 381569 438569 293894 315164 -2125 15290 424453 64399 302344
13543 302344 477976 415269 298746 379942 441671 438535 131210 466449 -161219 179581
13532 145922 18315 101324 102798 48217 23551 391611 368832 125233 386414 239169 -38685
13520 203436 210118 -55227 571481 113946 207092 49230 416569 212048 382437 -209470
13509 215273 -260105 54235 202037 355959 -8857 523403 58002 148117 -114305 129060
13498 542165 243414 252356 262469 172872 146765 267292 220382 34152 550524 172140 386340
13487 386340 -47959 119850 420115 185312 352612 115951 109684 134953 245570 -59546
13476 417665 37491 481059 420336 -92755 282644 315675 131893 81917 304693 454437
13466 454437 311657 448041 252818 84287 271421 426085 375131 88126 69102 274842
13456 274842 528468 208322 173035 -62634 138804 527640 453603 91583 186090 255530 196881
13445 196881 -32923 192876 357282 64662 -45886 393172 82691 144157 302740 58468 137831
13434 137831 371404 42384 182870 303544 128232 167857 314913 211718 323914 95195
13423 38058 528796 -93776 337340 84451 95948 -295275 219767 105250 45478 469471
13413 469471 586423 58628 120082 137053 342481 106050 22249 -50231 -258752 160415
13402 591395 268281 332710 359098 357165 94854 270642 -16533 333183 244732 127983 124075
13391 124075 179696 -68259 201117 -6810 295349 92762 62112 71703 192793 48422 -61890
13379 369180 75687 303769 194656 -38764 -153876 -69587 257777 46113 231122 122355
13369 122355 261721 -45950 352101 103026 229165 125559 451007 463039 215799 24047
13358 135596 334281 -121827 236829 256159 166329 -782 608537 180419 573862 240294
13347 245506 164443 295315 251883 218522 298691 371779 429556 255155 523795 179603 434241
13336 434241 198528 18012 521186 317739 407405 210202 532770 68975 294349 -14271
13325 -59136 613046 -160780 334372 471469 321246 347519 541217 226270 342046 228118
13315 228118 172296 -8090 496967 177670 359292 84435 127019 62125 -53485 255775 338592
13304 338592 194271 97697 209636 783491 -87616 711907 82609 412029 237579 7255
13293 260995 208782 -10984 1890 360771 262807 225915 345766 -38632 1990 475961 158792
13281 112467 -42751 74677 133778 278632 418682 -12267 153362 -295442 -25930 -313030
13271 -313030 -55080 116713 -35503 142193 314824 54126 406142 298129 130206 267075
13261 267075 193796 15508 30412 78553 -113991 91232 27925 -127313 366365 270762 110109
13249 -142765 -90054 107358 376022 48002 220757 138707 88965 58878 283248 180628
13239 180628 -67824 305972 -22536 251359 -10447 170026 195440 -30056 55850 -26553 255106
13227 52744 390600 -8572 -40027 27531 -29556 -99742 121859 -118665 227031 -158209 60981
13215 -92471 103357 -163845 408542 171564 284526 95897 44798 72371 144245 290753
13205 290753 -21589 -215438 89045 -82754 -213647 123212 -17212 -29001 -13003 44067 27071
13194 27071 214697 3312 322960 207942 177763 -2861 -12492 17007 -191727 101320 262686
13183 262686 175320 15670 227225 425781 56958 29099 44144 -176534 -59127 82594 22236
13171 187420 181453 213393 8542 107600 431194 158748 -214073 -39107 -244350 62474 275481
13160 275481 -87622 82384 -35310 134586 -297677 -159508 259846 -108601 400194 -29566
13149 207309 167046 148351 -5082 384425 283660 150706 121074 57141 175126 2792 56265
13138 56265 99995 188568 -268199 38712 265518 479604 -81684 -2757 -122229 -127593 -80993
13127 -80993 114364 -13148 29311 64319 -99516 191805 -12082 178798 112691 452425 262258
13116 262258 -279488 -158472 39315 63178 -31270 127085 -57542 80765 17053 -32826 104596
13104 -25920 241229 -226507 350160 87154 -121517 180018 413285 123125 -2882 -186571
13094 -186571 -1880 -1800 113011 48903 62756 37749 55901 189911 1778 -78252 -166964 -28574
13081 -317183 48860 278668 119901 45860 72193 133294 97499 -24570 -35924 -65477 122735
13069 46326 -6494 287854 -228142 63759 236767 444132 -129472 -109123 3404 57711 125389
13058 125389 182474 362855 216940 304942 321405 218213 80245 -25112 113257 14323 -109421
13046 79753 -65052 375238 352002 -40730 102546 398078 16687 356495 -148714 43884 -84386
13034 -86443 20908 -438192 -51696 378543 -1224 132868 -230516 -335932 426524 61815 -3020
13022 210588 15969 -165020 -64339 44851 27399 -5750 101247 54383 371871 257925 -35631
13010 100294 -96063 207327 -336538 18076 -93099 91405 98953 -103333 240210 -113496 -52614
12998 162325 85030 -17836 -103831 70154 105879 -46313 -42050 106919 -49312 12780 -15032
12986 430785 161897 -119559 104804 -6591 222431 -124359 40197 128302 -246070 95253
12975 286436 163340 112398 -371845 311108 -64641 103920 -275887 40602 77235 26879
12964 50837 -23990 68983 -310117 192260 -102019 5305 23811 -111060 123158 33613 -26503
12952 -245072 163634 -70871 46953 67690 227504 11566 105143 138412 137612 -13302 501307
12940 -83496 396330 303393 188794 -61516 -167876 -50770 -141083 -577206 -276407 -230144 -225558
12929 -225558 38604 113508 242279 220666 371670 -404599 -153973 -26231 -152712 433078
12918 78853 167682 -3773 -255583 254798 -34117 -254633 63926 156304 -203246 -110829 213693
12906 69410 315386 -260946 -112607 -5643 -158447 -170796 26040 200651 80354 -19509 352239
12894 187961 226941 52410 -35291 -16839 -36658 -13033 -62418 15296 -110891 -229647 -130906
12883 -130906 -5432 -117668 230816 -1625 -214668 -43634 -28037 -73285 580660 329953 -19583
12871 40793 -304746 31926 -3815 -3638 -13581 -63572 51964 171990 -88230 243290 184113 30347
12858 -99375 124605 -376256 313649 -124599 -28761 157640 34476 206942 94590 -26961
12847 -250203 -73217 -79599 -250148 80159 -37601 -62998 -124579 -100860 -204770 -285694 -269595
12836 -269595 -308710 -77625 285133 -160608 38565 -83155 -87912 84680 -308066 -90232 -190605
12825 -190605 -18030 -11011 -116179 109545 -84729 -164689 -145443 -3767 -128177 -153618 -10102
12813 141698 -53952 108325 -56797 72021 250535 21877 -70394 179580 189003 -258837 -80616
12801 96222 161966 292417 -213018 152626 -95838 40689 60823 98501 219346 -26861 -28808
12790 -28808 14049 38003 110205 -125466 -110851 -140674 168657 154395 77343 -11691 -163052
12779 -163052 -187382 124202 230305 -7353 287957 -62819 13926 -65910 -777173 73531 -52158
12767 132337 -39573 -347239 -173791 -136056 -97074 43048 -142277 91064 36905 26068 -279779
12755 143093 34438 120460 -14541 -62567 -198680 192225 168205 361461 26691 76693 -118851
12743 -53792 -229572 -16620 -25092 -80516 -46290 -102037 -67840 216082 151790 -34005 -119301
12732 -119301 93579 166563 -31803 -33993 -146801 -91187 -180727 175097 -105660 -253913 -71450
12720 89160 116124 153085 -71492 -141554 -136175 228690 -195800 -112 101999 203818 236647
12709 236647 203238 -26332 277726 46378 325625 -47563 198696 4795 -7956 77865 -119006
12697 -36235 137252 -133702 161432 -234276 21084 234007 115498 44992 -221494 276582
12686 -144877 -85680 -368097 -206423 373368 52282 -59532 83328 408604 -76633 25961 196137
12675 196137 50324 -1266 48279 -371642 59910 26588 -85768 -167240 242055 -350346 -23395
12663 -70745 -42589 84675 236985 51985 -278540 106247 210923 -92954 185740 206417 48781
12651 -6848 -66889 82408 292191 337990 -437707 -158628 86684 -317292 -305009 412358 3064
12639 169590 109258 46922 83264 -28202 147167 24022 371983 390228 206339 376948 333887
12628 333887 44172 136028 88165 16026 33341 349480 96522 173625 197492 205592 -41486
12616 -60295 408461 -210998 -15109 -125833 -133153 -44063 -14031 82031 -199921 108860 -62863
12604 142573 184284 17387 128410 353620 122280 -221657 74559 181166 50413 194124
12594 194124 -89726 71931 -188376 241023 -175933 -95744 44753 359236 -142050 -73751
12584 -73751 13228 25060 -290902 25736 -124759 494257 163850 152220 -301630 -14783 -79632
12573 -79632 -150595 265950 -98454 -15457 42008 -216666 138228 -230511 -1508 121611 79078
12562 79078 -77474 -329988 188448 -2166 4835 -38406 -95701 -371855 181994 -211367 -334858
12551 -334858 30589 172611 -389901 21231 -118128 237159 12270 169070 68739 453607
12541 453607 -203490 104674 71385 70286 -79598 -90761 364493 -72440 -183413 53366 58574
12530 58574 205596 133474 -80089 -57204 9471 -58243 -32509 -90786 -88177 194221 323644
12519 323644 250684 -352462 120722 -120889 25898 77186 -124459 250250 12990 56706
12509 56706 -39080 119884 340405 -152641 234250 179916 129492 -19834 511603 -95928 36898
12497 -59452 105228 -241659 -158245 -133052 -242797 -28880 -198917 -33790 154530 -166810
12486 -234838 249754 -58037 -161700 59103 153242 -267579 6201 -19699 20483 -82671 367920
12474 187499 82288 308177 239981 125579 -72649 64081 502107 56484 31411 101739 305813
12463 305813 23352 -231441 -25819 -109993 62701 138493 -25467 91796 -37394 -88665 69626
12451 116164 -249053 -245339 30459 322918 62736 180524 8363 4506 -260534 -124881 -93866
12440 -93866 169421 97769 -407733 -289366 -96059 -263630 -123969 107259 -167785 -241610
12430 -241610 -99506 -312534 -65257 373400 3902 9437 -13660 -11374 -252354 204841 -95604
12418 -191212 121916 -133767 97035 -18707 -411219 -299933 47241 -244430 -248381 210151
12407 -180799 62187 10628 172748 65273 151755 184914 204996 81005 -175477 -63966 160259
12395 92480 -170694 -187060 -100888 -81501 -165634 162001 66385 -174215 -404738 -69671 -225877
12384 -225877 -217223 -211870 240219 -336074 59484 22244 199954 240417 244305 147515 124386
12373 124386 26099 -125929 36224 125152 278027 73130 -67 -82344 214191 117710 167921
12362 167921 -445895 -36044 -43076 15896 -42635 -276719 20226 270926 262683 -184592 250941
12350 -440253 -96023 200769 -47860 -86495 -340000 84656 -158753 157788 -114455 6311 36663
12339 36663 -112756 53757 -210636 -136260 136717 -33994 -281424 156175 312535 -112925
12328 47876 -185909 386621 349379 -229114 277922 119570 286153 -61840 294978 261385
12318 261385 -125852 270729 230868 306702 114426 247760 -19190 187796 -118798 235879
12307 9457 317258 146757 69493 112195 -13971 221121 -116117 -139067 358556 84611 6445
12295 -337166 100935 323203 -418639 172011 165157 198306 467724 -111449 67410 -103825
12284 473307 -151911 146118 -22068 -19784 -238972 -48192 60220 274357 -40781 435919 209911
12272 23019 -100365 213356 416585 196830 84942 194744 -55675 120711 183655 -7134 287002
12260 113061 67053 10818 54674 154166 -48462 428274 236465 83843 59643 -31848 395906
12248 135898 246709 291632 178382 341645 379897 118773 352860 -212478 400036 263724
12238 263724 216112 266963 173806 25999 -188620 3727 476409 61051 36752 119034 288770
12227 288770 232933 323033 251726 234948 110799 263150 336297 130991 -22620 444653 525585
12216 525585 549264 76628 294436 9586 152741 348260 61380 92045 430080 131101 -17312
12204 63691 -77999 220232 85830 84164 320748 194464 119146 22117 257361 424483 94922
12192 363173 220292 374288 208074 55867 224099 -117815 451703 102107 459311 513741
12182 513741 272632 446686 313936 295600 167056 197830 -146169 315863 211655 434802
12172 434802 268573 278245 436521 -65441 58697 338431 341724 417735 647433 287771 200111
12161 200111 299144 440335 363304 248402 46031 230259 -117633 333007 51537 -94559
12150 12811 429145 -82696 -121421 18441 -107671 -209296 -157217 52920 8748 373295 -230002
12138 -191128 120912 -291450 234470 -60800 -142620 188238 -120742 310871 218448 -61751
12127 137278 112768 7148 48639 75728 541358 345829 298032 54825 212061 -93900 335247
12115 381435 164986 117673 -64027 67932 119166 139812 43259 73436 -279723 249244 161004
12104 161004 217293 -29491 -238115 -247028 -233403 271005 265052 -100801 109080 -28397 -40237
12093 -40237 -247006 357802 341094 135937 167881 152032 204950 -5985 350976 239198 201226
12082 201226 388777 259137 -220704 364418 157123 6829 280511 -155512 -128915 -35729
12071 22093 356070 148321 110056 62963 -124079 110293 284466 105053 49609 -224560
12060 134093 284883 -24953 70188 -3375 8744 -10725 -39792 82496 -186202 25075 214766
12049 214766 379719 18412 72265 -23385 96297 -311339 49784 207427 113667 -119355 265727
12037 86821 42916 247793 -58180 -1386 202424 32499 14097 -269985 300485 -92533 -226407
12026 -226407 -171513 -52872 -189446 113013 -228732 1139 180850 38909 -12363 234862 -236562
12014 163852 -240065 329563 -155749 221817 15227 149775 140413 -95044 -93202 259113 86148
12002 10706 -285646 -134742 -66763 -245245 43348 282855 57703 -83423 -151186 -259211 -189833
11991 -189833 -63037 22554 -115319 -186032 -540401 32931 27481 238164 72002 51982 -23154
11979 -270730 -138739 72671 -174886 -3437 -74262 -30186 17854 -61262 143244 -25521 -330534
11968 -330534 -111383 -69065 -329810 -101152 -154007 -143556 -104533 -175039 -146206 -196021 14137
11956 -190313 139794 337601 136980 75444 -276902 111604 -141706 19059 307814 58921
11945 -252350 -340161 -225698 103928 201221 361797 3083 53748 4401 -105292 -140452 -174675
11934 -174675 210600 -208398 59787 302960 -66818 -101877 -209972 301611 155861 223748
11924 223748 -138436 -113517 -106500 193412 112998 29657 -71821 -10726 39674 -254042 175483
11912 -146195 -143016 219317 -226877 -78865 -11759 -17507 -111367 -109087 271513 179915 -195261
11900 -30887 313255 -214071 -385482 61473 128219 -21706 16920 -32428 281047 -59917 -185131
11889 -185131 -89234 83184 282439 -69007 -263267 -120493 -276 -90112 -172530 138403 -159641
11877 -131152 15081 10248 -60612 -52433 -562424 -141949 97691 -161926 -290335 196774 -130100
11865 -139627 -2642 -64925 44954 -167983 -16746 -41881 97624 229110 244809 224880 -369214
11853 66594 -221227 276240 231515 -132716 -76579 27314 -156401 -63775 61790 -254102 -2427
11841 -112349 -38762 -348668 71199 72729 -90957 263555 -376157 143424 86063 -233932 -280190
11830 -280190 -157298 -103911 -77707 -169373 -250455 -41157 -30264 23187 -238237 -176472 -208545
11819 -208545 -85524 -148568 48415 387035 -290345 -217310 -125898 -94291 -8468 -147785 -61225
11807 28021 166264 306357 -71152 -5401 173615 60260 -100868 -83387 49318 -21961 -159495
11796 -159495 -197386 -297943 217022 -250583 83610 -89188 245441 100128 -29734 236370
11785 33219 30408 -246501 -284836 55428 91835 32794 69942 -63826 239744 -44791 -294280
11774 -294280 -264911 -271553 -11511 167778 61737 -25622 40173 45952 -181113 22000 -69752
11762 -14963 36376 -46903 -166833 -175431 -296008 23588 5846 -42075 12510 -133805 -39019
11750 245945 305445 -295052 -138244 165768 -102074 -51661 -191643 141386 -149582 124737
11739 -137890 -40085 -165667 266598 -592 -244654 -285327 -259227 -86742 -239934 -233366 -94863
11727 -108686 -401568 -125039 -219430 -106328 98492 112561 -32163 -143715 -57837 -126360 -233430
11716 -233430 297953 47263 -162797 116632 -215358 -34521 79371 134936 182995 -9569 -13111
11705 -13111 227731 56006 255494 -142242 188874 -184312 -98288 -152720 -252817 -2991 258362
11693 -179130 323435 -143422 32965 41578 137299 64005 -59987 265850 -109188 73541 111083
11682 111083 286730 38706 226880 269786 -269418 -139465 59117 108552 23065 -72727 20056
11670 -109860 -247471 67268 72321 -93266 173338 -44724 -302246 -37799 121209 -5588 -271657
11659 -271657 90627 180305 -54006 19285 129703 37586 -40210 -222761 86004 47494 -181204
11647 204907 137770 69885 392731 -17318 113124 12932 -190207 267163 49690 59058 -128564
11635 -40096 387977 270313 -170141 126104 -115693 -52689 -56022 304901 90547 204041
11625 204041 -119835 200753 -134192 -74524 93598 -63562 -290846 329326 -39652 -34185 316139
11613 -50624 161587 -40859 295334 -159638 56324 612728 -104988 219493 -118670 -84338
11603 -84338 -74324 -217681 96401 23081 -1479 163618 238045 -47852 107675 148971 -173178
11591 -50277 -111031 141899 -63168 49146 -60855 295263 312073 30358 -123349 223357 -127977
11579 312758 49697 -375954 192245 95867 124559 -127267 -95782 -102770 198909 130781 -166861
11567 -191954 7956 83128 401111 -182150 -409352 149806 137103 -41625 -62687 292832 205159
11556 205159 -61149 -65838 327569 141288 6060 -190517 28294 -66583 315934 153312 60687
11544 -82419 2578 26758 -77378 -295356 -94219 385667 281375 199846 -114218 -159998 90444
11532 -20413 140129 11853 103585 -60013 105569 227358 79781 -109512 -242255 321873
11521 101804 72929 114525 -915 17416 116091 -99971 221698 142957 194476 -153630 20102
11509 114359 69774 210332 86643 97819 39807 238496 505403 169015 162131 -225532 138671
11497 29707 186493 -72421 74027 -142831 176906 105583 27736 310592 128574 -93526 32062
11485 94427 312932 278776 -15196 177138 372869 461220 -46195 190822 46703 216981 -56719
11473 27591 361663 81411 177859 -96633 -156381 34771 10938 164887 315223 88616 -10295
11461 289818 254721 41956 295898 128457 112858 -8969 13934 179712 125 82604 330676
11450 330676 345784 422629 27275 102922 336514 154670 -131170 -125622 -16 198468 -22145
11438 188677 254468 438198 74648 5637 -126899 204149 -20647 98975 330956 155 -4239
11426 116165 -70554 19361 177361 -145927 -73309 148935 15642 -122136 -131188 -258141 -171553
11415 -171553 119813 309613 -66903 85721 -375508 -252319 -283901 -119563 266952 99159
11404 314060 178812 136694 -29918 19754 212415 169115 38543 -36014 5601 -23463 170435
11392 -22668 -196262 -75719 80923 -231126 39053 -203140 -40421 93805 -304724 59264 -109042
11380 -179630 26212 -198250 -80792 14902 189921 -1844 -67987 -108337 365164 -122293 300846
11368 236786 144561 151410 140208 -278572 -139833 180307 260049 158202 44088 -156537 -180290
11357 -180290 -113695 -2996 -410736 -372127 -199938 59525 223376 162595 -108934 -63377 -140308
11346 -140308 -102912 137959 77259 -36699 -211514 193181 -152186 -87782 -45764 -17455 -358461
11335 -358461 -343915 159372 80418 -68473 -155032 9664 1103 67385 -100551 -243895 -168836
11324 -168836 9512 -51762 75282 -264981 -7540 204487 66592 -211811 -37441 -277761 -84309
11312 -111380 40833 -11613 227516 -314592 24084 24866 -268333 -126677 170640 125423 -58689
11300 230495 67194 -259941 94456 211649 -181743 -108696 -265311 -213734 -66544 -426099
11290 -426099 -374524 151680 -111774 -224762 14952 -176790 -67370 -18931 46844 -520630
11279 -100957 -200356 72183 309640 13393 108185 261714 -12539 -78103 -54141 -98391 305130
11267 112259 88208 104374 -276251 -311446 162004 -209285 -153345 -246190 -115080 -50577 182096
11255 -52119 -303265 303495 238164 -90791 -167513 -118672 -165277 -284440 31046 -145235 -437015
11244 -437015 -32081 103028 -5314 -127277 67191 -227485 58429 -283488 -203555 -19015 -256258
11233 -256258 145518 105210 -217358 -235937 55101 -380857 -34793 -48413 -105873 216229 -230194
11221 -20508 -94346 -102662 -276799 -283666 54354 42180 94481 -146691 -218486 -180725 -339204
11210 -339204 57964 -268464 28873 -43121 370788 -126077 -438985 -181727 -154591 -259708
11200 -259708 -224125 42709 79897 -5189 213307 66492 142156 -99215 -67977 81966 -244132
11188 -147898 -279371 -111124 1857 -181240 229404 -86293 -105296 -148442 -142478 -158373 56110
11176 -255486 -334739 -212105 -222799 247638 64965 -140877 -120176 -180309 257691 -214180
11165 99054 -115747 4509 86362 -48498 23008 316136 -124926 105531 235261 60064 63632
11154 63632 -171814 -183069 -139960 27828 158058 45147 -417756 328113 77107 141004 9149
11142 -115302 -11955 92238 -203483 73247 411637 -66656 64633 124174 100120 233539 431932
11131 431932 214779 -71524 -121863 -62117 238986 32097 125321 11349 58221 -190004 -286015
11120 -286015 -35669 134826 305956 -178941 -74565 140514 55773 -271927 97200 80683
11110 80683 -223843 100485 34868 179119 177963 41660 325137 -33194 -157335 168080 66569
11098 350698 229087 108237 455089 362333 2269 442122 193879 179557 14683 260218
11088 260218 411241 452940 -18327 60259 241026 61275 248143 174103 260507 378770 460754
11077 460754 360107 288340 547340 388135 469750 651386 496141 247835 350242 388464
11067 388464 549776 -8875 281987 599080 408714 559270 525166 280215 569759 219961
11056 900010 340605 527549 352668 686651 679366 912085 945494 679103 558926 610816
11046 610816 871380 987271 984677 1141547 1114211 845043 1060791 1195694 986714 964601
11036 964601 624000 881196 974789 777638 1002893 846170 721609 1004881 731187 621099
11026 621099 886913 778815 558794 710256 544478 789306 889638 1019279 855780 726489
11016 726489 695632 699792 1171837 821131 451306 955527 697606 1015608 543960 769161
11006 769161 858894 860940 695996 980503 981411 892233 768917 703418 943191 945519 588444
10995 588444 673681 569162 604290 863167 820175 745685 417991 472291 1158972 1245836 929395
10984 929395 860478 560514 911516 1147742 1460527 900284 1085881 1245889 1212352 1559908
10974 1559908 1415286 1242118 2284327 2111775 2524042 2668636 3049437 3044310 3423900 3517065
10964 3517065 3373245 3007542 2973903 2439789 2182881 1569153 1548729 1694329 1781317 1448330
10954 1448330 1659097 1454307 1701129 1555009 1537618 1315991 941125 1016504 496499 914946
10944 914946 267051 610414 726197 -91606 469583 185345 434045 453238 290537 184317
10934 184317 -27755 78118 127627 -87555 152176 158496 117271 -141323 17222 127170 49677
10922 123127 65282 223815 106494 52366 22889 443447 86472 36466 25506 -246758 -156005
10911 -156005 -101035 7104 -108669 -117907 267558 88965 -62096 37512 113195 -31948 -571863
10900 -571863 -277146 -213903 -40794 -136867 -81573 169185 -107521 -275881 -105162 -167065
10890 -167065 -27862 -314740 -130179 -89961 -5049 -371697 20768 226028 -372608 139585
10879 -356 -353819 -120352 436520 -198719 135752 122773 363676 -73101 -57931 18340 -138773
10867 -283319 161545 -106244 -105924 -185561 -123176 -48785 -136128 149276 141325 -93144 -50545
10856 -50545 79147 -104833 -183029 -117174 294417 -93322 133050 177440 128111 21440 126374
10845 126374 98025 5345 -373258 -55464 -25919 119554 8601 -272654 199704 113999 -228978
10833 -74960 -178945 88170 133982 420 55600 -220253 20778 -148224 246098 -164424 30690
10821 93315 -5702 -93619 96767 22593 -117672 87995 -130434 -239644 35069 43561 -187167
10809 113040 44420 66306 -149838 -52828 -402869 -1186 -158911 -210401 246673 -194757 -326633
10798 -326633 195200 -42430 -32366 -250291 193010 877 185961 81066 67374 -44282 -114487
10787 -114487 -241234 -230281 -193544 -263319 -16979 242273 69731 -328 3237 -123514 -1524 -369426
10775 -369426 -7013 -233409 -164288 223257 -38718 168748 120905 -92669 -20324 -134304 -201499
10764 -201499 -179714 27462 -176858 -222436 -88270 -406472 -131704 129038 -30474 -278942
10754 -278942 74579 21554 42599 -309422 -80227 -37832 -52090 -228780 101490 -340325 -160293
10742 136653 -51362 250656 -295659 52158 -71758 -298504 -94772 -245392 -112122 2639 -76521
10730 190085 -103957 106917 134742 -281600 -323238 76165 -278943 -397441 -66335 106983
10719 -94127 -297455 29398 4111 -40482 -77946 -175113 -25844 76467 -260560 -196116 -281928
10708 -281928 -23767 -295722 -77757 -49618 -240965 102865 239479 -8195 126728 -152419
10697 241042 -47567 -24325 100537 -185044 29185 -282347 216185 -176933 324581 149196
10686 -9168 154195 112759 -317335 -711432 -122205 7355 -311950 -133054 -121663 -123509 3479
10674 37245 55811 94917 115086 130511 -67930 -118865 23266 51332 45273 55187 -458925 245331
10661 -161642 -36379 -194229 161117 -44879 -82444 -145404 -388015 -26055 -3139 135791 -301208
10649 88669 25775 -267952 68994 -234218 30248 -162450 -392916 152439 -47597 -97767 109279
10637 -85547 -221273 -283962 113320 -60658 -155389 201513 -97143 99761 145470 -90222 -175561
10626 -175561 -8924 -324428 -250722 20120 -212727 170285 43936 123883 -173255 73966 54574
10615 54574 -269551 -220051 -81008 -259174 -76311 137239 63660 -189669 -15645 -190606 -216207
10604 -216207 89130 -194460 99364 262778 93869 -204468 122590 -76481 -340568 98074
10593 -146791 -139010 72342 66051 -269456 -127901 46320 154410 49478 54890 107332 -76461
10581 36002 -161727 117172 100757 -210383 231461 45651 -126669 360693 -27276 161192
10570 74418 -143715 363512 129080 66970 121348 -36384 -81694 225562 -46703 -88314 -103260
10559 -103260 -425882 7487 -147808 -196643 -7979 90911 -7589 125778 269995 -54233 -364312
10548 -364312 138131 116496 -219425 -136044 129918 -523503 38876 177577 -321057 334739
10537 141864 -51628 -240203 -377887 -335931 -34359 -116080 166443 6803 -273971 -300264 190530
10525 -151247 -161853 72565 -184673 -127801 63900 50776 44311 169284 -94450 -9272 37120
10513 263726 35005 159182 -329830 -168274 -305989 -373555 13674 110796 -307310 -62041
10502 69613 -190534 68483 -167378 -76404 118398 187393 7516 -323730 -388582 214813 209070
10491 209070 83589 14744 86753 -221383 -87143 -26073 121527 -61517 50386 326744 -89496
10479 -98716 -79114 334270 -122278 175815 168182 568347 416108 415133 -86454 240745 -92087
10467 -62928 427413 24690 -113412 186964 14196 30947 -158928 13108 -161922 -30742 -41093
10456 -41093 -302823 -367238 -385044 78111 -282645 -360668 20494 -187995 115418 -258899 162489
10444 -10115 129560 -259678 -47092 152908 -215878 -159021 486036 -33726 -36864 139252 -292053
10432 88823 94559 120055 259139 156548 13318 -122146 -348766 58490 -154553 -55745 88191
10420 44509 36521 119461 145028 22361 998 -227452 59886 -34275 -108414 -190493 -157378 -170330
10408 -170330 -110740 73408 -193270 -262188 281458 -275449 -75904 -279495 50711 166939
10398 166939 -105575 -82824 -228876 -157118 252751 -125834 161698 217415 110286 173538
10388 173538 264427 -5200 -31126 -245414 77999 79587 47735 72080 -257429 -170230 96111
10376 158078 94765 176076 330539 146309 40704 339004 278942 455043 -55648 520328
10365 186539 350655 414813 388386 551280 529317 556441 474920 80093 291740 191890 396574
10354 396574 74846 412807 43425 315686 259128 444528 684521 485411 672222 508754
10344 508754 469531 184598 191391 456774 383859 654561 447079 269902 303788 360847 193152
10333 193152 88841 68516 333640 195570 128617 87483 71397 -143690 251859 428137
10323 428137 -106613 -62810 -30045 380786 197902 176194 301597 13720 78132 286176
10313 286176 251682 365559 213120 -152441 -302768 182107 -230090 -189426 86342 270808
10303 270808 -269532 -49795 139179 39387 -59438 -25725 390418 -86208 -205785 -30099 -98086
10292 -98086 -149314 -126889 224908 241118 213467 156532 -365240 29112 83484 -294646 -88747
10280 -191328 -13665 -20534 266131 -354445 208239 102330 -147302 -78807 -37540 211845
10269 256982 -88743 90435 347027 -141870 170599 -166264 -9526 10457 -388431 295907
10258 254730 -65389 -219209 181542 149931 123059 95814 123973 308679 416915 -110985
10247 -36444 306340 10840 -301092 118931 -147376 -282074 -42567 -184598 -23363 -202677
10237 -202677 -296391 113624 192591 259318 -148380 -341848 -219145 -140524 -147777 35968 -174287
10225 -380990 106241 -188393 -385924 217543 -94129 -254994 -92872 -262708 161271 -157108
10214 -55454 -69411 -127166 71019 -371029 -94100 212541 -4764 86448 -73381 112480 -53607
10202 -277173 -203145 18681 -90018 -110790 -171131 246800 44858 53340 -148274 -158833 -141914
10191 -141914 -170281 127931 -191079 -104855 -25708 -140303 234103 -396249 -287237 -20270
10180 -268836 -261095 -96058 -58367 124929 71057 380567 31808 -232943 -51880 125400 -156050
10168 27434 -267544 -140224 -155184 -124415 -107587 4067 286954 -253794 -295855 -242453 117036
10156 -158523 89135 84949 -180392 -325201 326504 -188758 -32508 10615 122577 132275 -117761
10144 -150670 106380 -181646 -65124 17914 237164 -106075 20380 -172871 -641179 11990
10133 176456 -522 -33750 192402 -81827 4780 -139840 -400442 -90264 -48900 61392 -6277 -114614
10121 -114614 49354 -12261 -98175 -197919 99856 -132574 -230565 -140158 -413325 -307662 -76090
10109 5602 -128117 -111567 5194 96975 -11083 100926 -118155 93684 -387489 44137 -56647
10097 -60912 -70236 131074 -41351 -87036 3495 -272990 176476 -136508 -57656 -101073 146694
10085 24375 -119452 -183358 -180432 70214 -141727 -240228 20467 -35873 -204057 -144910 -159706
10074 -159706 74466 -112812 -131124 -5691 99855 59196 -93171 23727 -404481 15457 -97101
10062 -206840 26703 -220408 -38435 6800 -171650 -228208 50946 -70496 -160808 45979 -358017
10050 18969 -67006 -19427 148417 -8407 69957 -100710 -213359 168312 -76897 112148 -233861
10038 -124789 375185 165456 139998 66905 168701 -170545 97394 12457 -220603 -30843
10027 -155981 -28876 -73767 -135972 10150 165011 188386 311701 61907 -374835 -128851 -16334
10015 110104 176717 82811 161268 122456 24782 -221832 -144860 -18480 -46177 36675 -340252
10003 -104927 -299718 123113 -51154 319161 -99275 187786 278277 -107181 -268336 297334
9992 -101712 -60899 19911 -224041 -222767 -266197 63522 -19161 -30325 -126145 -26328 -267105
9981 -267105 -374166 -256791 -200037 -46998 -421065 184192 -209862 -237720 -549216 -28301
9970 60754 16754 -32825 124590 -226705 33499 -382399 -25622 147511 193443 -257702 127277
9958 -10814 -174108 -304374 -219464 165516 -123915 103878 -647 184569 -186180 -242914 -92683
9946 238428 -177587 97227 72626 170873 -220942 183666 -24708 -38292 124849 -246009 -156279
9935 -156279 -185613 -54632 -233612 5504 -82919 -37291 -132761 56973 -348026 222061 -206777
9923 276943 -72999 -117122 43418 102574 -1422 72604 -294509 -313598 -1679 57369 148101 -158436
9910 -267071 54268 223941 44431 -19267 -297925 -121154 -461045 -237673 45510 -239147
9899 63278 -4200 -77728 -49994 -10932 -58237 -183275 -174567 252671 -24362 -335796 -19588 -174839
9887 -174839 -130888 -78943 -269484 -135637 97930 -33340 33097 -176422 89105 171260 -293067
9875 -331706 -301507 -112415 -104662 -140662 -278021 -156299 33853 -80805 71074 21700 -61617
9863 -346274 -72448 -45120 -251616 81533 99602 -222724 56030 -17944 -197377 -99242 -169252
9852 -169252 -101849 -150072 -308555 -232186 -32160 179728 46512 76174 355239 -13678 77956
9840 -200040 163051 -143617 -246484 45676 -129113 -301927 -18191 -238532 -74845 122263
9829 -188034 -93183 -176338 72143 -558846 -80373 210327 -56560 -185654 -312199 -100470 82089
9817 -157076 68848 52187 51386 -324374 -175128 505080 -156619 152017 -20840 -58751 -350303
9806 -350303 -285993 -47301 -239042 -125559 289314 72044 -74341 131163 198228 23285 -23434
9794 -215163 -280462 -163892 -45021 -116450 -119228 206263 -228133 -243376 -202476 -47202 -60735
9783 -60735 46784 -75235 -149760 -101836 -262514 -19166 -210764 -158408 163576 -271652 49697
9771 -154611 393382 -225016 87612 -37146 -123402 -115545 -222901 203485 92772 -44029 72606
9759 176554 220038 -2499 45507 16070 -11786 -227142 -195403 -324470 -317361 197364 -165519
9747 128674 134140 34692 -137601 184154 19102 -355468 -330339 17108 86859 -128394 129986
9735 -149524 19288 -174005 197393 -225746 -135139 201166 -45334 -83161 -61009 -139187 -9455
9723 80063 23812 -160438 -47736 55560 -135917 -145954 -109041 -65345 -57912 -417356 -73182
9711 215946 -15981 -287750 -181943 -233050 -408354 -101857 165867 -217923 -99043 -10272
9700 -12645 276840 79353 79669 -149156 255345 -177008 49662 -39430 -83642 -45637 -5608 -390483
9688 -390483 -3843 238917 -156018 -41255 102365 -315935 -179476 -35029 -93221 -102344 123512
9676 164642 -71184 89020 21629 -243433 -12451 -171737 -146035 -14894 201893 -127814 58676
9664 -198412 -149744 71448 120408 272591 -47440 -21631 115012 -165480 -24313 -396043 120214
9652 -141379 104123 52353 -181731 -93946 -395451 -10130 57961 39324 -6524 53950 -110134
9640 -129419 -417417 -202361 41215 -23820 -280239 -214380 -93947 -164745 82216 -199770 119528
9628 -28462 -390392 -53271 -29592 180822 -70868 -225753 147203 -17366 -53673 104294 -32732
9616 -324437 -167002 -161450 -285819 -39260 -100636 -181457 128160 -140273 -183718 -91699 228000
9604 -319467 -20362 70867 120462 76102 -130756 -83862 -93617 -91097 -85942 -422668 -8758 -219369
9592 -219369 273087 -209110 108663 42428 -434270 -110491 -220152 -13978 7753 -395486
9581 35924 -37078 41533 -111 -25263 -60326 -188217 -218255 -47538 -285735 -311629 -274802 200105
9568 -59438 -265535 -174116 -408371 -113447 -214326 -69851 -40576 360260 125212 202610 227210
9557 227210 -222813 202363 -150985 876 92619 -306099 50744 -299339 -205563 -44148 459913
9545 25534 -11509 -40495 -383695 -39320 208668 128980 -161075 8049 82960 -197017 232427
9533 -37513 -291542 -156699 148570 -130904 -78356 512274 -235093 189022 -90247 -48438
9523 -48438 -140657 24715 101291 -58476 -104654 17337 -143077 398216 -218409 -347299 201316
9511 -276717 -143502 -252056 192210 -74218 158475 -178940 -72209 -233007 195026 39420
9500 273698 -260586 146041 -50286 307450 70063 -166252 -273855 26147 50939 -114144
9489 -284133 -34846 77307 -78229 -147373 -197498 174564 -307980 -168919 -139453 -243817 -41320
9477 -322992 -288353 58158 147861 -42998 149043 9273 -148894 9436 82279 -81377 -326570
9466 -326570 175235 -208159 86781 163959 -358304 -155278 -348010 -383803 -37553 -445726
9456 -445726 80585 -33674 257005 92050 -97985 -236289 -45149 -168039 26326 160451 -91674
9444 -197393 -16895 -425191 65554 -275567 -57871 -90272 -143000 -138064 117594 -283859 -96428
9432 95419 -194407 -45410 -333502 -381307 203661 -228748 7676 223788 -188182 -222317 -121051
9421 -121051 213577 -163380 -383758 -87922 367 -190297 -79579 -279752 35457 -49866 -258009
9410 -258009 -98824 -127498 -269575 26396 -52199 -75050 60556 -164254 -111066 203997 -126299
9398 29430 -149699 -197406 162336 -118210 -120294 -137003 -9340 -283172 -437747 -267124 -73096
9386 11789 57245 -157434 -158054 37325 -76701 73696 -284059 -427244 -138818 -174063 291823
9374 303742 93558 138647 126577 -525307 -40423 39755 -110703 -176627 -59799 -60438 74877 -202923
9361 165518 -207261 -182646 -28080 -141773 -336415 -115126 -90834 144529 243283 -109204
9350 379458 -238766 -99305 162747 17168 -131235 -125398 186658 -215934 -198003 24324 -88563
9338 -319464 -296730 2903 -88730 273845 319192 119799 -14326 137119 57334 121028 43683
9326 -113080 29591 -40046 -231536 135075 278438 -135156 339924 20254 -36484 44416 315837
9315 315837 -79113 -16939 -33980 32358 13673 -34999 16645 -384982 17856 -67716 -317694
9304 -317694 -121073 128485 -227575 229948 -270217 -119380 186581 -288080 -181257 -279906
9294 -279906 -86696 -156631 -264833 -474356 -26956 69171 40592 -83641 -33568 -43510 87774
9282 246 -68372 118519 65740 -30234 299921 141403 -124386 -566262 -280712 -213940 -87631
9270 -470541 447 -168851 -110535 -131275 91346 -16585 26417 -59206 -453592 57793 70146 -169583
9257 28326 -91817 -197405 50029 -163860 -211498 416016 -112573 -150887 -161281 -154879 -507431
9246 -507431 -439238 -91341 -324595 -114830 85120 -119206 -26981 64330 200029 -230091 122390
9234 -92076 213022 162935 238533 -338196 -6197 -301765 65027 -324831 -128598 -241536 -55008
9222 -130628 -98018 -553244 -55732 -213636 41158 94194 9355 -319706 -145229 10715 -297143
9210 -121182 -166699 27443 -65350 287860 116878 -37892 -9363 -54700 194859 73768 13022
9198 11433 54564 -316968 -33070 188835 -104398 -69473 86547 -127395 -298720 76485 -22020
9186 -290748 48580 -151076 4447 -295176 -2930 -80693 268193 110954 -43607 1176 17019
9175 17019 -97853 49233 -28919 55766 -63853 -282409 -5050 179879 -69095 -161988 81612 -106810
9162 72731 85581 -38894 -124728 -403700 25711 -223839 -193543 255614 47456 -130910 66586
9150 -16929 -29163 -300511 275135 -307132 69731 -309023 35276 -78669 -242447 20112 -153847
9138 319411 222044 -287884 -190983 189543 -74069 332759 50186 -9327 162148 199729 -191096
9126 -126093 114741 -42198 -146952 54531 245638 -169878 62600 -363230 -269 -40911 3141
9114 212204 -233544 -54649 -36680 -13241 54607 2138 -7445 -479106 -96769 207531 -436767
9102 -271274 -352137 156594 -49156 323010 123020 -3560 -45255 -1941 -6478 -30800 -430450
9091 -430450 -33936 -347954 159542 -99697 -155066 -188984 -128440 -91483 -52371 -297294 -156667
9080 -156667 -46517 -304751 -102770 -156702 130113 -390087 -171918 141708 -188282 -287670
9070 -287670 -58440 -138694 51843 -178317 -356904 92306 103541 48505 118485 -268434 111132
9058 -137800 -72590 110168 150906 78299 -94303 -43022 124520 -77539 -319012 -204842 -57039
9046 -307600 -592021 -237394 -25638 149424 187869 -355091 -12338 -9436 -240140 -218866 -123450
9035 -123450 -15450 -173654 -233947 -35536 -50821 388805 -41190 -139048 -10100 22987 -170653
9023 11163 -28352 17087 -152972 53534 -267247 -101178 -14814 -160543 -435957 172165 22264
9011 122531 179881 83759 -48965 380787 -368287 -340996 -488983 -111453 51383 -314839 -134047
8999 32436 -195845 -924 -84959 -366011 -293547 -54865 224300 -175025 -307914 -286567 -179869
8988 -179869 65815 -81785 -445558 124086 -128660 188508 -73950 -58689 86148 -251030 29707
8976 -287988 -372406 50059 -306236 -295129 -23902 -210439 -551512 -49052 -207727 -379139 92526
8964 47224 96547 15503 97633 -51485 176159 262880 312037 -124324 -53993 -201550 -207079
8953 -207079 -75957 79865 -90173 486572 -98950 -163792 -121204 125785 257481 34289 272814
8942 272814 62899 140762 -106032 89602 16017 -291288 -312487 -68332 -56538 227467 482454
8931 482454 33255 10543 -31734 -113718 -82013 185838 -291138 299552 319618 741500 1206792
8920 1206792 4242709 12109256 5151694 1196164 674031 322003 403144 468111 112739
8910 144932 -177740 9880 66294 109292 109270 -74536 -44826 -93625 211822 -43654 39476 -79453
8897 246112 83211 168616 89628 -324445 -22646 -127461 -61504 -301308 -226702 -225143 249299
8885 -115456 141094 -133420 165377 -116478 432006 280688 50783 -328887 -51212 301064
8874 -231411 78922 -335532 -13214 23431 111573 752 169614 182375 389724 -55743 1319 -86963
8861 -126303 -170253 -10287 -100557 9012 -271273 -84948 153817 -39441 -252461 -128458 -25219
8849 -138345 -128009 -122451 49445 -31451 -125633 194265 -170161 233343 -143418 -60719 74876
8837 281610 151636 116141 -250356 -20877 -194346 95780 -141566 -235123 232283 135710 -141618
8825 -287781 -229123 -324201 -155643 -51922 -15355 -168104 38128 340995 -63771 -236147 121311
8813 -180315 86075 -142285 64592 -90917 -304496 -283191 -32199 44192 55709 69628 -252659
8801 -170131 54358 114645 -101205 27826 -186579 139464 41949 -46537 51011 -84937 -152659
8790 -152659 -6916 155712 -60327 -354776 -8900 -27497 -226234 181975 -153642 -281525 -212908
8779 -212908 -256100 -491601 122012 -109771 -202101 161972 -108961 113064 -120122 -11393
8768 66182 229441 -280247 50634 -12138 -118181 -153224 -273243 -296458 36733 -25871 189518
8756 -64024 -301561 -203268 284375 28311 -101930 -273571 91460 -57267 178131 107577 -222585
8744 214251 -78052 -212888 -53607 -135533 -188613 -24581 74771 121588 -140694 -265027 -56042
8732 8985 21511 34865 -290428 -143381 -22224 -214076 -149292 46559 -235875 -101520 125025
8720 -10384 -210165 10587 -68965 -97978 -383783 -188426 -252160 159536 -203553 105158 -46234
8708 217374 -264332 -101019 -136752 -20549 -250429 -210600 -143738 -106244 -78735 -61965 199502
8696 68419 -116545 54655 52403 18962 -295 -293618 -31144 411309 -65166 -166202 20315 -99618
8683 -261283 132784 -146786 -80061 120605 -36288 -152076 -221066 -269454 154729 -42352 58478
8671 -31210 45328 -26478 235004 58324 167446 54851 16959 -121756 -34695 248204 -261231
8659 -109963 -116739 -81369 342685 9321 166234 -414024 -8612 -45983 -231888 -24004 -134243
8648 -134243 33952 6251 -146068 170387 117247 -189144 -292656 -51843 86133 -227179 -18644
8636 -178170 95044 -310994 -140182 217839 -422994 175039 -435029 110484 47683 -131910
8625 -79166 -159723 -142451 -236507 11107 130028 430606 -146846 -275405 -212510 -139908 -1657
8613 96739 42360 22705 -87904 45106 -120566 -17300 -306076 50710 17383 102622 72504
8602 72504 -99934 -326666 -211545 -138124 -39455 -58921 13587 128576 110740 118856 135536
8591 135536 -328631 -318030 -90149 -51009 -78032 -94217 160849 -284888 58521 -39432 -85937
8580 -85937 -99024 -243589 -103389 -133361 -13767 78669 -181794 -291498 -89911 -364975 74992
8568 -27945 7947 -294899 24124 -202675 256243 101313 -17411 -114978 -21783 132129 -158887
8556 13979 -212613 -102368 -194658 -261937 354346 -499422 -180721 7475 -116266 -6769 9326
8544 -50153 -345592 -63164 -164135 43233 36966 232078 55007 -89771 -266654 -214401 -227956
8533 -227956 192561 -88107 105 -43963 14797 51831 -459578 -54067 67967 155512 -166422
8521 178393 -50013 178965 94512 -7429 338132 243892 123225 -255713 141384 -3516 -171051
8510 -171051 34702 -166370 8890 44628 93300 190319 -76568 -244940 121821 -220394 298997
8498 -228308 -102287 -2463 306181 -163257 -338962 229134 -56390 313451 -152407 -7445 205350
8486 -271901 135081 -68867 166692 24205 -306899 -86592 -51261 160785 64335 166987 163257
8475 163257 -77037 73933 -136411 520899 -267872 -141600 -5416 -511960 -104990 -56972 -341414
8464 -341414 141242 -160606 -75945 359444 -28392 -135546 22591 -64353 281682 -9060 299277
8452 -25869 -141327 -96446 -212440 177076 -263747 171144 -14776 -68932 -212791 -205094 -310699
8441 -310699 225729 78402 -20106 129120 -210996 100028 -5300 -63047 -44147 17879 263767
8430 263767 -73400 408546 -348903 -54818 -259137 166617 111267 -288076 -346838 -185974
8420 -185974 99843 -244449 152120 -369669 -137229 -140534 310681 -15067 342712 427108 58871
8408 -34319 -203886 18850 -606090 -238107 91023 -133928 56012 240087 11911 106337 15225
8396 -215619 -105349 -103565 4355 31815 24519 -200453 -225457 158643 680 -101381 72876 -143477
8383 139610 -162429 -230427 -17527 192217 125941 -178987 -67331 196574 -240829 -19240 66361
8371 -129426 -104537 -71747 -332139 -94299 -98174 351413 -203189 174795 -259425 105171 16852
8359 -158920 -44375 84896 -78455 -77909 73689 298333 52616 -299131 -77373 217991 -75923
8347 164739 -369741 -94926 -332604 -151207 -262728 183036 212346 -168521 -115947 -72029
8337 -72029 -271394 329775 -214118 73491 -44842 -133028 71005 -118791 -154935 113537 109996
8326 109996 133190 -44799 -346605 316393 -129134 218321 -256965 -71185 -185362 -118300
8316 -118300 45307 -175837 -406742 -94187 55259 88401 -178355 113643 32556 -1458 -78457
8305 -78457 2056 -191236 -131600 -440736 297283 -88424 -196610 110567 -286055 -121087 30202
8293 184250 65520 177713 257292 -87623 -57075 409013 -147191 -150052 38405 -127423 47678
8281 -11936 -80002 96437 167707 94012 40119 69149 -360457 -194970 -24810 49267 -480069
8269 157586 -233646 -93455 -380065 -78152 -219584 69451 -75457 -61692 38075 -121959 38897
8257 -107311 111691 -182506 -31941 85767 -103556 132881 -77465 -62512 60909 4051 -9339
8245 14071 -12 -7803 -257811 -228503 79133 -260952 -53788 5444 28303 -161011 -27247 -271906
8233 -271906 182041 -118133 -195805 56576 157952 214122 -152990 91151 -109625 431389
8222 -145301 -487516 -8675 283882 -83974 79338 -53546 6701 264894 6883 -137681 -154829
8211 -154829 192040 -387342 -319492 -14247 -364616 -236490 -200399 -5248 -13630 131289 -67333
8199 -97992 -34847 -86666 -49437 80951 -255194 194454 -219828 -37212 -240502 -160362 -284289
8188 -284289 32558 -214290 158968 122907 -104801 57417 189491 65226 -273568 72715 -367141
8176 -72624 197711 -54112 -209014 163395 -86856 -198482 -208135 -13696 90095 17117 79521
8165 79521 -15615 -104177 -36649 -176591 36459 -255518 71323 62392 -42113 8647 99732 -146359
8152 -160473 -278121 109399 -136399 -61528 225852 -14884 -17493 15664 -222455 496268 205963
8140 -101849 -395072 32337 -187631 121198 174355 125613 -264623 -123291 203324 -73017
8129 -264693 162991 109100 109463 -20153 94424 -72874 -129170 -13570 -341744 -127404 -22599
8117 -76595 -248318 215510 -168456 -130404 -84862 107764 152828 -288381 52476 -288633 -24805
8105 73820 -407473 222577 112530 4538 167148 -22096 49279 -117973 -19219 11732 -284495
8093 -74562 107557 -8170 217002 -133988 -141437 235710 95744 -33339 -26092 47874 277391
8082 277391 102051 -361336 -418266 -69642 -92132 191645 169705 77386 -133360 -101901 -140542
8071 -140542 102489 -169628 -86822 30280 10607 229283 -195314 -641858 377029 329034
8061 329034 -23580 -24943 -15446 -154014 -140517 -370945 -152863 65793 -76356 257246 -23672
8049 52468 29716 111393 1678 -111191 -163151 210704 28267 -13871 233834 11852 136371
8038 136371 21758 -101895 -151559 143975 208174 -192937 -175865 -193592 -43790 113430 55465
8026 2381 -38951 105707 26287 85342 304289 -132591 89736 153878 -235728 92978 84086
8015 84086 -71028 180421 57515 9182 -3991 61595 -143338 -581833 -160766 -219489 -140103
8004 -140103 52602 84114 111973 296652 -165107 -522279 97388 -211922 -17655 60743 -45044
7992 -54219 103588 -186551 -247198 189755 -116312 -139658 136453 195989 155704 -168017 -87110
7981 -87110 -47247 -67127 -150527 -331560 -278616 -243990 298148 -83051 51885 -444281 -158497
7969 9860 -244150 -79501 148605 -123301 -152323 23336 -87145 46172 123909 130285 -131846
7957 -354714 -146908 -20476 -153452 -82103 91122 -112327 -101713 -200930 -11625 -75520 -199675
7946 -199675 -306420 -123723 18898 139947 -194293 -92523 -125524 13456 387678 159453
7935 26554 -59078 -226345 -146196 224633 177799 -193454 175049 269586 -89158 -342805 -47972
7923 -132504 -59181 182958 -10459 -34734 -99522 -111424 -250278 -112796 -141943 -301638 -85608
7911 64597 27395 -233501 61972 -140379 95522 -154336 -337156 93510 -62043 -170648 51855
7899 -98288 -122053 110162 -72206 323125 34474 -141304 123091 -227860 29411 261061 -253141
7887 -6185 -188145 18951 -87679 34510 -289602 -59865 -39537 243845 -176111 -23917 396809
7875 129034 -72681 -48150 286671 -313412 71092 -85445 105181 23680 -87795 -227903 -253005
7864 -253005 116809 -331229 -105010 -6043 -271816 44161 107031 -30816 63938 -21054 181501
7852 -75586 -79770 -115411 -66635 75098 154518 -173805 -231476 -32115 85192 -103644 417174
7840 113214 232627 -167233 -296732 68176 150366 -40761 30405 -99568 -34752 383930 115337
7828 -5450 79371 203018 -174677 133281 138979 -271286 -177252 -157042 -63592 47698 -353606
7816 130419 48703 -97975 -90440 150208 207743 172934 73357 -167390 -134420 53230 -211742
7804 -101413 -90884 78856 -130062 124417 140366 -78388 -36347 -66583 -15096 -21168 -2287 -117610
7792 -117610 -61214 -189480 180954 -247146 -6410 255232 -78429 -161084 38004 91045 70367
7781 70367 1801 297013 13286 -310794 -96450 57956 441682 -310069 29499 -154683 263847
7769 144823 -3362 -64984 -65367 -158669 -52970 -286730 -199384 63767 -362245 372592 86115 -75821
7756 361777 230787 179754 69268 -100154 75854 -130967 -123705 -223216 -38382 -1304 164289
7744 20172 -73721 -146979 -4023 213310 231720 36684 -27337 -16377 29471 -82671 63326 -184517
7731 94198 1232 56965 -58273 -22084 -129742 -260193 -33474 106701 153121 154747 -7003 -286384
7719 -286384 166450 -383629 96006 -418095 -226834 -178972 -115702 15911 -126417 254210
7708 29045 151439 41554 203085 51273 -46143 156972 100481 81899 -434584 -112558 -59104
7697 -59104 -91820 -147533 203004 4725 7499 -374704 -250204 -278328 64965 64551 -20172 19282
7684 -131343 132431 -110395 -40560 95421 -337498 217971 78467 -36330 -93060 165205 -282233
7672 -98154 110072 34983 -253432 246989 217909 -56646 97499 53478 10837 -265314 -34027
7660 289546 -101890 -180020 -327174 121155 -2974 174535 28189 121031 77560 -206782 -42576
7648 25626 322590 64657 17029 67409 -393644 172724 271 92428 32772 -246286 -72073
7636 252710 -39501 120424 108507 -33398 -171371 -158451 219595 -302205 -68440 213528 190459
7625 190459 -102356 -78031 -56841 235120 5663 -74691 -17765 -40836 293403 -244661 229970
7613 -117355 -302015 177915 -162271 -74483 -338579 -14272 239871 -65506 -46997 -359757
7603 -359757 -91519 190196 -233295 -244547 -21593 22276 -109802 47170 -76052 240699 127262
7592 127262 -473263 -357643 -249053 -51268 -408248 2819 295633 -94569 13079 100117 81948
7581 81948 -345618 -118228 173962 17072 -6569 -93688 500315 -338469 -35550 -127785 -84277
7570 -84277 152235 166432 15168 -276126 143938 96491 -14069 -446274 172159 -189170 4624
7558 97311 -2430 -11740 -153628 -111452 -53975 89940 -223944 609 458894 -278313 331923 101882
7545 -135989 253445 29901 -229327 70864 -135327 -123682 264596 -147657 88877 -31371 -424616
7534 -424616 -80790 -277932 -51733 98402 -239350 -76615 22423 -182715 -14128 62662 138536
7523 138536 96615 18102 82181 -141689 -124322 -25660 -144549 -90446 78705 -320316 -159685
7511 -221234 -188600 -107931 -16197 325545 -168483 51971 38581 -69432 159596 11176 -150353
7499 -39383 -3906 -164297 -172338 -40801 121074 127667 288711 -97908 -172000 -295167 503035
7487 -6074 113834 -439176 88437 91213 -131913 27726 50078 -134891 -12960 -81311 -191190
7476 -191190 -234531 -220939 -111635 -283908 327668 -95799 406453 -37224 -233847 -177225 -87800
7464 248816 -17514 171 316616 98972 -78187 -261118 -189609 345552 -90934 59774 54330 126700
7452 126700 126309 1636 -6412 84615 -37637 -207997 -75508 153309 55937 -225835 -97137 -319929
7440 -319929 -422693 -98043 -53978 -195014 229506 -25096 -33357 -425527 -8135 -89495 -47181
7429 -47181 -63303 -253612 217434 82843 237276 18076 -66225 622494 -109730 -231571 393142
7417 62549 -32864 -45121 46830 -51867 77723 -61287 17222 -106551 -192181 7149 -258629 -247843
7405 -247843 -242145 120813 13640 153905 -25891 264235 -200599 206241 172572 376328 256639
7394 256639 -172810 6668 -194780 -116575 6444 -89670 -140799 -282626 30940 -56502 226756
7382 -321416 -34004 130935 39767 149687 184220 -63802 89532 -220731 86347 124862 60599
7370 -50306 52846 34180 27552 25027 -36796 -1631 265406 22272 -154205 -224088 263366 151236
7358 151236 -40695 -253602 101425 121839 156570 -493 8369 -38467 217492 117881 -58267 105432
7345 71799 -156973 38958 -188429 -83679 309830 -16671 51004 90793 -253585 -79607 -34315
7333 -60026 118541 174494 -71111 -196490 -83952 106983 163243 253614 -51686 -289854 147051
7321 -237929 65226 -50565 172648 -184225 -191716 -92954 -101598 -124916 -147121 58032 -187869
7309 491 -37191 -6986 -4690 -77332 -9979 4950 -11413 -403707 -56216 286653 142041 -230873
7296 -53111 -60776 211513 -192444 -390101 15156 -47592 90870 -283382 -93391 -149670 -328943
7285 -328943 323731 118639 -296283 -135888 62465 200700 -17798 176652 -216710 139411
7274 -44829 -94730 79757 -46547 -76495 228456 -48436 -77561 -16261 -97569 109476 37247
7262 -51489 54141 -143543 -217925 -48662 -178335 -313797 160125 -208659 199290 -315803
7251 -126386 67030 -173394 118312 114695 -82752 142522 -37804 -267640 -184506 -33457 -39212
7240 -39212 32955 -83213 21854 79118 -194052 -214046 186211 -155360 107248 -81006 -20927
7228 -117254 -23207 27953 -25119 -115178 -135636 94853 58861 256602 176301 20316 72485
7217 72485 -247980 -36853 33354 -139087 396354 -61684 33839 -424213 -182754 -257298 -192132
7206 -192132 372432 -102975 -516923 147164 -19123 201231 125510 445617 294598 16391
7195 480842 -317072 -104122 -162124 73897 22143 -121681 -134896 -24075 -303797 307976 -144216
7183 522539 -99439 -40248 -84564 70858 47971 26400 91351 97786 -43647 -91762 -481291 -267583
7171 -267583 -217221 218672 -317926 -14134 -225193 94967 -300562 34093 72953 167255 -73711
7159 314728 -149884 147391 -273978 104094 21817 -109815 -228902 -192817 61406 -156709
7148 264070 -8887 75756 -109618 194004 -200463 -316067 289927 -132601 315012 -21261
7137 -27153 7881 155950 55022 -185291 196232 163425 -225721 -50600 -24607 -89466 95323
7125 -171952 -118029 195422 -77299 -184100 36901 -267505 -176018 -97814 217126 8070 323762
7114 323762 106666 289634 -19567 -300867 51404 196649 56503 -134956 -332339 221220
7103 -19608 37231 -74975 -155541 -488747 22429 -103474 -76203 -257987 -128356 -137597 298415
7091 190916 216409 46733 58667 64928 180258 95254 7383 36239 109608 -349809 202763
7079 192874 178028 189798 334934 -269273 249967 -42607 19861 -34056 -17077 -419451 -376182
7068 -376182 80152 31370 29176 35214 -278302 116387 -58949 -399888 6313 49806 55030 -261219
7055 34902 -170149 -163818 53556 20545 -290404 -93464 178611 165723 319903 -146475 -19387
7043 -229708 44945 73931 95004 -194437 59132 -49406 -432749 -85326 108389 58415 -169845
7031 153005 -103774 234446 -135828 -74420 -21821 183742 -12344 -45482 -71813 -188567 -302548
7020 -302548 115069 57412 130404 -299778 -116978 -147010 12913 93320 -57605 50142 104819
7009 104819 174218 -29539 -194862 -256867 -181428 11761 -267493 -274052 -242244 3257 119242
6998 119242 132440 32191 -48321 -106434 226742 152170 278262 168259 -131074 -183796 -416753
6987 -416753 96843 182452 76255 -92631 -159549 -57678 -100194 22377 -243857 -15921 20340
6975 203206 22836 -37754 -102085 267785 -43560 -200318 33416 159501 154796 337092 -460070
6963 112093 -179666 178929 -46561 -260402 151213 -149364 272150 -96078 -170352 -42759
6952 -32679 -72360 183449 -47215 -2962 -266848 123228 122097 -82218 -199498 -24171 -385807
6941 -385807 -6824 -129631 364059 216906 -296618 115634 -252218 130865 -283880 15919
6930 84576 -20659 51920 -215739 -221843 -97920 53663 -212677 200204 87012 433645 94457
6918 -170184 33625 155312 -213921 -160750 138157 456934 25050 126009 -222479 -80675
6907 24035 2209 -242788 11806 -131420 56649 -262257 -148273 -9702 70769 -209416 -189 -95219
6895 -95219 -44762 331137 -160692 85625 -159790 183573 -113492 -129132 -46092 -183516 -27133
6883 22014 182119 -19258 -70186 -74830 -18119 157895 -349562 -132862 -1153 -199714 231391
6871 137115 25015 23991 -31139 92736 106293 -173528 30553 118252 188354 -91086 106948
6859 -159220 -39449 343015 -21431 209009 -199754 -62359 153283 -1183 -150201 -221404 -150576
6848 -150576 -2364 -201164 60210 -307138 -140488 -83503 -38889 -171134 -378015 -319265 -273245
6837 -273245 -93421 -13303 214600 63507 -197191 -21758 -172223 -168325 1619 49635 59151 -24441
6824 -67371 -251651 -111970 202776 192619 -154737 39684 115272 -92253 232749 35758 40597
6813 40597 -287009 281550 275982 -46530 37711 73042 -123332 -184648 -166411 -114431 211394
6801 -355868 -51987 81776 14112 37691 -317937 44751 235057 117010 -203667 184393 -176146
6789 76355 -12378 -72468 -250638 -10675 -214071 -223820 -568 -236047 -197603 -322021 122218
6777 148379 -172007 76573 -192611 -7361 238590 141939 168788 271077 233580 6648 -194179
6765 -150960 -62930 83285 301623 60742 -189208 236472 180366 129338 137743 -111680 34998
6753 110705 170548 -173010 -143050 206070 -2414 -279908 32514 -94857 10408 -22199 -226291
6742 -226291 51374 194089 -13026 9214 -19185 -258602 -700 -86981 -52052 16540 114537 -85080
6729 34305 108374 291194 224924 149606 -325070 334407 278125 96043 10372 436756 221974
6718 221974 -39191 120951 -29126 145675 -74635 -217774 461451 -29395 -291418 -40924 -116354
6707 -116354 269726 -16231 269341 -227155 -221819 85124 234063 -253178 83976 -43547 -174481
6696 -174481 -46311 -171458 -133627 -111516 114912 144534 232280 300233 213333 -52260 154378
6684 135223 -134072 60644 147664 -227343 -13246 32029 -191527 59020 -105376 -68153 -150002
6673 -150002 -439263 -129252 218265 156161 -82751 -31004 50726 53789 360960 -104749 -353473
6662 -353473 73790 -126096 -177088 -278867 -523900 -155211 -128855 -50242 -193797 279228
6651 -146782 145038 248397 -128561 75186 -73353 140885 -195430 -228639 -162197 136634
6640 -177919 -133180 63579 -53641 -162164 9115 157396 -128401 24298 280128 31820 180002
6629 180002 69820 172272 -249134 124649 -163500 262211 82592 -42613 -738 109741 -121308
6617 -228017 -181452 189054 97860 150002 -381725 -61903 -115810 -90044 243432 -19932 -103869
6606 -103869 96090 -513539 238119 -186694 52659 74798 -138931 283631 46900 182336
6596 182336 -3027 -17513 82310 15443 -25967 198366 -22411 -223388 -334278 -270486 -92301
6584 -132647 149054 -106900 -153525 -78316 -78713 -215368 109940 -3594 235693 303104 78290
6572 -278263 135848 -71566 -313333 -9594 266994 7708 27810 -220040 -276536 87048 -170867
6560 169385 -90291 94466 -33182 -55277 340913 -84204 -89773 -50037 -124502 108705 -182029
6548 -36968 -236884 40422 -95299 306369 -50264 90587 -300225 -275506 -293940 78338 232622
6537 232622 272359 -36722 40492 -53440 -136196 -58547 -64798 -196412 70108 395767 -38519
6525 -169043 179042 -214377 228031 -11231 -93467 -1434 -82267 4836 40159 25641 137449
6514 137449 57684 115817 -410339 -743 19250 -119287 55439 161841 -195637 165785 -350967
6502 27579 -80836 -139445 -98020 3715 -79956 114126 -32329 -28128 85047 -219208 325 -282681
6489 -246630 130312 94695 -119610 -19677 177706 -385450 152330 -113985 163646 -235130
6478 -55474 -174168 -469509 -22999 138616 236202 -46663 -22156 -348227 -57685 52484 -112632
6466 34335 11923 579 247294 58597 231704 -32721 18754 -113598 71079 -102089 7533 -170431
6453 -171545 -139684 -251700 62281 -47670 198521 -441473 33812 105725 171170 -115592 -226738
6442 -226738 24221 -19944 3370 25457 -58438 403984 -117571 -342920 114879 148191 62310
6430 -167416 -365814 -153423 68598 21776 -22481 117713 254135 -33183 -2703 176406 -294491
6418 260448 55782 -26030 66267 284349 96614 126925 205499 -1759 148868 -81994 134351
6406 311820 -602705 39358 191622 20068 -225769 44907 -480567 77368 189091 192302 -2825
6394 -168876 -288097 -7624 -113100 20295 -66465 -101589 -94491 -190729 -29062 -141936 98724
6382 -56419 228258 129514 226532 -168362 -14819 -64192 406908 46132 -228216 -52941 -66230
6371 -66230 165613 -208331 -75682 193166 -85262 -152944 172279 -197810 -275735 69409 -436506
6359 -157979 -112330 -113317 201371 15571 -29986 -100642 -154257 -252739 -189829 -168024 -120174 -187603
6347 -187603 -137848 272119 76510 -5175 196210 -78852 -28082 -119230 93546 -212203 446025
6335 238689 -39904 -66498 -231608 119991 -132644 99353 -91030 51935 -197003 176436 146082
6324 146082 -347354 -64592 -119501 -29282 97906 -228424 231311 -303808 -170748 -146206 -28566
6312 -159769 213485 99505 -119011 160644 42657 46094 165955 29171 45209 -294931 41172
6300 -275593 -276873 95274 -69674 -66856 25340 -21335 -47000 -145728 -53936 -145780 22667 -36602
6287 -112910 -139225 -83123 129876 80917 -212382 -106674 -216163 149144 290095 240071
6277 240071 -153809 205088 -88665 -143148 296019 -70717 202294 268325 -131684 57178 241418
6266 241418 -95367 -255182 -124442 -125815 -32954 -203749 169968 -128615 54683 -112709 267482
6254 -49731 406603 436820 -2221 -450421 3726 -45542 57721 165346 137176 68720 61876 446753
6242 446753 -38217 -34410 -26022 -15174 382091 -305457 348019 323756 -167468 22388 61358
6231 61358 -92200 104049 316431 -7555 -189883 -46459 -74137 34929 -68691 -499414 137306
6219 -27096 -213697 56051 -5500 -246536 -279237 -31992 72964 -200770 86455 7858 -36046 207774
6206 164738 -114092 -162513 103041 83339 49111 -501542 -84718 289957 27565 114505 443713
6195 443713 -7225 -38812 -8443 -308631 494890 -187689 -19097 111721 -273238 21504 42305
6184 42305 7911 -251805 -102609 29191 264294 -74527 106757 -274507 33726 82107 -131930
6172 -194838 188253 91130 -31103 -14583 120904 1779 -347360 80073 -255347 -52226 -86235
6161 -86235 105194 30217 -356481 -28965 54725 -211131 26186 14986 92961 198971 124456
6150 124456 65425 144520 51203 -73919 -143540 -80465 -136678 -18205 -169253 350708 110251
6138 60946 168376 -184125 -78334 238148 -78513 -262028 206682 -227772 220693 -115816
6127 110726 -420650 59899 -127941 -29458 197355 -116229 96055 -352017 348044 -87416
6116 -73665 41139 137367 38612 -153589 20390 -34976 -154865 -81601 376661 402888 -35073
6104 -175176 29848 -17592 -32714 44514 -37961 -144878 168755 258845 281150 5125 -23595
6092 -80942 -7905 -286730 -52090 -200873 99459 341027 52967 -158081 119660 370101 30067
6080 -178376 -103803 -18674 -165397 -31915 53589 -122838 301179 -52076 -144045 102782 30905
6068 -147423 -105797 130521 -21306 -129985 -158491 39453 14259 -234202 262438 -194777 356839
6056 -28131 33808 160092 31619 49792 109800 -177336 158110 149354 -318922 -125829 -36938
6044 -448252 -243201 -120453 -244955 113466 -54014 324616 108357 -186052 -238344 -178597
6034 -178597 -16025 -25086 -150793 -254692 -114861 -356720 216932 506843 -28156 334262
6023 -21948 18602 215041 267390 -61149 -149314 -54688 52562 -74987 -182447 495216 212010
6011 194412 -145049 1857 -94899 -268396 108897 146746 198778 8682 -107888 -254008 -96359
5999 114521 -135417 192849 -283191 72636 -244221 177239 49715 18814 -163406 -135417
5989 -135417 -88900 421365 107752 203751 -322088 -46729 242537 195015 -30888 -106499 -82019
5978 -82019 -320144 8710 125419 -110187 -75004 -690 -191752 116481 360467 -438467 3431
5966 75240 88243 154372 169532 -34336 119292 -479818 -90201 39734 243813 -205765 73769
5954 -189180 208573 249016 255587 106461 -94935 154679 66278 271337 -426807 -62277 -156300
5943 -156300 -99525 142201 -174109 197044 -263850 -3558 -189830 260583 108045 441519
5933 441519 -71734 271677 155520 -110199 -93683 -165805 -122728 -177469 71583 74380 -110602
5921 -63213 206101 57982 -27996 -100089 -220224 -95290 -166009 40203 212160 -155248 -69742
5909 -46976 44893 -248211 139287 1203 -4884 3854 163506 -82273 -151148 210621 -114012
5897 -28858 390025 -330004 -228916 -182078 156564 308837 -225624 -286631 -170565 -166259 -75754
5885 124558 213391 -282605 -263016 32631 50145 55442 -256229 -166604 -101498 -222361 40487
5873 -92466 115861 30223 25486 -322651 11028 795 25166 -118426 195379 87573 -319810
5861 216793 -101184 -133224 -153023 62173 -440059 335982 -170425 -119365 63389 109071 -95274
5849 -102612 -127587 273982 -178255 -38811 358452 6476 15558 -74913 -95240 -31307 152056
5837 181295 130400 -281056 3271 67816 96962 -107369 -13669 -159628 31009 -104598 -69771
5826 -69771 -53781 119468 111603 -271806 168009 -299997 -207350 -180423 -245963 149307 -42129
5814 32223 -103641 -287225 254442 64242 45562 149759 -38400 -234744 -68012 304580 -56127
5802 63078 -49476 -75310 -41278 -2198 51713 70281 47668 19431 51771 -292176 -207906 -101872
5789 74682 213245 -158648 -169132 174437 31531 -15699 172345 25878 231968 -239667 41410
5777 -14357 -57351 -239067 122136 -153794 199572 -22282 98675 -32514 -79768 -121377 133079
5765 69026 306389 -223088 -131021 2002 -101906 -76896 -123085 96696 22715 287473 90118
5753 9163 -76058 -10482 87003 401482 -78429 -208314 266845 -155725 -237652 -64550 43309
5741 45671 -165186 -99870 -245398 63407 84090 194458 266843 171436 -41183 -148544 -96184
5730 -96184 -61855 114387 -255596 14695 -31723 79828 -336513 68583 -87376 -200160 124462
5718 160431 -218096 117198 -2559 109729 -22001 -48225 117709 366904 -228193 11149 -374084
5706 -79770 35019 -22069 -158781 18466 42870 77172 177634 -70836 -398035 -215723 -121689
5695 -121689 227007 43806 -310517 -192216 98366 174175 451022 -88736 -112800 -126551 157649
5683 -64766 -76132 -205716 370193 285305 -87443 297536 123171 -35426 22778 -95231 -117935
5672 -117935 4631 145489 97320 34385 -68245 -62381 -267950 -112543 70943 -87001 -248551
5661 -248551 46299 157079 -8817 -47800 159754 117152 -45462 -54097 -38701 -438974 361201
5649 41346 -193293 -45197 -60173 -391469 -86044 223461 84141 -269740 56955 314576 -263930
5637 37243 20799 -436772 47345 -353022 -29986 46502 36296 113613 112126 -86785 432725
5625 330504 -125878 259569 317440 24219 -304048 -132784 -68546 32877 234522 -236730
5614 114239 190907 -118629 -77658 -640 152588 -298977 247280 83584 46800 -18144 -26053
5603 -26053 1994 -162555 44007 -192461 -80720 -293548 -25490 33314 23853 -12142 -141353
5592 -141353 -324017 67425 26866 122917 54162 -121708 56998 34723 -372286 411249 -6278
5580 -390242 -112365 -372492 130467 106805 -79717 -366450 153558 80670 -171178 281136
5569 -310215 -203759 -247024 182370 94589 158160 -44027 176011 65533 104747 -97623 -145871
5558 -145871 110525 -63025 -256944 154507 299976 104314 106975 16160 65680 20783 -128796
5546 -369525 -188312 10808 -16635 131154 26540 -120298 -17663 -1626 92326 60060 -228736
5534 31333 10994 -85609 -43738 -196968 -137807 405178 -327599 -72524 41120 164863 140789
5523 140789 28624 -37089 4588 261205 -183912 269108 274324 197629 -204439 -108179 -230490
5512 -230490 109715 -102411 -145567 24657 224788 -311815 130755 76205 -33497 -111478 184359
5500 -50780 -51955 -162508 -43161 141005 365839 -5367 215360 -260159 80411 90306 -70583
5488 -237135 168622 214978 46326 18732 143469 254594 235350 56150 -68525 -74083 8807
5476 -186470 9423 -40132 105869 -27418 -192860 -163214 33727 -245478 63965 -319331 -112095
5464 -170869 -81298 36559 129809 202395 148616 287645 56057 -143665 -8770 -15860 25956 189159
5452 189159 -111065 256724 -104323 203992 169596 16188 -293542 216660 145640 -214927
5441 125305 -339324 -440 60394 352598 -218287 -88063 115423 -169090 200704 -270930 49907
5429 -108192 -55032 -32045 25928 -27732 -4583 -211035 -25018 49192 -152594 204290 -26244
5417 14966 -227869 143393 -189099 -119051 127020 30241 -131531 -92313 -28608 209022 73107
5405 -4795 76717 -78805 333428 117176 55199 -94453 -264200 153550 219610 -470999 136465
5393 376 -300973 74311 233227 -45321 113107 251465 44152 -22560 29395 -197402 69882
5381 -46731 -176397 -91021 -357000 -302104 -79669 -105340 44907 155937 -39073 -60939 124788
5369 -36114 -77160 -17528 -1917 24057 72790 585414 -71220 -62908 82193 -281595 -118142 426847
5356 -263954 45038 -170380 -169917 -108925 37490 -378821 -44721 -122222 46969 200123 -79947
5344 431502 -171573 -383113 214461 200103 -255694 -113206 -174184 34824 102970 -251823
5333 -64478 100903 291105 97907 134901 57472 102301 109627 -9395 173658 123816 -262682
5321 -257669 -258640 166017 19416 40490 -134139 -5336 -44029 430414 -84997 299054 -117271
5309 -33264 204689 74044 38610 29728 129792 -151693 -40667 64977 -45155 27663 -87446
5297 25536 -227840 -297373 -203853 60763 -328835 50481 -309168 -347020 58462 491524 149930
5285 52315 -4367 25678 -183659 -50129 -230221 75333 73838 87563 83388 218385 -346855 147316
5272 94394 -57723 236210 -9915 -6871 121007 331832 212928 -228785 66781 138428 170249
5261 170249 37492 -236250 -419904 332098 201734 310776 176690 337923 -174484 44642
5250 387830 149115 -258491 -203032 -52095 -259429 139577 -250467 92359 -233536 -26915
5239 56754 18733 227055 348787 -214125 185018 29770 408155 89042 110228 163744 267193
5228 267193 -207981 205822 24331 -269738 125543 -158844 -173011 -44813 -13990 216918
5217 -83088 -174273 -79865 -143579 131527 123956 -13646 195077 -19635 -231110 34508 122995
5206 122995 94963 13290 -136639 -117971 -150508 -68383 -202582 -38526 -13478 -36309 -174508
5195 -174508 14180 188387 -58607 118383 190406 49964 19835 72918 -2556 -263731 102810
5183 -167762 10654 -129557 44078 251705 -90322 37082 26696 -8307 -112526 -225393 -1053
5171 192528 25676 323983 -130570 13868 -125643 -498390 -188472 192577 -178830 307533
5160 40862 -121531 -113555 -73445 -11901 -381280 -207237 355015 200412 94305 78420 83378
5149 83378 -162335 -265409 125153 140541 -137967 220429 -129472 3670 -70830 241431 43634
5137 -77943 -114945 183470 100428 -153792 -18367 -18488 174661 -170800 206507 -236404 66945
5125 31878 71139 232341 18700 -3031 214050 26343 -190808 31031 189930 210321 5353
5113 71549 -325084 183018 -3455 34760 198367 -118207 -37243 177525 33887 73558 -5001
5101 313162 336273 180702 212050 26170 98559 213636 219420 -93763 21836 -142318 348352
5089 233730 196928 153489 65035 196015 -174689 -111681 -108188 -264856 28913 -119318 144610
5077 36021 -93934 51760 40753 182973 133968 -320692 -93676 -56124 416701 -374850 103487
5065 -86618 47976 394323 70139 41493 322802 30290 -15748 -37901 -301163 -409880 32343
5053 -386233 -107356 47470 178214 53209 162605 338017 81576 -300594 -128334 42166
5042 52771 -158470 12940 -18914 228929 57840 -48437 -149031 213780 -146338 305590 100022
5030 275080 -41288 154366 144588 99450 291743 -92810 17877 -32064 -75492 -186756 201240
5018 -32132 -64180 212420 -295380 79538 -20849 37981 -354158 -67202 -191776 116856 95346
5007 95346 53607 383435 127993 -133676 38014 -1 -57445 105975 290613 78444 -72740 -142298
4995 -142298 44580 -171255 143411 -52843 154290 154896 90053 -146895 -186135 -114871 -125706
4984 -125706 -280764 123904 -173979 51523 -153191 -107851 -168123 12765 219761 -243603
4973 180062 43650 113153 -256371 -423854 -104470 -217473 -91279 -231969 124932 69062
4963 69062 -154771 232824 78902 -289934 121794 2953 5377 -2377 12502 -112190 -71115
4952 -71115 -161256 -146687 6051 5339 -167342 -30915 -191623 292579 190266 60891 -129158
4940 -56925 15969 -152319 72732 22108 92058 -47359 -155132 -272324 123263 -122712 109534
4928 -16310 -93382 150233 -43827 195257 -197767 98942 -106853 133409 195939 45380 104501
4917 104501 -337014 234046 277976 -94338 174472 121545 -287822 -101607 -11709 -194463
4907 -194463 108561 34664 -312731 142341 -185678 200515 52516 -175316 62244 108524
4897 108524 182253 282048 -65486 -202234 80872 -290947 -87204 481775 -183074 -241220 221121
4885 23181 135908 49545 -85613 466343 -82307 295201 -290136 212282 215171 140204 -289253
4873 -137605 -206651 33346 143205 365511 210445 49752 253469 -129961 -165811 45655 -181831
4861 90482 262667 -241642 207446 -62906 -11058 -129912 -134829 -31029 241089 -139503 -75053
4850 -75053 192512 -32593 -237154 264358 36590 112374 149486 -250392 329483 -38019 406541
4838 -91817 -54970 30269 88168 -50934 42714 78342 29172 -261998 246451 -401369 -185355
4826 71952 220627 145103 30199 -189892 66417 -201686 73876 269418 224298 -360040 -2087
4814 -169071 270270 -282363 522598 134522 -213926 124892 234672 -273362 330821 -193195
4803 218518 -308 -131809 -67952 220694 55923 244734 48161 -113179 -56413 170465 -229309
4791 355115 202221 116466 -80874 -51173 45263 -100667 132814 39000 214632 -76689 175089
4779 200674 16758 98293 88194 -108824 287155 -18491 19151 268448 -151636 194778 -64073
4767 -49057 -68390 125191 82030 -121050 64385 36202 75974 216452 52451 304734 -193191
4755 92624 -156737 27002 210962 -54757 136691 -116463 -4676 -60850 133854 96183 -367165
4743 59989 -49472 -96224 23645 211571 34513 324143 -68991 23944 215518 465025 -159720
4731 378440 -355593 -100160 167680 -33448 -109772 325349 152445 -166610 81275 -41477
4720 5982 -66098 82774 -13456 -126580 25246 -327338 -281743 137405 277661 -65515 -22014
4708 -173046 318321 237261 -215837 109570 -108598 286270 165157 56799 38604 -51546
4697 255574 -20219 18250 197226 -63484 -9671 289114 -25398 142510 24338 212729 -152175
4685 39991 -46858 35475 232860 -175542 256525 76539 38151 -164315 268370 -172124 104627
4673 265099 -132476 -78707 -378275 -146611 3675 136646 -313066 86263 25884 209493 139353
4662 139353 -191164 198097 67006 -50174 -83028 -337 33135 33369 -73590 50144 -129569 36696
4649 14843 -268558 39458 99833 305122 23076 26859 67591 181290 359755 -175936 146861
4637 17985 -41121 201027 140062 231210 -87226 6360 -178904 -85213 235732 -51837 -62669
4626 -62669 90452 293532 201133 96972 -35636 19946 96534 61822 100372 -77923 -24542 -79962
4614 -79962 -34366 78449 -448915 82948 6875 -19697 110178 -65993 223141 254430 56505
4602 41502 370230 -85619 -202403 -35650 -316257 187572 12379 144537 -166209 252483
4591 172899 -127258 5902 -65993 -82408 -311736 7490 50884 -109293 85556 110188 -243128
4579 -28526 122028 -292743 68969 -206060 -167987 367536 -206732 123831 25496 -150635
4568 7906 261283 98328 -160219 209759 -178640 -176920 41661 -146241 -39939 6196 -280078
4556 -126393 135004 -128069 404262 -183967 -45361 71026 435998 68344 -107472 299604
4545 -178797 109294 -91583 -167341 -37884 -449264 -22206 334 339498 -150622 -61208 210938
4533 -121059 29652 -66361 -13172 -186212 68132 -63815 109335 -286526 -36304 180489 -85958
4521 -20905 147067 62746 -155415 67769 141721 -6016 175597 -232998 63376 -23633 142466
4509 136840 308406 227142 530250 99757 -99501 -45798 -192072 -50897 194487 126119 294124
4498 294124 499823 122189 -22767 -577600 506668 33004 -137579 210141 88694 190438
4488 190438 59352 -105694 67052 47898 116781 -145312 433643 55057 -28283 81812 -160787
$$ [...]
##END NTUPLES=NMR SPECTRUM
##END=
