
##TITLE=AC1068_TOPL01_6519229_qYJ3gEzVqc
##JCAMPDX= 6.0         $$ Bruker NMR JCAMP-DX V2.0
##DATA TYPE= NMR SPECTRUM
##DATA CLASS= NTUPLES
##ORIGIN= BRUKER
##OWNER= Administrator
$$ 1.72 TOPSPIN		Version 2.1
$$ 2012-07-13 17:26:15.640 -0500  Administrator@TOPSPIN
$$ Compression mode = diff/dup
##.OBSERVE FREQUENCY= 400.02188249412
##.OBSERVE NUCLEUS= ^1H
##.ACQUISITION MODE= SIMULTANEOUS (DQD)
##.ACQUISITION SCHEME= undefined
##.AVERAGES= 64
##.DIGITISER RES= 22
##SPECTROMETER/DATA SYSTEM= spect
##.PULSE SEQUENCE= noesygpps1d.comp
##.SOLVENT NAME= COFFEE_meoh
##.SHIFT REFERENCE= INTERNAL, COFFEE_meoh, 1, 14.96254
##AUDIT TRAIL= $$ (NUMBER, WHEN, WHO, WHERE, PROCESS, VERSION, WHAT)
$$ ##TITLE= Audit trail, TOPSPIN		Version 2.1
$$ ##JCAMPDX= 5.01
$$ ##ORIGIN= Bruker BioSpin GmbH
$$ ##OWNER= Administrator
$$ $$ C:\Bruker\TOPSPIN/data/COFFEE/nmr/AC1068_TOPL01_6519229_qYJ3gEzVqc/42/pdata/1/auditp.txt
$$ ##AUDIT TRAIL=  $$ (NUMBER, WHEN, WHO, WHERE, PROCESS, VERSION, WHAT)
(   1,<2012-07-13 17:26:10.968 -0500>,<Administrator>,<TOPSPIN>,<go>,<TOPSPIN 2.1>,
      <created by zg
	started at 2012-07-13 17:14:40.859 -0500,
	POWCHK enabled, PULCHK disabled,
       configuration hash MD5:
       6B 1B 68 BB D9 2E 58 E2 7F 35 AD 54 07 DF 0E 41
       data hash MD5: 64K
       15 16 9C 7B A2 00 10 80 4F CE 71 2F 05 3F 66 B5>)
(   2,<2012-07-13 17:26:13.656 -0500>,<Administrator>,<TOPSPIN>,<proc1d>,<TOPSPIN 2.1>,
      <Start of raw data processing
       efp LB = 0.3 FT_mod = 6 PKNL = 1 PHC0 = 0 PHC1 = 0 SI = 128K 
       data hash MD5: 128K
       BF 2D C0 42 C7 45 65 89 8B F4 2A 49 0C 6D E7 FB>)
(   3,<2012-07-13 17:26:14.859 -0500>,<Administrator>,<TOPSPIN>,<proc1d>,<TOPSPIN 2.1>,
      <pk PHC0 = -0.05493164 PHC1 = 0 
       data hash MD5: 128K
       DB 80 69 7E 63 8B 28 85 32 9F 61 0D 19 DF 49 71>)
(   4,<2012-07-13 17:26:15.093 -0500>,<Administrator>,<TOPSPIN>,<proc1d>,<TOPSPIN 2.1>,
      <abs ABSG = 1 
       data hash MD5: 128K
       0D B1 C2 72 10 6B C3 37 4C 02 A3 BB 6C 53 AF 41>)
(   5,<2012-07-13 17:26:15.171 -0500>,<Administrator>,<TOPSPIN>,<proc1d>,<TOPSPIN 2.1>,
      <abs ABSG = 2 
       data hash MD5: 128K
       69 C5 26 78 C1 38 7D 2C C6 FA 7B 21 58 ED 8E 7B>)
(   6,<2012-07-13 17:26:15.218 -0500>,<Administrator>,<TOPSPIN>,<proc1d>,<TOPSPIN 2.1>,
      <abs ABSG = 3 
       data hash MD5: 128K
       2C 10 E8 71 07 E2 FD C0 1A 8C 73 B1 76 43 74 A4>)
(   7,<2012-07-13 17:26:15.281 -0500>,<Administrator>,<TOPSPIN>,<proc1d>,<TOPSPIN 2.1>,
      <abs ABSG = 4 
       data hash MD5: 128K
       18 9A EC 19 32 5B F2 4A B4 02 B7 9B F9 4F 4F AB>)
(   8,<2012-07-13 17:26:15.515 -0500>,<Administrator>,<TOPSPIN>,<proc1d>,<TOPSPIN 2.1>,
      <abs ABSG = 5 
       data hash MD5: 128K
       0E 19 B9 3A DA 5D 70 EF BC 09 71 7D 6B E9 51 20>)
$$ ##END=
$$ 
$$ $$ hash MD5
$$ $$ 55 6F B4 94 5F 79 C8 F9 5C 27 A6 38 95 5D D3 A4
##$RELAX= 
##$RELAX= 
##$RELAX= 
##$RELAX= 
##$RELAX= 
##$RELAX= 
##$RELAX= 
##$RELAX= 
##$RELAX= 
$$ Bruker specific parameters
$$ [...]
##$TP07= 0
##$TPNAME0= <>
##$TPNAME1= <>
##$TPNAME2= <>
##$TPNAME3= <>
##$TPNAME4= <>
##$TPNAME5= <>
##$TPNAME6= <>
##$TPNAME7= <>
##$TPOAL= (0..7)
0.5 0.5 0.5 0.5 0.5 0.5 0.5 0.5
##$TPOFFS= (0..7)
0 0 0 0 0 0 0 0
##$TUNHIN= 0
##$TUNHOUT= 0
##$TUNXOUT= 0
##$USERA1= <user>
##$USERA2= <user>
##$USERA3= <user>
##$USERA4= <user>
##$USERA5= <user>
##$V9= 5
##$VALIST= <valist>
##$VCLIST= <CCCCCCCCCCCCCCC>
##$VD= 0
##$VDLIST= <DDDDDDDDDDDDDDD>
##$VPLIST= <PPPPPPPPPPPPPPP>
##$VTLIST= <TTTTTTTTTTTTTTT>
##$WBST= 2048
##$WBSW= 25
##$XGAIN= (0..3)
0 0 0 0
##$XL= 0
##$YL= 0
##$YMAX_a= 17749088
##$YMIN_a= -10984091
##$ZGOPTNS= <>
##$ZL1= 120
##$ZL2= 120
##$ZL3= 120
##$ZL4= 120
##$ABSF1= 14.96254
##$ABSF2= -5.595642
##$ABSG= 5
##$ABSL= 3
##$ALPHA= 0
##$AQORDER= 0
##$ASSFAC= 0
##$ASSFACI= 0
##$ASSFACX= 0
##$ASSWID= 0
##$AUNMP= <proc_prof1d_extract.lims>
##$AXLEFT= 0
##$AXNAME= <>
##$AXNUC= <1H>
##$AXRIGHT= 0
##$AXTYPE= 0
##$AXUNIT= <>
##$AZFE= 0.1
##$AZFW= 0.1
##$BCFW= 0
##$BC_mod= 0
##$BYTORDP= 0
##$COROFFS= 0
##$CY= 15
##$DATMOD= 1
##$DC= 0
##$DFILT= <>
##$DTYPP= 0
##$F1P= 0
##$F2P= 0
##$FCOR= 0.5
##$FTSIZE= 131072
##$FT_mod= 6
##$GAMMA= 0
##$GB= 0
##$INTBC= 1
##$INTSCL= 1
##$ISEN= 128
##$LB= 0.3
##$LEV0= 0
##$LPBIN= 0
##$MAXI= 10000
##$MC2= 0
##$MEAN= 0
##$ME_mod= 0
##$MI= 0
##$NCOEF= 0
##$NC_proc= -2
##$NLEV= 6
##$NOISF1= 0
##$NOISF2= 0
##$NSP= 0
##$NTH_PI= 0
##$NZP= 0
##$OFFSET= 14.96254
##$PC= 1
##$PHC0= -0.05493164
##$PHC1= 0
##$PH_mod= 1
##$PKNL= yes
##$PPARMOD= 0
##$PPDIAG= 0
##$PPIPTYP= 0
##$PPMPNUM= 2147483647
##$PPRESOL= 1
##$PSCAL= 4
##$PSIGN= 0
##$PYNMP= <proc.py>
##$REVERSE= no
##$SF= 400.020009021081
##$SI= 131072
##$SIGF1= 0
##$SIGF2= 0
##$SINO= 400
##$SIOLD= 131072
##$SPECTYP= <>
##$SREGLST= <1H.CDCl3>
##$SSB= 0
##$STSI= 131072
##$STSR= 0
##$SW_p= 8223.68421052631
##$SYMM= 0
##$S_DEV= 0
##$TDeff= 65536
##$TDoff= 0
##$TI= <>
##$TILT= no
##$TM1= 0
##$TM2= 0
##$TOPLEV= 0
##$USERP1= <user>
##$USERP2= <user>
##$USERP3= <user>
##$USERP4= <user>
##$USERP5= <user>
##$WDW= 1
##$XDIM= 131072
##$YMAX_p= 445489801
##$YMIN_p= -64533
##$CURPLOT= <Network HP LaserJet P1505>
##$CURPRIN= <$Network HP LaserJet P1505>
##$DFORMAT= <normdp>
##$LAYOUT= <+/1D_H.xwp>
##$LFORMAT= <normlp>
##$PFORMAT= <normpl>
##$SURQMSG= 1
$$ End of Bruker specific parameters
$$ ---------------------------------
##NTUPLES= NMR SPECTRUM
##VAR_NAME=  FREQUENCY,     SPECTRUM/REAL,   SPECTRUM/IMAG
##SYMBOL=    X,             R,               I
##VAR_TYPE=  INDEPENDENT,   DEPENDENT,       DEPENDENT
##VAR_FORM=  AFFN,          ASDF,            ASDF
##VAR_DIM=   131072,        131072,          131072
##UNITS=     HZ,            ARBITRARY UNITS, ARBITRARY UNITS
##FACTOR=    0.0627417313425164, 1,          1
##FIRST=     8223.62146879497, 723,          -67944
##LAST=      0,             2047,            -68723
##MIN=       0,             -64533,          0
##MAX=       8223.62146879497, 445489801,    0
$$ Real data points
##PAGE= N=1
##DATA TABLE= (X++(R..R)), XYDATA
$$ [...]
$$ plain form
63211 961076 978855 995609 1009732 1020380 1027202 1029375 1025812 1016350 1001938 983506 961342 935790
63199 935790 907857 878669 848798 818646 789244 762085 738170 717544 699803 684818 672856
63188 672856 664157 658643 656062 656310 659452 665429 673837 684057 695532 707958 721359 735985 751944
63175 751944 768922 786483 804585 823434 842745 861661 879665 897174 914726 931903 947560
63164 947560 961057 972713 982975 991519 997342 999518 997697 991951 982352 968904 951980 932523 911387
63151 911387 888580 863752 837493 811495 787174 764741 744033 725438 709326 695097 681694
63140 681694 668771 656641 645399 634921 625552 617827 611487 605576 599588 593815 588565 583804 579688
63127 579688 576611 574517 572851 571383 570411 569988 569769 569901 571216 574085 577807 581671 585901 590905 596258
$$ packed form
63211I61076J7779J6754J4123J0648O822K173l563r462j4412j8432k2164k5552
63199I35790k7933k9188k9871l0152k9402k7159k3915k0626j7741j4985j1962
63188F72856q699n514k581K48L142N977Q408J0220J1475J2426J3401J4626J5959
63175G51944J6978J7561J8102J8849J9311J8916J8004J7509J7552J7177J5657
63164I47560J3497J1656J0262Q544N823K176j821n746r599j3448j6924j9457k1136
63151I11387k2807k4828k6259k5998k4321k2433k0708j8595j6112j4229j3403
63140F81694j2923j2130j1242j0478r369p725o340n911n988n773n250m761m116
63127E79688l077k094j666j468r72m23k19J32J315K869L722L864M230N004N353
$$ plain form
63112 596258 601292 606271 612078 618855 625742 632000 637798 643754 650219 657220 664754 672883 681555 690376
63098 690376 698624 705662 711486 716661 721571 725895 728999 730661 731245 731402 731827 733064 735156 737543 739537
63083 739537 740885 741728 742150 742079 741626 741302 741810 743651 746932 751419 756710 762329 767774 772738 777473 782747
63067 782747 789182 796726 805032 814222 824859 837252 851271 866868 884323 903841 925415 949291
63055 949291 976138 1006434 1039980 1076214 1114689 1155015 1196776 1239890 1284853 1332311 1382455
63044 1382455 1434874 1488625 1542243 1594148 1643570 1690996 1737413 1783266 1828316 1872255 1915100
63033 1915100 1957037 1998206 2038600 2078064 2116327 2152886 2186557 2215205 2236404 2248595 2251312
63022 2251312 2244283 2226923 2199013 2161366 2115325 2062010 2002462 1938236 1871385 1804093 1738606
$$ packed form
63112E96258N034M979N807O777O887O258N798N956O465P001P534Q129Q672Q821
63098F90376Q248P038N824N175M910M324L104J662N84J57M25J237K092K387J994
63083G39537J348Q43M22p1m53l24N08J841L281M487N291N619N445M964M735N274
63067G82747O435P544Q306R190J0637J2393J4019J5597J7455J9518K1574K3876
63055I49291K6847L0296L3546L6234L8475M0326M1761M3114M4963M7458N0144
63044A382455N2419N3751N3618N1905M9422M7426M6417M5853M5050M3939M2845
63033A915100M1937M1169M0394L9464L8263L6559L3671K8648K1199J2191K717
63022B251312p029j7360k7910l7647m6041n3315n9548o4226o6851o7292o5487
$$ plain form
63011 1738606 1677132 1621211 1571340 1527594 1490341 1459922 1436025 1417983 1405560 1398886 1397837 1402120
62999 1402120 1411851 1427322 1448104 1472996 1500996 1531779 1565044 1599907 1635214 1670097 1704100
62988 1704100 1737223 1770051 1803295 1836763 1868972 1898156 1923471 1944892 1962105 1974043 1979563
62977 1979563 1978163 1969722 1953767 1929418 1896246 1854963 1807084 1754072 1697017 1636979 1575199 1512833
62965 1512833 1450763 1389826 1331002 1275228 1223275 1175815 1133255 1095316 1061127 1030032 1002016
62954 1002016 977049 954418 933228 913339 895331 879632 866143 854653 845031 836885 829467 822144
62942 822144 814716 807119 799129 790607 781844 773411 765611 758235 750940 743800 737301 731706 726565 721160
62928 721160 715418 710022 705507 701553 697357 692459 686961 681147 675152 668848 661943 654405 646950 640754
$$ packed form
63011A738606o1474n5921m9871m3746l7253l0419k3897j8042j2423o674j049M283
62999A402120R731J5471K0782K4892K8000L0783L3265L4863L5307L4883L4003
62988A704100L3123L2828L3244L3468L2209K9184K5315K1421J7213J1938N520
62977A979563j400q441j5955k4349l3172m1283m7879n3012n7055o0038o1780o2366
62965A512833o2070o0937n8824n5774n1953m7460m2560l7939l4189l1095k8016
62954A002016k4967k2631k1190j9889j8008j5699j3489j1490r622q146p418p323
62942H22144p428p597p990q522q763q433p800p376p295p140o499n595n141n405
62928G21160n742n396m515l954m196m898n498n814n995o304o905p538p455o196
$$ plain form
62914 640754 636347 633035 629693 625872 621822 617726 613420 608773 603956 599362 595535 593004 591814 591307
62900 591307 590678 589713 588740 588057 587701 587636 587769 587874 587749 587318 586381 584532 581688 578341 574964 571448 567706
62883 567706 564395 562269 560966 559286 556823 554585 553759 554408 555661 556688 557159 557134 556900 556839 557241 558223 559753
62866 559753 561615 563460 565125 566771 568499 570018 571010 571563 571875 571843 571396 570944 570892 570903 570354 569309 568324
62849 568324 567417 566120 564516 563253 562369 561029 558741 555984 553277 550457 547365 544476 542253 540471 538722
62834 538722 536950 534964 532145 528403 524841 522633 521533 520272 518113 515276 512038 508310 504098 499713
62820 499713 495445 491515 488259 485773 483452 480519 477074 474025 471918 470469 469396 469027 469663 470834 471736
62805 471736 472253 473151 475317 479041 483988 489707 496119 503540 512163 521517 530719 539363 548043 557806 569194
$$ packed form
62914F40754m407l312l342l821m050m096m306m647m817m594l827k531j190n07
62900E91307o29r65r73o83l56o5J33J05j25m31r37j849k844l347l377l516l742
62883E67706l311k126j303j680k463k238q26O49J253J027M71k5k34o1M02R82J530
62866E59753J862J845J665J646J728J519R92N53L12l2m47m52n2J1n49j045r85
62849E68324r07j297j604j263q84j340k288k757k707k820l092k889k223j782j749
62834E38722j772j986k819l742l562k208j100j261k159k837l238l728m212m385
62820D99713m268l930l256k486k321k933l445l049k107j449j073l69O36J171R02
62805D71736N17Q98K166L724M947N719O412P421Q623R354R202Q644Q680R763J1388
$$ plain form
62790 569194 582069 596264 612070 629869 649540 670602 692963 717292 744506 775101 809093
62779 809093 846402 887039 931087 978853 1031055 1088517 1151466 1219191 1290438 1364134 1439809
62768 1439809 1517381 1596364 1675116 1751018 1821518 1884754 1938994 1982040 2011877 2027759 2030046
62757 2030046 2019107 1995103 1958791 1911662 1855063 1790045 1718375 1642757 1565399 1487074 1408359
62746 1408359 1331132 1257769 1189132 1124364 1062704 1004609 950889 901537 855890 813467 774278
62735 774278 738536 706337 677461 651314 627267 605203 585524 568451 553485 539777 526985
62724 526985 515524 505858 497682 490011 482246 474953 469325 465871 463971 462791 462257 462883 464938 468177
62710 468177 472287 477181 482914 489629 497727 507839 520501 535797 553334 572600 593540 616812
$$ packed form
62790E69194J2875J4195J5806J7799J9671K1062K2361K4329K7214L0595L3992
62779H09093L7309M0637M4048M7766N2202N7462O2949O7725P1247P3696P5675
62768A439809P7572P8983P8752P5902P0500O3236N4240M3046K9837J5882K287
62757B030046j0939k4004l6312m7129n6599o5018p1670p5618p7358p8325p8715
62746A408359p7227p3363o8637o4768o1660n8095n3720m9352m5647m2423l9189
62735G74278l5742l2199k8876k6147k4047k2064j9679j7073j4966j3708j2792
62724E26985j1461r666q176p671p765p293n628l454j900j180n34O26K055L239
62710D68177M110M894N733O715Q098J0112J2662J5296J7537J9266K0940K3272
$$ plain form
62698 616812 643337 673563 707334 744458 784995 828938 876090 926556 980924 1039490 1101542
62687 1101542 1165715 1230721 1295235 1357382 1414997 1466381 1510333 1545551 1570570 1584290 1586058
62676 1586058 1575351 1552156 1517885 1475208 1426496 1372747 1314326 1252302 1188557 1124885 1062513
62665 1062513 1002383 945347 891893 842002 795461 752239 712483 676296 643587 614075 587327
62654 587327 562870 540422 520054 501987 486041 471386 457104 443067 429973 418395 408042
62643 408042 398230 388789 380111 372433 365540 359138 353073 347109 340980 334920 329737 326032 323511 321338
62629 321338 318939 316225 313252 310104 307029 304312 302032 300229 299276 299613 300875 301765 301273 299921 299446
62614 299446 301180 304985 309731 314364 318371 321645 324426 327338 331114 336075 341911 347996 353929 359951
$$ packed form
62698F16812K6525L0226L3771L7124M0537M3943M7152N0466N4368N8566O2052
62687A101542O4173O5006O4514O2147N7615N1384M3952L5218K5019J3720J768
62676A586058j0707k3195l4271m2677m8712n3749n8421o2024o3745o3672o2372
62665A062513o0130n7036n3454m9891m6541m3222l9756l6187l2709k9512k6748
62654E87327k4457k2448k0368j8067j5946j4655j4282j4037j3094j1578j0353
62643D08042r812r441q678p678o893o402o065n964o129o060n183l705k521k173
62629C21338k399k714k973l148l075k717k280j803r53L37J262Q90m92j352m75
62614B99446J734L805M746M633M007L274K781K912L776M961N836O085N933O022
$$ plain form
62600 359951 367007 376204 387942 401601 416324 432028 449397 469019 490970 515295 542396 572685
62588 572685 606157 642480 681264 722013 764088 806873 849700 891332 929847 963438 991177
62577 991177 1012769 1027831 1035857 1036699 1030568 1017555 997720 971791 941413 908415 874046 839055
62565 839055 804217 770415 738198 707491 677846 649068 621659 596646 574824 556022 539100
62554 539100 522800 506659 491081 476547 462868 449411 435985 423191 411696 401463 392018 383229
62542 383229 375270 367891 360401 352610 345329 339537 335434 332635 330906 330208 330216 330341 330321 330447 331171 332722
62526 332722 335186 338734 343657 350047 357396 364674 371244 377752 385650 395581 406754 418258 430508
62513 430508 444772 461632 480662 501564 524877 551391 581317 614153 648921 684417 719615
$$ packed form
62600C59951P056R197J1738J3659J4723J5704J7369J9622K1951K4325K7101L0289
62588E72685L3472L6323L8784M0749M2075M2785M2827M1632L8515L3591K7739
62577I91177K1592J5062Q026Q42o131j3013j9835k5929l0378l2998l4369l4991
62565H39055l4838l3802l2217l0707k9645k8778k7409k5013k1822j8802j6922
62554E39100j6300j6141j5578j4534j3679j3457j3426j2794j1495j0233r445q789
62542C83229p959p379p490p791p281n792m103k799j729o98QJ25k0J26P24J551
62526C32722K464L548M923O390P349P278O570O508P898R931J1173J1504J2250
62513D30508J4264J6860J9030K0902K3313K6514K9926L2836L4768L5496L5198
$$ plain form
62502 719615 754094 787863 820636 851448 878971 902003 919638 931222 936260 934400 925696 910996
62490 910996 891786 869303 844023 816211 786627 756245 725699 695608 667039 640816 616557
62479 616557 593375 571547 552490 536823 523483 511232 500162 491064 483976 478165 473150 468967
62467 468967 465689 463289 461796 461093 460817 460954 462226 465227 469428 473767 478128 483420 490036 497079 503560
62452 503560 509856 517385 526991 538062 549201 559463 568826 577631 585760 592475 597048 599268 599211 596669
62438 596669 591202 582717 571700 558769 544265 528469 512011 495761 480300 465659 451621 438233
62426 438233 426008 415659 407598 401649 397223 393831 391386 390054 389883 390740 392624 395829 400568 406493
62412 406493 412847 419248 426100 434048 443171 453005 463223 473901 484999 495924 505870 514405 521451
$$ packed form
62502G19615L4479L3769L2773L0812K7523K3032J7635J1584N038j860q704j4700
62490I10996j9210k2483k5280k7812k9584l0382l0546l0091k8569k6223k4259
62479F16557k3182k1828j9057j5667j3340j2251j1070r098p088n811n015m183
62467D68967l278k400j493p03k76J37J272L001M201M339M361N292O616P043O481
62452E03560O296P529R606J1071J1139J0262R363Q805Q129O715M573K220n7k542
62438E96669n467q485j1017j2931j4504j5796j6458j6250j5461j4641j4038j3388
62426D38233j2225j0349q061n949m426l392k445j332j71Q57J884L205M739N925
62412D06493O354O401O852P948R123R834J0218J0678J1098J0925R946Q535P046
$$ plain form
62399 521451 526796 529987 530846 529869 527926 525520 522442 518163 512427 505433 497524 488970 480165 471836 464801
62384 464801 459445 455550 452708 450815 450195 451279 454261 459036 465469 473720 484208 497263 512856 530743
62370 530743 550860 573563 599483 629077 662219 698307 736987 778671 823948 872466 922845
62359 922845 973850 1025149 1076498 1126662 1173727 1216193 1253020 1282785 1303664 1314628 1316202 1309841
62347 1309841 1296984 1278820 1256398 1230497 1201584 1170100 1136556 1101241 1064240 1026002 987587
62336 987587 950125 914324 880724 849957 822280 797158 773798 751985 731906 713338 695579
62325 695579 678294 661935 647148 634112 622702 613035 605456 600052 596464 594213 592978 592349 591465
62312 591465 589308 585501 580593 575323 569735 563301 555810 547753 539772 532092 524633 517347 510245 503319
$$ packed form
62399E21451N345L191Q59r77j943k406l078m279n736o994p909q554q805q329p035
62384D64801n356l895k842j893o20J084K982M775O433Q251J0488J3055J5593J7887
62370E30743K0117K2703K5920K9594L3142L6088L8680M1684M5277M8518N0379
62359I22845N1005N1299N1349N0164M7065M2466L6827K9765K0879J0964J574o361
62347A309841j2857j8164k2422k5901k8913l1484l3544l5315l7001l8238l8415
62336I87587l7462l5801l3600l0767k7677k5122k3360k1813k0079j8568j7759
62325F95579j7285j6359j4787j3036j1410r667p579n404l588k251j235o29q84
62312E91465k157l807m908n270n588o434p491q057p981p680p459p286p102o926
$$ plain form
62298 503319 496729 490942 486427 483244 481049 479499 478572 478536 479653 481863 484830 488360 492630 497792 503508
62283 503508 509299 515326 522343 530755 540187 550116 560425 571012 581432 591466 601678 612779 624698
62270 624698 636900 649461 663149 678411 695011 712905 732910 756065 782778 813009 847039
62259 847039 885465 928375 974884 1023634 1073540 1123838 1173509 1220866 1263798 1300336 1328921
62248 1328921 1348298 1357495 1356126 1344753 1324830 1298239 1266716 1231441 1192996 1151757 1108378 1063948
62236 1063948 1019736 976923 936517 899282 865660 835913 810332 788996 771244 755792 741683
62225 741683 728963 718099 708955 700725 692813 685371 678908 673646 669350 665484 661412 656676 651401 646391
62211 646391 642671 640801 640597 641473 643051 645429 648873 653348 658538 664339 671104 679277 688932 699890
$$ packed form
62298E03319o590n787m515l183k195j550r27l6J117K210K967L530M270N162N716
62283E03508N791O027P017Q412R432R929J0309J0587J0420J0034J0212J1101J1919
62270F24698J2202J2561J3688J5262J6600J7894K0005K3155K6713L0231L4030
62259H47039L8426M2910M6509M8750M9906N0298M9671M7357M2932L6538K8585
62248A328921J9377R197j369j1373j9923k6591l1523l5275l8445m1239m3379m4430
62236A063948m4212m2813m0406l7235l3622k9747k5581k1336j7752j5452j4109
62225G41683j2720j0864r144q230p912p442o463n262m296l866m072m736n275n010
62211F46391l720j870k04Q76J578K378L444M475N190N801O765Q173R655J0958
$$ plain form
62197 699890 712179 726116 741985 759810 779460 800786 823621 847775 873096 899473 926702
62186 926702 954257 981132 1005922 1027349 1044917 1059025 1070398 1079550 1086825 1092592 1097031 1099985
62174 1099985 1101558 1102935 1106138 1112761 1123181 1137197 1155016 1177176 1203567 1232990 1263862 1295056
62162 1295056 1325776 1354836 1380537 1401468 1417227 1428123 1434330 1435685 1432327 1425211 1415690 1404586
62150 1404586 1391721 1376303 1357791 1336652 1314397 1292772 1272806 1254641 1238187 1223592 1210919
62139 1210919 1199717 1189262 1179202 1169647 1160727 1152319 1144305 1136906 1130641 1125991 1123078 1121676 1121591 1123047
62125 1123047 1126511 1132101 1139402 1148035 1158168 1170171 1183982 1199243 1215956 1234520 1254997 1276722
62113 1276722 1298865 1321088 1343434 1365862 1388224 1410571 1433133 1456052 1479457 1503887 1530267
$$ packed form
62197F99890J2289J3937J5869J7825J9650K1326K2835K4154K5321K6377K7229
62186I26702K7555K6875K4790K1427J7568J4108J1373R152P275N767M439K954
62174A099985J573J377L203O623J0420J4016J7819K2160K6391K9423L0872L1194
62162A295056L0720K9060K5701K0931J5759J0896O207J355l358p116r521j1104
62150A404586j2865j5418j8512k1139k2255k1625j9966j8165j6454j4595j2673
62139A210919j1202j0455j0060r555q920q408q014p399o265m650k913j402q5J456
62125A123047L464N590P301Q633J0133J2003J3811J5261J6713J8564K0477K1725
62113A276722K2143K2223K2346K2428K2362K2347K2562K2919K3405K4430K6380
$$ plain form
62102 1530267 1559195 1590325 1622708 1655818 1690170 1726924 1766994 1810487 1856875 1905602 1956627
62091 1956627 2010383 2067103 2126153 2186126 2245602 2303657 2359668 2413133 2464078 2513454 2562716
62080 2562716 2612983 2664703 2717670 2770634 2821002 2865886 2904066 2936773 2966491 2995420 3025119
62069 3025119 3056734 3090793 3127047 3165094 3204963 3246552 3288730 3329730 3368457 3404903 3439305
62058 3439305 3471534 3501535 3529812 3557064 3583596 3609405 3634618 3659540 3684275 3708452 3731350
62047 3731350 3752337 3771390 3789269 3806961 3824895 3842855 3860746 3879125 3898682 3919372 3940354
62036 3940354 3960762 3980265 3998820 4016206 4032031 4046069 4058270 4068314 4075398 4078666 4077820 4073138
62024 4073138 4064955 4053448 4038953 4022173 4003753 3983843 3962420 3940071 3918148 3898025 3880374
$$ packed form
62102A530267K8928L1130L2383L3110L4352L6754M0070M3493M6388M8727N1025
62091A956627N3756N6720N9050N9973N9476N8055N6011N3465N0945M9376M9262
62080B562716N0267N1720N2967N2964N0368M4884L8180L2707K9718K8929K9699
62069C025119L1615L4059L6254L8047L9869M1589M2178M1000L8727L6446L4402
62058C439305L2229L0001K8277K7252K6532K5809K5213K4922K4735K4177K2898
62047C731350K0987J9053J7879J7692J7934J7960J7891J8379J9557K0690K0982
62036C940354K0408J9503J8555J7386J5825J4038J2201J0044P084L268q46m682
62024D073138q183j1507j4495j6780j8420j9910k1423k2349k1923k0123j7651
$$ plain form
62013 3880374 3865216 3852489 3842339 3834976 3830542 3829240 3831430 3837438 3847322 3860961 3878456 3900232
62001 3900232 3926528 3956700 3989052 4021481 4052385 4080989 4106767 4128574 4144628 4153654 4155906 4152682
61989 4152682 4144920 4132803 4116854 4098590 4079493 4059807 4039057 4017329 3995153 3972307 3947805
61978 3947805 3921310 3893674 3865652 3836848 3806418 3774221 3740683 3705919 3669631 3631695 3592367
61967 3592367 3552100 3511511 3471354 3432185 3394133 3357199 3321489 3287038 3253810 3222174 3192952
61956 3192952 3166592 3142696 3120808 3101350 3085285 3073140 3064913 3060683 3060771 3065431 3074902 3089587 3109579
61943 3109579 3134077 3161735 3191629 3223512 3257243 3292459 3328813 3366115 3404102 3442267 3479805
61932 3479805 3515655 3548917 3579487 3607918 3634296 3657744 3677626 3694831 3711230 3728360 3747560
$$ packed form
62013C880374j5158j2727j0150p363m434j302K190O008R884J3639J7495K1776
62001C900232K6296L0172L2352L2429L0904K8604K5778K1807J6054R026K252l224
61989D152682p762j2117j5949j8264j9097j9686k0750k1728k2176k2846k4502
61978C947805k6495k7636k8022k8804l0430l2197l3538l4764l6288l7936l9328
61967C592367m0267m0589m0157l9169l8052l6934l5710l4451l3228l1636k9222
61956C192952k6360k3896k1888j9458j6065j2145q227m230Q8M660R471J4685J9992
61943C109579K4498K7658K9894L1883L3731L5216L6354L7302L7987L8165L7538
61932C479805L5850L3262L0570K8431K6378K3448J9882J7205J6399J7130J9200
$$ plain form
61921 3747560 3771134 3802241 3843468 3896330 3962307 4043450 4141784 4258976 4396988 4558252 4744646
61910 4744646 4956912 5195658 5462625 5760652 6093036 6463604 6877201 7339429 7855522
61901 7855522 8429059 9060580 9745854 10473931 11225358 11970908 12671699 13281911 13754323
61892 13754323 14047490 14132855 14000151 13659367 13138309 12476887 11720483 10913812 10095661
61883 10095661 9295559 8533592 7822558 7169892 6578369 6046854 5571919 5149208 4773810
61874 4773810 4440557 4144867 3883075 3651712 3447003 3265551 3105071 2963914 2840245
61865 2840245 2732194 2638526 2558624 2491892 2437598 2395149 2364175 2344402 2335589 2337331 2348679
61854 2348679 2368279 2395199 2429213 2469853 2515383 2563144 2610676 2656027 2697247 2732277 2759501
$$ packed form
61921C747560K3574L1107M1227N2862O5977Q1143R8334J17192J38012J61264J86394
61910D744646K12266K38746K66967K98027L32384L70568M13597M62228N16093
61901G855522N73537O31521O85274P28077P51427P45550P00791O10212M72412
61892A3754323K93167Q5365j32704l40784n21058o61422p56404q06671q18151
61883A0095661q00102p61967p11034o52666n91523n31515m74935m22711l75398
61874D773810l33253k95690k61792k31363k04709j81452j60480j41157j23669
61865B840245j08051r3668p9902o6732n4294m2449l0974j9773q813J742J1348
61854B348679J9600K6920L4014M0640M5530M7761M7532M5351M1220L5030K7224
$$ plain form
61843 2759501 2778026 2787366 2787315 2778421 2762427 2741987 2719929 2698746 2680602 2667569 2661501 2663428 2673005
61830 2673005 2688632 2707994 2728457 2747275 2762003 2770764 2771804 2763023 2742646 2710577 2668569 2618848
61818 2618848 2563074 2502787 2440143 2377542 2316862 2259557 2207197 2161315 2122768 2091632 2067683
61807 2067683 2050798 2041086 2038891 2044515 2057698 2077657 2103863 2136578 2176407 2223612 2278170 2340160
61795 2340160 2409745 2487026 2572325 2666511 2770817 2886503 3014853 3157167 3314593 3488509
61785 3488509 3681507 3897606 4140987 4414922 4722504 5068123 5457539 5896810 6392052
61776 6392052 6950390 7580462 8291689 9093267 9993628 10999749 12115566 13339595 14661991
61767 14661991 16061141 17500521 18926944 20271234 21452279 22385648 22996432 23232824
$$ packed form
61843B759501J8525R340n1q894j5994k0440k2058k1183j8144j3033o068J927R577
61830B673005J5627J9362K0463J8818J4728Q761J040q781k0377l2069m2008m9721
61818B618848n5774o0287o2644o2601o0680n7305n2360m5882l8547l1136k3949
61807B067683j6885r712k195N624J3183J9959K6206L2715L9829M7205N4558O1990
61795B340160O9585P7281Q5299R4186J04306J15686J28350J42314J57426J73916
61785C488509J92998K16099K43381K73935L07582L45619L89416M39271M95242
61776F392052N58338O30072P11227Q01578R00361J006121J115817J224029J322396
61767A4661991J399150J439380J426423J344290J181045R33369O10784K36392
$$ plain form
61759 23232824 23075536 22540285 21673956 20546247 19238415 17831354 16396065 14988575
61751 14988575 13648937 12402409 11261542 10229025 9301272 8471814 7733167 7077039 6494237
61742 6494237 5975526 5512882 5099849 4731035 4401796 4108172 3846340 3612107 3401651
61733 3401651 3212812 3044676 2895607 2762678 2643508 2537455 2443998 2360838 2284839 2214266
61723 2214266 2148813 2087758 2029528 1973155 1918939 1867350 1818294 1771764 1728285 1688265 1651594
61712 1651594 1618201 1588358 1562091 1538895 1518334 1500314 1484432 1469661 1455140 1440782 1426762
61701 1426762 1412867 1398689 1383976 1368351 1351161 1332161 1312078 1292105 1272983 1254814 1237392
61690 1237392 1220361 1203335 1186320 1169810 1154168 1139114 1124239 1109825 1096678 1085177 1074888
$$ packed form
61759B3232824j57288n35251q66329j127709j307832j407061j435289j407490
61751A4988575j339638j246528j140867j032517r27753q29458p38647o56128n82802
61742F494237n18711m62644m13033l68814l29239k93624k61832k34233k10456
61733C401651j88839j68136j49069j32929j19170j06053r3457q3160p5999p0573
61723B214266o5453o1055n8230n6373n4216n1589m9056m6530m3479m0020l6671
61712A651594l3393k9843k6267k3196k0561j8020j5882j4771j4521j4358j4020
61701A426762j3895j4178j4713j5625j7190j9000k0083j9973j9122j8169j7422
61690A237392j7031j7026j7015j6510j5642j5054j4875j4414j3147j1501j0289
$$ plain form
61679 1074888 1065161 1055835 1047288 1040027 1034346 1030268 1027696 1026611 1027134 1029447 1033674 1039762 1047335 1055666
61665 1055666 1063851 1071024 1076416 1079501 1080325 1079560 1077938 1075748 1073130 1070630 1068995 1068496 1068853 1069810 1071306
61650 1071306 1073065 1074587 1075713 1076745 1077752 1078153 1077271 1074960 1071411 1066702 1060891 1054393 1047952 1042282
61636 1042282 1037845 1034887 1033542 1034013 1036673 1041852 1049486 1059181 1070539 1083138 1096186 1108554 1119251
61623 1119251 1127661 1133383 1136345 1137114 1136565 1134984 1131922 1127143 1121277 1115217 1109260 1103160 1096677 1089659
61609 1089659 1081894 1073303 1064173 1054884 1045575 1036300 1027271 1018603 1010077 1001429 992643 983652 973997 963255
61595 963255 951734 940376 930037 921070 913380 906527 899913 893356 887437 882944 880049 878400 877926 879089
61581 879089 882248 887266 893936 902433 913083 925919 940750 957529 976400 997417 1020477 1045588
$$ packed form
61679A074888r727r326q547p261n681m078k572j085N23K313M227O088P573Q331
61665A055666Q185P173N392L085Q24p65j622k190k618k500j635m99L57R57J496
61650A071306J759J522J126J032J007M01q82k311l549m709n811o498o441n670
61636A042282m437k958j345M71K660N179P634R695J1358J2599J3048J2368J0697
61623A119251Q410N722K962P69n49j581l062m779n866o060n957o100o483p018
61609A089659p765q591r130r289r309r275r029q668q526q648q786q991r655j0742
61595I63255j1521j1358j0339q967p690o853o614o557n919m493k895j649m74J163
61581H79089L159N018O670Q497J0650J2836J4831J6779J8871K1017K3060K5111
$$ plain form
61569 1045588 1073014 1103019 1135513 1170109 1206566 1244929 1285056 1326102 1366689 1405555 1441860
61558 1441860 1474965 1504429 1530418 1553793 1575452 1595657 1614169 1630848 1645922 1659786 1672715
61547 1672715 1684531 1694296 1700555 1702304 1699712 1693571 1684121 1670805 1653324 1632542 1610105 1587318
61535 1587318 1564560 1541672 1518670 1496119 1474990 1456182 1440070 1426412 1414797 1405215 1398200 1394429
61523 1394429 1394265 1397755 1404951 1416031 1431135 1450361 1474081 1503103 1538296 1580203 1629164 1685720
61511 1685720 1750631 1824603 1908319 2002776 2109336 2229361 2364033 2514573 2682406 2868861
61501 2868861 3074648 3299460 3541775 3798753 4066230 4338531 4607993 4864657 5096802
61492 5096802 5292371 5440871 5535271 5573236 5556819 5490792 5381295 5235972 5064255 4875970
$$ packed form
61569A045588K7426L0005L2494L4596L6457L8363M0127M1046M0587L8866L6305
61558A441860L3105K9464K5989K3375K1659K0205J8512J6679J5074J3864J2929
61547A672715J1816R765O259J749k592o141r450j3316j7481k0782k2437k2787
61535A587318k2758k2888k3002k2551k1129j8808j6112j3658j1615r582p015l771
61523A394429j64L490P196J1080J5104J9226K3720K9022L5193M1907M8961N6556
61511A685720O4911P3972Q3716R4457J06560J20025J34672J50540J67833J86455
61501B868861K05787K24812K42315K56978K67477K72301K69462K56664K32145
61492E096802J95569J48500R4400L7965j6417o6027j09497j45323j71717j88285
$$ plain form
61482 4875970 4679142 4479569 4282302 4092455 3914122 3749388 3599068 3463913 3344536
61473 3344536 3240744 3151750 3076933 3015932 2968270 2933389 2910921 2900544 2901735 2913832 2935939
61462 2935939 2966499 3003547 3045907 3093562 3146243 3202223 3259360 3316753 3374237 3430634 3483948
61451 3483948 3533483 3580488 3626248 3670692 3713521 3755767 3799231 3844888 3892628 3942168 3993413
61440 3993413 4046066 4099620 4153733 4208026 4261427 4312169 4358509 4399209 4433353 4460060 4478477
61429 4478477 4487788 4487187 4476089 4454515 4423265 4383727 4337587 4286548 4232105 4175593 4118497 4062578
61417 4062578 4009570 3960862 3917547 3880474 3849928 3825445 3806399 3792790 3785138 3783508 3786822 3793185
61405 3793185 3800667 3807793 3813573 3817235 3817892 3814440 3806001 3792535 3775009 3755035 3734532 3715573 3700164
$$ packed form
61482D875970j96828j99573j97267j89847j78333j64734j50320j35155j19377
61473C344536j03792q8994p4817o1001m7662l4881k2468j0377J191J2097K2107
61462B935939L0560L7048M2360M7655N2681N5980N7137N7393N7484N6397N3314
61451C483948M9535M7005M5760M4444M2829M2246M3464M5657M7740M9540N1245
61440C993413N2653N3554N4113N4293N3401N0742M6340M0700L4144K6707J8417
61429D478477R311o01j1098k1574l1250l9538m6140n1039n4443n6512n7096n5919
61417D062578n3008m8708m3315l7073l0546k4483j9046j3609p652j630L314O363
61405C793185P482P126N780L662O57l452q439j3466j7526j9974k0503j8959j5409
$$ plain form
61392 3700164 3690015 3686757 3692468 3709674 3740639 3786893 3849661 3930456 4030930 4152292 4295220
61381 4295220 4460319 4648337 4859806 5094468 5350789 5625661 5914469 6211536 6510222
61372 6510222 6802188 7076759 7321728 7525491 7679024 7776870 7817550 7803578 7740401 7634399
61362 7634399 7491464 7317115 7117143 6897366 6662780 6417349 6164685 5908742 5653870
61353 5653870 5404265 5163128 4932107 4711697 4502385 4305207 4121048 3949862 3791058
61344 3791058 3644433 3510264 3388724 3279805 3183778 3101099 3031842 2975641 2932135 2900888
61334 2900888 2880895 2870846 2870059 2878539 2895903 2920847 2951883 2987936 3027859 3070146 3113789 3158884
61322 3158884 3205599 3252849 3298737 3342184 3383343 3422439 3458925 3492003 3521440 3547638 3571300
$$ packed form
61392C700164j0149l258N711J7206L0965M6254O2768Q0795J00474J21362J42928
61381D295220J65099J88018K11469K34662K56321K74872K88808K97067K98686
61372F510222K91966K74571K44969K03763J53533R7846M0680j3972o3177j06002
61362G634399j42935j74349j99972k19777k34586k45431k52664k55943k54872
61353E653870k49605k41137k31021k20410k09312j97178j84159j71186j58804
61344C791058j46625j34169j21540j08919r6027q2679o9257n6201m3506l1247
61334B900888j9993j0049p87Q480J7364K4944L1036L6053L9923M2287M3643M5095
61322C158884M6715M7250M5888M3447M1159L9096L6486L3078K9437K6198K3662
$$ plain form
61311 3571300 3593227 3614112 3634057 3652357 3667853 3679462 3686362 3687925 3683736 3673744 3658292 3637811
61299 3637811 3612364 3581542 3545053 3503454 3458043 3409869 3359104 3305586 3249714 3192561 3135340
61288 3135340 3079154 3025121 2974323 2927594 2885629 2849216 2819033 2795277 2777795 2766500 2761197
61277 2761197 2760993 2764309 2769691 2776338 2783770 2791386 2798597 2805180 2811232 2816803 2821719 2825608 2828019 2828541
61263 2828541 2826839 2822555 2815308 2805140 2793000 2780651 2770116 2763436 2762844 2770666 2788838 2818786 2861813
61250 2861813 2919125 2991219 3077602 3177359 3289506 3412269 3542219 3674570 3804055 3924919
61240 3924919 4030228 4112086 4163138 4177997 4153769 4090364 3990931 3861559 3709767 3542969
61230 3542969 3368047 3191472 3018861 2854267 2700253 2558542 2430116 2314708 2210866
$$ packed form
61311C571300K1927K0885J9945J8300J5496J1609O900J563m189r992j5452k0481
61299C637811k5447l0822l6489m1599m5411m8174n0765n3518n5872n7153n7221
61288C135340n6186n4033n0798m6729m1965l6413l0183k3756j7482j1295n303
61277B761197k04L316N382O647P432P616P211O583O052N571M916L889K411N22
61263B828541j702m284p247j0168j2140j2349j0535o680n92P822J8172K9948M3027
61250B861813N7312P2094Q6383R9757J12147J22763J29950J32351J29485J20864
61240C924919J05309Q1858N1052J4859k4228o3405r9433j29372j51792j66798
61230C542969j74922j76575j72611j64594j54014j41711j28426j15408j03842
$$ plain form
61221 2210866 2117069 2032724 1957964 1892656 1835792 1785788 1741272 1701686 1667200 1638094 1614262
61210 1614262 1595394 1581399 1572260 1567510 1566253 1567920 1572811 1581742 1595292 1613275 1634571 1657411
61198 1657411 1680228 1702418 1723916 1743936 1760717 1772869 1780597 1785265 1788192 1790252 1791965 1793164
61186 1793164 1792798 1789838 1784317 1776871 1767459 1755292 1739988 1721921 1701306 1677772 1651133 1621919
61174 1621919 1590839 1558290 1524732 1490907 1457303 1423930 1391040 1359493 1329866 1301590 1273529
61163 1273529 1245157 1216732 1188690 1161395 1135235 1110373 1086566 1063675 1042197 1022745 1005079
61152 1005079 988108 970784 952497 932698 910840 887013 862275 838068 815403 794677 776073
61141 776073 759933 746684 736364 728238 721202 714796 709637 706575 705596 705942 707195 709709 713829 719198
$$ packed form
61221B210866r3797q4345p4760o5308n6864n0004m4516l9586l4486k9106k3832
61210A614262j8868j3995r139m750j257J667M891Q931J3550J7983K1296K2840
61198A657411K2817K2190K1498K0020J6781J2152P728M668K927K060J713J199
61186A793164l66k960n521p446r412j2167j5304j8067k0615k3534k6639k9214
61174A621919l1080l2549l3558l3825l3604l3373l2890l1547k9627k8276k8061
61163A273529k8372k8425k8042k7295k6160k4862k3807k2891k1478j9452j7666
61152A005079j6971j7324j8287j9799k1858k3827k4738k4207k2665k0726j8604
61141G76073j6140j3249j0320q126p036o406n159l062r79L46J253K514M120N369
$$ plain form
61127 719198 725238 732044 740288 750169 760856 771312 781516 792506 805126 819085 833450 847771
61115 847771 862338 877569 893627 910584 928330 946163 962947 977939 991163 1002740 1012222 1018850
61103 1018850 1022167 1022119 1018859 1012826 1004819 995630 985638 974883 963402 951339 938930 926507 914262
61090 914262 901943 889071 875563 861760 847735 833143 818015 803175 789391 776551 764151
61079 764151 752228 741252 731397 722493 714566 707895 702647 698905 696844 696420 696999 697835 698814 700272 702215
61064 702215 704274 706372 708815 711657 714430 716730 718648 720436 721994 722907 722915 722326 721889 722126 722750 723055
61048 723055 723025 723632 725749 729210 733381 738263 744457 752278 761508 771854 783056 794695 806519 818935
61034 818935 832511 846902 860791 873117 884030 894559 905700 917777 930285 942240 953015
$$ packed form
61127G19198O040O806Q244R881J0687J0456J0204J0990J2620J3959J4365J4321
61115H47771J4567J5231J6058J6957J7746J7833J6784J4992J3224J1577R482O628
61103A018850L317m8l260o033q007r189r992j0755j1481j2063j2409j2423j2245
61090I14262j2319j2872j3508j3803j4025j4592j5128j4840j3784j2840j2400
61079G64151j1923j0976r855q904p927o671n248l742k061m24N79Q36R79J458J943
61064G02215K059K098K443K842K773K300J918J788J558R13Qn89m37K37O24L05
61048G23055l0O07K117L461M171M882O194P821R230J0346J1202J1639J1824J2416
61034H18935J3576J4391J3889J2326J0913J0529J1141J2077J2508J1955J0775
$$ plain form
61023 953015 962969 973110 984163 996115 1008526 1021005 1033531 1046552 1060583 1075564 1090967 1106883
61011 1106883 1124526 1145133 1168715 1194515 1222413 1253197 1287637 1326068 1368844 1416449 1468956
61000 1468956 1525899 1586784 1651401 1719724 1791965 1868852 1951712 2042419 2143396 2257126 2385216
60989 2385216 2528263 2686977 2862871 3057749 3273842 3515586 3790433 4106954 4473456
60980 4473456 4900268 5402708 6000362 6715454 7575852 8619672 9892665 11438928 13295173
60971 13295173 15488787 18021771 20829463 23737962 26467172 28702774 30207783 30912856
60963 30912856 30940521 30560320 30100912 29848475 29954944 30381099 30900901 31176363 30878462
60954 30878462 29803926 27940369 25458145 22638921 19776285 17094201 14715206 12676473
$$ packed form
61023I53015R954J0141J1053J1952J2411J2479J2526J3021J4031J4981J5403J5916
61011A106883J7643K0607K3582K5800K7898L0784L4440L8431M2776M7605N2507
61000A468956N6943O0885O4617O8323P2241P6887Q2860R0707J00977J13730J28090
60989B385216J43047J58714J75894J94878K16093K41744K74847L16521L66502
60980D473456M26812N02440N97654P15092Q60398J043820J272993J546263J856245
60971A3295173K193614K532984K807692K908499K729210K235602J505009P05073
60963C0912856K7665l80201m59408k52437J06469M26155N19802K75462k97901
60954C0878462j074536j863557k482224k819224k862636k682084k378995k038733
$$ plain form
60946 12676473 10964692 9543175 8366442 7389791 6575986 5895909 5325030 4841766 4428753
60937 4428753 4072741 3762163 3486245 3236849 3009470 2801502 2610537 2434777 2273814
60928 2273814 2127899 1996824 1879793 1775659 1682746 1598956 1522345 1451193 1383548 1317661
60918 1317661 1253335 1192145 1135783 1084529 1037611 994501 955300 920191 889045 861537 837343
60907 837343 816143 797456 780524 764634 749795 736798 726160 717203 708675 700196 692515 686359
60895 686359 681676 678099 675602 674468 675027 677515 681833 687391 693643 700820 709575 719788 730261 739805
60881 739805 748085 755199 761020 765395 768494 770454 770935 769511 766252 761557 755593 748406 740376 732012
60867 732012 723288 713769 703605 693936 685893 679416 673454 667205 660772 654638 649047 644136 640263 637826
$$ packed form
60946A2676473j711781j421517j176733r76651q13805o80077n70879m83264m13013
60937D428753l56012l10578k75918k49396k27379k07968j90965j75760j60963
60928B273814j45915j31075j17031j04134r2913q3790p6611p1152o7645o5887
60918A317661o4326o1190n6362n1254m6918m3110l9201l5109l1146k7508k4194
60907H37343k1200j8687j6932j5890j4839j2997j0638q957q528q479p681o156
60895F86359m683l577k497j134N59K488M318N558O252P177Q755J0213J0473R544
60881G39805Q280P114N821M375L099J960M81j424l259m695n964p187q030q364
60867G32012q724r519j0164r669q043o477n962o249o433o134n591m911l873k437
$$ plain form
60853 637826 636913 637484 639674 643590 649018 655775 664169 674627 687007 700896 716435 734088 753532
60840 753532 773642 793807 814457 835833 856971 876445 893566 908358 921006 931988 942229
60829 942229 952441 962565 972274 981456 989613 995449 997992 997833 996470 994749 992670 990268 987705 984695
60815 984695 980830 976421 972106 967631 961903 954233 944685 933254 919696 904430 888678 873337 858295
60802 858295 843127 827818 812663 798104 784867 773593 764113 755738 748466 743232 740697 740499 741993
60789 741993 744987 749370 754754 761025 768674 778006 788403 798880 809041 819086 829238 839572 850030
60776 850030 860171 869205 876690 882985 888731 894202 899424 904529 909589 914457 919173 924222 930039 936574
60762 936574 943713 951733 960834 970506 979935 988887 997681 1006404 1014632 1021883 1027960 1032851 1036738 1040128
$$ packed form
60853F37826r13N71K190L916N428O757Q394J0458J2380J3889J5539J7653J9444
60840G53532K0110K0165K0650K1376K1138J9474J7121J4792J2648J0982J0241
60829I42229J0212J0124R709R182Q157N836K543j59j363j721k079k402k563l010
60815I84695l865m409m315m475n728p670r548j1431j3558j5266j5752j5341j5042
60802H58295j5168j5309j5155j4559j3237j1274r480q375p272n234k535j98J494
60789G41993K994M383N384O271P649R332J0397J0477J0161J0045J0152J0334J0458
60776H50030J0141R034P485O295N746N471N222N105N060M868M716N049N817O535
60762I36574P139Q020R101R672R429Q952Q794Q723Q228P251O077M891L887L390
$$ plain form
60748 1040128 1043604 1047364 1051196 1054844 1058120 1060723 1062352 1063073 1063262 1063046 1062043 1059841 1056508 1052447 1047863
60733 1047863 1042602 1036478 1029544 1021992 1013984 1005729 997598 989878 982413 974715 966495 957870 949002 939831
60719 939831 930349 920819 911415 901920 892177 882643 873989 866152 858251 849551 840224 831047 822688 815402
60705 815402 809247 804413 801327 800265 800839 802164 803852 806506 810821 816514 822700 829046 835736 842376
60691 842376 847825 851337 853070 853138 850852 845413 836822 825681 812557 798000 782694 767022 750779
60678 750779 733907 717290 702322 689751 679382 670750 663620 657864 653361 650176 648571 648666 650189
60665 650189 652588 655289 657919 660438 663079 666022 669055 671551 672919 673189 673178 673809 675156 676424 677122
60650 677122 677986 680240 684160 688914 693717 698523 703486 708414 713019 717152 720602 723219 725594 729067
$$ packed form
60748A040128L476L760L832L648L276K603J629P21J89k16j003k202l333m061m584
60733A047863n261o124o934p552q008q255q131p720p465p698q220q625q868r171
60719I39831r482r530r404r495r743r534q654p837p901q700r327r177q359p286
60705H15402o155m834l086j062N74J325J688K654M315N693O186O346O690O640
60691H42376N449L512J733O8k286n439q591j1141j3124j4557j5306j5672j6243
60678G50779j6872j6617j4968j2571j0369q632p130n756m503l185j605R5J523
60665F50189K399K701K630K519K641K943L033K496J368K70j1O31J347J268O98
60650F77122Q64K254L920M754M803M806M963M928M605M133L450K617K375L473
$$ plain form
60636 729067 734628 742142 750987 760961 772180 784526 797782 812093 827764 844681 862267 879815
60624 879815 896659 912319 926922 941147 955306 968699 980274 989638 996901 1001842 1003923 1003091 999877
60611 999877 994620 987140 977402 966083 954296 943082 933273 925413 919465 914800 910703 906797 902882
60598 902882 898571 893351 886946 879456 871161 862305 853151 844167 836037 829375 824437 821141 819292 818641
60584 818641 818862 819740 821449 824309 828079 831766 834456 836240 837996 840255 842564 844094 844703 845128 846096
60569 846096 847456 848427 848716 848996 849966 851104 850837 848014 842887 836534 829648 822074 813360 803517 793293
60554 793293 783800 775823 769480 764607 761329 760068 761100 764403 769843 777185 786032 796138 807810 821644
60540 821644 837983 857113 879880 907404 940012 976969 1017294 1060006 1103140 1143281 1176800
$$ packed form
60636G29067N561P514Q845R974J1219J2346J3256J4311J5671J6917J7586J7548
60624H79815J6844J5660J4603J4225J4159J3393J1575R364P263M941K081q32l214
60611I99877n257p480r738j1319j1787j1214r809p860n948m665m097l906l915
60598I02882m311n220o405p490q295q856r154q984q130o662m938l296j849o51
60584H18641K21Q78J709K860L770L687K690J784J756K259K309J530O09M25R68
60569H46096J360R71K89K80R70J138k67k823n127o353o886p574q714r843j0224
60554G93293r493p977o343m873l278j261J032L303N440P342Q847J0106J1672J3834
60540H21644J6339J9130K2767K7524L2608L6957M0325M2712M3134M0141L3519
$$ plain form
60529 1176800 1201283 1215495 1218666 1210682 1192815 1167605 1137883 1106167 1074708 1045638 1020936 1002279
60517 1002279 990522 985130 984589 987763 994527 1004760 1017356 1030812 1044371 1057916 1071096 1083438
60505 1083438 1095248 1107684 1121912 1138748 1159167 1184540 1216251 1255518 1303612 1361842 1431349
60494 1431349 1513367 1609696 1722415 1853109 2002828 2172811 2364752 2580319 2820949 3088272
60484 3088272 3384030 3708657 4059151 4427133 4797718 5149803 5458323 5697814 5846006
60475 5846006 5887030 5814450 5633179 5358740 5013974 4625173 4218808 3818378 3441369 3097858
60465 3097858 2791684 2522829 2289149 2087110 1912414 1760767 1628532 1513034 1412414
60456 1412414 1324945 1248409 1180374 1119129 1063984 1014551 970200 930480 895502 865301 839026
$$ packed form
60529A176800K4483J4212L171p984j7867k5210k9722l1716l1459k9070k4702j8657
60517A002279j1757n392n41L174O764J0233J2596J3456J3559J3545J3180J2342
60505A083438J1810J2436J4228J6836K0419K5373L1711L9267M8094N8230O9507
60494A431349Q2018R6329J12719J30694J49719J69983J91941K15567K40630K67323
60484C088272K95758L24627L50494L67982L70585L52085L08520K39491J48192
60475E846006M1024p2580j81271k74439l44766l88801m06365m00430l77009l43511
60465C097858l06174k68855k33680k02039j74696j51647j32235j15498j00620
60456A412414q7469p6536o8035o1245n5145m9433m4351l9720l4978l0201k6275
$$ plain form
60445 839026 815322 793381 773120 754441 736974 720646 705905 692926 681019 669242 657382
60434 657382 645922 635269 625495 616807 609663 604217 600076 596861 594646 593470 592795 591945 590900 590140
60420 590140 589807 589619 589662 590673 593243 597151 601725 606463 611090 615409 619470 623583 627827 631770 634999
60405 634999 637695 640400 643486 647097 651254 655640 659607 662935 666310 670516 675315 679759 683553 687475
60391 687475 692348 698116 704038 709328 713437 716183 717894 719075 719773 719543 718268 716621 715394 714598 713620
60376 713620 712189 710715 709585 708442 706545 703794 701071 699368 698813 698828 699012 699429 700098 700832 701764 703426
60360 703426 705992 709014 712318 716508 721880 727410 731814 735416 739892 746094 753157 760017 766849 774430
60346 774430 782844 791573 800319 808955 816950 823643 829048 833699 837576 839769 839502 837178 834110 831444
$$ packed form
60445H39026k3704k1941k0261j8679j7467j6328j4741j2979j1907j1777j1860
60434F57382j1460j0653r774q688p144n446m141l215k215j176o75q50j045p60
60420E90140l33j88M3J011K570L908M574M738M627M319M061M113M244L943L229
60405F34999K696K705L086L611M157M386L967L328L375M206M799M444L794L922
60391F87475M873N768N922N290M109K746J711J181O98k30j275j647j227p96r78
60376G13620j431j474j130j143j897k751k723j703n55J5J84M17O69P34R32J662
60360G03426K566L022L304M190N372N530M404L602M476O202P063O860O832P581
60346G74430Q414Q729Q746Q636P995O693N405M651L877K193k67k324l068k666
$$ plain form
60332 831444 829544 828337 827968 828965 831810 836422 842178 848461 855168 862555 870550 878260 884272 887511 887808
60317 887808 885689 881731 876254 869518 861938 854018 846248 839158 833281 828862 825627 822932 820182 817151
60303 817151 814075 811448 809543 808050 806439 804798 804124 805570 809506 815329 821934 828243 833644 838263
60289 838263 842716 847320 851659 855071 857313 858556 859009 858901 858633 858523 858492 858310 858157 858723 860737 864489
60273 864489 869670 875555 881612 888056 895570 904389 914136 924786 937145 951845 968413 986057 1004945
60260 1004945 1025936 1049363 1075033 1103306 1135150 1171023 1210613 1253905 1301665 1354534 1412446
60249 1412446 1475439 1544352 1620184 1703210 1793296 1890636 1995556 2107681 2225718 2347955
60239 2347955 2472800 2598938 2725194 2849951 2970596 3083829 3186816 3277929 3356351 3421374
$$ packed form
60332H31444j900j207l69R97K845M612N756O283O707P387P995P710O012L239K97
60317H87808k119l958n477o736p580p920p770p090n877m419l235k695k750l031
60303H17151l076k627j905j493j611j641o74J446L936N823O605O309N401M619
60289H38263M453M604M339L412K242J243M53j08k68j10l1j82j53N66K014L752
60273H64489N181N885O057O444P514Q819R747J0650J2359J4700J6568J7644J8888
60260A004945K0991K3427K5670K8273L1844L5873L9590M3292M7760N2869N7912
60249A412446O2993O8913P5832Q3026R0086R7340J04920J12125J18037J22237
60239B347955J24845J26138J26256J24757J20645J13233J02987R1113P8422O5023
$$ plain form
60229 3421374 3472268 3508440 3529406 3534980 3525786 3503310 3469182 3424801 3372062 3314097 3254770 3197527
60217 3197527 3144965 3099168 3061807 3033925 3016123 3009185 3014339 3032979 3066264 3114791 3178216 3255234
60205 3255234 3344382 3444988 3556973 3679499 3809953 3944394 4078760 4209530 4333523 4447583
60195 4447583 4548646 4634002 4701415 4749224 4776503 4783066 4769087 4734737 4680492 4607959 4520298
60184 4520298 4421610 4315948 4206860 4097623 3991595 3892223 3802695 3725479 3662136 3613796
60174 3613796 3581838 3567813 3572494 3595294 3634885 3690014 3759302 3840568 3930904 4027268 4126345
60163 4126345 4223936 4315312 4396579 4465291 4519633 4557765 4578559 4582533 4571415 4546904 4510435
60152 4510435 4464146 4411470 4356521 4303191 4255004 4215362 4187307 4172933 4173474 4190201 4224955 4279560
$$ packed form
60229C421374N0894L6172K0966N574r194k2476l4128m4381n2739n7965n9327n7243
60217C197527n2562m5797l7361k7882j7802o938N154J8640L3285M8527O3425P7018
60205C255234Q9148J00606J11985J22526J30454J34441J34366J30770J23993J14060
60195D447583J01063Q5356O7413M7809K7279O563j3979l4350n4245p2533q7661
60184D520298r8688j05662j09088j09237j06028r9372q9528p7216o3343m8340
60174C613796l1958j4025M681K2800L9591N5129O9288Q1266R0336R6364R9077
60163D126345R7591R1376Q1267O8712N4342L8132K0794L974j1118k4511l6469
60152D510435m6289n2676n4949n3330m8187l9642k8055j4374N41J6727L4754N4605
$$ plain form
60140 4279560 4355029 4451914 4571298 4714903 4884175 5079850 5302586 5553311 5832538 6139804
60130 6139804 6474056 6833870 7216543 7617349 8030236 8448807 8866020 9273681 9663511
60121 9663511 10028696 10363406 10660988 10913957 11116211 11264327 11356326 11390183 11364213 11278219
60111 11278219 11133569 10932797 10680086 10382077 10047610 9686623 9309457 8926709 8548928
60102 8548928 8185947 7846177 7536066 7259921 7020391 6819346 6658196 6537501 6456694 6414402
60092 6414402 6408824 6437746 6498482 6587789 6701420 6833714 6978056 7127719 7275765 7414313
60082 7414313 7535066 7631320 7699201 7736824 7743155 7718223 7663725 7582467 7477324 7351185 7207291
60071 7207291 7048745 6877791 6696287 6506855 6312987 6118051 5924753 5735589 5553241
$$ packed form
60140D279560P5469R6885J19384J43605J69272J95675K22736K50725K79227L07266
60130F139804L34252L59814L82673M00806M12887M18571M17213M07661L89830
60121I663511L65185L34710K97582K52969K02254J48116R1999L3857k5970q5994
60111A1278219j44650k00772k52711k98009l34467l60987l77166l82748l77781
60102H548928l62981l39770l10111k76145k39530k01045j61150j20695q0807m2292
60092F414402n578K8922O0736Q9307J13631J32294J44342J49663J48046J38548
60082G414313J20753R6254O7881L7623O331k4932n4498q1258j05143j26139j43894
60071G207291j58546j70954j81504j89432j93868j94936j93298j89164j82348
$$ plain form
60062 5553241 5380375 5219454 5072872 4942875 4831169 4738760 4666281 4614163 4582429 4570608
60052 4570608 4578134 4604773 4650547 4715249 4798121 4897931 5013006 5140833 5277525 5418019 5557160
60041 5557160 5690476 5813684 5921785 6009431 6072556 6109336 6119413 6102590 6058626 5988032 5892712
60030 5892712 5775821 5641196 5492968 5335613 5174176 5013900 4859136 4712655 4576335
60021 4576335 4452333 4343034 4249934 4173244 4112799 4068875 4041995 4032612 4041297 4068781 4115459
60010 4115459 4181273 4266364 4371414 4496916 4642370 4806337 4986770 5180757 5384072 5591266
60000 5591266 5796013 5991356 6170284 6326770 6456411 6556226 6624352 6660097 6663658 6635396
59990 6635396 6575777 6486348 6370318 6231838 6075158 5904915 5726696 5546622 5370439 5203262
$$ packed form
60062E553241j72866j60921j46582j29997j11706r2409p2479n2118l1734j1821
60052D570608P526K6639M5774O4702Q2872R9810J15075J27827J36692J40494J39141
60041E557160J33316J23208J08101Q7646O3125L6780J0077j6823m3964p0594r5320
60030E892712j16891j34625j48228j57355j61437j60276j54764j46481j36320
60021D576335j24002j09299r3100p6690o0445m3924k6880r383Q685K7484M6678
60010D115459O5814Q5091J05050J25502J45454J63967J80433J93987K03315K07194
60000E591266K04747J95343J78928J56486J29641R9815O8126L5745L561k8262
59990F635396n9619q9429j16030j38480j56680j70243j78219j80074j76183j67177
$$ plain form
59980 5203262 5049695 4913470 4796957 4701323 4627071 4574274 4542767 4532593 4544049 4576875 4629597
59969 4629597 4699971 4785860 4885334 4996211 5115793 5240888 5367899 5493286 5614222 5728376
59959 5728376 5832865 5924073 5999149 6057300 6099264 6126069 6138979 6140241 6132985 6120456 6105871
59948 6105871 6092881 6085566 6088041 6104539 6139720 6198274 6284123 6400322 6549618 6734761 6958362
59937 6958362 7222683 7529324 7878646 8269350 8698389 9160475 9647176 10146772 10645172
59928 10645172 11126382 11571864 11960812 12272840 12491246 12604358 12605757 12495390 12280818 11976100
59918 11976100 11598665 11166987 10700010 10216530 9733530 9264677 8820013 8406442 8028496
59909 8028496 7689325 7391293 7135586 6921729 6748325 6614349 6519354 6462667 6443156 6459780
$$ packed form
59980E203262j53567j36225j16513r5634p4252n2797l1507j0174J1456L2826N2722
59969D629597P0374Q5889R9474J10877J19582J25095J27011J25387J20936J14154
59959E728376J04489R1208P5076N8151M1964K6805J2910J262p256j2529j4585
59948F105871j2990p315K475J6498L5181N8554Q5849J16199J49296J85143K23601
59937F958362K64321L06641L49322L90704M29039M62086M86701M99596M98400
59928A0645172M81210M45482L88948L12028K18406J13112J399j10367k14572l04718
59918A1976100l77435m31678m66977m83480m83000m68853m44664m13571l77946
59909H028496l39171k98032k55707k13857j73404j33976r4995n6687j9511J6624
$$ plain form
59899 6459780 6511743 6597989 6716934 6866403 7043039 7241712 7456031 7679223 7903664 8119557
59889 8119557 8315023 8477940 8597446 8664208 8670859 8613353 8491826 8310081 8074768 7795145
59879 7795145 7482570 7148975 6805287 6460888 6123823 5800853 5497229 5216389 4959819
59870 4959819 4727505 4519059 4334515 4173798 4035728 3918147 3818860 3735727 3665887 3605809
59860 3605809 3552426 3503582 3457119 3410371 3361235 3309356 3255828 3202099 3149646 3100308 3056202
59849 3056202 3019060 2989811 2968713 2955584 2949766 2949788 2953034 2955932 2954862 2947112 2931108 2906083 2872031
59836 2872031 2829908 2781476 2728785 2674024 2619823 2569168 2524623 2487551 2458039 2435596 2420096
59825 2420096 2412273 2413184 2423088 2441187 2466652 2499511 2540096 2587895 2641427 2699011 2759351 2821811
$$ packed form
59899F459780N1963Q6246J18945J49469J76636J98673K14319K23192K24441K15893
59889H119557J95466J62917J19506O6762O651n7506j21527j81745k35313k79623
59879G795145l12575l33595l43688l44399l37065l22970l03624k80840k56570
59870D959819k32314k08446j84544j60717j38070j17581r9287q3133o9840o0078
59860C605809n3383m8844m6463m6748m9136n1879n3528n3729n2453m9338m4106
59849C056202l7142k9249k1098j3129n818K2L246K898j070p750j6004k5025l4052
59836B872031m2123m8432n2691n4761n4201n0655m4545l7072k9512k2443j5500
59825B420096p823R11R904J8099K5465L2859M0585M7799N3532N7584O0340O2460
$$ plain form
59813 2821811 2886768 2955285 3027586 3101856 3175060 3244631 3308552 3364117 3407889 3437347 3451981
59802 3451981 3452813 3441851 3422406 3399003 3376021 3356381 3341648 3333012 3331927 3340205 3359812 3392459
59790 3392459 3439303 3501250 3579465 3675468 3791072 3928813 4092196 4284917 4509925 4769804
59780 4769804 5067575 5405885 5784747 6199987 6642593 7097331 7541041 7943605 8272670
59771 8272670 8499538 8603921 8577765 8427917 8175302 7849549 7481963 7100510 6727427 6378238
59761 6378238 6061980 5782826 5541918 5338284 5169298 5031655 4922427 4839229 4779828 4742034
59751 4742034 4723904 4723810 4740514 4773329 4822010 4886446 4966723 5063467 5177595 5309540 5459248
59740 5459248 5627153 5814752 6024023 6256772 6514739 6799825 7113952 7459183 7838273
$$ packed form
59813B821811O4957O8517P2301P4270P3204O9571O3921N5565M3772K9458J4634
59802C451981Q32j0962j9445k3403k2982j9640j4733q636j085Q278J9607L2647
59790C392459M6844O1947P8215R6003J15604J37741J63383J92721K25008K59879
59780D769804K97771L38310L78862M15240M42606M54738M43710M02564L29065
59771H272670K26868J04383k6156j49848k52615l25753l67586l81453l73083l49189
59761F378238l16258k79154k40908k03634j68986j37643j09228q3198n9401l7794
59751D742034j8130r4J6704L2815M8681O4436Q0277R6744J14128J31945J49708
59740E459248J67905J87599K09271K32749K57967K85086L14127L45231L79090
$$ plain form
59731 7838273 8254478 8710384 9207147 9744952 10323379 10940596 11592227 12271095 12967462
59722 12967462 13669235 14362706 15034151 15671302 16264272 16807049 17299762 17749742 18169829
59713 18169829 18575449 18982797 19408025 19865943 20368151 20921802 21529046 22186413 22884245
59704 22884245 23606998 24334300 25041976 25703192 26290522 26778880 27148314 27386012 27487602
59695 27487602 27457689 27309341 27062464 26741531 26373299 25984918 25602407 25249251 24945192
59686 24945192 24705923 24543911 24469368 24490520 24613779 24844705 25189016 25652295 26238670 26949900
59676 26949900 27784882 28738396 29799067 30947609 32155441 33383145 34579927 35686025
59668 35686025 36637679 37372513 37835009 37983478 37797393 37281240 36463174 35390667 34125162
$$ packed form
59731G838273M16205M55906M96763N37805N78427O17217O51631O78868O96367
59722A2967462P01773O93471O71445O37151N92970N42777M92713M49980M20087
59713A8169829M05620M07348M25228M57918N02208N53651O07244O57367O97832
59704B2884245P22753P27302P07676O61216N87330M88358L69434K37698J01590
59695B7487602k9913j48348k46877l20933l68232l88381l82511l53156l04059
59686B4945192k39269j62012p4543K1152J23259K30926L44311M63279N86375P11230
59676B6949900Q34982R53514J060671J148542J207832J227704J196782J106098
59668C5686025R51654P34834M62496J48469j86085n16153q18066j072507j265505
$$ plain form
59659 34125162 32735134 31287844 29842666 28448021 27140325 25942931 24865522 23904849
59651 23904849 23045929 22263106 21522563 20787453 20024173 19208032 18327885 17388664 16409177
59642 16409177 15415264 14432721 13483794 12586094 11751306 10984404 10285280 9651510 9079518
59633 9079518 8564448 8100846 7683986 7309968 6974803 6674398 6405417 6165336 5951635
59624 5951635 5761663 5593335 5445265 5316126 5204316 5108202 5026138 4956208 4896333 4844529
59614 4844529 4798648 4756013 4713644 4668672 4618341 4560119 4492457 4415288 4329457 4236021 4136459
59603 4136459 4032952 3927776 3822762 3719820 3621334 3529154 3443671 3364777 3293406 3231117
59593 3231117 3178346 3134115 3097542 3068710 3047887 3034696 3028373 3028346 3034341 3046256 3063910 3086488
$$ packed form
59659C4125162j390028j447290j445178j394645j307696j197394j077409r60673
59651B3904849q58920p82823p40543p35110p63280q16141q80147r39221r79487
59642A6409177r93913r82543r48927q97700q34788p66902o99124o33770n71992
59633I079518n15070m63602m16860l74018l35165l00405k68981k40081k13701
59624E951635j89972j68328j48070j29139j11810r6114q2064o9930n9875n1804
59614D844529m5881m2635m2369m4972n0331n8222o7662p7169q5831r3436r9562
59603D136459j03507j05176j05014j02942r8486r2180q5483p8894p1371o2289
59593C231117n2771m4231l6573k8832k0823j3191o323k7N995J1915J7654K2578
$$ plain form
59581 3086488 3112331 3139653 3167352 3194703 3220661 3244249 3265642 3286243 3307623 3330805 3356440
59570 3356440 3385086 3417324 3454090 3496887 3547248 3606097 3674044 3752010 3841012 3941560 4053952
59559 4053952 4179055 4318240 4472707 4643549 4832283 5040476 5268709 5516508 5783246
59550 5783246 6068398 6370800 6688280 7018087 7357031 7700966 8044676 8382730 8710419
59541 8710419 9024099 9321211 9600096 9859562 10098644 10316978 10515007 10693209 10851269
59532 10851269 10988722 11106687 11208889 11301289 11391061 11485290 11589344 11705726 11834083 11971590
59522 11971590 12112534 12247804 12365690 12453583 12499147 12491047 12420332 12281798 12073933 11798024
59512 11798024 11458269 11062584 10622070 10148995 9655363 9152803 8652353 8163399 7693083
$$ packed form
59581C086488K5843K7322K7699K7351K5958K3588K1393K0601K1380K3182K5635
59570C356440K8646L2238L6766M2797N0361N8849O7947P7966Q9002J00548J12392
59559D053952J25103J39185J54467J70842J88734K08193K28233K47799K66738
59550E783246K85152L02402L17480L29807L38944L43935L43710L38054L27689
59541H710419L13680K97112K78885K59466K39082K18334J98029J78202J58060
59532A0851269J37453J17965J02202R2400Q9772R4229J04054J16382J28357J37507
59522A1971590J40944J35270J17886Q7893M5564q100p0715j38534k07865k75909
59512A1798024l39755l95685m40514m73075m93632n02560n00450m88954m70316
$$ plain form
59503 7693083 7246823 6828874 6442255 6088602 5768328 5480619 5223534 4994906 4793363
59494 4793363 4617975 4466980 4337661 4227653 4135705 4061033 4002694 3959946 3932585 3920508
59484 3920508 3923481 3941639 3975735 4026428 4093704 4177299 4277360 4394413 4529019 4681878 4854078
59473 4854078 5046974 5261745 5498857 5757467 6035072 6327759 6630590 6937375 7240215
59464 7240215 7529760 7795988 8028495 8216513 8349853 8420810 8425471 8363653 8238239 8054662
59454 8054662 7820412 7544534 7237391 6910208 6573758 6236808 5905797 5585687 5280549
59445 5280549 4993328 4725648 4478172 4250890 4043154 3853988 3682575 3528236 3390002
59436 3390002 3266621 3156931 3059826 2973981 2898132 2831652 2774380 2725955 2685744 2653263 2628059
$$ packed form
59503G693083m46260m17949l86619l53653l20274k87709k57085k28628k01543
59494D793363j75388j50995j29319j10008r1948p4672n8339m2748k7361j2077
59484C920508K973J8158L4096N0693O7276Q3595J00061J17053J34606J52859J72200
59473D854078J92896K14771K37112K58610K77605K92687L02831L06785L02840
59464G240215K89545K66228K32507J88018J33340P0957M661o1818j25414j83577
59454H054662k34250k75878l07143l27183l36450l36950l31011l20110l05138
59445E280549k87221k67680k47476k27282k07736j89166j71413j54339j38234
59436C390002j23381j09690r7105q5845p5849o6480n7272m8425m0211l2481k5204
$$ plain form
59425 2628059 2609262 2595952 2588008 2585850 2589212 2596798 2607306 2620278 2635873 2654492 2676857 2703866
59413 2703866 2736045 2773451 2815953 2862807 2911709 2959076 3001992 3039900 3074626 3109514 3148736
59402 3148736 3196557 3256408 3330560 3420637 3527797 3651879 3790723 3941088 4100795 4270467
59392 4270467 4453790 4656404 4884328 5143067 5437635 5772564 6151194 6575092 7044547
59383 7044547 7559237 8117609 8715345 9344629 9994570 10651836 11301346 11927736 12517318
59374 12517318 13059297 13546115 13973700 14341559 14652160 14910000 15120969 15291265 15425252
59365 15425252 15523907 15585570 15607671 15586814 15517894 15395080 15214648 14976724 14684841 14345425
59355 14345425 13968242 13566200 13153631 12744381 12350441 11980187 11636522 11316902 11015501
$$ packed form
59425B628059j8797j3310p944k158L362P586J0508J2972J5595J8619K2365K7009
59413B703866L2179L7406M2502M6854M8902M7367M2916L7908L4726L4888L9222
59402C148736M7821N9851P4152R0077J07160J24082J38844J50365J59707J69672
59392D270467J83323K02614K27924K58739K94568L34929L78630M23898M69455
59383G044547N14690N58372N97736O29284O49941O57266O49510O26390N89582
59374A2517318N41979M86818M27585L67859L10601K57840K10969J70296J33987
59365A5425252R8655O1663K2101k0857o8920j22814j80432k37924k91883l39416
59355A4345425l77183m02042m12569m09250l93940l70254l43665l19620l01401
$$ plain form
59346 11015501 10725132 10437713 10144769 9838999 9515664 9172872 8811641 8436023 8052186
59337 8052186 7666599 7285150 6913569 6557281 6220268 5904895 5613184 5347223 5107773
59328 5107773 4893480 4702238 4532660 4383703 4253816 4141432 4045764 3966282 3901775 3850575
59318 3850575 3811398 3783481 3766337 3759840 3764152 3779103 3804052 3838677 3883406 3938649 4004171 4079544
59306 4079544 4164591 4258823 4360975 4469494 4582895 4699159 4815422 4928848 5037262 5138397
59296 5138397 5229221 5306864 5369838 5417826 5450787 5469249 5475267 5472339 5464244 5454232 5445147 5439834
59284 5439834 5441435 5453409 5478989 5520404 5578765 5654585 5747794 5857110 5980072 6113991 6256134
59273 6256134 6402578 6547505 6684273 6806896 6910359 6990254 7042794 7064964 7054494 7010400
$$ packed form
59346A1015501k90369k87419k92944l05770l23335l42792l61231l75618l83837
59337H052186l85587l81449l71581l56288l37013l15373k91711k65961k39450
59328E107773k14293j91242j69578j48957j29887j12384r5668p9482o4507n1200
59318C850575l9177k7917j7144o497M312J4951K4949L4625M4729N5243O5522P5373
59306D079544Q5047R4232J02152J08519J13401J16264J16263J13426J08414J01135
59296E138397R0824P7643O2974M7988L2961J8462O018k928q095j0012r085n313
59284E439834J601J1974K5580M1415N8361P5820R3209J09316J22962J33919J42143
59273F256134J46444J44927J36768J22623J03463P9895N2540K2170j0470m4094
$$ plain form
59263 7010400 6934260 6830827 6707277 6572128 6434477 6302789 6183289 6079609 5993976 5927933
59253 5927933 5881675 5853738 5842187 5845525 5861964 5888606 5922042 5959278 5997646 6034699 6069038
59242 6069038 6100812 6130844 6159876 6189289 6221960 6261827 6313217 6381096 6471057 6588087 6735791
59231 6735791 6917347 7136348 7395588 7695310 8033114 8404569 8802521 9215899 9629999
59222 9629999 10027883 10391384 10702041 10942862 11099825 11162020 11121883 10976927 10731329 10395091
59212 10395091 9981898 9508005 8991749 8451856 7905309 7366671 6848319 6359704 5906262
59203 5906262 5489959 5110972 4768354 4459865 4182635 3934354 3713199 3516832 3342453
59194 3342453 3187823 3051382 2931220 2824686 2729120 2642624 2564203 2493661 2431038 2375581
$$ packed form
59263G010400p6140j03433j23550j35149j37651j31688j19500j03680q5633o6043
59253E927933m6258k7937j1551L338J6439K6642L3436L7236L8368L7053L4339
59242F069038L1774L0032K9032K9413L2671L9867N1390O7879Q9961J17030J47704
59231F735791J81556K19001K59240K99722L37804L71455L97952M13378M14100
59222I629999L97884L63501L10657K40821J56963O2195m0137j44956k45598l36238
59212A0395091m13193m73893n16256n39893n46547n38638n18352m88615m53442
59203E906262m16303l78987l42618l08489k77230k48281k21155j96367j74379
59194C342453j54630j36441j20162j06534r5566q6496p8421p0542o2623n5457
$$ plain form
59184 2375581 2325478 2279091 2236077 2196743 2160944 2128445 2099864 2076177 2057481 2043109 2032687
59173 2032687 2026186 2023242 2023539 2027663 2036557 2050242 2068125 2090399 2117890 2150421 2186629 2225776
59161 2225776 2268657 2316190 2368025 2423230 2481755 2544624 2613089 2687980 2769565 2857590 2951568
59150 2951568 3051223 3156509 3267252 3382903 3502516 3624668 3747474 3868931 3987092 4099620
59140 4099620 4203481 4295499 4373078 4434321 4478086 4504594 4515590 4513261 4499281 4475435 4444716
59129 4444716 4411016 4377949 4348645 4326308 4313974 4313750 4327031 4355580 4401835 4468173 4556279 4667008
59117 4667008 4800276 4955298 5131483 5328982 5547903 5787197 6044563 6316635 6598327
59108 6598327 6882262 7159531 7420645 7655214 7851719 7999459 8091360 8124947 8101615 8026380
$$ packed form
59184B375581n0103m6387m3014l9334l5799l2499k8581k3687j8696j4372j0422
59173B032687o501k944K97M124Q894J3685J7883K2274K7491L2531L6208L9147
59161B225776M2881M7533N1835N5205N8525O2869O8465P4891Q1585Q8025R3978
59150B951568R9655J05286J10743J15651J19613J22152J22806J21457J18161J12528
59140D099620J03861R2018P7579O1243M3765K6508J0996k329j3980k3846l0719
59129D444716l3700l3067k9304k2337j2334k24J3281K8549M6255O6338Q8106J10729
59117D667008J33268J55022J76185J97499K18921K39294K57366K72072K81692
59108F598327K83935K77269K61114K34569J96505J47740R1901L3587k3332p5235
$$ plain form
59098 8026380 7907906 7756952 7583974 7398342 7208803 7022627 6843579 6671648 6505160
59089 6505160 6342467 6181715 6020395 5856018 5686850 5511842 5330568 5143475 4951663
59080 4951663 4756281 4558628 4360741 4165070 3973486 3787263 3607844 3436694 3274249
59071 3274249 3120009 2973928 2836946 2709865 2592500 2484270 2384927 2294232 2211419 2135446
59061 2135446 2065517 2001208 1942304 1888514 1839068 1792761 1748740 1706981 1667561 1629849 1593221
59050 1593221 1558221 1526108 1497280 1471029 1446806 1424956 1406169 1390955 1379640 1372102 1367408 1364368
59038 1364368 1362442 1361499 1360979 1360212 1359534 1360219 1363246 1368896 1377477 1389444 1404613 1422064 1440960 1460774
59024 1460774 1480633 1499167 1515118 1527558 1535684 1539230 1539076 1536715 1533156 1529031 1525480 1523931 1525015
$$ packed form
59098H026380j18474j50954j72978j85632j89539j86176j79048j71931j66488
59089F505160j62693j60752j61320j64377j69168j75008j81274j87093j91812
59080D951663j95382j97653j97887j95671j91584j86223j79419j71150j62445
59071C274249j54240j46081j36982j27081j17365j08230r9343r0695q2813p5973
59061B135446o9929o4309n8904n3790m9446m6307m4021m1759l9420l7712l6628
59050A593221l5000l2113k8828k6251k4223k1850j8787j5214j1315p538m694l040
59038A364368j926r43n20p67o78O85L027N650Q581J1967J5169J7451J8896J9814
59024A460774J9859J8534J5951J2440Q126L546j54k361l559m125l551j549J084
$$ plain form
59011 1525015 1528571 1534534 1542920 1553168 1564645 1577661 1592712 1608721 1623274 1634741 1642970 1647867
58999 1647867 1648764 1645640 1639694 1632166 1623605 1614650 1606362 1599230 1592849 1587101 1582759 1580446 1579967 1581206
58985 1581206 1584704 1590743 1598595 1607263 1616331 1625743 1635548 1646331 1659055 1673954 1690232 1707266 1725474
58972 1725474 1745608 1767879 1792179 1818521 1846953 1877570 1910808 1947071 1985951 2026445 2067935
58961 2067935 2110210 2152658 2194547 2236250 2278993 2323135 2367785 2412427 2457892 2505384 2555680
58950 2555680 2609684 2668599 2732974 2802524 2877377 2958577 3047003 3142828 3246526 3359336 3482286
58939 3482286 3615762 3760498 3917883 4088718 4272851 4470730 4684378 4916347 5168883
58930 5168883 5444731 5747468 6080132 6444477 6842447 7277326 7752666 8271055 8834838
$$ packed form
59011A525015L556N963Q386J0248J1477J3016J5051J6009J4553J1467Q229M897
58999A647867Q97l124n946p528q561q955q288p132o381n748m342k313m79J239
58985A581206L498O039P852Q668R068R412R805J0783J2724J4899J6278J7034J8208
58972A725474K0134K2271K4300K6342K8432L0617L3238L6263L8880M0494M1490
58961B067935M2275M2448M1889M1703M2743M4142M4650M4642M5465M7492N0296
58950B555680N4004N8915O4375O9550P4853Q1200Q8426R5825J03698J12810J22950
58939C482286J33476J44736J57385J70835J84133J97879K13648K31969K52536
58930E168883K75848L02737L32664L64345L97970M34879M75340N18389N63783
$$ plain form
58921 8834838 9446907 10109484 10822662 11584743 12392756 13241032 14119293 15012628 15902460
58912 15902460 16766574 17578942 18310957 18933487 19418817 19743333 19891246 19857010 19644747
58903 19644747 19266564 18741756 18095656 17356592 16552573 15709759 14851791 13998433 13164651
58894 13164651 12361520 11597540 10878567 10207391 9584639 9010019 8482456 7999879 7559776
58885 7559776 7159574 6796018 6465032 6162942 5887136 5634913 5402608 5186833 4985916
58876 4985916 4799258 4625942 4464819 4315307 4177073 4049363 3931409 3823021 3724066 3633872
58866 3633872 3551756 3477424 3410275 3349107 3293251 3243110 3198853 3159576 3124678 3095064 3071764
58855 3071764 3054288 3041596 3033937 3032390 3037239 3048210 3065757 3090651 3122627 3160814 3205278 3256881
$$ packed form
58921H834838O12069O62577P13178P62081Q08013Q48276Q78261Q93335Q89832
58912A5902460Q64114Q12368P32015O22530M85330L24516J47913l4236k12263
58903A9644747l78183n24808o46100p39064q04019q42814q57968q53358q33782
58894A3164651q03131p63980p18973o71176o22752n74620n27563m82577m40103
58885G559776m00202l63556l30986l02090k75806k52223k32305k15775k00917
58876D985916j86658j73316j61123j49512j38234j27710j17954j08388r8955r0194
58866C633872q2116p4332o7149o1168n5856n0141m4257l9277l4898k9614k3300
58855C071764j7476j2692p659j547M849J0971J7547K4894L1976L8187M4464N1603
$$ plain form
58843 3256881 3315760 3381234 3453183 3532397 3619610 3715185 3819718 3934022 4058542 4193654
58833 4193654 4340469 4500512 4674711 4863520 5068006 5290250 5532812 5798367 6089481
58824 6089481 6408095 6755678 7134616 7549044 8003563 8501636 9045893 9639075 10283185
58815 10283185 10977803 11720064 12505550 13327484 14174712 15031257 15877478 16690441 17443358
58806 17443358 18106702 18651553 19052808 19290850 19352906 19234840 18942245 18489844 17899686
58797 17899686 17198707 16415826 15579255 14714813 13845001 12988263 12158724 11366644 10618799
58788 10618799 9918385 9265589 8659276 8098231 7580871 7104772 6667352 6266553 5900252
58779 5900252 5565593 5259606 4979954 4724345 4489792 4273298 4072811 3886709 3712819
$$ packed form
58843C256881N8879O5474P1949P9214Q7213R5575J04533J14304J24520J35112
58833D193654J46815J60043J74199J88809K04486K22244K42562K65555K91114
58824F089481L18614L47583L78938M14428M54519M98073N44257N93182O44110
58815A0283185O94618P42261P85486Q21934Q47228Q56545Q46221Q12963P52917
58806A7443358O63344N44851M01255K38042O2056j18066k92595m52401n90158
58797A7899686p00979p82881q36571q64442q69812q56738q29539p92080p47845
58788A0618799p00414o52796o06313n61045n17360m76099m37420m00799l66301
58779E900252l34659l05987k79652k55609k34553k16494k00487j86102j73890
$$ plain form
58770 3712819 3548827 3393373 3246045 3106714 2975564 2853260 2740270 2636307 2540980 2454434
58760 2454434 2376640 2306709 2243724 2187725 2138988 2096825 2059936 2027575 1999593 1975785 1955874
58749 1955874 1939686 1926718 1916078 1907381 1900929 1896413 1892458 1888162 1883952 1879839 1873955 1864180 1850266
58736 1850266 1833018 1812366 1787972 1761075 1733890 1707438 1681424 1655826 1630974 1606250 1580357
58725 1580357 1552924 1524538 1495276 1464517 1432251 1399336 1366421 1333653 1301397 1270212 1240232
58714 1240232 1211523 1184858 1161097 1140057 1120908 1103386 1087560 1072882 1058675 1045274 1033536
58703 1033536 1023484 1014507 1006569 1000085 994954 990734 987342 984544 981431 977650 974455 973123 972971 972432
58689 972432 971264 969855 967041 960859 951301 940296 928958 916938 904533 893286 884003 876098 869441
$$ packed form
58770C712819j63992j55454j47328j39331j31150j22304j12990j03963r5327q6546
58760B454434p7794o9931o2985n5999m8737m2163l6889l2361k7982k3808j9911
58749A955874j6188j2968j0640q697o452m516l955m296m210m113n884r775j3914
58736A850266j7248k0652k4394k6897k7185k6452k6014k5598k4852k4724k5893
58725A580357k7433k8386k9262l0759l2266l2915l2915l2768l2256l1185k9980
58714A240232k8709k6665k3761k1040j9149j7522j5826j4678j4207j3401j1738
58703A033536j0052q977p938o484n131m220l392k798l113l781l195j332j52n39
58689I72432j168j409k814o182r558j1005j1338j2020j2405j1247r283p905o657
$$ plain form
58676 869441 865111 863659 864228 866044 869338 874077 879117 883394 886977 890363 893705 897198 901297 906129
58662 906129 911391 916945 922631 927442 929938 929581 926847 922213 916295 910830 908059 908866 912660 919114 928656
58647 928656 941112 955235 969989 985297 1001353 1018333 1036907 1057901 1081317 1106763 1134846
58636 1134846 1166931 1203550 1244234 1288923 1338235 1392454 1451651 1516902 1589951 1671673 1762314
58625 1762314 1863283 1977170 2105819 2249919 2410673 2590206 2789879 3009557 3248667
58616 3248667 3506269 3779403 4062498 4348507 4628976 4892581 5125412 5313937 5447463
58607 5447463 5518417 5522698 5461104 5339601 5167642 4956640 4719294 4468045 4213018 3961912
58597 3961912 3721320 3496245 3288159 3095562 2917258 2753815 2605645 2471567 2350079
$$ packed form
58676H69441m330j452N69J816L294M739N040M277L583L386L342L493M099M832
58662I06129N262N554N686M811K496l57k734m634n918n465k771Q07L794O454R542
58647I28656J2456J4123J4754J5308J6056J6980J8574K0994K3416K5446K8083
58636A134846L2085L6619M0684M4689M9312N4219N9197O5251P3049Q1722R0641
58625A762314J00969J13887J28649J44100J60754J79533J99673K19678K39110
58616C248667K57602K73134K83095K86009K80469K63605K32831J88525J33526
58607E447463P0954M281o1594j21503j71959k11002k37346k51249k55027k51106
58597C961912k40592k25075k08086j92597j78304j63443j48170j34078j21488
$$ plain form
58588 2350079 2240541 2142364 2054465 1976275 1908105 1849864 1800545 1759379 1726121 1699766 1678346
58577 1678346 1660547 1646213 1634768 1624523 1614107 1603323 1592176 1580374 1568285 1557013 1547007
58566 1547007 1537861 1529829 1523998 1520294 1516520 1509898 1498495 1481074 1457193 1428055 1395932 1362407
58554 1362407 1328372 1295667 1266878 1243046 1223260 1206790 1193847 1183813 1174655 1164876 1154444 1143275
58542 1143275 1130522 1115998 1100634 1084895 1068318 1051014 1033844 1016663 998398 979455 962064
58531 962064 947441 934494 922041 910234 898984 887057 873811 860099 846601 833090 820028
58520 820028 808704 798940 788847 777924 768142 760829 754776 748770 743671 740384 737987 735632 734386
58507 734386 735351 737776 740754 745035 751307 758317 764633 770933 778791 788432 799306 811604 825649 840941
$$ packed form
58588B350079j09538r8177q7899p8190o8170n8241m9319m1166l3258k6355k1420
58577A678346j7799j4334j1445j0245j0416j0784j1147j1802j2089j1272j0006
58566A547007r146q032n831l704l774o622j1403j7421k3881k9138l2123l3525
58554A362407l4035l2705k8789k3832j9786j6470j2943j0034r158r779j0432j1169
58542A143275j2753j4524j5364j5739j6577j7304j7170j7181j8265j8943j7391
58531I62064j4623j2947j2453j1807j1250j1927j3246j3712j3498j3511j3062
58520H20028j1324r764j0093j0923r782p313o053o006n099l287k397k355j246
58507G34386R65K425K978M281O272P010O316O300P858R641J0874J2298J4045J5292
$$ plain form
58493 840941 857188 875051 894695 914974 935162 955829 976769 995939 1011979 1026041 1039429
58482 1039429 1051041 1058753 1061787 1060059 1052879 1040208 1023828 1005541 985488 963682 941583 920479
58470 920479 899857 879196 859849 843327 829064 815641 802927 791389 780735 770958 763211 757919
58458 757919 753487 748605 744287 741844 740472 738747 736915 735733 734612 733030 732296 733794 736821 740215
58444 740215 744738 751673 760497 770188 781563 796009 812973 830806 848942 867180 884016 897859
58432 897859 908932 917988 924372 927322 927943 927889 927307 926079 925527 926680 928232 928558 928368 928997 929458 927888
58416 927888 924801 922245 920678 919189 918010 918346 920388 923739 929035 936956 946360 955404 963564 970667
58402 970667 975151 975551 972588 967659 960502 950570 939450 929430 920776 912731 905927 901321 897923 894192
$$ packed form
58493H40941J6247J7863J9644K0279K0188K0667K0940J9170J6040J4062J3388
58482A039429J1612P712L034j728p180j2671j6380j8287k0053k1806k2099k1104
58470I20479k0622k0661j9347j6522j4263j3423j2714j1538j0654r777p747n292
58458G57919m432m882m318k443j372j725j832j182j121j582p34J498L027L394
58444G40215M523O935Q824R691J1375J4446J6964J7833J8136J8238J6836J3843
58432H97859J1073R056O384K950O21n4n82j228n52J153J552L26j90O29M61j570
58416I27888l087k556j567j489j179L36K042L351N296P921R404R044Q160P103
58402I70667M484M00k963m929p157r932j1120j0020q654q045o804m606l398l731
$$ plain form
58388 894192 890712 889076 889209 890138 892218 896137 900895 905269 910102 916735 924483 932131 940381 950106 959706
58373 959706 967179 973457 980718 988729 995955 1002919 1011163 1019942 1027255 1033295 1039791 1046911 1053812 1061195
58359 1061195 1070170 1079682 1088252 1097237 1109147 1123746 1138938 1154205 1169791 1183789 1193800 1200558
58347 1200558 1206337 1210729 1211617 1209346 1206176 1202540 1197662 1193002 1191044 1191309 1191503 1192017 1195378 1201770 1209106
58332 1209106 1217079 1227124 1238747 1249933 1261011 1274243 1289681 1305152 1320123 1335971 1352772
58321 1352772 1369497 1386983 1407019 1428977 1450937 1473445 1498299 1524395 1548823 1571374 1593799
58310 1593799 1615308 1633111 1646886 1658481 1667865 1673746 1677616 1682669 1689245 1695643 1702636 1712633 1725214
58297 1725214 1738260 1752625 1770697 1791249 1811005 1830513 1853001 1878171 1902806 1927009 1953963
$$ packed form
58388H94192l480j636J33R29K080L919M758M374M833O633P748P648Q250R725R600
58373I59706P473O278P261Q011P226O964Q244Q779P313O040O496P120O901P383
58359A061195Q975R512Q570Q985J1910J4599J5192J5267J5586J3998J0011O758
58347A200558N779M392Q88k271l170l636m878m660j958K65J94N14L361O392P336
58332A209106P973J0045J1623J1186J1078J3232J5438J5471J4971J5848J6801
58321A352772J6725J7486K0036K1958K1960K2508K4854K6096K4428K2551K2425
58310A593799K1509J7803J3775J1595R384N881L870N053O576O398O993R997J2581
58297A725214J3046J4365J8072K0552J9756J9508K2488K5170K4635K4203K6954
$$ plain form
58286 1953963 1983934 2014443 2046082 2082058 2122106 2162982 2204884 2251095 2301335 2351993 2403031
58275 2403031 2457888 2516160 2573147 2627159 2680497 2732671 2779730 2821145 2860375 2897761 2930103
58264 2930103 2958456 2989006 3024683 3062789 3102254 3146097 3195253 3247156 3302104 3364124 3434121
58253 3434121 3508955 3588238 3674736 3767244 3860788 3954881 4053717 4157512 4262152 4368180 4481065
58242 4481065 4601594 4725432 4853365 4991892 5142067 5298069 5458807 5630374 5814873
58233 5814873 6007758 6208643 6423431 6653135 6892348 7141734 7410017 7700549 8008408
58224 8008408 8333970 8686011 9067841 9474355 9906993 10377161 10890588 11443636 12039877
58215 12039877 12694118 13414790 14199597 15054765 16000894 17053933 18220283 19518484 20985803
$$ packed form
58286A953963K9971L0509L1639L5976M0048M0876M1902M6211N0240N0658N1038
58275B403031N4857N8272N6987N4012N3338N2174M7059M1415L9230L7386L2342
58264B930103K8353L0550L5677L8106L9465M3843M9156N1903N4948O2020O9997
58253C434121P4834P9283Q6498R2508R3544R4093R8836J03795J04640J06028J12885
58242D481065J20529J23838J27933J38527J50175J56002J60738J71567J84499
58233E814873J92885K00885K14788K29704K39213K49386K68283K90532L07859
58224H008408L25562L52041L81830M06514M32638M70168N13427N53048N96241
58215A2039877O54241P20672P84807Q55168R46129J053039J166350J298201J467319
$$ plain form
58206 20985803 22656682 24558694 26740678 29283152 32273223 35795481 39954691 44874255
58198 44874255 50663796 57435234 65381245 74813264 86124698 99791805 116448502 136876650
58190 136876650 161831278 191885877 227404124 268323049 313415851 359399426 400828389
58183 400828389 431302997 445489801 440900966 418653642 382996559 339841315 294923374
58176 294923374 252430915 214624775 182259947 155204543 132875618 114512204 99379307
58169 99379307 86869354 76486478 67812852 60523015 54391579 49249779 44946208 41359384
58161 41359384 38417087 36075825 34296419 33059202 32386831 32327433 32920497 34194791 36184908
58152 36184908 38903883 42248356 45890641 49250192 51607270 52335584 51138033 48151301
$$ packed form
58206B0985803J670879J902012K181984K542474K990071L522258M159210M919564
58198D4874255N789541O771438P946011R432019J1311434J3667107J6656697K0428148
58190A36876650K4954628L0054599L5518247M0918925M5092802M5983575M1428963
58183D00828389L0474608J4186804m588835k2247324l5657083m3155244m4917941
58176B94923374m2492459l7806140l2364828k7055404k2328925j8363414j5132897
58169I9379307j2509953j0382876q673626p289837o131436n141800m303571l586824
58161D1359384k942297k341262j779406j237217o72371n9398N93064J274294J990117
58152C6184908K718975L344473L642285L359551K357078P28314j197551k986732
$$ plain form
58144 48151301 43869436 38947229 33990216 29415323 25418979 22034973 19218304 16896020
58136 16896020 14982546 13392694 12059983 10938957 9990926 9178981 8477654 7874238 7355555
58127 7355555 6902195 6498153 6135855 5807922 5503149 5214455 4942288 4686457 4442613
58118 4442613 4210198 3995619 3803386 3631128 3476539 3341578 3225993 3123810 3030159 2944988
58108 2944988 2866599 2788370 2705951 2621618 2537918 2453287 2367729 2286605 2214398 2149872 2090957
58097 2090957 2038964 1994120 1952124 1909170 1865927 1823250 1778785 1731342 1684075 1639841 1597645
58086 1597645 1556728 1519648 1487921 1458863 1429914 1402051 1376014 1349473 1321135 1293542 1268701
58075 1268701 1244850 1220427 1197169 1176325 1155909 1134810 1115620 1100218 1086496 1072573 1060225
$$ packed form
58144D8151301m281865m922207m957013m574893l996344l384006k816669k322284
58136A6896020j913474j589852j332711j121026r48031q11945p01327o03416n18683
58127G355555m53360m04042l62298l27933l04773k88694k72167k55831k43844
58118D442613k32415k14579j92233j72258j54589j34961j15585j02183r3651q5171
58108B944988p8389p8229q2419q4333q3700q4631q5558q1124p2207o4526n8915
58097B090957n1993m4844m1996m2954m3243m2677m4465m7443m7267m4234m2196
58086A597645m0917l7080l1727k9058k8949k7863k6037k6541k8338k7593k4841
58075A268701k3851k4423k3258k0844k0416k1099j9190j5402j3722j3923j2348
$$ plain form
58064 1060225 1050784 1041598 1030293 1019023 1010794 1004651 998026 990877 984090 976655 967691 958604 950242
58051 950242 940743 929181 918359 910876 905232 899015 893097 889417 887242 885001 883385 883362 883383 881809 880119
58036 880119 880619 882934 885574 888885 893613 898520 902224 905516 909272 912129 912848 912929 914214 915955 916851
58021 916851 917841 920106 922384 923105 923254 924329 925352 924704 923094 921898 920407 917559 914607 913182 912311
58006 912311 910241 907561 905636 903558 899665 894709 890550 886962 882588 877767 873436 868435 860965 851956
57992 851956 844097 838219 833234 828948 826245 824970 824095 823615 824207 825583 827142 829519 833484 838086 841847
57977 841847 845035 848941 853762 858976 864741 871000 876249 879112 880133 880233 878731 874889 870010 865672
57963 865672 861125 854828 847488 841163 836319 832160 828924 827252 826062 823572 819892 816315 812743 808221
$$ packed form
58064A060225r441r186j1305j1270q229o143o625p149o787p435q964r087q362
58051I50242r499j1562j0822p483n644o217n918l680k175k241j616k3K1j574j690
58036H80119N00K315K640L311M728M907L704L292L756K857P19Q1J285J741Q96
58021I16851R90K265K278P21J49J075J023o48j610j196j491k848k952j425q71
58006I12311k070k680j925k078l893m956m159l588m374m821m331n001p470r009
57992H51956p859n878m985m286k703j275q75m80N92J376J559K377L965M602L761
57977H41847L188L906M821N214N765O259N249K863J021J00j502l842m879m338
57963H65672m547o297p340o325m844m159l236j672j190k490l680l577l572m522
$$ plain form
57949 808221 803449 800328 799339 799604 801025 804095 807982 811084 813213 815101 816153 814907 811466 807324 802963
57934 802963 797718 791807 786304 781113 774995 767642 759910 752008 743301 733945 725012 716944 709463 702923
57920 702923 698221 695444 694072 694266 696530 700354 704717 709628 715725 722765 730051 737897 747098 757387
57906 757387 767983 779078 791082 802961 813229 822146 830986 839501 846175 850790 854733 858732 862120
57893 862120 864328 865366 864837 862233 858234 854076 849752 844458 838607 833515 829175 824283 818611 813475
57879 813475 809594 806243 802849 799881 797822 796665 796646 798104 800487 802893 805590 809623 814981 820683 826616
57864 826616 833608 841562 849182 855715 861445 866292 869563 871332 872567 873655 874253 874693 875858 877441 878048
57849 878048 877426 876930 877328 877731 877356 876760 876592 876493 876018 875548 875484 875452 874893 873610 871322 867623 862770 857627
$$ packed form
57949H08221m772l121r89K65J421L070L887L102K129J888J052j246l441m142m361
57934H02963n245n911n503n191o118p353p732p902q707r356q933q068p481o540
57920G02923m702k777j372J94K264L824M363M911O097P040P286P846R201J0289
57906G57387J0596J1095J2004J1879J0268Q917Q840Q515O674M615L943L999L388
57893H62120K208J038n29k604l999m158m324n294n851n092m340m892n672n136
57879H13475l881l351l394k968k059j157j9J458K383K406K697M033N358N702N933
57864H26616O992P954P620O533N730M847L271J769J235J088N98M40J165J583O07
57849H78048o22m96L98M03l75n96j68r9m75m70o4l2n59j283k288l699m853n143
$$ plain form
57831 857627 852470 846736 840215 833571 827343 821268 814820 807669 799562 790619 781749 773893 766895 760078
57817 760078 753665 748431 744144 739787 735373 732079 730329 729182 727956 727157 727342 728303 729754 731734 733963
57802 733963 735911 737913 741139 746147 752508 760141 769761 781580 794702 808356 822684 837735 852579
57789 852579 865904 876790 884605 889032 890517 889939 887636 883560 878409 873558 869699 866529 863842 861818
57775 861818 860128 858006 855525 853605 852482 851389 850181 850019 851813 855039 858667 862336 866097 869938
57761 869938 874122 879160 884917 890482 895300 899724 904165 908517 912731 917118 921804 926585 931537 936918
57747 936918 942400 947320 951824 956768 962399 968171 973958 980243 986943 993330 999420 1006126 1013614 1020775
57733 1020775 1026854 1032459 1038452 1044994 1052200 1060587 1070291 1080831 1092157 1104841 1118844 1133288 1147993
$$ packed form
57831H57627n157n734o521o644o228o075o448p151q107q943q870p856o998o817
57817G60078o413n234m287m357m414l294j750j147j226p99J85R61J451J980K229
57802G33963J948K002L226N008O361P633R620J1819J3122J3654J4328J5051J4844
57789H52579J3325J0886P815M427J485n78k303m076n151m851l859l170k687k024
57775H61818j690k122k481j920j123j093j208j62J794L226L628L669L761L841
57761H69938M184N038N757N565M818M424M441M352M214M387M686M781M952N381
57747I36918N482M920M504M944N631N772N787O285O700O387O090O706P488P161
57733A020775O079N605N993O542P206Q387R704J0540J1326J2684J4003J4444J4705
$$ plain form
57720 1147993 1163991 1181894 1201000 1220697 1241525 1264011 1287588 1311565 1336205 1362065 1389226
57709 1389226 1417930 1448923 1482379 1517521 1554196 1593834 1638004 1687010 1740859 1800663 1868006
57698 1868006 1943706 2028148 2122129 2226585 2342406 2471485 2617003 2781550 2965540 3168399
57688 3168399 3390382 3631983 3892045 4167327 4452970 4741774 5023175 5284209 5511910
57679 5511910 5694903 5824234 5894768 5906547 5864796 5779195 5663385 5533592 5405449 5291113
57669 5291113 5198710 5132355 5090154 5061725 5029168 4972097 4873776 4725808 4530549 4300287 4052898
57658 4052898 3806216 3574207 3365643 3184231 3029876 2900846 2795247 2710681 2643597 2590217
57648 2590217 2548010 2515714 2492374 2477230 2470272 2471909 2482105 2500426 2526819 2561685 2605352 2658151
$$ packed form
57720A147993J5998J7903J9106J9697K0828K2486K3577K3977K4640K5860K7161
57709A389226K8704L0993L3456L5142L6675L9638M4170M9006N3849N9804O7343
57698A868006P5700Q4442R3981J04456J15821J29079J45518J64547J83990K02859
57688C168399K21983K41601K60062K75282K85643K88804K81401K61034K27701
57679E511910J82993J29331P0534J1779m1751q5601j15810j29793j28143j14336
57669E291113r2403o6355m2201k8429l2557n7071r8321j47968j95259k30262k47389
57658D052898k46682k32009k08564j81412j54355j29030j05599q4566o7084n3380
57648B590217m2207l2296k3340j5144o958J637J0196J8321K6393L4866M3667N2799
$$ plain form
57636 2658151 2720988 2795229 2882058 2982353 3097031 3227029 3373013 3535464 3714821 3911116
57626 3911116 4123408 4349547 4585832 4826320 5062634 5284674 5481329 5640926 5752541
57617 5752541 5808257 5804519 5741797 5624262 5460287 5261784 5041258 4809155 4573819 4342478
57607 4342478 4120804 3912046 3717809 3539315 3377052 3229933 3096271 2975447 2867523
57598 2867523 2771493 2685225 2607164 2536926 2474091 2417518 2366130 2319559 2277754 2240624 2208167
57587 2208167 2180211 2155906 2134073 2114159 2096265 2080313 2065931 2053177 2042522 2033884 2026400 2019521
57575 2019521 2013822 2010419 2009906 2011973 2015661 2019856 2023890 2027857 2032295 2037732 2044736 2053990 2065752 2079437
57561 2079437 2094312 2110399 2128133 2147301 2167128 2187429 2208910 2232167 2257119 2283799 2313120
$$ packed form
57636B658151O2837P4241Q6829J00295J14678J29998J45984J62451J79357J96295
57626C911116K12292K26139K36285K40488K36314K22040J96655J59597J11615
57617E752541N5716l738o2722j17535j63975j98503k20526k32103k35336k31341
57607D342478k21674k08758j94237j78494j62263j47119j33662j20824j07924
57598B867523r6030q6268p8061p0238o2835n6573n1388m6571m1805l7130l2457
57587B208167k7956k4305k1833j9914j7894j5952j4382j2754j0655q638p484o879
57575B019521n699l403n13K067L688M195M034L967M438N437P004R254J1762J3685
57561B079437J4875J6087J7734J9168J9827K0301K1481K3257K4952K6680K9321
$$ plain form
57550 2313120 2346287 2383593 2424158 2466925 2511884 2560412 2614456 2675272 2742974 2817274 2898477
57539 2898477 2987782 3086881 3197386 3320332 3455985 3604254 3765254 3939019 4124512 4319264
57529 4319264 4519872 4721991 4919334 5103283 5264136 5392643 5480725 5522305 5514936 5460735
57519 5460735 5365316 5236184 5082212 4913241 4738419 4564561 4396413 4237802 4091536 3958620
57509 3958620 3838701 3731348 3636242 3552458 3478676 3414192 3358907 3312269 3273011 3239955 3212485
57498 3212485 3190277 3173237 3161630 3155504 3154031 3156098 3161464 3170598 3183425 3199153 3217440 3238955
57486 3238955 3264629 3295114 3331188 3373958 3424279 3482458 3548719 3623515 3707290 3800513 3904139
57475 3904139 4019621 4148315 4291080 4448235 4619194 4802039 4993806 5191011 5389052
$$ packed form
57550B313120L3167L7306M0565M2767M4959M8528N4044O0816O7702P4300Q1203
57539B898477Q9305R9099J10505J22946J35653J48269J61000J73765J85493J94752
57529D319264K00608K02119J97343J83949J60853J28507Q8082M1580p369n4201
57519E460735r5419j29132j53972j68971j74822j73858j68148j58611j46266j32916
57509C958620j19919j07353r5106q3784p3782o4484n5285m6638l9258l3056k7470
57498C212485k2208j7040j1607o126j473K067N366R134J2827J5728J8287K1515
57486C238955K5674L0485L6074M2770N0321N8179O6261P4796Q3775R3223J03626
57475C904139J15482J28694J42765J57155J70959J82845J91767J97205J98041
$$ plain form
57466 5389052 5580922 5757143 5907361 6022020 6093414 6116794 6091476 6020707 5910277 5767543
57456 5767543 5601416 5421778 5237639 5055700 4880662 4716253 4565251 4428782 4306320
57447 4306320 4196724 4099211 4013389 3938624 3873725 3817397 3768825 3727469 3692402 3662384 3636713
57436 3636713 3615461 3598594 3585486 3575597 3568843 3564717 3561829 3559260 3557848 3559046 3562904 3568276 3574679
57423 3574679 3582651 3592287 3602759 3613650 3625595 3639121 3653722 3668662 3683964 3700014 3716738 3733696
57411 3733696 3750690 3767851 3785403 3803572 3822486 3842066 3862226 3883138 3904900 3927095 3949231
57400 3949231 3971570 3994897 4019367 4044221 4068752 4093013 4117437 4142326 4167802 4193772 4219815
57389 4219815 4245579 4271300 4297469 4324026 4350473 4376667 4402902 4429294 4455800 4482688 4510158
$$ packed form
57466E389052J91870J76221J50218J14659P1394K3380k5318p0769j10430j42734
57456E767543j66127j79638j84139j81939j75038j64409j51002j36469j22462
57447D306320j09596r7513q5822p4765o4899n6328m8572m1356l5067l0018k5671
57436C636713k1252j6867j3108r889o754m126k888k569j412J198L858N372O403
57423C574679P972R636J0472J0891J1945J3526J4601J4940J5302J6050J6724J6958
57411C733696J6994J7161J7552J8169J8914J9580K0160K0912K1762K2195K2136
57400C949231K2339K3327K4470K4854K4531K4261K4424K4889K5476K5970K6043
57389D219815K5764K5721K6169K6557K6447K6194K6235K6392K6506K6888K7470
$$ plain form
57378 4510158 4537610 4564250 4590402 4617144 4644581 4671665 4697978 4724404 4751579 4778912 4805827
57367 4805827 4832840 4860513 4888323 4915603 4942813 4970785 4999239 5027220 5054710 5082792 5112224
57356 5112224 5142654 5173235 5203437 5233302 5263355 5294217 5325898 5357703 5389115 5420483 5452440
57345 5452440 5485026 5517936 5551269 5585392 5620242 5655353 5690500 5725786 5761154 5796279 5830964
57334 5830964 5865303 5899461 5933595 5967917 6002541 6037289 6071858 6106170 6140451 6175105 6210581
57323 6210581 6247067 6284165 6321212 6358118 6395501 6433720 6472158 6509899 6546845 6583737 6621217
57312 6621217 6659277 6697522 6735605 6773488 6811514 6850166 6889528 6929122 6968525 7008025 7048391
57301 7048391 7090032 7132641 7175709 7219223 7263759 7309900 7357651 7406653 7456952 7509207 7563863
$$ packed form
57378D510158K7452K6640K6152K6742K7437K7084K6313K6426K7175K7333K6915
57367D805827K7013K7673K7810K7280K7210K7972K8454K7981K7490K8082K9432
57356E112224L0430L0581L0202K9865L0053L0862L1681L1805L1412L1368L1957
57345E452440L2586L2910L3333L4123L4850L5111L5147L5286L5368L5125L4685
57334E830964L4339L4158L4134L4322L4624L4748L4569L4312L4281L4654L5476
57323F210581L6486L7098L7047L6906L7383L8219L8438L7741L6946L6892L7480
57312F621217L8060L8245L8083L7883L8026L8652L9362L9594L9403L9500M0366
57301G048391M1641M2609M3068M3514M4536M6141M7751M9002N0299N2255N4656
$$ plain form
57290 7563863 7620431 7678059 7736567 7796403 7857733 7920208 7983570 8047812 8112726 8177931 8243320
57279 8243320 8308707 8372876 8433719 8489586 8539848 8584056 8621422 8651495 8674531 8690752 8700087
57268 8700087 8703212 8702091 8698775 8694239 8688984 8684063 8680630 8678926 8678520 8679323 8681653 8685657 8691366 8699073
57254 8699073 8708924 8720316 8732337 8744645 8757411 8770664 8784353 8798818 8814478 8831114 8848084
57243 8848084 8865195 8882792 8901033 8919647 8938397 8957319 8976528 8996218 9016762 9038225 9059806
57232 9059806 9080238 9098832 9115753 9131322 9145537 9158213 9169121 9177833 9183910 9187416 9188938 9188949 9187402
57219 9187402 9183973 9178482 9170932 9161390 9149984 9136941 9122479 9106602 9089012 9069390 9048042 9026186
57207 9026186 9005212 8985509 8966310 8946734 8926617 8906234 8885718 8865078 8844333 8823339 8801859
$$ packed form
57290G563863N6568N7628N8508N9836O1330O2475O3362O4242O4914O5205O5389
57279H243320O5387O4169O0843N5867N0262M4208L7366L0073K3036J6221R335
57268H700087L125j121l316m536n255m921l433j704m06Q03K330M004N709P707
57254H699073R851J1392J2021J2308J2766J3253J3689J4465J5660J6636J6970
57243H848084J7111J7597J8241J8614J8750J8922J9209J9690K0544K1463K1581
57232I059806K0432J8594J6921J5569J4215J2676J0908Q712O077L506J522J1j547
57219I187402l429n491p550r542j1406j3043j4462j5877j7590j9622k1348k1856
57207I026186k0974j9703j9199j9576k0117k0383k0516k0640k0745k0994k1480
$$ plain form
57196 8801859 8780121 8758765 8737845 8716312 8693093 8668282 8642686 8616579 8589654 8561957 8534048
57185 8534048 8506144 8477737 8448122 8416820 8383519 8348282 8312015 8276091 8241128 8206468 8171139
57174 8171139 8135037 8098905 8063428 8028811 7995151 7962835 7932345 7903867 7877293 7852487 7829258
57163 7829258 7807089 7785311 7763795 7743169 7723936 7705573 7686870 7667023 7645905 7623437 7599288
57152 7599288 7573236 7545263 7515138 7482383 7446705 7407953 7365640 7319139 7268494 7214372 7156971
57141 7156971 7095650 7030094 6961354 6891422 6822268 6755554 6692681 6634597 6581874 6535345 6496358
57130 6496358 6466136 6445218 6433579 6430646 6434794 6443206 6452575 6459703 6461592 6455858 6441748 6420580 6395179
57117 6395179 6369265 6347207 6333299 6330635 6340873 6364927 6403058 6454289 6516813 6589621 6673550
$$ packed form
57196H801859k1738k1356k0920k1533k3219k4811k5596k6107k6925k7697k7909
57185H534048k7904k8407k9615l1302l3301l5237l6267l5924l4963l4660l5329
57174H171139l6102l6132l5477l4617l3660l2316l0490k8478k6574k4806k3229
57163G829258k2169k1778k1516k0626j9233j8363j8703j9847k1118k2468k4149
57152G599288k6052k7973l0125l2755l5678l8752m2313m6501n0645n4122n7401
57141G156971o1321o5556o8740o9932o9154o6714o2873n8084n2723m6529l8987
57130F496358l0222k0918j1639k933M148Q412R369P128J889n734j4110k1168k5401
57117F395179k5914k2058j3908k664J0238K4054L8131N1231O2524P2808Q3929
$$ plain form
57106 6673550 6771182 6886997 7027837 7202140 7418352 7684887 8011625 8410292 8893292 9473324
57096 9473324 10163835 10977771 11924939 13011450 14241312 15616517 17135319 18792176 20578645
57087 20578645 22480542 24473156 26523250 28598913 30675976 32732180 34733609 36621954
57079 36621954 38307490 39675359 40613299 41049018 40964522 40372515 39285132 37715387 35707522
57070 35707522 33354464 30780389 28110025 25452027 22895518 20506317 18323274 16362429
57062 16362429 14625440 13103543 11778527 10627331 9628070 8760926 8005551 7341675 6752586
57053 6752586 6225963 5751837 5321946 4930495 4573211 4245370 3941920 3658773 3392397
57044 3392397 3138894 2895223 2660779 2436351 2222281 2019145 1829059 1654132 1494099
$$ packed form
57106F673550R7632J15815J40840J74303K16212K66535L26738L98667M83000N80032
57096I473324O90511Q13936R47168J086511J229862J375205J518802J656857J786469
57087B0578645J901897J992614K050094K075663K077063K056204K001429J888345
57079C6621954J685536J367869R37940M35719q4496n92007j087383j569745k007865
57070C5707522k353058k574075k670364k657998k556509k389201k183043j960845
57062A6362429j736989j521897j325016j151196r99261q67144p55375o63876n89089
57053F752586n26623m74126m29891l91451l57284l27841l03450k83147k66376
57044C392397k53503k43671k34444k24428k14070k03136j90086j74927j60033
$$ plain form
57035 1494099 1347306 1213360 1092718 984136 884843 793437 710632 636921 571281 512509
57025 512509 460155 413550 371242 332049 295811 262845 233502 208276 187350 169869 154554
57014 154554 141045 129873 121262 114963 111133 110284 112495 117873 127824 144648 169725 203226 245866
57001 245866 299871 368073 453491 560383 694122 857665 1046304 1244271 1425445 1558892
56991 1558892 1618543 1593205 1491147 1336154 1157742 981448 823629 691355 585066 501223
56981 501223 434064 377251 325662 276186 227169 177985 129510 84111 44132 10561 -16515
56969 -36972 -50961 -59566 -64019 -64533 -60792 -53247 -42890 -29948 -13747 6251 30218 58556 91531
56956 91531 127819 163975 195521 218276 229210 227272 213893 192272 165948 138044 111230 87441
$$ packed form
57035A494099j46793j33946j20642j08582r9293r1406q2805p3711o5640n8772
57025E12509n2354m6605m2308l9193l6238l2966k9343k5226k0926j7481j5315
57014A54554j3509j1172q611o299l830q49K211N378R951J6824K5077L3501M2640
57001B45866N4005O8202Q5418J06892J33739J63543J88639J97967J81174J33447
56991A558892N9651k5338j02058j54993j78412j76294j57819j32274j06289q3843
56981E01223o7159n6813n1589m9476m9017m9184m8475m5399l9979A0561a6515
56969c6972j3989q605m453n14L741P545J0357J2942a3747F251K3967K8338L2975
56956I1531L6288L6156L1546K2755J0934j938j3379k1621k6324k7904k6814k3789
$$ plain form
56944 87441 67573 51902 40565 33221 28805 26507 26753 30574 38458 50583 67698 90742 119848
56931 119848 154501 193923 235791 274733 303711 317528 314608 296164 265323 227060 187057 149395
56919 149395 115750 86752 62910 43943 28564 15710 5222 -3124 -10372 -17453 -24223 -29942 -34246
56906 -34246 -37306 -39522 -41344 -42916 -43722 -43152 -41469 -39474 -37117 -33317 -27339 -19562 -10652 -763 10226
56890 22584 37220 55450 77875 104174 134098 167515 202867 236512 264314 283377 292113 290058
56878 290058 278704 261730 243236 225802 210668 198869 191181 187400 186840 189537 196297 207730 224014
56865 224014 245589 273490 308987 353272 407316 471269 543478 619765 693225 754695 794637
56854 794637 806382 788879 746833 688484 622976 558519 501147 453971 417497 391022 373970
$$ packed form
56944H7441j9868j5671j1337p344m416k298K46L821P884J2125J7115K3044K9106
56931A19848L4653L9422M1868L8942K8978J3817k920j8444l0841l8263m0003l7662
56919A49395l3645k8998k3842j8967j5379j2854E222c124p248p081o770n719m304
56906c4246l060k216j822j572q06N70J683J995K357L800N978P777Q910g63A0226
56890B2584J4636J8230K2425K6299K9924L3417L5352L3645K7802J9063Q736k055
56878B90058j1354j6974j8494j7434j5134j1799p688l781n60K697O760J1433J6284
56865B24014K1575K7901L5497M4285N4044O3953P2209P6287P3460O1470L9942
56854G94637J1745j7503m2046n8349o5508o4457n7372m7176l6474k6475j7052
$$ plain form
56843 373970 366173 367378 377165 395739 424590 465887 521152 590988 676107 777539 894427 1021002
56831 1021002 1145567 1252344 1325021 1351136 1326515 1257484 1158472 1046030 933496 829271
56821 829271 737841 661209 599642 552081 516702 491742 476236 470138 473891 488216 514253 553185
56809 553185 605361 670145 746454 831767 919257 996710 1050220 1070006 1053308 1003596 928968
56798 928968 840568 749625 664055 587608 521652 466527 421478 385146 356907 336899 324637
56787 324637 318937 319566 327708 344188 368385 399413 437089 480573 526516 569095 601394 616935
56775 616935 611585 585550 543448 491966 437437 384906 337619 296387 260254 228504 201444 179035
56763 179035 160024 143188 128491 116291 106296 98015 91351 85964 80923 75808 71356 68169 65595
$$ packed form
56843C73970p797J205R787J8574K8851M1297N5265O9836Q5119J01432J16888J26575
56831A021002J24565J06777P2677K6115k4621o9031r9012j12442j12534j04225
56821H29271r1430p6632o1567m7561l5379k4960j5506o098L753J4325K6037L8932
56809E53185N2176O4784P6309Q5313Q7490P7453N3510J9786j6698m9712p4628
56798I28968q8400r0943q5570p6447o5956n5125m5049l6332k8239k0008j2262
56787C24637n700O29Q142J6480K4197L1028L7676M3484M5943M2579L2299J5541
56775F16935n350k6035m2102n1482n4529n2531m7287m1232l6133l1750k7060k2409
56763A79035j9011j6836j4697j2200r995q281o664n387n041n115m452l187k574
$$ plain form
56750 65595 62738 59787 57376 55372 53371 51782 51271 51496 51360 50283 48442 46102 43545 41294 39656
56735 39656 38215 36426 34422 32673 31226 29866 28628 27614 26675 25763 25083 24465 23242 21287 19504
56720 19504 18597 18038 16965 15487 14302 13582 13055 12652 12332 11725 10701 9777 9265 8564 7046 5053 3294
56703 3294 1872 684 41 -56 -563 -2225 -4305 -5480 -5572 -5367 -5260 -5155 -5247 -5756 -6187 -5917 -5142 -4286 -2901
56684 -2901 -322 3029 6204 9319 13267 18026 22654 26965 31939 38216 45210 51914 57672 62054 64907
56669 64907 66754 68402 70019 71236 72049 72814 73421 73312 72332 70845 69072 67103 65427 64593 64395 64200
56653 64200 64040 64529 65781 67252 68615 69978 71270 72253 73097 74125 75107 75661 76218 77491 78983 79153
56637 79153 77362 74716 72646 71477 70769 70278 70030 69902 69598 68877 67725 66457 65546 65097 64733 64242 63918
$$ packed form
56750F5595k857k951k411k004k001j589n11K25j36j077j841k340k557k251j638
56735C9656j441j789k004j749j447j360j238j014r39r12o80o18j223j955j783
56720A9504r07n59j073j478j185p20n27m03l20o07j024r24n12p01j518j993j759
56703C294j422F84D1e6n07j662k080j175r2K05J07J05r2n09m31K70P75Q56J385
56684b901c22C029L175L115L948M759M628M311M974O277O994O704N758M382K853
56669F4907J847J648J617J217Q13P65O07j09r80j487j773j969j676q34j98j95
56653F4200j60M89J252J471J363J363J292R83Q44J028R82N54N57J273J492J70
56637G9153j791k646k070j169p08m91k48j28l04p21j152j268r11m49l64m91l24
$$ plain form
56620 63918 63877 63623 62916 62451 62829 63418 63248 62591 62540 63356 64387 65406 66748 68214 69045 69193 69492 70396
56602 70396 71419 71998 72059 71677 71020 70672 71171 72181 72920 73390 74291 75807 77367 78593 79575 80221 80296 80062
56584 80062 80025 80111 80072 80488 82259 85082 87647 89373 90790 92171 93056 93390 93952 95273 97129 99373 102238
56567 102238 105571 108772 111750 114975 118363 121221 123616 126706 131293 136975 143021 149159 155122 160382
56553 160382 164753 168485 171542 173619 174962 176182 177043 176453 173967 170307 166215 161848 157504 153783 150701
56538 150701 147677 144717 142500 141051 139594 138002 137060 136812 136065 134199 132158 130875 129939 128700 127524
56523 127524 126965 126638 125914 124881 123749 122104 119706 117261 115505 114101 112302 110127 108008 105797 102993
56508 102993 99626 96292 93563 91770 90984 90822 90671 90361 90109 89723 88695 87294 86629 87171 88110 88636 88953
$$ packed form
56620F3918m1k54p07m65L78N89j70o57n1Q16J031J019J342J466Q31J48K99R04
56602G0396J023N79O1l82o57l48M99J010P39M70R01J516J560J226R82O46P5k34
56584H0062l7Q6l9M16J771K823K565J726J417J381Q85L34N62J321J856K244K865
56567A02238L333L201K978L225L388K858K395L090M587N682O046O138N963N260
56553A60382M371L732L057K077J343J220Q61n90k486l660m092m367m344l721l082
56538A50701l024k960k217j449j457j592r42k48p47j866k041j283r36j239j176
56523A27524n59l27p24j033j132j645k398k445j756j404j799k175k119k211k804
56508A02993l367l334k729j793p86j62j51l10k52l86j028j401o65N42R39N26L17
$$ plain form
56491 88953 89463 89836 89618 89076 88808 89081 90002 91622 93470 94796 95761 97550 100781 104630 108079 111140
56475 111140 114170 116889 118970 120925 123540 126843 130297 133599 136705 139465 141724 143498 144844 146051
56461 146051 147978 151389 155731 159419 161718 163498 165798 168440 170451 171129 170408 168987 168250 169081 170600
56446 170600 171126 170523 170301 171203 172333 173182 174757 177692 180668 181953 181425 179999 178103 175873 173897 172544
56430 172544 171146 168831 165678 162290 158933 155764 153124 150856 148092 144387 140378 136811 133827 131578
56416 131578 130373 129631 127934 124949 122118 120738 120657 121588 124104 128157 132087 134550 136236 138374 140716
56401 140716 142478 144123 146464 148822 149769 149159 147986 146796 145627 145020 145625 147076 148424 149410 150429
56386 150429 151693 153250 155234 157336 158757 159471 160612 162796 165155 166945 168850 171477 173885 175126
$$ packed form
56491H8953N10L73k18n42k68K73R21J620J848J326R65J789L231L849L449L061
56475A11140L030K719K081J955K615L303L454L302L106K760K259J774J346J207
56461A46051J927L411M342L688K299J780K300K642K011O78p21j421p37Q31J519
56446A70600N26o03k22R02J130Q49J575K935K976J285n28j426j896k230j976j353
56430A72544j398k315l153l388l357l169k640k268k764l705m009l567k984k249
56416A31578j205p42j697k985k831j380q1R31K516M053L930K463J686K138K342
56401A40716J762J645K341K358R47o10j173j190j169o07O05J451J348R86J019
56386A50429J264J557J984K102J421P14J141K184K359J790J905K627K408J241
$$ plain form
56372 175126 176150 178505 182028 185420 188201 190437 191410 190479 188764 188158 188981 190182 191417 193316 196050
56357 196050 199224 202985 207693 212737 217074 220821 225026 230064 235408 240676 245684 249848 252749 254941
56343 254941 257058 258574 258643 257702 257074 257445 258895 261778 266283 271711 277453 284057 292098 300780 309108
56328 309108 317629 327308 337381 346199 353688 361191 369180 376923 384132 391189 397919 403805 409254 415005
56314 415005 420431 424102 425920 427087 428024 427954 426506 424183 421173 417264 413084 409948 408220 407048 405878
56299 405878 405126 405289 406444 408641 411890 415812 420093 424971 430589 436477 442549 449767 458744 468573 478285
56284 478285 488551 500552 514189 529037 546034 566355 589334 613423 638523 665597 694787
56273 694787 725981 760511 800017 844042 890972 940994 996045 1057262 1124825 1200069 1285316
$$ packed form
56372A75126J024K355L523L392K781K236R73r31j715o06Q23J201J235J899K734
56357A96050L174L761M708N044M337L747M205N038N344N268N008M164K901K192
56343B54941K117J516O9r41o28L71J450K883M505N428N742O604Q041Q682Q328
56328C09108Q521R679J0073Q818P489P503P989P743P209P057O730N886N449N751
56314D15005N426L671J818J167R37p0j448k323l010l909m180l136j728j172j170
56299D05878p52J63J155K197L249L922M281M878N618N888O072P218Q977R829R712
56284D78285J0266J2001J3637J4848J6997K0321K2979K4089K5100K7074K9190
56273F94787L1194L4530L9506M4025M6930N0022N5051O1217O7563P5244Q5247
$$ plain form
56262 1285316 1381462 1487867 1604672 1733098 1873355 2024338 2185535 2357133 2537967 2725188
56252 2725188 2916110 3108515 3298872 3482104 3653357 3808535 3943320 4053657 4137447 4194322
56242 4194322 4224066 4227078 4206036 4164976 4106779 4033398 3948218 3855908 3759875 3661815 3563436
56231 3563436 3466285 3369931 3272664 3174074 3074774 2973839 2869174 2760659 2650330 2539140
56221 2539140 2426053 2310869 2195453 2081482 1969218 1859151 1752760 1650962 1553695 1461545
56211 1461545 1375850 1296841 1223616 1156228 1095746 1041997 993357 949062 909629 874745 842984
56200 842984 813867 787969 764678 742271 720590 701388 685546 672129 660477 650925 643114 635952
56188 635952 629627 625347 622863 620634 618758 619117 622283 626866 632288 639474 648325 657290 666079 676115
$$ packed form
56262A285316R6146J06405J16805J28426J40257J50983J61197J71598J80834J87221
56252B725188J90922J92405J90357J83232J71253J55178J34785J10337Q3790N6875
56242D194322K9744L012k1042m1060n8197p3381q5180r2310r6033r8060r8379
56231C563436r7151r6354r7267r8590r9300j00935j04665j08515j10329j11190
56221B539140j13087j15184j15416j13971j12264j10067j06391j01798r7267r2150
56211A461545q5695p9009p3225o7388o0482n3749m8640m4295l9433l4884l1761
56200H42984k9117k5898k3291k2407k1681j9202j5842j3417j1652r552p811p162
56188F35952o325m280k484k229j876L59L166M583N422P186Q851Q965Q789J0036
$$ plain form
56174 676115 687651 699122 709941 721171 732754 742868 750768 757580 763557 767387 768943 769907 770858
56161 770858 770653 769429 769199 770569 771911 772766 774964 779307 784274 789266 796094 805940 817851 831594
56147 831594 849025 871207 897108 926630 962202 1005980 1058262 1119894 1193345 1280087 1379731
56136 1379731 1492777 1620815 1762379 1911473 2061573 2208055 2345734 2468160 2571967
56127 2571967 2659303 2734241 2799447 2857360 2910655 2959039 2998299 3024447 3036314 3033316 3014720
56116 3014720 2983202 2945310 2905482 2861998 2810283 2746933 2668950 2573360 2460863 2337333 2209551
56105 2209551 2082067 1959443 1847390 1748925 1662465 1585906 1519435 1462493 1411868 1365380 1323995
56094 1323995 1288023 1254930 1223371 1195616 1173329 1154586 1137649 1123867 1114128 1106309 1099090 1094416
$$ packed form
56174F76115J1536J1471J0819J1230J1583J0114P900O812N977L830J556R64R51
56161G70858k05j224k30J370J342Q55K198M343M967M992O828R846J1911J3743
56147H31594J7431K2182K5901K9522L5572M3778N2282O1632P3451Q6742R9644
56136A379731J13046J28038J41564J49094J50100J46482J37679J22426J03807
56127B571967Q7336P4938O5206N7913N3295M8384L9260K6148J1867k998j8596
56116C014720l1518l7892l9828m3484n1715o3350p7983r5590j12497j23530j27782
56105B209551j27484j22624j12053r8465q6460p6559o6471n6942n0625m6488m1385
56094A323995l5972l3093l1559k7755k2287j8743j6937j3782r739p819p219m674
$$ plain form
56082 1094416 1093292 1093142 1092371 1093413 1098020 1103627 1107864 1112589 1119842 1127861 1134934 1143232 1154784 1167320
56068 1167320 1178152 1188658 1201066 1214327 1227000 1240613 1256321 1271798 1285287 1299088 1315366
56057 1315366 1332365 1348471 1365813 1385840 1405689 1423198 1441276 1462937 1486303 1508941 1532747
56046 1532747 1559811 1587884 1614715 1642473 1673063 1703684 1732033 1761199 1794162 1828305 1860771
56035 1860771 1894259 1931736 1970408 2007042 2044331 2085742 2128965 2170962 2214535 2263118 2313899
56024 2313899 2363053 2412941 2467038 2522646 2576036 2629955 2688511 2749472 2809392 2871473 2940407
56013 2940407 3014269 3089482 3168641 3255024 3344602 3432334 3521284 3616613 3715873 3814587 3916037
56002 3916037 4025839 4142231 4261666 4388455 4528396 4678394 4833024 4995618 5171777
$$ packed form
56082A094416j124j50p71J042M607N607M237M725P253Q019P073Q298J1552J2536
56068A167320J0832J0506J2408J3261J2673J3613J5708J5477J3489J3801J6278
56057A315366J6999J6106J7342K0027J9849J7509J8078K1661K3366K2638K3806
56046A532747K7064K8073K6831K7758L0590L0621K8349K9166L2963L4143L2466
56035A860771L3488L7477L8672L6634L7289M1411M3223M1997M3573M8583N0781
56024B313899M9154M9888N4097N5608N3390N3919N8556O0961N9920O2081O8934
56013B940407P3862P5213P9159Q6383Q9578Q7732Q8950R5329R9260R8714J01450
56002C916037J09802J16392J19435J26789J39941J49998J54630J62594J76159
$$ plain form
55993 5171777 5357964 5548245 5746311 5958666 6182204 6411379 6651354 6910637 7187144
55984 7187144 7475507 7781484 8114498 8472817 8851601 9258520 9705301 10191430 10713444
55975 10713444 11282328 11913421 12607703 13363136 14195860 15129104 16170923 17326829 18625563
55966 18625563 20107919 21801315 23734691 25970544 28594794 31687168 35332423 39644725
55958 39644725 44744287 50732216 57744022 66025665 75924425 87849041 102321584 120039671
55950 120039671 141766254 168126772 199554985 236258520 277725224 321758713 363905395
55943 363905395 398163870 418821002 422345709 408413033 379833945 341581394 299250525
55936 299250525 257535645 219399829 186153577 158015411 134615323 115297940 99342863
$$ packed form
55993E171777J86187J90281J98066K12355K23538K29175K39975K59283K76507
55984G187144K88363L05977L33014L58319L78784M06919M46781M86129N22014
55975A0713444N68884O31093O94282P55433Q32724R33244J041819J155906J298734
55966A8625563J482356J693396J933376K235853K624250L092374L645255M312302
55958C9644725N099562N987929P011806Q281643R898760J1924616J4472543J7718087
55950A20039671K1726583K6360518L1428213L6703535M1466704M4033489M2146682
55943C63905395L4258475K0657132L524707j3932676k8579088l8252551m2330869
55936B99250525m1714880l8135816l3246252k8138166k3400088j9317383j5955077
$$ plain form
55929 99342863 86120854 75121654 65908335 58113329 51467116 45778602 40883172 36634558
55921 36634558 32929565 29698682 26871589 24377048 22168311 20218898 18495717 16959526
55913 16959526 15586567 14365505 13275731 12289740 11393730 10585726 9856005 9187927 8575213
55904 8575213 8020294 7517480 7054211 6626682 6238320 5884822 5555725 5248921 4969166
55895 4969166 4714054 4475326 4252290 4050337 3867564 3695819 3533711 3386067 3251619
55886 3251619 3123354 3000235 2886935 2782670 2681472 2582983 2492256 2409322 2329257 2252096
55876 2252096 2182713 2121179 2062774 2007075 1957724 1913582 1869223 1823932 1781518 1741682 1700172
55865 1700172 1657081 1616530 1578498 1539296 1499855 1465253 1436198 1409008 1383901 1365257 1353535
$$ packed form
55929I9342863j3222009j0999200r213319p795006o646213n688514m895430m248614
55921C6634558l704993l230883k827093k494541k208737j949413j723181j536191
55913A6959526j372959j221062j089774r85991q96010q08004p29721o68078o12714
55904H575213n54919n02814m63269m27529l88362l53498l29097l06804k79755
55895D969166k55112k38728k23036k01953j82773j71745j62108j47644j34448
55886C251619j28265j23119j13300j04265j01198r8489r0727q2934q0065p7161
55876B252096o9383o1534n8405n5699m9351m4142m4359m5291m2414l9836m1510
55865A700172m3091m0551l8032l9202l9441l4602k9055k7190k5107j8644j1722
$$ plain form
55854 1353535 1344620 1337452 1334793 1336070 1336511 1333636 1327816 1316662 1296244 1268319 1239503 1212752 1185964
55841 1185964 1158854 1134249 1112075 1088730 1063231 1038033 1013311 986414 957316 928818 901170
55830 901170 872297 843412 818441 797714 778089 759271 744007 731861 719043 704842 692214
55819 692214 681601 670176 657797 647702 640549 633659 626880 623323 623374 623817 623938 626654 632367 637429
55805 637429 640240 643342 647829 650926 650929 649587 647845 643892 637150 629665 621934 611679 598356 584588
55791 584588 571711 558104 543350 529788 518379 507082 494877 483590 474366 466056 458328 452655
55779 452655 449107 445876 442891 442022 442656 440970 434672 424770 411956 395521 376909 360013 346376
55766 346376 333855 321292 310576 302813 296431 290506 286111 282957 278529 272083 265788 260556 254571
$$ packed form
55854A353535q915p168k659J277M41k875n820j1154k0418k7925k8816k6751k6788
55841A185964k7110k4605k2174k3345k5499k5198k4722k6897k9098k8498k7648
55830I01170k8873k8885k4971k0727j9625j8818j5264j2146j2818j4201j2628
55819F92214j0613j1425j2379j0095p153o890o779l557N1M43J21K716N713N062
55805F37429K811L102M487L097Lj342j742l953o742p485p731j0255j3323j3768
55791E84588j2877j3607j4754j3562j1409j1297j2205j1287r224q310p728n673
55779D52655l548l231k985q69O34j686o298r902j2814j6435j8612j6896j3637
55766C46376j2521j2563j0716p763o382n925m395l154m428o446o295n232n985
$$ plain form
55753 254571 247442 241908 239630 238883 238086 238102 239371 240320 240268 240506 240899 239043 234484 230211 228134 226595
55737 226595 224107 221948 221025 219756 217362 215944 216928 218495 218836 218932 219803 219858 217481 213688 209960 205876
55721 205876 200933 196278 192597 188678 184007 180324 178732 177770 176206 175204 175728 176472 176524 177598 181359
55706 181359 186779 192374 198846 207279 216689 225515 233605 240788 245556 247247 247718 248798 249838 249619 248768
55691 248768 248292 247490 245329 242334 239355 236051 232262 229187 227525 226111 224082 222749 223675 226443 229875
55676 229875 233847 238403 242684 246226 249722 253267 255569 256110 256236 256821 256922 256047 255611 256577 257750 257996
55660 257996 258020 258382 258017 256572 255942 257444 259477 260034 259595 259417 258913 257016 254328 251575 247456 240374
55644 240374 230951 220778 210158 199174 189383 181985 175520 167755 158907 150880 144289 138406 133180
$$ packed form
55753B54571p129n534k278p47p97J6J269R49n2K38L93j856m559m273k077j539
55737B26595k488k159r23j269k394j418R84J567L41R6Q71N5k377l793l728m084
55721B05876m943m655l681l919m671l683j592r62j564j002N24P44N2J074L761
55706A81359N420N595O472Q433R410Q826Q090P183M768J691M71J080J040k19q51
55691B48768m76q02k161k995k979l304l789l075j662j414k029j333R26K768L432
55676B29875L972M556M281L542L496L545K302N41J26N85J01q75m36R66J173K46
55660B57996K4L62l65j445o30J502K033N57m39j78n04j897k688k753m119p082
55644B40374r423j0173j0620j0984r791p398o465p765q848q027o591n883n226
$$ plain form
55631 133180 129210 126219 123362 120455 117558 114118 109928 105964 102979 100337 97470 95166 93994 92857
55617 92857 90728 88512 87582 87661 87748 87844 88136 87790 86253 84537 83552 82476 80441 78494 78069 78753 79361 79875
55599 79875 80437 79845 77235 74166 72783 72810 72437 71328 70633 70726 70988 71296 71813 71868 70796 69414 68999 69390
55581 69390 69591 69504 69459 68876 67145 65155 64202 63962 63211 61933 61166 61299 61999 63105 64203 64126 62452 60650
55563 60650 60246 60730 60919 61291 63034 65659 67631 68777 70040 71338 71701 71236 71032 71361 71634 71915 72764
55546 72764 73790 74013 73594 73722 74926 76787 79060 81754 84352 86211 87518 88807 89984 90941 92465
55531 92465 95327 99060 102885 107130 112369 117841 122142 124864 126260 125986 123640 119882 115598 110651 104838
55516 104838 99238 94976 91390 87032 81820 76629 71569 66430 62065 59379 57483 54715 51056 47734
$$ packed form
55631A33180l970k991k857k907k897l440m190l964k985k642k867k304j172j137
55617I2857k129k216r30P9Q7R6K92l46j537j716r85j076k035j947m25O84O08N14
55599G9875N62n92k610l069j383K7l73j109o95R3K62L08N17N5j072j382m15L91
55581F9390K01q7m5n83j731j990r53k40p51j278p67J33P00J106J098p7j674j802
55563F0650m04M84J89L72J743K625J972J146J263J298L63m65k04L29K73K81Q49
55546G2764J026K23m19J28J204J861K273K694K598J859J307J289J177R57J524
55531I2465K862L733L825M245N239N472M301K722J396k74k346l758m284m947n813
55516A04838n600m262l586m358n212n191n060n139m365k686j896k768l659l322
$$ plain form
55502 47734 44943 41924 38871 36757 35454 33903 32000 30509 29313 27586 25562 24282 23661 22615 21031
55487 21031 19793 18825 17063 14559 12817 12648 13298 14086 15401 17599 20171 22413 23914 24273 23376 22028
55471 22028 21239 20860 19962 18400 16918 15915 15317 15477 16913 19193 21216 22446 22853 22059 19862 17280
55455 17280 15693 15127 14659 14131 14027 14018 13290 12222 12098 13116 14207 14859 15613 16539 16657 15301 13042 10982
55437 10982 9962 10352 11755 13073 13665 14070 14802 15263 15005 15116 16777 19179 20653 21277 22420 24104
55421 24104 24885 24266 23252 22461 21537 20561 20240 20478 20399 19996 20208 21237 22331 23317 24730 26339 27242 27560
55403 27560 28389 29877 30998 31383 31692 31936 31164 29143 26748 24413 21856 19548 18630 18926 18823 17722
55387 17722 16904 17322 18172 18373 17925 17010 15171 12320 9433 7430 6250 5552 5334 5490 5715 6171 7221
$$ packed form
55502D7734k791l019l053k114j303j551j903j491j196j727k024j280o21j046j584
55487B1031j238r68j762k504j742j69O50P88J315K198K572K242J501L59q97j348
55471B2028p89l79q98j562j482j003n98J60J436K280K023J230M07p94k197k582
55455A7280j587n66m68n28j04rp28j068j24J018J091O52P54R26J18j356k259k060
55437A0982j020L90J403J318N92M05P32M61k58J11J661K402J474O24J143J684
55421B4104P81o19j014p91r24r76l21K38p9m03K12J029J094R86J413J609R03L18
55403B7560Q29J488J121L85L09K44p72k021k395k335k557k308r18K96j03j101
55387A7722q18M18Q50K01m48r15j839k851k887k003j180o98k18J56K25M56J050
$$ plain form
55370 7221 8432 9028 9438 10988 13893 16920 19237 21108 22547 22956 22496 22216 22375 22167 21588 21866 23361
55353 23361 24679 24707 24025 23458 22656 21108 19317 18037 17328 17059 17318 17705 17351 16252 15446 15326 14998 13922
55335 13922 12927 12859 13373 13737 13724 13146 11717 10016 9366 10087 11042 11434 11780 12454 12700 11927 10699 9634
55317 9634 8569 7595 7589 8733 9791 9881 9847 10797 12365 13464 13853 13926 13805 13564 13552 13734 13577 13230 13802 15674
55297 15674 17657 18599 18763 18796 18584 18128 18319 19628 21069 21690 22076 23146 24359 24518 23688 22941 22675 22356
55279 22356 21537 20106 17948 15353 13321 12594 12761 13073 13617 14843 16490 17815 18482 18527 17949 17097 16854
55262 16854 17645 18686 18918 18224 17149 16058 15186 14897 15168 15362 15082 14661 14324 13643 12433 11395 11167
55245 11167 11485 11957 12809 14117 15151 15340 15152 15244 15488 15663 16275 17750 19538 20941 22143 23502 24512
$$ packed form
55370G221J211N96M10J550K905L027K317J871J439M09m60k80J59k08n79K78J495
55353B3361J318K8o82n67q02j548j791j280p09k69K59L87l54j099q06j20l28j076
55335A3922r95o8N14L64j3n78j429j701o50P21R55L92L46O74K46p73j228j065
55317I634j065r74oJ144J058R0l4R50J568J099L89P3j21k41j2J82j57l47N72J872
55297A5674J983R42J64L3k12m56J91J309J441O21L86J070J213J59q30p47k66l19
55279B2356q19j431k158k595k032p27J67L12N44J226J647J325O67M5n78q52k43
55262A6854P91J041K32o94j075j091q72k89K71J94k80m21l37o81j210j038k28
55245A1167L18M72Q52J308J034J89j88R2K44J75O12J475J788J403J202J359J010
$$ plain form
55228 24512 24450 23499 22349 21238 20175 19472 19204 18827 18207 18307 19905 22305 24291 25667 26829 27563 27443
55211 27443 26897 26676 26662 26253 25561 25206 25307 25605 26160 26915 27091 26118 24834 24574 25333 25896 25581 24805 24081
55192 24081 23487 23106 23050 23014 22606 22128 22310 23277 24372 24978 25052 24948 25135 25846 26712 27140 27312 28156 29884
55173 29884 31329 31322 30000 28105 25920 23784 22731 23395 24821 25531 25335 25056 24988 24793 24535 24636 25000 25252
55155 25252 25552 26143 26419 25613 24176 23281 23069 22589 21498 20569 20355 20407 20165 19755 19524 19472 19403 19170 18596
55136 18596 17659 16860 16954 18228 20293 22478 24165 25039 25406 25955 26902 27760 28270 28915 30025 31112 31762
55119 31762 32462 33663 34747 34939 34636 34668 34694 33637 31508 29567 28714 28781 29388 30405 31512 32216 32501 32723
55101 32723 32914 32970 33357 34692 36617 38028 38489 38600 38977 39722 40896 42578 44304 45308 45541 45683 46051
$$ packed form
55228B4512o2r51j150j111j063p03k68l77o20J00J598K400J986J376J162P34j20
55211B7443n46k21j4m09o92l55J01K98N55P55J76r73j284k60P59N63l15p76p24
55192B4081n94l81n6l6m08m78J82R67J095O06P4j04J87P11Q66M28J72Q44J728
55173B9884J445pj322j895k185k136j053O64J426P10j96k79o8j95k58J01L64K52
55155B5252L00N91K76q06j437q95k12m80j091r29k14N2k42m10k31n2o9k33n74
55136A8596r37p99R4J274K065K185J687Q74L67N49R47Q58N10O45J110J087O50
55119C1762P00J201J084J92l03L2K6j057k129j941q53O7O07J017J107P04K85K22
55101C2723J91N6L87J335J925J411M61J11L77P45J174J682J726J004K33J42L68
$$ plain form
55084 46051 46280 46301 46750 48023 49625 50863 51655 52275 52753 52996 53205 53769 54742 55596 55633 54739 53699 53430
55066 53430 53850 53922 53039 51858 51464 52148 53446 54812 55785 55982 55511 54978 54631 54027 53014 52309 52392 52535
55048 52535 51834 50546 49421 48292 46581 44781 44099 44743 45764 46539 47178 47455 46670 45005 43893 44417
55032 44417 46057 47521 48206 48348 48252 47968 47646 47738 48653 50190 51456 51640 50915 50184 49913 49709 49187 48564
55014 48564 48056 47454 46749 46487 46940 47626 48176 48855 49607 49568 48448 47446 47662 48359 48002 46387 44499 42901
54996 42901 41600 41004 41529 42534 43027 43238 44193 45968 47684 49030 50403 51633 51999 51583 51301 51562 52113
54979 52113 53164 55253 57916 59907 60985 62192 64110 66100 67624 69030 70599 71960 72977 74288
54965 74288 76531 79737 83675 88017 92109 95582 99268 104534 111709 120132 129592 140399 152167 164038
$$ packed form
55084D6051K29K1M49J273J602J238P92O20M78K43K09N64R73Q54L7q94j040k69
55066E3430M20P2q83j181l94O84J298J366R73J97m71n33l47o04j013p05Q3J43
55048E2535p01j288j125j129j711j800o82O44J021P75O39K77p85j665j112N24
55032D4417J640J464O85J42r6k84l22R2R15J537J266J84p25p31k71k04n22o23
55014D8564n08o02p05k62M53O86N50O79P52l9j120j002K16O97l57j615j888j598
54996D2901j301n96N25J005M93K11R55J775J716J346J373J230L66m16k82K61N51
54979E2113J051K089K663J991J078J207J918J990J524J406J569J361J017J311
54965G4288K243L206L938M342M092L473L686N266P175Q423R460J0807J1768J1871
$$ plain form
54951 164038 176325 190328 206059 221503 234615 244713 251483 254121 252190 246082 236044 222089
54939 222089 205542 189172 174763 161708 148927 136885 126624 117978 110141 103130 97360 92489
54927 92489 87961 84175 81849 80608 79423 78177 77664 78178 79202 80552 82895 86891 92405 98741 105278
54912 105278 111927 119300 128386 139720 152925 167174 181799 196190 209473 220654 228876 233330
54900 233330 233297 228630 220034 208663 195589 181701 167687 153962 140906 129193 119404 111328 104206
54887 104206 97706 92056 87168 82489 77950 74287 71977 70514 69176 67885 66866 65995 64966 63688
54873 63688 62156 60378 58680 57542 56790 55508 53195 50485 48340 47007 46189 45732 45618 45599 45311 44626
54857 44626 43678 42791 42426 42715 42967 42225 40515 38905 38103 37646 36830 35750 34904 34357 33913 33703 34065 35089
$$ packed form
54951A64038J2287J4003J5731J5444J3112J0098O770K638j931o108j0038j3955
54939B22089j6547j6370j4409j3055j2781j2042j0261q646p837p011n770m871
54927I2489m528l786k326j241j185j246n13N14J024J350K343L996N514O336O537
54912A05278O649P373R086J1334J3205J4249J4625J4391J3283J1181Q222M454
54900B33330l3m667q596j1371j3074j3888j4014j3725j3056j1713r789q076p122
54887A04206o500n650m888m679m539l663k310j463j338j291j019q71j029j278
54873F3688j532j778j698j138p52j282k313k710k145j333q18m57j14j9k88o85
54857D4626r48q87l65K89K52p42j710j610q02m57q16j080q46n47m44k10L62J024
$$ plain form
54839 35089 36722 38994 41744 44327 46030 46678 46630 46312 45951 45641 45539 45985 47271 49136 50828 51985
54823 51985 53099 54580 55875 56269 56225 56844 58160 59058 58996 58730 59120 60173 61612 63447 65647 68038 70802
54806 70802 74351 78475 82531 86706 92188 99765 109155 119986 132488 146783 162402 178904 196089
54793 196089 213173 228644 241293 250515 255318 254381 247812 237787 226603 214905 202521 190028
54781 190028 178486 168293 159201 151042 143782 137413 132311 129042 127324 125888 123920 121884 120505 119827
54767 119827 119839 120961 123119 125379 127442 130616 136293 144233 153330 163344 174799 187879 202538 219183
54753 219183 238076 258426 278976 299071 318195 334917 347401 354708 356755 353314 344040 329362
54741 329362 310653 289677 268330 248248 229838 212202 194777 178538 164724 153080 142432
$$ packed form
54839C5089J633K272K750K583J703O48m8l18l61l10j02M46J286J865J692J157
54823E1985J114J481J295L94m4O19J316Q98o2k66L90J053J439J835K200K391K764
54806G0802L549M124M056M175N482P577R390J0831J2502J4295J5619J6502J7185
54793A96089J7084J5471J2649R222M803r37o569j0025j1184j1698j2384j2493
54781A90028j1542j0193r092q159p260o369n102l269j718j436j968k036j379o78
54767A19827J2J122K158K260K063L174N677P940R097J0014J1455J3080J4659J6645
54753B19183J8893K0350K0550K0095J9124J6722J2484P307K047l441r274j4678
54741C29362j8709k0976k1347k0082j8410j7636j7425j6239j3814j1644j0648
$$ plain form
54730 142432 132496 123994 117300 112113 108213 105446 103070 100170 96710 93318 90170 86952 83798 81390
54716 81390 80131 79877 80357 81122 81345 80528 79276 78611 78653 78703 78422 78081 77831 77520 77220 77186 77438 78018 79391
54697 79391 81827 84600 86594 87507 87744 87419 86386 85067 84246 84062 84039 84036 84372 85085 85925 87007 88625 90485
54679 90485 91949 92971 93951 94764 94950 94843 95498 97319 99744 102433 105800 110033 114510 118691 122863 127541
54663 127541 132716 138133 143769 149636 155561 161506 167691 174060 179938 184595 187900 190229 192012 193632
54649 193632 195537 198221 202172 207935 216046 226775 239833 254319 268997 282912 295851 308001
54637 308001 319025 327730 332685 332884 327855 317873 304307 289037 273020 255989 237995 220446 204891
54624 204891 191364 178917 167360 157534 150027 144508 140307 136894 133847 131010 128744 127478 127081 127081
$$ packed form
54730A42432r936q502o694n187l900k767k376k900l460l392l148l218l154k408
54716H1390j259k54M80P65K23q17j252o65M2N0k81l41k50l11l00l4K52N80J373
54697G9391K436K773J994R13K37l25j033j319q21j84k3lL36P13Q40J082J618J860
54679I0485J464J022R80Q13J86j07O55J821K425K689L367M233M477M181M172M678
54663A27541N175N417N636N867N925N945O185O369N878M657L305K329J783J620
54649A93632J905K684L951N763Q111J0729J3058J4486J4678J3915J2939J2150
54637C08001J1024Q705M955J99n029r982j3566j5270j6017j7031j7994j7549j5555
54624B04891j3527j2447j1557r826p507n519m201l413l047k837k266j266l97%
$$ plain form
54610 127081 127329 127999 129150 130821 133230 136355 139551 142096 143840 144902 145215 144975 144933 145390 145257 143054
54594 143054 138625 133152 127743 122786 118289 113891 108785 102633 96523 92125 89928 88995 88252 87131 85206
54579 85206 82292 79061 76662 75529 75174 75071 75064 74923 74350 73482 72724 72087 71298 70434 69789 69259 68588 68033
54561 68033 67997 68187 68023 67709 67911 68495 68569 67842 66974 66455 66127 65986 66586 68310 70875 73767 76535 78607
54543 78607 79592 79963 80898 83301 87322 92635 98515 103895 108177 111975 116377 121592 127120 132946 139547
54528 139547 146688 153233 158289 161759 163663 163695 161594 157306 150831 142571 133703 125486 118315 112042 106791
54513 106791 102545 98438 93646 88740 84950 82352 80018 77705 75969 74766 73525 72597 72959 74291 74982
54498 74982 74439 73822 73987 74318 74234 74274 74815 75085 74400 73238 72221 71131 69861 69281 70131 71877 73567 75081
$$ packed form
54610A27081K48O70J151J671K409L125L196K545J744J062L13k40m2M57j33k203
54594A43054m429n473n409m957m497m398n106o152o110m398k197r33p43j121j925
54579H5206k914l231k399j133l55j03pj41n73q68p58o37p89q64o45n30o71n55
54561F8033l6J90j64l14K02N84P4p27q68n19l28j41O00J724K565K892K768K072
54543G8607R85L71R35K403M021N313N880N380M282L798M402N215N528N826O601
54528A39547P141O545N056L470J904L2k101m288o475q260q868q217p171o273n251
54513A06791m246m107m792m906l790k598k334k313j736j203j241r28L62J332O91
54498G4982n43o17J65L31q4M0N41K70o85j162j017j090j270n80Q50J746J690J514
$$ plain form
54480 75081 76822 78947 81554 84751 87836 89367 88928 87984 88137 89390 90962 92843 95357 97900 99415
54465 99415 99828 99910 99919 99305 97711 95521 93382 91677 90439 89523 88898 88781 89116 89058 87717 85490 83722 82862
54447 82862 81966 80437 79116 78958 79563 79847 79465 78751 77906 76987 76196 75561 74871 74362 74677 75648 76023 75132
54429 75132 73950 73639 73864 73601 72871 72563 72967 73601 74207 75012 76157 77584 79219 80690 81304 81003 80927 82245
54411 82245 84732 87181 88804 89576 89683 89529 90037 92111 95842 100673 106032 111366 116071 120085 124130
54396 124130 128744 133447 137493 141020 144748 148915 153160 157039 160006 161399 161174 160258 159452 158392 156321
54381 156321 153390 150343 147363 144185 141044 138459 136220 133538 130252 127069 124549 122499 120435 118063
54367 118063 115323 112439 109888 107956 106403 104871 103350 101913 100364 98625 97035 95822 94745 93756
$$ packed form
54480G5081J741K125K607L197L085J531m39r44J53J253J572J881K514K543J515
54465I9415M13Q2Ro14j594k190k139j705j238r16o25j17L35n8j341k227j768q60
54447H2862q96j529j321j58O05K84l82p14q45r19p91o35o90n09L15R71L75q91
54429G5132j182l11K25k63p30l08M04O34O06Q05J145J427J635J471O14l01p6J318
54411H2245K487K449J623P72J07j54N08K074L731M831N359N334M705M014M045
54396A24130M614M703M046L527L728M167M245L879K967J393k25r16q06j060k071
54381A56321k931l047k980l178l141k585k239k682l286l183k520k050k064k372
54367A18063k740k884k551j932j553j532j521j437j549j739j590j213j077r89
$$ plain form
54353 93756 93462 94284 95672 96868 98010 99717 102015 104527 107319 110653 114169 117284 120254 123969 128749
54338 128749 134071 139441 144732 149728 154053 157591 160385 162180 162638 161933 160535 158554 155791 152265 148094
54323 148094 143015 136693 129460 122212 115688 110245 106081 103087 100682 98312 95942 93643 91109 88197
54309 88197 85484 83519 81802 79339 76030 72742 70122 68080 66352 64820 63237 61303 59102 57034
54295 57034 55361 54143 53437 53166 53083 53207 53896 55051 55853 55909 56055 57240 59070 60329 60518 60018 59214 58388
54277 58388 58133 58821 59915 60711 61434 62592 63659 63658 62837 62482 63063 63787 64088 64351 64903 65438 65779 66257 66995
54258 66995 67671 68253 69106 70098 70436 69746 68614 67772 67393 67331 67372 67110 66312 65524 65574 66383 67091 67474 68234 69633
54238 69633 70819 71038 70723 70815 71561 72451 72880 72526 71510 70387 69594 68851 67676 66477 66269 67151 67852 67173
$$ packed form
54353I3756k94Q22J388J196J142J707K298K512K792L334L516L115K970L715M780
54338A28749N322N370N291M996M325L538K794J795M58p05j398j981k763l526m171
54323A48094n079o322p233p248o524n443m164k994k405k370k370k299k534k912
54309H8197k713j965j717k463l309l288k620k042j728j532j583j934k201k068
54295E7034j673j218p06k71q3J24O89J155Q02N6J46J185J830J259J89n00q04q26
54277E8388k55O88J094P96P23J158J067jq21l55N81P24L01K63N52N35L41M78P38
54258F6995O76N82Q53R92L38o90j132q42l79o2M1k62p98p88N0Q09P08L83P60J399
54238F9633J186K19l15R2P46Q90M29l54j016j123p93p43j175j199k08Q82P01o79
$$ plain form
54220 67173 65208 62817 60647 59080 58420 58549 58832 58823 58741 58941 59369 59836 60363 60926 61247 61192 61007 60940 60940 60959
54200 60959 61140 61460 61599 61423 61273 61482 61846 61800 60950 59368 57531 56054 55301 55205 55473 55733 55465 54328
54182 54328 52912 52535 53705 55293 55924 55648 55370 55243 54831 54437 54873 55948 56582 56494 56438 56598 56220 55282
54164 55282 55047 56204 57655 58062 57590 57200 57051 56618 55825 55121 54794 54874 55343 55886 55890 55313 55049 55866 57335
54145 57335 58412 58683 58496 58232 58112 58436 59411 60810 62127 62930 62913 61961 60517 59467 59277 59484 59301 58414
54127 58414 57000 55399 54045 53293 53035 52885 52906 53631 55067 56279 56366 55392 53966 52414 50809 49402 48484
54110 48484 48070 48083 48544 49305 49970 50411 51053 52281 53889 55343 56276 56580 56384 56131 56242 56529 56417 55873
54092 55873 55474 55379 54926 53656 52027 50718 49836 49260 49127 49425 49610 49201 48343 47358 46296 45387 45289 46254
$$ packed form
54220F7173j965k391k170j567o60J29K83rq2K00M28M67N27N63L21n5j85o7%J9
54200F0959J81L20J39j76j50K09L64m6q50j582j837j477p53r6K68K60k68j137
54182E4328j416l77J170J588O31k76k78j27m12l94M36J075O34q8n6J60l78r38
54164E5282k35J157J451M07m72l90j49m33p93p04l27Q0M69N43Mn77k64Q17J469
54145E7335J077K71j87k64j20L24R75J399J317Q03j7r52j444j050j90K07j83q87
54127E8414j414j601j354p52k58j50K1P25J436J212Q7r74j426j552j605j407r18
54110D8484m14J3M61P61O65M41O42J228J608J454R33L04j96k53J11K87j12n44
54092E5873l99r5m53j270j629j309q82n76j33K98J85m09q58r85j062r09r8R65
$$ plain form
54074 46254 47560 48388 48837 49435 50178 50783 51518 52914 54837 56571 57736 58566 59400 60414 61772 63432
54058 63432 64873 65504 65375 65154 65384 65989 66435 66178 65179 64176 64222 65685 67894 69962 71669 73364 75342
54041 75342 77599 79933 82064 83880 85659 87719 89905 91887 94004 97111 101519 106781 112627 119132
54027 119132 125703 131079 135043 139167 144917 151793 158292 163984 169498 175001 179950 184220 188301 192304
54013 192304 195699 198210 200224 202104 203640 204294 203647 201637 198785 196033 193884 191782 188718 184319 179015
53998 179015 173413 167970 163031 158640 154469 150326 146514 143299 140367 137335 134446 132228 130707 129474
53984 129474 128257 126906 125201 123293 121996 121864 122211 121777 120230 118315 116684 115345 114172 113221 112465
53969 112465 111838 111583 111979 112765 113403 113920 114939 116826 119246 121569 123330 124401 125180 126421 128422 130568
$$ packed form
54074D6254J306Q28M49N98P43O05P35J396J923J734J165Q30Q34J014J358J660
54058F3432J441O31j29k21K30O05M46k57r99j003M6J463K209K068J707J695J978
54041G5342K257K334K131J816J779K060K186J982K117L107M408N262N846O505
54027A19132O571N376L964M124N750O876O499N692N514N503M949M270M081M003
54013A92304L395K511K014J880J536O54o47k010k852k752k149k102l064m399n304
53998A79015n602n443m939m391m171m143l812l215k932l032k889k218j521j233
53984A29474j217j351j705j908j297j32L47m34j547j915j631j339j173r51p56
53969A12465o27k55L96P86O38N17J019J887K420K323J761J071P79J241K001K146
$$ plain form
53953 130568 132185 133582 135606 138390 141277 143771 145811 147241 147963 148638 150307 153065 155897 158202 160759
53938 160759 164792 170538 177083 183200 188011 191214 193014 193734 193387 191782 188982 185357 181277 177151 173680
53923 173680 171538 170728 170706 171217 172615 175235 178869 183005 187349 191988 197195 203039 209080 214672 219814
53908 219814 225327 231773 238583 244825 250499 256316 262355 267760 271754 274220 275239 274882 273622 272274
53894 272274 271233 270238 268979 267364 265107 261781 257551 253224 249269 245335 240966 236276 231562 226751
53880 226751 221521 215628 208923 201540 194240 188011 182999 178324 173256 168101 163546 159732 156427 153695
53866 153695 151748 150306 148655 146311 143328 140034 136742 133578 130396 126955 123359 120112 117559 115503
53852 115503 113551 111615 109806 108058 106188 104266 102673 101792 101658 101826 101584 100506 98860 97232 95731
$$ packed form
53953A30568J617J397K024K784K887K494K040J430P22O75J669K758K832K305K557
53938A60759M033N746O545O117M811L203J800P20l47j605k800l625m080m126l471
53923A73680k142q10k2N11J398K620L634M136M344M639N207N844O041N592N142
53908B19814N513O446O810O242N674N817O039N405L994K466J019l57j260j348
53894B72274j041r95j259j615k257l326m230m327l955l934m369m690m714m811
53880B26751n230n893o705p383p300o229n012m675n068n155m555l814l305k732
53866A53695j947j442j651k344k983l294l292l164l182l441l596l247k553k056
53852A15503j952j936j809j748j870j922j593q81j34J68k42j078j646j628j501
$$ plain form
53837 95731 93949 91829 90064 89266 89097 88781 88311 88581 90230 92811 95321 97213 98558 99468 99827 99734 99827
53820 99827 100795 102577 104309 105142 104947 104168 103255 102399 101676 101181 101030 101355 102295 103924 106262 109291 112819
53803 112819 116317 119202 121415 123472 125872 128706 131989 135960 140719 145813 150594 154876 159014 163401
53789 163401 168049 172535 176218 178793 180770 183123 186230 189525 192363 194756 196850 198213 198307 197409 196435
53774 196435 195926 195665 195190 194253 192888 191380 190056 188789 186953 184215 181035 178036 175248 172415 169590
53759 169590 166823 163712 160014 156362 153571 151526 149601 147909 147160 147385 147780 147808 147578 147096 146078 144720
53743 144720 143736 143442 143566 144103 145470 147548 149476 150795 152056 153817 155723 156981 157173 156265 154435 152301
53727 152301 150750 150063 149664 149001 148198 147566 147017 146340 145596 144923 144418 144325 144795 145298 145017 144106 143784 144758 146394
$$ packed form
53837I5731j782k120j765p98j69l16m70K70J649K581K510J892J345R10L59r3R3
53820I9827R68J782J732Q33j95p79r13q56p23m95j51L25R40J629K338L029L528
53803A12819L498K885K213K057K400K834L283L971M759N094M781M282M138M387
53789A63401M648M486L683K575J977K353L107L295K838K393K094J363R4q98r74
53774A96435n09k61m75r37j365j508j324j267j836k738l180k999k788k833k825
53759A69590k767l111l698l652k791k045j925j692p49K25L95K8k30m82j018j358
53743A44720r84k94J24N37J367K078J928J319J261J761J906J258J92r08j830k134
53727A52301j551o87l99o63q03o32n49o77p44o73n05r3M70N03k81r11l22R74J636
$$ plain form
53708 146394 147968 149856 152676 155915 158400 159803 160846 162197 163925 165949 168334 171139 174399 178218
53694 178218 182549 187005 191278 195599 200356 205422 210202 214292 217736 220773 223615 226494 229689 233519
53680 233519 238302 244049 250140 255661 260249 264329 268398 272400 275914 278518 279834 279752 278827 277988 277584
53665 277584 277226 276752 276590 276771 276431 274998 273275 272437 272371 271930 270541 268654 266673 264394 261728 259201
53649 259201 257381 256210 255200 254001 252634 251363 250418 249680 248714 247296 245831 244960 244785 244725 244103 242684
53633 242684 240747 238894 237745 237620 238405 239702 240989 241759 241946 242310 243879 246747 249823 252084 253674
53618 253674 255423 257765 260646 264099 268206 272640 276855 280705 284432 288132 291746 295498 299800 304657
53604 304657 309623 314446 319426 325050 331545 338784 346291 353352 359427 364640 369658 375100 381212 388020
$$ packed form
53708A46394J574J888K820L239K485J403J043J351J728K024K385K805L260L819
53694A78218M331M456M273M321M757N066M780M090L444L037K842K879L195L830
53680B33519M783N747O091N521M588M080M069M002L514K604J316q2r25q39m04
53665B77584l58m74j62J81l40j433j723q38o6m41j389j887j981k279k666k527
53649B59201j820j171j010j199j367j271r45p38r66j418j465q71j75o0o22j419
53633B42684j937j853j149j25P85J297J287P70J87L64J569K868L076K261J590
53618B53674J749K342K881L453M107M434M215L850L727L700L614L752M302M857
53604C04657M966M823M980N624O495P239P507P061O075N213N018N442O112O808
$$ plain form
53590 388020 395431 403115 410527 417286 423539 429908 437003 444864 452833 460159 466685 472773 478568 483768
53576 483768 488229 492392 496787 501381 505656 509131 511630 513351 514848 516617 518504 519908 520767 521784
53562 521784 523429 525283 526835 528251 529683 530442 529801 528289 527210 526941 526648 525698 524449 523457 522796 522488
53546 522488 522845 523837 524655 524421 523103 521378 519908 519005 518686 518678 518552 518221 518226 519260 521414 524025 526227 527632
53528 527632 528626 530132 532923 537061 542055 547607 554021 561771 570814 580533 590368 600406 611268 623439
53514 623439 636751 650600 664603 678967 694210 710700 728443 747138 766418 786281 807346
53503 807346 830389 855459 881749 908501 935747 963958 993289 1023557 1054677 1086691 1119438
53492 1119438 1152652 1186358 1220847 1256196 1292057 1327947 1363619 1399159 1434878 1471070 1507778
$$ packed form
53590C88020P411P684P412O759O253O369P095P861P969P326O526O088N795N200
53576D83768M461M163M395M594M275L475K499J721J497J769J887J404Q59J017
53562E21784J645J854J552J416J432P59o41j512j079k69k93r50j249r92o61l08
53546E22488L57R92Q18k34j318j725j470r03l19qj26l31NJ034K154K611K202J405
53528E27632R94J506K791M138M994N552O414P750R043R719R835J0038J0862J2171
53514F23439J3312J3849J4003J4364J5243J6490J7743J8695J9280J9863K1065
53503H07346K3043K5070K6290K6752K7246K8211K9331L0268L1120L2014L2747
53492A119438L3214L3706L4489L5349L5861L5890L5672L5540L5719L6192L6708
$$ plain form
53481 1507778 1544819 1582030 1619233 1655991 1691841 1726987 1762337 1798443 1834652 1869661 1902637
53470 1902637 1933494 1962416 1989645 2015540 2040329 2063823 2085719 2105971 2124540 2141079 2155438
53459 2155438 2168251 2180417 2192073 2202698 2212070 2220314 2226962 2230785 2230889 2227358 2220483 2210059 2195994
53446 2195994 2179126 2160718 2141194 2119860 2095867 2069073 2040036 2009486 1977975 1945691 1912376
53435 1912376 1877538 1841006 1803353 1765557 1728150 1690863 1653253 1615454 1578079 1541655 1506716
53424 1506716 1474226 1445051 1418754 1393655 1368642 1344348 1322044 1302012 1283834 1267813 1254955
53413 1254955 1245509 1238584 1233539 1231042 1232228 1237300 1245379 1255494 1267380 1281459 1298299 1318082 1340490
53400 1340490 1365118 1391858 1420755 1451624 1484100 1518059 1553786 1591790 1632579 1676343 1722567
$$ packed form
53481A507778L7041L7211L7203L6758L5850L5146L5350L6106L6209L5009L2976
53470A902637L0857K8922K7229K5895K4789K3494K1896K0252J8569J6539J4359
53459B155438J2813J2166J1656J0625R372Q244O648L823J04l531o875j0424j4065
53446B195994j6868j8408j9524k1334k3993k6794k9037l0550l1511l2284l3315
53435A912376l4838l6532l7653l7796l7407l7287l7610l7799l7375l6424l4939
53424A506716l2490k9175k6297k5099k5013k4294k2304k0032j8178j6021j2858
53413A254955r446o925n045k497J186N072Q079J0115J1886J4079J6840J9783K2408
53400A340490K4628K6740K8897L0869L2476L3959L5727L8004M0789M3764M6224
$$ plain form
53389 1722567 1770259 1819023 1869796 1924055 1982379 2044218 2108849 2175937 2245232 2316455 2389740
53378 2389740 2465669 2544613 2626278 2709959 2794849 2880040 2964695 3048428 3131271 3213245 3294271
53367 3294271 3374341 3453173 3529685 3602343 3670184 3733021 3790732 3843087 3890479 3933988 3974159
53356 3974159 4010231 4041051 4066274 4086086 4100166 4107645 4108049 4101789 4089650 4071993 4048347 4017474
53344 4017474 3977895 3928669 3869747 3801730 3725613 3642973 3556032 3467114 3377933 3289422 3201947
53333 3201947 3115522 3030074 2945746 2862844 2781400 2701121 2621998 2544635 2469585 2396611 2325018
53322 2325018 2254667 2186239 2120569 2058130 1999227 1944273 1893599 1847168 1804716 1766018 1730761
53311 1730761 1698249 1667602 1638456 1611229 1586532 1564492 1544974 1528275 1515037 1505361 1498543 1493926
$$ packed form
53389A722567M7692M8764N0773N4259N8324O1839O4631O7088O9295P1223P3285
53378B389740P5929P8944Q1665Q3681Q4890Q5191Q4655Q3733Q2843Q1974Q1026
53367C294271Q0070P8832P6512P2658O7841O2837N7711N2355M7392M3509M0171
53356C974159L6072L0820K5223J9812J4080P479M04o260j2139j7657k3646l0873
53344D017474l9579m9226n8922o8017p6117q2640q6941q8918q9181q8511q7475
53333C201947q6425q5448q4328q2902q1444q0279p9123p7363p5050p2974p1593
53322B325018p0351o8428o5670o2439n8903n4954n0674m6431m2452l8698l5257
53311A730761l2512l0647k9146k7227k4697k2040j9518j6699j3238r676o818m617
$$ plain form
53299 1493926 1491499 1491278 1492594 1494617 1497229 1500721 1504849 1508960 1512997 1517617 1523231 1529703 1537236 1546856
53285 1546856 1559577 1575581 1594521 1616194 1640520 1667323 1696582 1728570 1763327 1800220 1838325
53274 1838325 1877017 1915897 1954490 1992460 2030049 2067879 2106268 2144813 2182551 2218458 2252022
53263 2252022 2283374 2312647 2339270 2362398 2382159 2399879 2416679 2432343 2445905 2456845 2465042
53252 2465042 2469990 2470842 2467197 2459199 2446911 2430186 2409215 2384537 2356319 2324136 2287803 2248045
53240 2248045 2206065 2162710 2118377 2073452 2028385 1983318 1938001 1892258 1846444 1801322 1757539
53229 1757539 1715238 1674169 1634043 1594752 1556314 1518719 1481822 1445356 1409005 1372503 1335699
53218 1335699 1298639 1261706 1225681 1191440 1159452 1129719 1102254 1077261 1054565 1033182 1012033
$$ packed form
53299A493926k427k21J316K023K612L492M128M111M037M620N614O472P533R620
53285A546856J2721J6004J8940K1673K4326K6803K9259L1988L4757L6893L8105
53274A838325L8692L8880L8593L7970L7589L7830L8389L8545L7738L5907L3564
53263B252022L1352K9273K6623K3128J9761J7720J6800J5664J3562J0940Q197
53252B465042M948Q52l645p998j2288j6725k0971k4678k8218l2183l6333l9758
53240B248045m1980m3355m4333m4925m5067m5067m5317m5743m5814m5122m3783
53229A757539m2301m1069m0126l9291l8438l7595l6897l6466l6351l6502l6804
53218A335699l7060l6933l6025l4241l1988k9733k7465k4993k2696k1383k1149
$$ plain form
53207 1012033 991040 970895 951692 932418 912126 891091 870326 850252 830454 810586 790930
53196 790930 771914 753541 735594 718190 701747 686383 671616 656853 642039 627506 613173
53185 613173 598301 582331 565645 549110 533021 517009 500929 485263 470513 456634 443348
53174 443348 430630 418620 407334 396742 386865 377578 368553 359688 351341 343884 337205 330904 324772
53161 324772 318799 312920 307073 301399 296035 290783 285293 279586 274120 269323 265290 261966 259342 257355
53147 257355 255753 254215 252590 250995 249691 248861 248430 248085 247522 246745 246117 246029 246462 246954 247169 247411 248306
53130 248306 249996 252073 254460 257817 262579 267924 272411 275541 278017 280416 282362 283244 283120 282440 281306
53115 281306 279386 276356 272131 266991 261711 257187 253586 250113 245909 240898 235467 229787 223959 218529
$$ packed form
53207A012033k0993k0145j9203j9274k0292k1035k0765k0074j9798j9868j9656
53196G90930j9016j8373j7947j7404j6443j5364j4767j4763j4814j4533j4333
53185F13173j4872j5970j6686j6535j6089j6012j6080j5666j4750j3879j3286
53174D43348j2718j2010j1286j0592r877r287r025q865q347p457o679o301o132
53161C24772n973n879n847n674n364n252n490n707n466m797m033l324k624j987
53147B57355j602j538j625j595j304q30m31l45n63p77o28q8M33M92K15K42Q95
53130B48306J690K077K387L357M762N345M487L130K476K399J946Q82j24o80j134
53115B81306j920l030m225n140n280m524l601l473m204n011n431n680n828n430
$$ plain form
53101 218529 214211 211100 208570 205949 202860 199020 194246 188871 183744 179538 176184 173138 170055 167066
53087 167066 164518 162561 161017 159565 157986 156189 154119 151805 149516 147634 146330 145469 144837 144225 143321
53072 143321 141854 139994 138327 137216 136539 136169 136332 137071 137773 137819 137569 138057 139605 141290 142051 141863 141486
53055 141486 141365 141277 140895 140158 138963 137068 134663 132706 132102 132606 133046 132700 131991 131631 131654 131629 131360 130896
53037 130896 130211 129441 129119 129503 129939 129576 128658 128313 129022 130099 130869 131545 132563 133734 134627 135298 136142 137246
53019 137246 138277 138788 138421 137158 135589 134587 134460 134729 134872 134814 134515 133765 132759 132295 132806 133675 134090
53002 134090 134165 134614 135617 136703 137557 138295 139020 139691 140412 141377 142477 143369 143957 144535 145499 147164 149730
52985 149730 153091 156804 160485 164204 168252 172765 177770 183340 189322 195131 200128 204063 206941 208740
$$ packed form
53101B18529m318l111k530k621l089l840m774n375n127m206l354l046l083k989
53087A67066k548j957j544j452j579j797k070k314k289j882j304q61o32o12r04
53072A43321j467j860j667j111o77l70J63P39P02M6k50M88J548J685P61j88l77
53055A41486j21q8l82p37j195j895k405j957o04N04M40l46p09l60K3k5k69m64
53037A30896o85p70l22L84M36l63r18l45P09J077P70O76J018J171Q93O71Q44J104
53019A37246J031N11l67j263j569j002j27K69J43n8k99p50j006m64N11Q69M15
53002A34090P5M49J003J086Q54P38P25O71P21R65J100Q92N88N78R64J665K566
52985A49730L361L713L681L719M048M513N005N570N982N809M997L935K878J799
$$ plain form
52971 208740 209528 209499 208540 206185 202471 198505 195599 194043 193158 192241 190956 189096 186731 184457 182859 181773
52955 181773 180615 179310 178200 177118 175312 172504 169473 167329 166535 166772 167391 167893 168260 168845 169708 170209
52939 170209 169652 168200 166685 165589 164743 163942 163310 162948 162816 163047 163867 165029 165889 166259 166704 167682 168786
52922 168786 169216 168807 168225 168246 169076 170339 171532 172379 172734 172370 171173 169626 168659 168724 169293 169625 169695 169950
52904 169950 170459 170914 171274 171754 172220 172208 171636 170997 170704 170719 170858 171082 171414 171940 172864 174179 175352 175800 175638
52885 175638 175445 175387 175210 175079 175664 177167 178966 180561 182210 184196 185997 186790 186529 185997 185901 186281 186818
52868 186818 187368 188122 189316 190916 192667 194432 196257 198035 199454 200579 202119 204719 208227 212174 216591
52853 216591 221682 226849 230913 233388 234818 235757 236088 235494 233977 231752 229262 227396 226937 227491 227680 226687
$$ packed form
52971B08740P88k9r59k355l714l966k906j556q85r17j285j860k365k274j598j086
52955A81773j158j305j110j082j806k808l031k144p94K37O19N02L67N85Q63N01
52939A70209n57j452j515j096q46q01o32l62j32K31Q20J162Q60L70M45R78J104
52922A68786M30m09n82K1Q30J263J193Q47L55l64j197j547r67O5N69L32P0K55
52904A69950N09M55L60M80M66j2n72o39k93J5J39K24L32N26R24J315J173M48j62
52885A75638j93n8j77j31N85J503J799J595J649J986J801P93k61n32r6L80N37
52868A86818N50P54J194J600J751J765J825J778J419J125J540K600L508L947M417
52853B16591N091N167M064K475J430R39L31n94j517k225k490j866m59N54J89r93
$$ plain form
52837 226687 224973 223174 221077 218240 214949 211920 209434 207253 204999 202245 198684 194681 191203 188751
52823 188751 186779 184593 182281 180207 178189 175922 173822 172572 172008 171230 169762 167957 166250 164664 163108
52808 163108 161669 160475 159625 159203 158996 158338 156721 154553 152737 151469 149969 147559 144546 141830 139992
52793 139992 138998 138481 137997 137198 135999 134594 133191 131822 130490 129411 128913 129030 129293 129094 128260 127117
52777 127117 125920 124466 122556 120633 119510 119406 119708 119756 119401 118630 117226 115222 113235 111744 110343 108328
52761 108328 105917 104248 104029 104689 105059 104548 103433 102262 101207 99915 97889 95074 92097 89772 88347
52746 88347 87396 86482 85716 85501 85900 86448 86582 86079 85052 83729 82392 81383 80893 80751 80625 80461 80515 80972
52728 80972 81820 83119 84963 86991 88481 89252 89999 91228 92414 92928 93320 94667 96836 98550 99275 99904
$$ packed form
52837B26687j714j799k097k837l291l029k486k181k254k754l561m003l478k452
52823A88751j972k186k312k074k018k267k100j250n64p78j468j805j707j586j556
52808A63108j439j194q50m22k07o58j617k168j816j268j500k410l013k716j838
52793A39992r94n17m84p99j199j405j403j369j332j079m98J17K63j99q34j143
52777A27117j197j454j910j923j123j04L02M8l55p71j404k004j987j491j401k015
52761A08328k411j669k19O60L70n11j115j171j055j292k026k815k977k325j425
52746H8347r51r14p66k15L99N48J34n03j027j323j337j009m90j42j26j64N4M57
52728H0972Q48J299J844K028J490P71P47J229J186N14L92J347K169J714P25O29
$$ plain form
52712 99904 101239 102951 104676 107112 111010 115712 119698 122255 123749 124606 124946 125094 125458 125746 125067 123076
52696 123076 120461 118028 115760 113092 109808 106353 103358 101015 98920 96540 93820 91217 89109 87361
52682 87361 85614 83703 81618 79352 77119 75407 74455 73869 73105 72124 71202 70399 69730 69600 70405 71679 72298
52665 72298 71676 70301 68945 67875 67048 66579 66552 66580 65977 64428 62355 60594 59757 59810 60222 60570 60941 61683
52647 61683 62842 63993 64645 64684 64449 64422 64779 65174 65094 64488 63837 63550 63560 63735 64320 65560 67136 68473 69510
52628 69510 70657 71918 72556 71869 69991 67757 66005 65147 65158 65672 66185 66350 66169 65947 66081 66785 67865
52611 67865 68820 69319 69475 69509 69353 68962 68885 69890 71804 73233 72943 71328 70028 70093 71016 71677 71805 72086
52593 72086 73060 74486 75782 76695 77250 77427 77235 76941 76851 76993 77299 77968 79246 80920 82462 83738 85113
$$ packed form
52712I9904J335J712J725K436L898M702L986K557J494Q57L40J48L64K88o79j991
52696A23076k615k433k268k668l284l455k995k343k095k380k720k603k108j748
52682H7361j747j911k085k266k233j712r52n86p64r81r22q03o69j30Q05J274O19
52665G2298o22j375j356j070q27m69k7K8o03j549k073j761q37N3M12L48L71P42
52647F1683J159J151O52L9k35k7L57L95q0o06o51k87J0J75N85J240J576J337J037
52628F9510J147J261O38o87j878k234j752q58J1N14N13J65j81k22J34P04J080
52611F7865R55M99J56L4j56l91p7J005J914J429k90j615j300O5R23O61J28K81
52593G2086R74J426J296R13N55J77j92k94r0J42L06O69J278J674J542J276J375
$$ plain form
52576 85113 86823 88692 90689 93241 96654 100479 103830 106180 107674 108829 110057 111265 111844 111362 110376
52561 110376 110122 111122 112538 113229 113152 113277 114344 116115 117765 118697 119029 119462 120523 121924 122908 123299 123725
52544 123725 124635 125679 126400 126996 127833 128737 129342 129782 130354 130883 131136 131612 133080 135383 137478 138676 139179
52527 139179 139381 139409 139513 140100 141011 141306 140222 138060 135818 134210 133221 132392 131338 130123 129192 128770 128396
52510 128396 127343 125527 123696 122671 122678 123406 124408 125392 126414 127800 129684 131666 133158 133971 134284 134214
52494 134214 133810 133352 133170 133243 133349 133536 133986 134578 135095 135725 136712 137616 137645 136844 136212 136485 137482 138829 140545
52475 140545 142507 144033 144594 144531 144548 144806 144957 144738 144189 143543 143215 143562 144302 144564 143948 143210 143449 144880
52457 144880 146844 148754 150488 152089 153687 155676 158386 161501 164205 166002 167091 167908 168727 169739 171066
$$ packed form
52576H5113J710J869J997K552L413L825L351K350J494J155J228J208N79m82r86
52561A10376k54J000J416O91p7J25J067J771J650R32L32M33J061J401R84L91M26
52544A23725R10J044P21N96Q37R04O05M40N72N29K53M76J468K303K095J198N03
52527A39179K02K8J04N87R11K95j084k162k242j608r89q29j054j215r31m22l74
52510A28396j053j816j831j025PP28J002R84J022J386J884J982J492Q13L13p0
52494A34214m04m58j82P3J06J87M50N92N17O30R87R04K9q01o32K73R97J347J716
52475A40545J962J526N61o3J7K58J51k19n49o46l28L47P40K62o16p38K39J431
52457A44880J964J910J734J601J598J989K710L115K704J797J089Q17Q19J012J327
$$ plain form
52442 171066 172384 172832 171656 168933 165508 162294 159741 157835 156289 154664 152590 150070 147511 145299
52428 145299 143454 141871 140733 140262 140060 139213 137334 135125 133511 132515 131429 129850 128002 126196 124636
52413 124636 123764 124099 125404 126543 126579 125741 124968 124728 124649 124200 123422 122923 123313 124648 126396 127947 129124
52396 129124 130155 131254 132406 133476 134312 134807 135077 135498 136293 137157 137573 137531 137624 138468 140261 142776 145455
52379 145455 147565 148674 149084 149514 150372 151591 153004 154474 155823 157174 159281 162838 167402 171642 174726
52364 174726 176920 178763 180480 182381 184955 188066 190788 192674 194591 197591 201419 204855 207224 208839
52350 208839 210172 211317 212356 213659 215600 218188 220991 223328 224736 225475 226327 227738 229442 231122 232991
52335 232991 235338 237966 240551 243219 246164 249031 251325 253242 255398 257845 260053 261845 263678 265848
$$ packed form
52442A71066J318M48j176k723l425l214k553j906j546j625k074k520k559k212
52428A45299j845j583j138m71k02q47j879k209j614r96j086j579j848j806j560
52413A24636q72L35J305J139L6q38p73k40p9m49p78m99L90J335J748J551J177
52396A29124J031J099J152J070Q36M95K70M21P95Q64M16m2R3Q44J793K515K679
52379A45455K110J109M10M30Q58J219J413J470J349J351K107L557M564M240L084
52364A74726K194J843J717J901K574L111K722J886J917L000L828L436K369J615
52350B08839J333J145J039J303J941K588K803K337J408P39Q52J411J704J680J869
52335B32991K347K628K585K668K945K867K294J917K156K447K208J792J833K170
$$ plain form
52321 265848 268032 269826 271295 272791 274610 276977 279965 283259 286404 289444 292959 297281 302046 306857
52307 306857 312053 318448 326397 335445 344893 354473 364460 375230 386824 398916 411177 423569 436218
52294 436218 449155 462412 476316 491411 507854 524994 541774 557640 573024 588871 605638
52283 605638 622803 639387 654833 669271 683119 696778 710697 725226 740079 754222 766687
52272 766687 777477 787427 797267 807013 816180 824356 831526 837996 843988 849337 853637 856707 858688 859701
52258 859701 859699 858834 857647 856631 855826 855045 854230 853315 852012 850147 848091 846512 845778 845893 846870 848794 851530
52241 851530 854771 858432 862784 868165 874655 882005 889769 897638 905806 914834 925047 936211 947911
52228 947911 959884 971828 983281 994039 1004341 1014199 1023020 1030389 1036844 1043135 1048975 1053367 1056054
$$ packed form
52321B65848K184J794J469J496J819K367K988L294L145L040L515M322M765M811
52307C06857N196O395P949R048R448R580R987J0770J1594J2092J2261J2392J2649
52294D36218J2937J3257J3904J5095J6443J7140J6780J5866J5384J5847J6767
52283F05638J7165J6584J5446J4438J3848J3659J3919J4529J4853J4143J2465
52272G66687J0790R950R840R746R167Q176P170O470N992N349M300L070J981J013
52258H59701kq65j187j016q05p81q15r15j303j865k056j579p34J15R77J924K736
52241H51530L241L661M352N381O490P350P764P869Q168R028J0213J1164J1700
52228I47911J1973J1944J1453J0758J0302R858Q821P369O455O291N840M392K687
$$ plain form
52215 1056054 1057778 1059042 1059499 1058811 1057292 1055275 1052446 1048287 1042757 1036109 1028443 1019864 1010715 1001276
52201 1001276 991488 981328 971186 961543 952524 944081 936298 929188 922440 915771 909316 903376 897989
52188 897989 893086 888802 885192 881871 878471 875346 873252 872231 871296 869461 866867 864618 863614 863632 863500
52173 863500 862236 860055 858098 857074 856470 855338 853528 851619 849801 847524 844372 840707 837100 833542
52159 833542 829584 824980 819868 814593 809703 805863 803235 800983 797851 793383 788349 783956 780916 779188
52145 779188 778126 776707 774068 770236 766168 762746 759906 756986 753707 750326 746979 743414 739556 735809
52131 735809 732533 729498 726249 722840 719797 717368 715139 712497 709302 705939 702882 700316 698182 696407
52117 696407 694972 693795 692658 691374 689951 688520 687169 686025 685426 685728 686908 688583 690562 693137 696721
$$ packed form
52215A056054J724J264M57o88j519k017k829m159n530o648p666q579r149r439
52201A001276r788j0160j0142r643r019q443p783p110o748o669o455n940n387
52188H97989m903m284l610l321l400l125k094j021r35j835k594k249j004J8j32
52173H63500j264k181j957j024o04j132j810j909j818k277l152l665l607l558
52159H33542l958m604n112n275m890l840k628k252l132m468n034m393l040j728
52145G79188j062j419k639l832m068l422k840k920l279l381l347l565l858l747
52131G35809l276l035l249l409l043k429k229k642l195l363l057k566k134j775
52117F96407j435j177j137j284j423j431j351j144n99L02J180J675J979K575L584
$$ [...]
##END NTUPLES=NMR SPECTRUM
##END=
