
##TITLE=AC1068_TOPL01_6519229_qYJ3gEzVqc
##JCAMPDX= 6.0         $$ Bruker NMR JCAMP-DX V2.0
##DATA TYPE= NMR SPECTRUM
##DATA CLASS= NTUPLES
##ORIGIN= BRUKER
##OWNER= Administrator
$$ 1.72 TOPSPIN		Version 2.1
$$ 2012-07-13 18:18:35.296 -0500  Administrator@TOPSPIN
$$ Compression mode = diff/dup
##.OBSERVE FREQUENCY= 400.02188249412
##.OBSERVE NUCLEUS= ^1H
##.ACQUISITION MODE= SIMULTANEOUS (DQD)
##.ACQUISITION SCHEME= undefined
##.AVERAGES= 8
##.DIGITISER RES= 22
##SPECTROMETER/DATA SYSTEM= spect
##.PULSE SEQUENCE= zg30
##.SOLVENT NAME= COFFEE_meoh
##.SHIFT REFERENCE= INTERNAL, COFFEE_meoh, 1, 14.98509
##AUDIT TRAIL= $$ (NUMBER, WHEN, WHO, WHERE, PROCESS, VERSION, WHAT)
$$ ##TITLE= Audit trail, TOPSPIN		Version 2.1
$$ ##JCAMPDX= 5.01
$$ ##ORIGIN= Bruker BioSpin GmbH
$$ ##OWNER= Administrator
$$ $$ C:\Bruker\TOPSPIN/data/COFFEE/nmr/AC1068_TOPL01_6519229_qYJ3gEzVqc/30/pdata/1/auditp.txt
$$ ##AUDIT TRAIL=  $$ (NUMBER, WHEN, WHO, WHERE, PROCESS, VERSION, WHAT)
(   1,<2012-07-13 18:18:25.359 -0500>,<Administrator>,<TOPSPIN>,<go>,<TOPSPIN 2.1>,
      <created by zg
	started at 2012-07-13 18:17:18.343 -0500,
	POWCHK enabled, PULCHK disabled,
       configuration hash MD5:
       6B 1B 68 BB D9 2E 58 E2 7F 35 AD 54 07 DF 0E 41
       data hash MD5: 64K
       01 6F 48 82 1B 8B 28 4E A9 7A B1 79 74 D9 E6 B8>)
(   2,<2012-07-13 18:18:30.796 -0500>,<Administrator>,<TOPSPIN>,<proc1d>,<TOPSPIN 2.1>,
      <Start of raw data processing
       efp LB = 0 FT_mod = 6 PKNL = 1 PHC0 = 0 PHC1 = 0 SI = 32K 
       data hash MD5: 32K
       7F 31 69 76 C4 8A 9C 89 C2 02 62 43 B8 4B 8A 7D>)
(   3,<2012-07-13 18:18:31.078 -0500>,<Administrator>,<TOPSPIN>,<proc1d>,<TOPSPIN 2.1>,
      <pk PHC0 = 177.8137 PHC1 = 0 
       data hash MD5: 32K
       9C A5 22 02 2C 46 BF D3 0A 1E A4 FD E9 FD 96 9D>)
(   4,<2012-07-13 18:18:31.140 -0500>,<Administrator>,<TOPSPIN>,<proc1d>,<TOPSPIN 2.1>,
      <abs ABSG = 1 
       data hash MD5: 32K
       23 66 28 C4 3F F1 E7 73 59 41 94 74 31 9B 5E B9>)
(   5,<2012-07-13 18:18:31.171 -0500>,<Administrator>,<TOPSPIN>,<proc1d>,<TOPSPIN 2.1>,
      <abs ABSG = 2 
       data hash MD5: 32K
       5A 1D 8E 14 25 F0 1B 25 BC 88 F6 53 55 0F 91 46>)
(   6,<2012-07-13 18:18:31.203 -0500>,<Administrator>,<TOPSPIN>,<proc1d>,<TOPSPIN 2.1>,
      <abs ABSG = 3 
       data hash MD5: 32K
       C1 FB F1 B4 C8 85 27 27 4E AA 30 5E CF 3B ED F3>)
(   7,<2012-07-13 18:18:31.234 -0500>,<Administrator>,<TOPSPIN>,<proc1d>,<TOPSPIN 2.1>,
      <abs ABSG = 4 
       data hash MD5: 32K
       37 C6 71 83 AC 11 E4 5B 51 34 86 9A 01 6E 75 32>)
(   8,<2012-07-13 18:18:31.265 -0500>,<Administrator>,<TOPSPIN>,<proc1d>,<TOPSPIN 2.1>,
      <abs ABSG = 5 
       data hash MD5: 32K
       E0 1E 29 A4 FC 52 4A 27 C8 6D 2F FF 37 E9 1F 22>)
$$ ##END=
$$ 
$$ $$ hash MD5
$$ $$ EA 08 79 A6 8E 99 39 DB D2 C4 BC 2C 3F 0E CF D4
##$RELAX= 
##$RELAX= 
##$RELAX= 
##$RELAX= 
##$RELAX= 
##$RELAX= 
##$RELAX= 
##$RELAX= 
$$ Bruker specific parameters
$$ --------------------------
$$ [...]
##$TP= (0..7)
150 150 150 150 150 150 150 150
##$TP07= 0
##$TPNAME0= <>
##$TPNAME1= <>
##$TPNAME2= <>
##$TPNAME3= <>
##$TPNAME4= <>
##$TPNAME5= <>
##$TPNAME6= <>
##$TPNAME7= <>
##$TPOAL= (0..7)
0.5 0.5 0.5 0.5 0.5 0.5 0.5 0.5
##$TPOFFS= (0..7)
0 0 0 0 0 0 0 0
##$TUNHIN= 0
##$TUNHOUT= 0
##$TUNXOUT= 0
##$USERA1= <user>
##$USERA2= <user>
##$USERA3= <user>
##$USERA4= <user>
##$USERA5= <user>
##$V9= 5
##$VALIST= <valist>
##$VCLIST= <CCCCCCCCCCCCCCC>
##$VD= 0
##$VDLIST= <DDDDDDDDDDDDDDD>
##$VPLIST= <PPPPPPPPPPPPPPP>
##$VTLIST= <TTTTTTTTTTTTTTT>
##$WBST= 2048
##$WBSW= 25
##$XGAIN= (0..3)
0 0 0 0
##$XL= 0
##$YL= 0
##$YMAX_a= 498922
##$YMIN_a= -651225
##$ZGOPTNS= <>
##$ZL1= 120
##$ZL2= 120
##$ZL3= 120
##$ZL4= 120
##$ABSF1= 14.98509
##$ABSF2= -5.573092
##$ABSG= 5
##$ABSL= 3
##$ALPHA= 0
##$AQORDER= 0
##$ASSFAC= 0
##$ASSFACI= 0
##$ASSFACX= 0
##$ASSWID= 0
##$AUNMP= <proc_prof1d_extract_pilot.lims>
##$AXLEFT= 0
##$AXNAME= <>
##$AXNUC= <1H>
##$AXRIGHT= 0
##$AXTYPE= 0
##$AXUNIT= <>
##$AZFE= 0.1
##$AZFW= 0.1
##$BCFW= 0
##$BC_mod= 0
##$BYTORDP= 0
##$COROFFS= 0
##$CY= 15
##$DATMOD= 1
##$DC= 0
##$DFILT= <>
##$DTYPP= 0
##$F1P= 0
##$F2P= 0
##$FCOR= 0.5
##$FTSIZE= 32768
##$FT_mod= 6
##$GAMMA= 0
##$GB= 0
##$INTBC= 1
##$INTSCL= 1
##$ISEN= 128
##$LB= 0
##$LEV0= 0
##$LPBIN= 0
##$MAXI= 10000
##$MC2= 0
##$MEAN= 0
##$ME_mod= 0
##$MI= 0
##$NCOEF= 0
##$NC_proc= -8
##$NLEV= 6
##$NOISF1= 0
##$NOISF2= 0
##$NSP= 0
##$NTH_PI= 0
##$NZP= 0
##$OFFSET= 14.98509
##$PC= 1
##$PHC0= 177.8137
##$PHC1= 0
##$PH_mod= 1
##$PKNL= yes
##$PPARMOD= 0
##$PPDIAG= 0
##$PPIPTYP= 0
##$PPMPNUM= 2147483647
##$PPRESOL= 1
##$PSCAL= 4
##$PSIGN= 0
##$PYNMP= <proc.py>
##$REVERSE= no
##$SF= 400.02
##$SI= 32768
##$SIGF1= 0
##$SIGF2= 0
##$SINO= 400
##$SIOLD= 32768
##$SPECTYP= <>
##$SREGLST= <1H.CDCl3>
##$SSB= 0
##$STSI= 32768
##$STSR= 0
##$SW_p= 8223.68421052631
##$SYMM= 0
##$S_DEV= 0
##$TDeff= 65536
##$TDoff= 0
##$TI= <>
##$TILT= no
##$TM1= 0
##$TM2= 0
##$TOPLEV= 0
##$USERP1= <user>
##$USERP2= <user>
##$USERP3= <user>
##$USERP4= <user>
##$USERP5= <user>
##$WDW= 1
##$XDIM= 32768
##$YMAX_p= 481965095
##$YMIN_p= -768281
##$CURPLOT= <Network HP LaserJet P1505>
##$CURPRIN= <$Network HP LaserJet P1505>
##$DFORMAT= <normdp>
##$LAYOUT= <+/1D_H.xwp>
##$LFORMAT= <normlp>
##$PFORMAT= <normpl>
##$SURQMSG= 1
$$ End of Bruker specific parameters
$$ ---------------------------------
##NTUPLES= NMR SPECTRUM
##VAR_NAME=  FREQUENCY,     SPECTRUM/REAL,   SPECTRUM/IMAG
##SYMBOL=    X,             R,               I
##VAR_TYPE=  INDEPENDENT,   DEPENDENT,       DEPENDENT
##VAR_FORM=  AFFN,          ASDF,            ASDF
##VAR_DIM=   32768,         32768,           32768
##UNITS=     HZ,            ARBITRARY UNITS, ARBITRARY UNITS
##FACTOR=    0.250966925370066, 1,           1
##FIRST=     8223.43324360094, -129840,      94032
##LAST=      0,             -79664,          -20523
##MIN=       0,             -768281,         0
##MAX=       8223.43324360094, 481965095,    0
$$ Real data points
##PAGE= N=1
##DATA TABLE= (X++(R..R)), XYDATA
$$ [...]
23764 -62609 -3888 334391 -68211 -147248 17044 -34619 63920 14678 -56198 96771 -64790 -54059
23752 -54059 -17285 114224 -212756 -75026 -247341 -30168 -99001 92454 153622 71127 74804
23741 74804 80001 -11484 290353 -51956 -62071 -25029 -23322 61842 37907 101219 344503 78842
23728 -91680 1180 348123 25613 -25956 155677 -141750 -17566 -295767 -124972 -213629 -145580
23717 -145580 164809 -26567 -167351 -246744 68279 -95275 143452 -196182 423531 190580
23706 199888 242080 65200 40649 -278064 -20020 -212798 263314 -295927 -56075 30746 165383
23695 165383 -123791 75589 -106147 3180 -313814 -176208 -35876 -96949 130329 86273 117219
23684 117219 54952 100539 -14603 4063 -61651 -270107 798 -30893 10210 14157 151311 -11958
23671 -214447 -361768 -166647 -355555 -165798 87008 111905 203782 -208549 50943 2873 99260
23660 99260 29173 110142 -179505 -368236 18423 -262809 -202050 -153116 -90025 -83277 -405975
23649 -405975 28034 -395362 -50983 153406 -282855 -169544 -22461 -88821 193682 -86861
23638 43740 -55934 -168799 132716 150582 50602 -21398 -114845 -200714 -78576 41664 11959
23626 -15539 -73236 -44385 -238414 -501041 108551 53237 69430 341791 -201123 -78257 242715
23614 215880 -61657 -121848 23931 -13985 89979 104047 174532 -191196 -27867 115752 -276712
23602 -306713 -11796 -114005 -119483 204655 -340314 168308 -29486 25085 120239 23836 60040
23591 60040 154945 329590 -64837 617909 181937 221803 315778 44672 200801 -236349 4109
23579 217522 77492 430660 -366516 -85739 285359 26530 278031 203026 -5063 -201715 -58751
23567 82711 -163638 -285156 -101418 -9040 262512 -284551 276519 -358929 -38463 106315
23556 5063 -147687 -114394 -322002 -251312 34668 378877 -21977 -228944 -60046 59443 -323915
23544 -302686 -79553 384860 -63009 46059 -40319 12038 83870 -57885 -87335 53624 205778
23533 205778 268360 -127514 -40298 21150 -112907 6728 82577 -299083 125732 51128 -229648
23521 -103743 -122506 -117487 144807 -2218 212188 -99638 17817 -172986 14905 102009 -44847
23509 85871 -169845 42417 -341472 -7032 32811 -22153 -97325 -104819 -39130 -226855 78390
23497 -105967 19585 -36311 235278 -262639 -32659 1861 -170494 30186 -12889 -207151 66454
23485 62719 37784 -119472 35618 47280 58504 180561 37409 -143063 28050 -222100 -7605
23473 80762 -81274 -96497 113999 53473 -58411 -70327 -109577 -151113 -112420 -320996 -222943
23462 -222943 268355 -20083 64831 14664 114076 227169 -42878 103069 -128934 88076 147630
23451 147630 -280293 37510 113091 38891 -715 -58312 -387121 -204425 53879 44015 312808
23440 312808 58399 -151806 33537 -145698 112009 -35044 -384570 -67738 -95425 16862 74724
23429 74724 180876 -414645 -129628 119664 222137 -68576 356536 32580 -70240 50273
23418 -228700 112703 -113273 319328 49536 -34917 93611 60836 82740 210361 217285 -485066
23406 144030 164188 10046 314804 98649 2057 -86132 -6567 -23589 -301263 -80541 40541
23394 -336497 -331945 -328556 -14809 10935 -70652 -179394 273126 -133938 165901 -202581 -54240
23382 -91171 -118839 18350 35840 140480 -13563 -256524 151528 -296634 85162 57266 -82313
23370 -198200 -205588 228045 -341858 -5097 348395 86172 -2454 -87051 200893 -160964 343840
23358 -156231 251368 181324 162012 37798 -455211 12810 25358 188373 293098 -120251
23347 -167212 -76696 178101 -56615 -327043 -51172 55530 -85427 107688 -114434 18874 -101204
23335 103976 -254323 -229927 16374 145814 -77159 -44643 -145141 37460 -45127 -35501 -64604
23324 -64604 176866 228271 145182 -116304 157169 -51124 -170355 -14654 125478 -109705
23313 -121241 -23967 19732 337108 -302737 108454 172102 119752 235387 190469 92627 -145999
23301 85435 -161541 -143299 -58820 -410459 138082 -251788 142883 -705 105076 -3471 110112
23289 -22896 96472 -161397 -365007 -144474 -65206 -8975 -64744 206830 -212459 -364292 -172770
23277 107290 43681 13298 -7550 6595 -57869 167486 53990 504 -139188 6980 -73702 75713
23264 -125538 51769 331774 -261809 8780 -19355 -215036 -142309 -9973 -114539 -203189 -245151
23253 -245151 17586 -133836 -76599 -235591 -180124 -156500 87231 106662 309598 124435 115970
23242 115970 224519 151826 -257483 -210317 182349 96187 -105639 -73986 207799 -119054
23231 -141811 79413 82392 42749 -11345 124309 139029 -143964 -9718 -176512 32755 -273750
23219 -136961 -146270 292507 -529440 -154438 -316780 -463165 -130877 265323 -121141 114662
23208 164762 -112435 -393226 235050 132885 230344 -76122 -462427 353364 337643 9437
23197 18509 74767 8814 59934 23462 -177572 171265 -68937 -48884 -316859 -67738 -64575
23186 -64575 -12875 -57683 -182018 39507 55741 -171600 291377 -338364 44563 -290638 65024
23174 -395894 178948 -123794 18639 66319 -220420 131023 -166916 -4840 36097 142119
23164 142119 176631 -7643 30265 -135549 65246 -286940 -86017 129685 -78930 14011 -182455
23152 -123673 57458 71324 5710 133195 123109 -108022 -215988 -38199 -295544 -369362 115209
23140 237955 -69749 755 -24188 -77718 126883 236940 262332 486800 -150785 76735 -39797
23128 -112798 142913 29271 226626 158034 152614 116626 168398 154212 277359 54537 -29403
23116 -232253 -192227 -52940 -4756 147137 -67295 164747 -56915 -263677 -1058 -37000 -234677
23105 -234677 -168558 563956 -79682 -17159 294806 -11754 -207956 -16592 96284 139661 212503
23094 212503 -58734 4904 258642 62312 287578 -230870 118559 82973 143154 -159519 188676
23082 -63207 -29142 -120183 301147 -19810 303308 -59680 -34389 161112 86860 -154254 258014
23070 71277 40295 -248214 118950 67034 143484 -49906 -112169 -323124 -62853 189235 98289
23059 98289 147084 16065 -4493 -346627 -123496 88837 -180085 73498 168220 74371 50927
23048 50927 48202 118799 122500 -19285 -87355 -82824 -208191 84353 349056 76772 -32713 130349
23035 82219 2491 42866 42309 307686 269012 27296 85102 -249121 -51781 96887 151696 214502
23023 214502 200390 -6156 -62941 -193411 -134547 -124131 155532 -17713 -329991 -79831 -225489
23012 -225489 172215 -24445 131204 -135946 -65931 -15845 -127279 -186338 -104220 -53981 -183670
23001 -183670 80771 10284 -263847 -61974 -427092 -265193 -182804 -89994 -79521 1112 283681
22990 283681 -27010 326560 35320 233401 -59925 -41711 -352101 -30171 -52164 -12257 -70740
22979 -70740 -229727 -121323 -266409 12470 -67972 29873 214452 -311362 27874 -210021
22968 77044 -141408 112840 -96867 78921 -60558 39338 13674 -93410 -103300 206548 -162436
22956 -56507 -187625 -178759 -99352 -182643 25370 53729 19121 -6457 -298531 38259 -14849 -39627
22944 -39627 6147 -117068 250923 -346459 175196 79257 -119577 -186061 213283 98006 114535
22933 114535 -62005 -86228 -143944 -217369 39238 215223 -234368 40555 -280236 -7956 -139780
22922 -139780 -143308 317301 -25134 60243 118932 150069 -59408 -27643 -352387 79111 -262656
22910 -72665 20808 152858 73521 246688 40299 11200 -377697 114483 -180795 -216278 167234
22898 -141962 41677 -69676 -256745 -67194 235008 -251465 -33648 -114451 19245 -58934 276277
22886 -252551 -141156 -65424 126225 104901 268565 139235 19591 -193681 1469 101954
22876 101954 -111236 -8288 -110038 -178623 -89846 -16404 -39805 -11298 -66162 -48769 -210688
22865 -210688 72374 143186 185430 -238669 -111003 62010 -191056 150897 -189224 -80100
22854 9514 38381 -94186 9689 -35962 -31787 -108516 411332 172555 -209368 34425 215340
22843 215340 -108723 216754 -323433 -28915 71349 -121069 36093 -147509 -101776 36712
22832 -173933 -100166 -509840 47108 -223338 118819 392445 92133 217004 -97821 -85704
22822 -85704 -118740 -243448 100677 86456 -35296 55184 -51532 252007 261590 290142 -87017
22810 29212 -104050 -77813 -55675 -282159 -63938 -109929 116770 -43971 28252 108835 -125864
22798 75314 -224144 -188466 -333565 -251262 -340710 122935 65337 -82604 -113100 -136155 70596
22786 130741 142062 136159 25478 23171 -45475 -201440 -8887 -264562 -59956 -123600 8010 -271320
22773 -33859 93316 98666 -254745 -105493 -38670 142599 275845 118203 -321738 -62707 -136058
22762 -136058 118513 86872 117163 -41679 -31006 -167204 -165927 -109535 -193760 -22940 -108655
22751 -108655 38907 34074 -163280 43173 37118 8551 -71807 69128 142831 414212 -140581
22739 -40071 208256 417801 474748 -293691 -243845 -117477 -11024 -191198 -353438 -48633
22728 -155852 -47309 137869 -351108 -151413 31082 -182508 -384013 129183 -92366 -35582
22717 -432360 26905 38575 81588 -198095 -4815 336391 89516 -329833 -70097 19780 35792
22706 35792 395411 -467456 80349 -142152 -47962 -126413 31194 -249809 -209630 308787 134374
22694 -15742 -265269 -109909 -54655 -106965 4905 -10561 -112937 -158436 -35440 -106510 -36043
22682 -199996 -196486 236402 -80700 2996 192387 -171251 -63045 -86039 -257699 -31940 -321161
22671 -321161 -16956 37683 -60215 32446 78580 25564 -76202 -441442 118773 -228564 629
22659 -6809 -211231 -452349 -107092 -17282 -115517 162338 70209 -106579 -252036 -75407 -108520
22648 -108520 -211308 75781 26498 -60661 -215767 -40111 -11714 160598 133395 -104344 -36034
22636 -197546 -30718 114858 -140650 -94828 -29564 -200544 -228286 98465 -112524 206863
22625 -131391 -293769 -258827 46553 -151672 324937 43072 71923 -269490 -253551 -110461
22614 188081 165720 -138366 -44746 3643 -187628 -351039 -245613 -554972 -118646 -239042
22604 -239042 -208745 -213756 -2330 -252283 -116146 -303272 286216 -183709 -87252 -204798 41638
22592 -190176 -47176 -122868 -23912 -289519 -32563 -282893 -98330 -152869 -102970 -94509 181840
22580 -201577 -128857 13257 16322 187135 49518 61831 -300833 -181640 -234847 29263 276851
22569 276851 -140518 108327 -160292 147758 -34560 -5445 -305683 -164906 -134430 174241
22558 -40838 29439 -324251 -67367 -148469 123521 -172612 -198810 39168 -70052 -155277 307512
22546 -40771 -39213 -172995 306761 259833 59416 177329 -109388 -297764 99917 -131219 20596
22534 -53379 37585 39669 -122628 -118570 102093 -270026 88858 256853 -292107 -125402 192329
22522 -196030 -29198 -15279 -45868 -167286 -190646 456761 243942 189392 109882 16880 16377
22511 16377 -51738 -45704 15297 166171 -231438 -249951 -155133 29961 -277973 64790 31732
22499 192922 -199155 -71502 34393 -157596 -167232 -279142 -162949 22375 59244 179518 -9506
22487 15817 -95635 88705 -320089 87637 148756 26083 127398 -36884 128342 -70482 194876
22475 57788 -10146 44179 125482 6298 -162024 90737 67222 229454 -333723 -173478 102884
22463 -210929 64304 229135 -94635 -144936 -62094 93173 66055 -63549 -52067 -216741 -176292
22452 -176292 430483 -182678 -140499 -656540 -110343 -71885 -256041 337586 105115 -4140
22441 13791 35101 38871 85806 -207652 -63385 -285645 233689 -263342 75880 358925 -64964
22429 93637 -370007 282444 -94854 101008 118747 567103 64464 -50303 -309385 -51779 39294
22417 -55472 -230629 55177 -74500 -61588 -43107 2824 -37939 -77171 -97947 75666 4455 309447
22405 309447 -275761 -83098 -49371 -77060 -104425 373634 -268579 19066 121650 103504 94359
22394 94359 -63655 -122963 -266520 135143 24903 428819 45112 -166238 -339466 254814
22383 -208507 -147522 -415834 26691 -252553 99708 -273139 280140 342829 146502 57273
22372 186840 -217017 -320325 -136773 85788 -190244 112167 -52239 -80223 -359283 88823
22361 -172976 -136928 79477 209546 -133627 -436997 66501 -255547 295590 3280 -110392
22350 -62261 -143995 83856 -21608 -51375 -140554 -236902 -69102 -77503 145807 -259597 -64396
22338 -452504 -193846 246856 -9785 -278305 -332662 -153153 6168 -291413 -119887 -36758 172317
22326 71020 71005 -127209 -128997 -122333 -100852 -148833 -143076 -119142 -117577 2140 132272 -288464 -39192
22312 -159039 116105 -137249 43402 122776 -127586 123647 -127708 176617 103573 188623
22302 188623 -209992 -186687 284068 -144712 124629 -298100 72634 -202952 92783 14683
22291 -188161 -258838 -252943 -8264 -42956 -78977 -264324 926 166922 -341486 -4264 -26848 10206
22278 -343634 223130 -68607 -116394 48059 -61768 -133605 19457 -102202 256551 131887 -339290
22266 -164316 154504 67950 -264576 51072 3153 -226766 -190202 49077 152775 -151794 223734
22254 -24319 -18011 7656 55461 67400 24278 -473688 -167738 199056 331656 83229 -91118
22242 -59822 -291471 66080 -80465 -126400 -33436 90090 -369578 31075 192186 -150847 -141264
22231 -141264 -186217 -119564 110700 -294450 -18244 -108392 -84783 -60439 92033 -292062 -88668
22219 -77538 -223583 -222316 -212229 85540 284457 -175692 -156931 261192 194226 -134213 168545
22207 -46740 -39832 -153741 68387 -64107 22445 -210976 40157 62449 -162357 -48952 163096
22195 8955 -37353 -128703 117632 -18655 170142 162183 -183391 -193209 -413086 -169719 135019
22183 44190 163928 -32725 45577 96764 27555 -127933 -73400 -186601 147726 -888 -83594
22172 -83594 -45574 -157620 -239369 -202400 -159810 -260874 -51705 158378 -363317 100206 -120421
22160 131244 35007 36891 -9806 34477 -202223 -5778 -94394 -117398 -232484 255789 34193
22148 -63421 -80848 228040 119075 102287 -71368 152650 -201683 216458 -135315 -25116
22137 48805 120878 -285287 -265194 50532 -16867 -137554 281360 144116 -91398 234619 69349
22125 125529 120398 153447 -283770 -332713 170703 -75425 144174 -91185 94407 -192593 -96093
22113 260318 -176455 -82683 -156255 -12583 75361 156151 -75819 -130610 -168012 324965 -197584
22101 150430 -230599 203800 -103971 -6942 120673 -194805 -489559 36268 275124 -393764
22090 264833 -131539 245992 -148850 104951 -28946 189133 10031 73975 62285 34049
22080 34049 132075 10704 -139800 -7815 -321941 19955 -35221 46524 -169534 56564 280465
22069 280465 -113078 -77203 -297415 -149762 -93872 -5641 -135973 -81436 -63010 -91695 50585
22057 223436 -245765 177389 171560 157333 97379 -177476 139166 -139165 -32721 135552
22046 -389856 -273694 -340069 -261505 459581 200902 -200083 -143655 -144330 68617 -356023 -84034
22034 -288666 57959 -98330 -135194 88961 -298369 -264943 -103721 170170 322904 -265552
22023 -370190 20699 -16363 -128406 70482 -60404 -369222 -343247 136512 -302000 27212 231346
22012 231346 170155 59687 115658 -148266 22534 -178826 -204233 -267492 6130 115225 -314619
22000 31415 252294 -292727 1414 167697 -146573 -77356 -218574 14337 -69709 -249794 5850
21988 68972 -34553 42939 234379 30936 46910 -69029 -291378 64008 -166840 -110834 119741
21976 16418 -20786 -67781 -146393 -312491 -328580 -92394 -152148 -338061 97 326889 -108589
21964 -74361 84712 169120 59329 -115475 -194010 -486594 -200670 122760 184782 -137705 40982
21952 228096 170356 -215615 -83058 -129266 26760 159794 -165953 -255950 -47097 -160818 -281619
21941 -281619 -22751 -101454 -221926 -61201 221965 -55997 182911 28910 -54959 120386 -73352
21929 75950 -150930 132640 -235341 -75325 153328 -100406 -4317 110367 69630 -7198 -173041
21918 -173041 -57227 7470 83376 22862 75481 -34159 148216 -79620 -39345 -192785 -71898
21906 -72194 -64292 -186095 30083 -146706 -80690 -254704 154096 1852 -116703 -44823 -155399
21895 -155399 216780 -92077 111105 84019 -267621 -155861 51903 -9293 309096 -253797
21884 -26707 -273488 -41570 262433 121668 -50329 -24344 -33317 -186188 -262592 -288399 -265396
21873 -265396 122913 19138 -123051 168071 -313444 -169092 -337184 38009 -142605 201108
21862 -211391 15832 -346929 -218812 14025 110581 -307064 -315065 236922 -76563 -342944 -311690
21851 -311690 -112567 -332115 107321 -164344 107845 -151476 -120720 162620 -244901 89955
21840 314850 -325821 -232381 -98573 -21672 -272619 -195874 62516 -302656 -28603 -120111 -320951
21829 -320951 -67640 -387656 -278419 -149261 72742 -176003 -209220 301794 -208968 -51779
21818 -105596 -131770 -55471 -88114 154274 -112096 -80798 -473930 -50490 -113308 129508 74398
21807 74398 -74589 201382 -296504 263417 -32081 91860 -168234 181484 -179529 109909
21796 32272 -211846 -45307 -24567 233938 -66587 -68194 129655 320027 6809 261085 206760
21785 206760 -32296 185043 78305 -191799 -77622 144654 -244552 -57239 3286 188544 -58624
21773 -191685 50809 -160492 326909 -147815 -132440 -86892 -36771 392947 62693 110982 -30853
21761 -55946 -131732 -14079 247470 -211222 111986 17367 -168580 -123086 -198362 58340 60276
21750 60276 167349 -67594 -46497 33945 -24067 -289896 133858 -122336 254303 -211370
21739 -192913 91875 -125107 105416 -20820 -69963 87407 -100854 188844 729 -244777 -210119
21728 -210119 -239447 -48593 108234 -19065 -191722 13845 -139102 -279197 102340 337810
21718 337810 92673 -228293 10788 -144119 -153644 -64336 7599 -307051 -61343 -80610 -174983
21707 -174983 -246551 -230430 20061 -222914 130229 -163463 -291866 224609 -21743 55537
21696 -107484 -192200 -74291 -79413 -56485 64565 57305 -218260 -48164 -91937 -371833 -17370
21684 40947 -189554 -301123 -221190 -111714 -67651 -29987 -244172 -283987 -219588 10728 208160
21673 208160 -121145 -62056 -91140 -97799 214052 30305 37204 175595 -142538 40147 105039
21662 105039 79545 -197041 -420008 -15923 68323 -322284 1581 236058 -19047 -44039 -215602
21651 -215602 182139 39379 93446 -44046 -17976 -273939 176696 190514 29120 -316407 382094
21639 -201766 -130175 -168578 56865 -242434 -262898 47611 -215904 213147 -65726 -256025 -94208
21627 -331860 63946 263233 58333 -220139 29570 56041 33009 -71563 280486 4523 -89310
21615 232628 154598 27853 -142687 -74545 -333263 413682 -200517 -44902 -121498 118139
21604 40213 154511 216912 -210941 -109611 -301253 -93609 64910 176462 232953 105567
21593 110310 41652 -110681 -160267 318454 -31482 -299135 -69048 -30706 91007 -75519 93072
21581 -319680 -109109 68141 -49854 -161563 74908 -457400 -348432 -2865 -163484 -116372 -162008
21570 -162008 29083 75575 -87290 100825 -194980 2392 -136766 -226211 93108 -327251 103291
21558 210857 401612 17497 73421 455829 -242517 -209328 81218 -284987 -404014 -260424
21548 -260424 -225966 -20482 154174 -26855 63901 27002 -183602 -292598 115950 -858 83648
21536 109936 331972 167088 169900 -72446 -232614 3644 -125823 331685 -236479 74696 37549
21525 37549 -22302 68405 -91595 87400 -112773 -224012 -221043 -53569 63433 -12782 39040
21513 -535330 129517 -97858 -151117 63595 16957 94112 -178795 -130682 -231722 -222413 102036
21501 -396568 45498 -30436 -595896 115945 -33408 -106050 -117443 -104872 -35036 335924 -50873
21489 -105574 264569 70169 -46552 -122090 86515 -30338 167357 -94136 -91740 96683 -309251
21477 16009 147724 -148395 37814 -146063 -64188 -440293 -190311 73890 -155444 -114986
21467 -114986 -145809 110299 -214669 -346242 -45436 -156133 250092 68594 -296538 -290180
21457 -290180 -305664 100387 139684 -79279 115772 -28084 -325121 -174705 -371992 16361
21446 146781 36694 -180413 -210441 287176 -182246 28268 -189867 6748 198571 416815
21436 416815 174294 22904 379494 727706 214566 70003 78553 -45866 -233888 -243882 21150
21424 -224136 -157485 -271642 162572 -286260 -76686 61181 10350 -152397 -245705 21504 153929
21413 153929 15817 171897 -62560 344808 -78206 -154953 -116242 -49022 -58357 -180916 13935
21401 -56801 -136375 -73819 -222211 -232493 184610 -218433 -57988 -137308 -41018 -37090 89510
21389 -223435 68129 -525347 -325307 -59982 -166122 -75868 47985 90130 -127619 -404117
21379 -404117 94027 -10519 286014 -16941 -310559 121052 279394 -318538 300336 -103685
21368 -111429 36661 -14910 -309415 176477 -32656 -175105 58188 -46008 -130781 -117393 -230692
21357 -230692 -386365 -275077 -100172 96717 79377 -160818 -238942 74770 214574 -9975 -88268
21346 -88268 117284 162114 84771 -113826 -201214 -434421 -142576 3219 -313958 -20955 -130875
21335 -130875 -136909 -358311 -42778 -30017 25199 91284 -356635 9121 -31262 -114492 -100472
21324 -100472 -134564 181292 -189094 -13677 465275 -50003 -125389 48385 -51217 135072 233841
21313 233841 339239 -425301 -246282 -175774 198578 -254323 314523 218399 -36106 -322487
21303 -322487 -20277 -105270 12493 -77440 126227 12260 111044 132120 174138 -399593 100936
21291 -21712 240039 -55105 8972 -72608 -99092 57550 113393 -361858 235786 -209195 1750
21279 69139 29442 78587 30488 43648 84851 -106724 -66406 -284487 153277 82619 -209137
21267 255069 158185 -16488 17505 8220 112786 -58650 -52856 188522 -5846 -217241 -18179
21255 14176 -31005 142622 -9613 108700 -173014 -120031 102626 -403279 -56882 76924 144183
21244 144183 1036 55164 140173 162144 -10265 94526 -54691 149555 -7176 -23522 -34283 88688
21231 -8258 63659 24115 -489963 7667 69590 -235203 -294862 5664 -33196 -28672 67380 -35374
21218 101349 -97857 -166661 -3403 -359527 -105041 -56978 -87591 156920 21035 39823 -66377
21206 -163958 169186 144380 7036 -49880 -208720 -275339 -73762 14374 -402022 -56454 -67073
21195 -67073 -196422 13271 121787 36808 -230914 -5648 -304650 -274593 -165550 -205696 -5376
21183 -206953 -117309 -58822 -183290 -134694 23757 -58443 -456044 -72080 -279313 -23824 -236206
21172 -236206 -116751 -224712 214197 256215 18306 -124452 66250 -218427 -64717 1980 -298089
21160 -228192 -85768 -258534 -191539 31529 24594 50087 154832 -90192 -459746 -223563 95838
21148 -101142 321595 -320834 79985 121566 -199028 -6127 -89529 -105115 29919 -202393 -83244
21136 41993 -49493 85274 -213870 -242064 -68762 -55659 -9355 -201215 124912 100700 -74599
21124 -34714 210506 -122889 -262188 -35237 -47364 -191053 -250 -359659 178345 -269061 41079
21112 -475696 -57164 7553 113168 -280072 81010 -271034 -144156 164928 -89290 -85849 48577
21100 -186892 -238263 115884 -151045 -129325 68116 -349363 -234319 334260 148788 -24017
21089 180898 -18489 170732 29190 160 44495 -55711 53604 -189283 -88016 -164842 -73734
21077 -83769 -317256 -10897 4520 -325202 -78945 -21766 -60736 387535 372970 -11585 -280316
21066 -280316 224877 130616 198217 -32583 -15300 -50854 134622 129079 -167021 -209741 97582
21054 158029 -8574 -47387 -16241 -1473 -395674 -52555 150753 -194918 10812 -228711 -36655
21042 55609 -160103 392327 36061 -109989 58441 -35064 -39351 -3630 -275979 -249199 -212699
21031 -212699 -212597 -107958 -106167 15369 -33598 80186 67966 300664 -166322 -115815 -121944 -34797
21018 -212161 237832 -61881 455401 -414446 -309701 45265 -30168 142158 -218996 -101602
21007 -216592 296243 237918 308616 177601 -89477 28588 -39012 138578 18929 -154712 195364
20995 197833 -123733 -41243 83816 61048 5378 -9449 -56179 -53705 -107166 54880 -382345 -58055
20982 -149236 -117728 -5358 -349670 57840 -55524 -313494 161582 197607 -76277 204500 -125111
20970 8889 -38228 -108541 199858 149716 -249008 6327 -90449 -97165 -40870 -266278 -3114 174475
20957 10858 -3292 -32984 -442884 220001 -157378 184470 -52507 2444 139521 44396 215150
20946 215150 -100321 2327 73233 361441 355324 158058 464170 34479 -52683 -260966 -6900
20934 -242615 72891 57147 -243493 76842 231424 1493 -28852 -43233 367914 -332560 -544120
20923 -544120 -164551 -408424 -194548 37663 173480 234498 99380 -293655 -48301 178149
20912 62363 -261810 70915 87329 -62691 -111538 314803 -113946 124841 -215607 -193999 -278873
20901 -278873 -271258 50858 139998 -147387 -128262 -27364 142198 -64442 -140124 -29094 -27530
20890 -27530 -60605 -49960 158584 214258 45977 -247879 -417636 -96020 -64554 -94249 -2603
20878 102488 -281743 73144 77595 -221111 56465 332576 -621589 160540 -202770 -23192
20867 -77104 319431 37295 -12701 108203 -103673 39169 -242349 74763 -386998 -109749
20856 -104270 3826 -31743 -106031 -2369 -163570 -326275 -154895 -52781 -96590 12720 654 137426
20844 137426 -347650 369909 -145066 51770 -146443 -218299 -279718 131779 80624 66466
20834 66466 -91299 -340231 95549 -253837 -306901 -193530 -100031 -96274 88400 -46316 -231057
20823 -231057 -72916 -140842 -164887 154316 -26764 -368720 68440 -117030 -12104 -61509 133423
20811 -162499 84710 -99318 -56896 -208390 -226830 -421402 -27185 69593 -93579 -39859 -159251
20800 -159251 131673 -204429 180471 -380694 299995 305307 -279235 -50318 -146933 -151586 -322829
20789 -322829 14039 -90268 -250583 130499 -230389 -2652 122944 15236 -49376 -291593 26191
20777 -112066 -199634 290480 203219 153967 -244716 -242011 240705 64073 94750 9537 -626063
20765 284258 -94757 -140079 -87786 -272379 74664 -296843 33954 -135162 -207795 -17865 -125861
20754 -125861 -48665 -377289 286376 -183196 -92986 -299046 -374296 13208 -114970 157015
20743 363834 42225 -179535 -410792 -91552 54524 135248 -141560 -333764 43886 -98067 100641
20731 -19496 -15585 -192985 -368732 12961 -546160 -409963 -84113 -35264 -201855 -68744 -70844
20720 -70844 -234268 118184 -65508 235113 245736 51607 -76634 51653 -285212 -216470 -200349
20709 -200349 33023 -299805 -237335 187972 52399 99265 1611 -62718 62334 -70285 317465
20697 -100926 -250503 69144 -98358 -597903 146809 -139428 -233373 -62465 -105783 144765
20686 20669 -301847 208946 -134227 -516645 -92036 -469515 320202 84724 -3689 -145375
20676 -145375 197533 -58677 275746 -143824 -106988 60498 88135 46021 24081 312049 100678
20664 -281727 -109330 -184828 -424396 154540 -74716 -42056 156839 248145 -121053 12128
20653 61598 -77772 254066 77525 -62526 -137037 -203125 107878 27802 -164921 -298891 -424048
20642 -424048 97634 -195128 -18540 -317645 106211 -216773 -166351 -213184 154957 2981 -251790
20630 -108739 -127548 569 -188544 -3968 -44686 64366 34040 -84492 -160200 -339250 -351242 -66771
20617 -124892 245641 -282226 127991 -163788 -188889 217179 -32430 -412727 -23991 -304790
20607 -304790 -108807 -182505 -3307 -273085 -166838 38630 21210 153769 -104183 -17891 -155594
20596 -155594 -134556 -214081 -232026 -1509 85413 -177253 531268 -262217 -59279 85708 251014
20585 251014 -358361 96834 131192 92495 451731 324103 -67566 -135421 49655 -203626 -98633
20573 228405 33304 -45360 21 -192932 -273788 -99828 -2574 -353728 -300612 -352027 513068 -73894
20560 -50901 30876 279444 47949 -205939 -246652 -268896 -92119 -330594 -121549 229932 64745
20548 -357083 -56601 -261748 115222 64810 334749 -114371 -414344 74792 -191238 -313612
20538 -313612 -91597 34142 -51130 63390 23337 -213711 -145993 -210356 -62861 -49727 122537
20526 -63465 -108235 274868 66408 -101390 -72694 -180013 -334905 -209255 -60321 -99341 10299
20514 393314 -22029 -195549 -36074 -155142 -258857 -101911 -57563 -25867 -255936 -45283
20503 -229020 374632 65591 -81109 209030 31787 -292881 -154550 35421 -107389 38938
20492 69455 27136 -95580 237157 -74273 26327 62592 -44459 105904 -240937 -447619 291101
20480 -426345 -227827 -308688 -245193 -209318 -94793 -141900 -27661 -232263 -96500 -103764 43086
20468 -108212 -24482 -258860 18978 163676 -175913 25350 279387 -57193 -141203 101010
20457 187394 26141 -32681 -239469 -100701 159792 -84930 -21958 -6416 165306 -273702 29986
20445 85394 -222465 -433855 -48558 85420 3346 78977 215338 99197 63509 -98936 -145869
20434 -145869 63699 241827 73491 -508801 -132263 149599 80586 -97265 -326291 -92170
20423 -292582 -125756 -271632 -278250 -148943 -139803 372620 -112345 -16630 103958 -267481
20412 -174486 214771 -35828 125963 -295735 -20876 196907 -105105 -160048 -45573 -67286
20402 -67286 -273951 -29513 -207743 111073 94754 26453 -43684 -22750 191816 -218234 78684
20390 -162386 -143704 -123293 -181066 123819 47266 51565 -169184 77459 -142132 -238164 221482
20378 -155281 -41192 -130885 42135 -78578 23158 -4521 148942 -10223 201901 87845 24443
20366 93428 99196 128669 370129 -210841 -99695 -220768 -16209 43672 44961 -311071 250532
20354 32703 -504054 -235085 -177215 -129356 330823 -383428 -103504 -152484 -37868 -26075 6749
20342 85136 -129273 89415 24576 -128121 -60084 -72916 -178255 -28102 -141357 -215315 -267648
20331 -267648 -104913 -53293 -160103 -372956 170190 -100614 49920 -254899 -165433 -180529
20321 -180529 30802 -729481 83684 -262371 239092 -267769 -215230 -45299 -50529 88812 -268781
20309 -462762 8440 -178415 88882 -55266 2969 75687 -171885 15461 -90163 26616 -321997
20297 -110742 46755 134225 -99777 142017 -77312 -82681 -193721 -98456 -148456 120327 -120448
20285 164452 -76350 -153697 -260743 58418 -87783 -8711 -125248 -139689 76923 -187006 -130584
20274 -130584 26783 -163788 -171434 -99904 206343 -116737 -13897 -41210 -182021 -351247 122422
20262 72439 -246691 -267531 -171339 -40348 -156096 81016 -54522 151811 107840 82303 -347293
20250 137934 -115523 -48212 32903 -387292 193323 254109 -150937 -315635 -199628 -224850
20240 -224850 -198558 120125 -51139 -321761 -293405 57904 -257275 -274367 -314490 -139702 43357
20228 -7650 117496 51166 49147 -155592 -21617 -57437 -164559 68637 50608 -152208 149750
20216 23285 -215615 -101107 145678 178219 -107280 -172315 45538 -196230 -110553 -210166 -151153
20205 -151153 26285 -16308 272124 351968 -412768 -24994 -297461 181322 -225838 -137694
20195 -137694 -10945 -161152 376490 -166475 258801 206663 175748 -57029 -213176 -5509 249287
20183 -84459 -292251 -513587 207366 -115623 -252335 -15442 -27512 -110851 236099 -306001
20172 -420854 -53643 -21848 469636 -7375 -143720 325711 36522 -260727 -83341 -375813 255481
20160 -37255 22225 44302 32486 -15055 207019 86645 77333 -155126 -3418 112492 115208 187705
20148 187705 188904 70960 650816 498178 323924 357407 320175 413340 431734 546439 444428
20137 444428 157882 605921 -37756 -75459 -110314 -28184 -215772 -114221 -63092 -85256 -187888
20126 -187888 -126276 -30621 -190374 303705 -60701 -97863 70998 281506 132059 -168409
20115 -88788 3827 90683 58305 -19790 -315196 -62166 -189857 153759 -106812 -87976 -113262
20104 -113262 226560 20469 -179505 -270154 -304761 209728 -142862 -316823 191649 28112
20093 109875 -63260 -54353 -90085 -279324 172977 -136121 -60539 -212014 -85 -476023 383275
20081 -355508 29987 -107620 22020 -386760 -56560 -149774 223460 -116360 238445 -180928
20070 -425992 -107186 146951 -387552 -189545 247904 6102 78721 -93727 -217592 -30338
20059 66824 -18394 -585360 126768 120381 -149081 -38760 211834 -183916 -99693 234792 -300802
20047 -122357 -13616 1760 125953 251594 -195443 -41498 97755 132791 -251442 -65672 -295498
20036 -295498 -88657 -53981 -41249 -139292 291325 -345776 -105933 -323901 -293894 284713
20025 391021 162349 -176487 -3617 81976 190184 42945 -14707 117175 -58885 -73182 92075
20013 -282322 -602799 -86035 -299319 267122 -310681 -47503 -366254 48661 -105349 42771
20002 -201784 67779 -126976 -439311 -2101 1365 211480 -82601 -157314 342776 186804 164669
19991 164669 147919 -142503 246746 -33810 184086 260073 151631 60590 573014 80929
19980 324106 -87542 -151477 -90929 198850 -225952 -236676 -179021 -81596 -22523 -174218 -73744
19968 -430217 208314 242083 -35119 112374 209657 501033 603333 321554 173170 -251071
19957 -73271 -59542 -199078 249705 -115388 410334 460958 210364 320670 148493 397761
19947 397761 -46483 -27559 -31591 68162 -131576 -310632 108606 -155515 7501 8860 -182196
19935 -11342 -106364 2564 -260596 378114 -22956 20100 -105282 -93237 -115323 20103 -25572
19923 -48094 -275657 -176376 -161454 -84662 148040 148886 194905 -78314 -208822 -162971 -98717
19912 -98717 -25780 -372114 -154679 -191137 -64721 -47572 29055 -32368 -55547 -227391 -179958
19901 -179958 -535842 137964 251794 -85814 16528 46166 324334 298562 123690 -242561
19890 -158977 288835 280254 96088 -278751 10693 109384 30499 -57836 -129718 -233237 94448
19878 -27428 -297092 -51679 -281645 -202440 141420 -325643 -156608 -61462 -165345 38301
19867 142797 -111414 -199761 -60076 -419474 138690 -20062 -69459 -28089 254483 20236 -199747
19855 -163819 -131509 -149963 -100829 63919 -182267 -302792 -88648 -294982 -185083 -118944 244768
19843 -167842 171889 -118297 -280276 -332405 89269 51496 70321 -154819 -13024 -198519
19833 -198519 95613 56854 44902 19120 -134897 -209320 71289 -536603 -235079 -130388 -278374
19822 -278374 105230 -142365 189778 44766 -400743 65773 184792 -214565 -131959 85852
19811 -79102 -131513 -107438 -169020 82050 278885 -131325 -283493 -69191 -356607 -41315 39778
19799 32737 9058 -330122 -237003 -287509 -97602 -1880 -227793 -50218 -159037 24880 66588
19788 66588 -185605 -104231 -357094 170184 34850 -117730 -117899 118544 -39911 -43546 -27347
19777 -27347 -157190 87252 -350229 43820 -161726 71522 -402432 64695 415156 -38917 -80235
19766 -80235 -44723 -244914 -131915 -138560 -432993 -238137 -126163 72299 -261650 81887 -176377
19754 -17752 90248 214694 5647 130974 268270 -26895 24692 -124444 -67474 -310025 59785
19742 -187742 -101152 179697 168877 243052 85200 283762 113111 -266117 328880 281476
19732 281476 263467 320898 664357 794763 476810 294111 -73583 236722 -140053 -15964
19721 -230235 -2624 10911 -10729 23811 149207 -24631 83839 -80721 -72237 27258 106884 -91805
19708 -121383 185723 290326 197803 151279 59231 -134524 332710 295154 90811 -161930
19697 466382 491872 326849 17793 3562 80815 -102342 -60026 -20542 165517 25417 -11723
19685 258950 10250 138348 -108179 -92870 123839 16378 -253889 331672 -236784 4089
19674 -325056 180067 -12082 -405267 11001 -387461 -90106 -217266 -137254 230689 -265108
19663 -126970 172437 -244873 -181593 -87572 -222307 -38407 -479 207234 137836 -10391 -171389
19652 -171389 99421 123685 136935 -159963 69222 -50954 113137 -114470 95824 -235226 1155
19640 256582 -103603 -69293 164034 -1811 94934 -344817 -114718 -33348 26331 -68393 -93935
19629 -93935 -81381 25768 -116359 6275 29517 -185104 -9440 -338095 181469 7768 -309894
19617 -268597 -124630 -151813 177053 100221 -243071 -48407 -276256 -169989 -108503 -81044
19607 -81044 -119838 -146175 -60059 -1455 -143657 32799 116550 137811 268978 -215075 -142738
19596 -142738 -267142 -53841 -189234 7569 -36033 -163428 -33203 -66223 -264400 48672 -233296
19584 32714 -220856 -69455 -7324 -3265 22971 -45159 101450 -48767 -331357 95791 229765
19573 229765 -4203 -119042 -17428 -240293 -194102 31456 -298749 253433 -209584 -327967
19563 -327967 281484 22318 -260356 -31776 -88244 -115641 69424 -199700 22831 -424200 -141258
19551 -388912 -28286 328528 7039 70551 -86377 107513 -68336 186329 -100718 -214185 -190765
19540 -190765 71704 -166606 -48737 254062 -394731 286196 93034 -96010 209372 -292639
19529 140867 -49309 -244412 193092 -49180 -113399 -210621 -112623 -61264 60782 208703 -279460
19517 124290 148663 -175418 195083 -74793 -25997 -275039 -8566 -234163 -23027 -37147 234096
19505 -73252 -272512 -260295 101164 2209 -274841 -1180 15824 62955 -190141 -388165 -290743
19494 -290743 144488 94546 32553 -32454 -10369 -68347 -104455 -284757 -218479 -366918 -257417
19483 -257417 159610 -36309 134614 -493490 -145168 -128362 -442862 67877 -85862 -29627
19472 346045 -265348 -83200 -138017 -254906 49404 -115059 60131 -94282 -29744 -218371 -8100
19460 37572 -207506 -247387 227837 -300123 -47294 47696 -249199 -87164 -43659 -225241 -173493
19449 -173493 -191564 -84833 -5454 -45789 -139932 21655 115418 -195581 -74078 -163158 168580
19437 -121104 -25289 -115409 368313 -132519 -150461 -320059 48792 118327 -229702 220870
19426 -120439 -17970 -3091 -377796 164623 -155029 -70988 -151060 -155498 35035 -357568 -68596
19414 -287807 -308498 188573 -324879 -221709 271802 -231044 -250869 -66301 -31524 19118
19403 -145077 -59017 -47384 -206918 -52484 -223293 -55908 -211834 -10397 110865 7177 80791
19392 80791 -256651 -509037 12702 -70437 51583 -110440 181270 -6426 -434661 -47104 -115321
19381 -115321 -6688 99103 -11883 -110236 -73135 -105055 -720 156588 149522 31771 -109255 28302
19368 71992 -50785 121421 -503947 168274 -276872 107834 -257154 -146061 317434 349920
19358 349920 -215343 -304118 49816 34650 200023 -299151 -36851 -121132 -199978 257830 -72961
19346 120730 -206803 -181580 148693 53371 87101 41437 297214 -198407 -224438 -154601 -159970
19335 -159970 91667 -307786 -295796 -144744 306820 -101410 -443047 145177 -196406 -26158
19324 -85743 239392 231848 -47105 -93049 -183710 -75411 -12407 27568 26379 -317443 -8003 250448
19311 20805 5543 313774 35140 83141 -170799 -232913 207167 10129 -89823 -180177 152663
19299 54777 127009 -201819 -241134 36395 46878 -22452 143562 -214193 -276395 -143257 54259
19287 40522 -149561 -216790 89916 364916 -230364 -61820 -289039 -204017 124036 210721 -224506
19275 -336436 40141 37248 -20199 -313474 -14074 -144805 -165793 -157213 -328103 100722 61908
19264 61908 -121599 135895 103133 -246533 -191989 116663 -108614 152254 -342255 -324873
19254 -324873 52 -90181 -316413 144238 -43943 73994 -225630 342560 -446351 30192 310510
19243 310510 -74031 66844 87840 -93885 34872 -343448 14110 -285783 -111925 -251510 -310963
19232 -310963 -201549 -30773 -109275 -274921 -445319 66866 18242 -122536 -100613 171069
19221 129555 76575 134999 77367 -182870 -148670 -209707 190500 -154019 -147495 -220757 -188456
19210 -188456 -148944 43313 -205905 -32619 5630 -162273 60615 13845 -196502 50464 366881
19199 366881 -346213 24763 33132 98338 -264058 -113585 -185614 -77751 210881 99290 252643
19188 252643 -154335 -24451 16840 -413381 213969 -244520 -123365 -172209 -97771 238570
19177 272753 -189594 136911 -169068 196385 -221254 -45649 -238151 -164011 204874 -149441
19166 -182946 -94944 -39449 -102508 -290394 -149324 -148649 -26366 -226988 129187 -80919 -345691
19155 -345691 10188 371721 325868 212201 -9272 15002 -294055 -36996 139791 67490 -30504
19143 -137172 70934 423258 -86998 -16535 43750 -27463 265857 -278824 155417 86907 -82931
19131 22337 -11694 20130 -136310 -176581 -123143 -181618 10120 360420 173255 -192971 80350
19119 -195468 233597 -98441 37362 -192655 -210426 -142972 -465861 -151168 -55365 -27407 -220991
19108 -220991 102251 -416779 26211 -26525 170914 186456 -302936 -288817 -70573 -297994
19098 -297994 -46946 -115113 -74973 9882 118504 -75893 198738 -124843 164844 -18795 9792
19086 49838 -152417 39156 -163076 -164915 -22559 -235256 -140788 -1427 223142 -12334 -200936
19075 -200936 -262247 -166695 -136273 -172848 -322028 270377 61513 24701 49351 -17028 154929
19063 -184764 -18396 -191728 -47125 18630 -150200 -67371 -103464 33365 -50988 -106420 62601
19051 46888 -153196 90712 -102600 154757 78477 -322231 -12242 -235221 19835 113240 87808
19040 87808 146750 183688 71919 -217236 -189874 -14376 -271540 -258679 -146632 300151 79294
19028 -270368 144221 132478 -37373 5803 -47761 -156661 -52259 -53717 320884 33478 -279811
19016 121706 109167 -82919 140058 -218839 -307945 133926 -73458 -58638 239847 -48141 -67509
19005 -67509 -118445 -25072 -84215 -27006 132652 59243 -47693 524890 -238486 -134571 161653
18993 -24011 162145 106226 -122134 -138399 -257613 -13346 -12546 15787 92172 21673 -376 -113776
18981 -113776 -415175 33295 -464953 -230204 71131 149580 -385336 196647 199907 377485
18971 377485 552649 556533 440128 58307 14445 -183812 -95026 51803 -157732 63787 -198976
18959 28758 81657 16599 -286794 57384 -326900 -156589 381597 10297 -67521 -279901 16391
18947 252429 98995 -53730 41561 -22445 -536441 -64433 -376077 -199704 35856 14230 -27845
18935 -71731 -229306 -3603 -282276 -318388 -153291 -238177 44054 135005 110639 118276 49213
18923 477210 53626 -149744 80641 -82869 97751 -18864 -168695 -167978 -41464 147970 228097
18912 228097 -58238 347746 -66530 -42797 204371 465572 524888 436338 250263 -331836
18901 -177596 -243243 -7458 -262821 -2541 -5282 120470 -23222 -115188 -241411 -115495 -204469
18890 -204469 21082 -332892 180801 -196992 -43159 112983 -292387 -196677 59013 105291
18880 105291 -29943 -69240 -7863 -115857 61239 -7663 -53368 -193225 -92837 162417 41462
18868 -442121 -445281 -71483 -16844 -30212 71030 -284644 46392 -69941 -74846 8939 -19771 -76504
18856 -76504 -116133 159475 362431 -88047 185883 -138976 107777 -183090 -303568 -66125
18845 -44960 26313 34692 164159 -163501 274845 129195 148048 -61006 -124973 90815 42137
18833 -103929 130303 -67884 -273721 245541 -196791 -259810 121718 -125456 -411866 -52810
18822 -181983 3645 -257341 53822 256345 2406 28465 61781 193976 -212439 -338270 67491
18810 27318 -213471 108038 134466 67214 21626 85307 68983 118447 192104 44462 -90555
18798 81014 -287069 82111 -247131 157983 -79384 -224011 178713 267726 23198 215410
18788 215410 57360 109206 -247667 -159690 -188214 85092 418925 161300 -168188 59805 59513
18777 59513 -53200 17656 10758 -94099 36339 67318 -62116 -54503 123991 87696 253331 -178916
18764 -60334 -207248 60136 40195 -241508 372725 -64563 -107917 47172 -218154 -136107 -278454
18753 -278454 -29718 -202043 -449335 -98625 -187775 54529 149243 -149895 -234257 277577 -278190
18741 163383 -178617 144083 71082 -417898 147859 -161084 -8328 -54102 -242483 51608
18730 -42704 13463 -63328 -162720 88884 33980 102451 -42625 47889 -175526 -288965 -346862
18719 -346862 -212780 -20911 -138264 53499 -94092 -70034 31718 110757 -80294 111950 -68022
18707 244231 -251685 -252106 272405 -443132 -236998 46331 259510 -68534 170612 -52553 162071
18695 217915 -70574 -198166 -264766 220259 -27409 156332 58911 69952 -234323 -72965 -46622
18684 -46622 -49866 -35005 4312 138383 -92358 146070 165657 -40882 239558 -394169 -80908
18672 -174368 -202960 -5879 220748 -368778 128894 65730 -133412 162158 -297008 -103260
18661 262541 -267893 -421252 38694 2756 -256971 -114940 -129171 -307600 -209966 68871 110743
18650 110743 87797 6971 -126575 -325676 -34136 38881 432343 -55068 63859 -12626 -131297
18639 -131297 48316 139963 -285321 213344 -236622 36046 -332275 -165625 261711 -149706
18628 -255057 118505 -120270 -297894 -86096 110948 -325219 -119587 94011 254768 4457
18617 185429 -129210 130582 229575 -278535 -353796 -273134 -341605 -250488 -163014 1006 27706
18606 27706 -48878 -94386 115968 -147966 -38563 63591 82499 -437347 -106923 -51606 -124400
18595 -124400 -309303 -289986 53106 87202 -107239 106694 106328 -63032 -148688 -234605 319273
18583 105008 -144333 174389 180607 -137171 45313 -260000 -64730 -31088 24470 254028 -105763
18571 -52852 -48579 -210797 -16649 71577 247759 -186977 -63153 298158 -534078 317606 -45941
18559 -277999 186715 10872 -234418 -65251 -119745 -334141 -51486 39202 44819 -20520 -139753
18548 -139753 -187370 154669 102617 144855 208599 -18860 -163927 -347107 28775 -409408 130890
18536 86050 -142930 -89800 207591 174848 -293032 62758 107785 -68067 -60213 -140847 76947
18524 202400 69044 -169275 -259151 -17536 -86144 -258701 204208 40111 -32317 -102127 -239617
18513 -239617 -163185 -45935 -6925 122969 -231873 -168960 -135027 32490 281592 -366950 184257
18501 -172688 41000 -388567 278954 107058 -465236 308600 96455 -65972 -270210 -349553
18491 -349553 59530 14425 65583 -40106 -173458 144598 27221 -172390 -72833 -74662 -123856
18480 -123856 27480 -70721 -211788 182481 -48293 -168331 -116702 -97414 -324083 35078 -328873
18468 -144370 -121788 -39075 -7040 30847 7023 -136996 -5334 -327734 107933 -235388 -126345
18457 -126345 9956 -188253 -198299 437288 -151722 8369 204545 -89052 -273118 192652 -44037
18445 93543 152504 -97397 -256463 -35961 -398478 -50386 269733 261342 231213 -9531 313953
18433 140021 269690 -388460 -384532 -125997 -131103 182783 -203125 -171875 -179121 398503 82554
18421 -225847 320846 44824 6804 342932 -67438 -144384 13922 -174899 169031 215262 108881
18410 108881 -255718 207870 -20729 -185957 22177 -2115 267141 -165708 321256 -349653
18399 27523 339738 59083 -8862 -20901 -161642 400609 -277062 315515 110424 161365 -305016
18387 -111563 94545 142184 180280 6515 155258 -249975 140160 110330 118322 -60842 87849
18375 -56124 -128191 278848 2322 21996 -74873 78939 -4878 -20344 -90922 94831 -389870 -140333
18362 37265 -154615 -77539 -322307 158632 -81496 91970 40508 45507 42454 -184174 -327008
18351 -327008 -196794 -87694 76479 -132844 150494 -583236 -110281 -1697 -4565 -99402 -136231
18340 -136231 -180130 200072 68001 117795 386596 -97872 108769 37802 196025 -209644
18329 1805 -115256 -304220 -196083 -23566 187533 129517 31462 90354 -270388 101094 -239195
18317 -140899 -8871 323488 -360444 36185 27308 -118585 -203990 -326723 -221559 -152525 -132325
18306 -132325 -250994 -129554 -5361 -206585 -207291 -56147 185991 16893 347629 -125247 -92281
18295 -92281 -275821 -262086 -18561 45981 90586 -27940 -144645 -51140 -71971 109354 84094
18284 84094 228798 -282 -48452 83010 -25934 -251446 -69245 -89127 -140505 -211368 -75560 30271
18271 21529 -119075 94680 36275 71484 -170566 -640 -223377 160615 -32787 -85134 50992
18259 -295350 60422 -388952 -315022 34190 -211583 -237183 250123 -68870 -11039 1393 -33641
18247 -324846 70928 -14938 -204465 22731 -378422 -48953 -277847 -200319 52454 -32076 133600
18235 -14885 78411 29734 -345361 -74265 -210639 -249620 -40121 69019 138270 484662 80277
18223 -230560 -96828 18977 87672 -137779 -200701 -396639 -61903 -205886 166171 -174410
18212 127656 -13163 -96456 293101 82502 -25917 -36366 -375878 66105 -209695 256486 -39607
18200 9799 43234 -42317 -103110 -213916 -45442 134617 -33449 337 -316101 -6601 124038 -154275
18187 127018 83324 -129825 -345510 -196277 -27092 4368 220853 -143717 -229973 -152889 -147374
18176 -147374 -57383 -126087 341164 -164880 -92239 485610 77307 95348 -281705 10160 -220491
18164 -345385 -131346 -16066 111423 -51676 -79527 184674 118186 -40180 -177915 51195 -154022
18152 -22017 -12126 -224800 129673 221493 -176509 -372502 173164 217052 -345410 -158948
18141 216769 -94992 -44527 16699 -339191 -608321 -1950 298134 -285922 -150192 -115226 26663
18129 1386 -97431 299746 -109084 -33771 341065 3456 -162964 -173615 -23659 -164853 -264604
18118 -264604 -329795 -161915 -89735 77239 -62958 -111007 56712 372831 42974 -107905 61303
18106 -387962 -48710 -120824 -89672 -119108 -271204 -117634 171181 142121 34112 -185934 87510
18094 -39979 -294587 -136718 352 -7455 -171680 126425 -74271 -1768 109855 45467 9194 59228
18082 59228 -100412 6209 -142823 289925 -8542 242311 -182596 80986 -281457 -225612 3492
18070 277095 503117 3202 378881 -146086 -293105 115348 -207240 187840 162200 123966
18060 123966 359802 50849 390295 29782 64716 -11972 21466 -174935 -22268 330782 12225
18048 -65277 -218933 -89569 -73312 -12144 -51352 25180 -110099 1136 275349 262593 -190342
18036 80789 -11730 137866 -304796 160102 -223301 45013 -2531 -227447 -57482 24760 -46258
18024 -214853 71226 95742 -19962 -3479 48167 -205577 158197 157339 89247 193336 1263 8645
18012 8645 -299165 76734 -9393 -157133 -134261 -7735 184151 -142846 144228 165639 217204
18001 217204 -9502 -59646 -41954 312172 -90426 -64836 -157281 71770 -190104 138827 124471
17990 124471 68439 -216447 -102091 88765 54802 -623520 -111240 -25660 162045 273309
17980 273309 -70141 -98599 -60021 -220052 -119240 -211194 -66416 -160614 371080 -12202 -239606
17969 -239606 52311 177842 -192354 350983 -282408 178074 -83887 34559 -67419 96827
17958 -135124 -344309 -117726 432624 -47852 331156 61901 15770 -7359 50269 -24765 26168
17946 -400854 -313025 67729 102592 -3507 146226 -83132 137801 -161454 -31905 209581 -51132
17934 -10785 84639 142245 99348 24664 -50120 -26196 4855 -28655 -111702 -28957 279152 -71231
17921 365046 -230964 -32433 -150134 317151 -6596 125801 -367532 -151489 -169352 61683
17910 -52491 107548 99327 -166163 -51419 17273 78536 164701 261385 225271 -184336 35363
17898 53518 34429 111024 -111938 165880 149120 -155976 433750 -39066 72280 92759 -168239
17886 -111165 5696 203649 -19769 52262 7974 148480 -83004 -287542 114986 98553 226351
17875 226351 -446004 -220280 -83771 88483 100076 45594 -24868 -320722 228120 43968 -67539
17863 12396 317138 308891 -85218 -335150 -524144 -20127 -138459 -138536 -408251 21795 1007 -33411
17850 64345 -205417 -235701 106325 463446 250300 168152 60384 -63450 97085 -115661 3108
17838 494 -207181 -62396 109636 134012 -121051 -50650 -141896 192079 -267348 315616 -86663
17826 120221 124944 54338 -97492 164883 126903 -17111 -33359 -30062 113162 22500 34868
17815 34868 31642 398358 -154257 292309 -331166 -271342 24198 480151 -75240 -305591 96308
17803 184563 131723 14118 46053 -29659 406245 137011 -280716 117874 933 -66075 -70391
17792 -70391 -88705 -87903 311639 -163148 170332 -54477 358056 244831 347222 122737 -257088
17780 116590 26223 24944 420979 -80077 -254665 140417 10838 123755 -31158 -151379 192949
17768 112883 24210 261234 -106011 179349 -57005 -6991 -70827 -87487 -43506 460416 166917
17756 -396542 181905 213032 40749 -87933 5412 63216 242363 31057 202842 111478 88857
17745 88857 105527 -251295 21625 204249 262895 337467 140395 11263 12927 192758 144173
17734 144173 327285 -111906 17350 340078 -6464 397324 45117 262391 154838 -8942 284326
17722 60487 248449 114269 175466 206012 -82588 -244576 88377 -154177 234565 -229492
17711 -4108 -148684 -218770 227057 40090 -120353 -406423 151145 297901 194519 185286 211921
17700 211921 119541 60355 336553 92725 14406 58747 111754 113626 40810 275001 -45234
17688 371628 419391 97883 -32080 -38898 253464 329677 217375 177453 438004 267793 186131
17677 186131 308127 -211778 229692 -319355 195345 178684 47507 1217 49767 -117017
17666 -28083 83437 14132 32354 163385 35034 332614 85029 201381 214455 -235600 163996
17654 -79806 13712 338878 -100413 351901 4580 -162681 359394 263753 221481 38784 126501
17643 126501 109511 94629 -88493 -38429 344862 181229 -269620 -57301 -8691 70212 -43722
17631 234498 54406 245102 218453 137231 138306 399730 275625 94654 188947 179046 102318
17620 102318 178170 122203 -77621 140606 -88056 -87096 172374 265883 113363 235797 70837
17608 104113 -191629 276385 448748 -466885 182327 1559 425077 275653 196894 164338
17598 164338 -96252 157938 300037 65087 100303 267848 265923 -56720 41659 19258 103251
17587 103251 -102563 -158777 -21451 133922 294117 5210 -57130 54654 48597 90677 394827
17576 394827 137699 133121 314106 -31846 -89411 -119676 -357547 10539 286949 141197 179885
17565 179885 366323 117355 213840 -21947 175577 120909 10903 178506 247752 -17109 543784
17553 149003 -235890 76814 -183628 -51090 203338 65764 64809 65426 -69867 60186 333334
17542 333334 539733 185554 167402 -19239 -27271 253434 437300 132239 216609 220049 292177
17531 292177 260226 -138620 324951 184279 394272 574443 737214 1099272 955345 1208332
17521 1208332 651285 383221 353505 601448 197283 462527 595688 231296 778989 714716
17511 714716 885671 737456 1541039 929031 854298 877431 708679 552867 431042 351831
17501 351831 419446 511542 96591 489525 303976 88059 366662 297354 332969 120907 486488
17490 486488 382028 170856 166692 538898 378144 317211 319610 334771 419456 201010 230732
17479 230732 113168 344710 432031 419734 204650 627681 314566 291020 17325 350327
17469 350327 660128 278214 297815 34224 326384 156512 194409 323496 606848 520108
17459 520108 358659 457895 367575 208405 537876 110515 324635 346337 214194 243440
17449 243440 381003 703911 -14431 526226 651156 641456 661654 374167 463775 358852
17439 358852 488281 372353 359260 95593 164943 433111 194587 503954 247153 195278
17429 195278 335328 482579 341901 198748 406598 432343 280441 250821 315754 605684
17419 605684 597980 773160 76314 280990 16951 403099 521178 271598 566981 721080
17409 721080 217534 650291 372790 533981 469288 367827 127388 323447 46836 127394
17399 127394 21715 35703 27313 648566 312703 135835 32610 366308 333751 217926 72446
17387 640106 204543 209074 214066 340186 773322 553836 444921 310861 163049 158738 313005
17376 313005 524568 326294 253513 108729 439099 292641 237017 206140 253945 323825
17366 323825 430668 411491 319766 411972 227374 300956 723485 181422 1506 -59546 262094
17354 1727 309318 374035 433804 259825 129825 222434 267603 417279 113720 228467 147780
17343 147780 204430 188745 132587 151414 422723 31915 411373 399819 562073 113436 376740
17332 376740 398728 414348 183916 503044 91704 161213 -80620 321189 388357 438528 266890
17321 266890 711680 3482 507893 358487 -43828 472581 299690 331762 134084 263051
17311 263051 130921 342915 742551 117868 196479 52078 -39806 554828 -79959 654621
17300 381176 655877 62723 494827 239088 391003 71130 -33362 157892 221726 149971
17290 149971 140622 258700 236907 456414 327823 342729 475263 46862 283348 471998
17280 471998 365541 372150 702143 76213 310155 555263 296370 568592 359413 291619
17270 291619 541061 498026 207671 149637 423590 376059 -176772 402548 441190 282657
17260 282657 186306 269653 657405 338795 391397 95072 662765 519528 457816 319661
17250 319661 516183 241935 245625 386723 161893 307587 202239 396152 340528 51707
17239 244575 381024 468656 586791 403325 446979 199562 7911 337121 459492 328395
17229 328395 629358 437093 271070 313757 212202 65364 271988 353360 370557 586050
17219 586050 569381 126026 490609 713195 315090 738920 141901 128815 493787 535926
17209 535926 578195 390398 118820 477834 480095 404859 192759 479479 358384 481759
17199 481759 588151 421475 819192 324717 432942 735740 545400 535084 358426 541053
17189 541053 259062 405248 513073 500139 358141 554540 458363 338137 562535 441030
17179 441030 774946 510712 691763 743502 669232 651647 539339 692923 467946 635325
17169 635325 531231 516849 405909 651454 419548 313171 640027 492240 397505 615845
17159 615845 777486 634499 368858 600288 499013 703780 493660 881420 488773 637361
17149 637361 478010 509722 468818 413169 537520 786275 204872 400495 247028 323793
17139 323793 716975 536984 303171 515777 238644 598233 406288 328679 664570 655864
17129 655864 729520 719233 661538 380992 500759 755779 596192 749287 895866 352642
17118 713569 769751 743849 600943 598643 750867 810722 523307 651659 820165 866232 675351
17107 675351 675388 530078 699043 541900 568679 694859 725406 480102 600804 772724 676069
17096 676069 536966 636602 355042 530960 572003 890985 802715 661003 770317 1129554
17086 1129554 709194 562773 525915 606084 777339 641296 558713 546518 642835 746471
17076 746471 833899 1038467 408094 910103 831515 582163 1105569 882827 1001850 802541
17066 802541 959406 893787 880879 921164 1219719 989469 788203 840610 899034 1041087
17056 1041087 570674 973480 754353 930119 1119454 1144842 839693 1280139 1205370 546424
17045 984839 1224864 1091362 1295451 918098 811372 1262219 1129279 1407703 813627 1105569
17035 1105569 1077133 1030989 1240084 983608 1061831 1166936 845230 741723 1279088 1277950
17025 1277950 1110279 953820 1279863 1100263 929642 1138587 1134723 1056773 1207653 1325939
17015 1325939 1123873 1038306 1246904 1124849 1025331 1467204 1264295 1094871 1279818 1550340
17005 1550340 1272120 1303572 1332608 1348594 1256107 1652731 1324946 1348149 1902038 1464486
16995 1464486 1629871 1253348 1296712 1508800 1396836 1276943 1609736 1526283 1253493 1243103
16985 1243103 1160300 1561789 1424465 1194515 1581645 1525884 1921500 1718069 1317204 1350896
16975 1350896 1523185 1664158 1608471 1679674 1544204 1152797 1574911 1378207 1679640 1657177
16965 1657177 1921301 1649216 1812787 1493244 1762430 1659607 1586380 1938259 1685869 1656494
16955 1656494 2017082 2129159 1888412 2228113 1874083 1720449 1805029 1763953 2287721 1997323
16945 1997323 1791056 2136621 2025006 2008231 1791905 2089119 2142126 2667947 2461301 2083590
16935 2083590 2354277 2122624 2019100 2464300 2384328 2296853 2206669 2435345 2232452 2335404
16925 2335404 2096218 2517874 2407509 2440421 2810891 2675929 3093662 2406423 2599361 2473688
16915 2473688 2917078 2278426 2713322 2615274 2759494 2641509 2689325 2821896 2611922 2857286
16905 2857286 3198006 2972833 3219465 2581070 3158620 3279154 2957599 3332953 3350106 3200896
16895 3200896 3273308 3332257 3368238 3367699 3627581 3439692 3325611 3314864 3660238 3707524 3487216
16884 3487216 3731331 3631795 4090225 3924482 4188119 4021038 3833031 4128136 4115401 4018252
16874 4018252 4205882 3994190 4130072 4453228 4588841 4291036 4708821 4411306 4499370 4827131
16864 4827131 4717435 4714023 4796055 4986148 4941798 4882373 5525708 5334690 5043859 5397480
16854 5397480 5385676 5980058 5518728 5876009 5754618 5778282 6319546 6234937 5833057 6468062
16844 6468062 6409347 6608676 6480825 6573325 6789729 6576471 7054068 7474917 7288886 7220824
16834 7220824 7407296 7478709 7560198 7957938 7886487 8095462 8199789 8176245 8230288 8651529
16824 8651529 8901093 8693553 8960415 9301558 9509800 9665046 9860316 9848203 10086308 10274460
16814 10274460 10607056 10952990 10989070 11394861 11524274 11485356 12038046 12204074 12337254 12754548
16804 12754548 13053443 13854995 13142052 13651081 13831068 14576926 14802815 15073926 15791370
16795 15791370 15958177 16224319 16550441 16959484 17335862 18038108 18241426 18669410 19288016
16786 19288016 19581931 20024029 20616713 21245007 21607640 22522126 22652926 23526143 24590096
16777 24590096 24842627 25924785 26563601 27404573 28342222 29227493 29701726 30857904 31089000
16768 31089000 32404750 33426678 34597797 35871385 36935025 38294542 39194977 40731997
16760 40731997 41976341 43753520 44723824 46404615 47781935 49619934 51398759 53393090
16752 53393090 54849979 56684696 58969437 60898528 63180549 65351484 67756009 70153046
16744 70153046 72409802 74972596 77523757 80138787 83009025 85405405 88165881 91027798
16736 91027798 93643573 96374188 99286685 102042132 104527589 106793287 109346632 111749187
16728 111749187 113806647 115664525 117364506 118471719 119902682 120806867 121660847 121588911
16720 121588911 121673692 121542472 120924916 120261167 119247616 117681095 115953585 114351998 112115754
16711 112115754 109716636 107561509 104805249 102586963 99457088 97089593 94269025 91237025
16703 91237025 88496052 85795356 83078370 80033370 77549782 74868671 72499204 69748057
16695 69748057 67338471 64808947 62831643 60445045 58498435 56580604 54311982 52552125
16687 52552125 50739740 49069170 47263033 45607997 43780125 42416289 41098310 39580625
16679 39580625 38677322 37226883 35782122 34864247 33771973 32770876 31419252 30855687
16671 30855687 29513690 28560054 28136147 26936840 25971372 25546727 24838150 23933127 23564221
16662 23564221 22824624 21834347 21300084 20890910 20269218 20039230 19311579 18996956 18074916
16653 18074916 18024503 17273991 17033819 16583958 16293729 15453492 15333791 15068094 14485187
16644 14485187 14212277 13975324 13535941 13382697 12966849 13125898 12384879 12282074 11723470
16635 11723470 11529989 11059314 11373934 10950576 10547939 10234972 10239600 9951053 9974645 9919251
16625 9919251 9410090 8865638 8923839 8967868 8889961 8520906 8349971 8480429 8104028 7996310
16615 7996310 7776932 7642152 7449498 7472585 7092868 7085450 6859114 6750421 6836853 6592129
16605 6592129 6540597 6679298 6481878 6214136 6084783 5940834 6141903 5942151 5760022 5691609
16595 5691609 5599992 5227552 5257278 5505296 5421361 5337943 5143177 5287075 5206691 4957294
16585 4957294 4398742 4488974 4727654 4525397 4552367 4189731 4318359 4077320 4235697 4243190
16575 4243190 3937103 4222204 3893250 4166055 3836552 3970912 3476718 3765353 3792059 3772926
16565 3772926 3725382 3236740 3551857 3286716 3886240 3512067 3199377 2965110 3426030 2873579
16555 2873579 3122048 3124278 2927772 3219933 2975297 3227967 3022088 2871201 2990271 2701427
16545 2701427 3043423 2764426 2474491 2482503 2723314 2498928 2515821 2570916 2576871 2749837
16535 2749837 2454883 2401634 2212538 2518601 2293755 2663745 2221045 2087379 2337221 2551001
16525 2551001 2255591 2285296 2339462 2063027 2368845 2207369 2190507 1784710 1856218 2033129
16515 2033129 1854753 2076775 1925401 2282945 1900018 2030903 1924985 1714339 2009909
16506 2009909 1732975 1521819 1749849 1789721 1600883 2105873 1638642 1941663 1772610 1504853
16496 1504853 1567859 1662214 1844371 1611076 1446597 1761229 1885442 1589347 1587509 1724057
16486 1724057 1679013 1312030 1722649 1591111 1470770 1489538 1359882 1728804 1555670 1437165
16476 1437165 1361238 1424477 1663486 1314144 1557355 1210490 1446259 1071071 1386741 1375547
16466 1375547 1480643 1362402 1315434 1150465 1312330 1459127 1242989 945141 1182125 1141690
16456 1141690 1331917 1052206 1565597 994258 1213415 1218410 1045417 1195803 1340686 1211273
16446 1211273 1001153 1096302 1016396 1143339 991418 772478 1115380 975261 1116598 1066596
16436 1066596 754407 1130916 1027260 1030154 934534 781187 494537 889932 739329 1101755
16426 1101755 812729 882453 711021 1048066 790574 876806 963045 803836 853389 968561
16416 968561 556112 944466 1130020 977831 877669 605604 647143 823646 838483 1007981
16406 1007981 609071 853996 971834 738915 818770 663249 1084985 1091480 618720 733482
16396 733482 619848 886152 933329 588883 918731 697035 1074178 359807 476181 536780
16386 536780 638902 543879 1069196 726732 610659 361681 651279 758171 726215 787864
16376 787864 276634 757276 606130 508515 576403 719802 835076 942625 611961 544878
16366 544878 585650 787274 357257 571149 557749 431303 628392 350168 723417 316619
16355 227323 496976 672284 904395 342033 420673 537050 401122 767510 266759 626084
16345 626084 597206 540593 773828 507281 577014 341974 511004 401445 764583 770519
16335 770519 688969 232391 573650 612738 618460 607096 310035 562429 417244 648772
16325 648772 526486 309317 705712 628517 183729 406729 177552 550942 319435 559356
16315 559356 454184 730029 604958 260274 365269 333494 571091 663988 492327 444952
16305 444952 510962 403447 497441 461275 348004 439082 587092 213495 345488 78727
16294 249831 476587 191491 518319 44284 485028 416841 464292 -144295 230479 660545
16284 660545 248097 458617 272437 459087 343770 576563 284739 143185 138435 629506
16274 629506 179907 460658 321809 523030 346301 85420 486700 336741 635389 391958
16264 391958 103097 250390 -19207 200814 287192 361787 196652 384312 388534 378727 291284
16253 291284 620120 208684 221855 409894 53045 347899 588338 419640 212297 50381
16242 328567 441973 195552 177064 211861 357738 379693 494421 443245 -10414 308855
16231 415460 498532 146352 311235 -12983 170207 325203 230611 367689 410714 259163
16221 259163 377118 351452 105161 253128 259246 132499 428253 -116758 153153 404681
16211 404681 114545 592885 282946 399375 128493 -102308 359577 35635 26702 -43738
16200 331515 205147 121492 385073 109955 75954 149772 109641 -43665 289217 340567 50492
16188 54397 394983 577958 -179671 231971 -29478 390679 6919 338662 320142 181308
16178 181308 36515 56897 375939 407551 198422 40249 -24505 40718 304222 -264388 40711
16166 205266 -94340 308557 -220083 232814 313174 95973 -30182 156640 161553 42382 324164
16155 324164 -14524 67342 436207 265567 61013 36328 -40043 198411 222208 265217 478400
16144 478400 -24033 -7725 -71883 162578 187766 269794 -8155 286516 314146 204241 -7019
16132 -54845 379328 188710 353707 83562 146419 48996 108145 -225593 253039 -109628
16121 266091 -110689 -126263 268240 124101 -19518 79406 29553 117160 -165420 87228 43972
16110 43972 135891 188193 -23572 60698 231956 220003 68312 -55769 110704 59436 209511
16099 209511 -233800 334511 282637 109411 -246716 82244 489964 -26899 173156 -28769
16088 -187201 197403 193375 6636 63856 96299 41706 71664 60038 287444 -236951 -218805
16077 -218805 72561 41561 195835 136617 188344 -131772 -125126 250985 164330 55501 -249828
16065 -140158 -78989 139807 -219771 119966 155605 229874 335725 105626 -99224 111020
16054 108887 -102291 78814 40838 -62611 81923 91209 -1313 133322 -18495 -115175 131625
16042 -209047 -48055 -123347 73726 14015 89534 317907 -213461 22961 76929 418413 -186636
16030 77530 24673 -84414 210280 -267152 118052 17339 53855 136344 -30145 41077 -140910
16018 294909 417582 193594 -187174 -134641 124760 -128097 -191903 -134793 -228612 159243
16007 46268 379083 211176 -123043 41220 270026 -128300 177279 -234859 -21733 39794
15996 203807 143067 151941 345507 343023 270918 423652 143727 551220 629149 511711 1087883
15985 1087883 1408338 1235282 1363128 554192 493255 311680 268930 238204 69920 4080
15974 24517 86477 -61140 468448 105609 -49950 -135207 353944 62972 127893 32645 129879
15963 129879 -163139 -180042 -310515 -82527 17686 -144106 58120 -309865 -180651 -177479 198286
15951 79686 -178140 99881 -22573 -210415 -407825 -213473 160982 -307438 194587 -94069
15940 -378178 28514 134212 71322 -47122 26115 -82977 206595 -259166 -269199 347085 287047
15929 287047 -343571 115985 -117006 30093 -260561 347165 299522 -34688 -134783 48494
15918 21844 165091 21722 154647 424415 -86090 -4039 120003 -38238 -483913 -181588 107918
15906 68155 -181094 142200 3241 -66770 -119670 164886 80816 14435 41223 96251 -111780
15894 -248793 67422 -35205 -20802 -16307 238305 -123128 105577 105805 7326 -57789 213716
15882 322386 -263161 56470 -322893 -403634 201976 -50478 -62791 -124769 85904 -98042 115048
15870 -28273 129664 -100450 41737 126799 -161263 -261762 -78023 110306 -118186 -29914
15859 354809 -194974 -295500 -239059 259890 -245550 -85670 85085 112387 18545 238951
15849 238951 -281222 38121 317649 -22072 -276947 22964 -211218 -134129 248399 85587
15838 -124790 -139354 54928 -54061 -77149 -282753 146937 -152215 -47573 116620 -157968
15827 43532 591109 5697 -42006 -78116 -85592 61536 37302 -375191 -315166 -337384 132157
15815 -285679 293858 145439 88614 -60208 265037 -7413 -164925 -204813 -51540 -66169 -107925
15804 -107925 -331864 17547 231331 -20889 -24672 -211030 282259 -110976 297848 144712
15793 -272333 228456 -246223 -149228 -159071 20084 -4406 30768 72691 -299642 9092 53323
15782 53323 176440 -199667 43808 -48563 57380 -189141 -86404 -236926 77854 22816 65256
15771 65256 -26914 -332795 42688 -165175 30171 -2565 255027 -137011 -134786 133005 -238116
15759 -223224 69419 -5181 64365 340477 401269 -42864 199050 -76529 -61865 96455 24431
15747 -143250 -174667 32854 -67741 127766 93900 -37385 93916 -62938 -195524 28905 96514
15736 96514 359958 -10002 -57248 -65332 279990 -123638 120524 63393 9968 -78571 39607
15724 -86173 -40071 239031 -55195 -153836 -18946 -33080 -108028 156017 -100465 186730 -143167
15712 -18977 159402 -63490 127248 -196360 137785 -10885 171173 193184 52932 157098
15702 157098 213601 -75410 -168733 302653 267450 -212190 -256705 -114402 -122400 141657 395596
15691 395596 -122169 177716 84082 -345935 29117 220234 193343 -14924 76070 -80899 -79183
15680 -79183 -212915 -226859 -36593 -394653 -68953 -24236 -114168 37787 67172 -89400 106837
15668 420238 -202680 -161156 45054 -295763 216839 -5260 -40081 -192892 -5932 -280692 -159226
15657 -159226 239426 -24460 -48896 -98159 244513 -215427 47522 227431 30245 -35258 -86960
15646 -86960 221930 -26728 1541 75234 -119069 160509 -158361 281735 -58713 -152197 -52654
15634 121485 16343 221240 -64527 38482 -64589 -253367 88935 105598 -22531 -14306 300958
15622 -24635 -45943 77758 -152144 -181464 -101731 -103229 -45382 -141000 143426 -134491 -155552
15611 -155552 -41445 253130 156985 258182 -9305 -131177 -81824 -93754 -197890 -181738 27057
15599 137210 -328047 116074 57830 208115 47965 -132154 317065 -51765 239097 157931
15589 157931 136949 -324709 -182883 207263 48474 -227455 -46529 28126 -64767 -32107 -94227
15578 -94227 208420 -13435 -231382 -211722 -168422 39146 79311 -54008 44233 -105922 -711669
15567 -711669 158010 73040 155639 -176785 16094 -25772 468366 59465 94545 95095 281850
15556 281850 -144203 43516 -294500 -29856 -61794 -119836 46089 99859 62229 5552 241534
15545 241534 33888 -190949 -128913 -165014 23757 -292171 -83385 32165 -124741 -25850 64622
15533 24844 78615 292284 126091 -11951 254927 44875 166312 131611 29798 21029 76798
15522 76798 88251 -338994 298863 -244574 90954 165108 82498 11195 -148527 46195 -18160
15510 48860 208644 264567 81827 110500 363542 224353 153432 -83050 363590 353595 218823
15499 218823 6398 125087 257269 235225 132266 431042 10407 64356 80922 182654 388523
15488 388523 -14983 -42013 371142 139398 -124969 -156474 412606 -72470 180470 92796
15478 92796 434559 149798 -33661 423564 698491 364019 1010692 465665 356439 116688
15467 299741 -55595 137522 -23523 22775 2409 82494 235683 39139 45559 204401 301871
15456 301871 296513 96813 13408 155605 307202 -521576 -198492 -40725 -182923 30950 -166886
15444 198434 420914 470253 738243 962434 1237166 1028141 754150 432438 94998 376651
15434 376651 114429 57595 143432 262525 1856 177674 144472 21781 31218 21688 281235
15423 281235 -78359 -38919 -75420 242329 343510 -69222 145834 -294437 143485 111286
15413 111286 57371 181453 -32152 -88206 -69037 71753 -137111 -146570 51527 -298247 217627
15401 -381639 97523 13282 -48378 178094 11436 -48478 115629 -208000 -129973 -211567 124370
15389 -112871 -2636 176875 42625 -303423 -61766 -89491 52062 222309 -87601 164179 280796
15378 280796 -262221 196189 296893 407932 -160323 164953 -121451 591013 163498 -52143
15367 -16241 28153 -141141 29994 -73250 134219 127453 503962 504271 187012 379579 157636
15355 757053 452834 384567 601188 54369 -14556 114859 311886 255919 73268 164773 9214
15343 289938 253067 117675 387256 428721 286835 271451 59475 211665 442140 131294
15332 -153603 -129141 117879 128603 390274 67013 339603 183626 -65474 174105 333217
15322 333217 209292 -18694 76830 274455 -285651 -84005 124890 136683 -143551 224795
15311 312575 396680 -28081 -221682 217728 56397 266513 229991 -106058 112159 174134
15301 174134 66754 266702 143874 86225 -119816 -286624 188694 -72081 120527 266742
15291 266742 151532 -149018 115088 106233 39818 78891 -95980 282770 -127150 98951 67417
15280 67417 20671 264875 -97740 -65594 327457 -67378 104929 144761 108021 44538 -254328
15268 -22596 20560 324463 -205595 326655 133906 128425 74544 251802 -6756 -80269 72015
15256 -227806 285158 22961 -129276 168655 -40393 -51590 111191 229757 227491 72224 51429
15245 51429 -474 378636 447424 1258224 2162118 1501285 1950568 1747335 218188 420006
15235 420006 150840 -241003 18003 187140 36619 265777 194750 52635 129328 155578 276381
15224 276381 75994 321224 53386 -32612 155406 17835 -98559 157144 -19983 -147755 158071
15212 375811 -51408 -169485 397512 110889 360606 -329807 233426 -31352 312499 -264891
15201 -118609 295578 -346860 164478 -50504 207167 -281934 12724 100031 397862 167077
15190 -204269 -34982 -54592 233662 131588 72684 253948 139791 262195 -166112 415663
15179 7028 2054 176308 31053 -132719 67841 42279 316426 63126 184806 -75270 -30052
15167 -81351 56835 155368 -23238 -148818 -143915 146672 11194 -61407 -150467 48427 498471
15156 498471 131492 75942 357429 -196483 41054 191915 171438 208052 7286 -83925 245871
15144 224958 321006 328359 -79362 -5101 -169570 -89894 92244 55581 25408 425425 297161
15133 297161 145229 44286 258914 383879 211138 -81087 350583 113448 -131352 255743
15122 220722 416609 214834 331010 454387 846383 162328 324312 386073 -160388 348410
15111 34726 285671 357785 221781 79402 -100789 242776 120528 234314 97532 15302
15100 220933 -106439 265406 65402 300650 103529 125584 158465 151521 391995 25661 -86359
15088 142446 285617 -181338 -100825 -92617 219048 -102272 311781 121295 248686 373839
15078 373839 -24885 75036 -14454 121858 -13164 207239 20145 104434 302473 371253 307407
15067 307407 160408 111771 92366 -6724 -152241 198434 57183 -7229 289237 440795 -19328
15055 336043 491552 131120 186822 432560 317148 104745 620417 240683 401095 341611
15045 341611 578987 198286 288375 348557 313739 563425 153964 607737 556684 334340
15035 334340 382373 -23476 184592 394354 443263 867604 540823 996598 517962 510048
15025 510048 261974 444039 251955 354755 496710 635650 463354 451902 685481 369301
15015 369301 403644 485331 506749 382405 375959 259509 568324 360193 446545 503387 180133
15003 429206 377915 421240 462105 634842 522414 463145 555407 387247 649069 339384
14993 339384 387161 401501 273309 576599 245423 7955 448339 546288 481024 291892 561040
14982 561040 979656 1187563 648165 770310 763215 493612 757057 641129 720988 502862
14972 502862 416522 450711 681215 386342 81307 459834 624765 599913 230418 75980
14961 304940 198525 530290 589188 558218 504683 381624 232194 535395 415258 313600
14951 313600 635078 713209 627784 695431 -91798 293638 347355 751288 372928 807495
14941 807495 586216 402261 614558 493941 589865 486005 908869 641887 619642 518135
14931 518135 889225 826321 1267858 1323686 1169167 1582409 1523750 1742613 1447785 1519571
14921 1519571 1364851 1589113 1428453 1865029 1823610 2589864 2288308 1844008 1672726 1075439
14911 1075439 1205319 1091040 658951 597567 372795 430255 400725 693826 390215 373755
14901 373755 118891 467287 436115 357680 305746 573978 627419 410553 253975 598421
14891 598421 316296 188226 129820 415174 863832 653379 670522 993401 1160070 982131
14881 982131 922231 847815 1174534 903211 821308 777885 483475 614638 587730 793683
14871 793683 394080 275105 882512 750774 979105 624573 767054 1050520 601480 778635
14861 778635 331989 494463 466015 262187 254491 709654 513188 448460 537514 489237 78610
14849 422542 588560 178458 765833 851415 585691 718184 1282803 1114143 1247978 1264210
14839 1264210 967242 1270082 1128105 871664 629342 794058 656493 311060 494810
14830 494810 710950 672462 462139 268595 592154 614884 704408 687449 826655 435879
14820 435879 647820 490859 566588 665042 568749 1059972 851637 488764 955345 774427
14810 774427 600560 821280 726032 1046091 1066093 1200495 947501 1002385 892141 892772 553261
14799 553261 613133 285745 408053 777031 644228 590002 493400 627395 346682 328834
14789 328834 285847 503825 667877 738943 799893 576370 778686 610696 693542 727611
14779 727611 869389 940777 987182 1201587 1001727 1204361 762607 759239 1231391 755732
14769 755732 824453 562010 547067 647540 783716 687925 762064 487473 625200 920496
14759 920496 949911 620778 582770 592992 333846 359855 641410 365428 545486 477094
14749 477094 804340 624839 744310 668619 802440 563242 466765 680601 487605 746284
14739 746284 484639 406237 750049 790618 998919 1306278 1089292 850716 1309418 1315903
14729 1315903 1162743 1711795 2044989 2023787 1850194 1329326 1270086 1064013 1277164 1110059
14719 1110059 891079 909576 715034 795238 879536 963897 895242 772868 939173 1031195
14709 1031195 694334 920996 1017598 1223782 1297516 1566961 1543382 1376902 2249508 2010742
14699 2010742 1802035 1457884 1291111 1361600 1046017 1010243 1102421 699371 1031061 861218
14689 861218 1293736 969694 1096615 837982 823000 851530 1236448 1131033 863691 872361
14679 872361 1139861 1081361 956348 836208 1113428 937787 787359 1090547 1105673 1007686
14669 1007686 1093817 1067341 957494 1270299 1144559 942151 1008024 886602 1367902 803573
14659 803573 1391582 1048490 1475287 1202205 1209269 1104251 1143362 1486333 1320649 1617934
14649 1617934 1331563 1439160 1215253 1296613 1213731 1261108 1068641 1335791 1120152 1430851
14639 1430851 1180715 1385883 1228407 1221347 1158470 1085002 1389990 1109298 1409503 1092941
14629 1092941 1521854 1565378 1553626 1073233 1213163 1484067 1318327 1398836 1528031 1332938
14619 1332938 1353184 1523278 1360552 1421856 1593363 1584815 1075026 1579858 1288955 1396238
14609 1396238 1858433 1695214 1438812 1546082 1535117 1633840 1509295 1869991 1663977 1445508
14599 1445508 1803644 1628927 1602143 1732405 1649237 1769746 1522610 1903921 1740707 2011832
14589 2011832 1692585 1790235 1872723 1527793 1606462 1860620 1690392 2019094 2003666 1841913
14579 1841913 1612777 2169987 1959969 2085326 1785331 1848860 1936923 2012474 2165067 2017272
14569 2017272 2141897 2425596 2460678 1892936 2279848 2476455 2057632 2596568 2320455 2312904
14559 2312904 2916789 2291933 2776489 3317555 3238851 3233021 3898548 4159857 4522796 5478511
14549 5478511 7325271 11835249 20156699 40410442 50709888 19489389 7973916 4900399
14541 4900399 3182042 3088628 2890714 3686784 5496787 4736176 2726430 2347330 2197404
14532 2197404 2160533 2380931 2262158 2234928 2276487 2192679 2461430 2656302 2219903 2677494
14522 2677494 2429428 2557294 2479398 2598554 2249440 2882816 2526610 2576339 2761419 2714551
14512 2714551 2862300 2621072 2753223 2857310 2841907 3101555 2884591 2861366 3269422 3165647
14502 3165647 3099578 2962028 3429397 3438927 3137936 3342894 3156944 3170638 3141543 2865216
14492 2865216 3597295 3595221 3506605 3371424 3521117 3852123 3766835 3788188 3472813 3546100
14482 3546100 3926768 3775973 3791053 3828390 3740370 4321913 3969638 4077257 4256788 4139037
14472 4139037 4559976 4716172 4235413 4568166 4176667 4599936 4752408 4315740 4708014
14463 4708014 4590923 4579912 4508246 4954002 5078458 4909520 4899173 5332645 4789561 5200400
14453 5200400 5056685 5388140 5498465 5380500 5287894 5376945 5826097 5787859 6006003 5978036
14443 5978036 6072143 6116694 5795327 5840838 6306871 6432038 6159596 6531288 6203944 6617626
14433 6617626 6505768 6852907 6884485 7206958 7011761 7342566 7695376 7558716 7760571 7800544
14423 7800544 7751054 8141509 8410750 8219363 8910460 8668504 8774636 8801633 8823216 8957734
14413 8957734 8897094 9274015 9456277 9534259 9431018 9591351 10033252 10003435 10287744 10566149
14403 10566149 10803917 10605261 10663294 10500261 10826926 11329468 11378139 11563118 11713322 12021836
14393 12021836 11852287 12179270 12354688 12729182 13157873 13277608 13304896 13743849 13755546 14313429
14383 14313429 14429414 14910085 15434635 15586141 15614983 15720623 15956263 16482308 16474330 17107834
14373 17107834 17384661 17901407 17934968 18602131 18702509 19231041 20066262 20213894 20896094
14364 20896094 20622516 21394475 21681681 22030842 22256581 23131397 23361785 24640882 24702989
14355 24702989 25032008 25978569 26528682 27300237 27540136 28478722 28876398 30211054 30407832
14346 30407832 31163445 32255455 33225275 34171735 34977647 36032496 36860270 37743405 38561799
14337 38561799 39560671 41266533 42182749 43237254 44741704 46063666 47417947 49233693
14329 49233693 50555128 52197416 53982696 55346327 57427001 59783986 61621066 63965669
14321 63965669 65966432 68648600 70747894 73576846 76081237 78967992 81764197 84989231
14313 84989231 88282833 92057045 95799263 99774138 103756793 108116800 113112590 118144267
14305 118144267 123187273 128733971 134595649 141104024 147761699 154888582 162549315 170311022
14297 170311022 178921444 187963290 197167072 207320320 217547277 228879554 240838043
14290 240838043 253152301 266289227 279541701 293600481 308408205 323441505 339362361
14283 339362361 355234815 371094979 386818866 402513795 417976153 432708536 446364953
14276 446364953 458654268 469524484 477479381 481652117 481965095 480480522 478819533 479445632
14268 479445632 472687363 465020125 456580958 446637456 436237836 423144336 409426397
14261 409426397 394271514 378403897 362036763 345521126 329009630 312910354 297375619
14254 297375619 282289770 268472887 254465681 241430541 228913195 217266323 207006040
14247 207006040 198236527 188313038 178749062 170491121 162415550 154576769 147338902 140193446
14239 140193446 134478526 128306222 123023294 117539512 112133374 107369162 102944255 98856574
14231 98856574 95592450 91618965 87855590 84366042 81036302 78024185 75048382 72424382
14223 72424382 69863136 67371647 65128566 63182496 60621877 58634303 56799023 54987196
14215 54987196 53347586 51901537 50159839 48551163 46943324 45873653 44394866 43209143
14207 43209143 42503907 41489152 39651480 38886884 37469715 36755028 35392264 35405335 33742821
14198 33742821 32867136 31929013 31288561 30604203 30063561 29086891 28403559 27994080 27242681
14189 27242681 26529741 25527792 25147631 24870100 23896188 23623841 22498867 22603390 22027356
14180 22027356 21472876 20877763 20254498 19856591 19737303 19518761 18845390 18657178 18086724
14171 18086724 17910918 17284242 17029407 16856890 16470399 16175983 16106923 15527087 15301290
14162 15301290 15075071 14819847 14891733 14410300 14085375 13786295 13827759 13300126 13096456 12930431
14152 12930431 12584957 12237914 12574689 12085322 12046027 12098676 11632974 11321636 11329532 10854881
14142 10854881 10879316 10524440 10749909 10435503 10245291 10112330 10007257 9779802 9707629 9725807
14132 9725807 9504592 9381636 9100076 8886150 8868510 8975828 8866217 8434567 8409163 8171878
14122 8171878 8414033 8136886 8072219 7796186 7857646 7883900 7954242 7297226 7518546 7346722
14112 7346722 6977583 7136307 7067779 7079330 6930175 6832000 6551121 6255778 6661837 6561265
14102 6561265 6130254 6346880 6295696 6059147 6057954 5991114 5839330 5906896 5778031 5877408
14092 5877408 5742771 5789704 5519659 5346715 5881538 5122023 5349377 5130889 5245177 5108366
14082 5108366 5064943 4648384 4905775 5075226 4875253 4771670 4705812 4753254 5074378 4876683
14072 4876683 4526192 4860131 4394300 4397011 4159719 4202813 4459212 4351874 4267961 4097644
14062 4097644 4079133 4262907 4227806 4322797 4492142 4150852 4054253 4357912 3753018 3785604
14052 3785604 3725240 3764092 3724970 3758847 3850401 3756388 3281800 3239218 3385688 3401583 3533083
14041 3533083 3427392 3417395 3519748 3333772 3296894 3658324 3084669 3072475 3181064 3126048
14031 3126048 3283618 3399287 3088936 3198096 3039597 3234354 2692453 3193712 2853206
14022 2853206 2810911 2771151 2541690 2594934 2978446 2441575 2453987 2688687 2610354 2636266
14012 2636266 2376885 2365301 2477913 2469140 2468912 2280215 2069412 2472274 2414626 2249697 1967863
14001 1967863 2109691 2376330 2310938 2581029 2117306 2214144 2143951 2125439 1939656 2117085
13991 2117085 2355285 2289819 3282771 5701614 12343990 30657157 52806179 28263150
13983 28263150 13577688 9016003 6155561 5033721 4245679 3901051 3360535 3130292
13975 3130292 3418713 2897324 2456403 2816077 2666442 2850993 2211734 2328084 2594944
13966 2594944 2146399 2287589 2448794 2415331 2286049 2451664 2489986 2151416 2181323 2396790
13956 2396790 2270048 1880069 1884018 2081913 2036669 1972028 1828630 2158263 2163685 1748239
13946 1748239 1718502 1755469 2106390 1893699 1815304 1953715 1849061 1711487 2033248 1841079
13936 1841079 1334407 1523074 1617587 1605977 1832342 1790162 1373300 1963827 1813060 1691011
13926 1691011 2102316 1576699 1743293 1722846 1725770 1595221 1325222 1688198 1740592 1656305
13916 1656305 1777560 1615991 1600995 1444861 1456238 1312285 1486171 1649976 1310320 1344283
13906 1344283 1644203 1550132 1529718 1353096 1612901 1307643 1142352 1174610 1308019 1499184
13896 1499184 1286607 1557583 1385314 1242609 1520677 1232364 1436180 1540624 1494543 1514524
13886 1514524 1358733 1314952 1182576 1227929 878267 1339412 1380791 1125696 1086661 1376062
13876 1376062 1384751 1380172 1187386 1441235 1144957 1315774 958661 1187625 974433 1316991
13866 1316991 914699 1075472 1132967 1024960 858092 1296315 1176688 1055918 1064098 1319124
13856 1319124 669459 1001798 966158 676076 1231635 938950 887331 1082028 1290575 1348550
13846 1348550 931077 1304152 895068 1255819 977438 1108117 1149402 747396 901923 1071397
13836 1071397 1206573 914276 743356 1051891 719907 1010294 873736 945478 915334 996895
13826 996895 661980 1076578 808596 745587 1057110 983963 886546 643342 1117666 939602
13816 939602 882237 811746 941255 966235 865168 841656 694425 646449 855221 1228414
13806 1228414 698331 758550 812390 945845 766478 770574 768386 972109 604506 633706 886306
13795 886306 934739 971720 759841 684888 831268 842090 998940 959814 817547 863616 819112
13784 819112 748615 273385 534506 600364 889625 719984 692364 947362 1057720 590115
13774 590115 440876 739453 928326 836291 308332 442134 725720 691238 724994 707920
13764 707920 696811 677728 525881 739129 765263 761207 514463 756466 461208 653818
13754 653818 968010 636756 817800 617713 379796 772818 514671 506588 562167 608172
13744 608172 804544 760723 534580 449842 536168 744425 596200 533751 491191 753525
13734 753525 808028 644503 424724 779874 691446 292685 791994 573103 638399 799253
13724 799253 811609 496946 605290 684810 669480 512453 388123 416353 488128 431464 502526
13713 502526 909600 565784 701753 470247 297354 346455 745853 677435 940085 443170
13702 586935 518857 784721 493110 498421 298627 669838 318595 489989 459549 368788
13692 368788 418598 572675 233617 347920 739369 543458 305826 232384 809471 647221
13682 647221 562215 443760 606921 496390 571264 436195 539322 308001 521238 525675
13672 525675 411625 788986 413564 378172 524052 285151 575024 -35547 607886 523192
13662 523192 812093 204604 614095 345088 250448 192903 626878 646441 706104 678126
13652 678126 179339 286869 601467 366806 456972 665618 484900 272510 373681 386645
13642 386645 526877 377548 517139 404553 415931 741418 350833 711555 261772 342744
13632 342744 287509 366594 310497 396473 214844 494451 775270 636451 371424 414471
13622 414471 290038 362321 510323 290230 175614 609687 457502 338690 591593 622829
13612 622829 380616 270228 303332 600125 474029 -25420 356121 324520 234153 405707
13602 405707 725910 406329 217939 327228 112560 354277 -19188 366715 454668 532247
13592 532247 341520 -154876 103640 330839 440306 433617 358812 234103 463957 324623
13582 324623 670273 599788 305458 134155 651786 413772 219980 -119633 476338 91457
13571 381317 406284 276516 192817 267677 220741 291811 211477 398772 445609 439282 190948
13559 362181 380603 464460 305597 299374 393272 560796 73753 363087 310551 299371 223545
13548 223545 293830 287771 231485 29589 452251 427234 269228 464321 741684 662467 382376
13537 382376 418614 -110065 137022 -125190 277391 273748 416956 531108 196717 315507
13527 315507 482326 144471 126706 608687 375195 231078 111114 224043 -93151 176283
13516 442630 732204 440896 452335 302829 333961 188144 406886 -21411 254080 477671
13506 477671 34094 307766 222538 202298 71604 202351 284340 90900 153759 407604 159510
13494 426548 27225 265401 161394 221583 405072 53684 124449 372994 361046 -103832
13483 461541 184122 200813 118415 123384 242590 68469 219935 902221 582666 145556
13472 441926 91970 368879 399325 369586 14341 50785 376233 45943 295467 153053 68003
13460 598694 345767 236900 24280 197613 231027 297869 -3404 110447 322792 259121 -198614
13448 262354 250218 513853 337040 173049 263347 138671 -13127 14852 282926 425818
13438 425818 175589 -126133 161826 299572 335394 240802 196443 131390 133506 192223 75382
13426 608635 494222 86066 149736 332325 -76172 131041 166858 264489 370204 311516 164923
13415 164923 38128 594512 94648 394606 388030 568703 191638 -23984 253370 252157 280213
13404 280213 106179 192135 318994 62685 19516 4157 213527 294393 75372 112958 316629
13393 316629 -215482 145786 65688 28299 99220 307123 461558 -61440 162777 190575
13383 190575 75466 420612 140303 43634 33019 85617 75688 -5186 625800 193991 245695
13372 245695 248907 -39753 369944 37063 135924 208344 321423 149037 305004 422386 287495
13361 287495 173796 503334 333439 244878 42599 268007 253498 416786 176241 1187
13350 144550 210166 221422 127363 83075 112793 15078 192310 472220 390430 367713 242737
13339 242737 69761 111235 706643 395191 479269 161318 507710 149715 377159 140663
13328 78082 203995 -49201 633611 645252 227858 251691 381061 -61085 332101 102745
13317 240428 296957 71538 18579 -33460 446477 266157 -39378 32569 480287 171290 108536
13306 108536 302672 -30431 605348 441806 151624 165306 170194 163634 208965 158695 160418
13295 160418 340879 58794 -38923 249150 268298 145967 84507 486971 333178 189091
13285 189091 -167916 -37252 181320 71376 430271 510343 320543 322183 119082 189195 -43541
13273 117424 27403 -48393 214206 158389 324962 367483 114000 73369 -19388 67788 156028
13262 156028 352065 139256 -243510 45966 -258639 -34064 -217333 272374 441219 -16733
13251 -120056 148492 9708 211904 293430 108310 202261 151774 -41264 288331 55064 -57043
13239 6203 146493 29810 159669 -254687 137209 152301 389639 220130 -15211 -132352
13229 -132352 53834 164621 -59897 -123264 300436 26981 287884 -231896 114987 220443
13219 220443 -146228 -42769 274047 128095 12142 65942 181569 58274 232743 71841
13208 161601 117227 53250 -34060 -32423 162126 139312 201125 322574 -22818 112427 191523
13197 191523 396132 -83595 4034 204876 -25370 263125 172955 83539 219904 -308137 419529
13185 115648 5273 -104624 99184 -54332 -174257 -178615 89273 209934 357587 237218 -39987
13173 -41369 45520 -85005 72183 419894 231803 -24605 -131031 7020 -79277 53118 230493
13162 230493 306554 220886 4952 -213548 -356351 8969 63231 167966 50406 -113445 -146438
13151 -146438 -201453 -50746 240912 -77553 -39850 -133591 271046 -21123 -4233 243420 -196037
13139 61702 -301791 19621 280418 121531 -93763 -80876 213079 123945 -82959 193533 -69613
13127 -242041 -181550 -30238 85346 201206 25315 -109741 -31899 99109 165740 38906 -146277
13115 -212049 -260070 184939 259203 51493 -191045 288532 58435 -49139 511450 355944
13105 355944 44338 184330 126613 258306 209329 142559 462570 165098 -22757 130220
13094 60613 9870 156546 469211 -17581 187133 249022 -194403 -28037 10376 -224094 -46150
13082 228759 -77438 252164 -92255 184065 75478 205308 23213 6886 -113760 -118843 -315921
13071 -315921 -97314 -17491 -146567 136137 431041 -41478 -84791 57338 137018 273321 143571
13060 143571 196096 9319 139786 150924 101616 289360 -23279 -55048 389913 37742 107007
13049 107007 -266046 299872 184473 127669 -978 270646 80070 -33741 14624 -415782 -119515
13037 48029 137948 -151908 389080 -106264 228549 -73717 -117015 67823 336803 254659 71457
13025 199559 -108614 112155 256381 288218 -96872 -115453 -54276 55989 146965 -83788 -185975
13014 -185975 53558 328062 -13633 265998 44104 125757 57248 308486 134839 490814
13004 490814 220442 -109904 150884 -184811 -296829 35225 211929 223511 366825 42641
12993 -45014 374064 -44185 -256558 81700 -147001 13161 124891 153674 177797 113928 -232447
12981 41828 300998 -37301 -21392 58556 351372 -250561 84045 -18065 33595 74580 187629
12970 187629 126980 -37222 -113718 31780 -127958 134137 16537 -103998 -190530 14906 -115643
12958 -29431 122111 257022 -33076 174830 -54335 25201 18022 189196 312612 122660 169829
12947 169829 38737 -68779 -20686 -231839 947 241929 247699 108209 363121 -108549 96730
12935 118896 115278 61246 -419118 -247922 113557 159369 -95376 60054 130790 173319 362927
12924 362927 105025 10586 230743 -219913 -49553 22878 -157175 -4834 -61932 204364 -54146
12912 -74351 -120157 170514 72374 194412 -161430 216234 132524 20614 259414 159441 -135075
12900 -307396 23970 380720 185376 -44399 201259 389915 39934 138934 88679 7913 34311
12889 34311 172043 132540 -220461 240346 253156 -313369 -76505 45234 99535 15369 -83152
12877 328145 -222708 253129 -183840 -32007 -56815 30375 93112 -72822 188699 190071 -49971
12865 -332091 171587 -70468 -31944 296294 -203448 -121716 165414 449004 -34256 -46560
12855 -46560 -35393 97638 6637 202211 -112885 -179223 319530 45382 -152141 207592 -203459
12843 -132834 -224886 6670 35446 -66571 -30031 -498210 113043 -85561 168750 -16107 190636
12831 116395 92160 -112118 66200 -287862 -325509 -248600 -70762 -134227 -129400 184133 108377
12820 108377 32941 84803 9062 -150499 129533 19085 -156094 270761 102914 124166 -121414
12808 67761 -226685 177257 -152267 264112 -273486 92359 69904 -177194 160255 -148493
12797 -5700 309703 -14264 -41188 123128 55075 -74333 35777 357397 95759 -8194 13743
12785 -324236 -84608 -145798 -26251 -90709 -88649 -161093 90915 -86176 -57856 65100 -49539 -51722
12773 -51722 -2827 41980 -180927 -120776 24978 40498 -163021 -326051 186016 270528 -125410
12761 86556 28484 -256622 -77022 -143300 12320 -144497 21060 -359481 167042 -2687 85727
12749 -106802 -75604 -68463 163986 -134212 -4429 113448 -49901 -251103 -74340 -36879 178447
12737 -54090 -102581 3722 362688 201891 209476 19290 193384 457771 226093 -33157 11433
12725 -27378 91285 118475 -114919 -223328 -224206 328194 -253294 233 59501 -91131 244424
12713 109228 -161069 106046 -201464 111687 39907 122500 -51581 216495 -168669 148489
12702 545844 -123911 -97266 -24620 73464 141155 176178 156834 3793 107731 104724 251696
12691 251696 110461 68029 68079 139652 78125 -344222 -106679 -88541 378323 69399 127224
12680 127224 -8881 20727 16238 56447 17126 -16248 209078 37575 -165115 11208 -60842
12668 -213498 176779 92484 76209 325348 32193 301104 366089 -124479 111462 120963 348586
12657 348586 -42754 43038 115557 291683 177119 244502 394565 38741 393831 -185971
12646 -118169 103078 -36080 -2768 222210 108576 37778 -176642 264887 -20186 16687 291369
12635 291369 216158 280655 154138 -13640 -94096 3079 296660 -101734 312986 273269 -212942
12623 233811 -161739 -213456 133089 274931 -46676 7754 -189663 230343 297984 180817
12613 180817 -438859 -104380 -176636 73447 103818 401437 88023 95580 84749 41997 -104750
12601 64263 -272792 218129 247205 49668 12306 90268 250475 -81099 257751 -3175 12257
12589 79036 -139660 -98252 -69754 -215239 240180 40707 26357 44875 -53956 161529 226973
12578 226973 175098 -173882 -224476 131747 359776 -67343 -143501 73522 182216 112112 -66502
12566 -339962 -74020 6263 2519 -54190 -120238 79201 -63955 -148827 361898 66782 29126 -37081
12553 75788 -167587 -200940 -18019 127878 -54856 104446 -106069 22167 244221 55741 5205
12541 -53266 124728 -14025 -89220 -51563 364594 -192390 -327482 -150814 4350 -14111 182232
12529 -121508 166435 -221478 -218950 181998 173960 -63359 71767 -149096 -40205 -30119 -168443
12518 -168443 -200212 192441 53294 23018 -198552 -338741 55033 -301187 -156879 53558
12507 20509 10961 -198072 186505 112798 174714 228772 382599 70166 19134 178859 172837
12496 172837 -53043 -25960 -106368 -261944 -35178 77221 -85328 -96917 247826 -107333 -73590
12485 -73590 241299 131487 -71545 -46502 29472 134268 -177704 -67372 395407 142708
12474 64825 188338 -46728 270200 97600 48177 40917 193009 -246903 -234876 -124199 124921
12462 76421 -215687 17669 -74003 -156346 -157434 108095 379847 51602 -48912 193287 62008
12450 220834 10515 73689 201230 -163675 191870 92507 168380 77924 246299 -139110
12439 101986 -90908 -240495 -261387 -198398 -23741 -227526 -182842 147024 -78758 123918 18239
12427 -167771 -107836 102303 -107116 1162 12332 220479 482 75177 -359288 -12064 -170066
12416 -170066 -132731 -48542 -157096 184790 -90809 -61120 13635 548605 -62987 -56653 -70498
12405 -70498 141442 241347 163681 -64321 27165 184788 -303284 -286629 90248 -92503 129460
12393 -126901 -17734 -57308 -110495 81779 -22208 136500 161828 104239 56888 74488 -188619
12381 34112 -146277 -69078 -60961 66865 182849 27556 183229 -108433 74548 243421 -119736
12369 134981 134971 184509 28129 -42942 -106403 -160050 -133485 -84538 -198838 146457 7445 180579
12357 180579 216432 -147069 6397 -340720 -208037 -225619 138376 252011 -440826 72806
12346 -116836 100504 -146225 96789 -40096 165064 -114623 257462 35286 183765 -248913
12335 94039 156450 -132525 -121415 118018 225343 -6170 -266258 107011 294174 233460 30082
12323 14324 40695 134287 -117655 381913 381556 292063 81364 269006 -198085 300602 -341448
12311 318215 206779 394131 -84571 330306 365757 -240956 244830 62484 -70870 -27291
12300 -18870 265676 -22200 -61738 203800 161453 -76612 -61689 130029 -47508 -81158 -126897
12289 -126897 -96453 99405 324440 -30931 75235 669 -144001 86283 216103 290048 -154120
12277 27066 -4099 188016 88586 272047 196995 140282 98675 152558 35156 256921 358529
12266 358529 310810 291177 -3895 84284 381536 161940 15876 -197407 -4277 65698 149932
12255 149932 15295 282161 192354 103930 39108 401146 -70123 60572 352967 285248 347412
12244 347412 136901 700088 -21527 36193 -13834 32318 313894 -68079 219015 -126825
12233 7817 45594 -63397 186334 116058 266604 85061 252376 -3748 212181 -36122 242418
12221 441354 548558 460544 314404 416044 450640 448156 268065 356553 215204 454311
12211 454311 174195 95375 25509 218878 103347 371107 146318 -9897 -245803 300114
12200 531024 -189731 289576 385808 517909 355401 9288 248263 -55391 75276 349361
12190 349361 264095 149328 421037 374696 110693 268373 94115 69085 296552 181398
12180 181398 -11343 104019 -394385 40766 55197 411621 6789 160377 27202 520621 105345
12168 349263 489660 308182 587115 29575 258654 361177 265142 315661 -60999 216996
12157 14808 300104 615903 171450 331757 76429 91511 283906 315904 10274 33276 99144
12146 99144 -263988 285507 9263 3169 249016 -32435 124973 -170019 139859 196060 19027
12134 320480 75349 123522 105012 -85221 -217301 61207 146 303449 128004 96751 103564
12123 103564 53983 -31202 102692 261505 20556 16309 298384 111768 26415 281029 232151
12112 232151 283960 208783 292097 91601 247520 304564 -139450 141631 -219575 71635 81988
12101 81988 82437 132280 502704 122169 191674 192992 94188 238813 203337 -148819 141410
12089 305079 97576 82847 -656 271532 28957 537071 174720 90995 130378 222264 -58553
12077 -189261 161002 444464 227996 -71288 134315 169312 51537 -279088 277705 21762
12066 116026 61916 392318 259360 -49605 37826 -134171 358529 283821 72246 77217 -180129
12054 -165980 75109 194202 104078 399841 -105818 -37333 -127081 -88378 -321451 -77041 -251611
12043 -251611 -160371 309655 182040 116500 25419 -66074 -42953 -127399 99107 4097 -139601
12031 266810 168056 57999 435 -31480 161026 -268027 -8042 164692 -75815 -131860 -85240
12020 -85240 -360493 138769 -60455 53776 147173 -241638 -231205 -83007 -51198 117913 228547
12009 228547 34606 103196 -159977 83643 80689 411672 257052 -103076 184648 -185032
11998 329564 346508 144438 -171748 97584 -386525 -30184 324901 466524 99879 100133 -113129
11986 -60847 42898 175765 -156819 -48991 -71690 14966 82231 -225422 -307161 -29460 -164883
11975 -164883 -342407 290370 -91036 -117838 104003 -114793 14187 -142119 -65782 -245988
11965 -245988 -33175 -94775 -28086 -293402 -186241 54858 224576 -189250 187305 88151
11954 -18917 -218990 138651 -99832 -10268 -211436 430960 -132234 5870 -132587 -350296
11944 -350296 -126370 -36597 56333 179122 12566 155509 -215235 57686 75520 215732
11934 215732 22152 -418576 329375 -140465 -56558 76601 162618 -135643 42520 320891
11924 320891 82965 -234413 147825 132944 -214074 26339 146371 -154778 -309337 -156979
11914 -156979 -83068 -79583 -384 52236 -371271 -25748 91091 8764 2450 -18416 -20535 -53643
11902 -53643 -240064 -23452 -69184 231828 74943 -334566 -247421 -106013 -201244 -73837 -150033
11891 -150033 -130657 67145 58979 70618 -188379 55110 188816 -190512 154645 -55026 -465
11879 -114179 -145644 -83114 197697 -174480 -43271 165751 -236959 -216835 -77993 -208038
11869 -208038 278825 -139710 149968 -89323 -149210 20514 52227 -238561 56419 -326188
11858 -279836 -363819 -88001 227528 231932 -288579 -178116 -62724 -316117 329816 -117001
11847 -218695 199284 13408 -81900 29505 162755 -125017 -59812 -31441 -36740 -115168 173571
11835 -397826 -366942 -319815 134260 14663 193489 -119084 -222208 -117877 185624 146967
11825 146967 -179681 -151428 -130978 16513 78026 62113 -31098 -53659 54166 -6616 -390306
11814 -390306 383786 201968 -105715 161367 -79390 145871 101112 -422585 137904 -249905
11803 -53857 10931 -146565 -59219 -42747 -151670 -144125 -437151 -306527 -38607 -12702 -105498
11792 -105498 -219928 -86142 319077 -63541 138640 -384747 109503 -61398 -166394 -230956
11782 -230956 131270 22259 125421 -260385 -26110 2803 27388 -61722 -111576 -267439 7532
11770 -50121 -107053 -143926 -266842 -131108 83547 121870 -35310 227012 65063 81003 -302279
11758 -283261 260640 -197183 188687 -93303 256305 229533 -281219 145302 -68325 -144925
11748 -144925 89675 -292447 140756 199958 87122 120031 325542 209218 -32475 -70357 75234
11736 251774 -82860 -334486 -56019 23090 -37486 -48722 83251 123405 -32916 -156293 256872
11724 -233468 -87043 -404584 -74111 83073 8759 39930 -22550 -161158 -124255 375877 -36259
11712 -371246 344290 -115909 343713 -37522 -87649 -97473 57674 57492 179299 37479 7763
11700 -9528 159831 -559594 58450 74197 120860 201674 -391913 253842 -69789 11937 -34248
11688 -35508 -62489 -69669 -60942 -77647 160839 -13791 230771 94413 -55324 -54494 120058 75756
11676 75756 294502 -134483 261030 58720 49328 -42680 -48371 -393112 78189 -30514 112163
11664 180789 16051 112542 132133 6419 -214733 -260466 5711 -93886 207837 102878 113806
11653 113806 -10689 -205089 -136018 301802 -30063 104350 -19248 21346 -55551 -69998 136815
11641 147748 -181838 -281313 119913 71411 110694 134462 -175940 -61237 106764 -176506
11630 100125 -340226 120567 10842 340281 302024 -1909 362454 215427 113129 32434
11619 153167 218161 -20985 18527 -42862 -141417 -244798 8161 -130472 -1709 -226210 174832
11607 210356 314594 -226600 -127713 -113902 -305932 149029 132838 254810 131166 -421896
11596 -121836 112626 93029 106492 277345 -29116 -160270 240771 225567 170239 148347 -57837
11584 -293579 36011 180574 -215194 202735 -19548 62421 166798 -86761 126634 -129532
11573 79673 166516 -174442 -275904 99162 -126343 -31757 153093 245703 -63551 157622 -247752
11561 -126917 -89287 121383 -94625 -80115 -17316 865 -239336 44250 79748 -106189 -59648
11550 -59648 -219743 -70469 -54337 -39310 -3822 454774 -159162 60101 -105238 -214773 110787
11538 405916 141173 292391 263096 105429 115041 206962 140855 285619 102432 -19457 -345074
11527 -345074 92519 -230210 148143 277169 -69960 245870 68168 -182313 -183736 -62251 9731
11515 -23019 150835 160517 117300 212476 -126096 102192 396870 552269 95660 -66659 292806
11503 59910 -22004 -134072 312353 -26799 300465 -62114 389022 -102777 44527 136812 110402
11492 110402 342593 253491 -307017 197711 184456 45558 215128 201756 -31284 -51056 346743
11480 48351 198222 215494 139784 272527 549820 -224247 206409 195395 120516 146132 370340
11469 370340 278941 14298 52954 293681 581780 -203209 -23584 283551 269163 259041 156678
11458 156678 27915 229770 158135 43137 -81773 234091 43979 108638 291833 -90864 50611
11446 -148620 -20093 234243 -263913 -148036 125663 -56975 284422 151727 -72807 21968
11435 162111 95206 -220204 154959 367586 73419 263449 -126648 148457 -219167 34030
11424 174784 -321319 -130448 87997 281717 117155 61723 228771 -78759 -279205 20668
11413 -227216 -418929 -12163 -168874 -122861 -339015 -240803 126642 121644 -214080 -428849
11403 -428849 129634 45130 18991 178672 -152026 412360 73206 332765 -58430 443626
11392 -90999 19388 -63598 -7234 -189842 -95849 -257979 43244 308758 128787 229932 -114566
11380 849 -61270 -29091 -262414 -23113 -91537 -239312 227147 -226075 -103593 -30264 163896
11368 -181259 220021 -89506 -68413 164163 -96385 6093 -303 157730 77612 -134693 122986
11356 292248 -45910 -119443 -292702 376856 -217919 -3887 -201307 -162010 264894 1814 47489
11345 47489 -90456 528619 -269567 47021 -257990 -393029 294817 -178469 -204314 -379353
11335 -379353 85800 -57170 -16221 -53753 83222 -73430 -208938 -185272 -172026 -327329 108
11323 -196017 124708 -78814 71462 4548 129943 59524 -315808 177863 33170 116121 -129899
11311 -131087 67409 -120973 -104077 -96738 101108 85679 -88131 52878 -33609 -273013 -60745
11299 -79255 36103 -24792 -358880 140451 35806 289210 -300716 -197088 55791 -193257
11288 214349 -333719 -142665 -83016 240408 -111947 42349 3519 -9552 140859 88249 -240819
11276 -272395 108277 56036 71972 -220731 90469 117990 -31620 -90871 -24285 246143 -115220
11264 131214 73867 -105881 43719 11258 -108353 -327180 -100555 261946 -147351 68790
11253 120994 -40779 211743 277140 -415885 -253141 -227607 -72618 409090 -144625 106936
11242 36375 -45024 -9956 -24145 87750 157482 -91153 31383 -156986 153007 -54192 34775
11230 208882 -209679 76336 -18450 -175370 -284945 -21208 27414 46731 -151823 -125431 -108265
11219 -108265 244106 256122 121393 2694 80927 174457 -165214 -140090 -298457 -293446 -60574
11207 -59040 -419887 228681 -287091 -176371 387818 30576 -269567 68666 27232 199681
11197 199681 -57769 -4131 136380 53161 29051 -67635 -70695 -183917 -80965 -100321 -72787
11186 -72787 -231871 -217301 -202872 21628 -91050 163096 136502 -99630 -54848 192523 117069
11175 117069 -88821 -41900 7279 83502 -144944 127147 -55240 75247 -61847 -257710 -36561
11163 186063 -167664 -143613 -210412 140869 -391374 -29332 -151922 -272432 -177398 -289183
11153 -289183 -353579 200615 -207148 21504 176612 -85107 230681 60808 -98707 67368 89666
11142 89666 -220857 191373 -182497 48629 -91203 -71173 -236671 168903 20770 -252060
11131 170137 -58837 20172 -62410 232087 169234 -289013 -170166 314704 177912 -382216
11120 -98193 40629 -144929 -72332 -59698 -23849 84132 -82218 158198 52481 109902 191135
11109 191135 -500 291485 -118100 297058 -425611 -76014 -10542 272653 135829 286694
11099 286694 13125 70444 194411 120798 -11775 267032 303686 127062 254388 31680 533893
11088 533893 99507 369802 290557 -149078 265651 470791 247250 317312 515985 299271
11078 299271 55772 178581 268665 -11971 273584 210091 354645 283223 319573 471567 554987
11067 554987 -27274 306307 584755 320363 605254 803123 693274 199299 359412 375229
11057 375229 751695 718743 557380 840316 421899 957550 462318 801976 687137 751282
11047 751282 905081 876121 1180385 1043019 718101 1120088 874941 1106802 1156748 1022028
11037 1022028 1057678 837250 736047 976984 857589 969266 796803 594675 701078 864146
11027 864146 734916 946981 837991 1031335 1235608 1001538 870105 860755 1101456 1004294
11017 1004294 1065270 1268668 1213221 663709 643825 695445 761999 790602 538841 746489
11007 746489 760546 743346 721375 771615 865549 699635 708248 383177 681355 882026 1124978
10996 1124978 730629 796329 597526 632824 805455 654218 848683 761852 766264 861308
10986 861308 818543 1028219 878390 894674 1129827 851784 1520713 952230 1312228 1136831
10976 1136831 1365301 1521550 1570800 1800003 2131773 2119896 2688804 3056640 3223171 3085593
10966 3085593 3369862 3415005 3248533 3529638 2768509 2191504 2463478 2120155 1780132 1745062
10956 1745062 1884812 1905012 1565129 1523547 1519357 1547289 1201889 1552637 1230711 1185757
10946 1185757 797032 463344 383333 499175 198290 742858 191318 534858 447161 -40483
10935 392928 -80850 -105964 -155958 81703 129187 95700 175019 275176 -159004 73895 291354
10924 291354 290225 -6087 169825 54251 -256293 -116467 373977 -61785 -93206 -21803 52324
10912 -51542 -20744 38078 -219476 -120250 -21813 71785 -63511 -16878 -189521 -259100 159385
10900 60497 59228 -176074 -169193 -158563 177807 -258321 -136680 153162 82547 109495 54032
10888 51413 -38365 -366644 -7139 -361227 -91130 128617 -175387 -236141 12927 -162896 -234337
10877 -234337 -7798 -344659 -233397 -36743 -70560 -62352 -140176 -240332 -357729 -70284 18945
10865 -248472 23590 -38035 -296669 -188855 -53724 97727 -96347 -61864 121633 -125668 106728
10853 -261792 57480 -7581 -82448 -89303 -2326 186689 -127337 -122104 -67179 -214329 216669
10841 154434 -142823 -204245 154051 -119113 -206374 91259 -47525 -100054 -201488 15571 101230
10830 101230 26050 238837 66752 -297217 -79786 -171817 -72564 63109 -160998 148662 50989
10818 -209768 221425 140374 154219 -74473 -48402 366165 -32344 -354951 -163261 135165
10807 78003 -288295 158899 197495 -218306 -407080 392740 -222985 -166327 -157720 61598 -97584
10795 -305603 233317 297965 -207739 -90787 -121691 6977 193910 77270 -119974 -141250 49651
10783 -84044 -477236 312171 -87471 149736 -198808 89198 25648 -60274 15938 -361458 173786
10771 140579 9198 49054 -66548 -28359 157771 -35083 49588 -13680 -37618 177757 86800
10759 -180916 81673 -10158 -28711 -365747 -92793 69633 -117532 -216536 -45473 -3362 -161919
10748 -161919 -108141 -23008 -564555 -67905 -244360 -90400 -123253 325169 23494 -125132 -33338
10736 236893 144530 188953 128993 84004 -359011 32548 -92280 280629 335407 -87070 149444
10724 -121112 65041 -32218 -205763 -187253 132589 -13794 -59531 -72764 -88568 -33094 -111297
10713 -111297 50768 -164723 -207516 149555 -322729 168823 235028 184467 32100 -177132
10702 -196350 -320537 -358810 107478 -35176 -176113 -161667 -184653 14059 -189376 144065
10691 36957 108668 -405465 145437 153697 227221 198384 -173796 -133366 340587 -319513 59601
10679 104050 -165109 36627 -202773 -177545 -184107 -472575 -34134 27928 -140618 106666 229485
10668 229485 447648 85407 -266954 -53734 -184766 -124927 -24114 -227568 -216318 33741 118535
10657 118535 -202338 316866 -133657 -100815 1067 148724 -89638 -79200 -284342 -569356
10647 -569356 -149209 5663 -14633 169493 -52548 -232615 -11399 -170480 -19172 -240736 -83896
10635 -169389 -68636 452344 -368887 -335518 -140404 143856 176567 43611 -143900 -516984
10625 -516984 -17573 18588 93606 -159381 -156885 148999 -95686 254736 46803 54962 39117
10614 39117 -153720 136455 -32656 19703 -58086 80672 -127286 71114 58737 278952 255955
10603 255955 -464437 -345929 22371 249887 -62734 55433 -123674 -440931 -105876 80855
10592 307150 -46512 44417 -4263 159919 -196608 110555 -2936 91037 -341222 -205503 -143150
10581 -143150 -140310 53373 -55149 -57754 -200150 195454 -154464 181553 -93426 24480 -75643
10569 119047 -111548 -17948 -341882 1475 -183447 -78089 -252268 -157157 -113885 54346 -48059
10557 -158700 61477 -83445 276112 52860 123207 -112510 230248 -30425 -89815 66676 -677990
10545 -86075 -145514 192482 -52274 -192131 -203570 -70452 -235189 -204694 -2921 -87142 128214
10533 351230 221293 84563 67462 -192708 -247575 -193093 -257625 204117 -95187 46147 -248818
10521 -366161 -91275 -424327 259223 -148904 250115 185682 -212290 -114746 -119750 -36750 -250597
10510 -250597 -71430 -29852 15221 -31091 196904 172923 384780 -178343 -320583 -166210
10500 -166210 310091 76304 -421962 -173433 30511 -276456 111473 -53568 17298 1643 -155764
10488 -66227 -58300 -139907 292943 -488999 -90981 -53571 -93390 207829 -100355 124121 -52944
10476 -55763 341281 99577 412426 375663 522242 335374 -197684 314545 159344 158335
10466 158335 151264 -11229 40075 -68259 -201069 238218 120423 111399 38419 -132638 91689
10454 -568458 267403 -75689 -123254 -40599 174519 -335401 59827 147087 -151219 51784 -7540
10442 -242463 -386971 -208448 177721 -25904 330397 111476 69738 6204 -214935 106491
10431 118696 -182787 -380867 -88240 -75804 -71965 251823 -616400 -11971 -243792 -20066 -322218
10420 -322218 163127 123631 -74881 -16697 -96194 -49980 17316 -181 -157500 -322779 -65189
10408 104358 -381880 -56159 -103050 -239220 -220302 -244705 119189 24376 -47973 223049 -59635
10396 167493 -221208 -171168 23287 -238574 535650 44445 -103603 151720 230493 49042
10385 33485 127677 -129903 -91641 232286 -158567 -79756 75333 -116379 101046 145319 278975
10374 278975 183551 146729 289144 -19268 486034 -30970 262198 256732 341653 718831 391982
10363 391982 830685 494607 500118 131405 575824 465496 97925 78922 611277 299389
10352 524739 475955 178841 277491 283795 343345 464338 685574 485052 348018 459398
10342 459398 440689 521777 160103 428498 115027 388600 239735 229388 -42275 314685
10331 -55078 385119 274094 15123 -133652 390635 -125439 111896 -64945 -30124 161603
10320 260566 320773 -29435 481862 346536 40866 138427 -20557 -116502 -169103 -22143 132656
10308 129349 98776 -253377 -161502 -350866 -285627 204681 -106757 133695 -244148 -93365
10297 141182 -13634 -45836 4741 98422 -36119 -55772 -40062 -38856 -76124 30539 -133135 -184862
10285 -184862 -130931 -42701 -232281 -107428 -76516 -207245 94289 -47680 -175951 -340735
10275 -340735 -250804 29207 -412023 52587 -115672 -282116 267586 -400 150470 88128 144308
10264 144308 178711 -78635 -19101 -377501 200734 41616 149828 -5206 -95453 184287 -68601
10252 220456 380741 -56040 334484 18906 -36836 377963 48031 232772 -398243 -38896
10241 153426 15888 -66082 -39135 255372 -81103 -78316 27072 19062 101132 -172773 -242652
10230 -242652 -197430 -388194 -29460 -84446 -152715 327956 149987 -74651 21450 -21176 -176776
10219 -176776 269090 -44376 -115713 -96863 -183070 -130537 113714 151580 68315 -135773 -189731
10208 -189731 -163569 62197 -269476 141333 -17489 -72844 64930 1418 48592 -120418 -145742
10197 -145742 197098 -77735 -273634 -115919 -7330 -155508 -188281 396707 152940 250350
10187 250350 -256994 -95457 144997 -171001 54544 49 49400 -221551 -517049 -127506 5499
10175 -229884 -217876 63871 107096 -32438 -261980 -202943 -220957 61620 -170164 175634 -36859
10163 99134 -232102 164602 -129806 64616 -12073 -274614 32403 -79198 -341614 -410011 22683
10151 -78142 84776 -66551 14358 -233844 140657 -90037 -228667 202558 -287287 -9895 -248388
10140 -248388 -45315 -35043 -132723 -88708 -75108 -112458 132000 144814 -67219 -121129 -27951
10128 -69611 -116614 -273947 -143593 -111714 41427 5705 -9431 239407 -4810 116890 -163991
10116 -193588 -100041 -259838 -242977 -127014 335023 -278876 -313642 -90639 -395923 -26683
10105 110292 95561 -322912 -229306 -68498 401706 -199036 198571 87911 375598 52739
10094 -26454 -240015 177149 -60939 242439 73807 -193491 -158387 -287874 -109851 -306662
10084 -306662 150118 18293 -166667 32852 -98558 333235 -109076 81085 -175818 -56751
10073 38336 40342 -236549 -163465 -100818 264651 186190 180415 -101096 -252406 -115411 -186550
10062 -186550 103367 108334 -455640 192494 -16861 -137648 222282 90609 92315 51988 113018
10051 113018 217013 -312304 14995 -6626 -73683 -70248 202877 -88798 84927 -13357 -238853
10040 -238853 33419 -4235 116939 198813 -328380 -90761 -44147 -124825 -330954 -41160 -141635
10029 -141635 -255565 43515 -58826 -141085 73946 -417232 -231246 -138753 -322174 -202259
10019 -202259 -53798 174596 -133059 27817 -86368 21217 55364 -38373 18091 -107199 -40515
10007 -168564 -5352 -190931 -17465 -24282 -509 -102573 52174 -249083 -97310 -102544 -15606 286244
9994 -104733 -137685 -286564 -277539 -117309 -24173 -524 -28097 -15073 -580360 55303 272542
9983 272542 -367565 -405562 -230019 69319 23956 -359172 -255102 100277 83363 -149740
9972 130312 -44659 -8922 135747 121172 5698 -30328 -52286 -39556 -181177 -52577 96072 269737
9960 269737 -67412 47736 278557 -110397 -168914 82611 -134549 151360 -140848 218112
9949 -142575 -254610 142449 -118436 107367 -99181 -93977 -270766 -83715 -179255 50089 73757
9938 73757 17698 -254058 -5633 27904 -70149 -394899 185532 64023 92374 -119654 -308918
9927 -308918 189827 -53892 -57274 -65704 176205 -54440 -272831 -316093 -93960 163231 -112700
9915 -237535 -8580 231558 -122401 27871 -49252 -265283 -381084 -217909 -315277 -93069 -57952
9904 -57952 17675 -225046 -80170 -27495 74221 60255 358240 -104825 155487 -126736 22241
9892 -139117 53508 -95577 -164549 -27537 136752 182003 329317 -230070 28149 -121976 -282073
9881 -282073 70321 -81830 -159966 -63629 -213291 -160253 -455248 -236093 123848 -307121 7248
9869 -133141 100519 21566 -214933 161364 -57596 -561422 -186151 -333945 -33279 -26343 -347560
9858 -347560 98517 107117 -161224 -24335 -52784 -100977 -233981 21839 72171 102620 -57885
9846 -272624 -217044 -144007 4508 -67435 -503242 135205 31616 -4969 -56727 169753 -240776
9834 -224680 45550 -45610 84185 96467 61917 -310551 -125141 267382 20392 107122 325665
9823 325665 -50131 -130841 -22821 -116402 -195495 -37483 230505 -38717 -45204 5753 38140 -485767
9810 -768281 -105343 -156561 -55633 -148817 -258398 -165393 35593 -116786 -41907 -135613 -15980
9798 -109543 65037 257867 -113864 -24005 -103694 331662 -93448 -94506 35961 -44908 23884
9786 -55914 200757 -26399 132544 136579 54715 -186436 -321676 308577 -84519 302823 -204252
9774 182991 -109470 -83119 -122127 154376 145373 -212744 -285021 125343 -242964 -48706 -196013
9763 -196013 -95795 -261233 -116192 32398 -154985 1328 -7288 -149272 -3811 -206970 -137914
9752 -137914 -74973 -94187 146776 -90007 -290541 94256 123656 143118 144711 -181278 -273066
9741 -273066 -220895 109033 -100148 -149364 -64348 134704 -97995 -50793 -89257 86465 -74417
9729 106737 -270149 180504 -221427 -115712 63422 147107 105250 74737 -17886 73448 -8071
9717 -54277 -4465 -199793 -156941 6089 -173295 -190953 -220583 45971 -282760 -177550 -371703
9706 -371703 -49257 136769 -41780 76840 -137750 -38188 -267255 -324621 -148193 -418904 110738
9694 -65200 -164043 -260498 -115635 241099 -109702 -318407 15563 -201931 -49943 139665 198465
9683 198465 -370770 -121779 -427056 12182 246622 169036 67616 -189919 51623 158878
9673 158878 150135 -312485 88306 -97074 57928 30306 -94575 -96991 -9408 3018 -131501 -33972
9660 -82273 115192 -187354 -140326 84450 -143109 -36171 -273215 147424 -54923 -286028 -414581
9649 -414581 -763 -260412 92795 -33309 -148138 22584 -225233 67959 -271341 -464591 -10624
9637 -138443 -272427 -61317 -360943 -315884 245909 207590 -157928 -106338 -168020 254564 -99665
9625 -199162 -255474 71677 141461 82122 -325732 49533 -8085 191860 -261106 -118723 43445
9613 -37134 31651 -110286 132104 -19576 290352 -22603 -8418 -55612 -155935 -2079 -304173
9602 -304173 -606949 -243521 -212021 -59845 -77985 78565 -178536 258011 108748 31309 -239898
9590 56758 218199 102958 -254812 -563590 -265898 -26181 87181 -249518 235412 -258779
9579 -222186 -207916 -390691 -380338 -153508 -196412 284466 168145 -176884 -122095 -215682 -130722
9568 -130722 306288 -293826 -443579 -249474 144043 172131 373659 -72006 54521 -402879
9557 -421594 -136687 -50636 20203 -17865 -99925 286285 -79679 32041 -60782 180982 -287161
9545 -123348 -361999 -195733 314957 7103 -526792 -113685 -204918 17125 159929 -116878
9534 -235033 7670 -195754 -193121 62594 195963 170424 -68201 -193566 -15711 -364961 117823
9522 104341 -57902 -197773 207172 -273992 42384 -64565 60364 -142921 -182166 -390872 122999
9510 326910 -248095 -95619 -38310 29520 203906 -226808 -198684 -236052 -80238 -35899 -1082
9498 206228 167118 311023 -95292 84291 -242501 291873 -4323 9288 68529 186483 -368182
9486 221687 -17739 468723 -105607 100 46958 -161054 -467974 170741 130189 -34940 -352231
9475 -352231 -99658 -286514 107869 91750 -11453 -223921 -127267 326546 243602 -41667 65418
9463 -259846 2580 -343648 172490 -124584 -26526 -80954 -167932 415598 -56981 -185713 -242367
9452 -242367 77169 99060 155608 -29183 255063 -3466 -169667 -47558 88593 -248697 125274
9440 -7026 -228146 129319 -8047 -148964 -352388 -93935 177175 -43726 -156567 -96799 112418
9428 -11673 -110958 -175024 104974 -51716 208150 181412 -241129 -122139 151821 -90723 -258140
9417 -258140 139837 264823 -36866 45299 -33662 -311599 233079 -475640 5958 22421 -73548
9405 -81258 -59948 -258013 -39649 73234 184829 184212 294259 205742 -64814 -14366 76799 -25575
9392 -37780 20800 -302008 270776 -497057 231050 -59429 83128 -11761 -147761 -150804 -408097
9381 -408097 132130 -248563 46307 -549599 -224586 -175019 -380314 -134540 258830 122354
9370 -275055 -29046 -157400 -78200 -219945 -2782 -210499 -249423 31113 -203758 302305 -22815
9358 -99788 116218 90238 91725 -405128 -110276 -278220 -226846 -130429 -115606 -204246 -249960
9347 -249960 -90143 -175114 59597 -279503 -277127 -122769 -172255 -255421 -6283 -586607 166950
9335 -226919 -290650 337317 -71014 150330 248363 302635 -275926 68092 90093 14077 9926
9324 9926 137347 -34880 -51950 -275315 117536 -86620 123238 185361 35945 -117763 -47415
9312 -64430 -229093 -161098 -119806 -49461 -73558 -6255 -265772 -121152 -99976 -300312 44563
9300 100384 49185 42245 135161 -188318 55181 -329323 -408462 9428 175853 46495 -63646
9288 -91672 -224979 -244336 -232989 -9506 -56488 41111 -91655 -246389 47803 -37582 13425 -196829
9275 -193330 -373379 65675 -200774 26813 -116432 57278 -205753 -142422 162511 -94657 -15397
9263 -159843 -65506 -24241 -57358 -247339 -100302 72638 -82547 -38365 -129126 -94868 -229444
9252 -229444 -237229 152443 -247579 -273183 208355 34093 -70762 -164401 -329830 21469 -26250
9240 244283 -345045 -32096 -62837 457232 93689 -42023 -124492 151392 -178075 8490 -242410
9228 -404196 77276 71097 -74512 -398900 34145 -63524 45477 175624 -16587 4382 25422 -186057
9215 176120 114413 97283 51529 -179433 -99084 -71638 52025 -134362 -166263 200707 173479
9204 173479 -41732 -53306 86752 -132640 -303775 192716 33814 133986 -133141 -165349 -215197
9193 -215197 -22969 112604 -68447 157395 81612 -45365 -33804 -160211 -399245 -105089 -187942
9182 -187942 -320209 -27404 -239756 -372548 -192609 239223 -124386 -120120 6059 -2323 4798
9170 61694 -258696 174765 -191889 68090 -58237 -405274 -146327 -29590 -143828 -112897 38218
9158 -86879 53521 -44390 22964 338528 -53778 32215 -114222 111588 27895 40171 -301914
9146 -34229 313169 -173273 -378200 -168064 -35129 -88435 -168528 70091 -60335 -424749 -204471
9134 238574 -49863 240951 54607 -61817 -149786 -34373 -106180 -121426 -348724 24146 76375
9123 76375 -72508 14106 -144253 -252761 -26297 -39082 172084 -322716 -123200 76700 -126669
9111 -123845 189738 -64318 36012 -64838 796 129329 -47547 160795 233370 19148 87082
9100 87082 -119498 292790 92478 303850 -224470 -125725 63129 88873 274135 60763 -398280
9088 218108 -50262 33301 -62388 -282147 -126352 -436151 320744 73005 40763 169461 -242566
9076 76947 -106948 -219953 -281120 -299781 -1831 -82710 96192 24079 277353 -167224 -201699
9065 -201699 -389495 -133517 -296614 243175 87960 -149812 -31249 274520 -129573 53664
9054 138848 -83262 -57009 -338545 24044 -5026 -213619 -40552 -4827 116164 65479 269691
9043 269691 135130 -314014 111539 26276 61538 114632 -236960 28975 -309852 36197 -279722
9031 571839 -37351 -122859 273936 -19144 -157399 -321208 -525000 -19776 -87026 -173467 40263
9019 -194312 -12777 1005 -158092 -80 71889 -180032 -221116 -147539 -141557 69892 143839 -183622
9006 -237492 -2573 -104105 -176207 -167379 -177413 150732 90710 -13838 -115869 138875 195373
8995 195373 165431 -15689 83571 -127892 89993 -15661 -48994 -148466 -22039 -309509 -78770
8983 -77998 -375333 -193617 -72633 -33595 -102152 96600 -101942 -135385 40123 -240343 -116533
8971 -129663 -28587 -48236 76189 -435677 2720 -176169 -21510 -160255 -149943 -184514 -169386
8960 -169386 231610 -92628 -75900 119313 -508989 -163877 -41299 -173777 149434 -106313
8949 -266027 -349493 -227413 -65667 -58629 -106095 -98930 -116157 116745 -193802 252878 199536
8938 199536 -213648 -238556 184454 35309 49476 129324 379632 -125299 350014 -306649
8927 232020 225787 88193 -12176 73962 478492 698982 1401494 3921981 12086307 6611286
8917 6611286 1744132 623070 557006 139507 251916 39264 80136 -338472 58718 -9953
8906 211606 145400 23434 -199597 -297433 -110847 -76504 -56678 -125894 -191158 158992 139079
8895 139079 -147402 -2668 -125775 -226607 -78206 -168709 101822 23413 -204183 78355 34756
8883 -121277 -237860 -185353 -184828 13019 49043 -308040 249250 238677 27643 -69536 366447
8871 6956 240830 103762 -163007 -16981 209212 126413 -147578 76311 -204358 122082 -245570
8859 -75611 212766 -235583 -125322 -188671 58879 -267622 -131167 118477 264457 -51942
8848 22377 -70424 -102647 -131148 -6261 -12948 369345 -319721 -79789 164619 71289 -185169
8836 -20862 -553827 -101735 14186 -282105 -38298 8345 -66281 -64188 -82951 -113756 -163481 -81976
8824 -81976 -203327 42496 -105952 2537 -58013 -464799 73897 -213955 -93455 106934 143803
8813 143803 193943 54224 -8923 104530 203727 -340387 -163816 -136619 -351981 -29565 -16119
8802 -16119 66294 44085 134394 -278691 -314684 -139588 157367 -66150 111587 148682 181075
8791 181075 219731 -32247 -273340 284998 198402 76058 81712 -112766 71390 -26891 -258838
8780 -258838 -181552 -104247 98608 -135995 129250 107838 11520 324322 228734 1795 -111989
8768 167502 21390 -108387 -147376 -384042 167870 -222682 -100384 221984 -301545 -140513
8757 -8077 -241952 71343 7641 -227447 -60276 -45565 -160996 212308 -325017 45980 -154189
8745 367564 35895 18857 -214320 -35834 -166617 -96997 186587 -131533 -173991 -154466 -61020
8733 139726 48182 -206747 -212461 -274401 -141710 227927 15935 -419051 -377829 -328628 183749
8721 -22285 -245264 -10477 -36983 -133057 91618 -417415 -86681 32515 229842 -72924 -184015
8710 -184015 304729 147491 -252398 152159 -52438 -370226 -73691 -255199 -160706 -29581
8699 -82715 15110 -34190 49977 -301445 14451 32751 -268733 -304555 122399 -192438 -40423
8687 -486167 115502 -2315 264397 -562180 220581 -159845 73652 55565 247227 140111
8677 140111 -246776 -154477 -64316 291728 -202171 -89689 41257 -246831 -45896 -229419 127885
8665 -93027 -240348 -2475 -34956 37981 -3439 -218417 -38966 180202 -60296 -343903 -18974
8653 -205680 -43916 59276 224347 -98114 130160 -25031 -129286 -189468 255975 22933 172972
8642 172972 -219735 -205312 96489 118406 241948 18171 100789 -95631 110357 -217072 185876
8630 419626 -230205 -66697 -86189 -28048 -313996 165036 -147533 42154 229115 148819 39261
8618 -292637 171258 127312 -127066 167038 -240599 -161941 36626 -70003 -55968 -89295 -19849
8606 -185314 83095 141483 -75914 -70704 83639 247787 -240943 91115 -64520 112507 -107115
8594 -39987 -20559 -168385 -113705 217564 37629 99674 -133366 22530 861 47618 215032
8583 215032 -25923 -140367 37649 -441292 -78973 -113063 90214 -116132 157069 -107050 -287333
8572 -287333 -356258 1885 -216152 -122555 -3349 120886 -77564 141807 -203596 -281210 -174009
8561 -174009 -69758 -46262 -19409 -349267 217475 -93488 109790 -202451 -160856 -335610 -73880
8549 71704 -257927 -471435 -211452 -83394 -11583 37160 -85307 -188817 -29213 -382287 206032
8537 -120949 -255252 -172663 9616 -62076 265745 128821 -31068 -263053 206941 189041 -115119
8525 112107 54958 -12126 -76475 49192 43378 205661 120398 185041 61941 -345916 233032
8513 -221462 -92608 -385475 135819 -271607 -58797 16990 -88218 -24998 -148092 269853 -218605
8501 -43185 -296455 525396 107765 -167491 272460 -82435 29099 -390100 -118375 54686
8490 -253544 63271 -581531 -213213 174302 -238783 -17078 -20338 115002 -15081 119685 155488
8479 155488 41615 215833 -80133 464355 -83850 145698 115771 -230150 21224 -169198 -102158
8468 -102158 279524 40222 -122520 -343071 64254 -190382 177122 -116827 -124924 -37221 106608
8456 210315 -33382 -219137 340157 -58950 -259460 -189495 -54921 131933 -136863 -119956 100529
8444 -204830 158302 14983 -102069 -26610 -56691 12922 -292410 -28496 256058 -232568 -198261
8433 -198261 -26721 -68858 -59977 -180792 -111615 326939 97099 104753 44797 39410 -92953 51449
8420 -33085 90086 -338312 255077 -265999 -72515 129920 233515 97079 -27679 -40009 12500
8408 -335248 -67368 -424299 -20243 187701 -66079 -121108 58649 43117 225610 -71569 -7552
8396 -278101 -49662 -253284 -198368 -226040 24371 274144 -3460 105352 34523 -283416 2837
8384 16555 149644 64893 -256076 -109051 -174841 -275653 -352793 -109792 -48953 -167167 -167439
8373 -167439 -47743 -174882 -7582 52258 63788 143095 -251736 181899 -78113 16498 -32026
8361 342995 18527 -75447 -475011 14673 245284 -277472 154867 -298936 74255 -176758
8350 92941 -21734 -17495 -91934 -286569 -17091 424420 206246 -289414 -20282 -262700 152484
8338 58368 145132 244268 105042 -348816 -129525 -416916 -152250 195408 593168 44279
8327 208427 36213 -147659 -282231 -229984 75161 123514 -306750 -105131 -21958 40793 -216480
8315 -22647 -50767 -136731 -23291 -282945 97130 -152945 -127272 -150808 -92058 357775 -211920
8303 294873 -13567 -50328 -392149 -177436 -181537 55867 45663 -183064 -118790 5917 -191068
8291 -350438 -106898 209871 -130726 -88046 -247291 328668 184833 18326 194746 -321307
8280 6823 -353632 49964 387687 -158260 -156017 88233 -29605 86261 -143947 -44755 -170689
8269 -170689 -217391 -170582 200684 -219403 -174173 -146489 -119437 -252246 -458271 -193371 -252030
8258 -252030 -223741 264691 -197725 62993 -6557 61947 113474 -243649 10254 206444 -155288
8246 31475 177414 112868 -35534 -90270 -88849 283101 -71011 13774 -265253 142990 -69454
8234 111203 60756 137461 102204 -297169 203534 -178410 -113062 439700 -323587 147591
8223 -2924 26555 97533 -325916 -150435 98673 170808 -193936 2917 46419 38965 -192014 -235087
8211 -235087 -89651 16625 -265756 33233 -144640 -114675 87999 -19627 239832 -88214 -280220
8200 -280220 103244 202593 236077 -8023 62628 36665 -147629 -105201 -127056 147303 -107949
8188 -128283 57205 125698 -356042 -165584 -209797 33504 189594 341221 -105489 119959
8177 81990 90586 96736 -132386 -367844 85545 -81036 -186712 -95536 -50920 180241 -85695
8165 -161948 -163678 -144 -44473 -96749 -132886 -409066 -220475 89626 24537 5016 -101170 86798
8152 48484 135864 129329 -363573 -384120 156752 825 37610 1180 70787 -188716 -82299 -73125
8140 -73125 32028 81956 290347 -23715 -163832 150272 -51076 -294714 -75817 -62732 -219123
8129 -219123 -219917 -329121 10633 9805 4166 -177102 168713 260753 30528 -78024 -155295 114010
8116 -218931 166680 -101698 159623 -151460 -180085 175071 -87693 -107504 -133982 -194158 107442
8104 -125385 -250807 24868 -242006 -292480 44910 -44062 110439 -261688 209630 198494 131687
8093 131687 -215595 62154 128233 192735 -123850 49948 124848 14644 -82064 176952 45130
8081 -124328 33636 -182762 19937 -59464 -303307 -189776 -106386 -43182 179570 -160143 -165105
8070 -165105 53465 -273826 -92651 -159838 255643 -193056 118669 265490 -58068 -388285
8060 -388285 51700 45989 127775 214145 -61039 -93406 125032 142305 -346692 95557 -215363
8048 77086 37312 -281634 -247554 -250259 -296066 -169051 -191259 168738 -384904 -17795 185668
8036 97817 53832 395284 167397 -170082 101200 -52815 37155 -66499 -385766 52097 -247336
8024 -335724 -146741 14848 51296 -5189 -34004 -4940 -83721 -48033 -30756 -250063 21977 134314
8012 134314 47252 -294124 41518 301065 157472 -56658 101754 -67317 -6725 16376 -72511
8000 -103718 -6362 -343150 -315756 152970 -344598 -42427 -155694 -353362 -210736 -180810 -138203
7989 -138203 -146974 -93751 -234314 -10020 125630 -151843 -272005 2515 -328903 -293568 -157064
7978 -157064 215038 -166934 -24230 -66682 -43831 64114 -328891 -255317 15125 -218678 121186
7966 -403107 -104519 86250 -187045 256823 -131064 -99640 -431395 -242993 -230755 -209875
7956 -209875 -145923 -405394 33550 170585 97243 -2638 -137822 -152448 38438 -35121 -76927
7945 -76927 -183044 -28082 63900 -212501 276146 -255674 234887 49301 -255971 73856 -288635
7933 -105282 31280 -118117 185472 -112194 15775 -225758 -124021 280948 -192022 198273
7922 291319 -53641 -9670 -173281 -15989 81533 -223364 140186 146191 -55958 196215 245165
7911 245165 -68084 229460 -105870 -149038 119199 -91048 -69311 116318 -187767 -266541 -3478
7899 251909 264340 75141 205530 15456 -108068 -111577 -251012 -84840 -83403 244461 -63378
7887 199331 87114 -26560 31538 66409 -187139 -177061 -293284 287923 348885 -23914 -456525
7876 -456525 -197143 -240584 -203132 -436677 249570 230885 -138575 202232 -7382 -84723 -67267
7865 -67267 275691 194379 -274058 -15266 -330169 -142764 -73593 -10620 -42285 317858 -113399
7853 175733 124987 -14403 68296 -272012 136989 -74734 -127026 56308 253674 127551 -85167
7841 -230150 -163299 41112 -10087 -652955 16551 73727 -326742 -68861 238166 166599 -285844
7829 -104870 -153801 68321 94469 -54885 90056 121759 157647 53741 140629 -209672 -393621
7818 -393621 44479 -246605 -58098 -179737 -347671 -97421 -225858 -95284 -267422 -30765 -374021
7807 -374021 -94643 -20052 104295 -122082 -185090 -10910 82274 101499 -112107 91582 -213048
7795 -184992 100678 166746 91001 -260885 -21009 -122658 138183 -131412 243052 261655
7785 261655 31942 -363109 147809 -434011 -54571 271052 76058 -86256 -48436 31108 -72940
7773 -79068 -59941 -54110 269868 106377 -186451 -65094 41601 -46173 68934 -391790 94081
7761 -163541 31044 -419415 188725 10209 42735 -145800 23859 163665 -149468 262863
7750 -222360 217548 30344 59552 -139541 -82879 263909 39291 101935 -7430 284820 -57250
7738 39428 254920 -229915 -85300 -48259 -12876 -8390 -151160 103996 237457 49622 -14511
7726 140837 -89358 118751 -8282 419745 219507 -301898 194949 74341 16030 11718 -44530
7714 -17635 -7348 -190 -110038 -98653 -167949 148457 192798 262496 252759 -450078 134767 370739
7702 370739 -117120 -169414 -122109 -147678 -123350 121450 -277071 -284878 76795 -87497 -154873
7691 -154873 45100 359084 -133929 -287866 5213 -482780 110859 -73933 -47306 -153403 -166132
7680 -166132 31458 -92397 -93278 -313283 228509 -339477 -18633 35766 103924 127922 -71159
7668 90550 -167930 -115473 54239 -250887 -113390 -125031 -193128 -24380 103722 89306 147229
7657 147229 -422946 69490 -136877 -149610 -142576 -123282 -223493 233219 -18246 -169510 -321456
7646 -321456 41726 -863 233070 258889 -165826 -3211 195383 -12639 -128271 120092 -270169
7634 -128282 -18929 -263338 -111744 234150 155800 289497 96310 107477 -191167 -183527 99591
7622 17178 103135 421773 -218488 133574 31264 404473 -117171 -32692 21691 26421 194737
7611 194737 -23604 -292430 124095 -47243 -412361 11692 -190093 -299721 159529 -285355
7600 -215253 -64811 71390 -355928 53622 -232470 226739 -165431 7184 -253926 86873 -31763
7588 -65372 66937 366146 89772 162956 285500 -5947 -242822 -109362 -58032 -9951 30900
7576 69510 -88447 -37653 99207 -188472 65435 -141476 -210699 54559 28417 -1543 58970 54936
7564 54936 -398735 -126891 -338957 126064 120076 -17965 28022 73971 264667 -209765 -269246
7553 -269246 -40080 -145865 2818 38240 -104067 -62134 -285850 -291992 181665 54541 -80923
7541 -91327 1717 -96027 -33853 -209069 29448 -91101 166232 -45758 -216135 237403 -139554
7529 57865 9119 -195731 114595 -233769 -62518 -57834 162892 34985 -75114 86482 39315
7517 -147421 -23452 -69436 10886 -98740 18939 -164460 113466 13998 19638 -16082 144077
7505 -89907 -59382 -61722 18744 -250490 -88815 132312 -98349 213738 -156448 -65479 29773
7493 -152490 -125952 90576 -109619 -137784 -97746 -304148 -125327 -5230 39989 71872 90755
7482 90755 -139138 -85383 -52815 -256816 -211658 -108780 -159512 -236218 -1086 -217861 -50884
7470 -313004 4685 -316714 -309856 176000 206439 98498 51522 -17651 120323 162473 66567
7458 -145193 59045 60105 -349013 -47401 147752 37596 -35610 -285793 -206396 -24407 436446
7446 170313 9094 -349557 289791 39853 88455 -8770 230746 126404 -65126 162723 -346256
7434 -64213 -163578 -46613 -125430 -87523 122269 -365126 -7256 -41341 54343 -122621 103883
7422 133275 -100723 -64339 -207636 -18680 -176409 154862 42111 -179055 233960 -171300
7411 -2465 -51403 -315365 150853 24493 448822 -164525 12050 -19996 57542 -265647 122666
7399 -94481 -39504 -287845 -43101 188860 203804 71888 151772 189936 73250 -55863 -124267
7388 -124267 10429 194882 -89970 -43095 -192055 95988 -88138 157167 131322 96553 -264721
7376 -150323 -13474 132495 -62859 142370 -222339 -71255 -27802 -279673 -116715 -250192
7366 -250192 -43523 13809 191460 -228411 43261 -103668 -869 -107617 -59242 -385667 435307
7354 -216258 -105119 94613 269769 39997 -279763 -238895 90916 -180670 -60359 55724 45328
7343 45328 -255928 24617 -238470 116451 -30593 -45209 122713 35531 124654 13438 141976
7332 141976 -363490 184343 -147094 106394 -109017 -207707 162794 12275 -49750 -236949
7322 -236949 42073 -188558 -20219 -277602 -112255 -197488 -55089 -28568 196266 50651 -48663
7310 -141546 209321 -46031 -387029 -153215 59263 53341 27869 89455 -287643 121869 311461
7299 311461 196196 -307189 -189433 94202 201627 -80605 129612 -433741 -432578 134151
7288 -107032 117440 133312 111850 -130703 60338 36392 14578 -28890 162738 107811 -135746
7276 -29566 7614 -52062 -191387 135779 69007 41731 73343 -271865 -33537 226505 -201231
7264 -160846 -282856 -157306 -11658 -61977 -191122 20056 -91225 -64016 59672 -290693 239691
7252 186693 -354601 19445 -361672 313155 -48665 -48194 22897 108581 -60063 170460 -437828
7240 -183875 98686 -219374 -345718 -239517 3536 -144991 171918 -205615 -171725 -217298 167219
7228 145849 115515 262361 309684 110831 145247 268917 9125 -281218 -152249 306723 -29567
7216 78826 -578471 328775 -402887 74121 -161826 -71447 120959 93072 150065 -13949 153514
7204 25795 -44716 -166896 -47463 155094 22500 200259 -23468 -79669 -89774 -272145 216699
7192 -286125 458058 54944 229807 -123829 -64797 -626094 -250343 35355 -17349 -24201 91796
7180 39965 64759 -120252 -2148 -379883 153850 -124891 -137344 466819 150628 -128921 -229044
7169 -229044 -97482 -206117 109895 -118450 -189285 69856 31707 -35805 -54609 97158 52710
7158 52710 -15471 185053 38142 -1768 87253 -232327 -341471 -140420 -7521 123709 17756
7146 285907 79774 495225 -114916 17280 -278213 -20477 -12460 -170347 -19564 141946 131321
7135 131321 113999 399240 26326 236211 8646 52174 -202727 125928 -200183 367792 17294
7123 -45651 -135295 118612 -104391 -371730 58257 -63417 -234022 -3497 19264 -173021 202860
7111 -94281 -155263 -10659 117061 -62288 -152494 91775 -211123 -187658 -122794 -9958 283839
7099 137380 -104890 -37011 -590 16670 -34494 63492 -219918 167345 28735 143002 -234143
7087 30762 230641 -372224 -476664 -125882 -182752 39260 15375 -187333 -35414 52939 -190369
7075 -126530 231732 108356 -152705 266638 -1807 60839 -153137 -299426 135202 148693
7065 148693 121043 -141081 -11726 54284 -81296 -128962 206464 53734 30272 151468 -54447
7053 -83570 -365372 -61520 268614 59118 -135638 33937 -223015 -98625 -75590 7448 -282964
7041 99140 -231259 84050 372847 106529 -141825 50002 -82708 47038 138041 -84942 151649
7029 271662 210909 -333361 -289079 -92601 111841 109869 -217110 -307450 62273 -37937 -252211
7018 -252211 207262 -373987 -118692 -102226 35315 -99633 -151445 -87785 137128 -30096 -41938
7007 -41938 -144890 -137085 -292922 -53231 -183684 46942 65701 151120 32772 -49408 268679
6995 -49259 240991 -137021 229489 -21408 -286080 -127706 -180495 40030 -147349 -334673
6985 -334673 -380616 -18938 7656 33208 174 -363427 -85165 58513 43565 -163991 -137079 92617
6972 -318447 53706 -69258 93812 120540 -59769 -22109 12911 -336210 -52161 7397 13081 -10232
6959 207734 -63531 -157087 451150 -188175 201387 -142996 -306183 311580 35774 52427
6949 52427 -88560 -112357 -23635 -86210 -188252 -131313 -174042 -6826 -210948 1924 -265741 -166127
6937 -166127 24671 226696 -176342 133032 -245478 -220104 153326 185546 -319878 -67405
6926 64082 -45054 -2599 -85943 89036 -198428 -271710 -54983 384 -48639 -150595 -68492 -199199
6914 -199199 -212265 136221 -122573 -38829 13011 314777 167003 227510 -130430 -11829 -137226
6903 -137226 133 -220458 -93410 259747 380056 -35231 11560 121861 -81890 -356672 491029
6891 -165383 -125913 25488 -134950 -64336 -198578 -108987 -62450 -238876 129421 -5254 -76834
6880 -76834 -287350 -24535 89337 450659 -100587 -124643 116380 100143 -12208 5189 69874
6869 69874 364990 908 -24981 -145007 231872 -414473 -119042 120798 -31595 -239890 -51189
6857 -324786 -53536 250000 128048 416415 215583 -147293 140342 148893 22922 377453
6847 377453 -224423 -43197 -243159 -228389 -18498 6196 -23323 383623 -150929 -7138 -16554
6836 -16554 -70180 -106273 163772 -100157 19021 155884 -87748 -238513 -81231 -25778 278916
6824 -355349 124121 -60964 -168198 274269 22726 143649 -6484 -41813 -209642 178411 -182659
6812 221138 132135 146067 388118 96650 2505 -121928 -199226 -122190 -228510 -67577 7988
6800 6632 -104793 -27233 315714 283156 61001 -1 91075 -23211 -227602 -48180 84565 -110193
6787 -88741 -50033 218039 -168656 205822 -1487 -361087 -182480 258660 472318 -17514 3818
6775 -283096 -335326 154643 -460517 125164 306919 -260385 150796 37934 -46051 -171104
6765 -171104 -180767 -117420 -192632 -174808 -81937 85971 -190089 -112583 -205514 -174322 -205482 45543
6752 147845 -130488 -9925 25545 -234652 -81005 -47062 -182615 -23305 -17956 67778 -160706
6740 253250 69098 176554 -214899 -40550 -184817 -256288 -103769 -232731 47766 -19778 4421
6728 64426 -87349 -83419 -9716 -203799 2116 -216646 47147 -33635 307114 141270 35991 76207
6716 76207 -49213 196840 233653 160918 -43252 -93970 135922 331333 11127 -293144 270859
6704 -120009 43555 -26086 -144579 79951 72474 256351 -13445 -124204 -701814 -276600 110072
6692 -65304 -11233 115183 -141678 -17605 224074 -244818 102266 -221925 -216426 96754 -468208
6680 -332765 298371 13065 -295961 -9474 82108 -4901 -63008 -286928 -207982 -74628 -94820
6669 -94820 71224 91028 -131464 -48052 -284256 110051 12112 78308 97308 -24501 157145
6657 -229052 -7368 141576 -213252 -41536 -87744 -67390 38170 128336 -23943 -151597 -241415
6646 -241415 23832 43914 222611 165176 -356029 -107338 -157638 -128730 -100181 -156910 -25978
6634 -48160 61964 -96721 120517 -45024 10147 157874 -54842 388027 -89396 106212 19488
6622 46113 -85781 -127419 16294 -259629 178669 89747 -22182 -11403 170474 46443 -102702
6610 218769 -185557 80389 231416 -46645 -13674 85217 -146370 309581 303801 57533 -65433
6598 -487576 264934 -26181 -130160 -2668 144916 28994 89490 -78972 327188 33974 86855
6587 86855 -272853 323044 -90264 70222 22587 -31898 -205047 -162684 131616 -27263 -283055
6576 -283055 -193197 203433 386556 -124923 -136562 215666 174822 -217417 -77450 -73268 -94387
6565 -94387 -76022 -322632 -109776 -36778 19704 88195 -116157 230728 -255479 262567 -101766
6553 -214233 -124131 -78597 -55970 325894 67740 414854 169422 83854 159527 64195 -188566
6541 188457 -276290 -179451 352243 183661 -59614 73177 -267592 -187191 -238494 -318793 160560
6529 -132829 -227709 22728 167769 103188 382526 227354 71170 -349255 -38351 45375 5633
6517 44221 118974 -168194 138901 -87120 26652 -88344 160943 232098 122913 50391 -76911
6505 78613 -396036 -33988 11124 -57104 -55040 299785 -281998 -9651 149699 302904 108045
6493 9976 100282 -107499 96927 -94764 226563 -19149 87677 -259329 187810 -38840 33928
6481 3001 -122474 34247 -226825 28796 86556 -160443 30597 -251678 4691 -25084 -179889
6470 -179889 -120567 180738 -220892 326973 27488 -100281 67667 26960 -10852 -311607 -135897
6458 253941 -137454 74122 32324 71470 51429 181226 208701 -38161 245493 -14598 -41400
6447 -41400 -112591 -115740 49422 -296294 -416300 38295 -183626 -285776 29509 -3161 72799
6435 25181 -115698 115085 -3009 -239579 -72219 17330 -45614 46348 -4089 60051 268219
6424 268219 181757 3475 -122181 -188669 97467 -104366 -342450 -406868 29744 -433637 -219382
6413 -219382 185156 173905 -128355 -390320 122583 42218 -277139 -148060 -99392 -8542 73638
6401 -4195 -15675 -165627 -192106 -21686 6514 -332402 -84689 247949 30413 32695 173249 222746
6389 222746 -120530 99417 -234488 -182123 14559 -21509 -206288 360432 -182362 -195059 -177874
6378 -177874 101395 310448 230879 6319 -17771 259226 -107686 -46378 -108107 211429 -23043
6366 107843 249522 27470 -83891 -156936 181487 -105289 34811 -393599 6769 -260675 -48867
6354 -11430 -195972 -186369 451010 -64814 38217 133059 -32788 141904 74701 -186582 -22002
6342 27413 198942 -81068 -295086 -294804 108206 -335364 -44498 412553 -22836 -172681 -117985
6331 -117985 28470 79345 -281389 91783 -207620 -95215 -41808 553049 3111 267932 73365
6319 -340182 117454 -110303 -172269 177661 381833 155207 -170192 -80904 216658 53080
6308 100012 -40996 -131950 151763 294107 91942 -125109 174188 -65720 -152801 -104435 -118712
6297 -118712 -36358 147353 230109 -157854 -4974 -15659 -126204 133832 18050 -168820 -395256
6286 -395256 -310345 -83912 -105129 124785 39174 -212024 -115700 47075 -95530 390114 -71788
6274 -85116 57398 121445 -145599 180204 82937 8530 180881 -45564 2529 65624 -148147
6262 -50282 1882 -33811 -17181 148527 89159 74874 7839 -185897 306000 43412 -162336
6250 -39571 283912 -247879 -263413 -181778 104649 721 203973 207058 -55269 57971 444586
6239 444586 -81570 -207434 200774 -85792 -21936 -31237 525123 -146410 -36310 -186222 123688
6227 45835 128937 -142309 144201 79486 -1260 140830 110924 149896 84206 184873 -30641
6215 -224985 -263712 71968 396827 -385285 -233787 60936 -72254 -102864 -109765 149784 -289885
6203 127025 -49339 116795 63687 126872 -192932 83504 -117131 -204537 200463 34191 57296
6192 57296 173783 82187 -101279 -30210 -196883 -35828 232261 43907 16273 -36457 -218290
6181 -218290 128161 262293 240990 59587 51574 83413 -134210 -51458 78875 121223 82934
6170 82934 -56472 8367 52289 4333 -75723 70801 -267019 -45804 49903 -46537 162601 -140511
6157 -13591 84915 229880 -36648 -195517 10561 309455 97954 -55237 -171194 253779 101452
6145 -53178 -20168 54937 -104584 178394 211191 -211914 124363 141734 52144 81360 -144119
6133 -93544 -27063 111097 -541154 -22798 -90036 132413 -2935 108836 72634 -15017 159119
6121 30014 -199202 -263089 -190980 -210840 -221019 45032 126589 -161824 -79077 -315765 230629
6109 217408 172024 29502 321385 -47977 -199373 336120 123897 163514 -486720 62207 -84414
6097 -241137 -34039 -57057 -349753 -52720 134131 -157227 25298 255997 -243029 -90299 -1625
6085 12593 238755 293995 -314790 169294 -217161 175835 -165776 -24600 -62724 -299831
6075 -299831 -263622 -363094 173981 114597 38826 -244087 103881 103990 -12962 208569 -270722
6063 -75821 -478857 52072 -206587 191290 -467887 -22337 237113 152953 76938 226330 -28937
6051 142141 140572 530001 186662 17380 -117331 -47122 -19628 -40626 -195040 214779 186407
6040 186407 -86750 -98639 -22775 -108372 -151790 -86692 329977 -70951 301752 67158 40823
6029 40823 -261732 -57353 305849 49269 -4626 237495 -5088 -230617 -51744 -123081 -60756
6017 -25188 140502 79769 -56360 -136685 -18429 46826 -439909 388093 -181471 -147308 -216895
6006 -216895 -110027 96881 177818 -46152 -47146 242759 60376 -218101 244059 146884 244390
5995 244390 -33828 -12127 -287478 -145225 15598 -43321 -184514 -37771 -116627 -159028 -271651
5984 -271651 128483 -21278 -242021 114039 -151924 -184255 -113860 102234 -206757 -166503
5974 -166503 -65858 170946 -1100 -346318 -247720 76158 192054 -136187 -122070 342569 259619
5963 259619 160649 24959 -193961 -204536 -86085 290321 97553 272603 -34173 -226536 118110
5951 89589 295179 -91679 -89950 -68371 -31409 -87473 -25704 -26215 -71584 338055 -27206 105773
5938 235761 330675 -3773 -229673 -173101 -459223 -171871 -135447 205012 -125443 136686 -50223
5926 133142 -32786 602 185116 -152952 20923 -169860 -210285 -31570 356447 -180868 -137718
5915 -137718 -98248 386725 60476 -496451 -52791 167681 2346 141527 177890 -183455 81107
5903 65965 -56885 -143591 -4496 383089 11099 -92866 -139812 16446 -93776 10402 -178192 -47457
5890 -27332 29157 -227473 -195790 -26774 -350830 148302 19534 211971 81471 62827 -180898
5878 -154114 -264407 -8501 -146951 64427 -244471 112973 -24482 -36277 -126612 27348 -47242
5866 47941 -47639 -121817 -91463 99494 228589 146105 -21733 201483 116904 -258772 -227 -144346
5854 -144346 -109065 244084 -153553 -280970 -222284 -193871 152917 2272 -53482 -81264 -144860
5843 -144860 -98524 -239525 -317883 -200352 264480 314971 81292 -214512 249435 -363269
5832 -145963 -278296 -199612 51640 10685 68731 93640 -218322 351782 252857 -18788 39031
5820 -116377 -181311 -34727 -312454 -268752 -223534 -199381 48722 123336 -234436 182319 278476
5809 278476 1235 180416 -151575 129110 -6976 -23122 -106187 -57131 -48750 351596 60239
5797 -29284 121722 -12218 310671 57407 266297 -99629 -30542 -43058 103701 -155357 -241466
5786 -241466 -182965 146056 186126 76149 -42200 -48274 -3532 30095 -144468 -3184 60366 142892
5774 142892 249768 79990 11503 -295916 -205066 172618 205464 126475 -188864 205999 359475
5763 359475 -117988 107502 -162718 200884 50580 131983 -143785 73640 -70416 -47159 15356
5751 128705 229405 158350 351099 -260109 -23635 -233665 119134 283916 66256 29426
5740 78284 -226806 7998 -137133 -71505 59122 73223 -30679 -106498 222100 214328 -6131 78855
5727 -38207 306450 487775 -188198 216072 192011 121795 -218315 21627 93159 -86248 -22158
5715 18907 -169156 -247513 -220546 -57495 -223530 106714 -136371 187199 240304 -332409 -224650
5704 -224650 20322 -134437 -131355 -264315 346413 150479 82949 -317063 152766 412177
5694 412177 -226569 -23414 253660 -61884 -61085 284407 -180634 87689 -26265 -41126 106516
5682 -138025 -23825 87087 312451 89331 -61846 89666 175732 236665 87422 -144714 13176
5670 -151948 -287400 -114850 -242478 -33731 268760 -297916 -486812 374608 10805 192481
5660 192481 78979 43527 -143658 12563 -249679 239575 60077 12513 130907 -303548 -24669
5648 -27732 265993 -184830 278896 -185249 6433 77032 157534 72277 -708 29322 -33948 -272471
5636 -272471 -177300 -136876 378743 -96673 -228364 -98283 -3241 -237723 547301 -23837 244427
5624 56879 -304325 -104162 -35418 16156 49689 -107091 159214 65070 -212575 11468 168935
5613 168935 93978 -48692 -291487 251693 177178 -237669 58446 -124110 -167814 -303666 -4356
5601 322641 50826 -171555 -27853 7941 118938 154635 -380550 -95105 -77427 58220 -59599
5589 -155532 77087 -197256 260147 -37285 -183405 104367 -39196 44089 115629 25767 77555
5578 77555 -334410 -74834 129604 -249279 5420 -325414 197418 78288 -57869 214015 -114105
5566 256886 -134336 -196545 60992 1257 268221 294479 -146639 112733 -14656 13358 -77970
5554 -287908 -111502 -222161 325194 -63767 275111 7362 19399 -241537 229848 -61018 -95558
5543 -95558 149200 101108 125502 -147710 -62513 56267 15413 -33929 -204660 -21495 241522
5531 -99184 -36421 -3842 -70555 237049 110924 -158275 -162519 -8256 158019 24301 14604 42168
5519 42168 86279 -146042 222288 -136508 113881 -383933 359568 -152662 -133500 117743
5508 142633 -21000 228914 90928 244743 214365 -76655 -164386 15259 109662 -215784 -95821
5496 -66057 28126 -64133 12674 -55249 80669 -136107 128855 -293187 5336 127328 40977
5484 -116578 -188313 151956 124647 177435 50017 69453 -193586 -277223 204500 -52887 -69332
5473 -69332 -113564 -278760 -202729 235250 -260051 -226092 160917 -82457 50144 -19047 146821
5461 203079 -327044 161937 -149972 308002 -12845 -135139 -168130 -290614 -72413 -114087
5451 -114087 -67168 163137 191565 494014 -70697 97644 -309679 224736 118171 -129188
5440 307713 -22147 140899 -252865 -126694 -94455 341265 -143979 -185014 -25935 -20062 401072
5428 -93369 -16372 73036 -153218 -38100 -26628 153476 110634 139174 -231693 -94484 19283
5416 88628 -196187 -77570 19882 -230923 -26963 47510 107677 18976 -126862 -91244 -134578
5405 -134578 -117266 -38283 -221243 141941 47594 255910 -222864 15441 -17152 -1157 16592
5393 6858 230066 -37035 37362 30885 275892 115188 -142291 224513 125930 -48309 -232457
5382 -232457 -422801 1766 -31480 -108960 -497 118316 190368 -37043 -128412 -97465 -269387 70768
5369 28354 -26465 168912 -65872 46243 -274318 249804 -111095 9176 -149141 -113212 152599
5357 325418 303388 -364976 -43728 -27514 203299 -398373 -50364 -344379 156056 -24695 -94988
5346 -94988 -10510 -30682 236648 12751 81706 12798 179715 -154602 -285953 101270 -17599
5334 -120294 276145 -140740 -161476 78778 -144892 301104 38530 152408 86918 126735 -85707
5322 165801 -234659 -116524 35899 35875 -229469 173599 109250 84193 193828 -142486 148488
5310 -408317 123134 16360 183222 -76952 -90863 21708 -19121 -23232 66489 -36336 138500
5298 118875 -31452 -64422 43762 -107047 -82802 -224734 -225712 90001 -61006 -83583 84137 -303942
5285 31137 -113332 -45903 86793 -120603 136200 127301 88561 -103740 -134589 269359 289887
5274 289887 259122 169916 -184146 -10485 -173244 49955 -24697 68377 171518 70537 110613
5263 110613 103667 532255 -76554 77322 62118 -22908 -377032 321135 110820 -96743 -191587
5252 -191587 -12182 84185 -142228 199674 -454448 -197865 16684 262878 -210490 109727
5241 -68071 -184919 26957 -44176 38959 -102857 7127 131032 -53855 265081 32468 160629
5230 160629 31950 -246012 109785 7936 -294614 56813 170180 -431269 -146243 170998
5219 215806 20827 86088 114237 -316172 -292439 168897 -287484 63786 12156 19847 -146650
5207 -96147 100283 -36262 117288 -62221 -147374 -326037 115256 10802 -34500 -227788 -158880
5196 -158880 -10913 65710 24018 361156 -306712 -131907 -92734 269311 -42670 -102503 -184056
5185 -184056 -119336 156404 -20406 -150913 -166864 -11274 -84353 -167875 6964 -16737 -64914
5174 -64914 167528 -137955 -62297 71778 -63440 -427167 63413 212605 21593 63290 -62399
5162 -68667 104077 161468 275819 411410 203804 -105652 306177 -1989 -180667 183160
5151 -8568 151550 191890 64469 -335123 165652 -217126 -201500 125171 217980 -45647 -210831
5140 -210831 64740 90585 -427259 300227 58751 20147 234484 88842 -115668 165048 -207671
5128 -100416 -114879 106015 -244591 221299 -83719 60574 -207199 -339355 103987 349683
5118 349683 52449 -17167 100761 -141717 285318 -92035 -209008 95235 233027 -71111 192201
5106 -47173 115089 179172 117351 214192 -120828 188928 -26796 -204785 82800 -142939 203592
5094 101240 13188 -176021 -91215 -284647 -53405 -131391 -141049 149070 -93159 -160410 296539
5082 238387 333560 -243697 -49609 -82373 -49845 59840 9167 -204744 -12559 2066 83147 -221213
5069 16009 153531 143317 -37561 -3689 -58555 63649 -40106 -136046 -206840 -9412 104499 314438
5057 314438 84454 402444 14115 -1279 -247307 -187876 -155230 -133218 73648 282521 104416
5045 34524 -164937 146107 -22431 184586 42043 -116890 -250969 -169730 250237 106069
5034 -213330 -37584 287869 247924 -10282 101076 -222596 12854 -57936 493 161350 230468
5023 230468 337479 -211380 -252845 -19001 391770 -132344 -15759 -149115 -116862 178018
5012 -63961 19961 -18008 282380 -110706 -185985 -139692 282554 -49892 131079 -221181 16975
5000 259445 277891 -96141 250008 331105 -48016 14273 -244263 201121 74279 28105 -336626
4988 -8784 178719 447 260312 -131103 -134608 -53068 66419 18048 140682 231553 -168194 -97280
4976 -97280 -107336 -132629 201599 267643 388780 61191 -124648 113961 -263465 33812 187538
4965 187538 67361 7261 -5834 -341127 -81174 -72160 -195963 -44199 -106071 -72050 114889 -105478
4952 -132918 97864 -72223 -159990 -35944 285330 -189263 201788 64530 36001 -21716 -71430
4941 -71430 175355 188519 -166619 25771 -136225 217079 184775 -33070 -133580 135764 -72706
4929 101552 59488 -123070 -317547 -167093 243727 -258655 -184338 -23577 -419804 293681
4918 170579 -110981 -255242 -71954 -104964 22744 114204 36021 -132947 -151228 -286923 190196
4906 2941 220300 -15564 -127389 183476 -35427 108667 -93796 -370368 108207 73325 -342795
4894 -153250 216748 -6143 -293543 168550 47135 73730 124746 111169 225398 212474 -115571
4882 -31377 204945 442726 -5673 -29323 162648 -274206 -367146 -467732 56306 154368 314999
4871 314999 -82777 153009 146894 -154339 -90845 22634 131747 -87136 111031 -64575 -159882
4860 -159882 83247 -284798 -26006 45165 -138163 232530 34448 341061 181841 18001 172063
4849 172063 27469 289214 -25340 31858 -251951 -241099 106149 20627 -53198 -296096 65657
4837 -116069 -99719 -18869 -127894 133684 -463527 -28837 -32594 -37139 24876 216810 -15272
4825 -85954 -127660 -179818 -17110 159811 -23280 -38279 146965 -28520 69102 -41512 -38584 -273284
4813 -273284 34788 316086 -387324 53552 280183 12159 -103168 352843 224020 199321
4803 199321 45718 235994 -19961 -57419 -161287 329841 477826 120994 252393 -227667
4792 -203317 -65257 -97157 75407 237066 -86568 91829 111661 -9514 29195 156072 -204312
4780 13906 461868 -238305 47982 14669 -276761 -782 -30672 -169063 240170 -185348 26147
4768 166700 216987 41224 -281328 -176434 229615 -29407 116278 45343 -172764 -38129 -162600
4757 -162600 7792 191679 -299858 -15996 -53378 -93084 -45530 2521 -68219 -162347 122739
4745 -117033 140677 118424 85948 -332107 -45152 3038 31738 942 85070 76971 -250770 -228704
4733 -228704 -38514 -39568 -88232 -57421 121902 190169 -47747 291784 -94687 -135413 24484
4721 -43626 174935 -238380 -197123 -242902 155277 -4335 -178089 -132893 142027 338356 87389
4709 84232 221182 -108031 357780 -384254 -89167 133590 17693 -262587 92018 149355 -56668
4697 -451 -132065 -230900 157383 577411 92142 -52221 -95912 220212 235948 -134551 187029
4685 186100 165366 23420 -161601 -258356 -166963 112318 259337 81176 181340 144977 201371
4674 201371 -136534 56992 227551 382621 -220704 137190 73280 -261297 318003 113036
4663 110990 387786 -137640 317203 -332268 77459 274514 -51816 -267906 66216 33770
4653 33770 148112 68774 -248861 326876 75131 193489 55103 -61520 110231 -118036 -17577
4641 -67444 -238861 -148599 -162911 378950 -62527 30734 12728 -60927 51210 184047 114929
4630 114929 -25672 -179789 -78869 -185893 196131 63438 182404 2 83578 126256 26712 13287
4617 -172652 -36616 -77185 135201 119407 -123937 -99202 -40634 -347443 51572 -375434 23115
4605 74776 172252 -34968 -116878 169248 -237365 194413 -412746 -163781 3009 84438 375666
4594 375666 98177 277126 -44991 273195 -472911 49015 -329697 84843 -37148 -13233 48739
4582 -43054 -260578 -1995 -25753 79654 -55989 -328241 95073 389233 -111083 -340729 7419
4570 -363917 60389 135647 260912 69407 81077 374985 -127682 16909 172356 88895 -131734
4558 142894 -61632 -121173 64586 -116762 178405 17122 -187770 149765 285680 -203378
4547 -148228 -66702 113857 -36112 117783 -310289 280178 134879 69153 24427 29378 172244
4536 172244 -169695 -63189 -199724 -66181 -180122 2662 26687 -80203 353539 146651 104795
4525 104795 -104281 -49739 257882 -151026 197494 253625 257993 -202546 98945 28650 66646
$$ [...]
##END NTUPLES=NMR SPECTRUM
##END=
