
##TITLE=AC1068_TOPL01_6519229_qYJ3gEzVqc
##JCAMPDX= 6.0         $$ Bruker NMR JCAMP-DX V2.0
##DATA TYPE= NMR SPECTRUM
##DATA CLASS= NTUPLES
##ORIGIN= BRUKER
##OWNER= Administrator
$$ 1.72 TOPSPIN		Version 2.1
$$ 2012-07-13 18:31:37.953 -0500  Administrator@TOPSPIN
$$ Compression mode = diff/dup
##.OBSERVE FREQUENCY= 400.02188249412
##.OBSERVE NUCLEUS= ^1H
##.ACQUISITION MODE= SIMULTANEOUS (DQD)
##.ACQUISITION SCHEME= undefined
##.AVERAGES= 64
##.DIGITISER RES= 22
##SPECTROMETER/DATA SYSTEM= spect
##.PULSE SEQUENCE= noesygpps1d.comp
##.SOLVENT NAME= COFFEE_meoh
##.SHIFT REFERENCE= INTERNAL, COFFEE_meoh, 1, 14.96257
##AUDIT TRAIL= $$ (NUMBER, WHEN, WHO, WHERE, PROCESS, VERSION, WHAT)
$$ ##TITLE= Audit trail, TOPSPIN		Version 2.1
$$ ##JCAMPDX= 5.01
$$ ##ORIGIN= Bruker BioSpin GmbH
$$ ##OWNER= Administrator
$$ $$ C:\Bruker\TOPSPIN/data/COFFEE/nmr/AC1068_TOPL01_6519229_qYJ3gEzVqc/32/pdata/1/auditp.txt
$$ ##AUDIT TRAIL=  $$ (NUMBER, WHEN, WHO, WHERE, PROCESS, VERSION, WHAT)
(   1,<2012-07-13 18:31:33.312 -0500>,<Administrator>,<TOPSPIN>,<go>,<TOPSPIN 2.1>,
      <created by zg
	started at 2012-07-13 18:20:03.078 -0500,
	POWCHK enabled, PULCHK disabled,
       configuration hash MD5:
       6B 1B 68 BB D9 2E 58 E2 7F 35 AD 54 07 DF 0E 41
       data hash MD5: 64K
       B7 74 2B 6B 9C E4 34 1F 74 CD 28 03 19 D7 2D 8B>)
(   2,<2012-07-13 18:31:36.000 -0500>,<Administrator>,<TOPSPIN>,<proc1d>,<TOPSPIN 2.1>,
      <Start of raw data processing
       efp LB = 0.3 FT_mod = 6 PKNL = 1 PHC0 = 0 PHC1 = 0 SI = 128K 
       data hash MD5: 128K
       19 B3 8C 2F 19 02 D7 56 09 E0 62 9F 69 40 0E 8C>)
(   3,<2012-07-13 18:31:37.203 -0500>,<Administrator>,<TOPSPIN>,<proc1d>,<TOPSPIN 2.1>,
      <pk PHC0 = 0.03295898 PHC1 = 0 
       data hash MD5: 128K
       14 9F D3 37 7B 65 28 C2 BC 25 05 16 1D E5 31 61>)
(   4,<2012-07-13 18:31:37.437 -0500>,<Administrator>,<TOPSPIN>,<proc1d>,<TOPSPIN 2.1>,
      <abs ABSG = 1 
       data hash MD5: 128K
       6D 7B BC FF 85 E6 D9 94 94 08 35 16 48 D1 57 1B>)
(   5,<2012-07-13 18:31:37.515 -0500>,<Administrator>,<TOPSPIN>,<proc1d>,<TOPSPIN 2.1>,
      <abs ABSG = 2 
       data hash MD5: 128K
       8B 10 DA 59 AC F4 2D 79 C6 E4 BF D8 3C B9 69 64>)
(   6,<2012-07-13 18:31:37.562 -0500>,<Administrator>,<TOPSPIN>,<proc1d>,<TOPSPIN 2.1>,
      <abs ABSG = 3 
       data hash MD5: 128K
       56 24 D6 9B 20 E7 3C 7D 06 38 01 2F E9 B0 9B 2C>)
(   7,<2012-07-13 18:31:37.750 -0500>,<Administrator>,<TOPSPIN>,<proc1d>,<TOPSPIN 2.1>,
      <abs ABSG = 4 
       data hash MD5: 128K
       46 1E C6 08 47 9B 98 A3 85 0A 88 82 2E 4F F9 98>)
(   8,<2012-07-13 18:31:37.859 -0500>,<Administrator>,<TOPSPIN>,<proc1d>,<TOPSPIN 2.1>,
      <abs ABSG = 5 
       data hash MD5: 128K
       4B FB 82 9C 32 80 8B F4 06 63 4A 31 D0 38 CC BC>)
$$ ##END=
$$ 
$$ $$ hash MD5
$$ $$ D2 9C 39 62 75 F5 20 B0 C1 A8 00 7C B6 90 12 C2
##$RELAX= 
##$RELAX= 
##$RELAX= 
##$RELAX= 
##$RELAX= 
##$RELAX= 
##$RELAX= 
##$RELAX= 
##$RELAX= 
$$ Bruker specific parameters
$$ [...]
##$TP07= 0
##$TPNAME0= <>
##$TPNAME1= <>
##$TPNAME2= <>
##$TPNAME3= <>
##$TPNAME4= <>
##$TPNAME5= <>
##$TPNAME6= <>
##$TPNAME7= <>
##$TPOAL= (0..7)
0.5 0.5 0.5 0.5 0.5 0.5 0.5 0.5
##$TPOFFS= (0..7)
0 0 0 0 0 0 0 0
##$TUNHIN= 0
##$TUNHOUT= 0
##$TUNXOUT= 0
##$USERA1= <user>
##$USERA2= <user>
##$USERA3= <user>
##$USERA4= <user>
##$USERA5= <user>
##$V9= 5
##$VALIST= <valist>
##$VCLIST= <CCCCCCCCCCCCCCC>
##$VD= 0
##$VDLIST= <DDDDDDDDDDDDDDD>
##$VPLIST= <PPPPPPPPPPPPPPP>
##$VTLIST= <TTTTTTTTTTTTTTT>
##$WBST= 2048
##$WBSW= 25
##$XGAIN= (0..3)
0 0 0 0
##$XL= 0
##$YL= 0
##$YMAX_a= 17463224
##$YMIN_a= -10821205
##$ZGOPTNS= <>
##$ZL1= 120
##$ZL2= 120
##$ZL3= 120
##$ZL4= 120
##$ABSF1= 14.96257
##$ABSF2= -5.595612
##$ABSG= 5
##$ABSL= 3
##$ALPHA= 0
##$AQORDER= 0
##$ASSFAC= 0
##$ASSFACI= 0
##$ASSFACX= 0
##$ASSWID= 0
##$AUNMP= <proc_prof1d_extract.lims>
##$AXLEFT= 0
##$AXNAME= <>
##$AXNUC= <1H>
##$AXRIGHT= 0
##$AXTYPE= 0
##$AXUNIT= <>
##$AZFE= 0.1
##$AZFW= 0.1
##$BCFW= 0
##$BC_mod= 0
##$BYTORDP= 0
##$COROFFS= 0
##$CY= 15
##$DATMOD= 1
##$DC= 0
##$DFILT= <>
##$DTYPP= 0
##$F1P= 0
##$F2P= 0
##$FCOR= 0.5
##$FTSIZE= 131072
##$FT_mod= 6
##$GAMMA= 0
##$GB= 0
##$INTBC= 1
##$INTSCL= 1
##$ISEN= 128
##$LB= 0.3
##$LEV0= 0
##$LPBIN= 0
##$MAXI= 10000
##$MC2= 0
##$MEAN= 0
##$ME_mod= 0
##$MI= 0
##$NCOEF= 0
##$NC_proc= -2
##$NLEV= 6
##$NOISF1= 0
##$NOISF2= 0
##$NSP= 0
##$NTH_PI= 0
##$NZP= 0
##$OFFSET= 14.96257
##$PC= 1
##$PHC0= 0.03295898
##$PHC1= 0
##$PH_mod= 1
##$PKNL= yes
##$PPARMOD= 0
##$PPDIAG= 0
##$PPIPTYP= 0
##$PPMPNUM= 2147483647
##$PPRESOL= 1
##$PSCAL= 4
##$PSIGN= 0
##$PYNMP= <proc.py>
##$REVERSE= no
##$SF= 400.020009007846
##$SI= 131072
##$SIGF1= 0
##$SIGF2= 0
##$SINO= 400
##$SIOLD= 131072
##$SPECTYP= <>
##$SREGLST= <1H.CDCl3>
##$SSB= 0
##$STSI= 131072
##$STSR= 0
##$SW_p= 8223.68421052631
##$SYMM= 0
##$S_DEV= 0
##$TDeff= 65536
##$TDoff= 0
##$TI= <>
##$TILT= no
##$TM1= 0
##$TM2= 0
##$TOPLEV= 0
##$USERP1= <user>
##$USERP2= <user>
##$USERP3= <user>
##$USERP4= <user>
##$USERP5= <user>
##$WDW= 1
##$XDIM= 131072
##$YMAX_p= 463289293
##$YMIN_p= -12139
##$CURPLOT= <Network HP LaserJet P1505>
##$CURPRIN= <$Network HP LaserJet P1505>
##$DFORMAT= <normdp>
##$LAYOUT= <+/1D_H.xwp>
##$LFORMAT= <normlp>
##$PFORMAT= <normpl>
##$SURQMSG= 1
$$ End of Bruker specific parameters
$$ ---------------------------------
##NTUPLES= NMR SPECTRUM
##VAR_NAME=  FREQUENCY,     SPECTRUM/REAL,   SPECTRUM/IMAG
##SYMBOL=    X,             R,               I
##VAR_TYPE=  INDEPENDENT,   DEPENDENT,       DEPENDENT
##VAR_FORM=  AFFN,          ASDF,            ASDF
##VAR_DIM=   131072,        131072,          131072
##UNITS=     HZ,            ARBITRARY UNITS, ARBITRARY UNITS
##FACTOR=    0.0627417313425164, 1,          1
##FIRST=     8223.62146879497, 4079,         -68170
##LAST=      0,             5529,            -67065
##MIN=       0,             -12139,          0
##MAX=       8223.62146879497, 463289293,    0
$$ Real data points
##PAGE= N=1
##DATA TABLE= (X++(R..R)), XYDATA
$$ [...]
63198I24564l1566l2304l1241k9733k8468k6694k3703k0156j7179j4710j1764
63187F57046q034m293j195J480M206O954R400J1426J3068J4279J5033J5512J6018
63174G50900J6740J7679J8650J9304J9350J8879J8309J7930J7625J7101J6175
63163I48642J4724J2595R837O834L886O69l391q163j2680j6210j9011k1650k3971
63150H92111k5371k5781k5643k4954k3244k0682j8375j7025j6121j4925j3617
63139F66373j2669j1782j0464r148q602q416p418n696m800n464o329n822m273
63126E65490l147k820k375j327k85K53P01J583K685L500L951M213M213L958M022
63111E84615M981O397P081O592N843N917O719P411P721Q056Q488Q475P868P343
$$ plain form
63198 924564 892998 860694 829453 799720 771252 744558 720855 700699 683520 668810 657046
63187 657046 649012 644719 643524 645004 649210 656164 665564 676990 690058 704337 719370 734882 750900
63174 750900 767640 785319 803969 823273 842623 861502 879811 897741 915366 932467 948642
63163 948642 963366 975961 985798 992632 996518 997187 993796 985633 972953 956743 937732 916082 892111
63150 892111 866740 840959 815316 790362 767118 746436 728061 711036 694915 679990 666373
63139 666373 653704 641922 631458 622310 613708 605292 597874 592178 587378 581914 575585 569763 565490
63126 565490 562343 559523 557148 555821 555536 555789 556490 558073 560758 564258 568209 572422 576635 580593 584615
63111 584615 589596 595993 603074 609666 615509 621426 628145 635556 643277 651333 659821 668296 676164 683507
63097F83507P360P267O107M002K038R53N72M76N66Q21R92Q46M32o5m76o09k91
63080G14498L62R99J425J813K430L277M085M616M881N140N631O295O871P244P517
63065G77084P716P779Q041R237J1665J4702J7460J9674K1517K3092K4682K7051
63053I69700L0608L4486L7429L9454M1682M4507M7044M8710N0174N2087N3764
63042A449645N4017N2714N0658M8441M6245M4511M3819M4030M4271M3972M3410
63031A965733M3073M2891M2253M0509L7332L2757K6907J9629J0555k73j1981k3391
63019B225994l3864m3292n1475n7994o2838o6421o8676o8672o5667o0407n4603
63008A592085m9108m3276l6408k9140k2675j7045j1089m240K646Q653J4101J9698
$$ plain form
63097 683507 690867 698134 704241 708243 710281 711234 711806 712282 712848 713669 714661 715507 715939 715874 715398 714789 714498
63080 714498 714860 715859 717284 719097 721527 724804 728889 733505 738386 743526 749157 755452 762323 769567 777084
63065 777084 784800 792579 800620 809857 821522 836224 853684 873358 894875 917967 942649 969700
63053 969700 1000308 1034794 1072223 1111677 1153359 1197866 1244910 1293620 1343794 1395881 1449645
63042 1449645 1503662 1556376 1607034 1655475 1701720 1746231 1790050 1834080 1878351 1922323 1965733
63031 1965733 2008806 2051697 2093950 2134459 2171791 2204548 2231455 2251084 2261639 2261366 2249385 2225994
63019 2225994 2192130 2148838 2097363 2039369 1976531 1910110 1841434 1772762 1707095 1646688 1592085
63008 1592085 1542977 1499701 1463293 1434153 1411478 1394433 1383344 1379104 1381750 1390403 1404504 1424202
62996A424202K4991K8699L0502L1500L2747L4160L5183L5724L6010L5984L5457
62985A785159L4545L3418L1815K9270K5732K1537J6770J1047M065l917j2286k0627
62973A956528k8916l7207m5277n2592n8554o2750o5028o5568o4805o3162o0789
62962A351880n7712n4182n0517m6582m1992l7012l2693k9608k7014k3910k0555
62951I30103j8109j6950j6229j5103j3583j2012j0522r311q695q570q331p691
62939G84997o988o498o016n541n625o510p467p608p029o481o285o177o012n978
62925F94782o138o308o365o308o089n709n370n223n080m760m494m589m850m817
62911F18682m512m415m704m964m811m379l999l741l464l066k473j604n67K05L60
$$ plain form
62996 1424202 1449193 1477892 1508394 1539894 1572641 1606801 1641984 1677708 1713718 1749702 1785159
62985 1785159 1819704 1853122 1884937 1914207 1939939 1961476 1978246 1989293 1993358 1989441 1977155 1956528
62973 1956528 1927612 1890405 1845128 1792536 1733982 1671232 1606204 1540636 1475831 1412669 1351880
62962 1351880 1294168 1239986 1189469 1142887 1100895 1063883 1031190 1001582 974568 950658 930103
62951 930103 911994 895044 878815 863712 850129 838117 827595 818284 809589 801019 792688 784997
62939 784997 778009 771511 765495 759954 754329 747819 740352 732744 725715 719234 712949 706772 700760 694782
62925 694782 688644 682336 675971 669663 663574 657865 652495 647272 642192 637432 632938 628349 623499 618682
62911 618682 614170 609755 605051 600087 595276 590897 586898 583157 579693 576627 574154 572550 571983 572188 572548
62896E72548J09R6O12J085O46q17k405l165l130l081l446l808l587k849k167j923
62880E44718j985j974j657j077m34R2M56O63P27P01P20R12J308J894K525K809
62864E50398K373J417O82N59O33M51K79M81O16k4j077j385o47N1l26j508k489
62847E50484k716k329j731j328j300j367j190j097j807l201m104l651k316j184
62833E21163q05j099j747k202j984j510j965l647n158n040l706k802l048l699
62819D82751l970l958m034m151m042l576k758j695o92o7J32J17K04P81J969L100
62803D60111L134K128J597K721M760O152O680P443Q863J0069J0389J0369J0900
62790E45316J2168J3902J5826J7547J8612J9161J9986K1668K4048K6884L0306
$$ plain form
62896 572548 572657 572753 573365 574450 575096 574279 571874 568709 565579 562498 559052 555244 551657 548808 546641 544718
62880 544718 542733 540759 539102 538025 537591 537683 538139 538802 539529 540230 540950 541862 543170 545064 547589 550398
62864 550398 552771 554188 554870 555429 556062 556513 556792 557273 557889 557865 556788 555403 554756 554807 554481 552973 550484
62847 550484 547768 545439 543708 542380 541080 539713 538523 537426 535619 532418 528314 524663 522347 521163
62833 521163 520358 519259 517512 515310 513326 511816 509851 506204 501046 496006 492300 489498 486450 482751
62819 482751 478781 474823 470789 466638 462596 459020 456262 454567 453875 453808 453940 454057 454261 455042 457011 460111
62803 460111 463245 465373 466970 469691 474451 480603 487283 494726 503589 513658 524047 534416 545316
62790 545316 557484 571386 587212 604759 623371 642532 662518 684186 708234 735118 765424
62779G65424L4304L8340M2042M5848N0377N5516O0662O5624P0684P5798Q0287
62768A384906Q3374Q4637Q3946Q1253P6637P0303O2393N2828M1386K7968J2918
62757B062549k819j7935l1415m3141n3698o3442p1757p7491q0186q0656q0112
62746A459897p8986p6921p3757o9924o5864o1591n7079n2560m8275m4335m1008
62735G89597l8523l6320l3246k9034k5026k2598k1381j9887j7546j5198j3616
62724E17222j2511j1202r463p515n722m467l850l395k528j351m37J06P08J505
62710D57100K159K731L898N962Q288J0168J1691J3351J5275J7311J9549K2193
62698E89676K5221K8460L1862L5383L8921M2576M6706N1350N5916N9765O2786
$$ plain form
62779 765424 799728 838068 880110 925958 976335 1031851 1092513 1158137 1228821 1304619 1384906
62768 1384906 1468280 1552917 1636863 1718116 1794753 1865056 1927449 1980277 2021663 2049631 2062549
62757 2062549 2059730 2041795 2010380 1967239 1913541 1850099 1778342 1700851 1620665 1540009 1459897
62746 1459897 1380911 1303990 1230233 1160309 1094445 1032854 975775 923215 874940 830605 789597
62735 789597 751074 714754 681508 652474 627448 604850 583469 563582 546036 530838 517222
62724 517222 504711 493509 484046 476531 470809 466342 462492 459097 456569 455218 454781 454887 455595 457100
62710 457100 459259 461990 465888 471850 480138 490306 501997 515348 530623 547934 567483 589676
62698 589676 614897 643357 675219 710602 749523 792099 838805 890155 946071 1005836 1068622
62687A068622O5104O6491O6512O4982O1873N7006N0209M1735L2040K1285R434
62676A605293l187j5800k7648l8243m7131n3927n8721o2163o4763o6287o6100
62665A101323o4021o0644n6789n2889m9042m5414m2207l9261l6101l2572k9151
62654E93232k6353k4103k2006k0056j8535j7292j5671j3503j1608j0913j1178
62643D02014j1148j0007q278p093o785o596n825m831m589n379o390o678o133n306
62629C06976m593m020l570l325l220k974k403j597p99j85J98L75L39J03q3K78
62613B81500J384K592K961K458K117K720L845M652N104N742O652P365P702Q026
62599C44820Q699R788J1264J3010J4732J6341J8303K1006K3991K6545K8889L1942
$$ plain form
62687 1068622 1133726 1200217 1266729 1331711 1393584 1450590 1500799 1542534 1574574 1595859 1605293
62676 1605293 1602106 1586306 1558658 1520415 1473284 1419357 1360636 1298473 1233710 1167423 1101323
62665 1101323 1037302 976658 919869 866980 817938 772524 730317 691056 654955 622383 593232
62654 593232 566879 542776 520770 500714 482179 464887 449216 435713 424105 413192 402014
62643 402014 390866 380859 372581 365488 358703 352107 346282 341451 336862 331483 325093 318415 312282 306976
62629 306976 302383 298363 294793 291468 288248 285274 282871 281274 280475 280290 280488 280863 281202 281305 281222 281500
62613 281500 282884 285476 288437 290895 293012 295732 299577 304229 309333 315075 321727 329092 336794 344820
62599 344820 353519 363307 374571 387581 402313 418654 436957 457963 481954 508499 537388 569330
62587E69330L5828L9489M2008M3507M4375M4431M3345M1258L8301L3972K7665
62576A003509J9680J1161L103m228j1001j7315k2998k7752l1372l3890l5409l5963
62564H17525l5712l5101l4453l3484l1598k8760k5616k2812k0588j8994j7945
62553E12462j6946j5432j3613j2408j2241j2407j2019j1112j0377j0167j0187
62542C75553r976r288q154o867n756m833l854k838k185k051j948j290o0J233K144
62527C19830K537K524K377K387K686L344M563O365Q147R108R320R824J1360J3505
62513D07877J5374J6778J8258K0298K2919K5759K8283L0201L1850L3858L6142
62502F87597L7750L7893L6692L4494L1108K6299K0570J4708Q879K711l889j0635
$$ plain form
62587 569330 605158 644647 686655 730162 774537 818968 862313 903571 941872 975844 1003509
62576 1003509 1023189 1034350 1037453 1033225 1022224 1004909 981911 954159 922787 888897 853488 817525
62564 817525 781813 746712 712259 678775 647177 618417 592801 569989 549401 530407 512462
62553 512462 495516 480084 466471 454063 441822 429415 417396 406284 395907 385740 375553
62542 375553 365577 356289 348135 341268 335512 330679 326825 323987 321802 319751 317803 316513 316453 317686 319830
62527 319830 322367 324891 327268 329655 332341 335685 340248 346613 354760 363868 373188 383012 394372 407877
62513 407877 423251 440029 458287 478585 501504 527263 555546 585747 617597 651455 687597
62502 687597 725347 763240 799932 834426 865534 891833 912403 927111 935990 938701 934812 924177
62490I24177j7256k3274k7731k9926l0483l0828l1481l1572l0223k7786k5294
62479F18323k3275k1518j9648j7504j5122j2738j0783r554q830q010o683n045
62467D59613l617k616j726n99N74J300J571J953K727L398L489L463M226N808P212
62452D86776P751P949Q688R920J0748J0688J0226R958R644Q565O538M079J571
62439E93101j212m509p980j1023j3438j5366j6751j7338j7098j6280j5054j3512
62427D43540j1962j0807j0076r357q258o690m804l005j797j217n77P35K376L592
62413C81693M405N473O795P597P653P798Q683R842J0500J0565J0305R729Q853
62400D89891P965P045N494L119P38p94j699k701l848m702n276n960o731p217p345
$$ plain form
62490 924177 906921 883647 855916 825990 795507 764679 733198 701626 671403 643617 618323
62479 618323 595048 573530 553882 536378 521256 508518 497735 488181 479351 471341 464658 459613
62467 459613 455996 453380 451654 451055 451629 452929 454500 456453 459180 462578 466067 469530 473756 479564 486776
62452 486776 494527 502476 511164 521084 531832 542520 552746 562704 572348 580913 587451 591530 593101
62439 593101 591889 587380 579400 568377 554939 539573 522822 505484 488386 472106 457052 443540
62427 443540 431578 420771 410695 401338 393080 386390 381586 378581 376784 375567 374990 375725 378101 381693
62413 381693 386098 391571 398366 405963 413616 421414 430097 439939 450439 461004 471309 481038 489891
62400 489891 497856 504901 510395 513514 514252 513458 511759 509058 505210 500508 495232 489272 482541 475324 467979
62385D67979p255o770n689m407l551l076k338r11J213L968P004R449J0788J1867
62371D78271J4100J7664K1352K4296K6962L0150L3853L7533M0871M3867M6603
62360H15522M9258N1938N4214N5286N4763N2873M9739M4967L8297L0162K1265
62349A318284J1967K534o358j3862j9624k3944k7383l0444l3466l6488l9137m0843
62337A061236m1231m0335l8535l6346l4163l2077k9893k7358k4454k1615j9597
62326G15632j8869j9062j9128j8180j6095j3324j0462q060o423n307m172k960
62314E73590k213k172k285k031j740k007k736l496m436n931p558q408q409q445
62300E11723q902r043q127o515n185m608m454m048k883j031P35J680K089K972
$$ plain form
62385 467979 460724 453954 448265 443858 440307 437231 434893 433982 435195 439163 446167 455616 466404 478271
62371 478271 492371 510035 531387 555683 582645 612795 646648 684181 725052 768919 815522
62360 815522 864780 916718 970932 1026218 1080981 1133854 1183593 1228560 1266857 1297019 1318284
62349 1318284 1330251 1332785 1326427 1312565 1292941 1268997 1241614 1211170 1177704 1141216 1102079 1061236
62337 1061236 1020005 979670 941135 904789 870626 838549 808656 781298 756844 735229 715632
62326 715632 696763 677701 658573 640393 624298 610974 600512 592452 586029 580722 576550 573590
62314 573590 571377 569205 566920 564889 563149 561142 558406 554910 550474 544543 536985 528577 520168 511723
62300 511723 502821 493778 485651 479136 473951 469343 464889 460841 457958 456927 457662 459342 461431 464403
62286D64403M579N914O114N739O005P136Q271Q819R096R491R693R270Q653Q888
62272E72071J0333J2071J2933J2875J2891J3697J5064J6560J8356K0891K4131
62261G41873K7712L1535L5691M0005M4191M8295N2342N5641N6982N5650N1757
62250A241674M5631L7498K7812J7300O498m255j4289k2681k9101l4109l8327m1832
62238A191819m4486m6300m7084m6343m4040m1023l8154l5299l1772k7545k3432
62227G66341k0083j7352j4839j2592j0955r908q900p451n749m498m163m458m678
62214F40715m330l459k524k049k149k216j390M31K264L142L210L394M187N373
62200F44599O747Q447J0466J2428J3987J5113J5874J6468J7438J9327K1914K4290
$$ plain form
62286 464403 468982 474896 481010 486749 492754 499890 508161 516980 526076 535567 545260 554530 563183 572071
62272 572071 582404 594475 607408 620283 633174 646871 661935 678495 696851 717742 741873
62261 741873 769585 801120 836811 876816 921007 969302 1021644 1077285 1134267 1189917 1241674
62250 1241674 1287305 1324803 1352615 1369915 1376413 1372158 1357869 1335188 1306087 1271978 1233651 1191819
62238 1191819 1147333 1101033 1053949 1007606 963566 922543 884389 849090 817318 789773 766341
62227 766341 746258 728906 714067 701475 690520 680612 671712 664261 658512 654014 649851 645393 640715
62214 640715 636385 632926 630402 628353 626204 623988 622598 623029 625293 628435 631645 635039 639226 644599
62200 644599 651346 659793 670259 682687 696674 711787 727661 744129 761567 780894 802808 827098
62188H27098K5849K6803K7481K7669K6900K5077K2519J9587J6497J3227R582N617
62176A073906K056j28o45j8J286L388O572J0773J5717K1027K6044K9961L2479
62163A222418L3878L4173L2719K9065K3820J8184J2926Q098L590m76l804o236
62151A408355q119j0339j3574j7377k0479k2150k2811k3018k2529k0849j8258
62140A208852j5629j3506j1872j0611r661q824p943p200o855o720o248n152l636
62127A094995k051n37J024K843M975P156R062J0755J2568J4464J5946J6808J7516
62114A205524J8513J9602K0459K1261K2268K3094K3151K2633K2372K2757K3427
62103A445061K4129K5220K7080K9486L1878L4008L6081L8457M1306M4487M7666
$$ plain form
62188 827098 852947 879750 907231 934900 961800 986877 1009396 1028983 1045480 1058707 1068289 1073906
62176 1073906 1075962 1075834 1075189 1075171 1076457 1079845 1086417 1097190 1112907 1133934 1159978 1189939 1222418
62163 1222418 1256296 1290469 1323188 1352253 1376073 1394257 1407183 1415281 1418871 1418395 1414591 1408355
62151 1408355 1400236 1389897 1376323 1358946 1338467 1316317 1293506 1270488 1247959 1227110 1208852
62140 1208852 1193223 1179717 1167845 1157234 1147573 1138749 1130806 1123606 1116751 1110031 1103783 1098631 1094995
62127 1094995 1092944 1092407 1093431 1096274 1101249 1108405 1117467 1128222 1140790 1155254 1171200 1188008 1205524
62114 1205524 1224037 1243639 1264098 1285359 1307627 1330721 1353872 1376505 1398877 1421634 1445061
62103 1445061 1469190 1494410 1521490 1550976 1582854 1616862 1652943 1691400 1732706 1777193 1824859
62092A824859N0660N3589N6477N8779N9601N8544N6101N3260N0925M9767N0162
62081B422724N1945N4261N5955N6178N4599N1184M6071L9885L3941K9696K7887
62070B924326K8246L0115L2968L6244L9127M1032M2078M2655M2655M1670L9848
62059C340964L7892L6074L3918L1135K8289K6153K4874K4154K3830K3744K3353
62048C654380K2009J9689J7097J5151J4434J4919J6021J7063J7900J8841J9877
62037C847381K0511K0476K0147J9815J9128J7686J5803J4023J2264J0005P067
62026D024306L618l17m642q687j1778j4211j6839j9634k1522k1876k1373k0879
62014C866166k0204j8648j6236j3649j1136q239m695r38K563O073J0216J5029
$$ plain form
62092 1824859 1875519 1929108 1985585 2044364 2103965 2162509 2218610 2271870 2322795 2372562 2422724
62081 2422724 2474669 2528930 2584885 2641063 2695662 2746846 2792917 2832802 2866743 2896439 2924326
62070 2924326 2952572 2982687 3015655 3051899 3091026 3132058 3174136 3216791 3259446 3301116 3340964
62059 3340964 3378856 3414930 3448848 3479983 3508272 3534425 3559299 3583453 3607283 3631027 3654380
62048 3654380 3676389 3696078 3713175 3728326 3742760 3757679 3773700 3790763 3808663 3827504 3847381
62037 3847381 3867892 3888368 3908515 3928330 3947458 3965144 3980947 3994970 4007234 4017239 4024306
62026 4024306 4027924 4027607 4022965 4014278 4002500 3988289 3971450 3951816 3930294 3908418 3887045 3866166
62014 3866166 3845962 3827314 3811078 3797429 3786293 3778054 3773359 3772421 3774984 3781057 3791273 3806302
62002C806302J9796K3887K7399L0671L3370L4436L3063K9463K4498J8868J2827
61991D094580O564M10n343j0554j4991j8190j9780j9996j9709j9819k0580k1571
61979C931021k2310k2820k3587k5086k7413l0190l2691l4331l5173l5910l6992
61968C604518l8095l8657l8777l9054l9643l9978l9548l8428l6974l5343l3505
61957C186516l1375k8872k6141k3632k1596j9525j6692j3191r714o259j889L853
61945B991483J0066J5550K0088K4174K7989L1252L3691L5167L5733L5970L6728
61934C297891L8032L8751L7890L5751L3283L0793K7978K4708K1110J7370J4157
61923C617714J2721J3833J7042K1787K8634L8366N0484O3928P8898R6566J16979
$$ plain form
62002 3806302 3826098 3849985 3877384 3908055 3941425 3975861 4008924 4038387 4062885 4081753 4094580
61991 4094580 4101144 4101554 4096211 4085657 4070666 4052476 4032696 4012700 3992991 3973172 3952592 3931021
61979 3931021 3908711 3885891 3862304 3837218 3809805 3779615 3746924 3712593 3677420 3641510 3604518
61968 3604518 3566423 3527766 3488989 3449935 3410292 3370314 3330766 3292338 3255364 3220021 3186516
61957 3186516 3155141 3126269 3100128 3076496 3054900 3035375 3018683 3005492 2995778 2989519 2987630 2991483
61945 2991483 3001549 3017099 3037187 3061361 3089350 3120602 3154293 3189460 3225193 3261163 3297891
61934 3297891 3335923 3374674 3412564 3448315 3481598 3512391 3540369 3565077 3586187 3603557 3617714
61923 3617714 3630435 3644268 3661310 3683097 3711731 3750097 3800581 3864509 3943407 4039973 4156952
61912D156952J38758J61104J84700K10253K37449K66058K97011L31634L70670
61903F354589M14678M64503N20341N80659O42346P00989P49972P79598P78107
61894A1985782P34213O39794M92687K99458P6131j54962l70914n53342o90980
61885A2457867p80144q23678q28938q05467p62941p09412o50380n89388n29462
61876E978057m73396m22534l76241l33452k94314k59751k29883k03724j80217
61867C204545j58844j39399j21830j06237r2399p9410o6361n3252m0632k8555
61857B317626j6606m891N881J5389K4017L1975L8877M4418M8665N1306N1335M8122
61845B656114M2260L4795K6086J6092N384m840j3592k0285k4267k4917k2318j7322
$$ plain form
61912 4156952 4295710 4456814 4641514 4851767 5089216 5355274 5652285 5983919 6354589
61903 6354589 6769267 7233770 7754111 8334770 8977116 9678105 10428077 11207675 11985782
61894 11985782 12719995 13359789 13852476 14151934 14228065 14073103 13702189 13148847 12457867
61885 12457867 11677723 10854045 10025107 9219640 8456699 7747287 7096907 6507519 5978057
61876 5978057 5504661 5082127 4705886 4372434 4078120 3818369 3588486 3384762 3204545
61867 3204545 3045701 2906302 2784472 2678235 2585836 2506426 2440065 2386813 2346181 2317626
61857 2317626 2301020 2296129 2302010 2317399 2341416 2373391 2412268 2456686 2505351 2556657 2607992 2656114
61845 2656114 2698374 2733169 2759255 2775347 2780731 2775891 2762299 2742014 2717747 2692830 2670512 2653190
61833B653190j0798l291M558J1748J7316K0705K1555J9549J4670P302k053j3019
61821B741432k5005l6983m7753n6389o2371o5595o6440o5541o3250n9501n4314
61810B138290m8091m1246l3865k6039j8163j0610l307L941J1075J8098K5397L3195
61798B048675M0892M7685N3738O0089O7397P5448Q3919R2963J02777J13322J24856
61787B911761J38172J53839J71639J91274K13288K38850K68771L03142L41914
61778D932650L85540M35156M92297N58273O33602P18062Q11308R13162J022980
61769A0903030J138516J254736J362771J449382J497720J489162J405643J233155
61761B1734115R67282O18865K15297k04797o00706r38010j194275j361676j445743
$$ plain form
61833 2653190 2642392 2639101 2643659 2655407 2672723 2693428 2714983 2734532 2749202 2756504 2754451 2741432
61821 2741432 2716427 2679444 2631691 2575302 2512931 2447336 2380896 2315355 2252105 2192604 2138290
61810 2138290 2090199 2048953 2015088 1989049 1970886 1960276 1956969 1960910 1971985 1990083 2015480 2048675
61798 2048675 2089567 2137252 2190990 2251079 2318476 2393924 2477843 2570806 2673583 2786905 2911761
61787 2911761 3049933 3203772 3375411 3566685 3779973 4018823 4287594 4590736 4932650
61778 4932650 5318190 5753346 6245643 6803916 7437518 8155580 8966888 9880050 10903030
61769 10903030 12041546 13296282 14659053 16108435 17606155 19095317 20500960 21734115
61761 21734115 22701397 23320262 23535559 23330762 22730056 21792046 20597771 19236095 17790352
61752A7790352j460329j421829j346079j247706j139376j030226r25376q27216
61744H392215p36939o55094n81751n16789m59889m10140l66053l26342k90538
61735D048680k58704k30730k06032j83777j63383j44865j28602j14646j02424
61726B515517r1376q1579p3433o6964o1854n8068n5789n4709n3802n2067m9303
61715A816573m6041m2907m0059l7117l3611k9534k5344k1469j8106j5617j4499
61704A492269j4649j5097j5071j4947j5545j6776j7769j8135j8371j8942j9669
61693A307298k0128k0100j9585j8875j8577j8964j9319j8635j7004j5579j5017
61682A105515j4733j4013j3005j2075j0944r172p076n394m253l118j662r8J441
$$ plain form
61752 17790352 16330023 14908194 13562115 12314409 11175033 10144807 9219431 8392215
61744 8392215 7655276 7000182 6418431 5901642 5441753 5031613 4665560 4339218 4048680
61735 4048680 3789976 3559246 3353214 3169437 3006054 2861189 2732587 2617941 2515517
61726 2515517 2424141 2342562 2269129 2202165 2140311 2082243 2026454 1971745 1917943 1865876 1816573
61715 1816573 1770532 1727625 1687566 1650449 1616838 1587304 1561960 1540491 1522385 1506768 1492269
61704 1492269 1477620 1462523 1447452 1432505 1416960 1400184 1382415 1364280 1345909 1326967 1307298
61693 1307298 1287170 1267070 1247485 1228610 1210033 1191069 1171750 1153115 1136111 1120532 1105515
61682 1105515 1090782 1076769 1063764 1051689 1040745 1031573 1024497 1019103 1014850 1011732 1010070 1009972 1011413
61669A011413L250N529P768R015Q724P149M898K347l19k596l697l290j943o18
61655A047630J20K76J82L84J344K756L522K942J670Q72P41N48j3n62j079k201
61639A059132m110n950o864o950o696n994m353j720J444M736Q041J1234J3968
61626A055918J5691J5850J4300J1588Q527N428K160j004l234m184m549n195o036
61613A105260o386o090n753n920o527p199p697q000q238q611r262j0096j0857
61600A004624j1336j1506j1447j1215j0820j0316r897r766r854r790r241q218
61588H81218o961n717m665l788k742j169O50J999K813L945N946Q178R917J1652
61574I01276J4317J7622K0348K2201K4115K6646K9240L1370L3335L5486L7632
$$ plain form
61669 1011413 1014663 1020192 1027960 1036975 1045699 1052848 1057746 1060093 1059774 1057178 1053481 1050191 1048248 1047630
61655 1047630 1047750 1048026 1048208 1048592 1049936 1052692 1056214 1059156 1060826 1061698 1062439 1062987 1062974 1062412 1061333 1059132
61639 1059132 1055022 1049072 1042208 1035258 1028562 1022568 1018215 1016495 1017939 1022675 1030716 1041950 1055918
61626 1055918 1071609 1087459 1101759 1113347 1121874 1127302 1129462 1128458 1125224 1121040 1116491 1111296 1105260
61613 1105260 1098874 1092784 1087031 1081111 1074584 1067385 1059688 1051688 1043450 1034839 1025577 1015481 1004624
61600 1004624 993288 981782 970335 959120 948300 937984 928087 918321 908467 898677 889436 881218
61588 881218 874257 868540 863875 860087 857345 856176 856826 858825 861638 865583 871529 879707 889624 901276
61574 901276 915593 933215 953563 975764 999879 1026525 1055765 1087135 1120470 1155956 1193588
61563A193588L9603M1459M2620M1806L8618L4326L0426K7099K3898K1163J9656
61552A554262J9235J8837J7773J6247J4731J3374J1940R849O490J911l005p483
61540A674161j1703j6204k0755k4408k6476k7031k6536k5443k4011k2206j9877
61529A429511j7209j4733j2677j0712q574o409m215j567J679N084Q632J3242J9432
61516A401484K6110L1839L6895M2919N0641N9180O7696P6626Q6841R8512J11323
61505B090066J25206J40332J56806J74696J94036K14415K34856K54150K70868
61496C855431K82809K86959K80486K61741K30375J87097J33936P4574J3953m2969
61486E564392r2476j32733j63575j85649j99610k06035k05793k00112j90279j77457
$$ plain form
61563 1193588 1233191 1274650 1317270 1359076 1397694 1432020 1462446 1489545 1513443 1534606 1554262
61552 1554262 1573497 1592334 1610107 1626354 1641085 1654459 1666399 1676248 1682738 1684649 1681644 1674161
61540 1674161 1662458 1646254 1625499 1601091 1574615 1547584 1521048 1495605 1471594 1449388 1429511
61529 1429511 1412302 1397569 1384892 1374180 1365606 1359197 1354982 1353415 1355094 1360178 1368810 1382052 1401484
61516 1401484 1427594 1459433 1496328 1539247 1589888 1649068 1716764 1793390 1880231 1978743 2090066
61505 2090066 2215272 2355604 2512410 2687106 2881142 3095557 3330413 3584563 3855431
61496 3855431 4138240 4425199 4705685 4967426 5197801 5384898 5518834 5593408 5607361 5564392
61486 5564392 5471916 5339183 5175608 4989959 4790349 4584314 4378521 4178409 3988130 3810673
61476C810673j62815j47447j32013j16638j01316q6203p1444n7018m2974k9612
61466B863193j7237n788M999J5124K4340L2624M0358M7677N3961N8271O0342O0716
61454C238580N9956N8164N5455N2384M9507M6909M4667M3386M3606M4901M6294
61443C783809M7507M9065N1084N2803N3545N3436N2833N1594M9423M6447M2893
61432D334439L8523L2764K5290J6178N871m878j5308k5114l4326m2688m9529n4388
61420D226834n7314n8319n7234n4260n0116m5282l9691l3478k7377k1828j6345
61409C765590j0378m339Q06M508O676P205O129L883P33l645r402j5587k0685k3883
61395C707611k5272k4986k2758j8243j1368k377Q202J9975L3276M8900O6946Q6492
$$ plain form
61476 3810673 3647858 3500411 3368398 3251760 3150444 3064241 2992797 2935779 2892805 2863193
61466 2863193 2845956 2840168 2845167 2860291 2884631 2917255 2957613 3005290 3059251 3117522 3177864 3238580
61454 3238580 3298536 3356700 3412155 3464539 3514046 3560955 3605622 3649008 3692614 3737515 3783809
61443 3783809 3831316 3880381 3931465 3984268 4037813 4091249 4144082 4195676 4245099 4291546 4334439
61432 4334439 4372962 4405726 4431016 4447194 4453065 4448187 4432879 4407765 4373439 4330751 4281222 4226834
61420 4226834 4169520 4111201 4053967 3999707 3949591 3904309 3864618 3831140 3803763 3781935 3765590
61409 3765590 3755212 3750873 3751679 3756187 3762863 3770068 3776197 3780080 3780813 3777168 3767766 3752179 3731494 3707611
61395 3707611 3682339 3657353 3634595 3616352 3604984 3602607 3610809 3630784 3664060 3712960 3779906 3866398
61383C866398J06825J28212J50981J74611J98494K22711K47058K69853K88892
61374E654035L02982L11313L11720L01142K77885K42384J95981J40605Q0004J9708
61364G837759l5382q3124j23704j58000j86783k10653k29928k44570k54433k59390
61354F051792k59438k55202k48191k39840k30381k19314k06905j94237j81863
61345D016421j69377j56535j43752j31185j18335j05059r1991p9409o6552n2868
61335B901358l9206k6941j6343o603K862J1838J9900K6930L3080L8591M3539M7567
61323C036572N0076N0889N0383M8864M6274M2820L9336L6433L3811L0930K8047
61312C494435K5911K4651K3610K2232K0434J8117J4868J0435N080p75o937j3268
$$ plain form
61383 3866398 3973223 4101435 4252416 4427027 4625521 4848232 5095290 5365143 5654035
61374 5654035 5957017 6268330 6580050 6881192 7159077 7401461 7597442 7738047 7818051 7837759
61364 7837759 7802377 7719253 7595549 7437549 7250766 7040113 6810185 6565615 6311182 6051792
61354 6051792 5792354 5537152 5288961 5049121 4818740 4599426 4392521 4198284 4016421
61345 4016421 3847044 3690509 3546757 3415572 3297237 3192178 3100187 3020778 2954226 2901358
61335 2901358 2862152 2835211 2818868 2812265 2815127 2826965 2846865 2873795 2906875 2945466 2989005 3036572
61323 3036572 3086648 3137537 3187920 3236784 3283058 3325878 3365214 3401647 3435458 3466388 3494435
61312 3494435 3520346 3544997 3568607 3590839 3611273 3629390 3644258 3654693 3659773 3658998 3652061 3638793
61300C638793j9356k4697k9230l3397l7625m1875m5800m9215n2188n4754n6746
61289C193910n7949n8152n7004n4197m9938m4949l9719l4039k7610k0760j4211
61278B735382q331l129J177M157N744O384O537O349N820N009M082L338L058L019
61264B778596K361M06k574n690q384j0603j2131j2359j0627o413O45J0430K2144
61251B745801L4954M8770O3782P9405R4349J07696J19258J28724J35109J37141
61241C694989J33615J23218J04690P7634M3021L063l9050p9545j15047j43561
61231C803027j64256j76697j81025j78677j71896j62283j50564j37708j25144
61222B354777j13490j02126r0614p9674p0163o1931n4417m7706m2184l7615l3285
$$ plain form
61300 3638793 3619437 3594740 3565510 3532113 3494488 3452613 3406813 3357598 3305410 3250656 3193910
61289 3193910 3135961 3077809 3020805 2966608 2916670 2871721 2832002 2797963 2770353 2749593 2735382
61278 2735382 2727051 2723922 2725099 2729256 2735000 2741384 2747921 2754270 2760090 2765099 2769181 2772519 2775577 2778596
61264 2778596 2780957 2781363 2778789 2773099 2764715 2754112 2741981 2729622 2718995 2712582 2713227 2723657 2745801
61251 2745801 2780755 2829525 2893307 2972712 3067061 3174757 3294015 3422739 3557848 3694989
61241 3694989 3828604 3951822 4056512 4134146 4177167 4180230 4141180 4061635 3946588 3803027
61231 3803027 3638771 3462074 3281049 3102372 2930476 2768193 2617629 2479921 2354777
61222 2354777 2241287 2139161 2048547 1968873 1898710 1836779 1782362 1734656 1692472 1654857 1621572
61211A621572k8831k4246j9492j4656j0151o136k026K721P638J1804J5195J8633
61199A572025K2347K5327K6398K5464K3330K0667J7568J4049J0543P605N284L156
61187A773763J041o98j841k912m627p005r577j2246j5268j8490k1401k3992k6709
61174A630038k9396l1179l1747l1951l2643l3583l4058l3899l3306l2225l0677
61163A275374k9294k8761k8978k9252k9099k8349k6820k4503k1889j9577j7719
61152I91133j6325j5788j6518j8258k0316k2309k4071k5022k4429k2380j9833
61141G65884j7594j5678j3808j1968j0194q316o257m250k533r52P93K694M442
61128F82263N825O888P674Q076Q090Q110Q703R971J1334J2146J2436J2780J3487
$$ plain form
61211 1621572 1592741 1568495 1549003 1534347 1524196 1518060 1516034 1518755 1526393 1538197 1553392 1572025
61199 1572025 1594372 1619699 1646097 1671561 1694891 1715558 1733126 1747175 1757718 1765323 1770607 1773763
61187 1773763 1774804 1774106 1772265 1769353 1764726 1757721 1748144 1735898 1720630 1702140 1680739 1656747 1630038
61174 1630038 1600642 1569463 1537716 1505765 1473122 1439539 1405481 1371582 1338276 1306051 1275374
61163 1275374 1246080 1217319 1188341 1159089 1129990 1101641 1074821 1050318 1028429 1008852 991133
61152 991133 974808 959020 942502 924244 903928 881619 857548 832526 808097 785717 765884
61141 765884 748290 732612 718804 706836 696642 688326 682069 677819 675286 674334 675127 677821 682263
61128 682263 688088 694976 702650 710726 718816 726926 735629 745600 756934 769080 781516 794296 807783
61115H07783J4267J4760J5097J5648J6403J6907J6768J6089J5204J4079J2132
61104I75137Q902M852J182j331l037m710o465p846q691r340r975j0368j0450j0638
61090I07222j1360j2573j3833j4675j4937j5012j5632j6966j8026j7578j5583
61079G41047j3215j1407j0080q872p738o545m906k951j592j357j500r64J74R06
61065F71000P25J25j93N6Q33J954L009L522L356K682J686N43l90q14r33j150j277
61048F84734n43J256L063L629L110K984M222O138P430P887Q376R401J0469J1031
61034G63187J1318J1836J2538J2976J2924J2512J1941J1447J1251J1338J1480
61023H94748J1648J2049J2556J2597J1935J1096J0692J0830J1453J2655J4241
$$ plain form
61115 807783 822050 836810 851907 867555 883958 900865 917633 933722 948926 963005 975137
61104 975137 984039 988891 990073 988742 985705 980995 974530 966684 957993 948653 938678 928310 917860 907222
61090 907222 895862 883289 869456 854781 839844 824832 809200 792234 774208 756630 741047
61079 741047 727832 716425 706345 697473 689735 683190 678284 675333 673741 672384 670884 669920 670094 671000
61065 671000 671725 671850 671657 671713 672546 674500 677509 681031 684387 687069 688755 689298 688908 688094 687161 686011 684734
61048 684734 684191 685447 688510 692139 695249 698233 702455 708593 716023 723910 732286 741687 752156 763187
61034 763187 774505 786341 798879 811855 824779 837291 849232 860679 871930 883268 894748
61023 894748 906396 918445 931001 943598 955533 966629 977321 988151 999604 1012259 1026500
61012A026500J5624J6676J8052K0193K2659K5001K7592L0888L4733L8962M3857
61001A320737M9236N4056N7856O1467O5401O8889P1804P6181Q4096R5152J07836
60990B112711J22035J38081J54580J69861J84928K02679K25178K54431K94384
60981C858868L48492M15990M94570N86460O98217Q36089J007544J226635J508947
60972A0981812J857208K254871K666923L024677L200277L029049K415788J453672
60964C0884277M25527l47099o83042n97358k24252K69905O98642Q47710N44027
60955C1818337k18978j231841k175233k801615l040250k965843k702080k354589
60947A4327908j995482j667432j386997j152450r56971p95944o65085n58546m71472
$$ plain form
61012 1026500 1042124 1058800 1076852 1097045 1119704 1144705 1172297 1203185 1237918 1276880 1320737
61001 1320737 1369973 1424029 1481885 1543352 1608753 1677642 1749446 1825627 1909723 2004875 2112711
60990 2112711 2234746 2372827 2527407 2697268 2882196 3084875 3310053 3564484 3858868
60981 3858868 4207360 4623350 5117920 5704380 6402597 7238686 8246230 9472865 10981812
60972 10981812 12839020 15093891 17760814 20785491 23985768 27014817 29430605 30884277
60964 30884277 31309804 30962705 30279663 29682305 29458053 29727958 30426600 31274310 31818337
60955 31818337 31599359 30367518 28192285 25390670 22350420 19384577 16682497 14327908
60947 14327908 12332426 10664994 9277997 8125547 7168576 6372632 5707547 5149001 4677529
60938D677529m01491l46457l03168k68971k42309k21131k02742j85719j70086
60929B335455j55488j40913j26279j12425r9533q7458p7364p0977o7969o6051
60919A330998o3761o1358n8960n5839n1739m7170m2220l6827l2077k9226k7493
60908H24328k4924k1456j8831j7376j5475j2700j0849j0843j0988r611p394n822
60896F58059m983m234l537k874j605M25K253L220L881M834N817O731Q141R898
60882F86026J0598R411P329N710M727L981L473L011J852j63k142l530m880o600
60868G18803q094q932r595j0232j0039q801p756p829q203p713o538n362m054k376
60854F13279j024n74k67R35K745M105M752N259O171P930J0918J4667J7821J9701
$$ plain form
60938 4677529 4276038 3929581 3626413 3357442 3115133 2894002 2691260 2505541 2335455
60929 2335455 2179967 2039054 1912775 1800350 1700817 1613359 1535995 1465018 1397049 1330998
60919 1330998 1267237 1205879 1146919 1091080 1039341 992171 949951 913124 881047 851821 824328
60908 824328 799404 777948 759117 741741 726266 713566 702717 691874 680886 671275 663881 658059
60896 658059 653076 648842 645305 642431 640826 641251 643504 646724 650605 655439 661256 667987 676128 686026
60882 686026 696624 706035 713364 719074 723801 727782 731255 734266 736118 735955 733813 730283 725403 718803
60868 718803 710709 701777 692182 681950 671911 663110 655354 647525 639322 631609 625071 619709 615655 613279
60854 613279 612255 611681 611414 612349 615094 619199 623951 629210 635381 643311 654229 668896 686717 706418
60840G06418K1084K2650K3662K3179K1526J9462J6991J4132J1864J0893J0419
60829I02280R495Q741R129R877R262P060M535K386L21j474k170j752j234j210
60815I55246j356j524k203l626n400p225r181j1109j2512j3295j3939j4779j5640
60802H43457j6256j6541j6437j5852j4765j3114j0851q353o388n232m264k811
60790G12593q87J226L430N332O221O235O721Q499J0581J1526J1388J1177J1102
60777H05144J0724J0253J0194J0025Q698O422M563L812L681L804M367N130N404
60764H92221N268N629O707P618P858Q004Q528Q883Q542P955P798P879P583O831
60750I97304O022N371M894M636M482M061L237K439K095K043J805J180K84p58j889
$$ plain form
60840 706418 727502 750152 773814 796993 818519 837981 854972 869104 880968 891861 902280
60829 902280 911775 920516 929645 939522 948784 955844 960379 962765 963086 961612 959442 957690 956456 955246
60815 955246 953890 952366 950163 946537 941137 933912 924731 913622 901110 887815 873876 859097 843457
60802 843457 827201 810660 794223 778371 763606 750492 739641 731288 724900 719668 715404 712593
60790 712593 711706 712932 716362 721694 727915 734150 740871 749370 759951 771477 782865 794042 805144
60777 805144 815868 826121 836315 846340 855038 861460 866023 869835 873516 877320 881687 886817 892221
60764 892221 897489 903118 909825 917443 925301 933305 941833 950716 959258 967213 975011 982890 990473 997304
60750 997304 1003326 1008697 1013591 1018227 1022709 1026770 1030007 1032446 1034541 1036584 1038389 1039569 1039853 1039095 1037206
60735A037206l009m101n313o671p837q308p936p187o880p525q782r705r744r274
60721I34934q961q837q455p800p408p595q050q389q666r045r359r331r033q756
60707H15249q583q325p890p336o543n134k994o35J361L149N331P789R443R593
60693H04475Q863Q183P335N491K865N71j179l493o963j0522j2905j4286j5582
60680G72853j6810j7274j6909j6350j5664j4192j1854r727q740q375p261m919
60668F24778k307n68K92J053K001K663K835L015L411L362K466J578J677K254K091
60653F50601J275J035J630K025J862K172L412M386M051L123K844L149L273L285
60639F88123L785M654N325N874O792P965Q899R646J0641J1811J2708J3332J4065
$$ plain form
60735 1037206 1034197 1030096 1024783 1018112 1010275 1001967 994031 986844 979964 972439 963657 953952 944208 934934
60721 934934 925973 917136 908681 900881 893473 885878 877828 869439 860773 851728 842369 833038 824005 815249
60707 815249 806666 798341 790451 783115 776572 771438 768444 767809 769170 772319 777650 785439 794882 804475
60693 804475 813338 821521 828856 834347 837212 837783 836604 833111 826148 815626 802721 788435 772853
60680 772853 756043 738769 721860 705510 689846 675654 663800 654073 645333 636958 629697 624778
60668 624778 622471 621903 622195 623248 625249 627912 630747 633762 637173 640535 643001 644579 646256 648510 650601
60653 650601 651876 652911 654541 656566 658428 660600 664012 668398 672449 675572 678416 681565 684838 688123
60639 688123 691908 696562 701887 707761 714553 722518 731417 741063 751704 763515 776223 789555 803620
60626H03620J4987J5870J6700J7521J8085J8148J7846J7261J5961J3541J0264
60615I79804O713L217O1k320l911n335o954q382r356j0246j1047j0802r058p043
60601I05341o245o464o402n758n458o158p608r288j0682j1174j0548r407q272
60588H01877o758m509k238p84L24J996L792M463L984L574L700L479K312P72l53
60573H15631q00m60O71J911K288J810J447J610J563O27q84k279l442m699o260
60558H08734p938r169r372q627p757p331o962o027m620l123j447N85K632M452
60544G44030O521R103J1388J2698J3941J6578K0660K5235L0144L5744M1186M4628
60532A011856M5167M3102L8434L0705K0381Q820l143j5064k5398l2032l4565l4429
$$ plain form
60626 803620 818607 834477 851177 868698 886783 904931 922777 940038 955999 969540 979804
60615 979804 986517 989734 989795 987475 983564 978229 971275 962893 953537 943291 932244 921442 912384 905341
60601 905341 899096 892632 886230 880472 875014 868856 861248 851960 841278 830104 819556 810149 801877
60588 801877 795119 790610 788372 787588 787912 789908 793700 798163 802147 805721 809421 812900 815212 815984 815631
60573 815631 814831 814371 815042 816953 819241 821051 822498 824108 825671 826298 825414 823135 819693 814994 808734
60558 808734 800796 791627 782255 773628 765871 758540 751578 745551 740931 737808 736361 736946 739578 744030
60544 744030 750551 759654 771042 783740 797681 814259 834919 860154 890298 926042 967228 1011856
60532 1011856 1057023 1100125 1138559 1169264 1189645 1198465 1195322 1180258 1154860 1122828 1088263 1053834
60520A053834l2465k8166k1718j4836q857l534J518N779R007J1823J4197J4916
60508A001498J3590J1806J1131J1277J1440J2134J4342J7819K1793K6560L3032
60497A186422M1200N0388O0655P2814Q7253J03699J21852J41469J62087J83462
60487B211301K06078K30688K57644K87063L18846L51285L79419L95281L90085
60478E027690L56921K93062K01224Q9035l3000j53285k60073l43018l95920m18528
60468D364108m15628l94374l61939l24179k85203k47854k14302j85662j61398
60459A773569j40199j21635j06055r3044q1343p0661o2062n5945n0961m5701m0276
60448I05687l5331l0725k6305k2832k0912j9805j8446j6897j5710j4671j3435
$$ plain form
60520 1053834 1021369 993203 971485 956649 947792 944258 945776 951555 960562 972385 986582 1001498
60508 1001498 1015088 1026894 1038025 1049302 1060742 1072876 1087218 1105037 1126830 1153390 1186422
60497 1186422 1227622 1278010 1338665 1411479 1498732 1602431 1724283 1865752 2027839 2211301
60487 2211301 2417379 2648067 2905711 3192774 3511620 3862905 4242324 4637605 5027690
60478 5027690 5384611 5677673 5878897 5967932 5934932 5781647 5521574 5178556 4782636 4364108
60468 4364108 3948480 3554106 3192167 2867988 2582785 2334931 2120629 1934967 1773569
60459 1773569 1633370 1511735 1405680 1312636 1231293 1160632 1098570 1042625 991664 945963 905687
60448 905687 870356 839631 813326 790494 769582 749777 731331 714434 698724 684053 670618
60437F70618j2594j2789j3244j2646j1049r598q669p595o119m787l877l119k541
60424E61991k495k655k112p01O13J086J119J544K531L593M230M301M087M053M334
60409E85519M480M017L121K416K222K436K912L509L872L673L098K732K991L918
60395F30916N298O617P216O923O336O051N830N082L946L200L127L076K357J115
60381F97090R3k63k66o17j619k789l347l081k483k047j762j388r25n26k63j20
60365F75687k8K06P17J270J512J598K102L226M505N414N766N455M444L255K849
60350G17978L658N157O662P972R000R393R003Q301P887P835P761P129N457K777
60336H15970l6j943k928l687m201l610j840j54N96J290L241O294R094J0650J0819
$$ plain form
60437 670618 658024 645235 631991 619345 608296 598698 590029 582434 576315 571528 567651 564532 561991
60424 561991 559496 556841 554729 554028 554641 555727 556846 558390 560921 564514 568744 573045 577132 581185 585519
60409 585519 589999 594016 597137 599553 601775 604211 607123 610632 614504 618177 621275 624007 626998 630916
60395 630916 636214 642831 650047 656970 663306 669357 675187 680269 684215 687415 690542 693618 695975 697090
60381 697090 697183 696920 696654 696037 694418 691629 688282 685201 682718 680671 678909 677521 676596 676070 675807 675687
60365 675687 675659 675865 676582 677852 679364 680962 683064 686290 690795 696209 701975 707430 711874 715129 717978
60350 717978 721636 726793 733455 741427 750427 759820 768823 777124 785011 792846 800607 807736 813193 815970
60336 815970 815934 813991 811063 807376 803175 799565 797725 797571 798167 799457 802698 808992 818086 828736 839555
60321H39555R807Q016N937L602N24l190o352p992q568r068r507r183p996o538
60307G99047n234m223l767l907l959l265k231j810k103k249j609l26J251K941
60293G68556M542N807O669P054O671N368L599K062J100P10P68Q17J86j081j837
60278H10991j111O26K128K954L568M180M438M271M229M770N811P123Q743J0764
60264H73485J2991J4914J6103J6795J8045K0753K4513K7938L0371L2547L5328
60253A123783L8623M2082M6050N1051N6933O3228O9867P6839Q3687R0113R6590
60242A838846J03613J10787J17322J22922J27413J30023J29918J27145J22250
60233B930239J15281J05904R4162Q0496O5377M9546L3999J9061M055j1268k5635
$$ plain form
60321 839555 849362 857378 863315 866917 867441 864251 857899 849907 841339 832271 822764 813581 805585 799047
60307 799047 793813 789590 785823 781916 777957 774692 772461 770651 768548 766299 764690 764364 765615 768556
60293 768556 773098 778905 785574 792628 799299 804667 808266 810328 811428 812138 812906 813723 813909 812828 810991
60278 810991 809880 810506 812634 815588 819156 823336 827774 832045 836274 841044 846855 853978 862721 873485
60264 873485 886476 901390 917493 934288 952333 973086 997599 1025537 1055908 1088455 1123783
60253 1123783 1162406 1204488 1250538 1301589 1358522 1421750 1491617 1568456 1652143 1742256 1838846
60242 1838846 1942459 2053246 2170568 2293490 2420903 2550926 2680844 2807989 2930239
60233 2930239 3045520 3151424 3245586 3326082 3391459 3441005 3475004 3494065 3498120 3486852 3461217
60222C461217l7520m6867n4359n9631o1502n9723n5206m8641m0140l0127j9397
60211B948104q088M382J8197L2701M7209O1518P5594Q9336J02528J14514J24255
60200C610250J31288J36082J38680J37636J31427J20428J06244Q9494O9797M7717
60190D719043K5123L303j7917l8850n8839p6840r2040j03581j10628j13212j12257
60179D023305j08474j01863r2380q0339o5950m9354l1334j3138M649K2330L9952
60168C547404N6680P1561Q4212R4336J01138J03635J01297R4279Q3361O9693N4276
60157D461872L7718K0619L800j2195k7254m0804n1355n7674n9852n8420n3100
60146D163355m3600l1014j7028j987J4924L3834N3969P5104R7775J21889J46641
$$ plain form
60222 3461217 3423697 3376830 3322471 3262840 3201338 3141615 3086409 3037768 2997628 2967501 2948104
60211 2948104 2940016 2944398 2962595 2995296 3042505 3104023 3179617 3268953 3371481 3485995 3610250
60200 3610250 3741538 3877620 4016300 4153936 4285363 4405791 4512035 4601529 4671326 4719043
60190 4719043 4744166 4747469 4729552 4690702 4631863 4555023 4462983 4359402 4248774 4135562 4023305
60179 4023305 3914831 3812968 3720588 3640249 3574299 3524945 3493611 3480473 3485122 3507452 3547404
60168 3547404 3604084 3675645 3759857 3854193 3955331 4058966 4160263 4254542 4337903 4407596 4461872
60157 4461872 4499590 4520209 4524009 4511814 4484560 4443756 4392401 4334727 4274875 4216455 4163355
60146 4163355 4119755 4088741 4071713 4069726 4084650 4118484 4172453 4247557 4345332 4467221 4613862
60135D613862J71935J98637K27050K56370K85937L15655L44848L71818L95014
60126G181126M13579M26507M32429M30629M21218M03931L77900L43142L01271
60117A0731732K54155K02714J47349Q8633K7203l6145r9857j61911k20743k74901
60107A0658229l21796l58260l82762l95873l98265l89766l70978l44262l12173
60098G384094k76061k36950j96475j55908j15318p4761l5305K027L7258P0245
60088F402846R9385J22731J39708J50495J54370J49983J37046J16781R0981O1515
60078G625841L0413o07l0660n9166q5133j07674j26903j43642j58439j71374j82382
60067F590274j91129j96853j98948j97477j92708j84568j73188j59461j44412
$$ plain form
60135 4613862 4785797 4984434 5211484 5467854 5753791 6069446 6414294 6786112 7181126
60126 7181126 7594705 8021212 8453641 8884270 9305488 9709419 10087319 10430461 10731732
60117 10731732 10985887 11188601 11335950 11424583 11451786 11415641 11315784 11153873 10933130 10658229
60107 10658229 10336433 9978173 9595411 9199538 8801273 8411507 8040529 7696267 7384094
60098 7384094 7108033 6871083 6674608 6518700 6403382 6328621 6293316 6295343 6332601 6402846
60088 6402846 6502231 6624962 6764670 6915165 7069535 7219518 7356564 7473345 7564326 7625841
60078 7625841 7656254 7655647 7624987 7565821 7480688 7373014 7246111 7102469 6944030 6772656 6590274
60067 6590274 6399145 6202292 6003344 5805867 5613159 5428591 5255403 5095942 4951530
60058D951530j28268j10768r2101p2838n3217l3067j2410Q389K8893M8774O7873
60047D602790Q6288J04030J20344J33721J42804J46931J45763J39112J27380J11389
60037E860552R1482O7565M0368J1750j6848m5252p3184r9003j20952j38824j53169
60026E424485j63353j67823j66201j59917j50628j38990j25251j10073r4309p8384
60016D069556o2192m5415k7832r637Q607K6580M4738O3870Q4230J05380J26755
60005D384640J48004J68639J87509K02791K12604K15850K12445K02642J86359
59996F121483J63721J35994J05259P3015L9703N760k7815o0190r1164j20218j45741
59985F199807j65940j80054j88120j90086j85850j75915j61260j42808j21511
$$ plain form
60058 4951530 4823262 4712494 4620393 4547555 4494338 4461271 4448861 4457250 4486143 4534917 4602790
60047 4602790 4689078 4793108 4913452 5047173 5189977 5336908 5482671 5621783 5749163 5860552
60037 5860552 5952034 6019599 6059967 6071717 6054869 6009617 5936433 5837430 5716478 5577654 5424485
60026 5424485 5261132 5093309 4927108 4767191 4616563 4477573 4352322 4242249 4147940 4069556
60016 4069556 4007364 3961949 3934117 3924480 3933087 3959667 4004405 4068275 4152505 4257885 4384640
60005 4384640 4532644 4701283 4888792 5091583 5304187 5520037 5732482 5935124 6121483
59996 6121483 6285204 6421198 6526457 6599472 6639175 6644935 6617120 6556930 6465766 6345548 6199807
59985 6199807 6033867 5853813 5665693 5475607 5289757 5113842 4952582 4809774 4688263
59976D688263r8678p5594n2833l0331q049J3765L4729N4360P2190Q8115J02335
59965D788272J14623J23979J29408J30761J28566J23302J15228J04585R1571P6435
59955E926730N9928M3390K7960J3958J476q748j5452j7779j5696r511P47J5428
59943F022431L4923N9171Q7573J19460J54606J93004K34349K77977L23057L68319
59933G874870M11760M51135M84455N09284N21819N17709M93963M49433L83843
59924A2098271K97873J94714Q0458l7658j52744k58141l47513m16450m63711m90510
59914A0504589m99234m92946m74926m47743m13243l73708l31942k89709k47183
59905F933955k04592j63199j23733q5116m6094p313K9623O4432R8085J30813J61512
$$ plain form
59976 4688263 4589585 4513991 4461158 4430827 4422778 4436543 4471272 4525632 4597822 4685937 4788272
59965 4788272 4902895 5026874 5156282 5287043 5415609 5538911 5654139 5758724 5850295 5926730
59955 5926730 5986658 6030048 6058008 6071966 6073442 6064694 6049242 6031463 6015767 6006256 6007003 6022431
59943 6022431 6057354 6116525 6204098 6323558 6478164 6671168 6905517 7183494 7506551 7874870
59933 7874870 8286630 8737765 9222220 9731504 10253323 10771032 11264995 11714428 12098271
59924 12098271 12396144 12590858 12671316 12633658 12480914 12222773 11875260 11458810 10995099 10504589
59914 10504589 10005355 9512409 9037483 8589740 8176497 7802789 7470847 7181138 6933955
59905 6933955 6729363 6566164 6442431 6357315 6311221 6303908 6333531 6397963 6496048 6626861 6788373
59894F788373J88871K11789K28642K37290K35973K23484J98678J60973J11541
59885H585614N3269j0605p7131j42890k03681k55645k96700l26618l45886l54670
59875F625057l52997l42013l24520l03596k80648k55612k29029k02839j78630
59866D155173j56225j34750j14352r5894p9753o5888n4710m6874m2412m0757m1359
59855C282199m3645m6716m9635n1712n2100m9818m4691l7686k9669k0643j0989
59844B844895k500K922M990M308O75o491j6427k7171l7359m6524n3775n7627n7558
59831B552358n4629n0112m4378l7408k9580k1455j3299n242K487R772J6902K4397
59819B349813L2471M0501M7057N1047N3082N5181N8750O3460O8300P2814P6457
$$ plain form
59894 6788373 6977244 7189033 7417675 7654965 7890938 8114422 8313100 8474073 8585614
59885 8585614 8638883 8628278 8551147 8408257 8204576 7948931 7652231 7325613 6979727 6625057
59875 6625057 6272060 5930047 5605527 5301931 5021283 4765671 4536642 4333803 4155173
59866 4155173 3998948 3864198 3749846 3653952 3574199 3508311 3453601 3406727 3364315 3323558 3282199
59855 3282199 3238554 3191838 3142203 3090491 3038391 2988573 2943882 2906196 2876527 2855884 2844895
59844 2844895 2842395 2845317 2850307 2854615 2855290 2848799 2832372 2805201 2767842 2721318 2667543 2609916 2552358
59831 2552358 2497729 2447617 2403239 2365831 2336251 2314796 2301497 2296255 2298742 2308514 2325416 2349813
59819 2349813 2382284 2422785 2469842 2520889 2573971 2629152 2687902 2751362 2819662 2892476 2968933
59808B968933P7603P4413O6429N4574M0118K4522R738k579j2056j8972k3040k3730
59796C235953k1465j7283j1504l783N667J6092K7437M0476N5505P1944Q9438J08584
59784C597061J30289J55196J83810K16457K52982K92905L35738L80188M22763
59775E967389M57539M77159M73583M38805L67313K59935J26069j7833j52856k63089
59765H134014l39828l82504l96000l86986l62104l27750k89394k50506k12706
59756E186236j77067j44594j15649q9804o6508m5308k5590o833J0832K7101M2471
59745D595287N8033P4265R0808J07554J25101J43919J63711J84018K05030K27464
59735E975190K51899K78451L07005L37725L71316M08487M49066M91950N35935
$$ plain form
59808 2968933 3046536 3120949 3187378 3241952 3282070 3306592 3316330 3313751 3301695 3282723 3259683 3235953
59796 3235953 3214488 3197205 3185701 3181918 3187585 3203677 3231114 3271590 3327095 3399039 3488477 3597061
59784 3597061 3727350 3882546 4066356 4282813 4535795 4828700 5164438 5544626 5967389
59775 5967389 6424928 6902087 7375670 7814475 8181788 8441723 8567792 8549959 8397103 8134014
59765 8134014 7794186 7411682 7015682 6628696 6266592 5938842 5649448 5398942 5186236
59756 5186236 5009169 4864575 4748926 4659122 4592614 4547306 4521716 4514883 4525715 4552816 4595287
59745 4595287 4653320 4727585 4818393 4925947 5051048 5194967 5358678 5542696 5747726 5975190
59735 5975190 6227089 6505540 6812545 7150270 7521586 7930073 8379139 8871089 9407024
59726I407024N79905O22010O59468O89660P10592P19888P14520O92803O56314
59717A5452184O09230N56616N04218M58603M25621M08652M09023M27194M61986
59708A9713327N09360N63652O19846O73171P17066P43726P47120P24123O72964
59699B5684355N92786M85745L58099K18440P5666o1229j83222k82818l55493l99590
59689B6132739m15601m05823l73605l22235k54685j74195q3977J3942J18799K29980
59679B4465339L46641M68351N94818P24444Q53923R79030J094362J191624J259293
59670C1977825J284749J256541J165244J004678P74809M84273J50322k03417n50118
59661C7344906q63756j123380j315861j436270j486987j476267j416059j319631
$$ plain form
59726 9407024 9986929 10608939 11268407 11958067 12668659 13388547 14103067 14795870 15452184
59717 15452184 16061414 16618030 17122248 17580851 18006472 18415124 18824147 19251341 19713327
59708 19713327 20222687 20786339 21406185 22079356 22796422 23540148 24287268 25011391 25684355
59699 25684355 26277141 26762886 27120985 27339425 27415091 27353862 27170640 26887822 26532329 26132739
59689 26132739 25717138 25311315 24937710 24615475 24360790 24186595 24102618 24116560 24235359 24465339
59679 24465339 24811980 25280331 25875149 26599593 27453516 28432546 29526908 30718532 31977825
59670 31977825 33262574 34519115 35684359 36689037 37463846 37948119 38098441 37895024 37344906
59661 37344906 36481150 35357770 34041909 32605639 31118652 29642385 28226326 26906695
59653B6906695j200409j071898r47140q37889p54775p07370p01690p36055p99486
59644A9149983q74786r43668r91209j009011r96590r59623r05834q41921p73138
59635A0854203p03739o36676n73448n14887m61670m13982l71358l33234k99088
59626F546121k68048k39157k12245j87797j65786j45411j26098j08043r1630p7079
59616D924827o4727n4876m7359m2036l9564m0661m4760n0551n7662o6495p6425
59605D339711q5657r3226r9546j04621j07298j06895j04180r9936r3926q6139
59595C358287p7777o9972o2486n4612m6511l8697l1000k2932j4551o224J863R352
59583B944740J5584K0315K4001K6834K8320K8233K7233K5981K4498K2877K1749
$$ plain form
59653 26906695 25706286 24634388 23687248 22849359 22094584 21387214 20685524 19949469 19149983
59644 19149983 18275197 17331529 16340320 15331309 14334719 13375096 12469262 11627341 10854203
59635 10854203 10150464 9513788 8940340 8425453 7963783 7549801 7178443 6845209 6546121
59626 6546121 6278073 6038916 5826671 5638874 5473088 5327677 5201579 5093536 5001906 4924827
59616 4924827 4860100 4805224 4757865 4715829 4676265 4635604 4590844 4540293 4482631 4416136 4339711
59605 4339711 4254054 4160828 4061282 3956661 3849363 3742468 3638288 3538352 3444426 3358287
59595 3358287 3280510 3210538 3148052 3093440 3046929 3008232 2977232 2954300 2939749 2933525 2935388 2944740
59583 2944740 2960324 2980639 3004640 3031474 3059794 3088027 3115260 3141241 3165739 3188616 3210365
59572C210365K1422K1468K1837K3645K7980L4580M2305N0415N8870O7891P7774
59561C658552Q8669J00291J12311J25082J39267J54806J71234J88919K08645K29836
59551E177612K50643K70199K89183L07543L23390L34995L42407L45951L44647
59542G986570L37577L25640L10434K92328K71227K48594K26966K07420J88520
59533A0395276J67934J44635J20107R8066Q2495P5174P5322Q1620R3495J09850
59523A1443974J27727J43168J52627J52827J40506J13706P2935K0271m2032j11328
59513A2214381j83930k55844l23717l84428m34741m72390m96921n08818n08656
59504H644936m97950m79521m55754m27354l94946l60742l27114k94439k62094
$$ plain form
59572 3210365 3231787 3253255 3275092 3298737 3326717 3361297 3403602 3454017 3512887 3580778 3658552
59561 3658552 3747221 3847512 3959823 4084905 4224172 4378978 4550212 4739131 4947776 5177612
59551 5177612 5428255 5698454 5987637 6295180 6618570 6953565 7295972 7641923 7986570
59542 7986570 8324147 8649787 8960221 9252549 9523776 9772370 9999336 10206756 10395276
59533 10395276 10563210 10707845 10827952 10926018 11008513 11083687 11159009 11240629 11334124 11443974
59523 11443974 11571701 11714869 11867496 12020323 12160829 12274535 12347470 12367741 12325709 12214381
59513 12214381 12030451 11774607 11450890 11066462 10631721 10159331 9662410 9153592 8644936
59504 8644936 8146986 7667465 7211711 6784357 6389411 6028669 5701555 5407116 5145022
59495E145022k30884k02567j77317j53667j30969j10164r1763p4708n7829m1273
59485C873881k5738j1164L226J8059L3473M9331O5513Q2129R9451J17581J36432
59474D442174J56193J77334J99832K22795K45153K66181K84999L00220L10491
59465F605372L14633L10886K96838K70941K33428J85245J27195O1158q708p7424
59455H319564j41568j99423k49366k89381l18141l35669l43068l42117l34824
59446E766007l22631l06253k86749k66070k45803k26032k06228j86825j68944
59437C550472j52929j38125j23931j10345r7611q5934p5362o5581n6149m7178
59427B597327l9204l2099k4980j7570j0759n223n10L851P385R762J1869J4781
$$ plain form
59495 5145022 4914138 4711571 4534254 4380587 4249618 4139454 4047691 3972983 3915154 3873881
59485 3873881 3848143 3836979 3840205 3858264 3891737 3941068 4006581 4088710 4188161 4305742 4442174
59474 4442174 4598367 4775701 4975533 5198328 5443481 5709662 5994661 6294881 6605372
59465 6605372 6920005 7230891 7527729 7798670 8032098 8217343 8344538 8405696 8396988 8319564
59455 8319564 8177996 7978573 7729207 7439826 7121685 6786016 6442948 6100831 5766007
59446 5766007 5443376 5137123 4850374 4584304 4338501 4112469 3906241 3719416 3550472
59437 3550472 3397543 3259418 3135487 3025142 2927531 2841597 2766235 2700654 2644505 2597327
59427 2597327 2558123 2526024 2501044 2483474 2472715 2467492 2466982 2470833 2478218 2487980 2499849 2514630
59415B514630J8445K2321K6597L1856L8093M4604M9885N1321M6709L7407K8644
59404B910512K5179K7702L4456M4615N8154P3834Q9853J05701J21147J34154J42533
59393C767840J47741J54807J68010J88240K14555K46211K82612L22874L66248
59384E859138M12159M59591N07178N53665N97083O33734O59249O70705O66846
59375A1019348O47046O11707N63558N07089M46598L85723L28029K76065K29882
59366A5015045J88025J49751J14624Q0290M2988O13m6571r8325j55176k15843
59356A5075421k75750l29258l72213m01787m15811m13992l99244l76786l52125
59347A1738455l29936l13634l04992l04407l11679l25879l44521l63963l81128
$$ plain form
59415 2514630 2533075 2555396 2581993 2613849 2651942 2696546 2746431 2797752 2844461 2881868 2910512
59404 2910512 2935691 2963393 2997849 3042464 3100618 3174452 3264305 3370006 3491153 3625307 3767840
59393 3767840 3915581 4070388 4238398 4426638 4641193 4887404 5170016 5492890 5859138
59384 5859138 6271297 6730888 7238066 7791731 8388814 9022548 9681797 10352502 11019348
59375 11019348 11666394 12278101 12841659 13348748 13795346 14181069 14509098 14785163 15015045
59366 15015045 15203070 15352821 15467445 15547735 15590723 15591336 15544765 15446440 15291264 15075421
59356 15075421 14799671 14470413 14098200 13696413 13280602 12866610 12467366 12090580 11738455
59347 11738455 11408519 11094885 10789893 10485486 10173807 9847928 9503407 9139444 8758316
59338H758316l94199m01686m02014l94586l80450l61525l39626l16183k91971
59329E476076k66922k41028k15405j91586j69811j49078j28939j10138r3318p8185
59319C831666o4221n1238l9006k7199j5861n097N607J6752K7655L7125M5388N4013
59307C815584O3792P3962Q3742R3238J02358J10145J15729J19017J19966J18140
59297D815673J13383J05957R5777Q2592O7229N1517L6608K2451R383j029p435
59286E392106r948r244n275K374J3556K7596M3696O0838P7966R4612J10742J25631
59274E924650J37616J45227J47942J45535J37536J23627J03894P8276M6613R659
59264G000575l0233o9488j03901j29376j43531j47148j43221j34270j21187j04532
$$ plain form
59338 8758316 8364117 7962431 7560417 7165831 6785381 6423856 6084230 5768047 5476076
59329 5476076 5209154 4968126 4752721 4561135 4391324 4242246 4113307 4003169 3909851 3831666
59319 3831666 3767445 3716207 3677201 3650002 3634141 3629044 3634651 3651403 3679058 3716183 3761571 3815584
59307 3815584 3879376 3953338 4037080 4130318 4232676 4342821 4458550 4577567 4697533 4815673
59297 4815673 4929056 5035013 5130790 5213382 5280611 5332128 5368736 5391187 5400570 5399541 5392106
59286 5392106 5382158 5372914 5367639 5370013 5383569 5411165 5454861 5515699 5593665 5688277 5799019 5924650
59274 5924650 6062266 6207493 6355435 6500970 6638506 6762133 6866027 6944303 6990916 7000575
59264 7000575 6970342 6900854 6796953 6667577 6524046 6376898 6233677 6099407 5978220 5873688
59254E873688q5631o5862m5896k6255p938P997K0964L0725L7309M1164M2773M2032
59242E865070L8784L3933K9360K6617K6414K9258L5776M6444O1787Q2583J08967
59231F384993J39714J73525K10625K51615K94938L37006L74640M05638M26835
59222H999529M33718M22739L92672L43313K74815J89306R1657j2579j19080k23843
59212A0792247l21666m06738m74443n22199n49608n58420n51664n32206n02737
59203F372566m66875m28748l90862l53605l17313k83478k53182k25844k00483
59194C452176j77244j56732j38875j23376j10318r9465q9765q0473p1990o4879
59184B339059n8831n3298m8331m3929l9472l4622l0072k6498k3412j9864j5735
$$ plain form
59254 5873688 5788057 5722195 5676299 5650044 5642106 5650103 5671067 5701792 5739101 5780265 5823038 5865070
59242 5865070 5903854 5937787 5967147 5993764 6020178 6049436 6085212 6131656 6193443 6276026 6384993
59231 6384993 6524707 6698232 6908857 7160472 7455410 7792416 8167056 8572694 8999529
59222 8999529 9433247 9855986 10248658 10591971 10866786 11056092 11147749 11135170 11016090 10792247
59212 10792247 10470581 10063843 9589400 9067201 8517593 7959173 7407509 6875303 6372566
59203 6372566 5905691 5476943 5086081 4732476 4415163 4131685 3878503 3652659 3452176
59194 3452176 3274932 3118200 2979325 2855949 2745631 2646166 2556401 2475928 2403938 2339059
59184 2339059 2280228 2226930 2178599 2134670 2095198 2060576 2030504 2004006 1980594 1960730 1944995
59173A944995j1564p626l854j82L677Q197J3285J8087K2096K5821K9857L3917
59161B076706L7518M0976M5045M9871N4914N9650O3985O8230P2931P8487Q4820
59150B733133R1614R8657J05541J11438J15885J19435J22537J24191J22945J18908
59140C864284J13314J06149R5875Q1809O5244M7826L0289J3287j986j4706k4803
59129D376582l1930l5227l4541l0755k4400j5185l196J0722K6338M4317O4612
59118D347337Q5887J07197J28916J51366J73895J96018K18055K39809K59709K75960
59108F184149K87313K92112K87890K72694K45793K06914J56531R7674L5805k3910
59098H042965p8018j23345j56638j77079j87324j90622j88325j81419j72659j65241
$$ plain form
59173 1944995 1933431 1925805 1921951 1921769 1925446 1933643 1946928 1965015 1987111 2012932 2042789 2076706
59161 2076706 2114224 2155200 2200245 2250116 2305030 2364680 2428665 2496895 2569826 2648313 2733133
59150 2733133 2824747 2923404 3028945 3140383 3256268 3375703 3498240 3622431 3745376 3864284
59140 3864284 3977598 4083747 4179622 4261431 4326675 4374501 4404790 4418077 4416091 4401385 4376582
59129 4376582 4344652 4309425 4274884 4244129 4219729 4204544 4201348 4212070 4238408 4282725 4347337
59118 4347337 4433224 4540421 4669337 4820703 4994598 5190616 5408671 5648480 5908189 6184149
59108 6184149 6471462 6763574 7051464 7324158 7569951 7776865 7933396 8031070 8066875 8042965
59098 8042965 7964947 7841602 7684964 7507885 7320561 7129939 6941614 6760195 6587536 6422295
59088F422295j60497j58376j59092j62753j68346j74583j81030j87396j92643
59079D877579j95910j97306j96897j94164j89420j84303j79557j73739j65527
59070C200756j55934j46732j37982j28789j19288j10155j01180r2039q3547p6541
59060B048569p0354o4035n8147n3746n0404m6980m3620m1284l9859l8282l6144
59049A505714l3727l1119k8452k6394k5041k3150j9725j5575j1913q488m629j189
59037A276312L57J19n16q13p38J70K350N147P751J0583J4257J7819J9708J9888
59023A372394J9373J8191J5537J1509P131K940r77l985n369n483m985l512n07
59010A422257L258O462Q998J1515J3781J5092J5626J5779J4745J1529O848K363
$$ plain form
59088 6422295 6261798 6103422 5944330 5781577 5613231 5438648 5257618 5070222 4877579
59079 4877579 4681669 4484363 4287466 4093302 3903882 3719579 3540022 3366283 3200756
59070 3200756 3044822 2898090 2760108 2631319 2512031 2401876 2300696 2208657 2125110 2048569
59060 2048569 1978215 1914180 1856033 1802287 1751883 1704903 1661283 1619999 1580140 1541858 1505714
59049 1505714 1471987 1440868 1412416 1386022 1360981 1337831 1318106 1302531 1290618 1282130 1277501 1276312
59037 1276312 1276669 1276788 1276272 1275459 1274721 1274891 1277241 1282388 1290139 1300722 1314979 1332798 1352506 1372394
59023 1372394 1391767 1409958 1425495 1437004 1444135 1447075 1446098 1442113 1436744 1431261 1426276 1422764 1422257
59010 1422257 1425515 1431977 1440975 1452490 1466271 1481363 1496989 1512768 1527513 1539042 1545890 1548253
58998A548253j513n361q839j0871j1424j1320j0618q900o761n248m094k314k03
58985A460787J044J546K681M883P233R153J0871J2243J2858J3199J4204J5726
58973A566428J6970J8116J9893K1870K3055K3939K5988K9175L1998L3973L6006
58962A847411L8229L9518L9627L9812M0738M1499M1351M0899M0951M1559M2736
58951B294330M4853M7816N1051N4621N9357O5509P2402P9498Q6812R4247J01737
58940C052233J10006J19945J31169J42407J53333J64843J77602J91665K07450
58931D450653K25755K46688K69809K95237L23500L54548L88276M25630M67636
58922G447732N13530N61476O10996O62853P16549P69630Q19464Q63805Q99295
$$ plain form
58998 1548253 1546740 1541379 1532540 1521669 1510245 1498925 1488307 1479407 1472646 1467398 1463304 1460990 1460787
58985 1460787 1461831 1463377 1466058 1470941 1478174 1487327 1498198 1510441 1523299 1536498 1550702 1566428
58973 1566428 1583398 1601514 1621407 1643277 1666332 1690271 1716259 1745434 1777432 1811405 1847411
58962 1847411 1885640 1925158 1964785 2004597 2045335 2086834 2128185 2169084 2210035 2251594 2294330
58951 2294330 2339183 2386999 2438050 2492671 2552028 2617537 2689939 2769437 2856249 2950496 3052233
58940 3052233 3162239 3282184 3413353 3555760 3709093 3873936 4051538 4243203 4450653
58931 4450653 4676408 4923096 5192905 5488142 5811642 6166190 6554466 6980096 7447732
58922 7447732 7961262 8522738 9133734 9796587 10513136 11282766 12102230 12966035 13865330
58913A3865330R21020R23961R03514Q54900P74308O61418N19721L54415J71826
58904A9950413j8996k06517l79952n31688o56791p52291q17941q56310q71139
58895A4858788q66198q45625q13810p74250p29349o81375o32424n83469n34831
58886H397457m87703m43841m03729l66602l32472l02488k76969k54667k34477
58877E294509k16429k00636j86607j73960j62489j51304j39340j26978j15803
58868C820963j06433r7996q9889q2507p5900o9354o2763n6952n2155m7495m2411
58857C037108l7190l1824k5774j9254j3307q167k931K873Q777J4719K1308K8423
58845B974761L5026M0901M7155N4518O2500P0555P8720Q6791R4335J01873J10644
$$ plain form
58913 13865330 14786350 15710311 16613825 17468725 18243033 18904451 19424172 19778587 19950413
58904 19950413 19931417 19724900 19344948 18813260 18156469 17404178 16586237 15729927 14858788
58895 14858788 13992590 13146965 12333155 11558905 10829556 10148181 9515757 8932288 8397457
58886 8397457 7909754 7465913 7062184 6695582 6363110 6060622 5783653 5528986 5294509
58877 5294509 5078080 4877444 4690837 4516877 4354388 4203084 4063744 3936766 3820963
58868 3820963 3714530 3616534 3526645 3444138 3368238 3298884 3236121 3179169 3127014 3079519 3037108
58857 3037108 2999918 2968094 2942320 2923066 2909759 2901592 2898661 2901534 2910311 2925030 2946338 2974761
58845 2974761 3009787 3050688 3097843 3152361 3214861 3285416 3364136 3450927 3545262 3647135 3757779
58834C757779J20884J31712J42958J55503J69628J84648K00482K17942K37196
58825E318732K57754K80331L06838L37972L72554M09821M50533M95155N42805
58816H772495N92760O45115O98979P51486P99479Q40523Q71348Q86837Q81609
58807A5740631Q51557P93303P04081N83560M35078K64642P9950j09301k92111
58798A9051390m58644o01704p16251p99549q52476q78978q83286q68757q39447
58789A2152298q00559p56285p08689o59399o10658n63937n19280m76892m37750
58780F618849m01843l67773l35103l05333k79397k56081k34242k14923j99625
58771D024529j87801j77594j68022j59031j50324j41421j32257j22848j13088
$$ plain form
58834 3757779 3878663 4010375 4153333 4308836 4478464 4663112 4863594 5081536 5318732
58825 5318732 5576486 5856817 6163655 6501627 6874181 7284002 7734535 8229690 8772495
58816 8772495 9365255 10010370 10709349 11460835 12260314 13100837 13972185 14859022 15740631
58807 15740631 16592188 17385491 18089572 18673132 19108210 19372852 19452802 19343501 19051390
58798 19051390 18592746 17991042 17274791 16475242 15622766 14743788 13860502 12991745 12152298
58789 12152298 11351739 10595454 9886765 9227366 8616708 8052771 7533491 7056599 6618849
58780 6618849 6217006 5849233 5514130 5208797 4929400 4673319 4439077 4224154 4024529
58771 4024529 3836728 3659134 3491112 3332081 3181757 3040336 2908079 2785231 2672143
58762B672143j03438r4787q7075p9174p0682o2553n5449m8830m2285l6343l1265
58751A960262k6489k1947j8447j6089j3743j0836q172o205m222j984o21r72k549
58738A827986m958q692j3622j8297k1740k4453k6797k7963k7527k6468k5737k5263
58726A576469k5193k6293k8337k9749k9924l0159l1363l2683l3323l3823l4336
58715A241286l3639l1165k8230k5916k3573k0722j8505j7715j7128j5453j3375
58704I95865j2124j1522j0871j0304r826q577o476n024n101n491m960m145l906
58691H97538l614k696k123k639l095k487k074l537o348q738j0123j0843j0748
58678H28473r727q519p458n639k704m9J235K092L568M762M455L278K494J997J417
$$ plain form
58762 2672143 2568705 2473918 2386843 2307669 2236987 2174434 2118985 2070155 2027870 1991527 1960262
58751 1960262 1933773 1911826 1893379 1877290 1863547 1852711 1844539 1838334 1834112 1832128 1831507 1830535 1827986
58738 1827986 1823028 1814336 1800714 1782417 1760677 1736224 1709427 1681464 1653937 1627469 1601732 1576469
58726 1576469 1551276 1524983 1496646 1466897 1436973 1406814 1375451 1342768 1309445 1275622 1241286
58715 1241286 1207647 1176482 1148252 1122336 1098763 1078041 1059536 1041821 1024693 1009240 995865
58704 995865 983741 972219 961348 951044 941218 932641 926165 921141 916040 910549 905589 901444 897538
58691 897538 893924 891228 889105 886466 883371 880884 878810 875273 868925 860187 850064 839221 828473
58678 828473 818746 810227 802769 797130 794426 794377 795612 797704 801272 806034 810489 813767 816261 818258 819675
58663H19675J718L674N932O516N252L048J30l216n514n678m677l846k747n31J960
58648H21696L473M575O565R144J1166J2773J4894J7395J9577K1696K4341K7098
58636I94393K9435L1968L5430L9308M3021M7280N2791N8826O4647P1139P9427
58625A547665Q9064R9254J10651J24295J39972J57119J76092J96964K18418K39288
58615C098782K59665K78750K93232K99480K95753K80622K51361K06459J48431
58606E412535Q2066J1447n9208j23755j76346k14930k40626k54758k58514k54165
58596C923746k44203k30005k12995j95684j79667j64093j48101j33156j20848
58587B294994j10173r9406q8988p9944p1148o0977n0317m1151l3460k6196j9980
$$ plain form
58663 819675 821393 825067 830999 837515 842767 845815 845945 842729 837215 831537 826860 823014 820267 819736 821696
58648 821696 825169 829744 836309 845453 856619 869392 884286 901681 921258 942954 967295 994393
58636 994393 1023828 1055796 1091226 1130534 1173555 1220835 1273626 1332452 1397099 1468238 1547665
58625 1547665 1636729 1735983 1846634 1970929 2110901 2268020 2444112 2641076 2859494 3098782
58615 3098782 3358447 3637197 3930429 4229909 4525662 4806284 5057645 5264104 5412535
58606 5412535 5494601 5506048 5446840 5323085 5146739 4931809 4691183 4436425 4177911 3923746
58596 3923746 3679543 3449538 3236543 3040859 2861192 2697099 2548998 2415842 2294994
58587 2294994 2184821 2085415 1996427 1916483 1845335 1784358 1734041 1692890 1659430 1633234 1613254
58576A613254j5981j3343j0564q275p901q768r411j0458j3085j5670j5224j1606
58564A472968p409m452l132m386r116j6047k2827k8800l4265l7977l8266l5897
58552A230394l3037l0033k5840k0844j6485j2840r277o727o492p600q200q700
58540A044319j0703j3704j5807j6984j8503j9900j9621j8078j7051j6548j5221
58529H62199j3307j2264j2054j1659j1536j2657j3928j3640j2652j2976j4011
58518G21515j3539j1639j0237r369p514n130m182m427l749j984r77q98l5J769
58504F49604K832K953L744N454O537O566O814P774Q823J0149J2421J4868J6308
58491G54847J7421J9372K1051K0646J8981J8131J7745J6094J3674J2090J0479
$$ plain form
58576 1613254 1597273 1583930 1573366 1565091 1557190 1548422 1539011 1528553 1515468 1499798 1484574 1472968
58564 1472968 1465559 1461107 1457975 1453589 1444473 1428426 1405599 1376799 1342534 1304557 1266291 1230394
58552 1230394 1197357 1167324 1141484 1120640 1104155 1091315 1082038 1075311 1068819 1061219 1053019 1044319
58540 1044319 1033616 1019912 1004105 987121 968618 948718 929097 911019 893968 877420 862199
58529 862199 848892 836628 824574 812915 801379 788722 774794 761154 748502 735526 721515
58518 721515 707976 696337 686100 676731 669217 664087 659905 655478 651729 649745 648768 647870 647835 649604
58504 649604 652436 655389 659133 664587 671124 677690 684504 692278 701101 711250 723671 738539 754847
58491 754847 772268 791640 812691 833337 852318 870449 888194 904288 917962 930052 940531
58480I40531O903K340p99l270p712j3481j7265j8475j9497k0860k0787j9585j9694
58467G88349k1027k0700j7985j5255j3575j1579r186q163q348p460n278m063m293
58454F41437l995k757k383l067k937j838j488j598m7K786M178M014N128Q196J0828
58439F56457J2295J4533J7684J9242J8568J7716J6941J3985Q848M615K450L03
58427H03637k323l063j432k02n56l79J238K206J654J502K344K136M07m41M72J075
58411H08275N89R24K563L427L118L899O076O903N369L601K315m39m700p578q246
58396H26096r201j1190j1753j0259r357r805q940n969l647l009j601J250K745
58383G45360K096K323M476N409L642K081K546K826J621J223K727L660K914K972
$$ plain form
58480 940531 947434 949774 948975 945705 937993 924512 907247 888772 869275 848415 827628 808043 788349
58467 788349 767322 746622 728637 713382 699807 688228 679042 670879 662531 655071 649793 645730 641437
58454 641437 637442 634685 632302 629235 626298 624460 622972 621374 621327 624113 628291 632305 637433 645629 656457
58439 656457 668752 683285 700969 720211 738779 756495 773436 787421 796269 800884 803334 803637
58427 803637 801314 798251 796819 796617 796061 795682 796920 799126 800780 802282 804626 806762 807169 806728 807200 808275
58411 808275 808864 809788 812351 815778 818896 822795 828871 835774 841143 844744 847059 846620 841920 834342 826096
58396 826096 816895 805705 793952 783693 774336 764531 755591 749622 745975 742966 741365 742615 745360
58383 745360 747456 749779 754255 759664 763306 765387 767933 770759 772380 773603 776330 779990 782904 785876
58369G85876M899O157N729O145Q131Q658O760N785P306Q341P258O788Q511R985
58355H86329J0140J1716J5430J7533J6161J4378J3959J2122P458L092P43k243
58343A006818o779r276q307p568q786q296m319q49l34P09M542P572P312P221R907
58328I89567J2127J1433J1084J3478J5248J3929J2939J4855J6367J5142J4906
58317A141075J8284K1424K1237K1119K3668K4806K1250J6972J5795J4414R318
58306A349362L990K467K193O6q74K301N829N846N373P933J0621J0319J0360J4032
58292A429818J7866J8296J8402K1148K2912K0801J9310K2225K5255K4390K4043
58281A664466K8928L5268L8406M1565M8455N4784N6025N6136N9554O2012N8510
$$ plain form
58369 785876 790775 796932 802661 808806 816937 825595 832355 838140 845446 853787 861045 867833 876344 886329
58355 886329 896469 908185 923615 941148 957309 971687 985646 997768 1005226 1008318 1009061 1006818
58343 1006818 1000039 990763 982456 974888 966102 957806 953487 952638 952304 953013 957555 965127 972439 979660 989567
58328 989567 1001694 1013127 1024211 1037689 1052937 1066866 1079805 1094660 1111027 1126169 1141075
58317 1141075 1159359 1180783 1202020 1223139 1246807 1271613 1292863 1309835 1325630 1340044 1349362
58306 1349362 1353352 1355819 1358012 1358078 1357204 1359505 1365334 1371180 1376553 1384486 1395107 1405426 1415786 1429818
58292 1429818 1447684 1465980 1484382 1505530 1528442 1549243 1568553 1590778 1616033 1640423 1664466
58281 1664466 1693394 1728662 1767068 1808633 1857088 1911872 1967897 2024033 2083587 2145599 2204109
58270B204109N2816M9750M5792L6946K8125K4922K4010K1348K1458K8246L5421
58259B572943L6757L7221M2880M8950M9433M9260N4635O0634O1135O1650O9060
58248C144558P8005Q1001Q2732R0275R8785J01315J03158J11604J21357J25224
58238D138014J29013J40147J52268J57431J62240J74868J87931J92364J96093
58229E630369K09873K27072K37515K48382K70142K95194L12777L31372L62825
58220H125521L98607M26582M56198N00771N50739N92632O37835P02452P76449
58211A3167786Q45248R23270J031127J159461J293338J451330J659540J910318
58203B3441418K192495K538112K990082L551498M220659N041636O056405P248663
$$ plain form
58270 2204109 2256925 2306675 2352467 2389413 2417538 2442460 2466470 2487818 2509276 2537522 2572943
58259 2572943 2609700 2646921 2689801 2738751 2788184 2837444 2892079 2952713 3013848 3075498 3144558
58248 3144558 3222563 3303564 3386296 3476571 3575356 3676671 3779829 3891433 4012790 4138014
58238 4138014 4267027 4407174 4559442 4716873 4879113 5053981 5241912 5434276 5630369
58229 5630369 5840242 6067314 6304829 6553211 6823353 7118547 7431324 7762696 8125521
58220 8125521 8524128 8950710 9406908 9907679 10458418 11051050 11688885 12391337 13167786
58211 13167786 14013034 14936304 15967431 17126892 18420230 19871560 21531100 23441418
58203 23441418 25633913 28172025 31162107 34713605 38934264 43975900 50032305 57280968
58195E7280968Q616753J0265589J2344242J4954118J8234616K2455119K7813779
58188A71965184L4126191M0803279M6910008N0788304M9699083M0788071K3447257
58181D58527377R21197k0942062l7026233m5400039m7127315m4486144l9571642
58174B24895139l3901739k8436432k3613809j9509727j6093735j3330770j1122695
58167G8886232r317896p813808o571598n535299m624229l806059l095601k475126
58159C5646616j886897j304868p37993j55494N14669J295360K134229K971314
58151C8476936L728414M176721L919668K660953N38526j853164l814730m942531
58143D2890793n250245m999259m466704l837276l216842k666858k210040j835777
$$ plain form
58195 57280968 65897721 76163310 88507552 103461670 121696286 144151405 171965184
58188 171965184 206091375 246894654 293804662 344592966 394292049 435080120 458527377
58181 458527377 459448574 438506512 401480279 356080240 308952925 264466781 224895139
58174 224895139 190993400 162556968 138943159 119433432 103339697 90008927 78886232
58167 78886232 69568336 61754528 55182930 49647631 45023402 41217343 38121742 35646616
58159 35646616 33759719 32454851 31716858 31561364 32076033 33371393 35505622 38476936
58151 38476936 42205350 46382071 50301739 52962692 53501218 51648054 47833324 42890793
58143 42890793 37640548 32641289 28174585 24337309 21120467 18453609 16243569 14407792
58135A4407792j526575j276907j082440r26776p92868o77985n85052n08267m40135
58126F590787l84072l45839l19351k94445k72280k59165k51059k38359k21264
58117D004953k06487j92958j74533j53331j36867j24588j10143r4466q4346q0209
58107B647025p7135p5621p9549q5604q6267q1700p7880p4977o8401n9334n3196
58096A827361m9346m2924l5414l2802l4702l5468l4651l6247l9058l8092l4391
58085A414266l3495l5171l4519l2058l2733l5803l5663l2185l0466l0810k8601
58074A052762k3965k1950k2979k2346j9399j8233j9028j7575j3784j2036j2641
58063H48826j1406q156p180q757q534o035n534p718q556p335p838j0548j1451
$$ plain form
58135 14407792 12881217 11604310 10521870 9595094 8802226 8124241 7539189 7030922 6590787
58126 6590787 6206715 5860876 5541525 5247080 4974800 4715635 4464576 4226217 4004953
58117 4004953 3798466 3605508 3430975 3277644 3140777 3016189 2906046 2811580 2727234 2647025
58107 2647025 2569890 2494269 2414720 2329116 2242849 2161149 2083269 2008292 1939891 1880557 1827361
58096 1827361 1778015 1735091 1699677 1666875 1632173 1596705 1562054 1525807 1486749 1448657 1414266
58085 1414266 1380771 1345600 1311081 1279023 1246290 1210487 1174824 1142639 1112173 1081363 1052762
58074 1052762 1028797 1006847 983868 961522 942123 923890 904862 887287 873503 861467 848826
58063 848826 837420 829264 822084 813327 804793 798758 793224 785506 776950 769615 761777 751229 739778
58050G39778r761r110j0032q897n589m565o686p383m803k633k937k984j230Lj82
58035F62989O93L198M567M113M475O072N967L589J966J989J086j113j558M25J700
58020G00158J028Q46K004K137O38J8R35J070rk1R92Q7k924m588l819l380m297
58003F90875m115k123r38j457j444n63j583n031p830q735j0014j2293j2966j1383
57989F10400j0307j0551r393o156l970l976l058K63K890K667J944K915M019L823
57975E81510M045N821P005O003M601M363L790J561r03k396l988n998o442m718
57961E94254l435m383n843n984n606n675n398m625m897o277o518m933l686l637
57947E23357k689p8J636R67J75J124K089J174l78q71j105k189l199l292l575m741
$$ plain form
58050 739778 730017 720907 710875 701978 696389 691824 685138 677755 672952 670319 667382 664398 663168 663171 662989
58035 662989 663682 666880 671447 675560 680035 686107 692074 695663 697629 699618 700704 699591 698033 698458 700158
58020 700158 701186 702032 704036 706173 706811 706829 707764 708834 708825 708804 709796 709883 706959 702371 698552 695172 690875
58003 690875 686760 684637 683699 682242 680798 680235 678652 673621 665791 657056 647042 634749 621783 610400
57989 610400 600093 589542 580149 573993 570023 566047 562989 563252 566142 568809 570753 573668 577687 581510
57975 581510 585555 591376 598381 604384 608985 613348 617138 618699 617796 615400 611412 605414 598972 594254
57961 594254 590819 586436 580593 574609 569003 563328 557930 553305 548408 542131 535613 530680 526994 523357
57947 523357 520668 520590 522226 523193 523368 524492 526581 527755 527377 526506 525401 523212 520013 516721 513146 508405
57931E08405n526n396o009q186j0190j0812j1274j2343j2468j0666q379o765n008
57918C95383k919k026k293j110K507N811O556O194O794P838Q314Q982J0277J0758
57904D61066R847R340J0127J0256Q417O397N832N491M128L045L315L238J253j265
57890E40487k599l574n286o493n951n033n384o189o139n942o450o524n171l701
57876D66051l424l304k142q94n52LJ726L244L311L206M304N522N580N497O432
57861D94560P182O422N204M736L927J788J2L13J286P93m66p01m84j358k634k589
57845E17991j597j223j466j494j791l004l971l412k345k398l092l125k984l739
57831D82350m743m948n131o392p852q280q547r901j1297j1127j0180j0177j0664
$$ plain form
57931 508405 502879 497483 491474 483288 473098 462286 451012 438669 426201 415535 407156 400391 395383
57918 395383 392464 390438 388145 387035 389542 395353 401909 408103 414897 422735 431049 440031 450308 461066
57904 461066 470913 480253 490380 500636 509053 515450 521282 526773 530901 533946 537261 540499 541752 540487
57890 540487 537888 534314 529028 522535 516584 511551 506167 499978 493839 487897 481447 474923 469752 466051
57876 466051 462627 459323 457181 456287 455735 455738 457464 460708 464019 467225 471529 477051 482631 488128 494560
57861 494560 501742 508164 513368 518104 522031 523819 523831 524144 525430 526223 525757 525056 524572 523214 520580 517991
57845 517991 516394 515171 513705 512211 510420 507416 503445 500033 497688 495290 492198 489073 486089 482350
57831 482350 477607 472659 467528 461136 453284 445004 436457 426556 415259 404132 393952 383775 373111
57818C73111j0105q848q220p825o560n250n385o166n602l835k639k272j546l71
57804B98487L06O17J414K345K559K728M107O180P508Q230R491J1140J2145J2615
57790C79872J3063J2528R826O042L368K037P08p76j480j649k430l667m330m716
57776D08396n978p815q822q870q931q897p825o020m755m084k985j459m64j0P53
57761C32234J761K251K410L026L791L803L327L256L245K305Q84M65J345K521L420
57746C70044M048M023L151K478K977L802L595K780K706L336L724M014M819N383
57732D20880M687L687M147N761O754O874P376Q460R174R582J0596J1812J1947
57719E21737J1289J1428J2585J3514J4006J5138J6973J8320J8969J9989K1620
$$ plain form
57818 373111 363006 354158 345938 338113 331553 326303 320918 314752 309150 305315 302676 300404 298858 298487
57804 298487 298793 299410 300824 303169 305728 308456 312563 318743 326251 334481 343972 355112 367257 379872
57790 379872 392935 405463 415289 421331 424699 426736 427444 426668 425188 423539 421109 417442 413112 408396
57776 408396 402418 394603 385781 376911 367980 359083 351258 345238 340483 336399 333414 331955 331491 331481 332234
57761 332234 333995 336246 338656 341682 345473 349276 352603 355859 359104 361409 362293 362758 364103 366624 370044
57746 370044 374092 378115 381266 383744 386721 390523 394118 396898 399604 402940 406664 410678 415497 420880
57732 420880 425567 429254 433401 439162 445916 452790 460166 468626 477800 487382 497978 509790 521737
57719 521737 533026 544454 557039 570553 584559 599697 616670 634990 653959 673948 695568
57708F95568K2976K4046K5975K9055L2404L5737L9660M4095M8328N2701N8362
57697A108907O5422P3167Q2016R3223J06669J21051J36282J53529J72780J92545
57687B305591K12219K32540K53201K71814K85598K92344K89586K74751K46639
57678D664283K05601J52814R1381K7843k9861p6329j09108j26159j26000j10730
57668D563735q6252n9133l5893k5417l7736p6826j35096j96415k44600k70261
57658C396106k72766k58012k33655k05222j76007j48859j25788j06312q8568p2296
57648A708621n8786m8023l8230k8541j9732j1998m244L895J1620J9001K7246L6449
57636A597278M5440N4405O5185P8208R1678J04697J18802J35184J52766J70284
$$ plain form
57708 695568 718544 742590 768565 797620 830024 865761 905421 949516 997844 1050545 1108907
57697 1108907 1174329 1247496 1329512 1422735 1529404 1650455 1786737 1940266 2113046 2305591
57687 2305591 2517810 2750350 3003551 3275365 3560963 3853307 4142893 4417644 4664283
57678 4664283 4869884 5022698 5114079 5141922 5112061 5035732 4926624 4800465 4674465 4563735
57668 4563735 4477483 4418350 4382457 4357040 4319304 4242478 4107382 3910967 3666367 3396106
57658 3396106 3123340 2865328 2631673 2426451 2250444 2101585 1975797 1869485 1780917 1708621
57648 1708621 1649835 1601812 1563582 1535041 1515309 1503311 1499067 1502962 1514582 1533583 1560829 1597278
57636 1597278 1642718 1697123 1762308 1840516 1932194 2036891 2155693 2290877 2443643 2613927
57626B613927J87988K05805K21789K33885K41254K42349K33658K12136J77627
57617D570418J31747P6286J4400m8281j05852j54782j93478k20750k36313k41793
57607C591602k39649k31754k19771k05727j91045j75916j60498j45659j31889
57598A889694j18769j06332r5596q6854p8946p1102o4046n8273n2886m7305m2500
57587A067085l9185l6277l2660k9098k6799k5295k3346k0971j8919j7019j4633
57576G82883j2145j0549r935r539q787p526n809m234l647l844l468j908k07O93
57562G01978J356K612M129N368O787Q888J1076J2574J3630J4783J5924J7075J9006
57549H35186K2105K5581K8761L2069L5811L9339M2489M6536N2480N9602O7073
$$ plain form
57626 2613927 2801915 3007720 3229509 3463394 3704648 3946997 4180655 4392791 4570418
57617 4570418 4702165 4778451 4792851 4744570 4638718 4483936 4290458 4069708 3833395 3591602
57607 3591602 3351953 3120199 2900428 2694701 2503656 2327740 2167242 2021583 1889694
57598 1889694 1770925 1664593 1568997 1482143 1403197 1332095 1268049 1209776 1156890 1109585 1067085
57587 1067085 1027900 991623 958963 929865 903066 877771 854425 833454 814535 797516 782883
57576 782883 770738 760189 750254 740715 731928 724402 718593 714359 710712 706868 703400 701492 701285 701978
57562 701978 703334 705946 710075 715443 722230 731118 742194 754768 768398 783181 799105 816180 835186
57549 835186 857291 882872 911633 943702 979513 1018852 1061341 1107877 1160357 1219959 1287032
57538A287032P5593Q5973R7366J08599J20232J33505J48108J62592J76159J88301
57528B583460J97391K01232J98466J87952J67732J36455R5531M8443j438n0923
57518C764301r5890j32349j58715j75611j83828j84048j78126j68782j57710j45305
57508B183937j32164j19475j07876r7110q6855p6972o7222n7762m9547m3145l7579
57497A308230l1637k5766k1273j7974j4344r882n737k702j3L460P936J2948J8021
57484A221267K2854K7493L2401L7813M3379M9030N5723O4448P4943Q6412R8912
57473A814675J12825J27482J41667J55147J68240J80045J88454J91703J88411
57464C268649J76323J52998J18367P5273K7144k3426p3371j18185j53677j78203
$$ plain form
57538 1287032 1362625 1448598 1545964 1654563 1774795 1908300 2056408 2219000 2395159 2583460
57528 2583460 2780851 2982083 3180549 3368501 3536233 3672688 3768219 3816662 3815224 3764301
57518 3764301 3668411 3536062 3377347 3201736 3017908 2833860 2655734 2486952 2329242 2183937
57508 2183937 2051773 1932298 1824422 1727312 1640457 1563485 1496263 1438501 1388954 1345809 1308230
57497 1308230 1276593 1250827 1229554 1211580 1197236 1187354 1181617 1178915 1178902 1182362 1190298 1203246 1221267
57484 1221267 1244121 1271614 1304015 1341828 1385207 1434237 1489960 1554408 1629351 1715763 1814675
57473 1814675 1927500 2054982 2196649 2351796 2520036 2700081 2888535 3080238 3268649
57464 3268649 3444972 3597970 3716337 3791610 3818754 3795328 3721957 3603772 3450095 3271892
57454C271892j92534j98261j97104j90995j81704j70244j57073j42809j28479
57445A712689j15111j03179r2452q2454p3183o5175n8730n3387m8435m3550l8618
57434I38415l3529k8621k4843k2753k1662k0454j8859j7305j5897j4400j2924
57423G07168j1774j0791r550q100o853n877m934m044l489l321l345l317k867j740
57409F27166n39m70j715k756k197n76O44J158J747K598L077L001K921L131L425
57394F40615L778M282M578M321M084M727N921O369N571M392L815L971M490M958
57380G05872M958M387L776L655L781L710L812M708N950O393N823N168M991M914
57366G71898M653M597N064N827O574P129P139O411N648N915P187Q236Q207P528
$$ plain form
57454 3271892 3079358 2881097 2683993 2492998 2311294 2141050 1983977 1841168 1712689
57445 1712689 1597578 1494399 1401947 1319493 1246310 1181135 1122405 1069018 1020583 977033 938415
57434 938415 904886 876265 851422 828669 807007 786553 767694 750389 734492 720092 707168
57423 707168 695394 684603 675053 666953 660100 654223 649289 645245 641756 638435 635090 631773 628906 627166
57409 627166 626627 626157 624442 621686 619489 618913 619557 620715 622462 625060 628137 631138 634059 637190 640615
57394 640615 644393 648675 653253 657574 661658 666385 672306 678675 684246 688638 692453 696424 700914 705872
57380 705872 710830 715217 718993 722648 726429 730139 733951 738659 744609 751002 756825 761993 766984 771898
57366 771898 776551 781148 786212 792039 798613 805742 812881 819292 824940 830855 838042 846278 854485 862013
57352H62013P070P129P554Q146Q638Q778Q651Q575Q690R062R961J1383J2477J2356
57338I90483J1358J0760J1199J2167J2949J3300J3083J2231J1193J0708J0905
57327A120336J1190J1128J0876J0749J0871J1242J1639J1681J1430J1640J2763
57316A245545J4105J4770J4966J5509J6350J6769J6716J6845J7366J7952J8648
57305A425541J9720K0668K0717K0357K1041K3159K5380K6422K6392K6144K6283
57294A681824K7102K8604L0341L1891L3595L5979L8571M0383M1494M2968M5124
57283B077876M7071M8241M9085M9948N0316M9652M7985M5362M1595L6806L1330
57272B575267K5036J7717J0189L738j579o696j1451j4364j4862j4185j3442j2209
$$ plain form
57352 862013 869083 876212 883766 891912 900550 909328 917979 926554 935244 944306 954267 965650 978127 990483
57338 990483 1001841 1012601 1023800 1035967 1048916 1062216 1075299 1087530 1098723 1109431 1120336
57327 1120336 1131526 1142654 1153530 1164279 1175150 1186392 1198031 1209712 1221142 1232782 1245545
57316 1245545 1259650 1274420 1289386 1304895 1321245 1338014 1354730 1371575 1388941 1406893 1425541
57305 1425541 1445261 1465929 1486646 1507003 1528044 1551203 1576583 1603005 1629397 1655541 1681824
57294 1681824 1708926 1737530 1767871 1799762 1833357 1869336 1907907 1948290 1989784 2032752 2077876
57283 2077876 2124947 2173188 2222273 2272221 2322537 2372189 2420174 2465536 2507131 2543937 2575267
57272 2575267 2600303 2618020 2628209 2631947 2630368 2623672 2612221 2597857 2582995 2568810 2555368 2543159
57260B543159r893p036m374j744J055L507N321P181R581J1884J3466J4786J6408
57247B603301J7793J8201J7977J7975J8246J8391J8535J9036J9722K0260K0789
57236B810226K1411K1591K0893J9882J9501J9955K0839K1946K3260K4524K5505
57225C049533K6341K7195K7918K8419K8907K9399K9592K9463K9292K8868K7609
57214C362536K5862K4951K5262K5387K4012K1766K0240J9946K0244K0545K0553
57203C611304J9932J8777J7985J8289J9277K0071K0459K0681K0783K0990K2069
57192C830617K4368K7076K9296L1205L3258L4872L5113L4285L3604L3450L2980
57181D180124L1467K9266K7426K6892K7822K9266K9831K9105K7928K6969K5837
$$ plain form
57260 2543159 2533266 2526230 2521856 2520112 2521167 2524674 2529995 2537176 2546757 2558641 2572107 2586893 2603301
57247 2603301 2621094 2639295 2657272 2675247 2693493 2711884 2730419 2749455 2769177 2789437 2810226
57236 2810226 2831637 2853228 2874121 2894003 2913504 2933459 2954298 2976244 2999504 3024028 3049533
57225 3049533 3075874 3103069 3130987 3159406 3188313 3217712 3247304 3276767 3306059 3334927 3362536
57214 3362536 3388398 3413349 3438611 3463998 3488010 3509776 3530016 3549962 3570206 3590751 3611304
57203 3611304 3631236 3650013 3667998 3686287 3705564 3725635 3746094 3766775 3787558 3808548 3830617
57192 3830617 3854985 3882061 3911357 3942562 3975820 4010692 4045805 4080090 4113694 4147144 4180124
57181 4180124 4211591 4240857 4268283 4295175 4322997 4352263 4382094 4411199 4439127 4466096 4491933
57170D491933K4128K2374K1001J9247J6278J2735R986Q348P092N806M574L195
57158D646697J329q00k788m812p209r677j1856j4035j6342j7779j7267j5146j2389
57145D517926r001m542K81M238P536J1354J5505J8303J9041J8982J9335J9621
57133D638579J8566J5585J0870N067p66n767j0227j5090k0309k4501k6360k5437
57121D560210k1556j4753o207J894P924J1573J2945J2064R650P193N856O272R767
57108D602832J8629L4448N7018Q5392J19209J58849K05562K62116L32551M20875
57098F297481N30953O67585Q35850J038401J274611J542899J842199K170106K520911
57089A8720996K885558L250037L591665L880587M090361M207367M227260M144429
$$ plain form
57170 4491933 4516061 4538435 4559436 4578683 4594961 4607696 4617682 4626030 4633122 4638928 4643502 4646697
57158 4646697 4648026 4647226 4644438 4639626 4632417 4622740 4610884 4596849 4580507 4562728 4545461 4530315 4517926
57145 4517926 4508925 4504383 4504664 4508902 4516438 4527792 4543297 4561600 4580641 4599623 4618958 4638579
57133 4638579 4657145 4672730 4683600 4688667 4687901 4682134 4671907 4656817 4636508 4612007 4585647 4560210
57121 4560210 4538654 4523901 4517694 4519588 4527512 4539085 4552030 4564094 4573744 4580937 4586793 4593065 4602832
57108 4602832 4621461 4655909 4712927 4798319 4917528 5076377 5281939 5544055 5876606 6297481
57098 6297481 6828434 7496019 8331869 9370270 10644881 12187780 14029979 16200085 18720996
57089 18720996 21606554 24856591 28448256 32328843 36419204 40626571 44853831 48998260
57081D8998260L950885L645433L235355K723102K096594J343109M76886m49163
57073F6020461j360065k185955k877784l408729l771160l973417m034080l975281
57065D0433990l820160l594130l324098l033827k740315k454532k183801j932565
57057A7350562j702555j494327j308815j146922j008236q90849p92060p08768
57049H298030o37883n77202n25612m81877m43703m08662l75671l44899l16662
57040D185859k90964k67675k46299k25873k05817j86648j69178j53353j38595
57031B301457j24965j13044j02794r3438q4507p6265o9018o2690n7108n2103m7269
57020A418256m2227l7146l2517k8483k4855k1632j8841j6064j2818r302o087l094
$$ plain form
57081 48998260 52949145 56594578 59829933 62553035 64649629 65992738 66469624 66020461
57073 66020461 64660396 62474441 59596657 56187928 52416768 48443351 44409271 40433990
57065 40433990 36613830 33019700 29695602 26661775 23921460 21466928 19283127 17350562
57057 17350562 15648007 14153680 12844865 11697943 10689707 9798858 9006798 8298030
57049 8298030 7660147 7082945 6557333 6075456 5631753 5223091 4847420 4502521 4185859
57040 4185859 3894895 3627220 3380921 3155048 2949231 2762583 2593405 2440052 2301457
57031 2301457 2176492 2063448 1960654 1867216 1782709 1706444 1637426 1574736 1517628 1465525 1418256
57020 1418256 1376029 1338883 1306366 1277883 1253028 1231396 1212555 1196491 1183673 1174371 1168284 1165190
57008A165190K79M234Q686J4184K1600L0825M1151N3375P0203R3784J23975J59399
56996A786885J97490K30045K39660K06384J23541Q341j05501j88044k28338k33258
56986B037205k16131j88086j56626j26753j01113q0689o6652o0473o1429o5517
56976I13736o8165o7387o3500n7116m8875m0245l2680k6172j9938j4173r672o016
56964D59797j758L494Q670J3119J7516K2468K7583L2366L6703L9561L8265L0307
56952G28091J5930j438j7138k7788l2687l3438l2023k9183k4754j9204j3910r869
56940E02589o896m288j622J321M820R043J4007J9831K6714L4473M2166M7757M7963
56927G37878L9524K2027m43k1525l6703m4999m7427m5340m0330l4231k8389k3384
$$ plain form
57008 1165190 1165469 1169703 1178389 1192573 1214173 1244998 1286149 1339524 1409727 1503511 1627486 1786885
56996 1786885 1984375 2214420 2454080 2660464 2784005 2792346 2686845 2498801 2270463 2037205
56986 2037205 1821074 1632988 1476362 1349609 1248496 1167807 1101155 1040682 979253 913736
56976 913736 845571 778184 714684 657568 608693 568448 535768 509596 489658 475485 465813 459797
56964 459797 458039 461533 470203 483322 500838 523306 550889 583255 619958 659519 697784 728091
56952 728091 744021 742583 725445 697657 664970 631532 599509 570326 545572 526368 512458 502589
56940 502589 495693 491405 489783 491104 495924 504967 518974 538805 565519 599992 642158 689915 737878
56927 737878 777402 799429 798986 777461 740758 695759 648332 602992 562662 528431 500042 476658
56915D76658j9481j6656j4291j1856r854r028q762p603n515m096m096m241l228
56902C57951j538k80O46K018L768N121N925O772Q044R587J1251J3215J5774J9051
56888D57305K2824K6585L0065L3424L6244L6512L1674K1157P217o751j8081k5197
56876F52978k7665k6569k3850k0590j6570j1794p281l665j08M504J0068J5965
56864E45423K2533L0756M0850N2122O3910P5504Q4712Q7151P7850N4616K0777
56853A156204j5403m5062o3471p1016p0503o4595n5485m5157l4886k5001j5544
56842F50081o590K239J1635K1797L2730M5421O1390Q0666J01346J21267J37982
56831A259964J45979J36407J02819M8137j4960p0817j08597j25758j26536j17656
$$ plain form
56915 476658 457177 440521 426230 414374 404520 395492 386730 379127 373612 369516 365420 361179 357951
56902 357951 356413 356133 356779 358797 362565 367686 373611 380383 388427 398014 409265 422480 438254 457305
56888 457305 480129 506714 536779 570203 606447 642959 674633 695790 703007 696256 678175 652978
56876 652978 625313 598744 574894 554304 537734 525940 518659 514994 514886 519390 529458 545423
56864 545423 567956 598712 639562 691684 755594 831098 915810 1002961 1080811 1135427 1156204
56853 1156204 1140801 1095739 1032268 961252 890749 826154 770669 725512 690626 665625 650081
56842 650081 643491 645730 657365 679162 711892 757313 818703 899369 1000715 1121982 1259964
56831 1259964 1405943 1542350 1645169 1693306 1678346 1607529 1498932 1373174 1246638 1128982
56821A128982j04331q9161p3601n8974m5787l3433k1549j0801j510P571J8137
56810G15543L0739M5140O1361P8946R5254J05139J02410Q2324M4920k632m8209
56799A310935q1381r8614j02371r6919q6148p3629o2005n1832m2243l2789k3868
56788E59136j5787q482j856M501J1545J9817K8683L7284M5297N1494N2357M3977
56776H27966K5706J257k3546m3437n5325n9204n7649n3450m7755m0938l4224k8949
56764D10452k4843k0744j6750j4079j2903j1914j0243q373o904n698m592l910
56752B69499l791l853l727l351k614j506n53l75q39j314j601j891k062j916j761
56737B38345j958k125j772j369j737k665l229l241l234l221k704j847j404j455
$$ plain form
56821 1128982 1024651 935490 861889 802915 757128 723695 702146 691345 689835 697406 715543
56810 715543 746282 791422 852783 931729 1026983 1132122 1234532 1316856 1361776 1359144 1310935
56799 1310935 1229554 1130940 1028569 931650 845502 771873 709868 658036 615793 583004 559136
56788 559136 543349 534867 533011 537512 549057 568874 597557 634841 680138 731632 783989 827966
56776 827966 853672 854929 831383 787946 732621 673417 615768 562318 514563 473625 439401 410452
56764 410452 385609 364865 348115 334036 321133 309219 298976 290603 283699 278001 273409 269499
56752 269499 265708 261855 258128 254777 252163 250657 250104 249729 248890 247576 245975 244084 242022 240106 238345
56737 238345 236387 234262 232490 231121 229384 226719 223490 220249 217015 213794 211090 209243 207839 206384
56723B06384j330q73p01j099j636j931j933j453m40M03K60n42q75l47M54J073
56707A95414J469J347M62m55l25O08R64K19o21o13J6N77Q39Q63Q04J031J739K415
56689B06753K491K367K872L830M253L877L443L413L585L867M320M397L427J952
56675B54847J323J699J730N61j024j897j941j723j627j798k187k389k071j639
56661B41864j809k491k894k632j996j336r78j478k875m064l978l135k807l015
56647B06376k745j868j313j379j422j211j150j131o17J27L56L62J009J900J695
56632A98989M48l66k56k82q40q61P9Q34O24K72N60R75Q76N37J97m77j280j278
56614A98751m56j20q40j492j194o82q19j109p63rO18J147J472J001j45p94m06
$$ plain form
56723 206384 205054 204181 203480 202381 200745 198814 196881 195428 194988 195391 195651 195109 194234 193887 194341 195414
56707 195414 196883 198230 198692 198237 197912 198520 199484 199703 199082 198469 198485 199062 199901 200764 201568 202599 204338 206753
56689 206753 209244 211611 214483 218313 222566 226443 229886 233299 236884 240751 245071 249468 252895 254847
56675 254847 256170 257869 259599 260160 259136 257239 255298 253575 251948 250150 247963 245574 243503 241864
56661 241864 240055 237564 234670 232038 230042 228706 227728 226250 223375 219311 215333 212198 209391 206376
56647 206376 203631 201763 200450 199071 197649 196438 195288 194157 193540 193667 194023 194385 195394 197294 198989
56632 198989 199437 199071 198815 198533 197693 196832 196911 197745 198369 198641 199201 200176 201052 201589 201786 201309 200029 198751
56614 198751 198295 198175 197335 195843 194649 193967 193148 192039 191276 191267 191885 193032 194504 195505 195360 194566 194160
56597A94160J16Q4J33Q38J502J357P55K42l29r12p77J70P84M23J04R06K338L282
56579B05176L429K900J716M64K41J086J717J651J959L023L396K251J179J825L241
56564B35254L513K833K826L715M213L747L103K942L175L597M052M145L721L262
56550B84098L115K913K353J742J122q0j801k858k704k457l221m490n290n648n769
56535B61025n039l257j669j397j849j976j959k240k138j070j33o25j908k456k222
56520B31087k238k595k642k638l345m376m589l912l263k938k469j825j455j322
56506A91480j091r34j086j091m58M21R71J429K124K535K188J653J536J410Q61
56491B01948O64J537K654K868K524K545K684K320K126L111M602N018M174L194
$$ plain form
56597 194160 194276 194360 194493 195331 196833 198190 198945 199187 198858 197946 197169 197339 198123 198546 198650 199556 201894 205176
56579 205176 208605 211505 213221 213685 213926 215012 216729 218380 220339 223362 226758 229009 230188 232013 235254
56564 235254 238767 241600 244426 248141 252354 256101 259204 262146 265321 268918 272970 277115 280836 284098
56550 284098 287213 290126 292479 294221 295343 295263 293462 290604 287900 285443 282222 277732 272442 266794 261025
56535 261025 255986 252729 251060 249663 247814 245838 243879 241639 239501 238431 238298 237673 235765 233309 231087
56520 231087 228849 226254 223612 220974 217629 213253 208664 204752 201489 198551 196082 194257 192802 191480
56506 191480 190389 189455 188369 187278 186820 187241 188212 189641 191765 194300 196488 198141 199677 201087 201948
56491 201948 202612 204149 206803 209671 212195 214740 217424 219744 221870 224981 229583 234601 238775 241969
56477B41969K534J742Q94O50J083J627J997K066J464L54j24N91J421J337J123
56462B60728J942L209L601L174K760K164Q88k03O6J126J567J336J191P93m92j632
56446B82218j088N49J342J041J089J867K307K098K042K140J467J14p86j027j544
56431B93829k463k820k354j913k002k364k965l776l954k870j609j660k558k662
56417B57859j899j587j917j823j192r47j012m27N10N23k12k00O26O82l80r70k74
56400B47360M90L16j20pL02L47L90O00O69O48R14J221J115J092J853K672K287
56383B62149J165R20J612J796J148Q22J103J021N42P96J792K166J727J963L392
56368B84114M555M365L448K508J319J33P3J302K506K949L271L710L373K107J298
$$ plain form
56477 241969 244503 246245 247139 247789 248872 250499 252496 254562 256026 256380 256256 256847 258268 259605 260728
56462 260728 262670 265879 269480 272654 275414 277578 278466 278263 278329 279455 281022 282358 283549 284342 283850 282218
56446 282218 281130 281679 283021 284062 285151 287018 289325 291423 293465 295605 297072 297186 296400 295373 293829
56431 293829 291366 288546 286192 284279 282277 279913 276948 273172 269218 266348 264739 263079 260521 257859
56417 257859 255960 254373 252456 250633 249441 248494 247482 247055 247565 248088 247876 247676 248302 248984 248604 247634 247360
56400 247360 247850 248166 248046 248039 248341 248688 249078 249678 250347 250995 251909 253130 254245 255337 257190 259862 262149
56383 262149 263314 264234 265846 267642 268790 269612 270715 271736 272278 273074 274866 277032 278759 280722 284114
56368 284114 288669 293034 296482 298990 300309 300442 300515 301817 304323 307272 310543 314253 317626 319733 321031
56353C21031J879L064L828M180M310L860K762J622P76R7j04O75J937K636K837
56338C55390L414M231M355L906L887M282M225L914M338N192N306N026N829P535
56324D20830Q411Q150Q215Q948R006Q132P807Q411Q306O594M487L062J884O31
56310E12874l5J7o1m58o03r10k348m079m042k294j111j345j410m60L67O29J579
56293D96310L435M482M104M036N361O871P638Q668J0620J2342J2981J3395J4270
56280F04513J5029J5729J7617K0766K3479K5078K6929K9785L2590L4964L8188
56269H84667M2710M7232N1384N6688O3733P1136P8366Q6819R6926J07180J17253
56258A704094J28940J42591J55716J66668J76648J86341J93722J97157J97622
$$ plain form
56353 321031 322910 325974 329802 333982 338292 342152 344914 346536 347312 347409 347305 347980 349917 352553 355390
56338 355390 358804 363035 367390 371296 375183 379465 383690 387604 391942 397134 402440 407466 413295 420830
56324 420830 429241 437391 445606 454554 463560 471692 479499 487910 496216 502810 507297 510359 512243 512874
56310 512874 512839 512856 512795 512337 511734 510824 508476 504397 500355 498061 496950 495605 494195 493735 494102 494731 496310
56293 496310 499745 504227 508331 512367 517728 524599 532237 540905 551525 563867 576848 590243 604513
56280 604513 619542 635271 652888 673654 697133 722211 749140 778925 811515 846479 884667
56269 884667 927377 974609 1025993 1082681 1146414 1217550 1295916 1382735 1479661 1586841 1704094
56258 1704094 1833034 1975625 2131341 2298009 2474657 2660998 2854720 3051877 3249499
56249C249499J95735J89445J76903J59043J37299J11468Q1960N1576K2871l925
56239D371874k8706m9821o6497q0106r1126r7692r9221r8659r8858r9398r9101
56228C462689r8909r9969j01562j03240j06345j11140j15210j16903j17633j18614
56218B373164j18319j15666j12616j10847j08660j04031r7947r2024q5587p7999
56208A349468p1119o6324o1769n5561m9161m4535m0579l5531l0498k7347k5269
56197H41775k2563j9732j7897j6291j4048j2281j1773j0955q749o753o054m860
56185F89819k084m1l93o84J548M344M899M497N830Q122R121R476J0815J1837J0581
56170G67687Q583Q527R601R234P640O661N883L907J783J364J789J188J82K14L32
$$ plain form
56249 3249499 3445234 3634679 3811582 3970625 4107924 4219392 4301352 4352928 4375799 4371874
56239 4371874 4343168 4293347 4226850 4146744 4055618 3957926 3858705 3760046 3661188 3561790 3462689
56228 3462689 3363780 3263811 3162249 3059009 2952664 2841524 2726314 2609411 2491778 2373164
56218 2373164 2254845 2139179 2026563 1915716 1807056 1703025 1605078 1513054 1427467 1349468
56208 1349468 1278349 1212025 1150256 1094695 1045534 1000999 960420 924889 894391 867044 841775
56197 841775 819212 799480 781583 765292 751244 738963 727190 716235 707486 700733 694679 689819
56185 689819 687735 687694 687301 686617 688165 692509 697408 701905 707735 715857 724978 734454 745269 757106 767687
56170 767687 776270 784797 794398 803632 811272 817933 823816 827723 829506 830870 832659 833847 834029 834243 834575
56155H34575p54j456K30L052M860O496R688J3355J5867J8652K3702K9593L4018
56142I91878L8121M4390N2531O1318P2175Q6728J03043J18253J32423J45751J54600
56131B001211J54897J47243J34571J17671R7594P9443O8280O3144N9559N5489
56121B979102N0188M0520K4305N289j0513k1617k9752l4911l7290m1407n2229
56110B871685o8926q7378j06089j24204j36913j39496j33880j25222j14434j00147
56100A734996q5089p3546o4635n5039m6231m1968m0598l7188l1722k8008k6028
56089A204944k2592j8305j6543j6481j4348j0540q615q234o128k911j862k085
56077A076300P1L891N613N643P365J0071J0346R124J0008J2040J1628J0090J1524
$$ plain form
56155 834575 833821 832365 832595 835647 840507 847003 856691 870046 885913 904565 928267 957860 991878
56142 991878 1029999 1074389 1126920 1188238 1260413 1347141 1450184 1568437 1700860 1846611 2001211
56131 2001211 2156108 2303351 2437922 2555593 2653187 2732630 2800910 2864054 2923613 2979102
56121 2979102 3029290 3069810 3094115 3099404 3088891 3067274 3037522 3002611 2965321 2923914 2871685
56110 2871685 2802759 2715381 2609292 2485088 2348175 2208679 2074799 1949577 1835143 1734996
56100 1734996 1649907 1576361 1511726 1456687 1410456 1368488 1327890 1290702 1258980 1230972 1204944
56089 1204944 1182352 1164047 1147504 1131023 1116675 1106135 1097520 1089286 1083158 1080247 1078385 1076300
56077 1076300 1076371 1080262 1085875 1091518 1098883 1108954 1119300 1128424 1138432 1150472 1162100 1172190 1183714
56064A183714J4730J5191J3558J3938J5441J3951J0850J1108J4043J4801J3788
56053A335113J5432J8884J9343J7579J8562K1544K1319J8464J8366K0800K0648
56042A546054J8450J9793K4609K7414K7942L0988L6019L7674L6439L7965M1939
56031A885286M2676M0467M1074M4148M3907M1111M2402M7691N0325M9762N1633
56020B380482N5402N4947N1403N2129N6732N7759N5317N6805O2026O3537O2120
56009C008659O6415P6352Q2773Q4544Q9790R9015J03914J04470J09837J20501
55999C946270J27258J29799J37850J51736J61013J64811J73779J89001J99437
55990E380954K03407K11667K25844K35706K41231K54687K77046K95938L10733
$$ plain form
56064 1183714 1198444 1213635 1227193 1241131 1256572 1270523 1281373 1292481 1306524 1321325 1335113
56053 1335113 1350545 1369429 1388772 1406351 1424913 1446457 1467776 1486240 1504606 1525406 1546054
56042 1546054 1564504 1584297 1608906 1636320 1664262 1695250 1731269 1768943 1805382 1843347 1885286
56031 1885286 1927962 1968429 2009503 2053651 2097558 2138669 2181071 2228762 2279087 2328849 2380482
56020 2380482 2435884 2490831 2542234 2594363 2651095 2708854 2764171 2820976 2883002 2946539 3008659
56009 3008659 3075074 3151426 3234199 3318743 3408533 3507548 3611462 3715932 3825769 3946270
55999 3946270 4073528 4203327 4341177 4492913 4653926 4818737 4992516 5181517 5380954
55990 5380954 5584361 5796028 6021872 6257578 6498809 6753496 7030542 7326480 7637213
55981G637213L34896L69493M00759M28107M66705N17638N65117O08395O65130
55972A1993453P37575Q09176Q80986R75410J097080J228700J373251J558615J792632
55963B2446878K059837K372352K774432L287326L905015M652457N582172O703451
55955E3783920P995789R513405J1394377J3757612J6708177K0461972K5285395
55948A58900647L1194678L7791960M4332842M9541923N1128749M6073817L2492188
55941D51456804J1832489j1005869l0262839m2410114m7197370m6466210m2476159
55934B43470732l7046769l1408899k6236691k1758403j7985774j4889644j2404836
55927H1739716j0406657q775170p446163o369109n471587m700405m049472l514701
$$ plain form
55981 7637213 7972109 8341602 8742361 9170468 9637173 10154811 10719928 11328323 11993453
55972 11993453 12731028 13540204 14421190 15396600 16493680 17722380 19095631 20654246 22446878
55963 22446878 24506715 26879067 29653499 32940825 36845840 41498297 47080469 53783920
55955 53783920 61779709 71293114 82687491 96445103 113153280 133615252 158900647
55948 158900647 190095325 227887285 272220127 321762050 372890799 418964616 451456804
55941 451456804 463289293 452283424 422020585 379610471 332413101 285946891 243470732
55934 243470732 206423963 175015064 148778373 127019970 109034196 94144552 81739716
55927 81739716 71333059 62557889 55111726 48742617 43271030 38570625 34521153 31006452
55919C1006452l061991k664164k327648k056330j825275j613531j429078j279316
55911A4749119j147996j021993r11863q26057p51170o75914o09676n60160n16141
55902G728149m68640m26916l97943l71122l38199l08249k88668k70414k45856
55893D612142k23066k08993j95840j77066j60286j51854j44350j31516j20300
55884C098871j16420j12640j02906r4009r1927r0156q2721p5711p5003p4824o9323
55873B113231o3629o3031o2358n6361m9871m7936m6162m0416l6027l7949m1238
55862A568253m0282l8283l9027l8389l2520k5686k1757j6564o653K899P070Q813
55850A327874J0861Q452j775j3835k1179k5694l0567l2430k8607k4370k4801k6403
$$ plain form
55919 31006452 27944461 25280297 22952649 20896319 19071044 17457513 16028435 14749119
55911 14749119 13601123 12579130 11667267 10841210 10090040 9414126 8804450 8244290 7728149
55902 7728149 7259509 6832593 6434650 6063528 5725329 5417080 5128412 4857998 4612142
55893 4612142 4389076 4180083 3984243 3807177 3646891 3495037 3350687 3219171 3098871
55884 3098871 2982451 2869811 2766905 2672896 2580969 2490813 2408092 2332381 2257378 2182554 2113231
55873 2113231 2049602 1986571 1924213 1867852 1817981 1770045 1723883 1683467 1647440 1609491 1568253
55862 1568253 1527971 1489688 1450661 1412272 1379752 1354066 1332309 1315745 1309092 1311991 1319061 1327874
55850 1327874 1338735 1347187 1345412 1331577 1310398 1284704 1254137 1221707 1193100 1168730 1143929 1117526
55838A117526k4495k1993k3147k5300k4672k3930k6435k8983k7676k5259k5438
55827H40198k5566k2080j7760j6627j6788j4984j3170j4075j5309j4012j2494
55816F57333j3192j3121r389n137l988l597o49K682L261L088M895O400M895K862
55802F36343L240L634J064k112k713k631m565o472o048o127r683j3783j4484j3552
55788E62111j4371j5459j4086j2247j2868j3757j1490p801o156n375k514J121
55776D47108K589K642K883J006n221j2355j5510j5389j5594j5906j4001j1068
55764C51184r817r217o753l673k735l096k527k292m575p454p755o687p417r227
55750B67959r231p839p392p245n283k537j497j568q44l86k058m040l349j060l62
$$ plain form
55838 1117526 1093031 1071038 1047891 1022591 997919 973989 947554 918571 890895 865636 840198
55827 840198 814632 792552 774792 758165 741377 726393 713223 699148 683839 669827 657333
55816 657333 644141 631020 621631 616494 612506 608909 608260 610942 614203 617291 622186 628586 633481 636343
55802 636343 639583 643217 644281 642169 639456 636825 632260 625788 619740 613613 603930 590147 575663 562111
55788 562111 547740 532281 518195 505948 493080 479323 467833 460032 453876 448501 445987 447108
55776 447108 449697 452339 455222 456228 451007 438652 423142 407753 392159 376253 362252 351184
55764 351184 341367 332150 325397 321724 318989 315893 313366 311074 306499 299045 291290 284603 277186 267959
55750 267959 258728 250889 243497 236252 230969 228432 226935 225367 224523 224137 222079 218039 214690 213630 213268
55735B13268j140j071l41n63p62R30L069K885R63k23q33k480m326m704m781o354
55719A93537p770o528m029l230l377j799P23J253L8j54J061J961K661M429O222
55704A84998O213N653O883Q783Q514O509N348M836K908L89J13J894K855K290J960
55689B50146K049R86r97k109k426l423m587m144k530j568r11J124L908N286N214
55674B46018N176M882L173J175Q88J525J004j13J46J095O06o38k74J266J589Q65
55658B68383J259K443K044J73o81q8K3p15q71o91j859l969n030n300o779r060
55642B39282r717q701q487r665j0273r612r045q848p847o357n962o339n663m102
55628A28664l513l847l446k583k966l964l296j353p74j675j483J86P80n34j565
$$ plain form
55735 213268 212128 211057 210716 210153 209391 210321 213390 216275 217238 217015 216182 213702 209376 204672 199891 193537
55719 193537 185767 179239 175210 171980 168603 166804 167527 168780 168818 168664 169725 171686 174347 178776 184998
55704 184998 191211 196864 203747 212530 221044 227553 232901 237737 240645 241034 241147 243041 245896 248186 250146
55689 250146 252195 253181 252184 250075 247649 244226 239639 235495 232965 231397 230486 231610 235518 240804 246018
55674 246018 251194 256076 259249 260424 261312 262837 263841 263728 263874 264969 265575 264937 264663 265929 267518 268383
55658 268383 269642 272085 274129 274302 273621 273533 273556 272841 271970 271279 269420 265451 260421 255121 248342 239282
55642 239282 229565 220864 212377 202712 192439 182827 173782 164934 157087 150730 144768 138429 132766 128664
55628 128664 125151 121304 117858 115275 112309 108345 105049 103696 102922 101247 99764 99950 100730 100196 98631
55613I8631j255j144j809j621j72P09M14N73J595J577j43j640j743j651k111j989
55597H8221q85k01m98m81M11R65O17L34L59k31j160r12L28N78n15j083n31n03
55579H4813j511j747m18P08L08n91r70j407k130k045r20j65k98N8J513K626K370
55562H0194J669J427J146N20K50L43l20j813k634k184j708j963j987j092n1N23
55546G2320J135K049K709L102L865M707M614L835L588L694K756Q94j66O5M00N93
55530A10160J718L450L867K575J445J434J350N01j02r9p37k391l556l339k698
55515A13578k333j646o80o85j869k904l416m538o218o680n520m673n152n376m129
55500E7759k660k324k393j764q75m57k16O3j85q77r65l34j29m90j53J012J400
$$ plain form
55613 98631 97376 96232 94423 92802 92630 93339 93753 94326 95921 97498 97355 95715 93972 92321 90210 88221
55597 88221 87336 87135 86637 86156 86567 87532 88149 88483 88842 88611 87451 86539 86867 87445 86930 85847 85316 84813
55579 84813 83302 81555 81137 81845 82153 81562 80592 79185 77055 75010 74090 73925 73627 73685 75198 77824 80194
55562 80194 81863 83290 84436 84956 85206 85549 85229 83416 80782 78598 76890 74927 72940 71848 71797 72320
55546 72320 73455 75504 78213 81315 85180 89887 94501 98336 101924 105618 108374 109268 109102 109167 109567 110160
55530 110160 111878 115328 119195 121770 123215 124649 125999 126500 126398 126299 125562 123171 119615 116276 113578
55515 113578 111245 109599 108919 108234 106365 103461 100045 95507 89289 82609 77089 72416 67264 61888 57759
55500 57759 55099 52775 50382 48618 47743 47286 47070 47133 46948 46071 45106 44772 44643 44153 44000 45012 46412
55483D6412M70k61K2J16o67j183q54r28j927k309j203j39m33j061p74l03o44j045
55465C3289n54O8k87j220j785j971j992j475m87N3o8J03Q79J288R84Q71J180Q85
55447B9761j26n42q9k08j307j774q58o5l21k97R19J906J443O32O95Q22J10n07
55429C0194j29K42l51q43p0J083J405J460K077K406J487K04k15k19o36q19j0Q83
55411C8149P48K00L12O93N43L43P79J238J019P75J167J392O13m29p88r55j613
55394D4186k059j508n57j6M51J014O56r62k181j618k69K55J11J46R1l91m52L28
55376C7225O21m21j284m91P64O28k79k47L65p2j455k310k379k482k436j485k56
55359B4006p0o70o63J16N54K67j15l69o47n09M28J315J096L10L19J157J673J424
$$ plain form
55483 46412 46882 46621 46643 46759 46092 44909 44055 43127 41200 38891 37688 37549 37116 36055 35281 34978 34334 33289
55465 33289 32735 32803 32516 31296 29511 27540 25548 24073 23586 23639 23571 23674 24553 25841 26825 27696 28876 29761
55447 29761 29635 29093 29004 28796 27489 25715 24857 24792 24471 24174 25093 26999 28442 29074 29769 30591 30701 30194
55429 30194 30065 30307 29956 29113 29043 30126 31531 32991 35068 37474 38961 39165 38950 38731 38095 37276 37266 38149
55411 38149 38897 39097 39409 40102 40645 40988 41767 43005 44024 44799 45966 47358 47971 47542 46754 45799 44186
55394 44186 42127 40619 40062 40046 40497 41511 42167 41205 39024 37406 37137 37392 37503 37649 37740 37349 36897 37225
55376 37225 37846 37425 36141 35650 36414 37042 36763 36516 36881 36809 35354 33044 30665 28183 25747 24262 24006
55359 24006 23936 23266 22603 22719 23273 23540 23425 23056 22409 21900 22328 23643 24739 25049 25368 26525 28198 29622
55341B9622R85P36N65M75M14l8q84j359j145r64j156r01J38Q06L57j69J37L95
55323B8014k22o17K99J330Q07n58r29k95O7J49Q19J637J399L88p6J02ol50j21
55304C1837M22L48j81l49m34j185j955j484j54M55P4k05k9m4j52M85J602J879
55286C0930R42j80p52j051j338j380j100o62n8N59N85n3l63K57R09P59N77J256
55268B9837J896J170l33j063r90j145j436j007k23r0j94O03J779J676L15n33p8
55251C0184P45J302J955K540K127P58k89l62j20j13j58l40j101k110k312j440
55235C1266k62O74J418J776J378O03K79M33M32K22L15P34J047J203J299R37m3
55218D3711p21k38P36R60N56N38R51R52L39m06j126j733j581n34R8o93j723j316
$$ plain form
55341 29622 30607 31343 31908 32383 32797 32759 31875 30516 29371 28407 27251 26350 26488 27294 27651 27482 27619 28014
55323 28014 27792 27175 27474 28804 29611 29053 28124 27829 27896 28045 28864 30501 31900 32288 32212 32314 32308 31958 31837
55304 31837 32259 32607 32426 32077 31643 30458 28503 27019 26865 27320 27394 27189 27160 27116 26964 27449 29051 30930
55286 30930 31872 31692 30940 29889 28551 27171 26071 25409 25351 25910 26495 26442 26079 26336 27245 28004 28581 29837
55268 29837 31733 32903 32570 31507 30517 29372 27936 26929 26706 26616 26422 27025 28804 30480 30795 30262 30184
55251 30184 30929 32231 34186 36726 38853 39611 39322 38960 38840 38727 38569 38229 37128 35018 32706 31266
55235 31266 31004 31678 33096 34872 36250 36853 37132 37565 37997 38219 38534 39268 40315 41518 42817 43754 43711
55218 43711 42990 42752 43488 44448 45004 45542 46493 47445 47784 47378 46252 44519 42938 42404 42502 41809 40086 38770
55200C8770p1J40o79q43M7O12K33j99j60j46k59qL45mo91n88J04K1r69j470r09
55179C3276k10J28P41J683J863Q55k74o02m34k54J15P40J114R19M16j03m62l52
55161C9159J45J92o11j251p39J27N4n24l26L23R3p40o17N05R79K33n37o05n46
55142C5314n19R3R94J006J57k27J14J3p45q47J55R62Q23O78J260J895K034K237
55124D5397K747K792K118J634J757J677R03Q1m33j166k050k048r99k63o28j161
55108E0358q63j14M04P60J011P30Q4j8N42P45K39%N72J133J055Q51R12P33K04
55089E9338J23P24J060O66L24M67L77j91k65N14R17J42o78k68Q01J270J204J504
55071F8029K182K375J639L46p59r38r0Q12O96n5j82K93Rj389k461k124r83J05
$$ plain form
55200 38770 38699 38839 38160 37317 37364 37976 38209 38010 37850 37704 37445 37437 37782 37778 37087 36499 36603 36624 35655 34185 33276
55179 33276 33066 33194 33935 35618 37481 38336 38062 37460 37026 36772 36887 37627 38741 39660 40076 39973 39511 39159
55161 39159 39304 39496 38885 37634 36895 37022 37076 36552 36226 36549 36642 35902 35285 35790 36769 37002 36465 35860 35314
55142 35314 34795 34888 35882 36888 37045 36818 36932 36945 36200 35353 35508 36470 37293 37971 39231 41126 43160 45397
55124 45397 48144 50936 53054 54688 56445 58122 59025 59106 58673 57507 55457 53409 52410 52147 51519 50358
55108 50358 49495 49381 49785 50545 51556 52286 52370 52352 52894 53639 53878 53878 54450 55583 56638 57489 58401 59134 59338
55089 59338 59461 60185 61245 61911 62235 62702 63079 62888 62623 63137 64054 64196 63518 63250 64051 65321 66525 68029
55071 68029 70211 72586 74225 74571 73812 72874 72784 73596 74292 74237 74055 74348 74357 72968 70507 68383 67400 67505
55053F7505J199K224K341J257o1q01j162j239n94M30N71l51r31n08k32q61j313
55036F7474p03q8o29j574j651j171j119j232o74L15Q94J069J314J512J436J530
55020F6703K050K207J292q2q87j078j094q32k48n2p26j484j362n94pK81N52O17
55002F5256K49j37q0K08M24P54J167J006N3q76j081q84p15k62O57J386J469J371
54984F9965J444J192M26PM79J002O78m0l03k24k33j5P99J675J995J989K074K059
54966H4969J867K032K640K845K362K272L329M621N078N135N671O439O950P895
54952A44105J0160J3154J5557J7002J7762J7489J5586J2310Q286L570j701o524
54940B66756j0069j2817j5388j7025j6610j4564j2399j0867r778r097q885q563
$$ plain form
55053 67505 68704 70928 73269 74526 74465 73664 72502 71263 70669 71099 71670 71319 70388 69880 69648 68787 67474
55036 67474 66771 66683 66054 64480 62829 61658 60539 59307 58633 58948 59842 60911 62225 63737 65173 66703
55020 66703 68753 70960 72252 72170 71283 70205 69111 68279 68031 67979 67253 65769 64407 63813 63806 64087 64639 65256
55002 65256 65505 65368 65288 65496 65920 66674 67841 68847 68900 68024 66943 66059 65344 65082 65739 67125 68594 69965
54984 69965 71409 72601 73027 73034 73513 74515 75193 75153 74850 74626 74393 74378 75177 76852 78847 80836 82910 84969
54966 84969 86836 88868 91508 94353 96715 98987 102316 106937 112015 117150 122821 129260 136210 144105
54952 144105 154265 167419 182976 199978 217740 235229 250815 263125 271411 274981 273280 266756
54940 266756 256687 243870 228482 211457 194847 180283 167884 157017 147239 138142 129257 120694
54928A20694p477n950m771l988l145k234j466o18M80J302J431J449K128L317M476
54913A05628N661P037Q126Q535Q893J0073J2000J4049J5869J6991J6454J3874
54901B43190J0152O200J758l527q769j2708j5211j6746j7186j6262j4537j2801
54889A43553j1016q986p309o604o342n513l997k467j512j502k402l177k500p52
54875G9474M6q10j476m94Q03M85r10j524j143r07j031q84o31q12r05j97N45J62
54857F9791p45p82k01m02j322j525o99p1k82o47o42n52n88p28j246k169k498j445
54839E3247N8N27J34R8M81M41K21P87J764J757P92L38Q44J154O93L14N52P29L43
54820F5274j34k77k34L9Q07J658J842J628K001K926L329K930K692L201L960M503
$$ plain form
54928 120694 113217 107267 102496 98508 95363 93129 91663 91045 91525 92827 94258 95707 97835 101152 105628
54913 105628 111289 118326 126452 134987 143880 153953 165953 180002 195871 212862 229316 243190
54901 243190 253342 259542 261300 257773 249004 236296 221085 204339 187153 170891 156354 143553
54889 143553 132537 123551 116242 109638 103296 97783 93786 91319 89807 88305 85903 82726 80226 79474
54875 79474 79520 78710 77234 76740 77543 78028 77118 75594 74451 73544 72513 71629 70998 70186 69281 69084 69629 69791
54857 69791 69046 68264 68063 67661 66339 64814 64115 64044 63762 63115 62473 61921 61333 60605 59359 57190 54692 53247
54839 53247 53305 53832 53966 54064 54545 54986 55207 55994 57758 59515 60307 60645 61489 62643 63336 63650 64202 64931 65274
54820 65274 65140 64863 64629 64668 65475 67133 68975 70603 72604 75530 78859 81789 84481 87682 91642 96145
54804I6145M999N512N836O204P122Q440R687J1130J3238J5329J6186J5860J5364
54791B31052J4707J2827R513N700J782k700p403j0928j2656j3425j3916j3842
54779B00711j3075j2175j1269r739p492n452m282l689l260k907k263q63Q82J993
54765A27120K403K958L846M365M450N048O534Q059Q958R751J1256J3664J6733
54752B25145J9954K2347K3022K2113K0304J7537J3297P927K419k988q686j4239
54740C48152j8497k1135k2697k3074k1643j8917j6469j4866j3235j1098r169p894
54728A49458o808n705n077m960m681m072l615l193k170r32p04j555k185k018j841
54713I9942j987j689q18m46r14j043j39Q25Q55L31q4m95q71n63M57J088P16M4
$$ plain form
54804 96145 101144 106656 112492 118696 125818 134258 143945 155075 168313 183642 199828 215688 231052
54791 231052 245759 258586 268099 273799 275581 272881 265478 254550 241894 228469 214553 200711
54779 200711 187636 175461 164192 154453 146961 141509 137227 133538 130278 127371 125108 124245 125127 127120
54765 127120 129523 132481 136327 140692 145142 150190 156724 164783 173741 183492 194748 208412 225145
54752 225145 245099 267446 290468 312581 332885 350422 363719 371646 374065 371077 362391 348152
54740 348152 329655 308520 285823 262749 241106 222189 205720 190854 177619 166521 157352 149458
54728 149458 142650 136945 131868 126908 122227 118155 114540 111347 109177 108245 107541 105986 103801 101783 99942
54713 99942 97955 96266 95448 95002 94088 93045 92906 93731 94586 94917 94833 94338 93467 92904 93361 94449 95165 95209
54695I5209l09o51r74m48R76J901J452N22J43M1k46k05M97J089J055J121J762
54678A02935K060J353O79J092J801J562R40J359K694L523L412L275L662M114M297
54663A38758M545N077N577N722N573N371N284N307N186M704M125L903L940L743
54649B06815L409L631M510N274N509N889P255R612J2298J4454J5285J4681J3556
54636C22178J2631J0961O957Q48n305j0153j4032j7142j8633j8181j6882j5739
54624B37508j4566j3161j2017j1208r868p732n799m702l803k691k058k159j966
54611A45778q42L98J090J814K802K976J872R51J472K507K621K071J734J217j53
54596A68308j688k509l254m767o122n930m725m103m219m054l523l322l194k406
$$ plain form
54695 95209 94900 94249 93275 92827 93803 95704 97156 97678 97821 97862 97616 97411 97908 98997 100052 101173 102935
54678 102935 104995 106348 107027 108119 109920 111482 112422 113781 116475 119998 123410 126685 130347 134461 138758
54663 138758 143303 148380 153957 159679 165252 170623 175907 181214 186400 191104 195229 199132 203072 206815
54649 206815 210224 213855 218365 223639 229148 235037 242292 251904 264202 278656 293941 308622 322178
54636 322178 334809 345770 352727 353575 348270 338117 324085 306943 288310 270129 253247 237508
54624 237508 222942 209781 197764 186556 176688 168956 163157 158455 154652 151961 149903 147744 145778
54611 145778 144936 145334 146424 148238 151040 154016 155888 156839 158311 160818 163439 165510 167244 168461 168308
54596 168308 166620 164111 160857 156090 149968 144038 139313 135210 130991 126937 123414 120092 116898 114492
54582A14492j483j612k483k711k203k249l211l904l473k362j253l71l1m56r22
54567H5768m05Q46J504J076M31K42J20m08j041j219q37j94K62K45N0L46J084J197
54549H9067J64q77n34Q90J994K254K188K058J717J543K138L218L888L994M150
54534A17852M607N123N769O796P823Q197P978P581O761N021K723O13j458m092
54520A81294o776q237q313q125q277q182p412o445n697m926l993l301l024k699
54506I5887j946r88k28J57Q7l82q65j061j207j582j819j434p06k12K26J131K169
54489H7227K410J784J170J045J033R38J115J672K131K242K306K418K154J303K98
54474A11246k70k27K01N69M92J16J32Q56J602J510O23m05j235j809j884j445j127
$$ plain form
54582 114492 113009 111397 108914 106203 104000 101751 98540 94636 91163 88801 87548 87177 87146 86690 85768
54567 85768 85363 86209 87713 88789 89220 89462 89582 89174 88133 86914 86077 85883 86145 86390 86440 86786 87870 89067
54549 89067 89231 88354 87820 88710 90704 92958 95146 97204 98921 100464 102602 105820 109708 113702 117852
54534 117852 122459 127582 133351 140147 147970 156167 164145 171726 178487 183508 186231 186844 185386 181294
54520 181294 174518 166281 157968 149843 141566 133384 125972 119527 113830 108904 104911 101610 98586 95887
54506 95887 93941 92953 92725 92882 92969 92587 91722 90661 89454 87872 86053 84619 83913 83701 83927 85058 87227
54489 87227 89637 91421 92591 93636 94669 95607 96722 98394 100525 102767 105073 107491 109645 110948 111246
54474 111246 110976 110749 110950 111519 112011 112127 112259 113115 114717 116227 116850 116445 115210 113401 111517 110072 108945
54457A08945j343j553j208q82j279j793j332j55M99L41P6k25j100k091j914n56
54441I4430L76n6q85q99k80P0j80p72j331j300l46Q09R08r5q29m64K21L48L30
54422I0055R12J699J740R73K06n1O8L38O18O95N22M50Q16J411J717J612J513J898
54404A07192K794L672L921L553L339L889M743M925M252L554L546M070M596M875
54390A62921M828M286L221J997J087O53M33l2r83k130k881l062l146l514l877
54375A59801l855l709l941m433m600m176l391k552j959j946k428k698k291j659
54361A16163j444j444j118o08m46n03k14L16M60K23K60P68J257J508J890K542
54345A19610L049L153L134L330L831M570N231N219M423L735M043M862M919L899
$$ plain form
54457 108945 107602 106049 104841 103959 102680 100887 99555 99400 99899 100240 100316 100091 98991 96900 94986 94430
54441 94430 94806 94750 93865 92966 92686 92756 92576 91804 90473 89173 88827 89636 90544 90449 89620 89156 89377 89725 90055
54422 90055 90967 92666 94406 95379 95585 95534 95602 95940 96558 97253 97775 98225 99041 100452 102169 103781 105294 107192
54404 107192 109986 113658 117579 121132 124471 128360 133103 138028 142280 145834 149380 153450 158046 162921
54390 162921 167749 172035 175256 177253 178340 178993 179426 179394 178411 176281 173400 170338 167192 163678 159801
54375 159801 155946 152237 148296 143863 139263 135087 131696 129144 127185 125239 122811 120113 117822 116163
54361 116163 114719 113275 112157 111549 111103 110600 110386 110702 111162 111385 111645 112413 113670 115178 117068 119610
54345 119610 122659 125812 128946 132276 136107 140677 145908 151127 155550 159285 163328 168190 173109 177008
54331A77008K620J594N02p98j830k407k998l899m731n172n364n435n267n026n234
54316A33563n927o369n950m973m256m265m714m842m099k780j749j313r49m08l78
54301H0591j223j899j263M5L74o16j656j787j299p36k15J22R6J00O53J315J084
54284G3686nq04o97k53LL02Q63J359J510J395J028M49J36M70Q79N61k7L10J545
54265H2710K323J947J052J78q56j744j456J20J561J669Q11j2m05l57J07M99R3
54248H8240q80j285p24p3P3L21J231K307K797K523J470l45k118k583j751j037
54232H8166j176j282o93j93m82p87k48N42O03J51q8k27o66j027q54o23q72j084
54214G9160n95R5J96P9N72J349J372N89q1k80m86r55j371j556j624j492r67k12
$$ plain form
54331 177008 179628 181222 181724 180926 179096 176689 173691 169792 165061 159889 154525 149090 143823 138797 133563
54316 133563 127636 121267 115317 110344 106088 101823 97109 92267 88168 85388 83639 82326 81377 80969 80591
54301 80591 79368 77469 76206 76251 76625 76009 74353 72566 71267 70531 70316 70438 70534 70634 71287 72602 73686
54284 73686 73681 72877 72180 71927 71930 72232 73095 74454 75964 77359 78387 78836 78972 79442 80321 80882 80855 81165 82710
54265 82710 85033 86980 88032 88210 87354 85610 84154 84274 85835 87504 88315 88303 87898 87541 87648 88147 88240
54248 88240 87360 86075 85351 85278 85351 85672 86903 89210 92007 94530 96000 95655 93537 90954 89203 88166
54232 88166 86990 85708 85015 84822 84340 83553 83305 83847 84450 84601 84513 84286 83620 82593 81739 81116 80244 79160
54214 79160 78565 78660 78856 78935 79507 80856 82228 82817 82736 82456 81970 81015 79644 78088 76464 74972 74005 73793
54196G3793M21Q20Q49K00q97j417p38L23N74k5o84j109j495j613j047j56J85j96
54178F7788o43o53l21J21N16O07L01nR9M20N73P24J244J853J751O59q20j811j829
54159G0574j005MM97L54j9l89p88q47P1J679K627K142J063N54O11N42J68k67p67
54140G6804j181r40%N75rr55j040m24j10k20j75j51q24j810j941j078k65M4M69
54121F6769J114R66m35j956k284j556p76l26J27O96J107J269J377J482J319P31
54105F9624Jl27J5O76R90P02K24R3L98Q85J356J638J501R51L68qm52j257k105
54086G5273k351j842r69j64K99K19l68j031j336j234q51k08N06Q17N73L47O16
54069F8296R63P57K45K34P91J192J087R00R45R09N22J11O4K42L24L53M70M29j21
$$ plain form
54196 73793 74214 75034 75883 76083 75186 73769 73031 73354 73928 73903 73219 72110 70615 69002 67955 67799 67984 67788
54178 67788 67145 66492 66171 66292 66808 67415 67716 67711 67810 68230 68803 69527 70771 72624 74375 75034 74214 72403 70574
54159 70574 69569 69573 70070 70424 70405 70016 69228 68381 68452 70131 72758 74900 75963 76517 77128 77670 77838 77571 76804
54140 76804 75623 74683 74683 75258 75249 74294 73254 72830 72720 72500 72325 72174 71350 69540 67599 66521 66256 66300 66769
54121 66769 67883 68849 68414 66458 64174 62618 61842 61516 61643 62339 63446 64715 66092 67574 68893 69624
54105 69624 69625 69298 69313 69989 70979 71681 71905 71998 72396 73281 74637 76275 77776 78727 79095 79087 78635 77378 75273
54086 75273 72922 71080 70111 69947 70246 70465 70097 69066 67730 66496 65645 65437 65943 66760 67333 67680 68296
54069 68296 69259 70016 70261 70495 71286 72478 73565 74465 75410 76319 76841 76952 77016 77258 77582 77935 78405 78834 78713
54050G8713q90j020n8J438K482K704K417J922J279Q38J229K430L382L205K391
54035A02462K083K510K985L220L637M405N054N335N575N983O297O365O316O059
54021A68286N329M401L927L969L980L828L879L979L489K558K172K522K593J784
54007B16696P07j52j230k611l415l338l481m548n547n414m741m470m122k915j663
53992A69756j804l128m169m375m299m001l005j651r62j111j305j178j068j038
53978A36662q10o44j052j699j734j179q04p41l84L25P54P76Q97J150J013O06P49
53961A33885J552K120J993J811K102K376K031J322Q65P63P45P43Q76J105J159
53946A55448P94J16k34L88J755K839L143L374M195N057N172M929N158N466M653
$$ plain form
54050 78713 77823 76803 76745 78183 80665 83369 85786 87708 88987 89825 91054 93484 96866 100071 102462
54035 102462 104545 107055 110040 113260 116897 121302 126356 131691 137266 143249 149546 155911 162227 168286
54021 168286 173615 178016 181943 185912 189892 193720 197599 201578 205067 207625 209797 212319 214912 216696
54007 216696 217403 217251 216021 213410 209995 206657 203176 198628 193081 187667 182926 178456 174334 171419 169756
53992 169756 167952 164824 160655 156280 151981 147980 144975 143324 142362 141251 139946 138768 137700 136662
53978 136662 135852 135208 134156 132457 130723 129544 128740 127999 127615 127940 128694 129470 130367 131517 132530 133136 133885
53961 133885 135437 137557 139550 141361 143463 145839 147870 149192 150057 150820 151565 152308 153184 154289 155448
53946 155448 156242 156358 156124 156512 158267 161106 164249 167623 171818 176875 182047 186976 192134 197600 202253
53931B02253K617N49p93j748k590k876k381j631j154q72n50j59L97J284K375L326
53915A98047M010M400M285L734L556M417N773O507O414O164O039N820N666N982
53901B70814O397O021M754L340K086O13j007k033k197k063k016j885j729k029
53887B79066k839l625m166m797n589o146o387o651o946o943o801o987p210o557
53873A97422m982l583l145l383l745m095m256l921l317l081l237l162k775k745
53859A47995l236l483l003k311k027k060k071j940j561q76l25m63j055j382j431
53844A20771j726k050j578m60J29k16n64l55k08n32p01l46j82o92j143q35l16
53827A08996l58n95k78L91O27K81j69m52n95n73m28l42k44J88Q71J357J694K399
$$ plain form
53931 202253 204870 205419 204626 202878 200288 197412 195031 193400 192246 191374 190824 190665 191062 192346 194721 198047
53915 198047 202057 206457 210742 214476 218032 222449 228222 234729 241143 247307 253346 259166 264832 270814
53901 270814 277211 283232 287986 291326 293412 294025 293018 290985 288788 286725 284709 282824 281095 279066
53887 279066 276227 272602 268436 263639 258050 251904 245517 238866 231920 224977 218176 211189 203979 197422
53873 197422 192440 188857 185712 182329 178584 174489 170233 166312 162995 159914 156677 153515 150740 147995
53859 147995 144759 141276 138273 135962 133935 131875 129804 127864 126303 125427 125102 124639 123584 122202 120771
53844 120771 119045 116995 115417 114957 115086 114870 114306 113951 113743 113211 112510 112164 111982 111290 110147 109312 108996
53827 108996 108638 108043 107765 108156 108783 109064 108895 108443 107848 107275 106847 106505 106261 106449 107320 108677 110371 112770
53809A12770L310L461K566J555J115Q28M13O87K270M293N417N537N481N585N540
53794A60828N198M732M220L735L510L575L565L294K956K575J883J068P57R72R94
53779B03862O27N93J143J442R71L81J84k04j219k036j865j312j323j603j416j072
53763A97153j311j861j936j731k029k764l201l189l084k777k012j322j441j997
53749A66498k034j564j408j623j396n46J08O1k25j97J78Q13J701K497K669K264
53733A67796J824J550J164O16J55l71j430k859l649l068j516o1N36K54l40o08
53717A59993m14k05l30n41m11N8O41J332K048K272J622N85J26O34J685K610K958
53700A74663K693K350K619L425L884L676L705M718N949O117N264M478M118L608
$$ plain form
53809 112770 116080 119541 122107 123662 124777 125605 126018 126705 128975 133268 138685 144222 149703 155288 160828
53794 160828 166026 170758 174978 178713 182223 185798 189363 192657 195613 198188 200071 201139 201896 202868 203862
53779 203862 204489 205082 206225 207667 208638 209019 209203 208999 207780 205744 203879 202567 201244 199641 198225 197153
53763 197153 195842 193981 192045 190314 188285 185521 182320 179131 176047 173270 171258 169936 168495 166498
53749 166498 164464 162900 161492 159869 158473 157927 158035 158096 157871 157674 157852 158665 160366 162863 165532 167796
53733 167796 169620 171170 172334 172950 173105 172734 171304 168445 164796 161728 160212 160151 160687 160941 160601 159993
53717 159993 159579 159374 159044 158503 158092 158150 158791 160123 162171 164443 166065 166650 166776 167410 169095 171705 174663
53700 174663 177356 179706 182325 185750 189634 193310 197015 201733 207682 213799 219063 223541 227659 231267
53686B31267K886K763L637M844N610N842N696N208M690M700N169N206M164K497
53672B94179J117L33j94p07j028r02m38j40m43j186j709j644j336j321j606j798
53656B81177j717j504j295j216j459j961k176j611n47J97J16n70j293j525j071
53641B63545k64K12k3o75j229j431j198m95L19N34k4o14n32k0L26N21Q65J126
53623B60943Q91M84O34J334J838J814J738K005K419K677K874L235L739M207M506
53608B95338M599M556M527M543M571M820N608O712P311P038O624O957P855Q387
53594C79446Q057P192O412O273P039Q171Q431P197N486M839N461O162O079N544
53580D71789N274N414N617N551N177M778M683M749M432L649L098L220L421K958
$$ plain form
53686 231267 234153 236916 240553 245397 251007 256849 262545 267753 272443 277143 282312 287518 291682 294179
53672 294179 295296 295629 295435 294728 293700 292798 292360 292220 291777 290591 288882 287238 285902 284581 282975 281177
53656 281177 279460 277956 276661 275445 273986 272025 269849 268238 267691 267888 268004 267434 266141 264616 263545
53641 263545 263281 263493 263470 262795 261566 260135 258937 258442 258761 259295 259271 258657 258125 258105 258431 258952 259817 260943
53623 260943 261834 262318 262952 264286 266124 267938 269676 271681 274100 276777 279651 282886 286625 290832 295338
53608 295338 299937 304493 309020 313563 318134 322954 328562 335274 342585 349623 356247 363204 371059 379446
53594 379446 387503 394695 401107 407380 414419 422590 431021 438218 443704 448543 454004 460166 466245 471789
53580 471789 477063 482477 488094 493645 498822 503600 508283 513032 517464 521113 524211 527431 530852 533810
53566E33810K168J879K020J815J113N21L03J15j30j03J28N0l18l68KN5o47j572
53548E40841k033k014j754j203m00R7k08r72j332q83q7K85j09r32j544j596j183
53531E24973m64N53J734K717L386M072M958N618N668N520N932P056Q415R600J0496
53516F00234J1043J1395J2114J3571J5320J6566J7097J7261J7296J7336J7838
53505G67071J9221K1181K2983K4347K5494K6546K7551K8818L0468L1867L2406
53494A057953L2669L3834L5877L7408L7513L6827L6442L6559L6692L6532L6160
53483A454466L5754L5444L5240L5027L4870L5240L6389L7645L7920L7043L5911
53472A850949L5229L4656L3488L1687K9881K8527K7332K5509K2687J9536J7219
$$ plain form
53566 533810 535978 537857 539877 541692 542805 543326 543629 543744 543614 543511 543639 543689 543371 543003 543005 543060 542413 540841
53548 540841 538808 536794 535040 533837 533437 533534 533326 532354 531022 530139 530052 530337 530228 529296 527752 526156 524973
53531 524973 524509 525062 526796 529513 532899 536971 541929 547547 553215 558735 564667 571723 580138 589738 600234
53516 600234 611277 622672 634786 648357 663677 680243 697340 714601 731897 749233 767071
53505 767071 786292 807473 830456 854803 880297 906843 934394 963212 993680 1025547 1057953
53494 1057953 1090622 1124456 1160333 1197741 1235254 1272081 1308523 1345082 1381774 1418306 1454466
53483 1454466 1490220 1525664 1560904 1595931 1630801 1666041 1702430 1740075 1777995 1815038 1850949
53472 1850949 1886178 1920834 1954322 1986009 2015890 2044417 2071749 2097258 2119945 2139481 2156700
53461B156700J6025J5095J3743J2458J1908J1650J0685Q893O923M844J918k216
53449B268626o931j1164j4088j5492j6209j7810k1055k4917k7978l0252l2570
53438B050160l4661l5442l5067l5085l6163l7247l7442l7415l8095l9131l9518
53427A644894l8894l7500l5499l3056l0650k8672k7121k5886k4870k3599k1439
53416A317708j8519j5713j3415j1031q032m758j762R58L565N950Q155J0675J3837
53403A287618J7293K0483K3149K5181K6582K7813K9577L1925L4207L6133L8203
53392A598164M0768M3379M5487M7176M8843N0773N3284N6648O0464O3893O6779
53381B175658O9852P3444P6838P9367Q1319Q3262Q5118Q6543Q7509Q7991Q7699
$$ plain form
53461 2156700 2172725 2187820 2201563 2214021 2225929 2237579 2248264 2257157 2264080 2268924 2270842 2268626
53449 2268626 2261695 2250531 2236443 2220951 2204742 2186932 2165877 2140960 2112982 2082730 2050160
53438 2050160 2015499 1980057 1944990 1909905 1873742 1836495 1799053 1761638 1723543 1684412 1644894
53427 1644894 1606000 1568500 1533001 1499945 1469295 1440623 1413502 1387616 1362746 1339147 1317708
53416 1317708 1299189 1283476 1270061 1259030 1250998 1246240 1244478 1245436 1249001 1254951 1263106 1273781 1287618
53403 1287618 1304911 1325394 1348543 1373724 1400306 1428119 1457696 1489621 1523828 1559961 1598164
53392 1598164 1638932 1682311 1727798 1774974 1823817 1874590 1927874 1984522 2044986 2108879 2175658
53381 2175658 2245510 2318954 2395792 2475159 2556478 2639740 2724858 2811401 2898910 2986901 3074600
53370C074600Q6687Q5586Q4651Q3260Q0921P8019P4923P1115O6024O0174N4620
53359C900580M9757M5398M1506L7956L3998K8876K2771J6369R782K716m549j1219
53347D173941j7072k2750k9090l6737m6241n7657o9766q0389q7776r1641r2839
53336C541983r2432r1133q9355q7512q6119q5410q4940q3980q2430q0964q0061
53325B597647p9326p8059p6044p3463p0433o7056o3617o0203n6453n2075m7433
53314A873485m3244l9816l6948l4371l1960k9623k7273k4834k2141j9071j5861
53303A548343j2991j0602q373o169m302k908j485M36K505L939M510M758N311O289
53289A529261P363Q197Q826R749J1500J4167J7449K1114K5039K8855L1969L4097
$$ plain form
53370 3074600 3161287 3246873 3331524 3414784 3495705 3573724 3648647 3719762 3785786 3845960 3900580
53359 3900580 3950337 3995735 4037241 4075197 4109195 4138071 4160842 4177211 4186993 4189709 4185160 4173941
53347 4173941 4156869 4134119 4105029 4068292 4022051 3964394 3894628 3814239 3726463 3634822 3541983
53336 3541983 3449551 3358418 3269063 3181551 3095432 3010022 2925082 2841102 2758672 2677708 2597647
53325 2597647 2518321 2440262 2364218 2290755 2220322 2153266 2089649 2029446 1972993 1920918 1873485
53314 1873485 1830241 1790425 1753477 1719106 1687146 1657523 1630250 1605416 1583275 1564204 1548343
53303 1548343 1535352 1524750 1516377 1510208 1505906 1502998 1501513 1501949 1504454 1508393 1512903 1517661 1522972 1529261
53289 1529261 1536624 1544821 1553647 1563396 1574896 1589063 1606512 1627626 1652665 1681520 1713489 1747586
53277A747586L5532L6768L8091L9529M0811M1472M1334M0801M0366L9893L9005
53266B181188L7791L6553L4970L2393K8996K5815K3513K1879K0608J9673J8707
53255B482086J6891J3792R660M784o41n855r890j2878j6086k0200k4576k8546
53243B408541l2418l6469m0041m2456m3982m5141m5818m5944m6212m7180m8198
53232A934682m8165m6952m5289m3703m2304m1190m0295l9287l8157l7497l7571
53221A474272l7702l7295l6751l6677l6726l6126l4828l3156l0944k8002k5094
53210A100971k3320k2670k2158k1267k0378j9847j9611j9675k0192k0907k1194
53199H69752k0820k0146j9482j8724j7740j6787j6386j6822j7694j8050j7317
$$ plain form
53277 1747586 1783118 1819886 1857977 1897506 1938317 1979789 2021123 2061924 2102290 2142183 2181188
53266 2181188 2218979 2255532 2290502 2322895 2351891 2377706 2401219 2423098 2443706 2463379 2482086
53255 2482086 2498977 2512769 2522429 2527213 2526572 2520717 2510827 2497949 2481863 2461663 2437087 2408541
53243 2408541 2376123 2339654 2299613 2257157 2213175 2168034 2122216 2076272 2030060 1982880 1934682
53232 1934682 1886517 1839565 1794276 1750573 1708269 1667079 1626784 1587497 1549340 1511843 1474272
53221 1474272 1436570 1399275 1362524 1325847 1289121 1252995 1218167 1185011 1154067 1126065 1100971
53210 1100971 1077651 1054981 1032823 1011556 991178 971331 951720 932045 911853 890946 869752
53199 869752 848932 828786 809304 790580 772840 756053 739667 722845 705151 687101 669784
53188F69784j6147j5715j6154j6318j5436j4142j3541j3908j4778j5605j5818
53177E02222j5036j3736j2980j2962j2717j1766j0945j0842j0591r359p904p403
53165C65981p520p190o507o314o483o284n981o404p040o419m466k839k603l035
53151B86896l216l346l825m195l824k952k336k338k718k932k492j424m37j25j46
53136B50590J67N90L41m56o80J90J377J992K110K264K563K840L154L748M677N690
53120B81157O234N712M079K055L49j075k510l643l995l908m219n009n598n694
53106B63935n638n553n116m382l943m072m420m707m980n108m809m279m009l852
53092A99067l165k057j615k451l723m112l332k232j810k286k946k850j934j201
$$ plain form
53188 669784 653637 637922 621768 605450 590014 575872 562331 548423 533645 518040 502222
53177 502222 487186 473450 460470 447508 434791 423025 412080 401238 390647 381288 373384 365981
53165 365981 358461 351271 344764 338450 331967 325683 319702 313298 306258 299839 295373 292534 289931 286896
53151 286896 283680 280334 276509 272314 268490 265538 263202 260864 258146 255214 252722 251298 250861 250736 250590
53136 250590 250757 251347 251688 251232 250552 250742 252119 254111 256221 258485 261048 263888 267042 270790 275467 281157
53120 281157 287391 293103 297182 299237 299586 298511 296001 292358 288363 284455 280236 275227 269629 263935
53106 263935 258297 252744 247628 243246 239303 235231 230811 226104 221124 216016 211207 206928 202919 199067
53092 199067 195902 193845 192230 189779 186056 181944 178612 176380 174570 172284 169338 166488 164554 163353
53078A63353j419j969j773r65o55j161j622j476j210j270j282p58J24R29J425
53063A50271J402P14k11o27n20o16j120j316p82j26j7k61m26n76q00o63J40J118
53045A45584J577J508J270R15L33k34m90o17j042j826k632l042k675j383K63J183
53029A38692R30L41M85J287J713J176J99l64k82K0J09J5K9J77J22l49r39j225
53011A42136j185j008n91K29J071J292Q81M95N00N63M15L03M29M75J35l34m86
52994A45320l12j00N0K54N10P23R34J239J587J862K125K614L417M240M611M402
52978A73476M095M265M827N187N163N248N636N663M661K953J333K7j151j966k000
52963B17417j590j583k160k671k675k423k140j603p53j41l96j505k797l465l203
$$ plain form
53078 163353 161934 159965 158192 157227 156572 155411 153789 152313 151103 149833 148551 147793 147917 148846 150271
53063 150271 151673 152387 152176 151549 151029 150413 149293 147977 147195 147069 147052 146791 146365 145789 144989 144326 144466 145584
53045 145584 147161 148669 149939 150854 151187 150953 150463 149846 148804 146978 144346 141304 138629 137246 137509 138692
53029 138692 139622 139963 140448 141735 143448 144624 144823 144459 144177 144197 144306 144321 144350 144527 144649 144300 143361 142136
53011 142136 140951 139943 139352 139581 140652 141944 142825 143320 143820 144383 144798 145101 145530 146005 146140 145806 145320
52994 145320 145008 144908 144958 145212 145722 146445 147379 148618 150205 152067 154192 156806 160223 164463 169074 173476
52978 173476 177571 181836 186663 191850 197013 202261 207897 213560 218221 221174 222507 222534 221383 219417 217417
52963 217417 215827 214244 212084 209413 206738 204315 202175 200572 199819 199678 199282 197777 194980 191515 188312
52948A88312k462j967j784j264j82O94P29L83L06J72n50j244q88J90O62K07k43
52931A81071l02o74j618k210j681m07Q76J887K406K086J205O58P69Q45L31m65
52915A84777j051j381j416j041o59r30j554j445m83J18k54n77P4R72R83L75K11
52898A76719O33R00P04L72P0k94n74n13j86K43Q68J638K009J556O75J19J70O11
52880A85720J122J306Q81K30K49J125J820J366J19p96q33k58M52R33R76Q46J089
52863A96347J688J920J505J199J683K463K715K570K799L566M367M936N343N360
52849B38461M534K981J515P89O48M09l83j426j901j389m93k12p25j382j760k079
52833B37587k496k799k988l404m013m336m256m150l966l169j875j037j037j170
$$ plain form
52948 188312 185850 183883 182099 180835 180653 181347 182076 182459 182765 182937 182387 181143 180255 180445 181107 181314 181071
52931 181071 180769 180095 178477 176267 174586 174179 175055 176942 179348 181434 182639 183297 184066 184911 185242 184777
52915 184777 183726 182345 180929 179888 179229 178299 176745 175300 174817 174935 174681 174104 174178 175150 176133 176508 176719
52898 176719 177352 178252 178956 179328 179398 179104 178530 178017 177831 178074 178942 180580 182589 184145 184820 184939 185109 185720
52880 185720 186842 188148 189029 189259 189508 190633 192453 193819 193938 193142 192309 192051 192503 193436 194412 195258 196347
52863 196347 198035 199955 201460 202659 204342 206805 209520 212090 214889 218455 222822 227758 233101 238461
52849 238461 242995 245976 247491 248280 248928 249337 248954 247528 245627 244238 243745 243533 242808 241426 239666 237587
52833 237587 235091 232292 229304 225900 221887 217551 213295 209145 205179 202010 200135 199098 198061 196891
52819A96891j023j231k192l083l084k570k233j920j302q22r30j124q25n08q74
52804A73170j559j693j285r85r92j101j323j570j316n08j05o98j372j119n93j074
52788A55877k280k788k314j974k309k565k059j119m00k31o37j235j252m95J9o03
52772A33635j628j709r96p75j306j574j213j051j452j666j291r61j104j238j102
52757A14569j247j860k093j434p35j004j907k399k237k009j968j724r61O8P57
52742I3816O13l51j491k001j613o87K91R24Q54M7q01q99m14k77p99j209q25J3
52724H5191O17R33J328J797K004J864J645J520J401J206J062J156J451J664J605
52709A06444J562K050L062L874L846L160K502K243K277K345K135J336M8j084j587
$$ plain form
52819 196891 195868 194637 192445 189362 186278 183708 181475 179555 178253 177431 176501 175377 174552 174044 173170
52804 173170 171611 169918 168633 167648 166656 165555 164232 162662 161346 160838 160733 160035 158663 157544 156951 155877
52788 155877 153597 150809 148495 146521 144212 141647 139588 138469 138069 137838 137201 135966 134714 134219 134238 133635
52772 133635 132007 130298 129302 128527 127221 125647 124434 123383 121931 120265 118974 118013 116909 115671 114569
52757 114569 113322 111462 109369 107935 107200 106196 104289 101890 99653 97644 95676 93952 92991 93059 93816
52742 93816 94429 94078 92587 90586 88973 88286 88577 89501 90355 90402 89601 88702 88288 88011 87212 86003 85178 85191
52724 85191 85808 86741 88069 89866 91870 93734 95379 96899 98300 99506 100568 101724 103175 104839 106444
52709 106444 108006 110056 113118 116992 120838 123998 126500 128743 131020 133365 135500 136836 136884 135800 134213
52694A34213j784k243k821k884k310j735j785k451l209l558l441l278l302k962
52680I6450j650j5M30n45j263m89O57L43j310k606k730k243j587o37K19J92n66
52663H2650j044j052j446k377k719j744k22P52J044R77N88j0l08j03J46J69K87
52646G5588N89N43J0k25L25Q39L57o50q15K15J350J488O61l33r04r85p08j99L57
52627G7503N64J80m36n60p3K67j51q56j001n62j38J54O59J204J126L70l04l87
52609G7559j32J83O65J212J291O85j37o75q79p37n5R91J651J416O17j8j04K73
52591H3806P74J001Q19N64N94P60O94N29O84J089J296J259J278J253Q62M37P13
52574I8412J644K304K179J690J272Q93O80J032J811K296K275K270K472K378J818
$$ plain form
52694 134213 132429 130186 127365 124481 122171 120436 118651 116200 112991 109433 105992 102714 99412 96450
52680 96450 94800 94785 95215 94670 93407 92918 93575 93918 92608 90002 87272 85029 83442 82805 83024 83216 82650
52663 82650 81606 80554 79108 76731 74012 72268 72046 72798 73842 74819 75407 75397 75089 74986 75132 75301 75588
52646 75588 76177 76720 76730 76505 76830 77669 78026 77376 76561 76776 78126 79614 80275 79942 79038 78053 77345 77146 77503
52627 77503 78067 78247 77811 77251 77178 77445 77294 76438 75437 74875 74737 74891 75550 76754 77880 78250 77946 77559
52609 77559 77427 77610 78275 79487 80778 81463 81326 80651 79772 79035 78980 79971 81622 83038 83655 83637 83533 83806
52591 83806 84580 85581 86400 86964 87558 88318 89012 89541 90225 91314 92610 93869 95147 96400 97262 97699 98412
52574 98412 100056 102360 104539 106229 107501 108394 109074 110106 111917 114213 116488 118758 121230 123608 125426
52559A25426J389J400J423J281J484K097K224J358K57k07j96j70O8P12J117O85
52543A40348o7k50J19M32N58O56M74j70o44k14P77J347J240R66P66M04l4r3K61
52524A46876N48M99K74j1m06p87r60j051j352j769j936j819j688j574j242o93
52508A32909k06P6K11K00J10L57J238K228K280J087m06j057p09q1K88N34R25J265
52490A41249J218R77J159J833K201J606N06q9R9M85O24O35O09L63p5l24k07J02
52472A52971N90J384K107J970Q41m14j001j012q35m02M54J404J902J763J185O04
52456A63511O44J557K538K299P49o47o63K98J093J409J617J764J675J637K020
52441A81501K422J987O00q60j559j494j334j739k824l957m319l819l162k858k592
$$ plain form
52559 125426 126815 128215 129638 130919 132403 134500 136724 138082 138339 138132 137936 137766 137834 138546 139663 140348
52543 140348 140281 140031 140150 140582 141140 141796 142270 142100 141456 141242 142019 143366 144606 145572 146338 146742 146708 146615 146876
52524 146876 147424 147923 148197 148186 147780 146993 146033 144982 143630 141861 139925 138106 136418 134844 133602 132909
52508 132909 132703 132779 132990 133190 133300 133657 134895 137123 139403 140490 140084 139027 138318 138237 138525 139059 139984 141249
52490 141249 142467 143444 144603 146436 148637 150243 150749 150660 150759 151244 151868 152503 153112 153475 153400 153076 152869 152971
52472 152971 153561 154945 157052 159022 159863 159449 158448 157436 156601 156199 156653 158057 159959 161722 162907 163511
52456 163511 164155 165712 168250 170549 171298 170651 169988 170286 171379 172788 174405 176169 177844 179481 181501
52441 181501 183923 185910 186510 185650 184091 182597 181263 179524 176700 172743 168424 164605 161443 158585 155993
52426A55993j941j197r31j119j256j109q93q62j095j522j874j851j532j305j193
52411A36313p69K1N07K02m85q59p97n78l42j62j97l13k2P68J459J655J773K237
52393A40411K649K402J672J065P70O23O27Q02R32J020J457K132K101Q71n43q22
52377A58169n4O79J030J451J937J926J484J424K016K533K398J937J709J735J754
52362A82128J737J823K086K508K956L157L019K887L089L374L252K760K390K286
52348B19452K132J798J631J962K662L297L496L153K490J859J412J098J058J602
52334B49102K566L174K912K179J668J526J573J836K327K625K318J651J177J088
52320B77722J275J711K279K516K172J730J822K452L195L832M275M323M111M388
$$ plain form
52426 155993 154052 152855 151924 150805 149549 148440 147547 146685 145590 144068 142194 140343 138811 137506 136313
52411 136313 135544 135565 136072 136274 135789 134930 134133 133555 133213 133051 132854 132541 132519 133287 134746 136401 138174 140411
52393 140411 143060 145462 147134 148199 148969 149592 150219 151021 151953 152973 154430 156562 158663 159534 158991 158169
52377 158169 158115 158794 159824 161275 163212 165138 166622 168046 170062 172595 174993 176930 178639 180374 182128
52362 182128 183865 185688 187774 190282 193238 196395 199414 202301 205390 208764 212016 214776 217166 219452
52348 219452 221584 223382 225013 226975 229637 232934 236430 239583 242073 243932 245344 246442 247500 249102
52334 249102 251668 254842 257754 259933 261601 263127 264700 266536 268863 271488 273806 275457 276634 277722
52320 277722 278997 280708 282987 285503 287675 289405 291227 293679 296874 300706 304981 309304 313415 317803
52306C17803N704P621R256J0186J0346R702Q766Q731J0142J2001J3084J3622J4508
52293D51472J5512J5711J5342J5686J6983J7958J7652J6584J5738J5470J5805
52282F29913J6730J7750J8022J7393J6581J6047J5401J4260J2895J1684J0633
52271G97309R768R359R318Q944P709N927M301L266K843K707K295J336L84K27P10
52256H66403Q20J44n27l78K51M25j49r43j468j823k315k752k354n94J963M048
52240H60751N095N712O491P107P170P306Q359J0029J1307J1913J2286J2436J2041
52227I78003J1437J1301J1345J0682R458Q746Q590P712N602L537K735K748K510
52214A074406J865J102l0j739l399m414n278o729q341q983q467p770p698q214
$$ plain form
52306 317803 323507 331128 340384 350570 360916 370618 379384 388115 398257 410258 423342 436964 451472
52293 451472 466984 482695 498037 513723 530706 548664 566316 582900 598638 614108 629913
52282 629913 646643 664393 682415 699808 716389 732436 747837 762097 774992 786676 797309
52271 797309 807077 816436 825754 834698 842407 848334 852635 855901 858744 861451 863746 865082 865466 865693 866403
52256 866403 867223 867367 866840 866462 866713 867138 866989 866046 864578 862755 860440 857688 855334 854740 856703 860751
52240 860751 865846 871558 878049 885156 892326 899632 907991 918020 929327 941240 953526 965962 978003
52227 978003 989440 1000741 1012086 1022768 1032226 1040972 1049562 1057274 1062876 1066413 1069148 1071896 1074406
52214 1074406 1076271 1077373 1077343 1075604 1072205 1067791 1062513 1055784 1047443 1038460 1029993 1022223 1014525 1006311
52200A006311r030j0040j1020j1515j1259j0468r563q783q050p122n954m901m313
52187H94293l971l353k527k141k351k427j870j289j438j918j629l66Q08Q36k36
52172H70421j504k095j727q13j74l77j206j915k100k077k315k776l014k910k915
52157H42503l491m459n219n447n312m974m334l433k703k520k774l120l399l530
52143G87788l357k946k750l058l544l734l638l475l201k767k526k787l195l222
52129G43588l010l094l474l660l486l214k928k528k260k558l277l709l380k484
$$ plain form
52200 1006311 997281 987241 976221 964706 953447 942979 933416 924633 916583 909461 903507 898606 894293
52187 894293 890322 886969 884442 882301 879950 877523 875653 874364 872926 871008 869379 869013 869821 870657 870421
52172 870421 868917 866822 865095 864282 864108 863731 862525 860610 858510 856433 854118 851342 848328 845418 842503
52157 842503 839012 834553 829334 823887 818575 813601 809267 805834 803131 800611 797837 794717 791318 787788
52143 787788 784431 781485 778735 775677 772133 768399 764761 761286 758085 755318 752792 750005 746810 743588
52129 743588 740578 737484 734010 730350 726864 723650 720722 718194 715934 713376 710099 706390 703010 700526
$$ [...]
##END NTUPLES=NMR SPECTRUM
##END=
