
##TITLE=AC1068_TOPL01_6519229_qYJ3gEzVqc
##JCAMPDX= 6.0         $$ Bruker NMR JCAMP-DX V2.0
##DATA TYPE= NMR SPECTRUM
##DATA CLASS= NTUPLES
##ORIGIN= BRUKER
##OWNER= Administrator
$$ 1.72 TOPSPIN		Version 2.1
$$ 2012-07-14 09:43:21.281 -0500  Administrator@TOPSPIN
$$ Compression mode = diff/dup
##.OBSERVE FREQUENCY= 400.02188249412
##.OBSERVE NUCLEUS= ^1H
##.ACQUISITION MODE= SIMULTANEOUS (DQD)
##.ACQUISITION SCHEME= undefined
##.AVERAGES= 8
##.DIGITISER RES= 22
##SPECTROMETER/DATA SYSTEM= spect
##.PULSE SEQUENCE= zg30
##.SOLVENT NAME= COFFEE_meoh
##.SHIFT REFERENCE= INTERNAL, COFFEE_meoh, 1, 14.98509
##AUDIT TRAIL= $$ (NUMBER, WHEN, WHO, WHERE, PROCESS, VERSION, WHAT)
$$ ##TITLE= Audit trail, TOPSPIN		Version 2.1
$$ ##JCAMPDX= 5.01
$$ ##ORIGIN= Bruker BioSpin GmbH
$$ ##OWNER= Administrator
$$ $$ C:\Bruker\TOPSPIN/data/COFFEE/nmr/AC1068_TOPL01_6519229_qYJ3gEzVqc/50/pdata/1/auditp.txt
$$ ##AUDIT TRAIL=  $$ (NUMBER, WHEN, WHO, WHERE, PROCESS, VERSION, WHAT)
(   1,<2012-07-14 09:43:12.953 -0500>,<Administrator>,<TOPSPIN>,<go>,<TOPSPIN 2.1>,
      <created by zg
	started at 2012-07-14 09:42:06.031 -0500,
	POWCHK enabled, PULCHK disabled,
       configuration hash MD5:
       6B 1B 68 BB D9 2E 58 E2 7F 35 AD 54 07 DF 0E 41
       data hash MD5: 64K
       00 6A DE 41 DD 4B 30 73 C2 97 48 43 F3 85 40 E0>)
(   2,<2012-07-14 09:43:16.390 -0500>,<Administrator>,<TOPSPIN>,<proc1d>,<TOPSPIN 2.1>,
      <Start of raw data processing
       efp LB = 0 FT_mod = 6 PKNL = 1 PHC0 = 0 PHC1 = 0 SI = 32K 
       data hash MD5: 32K
       B8 79 D6 1C 3C AC C9 8C CD FE 13 2B 57 E0 57 0D>)
(   3,<2012-07-14 09:43:17.015 -0500>,<Administrator>,<TOPSPIN>,<proc1d>,<TOPSPIN 2.1>,
      <pk PHC0 = 180.6757 PHC1 = 0 
       data hash MD5: 32K
       B6 7D 37 67 BA E0 87 AA 88 C6 42 3E DE 2C 79 D3>)
(   4,<2012-07-14 09:43:17.109 -0500>,<Administrator>,<TOPSPIN>,<proc1d>,<TOPSPIN 2.1>,
      <abs ABSG = 1 
       data hash MD5: 32K
       92 A3 64 93 32 5D 65 31 29 CA F8 F1 0C 1E 43 4A>)
(   5,<2012-07-14 09:43:17.140 -0500>,<Administrator>,<TOPSPIN>,<proc1d>,<TOPSPIN 2.1>,
      <abs ABSG = 2 
       data hash MD5: 32K
       08 07 59 38 D2 35 00 53 24 BD AF 79 2D 22 62 DF>)
(   6,<2012-07-14 09:43:17.171 -0500>,<Administrator>,<TOPSPIN>,<proc1d>,<TOPSPIN 2.1>,
      <abs ABSG = 3 
       data hash MD5: 32K
       F6 B2 2F 6D C3 0C A1 E1 65 2E D7 2B A0 41 21 45>)
(   7,<2012-07-14 09:43:17.203 -0500>,<Administrator>,<TOPSPIN>,<proc1d>,<TOPSPIN 2.1>,
      <abs ABSG = 4 
       data hash MD5: 32K
       AD 5A FA 19 00 2C D7 E8 78 8F 1E B8 92 CF B4 6C>)
(   8,<2012-07-14 09:43:17.234 -0500>,<Administrator>,<TOPSPIN>,<proc1d>,<TOPSPIN 2.1>,
      <abs ABSG = 5 
       data hash MD5: 32K
       60 84 00 9F 0E B9 27 47 99 0B CC FE 74 6D 00 39>)
$$ ##END=
$$ 
$$ $$ hash MD5
$$ $$ A8 05 D8 2D A5 1E 54 18 9C 49 F9 DC 91 7B 84 54
##$RELAX= 
##$RELAX= 
##$RELAX= 
##$RELAX= 
##$RELAX= 
##$RELAX= 
##$RELAX= 
##$RELAX= 
$$ Bruker specific parameters
$$ --------------------------
$$ [...]
##$TP= (0..7)
150 150 150 150 150 150 150 150
##$TP07= 0
##$TPNAME0= <>
##$TPNAME1= <>
##$TPNAME2= <>
##$TPNAME3= <>
##$TPNAME4= <>
##$TPNAME5= <>
##$TPNAME6= <>
##$TPNAME7= <>
##$TPOAL= (0..7)
0.5 0.5 0.5 0.5 0.5 0.5 0.5 0.5
##$TPOFFS= (0..7)
0 0 0 0 0 0 0 0
##$TUNHIN= 0
##$TUNHOUT= 0
##$TUNXOUT= 0
##$USERA1= <user>
##$USERA2= <user>
##$USERA3= <user>
##$USERA4= <user>
##$USERA5= <user>
##$V9= 5
##$VALIST= <valist>
##$VCLIST= <CCCCCCCCCCCCCCC>
##$VD= 0
##$VDLIST= <DDDDDDDDDDDDDDD>
##$VPLIST= <PPPPPPPPPPPPPPP>
##$VTLIST= <TTTTTTTTTTTTTTT>
##$WBST= 2048
##$WBSW= 25
##$XGAIN= (0..3)
0 0 0 0
##$XL= 0
##$YL= 0
##$YMAX_a= 463298
##$YMIN_a= -639954
##$ZGOPTNS= <>
##$ZL1= 120
##$ZL2= 120
##$ZL3= 120
##$ZL4= 120
##$ABSF1= 14.98509
##$ABSF2= -5.573092
##$ABSG= 5
##$ABSL= 3
##$ALPHA= 0
##$AQORDER= 0
##$ASSFAC= 0
##$ASSFACI= 0
##$ASSFACX= 0
##$ASSWID= 0
##$AUNMP= <proc_prof1d_extract_pilot.lims>
##$AXLEFT= 0
##$AXNAME= <>
##$AXNUC= <1H>
##$AXRIGHT= 0
##$AXTYPE= 0
##$AXUNIT= <>
##$AZFE= 0.1
##$AZFW= 0.1
##$BCFW= 0
##$BC_mod= 0
##$BYTORDP= 0
##$COROFFS= 0
##$CY= 15
##$DATMOD= 1
##$DC= 0
##$DFILT= <>
##$DTYPP= 0
##$F1P= 0
##$F2P= 0
##$FCOR= 0.5
##$FTSIZE= 32768
##$FT_mod= 6
##$GAMMA= 0
##$GB= 0
##$INTBC= 1
##$INTSCL= 1
##$ISEN= 128
##$LB= 0
##$LEV0= 0
##$LPBIN= 0
##$MAXI= 10000
##$MC2= 0
##$MEAN= 0
##$ME_mod= 0
##$MI= 0
##$NCOEF= 0
##$NC_proc= -8
##$NLEV= 6
##$NOISF1= 0
##$NOISF2= 0
##$NSP= 0
##$NTH_PI= 0
##$NZP= 0
##$OFFSET= 14.98509
##$PC= 1
##$PHC0= 180.6757
##$PHC1= 0
##$PH_mod= 1
##$PKNL= yes
##$PPARMOD= 0
##$PPDIAG= 0
##$PPIPTYP= 0
##$PPMPNUM= 2147483647
##$PPRESOL= 1
##$PSCAL= 4
##$PSIGN= 0
##$PYNMP= <proc.py>
##$REVERSE= no
##$SF= 400.02
##$SI= 32768
##$SIGF1= 0
##$SIGF2= 0
##$SINO= 400
##$SIOLD= 32768
##$SPECTYP= <>
##$SREGLST= <1H.CDCl3>
##$SSB= 0
##$STSI= 32768
##$STSR= 0
##$SW_p= 8223.68421052631
##$SYMM= 0
##$S_DEV= 0
##$TDeff= 65536
##$TDoff= 0
##$TI= <>
##$TILT= no
##$TM1= 0
##$TM2= 0
##$TOPLEV= 0
##$USERP1= <user>
##$USERP2= <user>
##$USERP3= <user>
##$USERP4= <user>
##$USERP5= <user>
##$WDW= 1
##$XDIM= 32768
##$YMAX_p= 347821831
##$YMIN_p= -687089
##$CURPLOT= <Network HP LaserJet P1505>
##$CURPRIN= <$Network HP LaserJet P1505>
##$DFORMAT= <normdp>
##$LAYOUT= <+/1D_H.xwp>
##$LFORMAT= <normlp>
##$PFORMAT= <normpl>
##$SURQMSG= 1
$$ End of Bruker specific parameters
$$ ---------------------------------
##NTUPLES= NMR SPECTRUM
##VAR_NAME=  FREQUENCY,     SPECTRUM/REAL,   SPECTRUM/IMAG
##SYMBOL=    X,             R,               I
##VAR_TYPE=  INDEPENDENT,   DEPENDENT,       DEPENDENT
##VAR_FORM=  AFFN,          ASDF,            ASDF
##VAR_DIM=   32768,         32768,           32768
##UNITS=     HZ,            ARBITRARY UNITS, ARBITRARY UNITS
##FACTOR=    0.250966925370066, 1,           1
##FIRST=     8223.43324360094, -161136,      -244726
##LAST=      0,             3634,            3684
##MIN=       0,             -687089,         0
##MAX=       8223.43324360094, 347821831,    0
$$ Real data points
##PAGE= N=1
##DATA TABLE= (X++(R..R)), XYDATA
$$ [...]
19495a86181j04715B7847b18196k6813B09487r8557k9987b95531a07173A53069
19484a91235I3786a44116c4215E3803e4344L520b3924p2625O233L2795o1940j61419
19472b80880a11772A13051h3382B28118a08203j50190a08984j88471B98762a74429
19461A43872a99458c2347k49562p2665a22027C3278b28004M0122I6261P5206B4708
19449g1772A73226a16694I8091g9077A07597d51717M4244J12184J17910d9324
19438b68145G1635c8330k6205A37418n5498a14046k27339a47534m8914G6583L6352
19427A12935a38657L9908j64141l24522d1997q2617A8776a13256A79526c35598
19416A7676K4311L6406b19320P1391c269D2820b4197q4012J4736l17069d644B00761
$$ plain form
19495 -186181 -290896 27847 -218196 -245009 209487 110930 80943 -295531 -107173 153069
19484 -191235 93786 -144116 -34215 53803 -54344 -50824 -23924 -96549 -90316 -57521 -119461 -280880
19472 -280880 -111772 113051 -83382 228118 -108203 -258393 -108984 -297455 298762 -174429
19461 143872 -199458 -32347 -281909 -354574 -122027 33278 -228004 -187882 96261 171467 24708
19449 -71772 173226 -116694 98091 -79077 107597 -451717 -407473 -295289 -177379 -49324
19438 -268145 71635 -38330 -64535 137418 81920 -114046 -341385 -147534 -196448 76583 112935
19427 112935 -138657 -98749 -262890 -587412 -41997 -124614 18776 -113256 179526 -335598
19416 17676 41987 78393 -219320 -147929 -3269 42820 -24197 -108209 -93473 -410542 -4644 200761
19403i725A8009i2358E1404b09996D9627j2833j7240i2054k74572A3512d3094
19391E3126c0621A44808E3941Q3652m1385a57764B4347a42026D09596b11146A01949
19379D01693j72658b17A8685a33168k08063j7023A90375j8939d85693a72550l98002
19368e70552K53129h8789J2748B20092B4758d23040A17167b99695N3986J01364
19358a44345F5242b33575i6825D3803K3649d46143E530a56440O2779j0595L505
19347a00751C0590l934b8576c345C31427E2791f4201A02004c33228B15923I9056
19335I9624a44465j77457I9849k4162h7818j57846E3480B3131b3668j52527C7883
19323A7208B046K1285a64121p4403O7757M2038A6042L7145b88592L4201a01281
$$ plain form
19403 -9725 18009 -92358 51404 -209996 49627 36794 19554 -92054 -366626 13512 -43094
19391 53126 -30621 144808 53941 137593 96208 -157764 24347 -142026 409596 -211146 101949
19379 401693 229035 -217 18685 -133168 -341231 -358254 190375 171436 -485693 -172550 -570552
19368 -570552 -317423 -88789 -76041 220092 24758 -423040 117167 -299695 -245709 -144345
19358 -144345 65242 -233575 -96825 43803 67452 -446143 5530 -156440 -93661 -104256 -100751
19347 -100751 30590 26656 -28576 -3345 331427 52791 -64201 102004 -333228 215923 99056
19335 99624 -144465 -321922 99849 75687 -87818 -245664 53480 23131 -23668 -176195 37883
19323 17208 2046 23331 -164121 -238524 -170767 -128729 16042 53187 -288592 -254391 -101281
19311a93138O0725l5206N7626D4211f1538o0352p0292K8633k0976P0258j20938
19300b35205J09855M9423F5321a76170m6844C462j264K5687a40320A64567a49819
19288a56023g3866F372K190e60841A42266c18322A38788n8465b50795O4349A06847
19276a72291G4344r716J21752a26210j49L6845j19030Q3948q8242b9952k69191
19265b99143r7000h4926l0102B27578a79093B03311b62709J23306B79340q0423
19255A98917O3860a74921g3585k30516E2974a01065B9983j1724d29000L9660A60812
19243d7058j00646E2304O8240c1352A23616c8044m1670m6579A0233a36883c5643
19231b53604a837k32913c2612p6412j60474h3524I9273m7480a13248b805j93844
$$ plain form
19311 -193138 -132413 -167619 -109993 44211 -61538 -121890 -192182 -163549 -184525 -114267 -235205
19300 -235205 -125350 -75927 65321 -176170 -223014 3462 2198 27885 -140320 164567 -149819
19288 -156023 -73866 6372 8562 -560841 142266 -318322 138788 80323 -250795 -186446 106847
19276 -172291 74344 64628 186380 -126210 -126359 -89514 -208544 -124596 -212838 -29952 -299143
19265 -299143 -396143 -84926 -115028 227578 -179093 203311 -262709 -139403 279340 198917
19255 198917 262777 -174921 -73585 -304101 52974 -101065 29983 18259 -429000 -389340 160812
19243 -47058 -147704 52304 120544 -31352 123616 -38044 -79714 -126293 10233 -136883 -35643
19231 -253604 -1837 -234750 -32612 -109024 -269498 -83524 99273 51793 -113248 -2805 -196649
19220a96649D0161R3174b52109j91102b0738j88524C6471N9850J49994g7272A29950
19208A39289a3285k09923B44117f8351C44750a9161k50453j23558J68358o7960
19198b92774B50294a93777K7182l3712Q4104d6174A0047f9890l0442I3114a53090
19186b4810o3943m9854j27391A76540d1799A27715b179j30926A1951m047b11751
19174i1835m38804g8988p4878A0930a01313j29627P1266k48377F4340j048c61351
19162E1236h0405H4549R6885G482i3023E7978O0057a34748e3403a3156k87453
19151c00609f2253A50425a55283H5015a87964G6330e5667k47306f2331G511B084
19139D9914p085A4015Q7874J50231a39118A03642d02275J4955a10888c539j9930
$$ plain form
19220 -196649 40161 133335 -252109 -443211 -20738 -209262 36471 96321 246315 -77272 129950
19208 139289 -13285 -223208 244117 -68351 344750 -19161 -269614 -393172 -224814 -292774
19198 -292774 250294 -193777 -166595 -200307 -116203 -46174 10047 -69890 -100332 93114 -153090
19186 -24810 -88753 -138607 -265998 176540 -41799 127715 -2179 -133105 11951 7904 -211751
19174 -91835 -530639 -78988 -153866 10930 -101313 -230940 -159674 -408051 64340 63292 -361351
19162 51236 -80405 84549 181434 7482 -93023 57978 118035 -134748 -53403 -13156 -300609
19151 -300609 -62253 150425 -155283 85015 -187964 76330 -55667 -302973 -62331 7511 2084
19139 49914 42829 14015 101889 252120 -139118 103642 -402275 -387320 -110888 -3539 -23469
19128b3469j23118J1822m4998Q0481p1963p4839F4894H278N2918c3059E6577a55622
19115G8204b82247D8522c6665D05358j49561j01862b02247C3948p201L8026j2193
19104E2580k5227c85018L1574R8479G326a35811c328C51046b16118F8349B6232
19092e3652l58627i7126c1389j88520B82842e9198j98589r5708e7634k90042I1661
19080G6840L490K51258c71716A0775J09500L5410m1631c2947k07108F288a37817
19068a46332F4315J14651b48425h3261l84753B43311A5724N1082b24898a5397
19057B06587r9775b83762B01108C9047a6822m16599J39098a12630m1911A64265
19046i8862a4501j92959N0023G1330R9463a16996A4437c2176k2961F0979c6700
$$ plain form
19128 -23469 -146587 -134765 -179763 -99282 -171245 -246084 64894 8278 61196 -33059 56577 -155622
19115 78204 -282247 48522 -36665 405358 255797 153935 -202247 33948 26747 64773 52580
19104 52580 27353 -385018 -353444 -254965 7326 -135811 -3328 351046 -216118 68349 26232
19092 -53652 -412279 -97126 -31389 -219909 282842 -59198 -257787 -353495 -57634 -347676 91661
19080 76840 80330 331588 -371716 10775 120275 155685 114054 -32947 -240055 6288 -137817
19068 -146332 64315 178966 -248425 -83261 -468014 243311 15724 66806 -224898 -15397
19057 206587 106812 -283762 201108 39047 -16822 -433421 -294323 -112630 -154541 164265
19046 -98862 -14501 -207460 -157437 71330 170793 -116996 14437 -32176 -55137 60979 -36700
19034a8352m91305H9503a58518B16149K36440a35656A71816g410m9254I9149N1378
19023A50527d74504A51901A8351J08107a74526O0520A70095g7778A2859g3050
19012D0082d85263G9310k0660B1135c1917C6435b86616a34695E4532J6338c29861
19000A33592k4230C1230c75264P2759G3160c86885C71245a99565n0439a16849
18989a45392h738B01415c71282a82354N8492a9724C8890b36566B49633e5711B06849
18977A98062a7614G2406e6735D19425A73490K41676I3529L16104a24266B82997
18966B69902A15863B8504b02073C02469E2628K09715D0930J38335q8117L24591
18956D15739b32029E9611K4187H984M9675Q9123e4381A3544a34842h447j41696
$$ plain form
19034 -18352 -509657 89503 -158518 216149 452589 -135656 171816 -7410 -56664 99149 150527
19023 150527 -474504 151901 18351 126458 -174526 -114006 170095 -77778 12859 -73050
19012 40082 -485263 79310 58650 21135 -31917 36435 -286616 -134695 54532 70870 -329861
19000 133592 109362 31230 -375264 -302505 73160 -386885 371245 -199565 -250004 -116849
18989 -145392 -8738 201415 -371282 -182354 -123862 -19724 38890 -236566 249633 -55711 206849
18977 198062 -17614 72406 -56735 419425 173490 415166 93529 409633 -124266 282997
18966 269902 115863 28504 -202073 302469 52628 262343 40930 179265 91148 415739
18956 415739 -232029 59611 83798 8984 58659 147782 -54381 13544 -134842 -8447 -150143
18945a50143A12687A2207a98673A15962c9712N799n9071j91690e028l90435g0435
18933d9093D4738O611h3687F0830a72400B2077a87667h7032l765A2121K81994
18922B94115A43149j1726Q0901c6849j8723o8097l08817F8011j4611k58i8484
18910B26387B5695O2325R034Q8848B100b4752n4265j43881i048A26531c0105A57973
18897C37903E6435b70645e53l14130f8622H3794e3985o858A40027d1424k32157
18886b73581B10308h5234k124D5979e0599I7843O3058K2402D2356c92512D5932
18874i7071D9944c4938q3861L3111A70394a40859a5589r2715b4648j8682j27421
18863a70751k1643e5462k69182J29519H2064N7128f1687E00531a76718I8850a20137
$$ plain form
18945 -150143 112687 12207 -198673 115962 -39712 -33913 -92984 -284674 -5028 -395463 -70435
18933 -49093 44738 51349 -83687 60830 -172400 22077 -187667 -87032 -90797 12121 294115
18922 294115 143149 131423 212324 -36849 -55572 -123669 -432486 68011 53400 53142 -98484
18910 226387 25695 88020 97054 185902 2100 -24752 -79017 -222898 -9048 126531 -30105 157973
18897 337903 56435 -270645 -553 -314683 -68622 83794 -53985 -60843 140027 -41424 -273581
18886 -273581 210308 -85234 -87358 45979 -50599 97843 160901 183303 42356 -392512 45932
18874 -97071 49944 -34938 -118799 -85688 170394 -140859 -15589 -108304 -24648 -43330 -170751
18863 -170751 -192394 -55462 -324644 -195125 82064 139192 -61687 500531 -176718 98850 -120137
18851c61725A42835f8591B2587g567l2458p0204A05206a4330k03449B82111c25826
18839B5356J08306a72018c7682j66744A03012m7207N1225a13419B16181a55344
18828a6168A5140l957c3362l2125A27149L456d9348a670k4595D9668a59072d2757
18815a57916m1332A55851a08942l4224D50534H4638l4646a5093l06504a00867
18804i4265n0441m522e0249I1026j482b2729q7684b7331d859B82509F4572J91828
18792B56400j06632j1547a5982E2939b27712B18366a81733L4003C277Q9876J14937
18781B08090a11654A38576d39951C80659e8033b1413l137k26166J20964q06n6207
18770a86765Q1333G4927o541c10221A16021b28625H007a87471M2493j46841O3949
$$ plain form
18851 -361725 142835 -68591 22587 -7567 -40025 -110229 105206 -14330 -217779 282111 -325826
18839 25356 133662 -172018 -37682 -204426 103012 55805 107030 -113419 216181 -155344
18828 -16168 15140 11183 -33362 -65487 127149 130605 -49348 -1670 -26265 49668 -159072 -42757
18815 -157916 -199248 155851 -108942 -143166 450534 84638 49992 -15093 -321597 -100867
18804 -94265 -144706 -149228 -50249 91026 89544 -22729 -110413 -27331 -4859 282509 64572 256400
18792 256400 149768 138221 -15982 52939 -227712 218366 -181733 -147730 3277 93153 208090
18781 208090 -111654 138576 -439951 380659 -58033 -21413 -24550 -250716 -129752 -130558 -186765
18770 -186765 -105432 74927 68386 -310221 116021 -228625 8007 -187471 -144978 -291819 -227870
18759b27870f6882j11873b5015j76238E3193e2701A76974J50509E1126j7111e5666
18747a86951j156E7787a04670B01936I3883b00919A2940J63134d4470j81663A87497
18735c38640A45073a00721E5826a638F4085d1394j54294d4001F4547J05670J2829
18724A83046c5031k12967d4360L949B44464b2793r7355m8225j72640g0447j11573
18713a82020A41295d4080o4812A0262b01440h2681K6916j19262E2671K33259H8589
18701a1279A78637a50678K8927A16760c26184B07193l9857d1930A21542b79763
18690b84455Q2503A0763a70249h2905a5295A15114e0670k17003c6294H6159a24865
18678e27139a22707j06550d3939B1174G843b22177Q8922f2466m24843j2968a55784
$$ plain form
18759 -227870 -66882 -178755 -25015 -201253 53193 -52701 176974 327483 51126 34015 -55666
18747 -186951 -188107 57787 -104670 201936 93883 -200919 12940 176074 -44470 -226133 187497
18735 -338640 145073 -100721 55826 -1638 64085 -41394 -195688 -44001 64547 170217 183046
18724 183046 -35031 -247998 -44360 -40411 244464 -22793 -120148 -168373 -341013 -70447 -182020
18713 -182020 141295 -44080 -108892 10262 -201440 -82681 -55765 -175027 52671 285930 88589
18701 -11279 178637 -150678 -121751 116760 -326184 207193 167336 -41930 121542 -279763
18690 -284455 -201952 10763 -170249 -82905 -15295 115114 -50670 -267673 -36294 86159 -124865
18678 -527139 -122707 -229257 -43939 21174 7843 -222177 -133255 -62466 -487309 -500277 -155784
18666b24849R1661q7224j8376B9298J9645O584d08199A11156J9489d05194A38001
18654c3168A30144b11951P1268A58266c7885h654j29641C36542C9947a69976j3003
18643a82979e8830j16044C951g3034j49554R5632q5554Q3020e8131o2529a071
18631D2683b86169B5460a5663A9315K10096F7917b2405A25264Q4160b06934h5174
18619b43819n4232B56708C7072b15909A07857a52308I1844a09945A16814d6605
18608A2339Q7619l2949J14902b05504K0132K4950B39176c32683a9686j39301j82049
18597c41036C2910c19612O855B75684b12695A22340J75076c2941B08873c7063
18586e48688C0412a0338k54914J8444i5607J3580I3947b13139r7425b2102j16299
$$ plain form
18666 -224849 -133188 -220412 -238788 29298 48943 55527 -408199 111156 130645 -405194 138001
18654 -33168 130144 -211951 -140683 158266 -37885 -8654 -138295 336542 39947 -169976 -182979
18643 -182979 -58830 -174874 3951 -73034 -222588 -126956 -212510 -129490 -58131 -120660 -1071
18631 42683 -286169 25460 -15663 19315 229411 67917 -22405 125264 209424 -206934 -85174
18619 -243819 -298051 256708 37072 -215909 107857 -152308 91844 -109945 116814 -46605
18608 12339 99958 67009 181911 -205504 -185372 -160422 239176 -332683 -19686 -158987 -341036
18597 -341036 32910 -319612 -312757 275684 -212695 122340 297416 -32941 208873 -37063
18586 -548688 30412 -10338 -265252 -246808 -95607 -82027 93947 -213139 -310564 -22102 -138401
18575a38401f358j25585r3213F8031a15522C9606a74455p3889a7992B9872a49271
18563g3130p9597J9211l190A42123C3199a74501l4213A54767e9443j982B31097
18551A05824D4008J46752c37309J29551l6999i1176d3725A27592c29535J19734
18541b09801N9188B08050g8705j77228e3162l89251a06017F8404B8825O9652i78
18529H5367Q9015a34470A24037d467k76086N9924A33943Q6877a7439j15681d6878
18517a6273l5206B38856M5276a34001e9166B37158b5896j06230J2089b1841j40640
18506a62481A88452J36033c69050A97289G4961a93872M8016K9166A06226N9569
18496A65795K2131M4931m8269F7506J34714P571a03483j17127P0497C17287A1682
$$ plain form
18575 -138401 -6358 -131943 -225156 68031 -115522 39606 -174455 -248344 -17992 29872 -149271
18563 -73130 -152727 -133516 -136706 142123 33199 -174501 -208714 154767 -59443 -61425 231097
18551 105824 44008 190760 -337309 -207758 -244757 -91176 -43725 127592 -329535 -209801
18541 -209801 -150613 208050 -78705 -255933 -53162 -442413 -106017 68404 28825 98477 -978
18529 85367 174382 -134470 124037 -4467 -280553 -220629 133943 220820 -17439 -133120 -46878
18517 -16273 -51479 238856 284132 -134001 -59166 237158 -25896 -132126 -120037 -21841 -162481
18506 -162481 188452 324485 -369050 197289 74961 -193872 -145856 -116690 106226 165795
18496 165795 187926 232857 184588 67506 202220 209791 -103483 -220610 -150113 317287 11682
18484C6290b79813B03675b90375q9923a78677B31582a664A81770b55147B2639
18473a28355b970A36655a39962H75a398A84570L1623D633a18115A00974a26509
18461a4502k68984e4231E2462e579j978B33590c1421F4712b18372L6557C6404
18449G6710c33840a47853E3479f2349l11311A733c50387D6952a30161f0920j59465
18438b20385D2420b47874j97806A21443a54746H3055J3578d5589A10136b33212
18427a14357G3153J64502P666p353g870B87434b00924K1442p499A12261a45600
18415a56886j00802F2278a94330P4942k13091J25932A76038G0188c1009q8423
18405a19432k39419a25822q5832N3319N1655m5159n1441b6322k01068a0543j90637
$$ plain form
18484 36290 -279813 203675 -290375 -380298 -178677 231582 -1664 181770 -255147 22639
18473 -128355 -2970 136655 -139962 875 -1398 184570 216193 4633 -118115 100974 -126509
18461 -14502 -283486 -54231 52462 -5579 -7557 233590 -31421 64712 -218372 -181815 36404
18449 76710 -333840 -147853 53479 -62349 -373660 1733 -350387 46952 -130161 -60920 -220385
18438 -220385 42420 -247874 -445680 121443 -154746 83055 96633 -45589 110136 -233212
18427 -114357 73153 237655 245321 237968 -7870 287434 -200924 -179482 -186981 112261 -145600
18415 -156886 -257688 62278 -194330 -119388 -332479 -206547 176038 70188 -31009 -119432
18405 -119432 -358851 -125822 -211654 -158335 -106680 -151839 -203280 -26322 -227390 -10543 -201180
18394b01180D8700a36630B050K52669a5980C4667b83321D2415J80641b449I1236
18382a32073j39128c317C2165J71768a27991a766D9915c4920A21568h6204K1872
18371f4332o9027d3522A83968G2970c85066J80904F8282a84077f4984l6736A06453
18359B47036B4111O5325J13742G0191g6415A19259b12053j8213B84386r0300a09748
18347B04799E6335a34620A06125d76013K04608j82757a08256F6866A446h3684
18336d44098b9106B64701b4131k48820A55171c3692k42735L7360j21894i9146
18325a03267k51419e5044F7147R7455q0118a23487M9119m4332j0021G1412d2377
18313D0989c0353k25524I3933K49981I6299c05494I551a97596p2125j51374G4285
$$ plain form
18394 -201180 48700 -136630 2050 254719 -15980 34667 -283321 42415 223056 -2449 91236
18382 -132073 -271201 -3317 32165 203933 -127991 -1766 49915 -34920 121568 -86204 -64332
18371 -64332 -133359 -43522 183968 72970 -385066 -204162 68282 -184077 -64984 -101720 106453
18359 247036 24111 89436 203178 70191 -76415 119259 -212053 -230266 284386 194086 -109748
18347 204799 56335 -134620 106125 -476013 -271405 -454162 -108256 66866 1446 -83684
18336 -444098 -29106 264701 -24131 -272951 155171 -33692 -276427 -239067 -360961 -99146
18325 -103267 -354686 -55044 67147 164602 84484 -123487 -74368 -118700 -128721 71412 -42377
18313 40989 -30353 -255877 93933 343914 96299 -305494 9551 -197596 -269721 -421095 74285
18301A58089J10804b42505f9951B00420g1364J9755B7972a61040A33752f784m6478
18290e3262j04664g8526k03415a03695m01112f0815A41590J64052a70329P4759
18280i5570A62270a39025J4803E7562f5552I6857g996m227k81687A42323a59955
18268E2290B639b5985q9000A38875K0174c65222a0124D7519k0107b70195A52471
18256b16455e9660c678m90574A14438J24821c26993C2057c79257c7774j38779
18246a76553m4399a03003B32285A11085a93734E7241b39036d2292l5657A8235
18235b37693c9202m1904b7258j74174G2252c5520J4358l22697H8618a41087p8694
18224b19781j16639J57710A60808p2651d4352k26678O9759e219A7041O7354a99580
$$ plain form
18301 158089 268893 -242505 -69951 200420 -71364 -51609 27972 -161040 133752 -6784 -53262
18290 -53262 -157926 -78526 -281941 -103695 -504807 -60815 141590 305642 -170329 -95570
18280 -95570 162270 -139025 -124222 57562 -65552 96857 -7996 -12223 -293910 142323 -159955
18268 52290 2639 -25985 -114985 138875 159049 -365222 -10124 47519 27412 -270195 152471
18256 -216455 -59660 -3678 -494252 114438 239259 -326993 32057 -379257 -37774 -176553
18246 -176553 -220952 -103003 232285 111085 -193734 57241 -239036 -42292 -77949 18235
18235 -237693 -39202 -81106 -27258 -201432 72252 -35520 -21162 -343859 88618 -141087 -219781
18224 -219781 -336420 -178710 160808 88157 -44352 -271030 -201271 -5219 17041 84395 -199580
18212f50328a88520i1203j6688j06282G8357a6759n0867C76245j14760q0050R265
18201A90700O7345f1746r1004C7297b24151h7858K6784A05913D2189R0874C9624
18189H7185l4606j5052b41852g7710p7561B78504j27579d8179A95177o0993d3935
18177a71019a6902C35492b01044C51982D4989d36861J95403A5736b9081f568o4850
18166g1418j98468B80383b92502M0978B07164a40083A72117P836e3252B23612
18155a34766o0378A97094j1147a20477F3608c63857h6533E9438L50390A40247
18144G618L20317e24600G2507a30000C30075C6131b09276g0348H9686b42124K0231
18133b21893P4372A63887J78624h9520j12445j85134h3786A36365b156A11896
$$ plain form
18212 -650328 -188520 -91203 -107891 -214173 78357 -16759 -67626 376245 261485 181435 190700
18201 190700 258045 -61746 -152750 37297 -224151 -87858 -61074 105913 42189 133063 39624
18189 87185 52579 37527 -241852 -77710 -155271 278504 150925 -48179 195177 134184 -43935
18177 -171019 -16902 335492 -201044 351982 44989 -436861 -241458 15736 -29081 -6568 -71418
18166 -71418 -269886 280383 -292502 -251524 207164 -140083 172117 179953 -53252 223612
18155 -134766 -195144 197094 185947 -120477 63608 -363857 -86533 59438 409828 140247
18144 7618 327935 -524600 72507 -130000 330075 36131 -209276 -70348 89686 -242124 -221893
18133 -221893 -147521 163887 342511 -89520 -201965 -387099 -83786 136365 -2156 111896
18122F0639J43189H5099j0125e4204q0480B34736o5166a16480A40533m3178J19438
18111B16793r7997n2432K1185K27035E3566K08768g9715B81420E2081M6801K56627
18100C55509B7288n62a10381j55676B24785C3851P069N6626k7990B8780d0551
18088E1493J14312K6126p7668J27813b26756B7944G684J2182e4883F9486a31059
18076a8804m0186C3390O249N08054a95264A048K94456b32925c0420I9694l5679
18065F4015b58237J1164M503d0832B5070J4355O6650Q5489N7639f2933m1865j25326
18053b30124Q7916G3538N9424R251F3599b30300L051A30571b22028m2743H3769
18041E3615J32898a62824A32913d53068i9548M5850j9642b847o3110A37640c230
$$ plain form
18122 60639 203828 85099 74974 -54204 -134684 234736 169570 -116480 140533 97355 216793
18111 216793 118796 66364 87549 314584 53566 262334 -79715 281420 52081 98882 355509
18100 355509 27288 26726 -110381 -266057 224785 33851 40920 97546 69556 28780 -40551
18088 51493 165805 191931 114263 242076 -226756 27944 7684 19866 -54883 69486 -131059
18076 -18804 -58990 33390 39639 547693 -195264 1048 295504 -232925 -30420 99694 64015
18065 64015 -258237 -247073 -242570 -40832 25070 39425 106075 191564 249203 -62933 -104798 -230124
18053 -230124 -142208 73538 132962 142213 63599 -230300 -227249 130571 -222028 -264771 83769
18041 53615 186513 -162824 132913 -453068 -99548 -53698 -73340 -2847 -65957 137640 -3230
18029a10900A12044N0236J58082j08224b84016J10720M8943D0024i1638j72047
18019b63685H0707h5251j33847f863A34036a2514l68502G3079C3944M54107i914
18007c969A90824E1466Q1288J08961G5250a56377m40715A07259J3648n7715K47862
17996C11054H9851e9703D8353a84170e7131g569G5600h7952r0599C4611K26428
17985B61039D401b08611A07926B3162a94062G321g3135A31594A9196h2514j23934
17974b06448A04235c3760C5710c3425B11357a04502E5988a11968j17C2716e2904
17962a08991k25107J06257J06468A1321c35436g9915c8678j10519B33842a5765
17951A24605P5063b87341C50965R0024E0117g2835G9506J5019A8072b80406H0605
$$ plain form
18029 -110900 112044 162280 320362 212138 -284016 -173296 -124353 40024 -91638 -263685
18019 -263685 80707 -85251 -219098 -6863 134036 -12514 -381016 73079 33944 488051 -9914
18007 -3969 190824 51466 132754 241715 75250 -156377 -597092 107259 120907 63192 311054
17996 311054 89851 -59703 48353 -184170 -57131 -7569 75600 -87952 -178551 34611 261039
17985 261039 4401 -208611 107926 23162 -194062 7321 -73135 131594 19196 -82514 -206448
17974 -206448 104235 -33760 35710 -33425 211357 -104502 55988 -111968 -112085 32716 -52904
17962 -108991 -334098 -227841 -121373 11321 -335436 -79915 -38678 -149197 233842 -15765
17951 124605 199668 -287341 350965 440989 50117 -72835 79506 94525 18072 -280406 80605
17939A90070i4248j15617B28940b12981E8842a00272B79519p4267d5887C1677
17928A42621l8154a05759B08803b2001j79339D1780A196a53109b8571k53915i1510
17916I7185J6940O8296K1738l3391m1977b60075B04866o2103a00601N116H3223
17904i1321A49305a28681B30342H5440l4375b79179e7859A96304a87740C63965
17893a02175B31651h0736e725G0628d5137H2433b65316p4199g2693G8148J08529
17882A86677f016C9768J6625a71232B72024A19015A6118N663a50716B441M8485
17871E0926b16521G0164a49141L9487o3457B19729a25276D29946A77429p1194
17861A06235E286K19109j02270f9574b7733B93888b20916C41535C6812N9309f8509
$$ plain form
17939 190070 -94248 -209865 228940 -212981 58842 -100272 279519 205252 -45887 31677
17928 142621 104467 -105759 208803 -22001 -201340 41780 1196 -153109 -28571 -282486 -91510
17916 97185 114125 182421 204159 170768 128791 -260075 204866 142763 -100601 -95485 83223
17904 -91321 149305 -128681 230342 85440 51065 -279179 -57859 196304 -187740 363965
17893 -102175 231651 -80736 -5725 70628 -45137 82433 -265316 -339515 -72693 78148 186677
17882 186677 -6016 39768 56393 -171232 272024 119015 16118 21781 -150716 2441 50926
17871 50926 -216521 70164 -149141 -109654 -173111 219729 -125276 429946 177429 106235
17861 106235 5286 224395 122125 -69574 -27733 293888 -220916 341535 36812 96121 -68509
17849E7816a4678m6209o1336a4087k51402A49036E7090a00312F7271O4360K6331
17838A57962c5818j72752A38609a84684B8852K42726g0879C27231j28442c0287
17827A58416F8132l1453J9523l274J8251B7334a45429A43907h8464H6532n372
17816H1160J49605R5051c4601J0573D8422M29080d58309A02842a55253J3890n2069
17805a93432A08874b83250A1080f6860H6545a87685E5388k3601a37545I8157C5941
17793A06650P2593P9745i7046A86123h2178B0945R2721b60407I7145L53988E5979
17781A77140p6775K42453b16207F1935O3335a03448k37370E540J11143g4081C0286
17769A79100q2153K175e4833C45034j57854R0805c8239D29957B05312a24202A91176
$$ plain form
17849 57816 -14678 -60887 -122223 -14087 -265489 149036 57090 -100312 67271 131631 157962
17838 157962 -35818 -208570 138609 -184684 28852 271578 -70879 327231 198789 -30287
17827 158416 68132 36679 56202 52928 71179 27334 -145429 143907 -88464 86532 81160
17816 81160 230765 325816 -34601 -24028 48422 477502 -458309 102842 -155253 -141363 -193432
17805 -193432 108874 -283250 11080 -66860 86545 -187685 55388 31787 -137545 98157 35941
17793 106650 179243 258988 -97046 186123 -82178 20945 113666 -260407 97145 451133 55979
17781 177140 100365 342818 -216207 61935 125270 -103448 -340818 5540 116683 -74081 30286
17769 179100 96947 99122 -54833 345034 187180 277985 -38239 429957 205312 -124202 191176
17757a05548p9570D9880l121b25837C3228i0329D4498Q0633M9509a12602C18861
17745g6943I505d2566j90266q4657A61378i9528j39255d3138A95263m5761a85952
17733f3060B06925C0829a99568E22651i7183A63083k0398k1864M0187C85b09689
17721C68510b75956E2029B5441g3072B68343H2732P8126J20610i3802C88573a21822
17709h6484B14781D9672a38366A33605a0830j70430C1704K25610d2765A05343
17698a68051B60035l6437a90679A20442M36232A78898J97610L3580A87819E2898
17687B8550a64573A43836O0170a19549j62922c9997M465E42566A36489D6662P7264
17676A23926a06574d016o9998J4637a8365A53643B6642L65703j20356p1564C6637
$$ plain form
17757 -105548 -185118 49880 46759 -225837 33228 -90329 44498 125131 174640 -112602 318861
17745 -76943 9505 -42566 -232832 -317489 161378 -99528 -238783 -43138 195263 149502 -185952
17733 -63060 206925 30829 -199568 522651 -97183 163083 142685 120821 161008 385 -209689
17721 368510 -275956 52029 25441 -73072 268343 82732 160858 281468 -93802 388573 -121822
17709 -86484 214781 49672 -138366 133605 -10830 -181260 31704 257314 -42765 105343
17698 -168051 260035 223598 -190679 120442 556674 178898 376508 410088 187819 52898
17687 28550 -164573 143836 204006 -119549 -282471 -39997 -35532 542566 136489 46662 123926
17676 123926 -106574 -4016 -74014 -59377 -18365 153643 26642 392345 271989 200425 36637
17664a25528H3112J49339G3329l0223a7241j80753I6411d5027b0979D29291A52487
17652A55249p576a72189C10012H8678i6357j4736A79949M40D9400J02381J20039
17641B71820J5151d9373B0455K76192j3252D214b9559n9334q2910E2328J33224
17630A85552J44818g9681p0721n7133A33750J61281q4749a42086O393C60850a2865
17618E0695L36357h676A80413L9590h2494J4868G2667f2395j24840G3253M60599
17607E33852b90099A31668J75580m4161P8314a88831D3080a64140F1162Q4637
17597A45799F7668c1902B64595J34387A32997R3481B567a30534B7223L747P2117
17586A03087b33866B87311o4302o9000l7524k7121b10356B92969a4694r4195B99978
$$ plain form
17664 -125528 83112 232451 73329 43106 -17241 -197994 96411 -45027 -20979 429291 152487
17652 155249 147673 -172189 310012 88678 -96357 -111093 179949 180389 49400 151781 271820
17641 271820 286971 -49373 20455 296647 283395 4214 -29559 -88893 -171803 52328 185552
17630 185552 330370 -79681 -150402 -207535 133750 295031 210282 -142086 -135693 360850 -12865
17618 50695 387052 -8676 180413 220003 -82494 -67626 72667 -62395 -187235 73253 533852
17607 533852 -290099 131668 307248 263087 341401 -188831 43080 -164140 61162 145799
17597 145799 67668 -31902 264595 398982 132997 226478 2567 -130534 27223 30970 103087
17586 103087 -233866 287311 223009 154009 116485 89364 -210356 292969 -14694 -108889 299978
17574A66332n0279C7793K60178a94332M3069A32580J5944L7939R501i5090B77246
17562b19559A56426j950J02819o1728p6006J69828g0263C52326B5949L22707k2118
17551C26538j55779L00707j78314O2252A57394E9167j5142O8352R6817K36840
17541D46034B09130J37870m7798c77360A36558P7659D4473K42190R6862l4274
17531C49251r0627O7341m1598j07150M48424B37394K03615J0529L4034K7450B48182
17519F42904j61071j55189K31521K297j67394M42951l35525N5947k17561K53880
17509E92760k13290n9020L25786k78672O8706J01040J58053A26212R5390J97550
17499D19152m5886A34845K86170J116J62526j46963j80329J31555q3682K52176
$$ plain form
17574 166332 116053 37793 297971 -194332 -151263 132580 148524 186463 195964 -95090 277246
17562 -219559 156426 154476 257295 195567 119561 289389 -70263 352326 25949 348656 326538
17551 326538 170759 471466 293152 355404 157394 59167 44025 112377 209194 446034
17541 446034 209130 347000 299202 -377360 136558 214217 44473 286663 383525 349251
17531 349251 258624 325965 284367 177217 625641 237394 441009 451538 485572 513022 248182
17519 642904 481833 326644 558165 560462 393068 836019 500494 556441 338880 592760
17509 592760 379470 320450 646236 367564 436270 537310 695363 126212 221602 419152
17499 419152 373266 134845 421015 422131 584657 437694 257365 388920 305238 557414
17489E57414k29296j29155J27641D3689L37455K49371C05537R8039o6487j56096
17479A80993K51677R1521j49878O9151D1346Q750N78215A77323L42911J59643
17469F79877l04324k1191A06143R3955O7263m3615o9601L8542J62747c859A57960
17457E14110k50045K63066j32005Q1750n2756F6429J31882M04068l00053K8110
17447C30436J23405j63330J73934j48453L2511L0880P0241q0311k3956L14084
17437F59441B33612J29769j16343J86873o0753j85008K86391f113D79665R6774
17427E76439B03053L95413k46731j10137j6294j03162J78082J1385L33671B45938
17416D72651A92175m8522K34431j46542P2554J85305k18528k7457J57873j40753
$$ plain form
17489 557414 328118 198963 326604 43689 381144 630515 305537 403576 337089 180993
17479 180993 432670 524191 374313 443464 41346 50096 628311 177323 520234 679877
17469 679877 375553 354362 106143 200098 267361 223746 154145 192687 355434 -3859 157960
17457 514110 264065 527131 395126 476876 424120 66429 198311 602379 302326 330436
17447 330436 453841 290511 464445 315992 348503 379383 449624 369313 345357 659441
17437 659441 233612 363381 247038 433911 373158 188150 474541 -6113 479665 576439
17427 576439 203053 598466 351735 241598 225304 122142 300224 311609 645280 245938
17416 472651 192175 143653 378084 231542 304096 489401 270873 243416 401289 260536
17406B60536K0827m3820J58581j87819M85327C46557N807M1806L4773d1926A42691
17394B82686K28255j6628j83483J87306j48934p5728K42434B03708J06946K39400
17384E50054j42358H6028C9849K67194J62629k09136R1451j18562J67386d082
17373C71233j73267M87749B08929L33769B62072E0558K53305n7647m6457k1712
17363A78047L286J56453k6887G5489K88992d6249B45581q8212K30890o6340J31658
17352D53577k8661A91156M673L34009r4383j74687A18810R9721A05853J70552
17342B76405q1066D3617K90861J02938k18560J13890f1829C40704L1126e064B23174
17330B13990K89908K4409j50593A5536J63254a4768C42191F1185N58174B26726
$$ plain form
17406 260536 281363 237543 396124 208305 693632 346557 352364 394170 428943 -41926 142691
17394 282686 510941 494313 310830 498136 349202 273474 515908 203708 310654 550054
17384 550054 407696 86028 39849 307043 469672 260536 351987 233425 400811 -4082
17373 371233 197966 685715 208929 542698 262072 50558 303863 246216 199759 178047
17363 178047 181333 337786 310899 75489 364481 -46249 245581 157369 388259 321919 453577
17352 453577 424916 191156 195829 529838 435455 260768 118810 218531 105853 276405
17342 276405 195339 43617 334478 437416 218856 332746 -61829 340704 371830 -5064 223174
17330 213990 503898 528307 377714 15536 178790 -14768 342191 61185 619359 226726
17319A72834G7933J94800g4279E50702B47779R7607g5446A64879K94476p5696
17309C83659m5718M4585Q9864j82578o6531k2578F7231J21664L91686j98868J60735
17298E42448A73199l7670L62895K2579j57525j71523K66059A75778H1974J12675
17288A94649j812L57690k64292p0714M38414k76833l0863L106q0985J86767C4440
17276B65105R3771M5812j15391P4976K61763a09272D46664K46410A25928M47339
17266E73267k54952R831A17866K57313B0004J53157K59434H3560O4334j5773K69904
17255D02025m8149P6793j47911G0728L29933j15202L45666G722J65362G1079L76951
17244D48030B15378q5823K10013P4008j31981K96929k82889J14351B04496K26173
$$ plain form
17319 172834 77933 272733 -74279 550702 247779 345386 -75446 164879 459355 383659
17309 383659 337941 382526 472390 289812 223281 200703 67231 188895 580581 381713 542448
17298 542448 173199 135529 498424 521003 363478 191955 458014 175778 81974 194649
17288 194649 192837 550527 286235 215521 653935 377102 346239 349345 268360 455127 34440
17276 265105 358876 404688 289297 364273 626036 -109272 446664 693074 125928 573267
17266 573267 318315 328146 117866 375179 20004 173161 432595 83560 147894 132121 402025
17255 402025 353876 430669 282758 70728 400661 285459 631125 7722 173084 71079 448030
17244 448030 215378 129555 339568 413576 281595 578524 295635 409986 204496 430669
17234D30669j32131L56532k66538J21987B20666J45090j09806E6879K77262J67247
17224E01388k01230J76379j76237j32333J50120J57299J26219J32997l27371j86022
17214B21209J04743N07833B21218L4099O9618k5340J31733P903K24318k55422
17204D08127J01513p9526n4679j47230J32001K26473j73985K17858B40897K60868
17194E01765j54142j12917M5752M93171k01419j53100l8512F6817L62011K533
17184D31361k3433A37670L05079j81498M37301B57527K05637j61567A38771J84667
17174C23438L2480J57310J04726j82446r278k2549l5075M39703k57906k59357
17164B91046K29084j85545J87152J86150k64320J78302C05700d2783C36721K2116
$$ plain form
17234 430669 298538 655070 388532 510519 220666 365756 255950 56879 334141 501388
17224 501388 300158 476537 300300 167967 318087 475386 601605 734602 407231 221209
17214 221209 325952 833785 221218 255317 324935 299595 431328 439231 663549 408127
17204 408127 509640 430114 375435 228205 360206 586679 412694 630552 240897 501765
17194 501765 347623 234706 280458 773629 572210 419110 380598 66817 428828 431361
17184 431361 407928 137670 442749 261251 698552 257527 463164 301597 138771 323438
17174 323438 355918 513228 617954 435508 426230 403681 368606 808309 550403 291046
17164 291046 520130 334585 521737 707887 443567 621869 305700 -42783 336721 358837
17154C58837K97412j31391M4865p7807o3958N7461l6485L01287A54852K33534
17144C88386K60731B08001K13734K98507k87302J12544K19923l18999J77270Q797
17134F32475l0968J25170j32490j10317N7999j23734J53741B78649J08686J77168
17124E64503K25763p9197l16506K60535L9001m1209K28316k5592l73518k538m4939
17113D34619K43507j63389K2577M19703j01066L1016C76375M39085j90325p3280
17103E51855k11826N08094k08821L60035l56527r0828O288J32084j23317n035
17093E62002j6311J97893n7027j05365o0680K56664j47199m4953J9853J10903
17083G15780Q0401O464l19920J61623p4122J77136J03331j88846j01810K40443
$$ plain form
17154 358837 656249 524858 569723 491916 427958 485419 448934 750221 154852 388386
17144 388386 649117 208001 421735 720242 432940 545484 765407 446408 623678 632475
17134 632475 601507 726677 594187 483870 541869 418135 571876 278649 387335 564503
17124 564503 790266 711069 394563 655098 694099 652890 881206 855614 482096 479558 434619
17113 434619 678126 514737 537314 957017 855951 886967 376375 815460 625135 551855
17103 551855 340029 848123 639302 999337 642810 551982 558270 690354 567037 562002
17093 562002 545691 743584 686557 581192 520512 777176 629977 585024 604877 715780
17083 715780 796181 802645 482725 644348 570226 747362 850693 661847 560037 800480
17073H00480J41370l14220K34835P7183k91751N9525R1738j46740K43605j06764
17063G89261Q644P5475P0551N1773J0526j32638j24459K50435n9629J74802k51659
17052H63082K335K02284O2155k17914j3070k40441O9174K14858l74060K28542
17042G96945j72218M69802j97097j14628q4332k05716M46958p2579J41222m13922
17032E94435L62245k5279j12365Q4610K80527k14654K47986n8441K0651j9905
17022A159810j49804M8923j18888L0590N9128l57913J48987L87134N3661l52389
17012I09239N6871J97949n0908J63843j78489Q27p8488K83486l40271L42762J4511
17001A321332j87823P396J32223j20541j25010R9456R1303M3064J7772j60986
$$ plain form
17073 800480 941850 627630 862465 939648 647897 707422 799160 652420 896025 789261
17063 789261 797905 873380 943931 995704 1006230 873592 749133 999568 939939 1114741 863082
17052 863082 865417 1067701 1129856 911942 898872 658431 727605 942463 568403 796945
17042 796945 624727 1094529 897432 782804 698472 492756 939714 867135 1008357 594435
17032 594435 956680 931401 819036 903646 1184173 969519 1217505 1159064 1179715 1159810
17022 1159810 1010006 1058929 940041 970631 1029759 671846 820833 1207967 1261628 909239
17012 909239 966110 1164059 1113151 1276994 1098505 1099332 1020844 1304330 964059 1306821 1321332
17001 1321332 1133509 1140905 1273128 1152587 1027577 1127033 1218336 1261400 1279172 1118186
16991A118186Q5439J37167k26091K84794j3748l23545P8840N2925K56777j93171
16981A257573L62071p467j22214J88468j56669l97036M32742j04198k75374J83139
16971A361035j43895J16837L32806k385j66271P2036k89655N91872j48398j53404
16961A570578R0947j16894R058J29513Q802L07581o87425J91254j51429O77725
16951B029710k9565k15517J32383l27176J22713n5200j71169M08279l66359L22004
16941A850103L85923m57555j31592J56059L18827l87801J41575J21163k21815
16932A774887L07590l92824M28815p7540L3675j4956j19788m6465J52450L73309
16922B419153n34133M35820k75156J85543p9125K10141j96467K12849k59100K4439
$$ plain form
16991 1118186 1203625 1340792 1114701 1399495 1385747 1062202 1141042 1193967 1450744 1257573
16981 1257573 1619644 1612177 1489963 1678431 1521762 1124726 1557468 1453270 1177896 1361035
16971 1361035 1217140 1333977 1666783 1664398 1498127 1570163 1280508 1872380 1723982 1570578
16961 1570578 1661525 1544631 1553689 1683202 1692004 1999585 1312160 1503414 1351985 2029710
16951 2029710 2000145 1784628 1917011 1589835 1712548 1657348 1486179 1894458 1528099 1850103
16941 1850103 2236026 1778471 1646879 1802938 2121765 1733964 1875539 1996702 1774887
16932 1774887 2082477 1689653 2118468 2040928 2074603 2059647 1939859 1893394 2045844 2419153
16922 2419153 1885020 2320840 2045684 2231227 2152102 2362243 2165776 2378625 2119525 2143964
16912B143964J76062n4798R7191k37323N35855l96363n1797L31028k56469M24544
16902B711894j60204m990p3939J48413K1007K26723n41016N43980J51497N8395
16892C081760k29959K6014K19002j45517L12484l32185L76220K06550m97532J99800
16882C216637M40145l44437J14151K3051R1119k38986M78294n82543N16414J55694
16872C869539m22854M95010P0856n5358k31851P7842j38236R5820K95585n0251
16862D006102K35455j02768O9453Q6824L6913J74650J16169j2082L67721n47247
16852D431190J91276J3223K10000M4543j93328J69368L59558R5571L25522k280
16842E644643L1303K13682k28456o7708j8691N29474q4509n0711L65586j50582
$$ plain form
16912 2143964 2320026 2265228 2362419 2125096 2660951 2264588 2212791 2543819 2287350 2711894
16902 2711894 2551690 2546700 2472761 2621174 2642181 2868904 2327888 2871868 3023365 3081760
16892 3081760 2851801 2877815 3096817 2951300 3263784 2931599 3307819 3514369 3016837 3216637
16882 3216637 3656782 3312345 3426496 3449547 3540666 3301680 3779974 3197431 3713845 3869539
16872 3869539 3446685 3941695 4012551 3957193 3725342 3803184 3664948 3760768 4056353 4006102
16862 4006102 4241557 4138789 4208242 4295066 4331979 4506629 4622798 4610716 4978437 4431190
16852 4431190 4622466 4635689 4845689 4890232 4696904 4866272 5225830 5321401 5646923 5644643
16842 5644643 5675946 5889628 5661172 5593464 5574773 6104247 6019738 5969027 6334613 6184031
16832F184031L26663j04374K20376r7952L68528N3177J04749r2600L60722M582
16822G327902K72970L85648J07618K85968j42297R1316M40525k54020M37111O1527
16812I014268K18707K84449j89787N51710j38825N0407M70413L17130l97720R13695
16802A1094447K36816j25419N83870M37499o3184K45079J85620N78731l957N55093
16792A3724595k0735M46948K84211M65667N62017M57097N3824M04205O26206N82100
16782A7586135K20941L45217J93600Q15825M70034Q54392L64559O06965N98473
16773B2056141P35511L82537R68483O04941J015386P04326N66053R98754O16004
16764B8648136Q01186J208055O71554J339426J046656O44592J249440J057928
$$ plain form
16832 6184031 6510694 6406320 6626696 6528744 6897272 6950449 7055198 6962598 7323320 7327902
16822 7327902 7600872 7986520 8094138 8380106 8237809 8329125 8769650 8515630 8952741 9014268
16812 9014268 9232975 9517424 9327637 9879347 9740522 9790929 10261342 10578472 10180752 11094447
16802 11094447 11331263 11205844 11789714 12227213 12164029 12409108 12594728 13173459 13169502 13724595
16792 13724595 13703860 14150808 14435019 14900686 15462703 15919800 15973624 16377829 17004035 17586135
16782 17586135 17807076 18152293 18345893 19161718 19631752 20486144 20850703 21457668 22056141
16773 22056141 22791652 23174189 24142672 24747613 25762999 26467325 27033378 28032132 28648136
16764 28648136 29449322 30657377 31328931 32668357 33715013 34359605 35609045 36666973
16756C6666973J494213P96669J295923J641308J142719J750296J309778J861860
16748D7959739J134286J676073J800164J551882J465121K042184J898119J809001
16740F1336569J842261J936401J808054K014873J830291J424868J815966K436709
16732G6445992J124395J623744J650726J432258J063229J654949J203270Q60607
16724H7059170R22828J293479K87912P23193M40413N87176j24998L07307J52782
16715I1649262m41776l8337n27794l01266l91438p12161n39875o20564j303769
16706H6772282n91863j013668j044210q47208j130225j275217j123544j391389
16698G8354958j344187j183535j309564j403166j293731j605036j562519j555469
$$ plain form
16756 36666973 38161186 38957855 40253778 41895086 43037805 44788101 46097879 47959739
16748 47959739 49094025 50770098 52570262 54122144 55587265 57629449 59527568 61336569
16740 61336569 63178830 65115231 66923285 68938158 70768449 72193317 74009283 76445992
16732 76445992 77570387 79194131 80844857 82277115 83340344 84995293 86198563 87059170
16724 87059170 87981998 89275477 89563389 90286582 90726995 91314171 91189173 91496480 91649262
16715 91649262 91207486 91169149 90641355 90340089 89948651 89236490 88696615 88076051 86772282
16706 86772282 86180419 85166751 84122541 83275333 82145108 80869891 79746347 78354958
16698 78354958 77010771 75827236 74517672 73114506 71820775 70215739 68653220 67097751
16690F7097751j223463j340356j034385j548511j434813j568715j159981j106873
16682E6680654j696218j004471j328642j078763r34559j429087r95067j329176
16674D6884671o62724j249478q14655j321894q70255j431597o03400p81176o35643
16665C8513849r47813j006381n69307r83732p63999p04835p49130m73081q88823
16656C1426748k57472j199835l52268q04001n66975k40788r80918l58891o82043
16647B5983557l62401o45431m44238m41129o49474k76500m10170m88262o19793
16638B1646159j85274l31173o73773j57896n51025o22916K22620p99962j48634
16629A8398126k35767q3067q39774J29725r10396m12396J63309k67112n47012
$$ plain form
16690 67097751 65874288 64533932 63499547 61951036 60516223 58947508 57787527 56680654
16682 56680654 54984436 53979965 52651323 51572560 50638001 49208914 48213847 46884671
16674 46884671 46221947 44972469 44157814 42835920 41965665 40534068 39930668 39149492 38513849
16665 38513849 37566036 36559655 35990348 35006616 34242617 33537782 32788652 32315571 31426748
16656 31426748 31169276 29969441 29617173 28813172 28246197 28005409 27024491 26665600 25983557
16647 25983557 25621156 24975725 24531487 24090358 23440884 23164384 22754214 22265952 21646159
16638 21646159 21460885 21129712 20455939 20298043 19747018 19124102 19346722 18546760 18398126
16629 18398126 18162359 18079292 17239518 17369243 16458847 16046451 16209760 15942648 15395636
16620A5395636J92312l36795k28336n06116q4301n63312J82340p81614l1120P6354
16610A3315048k65523j1021o85695M4989k1685m67502m11595j43364l08248Q2779
16600A1128183l92753K71754n82453M5558j87055J57042l28759k19432n60945
16591I331140J47982k79118K10602m64633l26571M18304l77213k72395p0226j12233
16581H205639j73840q4670P8681r8607j74781k44174p9690m0750k7992K68470
16571G628286n77688m2406q9620k26665N9329j48340j63985k49434k87635K60561
16561F162403l23534j54366J17719p5145K25114m16631j88987K88217l75781j90196
16551E068813J42489k42869n6300K50059k98982j56943K67547l67334q6023M7934
$$ plain form
16620 15395636 15587948 15251153 15022817 14516701 14432400 13869088 14051428 13269814 13238694 13315048
16610 13315048 13049525 13038504 12352809 12397798 12376113 11908611 11497016 11353652 11045404 11128183
16600 11128183 10735430 11007184 10424731 10470289 10283234 10440276 10111517 9892085 9331140
16591 9331140 9479122 9200004 9410606 8945973 8619402 9037706 8660493 8388098 8317872 8205639
16581 8205639 8031799 7947129 8025810 7927203 7752422 7508248 7428558 7387808 7359816 7628286
16571 7628286 7050598 7008192 6918572 6691907 6751236 6602896 6438911 6189477 5901842 6162403
16561 6162403 5838869 5684503 5802222 5727077 5952191 5535560 5346573 5634790 5259009 5068813
16551 5068813 5211302 4968433 4912133 5162192 4863210 4706267 4973814 4606480 4520457 4568391
16541D568391k88059o3584K38317k79171k21078K20579j12304l79133J81159J13082
16531C978199l48165J36872P6457k68650j53247K4712O2074M6157J65075k58522
16521C460962l68996J24247k13868K57214r9398O962n23156L00609J6333j81024
16511B779885N5238j39014m5081j82377r391K6853L25647j77919j86490j33877
16501B313474P2946K39241q7256j86523j88281J87926n18494K44263K77457l14585
16491B040168J16289J4967o3726k47701j24646J18306J41996K3295l78157J01800
16481A742591M50690m60436Q6923O3252r0669R4432k06363l4112J37520k47046
16471A536782O21634m43761N1354k5026m1395J2586k57222j75575L28701L95632
$$ plain form
16541 4568391 4280332 4216748 4455065 4175894 3954816 4175395 4063091 3683958 3865117 3978199
16531 3978199 3630034 3766906 3843363 3574713 3421466 3446178 3508252 3554409 3719484 3460962
16521 3460962 3091966 3216213 3002345 3259559 3160161 3167123 2643967 2944576 2960909 2779885
16511 2779885 2835123 2696109 2651028 2468651 2459260 2486113 2811760 2633841 2447351 2313474
16501 2313474 2386420 2625661 2538405 2351882 2163601 2351527 1833033 2077296 2354753 2040168
16491 2040168 2156457 2171424 2107698 1859997 1735351 1853657 1995653 2018948 1640791 1742591
16481 1742591 2193281 1732845 1819768 1883020 1792351 1886783 1680420 1646308 1783828 1536782
16471 1536782 2158416 1714655 1766009 1740983 1699588 1712174 1454952 1279377 1608078 2003710
16461B003710p58282J80013L585j26382J60147p42K6451k05569q7287K88696K572
16450A486912j91199K15572k58907J31657O935j75518K81575l30842k11952L39020
16440A293253j72410M13373k83570k94834M14187m32168M05290q2954l58463l0175
16430H71529J0058K7593L47907j55464o3702R5405k31932L23537k45641K33190
16420A212480l6709k43150N98465n42019Q0093L68187F21403O34064k94450r438
16410I51579M5478r7538j39992L93786m24798L34034k77740K96778J3611E15892
16399H92966r4582K9481j47467M28106k77489j65527l6222L63947l2584k78234
16389F82395K32848k71802J13548R3339k9195j7274k44006P7488j0853j19368
$$ plain form
16461 2003710 1245428 1425441 1429026 1302644 1462791 1462049 1488500 1282931 1195644 1484340 1486912
16450 1486912 1295713 1511285 1252378 1384035 1390970 1215452 1497027 1166185 954233 1293253
16440 1293253 1120843 1534216 1250646 955812 1369999 937831 1343121 1260167 901704 871529
16430 871529 881587 909180 1257087 1101623 1037921 1133326 901394 1224931 979290 1212480
16420 1212480 1175771 932621 1531086 989067 1069160 1437347 621403 1255467 961017 951579
16410 951579 997057 899519 759527 1153313 728515 1062549 784809 1081587 1095198 515892
16399 892966 798384 827865 680398 1108504 831015 665488 629266 993213 960629 682395
16389 682395 915243 643441 756989 850328 821133 803859 559853 637341 626488 507120
16379E07120K05265J39926J49480r6753k12517k98158J93451K40318C49285N13492
16369H62777k84882j33828K41009K08956C35207L79969L03954n08063O1084K14981
16359G87132K89490n34524j64819K21800K4837K62226k21521l09028L36598C25756
16348B10964K61362j23745K50292K21386C96053K09433B72166J52829J25914L05559
16338H56468j80011C30359K7407J54944j21453k2288J59626j5k47407M17789k48602
16327D50360J32982L0041q6680P9860B93326K79464k79000N07229l31069j37378
16317C32572j19757K76106J1501k13846Q2100L07464j73677B49878m02M26355
16307F75831k68926J49459j53150K9416j15518K33352l5962o538j12223Q8574
$$ plain form
16379 507120 712385 852311 1001791 905038 692521 394363 587814 828132 349285 862777
16369 862777 577895 444067 685076 894032 335207 715176 1019130 511067 572151 787132
16359 787132 1076622 542098 377279 599079 623916 886142 664621 355593 692191 325756
16348 210964 472326 348581 598873 820259 396053 605486 272166 424995 550909 856468
16338 856468 676457 330359 357766 512710 391257 368969 528595 528580 281173 698962 450360
16327 450360 583342 613383 526703 606563 293326 572790 293790 801019 469950 332572
16317 332572 212815 488921 500422 286576 368676 676140 502463 249878 249476 675831
16307 675831 406905 556364 403214 432630 317112 550464 514502 507964 395741 484315
16297D84315A13710K52237J5387R2767K7101M9011k21609m5085Q3942L6790M6393
16286D50644A79149M72855C01455q0926j3640K71788n1546R6275k44785J06698
16276C85319p9785J14945l3749A70000J2608P2939J59736R8806j16918A98125
16265A66974K10807K7133A54073J25953q8139J92406Q3686k6537B19774n275J92787
16254D07286r1016A19833J73682m4728l0942n3100j0290O1871L36308B25672j5107
16243B10565k7254K37036A94970K03940A82020r711J1909L66331p9495A86207
16232C05604j51321K72400A45301D0141J11741J04844J84405C5733K63518O5641
16222C64892A65420L27030j11392K6001p4013K06981A16136A918N8967Q3658J74238
$$ plain form
16297 484315 113710 365947 381334 474101 501202 550213 328604 283519 367461 404251 450644
16286 450644 179149 652004 301455 220529 206889 478677 427131 523406 278621 385319
16276 385319 305534 420479 386730 170000 182608 255547 415283 514089 397171 198125
16265 166974 377781 404914 154073 280026 191887 384293 467979 441442 219774 214499 407286
16254 407286 316270 119833 293515 248787 217845 164745 154455 216326 552634 225672 210565
16243 210565 183311 420347 194970 398910 182020 172309 184218 550549 471054 186207
16232 305604 154283 426683 145301 40141 151882 256726 441131 35733 299251 364892
16222 364892 165420 492450 381058 407059 333046 540027 116136 1918 60885 144543 318781
16211C18781o8276J66282c5466A17201J7838a8329E15247B37508j01043J34874
16201B71339A06162Q7705L7934l1830J35105A02130J32828K21374e1617A00910
16190A54247N29919D4618b9226G1683A045J95011J31618j37918k6741K36449j27131
16179B72333m986J2889l4677I5274Q3780G3167R4720n8817J23221j12643Q7881
16168B07529o4709b75776A90108J5960D6487a8439D47804B04110J78797a0766
16157B31860G2341J88105J41138j68579p8104P5441k9210I7699l8007J90988J69122
16146D19802a02379j9259B91636a30148B37157c8687A52957L30486A61505A8656
16135b27854a10825B35856E0358H650J03361Q7171Q8189j41619Q2648n7911R7813
$$ plain form
16211 318781 250505 416787 -35466 117201 135039 -18329 515247 237508 136465 271339
16201 271339 106162 193867 231801 199971 335076 102130 234958 456332 -51617 100910
16190 154247 684166 44618 -29226 71683 1045 196056 327674 189756 163015 399464 272333
16179 272333 267347 280236 245559 95274 179054 73167 167887 109070 232291 119648 207529
16168 207529 142820 -275776 190108 206068 46487 -18439 447804 204110 382907 -10766
16157 231860 72341 260446 401584 233005 154901 230342 201132 97699 59692 250680 419802
16146 419802 -102379 -121638 291636 -130148 237157 -38687 152957 483443 161505 18656
16135 -227854 -110825 235856 50358 8650 112011 199182 287371 145752 228400 170489 268302
16124B68302b55574A2252h7619E3489R7738K38814j45258n127n5583D5989h9085
16112c9122q0817k29882B6104J69848o4735A0430L4702K10482o6117I409K68676
16101B78085a85890E4803b58671a7140j4935D50985E2621b07571B77996j23779
16091A54217a31772B91354H2175K61236a18560A19055a2904B69665g6759C71142
16080b09911B20897C995N04899D3656J5434L8781B5873J35480b380C6269i2127
16068A88179q6886P5717a49712K7802d7424A72372J2432a41385c8538B19431n1845
16057A67586g4666G0429J63764J04486a02472j63032L602A00427e349B13134a97111
16045A24758n5141A6055i5838B10288e553C2323b59039E1220J81432N2240A7723
$$ plain form
16124 268302 -255574 12252 -87619 53489 151227 390041 244783 239656 184073 45989 -89085
16112 -39122 -119939 -349821 26104 195952 131217 10430 45132 255614 189497 9409 278085
16101 278085 -185890 54803 -258671 -17140 -32075 450985 52621 -207571 277996 154217
16091 154217 -131772 291354 82175 343411 -118560 119055 -12904 269665 -76759 371142
16080 -209911 220897 3995 508894 43656 59090 97871 25873 161353 -2380 36269 -92127
16068 188179 101293 177010 -149712 -121910 -47424 172372 184804 -141385 -38538 219431 167586
16057 167586 -74666 70429 234193 338679 -102472 -265504 -261902 100427 -5349 213134 -197111
16045 124758 69617 16055 -95838 210288 -5553 32323 -259039 51220 232652 284892 17723
16033c87702J66341N1878b9918k1027B68J50257d0890J2388m5547r4333J863I9808
16020A69377e9382m8666a6550B8649g520j11827j19930A35169c2460j943j05097
16009a39500H4583D1344J12344G864Q7356O6298f5464q6707B0846J16907k349
15998A35404m7277b16398h9809b7991f710D83306B2943J95491c7394C94251J11427
15987E05678F2448J15587n186J60246j39341j7808K87294G0134L27304l9665P1294
15976D29067k03479K24155j63975j07212K54487p5441N9765A33315K64797G6960
15965B76606g6504B73653q4056O4026l0915b683r992q8153B28247j09489K6405
15954A45163O3914o3904j0814K59947j16365f3576p4127m1053h1453p929L1463
$$ plain form
16033 -387702 -221361 -169483 -29918 -50945 268 150525 -40890 -28502 -74049 -168382 -166519 99808
16020 169377 -59382 -108048 -16550 28649 -7520 -119347 -239277 135169 -32460 -34403 -139500
16009 -139500 84583 41344 153688 7864 95220 161518 -65464 -152171 20846 137753 135404
15998 135404 88127 -216398 -89809 -27991 -6710 483306 22943 218434 -37394 394251 505678
15987 505678 62448 178035 172849 333095 193754 175946 463240 70134 397438 357773 429067
15976 429067 225588 449743 285768 178556 433043 357602 417367 133315 398112 76960
15965 276606 -76504 273653 189597 253623 222708 -2683 -12675 -100828 228247 118758 145163
15954 145163 209077 145173 134359 394306 277941 -63576 -137703 -178756 -81453 -89382 -57919
15943e7919A22779l3134D2424a32431b6937A77336L65085B6481b1091B33139D3935
15931b46109R9610g0835p8878C13018A04415d2623B74069a05612j26076e8670
15920A68997L1083e2416q7582p9232p3165H1498Q1422a72288A51536a96676P7708
15909a18968J7813l1020B79692a63264O7037c9211D6262L51189H985b97237A56367
15897a13462d724o1264k09838J29089G6309a20200H7164a6601j8199B4025L1926
15886E5951R2890k8269a31676I8259C5884J74905b14580f0715k1768j66623d6334
15874E6969b9577k87763d1554C55581A43047J17635A22444c6906k2891A67389
15863a40599d8372A3547b58653J23211A2695L13464n5183e2068j19005B13331
$$ plain form
15943 -57919 122779 89645 42424 -132431 -26937 177336 542421 26481 -21091 233139 43935
15931 -246109 -146499 -70835 -149713 313018 104415 -42623 274069 -105612 -231688 -58670
15920 168997 200080 -52416 -139998 -219230 -292395 81498 162920 -172288 151536 -196676 -118968
15909 -118968 -101155 -132175 279692 -163264 -96227 -39211 46262 397451 8985 -297237 156367
15897 -113462 -4724 -65988 -275826 -146737 76309 -120200 87164 -16601 -34800 24025 55951
15886 55951 148841 120572 -131676 98259 35884 210789 -214580 -60715 -82483 -249106 -46334
15874 56969 -29577 -317340 -41554 355581 143047 260682 122444 -36906 -59797 167389
15863 -140599 -48372 13547 -258653 -135442 12695 326159 270976 -52068 -171073 213331
15852C01588A6206a94656g6844p7612f6980C6229R701J81315c4842k678E8474
15840A80849c6326B74608B8844b00712j5620A48776n8713e6879E1704k0240J75039
15829B06503b12359o9115a32854m5033O1829J3870p7344l2876r8341a35995E5359
15817C18528j57077g8313o1754L8708A57560p1071a29316K4930j32513o5785A01335
15805d4417B0616J95541D1134N6113b18092A3520L1067c900j02129A04643a07812
15793b18243A79441n0417a83491B34413c20424a12874L5458A67300b10007G6094
15782H0377a07715D544b84839B07187J57013A56179b039l3396M892a3884E10398
15770D13595A0536K16655i5897o3754F9442j7632c56281H2713B2103M2076d8311
$$ plain form
15852 301588 16206 -194656 -76844 -154456 -66980 36229 45930 227245 -34842 -37520 58474
15840 180849 -36326 274608 28844 -200712 -216332 148776 90063 -56879 51704 31464 206503
15829 206503 -212359 -281474 -132854 -177887 -116058 -102188 -179532 -212408 -310749 -135995 55359
15817 318528 161451 -78313 -140067 -101359 157560 86489 -129316 -104386 -236899 -302684 101335
15805 -44417 20616 216157 41134 97247 -218092 13520 44587 -3900 -106029 104643 -107812
15793 -218243 179441 129024 -183491 234413 -320424 -112874 -77416 167300 -210007 76094
15782 80377 -107715 4544 -284839 207187 364200 156179 -2039 -35435 -30543 -13884 510398
15770 413595 10536 227191 -95897 -159651 69442 51810 -356281 82713 22103 64179 -48311
15758A50892c47834e3258D8101b00699c5677B02708O8630b26400A03934k0932
15748H3002J63849m1993f6597l6740K8004k998B22821E6060c4531B23364A787
15736a45034A1342b0982l32424J24766N6534C5509b48170g2946A84666a56989
15725A08964a2826o4463r2016O408q8273a04520C4723a08569B10007a28908l6200
15714a65108N439A4167J45250f6067k733g835n8128I3906b6077C65759b8206p6191
15702a04397b5054J972m4816j93917O3888j5117h1113B4279d0600m7760k14347
15691c02707A5728Q272b6791A66704e2524j26081L4170d293k29485A49390C7471
15679H7582C2784f9337B02247q2422J39004j236a00177F1624b66719B98510a6419
$$ plain form
15758 150892 -347834 -53258 48101 -200699 -35677 202708 271338 -226400 103934 83002
15748 83002 246851 204858 -66597 -103337 -75333 -78331 222821 56060 -34531 223364 1787
15736 -145034 11342 -20982 -353406 -228640 -172106 35509 -248170 -72946 184666 -156989
15725 108964 -12826 -77289 -169305 -162897 -251170 -104520 34723 -108569 210007 -128908 -165108
15714 -165108 -159669 14167 159417 -66067 -68800 -7835 -65963 93906 -26077 365759 -28206 -104397
15702 -104397 -25054 -23082 -67898 -261815 -197927 -213044 -81113 24279 -40600 -88360 -302707
15691 -302707 15728 24000 -26791 166704 -52524 -178605 -144435 -4293 -233778 149390 37471
15679 87582 32784 -69337 202247 119825 258829 257593 -100177 61624 -266719 298510 -16419
15667D1033L29983b20814i8869B79401A00562d3290o0321B86844F675K32695g7148
15655A33081b03372A35360j4474k9833b26891e2623n2600j33956a07947d7441
15644B66132j20325c1464l05469h2863j2756q320A13283e2821A72336g5397l2477
15633a07874p5487A3619L7537J16870J09774b0408j80247A75242a88519I1205
15622c37243J43295j45089a38325m5326A04151d0501j69653e0089j60720C00073
15611D2542Q4756b21379A44848a87268H546Q2454A9482a92657F0482a34677A01962
15599A48826J91821G401b72414E3802a83994C2179e9931a8860B0924I850J24336
15588A34186a52193j54518A44570a20590a8486A01827M4493c21613i1835f627
$$ plain form
15667 41033 371016 -220814 -98869 279401 100562 -43290 -103611 286844 6675 239370 -77148
15655 133081 -203372 135360 120886 91053 -226891 -52623 -105223 -239179 -107947 -47441
15644 266132 145807 -31464 -336933 -82863 -95619 -103939 113283 -52821 172336 -75397 -107874
15633 -107874 -183361 13619 51156 168026 277800 -20408 -200655 175242 -188519 91205
15622 -337243 -193948 -339037 -138325 -183651 104151 -40501 -210154 -50089 -210809 300073
15611 42542 127298 -221379 144848 -187268 8546 91000 19482 -192657 60482 -134677 101962
15599 148826 340647 7401 -272414 53802 -183994 32179 -59931 -18860 20924 9850 134186
15588 134186 -152193 -306711 144570 -120590 -18486 101827 146320 -321613 -91835 -6627
15577A59441D7873K2561K37924h1007c3027A86593b7495A96638a33416A30804
15566a08816C4553a07880B0387N8252a79291A36175e6456k19682K2342G4194a41296
15554A27242d1698B32952a77591A65539a983j05241A5720L01607b26513D0651
15543A35841H269Q7673J7526j6870K82746g2894C57814b00733i1974D9763a34946
15531B35880b23754B68066d2869o473D45106H3209R2936a6363B0019e9300A64516
15519E2056b37207a9965G3071R9859a0454r6050C24825a38138G0168a10959l89
15508a11348D16872j53185A30346K18410H4754R1814F4873a75681A75330o8471
15498A06859R1313M115o3109d20565A74209d9031j94567A64974b51322C50641
$$ plain form
15577 159441 47873 70434 308358 -81007 -33027 186593 -27495 196638 -133416 130804
15566 -108816 34553 -107880 20387 78639 -179291 136175 -56456 -276138 -253796 74194 -141296
15554 127242 -41698 232952 -177591 165539 -1983 -107224 15720 317327 -226513 40651
15543 135841 8269 95942 113468 96598 379344 -72894 357814 -200733 -91974 49763 -134946
15531 235880 -223754 268066 -42869 -49342 445106 83209 176145 -16363 20019 -59300 164516
15519 52056 -237207 -19965 73071 172930 -10454 -106504 324825 -138138 70168 -110959 -111348
15508 -111348 416872 263687 130346 348756 84754 176568 64873 -175681 175330 106859
15498 106859 198172 202287 139178 -420565 174209 -49031 -243598 164974 -251322 350641
15487A08294e2359B78186a86410C25613D8009J57665J89972b05253C32513d0929
15476B10523N1858A27885O6251J96214j36010A20891J05517k6218M02K81733n6093
15465D26232B04474n3126L4127Q6539a32843e4203j34318P1309A25970e2074B39629
15453A17046l0660r800P0079p2103L56597g1741C48724p833A35082J39256j02420
15442A71918E4309d0982D31447C7388n172J06063m8472M80709C8530L47464A47596
15430G2648O2850j0769F21M55240k00426C6201M69892n9246B12348a39869I1067
15418E1568L19451A56963h7834k75879c7276F2794J08592o4846C6801H257f3314
15406F4105i5466c5192A64169R57a74803m0789i3494c605B6216J48636J9919a7487
$$ plain form
15487 108294 -52359 278186 -186410 325613 48009 205674 395646 -205253 332513 -40929
15476 210523 262381 127885 194136 390350 254340 120891 226408 200190 200592 482325 426232
15465 426232 204474 151348 185475 272014 -132843 -54203 -188521 -117212 125970 -52074 239629
15453 117046 86386 76586 146665 74562 431159 -71741 348724 340891 135082 274338 171918
15442 171918 54309 -40982 431447 37388 32216 138279 89807 570516 38530 385994 147596
15430 72648 135498 124729 621 455861 255435 36201 506093 446847 212348 -139869 91067
15418 51568 371019 156963 -87834 -363713 -37276 62794 171386 106540 36801 8257 -63314
15406 64105 -95466 -35192 164169 165126 -174803 -215592 -93494 -3605 26216 174852 194771 -17487
15393A68808J3518p2908e0294B1545N7536K16705A02621a20205A28513k2283a7843
15381A60457a3338A53765b41394B9120a52744B5098a29644c3733k7080H2217l5082
15370D7135b538j00534C67267h7364H9700g3710A54081a28326B6714L01974I3310
15358B30726e5249B68736A20944C1097L88832E6176P1833K06629j25092G6552
15347A62938f1908C5443e0460E20590k21295k0732k6866j18763R2257B14a71136
15335E24752H7603a12676B97964K25839A67366I364M05240A26641a31029C57056
15324B6794L18909K08929k74278E1781c9634E3518B1141J26698L798N7051d3076
15312B92048J765J9559A23644C6814d237A29827L14982A81307F103L33K033Q7838
$$ plain form
15393 168808 182326 109418 -50294 21545 79081 295786 102621 -120205 128513 106230 -17843
15381 160457 -13338 153765 -241394 29120 -152744 25098 -129644 -33733 -60813 82217 47135
15370 47135 -2538 -103072 367267 -87364 89700 -73710 154081 -128326 26714 328688 93310
15358 230726 -55249 268736 120944 31097 419929 56176 128009 334638 209546 76552
15347 162938 -61908 35443 -50460 520590 299295 278563 251697 132934 225191 214 -171136
15335 524752 87603 -112676 297964 523803 167366 9364 414604 126641 -131029 357056
15324 26794 345703 554632 280354 51781 -39634 53518 21141 147839 151637 208688 -43076
15312 292048 293813 313372 123644 36814 -4237 129827 444809 181307 6103 6436 8469 96307
15300I6307K54396f0078o4282A83755h8599c874A17975L3963a42097A78615g3829
15288A92565K7442e624D34133g4442A20255a97562C05636c17235D2118N2807b34531
15276C19718g3087K0739A843O772N0359a60676L4295j11271G851i9886A28641
15264B26140n9845M3005r9320K49091C5368g433B5264K40555q1075G2484e0377
15252E5429L68280A94821c387F8254J08291J58340n670c9018D16864Q6686A47115
15240D66597J99016k27185A71296J10400Q5733j75231M49086j60100k35652K478
15230B48010m6784K2625P0619i5601D36398o4085A10420K4657k859K6199K35636
15219C94053C6295O9640J27990A5924a65406G2310a39660B05184K7153A5280b15035
$$ plain form
15300 96307 350703 -60078 -124360 183755 -88599 -3874 117975 151938 -142097 178615 -73829
15288 192565 220007 -5624 434133 -74442 120255 -197562 305636 -317235 42118 94925 -234531
15276 319718 -73087 -52348 1843 8615 58974 -160676 -126381 -237652 7851 -99886 128641
15264 226140 166295 209300 109980 359071 35368 -7433 25264 265819 184744 72484 -50377
15252 55429 423709 194821 -3387 68254 176545 334885 329215 -39018 416864 503550 147115
15240 466597 665613 438428 171296 281696 367429 192198 641284 481184 245532 248010
15230 248010 201226 223851 294470 -95601 436398 372313 110420 135077 132218 158417 394053
15219 394053 36295 105935 233925 15924 -165406 72310 -139660 205184 232337 15280 -215035
15207D29789f7425k73213J30156b8631I2345J73122A29311J33591J73514j64563
15197B71853a45227B9994K58276A35008B7771G734K20931j08895E1948a2975B71905
15185h8264h094B11596J55595a56919K3025B56075C6988K73779A08218J11720
15175B19938J81251A30464n9982J40761F985J64514C2880K13317n1784k8040r846
15164A56527a35397C36890o5377a00140j69982B96718p5499h9590B50170a4812
15153f8740A85309B7736N23084m4735d9199j22121N2320D08818f8879k0468B82456
15141A07310a30087e8447A33713i4906A60280J12627m4947L9277b51942Q0060
15131a71882D1395d8171A58962L0209o5793a61257C35324b35988B03580d1395
$$ plain form
15207 429789 -67425 -340638 -210482 -28631 92345 265467 129311 262902 436416 271853
15197 271853 -145227 29994 288270 135008 27771 7734 228665 119770 51948 -12975 271905
15185 -88264 -8094 211596 367191 -156919 -133894 256075 36988 310767 108218 219938
15175 219938 401189 130464 70482 211243 6985 171499 32880 246197 194413 166373 156527
15164 156527 -135397 336890 271513 -100140 -270122 296718 221219 -89590 250170 -14812
15153 -68740 185309 27736 550820 506085 -49199 -171320 -119000 408818 -68879 -89347 282456
15141 107310 -130087 -58447 133713 -94906 160280 272907 227960 267237 -251942 -171882
15131 -171882 41395 -48171 158962 189171 123378 -161257 335324 -235988 203580 -41395
15120C3086e505k878A62333m6260L70644j00528j16279B0754K42774O1897B3635
15108G2780a72566B51076k7606o6877K97618A99585K02141E8530K04919n3545
15098B09904q9657M2609G0993L31336E9149a26230C0385L0818K31872R2513A22567
15086e8845C01549h4157L8029C8786g6463A10855J21388a67249B71214A32123
15075A52973P1766P1767A00684N3007J53241A24092J15287D1148h828A77581J29725
15064C07306H4967c2499E32635G8793I191a62166B46795I0112K38933p8460b06008
15052A03382K2998K74924J65670c18046F8710J51126E8187k7420K83823A21361
15041C41883P9770k0531n027k5718K34848B61993l6843D4983M61193j52216A61176
$$ plain form
15120 33086 -5505 -8383 162333 116073 486717 386189 269910 20754 263528 325425 23635
15108 72780 -172566 251076 223470 156593 454211 199585 401726 58530 263449 209904
15098 209904 120247 162856 70993 402329 59149 -126230 30385 61203 293075 385588 122567
15086 -58845 301549 -84157 -46128 38786 -76463 110855 232243 -167249 271214 132123
15075 152973 224739 296506 100684 153691 306932 124092 239379 41148 -8828 177581 307306
15064 307306 84967 -32499 532635 78793 9191 -162166 246795 90112 329045 250585 -206008
15052 103382 126380 401304 566974 -318046 68710 219836 58187 30767 314590 121361
15041 341883 421653 401122 396095 370377 605225 261993 225150 44983 506176 353960 161176
15029B62323n1715K16812K60559j04916j45699J24362B49927L61550j53584B14558
15018D06956j9710J1781n5282J52222A52065J78889N6686J7823R8857P9321o2757
15007E20884j57625j14915J17708l0802L72348l31546L32725k32827p5367J6365
14997D16948A35225L35387k24929A16457L68981p9622K98925k76309A64785M28422
14987E93207r6513j4277j34102J56686j56528Q6120j21977L30277k38780J39435
14977E43548R458j00177L06772A58774J68236K28740k04474j35804K77447K38258
14967G31177l14427p2788J81669o9389j4397J05725A91552N10490B17822K43503
14957D61325j3168J30434j77190A82968K78737N24618D34177k9646q8600J11081
$$ plain form
15029 262323 210608 427420 687979 583063 437364 561726 249927 611477 457893 214558
15018 406956 387246 399027 343745 495967 152065 330954 387640 405463 504320 583641 520884
15007 520884 363259 248344 366052 335250 707598 376052 708777 475950 400583 416948
14997 416948 135225 470612 245683 116457 485438 405816 704741 428432 164785 593207
14987 593207 496694 482417 348315 505001 348473 434593 312616 642893 404113 543548
14977 543548 553006 452829 759601 158774 327010 555750 351276 215472 492919 731177
14967 731177 416750 343962 525631 456242 441845 547570 191552 702042 217822 461325
14957 461325 448157 578591 401401 182968 461705 986323 434177 404531 315931 427012
14947D27012o2650N9195B05896K92850k19345O0552K25544K10634C19515K17213
14937E36728O6903O7028j67493J80395k04188j19924L07355K06946J68596k06637
14927H35709J8393l24094K52460J45579j13623K53509k9391j29433L2544l9196
14917I02457j7875J31555Q0091j04868l4519K7121k68491L34357l31370J56948
14907H75406R990l10142K48184K60242k14189L4599K5636L0923j17742J37778
14897I80685m14079L99252D13494K00655j79872J51742O9745J03879j5120J96298
14887I40821j52495j74124L43752j09034k4778l15358M49798D49558J74410K54995
14877H78963o9188J7300k97459j60644M93780m17985L93176k99462J23009o3173
$$ plain form
14947 427012 364362 423557 205896 498746 279401 339953 565497 776131 319515 536728
14937 536728 603631 670659 503166 683561 479373 359449 666804 873750 1042346 835709
14927 835709 854102 530008 782468 928047 814424 1067933 1038542 909109 941653 902457
14917 902457 884582 1016137 1096228 991360 956841 983962 715471 1049828 718458 875406
14907 875406 885396 575254 823438 1083680 869491 904090 929726 960649 842907 980685
14897 980685 566606 965858 413494 614149 434277 586019 655764 759643 744523 940821
14887 940821 788326 614202 957954 848920 824142 508784 958582 449558 623968 878963
14877 878963 809775 827075 529616 368972 862752 444767 837943 538481 661490 598317
14867E98317J75787j26714j99948K76076J22783l41264J75063j78083l1229O8128
14857E38916k11392J71662J70268M1819l10251K58186m997k92684N42892n3748
14847H50671D23989J77751j13830j76511O29160k60371J20676o2014L3587j78415
14837E94022L61048j50370M5423l14155M01127j53261m5174k77146J53499O9299
14827F84312n4819M3877j26428M33870k00641n1627k02069N38582E01757K35696
14817G37453o364l22554M12300j38556J26283r0828J77462J54825D33578N4524
14807D88102P6395L34138N3655j12175n6648J03670l27093Q2866J10719k8515
14797G25114r2782q8081J61450k62944K85081j64426J56046j47173j34957j37911
$$ plain form
14867 598317 774104 647390 447442 723518 846301 505037 680100 502017 470788 538916
14857 538916 327524 499186 669454 711273 401022 659208 654211 361527 904419 850671
14847 850671 423989 601740 487910 311399 940559 680188 800864 738850 772437 594022
14837 594022 955070 804700 850123 535968 937095 783834 738660 461514 615013 684312
14827 684312 629493 673370 546942 980812 780171 728544 526475 1065057 501757 737453
14817 737453 731089 408535 820835 682279 808562 717734 895196 1050021 433578 488102
14807 488102 564497 898635 952290 840115 783467 887137 560044 642910 753629 725114
14797 725114 632332 544251 705701 442757 727838 563412 719458 572285 437328 299417
14787B99417L48873J31606l77586L69969j3066l50568J55952K40017q7154J33342
14777H50802C85962L05729k70276M92598k75935K98128D12805R3053N2424M21250
14767I79532k50534J08648j27481r1261j37701L04608Q2323r7527j94453K45011
14757H21165P1323J37906m80533L39161l77038J9960J34790j41637P8311M5734
14747F49142M41181r3202D85425J14463q3944O6333K72472N2727k68101N50785
14737A190160l22792l34404J18388M7938O1j56657O18373l47407j0384K65466
14727A068742k09477K83852j55099j67176K09766P4785P0524j4449O7394l60124
14717H68738R2547J10186j38928J00996M2571j54564j5353m1241m4577J79683
$$ plain form
14787 299417 648290 779896 402310 772279 759213 408645 564597 804614 717460 850802
14777 850802 385962 691691 421415 914013 638078 936206 412805 505858 558282 979532
14767 979532 728998 837646 710165 618904 481203 785811 868134 770607 576154 821165
14757 821165 892488 1030394 549861 889022 511984 531944 666734 525097 603408 649142
14747 649142 1090323 997121 485425 599888 515944 582277 854749 907476 639375 1190160
14737 1190160 867368 532964 651352 699290 699351 542694 1161067 813660 803276 1068742
14727 1068742 859265 1143117 988018 820842 1030608 1105393 1175917 1161468 1228862 868738
14717 868738 961285 1071471 932543 1033539 1076110 921546 906193 864952 820375 1000058
14707A000058k13143j47372P12254r0041n43807L15245J33825K11781l79418Q0225
14697A079607k21768J2969L39706l95112M7864M46349l17109J05475P1415l32436
14687H36960K10369L2288J65602N4682k98681J08090L76878n29603K10180k09576
14677I57189L54790j38101j20184r103J62005q318j73115k615L9247j56719n9148
14666H45928N7081j59886M49533l64512N23674k12078j77369j93379L96047j99091
14656I65948N1738J03778p9367J32157k7715j52303K04560k8844j49426l0707
14646I89819K21936k40874J71800M01489m48230K2960L41215j29782l07491p5438
14636I47404L47510r3345k85617K49966M1069K07228j24255Q4881r0773j94594
$$ plain form
14707 1000058 786915 639543 1351797 1261756 717949 1033194 1167019 1378800 999382 1079607
14697 1079607 857839 870808 1210514 815402 863266 1309615 992506 1097981 1169396 836960
14687 836960 1047329 1079617 1245219 1299901 1001220 1109310 1486188 956585 1166765 957189
14677 957189 1311979 1173878 1053694 1044591 1206596 1198278 1025163 1022548 1061795 905076 845928
14666 845928 903009 743123 1192656 828144 1351818 1139740 962371 768992 1165039 965948
14656 965948 1017686 1121464 1042097 1174254 1146539 994236 1198796 1169952 1020526 989819
14646 989819 1211755 970881 1142681 1544170 1095940 1118900 1460115 1330333 1022842 947404
14636 947404 1294914 1201569 915952 1165918 1206987 1414215 1289960 1374841 1284068 1089474
14626A089474P318L57501k54326K80490k18562R850o67p4067J58819Q0344q338
14615A427836j96101O8544k66698K67159r4136P7805q1916L7635J17573r1574
14605A266127j97426K80438k1995J81390r2222o1745q0871j47905M90243j66924
14595A449110K03334j24130K01359j75095L4656j43605L8824K58806k73325q2607
14585A387327K94548K36884k36999J5532m9708l8641P1524J42429J35706j26063
14575A832539l22141K19108J88593k51072P1932J11178K19942M5449R8675J40874
14565B355077k47867K32688M70884k81514l1273K45806j41134K07959P3154N56120
14555C439900J09071M56085N80977N08443P07543O96356J62076O39436j7919L55238
$$ plain form
14626 1089474 1096792 1454293 1199967 1480457 1261895 1271745 1271078 1197011 1355830 1436174 1427836
14615 1427836 1231735 1300279 1033581 1300740 1206604 1284409 1202493 1240128 1357701 1266127
14605 1266127 1068701 1349139 1327144 1508534 1416312 1354567 1273696 1125791 1616034 1449110
14595 1449110 1652444 1528314 1729673 1554578 1589234 1445629 1484453 1743259 1469934 1387327
14585 1387327 1681875 1918759 1681760 1697292 1647584 1608943 1680467 1822896 1958602 1832539
14575 1832539 1510398 1729506 1918099 1667027 1738959 1850137 2070079 2115528 2214203 2355077
14565 2355077 2107210 2339898 2810782 2529268 2497995 2743801 2602667 2810626 2883780 3439900
14555 3439900 3548971 4005056 4586033 5094476 5802019 6498375 6660451 7299887 7281968 7637206
14545G637206l88969k51777j80130m47115l40854j66367p0352K17511n43038L62297
14535E828412j46843J24773m47965L3657K66959q81316J86399J94943l50332m13757
14525D394930N7860l00597J23293n29016K51731m69869j11507j0123k979n8181
14515C345542j18549k22374N05420m22293M91632l50845J64642l02413q7027K59898
14505C263633k14219L60075o20096K92856K64942k46387k5398M3476K77509m16069
14495B980322L50316P9408l35029L78459q1251K35876J8974k80857k1266R8511
14485C423463k27876J12587J99290l43531L94596k83064P4814J77367J54689j63737
14475C518598L38096j51110k0934R7329P4359K20133j54926k6740k8312J66024
$$ plain form
14545 7637206 7248237 6996460 6816330 6369215 6028361 5861994 5791642 6009153 5466115 5828412
14535 5828412 5681569 5806342 5358377 5392034 5658993 4777677 4964076 5159019 4808687 4394930
14525 4394930 4452790 4152193 4275486 3746470 3998201 3528332 3416825 3406702 3403723 3345542
14515 3345542 3226993 3004619 3510039 3087746 3579378 3228533 3393175 3090762 3003735 3263633
14505 3263633 3049414 3409489 2789393 3082249 3347191 3100804 3075406 3118882 3396391 2980322
14495 2980322 3330638 3410046 3075017 3453476 3372225 3608101 3627075 3346218 3324952 3423463
14485 3423463 3195587 3308174 3507464 3163933 3558529 3275465 3350279 3527646 3682335 3518598
14475 3518598 3856694 3705584 3684650 3781979 3856338 4076471 3921545 3894805 3866493 4032517
14465D032517j18866m1322O18285j45012k72750O5475k58717M41700o5989Q0795
14455D336116J26116l60123N73925l07223M8402K11008R6319j30441J95060L5665
14445D824824K02345k02217P5096l7833L22203j77073L63064P1457j22131j2491
14435E307244J87482P412q6216J67034j1926M44477J94439l56443l6808K52077
14425F068772K8330K42353j61463K48951L38000L1423p2637J28730L0874K1613
14415F904946M05206j33817j32660M44152K33203j03533L41562k67610N83434
14406H274883k39872M7885K37914k4476N18488N5842l2217Q9272N49341j91514
14396I285546L33554j31994K29586J68673J62095j5764M44529l08117K35447M96007
$$ plain form
14465 4032517 3913651 3872329 4490614 4345602 4072852 4138327 3879610 4321310 4255321 4336116
14455 4336116 4462232 4102109 4676034 4368811 4417213 4628221 4724540 4594099 4789159 4824824
14445 4824824 5027169 4824952 4900048 4862215 5184418 5007345 5370409 5441866 5319735 5307244
14435 5307244 5494726 5502138 5415922 5582956 5571030 6015507 6209946 5853503 5816695 6068772
14425 6068772 6097102 6339455 6177992 6426943 6764943 6796366 6723729 6852459 6883333 6904946
14415 6904946 7310152 7176335 7043675 7487827 7721030 7617497 7959059 7691449 8274883
14406 8274883 8035011 8082896 8320810 8296334 8814822 8870664 8838447 8927719 9477060 9285546
14396 9285546 9619100 9487106 9716692 9885365 10047460 10031696 10476225 10168108 10403555 10899562
14386A0899562M6938L32049q7866M66890L9196J64868J97500J289L48742L80631
14376A2789799L27833N8095K22962L35222L34636j2491P17405q9072M37687K75798
14366A5397874M46182K67545j64428P20286M1136M99663O06938M18804K36467
14357A8470467M67790L61154M28481M49662N19006L24033P92111K46674O22862
14348B2682240N24032N67816p229J344365K58673M59569J164217L84710N23947
14339B7902340Q41696R66043O54638Q38916J031592P99742O43489J473277P62476
14330C5914209J289993J008913R97949J121970K103598P36913J532582J527876
14322D6234003J383618J485837K185059J360533J935807K168752J898246J898496
$$ plain form
14386 10899562 10946500 11278549 11190683 11657573 11696769 11861637 12059137 12060426 12409168 12789799
14376 12789799 13117632 13175727 13398689 13733911 14068547 14056056 14773461 14684389 15122076 15397874
14366 15397874 15844056 16111601 15947173 16667459 16708595 17208258 17815196 18234000 18470467
14357 18470467 18938257 19299411 19727892 20177554 20696560 21020593 21812704 22059378 22682240
14348 22682240 23206272 23774088 23766859 25111224 25369897 25829466 26993683 27378393 27902340
14339 27902340 28744036 29710079 30364717 31203633 32235225 33034967 33678456 35151733 35914209
14330 35914209 37204202 38213115 39211064 40333034 42436632 43173545 44706127 46234003
14322 46234003 47617621 49103458 51288517 52649050 54584857 56753609 58651855 60550351
14314F0550351K710535K170364K556181K484069L030976K866391L231262L307816
14306H2907945L310228L382158M330288M427706M096521M827581N203970N423687
14298A17910084N421977O146914O602148O717165P563075P874119Q577868Q865637
14290A75678987R831099J0165411J1167435J2062647J1799397J2277212J3028233
14283B56010421J2110415J3095531J3345908J4092081J2787967J1913749Q661719
14276C42017791K853975K950065l582930R30787J5437o630586m746479r878059
14268C23930001n165437o989905n832008j5423840o313104k858682k747013l129479
14260B75470533j896228k024794M284065K294281K032820l327705R78098m410398
$$ plain form
14314 60550351 63260886 65431250 67987431 70471500 73502476 76368867 79600129 82907945
14306 82907945 86218173 89600331 93930619 98358325 102454846 107282427 112486397 117910084
14298 117910084 123332061 129478975 136081123 142798288 150361363 158235482 166813350 175678987
14290 175678987 185510086 195675497 206842932 218905579 230704976 242982188 256010421
14283 256010421 268120836 281216367 294562275 308654356 321442323 333356072 342017791
14276 342017791 344871766 347821831 344238901 345169688 345185125 338554539 333808060 323930001
14268 323930001 318764564 311774659 305942651 290518811 284205707 281347025 278600012 275470533
14260 275470533 273574305 271549511 275833576 278127857 280160677 276832972 277811070 273400672
14252B73400672l964781j539139m795604k127580o971773p657801o182421n305520
14244B34856053p150210p979943p883633o755333n042379n299144n454232o146478
14236A83144701n843219n227097n208030n239333m445047m503310m427465l555606
14228A44695594m291056l387549l774217l588989l878254l450157l264801l087659
14220A15972912k170477k541875k922943l044823k578459k450717k500161k702380
14212I5061077j790184k411230j379936k093574j370699j465141k280231j378434
14204H0891648k316173j367223j892968j810578j320064j643977j088033j409597
14196F8043035j148765j532327j535562j327549r89580j694399j084469j258219
$$ plain form
14252 273400672 269435891 267896752 263101148 260973568 254001795 246343994 240161573 234856053
14244 234856053 227705843 219725900 211842267 205086934 200044555 194745411 189291179 183144701
14236 183144701 177301482 172074385 166866355 161627022 157181975 152678665 148251200 144695594
14228 144695594 140404538 137016989 133242772 129653783 125775529 122325372 119060571 115972912
14220 115972912 113802435 111260560 108337617 105292794 102714335 100263618 97763457 95061077
14212 95061077 93270893 90859663 89479727 87386153 86015454 84550313 82270082 80891648
14204 80891648 78575475 77208252 75315284 73504706 72184642 70540665 69452632 68043035
14196 68043035 66894270 65361943 63826381 62498832 61509252 59814853 58730384 57472165
14188E7472165j102393j491675j023256j270459o62743j321951m73823j117181
14180D9008684m68559j348313q79238p17825o20951j084883p46795q30325r19008
14171D1392787o85820o57390j155513k99082r19855l11418n18245p75884l75405
14162C5694175j200009l88920q13365k39294n75642p65857m81902k87551m03849
14153C0537786l42203n55994m62513n30824k23491o47168n54953k63427n64234
14144B6392979p12326j53084l53571J4993o16445k77742n27662O8863q77569m81970
14134B2476466n49160l66214P3048o31938j33203l31580l16116r27791K30094
14125A9523606j26319n82697k40675k22578j97525p11126j29129j7231k19862
$$ plain form
14188 57472165 56369772 54878097 53854841 52584382 51921639 50599688 50125865 49008684
14180 49008684 48540125 47191812 46312574 45594749 44973798 43888915 43142120 42311795 41392787
14171 41392787 40706967 40049577 38894064 38594982 37675127 37363709 36845464 36069580 35694175
14162 35694175 34494166 34105246 33291881 33052587 32476945 31711088 31229186 30941635 30537786
14153 30537786 30195583 29639589 29177076 28646252 28422761 27775593 27220640 26957213 26392979
14144 26392979 25680653 25527569 25173998 25188991 24572546 24294804 23767142 23836005 22958436 22476466
14134 22476466 21927306 21561092 21634140 21002202 20868999 20537419 20221303 19293512 19523606
14125 19523606 19397287 18814590 18573915 18351337 18153812 17442686 17313557 17296326 17076464
14116A7076464n77305l5558r2989j16118o48318p48051J6195O3192n78123m9461
14106A4309928P1530j60464k17676k97212j77873P5995k87359j15853l29191r5003
14096A2776822n62969j16503k5942m19812n18233m9266N924o89019r2228O868
14086A0315642l87503n69709K13297k52970j1144l01511l85445j44581k02146
14077H273930p9696m22096R509k968j34861k04010k4504K6751n14779j54855r1619
14066F680802L61316l6967p21206J27143m58214J91372m29262K55012m14426j16004
14056E439566K36535R557k32205k49134j13671k0755K24113k05787q3408p7893
14046D926918m9845m75134M37232l80051O6240j34698j71570L3950J25217k22795
$$ plain form
14116 17076464 16499159 16463601 16370612 16254494 15606176 14858125 14874320 14937512 14359389 14309928
14106 14309928 14381458 14220994 14003318 13706106 13528233 13604228 13316869 13201016 12871825 12776822
14096 12776822 12213853 12097350 12071408 11651596 11133363 11084097 11090021 10401002 10308774 10315642
14086 10315642 9928139 9358430 9571727 9318757 9307613 9006102 8620657 8476076 8273930
14077 8273930 8194234 7772138 7781647 7778679 7643818 7439808 7415304 7442055 6927276 6772421 6680802
14066 6680802 7042118 7005151 6283945 6411088 5952874 6144246 5714984 5969996 5555570 5439566
14056 5439566 5676101 5685658 5453453 5204319 5090648 5069893 5294006 5088219 5004811 4926918
14046 4926918 4877073 4401939 4839171 4459120 4525360 4390662 4219092 4253042 4378259 4155464
14036D155464k23217K22300k14040j89959M28377m33617j3037q1981j17182Q2194
14026C615302k76276L70727j11472k25185L0909K49810n90730R8948K57702j40001
14016C279734J97757l19203J39304J44057j55385m98198K64834K27673j75898
14007C104675J20802q5513J56707m53477N9449O773M8610k12059J48823O03121
13997C497911o68176M05902K95990K27586P18150L48226K30852J220224J59772
13988F436437P21107J00528R7492K48038J6445l94241o21207j90375m47235k14174
13978E752815R1931L45432o54924J22216k89548K99081N5716j9042j40824L806
13968E566659l32826j6842l63551l27087k53567J19800m59782J20677k20813n40340
$$ plain form
14036 4155464 3932247 4154547 3940507 3750548 4178925 3745308 3732271 3650290 3533108 3615302
14026 3615302 3339026 3709753 3598281 3373096 3404005 3653815 3063085 3162033 3419735 3279734
14016 3279734 3477491 3158288 3297592 3441649 3286264 2788066 3052900 3280573 3104675
14007 3104675 3225477 3139964 3296671 2843194 2902643 2909416 2958026 2745967 2894790 3497911
13997 3497911 2829735 3235637 3531627 3759213 4477363 4825589 5056441 6276665 6436437
13988 6436437 7157544 7258072 7355564 7603602 7620047 7225806 6604599 6414224 5966989 5752815
13978 5752815 5844746 6190178 5535254 5657470 5367922 5667003 5722719 5703677 5562853 5566659
13968 5566659 5233833 5216991 4853440 4526353 4272786 4392586 3932804 4053481 3832668 3292328
13958C292328Q2060n5508k78440J72278o8012k05019l884J03324L1210k33567
13948B836770J59394j83723m94554N13953k04213q2484Q3403l86266j49405M47851
13938B540726j26182o1821k3658M49719m48990J5760r4381L07391l78203J37922
13928B318283k53160l7029J57661J93551n04888L13874j43669k45317K45533n6562
13918A988277o6779k07053L03172L86969m15525n8162J06254k07626P9212K20255
13908B128994k69675J62838l94316J9989K6572J35413m425J95547k87054j88989
13898A524894k978J39203L50301k36643j46822J66278k52353r6301J58906q2658
13888A521827O8278k5182J05893m01176J19919J61923j14132K13692l70646L55135
$$ plain form
13958 3292328 3374388 3318880 3040440 3212718 3144706 2939687 2935803 3039127 3070337 2836770
13948 2836770 2996164 2812441 2317887 2831840 2627627 2545143 2628546 2242280 2092875 2540726
13938 2540726 2414544 2352723 2329065 2778784 2329794 2345554 2251173 2558564 2180361 2318283
13928 2318283 2065123 2028094 2185755 2379306 1874418 2188292 2044623 1799306 2044839 1988277
13918 1988277 1921498 1714445 2017617 2404586 1989061 1930899 2037153 1829527 1908739 2128994
13908 2128994 1859319 2022157 1627841 1647830 1674402 1809815 1805390 2000937 1713883 1524894
13898 1524894 1521916 1661119 2011420 1774777 1627955 1794233 1541880 1445579 1604485 1521827
13888 1521827 1590105 1564923 1670816 1269640 1389559 1551482 1437350 1651042 1280396 1635531
13878A635531k96840r4907J82911R4906k06902P2579j54641K24823P3984j72075
13868A359369L6965k30376k4860n7887J98876n0467j00850L32873k85314M97455
13858A675784m03112j57035k45591K87605J16909j66023K26209m86392M44500
13849A292854M6089j87533r8719J11350K98666m30951K81799j67506J38247j07572
13839A176724L71645o44019N0752Q3135j58055M23277k81627R9913k00515j630
13829I19600K1610O1235O9520j89073L73570j71782j35093K57751j72074k997
13819A032267j8929l3053P5211k27032K33206k42618J03383K90725l93718n6853
13809G62589J91863M0139l27906M35226j63778k66042M7111R1339Q1333k35239
$$ plain form
13878 1635531 1338691 1243784 1426695 1521601 1314699 1387278 1232637 1457460 1531444 1359369
13868 1359369 1396334 1165958 1141098 1083211 1282087 1231620 1130770 1463643 1178329 1675784
13858 1675784 1272672 1115637 870046 1157651 1274560 1108537 1334746 848354 1292854
13849 1292854 1338943 1151410 1052691 1164041 1462707 1031756 1313555 1146049 1284296 1176724
13839 1176724 1548369 904350 955102 1038237 880182 1303459 1021832 1121745 921230 919600
13829 919600 941210 1002445 1071965 882892 1256462 1084680 949587 1207338 1035264 1032267
13819 1032267 1013338 980285 1055496 828464 1061670 819052 922435 1213160 819442 762589
13809 762589 954452 994591 666685 1101911 938133 672091 719202 810541 891874 656635
13799F56635K21543K69484k38701L0565j78540J28440o2052J86890j59802l93564
13789D60898N45549M0166o3210j98305K6722M01002n23206L02647k12869J90605
13779I69999k73372J76273k57917L30157o3478j04861K69392E19865J23737L51125
13769I94727k93050k30422J71586j28453J94108J37835l8562P4890L8806C11819
13758E96001j46660q1426L89159k03974M7916L168K35624j18324k89070K62330
13748F94744K44189k30810K81874l93708J70462K26039B75923J96403L74622q8947
13738G58001k13977J81805j32090k12445K15891p653n4138l9194Q0954O1077p8806
13727E59425n2691L4377j82679K62070K0227k33632J94722j28341J70687J63612
$$ plain form
13799 656635 878178 1147662 908961 939526 760986 889426 827374 1014264 854462 460898
13789 460898 1006447 1046613 983403 785098 811820 1212822 689616 992263 779394 969999
13779 969999 696627 872900 614983 945140 881662 776801 1046193 519865 643602 994727
13769 994727 701677 471255 642841 514388 708496 846331 807769 882659 921465 311819
13758 596001 449341 367915 757074 553100 601016 604184 839808 721484 432414 694744
13748 694744 938933 708123 989997 596289 766751 992790 275923 472326 846948 758001
13738 758001 544024 725829 593739 381294 597185 589532 535394 496200 577154 638231 559425
13727 559425 506734 541111 358432 620502 640729 407097 601819 473478 644165 807777
13717H07777B33624K62808K1315K67133k28226j95316K98263k7716j55578J40434
13707F16741J63472m4206j38588Q522q1250j79439J26587O0094m5735j95243K83226
13696E74181R749B54623J40204K65166k13393J46673j9972r1388K68991k60845
13686D90059K24945j75147q2102r8762L41861M2171J07946l67935R52K27559L59049
13675A070596E35058j78747J35298J87438A60035L03138J38756j6554J94471B57659
13664C64782J69793K1660J23728J03715k98098j08933J33437j59164I6738N31739
13654F28477m1894B45447M39882k00003l2735j15505j22838K80474k05376J39356
13644D28702A47755J92046J18864A63953J24601M26845k49635B22615J77463J03191
$$ plain form
13717 807777 233624 496432 517747 784880 556654 361338 659601 631885 476307 616741
13707 616741 780213 736007 597419 605941 524691 345252 471839 531933 486198 290955 574181
13696 574181 583930 254623 394827 659993 446600 593273 573301 481913 750904 490059
13686 490059 715004 539857 457755 358993 700854 743025 850971 483036 483988 711547 1070596
13675 1070596 535058 356311 491609 679047 160035 463173 601929 585375 779846 257659
13664 364782 534575 556235 679963 783678 485580 376647 510084 350920 96738 628477
13654 628477 586583 245447 685329 485326 452591 337086 214248 494722 289346 428702
13644 428702 147755 339801 458665 163953 288554 715399 465764 222615 400078 503269
13634E03269k50804N13080j73681k05286j3504J81490J12093k03536q287k05962
13624B48872j04431K64682J27661B04514n9652M81716j79980l6517l8339J41337
13614E13079k39812M322J23867K56152j74672L4215L1887k6388n7567A63835J20912
13603B84747D3928O87851j33927k02856K44268A02509L13295K22899j72450q8893
13593C77360j31641J43377r3983D2941L90547J7153N0483F3575L33940d1118E71882
13581E88017j21729j46340p0197J92862D0084N99892A81598K62214A07022N3187
13571A60209K63990C0469K10419p3602P0116l2023R0282N0127J28015j41354g9739
13559C01912R6886j62780N23685k90318B16109K97685K0151B32336E9325O7358
$$ plain form
13634 503269 252465 765545 591864 386578 373074 554564 666657 463121 454834 248872
13624 248872 144441 409123 536784 204514 144862 626578 446598 410081 371742 513079
13614 513079 273267 277589 401456 657608 482936 517151 549038 522650 465083 163835 284747
13603 284747 43928 731779 597852 394996 639264 102509 415804 638703 466253 377360
13593 377360 245719 389096 295113 42941 433488 450641 501124 63575 397515 -41118 571882
13581 588017 466288 319948 249751 442613 40084 639976 181598 443812 107022 160209
13571 160209 424199 30469 240888 167286 237402 205379 295661 345788 473803 332449 -79739
13559 301912 398798 236018 759703 469385 216109 513794 533945 232336 59325 126683
13549A26683P7368p6188J41447o6288J51677A52149K10177P4175H7992L53199
13539D41191j11377j38890H8596P72431A38380K27257C8459J67201J87826A94858
13528A29753j2376M4595L51926k56374q7941P3547J83673k07586j9662I7700L92338
13517D90038A41062J65502A46518L39414j31412j03172n5266J010K7385J08199
13507C32676F4917J81897J69668R145j24355L46181A47694M1094J86918r0263
13497B85443L983h9080C76400I5569J17705R9994m6083j06245J39197j16026E4016
13485B67305l4036L2577p9046B019M78823J57481G1035M1577l5781L48677J79917
13474F05425A24685J42586j22204K4048P0035m555K561N1054K49374A25960K4681
$$ plain form
13549 126683 204051 127863 269310 203022 354699 152149 362326 436501 87992 441191
13539 441191 329814 190924 88596 861027 138380 365637 38459 205660 393486 194858
13528 129753 117377 161972 513898 257524 169583 243130 426803 219217 199555 97700 490038
13517 490038 141062 306564 146518 485932 354520 251348 196082 197092 224477 332676
13507 332676 64917 246814 416482 425627 301272 647453 147694 188788 375706 285443
13497 285443 289426 -89080 376400 95569 213274 313268 267185 160940 300137 184111 54016
13485 267305 233269 265846 186800 2019 480842 638323 71035 112612 76831 425508 605425
13474 605425 124685 267271 145067 169115 239150 234595 237156 288210 537584 125960 150641
13463A50641L19152A03201J26249j321q2999i6626A45997O841n7131m7442g6054
13451A46335P3921c03420A61812K3123l0066a74456D5086K26521J08005a9992
13440B7015J37564l056J07139J58220a39185N9831C48261I398J63913R7613P2189
13429C43113a6676B73039M1673G7756h1255j52173b940E49024A7171a84928B13396
13417B60468J73734j53631O5359l3398J62844P327g2312D9405J81742M877a52966
13405B07454L4635j3436a04962A6896L77328p0343o087d8115A62308d4976B3005
13393D20010A97979J10138E4749f7258A91602O5138j00329J07279K76471A96637
13382B29175l4456c5716G6333M5471m0359J60161J97259F2552b18385C23194O6044
$$ plain form
13463 150641 469793 103201 229450 228129 145130 -96626 145997 152838 95707 48265 -76054
13451 146335 220256 -303420 161812 184935 154869 -174456 45086 271607 379612 -19992
13440 27015 164579 161523 268662 426882 -139185 -79354 348261 9398 173311 270924 343113
13429 343113 -16676 273039 314712 77756 -81255 -233428 -2940 549024 17171 -184928 213396
13417 260468 434202 280571 345930 312532 475376 482703 -72312 49405 231147 236024 -152966
13405 207454 242089 228653 -104962 16896 394224 323881 317794 -48115 162308 -44976 23005
13393 420010 197979 308117 54749 -67258 191602 256740 156411 263690 540161 196637
13382 229175 194719 -35716 76333 121804 81445 241606 438865 62552 -218385 323194 389238
13371C89238A31768M7088K2968F0081J26135R742I4094J73500b3305A29127L52814
13360D81941r1909O079K8041A64033m0133L04901j38698j17918k4141a43881B7402
13348B19045M6837a22348C65626A24085M0183J50606J16913j63842j0687j6501
13338B40757q3577K90374R7647l8821j99912J02873A8686K13617F7806R8251o499
13327A59558G2064e7043C62458l6354r0252J20340l5821a17096B61009q3636J60918
13316C38291L14817A22631Q6395k0918Q6460k2962K98186B45843m9172p6157N7894
13305A78408J22639J46000B05286o0329k1838J65233N2393J69740j23596j04141
13295B82748c1257A03488C7102a46590A04235M0887a3737l0202B26073L5431A09024
$$ plain form
13371 389238 131768 178856 201824 60081 186216 195958 94094 267594 -23305 129127 481941
13360 481941 390032 396111 424152 164033 123900 428801 290103 172185 148044 -143881 27402
13348 219045 265882 -122348 365626 124085 164268 314874 431787 267945 257258 240757
13338 240757 157180 447554 545201 506380 306468 409341 18686 232303 67806 166057 159558
13327 159558 72064 -57043 362458 326104 235852 356192 320371 -117096 261009 177373 338291
13316 338291 653108 122631 209026 188108 274568 251606 549792 245843 196671 120514 178408
13305 178408 301047 447047 205286 144957 123119 288352 340745 510485 386889 282748
13295 282748 -31257 103488 37102 -146590 104235 145122 -13737 -43939 226073 261504 109024
13283H1459K20421j36085N1757G1640L16237o0643M6755a13435B71193j30603
13273A40590C793K0230H619M84258j19811C4941K81166k4582A33470a34946G1633
13261a68434A74261a96842J3997C6262K37303q2497b02385I3181K90120A68398
13250a07891A33558i6980A77181K75996B23484L7710j7433a7849I7107L49731
13240D46838j39418O960A21057N8055g8693I7382j8220f9849H2697g5661K5301
13229e0360D10602A8652C375P6401a04246C57534A72297K19304I687L8835K22097
13218B70619I6783D5333a30347F0089R6651d088H9818K49429j65100D8755B1383
13206B8339h1800A87625j5362a65890G9799K74513M2323A52696b07084b0277D9945
$$ plain form
13283 81459 301880 165795 217552 71640 387877 327234 373989 -113435 271193 140590
13273 140590 3793 24023 8619 492877 373066 34941 316107 291525 133470 -134946 71633
13261 -168434 174261 -196842 -182845 36262 273565 191068 -202385 93181 383301 168398
13250 -107891 133558 -96980 177181 453177 223484 261194 243761 -17849 97107 446838
13240 446838 307420 314380 121057 179112 -78693 97382 79162 -69849 82697 -75661 -50360
13229 -50360 410602 18652 3375 79776 -104246 357534 172297 391601 9687 48522 270619
13218 270619 96783 45333 -130347 60089 156740 -4088 89818 339247 174147 48755 21383
13206 28339 -81800 187625 172263 -165890 79799 354312 396635 152696 -207084 -20277 49945
13194A84496E4505h4783Q729H7154P2779J19827P5174a90026E7550b32634C21355
13182B50963F6298R7875c93955E39838d8193E4175l277J296B4288Q521J80158
13171B12967a54213A68922K2753h7746C4086a15993L8003C42231A62014a8835
13160C28691j47687l6847a65214e2375A11359L6610a70554f6108o5199F4865a73484
13148a52524A93052e2493j3536j15499A02689a40459A62740P1996r2824n187a19017
13136C69249e2542I0014J22446c4940n1958C2333P4820a86413A79414k836J88182
13125C64760A27473f4312B75408g4248B8520J01203b01690K7147A56870j7111
13115A39759a51224D22944b09235A91981h2101A76239a57925m1544A18089L6723
$$ plain form
13194 184496 54505 -84783 -76054 87154 159933 279760 354934 -190026 57550 -232634 321355
13182 250963 66298 164173 -393955 539838 -48193 54175 50898 52194 24288 32809 212967
13171 212967 -154213 168922 191675 -87746 34086 -115993 -77990 342231 162014 -18835
13160 328691 181004 144157 -165214 -52375 111359 147969 -170554 -66108 -131307 64865 -173484
13148 -152524 193052 -52493 -66029 -181528 102689 -140459 162740 234736 141912 136725 -119017
13136 369249 -52542 90014 212460 -34940 -86898 32333 107153 -186413 179414 176578 364760
13125 364760 127473 -64312 275408 -74248 28520 129723 -201690 -174543 156870 139759
13115 139759 -151224 422944 -209235 191981 -82101 176239 -157925 -199469 118089 154812
13105A54812B273R9077O049A1794K93219q4274J06294A40037b5856o4765R357
13094h1264a2914H8041m3989a31622D9646c13998E1840K16695F3374J57990a839
13082c4407n0380B57214j04007M319p873L07046a62921a5089B68082j30643g4057
13070d7593m0719A02261L22445j02159c5196j94615A49348B2530q437J05065a1532
13058B32478b07896a4171A79311G0603a22466C01669A18484J05740n2860b65886
13047i3136A9006J15811J33557h9291j2833E5477J93167A11758M4091e2701j45691
13036a98392F1588a56017A30336n2256l8176a74044E3017a07658B70355F0177
13025a67350K6229E4850R4597a22495D03369D3842N8242O8616H0972a02337G6068
$$ plain form
13105 154812 2273 101350 107399 11794 305013 220739 327033 140037 -25856 -90621 -81264
13094 -81264 -12914 88041 44052 -131622 49646 -313998 51840 268535 63374 221364 -1839
13082 -34407 -84787 257214 153207 157526 149653 456699 -162921 -15089 268082 137439 -74057
13070 -47593 -88312 102261 424706 322547 -35196 -229811 149348 22530 14093 119158 -11532
13058 232478 -207896 -14171 179311 70603 -122466 301669 118484 224224 171364 -265886
13047 -93136 19006 134817 268374 -89291 -102124 55477 248644 111758 155849 -52701 -198392
13036 -198392 61588 -156017 130336 78080 39904 -174044 53017 -107658 270355 60177
13025 -167350 -141121 54850 149447 -122495 403369 43842 102084 170700 80972 -102337 76068
13013A01478h2691D2335a59568A05826l6398j7355a47175B27398r1883d9188j10698
13002a59886M4485A26231f8791O496C30276b4520C01188h8011L289C88837g809
12990a50939L9378K1236C38952B08e9197A98230e0670E2062c3259k32680c2456
12978E6903N9409c8598j01782D35777C6750c4241L474A18735b07347f1236A73592
12966A09953a30586j74947J08475H9357i2254A49460R579g0561l3932G8955R3165
12955A72120K19780A347K54953r0427E3851N3493a2704o6512A14325M7314f6524
12943A54736n5999a03620H6870C1090a86680i2477G9860i3302B41848a18017P013
12932a11004A04386d535A28480L71757e7235E6060f6599C16809C7656a00706M8796
$$ plain form
13013 101478 -82691 42335 -159568 105826 69428 52073 -147175 227398 135515 -49188 -159886
13002 -159886 -115401 126231 -68791 -62295 330276 -24520 301188 -88011 -84722 388837 -7809
12990 -150939 -111561 -90325 338952 208 -59197 198230 -50670 52062 -33259 -265939 -32456
12978 56903 116312 -38598 -140380 435777 36750 -34241 -30767 118735 -207347 -61236 173592
12966 109953 -130586 -305533 -197058 89357 -92254 149460 159039 -70561 -104493 78955 172120
12955 172120 391900 1347 256300 165873 53851 107344 -12704 -79216 114325 161639 -66524
12943 154736 98737 -103620 86870 31090 -186680 -92477 79860 -93302 241848 -118017 -111004
12932 -111004 104386 -4535 128480 500237 -57235 56060 -66599 316809 37656 -100706 -51910
12921e1910j90141A53567h4450C69681c9943C5616a84931C06223o2718r6139d9526
12909h9091h586k95827R0392C94842A76811d8274B03631p6662M6661d3240C85477
12897A15902J71608a88031E22502A62397b3789m0972j0464k5967E3925J55270
12887B09195J15005A43331a76717M3719l1310e4527D9512a33490a8415p9553j8284
12876a16252e1822o7277C4270b6345l24943f5627C14714a55332A07263K16847
12866C24110r6763i8173I6359B1116D867a25489N1478A78223J46432a41430A31255
12854d0608G5797a17282A17665K47402A51769K5658a36916a2947m49457B9060
12843a61588g3720a3004A48471a67404K7939o5633b740A09293O8234n7514A162
$$ plain form
12921 -51910 -242051 153567 -84450 369681 -39943 35616 -184931 306223 243505 147366 -49526
12909 -89091 -8586 -304413 -214021 394842 176811 -48274 203631 126969 173630 -43240 385477
12897 115902 287510 -188031 522502 162397 -23789 -64761 -75225 -101192 53925 209195
12887 209195 324200 143331 -176717 -132998 -164308 -54527 49512 -133490 -18415 -97968 -116252
12876 -116252 -51822 -119099 34270 -26345 -351288 -65627 314714 -155332 107263 324110
12866 324110 227347 -98173 96359 21116 4867 -125489 -74011 178223 324655 -141430 131255
12854 -40608 75797 -117282 117665 365067 151769 177427 -136916 -12947 -462404 29060
12843 -161588 -73720 -13004 148471 -167404 -139465 -205098 -2740 109293 177527 120013 1162
12831A3345d9848A0351J03800b91570P3398R4615I9783a15481k55611i6151c111
12819h0756A77863d820A05872e2043G6331J15623a0819j10419e669H8132d38886
12807E5913g1566A48152J51247i7847j56669D9086L63014A96308c08855g5357
12796C58017j14606i6931p898k86341C66334j40871b29695B27623a23833j63404
12786b87237A34291F6390a71317G8358a04322D06759j58761a0165F3187k1598
12776D1589b24593a03185A91597H5720j9397f018H1852Q6323J69245c09619b5926
12764b2723m3659b038k65295L6847k8454f7397J8735C96791a17549C80882a22905
12752D4605b39878n7396a04140F7505l3737a99566G0749a73886j89503A27873
$$ plain form
12831 13345 -49848 10351 114151 -291570 -218172 -123557 99783 -115481 -371092 -96151 -3111
12819 -80756 177863 -4820 105872 -52043 76331 191954 -10819 -121238 -5669 88132 -438886
12807 55913 -71566 148152 299399 -97847 -254516 49086 412100 196308 -308855 -75357
12796 358017 243411 -96931 -104829 -391170 366334 225463 -229695 227623 -123833 -287237
12786 -287237 134291 66390 -171317 78358 -104322 406759 247998 -10165 63187 41589
12776 41589 -224593 -103185 191597 85720 66323 -6018 81852 168175 337420 -309619 -25926
12764 -22723 -66382 -2038 -267333 -230486 -258940 -67397 -48662 396791 -117549 380882 -122905
12752 44605 -239878 -297274 -104140 67505 33768 -199566 70749 -173886 -363389 127873
12741a85312b9460k33913A43369M9417b18799O7880p2908A62365a22110L4117
12731h7993m1894E9386a20667q8126d5152K2078E7047a39608k51557B7714a05315
12719D761J11244c3693a2867G5068l1536L9506h1813L949j289j47300B51367H8029
12706B1935J39559l6h6759d796D0737b06071D7828L34219a70677A7771R714M6711
12694G4196K52732a54374a5915A26221K09790k2161a64873d9053f217j47917q023
12683a62157C15182I8789a12752A1328J61021l0998h2645B20976g5828A76635
12672a6809A66879b2516A48583G937d9331C2676a08205C10196D0913j8498M3072
12661F5487L14863I8710O5497b39332G8121h3798j708A57075e6492B15399A9128
$$ plain form
12741 -185312 -29460 -263373 143369 192786 -218799 -150919 -223827 162365 -122110 -87993
12731 -87993 -129887 59386 -120667 -208793 -45152 -23074 57047 -139608 -391165 27714 -105315
12719 4761 116005 -33693 -12867 75068 43532 83038 -81813 -77864 -79153 -226453 251367 88029
12706 21935 161494 161458 -86759 -4796 40737 -206071 47828 382047 -170677 17771 27485 74196
12694 74196 326928 -154374 -15915 126221 336011 313850 -164873 -49053 -6217 -154134 -162157
12683 -162157 315182 98789 -112752 11328 172349 141351 -82645 220976 -75828 176635
12672 -16809 166879 -22516 148583 7937 -49331 32676 -108205 310196 40913 22415 65487
12661 65487 380350 98710 164207 -239332 78121 -83798 -85506 157075 -56492 215399 19128
12649G0536J24191C6695K20250K9766o5072c7440A28217a39449A95169a26618
12638b106A40599N2776l4888a42854A05486J35704b7032j53969A83589H2844J164
12627H4008C0636J77122a04595D3568a75634C13877A09697a50997B02253R2166
12617B94419D9816a036B31160G9173M58016k42669c7308C9564i2561A45382O5116
12606B10498J93740I6277J00512Q5542J04110a83637C029i0361L5054B9084b273
12594A54723L4731G3907d0338n5470B98545a00036B00348L2515b39891r95P7455
12583a63431b7230k9474B31916b11538C95250b65946I3322h9I3288b44495B18826
12571h9548p0438n6490B0429a50327j74392a47773B65276c0443B1997a39850k32573
$$ plain form
12649 70536 194727 36695 256945 286711 221639 -37440 128217 -139449 195169 -126618
12638 -2106 140599 193375 158487 -142854 105486 241190 -27032 -181001 183589 82844 84008
12627 84008 30636 207758 -104595 43568 -175634 313877 109697 -150997 202253 294419
12617 294419 49816 -1036 231160 79173 537189 294520 -37308 39564 -92561 145382 210498
12606 210498 404238 96277 196789 282331 386441 -183637 3029 -90361 -55307 29084 -2273
12594 154723 189454 73907 -40338 -95808 298545 -100036 200348 232863 -239891 -240886 -163431
12583 -163431 -27230 -56704 231916 -211538 395250 -265946 93322 -89 93288 -244495 218826
12571 -89548 -159986 -216476 20429 -150327 -324719 -147773 265276 -30443 21997 -139850 -372423
12560c72423a60776A42424a10852A47443D472K53815a20513j48810D6174g4628
12549c3849l8779C810M1371J56422d69002a8681k95760J46641o8592A55918a16952
12537f2048B239K76676I1646O185a05985A42959a30173p6046R4805l9816m6970
12526a98200B20075f2798F4960e4413A1225a88953A48780J7689b03968A66272
12515a38351A0138M7605M52012c41141a3171E0813K52a15046J3351D08154j11912
12504B96242j21071i3223D5927a17362D9211J69662J7174H6688R0280n7688a38114
12492e7228j1852k33297j40736a08753r3839F2848c04544A96004r7003p575b7223
12480c9256A04215l9795d32492c8812H0152J05213M1765j0872N1312a42972f9739
$$ plain form
12560 -372423 -160776 142424 -110852 147443 4472 258287 -120513 -269323 46174 -74628
12549 -33849 -72628 3810 45181 201603 -469002 -18681 -314441 -167800 -236392 155918 -116952
12537 -62048 2239 278915 91646 97831 -105985 142959 -130173 -206219 -111414 -151230 -198200
12526 -198200 220075 -62798 64960 -54413 11225 -188953 148780 166469 -203968 166272
12515 -138351 10138 57743 509755 -341141 -13171 50813 51065 -115046 -101695 408154 296242
12504 296242 175171 -93223 45927 -117362 49211 218873 236047 86688 176968 119280 -138114
12492 -57228 -69080 -302377 -443113 -108753 -202592 62848 -304544 196004 99001 91426 -27223
12480 -39256 104215 64420 -432492 -38812 80152 185365 227130 216258 267570 -142972 -69739
12468B43983a39916C66167a02476k3261M191E2826k3615a00429C53389E2291b82971
12456b8007B71680a95815e156l5380C7587c4166d105A42935a20027b3643A19430
12444C70759g6909p6213b6279A39842o6963c3906A67285b1190j22080G9845C1954
12432g0053C1210L4432N7445c2465A40463b15088C87425b9764D9620a13048A72879
12420A11238a28486a875q4847D0059i0816A310f9573c0451B31603d4561k38403
12409b82964c151q6641j14922R872A93103i7173A38257b72620R3844k14967C21778
12397B03871a27085A37583m5168J06333d30677D7126H486a02734A65265h9719
12386H1211l4816J23423o6537B3030a21288d8432C779J51689G7302a96180A38941
$$ plain form
12468 243983 -139916 366167 -102476 -125737 -121546 52826 29211 -100429 353389 52291 -282971
12456 -28007 271680 -195815 -5156 -40536 37587 -34166 -4105 142935 -120027 -23643 119430
12444 370759 -76909 -153122 -26279 139842 72879 -33906 167285 -21190 -143270 79845 31954
12432 -70053 31210 65642 123087 -32465 140463 -215088 387425 -29764 49620 -113048 172879
12420 111238 -128486 -1875 -86722 40059 -90816 1310 -69573 -30451 231603 -44561 -282964
12409 -282964 -3151 -89792 -204714 -194842 193103 -97173 138257 -272620 -178776 -393743 321778
12397 203871 -127085 137583 92415 198748 -430677 47126 8486 -102734 165265 -89719
12386 81211 46395 169818 103281 23030 -121288 -48432 3779 155468 77302 -196180 138941
12374e7390b3327B66019f4000E324J34479D2956K6080g4634j35103F9136J78782
12363B47918a14566D46519G9136O2548D3495Q9610c3182q4062n1609m0010B8022
12351c7602k84970h2800o2017C7058M52307a20580r4607H2619e25436c8477j0876
12340d9353j43882B25521a23236j72933J03049e103H0948j9194J04231C6557J41479
12329A78036i3226A42911J1955L59774E5997P2131N0001D0963J03486J39377a21664
12317B95029A36978N3731C4177L31394b38102p132B95111G6647k202R7959c48095
12305a17622C5715J57473r0071f4562A41548a87704h8011n7590a8538m3192A23908
12293a06531n7026G4524J08735J14639b87483B08299i2195D29523e1833l7426
$$ plain form
12374 -57390 -23327 266019 -64000 5324 139803 42956 69036 -74634 -209737 69136 247918
12363 247918 -114566 446519 79136 141684 43495 133105 -33182 -117244 -168853 -208863 28022
12351 -37602 -322572 -82800 -144817 37058 489365 -120580 -215187 82619 -525436 -38477 -49353
12340 -49353 -193235 225521 -123236 -296169 -193120 -5103 80948 61754 165985 36557 178036
12329 178036 -93226 142911 154866 514640 55997 128128 178129 40963 144449 283826 -121664
12317 295029 136978 190709 34177 365571 -238102 -245234 295111 76647 74445 172404 -348095
12305 -117622 35715 193188 103117 -64562 141548 -187704 -88011 -145601 -18538 -61730 123908
12293 -106531 -163557 74524 183259 297898 -287483 208299 -92195 429523 -51833 -89259
12283h9259K6738A74257j1772m5301a25715a8205k28560D20110A00103a49359
12272b49002D02173l4014A49077J86685F0473J8062J06209J27427A39446M41852
12262E81298A95672a73825D8110e0218B86172M6169k4438D903R3819B3960e9738
12250B19410J02419m5221J3879C8051K1708L33078D7617a08891A24643K3611J40254
12239B88508F1282c2861D86105a1058r0345j73098J32057H2332d2624A31639c2111
12227C51649E9740J62244J69077h589A82897J98715G6098b3785o8467F2618J16447
12216A79065D7391h5815B82386r8870p299p6141m4197i2176A69381K9916f427
12204C26765J6574H4366j8969J1161a02289A85813j0369m9762g6423a3750C30705
$$ plain form
12283 -89259 -62521 174257 162485 117184 -125715 -18205 -246765 420110 100103 -149359
12272 -249002 402173 368159 149077 335762 60473 78535 184744 312171 139446 581298
12262 581298 195672 -173825 48110 -50218 286172 332341 307903 4903 98722 23960 -59738
12250 219410 321829 276608 290487 38051 59759 392837 47617 -108891 124643 148254 288508
12239 288508 61282 -32861 486105 -11058 -101403 -274501 -142444 82332 -42624 131639 -32111
12227 351649 59740 221984 391061 -8589 182897 381612 76098 -23785 -92252 62618 179065
12216 179065 47391 -85815 282386 183516 176217 100076 55879 -92176 169381 199297 -6427
12204 326765 343339 84366 65397 76558 -102289 185813 175444 125682 -76423 -13750 330705
12192B3974J45548j6747m4703Q4124R599J25190J30836h313q3297E2794e0035
12180C0547K58479J63927j94192d5987A66878j3490K4309a04597B0687K2209K33759
12169B76655O1046j20737q9760J34505I7714K55983K0267g6619A7608i6446B82467
12157h531A82095L07676A89388L22885e2817P311B81389j36868M2389j8746C1286
12145G3504P4631O8084b37718m6706a8250A67193a06818l8882C0451J20030E7475
12133A25557R1871J86709j01808a16383C00804j45957J57177c6006a5806A17393
12122B97612a12392j13967E03379H3660M68043A61306F9113j1504K37824L8259
12112C33692J5697b16494D46885A16606m157l6962P5111J32087J28625a95546
$$ plain form
12192 23974 169522 152775 108072 192196 201795 326985 457821 -8313 -91610 52794 -50035
12180 30547 289026 452953 258761 -45987 166878 153388 177697 -104597 20687 42896 276655
12169 276655 337701 216964 127204 261709 97714 353697 373964 -76619 17608 -96446 282467
12157 -8531 182095 489771 189388 512273 -52817 -45506 281389 144521 186910 168164 31286
12145 73504 148135 216219 -237718 -284424 -18250 167193 -106818 -145700 30451 150481 57475
12133 125557 217428 404137 302329 -116383 300804 154847 312024 -36006 -15806 117393
12122 297612 -112392 -226359 503379 83660 551703 161306 69113 57609 295433 333692
12112 333692 349389 -216494 446885 116606 112449 75487 150598 282685 411310 -195546
12101A55117a48720C3896J32548d01555A01802f1569c0636C37263r8551f907j2946
12090a9853k86438C53458b11006I9570a45880K7865B71936A19286K09355J83321
12080E11962A05885E1067a7129B31157a74342G4885L91838k12528f9221j57141
12070b26362G3412J90660G4669Q2358O7453J35235b1495B23037J16912j45860
12060A94089D642J144b33625B18243I8514B0613P9255J3594d6232J4357A69154
12048B6633a0227A11188b5223F1509P5786K38389D6997a60286D8436e7023C86395
12036A59816b41906a05683E8455L7031b41402A31737F4236R685l4527J92339D0843
12024A25754b6680m5159k87176G9002b5498I1307a27180A98198l0799b92679h14
$$ plain form
12101 155117 -148720 33896 166444 -401555 101802 -61569 -30636 337263 238712 -6907 -19853
12090 -19853 -306291 353458 -211006 99570 -145880 -118015 271936 119286 328641 511962
12080 511962 105885 51067 -17129 231157 -174342 74885 466723 254195 -69221 -226362
12070 -226362 73412 264072 74669 157027 224480 359715 -21495 223037 339949 194089
12060 194089 4642 5786 -233625 218243 98514 20613 99868 113462 -46232 -31875 169154
12048 26633 -10227 111188 -25223 61509 137295 375684 46997 -160286 48436 -57023 386395
12036 159816 -241906 -105683 58455 95486 -241402 131737 64236 73921 39394 231733 40843
12024 125754 -26680 -71839 -359015 79002 -25498 91307 -127180 198198 167399 -292679 -814
12012A53581E8304Q0793c9112B05332e22285C30J48998J29280b98658B92270A2971
12000B39016m759b35538g4448k79423F9440a90739Q1038F7394b56791F5433d1525
11988c2578j15362I9016i5450M784d1752j58473d2585j45496N6086j5555q3314
11977b30864a5143A6471K00925a07726o6708O3635j05856e1547J0696j22930a9478
11965a14308N6598B66001h629j53864D5113J93421c45847A14029l2211b51477
11954A27807a24662j21805R9003b2355j41025f4334B18621I6760A3066L0110b42172
11942a561A2022c31436C6539O4723C8717g9922B81808C8213b731C94559D33i1932
11929a86979F0555b37551d7383A12714j4994O3574i6659j472k7331I1071b6935
$$ plain form
12012 153581 58304 139097 -39112 205332 -522285 330 149328 278608 -298658 292270 12971
12000 239016 234257 -235538 -74448 -353871 69440 -190739 -109701 67394 -256791 65433 -41525
11988 -32578 -147940 99016 -95450 -90666 -41752 -200225 -42585 -188081 -131995 -147550 -230864
11977 -230864 -15143 16471 217396 -107726 -174434 -110799 -216655 -51547 -40851 -163781 -19478
11965 -114308 -57710 266001 -8629 -162493 45113 238534 -345847 114029 81818 -251477
11954 127807 -124662 -246467 -147464 -22355 -163380 -64334 218621 96760 13066 43176 -242172
11942 -1561 12022 -331436 36539 101262 38717 -79922 281808 38213 -2731 394559 433 -91932
11929 -186979 60555 -237551 -47383 112714 97720 161294 -96659 -98131 -125462 91071 -26935
11917F8637e629r4425I9275b4703B61660b54610E1947M8126a6918B05207F7166
11905G3234k6049c0576m5856r5842C27346d37834d0236j08657O771A67027c343
11893f5738B737N4222K9863k573M9822l2799h8977j3963B05300r1458c32133f3019
11880c36995a44483K655D23777g8283A9905J24472f8426B34237b38951O4599A00814
11868a23831p8139F5071b67718f6426j47302q719A95598I5774M0140e6611j3147
11857f9758J3274j15280A11180O7382g0343l03818A07093b84035J17108A80647
11846h322B42209e7064B0571G004b9096k12621C3420P5784f4437k09679J18585
11835a55531B1801b06949A63496g1613B02710A8747d7726A10558a99921C01030
$$ plain form
11917 68637 -5629 -100054 99275 -24703 261660 -254610 51947 100073 -16918 205207 67166
11905 73234 47185 -30576 -76432 -172274 327346 -437834 -40236 -148893 -142122 167027 -3343
11893 -65738 2737 56959 86822 84249 134071 101272 -88977 -102940 205300 113842 -332133 -63019
11880 -336995 -144483 -141828 423777 -78283 19905 144377 -68426 234237 -238951 -174352 100814
11868 -123831 -201970 65071 -267718 -66426 -213728 -222447 195598 95774 135914 -56611 -69758
11857 -69758 -56484 -171764 111180 178562 -70343 -374161 107093 -284035 -166927 180647
11846 -8322 242209 -57064 20571 7004 -29096 -241717 33420 109204 -64437 -274116 -155531
11835 -155531 21801 -206949 163496 -71613 202710 18747 -47726 110558 -199921 301030
11824a56477l2614d9495B09724b79203J37585q00c9763l19668A6063b46435A75327
11812B50644b20856C884b37469h2066K2914I8054C0203f4640F1915H059d36543
11800E7126R0579a54624B39070k8578b05011B5991C512O5745a69059A52711a75487
11788G4839Q9267b06245F9444b23998g7867j98681j39697H527J49608i1968j00615
11777a92583D02380A32233a76567Q0479D1453K11099f5074j63386J08864M9923
11767f9673l8414D6386a09976A04759J96896a5283B27636a46288A06845B0122
11756F8224f1414B18891b8977m9270l0820j05886A25360i7085B60870d26274A77950
11744b0318A04715j1237a0966j5268k28487A28753a9072H3960b55443o5529C70188
$$ plain form
11824 -156477 -189091 -49495 209724 -279203 -141618 -142418 -39763 -359431 16063 -246435 175327
11812 250644 -220856 3884 -237469 -82066 -59152 98054 30203 -64640 61915 8059 -436543
11800 57126 147705 -154624 239070 210492 -205011 25991 3512 69257 -169059 152711 -175487
11788 74839 164106 -206245 69444 -223998 -77867 -276548 -416245 8527 158135 -91968 -192583
11777 -192583 402380 132233 -176567 -96088 41453 252552 -65074 -228460 -119596 -69673
11767 -69673 -108087 46386 -109976 104759 301655 -15283 227636 -146288 106845 20122
11756 68224 -61414 218891 -28977 -78247 -109067 -214953 125360 -97085 260870 -426274 177950
11744 -20318 104715 93478 -10966 -26234 -254721 128753 -19072 83960 -255443 -320972 370188
11732A34137h1502c08E8115a13615C1138b18544a1217C66130c56331a35024j08977
11721b44001c0026p6062d7413A48206a50167C68406b6470D2248J22758E2725c26823
11709A24823g096j43387B60898a2264F2856J2107J54947J37089g4787E1415J23132
11698A74547c998C6804a12985p8456R5437g582F2795b10145e5531K1315k030c030
11685B43877a1305l54046A09315J01358I2825a61042N9340j24138j53232B36142
11674c0330k01240A27944c72419F3303d85A78540P8183H1474c9757E7513h8541
11662B39558a42914A16898c2335j98981M4209O263D4301n550a65713j07593C47078
11650H570J79006o0960n8143b05623k3328E7663a21933O202E1938J00286F1115
$$ plain form
11732 134137 -81502 -308 58115 -113615 31138 -218544 -11217 366130 -356331 -135024 -244001
11721 -244001 -30026 -106088 -47413 148206 -150167 368406 -26470 42248 165006 52725 -326823
11709 124823 -7096 -150483 260898 -12264 62856 74963 229910 366999 -74787 51415 174547
11698 174547 -3998 36804 -112985 -191441 -96004 -7582 62795 -210145 -55531 -34216 -36246 -3030
11685 243877 -11305 -365351 109315 210673 92825 -161042 -101702 -225840 -379072 236142
11674 -30330 -231570 127944 -372419 63303 -485 178540 256723 81474 -39757 57513 -88541
11662 239558 -142914 116898 -32335 -231316 -187107 -180844 44301 38751 -165713 -273306 347078
11650 8570 187576 126616 68473 -205623 -228951 57663 -121933 -115731 51938 152224 61115
11638f4990n6538A59602b81012B9366J70399b95761F3490O8715K73989c424r2091
11627i5515m3524A18352b73182B1334J51213a14612q7701R2471A0883L26291G1565
11615a20484B62372a54804k92105A07830M9038D1944K864j2604O9986k4919B6038
11603c5518A78471N0926e3870B9178Q7681N1341b86326C96074b86085a4683q7215
11592a01898o9938k8106a8784l08351i2687A71574E6662b11129o894A63194J03296
11581B66490k6518O3E2784J00850g6160E5530h5992q1461D8313k3070a16548A83513
11568I9982l0721c1568H3149e1954j21818A6369N0909j16J97693R6346a17093
11556f5755C1119K15577b65808B64547p9502H766a54646a8675C18376E9452a59502
$$ plain form
11638 -64990 -121528 159602 -281012 29366 199765 -295761 63490 132205 406194 -3424 -95515
11627 -95515 -139039 118352 -273182 21334 172547 -114612 -202313 -109842 10883 337174 71565
11615 -120484 262372 -154804 -446909 107830 156868 41944 44808 32204 102190 77271 26038
11603 -35518 178471 229397 -53870 29178 116859 168200 -286326 396074 -286085 -14683 -101898
11592 -101898 -171836 -199942 -18784 -327135 -92687 171574 56662 -211129 -218023 163194 266490
11581 266490 239972 240035 52784 153634 -76160 55530 -85992 -167453 48313 25243 -116548 183513
11568 99982 69261 -31568 83149 -51954 -173772 16369 67278 67162 264855 361201 -117093
11556 -65755 31119 246696 -265808 264547 185045 8766 -154646 -18675 318376 59452 -159502
11544H6676b05906I6858k6156a22019k50420a24689B8599Q923a95350B37161E4709
11532h7912B70471b98473L4036E4672m867K17716l0288k6096h242j67962A72553
11520A88788H2762C0011R9385P7939b37144C29015o2747l0373d0111E8147f2924
11508a72659A7270P3879c04946j11205G3112a8460E2874j8878K68890A27100J40119
11497B67219O6993c5401B10497k0018o3726g8778j43449b2632A33460Q6876E9869
11485a42258A65236b00888B19476A06636n0156a17068D89550B33058d9749A86773
11474B81031b6908L94C14644c50777I2400J34025Q0666g9330C45519j57670c748
11462F1155a22949A13123R1484Q2954g542A93033r1562J04970F3848J13115K1129
$$ plain form
11544 86676 -205906 96858 70702 -122019 -372439 -124689 28599 37522 -195350 237161 54709
11532 -87912 270471 -298473 -264437 54672 49805 267521 237233 211137 -8242 -176204 172553
11520 188788 82762 30011 129396 207335 -237144 329015 266268 235895 -40111 58147 -62924
11508 -172659 17270 91149 -304946 -416151 73112 -18460 52874 33996 302886 127100 267219
11497 267219 334212 -35401 210497 190479 126753 -78778 -222227 -22632 133460 220336 59869
11485 -142258 165236 -200888 219476 106636 56480 -117068 489550 233058 -49749 186773
11474 281031 -26908 -26514 314644 -350777 92400 226425 307091 -79330 345519 187849 -3748
11462 61155 -122949 113123 204607 287561 -7542 193033 101471 206441 63848 176963 198092
11451A98092d6225C7293J35969L1820l1495p6343K35893L04855A60915D2829J2783
11440E5612J82343J3684C3891J91341q4978K89059j62139l3556I6550R950j0481
11429I6019K64806B2835J57080a33018B03558r3046b85061J02124B27889P589
11419B35478b43186R3846f5210b6739F0263a64888j3100q325Q1175A07965a1217
11407b4900j77150q7902B74202a15080E9971a11939A93715J66510n5312m5089
11397B59824h2897B6912b975A0173d2527m9444B9961e7817k0603A07077b74912
11385a18883A0196K14439a92318C07901b40655B91658i4703a2100j19837A04777
11374b7237k05531f8617k7298f233A17797b248A61742b53261B1766g3758k5480
$$ plain form
11451 198092 -46225 37293 173262 205082 173587 97244 333137 637992 160915 42829 55612
11440 55612 237955 251639 33891 225232 140254 429313 267174 233618 96550 106500 96019
11429 96019 360825 22835 179915 -133018 203558 110512 -285061 -182937 227889 235478
11419 235478 -243186 -149340 -65210 -26739 60263 -164888 -177988 -186313 -105138 107965 -11217
11407 -24900 -202050 -289952 274202 -115080 59971 -111939 193715 360225 304913 259824
11397 259824 -82897 26912 -2975 10173 -42527 -91971 29961 -57817 -78420 107077 -274912
11385 -118883 10196 224635 -192318 307901 -240655 291658 -94703 -12100 -131937 104777
11374 -27237 -232768 -68617 -95915 -6233 117797 -2248 161742 -253261 21766 -73758 -99238
11363i9238p9734L6117I9953K30071a79880c4857A0325K05661b18167B31602a42058
11351A19b95982b0332j78376I3969f2964j25857h8960l7222B37905b9295B71114
11339C66225A4908b72729b5338j29536n9666G4156a15593k0696C87873f3007l6902
11328i9909j00796B35491a63887A65758M8303n5347c693j50220A48742m9483h0082
11316b23645J4464k2446b7666j8696j58603G6353b7132k64024c4110m9388b9821
11304a33132l09552a29348k87632E4717J64762b57586b5609k39974a4815A62836
11293i2018o4839e555E5783C250b40955b4970r4556N2972j60240D4526b3019B0329
11280b47063k4384A94385r871a67600g1408l73692B78677c9443j44286M6121j6769
$$ plain form
11363 -99238 -178972 -142855 99953 330024 -179880 -34857 10325 215986 -218167 231602 -142058
11351 119 -295982 -20332 -198708 93969 -62964 -188821 -88960 -126182 237905 -29295 271114
11339 366225 14908 -272729 -25338 -154874 -214540 74156 -115593 -136289 387873 -63007 -99909
11328 -99909 -200705 235491 -163887 165758 214061 158714 -3693 -153913 148742 99259 -80082
11316 -223645 -209181 -231627 -27666 -46362 -204965 76353 -27132 -291156 -34110 -83498 -29821
11304 -133132 -442684 -129348 -416980 54717 219479 -257586 -25609 -265583 -14815 162836
11293 -92018 -156857 -5555 55783 3250 -240955 -24970 -119526 -66554 -226794 44526 -23019 20329
11280 -247063 -271447 194385 184514 -167600 -71408 -445100 278677 -39443 -183729 -137608 -154377
11269a54377B8319a3541j70643c1005C5917a71238F3984k0029e6818r2538D04909
11257b21353j15605f3993j06565A23997j2676j2974c39698g8733A51757J16734
11247B68491A10775C8380A5738M0364a8017A62386B9716J2604Q0379c1596j64323
11236a95919r8718Q0912A35580J04186a95940b9268A57078c99972H869Q2171A0953
11224B0102i3882D3796R145c47663A37797f8912j07213k6400j16034j8129c866
11212G001L0604b28348J00568c6368k99612P5783G4456f9911a146j56617j33252
11201b91015G8911Q2983a49726O9578E7539a98036F3506N7168a21265a2229l05257
11190c17486h4673F6746J1807b4394B51017b18563R3526p0124j46684g4201k18648
$$ plain form
11269 -154377 28319 -13541 -184184 -31005 35917 -171238 63984 43955 -56818 -149356 404909
11257 -221353 -336958 -63993 -170558 123997 111321 98347 -339698 -78733 151757 268491
11247 268491 110775 38380 15738 56102 -18017 162386 29716 42320 122699 -31596 -195919
11236 -195919 -294637 -213725 135580 239766 -195940 -29268 157078 -399972 8869 91040 10953
11224 20102 -93882 43796 52941 -347663 137797 -68912 -176125 -202525 -318559 -336688 -3866
11212 7001 37605 -228348 -127780 -36368 -335980 -260197 74456 -69911 -1146 -157763 -291015
11201 -291015 78911 161894 -149726 -80148 57539 -198036 63506 120674 -121265 -12229 -317486
11190 -317486 -84673 66746 78553 -24394 251017 -218563 -125037 -195161 -341845 -74201 -292849
11179b92849o8269k5604M4390C4543J08313G302d6778A3162P242a23949o9202
11168a93151O1784i128k28498a6160I7523C0041J53092b8081k77789B66364a01097
11156b1426h560H0939b47134b532j78475c2134C5175h5561H8803M7648l595f3471
11143C33422a55393m9974i0076B80835a94725A45090c5772j33572B00902J06739
11133C07641b42165R2558R196C119K05676b75496c3235k19851h9399H4400e4540
11121h81l58069e4490D3248P6150N4551a74691N0616r5926n8524k0456a29842
11109B47271f4064a1835A71453C8689L60854F3818b31784B91182A41972c9515
11098h186q3128c1564A63584O1986b12137A44927h8900B48381E5726J16547K25564
$$ plain form
11179 -292849 -361118 -386722 -342332 34543 142856 7302 -46778 13162 20404 -123949 -193151
11168 -193151 -131367 -9128 -237626 -16160 97523 30041 183133 -28081 -305870 266364 -101097
11156 -21426 -8560 80939 -247134 -2532 -181007 -32134 35175 -85561 88803 136451 132856 -63471
11143 333422 -155393 -205367 -90076 280835 -194725 145090 -35772 -169344 200902 307641
11133 307641 -242165 -149607 -140411 3119 208795 -275496 -33235 -253086 -89399 84400 -54540
11121 -881 -358950 -54490 43248 119398 173949 -174691 -124075 -220001 -278525 -298981 -129842
11109 247271 -64064 -11835 171453 38689 399543 63818 -231784 291182 141972 -39515
11098 -8186 -91314 -31564 163584 225570 -212137 144927 -88900 248381 55726 172273 397837
11087C97837A67773K03545j67379r359c09598A36944K46281F2411b5794D49224
11076B21183K41208p2326j08412N2573p8368L1912h9442F54245C14528M431p1651
11065B47308P4387K73152k33795M1796J0546K96792A3572K98519L92439B63204
11054C68604j33702M00157j45071J38940B80118N88958l18274j25929J58344J79399
11044G62616p0155J59740j53926O0370o5672P1802j91031L60062k29921k27173
11034D76712K20666B25166N16797j50630M5094j71351K36525j51800L4516r6661
11024D87656K59406J50710k9292m5338C66873L00865O6024l4620K93448M220m41731
11013E55079K81413n0183l23179j24886K97447j3707l6984n5873J58752L33381
$$ plain form
11087 397837 167773 371318 203939 194580 -309598 136944 383225 62411 -25794 449224
11076 221183 462391 390065 281653 334226 255858 287770 -89442 654245 314528 318959 247308
11065 247308 321695 594847 361052 402848 413394 710186 13572 312091 704530 263204
11054 368604 234902 635059 489988 628928 280118 869076 550802 424873 583217 762616
11044 762616 692461 852201 698275 758645 692973 764775 573744 933806 703885 476712
11034 476712 697378 225166 741963 591333 636427 465076 701601 549801 584317 487656
11024 487656 747062 897772 868480 823142 366873 667738 733762 699142 992590 996810 555079
11013 555079 836492 786309 463130 338244 635691 621984 585000 529127 687879 1021260
11003A021260P9808j80445N1852m28866P5834L5687K39372j72320j54241J59010
10993G26951j5521j05576L81561l36220J47376j85357J92986J50844j74957j16404
10983F65683N26606k56400J36317K69750l58516R8011K09305j06792J52782J30374
10973A467120O8412m17167N35634M57364m85131L9876K03180l8474J52359l7909
10963A945264m55429J00707M01630k76414M0231l2994j75454M41563o65858M27739
10953A750985J60256k31555l62135L33058L4301m70761M55077n35423L64208l15318
10943A182693k35620K50002m38283k2691L55589m62012J19691k8370K3105J71523
10933I15627j89627k00922J04087k32902M16881l99762m4152M44912k18452j80300
$$ plain form
11003 1021260 1101068 920623 972475 543609 619443 655130 894502 722182 567941 726951
10993 726951 711430 605854 987415 651195 798571 613214 806200 957044 782087 665683
10983 665683 1192289 935889 1072206 1341956 983440 1081451 1290756 1183964 1336746 1467120
10973 1467120 1535532 1118365 1653999 2111363 1626232 1666108 1869288 1830814 1983173 1945264
10963 1945264 1489835 1590542 1992172 1715758 1755989 1722995 1547541 1989104 1323246 1750985
10953 1750985 1911241 1679686 1317551 1650609 1684910 1214149 1669226 1133803 1498011 1182693
10943 1182693 947073 1197075 758792 736101 1091690 629678 749369 720999 744104 915627
10933 915627 726000 525078 629165 396263 813144 413382 369230 814142 595690 415390
10923D15390B2775J31197K18622J50405r3288l6031A85264K021P147L9735A9533
10911A17034J71437q8270J0546r2456Q0968p3396b1284C36882a2763C93208d990
10899E18216a02438A30994a15581q1616A0082N732M85401A54848B0954j446M2456
10888F1964J08916O1723K48191A50434a55974A28560O3360c7237j20963B13860
10877A62110p7353J45428q6466g2930C0157A0982a4896A5777b60866C18024N9815
10866C77839H6061R8077P5773E6040J4027M3825n0054f7016B22949F4173K33632
10855B97805j04417n9003C7592A1449J06857k4051d7913A2566R7952h7413L2221
10844e5192C18386c49293B18769o5280E0658f3822A73725L49946C807J00824a2957
$$ plain form
10923 415390 22775 153972 372594 522999 429711 393680 185264 187285 194432 234167 19533
10911 117034 288471 200201 210747 118291 199259 125863 -21284 336882 -12763 393208 -4990
10899 518216 -102438 130994 -115581 -197197 10082 15814 501215 154848 20954 19508 61964
10888 61964 170880 232603 480794 150434 -155974 128560 191920 -37237 -158200 213860
10877 162110 84757 230185 143719 -72930 30157 10982 -14896 15777 -260866 318024 377839
10866 377839 86061 184138 259911 56040 70067 113892 63838 -67016 222949 64173 297805
10855 297805 193388 134385 37592 11449 118306 94255 -47913 12566 110518 -87413 -55192
10844 -55192 318386 -349293 218769 153489 50658 -63822 173725 523671 3807 104631 -12957
10832A0768a31582k65712B94490d8155C00015A36513r713a81841e5347k25728
10822b81075A92506b3941p6279B04810b03532h7989M3912l52255i4175j0084f829
10810a23153M4768j08272f8902k77660a07979b9167k48179A9471a20117B65498
10799B1897b27907n3209C12478A24739J87213q8158d2912k01755K8323G7011l5151
10788D1860a18729A45335B363c48550A46421a30241j12954C9746h45k73310K5591
10777b48564r4881b6427A36222N338d18058b6037q3873J1383D1268A3757J47905
10766A61662b34631k09608f5405l144J8636B3012L200a30738A16752a88045e105
10754G4271a30434A2803a8427A12131D420a48180B12136d46219a01959F1322R1152
$$ plain form
10832 10768 -131582 -397294 294490 -48155 300015 136513 126800 -181841 -55347 -281075
10822 -281075 192506 -23941 -100220 204810 -203532 -87989 -44077 -396332 -94175 -104259 -6829
10810 -123153 -78385 -186657 -68902 -346562 -107979 -29167 -277346 19471 -120117 265498
10799 21897 -227907 -281116 312478 124739 311952 223794 -42912 -244667 -216344 77011 41860
10788 41860 -118729 145335 2363 -348550 146421 -130241 -243195 39746 -845 -274155 -248564
10777 -248564 -343445 -26427 136222 141560 -418058 -26037 -109910 -98527 41268 13757 161662
10766 161662 -234631 -444239 -65405 -68549 -49913 23012 26212 -130738 116752 -188045 -5105
10754 74271 -130434 12803 -18427 112131 4420 -148180 212136 -446219 -101959 61322 152474
10743A52474F4880K3583i1342r6350a2801l22541Q4485B55632g6696A48670a84543
10731a51257d398C0197a03827C66350p6643I4336f3745A27234i0755j23051B5805
10719I949K7651R2364a59150L1448f2110A97722b28022d2036a3384o9153r6838
10708a79375A59527b80639a5565q8563A08978b04574C17441A37952a33683C3957
10697a22956j57833Q6917N4612A3569L6541K92848i6934I1416M6686a06410q5656
10686a92066R4542q5253G5852h1837G8846d42511b09101N1118B6872A333b47775
10674b01473h8186k82084e2995l13853c7671A35860L6771b55681A78320D6441
10663D0437a74287f9993k9572F1981b98321a10965C4382K20522b55331f2595j59798
$$ plain form
10743 152474 64880 88463 -91342 -187692 -12801 -335342 -250857 255632 -76696 148670 -184543
10731 -151257 -4398 30197 -103827 366350 289707 94336 -63745 127234 -90755 -213806 25805
10719 9949 37600 129964 -159150 -127702 -62110 197722 -228022 -42036 -13384 -82537 -179375
10708 -179375 159527 -280639 -15565 -104128 108978 -204574 317441 137952 -133683 33957
10697 -122956 -280789 -193872 -139260 13569 50110 342958 -96934 91416 138102 -106410 -192066
10686 -192066 -97524 -182777 75852 -81837 78846 -442511 -209101 -157983 26872 1333 -247775
10674 -201473 -88186 -370270 -52995 -366848 -37671 135860 172631 -255681 178320 46441
10663 40437 -174287 -69993 -99565 61981 -298321 -110965 34382 254904 -255331 -62595 -222393
10652b22393C1493b9550A31942a41618r3951p1839F8830K36487b27193A78838
10641A2889b08650c0550A72728a49911L1285k55499C9047b4575j36772k01668
10631c63015i5528k6471j7977b8411A13224A7351a23935p8889B45183o5991c35018
10619c98845a64147A56543n2254m7068a5942G5847F410b37253J7270j14888I3279
10607B1849a00563k43195i9878B27902f2466D86250a95329k4925i7846A90080
10596C8238i2020l62129a13641j12992R6141j03656A00268a90763f9400A3639
10585i5182A50118J32337c84758A1538f9479r7531j67897B57547I5290a80735
10574h556j96889l61054a8539q8900F7696b55193F2540P9986A030J62688N9222
$$ plain form
10652 -222393 31493 -29550 131942 -141618 -235569 -307408 68830 305317 -227193 178838
10641 12889 -208650 -30550 172728 -149911 -118626 -374125 39047 -24575 -161347 -363015
10631 -363015 -95528 -121999 -139976 -28411 113224 17351 -123935 -202824 245183 179192 -335018
10619 -398845 -164147 156543 104289 57221 -15942 75847 6410 -237253 -219983 -334871 93279
10607 21849 -100563 -343758 -99878 227902 -62466 486250 -195329 -220254 -97846 190080
10596 38238 -92020 -454149 -113641 -226633 -130492 -234148 100268 -190763 -69400 13639
10585 -95182 150118 282455 -384758 11538 -69479 -167010 -334907 257547 95290 -180735
10574 -8556 -205445 -566499 -18539 -107439 67696 -255193 62540 142526 1030 163718 222940
10563B22940b40593B94166p9537a15915C141J26292g1655n9122k13774I3670M7007
10552A40677K707i7463A05599a47645r6523C44474g5594j8529l35983d7560J5479
10541c2081N336k63535J21505A27156E4521e49127g3172n19C31548A12922a54448
10529C0303p845b6636p2819j84646D2538f3461n336b1627k69500D07027B8442
10517E4299b7351j8261a696H9071b3464j11961L3937j46397A97580f1799m4422
10506a06221K5618j01181C4228d5099A30075a40006c2557j80761A12277L4082
10496A46359b83678A16530a62438N9098d9592j56075R1411A6441c9918m8751c9944
10484a57082d7583a4069k10206b421j41717o5699c6069B74509a56751A80930N1884
$$ plain form
10563 222940 -240593 294166 214629 -115915 3141 129433 -71655 -130777 -344551 93670 140677
10552 140677 143384 -97463 105599 -147645 -244168 344474 -75594 -94123 -430106 -47560 -32081
10541 -32081 -26745 -290280 -168775 127156 54521 -549127 -73172 -73691 331548 112922 -154448
10529 30303 22458 -26636 -99455 -284101 42538 -63461 -68797 -21627 -291127 407027 28442
10517 54299 -27351 -45612 -1696 89071 -23464 -135425 -101488 -247885 197580 -61799 -106221
10506 -106221 -80603 -181784 34228 -45099 130075 -140006 -32557 -213318 112277 146359
10496 146359 -283678 116530 -162438 -103340 -49592 -205667 -114256 16441 -39918 -88669 -39944
10484 -157082 -47583 -14069 -224275 -2421 -144138 -209837 -36069 274509 -156751 180930 232814
10473B32814I5777a26497E05884B08523p2807b6005B73768o4214b72377Q3326
10463a89051R0509k47566a22733A62269R2811J66472G2759f094C46470c721n7778
10452f1499k1003j33081g3029k17081A91324b15419B04523b89475A96648H9987
10441c2830J4590o2262J163j86889d2667E3871c0390D1960h3806B13440l9389
10430A74051h4367k16202N9517D6698c7D6586O8535B7873a91929A47961b35401
10418i1068j88251G0105a32643B91075G4535h3878k40092B38211a83512i22F4389
10406a50499D0108N5804a49679r9423C8305i6361o4981H8791B851J18049N5007
10395A75907Q4180K20802i0549L3893j8787A86442J36917c15485G7342C2553a12038
$$ plain form
10473 232814 95777 -126497 505884 208523 135716 -26005 273768 209554 -272377 -189051
10463 -189051 -98542 -346108 -122733 162269 255080 421552 72759 -6094 346470 -3721 -61499
10452 -61499 -82502 -215583 -73029 -290110 191324 -215419 204523 -289475 196648 89987
10441 -32830 -18240 -80502 -79339 -266228 -42667 53871 -30390 41960 -83806 213440 174051
10430 174051 -84367 -300569 -241052 46698 -37 46586 115121 27873 -191929 147961 -235401
10418 -91068 -279319 70105 -132643 291075 74535 -83878 -323970 238211 -183512 -922 64389
10406 -150499 40108 95912 -149679 -249102 38305 -96361 -161342 88791 2851 120900 175907
10395 175907 260087 480889 -90549 -56656 -75443 186442 323359 -315485 77342 32553 -112038
10383A37345a52616j16459F9480n528b20445A61888L4648J57822b29216A45753
10372B72853r2464J22238j45795G5927p950L52821A68532p2568k8748j6545L52241
10361D02912A15047L70513A54951K7837J76133A49178m489L02162B23377J09936
10351C33313a10325D81282B24664q7137J81051p2814K36135J43126A45242M980
10341A50222R9349J8003k5293K96736j46083A89417J00415A22885K35815q7746
10331B70954A04342O7272o6458J31544p9694L42231k43378K88925B10909J0609
10321B21518J2569j16538O1666L87640E186M42576j96905F52K86890d2258D3273
10309A0753J22109b0948A84205c92143A42075K10899h7556p4913B79381J39303
$$ plain form
10383 137345 -152616 -269075 69480 63952 -220445 161888 196536 354358 -229216 145753
10372 272853 180389 302627 156832 75927 67977 420798 168532 95964 67216 50671 402912
10361 402912 115047 485560 154951 182788 358921 149178 144689 446851 223377 333313
10351 333313 -110325 481282 224664 137527 318578 245764 481899 625025 145242 150222
10341 150222 249571 267574 242281 539017 392934 189417 289832 122885 358700 270954
10331 270954 104342 171614 105156 236700 157006 499237 255859 544784 210909 221518
10321 221518 234087 117549 179215 566855 5186 447762 250857 652 287542 -42258 43273
10309 10753 132862 -20948 184205 -392143 142075 352974 -87556 -162469 279381 418684
10299D18684c406B76603j06491h2312a7625L942C9844M2480g6747A78834L8694
10288B17528J8703B3612e940l70301a79055k02718J43284G1297a94374A3418a17788
10276a63201A54454n1843i2572C75996A53508l6573B3425J80087G2905A1093B659
10264a23319M9738K833D28760e0558A31363b63159I2185a82158C04202j7516N0733
10253C37419f1589J9347B29512b89478e155j00306B6763J8159a42480B30014Q7633
10242C17647E1360b1495k06810I3078g2542d615j73958k26538A43413a35165l325
10231a38490o8354h0798B4031f3910A11511a77051J3402M4241H7627P2421D7836
10219C7409J17718b2200H812b16217g1074B42681f1952j06935k4784k5642H8016
$$ plain form
10299 418684 -3406 276603 170112 -82312 -17625 -13683 39844 82324 -76747 178834 217528
10288 217528 236231 23612 -5940 -376241 -179055 -381773 -238489 71297 -194374 13418 -117788
10276 -163201 154454 102611 -92572 375996 153508 116935 23425 203512 72905 11093 2659
10264 -123319 -73581 -70748 428760 -50558 131363 -263159 92185 -182158 304202 286686 337419
10253 337419 -61589 -42242 229512 -289478 -5155 -105461 26763 44922 -142480 230014 317647
10242 317647 51360 -21495 -228305 93078 -72542 -4615 -178573 -405111 143413 -135165 -138490
10231 -138490 -206844 -80798 24031 -63910 111511 -177051 -163649 -119408 87627 160048 47836
10219 37409 155127 -22200 8812 -216217 -71074 242681 -61952 -168887 -193671 -219313 88016
10207a08634R390F676a64308g5882C5965M3479d36439K14533E4230a81j04619
10196a04800k118b7639l9104F594c64969I2240J29419D5396J02313F1600g169
10184a05330A79728g5105J9673Q561j04742C87369f2889A14012c96609C01164
10173A00265J25689d50871b7166B26605b27657D181Q2987C2595b81551d7460D302
10161d4204j50603Q1059A09411g3654k99658A74161a61940J9699n627A6572i888
10149a47973A10274d37604A4558b35013G2148a59172j96039A37628J51910c0633
10138e9596b6497k0310k044j05495A50582a72483P3838j64332j36024J96039A4553
10126A3974b22264p2954J14288J9430e1265A06513d0668B7289b17868E0238N6650
$$ plain form
10207 -108634 -99244 6676 -164308 -75882 35965 79444 -436439 -221906 54230 -181 -104800
10196 -104800 -106918 -27639 -66743 6594 -364969 92240 221659 45396 147709 61600 -7169
10184 -105330 179728 -75105 -55432 -46871 -151613 387369 -62889 114012 -396609 301164
10173 100265 225954 -450871 -27166 226605 -227657 4181 87168 32595 -281551 -47460 4302
10161 -44204 -194807 -113748 109411 -73654 -373312 174161 -161940 -142241 -147868 16572 -9888
10149 -147973 110274 -437604 14558 -235013 72148 -159172 -355211 137628 289538 -30633
10138 -59596 -26497 -46807 -48851 -154346 150582 -172483 -98645 -262977 -399001 -202962 14553
10126 13974 -222264 -295218 -180930 -161500 -51265 106513 -40668 27289 -217868 50238 106888
10115A06888E2158a09064k4755k89486A22240a8219q9999a903j32731k98l0866
10104a65798f4526j61164A34422e26201d1655A8480P4426g9256i673j40064l78463
10093e28200C31435b48176l8986k80047B8212L38429A4160d5170I4464J24037
10083B18501A8760b83083A70729a06014K2904j34513P9722J7400B82130g1681
10072i1389A21217a69419E7117b80611a4319l24546E6796O376j2916J83040E9455
10060H6523C2663L5472i2529k9259k52293D931K6143N0743b76969i726A20586
10048a79593k4728a01472o1900B062K18847G8846a08768j97448h6248B06022C8457
10036c196A93099a49105c3015j24852m9422A27025R896b39932j73305L2185A93253
$$ plain form
10115 106888 52158 -109064 -133819 -423305 122240 -18219 -108218 -1903 -134634 -134932 -165798
10104 -165798 -64526 -225690 134422 -526201 -41655 18480 92906 -79256 -9673 -149737 -528200
10093 -528200 331435 -248176 -287162 -567209 28212 366641 14160 -45170 94464 218501
10083 218501 18760 -283083 170729 -106014 -83110 -217623 -137901 -120501 282130 -71681
10072 -91389 121217 -169419 57117 -280611 -14319 -338865 56796 63172 50256 233296 59455
10060 86523 32663 68135 -92529 -121788 -374081 4931 31074 81817 -276969 -9726 120586
10048 -179593 -204321 -101472 -163372 2062 220909 78846 -108768 -306216 -86248 206022 38457
10036 -3196 193099 -149105 -33015 -157867 -207289 127025 136921 -239932 -413237 -381052 193253
10024B0924a75680M0088l6796j29691q5377a53105P4906B04403H0516K58241B5195
10012c77377B0246b07958g660k60438d19A71383B1483C697a98458H5502K6039
10001A11541a23811l36014F051a53321A32774L3574p1089J17498h7832k54131
9991c41963l0551a24940o3865P7F8912a51255j53558J22818A10918K8555E5633
9979e4629A4741K57191A01938h2255k24621f3957j84275N3106o2252a13717e4017
9967A08363j5154K48674d6168J8196j65852A4098c2651A53095c6483j9129k76155
9956c31767J14859K123F7473c15209B17138J445e40662A24782F343i8829C5580
9944f7201G946a69701B4938a32229F336Q3298c95511A033K6627a18682n289A26644
$$ plain form
10024 20924 -175680 -135592 -172388 -302079 -387456 -153105 -78199 204403 80516 338757 25195
10012 -377377 20246 -207958 -7660 -268098 -419 171383 21483 3697 -198458 85502 111541
10001 111541 -123811 -459825 6051 -153321 132774 166348 95259 212757 -87832 -341963
9991 -341963 -372514 -124940 -188805 -188728 68912 -151255 -304813 -181995 110918 139473 55633
9979 -54629 14741 271932 101938 -82255 -306876 -63957 -248232 -195126 -257378 -113717 -54017
9967 108363 93209 341883 -46168 -27972 -193824 14098 -32651 153095 -36483 -55612 -331767
9956 -331767 -216908 -214785 67473 -315209 217138 218583 -540662 124782 6343 -98829 35580
9944 -67201 7946 -169701 24938 -132229 6336 89634 -395511 1033 27660 -118682 -123971 126644
9931A43551m9380M0837b63424q7025i5287B3319b39431f9224K9715q9194C443
9919d63401h6332A40340a03837H4367A4281K17843c85874G2217d02192J22364
9909b79828h5773K1003K3128A15404a88964G7013a30337d6372j77460A36349a35145
9897A12995a3410l71751B58867a15619k56876m5399a65666j06467a29569l7049
9887a66618N2865j23975a02022q1250L0060J2358B4705a55500k247q0648B3444
9875b05849A66335i7006k61659D4134c22879b3683l8407o6704N2409l7559a7709
9863a34017j76323B05531a00560J7710F3502L1842j4094N5047b76186g2290A26029
9851A0228d41904F4275b58606N2149E9821a57340d6440B52957j06741l4740i2042
$$ plain form
9931 143551 94171 135008 -263424 -350449 -95287 23319 -239431 -69224 -39509 -128703 3443
9919 -463401 -86332 140340 -103837 84367 14281 232124 -385874 72217 -402192 -279828
9909 -279828 -85773 -64770 -41642 115404 -188964 77013 -130337 -46372 -223832 136349 -135145
9897 112995 -13410 -385161 258867 -115619 -372495 -417894 -165666 -272133 -129569 -166618
9887 -166618 -113753 -237728 -102022 -183272 -153212 -140854 24705 -155500 -157747 -238395 23444
9875 -205849 166335 -97006 -358665 44134 -322879 -23683 -62090 -128794 -76385 -113944 -17709
9863 -134017 -310340 205531 -100560 -82850 63502 95344 81250 136297 -276186 -72290 126029
9851 10228 -441904 64275 -258606 -206457 59821 -157340 -46440 252957 146216 111476 -92042
9839b7055A15257a02349I0367g8172k99227A359a49451A85397E723J55979i3433
9827c0541D0785a55911C2647a03634n5150n0119R4049A87825H1792a48972A07686
9815H124b38926F5802c36643d3489J5708l1306l04559b9844A45330E0629K29724
9804B80353b05682G0677f5534b7274m19390l657d2656k27439N476J20650K215
9793a41754B83371g5039j50910P6117A95862q6566a70631i054l7741k81785D68767
9781e0976k01498Q3349j08195I527a10314B48220b6095A64565b96995j77351B98608
9769a80176C1730K37434b7143r3560l0678k75291F9478a86795b0305r6850j49609
9758b66764i8197k88770j16752e401j99007h7852c2716k2940r7j07975l3190A53909
$$ plain form
9839 -27055 115257 -102349 90367 -78172 -377399 1359 -149451 185397 5723 161702 -93433
9827 -30541 40785 -155911 32647 -103634 -158784 -208903 -114854 187825 81792 -148972 107686
9815 8124 -238926 65802 -336643 -43489 -27781 -59087 -363646 -29844 145330 50629 280353
9804 280353 -205682 70677 -65534 -27274 -446664 -450321 -42656 -270095 -264619 -143969 -141754
9793 -141754 283371 -75039 -225949 -149832 195862 109296 -170631 -9054 -46795 -328580 468767
9781 -50976 -252474 -169125 -277320 9527 -110314 248220 -26095 164565 -296995 -474346 298608
9769 -180176 31730 269164 -27143 -120703 -151381 -426672 69478 -186795 -20305 -117155 -266764
9758 -266764 -98197 -386967 -503719 -5401 -204408 -87852 -32716 -55656 -55753 -163728 -196918 153909
9745a97979B18127a02371e0869k04010f98j27288j05957H8383b43035K5607p6293
9734b93721A77572c61503H2487c48963J70708p059j35122d8898j3131A08042d4964
9722c29430I4436a80676h0379q6914B16688A8117D150L3506L3353R4627b3559
9710g513H2712a08979k00382H2970a54272K8677e1120j28436H087c58885f8950
9698I8552J25936q9857a66602a9475B28584C0622a18386l39481c089A79552a17437
9686F2639c51526B37737b16999j27845a7428C5192d01381R8173d872A22864h3699
9674A08259j6997a21802E3352a1724I049c37057C25711b22028B83159b35226i3401
9662A82510p1112b33599e3807j38488d7065p893k04697A30924a2131k59032B9265
$$ plain form
9745 -197979 218127 -102371 -50869 -254879 -698 -127986 -233943 88383 -243035 -217428 -293721
9734 -293721 177572 -361503 82487 -348963 -178255 -185314 -320436 -48898 -62029 108042 -44964
9722 -329430 94436 -180676 -80379 -167293 216688 18117 4150 37656 71009 165636 -23559
9710 -7513 82712 -108979 -309361 82970 -154272 -125595 -51120 -179556 8087 -358885 -68950
9698 98552 224488 134631 -166602 -19475 228584 30622 -118386 -457867 -3089 179552 -117437
9686 62639 -351526 237737 -216999 -344844 -17428 35192 -401381 -303208 -4872 122864 -83699
9674 108259 91262 -121802 53352 -11724 9049 -337057 325711 -222028 283159 -235226 -93401
9662 182510 111398 -233599 -53807 -192295 -47065 -54958 -259655 130924 -12131 -271163 29265
9650c5427H0647g3921A02082b57209A470O9245h4928B3481d30056a79842A85346
9638f8847G4271c23101A89809d34955J89087B14002e2605j34024k883l4768O4124
9627a60156l2454A62579c5556A41591K1373D3008d13079d9591m5386F2253K1366
9616H3619a56909p1771a13412A23843b25755J06136m793n4167j63961D98777e5058
9604b84520B23982e2804r3785J5431j59674A79440C7465J4910g1501b3869E8644
9592e0671I046d84064o537f7200q5064O6931k44945a4639A05416K77588b19263
9580a82451j39522J54051M0148A32977a78754j5052h8098j24202Q838F2015B934
9568c93701G1757b9527j07708b7884n0712F0281b41157E9053a01775A07020g3480
$$ plain form
9650 -35427 80647 -73921 102082 -257209 1470 70715 -84928 23481 -430056 -179842 185346
9638 -68847 74271 -323101 189809 -434955 -245868 214002 -52605 -186629 -189512 -224280 -160156
9627 -160156 -192610 162579 -35556 141591 162964 43008 -413079 -49591 -94977 62253 83619
9616 83619 -156909 -228680 -113412 123843 -225755 -119619 -124412 -178579 -342540 498777 -55058
9604 -284520 223982 -52804 -146589 -131158 -290832 179440 37465 52375 -71501 -23869 58644
9592 -50671 9046 -484064 -490601 -67200 -152264 -85333 -330278 -14639 105416 383004 -219263
9580 -182451 -321973 -167922 -127774 132977 -178754 -193806 -88098 -212300 -203462 62015 2934
9568 -393701 71757 -29527 -137235 -27884 -78596 60281 -241157 59053 -101775 107020 -73480
9556a39494N4266n4576O6453J6405k83758R7522a4985j47736j97455C4312c93031
9544h2814r3161f702k55785j9557d7040Q324k38195a19490G9251j0808b84975
9532G9973M0779b87072P7184Q4669l5109A32183g0904j57485j10822F8830O0898
9521A29728C9918J76003E9553a2334k38777j30158J74796B87391j38512a19843
9510a73874b8047j36230E1962K9567b15770k9979P6097A0221P6088a96887a5322
9498a62502q210O3698B73072d08254B2062c43873J43359E9432a51929c4857q4196
9487a19053K0633D3136a16862D6966J7113A7967b31088A58483f3627j2299J0258
9476f5668A21102g769m36951A8779J648f3948j34275o1252l6235A47498h1942
$$ plain form
9556 -139494 -85228 -139804 -73351 -56946 -340704 -243182 -14985 -162721 -360176 34312 -393031
9544 -82814 -175975 -6702 -262487 -282044 -47040 -38716 -276911 -119490 79251 68443 -284975
9532 79973 120752 -287072 -209888 -125219 -160328 132183 -70904 -228389 -339211 68830 129728
9521 129728 39918 215921 59553 -12334 -251111 -381269 -206473 287391 148879 -119843
9510 -173874 -28047 -164277 51962 81529 -215770 -245749 -169652 10221 86309 -196887 -15322
9498 -162502 -170712 -107014 273072 -408254 22062 -343873 -200514 59432 -151929 -34857 -119053
9487 -119053 -98420 43136 -116862 46966 64079 17967 -231088 158483 -63627 -75926 -65668
9476 -65668 121102 -7769 -444720 18779 20427 -63948 -198223 -259475 -295710 147498 -81942
9464d2124j4184m0009A29824h594j00937l7531m5817q8246G657e2863E2869i4161
9451C97894A84361J6727M9072b24443c8494A64460d70611a03363j27577B859b66166
9439b34336d5975A09418k7914m304a00980B55577a23147C69009c39106f1199o1054
9428a22253k15286C90991b08753o6846C5643a90299n8116J17845B87937e5758
9417b42921f905F6033b32532A5332c1074l45969B9445e0989p1855j94715B8783
9405A06320b60894A67911D271b79057P7111H8808g6083l4548A73495c29221f0611
9393a65706G1426b35561A18561n822J32250D7942a92704G2475a7311r0983A94547
9381a5368m1052p9636k85494a25075F8425b04254J6576b7579m4701j77763R9062
$$ plain form
9464 -42124 -56308 -96317 129824 -8594 -109531 -147062 -192879 -281125 7657 -52863 52869 -94161
9451 397894 184361 201088 250160 -224443 -38494 164460 -470611 -103363 -230940 2859 -266166
9439 -234336 -45975 109418 81504 77200 -100980 255577 -123147 369009 -339106 -61199 -122253
9428 -122253 -337539 390991 -208753 -275599 35643 -190299 -248415 -130570 287937 -55758
9417 -242921 -6905 66033 -232532 15332 -31074 -377043 29445 -50989 -122844 -317559 28783
9405 106320 -260894 167911 4271 -279057 -201946 88808 -76083 -110631 173495 -329221 -60611
9393 -165706 71426 -235561 118561 112739 244989 47942 -192704 72475 -17311 -108294 194547
9381 -15368 -56420 -136056 -421550 -125075 68425 -204254 -187678 -27579 -72280 -250043 -150981
9370a50981O4389B40498b56856i6860C22217A12669c36180C32189G734a70179
9359b73884e9520j04498J1572j96639A2429L303K9524L30031a99348F7003a13619
9347C05298C5090e3479K3602p3369j9333B06258a78916b6463k05954B49168l3881
9336B15287b82733A13937f4014B2765N1109B2451a05713A97199a48012j64974
9326c12986a23078J7257l961o0425c3425j14894N2933E8578b35191R0183A34811
9314C8515b34605B31301b73410q7863i966k54180a18414e6568a9649B64871a69333
9302c43962J67619o3816J06761M9325j86669o4055J44489g878k62383I6573i5801
9290d9820a4792l01663F6526O9514c74439B55022g6549H5574a29273k24395a24144
$$ plain form
9370 -150981 -86592 240498 -256856 -96860 322217 112669 -336180 332189 7734 -170179
9359 -273884 -59520 -164018 -152446 -349085 12429 15732 45256 375287 -199348 67003 -113619
9347 305298 35090 -53479 -29877 -103246 -122579 206258 -178916 -26463 -232417 249168 215287
9336 215287 -282733 113937 -64014 22765 73874 22451 -105713 197199 -148012 -312986
9326 -312986 -123078 -105821 -109782 -170207 -33425 -148319 -95386 58578 -235191 -145008 134811
9314 38515 -234605 231301 -273410 -361273 -9966 -264146 -118414 -56568 -19649 264871 -169333
9302 -343962 -176343 -240159 -133398 -84073 -270742 -334797 -190308 -7878 -270261 96573 -95801
9290 -49820 -14792 -316455 66526 136040 -374439 255022 -76549 85574 -129273 -353668 -124144
9278f1190A186e4903E782a74690A15287a3676m65747B5640a15197O200l82941
9267d91938d0702A9443M9030g3663G2045C3471J03959f5520B82467a68238B19847
9255B56541E4617a23425k29556g0218o117j33709Q4707M417j2143A37946b3702
9243b99278L6277B9818b70916B62493H3462b3003C27589b28706C0380c9175G0794
9231c2981k67588i4536j97620C2097g7857b8391A1850K26996C7169e3037k27613
9220b80650a0732l22336a7861L798G9999J18792l1690b2941q1358C51673f1503
9208C58989c71749j4349K4547a23640l85255a49432J3101j46412c0007j71136
9198b01143R1698B6593a17247B10038b20840f8689n2178C578a75418A12904b00821
$$ plain form
9278 -61190 1186 -54903 5782 -174690 115287 -13676 -479423 25640 -115197 -108997 -491938
9267 -491938 -40702 19443 68473 -73663 72045 33471 137430 -65520 282467 -168238 219847
9255 256541 54617 -123425 -352981 -70218 -76335 -210044 -125337 -120920 -133063 137946 -23702
9243 -299278 -263001 29818 -270916 262493 83462 -23003 327589 -228706 30380 -39175 70794
9231 -32981 -300569 -94536 -292156 32097 -77857 -28391 11850 238846 37169 -53037 -280650
9220 -280650 -10732 -333068 -17861 -14063 79999 198791 167101 -22941 -104299 351673 -61503
9208 358989 -371749 -386098 -361551 -123640 -508895 -149432 -136331 -282743 -30007 -201143
9198 -201143 -109445 26593 -117247 210038 -220840 -68689 -120867 3578 -175418 112904 -200821
9186c50855a35182M5862j86028C6842P2996g9686j87979A37641K3742a34108b6276
9174E9131O0317j3581b11023A87317e8446r2626A06064b51947l8482a16816l4473
9163a51289C07440a03144L0439E8713d14424J63789A32462j3136l485b00463B28908
9151a13519j00435i7919j65616D0837b14682G6288K96600c41180F405J07384i9239
9139h2655A22243a2578k15194L4580J1168G3240b49453j61933A79402q5034D2836
9127a47793c4777j9707C9447b10237A83656D5890Q8014O7512b24508B02162p6275
9116A25887n1809Q5052b68995a34218A97911a91820E476P632K36323b89189J25940
9105a63249r5515e8974j47195j13150D5063f9184r8574G8419J77058b9283D3622
$$ plain form
9186 -350855 -135182 -89320 -275348 36842 109838 -79686 -267665 137641 161383 -134108 -26276
9174 59131 119448 105867 -211023 187317 -58446 -151072 106064 -251947 -290429 -116816 -151289
9163 -151289 307440 -103144 -72705 58713 -414424 -250635 132462 119326 115841 -200463 228908
9151 -113519 -213954 -97919 -263535 40837 -214682 76288 372888 -341180 6405 113789 -99239
9139 -82655 122243 -12578 -227772 -193192 -182024 73240 -249453 -411386 179402 94368 42836
9127 -147793 -34777 -54484 39447 -210237 183656 45890 133904 201416 -224508 202162 125887
9116 125887 74078 159130 -268995 -134218 197911 -191820 5476 13108 249431 -289189 -163249
9105 -163249 -258764 -58974 -206169 -319319 45063 -69184 -167758 78419 255477 -29283 43622
9093A24667b44232P3574o039a2443m52884A36109G990a47803n4265N4418e6054
9081D5669b9990l5745j80078f6454p2184A59448d4990j10162E8293b3600j29049
9070a52649L1007a1517j5601n0607I7810b22852e0012A43821b8536k06268M9752
9059a85052A06131l7237M7919C2978a75213e199p4619k16032C0164a04919A8169
9047h7367B39732a01831A04446L52997B06536b42978J13667q8190H2283a21921
9036A02804b31490g9288K0810E4101H191f4857B0632K5430K5041a48438L3527
9025a14911b8181B77384o4120B4746a45239M7202L8137r4811a8576G3443i0193
9013b42250R7020A2272b58096C5516b65397h5086e252A51178a22186F181a44155
$$ plain form
9093 124667 -244232 -170658 -176697 -12443 -465327 136109 7990 -147803 -202068 -147650 -56054
9081 45669 -29990 -65735 -245813 -66454 -138638 159448 -44990 -155152 58293 -23600 -152649
9070 -152649 -121642 -11517 -27118 -77725 97810 -222852 -50012 143821 -28536 -234804 -185052
9059 -185052 106131 68894 116813 32978 -175213 -5199 -79818 -295850 30164 -104919 18169
9047 -87367 239732 -101831 104446 457443 206536 -242978 -129311 -217501 82283 -121921
9036 102804 -231490 -79288 -58478 54101 8191 -64857 20632 46062 71103 -148438 -114911
9025 -114911 -28181 277384 213264 24746 -145239 -98037 -59900 -154711 -18576 73443 -90193
9013 -242250 -145230 12272 -258096 35516 -265397 -85086 -5252 151178 -122186 6181 -144155
9001a14453H5229a01295J5148k03388I4513J76748A25944E5589a1127p4711B68311
8989a19045j95005a37359e8808j84507m648A25829e8216n4375c206k22462C31
8977i5125a5250B9197c83010g1800F9714b92367A08573K0195C640N9850c78805
8965b68767n5193d0845k4263C50010D1011a61526A96845c18553a22293B43965
8954C16924a8567j02697p3701D2030b30566O7855e9786m2794e15j69824B2889
8942A49253E8226a17469A21952J14771i9085C07798j13725I4648K2291d21438
8931A40527D4366J40670G918J16720M38689H6907O26060k17087O4609K97039j69865
8920F87663l4224L36680l57221L14976M9243m52889J77632M9240J218o3089J40127
$$ plain form
9001 -114453 85229 -101295 -86147 -289535 94513 271261 125944 55589 -11127 -85838 268311
8989 -119045 -314050 -137359 -58808 -243315 -247963 125829 -58216 -112591 -3206 -225668 331
8977 -95125 -15250 29197 -383010 -71800 69714 -292367 108573 128768 3640 63490 -378805
8965 -268767 -323960 -40845 -65108 350010 41011 -161526 196845 -318553 -122293 243965
8954 316924 -18567 -121264 -194965 42030 -230566 -162711 -59786 -102580 -515 -170339 22889
8942 149253 58226 -117469 121952 236723 -99085 307798 194073 94648 116939 -421438
8931 140527 44366 185036 7918 124638 563327 86907 712967 495880 560489 857528 687663
8920 687663 653439 990119 632898 947874 997117 544228 721860 771100 772318 709229 849356
8909H49356j54477k13237A59615M70901B06237L37344O0957R212B93060N79121
8899H72181l67280R7110G4646K88237J7823j68819L98641d8249D661a09208M4636
8888f4572A91692c862A76600q6138Q4892A4463a45393B04808a95690A01604c03750
8876h3604C36032A16552J17720f580I2232l0782J9294c47572J17505N9662B11333
$$ plain form
8909 849356 694879 481642 159615 630516 206237 543581 604538 613750 293060 872181
8899 872181 504901 602011 74646 362883 380706 211887 610528 -48249 4661 -109208 -64572
8888 -64572 191692 -3862 176600 90462 175354 14463 -145393 204808 -195690 101604 -303750
8876 -83604 336032 116552 234272 -6580 92232 61450 80744 -347572 -230067 -170405 211333
$$ [...]
##END NTUPLES=NMR SPECTRUM
##END=
