
##TITLE=AC1068_TOPL01_6519229_qYJ3gEzVqc
##JCAMPDX= 6.0         $$ Bruker NMR JCAMP-DX V2.0
##DATA TYPE= NMR SPECTRUM
##DATA CLASS= NTUPLES
##ORIGIN= BRUKER
##OWNER= Administrator
$$ 1.72 TOPSPIN		Version 2.1
$$ 2012-07-14 09:56:24.953 -0500  Administrator@TOPSPIN
$$ Compression mode = diff/dup
##.OBSERVE FREQUENCY= 400.02188249412
##.OBSERVE NUCLEUS= ^1H
##.ACQUISITION MODE= SIMULTANEOUS (DQD)
##.ACQUISITION SCHEME= undefined
##.AVERAGES= 64
##.DIGITISER RES= 22
##SPECTROMETER/DATA SYSTEM= spect
##.PULSE SEQUENCE= noesygpps1d.comp
##.SOLVENT NAME= COFFEE_meoh
##.SHIFT REFERENCE= INTERNAL, COFFEE_meoh, 1, 14.96214
##AUDIT TRAIL= $$ (NUMBER, WHEN, WHO, WHERE, PROCESS, VERSION, WHAT)
$$ ##TITLE= Audit trail, TOPSPIN		Version 2.1
$$ ##JCAMPDX= 5.01
$$ ##ORIGIN= Bruker BioSpin GmbH
$$ ##OWNER= Administrator
$$ $$ C:\Bruker\TOPSPIN/data/COFFEE/nmr/AC1068_TOPL01_6519229_qYJ3gEzVqc/52/pdata/1/auditp.txt
$$ ##AUDIT TRAIL=  $$ (NUMBER, WHEN, WHO, WHERE, PROCESS, VERSION, WHAT)
(   1,<2012-07-14 09:56:20.078 -0500>,<Administrator>,<TOPSPIN>,<go>,<TOPSPIN 2.1>,
      <created by zg
	started at 2012-07-14 09:44:49.812 -0500,
	POWCHK enabled, PULCHK disabled,
       configuration hash MD5:
       6B 1B 68 BB D9 2E 58 E2 7F 35 AD 54 07 DF 0E 41
       data hash MD5: 64K
       82 16 9E 5A 21 9D 02 92 23 1E 22 15 8D D9 8E 33>)
(   2,<2012-07-14 09:56:22.953 -0500>,<Administrator>,<TOPSPIN>,<proc1d>,<TOPSPIN 2.1>,
      <Start of raw data processing
       efp LB = 0.3 FT_mod = 6 PKNL = 1 PHC0 = 0 PHC1 = 0 SI = 128K 
       data hash MD5: 128K
       E4 1D 7A 62 8E 88 9D BE 77 92 87 16 75 63 D4 C5>)
(   3,<2012-07-14 09:56:24.156 -0500>,<Administrator>,<TOPSPIN>,<proc1d>,<TOPSPIN 2.1>,
      <pk PHC0 = 2.026978 PHC1 = 0 
       data hash MD5: 128K
       1F 4D 19 0F FD 0C 0B 23 95 48 BE AA E1 05 71 C5>)
(   4,<2012-07-14 09:56:24.625 -0500>,<Administrator>,<TOPSPIN>,<proc1d>,<TOPSPIN 2.1>,
      <abs ABSG = 1 
       data hash MD5: 128K
       6B 2D 7E 1C A3 2A 2E BA 8E ED A0 3B 25 D3 05 C8>)
(   5,<2012-07-14 09:56:24.718 -0500>,<Administrator>,<TOPSPIN>,<proc1d>,<TOPSPIN 2.1>,
      <abs ABSG = 2 
       data hash MD5: 128K
       AA F2 FF 0A BF 02 A5 A2 43 2D 9B 48 90 F5 D9 89>)
(   6,<2012-07-14 09:56:24.765 -0500>,<Administrator>,<TOPSPIN>,<proc1d>,<TOPSPIN 2.1>,
      <abs ABSG = 3 
       data hash MD5: 128K
       D6 B4 23 1B D5 6C 56 59 E4 E8 71 10 F2 A4 59 88>)
(   7,<2012-07-14 09:56:24.812 -0500>,<Administrator>,<TOPSPIN>,<proc1d>,<TOPSPIN 2.1>,
      <abs ABSG = 4 
       data hash MD5: 128K
       39 D1 ED E0 80 36 2E 61 CC 33 25 B2 FA AE 7C EC>)
(   8,<2012-07-14 09:56:24.875 -0500>,<Administrator>,<TOPSPIN>,<proc1d>,<TOPSPIN 2.1>,
      <abs ABSG = 5 
       data hash MD5: 128K
       F8 B5 BF 8E 77 DA A5 D6 1A C8 89 98 A1 BB 15 3E>)
$$ ##END=
$$ 
$$ $$ hash MD5
$$ $$ E4 C0 6F 4F C7 A6 88 40 E4 A6 55 30 DA B9 85 CE
##$RELAX= 
##$RELAX= 
##$RELAX= 
##$RELAX= 
##$RELAX= 
##$RELAX= 
##$RELAX= 
##$RELAX= 
##$RELAX= 
$$ Bruker specific parameters
$$ [...]
##$TP07= 0
##$TPNAME0= <>
##$TPNAME1= <>
##$TPNAME2= <>
##$TPNAME3= <>
##$TPNAME4= <>
##$TPNAME5= <>
##$TPNAME6= <>
##$TPNAME7= <>
##$TPOAL= (0..7)
0.5 0.5 0.5 0.5 0.5 0.5 0.5 0.5
##$TPOFFS= (0..7)
0 0 0 0 0 0 0 0
##$TUNHIN= 0
##$TUNHOUT= 0
##$TUNXOUT= 0
##$USERA1= <user>
##$USERA2= <user>
##$USERA3= <user>
##$USERA4= <user>
##$USERA5= <user>
##$V9= 5
##$VALIST= <valist>
##$VCLIST= <CCCCCCCCCCCCCCC>
##$VD= 0
##$VDLIST= <DDDDDDDDDDDDDDD>
##$VPLIST= <PPPPPPPPPPPPPPP>
##$VTLIST= <TTTTTTTTTTTTTTT>
##$WBST= 2048
##$WBSW= 25
##$XGAIN= (0..3)
0 0 0 0
##$XL= 0
##$YL= 0
##$YMAX_a= 36737724
##$YMIN_a= -24322709
##$ZGOPTNS= <>
##$ZL1= 120
##$ZL2= 120
##$ZL3= 120
##$ZL4= 120
##$ABSF1= 14.96214
##$ABSF2= -5.596042
##$ABSG= 5
##$ABSL= 3
##$ALPHA= 0
##$AQORDER= 0
##$ASSFAC= 0
##$ASSFACI= 0
##$ASSFACX= 0
##$ASSWID= 0
##$AUNMP= <proc_prof1d_extract.lims>
##$AXLEFT= 0
##$AXNAME= <>
##$AXNUC= <1H>
##$AXRIGHT= 0
##$AXTYPE= 0
##$AXUNIT= <>
##$AZFE= 0.1
##$AZFW= 0.1
##$BCFW= 0
##$BC_mod= 0
##$BYTORDP= 0
##$COROFFS= 0
##$CY= 15
##$DATMOD= 1
##$DC= 0
##$DFILT= <>
##$DTYPP= 0
##$F1P= 0
##$F2P= 0
##$FCOR= 0.5
##$FTSIZE= 131072
##$FT_mod= 6
##$GAMMA= 0
##$GB= 0
##$INTBC= 1
##$INTSCL= 1
##$ISEN= 128
##$LB= 0.3
##$LEV0= 0
##$LPBIN= 0
##$MAXI= 10000
##$MC2= 0
##$MEAN= 0
##$ME_mod= 0
##$MI= 0
##$NCOEF= 0
##$NC_proc= -3
##$NLEV= 6
##$NOISF1= 0
##$NOISF2= 0
##$NSP= 0
##$NTH_PI= 0
##$NZP= 0
##$OFFSET= 14.96214
##$PC= 1
##$PHC0= 2.026978
##$PHC1= 0
##$PH_mod= 1
##$PKNL= yes
##$PPARMOD= 0
##$PPDIAG= 0
##$PPIPTYP= 0
##$PPMPNUM= 2147483647
##$PPRESOL= 1
##$PSCAL= 4
##$PSIGN= 0
##$PYNMP= <proc.py>
##$REVERSE= no
##$SF= 400.020009178915
##$SI= 131072
##$SIGF1= 0
##$SIGF2= 0
##$SINO= 400
##$SIOLD= 131072
##$SPECTYP= <>
##$SREGLST= <1H.CDCl3>
##$SSB= 0
##$STSI= 131072
##$STSR= 0
##$SW_p= 8223.68421052631
##$SYMM= 0
##$S_DEV= 0
##$TDeff= 65536
##$TDoff= 0
##$TI= <>
##$TILT= no
##$TM1= 0
##$TM2= 0
##$TOPLEV= 0
##$USERP1= <user>
##$USERP2= <user>
##$USERP3= <user>
##$USERP4= <user>
##$USERP5= <user>
##$WDW= 1
##$XDIM= 131072
##$YMAX_p= 342756699
##$YMIN_p= -23647
##$CURPLOT= <Network HP LaserJet P1505>
##$CURPRIN= <$Network HP LaserJet P1505>
##$DFORMAT= <normdp>
##$LAYOUT= <+/1D_H.xwp>
##$LFORMAT= <normlp>
##$PFORMAT= <normpl>
##$SURQMSG= 1
$$ End of Bruker specific parameters
$$ ---------------------------------
##NTUPLES= NMR SPECTRUM
##VAR_NAME=  FREQUENCY,     SPECTRUM/REAL,   SPECTRUM/IMAG
##SYMBOL=    X,             R,               I
##VAR_TYPE=  INDEPENDENT,   DEPENDENT,       DEPENDENT
##VAR_FORM=  AFFN,          ASDF,            ASDF
##VAR_DIM=   131072,        131072,          131072
##UNITS=     HZ,            ARBITRARY UNITS, ARBITRARY UNITS
##FACTOR=    0.0627417313425164, 1,          1
##FIRST=     8223.62146879497, 5004,         -251639
##LAST=      0,             14520,           -252592
##MIN=       0,             -23647,          0
##MAX=       8223.62146879497, 342756699,    0
$$ Real data points
##PAGE= N=1
##DATA TABLE= (X++(R..R)), XYDATA
$$ [...]
64938 243460 245186 245432 245000 244404 243642 242511 240663 237737 233941 230287 227806 226592 225771 224325 221882
64923 221882 219011 216876 216338 217243 218748 220242 221558 222477 222841 223361 225404 229298 233404 235593 235458 234461
64907 234461 234083 234396 234410 233238 230915 228455 227146 227490 228880 230545 232513 235179 238156 240370 241405
64892 241405 242020 242998 244016 244055 242517 239550 235851 232696 231660 233300 236138 237839 237637 236912 237202 238487
64876 238487 239907 241217 242509 243119 242125 239919 238109 237592 237656 237282 236390 235272 233722 231544 229357 228188
64860 228188 228641 230886 234684 238658 240435 238812 235473 233262 232910 232769 231769 230995 231680 232996 233058 231483
64844 231483 229856 229830 231502 233569 234421 233134 230074 226812 225074 225376 226699 227554 227391 226908 227080 228095
64828 228095 229416 230712 232268 234441 237113 239775 241698 241975 240068 236705 233529 231399 229774 228291
64814 228291 227874 229210 231061 231573 230711 229824 229264 228225 226767 225958 225757 224801 222822 221294 220880 220211 218499
64797 218499 217491 219134 222689 225888 227898 229332 230244 230099 229282 228785 228659 228365 228402 229792 231943 232806
64781 232806 231581 229835 229456 230674 232616 234699 236809 238817 240482 241479 241352 239875 237421 234537 231427
64766 231427 228417 226410 225909 225982 225327 224126 223536 223604 223128 221660 220059 218823 217508 216336 216655 218842
64750 218842 221144 221891 221859 223109 226114 229276 230938 230820 229606 227999 226331 224655 223139 222275 222310 222532
64734 222532 221891 220470 219389 219082 218794 218303 218722 220623 222590 223091 222887 223987 226702 229426 231219 232899
64718 232899 235316 237991 240066 241437 242286 242410 241826 241417 242116 243747 245304 246217 246782 247350 247564 246686 244675
64701 244675 242716 242329 243751 245508 245982 245163 244293 243950 243366 241900 240329 239871 240299 239954 237854 235197
64685 235197 234176 235480 237415 237667 235649 232880 231323 231750 233551 235473 236329 235686 234516 234770 237403
64670 237403 240787 241931 239672 236049 233980 234090 234701 234642 234820 236443 238722 239609 238553 237142 236691 236475
64654 236475 235280 233699 233408 234473 234938 233489 231224 230075 230403 231150 231753 232753 234584 236645 237858
64639 237858 237721 236727 236083 236907 239295 242052 243717 243901 243428 243201 243276 243083 242190 240683 239004 237591 236611
64622 236611 235950 235528 235555 236348 237840 239438 240425 240483 239804 238805 237853 237226 237181 237856 239125 240764 242771 245239
64604 245239 247731 249146 248603 246365 243594 241299 239789 238903 238288 237522 236479 235518 234970 234601 234118 233922
64588 233922 234647 236080 237417 238516 239866 241295 241947 241887 242408 244058 245557 245669 245068 245047 245257 244162 241370
64571 241370 238145 235848 235124 236379 239522 243133 245260 245546 245480 246188 247084 247176 246580 245951 245352 244623 244188
64554 244188 244439 244662 243689 241608 239862 239427 239637 239297 238367 237893 238423 239165 238930 237409 235204 233030 231384
64537 231384 230703 231116 232052 232815 233579 235042 236927 237846 237205 236333 236878 238768 240553 241150 240237 237633 233688
64520 233688 230034 228520 229262 230773 232033 233185 234138 233959 232301 230308 229266 229102 228972 228672 228651 228966
64504 228966 228953 228023 226565 226025 227763 231409 234674 235574 234600 233799 234019 234434 234696 235700 237557 238573 237541
64487 237541 235765 235372 236505 237646 237997 237974 237693 236624 234956 234025 234923 237361 240112 242137 243365 244834
64471 244834 247778 251972 255393 256295 255232 254159 253939 253833 253195 252275 251295 249944 248219 246756 245910 245312
64455 245312 244628 243938 243073 241467 239137 237039 235942 235601 235524 235835 236760 237822 238245 237931 237543 237860 239322
64438 239322 241808 244471 246160 246486 246285 246684 247904 249166 249546 248732 247167 245603 244246 242519 240133
64423 240133 238262 238701 241647 245194 247380 247862 247186 245578 243404 241800 241520 241686 240990 239787 239615 240851
64407 240851 242321 243371 244697 246503 247292 245716 242873 241446 242719 245348 247110 247130 246195 245536 245730 246604
64391 246604 247669 248351 248006 246267 243719 241898 242009 243682 245393 246039 245597 244451 242946 241753 241695 242688
64375 242688 243657 244158 245351 248430 252628 255830 256944 256524 255155 252504 248441 244044 240752 239147 239154 240758
64359 240758 243622 246444 247756 247477 246973 247381 248483 249401 249828 250135 250636 251212 251641 252031 252894 254794 257680
64342 257680 260460 261585 260456 258208 256740 256941 258088 259013 259502 260393 262509 265723 268954 270883 270756
64327 270756 268801 265925 262995 260368 258132 256620 256427 257903 260787 264314 267508 269467 269812 269127 268740
64312 268740 269642 271523 273080 273325 272455 271456 271046 271112 271131 270959 271133 272331 274581 277103 278984 279889 280111
64295 280111 280178 280603 281795 283760 285963 287837 289556 291949 295472 299523 303007 305402 307116 308921 311163
64280 311163 313284 313989 312258 308646 305313 304178 305016 305964 305948 305857 306883 308462 308951 308186 308151 310455 313993
64263 313993 316141 316019 315392 316109 317754 318654 318438 318340 319107 319914 319824 319271 319314 320116 321196 322720 325328 328590
64245 328590 330866 331302 331073 331869 333769 335591 336942 338649 341037 342926 343070 341864 340858 341048 342353
64230 342353 344361 346505 347692 346999 345191 344557 346506 350029 353231 355650 358021 360227 360953 359611 357455
64215 357455 356214 356370 357290 358424 359705 361219 363130 365661 368569 370841 371537 370946 370485 371387 373740 376717
64199 376717 379402 381383 382861 384317 385989 387651 388909 389525 389407 388605 387489 386614 386152 385746 385221 385145
64183 385145 386287 388657 391460 393915 395894 397931 400839 405041 409929 414144 416917 418911 421456 425219
64169 425219 429970 435139 439980 443614 445852 447918 451558 457314 464185 470856 476513 480519 482363 482395 481996
64154 481996 482548 484516 487688 491770 496459 501303 505786 509460 512162 514469 517634 522301 527393 531063
64140 531063 532759 533479 533995 533980 533117 531945 531015 530248 529744 530210 531767 533225 533503 533048 532847 532796 532193 531358
64122 531358 531410 532574 533881 534675 535499 537271 540206 543613 546327 547625 548219 550006 554091 559419 564096
64107 564096 567573 570552 573290 575439 577412 580419 584856 589927 595062 600415 605710 609982 613046 615885
64093 615885 618897 621202 622631 624956 629642 635403 639709 642133 644484 647879 651561 654837 658469 663280
64079 663280 668585 673024 676322 679325 682652 686116 689367 692522 695997 700010 704290 708272 711667 714926
64065 714926 718949 724194 730148 735734 740113 743175 745514 748099 751830 757281 764795 774473 785713 797050
64051 797050 807164 816161 825246 834937 844297 852413 859936 868345 878042 888113 897911 907950 918993
64038 918993 931052 943720 956809 970178 983430 996504 1010202 1025330 1041429 1057145 1071949
64027 1071949 1086693 1102099 1117434 1131463 1144455 1158400 1174990 1193943 1213662 1233136 1252620
64016 1252620 1272651 1293284 1314644 1337555 1362770 1389806 1417447 1445543 1475533 1508812 1545280
64005 1545280 1583873 1623691 1663983 1703976 1743999 1786276 1833126 1884362 1937832 1992783 2051296
63994 2051296 2115772 2186196 2260818 2338527 2419531 2504398 2593715 2688381 2789139 2895815 3007889
63983 3007889 3125853 3251316 3385739 3529595 3682648 3844397 4014302 4192150 4378229
63974 4378229 4572837 4775947 4987850 5209490 5441045 5680413 5924375 6171532 6423163
63965 6423163 6680913 6944551 7212275 7482149 7752507 8021736 8288635 8552770 8813922
63956 8813922 9071366 9323972 9570586 9809814 10039713 10258278 10464257 10657360 10837797
63947 10837797 11005556 11159663 11298017 11418485 11520395 11604519 11671469 11720899 11752705 11768084
63937 11768084 11768590 11754796 11726887 11686099 11634296 11572185 11499144 11415160 11321981 11221849 11115837
63926 11115837 11004042 10886857 10765453 10641472 10516999 10394499 10275842 10161065 10048752
63917 10048752 9937937 9829335 9724465 9624112 9528226 9437050 9351597 9272732 9200202 9132783
63907 9132783 9069139 9008491 8950885 8897112 8848016 8803567 8762857 8725204 8690755 8659493 8630224
63896 8630224 8601386 8572709 8545132 8519004 8493215 8466406 8438309 8409354 8379417 8347451 8312166
63885 8312166 8272794 8229402 8182646 8133034 8080431 8024617 7966146 7905961 7844074 7779408 7711254
63874 7711254 7640033 7566141 7488898 7407524 7322676 7236168 7149426 7062900 6976530 6889799 6801512
63863 6801512 6710573 6617251 6522955 6428562 6333592 6237259 6139717 6042007 5945263 5850252 5757084
63852 5757084 5664902 5572208 5478154 5383476 5289816 5198141 5108194 5019503 4932420 4847798 4765826
63841 4765826 4685684 4606391 4527519 4448967 4370748 4293666 4219601 4149819 4082973 4016049 3947846
63830 3947846 3880456 3816520 3756112 3697584 3640661 3586899 3537026 3489435 3441979 3394194 3347052
63819 3347052 3301275 3256658 3212562 3168421 3124060 3080055 3037588 2997442 2959199 2921680 2884004
63808 2884004 2846102 2808597 2772473 2738480 2706312 2674509 2641680 2607838 2574274 2542166 2511657
63797 2511657 2482220 2453463 2425371 2398001 2371302 2345268 2320147 2296283 2273658 2251712 2229815
63786 2229815 2207933 2186610 2166249 2146641 2127330 2108174 2089319 2070803 2052494 2034358 2016465
63775 2016465 1998730 1980972 1963352 1946392 1930276 1914349 1897791 1880807 1864765 1850822 1838625
63764 1838625 1826623 1813590 1799566 1785342 1771387 1757456 1743080 1728289 1713837 1700561 1688400
63753 1688400 1676234 1663133 1649733 1637851 1628530 1620856 1612982 1603987 1594404 1585240 1576917 1568999 1560697
63740 1560697 1551701 1542643 1534397 1526766 1518377 1508334 1497513 1487530 1478870 1470860 1463325 1457091 1452514
63727 1452514 1448417 1443130 1436148 1428231 1420311 1412853 1405988 1399565 1393002 1385604 1377256 1368537 1360107 1352254
63713 1352254 1345136 1339030 1333927 1329004 1322996 1315325 1306612 1297929 1289820 1282324 1275588 1269891 1265024 1260196
63699 1260196 1254687 1248413 1241889 1236071 1232040 1230082 1229005 1227151 1224323 1221877 1220559 1219206 1216272 1211723
63685 1211723 1206481 1200826 1194577 1188314 1183049 1178810 1174832 1171033 1167984 1165236 1161122 1154840 1147760 1141985
63671 1141985 1138274 1135810 1133289 1129736 1124887 1119375 1114229 1109930 1106254 1102999 1100103 1097030 1093021 1088367
63657 1088367 1084474 1082036 1079868 1076202 1070654 1064435 1059187 1056019 1054940 1054655 1053534 1051312 1049272 1048438
63643 1048438 1048498 1048958 1050065 1051581 1051861 1049787 1046861 1045710 1046777 1048150 1048596 1048960 1050193 1051708 1052665 1053683
63627 1053683 1056063 1059847 1063675 1066374 1068000 1069424 1071422 1074191 1077314 1080008 1081487 1081223 1079121 1075780
63613 1075780 1072618 1071294 1072640 1076016 1079720 1082127 1082622 1081650 1079885 1077492 1074436 1071300 1069113 1068188 1067765
63598 1067765 1067129 1066459 1066059 1065515 1064354 1062939 1061801 1060583 1058708 1056687 1055535 1055058 1054079 1052470 1051547 1051964
63582 1051964 1052494 1051745 1050084 1048956 1048981 1049730 1050905 1052733 1055238 1057988 1060742 1063786 1067408 1071313 1074811
63567 1074811 1077506 1079717 1082193 1085424 1089389 1093961 1099187 1104897 1110495 1115675 1120944 1126668 1131946 1135559
63553 1135559 1138004 1141308 1146358 1151613 1155197 1157266 1159255 1161489 1162796 1162330 1160701 1159139 1158226 1157560 1156164
63538 1156164 1153154 1148535 1143428 1139130 1135795 1132321 1127634 1121933 1116576 1112793 1110500 1108482 1105813 1102829
63524 1102829 1100239 1097532 1093149 1086423 1078571 1071393 1065734 1061543 1058516 1055859 1052288 1047346 1042268 1038462
63510 1038462 1035512 1031809 1026863 1021810 1017666 1014358 1011672 1009895 1009002 1008159 1006713 1004982 1003562 1002491
63496 1002491 1001668 1001482 1002433 1004468 1007134 1009938 1012132 1012671 1011049 1007863 1004015 999712 994864 990171 986942
63481 986942 985762 985929 986359 986548 986562 986604 986955 987923 989298 989889 988216 984093 979292 976055 974817 973852 971366
63464 971366 967384 963165 959490 956493 954656 954560 955446 955433 953861 952278 952294 953470 954452 955330 957359 960736
63448 960736 964213 966877 968942 970604 971608 972457 974658 978820 983541 987225 990284 994393 1000078 1006247
63434 1006247 1011869 1016981 1021928 1026699 1031331 1036132 1041051 1045470 1049123 1052703 1056903 1061202 1064280 1065684
63420 1065684 1066521 1068268 1071231 1074435 1076820 1078130 1078602 1078333 1077447 1076584 1076446 1076618 1075585 1072471 1068321 1064952
63404 1064952 1062889 1061265 1059547 1058211 1057446 1056318 1054014 1051233 1049521 1049550 1050733 1052157 1053155 1053330 1052975
63389 1052975 1053413 1055900 1059976 1063739 1066037 1067625 1069777 1072614 1075490 1078289 1081405 1084857 1088392 1092335
63375 1092335 1097308 1102980 1107998 1111573 1114459 1117881 1122014 1126108 1129707 1133099 1136678 1140495 1144482 1148636
63361 1148636 1152828 1156672 1159697 1161529 1162045 1161697 1161492 1162126 1163060 1163021 1161620 1159869 1158771 1157960 1156302 1153376
63345 1153376 1149619 1145339 1140485 1135382 1130687 1126362 1121561 1116026 1110804 1106813 1103238 1098233 1091102 1082987
63331 1082987 1075459 1069132 1063781 1059075 1054793 1050732 1046881 1043560 1041110 1039455 1038088 1036460 1034395 1032208
63317 1032208 1030291 1028403 1025516 1020796 1014826 1009552 1006730 1006380 1006682 1005362 1001477 996161 991556 988826
63303 988826 987454 986617 986527 987684 989402 990369 990591 991322 992694 992931 990878 988063 986775 986757 985448 981445
63287 981445 976264 972381 970727 970674 971510 973024 974997 976863 977925 977758 976557 975119 974155 973478 972200 969884
63271 969884 967228 965433 965161 966149 967638 969094 970751 973321 976796 979799 980789 979922 978946 979200 980613 982914
63255 982914 986623 992041 998177 1003859 1009264 1015134 1020890 1025109 1027998 1031826 1038157 1045831 1052644 1058193
63241 1058193 1063940 1070991 1079132 1087905 1097272 1106782 1115215 1121961 1128213 1135875 1145465 1155753 1165402 1174232
63227 1174232 1182816 1191580 1200670 1210090 1219418 1227748 1234512 1240185 1245679 1251189 1256219 1260732 1265507 1271013
63213 1271013 1276485 1280673 1283431 1286107 1290290 1296276 1302831 1308389 1312462 1315782 1319098 1322211 1324576 1326538
63199 1326538 1329160 1332693 1335969 1337845 1338748 1340218 1343186 1347309 1351787 1356206 1360535 1364912 1369656 1375127
63185 1375127 1381333 1387861 1394322 1400695 1407187 1413872 1420524 1426681 1431965 1436498 1440917 1445744 1450824 1455661
63171 1455661 1460150 1464582 1468897 1472425 1474653 1475920 1477076 1478543 1480039 1481184 1482142 1483463 1485328 1487159
63157 1487159 1488157 1488118 1487421 1486257 1484405 1482055 1480284 1480118 1481331 1482755 1483564 1483539 1482180 1478592 1472740 1466286
63141 1466286 1461566 1459777 1460185 1460720 1459302 1455352 1450447 1447124 1446552 1447632 1448645 1449198 1449984 1451178 1451999
63126 1451999 1451805 1450859 1449864 1449337 1449613 1450983 1453602 1457468 1462520 1468343 1473801 1477531 1479129 1479603 1480491 1482666
63110 1482666 1485921 1489204 1491170 1491129 1489917 1489507 1491259 1494716 1498402 1501521 1504456 1507833 1511813 1516335 1521374
63095 1521374 1526529 1530742 1533016 1533467 1533361 1534033 1535942 1538878 1542804 1548113 1554930 1562460 1569440 1575450 1581511
63080 1581511 1589090 1598490 1608513 1617813 1626252 1634716 1643845 1653451 1663153 1673095 1683704 1695128 1707316
63067 1707316 1720580 1735639 1752981 1772395 1793201 1814688 1836225 1857192 1877115 1895909 1913982
63056 1913982 1932116 1951204 1971845 1993971 2016902 2039866 2062483 2084746 2106717 2128344 2149562
63045 2149562 2170393 2190940 2211318 2231603 2251813 2271791 2291012 2308596 2323872 2337059 2349178
63034 2349178 2361083 2372892 2384584 2396613 2409258 2421636 2432346 2441168 2449294 2457600 2465620 2472742
63022 2472742 2479553 2487081 2495210 2502812 2509287 2515203 2521462 2528544 2536463 2544862 2553145 2561142 2569521 2578907
63008 2578907 2588751 2597961 2606642 2616131 2626939 2637598 2646282 2652987 2659519 2667628 2677603 2688304 2698054
62995 2698054 2705762 2711728 2717311 2723547 2730299 2736879 2743029 2748856 2754189 2758570 2761738 2763648 2764169 2763240
62981 2763240 2761274 2759044 2757171 2755922 2755333 2755045 2753983 2750591 2743715 2733383 2720970 2708519 2697401
62968 2697401 2687245 2676398 2663794 2650139 2637019 2625099 2613629 2601439 2587963 2573496 2558979
62957 2558979 2545472 2533277 2521620 2509584 2497211 2485208 2473753 2462344 2450890 2440140 2430690
62946 2430690 2422072 2413178 2403232 2392127 2380286 2368560 2357827 2348175 2338604 2327921 2315928 2303584
62934 2303584 2292112 2282018 2272779 2263330 2253051 2242360 2232080 2222233 2211969 2200914 2190010 2180404
62922 2180404 2171820 2162651 2151679 2139245 2126685 2115021 2104222 2093407 2081691 2069087 2056618 2045333
62910 2045333 2035241 2025442 2015216 2004575 1993811 1983002 1972127 1961253 1950415 1939629 1929108
62899 1929108 1918994 1908685 1897099 1884135 1871376 1860582 1851673 1842958 1833293 1823171 1813527 1804271
62887 1804271 1794586 1784256 1774155 1765485 1758685 1752875 1746368 1738209 1729313 1721413 1714710 1707440 1698335
62874 1698335 1688577 1680274 1673695 1667401 1660769 1654816 1650233 1646053 1640848 1634113 1625886 1616247 1606189 1597856
62860 1597856 1592550 1588947 1584592 1578885 1573387 1569334 1566186 1562779 1558681 1553905 1548298 1541973 1535699 1530128
62846 1530128 1524958 1519479 1513714 1508492 1504476 1501498 1498882 1496129 1493249 1490541 1488017 1485036 1480767 1475278
62832 1475278 1470012 1466839 1466378 1467277 1467243 1464930 1460902 1456804 1453711 1451445 1449463 1447946 1447639 1448730 1450334
62817 1450334 1451241 1451058 1450491 1450520 1451446 1452956 1455083 1458574 1463780 1469511 1473949 1476798 1479664 1484011 1489707
62802 1489707 1496089 1503373 1511980 1521330 1530656 1540519 1552231 1565980 1580860 1596577 1613639 1631742
62790 1631742 1649496 1666189 1682452 1698668 1714129 1728591 1743386 1759852 1777553 1795162 1812327
62779 1812327 1829432 1846059 1861070 1874156 1886281 1898536 1911199 1923812 1935564 1945630 1953751
62768 1953751 1960406 1966126 1970992 1975224 1979688 1985024 1990662 1995422 1998705 2000268 1999374 1995329 1988732 1981088
62754 1981088 1973152 1964794 1956449 1949238 1943100 1936131 1926862 1916443 1907458 1900890 1895262 1888650 1880589 1871698
62740 1871698 1862318 1852336 1842164 1833020 1825769 1819887 1814157 1808243 1802941 1798804 1795426 1792436 1790422 1790070
62726 1790070 1790935 1791966 1792905 1794246 1796071 1797990 1800249 1803854 1809166 1815263 1821044 1826266 1831135 1835714
62712 1835714 1840285 1845684 1852644 1861178 1871095 1882556 1895383 1908153 1918863 1926678 1932618 1938466 1945333
62699 1945333 1953204 1961422 1969407 1977002 1984209 1990632 1995564 1998891 2001642 2005016 2008815 2011335 2011118 2008499
62685 2008499 2005126 2002177 1999509 1996370 1992210 1986451 1978205 1967118 1954341 1941776 1930162 1918634 1906381
62672 1906381 1893842 1881661 1869190 1855015 1838660 1821006 1803248 1786175 1770228 1755386 1741012
62661 1741012 1726597 1712611 1699912 1688407 1677146 1665751 1654765 1644454 1634268 1623812 1613369
62650 1613369 1603027 1592258 1581010 1570399 1561455 1553744 1546031 1537842 1529704 1522167 1515354 1509276 1503993
62637 1503993 1499536 1496003 1493395 1490998 1487483 1482302 1476622 1472104 1468989 1466099 1462606 1458993 1456190 1454408
62623 1454408 1453094 1451617 1449759 1447764 1445947 1444177 1441835 1438471 1434434 1430724 1428388 1427987 1429225 1430911
62609 1430911 1431786 1431690 1431451 1431394 1430776 1429256 1428097 1428872 1431439 1434288 1436626 1438939 1441506 1443555 1444333 1444168
62593 1444168 1444041 1444600 1445845 1447198 1447708 1446791 1445037 1443707 1443238 1442854 1441844 1440435 1438984 1437050 1433991
62578 1433991 1429989 1425753 1421430 1416465 1410532 1404116 1398091 1392955 1388387 1383436 1377299 1370189 1363258 1357442
62564 1357442 1352465 1347185 1340767 1333311 1325543 1318207 1311693 1305924 1300504 1295117 1289842 1285050 1280937 1277097
62550 1277097 1272568 1266552 1259346 1252432 1247318 1244334 1242875 1242549 1243404 1244939 1245793 1245017 1243211 1241848 1241735
62535 1241735 1242670 1244316 1246689 1249790 1253351 1257088 1260734 1263818 1266049 1268159 1271685 1277233 1283378 1288167
62521 1288167 1291687 1296260 1303605 1312542 1320220 1325230 1328579 1331823 1335425 1339315 1343874 1349357 1354940 1359347
62507 1359347 1362170 1363758 1364085 1362847 1360589 1358659 1357677 1357001 1356058 1355292 1355227 1355388 1354864 1353307 1350708 1346707
62491 1346707 1341015 1334247 1327562 1321631 1316512 1312260 1308898 1305875 1302341 1298092 1293742 1289927 1286781 1284156
62477 1284156 1281876 1279810 1278144 1277468 1277979 1278650 1277893 1275201 1271542 1268009 1264698 1261137 1257294 1253837 1251753
62462 1251753 1251774 1253586 1255501 1255639 1253839 1251730 1250537 1249637 1247961 1246024 1245437 1246723 1248814 1250692 1252375
62447 1252375 1253947 1254647 1253656 1251179 1248056 1244668 1240930 1237267 1234825 1234353 1235079 1235031 1232621 1228066 1223160
62432 1223160 1219465 1216777 1213783 1210184 1207453 1207036 1208508 1210336 1212082 1214641 1218195 1221169 1221876 1220298
62418 1220298 1217458 1213749 1209059 1204113 1200356 1198367 1197463 1197116 1197689 1199352 1201389 1203324 1205797 1209261 1212578
62403 1212578 1214118 1213863 1213206 1212980 1213122 1214174 1217284 1222062 1225972 1227122 1226718 1227559 1230758 1235196 1239754
62388 1239754 1244682 1250716 1257991 1266109 1274407 1281928 1287957 1292960 1298397 1305365 1313939 1323865 1335051 1347132
62374 1347132 1359400 1371602 1383993 1396066 1406150 1413157 1418211 1423630 1430610 1438737 1447338 1456152 1464646
62361 1464646 1471825 1477278 1481821 1486691 1492387 1498498 1504216 1508857 1512215 1514698 1516860 1518794 1520231 1521198
62347 1521198 1522063 1522812 1522835 1521660 1519530 1516999 1514380 1511804 1509363 1506853 1503759 1499965 1496231 1493484 1491682
62332 1491682 1489695 1486357 1481466 1475827 1470519 1466108 1462522 1459568 1457281 1455499 1453428 1450309 1446505 1443241
62318 1443241 1441154 1439829 1439051 1439576 1441892 1444812 1446167 1444779 1441235 1437102 1434030 1433195 1434586 1436737 1437934
62303 1437934 1437902 1437946 1439399 1442464 1446426 1450324 1453303 1455002 1455863 1456671 1457682 1458621 1459524 1460960 1463322 1466512
62287 1466512 1470533 1475821 1482657 1490636 1499021 1507230 1514856 1521634 1527700 1533482 1539152 1544474 1549368 1554223
62273 1554223 1559553 1565729 1573129 1581971 1591795 1601609 1610760 1619174 1626797 1633646 1640556 1648663 1657494 1664709
62259 1664709 1668793 1671157 1674305 1678520 1681897 1683388 1684157 1685555 1687178 1687694 1686652 1684613 1682196 1679862
62245 1679862 1678221 1677582 1677177 1675570 1672185 1668113 1665046 1663533 1662528 1660711 1657898 1654804 1651771 1648504
62231 1648504 1645183 1642852 1642052 1641817 1640977 1639910 1639789 1640371 1640022 1638144 1636225 1635855 1636863 1638245 1639944 1642643
62215 1642643 1646443 1650865 1655794 1661403 1667374 1673180 1679016 1685445 1692195 1698294 1703563 1708950 1715121 1721762
62201 1721762 1728874 1737694 1749217 1762238 1774092 1783549 1792150 1802249 1814260 1826401 1837005 1846448
62189 1846448 1856509 1868148 1880485 1892084 1902686 1913169 1923965 1934178 1942506 1948645 1953540 1958484
62177 1958484 1964245 1970921 1978286 1986116 1994205 2002181 2009671 2016865 2024623 2033436 2042426 2050072 2056123 2062047
62163 2062047 2069206 2077246 2084838 2091344 2096970 2101898 2106433 2111710 2118783 2126679 2132644 2135200 2136208 2138983
62149 2138983 2144745 2151755 2157690 2162024 2165974 2170840 2176804 2183091 2189028 2194903 2201839 2210813 2221890 2234305
62135 2234305 2246987 2259077 2270445 2281937 2294696 2308957 2323885 2338834 2354130 2370196 2386661
62124 2386661 2403142 2420281 2438820 2457931 2475787 2491960 2508143 2526170 2546382 2568374 2592178
62113 2592178 2617826 2644528 2671292 2697991 2725092 2752765 2781018 2810203 2840424 2870761 2900243
62102 2900243 2929589 2960778 2994536 3029254 3063112 3096485 3131371 3168681 3207056 3244524 3280681
62091 3280681 3316667 3353285 3389868 3425428 3460561 3497347 3536934 3577776 3617053 3653830 3690039
62080 3690039 3728085 3768096 3808108 3846469 3883289 3919672 3956497 3994383 4033992 4075289 4116705
62069 4116705 4156143 4193302 4230256 4269116 4309646 4349893 4388653 4426388 4464022 4501996 4540503
62058 4540503 4579374 4617381 4653079 4687180 4722879 4762460 4804225 4844160 4880321 4914285 4948493
62047 4948493 4983715 5019373 5054861 5089691 5123261 5155442 5186915 5218287 5249285 5279339 5308547
62036 5308547 5337462 5366330 5395203 5424521 5454828 5485932 5517000 5547674 5578574 5610417 5642826
62025 5642826 5674325 5703521 5730259 5755695 5781284 5807690 5834549 5861105 5886968 5912361 5937831
62014 5937831 5963703 5989709 6015194 6039789 6063666 6087015 6109604 6131242 6152396 6173756 6195272
62003 6195272 6216189 6236067 6255233 6274211 6293258 6312502 6331790 6350225 6366554 6380413 6392641
61992 6392641 6404117 6414930 6425060 6435122 6445778 6456927 6468089 6479105 6489784 6499358 6507100 6513203
61980 6513203 6518298 6522351 6524858 6525972 6526639 6527622 6529130 6531354 6534522 6538294 6541950 6545465 6549748 6555444
61966 6555444 6562076 6568689 6574844 6580638 6586285 6592263 6599558 6609054 6620569 6632869 6644912 6656939 6670205
61953 6670205 6685596 6702792 6721010 6740312 6761535 6784857 6809244 6833824 6859082 6885957 6914502
61942 6914502 6944582 6977392 7014653 7056150 7099564 7143341 7188438 7236558 7288002 7342461 7400874
61931 7400874 7464878 7534793 7609445 7687779 7769309 7853101 7937976 8024326 8114421 8209917 8309677
61920 8309677 8410873 8511746 8612436 8713498 8814786 8915980 9017287 9118876 9219997
61911 9219997 9319275 9415903 9510066 9602029 9691227 9776533 9857020 9931903 9999884 10059298 10109239
61900 10109239 10150079 10182617 10207090 10223376 10231749 10232882 10227308 10215368 10197447 10173658 10143397 10105957
61888 10105957 10061775 10012427 9959176 9902080 9840968 9776707 9710785 9643762 9574764 9502770 9428189
61877 9428189 9353166 9280510 9212279 9148997 9089891 9033842 8980318 8929629 8882432 8839005 8798904
61866 8798904 8761286 8725574 8691823 8660475 8631952 8606539 8584328 8564864 8547003 8529708 8513306
61855 8513306 8499529 8489996 8484683 8481947 8479780 8476924 8473184 8469170 8465702 8463122 8461062 8458844 8455842 8451298
61841 8451298 8444203 8433914 8420790 8405775 8389477 8372152 8354440 8337216 8320238 8301647 8279643
61830 8279643 8254536 8228537 8203498 8179479 8155753 8132584 8111281 8092486 8075073 8057287 8038907
61819 8038907 8021825 8008294 7998814 7992003 7986392 7981955 7979927 7981553 7987284 7997008 8010832 8029742 8055574
61806 8055574 8090158 8134177 8186751 8246139 8310931 8380935 8457491 8543104 8640327 8750421 8872896
61795 8872896 9006178 9148416 9297794 9452901 9613504 9780509 9954395 10133768 10316083
61786 10316083 10499788 10685169 10873059 11063385 11254975 11446049 11634700 11819825 12002132
61777 12002132 12183401 12363834 12540355 12708191 12863926 13006427 13135163 13248695 13345170
61768 13345170 13423740 13485160 13531280 13564007 13584293 13591775 13585525 13565281 13531826 13486259 13429262
61757 13429262 13361263 13283016 13195750 13100781 12999067 12891063 12776867 12656460 12529913 12397715
61747 12397715 12261348 12123582 11987682 11855956 11729325 11608445 11494462 11387946 11287622
61738 11287622 11191384 11098637 11010713 10928665 10851559 10777496 10705551 10635990 10569028 10504300 10441530
61727 10441530 10381119 10323800 10269973 10219602 10172722 10129839 10091584 10057787 10027307 9999107 9973089
61716 9973089 9949148 9925700 9900329 9872095 9842139 9811395 9778551 9740953 9696895 9646430 9590727
61705 9590727 9531555 9470786 9409230 9346051 9280063 9211323 9140741 9068545 8994225 8917859 8840561
61694 8840561 8763549 8687539 8612794 8538783 8463894 8386591 8306919 8225895 8143530 8058802 7971752
61683 7971752 7884058 7796818 7709041 7619264 7527673 7435645 7344056 7253157 7163486 7075733 6989946
61672 6989946 6905810 6823475 6743280 6664904 6587584 6511083 6435688 6361407 6287873 6215009 6143191
61661 6143191 6072879 6004579 5938897 5875911 5814683 5754201 5694744 5637590 5583351 5531309 5480424
61650 5480424 5430306 5381143 5333349 5287408 5243460 5200875 5158772 5117016 5076133 5036275 4996990
61639 4996990 4958108 4920014 4882789 4845897 4809191 4773548 4739824 4707623 4675683 4643326 4611016
61628 4611016 4579505 4548731 4517624 4485032 4451020 4417167 4385255 4355736 4327908 4301362 4276469
61617 4276469 4253343 4231184 4209027 4186567 4163904 4141203 4119064 4098519 4079944 4062316 4044086
61606 4044086 4024526 4003977 3983305 3963524 3945234 3927830 3909842 3890765 3871971 3855039 3839914
61595 3839914 3825661 3812362 3800854 3790930 3781297 3771377 3761709 3752448 3743012 3733714 3726232 3721443 3717990
61582 3717990 3714068 3709708 3706043 3703034 3699463 3694905 3690355 3686751 3684031 3681931 3680770 3681009 3682734 3685886
61568 3685886 3690360 3695430 3699727 3702393 3703993 3705775 3708247 3710911 3713214 3715285 3717611 3720241 3722478 3723467
61554 3723467 3723199 3722795 3723423 3725003 3726510 3727627 3729322 3732336 3735871 3738709 3741137 3744640 3749793 3755743 3762111
61539 3762111 3770069 3780547 3792198 3802510 3810854 3819473 3831321 3847657 3867870 3890835 3915904 3942991
61527 3942991 3972160 4003154 4035367 4068565 4103460 4140944 4180708 4221400 4262572 4305580 4351760
61516 4351760 4400255 4448714 4496099 4543797 4593686 4645914 4699027 4751684 4803585 4855058 4906307
61505 4906307 4957060 5006592 5054132 5099466 5142969 5184812 5224440 5261342 5296053 5329628 5362054
61494 5362054 5392028 5418740 5443167 5466879 5489982 5511061 5529003 5544014 5556926 5568504 5579792
61483 5579792 5592063 5605587 5618976 5630541 5640010 5648330 5656282 5664255 5673106 5684071 5697474 5712381
61471 5712381 5727907 5744257 5762211 5782230 5804420 5828754 5854827 5881974 5910111 5939975 5971930
61460 5971930 6004994 6037689 6069596 6101400 6133658 6166220 6198874 6231890 6265810 6301068 6337820
61449 6337820 6375721 6413824 6451082 6487070 6521998 6556090 6589217 6621052 6651266 6679677 6706607
61438 6706607 6732977 6759653 6786560 6812724 6837161 6859539 6880144 6899532 6918209 6936337 6953794
61427 6953794 6970605 6987019 7002906 7017531 7030422 7042057 7053084 7063264 7072155 7080772 7091470 7105745
61415 7105745 7122691 7139997 7156132 7171508 7187961 7207161 7229091 7252077 7274798 7297961 7323281
61404 7323281 7351101 7380322 7410813 7444412 7482641 7524418 7567031 7608766 7649804 7691253 7734371
61393 7734371 7780197 7828668 7878061 7926271 7972900 8019483 8067642 8117630 8168646 8219709 8269794
61382 8269794 8317565 8361620 8401263 8437104 8470736 8503322 8534256 8561536 8583743 8601320 8615657
61371 8615657 8627425 8636323 8641839 8643497 8640654 8633016 8621387 8607193 8591137 8572846 8551745 8527698
61359 8527698 8500821 8471399 8440152 8408045 8375713 8343514 8312057 8281855 8252319 8221885 8189662
61348 8189662 8156516 8124187 8093788 8065451 8038986 8014368 7991660 7970760 7951230 7932571 7915010
61337 7915010 7899827 7888131 7879151 7870583 7861151 7852209 7846200 7843941 7844043 7844598 7844597 7843819 7842272 7840214 7838369
61322 7838369 7837675 7838634 7840785 7842733 7842914 7840584 7836025 7829699 7821572 7811603 7800611 7789912 7779887 7769337
61308 7769337 7756605 7741216 7724141 7706510 7688300 7668461 7646208 7621981 7597072 7572540 7548700
61297 7548700 7525398 7502143 7477930 7451547 7422639 7392234 7361864 7332326 7303700 7276283 7250775
61286 7250775 7227320 7204891 7182000 7157932 7133135 7108639 7085313 7063473 7042903 7023243 7004537
61275 7004537 6987410 6972495 6959541 6947211 6933959 6919303 6904263 6890472 6878791 6868784 6859449
61264 6859449 6850208 6841016 6831823 6822533 6813644 6806339 6801253 6797220 6791905 6783914 6773862 6763126 6752137
61251 6752137 6740489 6728237 6716013 6703747 6690205 6674230 6655675 6634610 6610490 6583200 6554464
61240 6554464 6526830 6500952 6474905 6446573 6415788 6383452 6349414 6312518 6272695 6231977 6192894
61229 6192894 6156269 6120867 6085038 6048377 6011901 5976809 5943106 5909379 5873972 5836598 5798912
61218 5798912 5763454 5731739 5703120 5675506 5647285 5618570 5590671 5564703 5540955 5519152 5498668
61207 5498668 5478428 5457272 5434765 5411272 5387094 5362067 5336332 5310968 5287209 5265254 5244350
61196 5244350 5223869 5203706 5183792 5163888 5143963 5124138 5104036 5082653 5059208 5033809 5007066
61185 5007066 4979440 4951238 4922902 4894745 4866462 4837271 4806647 4774766 4742261 4709660 4677044
61174 4677044 4644083 4610457 4576373 4542561 4509588 4477246 4444923 4412559 4380908 4350577 4321065
61163 4321065 4291087 4259867 4227778 4195607 4163536 4131265 4099006 4067768 4038363 4010416 3982711
61152 3982711 3954323 3925095 3895309 3865541 3836857 3810347 3786009 3762499 3738492 3713970 3689774
61141 3689774 3666368 3643732 3622125 3601942 3582766 3563486 3543633 3523777 3504259 3484509 3464290
61130 3464290 3444742 3427171 3411344 3396097 3381178 3367210 3353941 3339950 3324455 3308253 3292425
61119 3292425 3277190 3262557 3248993 3236528 3224098 3210745 3196836 3183048 3168787 3152867 3135530
61108 3135530 3118566 3103395 3089909 3077210 3064486 3051129 3036933 3022413 3008090 2993363 2977069
61097 2977069 2959476 2942765 2928918 2917664 2906951 2894801 2880433 2864281 2847625 2831822 2817398
61086 2817398 2803999 2791290 2779413 2768565 2758743 2750005 2742109 2733763 2723325 2710782 2698054 2686732
61074 2686732 2676567 2666897 2658270 2651352 2645163 2638083 2630153 2622903 2617173 2612645 2609377 2608125 2608813 2610098
61060 2610098 2610887 2611079 2610544 2608774 2606303 2605155 2606875 2610896 2615659 2620606 2626214 2632757 2639960 2647409 2654558
61045 2654558 2660850 2666693 2673890 2684139 2697275 2711721 2726485 2741993 2759202 2778685 2800480 2824092
61033 2824092 2848655 2873756 2900036 2928371 2958691 2990337 3023411 3058823 3096983 3137481 3180256
61022 3180256 3226063 3275344 3327624 3382673 3441368 3504515 3571451 3641039 3713830 3792145 3877779
61011 3877779 3970531 4069447 4174838 4288349 4411293 4543642 4684984 4836129 4999382 5177065
61001 5177065 5369962 5577357 5798368 6032740 6280102 6538891 6806720 7082136 7365966
60992 7365966 7660780 7968818 8289981 8621306 8958229 9296677 9634626 9972529 10313074
60983 10313074 10660433 11018297 11386735 11760041 12128031 12480188 12809048 13110526 13382967
60974 13382967 13627820 13851377 14063924 14274728 14486117 14691562 14879146 15037324 15158929
60965 15158929 15241918 15288149 15302221 15290966 15262415 15223037 15174354 15112078 15029497 14922530 14791860
60954 14791860 14640955 14473610 14294351 14110124 13929294 13757547 13594843 13436588 13277401
60945 13277401 13113760 12944379 12769869 12592809 12417631 12249657 12093641 11952485 11826458
60936 11826458 11713249 11609294 11511929 11420907 11337870 11264053 11198152 11136558 11076094 11016664 10960996
60925 10960996 10911798 10869692 10833973 10804452 10781685 10765699 10755244 10747869 10739868 10726635 10704864
60914 10704864 10675289 10642478 10611125 10582817 10556342 10529774 10501025 10466957 10423487 10367255 10297291
60903 10297291 10215611 10126783 10036330 9948296 9863715 9781260 9698835 9614210 9525072 9429941 9329242
60892 9329242 9224794 9118237 9010641 8903243 8797168 8691997 8585604 8476020 8362932
60883 8362932 8247181 8129776 8011918 7895001 7779493 7664156 7547266 7428550 7309481
60874 7309481 7191873 7076693 6964044 6853638 6745219 6638860 6534957 6433844 6335566 6240135
60864 6240135 6147671 6058035 5970599 5884696 5800194 5717465 5637136 5560016 5486755 5417146 5350122
60853 5350122 5284914 5221943 5162007 5104845 5049114 4993817 4939288 4886510 4835830 4786620 4738292
60842 4738292 4691378 4647173 4606043 4566535 4526841 4486880 4448019 4410719 4373642 4335622 4297426
60831 4297426 4260640 4225520 4191008 4156409 4122084 4088704 4056699 4026298 3997333 3969098 3941048
60820 3941048 3913328 3885962 3858040 3828907 3799941 3773767 3751342 3730702 3709011 3685231 3660647
60809 3660647 3637465 3617029 3598610 3579761 3558566 3535787 3514162 3495593 3479745 3465227 3450907
60798 3450907 3435804 3419104 3401175 3383644 3367547 3352067 3335967 3319598 3304517 3291437 3279515
60787 3279515 3267611 3255497 3243771 3233058 3223430 3214410 3205722 3197962 3191974 3187345 3182305 3175656 3168147
60774 3168147 3161214 3154960 3148295 3140720 3132989 3125990 3119714 3113399 3106198 3097834 3089079 3081284 3074778 3068105
60760 3068105 3059719 3050237 3041989 3036212 3031719 3026526 3019839 3012015 3003523 2994613 2985459 2975935 2965675 2954824
60746 2954824 2944235 2934374 2924594 2914301 2904411 2896616 2891216 2886685 2881572 2875974 2870653 2865437 2859259
60733 2859259 2851384 2842030 2832046 2822606 2814820 2808673 2802441 2794274 2784621 2775941 2769407 2763042 2754336 2743826
60719 2743826 2734376 2727165 2720359 2712189 2703427 2695524 2687799 2678431 2667708 2658302 2652008 2647600 2642429 2635047
60705 2635047 2625768 2615752 2606336 2598465 2591708 2584198 2574418 2562873 2551322 2540686 2530630 2521039 2512710
60692 2512710 2506222 2501053 2496352 2491824 2487133 2481169 2473036 2463560 2454741 2447535 2441050 2434108 2426650 2419058
60678 2419058 2411006 2401908 2392081 2382528 2373658 2365048 2356524 2348672 2341961 2335935 2329791 2323474 2317791 2313445
60664 2313445 2310161 2306847 2302552 2297217 2291424 2285532 2279458 2273408 2268168 2264186 2260746 2256772 2252285 2248378
60650 2248378 2245808 2244224 2242725 2240490 2236869 2231845 2226684 2223341 2222633 2223513 2224487 2225090 2225489 2225391 2224258 2222347
60634 2222347 2220669 2219799 2219246 2218194 2216530 2214996 2214337 2214384 2214105 2212693 2210383 2207912 2205511 2203044 2200869
60619 2200869 2199581 2198823 2197381 2194814 2191963 2189285 2185774 2180528 2174583 2169934 2167100 2164762 2161683 2157967
60605 2157967 2154357 2151216 2148438 2145771 2142993 2140083 2137238 2134462 2131286 2127316 2122861 2118735 2115763 2114764
60591 2114764 2116281 2119437 2121587 2120311 2115837 2110688 2106970 2104776 2103174 2101658 2100268 2099087 2098173 2097559
60577 2097559 2097068 2096476 2095908 2095610 2095320 2094482 2093221 2092507 2093082 2094663 2096414 2097817 2098917 2100106 2101845 2104345
60561 2104345 2107449 2110952 2114793 2118582 2121306 2122272 2122207 2122784 2125009 2128691 2133185 2137886 2142099 2145470 2148729
60546 2148729 2153105 2158849 2165178 2171792 2179375 2188197 2197294 2205623 2213213 2220595 2227983 2235702 2244582 2254960
60532 2254960 2265724 2275225 2282852 2289167 2294949 2300913 2308100 2317712 2330438 2346177 2364231 2383473 2402857
60519 2402857 2422300 2442849 2465503 2490202 2516325 2543729 2572783 2603747 2636736 2671952 2709351
60508 2709351 2748348 2788424 2829737 2872522 2916218 2959919 3003490 3047493 3092087 3136730 3181043
60497 3181043 3225228 3269457 3313374 3356515 3398887 3440913 3482898 3524422 3564020 3599676 3630084
60486 3630084 3655534 3677346 3696564 3713358 3727306 3737723 3743965 3746018 3744731 3740936 3734366 3724036
60474 3724036 3709758 3692718 3674364 3655117 3634323 3611049 3584718 3555359 3523611 3490446 3456814
60463 3456814 3423629 3391873 3362224 3334388 3307207 3279715 3251994 3224862 3199010 3174751 3152434
60452 3152434 3132570 3115213 3099460 3084013 3068378 3053248 3039514 3027194 3015608 3004237 2992930
60441 2992930 2981522 2969920 2958563 2948149 2938824 2930243 2922440 2915886 2910608 2906133 2902527 2900330 2898879
60428 2898879 2895869 2889575 2880745 2871266 2861803 2851963 2842018 2832710 2823509 2812822 2800245 2787213 2774889
60415 2774889 2762611 2749101 2734267 2719054 2704244 2690039 2676240 2662196 2647054 2630621 2613627
60404 2613627 2596689 2579533 2561782 2544074 2527696 2513187 2499804 2486283 2471822 2456368 2440200
60393 2440200 2423296 2405213 2385871 2366251 2347761 2330843 2314836 2299278 2284588 2271172 2258643
60382 2258643 2246521 2234941 2224003 2213011 2201222 2188975 2177167 2165880 2154441 2142747 2131555
60371 2131555 2121253 2111206 2100742 2090286 2081102 2074151 2069370 2065765 2062086 2057774 2053388 2049802 2046943
60358 2046943 2043782 2039687 2035239 2031288 2027710 2023726 2019276 2015405 2013119 2012305 2011956 2011094 2009200 2006059 2001750
60343 2001750 1996890 1992520 1989361 1987200 1985177 1982721 1980108 1978086 1977053 1976670 1976256 1975476 1974581 1973974 1973627
60328 1973627 1973025 1971701 1969674 1967328 1965103 1963431 1962650 1962618 1962542 1961663 1960216 1959374 1960236 1963130 1967805 1973623
60312 1973623 1979285 1983052 1983945 1982601 1980511 1978679 1977527 1977704 1979971 1984059 1988390 1991435 1992942 1993660 1994464
60297 1994464 1996312 2000414 2007354 2016039 2024362 2031261 2037612 2044791 2052843 2060517 2066838 2072160 2077776 2084909
60283 2084909 2093980 2104468 2115319 2125750 2135800 2146077 2157053 2168841 2181605 2195956 2212797
60272 2212797 2232726 2255353 2279072 2301937 2323381 2345052 2369422 2397465 2428076 2459747 2492013
60261 2492013 2524994 2558420 2591989 2626342 2662681 2701321 2741339 2781901 2823308 2866342 2910961
60250 2910961 2956157 3000911 3044924 3088559 3132522 3177551 3223868 3270627 3316291 3360050 3402744
60239 3402744 3445933 3490071 3534153 3577239 3619620 3662042 3704427 3746173 3787322 3828447 3869456
60228 3869456 3909571 3948706 3987815 4027479 4067127 4106445 4146655 4189261 4233933 4278796 4322711
60217 4322711 4366309 4410628 4455638 4500405 4544137 4586804 4629233 4672789 4718436 4765827 4813592
60206 4813592 4860586 4906450 4951059 4994182 5036029 5077511 5119514 5162264 5205809 5250520 5296450
60195 5296450 5342433 5386676 5428432 5468591 5508465 5548492 5588436 5628365 5668639 5709069 5748941
60184 5748941 5788341 5828744 5871424 5915467 5958314 5998494 6037046 6075953 6115979 6156722 6198166
60173 6198166 6241131 6286306 6333540 6382216 6431881 6482529 6534520 6588097 6642736 6697413 6751931
60162 6751931 6807614 6866150 6928201 6993695 7062749 7135242 7209921 7285301 7361501 7440014 7521692
60151 7521692 7606253 7693926 7786009 7883016 7983519 8085696 8189080 8293942 8399937 8506590
60141 8506590 8614498 8724784 8837433 8951043 9064059 9175553 9285199 9393434 9501394
60132 9501394 9609627 9716717 9820164 9918959 10014540 10108723 10201155 10289389 10371271 10446780 10517481
60121 10517481 10584643 10648154 10707063 10760580 10808416 10850842 10889068 10925038 10959793 10992023 11019366
60110 11019366 11041449 11060677 11079438 11097449 11112603 11123785 11132029 11139408 11147603 11157150 11167270 11176683
60098 11176683 11185240 11194372 11205386 11217907 11230706 11243327 11255655 11266513 11274487 11280295 11286847 11296290
60086 11296290 11307998 11319926 11330948 11341157 11350711 11359331 11366680 11372653 11377406 11381399 11385113 11388573 11391482
60073 11391482 11393844 11395903 11397384 11397661 11396963 11396534 11396996 11397344 11396326 11394094 11391529 11388621 11384848 11380815 11377909
60058 11377909 11375973 11372898 11367342 11360680 11355111 11350602 11345184 11337884 11329852 11322364 11315143 11307347 11299084 11290971
60044 11290971 11282830 11273832 11263481 11251539 11237384 11220553 11201793 11182542 11163377 11143956 11124374
60033 11124374 11105334 11086788 11067798 11048256 11029398 11011815 10994294 10975807 10957603 10941890 10929094
60022 10929094 10917903 10907526 10898257 10889949 10881606 10872994 10865370 10860042 10857046 10855631 10855249 10855579 10856244 10856948
60008 10856948 10857518 10857735 10857734 10858493 10860892 10864064 10865796 10865142 10863672 10863262 10863475 10862208 10858516 10853660 10849444 10846490
59992 10846490 10844423 10842818 10841365 10839500 10836658 10833063 10829915 10828470 10828980 10830736 10833005 10835640 10838866 10843102
59978 10843102 10849182 10858067 10869796 10883245 10897607 10913702 10933105 10956331 10982855 11012604 11046269
59967 11046269 11084031 11125085 11168828 11215521 11265277 11317204 11370217 11424222 11480112 11539050 11602021
59956 11602021 11669408 11740452 11813601 11887799 11963095 12039790 12117567 12195796 12274156 12352512 12430619
59945 12430619 12508308 12585656 12662855 12740354 12818879 12898300 12976336 13049589 13116432 13177972 13235868
59934 13235868 13290535 13342103 13391422 13438576 13481485 13517800 13547669 13573127 13595148 13612969 13626122
59923 13626122 13635518 13642377 13647442 13651415 13654709 13656413 13654815 13649468 13641696 13632621 13621820 13608593 13593547
59910 13593547 13578121 13563182 13548696 13534203 13519072 13502943 13486450 13470891 13456605 13442380 13427093
59899 13427093 13411219 13395744 13380131 13362566 13342161 13319820 13296640 13272266 13245325 13214977 13181491
59888 13181491 13145616 13107894 13068583 13027791 12985457 12941388 12895508 12847914 12798512 12746781 12692350
59877 12692350 12635785 12578329 12520595 12461845 12400752 12336509 12269175 12199700 12130097 12062788 11998709
59866 11998709 11936255 11872918 11807783 11741712 11675402 11608503 11540653 11472383 11404702 11338616 11275049
59855 11275049 11214239 11155088 11096241 11037957 10981600 10927028 10872203 10816268 10761212 10708907 10657801
59844 10657801 10604619 10548746 10492991 10440224 10391039 10344629 10299924 10255375 10209436 10162242 10115600
59833 10115600 10070590 10026375 9982219 9939316 9899311 9861895 9825341 9788880 9753127 9718417 9684270
59822 9684270 9650723 9618946 9589960 9563477 9538454 9514251 9491003 9469489 9450934 9436299 9425339
59811 9425339 9416781 9409810 9404926 9403070 9404483 9408926 9416385 9426832 9439674 9454251 9470689 9489492 9510353
59798 9510353 9532247 9554830 9579034 9606029 9636215 9669365 9704997 9742215 9779993 9818266 9858238
59787 9858238 9900936 9945775 9991237 10036578 10082031 10127463 10171801 10214075 10254392 10293570 10332315
59776 10332315 10371022 10409824 10448424 10486296 10523692 10562305 10604312 10650430 10699179 10748360 10797225
59765 10797225 10847027 10899534 10955489 11014826 11077954 11145958 11219416 11297840 11380831 11469351 11565306
59754 11565306 11670250 11784945 11909647 12044027 12187171 12338640 12499403 12670869 12853047
59745 12853047 13044660 13245006 13454524 13673361 13900807 14136926 14383563 14642546 14913504
59736 14913504 15194408 15483721 15781027 16086044 16398321 16717972 17045629 17381260 17723472
59727 17723472 18070081 18419081 18769300 19120728 19474092 19829517 20185728 20541117 20895316
59718 20895316 21248963 21602139 21953998 22303999 22652482 22999688 23345050 23687786 24027503
59709 24027503 24363892 24696619 25025965 25352796 25677351 25998808 26316793 26632665 26948270
59700 26948270 27263812 27577982 27890102 28201047 28511778 28821779 29129454 29433466 29733191
59691 29733191 30028294 30318483 30603560 30883233 31156854 31423745 31683917 31938159 32187318
59682 32187318 32431622 32670678 32903662 33129046 33344401 33546961 33734556 33905781 34059403
59673 34059403 34194154 34309207 34404307 34479241 34533891 34569194 34587243 34589467 34575189 34543042 34493608
59662 34493608 34429407 34352141 34261195 34155277 34034361 33899251 33750257 33587544 33412200 33225889
59652 33225889 33029763 32824930 32613864 32400200 32186695 31974057 31761859 31549760 31337535
59643 31337535 31124745 30911083 30696776 30482299 30267951 30053895 29840243 29626922 29413935
59634 29413935 29201997 28992402 28785852 28582014 28380820 28183778 27993141 27809812 27632704
59625 27632704 27460037 27290471 27122882 26955981 26788891 26621692 26454824 26288124 26120815
59616 26120815 25952126 25781320 25607267 25428800 25245715 25058911 24869310 24677196 24483007
59607 24483007 24288152 24094208 23901346 23708283 23513940 23318665 23123669 22929716 22736697
59598 22736697 22544083 22351393 22158332 21964825 21770961 21576921 21383161 21190535 20999737
59589 20999737 20810488 20621944 20434330 20249605 20069772 19894834 19723214 19554105 19388605
59580 19388605 19228638 19075663 18930525 18793377 18662911 18536505 18412356 18291401 18176346
59571 18176346 18068769 17967855 17872030 17781057 17696166 17618686 17549096 17487080 17432009 17383407 17341366
59560 17341366 17306497 17279155 17258681 17243709 17233299 17227501 17226699 17230790 17239277 17251818 17268143 17287371
59548 17287371 17307979 17328725 17349437 17370637 17392551 17414607 17435646 17454383 17469852 17481807 17490722
59537 17490722 17497276 17501854 17504664 17505990 17505836 17503439 17497667 17487982 17474486 17456874 17434011 17405033 17370337
59524 17370337 17330721 17285802 17234297 17176123 17113375 17048554 16982315 16913752 16842590 16769919 16696382
59513 16696382 16620685 16541099 16458232 16375224 16294786 16216767 16139218 16061291 15984319 15910202 15839651
59502 15839651 15772386 15708462 15648652 15593524 15542728 15495590 15452241 15413674 15380581 15352625 15329261
59491 15329261 15310824 15297947 15289859 15284175 15278936 15274285 15271635 15271658 15273740 15276924 15280516 15283958 15287030 15290255
59477 15290255 15294334 15298994 15302993 15305265 15305387 15302839 15296727 15286558 15272530 15254548 15231553 15202362 15166683
59464 15166683 15124839 15076983 15023140 14963663 14899112 14829985 14756934 14680840 14602127 14520254 14434328
59453 14434328 14344012 14249621 14151955 14052549 13953445 13855793 13758908 13661417 13563178 13465332 13368778
59442 13368778 13273544 13179782 13088489 13000757 12916723 12835625 12756812 12680613 12608287 12540930 12478339
59431 12478339 12419292 12363033 12309827 12259760 12212012 12166332 12124525 12089141 12060937 12038806 12021892
59420 12021892 12010301 12003711 12001054 12002196 12008589 12021416 12040285 12064530 12094675 12131456 12174273 12221902
59408 12221902 12274233 12332065 12395515 12463874 12537003 12615674 12700234 12789783 12883170 12980291 13082007
59397 13082007 13189043 13301237 13417831 13538376 13663185 13792538 13925419 14059646 14193705
59388 14193705 14328034 14463896 14601268 14738423 14873437 15005386 15133973 15258614 15378343
59379 15378343 15492443 15600882 15703965 15801521 15892632 15976557 16053741 16125212 16190779 16248564
59369 16248564 16296814 16335540 16365785 16387927 16401533 16406371 16402607 16390302 16369688 16341839 16308152
59358 16308152 16269318 16225656 16178127 16127704 16073750 16014562 15950070 15882691 15814707 15745918 15674839
59347 15674839 15601280 15526434 15451033 15374887 15298214 15222171 15147822 15075422 15005111 14937537 14873334
59336 14873334 14812433 14754403 14699282 14647841 14601112 14559710 14523241 14490205 14458892 14428819 14401161
59325 14401161 14377401 14357598 14340315 14324305 14309914 14298537 14290874 14286003 14282105 14277787 14272740 14267659
59313 14267659 14263921 14262933 14264975 14268418 14270600 14269973 14267287 14264462 14262574 14261293 14260048 14258926 14258145 14257223 14255207
59298 14255207 14251494 14245807 14237601 14226339 14212653 14198392 14184824 14171270 14156172 14139078 14120642 14101041
59286 14101041 14079696 14056647 14032698 14007612 13979651 13948193 13915730 13885592 13858117 13830691 13801458
59275 13801458 13771251 13741495 13711945 13681508 13650230 13619359 13590042 13562714 13537153 13512352 13486995
59264 13486995 13461007 13436144 13414154 13394804 13376748 13359953 13345956 13335834 13329240 13325771 13325963 13330268
59252 13330268 13337936 13347787 13359536 13373744 13390915 13411287 13434970 13461460 13489256 13516837 13543982
59241 13543982 13571466 13599555 13627570 13654940 13681620 13707033 13729547 13747929 13762965 13776715 13790108
59230 13790108 13801906 13809987 13812992 13810537 13802536 13788885 13769550 13744496 13713583 13676756 13634222 13586286
59218 13586286 13533159 13475097 13412517 13345717 13274676 13199387 13120184 13037338 12950605 12859739 12765522
59207 12765522 12669725 12573731 12477524 12380363 12282327 12184826 12089553 11997135 11907001 11818558 11732215
59196 11732215 11648936 11568941 11491400 11415663 11342224 11271950 11204821 11140157 11077823 11018234 10961190
59185 10961190 10905732 10851531 10799538 10750747 10705195 10662823 10624411 10590444 10559545 10529440 10499705
59174 10499705 10472424 10449693 10431289 10415251 10399938 10384698 10369081 10352560 10335239 10318152 10302459
59163 10302459 10288577 10276269 10265178 10254863 10244522 10233271 10220988 10208509 10196609 10184939 10172580
59152 10172580 10159731 10148232 10139829 10134203 10129339 10123792 10117865 10112418 10107420 10102312 10097232 10092982 10089999
59139 10089999 10088314 10088472 10091267 10096061 10100542 10103311 10106103 10112096 10122163 10134125 10145869 10157721 10171104
59126 10171104 10186219 10202280 10219102 10236950 10255238 10272891 10290007 10307789 10326599 10345330 10363117
59115 10363117 10380369 10397456 10413470 10427260 10438808 10448455 10455362 10458001 10455992 10450363 10442031 10431041
59103 10431041 10417431 10401853 10384717 10365264 10341932 10313504 10279892 10242210 10202189 10161065 10118742
59092 10118742 10074191 10026615 9975967 9922522 9866628 9808965 9750340 9690891 9630089 9567956 9505724
59081 9505724 9444542 9383866 9322022 9258540 9195215 9134376 9076457 9019755 8962430 8904187 8845977
59070 8845977 8788734 8732954 8679047 8627135 8576349 8525202 8473245 8421821 8372587 8325707 8280217
59059 8280217 8235755 8192847 8151502 8110776 8070206 8030715 7993247 7957097 7920424 7882117 7842357
59048 7842357 7801543 7759605 7716545 7672977 7629750 7587450 7546394 7506630 7467547 7427932 7386983
59037 7386983 7345201 7303923 7263980 7225119 7186621 7148044 7109190 7069800 7029728 6989234 6948763
59026 6948763 6908412 6867843 6826746 6785103 6743051 6700867 6659181 6618767 6579837 6541795 6503949
59015 6503949 6466154 6428434 6390429 6351856 6313335 6276022 6240292 6205391 6170551 6135957 6102458
59004 6102458 6070851 6041582 6014384 5987847 5960165 5931096 5902754 5877609 5855942 5835972 5816185
58993 5816185 5796630 5778125 5761378 5747128 5735956 5727274 5719361 5711242 5704035 5699666 5698649 5699954 5702706
58980 5702706 5707015 5713091 5720484 5728640 5737828 5749277 5764622 5785053 5810403 5838983 5868829 5899276
58968 5899276 5930998 5964778 6001107 6040892 6085225 6133885 6185193 6238358 6295113 6357804 6426463
58957 6426463 6499147 6574868 6654630 6739490 6829229 6923661 7023871 7131103 7245359 7366268
58947 7366268 7494787 7632687 7780321 7935787 8096447 8260743 8428692 8601503 8780937
58938 8780937 8968297 9163370 9364379 9569034 9775515 9982677 10189813 10396511 10602473
58929 10602473 10807404 11011255 11214461 11417394 11619266 11817757 12010148 12195010 12372777
58920 12372777 12544495 12709796 12866175 13010612 13141989 13261453 13370236 13467739 13552382 13623793
58910 13623793 13683169 13731584 13768890 13794472 13808284 13810848 13802897 13785315 13758782 13723164 13678007
58899 13678007 13624216 13564569 13501753 13436182 13366473 13291888 13213745 13134587 13056600 12980724 12906654
58888 12906654 12833663 12761889 12692815 12627995 12567503 12510264 12455851 12405023 12358306 12315074 12274647
58877 12274647 12237627 12205202 12177509 12153559 12132776 12115796 12103536 12096079 12092904 12093818 12099175 12109209
58865 12109209 12123381 12140603 12160114 12182114 12207262 12235488 12265668 12296947 12329932 12365744 12404002
58854 12404002 12442871 12481565 12521683 12565095 12611377 12658834 12707719 12760762 12820104 12885182 12954463
58843 12954463 13027964 13106770 13190867 13279026 13370676 13466549 13567319 13672784 13782632 13896834
58833 13896834 14014574 14133787 14252872 14372457 14494565 14619922 14746595 14871320 14991930
58824 14991930 15108680 15223544 15338054 15451437 15560937 15664189 15760953 15852103 15937255 16014248
58814 16014248 16080942 16136706 16181801 16216037 16238826 16250292 16251514 16243384 16225542 16196782 16156433
58803 16156433 16105139 16044159 15974043 15894410 15805264 15708240 15605908 15499713 15389069 15272771
58793 15272771 15150852 15024505 14894594 14761140 14624530 14486518 14349472 14214861 14082872
58784 14082872 13953284 13826314 13702657 13583132 13468311 13358156 13251812 13148008 13045922
58775 13045922 12945785 12848713 12755933 12667936 12584105 12503272 12424915 12349756 12278917 12212517 12149396
58764 12149396 12088168 12028281 11970147 11914637 11862359 11812835 11764307 11714921 11664252 11613020 11561138
58753 11561138 11506964 11449088 11388094 11325618 11262144 11196686 11128333 11057024 10982905 10906019 10826904
58742 10826904 10746626 10665951 10585137 10504453 10423743 10341277 10254429 10162445 10067632 9972815 9878365
58731 9878365 9782846 9685840 9588552 9491703 9394423 9295711 9195899 9095967 8996171 8896101 8795564
58720 8795564 8694734 8593752 8492861 8392795 8294492 8198315 8103812 8010137 7916524 7822755
58710 7822755 7729669 7638933 7551581 7466777 7382732 7298975 7217053 7138580 7063291 6989581 6916400
58699 6916400 6843758 6771731 6700133 6629361 6560606 6494634 6431051 6369280 6309627 6252565 6197374
58688 6197374 6142471 6087170 6032389 5979440 5928704 5879706 5831965 5785401 5740188 5696448 5653914
58677 5653914 5611903 5570014 5528970 5490260 5454590 5420972 5387630 5353653 5319599 5286866 5256774
58666 5256774 5229881 5205629 5182597 5159425 5135667 5111871 5089114 5068548 5050914 5035985 5022645
58655 5022645 5009974 4998211 4988317 4980672 4974752 4970085 4966960 4965840 4966576 4968845 4973278 4981406 4994091
58642 4994091 5010406 5028618 5048080 5069494 5093240 5118349 5143692 5169597 5197341 5227252 5258315
58631 5258315 5289763 5322031 5355612 5389718 5422846 5454312 5484594 5514346 5543547 5571517 5597405
58620 5597405 5620826 5642352 5663077 5683252 5701566 5716274 5726918 5734506 5740075 5743568 5744123 5740998
58608 5740998 5734173 5724385 5712619 5699319 5684063 5666082 5644876 5620229 5592317 5562405 5532923 5505703
58596 5505703 5480051 5453408 5424126 5392925 5361553 5331016 5301529 5273284 5246415 5220736 5196281
58585 5196281 5173698 5153291 5133916 5113800 5092473 5071140 5051020 5032140 5014150 4997501 4982923
58574 4982923 4970031 4957324 4943795 4930011 4917245 4905896 4895109 4883756 4871331 4857939 4843953
58563 4843953 4829889 4816259 4803163 4790178 4776903 4763468 4750153 4736590 4721710 4704516 4684729
58552 4684729 4662779 4639552 4616154 4593369 4571047 4548290 4524585 4500583 4477466 4455621 4434151
58541 4434151 4411653 4387283 4361184 4334143 4306886 4279533 4251671 4223057 4194139 4165717 4138082
58530 4138082 4110783 4083342 4055941 4029112 4002905 3976744 3950169 3923367 3896840 3870892 3845827
58519 3845827 3822360 3801101 3781425 3761370 3739239 3715199 3690979 3668005 3646165 3624472 3602587
58508 3602587 3581297 3561487 3542934 3524466 3505362 3486246 3468288 3451756 3435910 3420205 3404883
58497 3404883 3390138 3375496 3360632 3346183 3332799 3319714 3305337 3289325 3273054 3257650 3242503
58486 3242503 3226362 3209220 3192298 3176585 3162182 3148768 3135785 3122165 3106851 3090022 3073179
58475 3073179 3057621 3043238 3029160 3015052 3001160 2987495 2973779 2960152 2947170 2934907 2922716
58464 2922716 2910192 2897840 2886329 2875633 2865421 2855927 2847607 2840112 2832409 2823996 2815334 2806999 2799150
58451 2799150 2792069 2786316 2781754 2777057 2770966 2763753 2756839 2751260 2747064 2743842 2741003 2737725 2733443 2728422
58437 2728422 2723256 2717877 2711799 2705267 2699270 2694328 2690122 2686505 2683770 2681444 2677921 2672300 2665894 2660892
58423 2660892 2657900 2655741 2653279 2650295 2646677 2642142 2637178 2633208 2631040 2629783 2627938 2625065 2621770 2618544
58409 2618544 2615459 2612733 2610595 2608497 2605313 2600688 2595593 2591207 2587819 2585249 2583675 2583215 2583068 2582119 2580430
58394 2580430 2579128 2578525 2577314 2574384 2570692 2568343 2568120 2568985 2569929 2571115 2572776 2574115 2574282 2573868 2574281 2575832
58378 2575832 2577577 2579306 2582538 2588705 2596920 2604609 2610189 2614242 2618010 2621811 2625395 2628963 2632906 2637013
58364 2637013 2640889 2645009 2650456 2657547 2665560 2673893 2682686 2692046 2701543 2710850 2720063 2728985 2736965 2744168
58350 2744168 2752109 2761990 2773194 2784524 2796188 2809135 2822790 2835264 2846063 2856962 2869561 2883333
58338 2883333 2896988 2910561 2924868 2939732 2954171 2968119 2982642 2998392 3014900 3031680 3049137
58327 3049137 3067835 3087485 3107354 3127521 3149158 3173325 3199732 3226950 3253834 3280463 3307485
58316 3307485 3334954 3362341 3389650 3417819 3447808 3479847 3513812 3549611 3586677 3623752 3660099
58305 3660099 3696645 3735154 3776435 3820102 3865837 3913780 3963644 4014574 4066375 4119920 4175796
58294 4175796 4233377 4291998 4352207 4414857 4479592 4545544 4613300 4684755 4760714 4839849 4920546
58283 4920546 5002919 5088460 5178557 5274009 5375170 5481542 5591694 5704500 5820203 5939614
58273 5939614 6062744 6189204 6319588 6455322 6597304 6745857 6901975 7067312 7242706
58264 7242706 7427860 7622879 7828872 8046624 8275986 8517346 8772463 9042739 9327594
58255 9327594 9625565 9936247 10260243 10598276 10951798 11323671 11716545 12130826 12565638
58246 12565638 13021505 13500623 14004816 14535116 15093653 15684116 16309263 16968712 17659714
58237 17659714 18379482 19126905 19903518 20714066 21566172 22469620 23436203 24479177 25610656
58228 25610656 26838545 28166465 29596443 31130731 32772134 34525606 36400937 38412768
58220 38412768 40577730 42912979 45435758 48157223 51070171 54143284 57332150 60598409
58212 60598409 63918637 67278877 70668132 74079492 77509847 80947999 84360713 87697305
58204 87697305 90915905 94009169 97008083 99968112 102955843 106038156 109258790 112602096
58196 112602096 115973439 119222606 122195935 124776953 126898126 128542360 129749772 130613266
58188 130613266 131241115 131701032 131990007 132055982 131850480 131366435 130635046 129697035 128586377
58179 128586377 127344935 126043725 124771557 123589015 122491665 121418681 120290550 119034904
58171 119034904 117593799 115939839 114106912 112199726 110355125 108680858 107220968 105963244
58163 105963244 104865002 103874965 102950980 102075502 101258238 100518781 99862585 99272257 98719886
58154 98719886 98185073 97660745 97144572 96628646 96098790 95541526 94948620 94316181 93645952
58145 93645952 92953869 92277425 91669157 91176714 90824857 90613610 90531681 90570877 90726168 90977694
58135 90977694 91268166 91498480 91554018 91349369 90862615 90137818 89257825 88307197 87346089
58126 87346089 86404593 85493253 84617167 83782607 82993988 82246966 81524892 80802673 80057369
58117 80057369 79279163 78472999 77646903 76796120 75898469 74926900 73869604 72742667 71587199
58108 71587199 70452444 69372897 68351780 67362139 66365742 65335628 64265908 63165416
58100 63165416 62045338 60911774 59765819 58607964 57443507 56286465 55159332 54087506
58092 54087506 53090331 52172829 51321968 50509911 49703951 48878526 48022242 47136199 46227273
58083 46227273 45303503 44374547 43453918 42558298 41703364 40899455 40150313 39455100 38811188
58074 38811188 38214827 37659133 37132001 36617518 36101198 35575188 35039143 34496684 33951375
58065 33951375 33405686 32862482 32326078 31801141 31290898 30796952 30320660 29863516 29425147
58056 29425147 29001243 28584711 28169526 27753235 27336169 26919777 26506721 26101539 25709424
58047 25709424 25334037 24977120 24639770 24322656 24024531 23741604 23469112 23203244 22941421
58038 22941421 22681706 22422821 22164646 21908295 21655822 21409877 21172986 20946432 20729543
58029 20729543 20519988 20314658 20110607 19905930 19700151 19493734 19287464 19082803 18882496
58020 18882496 18689778 18506478 18332280 18165584 18004153 17844922 17684748 17522352 17358751
58011 17358751 17194978 17030080 16862222 16691076 16518095 16345048 16173465 16005167 15841957
58002 15841957 15684522 15532553 15386172 15246482 15114492 14990146 14872657 14761220 14655083
57993 14655083 14553211 14454038 14355405 14255006 14151525 14045456 13938414 13831587 13725106 13618652
57983 13618652 13512086 13405521 13299379 13194398 13091010 12988670 12886497 12784820 12685444
57974 12685444 12589971 12498176 12408357 12318855 12228858 12138092 12046392 11953769 11860725 11768443 11678709
57963 11678709 11593403 11513659 11439185 11368368 11299309 11231119 11164310 11099793 11037486 10976092 10914232
57952 10914232 10851460 10788143 10724806 10661786 10599130 10536630 10474418 10413709 10356251 10302490 10250866
57941 10250866 10199424 10147465 10094815 10040241 9982028 9919999 9855643 9790042 9722857 9653807 9584076
57930 9584076 9515528 9449134 9384716 9321640 9259234 9197066 9135456 9075385 9017446 8961225 8905948
57919 8905948 8851148 8796282 8740516 8683795 8627600 8573599 8521871 8471529 8422938 8377786 8336544
57908 8336544 8297187 8257415 8217145 8177568 8138392 8097635 8054175 8009020 7963542 7917758 7871195
57897 7871195 7824374 7778187 7732462 7686494 7640635 7595862 7551799 7506708 7459921 7412957 7367579
57886 7367579 7323860 7280962 7238665 7196944 7154850 7111247 7066419 7021909 6978885 6937590 6898091
57875 6898091 6860478 6824190 6788033 6751069 6713037 6674014 6634298 6594506 6555215 6516662 6479290
57864 6479290 6443987 6410863 6378302 6344494 6309739 6276055 6244600 6214842 6186233 6159041 6133009
57853 6133009 6106679 6078888 6049855 6019923 5988355 5954395 5918837 5883528 5849742 5817710 5787143
57842 5787143 5757429 5727743 5697712 5667630 5637602 5607074 5575863 5544902 5515093 5485851 5455747
57831 5455747 5424247 5392010 5359749 5327790 5296727 5267649 5241338 5217469 5194580 5170796 5145178
57820 5145178 5118788 5093836 5071123 5048839 5024621 4998289 4971667 4946132 4921532 4897399 4873964
57809 4873964 4851498 4829414 4806648 4782678 4758018 4733864 4711171 4689828 4668886 4647866 4627397
57798 4627397 4608144 4589722 4571368 4553171 4535549 4517834 4498663 4477844 4456710 4436343 4416487
57787 4416487 4396565 4376843 4357990 4340222 4323345 4307088 4290978 4274488 4257657 4241022 4224687
57776 4224687 4208149 4191361 4175118 4159865 4144931 4129495 4113549 4097258 4080344 4063151 4047483
57765 4047483 4034828 4024056 4012443 3999114 3986062 3975241 3966006 3956315 3945425 3934163 3923073 3911659
57753 3911659 3899563 3887411 3876047 3865698 3856448 3849005 3844180 3841643 3839826 3837295 3833920 3830526 3827801
57740 3827801 3825958 3825248 3826192 3829021 3833157 3837575 3841691 3845658 3849787 3853942 3857784 3861585 3866521 3873871
57726 3873871 3883866 3895399 3906998 3918278 3930682 3946694 3967834 3993043 4019361 4044696 4069825
57715 4069825 4097210 4128114 4161702 4196886 4233799 4272835 4313290 4354167 4395877 4439976 4487166
57704 4487166 4536416 4586030 4634821 4682313 4728815 4775485 4823443 4872461 4921263 4969320 5017379
57693 5017379 5065750 5113116 5157898 5200068 5240594 5279541 5315779 5348414 5377561 5403675 5426911
57682 5426911 5447317 5465017 5480050 5492564 5503237 5513013 5522252 5530460 5536812 5540399 5540115 5535190 5526230
57669 5526230 5515078 5503236 5490884 5477869 5465019 5453645 5443909 5434560 5424543 5414442 5406074 5400898
57657 5400898 5399002 5399451 5401325 5404407 5408980 5415122 5422451 5430710 5440509 5453131 5469330 5488372 5508453
57644 5508453 5528206 5547819 5568704 5592148 5618212 5645633 5672562 5697540 5720278 5741673 5762909
57633 5762909 5784319 5805263 5825053 5843584 5860827 5876153 5888597 5897511 5902460 5902813 5898182 5889236
57621 5889236 5877372 5863534 5847989 5831203 5813898 5795739 5774861 5749523 5719869 5687524 5653974
57610 5653974 5619871 5585331 5549987 5513034 5474038 5433462 5391732 5348400 5303367 5258531 5216624
57599 5216624 5178256 5141513 5104862 5068983 5035052 5002761 4971244 4940846 4912486 4885948 4860235
57588 4860235 4835199 4811426 4788773 4766466 4744649 4724424 4706178 4689138 4672858 4657864 4644373
57577 4644373 4631656 4619435 4608759 4600546 4594140 4588329 4583164 4579708 4578468 4579064 4581065 4584042 4586996
57564 4586996 4588940 4590274 4592741 4597627 4604531 4612097 4619560 4627468 4637210 4649845 4665040 4681282 4697431
57551 4697431 4713652 4730242 4746069 4759393 4770294 4781143 4794163 4809262 4824601 4838539 4850593
57540 4850593 4861288 4871696 4882498 4892903 4901040 4906050 4909179 4911998 4914126 4913758 4910194 4904696 4898670
57527 4898670 4891960 4883287 4871755 4857622 4842080 4826632 4812283 4798968 4785782 4771807 4756606 4740235
57515 4740235 4723257 4706620 4690861 4675449 4659532 4643439 4628717 4616488 4606504 4598243 4592182 4589310
57503 4589310 4589805 4592921 4597975 4604771 4613162 4622816 4633593 4645814 4660014 4676540 4695305 4715812 4737496
57490 4737496 4760097 4783473 4807138 4830510 4853729 4877544 4901981 4925895 4948485 4970497 4992963
57479 4992963 5015376 5036480 5056638 5077772 5100624 5123467 5144136 5162010 5177053 5188087 5193628
57468 5193628 5194112 5191917 5189044 5185668 5180977 5174459 5166116 5156233 5145441 5134544 5123868 5113151 5102256
57455 5102256 5091472 5080764 5069281 5056310 5042481 5029331 5017546 5006259 4994314 4981764 4969681
57444 4969681 4958790 4948805 4939054 4929280 4919763 4911121 4904107 4899064 4895179 4890767 4884914 4878670 4873985 4871515
57430 4871515 4870064 4868200 4865714 4863310 4861534 4860544 4860467 4861365 4862929 4864723 4866797 4869726 4873838 4878535 4882632
57415 4882632 4885581 4888234 4891998 4897072 4902000 4905362 4907373 4909137 4910906 4912237 4913693 4916919 4922623 4929734
57401 4929734 4937209 4945505 4955387 4966292 4977117 4987959 4999896 5013460 5028451 5044846 5062693 5081319
57389 5081319 5099855 5118509 5138176 5158813 5179462 5200062 5221915 5245832 5270941 5295946 5320684
57378 5320684 5345684 5371008 5396428 5422230 5448920 5476357 5503965 5531738 5560353 5590203 5620950
57367 5620950 5652326 5684987 5720026 5757672 5796808 5836059 5875085 5914469 5954596 5995448 6037551
57356 6037551 6082220 6130246 6180953 6233139 6286244 6339827 6392706 6443954 6494561 6546875 6602317
57345 6602317 6660676 6721602 6785572 6853152 6924324 6998910 7076807 7157548 7240521 7325787 7413688
57334 7413688 7503396 7593077 7681930 7770905 7860691 7950085 8037285 8121996 8205379 8288570 8372244
57323 8372244 8457254 8544901 8636636 8733699 8836516 8944174 9055328 9170034 9289777 9415115
57313 9415115 9544278 9674726 9804845 9933096 10056912 10174385 10286655 10396999 10507823
57304 10507823 10620030 10735078 10855664 10983730 11119092 11260826 11409010 11564389 11726987
57295 11726987 11895775 12069319 12246287 12425659 12606877 12789668 12973507 13157626 13341803
57286 13341803 13527017 13714998 13906950 14102584 14300248 14498136 14695576 14893222 15092205
57277 15092205 15293476 15497938 15706493 15919512 16136552 16357000 16580636 16807307 17036612
57268 17036612 17268366 17502759 17739366 17976389 18211660 18444204 18674162 18901529 19125854
57259 19125854 19347285 19567342 19788628 20014119 20246380 20486696 20734834 20989952 21251420
57250 21251420 21518363 21788929 22061009 22333626 22606982 22881382 23157081 23435158 23717299
57241 23717299 24004130 24294391 24586316 24879413 25174359 25471372 25769226 26065849 26359373
57232 26359373 26648341 26931223 27206596 27474347 27736529 27996701 28258675 28526202 28802976
57223 28802976 29091557 29392270 29704365 30028326 30365520 30714912 31071173 31426567 31773626
57214 31773626 32105999 32419280 32713149 32991709 33259901 33519958 33772216 34017849 34258741
57205 34258741 34495388 34726901 34952515 35170921 35378336 35569432 35740454 35889762 36015452
57196 36015452 36114999 36188310 36239616 36275498 36302286 36325918 36352710 36388774 36438950 36506671 36594211
57185 36594211 36703194 36836009 36996937 37190256 37416122 37668656 37938039 38213127 38481721
57176 38481721 38730199 38945112 39116000 39237466 39310473 39343234 39350693 39351884 39366114 39409186 39490148
57165 39490148 39609480 39759551 39926451 40092192 40238702 40354902 40443217 40519543 40606280 40724095
57155 40724095 40886237 41094808 41339499 41602143 41866265 42123767 42373084 42612965 42840193
57146 42840193 43052967 43254333 43450883 43647800 43844800 44036330 44215764 44380300 44533016
57137 44533016 44680902 44830305 44982364 45131301 45267071 45380019 45462860 45509379 45515113 45482803
57127 45482803 45426777 45369151 45330155 45321196 45343936 45391861 45452111 45508692 45546266 45551963 45516147
57116 45516147 45434554 45309371 45145344 44943741 44700136 44404731 44040197 43580609 42999933
57107 42999933 42286732 41450641 40515776 39512483 38475980 37445738 36459129 35546272 34735280
57098 34735280 34063540 33582988 33355518 33443946 33903151 34771608 36062692 37758106 39809889
57089 39809889 42155383 44733075 47472098 50249646 52864150 55087304 56787786 58029238
57081 58029238 59049039 60130059 61467747 63117506 65021804 67061466 69087565 70932224
57073 70932224 72422418 73413543 73829593 73677297 73019914 71935133 70492561 68759289 66819603
57064 66819603 64801911 62910662 61438850 60724323 61050687 62548714 65159366 68668810
57056 68668810 72779232 77177779 81589172 85809392 89715961 93253312 96405737 99179951
57048 99179951 101609270 103767307 105766957 107736145 109786808 111997424 114412353 117051189
57040 117051189 119925887 123061637 126504420 130300099 134457497 138930072 143637566 148512995
57032 148512995 153535000 158709824 164003261 169273415 174273825 178746597 182544266 185694521
57024 185694521 188376637 190840727 193312766 195917273 198650389 201421254 204128153 206705199
57016 206705199 209115427 211324950 213292696 214973496 216327814 217347098 218081764 218628016
57008 218628016 219065904 219414222 219661976 219842432 220062476 220457065 221116257 222035797 223105042
56999 223105042 224135899 224935521 225393716 225530607 225481613 225447299 225639113 226225604 227287005
56990 227287005 228807857 230720375 232963551 235510148 238350337 241454625 244740617 248061182
56982 248061182 251227542 254061930 256447145 258341262 259759033 260745307 261357246 261655615
56974 261655615 261702834 261565556 261313276 261006339 260681262 260347259 259994712 259604517 259152956
56965 259152956 258616874 257981658 257246486 256420617 255510947 254507814 253380233 252088290 250605938
56956 250605938 248935282 247101389 245137528 243077033 240954025 238804085 236661751 234559261
56948 234559261 232527284 230593496 228779526 227101404 225573326 224208696 223016832 222000545
56940 222000545 221157525 220482192 219965240 219593034 219349420 219219080 219190802 219260389 219432663
56931 219432663 219721571 220148911 220742767 221534414 222551997 223813095 225320613 227063569
56923 227063569 229021012 231167644 233480299 235942256 238542459 241271397 244118571 247072941
56915 247072941 250123168 253255429 256450356 259680992 262911660 266098105 269191023 272143746
56907 272143746 274921004 277503860 279888300 282079115 284083401 285907276 287555919 289034655
56899 289034655 290349995 291511626 292535236 293443836 294266157 295033725 295778300 296528963 297308427
56890 297308427 298130776 299002194 299922694 300886098 301878833 302879825 303862247 304797252 305660355
56881 305660355 306438739 307134069 307757933 308324464 308846838 309337828 309809741 310272265 310731254
56872 310731254 311189855 311649813 312111813 312575795 313041146 313505395 313962639 314405054 314827435
56863 314827435 315230699 315622238 316015191 316427887 316881272 317393396 317974821 318628901 319355443
56854 319355443 320153431 321021364 321956967 322957030 324016149 325124338 326265471 327418339
56846 327418339 328560018 329670446 330737311 331759940 332750072 333728073 334715688 335728357
56838 335728357 336769585 337828038 338877161 339877780 340784046 341551550 342145178 342544493
56830 342544493 342745274 342756699 342595393 342280045 341829716 341264807 340606575 339873748 339079575
56821 339079575 338232554 337339394 336406017 335434900 334420675 333347227 332188940 330917141
56813 330917141 329509764 327959471 326276120 324483485 322612892 320696452 318761757 316829634
56805 316829634 314914974 313028485 311177281 309364729 307590969 305853963 304150208 302475799
56797 302475799 300829203 299215072 297646964 296147821 294748660 293485532 292394701 291507392
56789 291507392 290846443 290425634 290250373 290318569 290621833 291147142 291878186 292795320 293874363
56780 293874363 295085790 296396032 297771133 299180826 300600640 302011700 303399679 304753519
56772 304753519 306063054 307315755 308494939 309581143 310555058 311399425 312099295 312641922
56764 312641922 313017088 313217842 313241666 313091695 312776645 312308685 311700407 310962918 310106059
56755 310106059 309140344 308079158 306939095 305737499 304489429 303207560 301904966 300597081
56747 300597081 299300946 298034194 296815936 295667419 294609894 293661153 292833736 292134787
56739 292134787 291565925 291123617 290801117 290590179 290480305 290457190 290503891 290604251 290744822
56730 290744822 290914270 291102726 291302128 291505762 291706358 291894741 292060011 292189748 292269670
56721 292269670 292284443 292220102 292065719 291812692 291453577 290982907 290399293 289706279 288911109
56712 288911109 288022835 287051257 286006615 284899384 283740079 282539810 281311856 280072982
56704 280072982 278842677 277640618 276484810 275391720 274376798 273453640 272632426 271918940
56696 271918940 271313766 270811339 270400307 270066151 269793715 269567155 269368615 269178671 268978454
56687 268978454 268751011 268481493 268157710 267770897 267315145 266786097 266181008 265499703 264744257
56678 264744257 263917896 263025835 262077788 261088579 260075523 259055523 258044206 257055881 256102890
56669 256102890 255195271 254341531 253549296 252824644 252170941 251588161 251072634 250616993 250210409
56660 250210409 249838473 249482303 249118671 248722934 248273137 247751663 247144299 246440013 245632670
56651 245632670 244722423 243715513 242623897 241465123 240260769 239033738 237806843 236602838
56643 236602838 235443141 234345051 233320912 232380085 231529922 230773751 230109119 229528807 229022034
56634 229022034 228573317 228161337 227760446 227342942 226879974 226343255 225709672 224965482 224106241
56625 224106241 223134649 222060590 220902002 219682311 218425556 217154341 215891333 214659657
56617 214659657 213480167 212368591 211334668 210381570 209504799 208692866 207930770 207203430 206496396
56608 206496396 205794994 205084284 204349949 203578769 202758353 201876997 200924496 199894243 198785761
56599 198785761 197605634 196365880 195081641 193770651 192453840 191154405 189894934 188694765
56591 188694765 187568785 186526634 185571787 184701498 183907799 183178198 182495655 181839481 181188055
56582 181188055 180521921 179825526 179087642 178301331 177463795 176576114 175643067 174672845 173676363
56573 173676363 172666591 171658433 170668268 169711988 168802273 167947194 167150410 166411067 165722650
56564 165722650 165072478 164443368 163816431 163173123 162496281 161770890 160984892 160129728 159200645
56555 159200645 158196898 157121949 155983844 154795869 153576764 152349176 151136132 149957065
56547 149957065 148825466 147748906 146730264 145768311 144857065 143985626 143140358 142308335 141478768
56538 141478768 140641506 139785872 138902440 137985569 137033167 136044606 135020727 133966288 132890837
56529 132890837 131806163 130723545 129653772 128608191 127597541 126629135 125705413 124824894
56521 124824894 123983607 123175481 122392087 121622620 120854459 120074505 119271315 118437386 117570456
56512 117570456 116673384 115753124 114819578 113884652 112961170 112061081 111193046 110360644 109562535
56503 109562535 108794174 108049279 107320093 106597530 105872473 105137587 104387839 103619307 102828182
56494 102828182 102011858 101171454 100312881 99444931 98576347 97714875 96868318 96044674 95250080
56485 95250080 94487034 93755264 93053695 92380373 91730551 91096197 90468187 89838610 89200602
56476 89200602 88546803 87869376 87162493 86425015 85660623 84875310 84075041 83266001 82456307
56467 82456307 81655730 80872788 80112582 79377927 78671178 77993054 77339789 76703451 76076038
56458 76076038 75452622 74830300 74205526 73573631 72930338 72272924 71600634 70915324 70221691
56449 70221691 69525853 68833334 68148797 67477409 66825183 66197027 65594599 65016412 64459806
56440 64459806 63922408 63401876 62895172 62398881 61910039 61425930 60943050 60457325 59966419
56431 59966419 59471632 58976830 58485592 58000148 57523028 57058496 56611287 56183847 55774966
56422 55774966 55380717 54996342 54617460 54240174 53860708 53475503 53081976 52679035 52266572
56413 52266572 51844727 51414150 50976838 50535871 50093796 49651325 49207365 48759621 48304875
56404 48304875 47839078 47357628 46855794 46329713 45778103 45203351 44610206 44003074 43385008
56395 43385008 42759263 42130575 41503956 40882717 40268380 39662089 39065325 38479376 37904861
56386 37904861 37341822 36789755 36247532 35713733 35187154 34666738 34151121 33638719 33128346
56377 33128346 32619423 32111363 31603004 31093104 30581589 30070184 29561435 29056866 28556196
56368 28556196 28058461 27563603 27072774 26587582 26109586 25640165 25180125 24729501 24288371
56359 24288371 23857714 23438727 23031471 22635219 22250078 21877011 21515835 21164440 20820767
56350 20820767 20484742 20157522 19839566 19530140 19228092 18932377 18642354 18358144 18079996
56341 18079996 17806629 17534837 17261546 16985739 16707893 16428633 16149053 15871378 15597642
56332 15597642 15327942 15061238 14797550 14538045 14283218 14032615 13786419 13545768 13311044
56323 13311044 13081231 12855664 12635402 12422112 12216308 12017246 11823881 11635394 11451358
56314 11451358 11271987 11097837 10928830 10763848 10601448 10440547 10280335 10120274 9960610
56305 9960610 9802345 9646390 9493177 9343227 9197313 9055596 8917381 8782418 8651853
56296 8651853 8527086 8407902 8292459 8179017 8067182 7957583 7850907 7747350 7646609
56287 7646609 7548355 7452939 7361559 7275488 7195172 7120309 7050619 6986058 6926268 6870326 6817391
56276 6817391 6767346 6720400 6676114 6633386 6591695 6551978 6515692 6483031 6452575 6422715 6392804
56265 6392804 6362721 6332036 6300149 6266907 6232538 6197273 6161424 6125477 6089632 6053595 6017299
56254 6017299 5981409 5946654 5913248 5881510 5852103 5824579 5796512 5765673 5732694 5699871 5667445
56243 5667445 5633107 5595604 5556651 5518002 5478307 5434620 5386169 5334933 5282941 5230574 5177538
56232 5177538 5124199 5071418 5019625 4968296 4916065 4861537 4804433 4745817 4687007 4628668 4571235
56221 4571235 4515491 4461835 4409474 4357302 4305470 4255309 4207765 4162717 4119750 4078710 4039369
56210 4039369 4001284 3964371 3929087 3895778 3864302 3834491 3806520 3780547 3756372 3733744 3712675
56199 3712675 3693110 3674534 3656251 3637979 3619836 3601767 3583280 3563885 3543610 3522906 3502162
56188 3502162 3481525 3461186 3441498 3422618 3404182 3385598 3366519 3347051 3327755 3309570 3293155
56177 3293155 3277882 3262101 3245153 3228506 3213804 3200233 3185323 3168419 3151659 3137034 3124159
56166 3124159 3111936 3100826 3091789 3084085 3076090 3067982 3061810 3058760 3057857 3057647 3057780 3058448 3059465 3060736
56152 3060736 3062844 3066410 3071286 3076960 3083374 3090864 3099561 3109258 3119654 3130407 3141082 3151301 3160959
56139 3160959 3170320 3179987 3190512 3201626 3212070 3220928 3229142 3238878 3250927 3263305 3273025 3278866 3281874
56126 3281874 3283430 3283714 3282322 3279733 3277407 3276363 3276131 3275404 3273394 3270088 3265407 3258921 3250709 3241732 3232674
56111 3232674 3222841 3211034 3197441 3183808 3171613 3160757 3150341 3140092 3130460 3121742 3113735 3106250
56099 3106250 3099367 3093008 3086715 3080407 3075217 3072871 3073786 3076209 3077968 3079046 3081674 3087682 3096485 3106102
56085 3106102 3115524 3125409 3136762 3149604 3162970 3175924 3188710 3203040 3220703 3241537 3263329 3284259
56073 3284259 3304902 3327095 3351447 3376908 3402378 3427520 3452197 3476481 3501472 3528915 3559422
56062 3559422 3591913 3625237 3659505 3695206 3731941 3769053 3807159 3847996 3892597 3940152 3988879
56051 3988879 4037731 4087116 4138126 4191290 4246307 4303066 4362603 4426565 4495749 4569623 4647401
56040 4647401 4728974 4814418 4903083 4994012 5087425 5185194 5289232 5399409 5513585 5629992
56030 5629992 5749263 5873714 6005089 6143804 6290207 6445263 6609485 6782379 6964005
56021 6964005 7156350 7361927 7581452 7814156 8060242 8321475 8598961 8891512 9197152
56012 9197152 9515786 9849712 10201813 10573837 10966449 11380402 11817150 12278250 12764574
56003 12764574 13276681 13815763 14383480 14980809 15607897 16265156 16953200 17671127 18416630
55994 18416630 19189744 19996434 20847662 21755767 22732759 23790592 24939984 26187766 27536352
55985 27536352 28986175 30538359 32196362 33967541 35864124 37902166 40099824 42476255
55977 42476255 45047521 47816209 50761791 53844172 57020641 60260784 63547398 66869318
55969 66869318 70218237 73589099 76974380 80352569 83685032 86930665 90068201 93107435
55961 93107435 96084314 99051147 102068611 105189053 108422661 111705628 114904286 117860310
55953 117860310 120440297 122555871 124165075 125285254 126010714 126492964 126870338 127196342
55945 127196342 127428150 127479709 127286574 126832301 126133461 125216802 124117543 122893990 121627079
55936 121627079 120385865 119182750 117963081 116639408 115132980 113389270 111380838 109125872
55928 109125872 106711661 104284064 101995815 99953496 98199772 96726376 95493962 94449917
55920 94449917 93546479 92752937 92051858 91423165 90832434 90234487 89589307 88878327 88109321
55911 88109321 87307216 86500946 85718656 84990025 84344561 83804227 83381843 83089210 82941462
55902 82941462 82946838 83091998 83341176 83651834 83993095 84353013 84728495 85100511 85410850 85565716
55892 85565716 85475658 85106819 84503493 83766027 83003728 82293498 81661565 81089718 80538218
55883 80538218 79971277 79370591 78732483 78057099 77341284 76580103 75774036 74934281 74078966
55874 74078966 73220340 72353124 71455688 70504822 69493310 68438316 67375249 66339294 65344350
55865 65344350 64374199 63394168 62374297 61304971 60195778 59065261 57932661 56813577
55857 56813577 55716191 54638989 53574132 52516011 51468566 50445157 49460380 48519330
55849 48519330 47612436 46720498 45826326 44923759 44017973 43119211 42236525 41375834 40541841
55840 40541841 39740535 38978998 38262141 37589611 36956401 36356432 35784948 35237611 34708795
55831 34708795 34192209 33683653 33183146 32694427 32221983 31767611 31329115 30902073 30482668
55822 30482668 30068725 29658916 29252354 28849297 28451214 28059277 27672913 27290101 26908704
55813 26908704 26527297 26145288 25763162 25382974 25008404 24643878 24293116 23958223 23640141
55804 23640141 23339912 23058893 22797429 22553826 22325296 22109580 21904805 21707829 21513711
55795 21513711 21317365 21115659 20907991 20695571 20480370 20264240 20048280 19832654 19616911
55786 19616911 19400702 19184924 18972536 18767757 18573673 18390695 18217619 18053745 17899267
55777 17899267 17753818 17615293 17479846 17342447 17198111 17043994 16880568 16709984 16533375
55768 16533375 16350836 16163971 15976866 15793724 15616521 15445747 15282478 15128477 14984587
55759 14984587 14850193 14724507 14607808 14501033 14404218 14315215 14229821 14143443 14053073 13957765
55749 13957765 13857355 13751170 13638437 13519782 13397818 13275905 13156246 13039341 12925301
55740 12925301 12815245 12710757 12611959 12516922 12423502 12331174 12240425 12150927 12061167 11969567 11875082
55729 11875082 11777011 11675452 11572130 11469769 11370249 11273870 11180389 11089929 11002790 10919319
55719 10919319 10840248 10766339 10697433 10632631 10571516 10514052 10458930 10403259 10344807 10283697 10221174
55708 10221174 10157740 10093648 10030426 9970447 9914953 9863314 9813944 9765058 9714893 9662403 9607943
55697 9607943 9552492 9496062 9437596 9376391 9312706 9246703 9177664 9104894 9029017 8951926 8875650
55686 8875650 8801498 8729834 8660253 8592097 8525226 8460268 8397797 8337256 8277023 8215810 8153975
55675 8153975 8093325 8035573 7981070 7928940 7878106 7827916 7778119 7728907 7681212 7636338 7594651
55664 7594651 7554593 7513373 7468871 7421030 7371689 7323294 7277402 7233809 7190832 7146738 7101193
55653 7101193 7055357 7010433 6966301 6921798 6876157 6829734 6783103 6735965 6687503 6637655 6587398
55642 6587398 6537733 6488861 6440486 6392351 6344246 6295999 6247692 6199454 6150915 6101662 6052464
55631 6052464 6004953 5959388 5913754 5866218 5817720 5770719 5725899 5681698 5636874 5591948 5548000
55620 5548000 5505623 5465300 5427223 5390163 5352120 5312935 5274925 5239950 5207146 5174546 5141652
55609 5141652 5108966 5076131 5042460 5008768 4976883 4947294 4918644 4889609 4860026 4830092 4799720
55598 4799720 4769086 4738688 4708382 4677046 4643665 4608262 4571740 4535501 4501283 4470345 4442297
55587 4442297 4415307 4387847 4359812 4331814 4304132 4276727 4249532 4222154 4193852 4164385 4134421
55576 4134421 4104509 4074196 4042915 4011369 3981032 3952299 3924030 3895080 3865451 3835572 3805352
55565 3805352 3774717 3744512 3715866 3688738 3662008 3635204 3609337 3585540 3563415 3541254 3517629
55554 3517629 3492332 3466153 3440277 3415706 3392613 3370315 3348252 3326748 3306201 3285811 3264099
55543 3264099 3240826 3217483 3195441 3174418 3153319 3131875 3110614 3089635 3068402 3046813 3025735
55532 3025735 3006111 2987938 2970370 2952599 2934367 2915736 2896674 2877007 2856652 2835761 2814653
55521 2814653 2793786 2773674 2754468 2735472 2715482 2693849 2671005 2647743 2624497 2601676 2580103
55510 2580103 2560406 2542320 2525213 2508876 2493016 2476504 2458326 2439156 2420796 2403977 2387860
55499 2387860 2371739 2355893 2340337 2324023 2305981 2286408 2266157 2246071 2227179 2210352 2195152
55488 2195152 2180086 2164719 2150389 2138005 2126264 2113144 2098254 2082668 2067303 2052587 2038889
55477 2038889 2025949 2012403 1997119 1980595 1964098 1948048 1932301 1917261 1903391 1890118 1876547
55466 1876547 1862854 1849784 1837247 1824662 1812055 1799345 1785172 1768265 1749799 1732610 1718112
55455 1718112 1705634 1694625 1685435 1677487 1668698 1657580 1644586 1630803 1616807 1603391 1591759 1581871
55443 1581871 1571786 1559718 1545936 1531862 1518377 1505913 1495139 1486152 1477453 1466879 1453577 1438594
55431 1438594 1423830 1410828 1400077 1390880 1382049 1372890 1363273 1352878 1341199 1328326 1314999 1301873
55419 1301873 1289655 1279723 1273007 1267831 1260466 1248806 1234386 1220026 1206715 1193862 1181315 1169546
55407 1169546 1158465 1147423 1136226 1125142 1114185 1103130 1091912 1080454 1068590 1056786 1046184
55396 1046184 1037280 1029282 1021401 1013748 1006124 997229 986513 975756 967025 959820 952179 944118 937626
55383 937626 933118 928245 921138 912914 905629 899186 891927 883626 876123 870749 866303 860326 851965 842838
55369 842838 834919 828120 820633 811516 802000 793830 787157 780798 773959 766749 759388 751915 744589 737688
55355 737688 730962 723992 716958 710258 703584 696243 688353 680775 673930 667594 661757 656580 651414 644993
55341 644993 636909 627870 618293 607875 597127 588044 582154 578583 574996 569996 563828 557232 550677 544559
55327 544559 539295 534946 531181 527746 524747 522491 521120 520115 518117 513744 507003 499597 493452 489064
55313 489064 485471 481425 476293 470277 464345 459634 456335 453191 448589 442222 435355 429489 425092 421592
55299 421592 418210 414661 411251 408444 406285 404244 401615 398019 393497 388273 382634 376986 371866 367786
55285 367786 364896 362647 359961 356061 351255 346661 343118 340509 338116 335326 331924 328045 323964 319774
55271 319774 315220 310165 305141 300961 297656 294330 290420 286594 283892 282192 280112 276462 271399 266034
55257 266034 261119 256470 251771 247654 245363 245095 245230 243949 241284 238639 236421 233316 228299 222250 216903
55242 216903 212968 210103 207926 206100 203945 201054 198077 196063 195256 195184 195457 195490 193994 190050 184495 178970
55226 178970 173790 168292 163150 160341 160254 160786 160368 160070 161141 162020 160071 155519 151428 149720 149119 147409
55210 147409 144134 140476 137704 136361 136013 135378 133522 131206 130093 130416 130662 129999 129542 130318 131344 131063
55194 131063 129698 128613 127948 126488 123727 120496 117388 113947 109868 105884 102883 100941 99783 99528 100388
55179 100388 101998 103560 104499 104711 104426 103959 103340 102164 100151 97915 96734 97371 99385 101560 102688 102047
55163 102047 99797 97055 95110 94371 94412 94955 96150 97835 99215 99499 98352 95803 92471 89860 89294 90234
55147 90234 90704 89955 89564 91097 93745 95416 95364 94419 93222 91718 90211 89365 88935 87755 85486 83401
55131 83401 82911 84034 85840 87732 89705 91760 93690 95265 96222 96170 94841 92461 89752 87544 86328
55116 86328 85956 85684 84654 82508 79731 77526 77140 78737 80774 81160 79496 77723 77910 79829 81434 81515
55100 81515 80912 81118 82549 84495 86105 87042 87546 88134 89029 89848 90125 90009 90002 90108 89847 89014 87800 86203
55082 86203 84132 82252 81845 83418 86041 88444 90137 91098 91102 90131 88939 88466 88823 89437 90018 90783 91792
55065 91792 92632 92896 92633 92137 91532 90758 89920 89488 89971 91320 92823 93815 94409 95254 96730 98577 100095
55048 100095 100341 98485 94710 90674 88227 87565 87411 87118 87523 89281 91445 92653 93015 93706 94991 95704
55032 95704 94694 92049 88795 86044 84529 84380 85122 86138 87156 88069 88574 88496 88368 89090 90888 93031
55016 93031 94637 95403 95532 95460 95725 96658 97939 98799 98949 99078 100182 102498 105206 107041 107055 105067 101727
54999 101727 98279 95970 95322 95811 96487 97135 98615 101623 105265 107581 107733 107044 107402 109239 111690 114219
54983 114219 117071 120253 123049 124752 125238 124738 123842 123904 126531 131992 138645 144489 148895 152442 155627
54968 155627 158457 160915 163005 164464 165135 165631 167015 169810 173786 178520 183458 187543 189908 191195 193100
54953 193100 195949 197674 196209 192308 188838 187581 187860 188155 187768 186644 184811 182793 181769 182557 184859
54938 184859 187913 191226 194092 195214 193890 191246 189285 188801 189054 189328 189789 190699 191873 193315 195595
54923 195595 198918 202294 204225 204080 202568 201196 201404 203662 206867 208978 208907 207782 207867 210144 213333 215378
54907 215378 215531 214707 214136 214322 215399 217699 221104 224141 224898 223281 221484 221551 223149 224505 224787 224411
54891 224411 223493 221544 218866 216852 216301 216324 215422 212900 208888 203883 198900 195284 193580 193009 192490 191631
54875 191631 190371 188440 185864 183362 181551 180274 179320 179070 179600 179846 178716 176580 174640 173229 171937
54860 171937 171062 171429 172639 172908 171216 168584 166651 165925 166035 166811 168091 169120 169259 169145 170059 171969
54844 171969 173199 172569 171127 170872 172092 173013 172219 170453 169411 169529 169921 170046 170254 170659 170678 170161 170022
54827 170022 171122 173123 174990 176137 176652 176927 177572 179090 181118 182593 183201 183960 185692 187682 188794
54812 188794 189303 190469 192676 195086 196962 198285 199294 200422 202437 205435 207812 207639 205273 203354 203834
54797 203834 206261 209366 212940 217117 220949 223136 223921 225030 227621 231009 233652 234946 235761 237276 239585
54782 239585 241693 242944 243994 245903 248634 251190 253043 254532 255797 256368 256221 256405 257911 260444 262930
54767 262930 264870 266615 268615 271004 273817 277042 280300 282855 284253 284998 286412 289454 293587 297145
54753 297145 299087 299925 300479 300361 298618 295524 292569 290621 289120 287305 285184 282986 280661 278447 276947
54738 276947 276057 274723 272465 270374 269725 270278 270842 271036 271507 272714 274405 276152 277655 278610 278949 279096
54722 279096 279361 279213 277776 275055 272109 270007 269088 269114 269595 269841 269243 267722 265696 263568 261388 259028
54706 259028 256512 254197 252645 252105 252201 252478 253257 255310 258448 261144 262096 261644 261084 261097 261532 262230 263121
54689 263121 263681 263194 261672 259847 258242 256899 256100 256636 258973 262523 266063 268765 270681 272357 274034
54674 274034 275291 275737 276069 277877 281895 286726 289956 290508 289496 288766 289058 289585 289118 287417 285750 285852
54658 285852 288197 291586 294598 296996 299320 301698 303805 305677 307730 309949 311777 312901 313662 314662
54644 314662 316341 318823 321645 323772 324489 324244 324101 324490 325129 325952 327246 328751 329407 328285 325322 321144
54628 321144 316823 313716 312593 312633 312060 310150 307914 306553 306143 306301 307039 308081 308235 306750 304882 304722
54612 304722 306400 307719 306876 304456 302123 300273 297980 294701 290925 287260 283978 281597 280853 281609 282682
54597 282682 283477 284883 287559 290088 290423 288902 288082 289168 290272 289094 285921 282812 280975 280466 281513
54582 281513 284198 287029 287660 285412 281854 278657 276074 273722 271585 269717 268046 266955 267026 267701 267357
54567 267357 265501 263911 264588 267250 269832 270952 270911 270585 270315 269895 268879 266856 263892 260769 258429 257219
54551 257219 256890 257061 257417 257752 258180 258982 260002 260601 260581 260631 261302 262009 261698 260224 258370 256851 255965 255953
54533 255953 256721 257197 255863 252318 247856 244350 242893 243382 244762 245481 244399 241709 238734 236705 236033
54518 236033 236630 238153 239647 239798 238303 236622 236478 237722 238416 237187 234744 232665 231359 230001 228272
54503 228272 227226 227962 229924 231122 229981 226652 222536 218917 216237 214451 213696 214443 216911 220481 223922
54488 223922 226327 227643 228220 228183 227494 226234 224450 222051 219408 217676 217713 218774 219124 218076 216604 215793
54472 215793 215658 215909 216812 218404 219552 218973 216927 214941 213932 213502 213195 213533 215257 218094 220824 222380
54456 222380 222491 221354 219091 215820 212195 209533 209015 210572 212751 213836 213075 210922 208422 206559 205843
54441 205843 206106 206706 207196 207822 209269 211877 215133 217879 219135 218829 217621 215905 213351 209885 206674
54426 206674 205317 206057 207629 208993 210275 211757 213054 213914 214854 216153 217000 216670 215911 216054 217130 217957
54410 217957 217839 217091 215990 214328 212183 210230 209157 209380 211190 214301 217416 219220 219877 220607 221779
54395 221779 222550 222573 222785 224031 226006 228164 230581 233082 234466 233709 231468 229501 228919 229632 230982 232081
54379 232081 232035 230879 230100 231242 234049 236808 238393 238989 238781 237221 234213 231105 229520 229549 229986 230191
54363 230191 230833 232508 234365 234863 233775 232796 233857 237104 240752 242769 242479 240744 239030 238347 238809 239951
54347 239951 241401 243097 244716 245255 243778 240672 237679 236320 236489 236891 236672 236275 236643 237964 239453 240272
54331 240272 240284 239745 238676 237065 235553 235125 235923 237036 237820 238687 239988 240885 240322 238651 237136 236131
54315 236131 234986 233745 233564 234988 236869 237631 236814 234962 232787 230938 229842 229171 228038 226053 223484
54300 223484 220188 215579 210278 206563 206042 207721 209420 210259 210513 209978 208326 206729 207153 209668 211939
54285 211939 211939 209999 207763 206372 206377 208218 211519 214421 214753 211989 207595 203601 201236 200726 201722 203640
54269 203640 205768 207350 207921 207736 207644 208125 208524 207669 205195 201750 197954 193864 189737 186647 185697 186812
54253 186812 188755 190277 190951 190948 190370 189127 187489 186473 187118 189151 190840 190700 189029 187207 185723 183832
54237 183832 181192 178880 178253 179333 180804 181288 180287 178239 176077 174525 173561 172775 172270 172693 174013 174877
54221 174877 173892 171425 169426 169374 170912 172681 173921 174753 175141 174440 172407 170187 169500 170788 172780 173994
54205 173994 173965 172769 170308 166942 164095 163026 163205 162959 161701 160496 160468 161754 164155 167616 171577 174952
54189 174952 177332 179333 181187 181910 180604 177812 174781 172046 169527 167385 165894 164904 164205 163936 163975 163490
54173 163490 162041 160533 159996 159858 158637 156236 154339 154373 156037 158017 159275 159397 158470 157097 156132 156098
54157 156098 156973 158327 159340 159127 157710 156384 156349 157166 157341 156252 154662 153516 153154 153556 154337 154540 153518
54140 153518 152071 151616 152286 153044 153659 154892 156413 156330 153783 150488 148567 148055 147771 147424 147287 146870 145735
54123 145735 145029 146259 148714 150011 149336 148404 148790 149944 150528 150238 149321 147557 145059 143227 143521 145554
54107 145554 147532 148441 148751 148994 148863 148210 147943 149053 151153 152789 153104 152540 151855 151150 150233 149341 148918
54090 148918 148930 149044 149354 150236 151418 151879 151060 149682 148912 149073 149520 149552 149018 148282 148046 148995 151167 153733
54072 153733 155736 157028 158170 159554 160950 161852 162012 161716 161739 162799 164752 166542 167277 167092 166667 166338
54056 166338 166160 166429 167283 168081 168058 167552 167790 169422 172096 175481 179609 183895 186996 188372 189156 190645
54040 190645 192554 193643 193582 193275 193655 195070 197648 201215 204759 206942 207503 207562 208272 209846 212067 214966
54024 214966 218385 221554 223900 226051 229123 232996 236058 236951 236048 234823 234238 234308 234975 236527 238831 240698
54008 240698 240760 238966 236757 235554 235414 235505 235623 236631 239191 242507 244891 245514 245134 244933 245088 244852 243671
53991 243671 241680 239283 236937 235369 235210 236145 237098 237648 238561 240299 241816 241941 241506 242704 246216 250373
53975 250373 253695 256933 261562 267020 270864 271556 270063 268572 268419 269465 270733 271134 270059 267874 265792
53960 265792 264975 265724 267613 270261 273760 278308 283543 288374 291644 293076 293460 293832 294568 295482 296605 298369
53944 298369 300872 303238 304167 303252 301648 301251 303070 306373 309451 311119 311356 310758 309920 309622 310998 314762
53928 314762 320206 325565 329618 332565 335115 337067 337361 335529 332710 330886 331179 333049 335149 336796 338426
53913 338426 340868 344465 348957 353779 358176 361287 362597 362429 361768 361542 362142 363482 365181 366623 367172
53898 367172 366547 364957 362875 360809 359287 358793 359481 360977 362535 363488 363692 363663 364133 365270 366434 366959
53882 366959 366911 366643 365810 363627 360266 357141 355216 353741 351475 348588 346257 344617 342513 339599 337324
53867 337324 336912 337319 336438 333957 331711 331205 332002 332881 333482 334014 334089 332907 330460 327857 326356 326418 327530
53850 327530 328470 327912 325331 321475 317640 314577 312479 311728 312801 315241 317496 318290 317810 317077 316547 315929
53834 315929 315264 315436 317251 320222 322689 323312 322368 321329 321109 321047 319855 317277 314325 312011 310442 309229
53818 309229 308237 307745 308228 310026 312678 314594 314205 311747 309168 307873 307431 307088 307422 309258 311661 312692
53802 312692 312156 312167 314510 318519 322076 323793 323639 322269 320637 319878 320608 322209 323251 322821 321429 320619
53786 320619 321599 323949 325822 325804 324463 323526 323659 323900 323380 322565 322346 322762 323314 323750 323761 322538 319688 316239
53768 316239 313793 312857 312812 313304 314626 316733 318936 320854 322823 325039 326962 327935 327824 326768 324966 323137
53752 323137 322554 323982 326777 329447 330896 330918 329976 328912 328497 328730 328730 327692 325762 323670 321924 320845
53736 320845 321082 323339 327535 332672 337491 340924 342257 341653 340528 340520 341744 342711 342319 341176 340374 339672
53720 339672 337987 335433 333673 333956 335700 337603 339445 341975 345293 348305 350010 350692 351447 352915 354948
53705 354948 357379 360504 364559 368968 372575 374746 376047 377607 379859 382179 383789 384648 385274 386059 387252
53690 387252 389370 392805 396832 399799 400915 401413 403198 406502 409587 410788 410194 409236 409305 411038 414230
53675 414230 417870 420722 422536 424366 427092 429904 430996 429708 427205 425009 423668 423172 423765 425612 428116
53660 428116 430341 432004 433504 435084 436576 437963 439614 441758 444142 446401 448409 450044 450982 451131 451034
53645 451034 451484 452731 454349 455845 457130 458359 459647 461165 463301 466370 470009 473166 475019 475920 477146
53630 477146 479593 482870 485876 488055 489874 492149 495262 499061 503180 507329 511444 515673 520116 524514
53616 524514 528403 531618 534433 537092 539491 541580 543873 547209 551987 557863 564211 570637 576848 582277
53602 582277 586272 588923 591465 595470 601490 608800 616464 624173 631762 638545 643923 648442 653298 658706
53588 658706 663582 667197 670327 674190 678860 683449 687509 691418 695508 699589 703533 707748 712645 717843
53574 717843 722277 725220 727137 729285 732333 735776 739134 743305 749628 757562 764603 769223 772751 777271
53560 777271 782561 786663 789116 791932 797114 804500 812517 819992 826572 832294 837522 842901 848811 855046
53546 855046 861270 867349 873106 878197 882524 886358 890000 893774 898400 904694 912724 921825 931575 942122
53532 942122 953501 965430 977892 990975 1004024 1016124 1027762 1040658 1055217 1069436 1081469
53521 1081469 1092237 1104187 1118243 1133331 1148364 1163261 1178282 1193731 1210239 1228185 1246970
53510 1246970 1265972 1286014 1308566 1333405 1358379 1381739 1403615 1424951 1446240 1467801 1490214
53499 1490214 1513780 1538226 1563362 1589307 1615667 1641375 1665971 1690408 1715983 1742877 1770127
53488 1770127 1796604 1821725 1845792 1869898 1894933 1920456 1945193 1968843 1992436 2016588 2040480
53477 2040480 2063376 2086121 2110072 2135213 2160444 2185198 2209542 2232995 2254625 2274483 2293816
53466 2293816 2313498 2333021 2351392 2368247 2383592 2397148 2408757 2419284 2430461 2443516 2458093
53455 2458093 2472659 2485933 2497759 2508558 2518323 2526625 2533526 2539850 2546312 2552966 2559750 2566880 2574248
53442 2574248 2581120 2587267 2593720 2601251 2608482 2612999 2614633 2616256 2620652 2627597 2634903 2641343 2647243 2652854
53428 2652854 2658001 2663624 2672024 2684345 2698616 2711439 2721396 2729778 2738322 2747601 2757885 2770109 2784905
53415 2784905 2801503 2818684 2836324 2854886 2873965 2892813 2912177 2933816 2957616 2980886 3001788
53404 3001788 3022319 3046304 3074949 3105925 3136758 3167536 3199789 3233878 3268432 3301885 3333822
53393 3333822 3365042 3396915 3430717 3467084 3505645 3545081 3583817 3621087 3657530 3694535 3732954
53382 3732954 3772693 3813447 3855041 3896610 3936250 3972587 4006551 4040635 4076275 4112662 4148258
53371 4148258 4182599 4216175 4249219 4281342 4312054 4340982 4367659 4391612 4412942 4432589 4451768
53360 4451768 4470974 4489507 4506099 4520156 4532223 4543023 4552200 4558418 4560817 4560194 4558667 4558271 4559759
53347 4559759 4562331 4564254 4563858 4560284 4553754 4545421 4536745 4528382 4519453 4508535 4495660 4482762 4471544
53334 4471544 4461422 4450387 4437598 4424244 4412010 4401570 4392603 4384341 4375800 4366221 4355642 4344658
53322 4344658 4333630 4322730 4312603 4304026 4296814 4290069 4283719 4278558 4274273 4268849 4261033 4252391 4245640
53309 4245640 4241549 4238782 4236259 4234116 4232352 4230159 4227224 4224619 4223665 4224430 4225951 4227473 4229013 4230968
53295 4230968 4233677 4237238 4241421 4245720 4249637 4252858 4255162 4256300 4256127 4254918 4253544 4253194 4254479 4256677
53281 4256677 4258218 4258205 4257155 4256032 4255129 4254454 4254627 4256333 4258863 4260105 4258275 4253139 4245605 4236921 4228430
53266 4228430 4221158 4214941 4208445 4200611 4191713 4182624 4173535 4164002 4153918 4143658 4133295 4122214 4109654
53253 4109654 4095302 4079380 4062406 4044943 4027366 4009796 3992248 3974635 3956480 3937026 3915966
53242 3915966 3893883 3871578 3849121 3825976 3801972 3777668 3753796 3730826 3709020 3688264 3667669
53231 3667669 3645994 3622998 3599919 3578063 3557122 3535571 3512615 3489056 3466037 3443671 3421476
53220 3421476 3399709 3379417 3361027 3343545 3325483 3306217 3286057 3265376 3244191 3222512 3200497
53209 3200497 3178144 3155306 3132276 3109935 3088936 3068980 3049343 3029895 3011124 2993105 2974919
53198 2974919 2955297 2933678 2910546 2886967 2863852 2841316 2818616 2794962 2770551 2746464 2723276
53187 2723276 2700173 2675960 2650734 2625941 2602767 2581047 2559906 2538904 2518136 2497641 2477172
53176 2477172 2456293 2434355 2410744 2385755 2361058 2338475 2318073 2297900 2275817 2251367 2225952
53165 2225952 2201807 2180807 2163248 2147104 2129118 2107651 2084334 2062251 2042641 2024181 2005366
53154 2005366 1986367 1968044 1950161 1931683 1912490 1893708 1876121 1859039 1841142 1822066 1802681
53143 1802681 1784021 1766391 1749491 1733069 1717250 1702343 1688468 1675320 1662221 1648504 1634020
53132 1634020 1619375 1605536 1593078 1581665 1570257 1557902 1544497 1530789 1517428 1503994 1489260
53121 1489260 1472786 1455970 1440974 1428670 1418198 1408409 1398673 1387951 1374463 1357702 1340214 1325707
53109 1325707 1315143 1305937 1295333 1283328 1271648 1261205 1251633 1242501 1233623 1224547 1214957 1205368 1196431
53096 1196431 1187798 1178832 1170221 1163397 1158227 1152710 1145461 1137139 1128731 1119879 1109994 1099825 1090445 1081467
53082 1081467 1071896 1062238 1054070 1047581 1041269 1034385 1028043 1023151 1018611 1012554 1004523 995437 986208 977416
53068 977416 969780 963824 959154 954915 950839 947103 943342 938635 932619 925981 919730 914404 909928 905818
53054 905818 901499 896844 892312 888175 883862 878547 872181 865290 857972 849911 841317 833065 825802 819653
53040 819653 814800 811417 808820 805678 801503 797159 793471 790110 786342 781985 777063 771323 764928 758911
53026 758911 754098 750078 746019 741947 738320 734968 731460 728129 725587 723510 721037 718145 715402 712502
53012 712502 708406 703123 698128 694615 692355 690616 689071 687396 685064 682198 679753 678285 677308 676269
52998 676269 675159 673683 671009 667183 663679 661526 659893 657592 654987 653038 651456 649537 648063 648288
52984 648288 649248 648383 645261 642569 642507 643949 644409 643333 641933 640736 639047 636427 633269 629933 626476
52969 626476 623278 620911 619205 617304 614789 612050 609343 606327 602980 600363 599824 601505 604073 606004
52955 606004 606971 607791 608917 609233 606973 602076 597009 594496 594744 595625 595350 593954 592161 590066 587539 584969
52939 584969 582638 579961 576358 572637 570514 570691 572089 573074 572811 571355 569227 567207 565925 565214 564207
52924 564207 562377 560137 558072 556072 553727 551258 549393 548314 547210 545145 542225 539818 539432 541093
52910 541093 542849 542400 539510 536356 535068 535358 535157 533231 530362 528107 527272 527778 529182 530843 532018
52895 532018 532307 531894 531319 531167 531834 533085 533875 533213 531255 528999 526877 524523 522088 520770 521412 523319
52879 523319 525172 526526 527751 529060 530320 531406 532038 531748 530714 529961 529859 529056 526180 522184 519526
52864 519526 519123 519660 520039 520774 522226 522977 521310 517546 513789 511750 511588 512390 512902 512116 510153 508514
52848 508514 508729 510707 512930 514131 514185 513448 512011 509888 507402 504971 502705 500532 498672 497739 498115 499201
52832 499201 499613 498520 496686 495650 495788 495763 494216 491456 488988 487683 486969 485695 483349 480422 477885
52817 477885 476262 475070 473171 469806 465218 460358 456318 453973 453622 454776 456611 458628 460375 460750 458662
52802 458662 454665 450806 448231 446027 443193 440597 439607 439660 438867 436748 434784 434162 434339 434088 432791 430359
52786 430359 426941 423189 420024 417816 416340 415472 415086 414376 412533 410244 409202 409696 410015 408758 406440
52771 406440 404009 401177 397456 393729 391282 389887 388310 386353 385014 384665 384331 382994 380681 377957 375104
52756 375104 372102 369011 366172 364145 363231 362803 361605 359260 357016 356224 356438 355974 354110 351759 349967
52741 349967 348760 347625 346141 343880 340592 337087 335168 335941 338431 340388 340354 338686 336725 335260 333782
52726 333782 331194 327207 322804 319154 316435 314253 312822 312858 314232 315619 315799 314751 313223 311857 311064
52711 311064 311028 311340 311179 310375 309810 310253 311254 311845 311881 311839 311490 309835 306615 303106 300826 299877 299117 297744
52693 297744 296175 295321 295485 296185 296743 296755 296164 295207 294205 293039 290932 287215 282451 278295 275907 274875
52677 274875 273972 272587 270923 269165 267197 265062 263210 262144 262071 262710 263187 262453 260356 258060 256829 256632
52661 256632 256531 256103 255531 254511 252338 249366 247359 247784 250369 253675 256313 257262 255950 252832 249417
52646 249417 247090 246165 246205 246533 246133 244039 240638 237862 237272 238481 240114 241517 242557 242513 240704 238023
52630 238023 236463 236908 238382 239571 240134 240318 240282 240269 240778 242010 243456 244213 243493 241018 237482 234495 233304
52613 233304 233547 233878 233786 233925 234633 235244 235297 235471 236531 237995 238728 238542 238452 239335 240797 241509 240564 238523
52595 238523 237006 237017 237743 237491 235796 234020 233746 235191 237367 239095 239479 238107 235597 233616 233568 235224
52579 235224 237036 237872 238154 239282 242045 245590 248001 248165 247032 246636 247944 250150 252084 253465 254404
52564 254404 254592 253770 252595 252224 253174 255107 257474 259711 261011 260694 259011 257050 255725 255205 255431 256739
52548 256739 259560 263485 266812 267453 264770 260561 257717 257648 259354 261102 262346 263668 265605 268215 271295
52533 271295 274177 275686 275215 273604 272036 270218 266879 262308 259171 259945 264175 269066 272485 274638 276846
52518 276846 279464 281499 282057 281555 281135 281280 281592 281926 282804 284305 285424 285395 285068 285835 287530 288697 288952
52501 288952 289662 291721 293955 294641 293768 292721 292291 292148 292109 292765 294585 297076 299241 300406 300350 299116 297252
52484 297252 296040 296825 299676 302948 304640 304262 303060 302417 302640 303566 305516 308701 312076 313965 313980 313352
52468 313352 313152 313108 312590 311755 311036 310289 309294 308533 308593 309240 309926 310827 312421 314282 315333 315307 315044 315236 315767
52449 315767 316434 317390 318501 319130 319084 319095 319728 320322 319786 318187 316898 317187 319101 321630 323549 324171 323726
52432 323726 323145 323170 323576 323415 322022 319588 316826 314385 312626 311631 311182 310842 310254 309482 309052 309665 311648
52415 311648 314497 317046 318399 318780 319224 320363 321780 322672 322806 322467 321786 320651 319185 317767 316538 315352
52399 315352 314394 314333 315584 317872 320721 323888 326910 328941 329810 330804 333389 337169 340100 340897 340377 340073
52383 340073 340398 340812 341189 342182 344357 347533 350940 353680 355174 355542 355525 355816 356437 356867 356650 355866 355265
52366 355265 355904 358248 361556 364606 367044 369372 371596 372924 373399 374780 378655 384165 388773 391231 392736
52351 392736 395112 398759 402706 405932 408200 410003 412000 414371 416762 419102 422121 426443 431312 435006
52337 435006 436695 437350 438618 441206 444464 447236 449116 451105 454727 460126 465579 469671 473457 479249
52323 479249 487462 496046 503215 509296 515328 521229 526332 530872 535910 542311 550422 560110 570431 579902
52309 579902 587897 595197 602636 610061 617484 626182 637163 649111 659417 667208 674068 681823 691015
52296 691015 701610 713626 726368 738292 748573 758097 768135 778660 788798 798475 808648 819972
52284 819972 832008 843902 855326 866444 877214 887137 895837 903781 912072 921324 930988 940115 948587
52271 948587 957037 965678 973982 981881 990631 1001679 1014655 1027239 1037378 1045382 1053396 1062886 1073247
52258 1073247 1083049 1092036 1101093 1110613 1120033 1129155 1138790 1149344 1159700 1168542 1176256 1184429 1193767
52245 1193767 1203685 1213817 1224614 1236124 1247306 1257211 1266155 1275196 1284888 1294979 1304814 1313729 1321537
52232 1321537 1329066 1337760 1348233 1359448 1369613 1377665 1383856 1389380 1395639 1403299 1411636 1419111 1424804
52219 1424804 1429022 1432594 1436312 1441111 1447700 1455376 1462124 1466726 1470226 1474509 1480036 1485882 1491409 1496602
52205 1496602 1500972 1503541 1504269 1504569 1505926 1508569 1511802 1515033 1518105 1521039 1523859 1526510 1528844 1530919
52191 1530919 1533335 1536893 1541756 1547168 1551973 1555213 1556488 1556303 1555963 1556511 1557671 1558354 1558208 1557988 1558266 1558525
52175 1558525 1557912 1556252 1553933 1551456 1549717 1550013 1552761 1556417 1558677 1558962 1558970 1560437 1562988 1564675 1564278 1562463
52159 1562463 1560771 1560057 1560124 1560420 1560600 1560552 1560383 1560533 1561511 1563243 1564932 1565832 1565946 1565601 1564617 1562482 1559296
52142 1559296 1555903 1552957 1550465 1548463 1547478 1547733 1548437 1548616 1548488 1549133 1550611 1551200 1549094 1544546 1539727 1536506
52126 1536506 1534952 1534163 1533921 1534826 1536896 1538883 1539446 1538570 1537390 1536917 1537625 1539927 1544026 1549046 1553292 1556094
52110 1556094 1558700 1562543 1567127 1570708 1572930 1575569 1580293 1586663 1593041 1598755 1604413 1610364 1615884 1620244
52096 1620244 1623959 1628431 1634500 1641719 1649070 1656113 1663235 1670830 1678574 1685691 1691814 1697240 1702397 1707419
52082 1707419 1712368 1717461 1722783 1728058 1732972 1737496 1741529 1744599 1746434 1747731 1749733 1752980 1756988 1761152
52068 1761152 1765317 1769276 1772468 1774661 1776435 1778420 1780513 1782429 1784689 1788298 1793540 1799794 1806451 1813238
52054 1813238 1819556 1824346 1827074 1828384 1829419 1830860 1832826 1835150 1837341 1838870 1840111 1842588 1847409 1853511
52040 1853511 1858324 1860480 1861268 1862996 1866366 1870018 1872401 1873478 1874513 1876753 1880601 1885561 1890426 1893686
52026 1893686 1894467 1893256 1891225 1888749 1885199 1880487 1876069 1873613 1873147 1873340 1873277 1872893 1871764 1868879 1864124
52011 1864124 1858932 1854588 1850517 1845036 1837316 1828022 1818447 1809726 1802416 1795915 1788505 1778786 1767133 1755221
51997 1755221 1744288 1734465 1725550 1717510 1710066 1702459 1693916 1684090 1673167 1662023 1651953 1643484 1635395
51984 1635395 1625725 1613898 1601231 1589317 1578620 1568768 1559296 1549698 1539457 1528540 1517411 1506239
51972 1506239 1494704 1482938 1472036 1463069 1455989 1449786 1443279 1435595 1426633 1417546 1409906 1403670 1396619
51959 1396619 1386753 1374709 1362886 1352617 1343325 1334236 1325539 1317517 1309592 1300867 1291095 1280713 1270337
51946 1270337 1260588 1252035 1244877 1238683 1232541 1225421 1216682 1206693 1196848 1188315 1180686 1172389 1162604 1152157
51932 1152157 1142434 1134047 1126882 1120667 1114791 1108065 1099567 1089712 1079890 1070976 1062674 1054300 1045656 1036961
51918 1036961 1028381 1020069 1012503 1006324 1001672 997718 993046 986630 978522 969595 960714 952264 944347 937020
51904 937020 930149 923387 916713 910821 906482 903496 900701 897194 893167 889365 886074 882965 879607 875672
51890 875672 870800 864843 858392 852574 848038 844369 840739 836888 833180 829876 826809 823872 821437 819937
51876 819937 819039 817515 814222 809247 803995 800010 797780 796767 796288 795849 794684 791741 786712 780817 776010
51861 776010 773380 772623 772823 773218 773189 772176 770003 767110 764216 761806 759962 758566 757624 757429 758177 759259
51845 759259 759298 757345 753821 749836 745995 742562 740410 740431 741846 742374 740718 737795 734899 731904 728403
51830 728403 725495 724720 725750 726880 727714 729493 732445 734707 734785 733541 732389 730741 727006 721545 716743
51815 716743 714060 712618 711144 709850 709443 709390 708530 706931 705833 705731 705709 705038 704433 704982 706454 707562 707705
51798 707705 707632 708333 709895 711594 712544 711968 709432 705354 701109 698199 697206 697506 697739 696516 693182 688402
51782 688402 683964 681524 681365 682268 682482 680891 677679 674171 671804 671002 671184 671825 672978 674603 676052 676879
51766 676879 677652 679224 681418 683197 683947 683686 682115 678646 673895 670173 669504 671408 673372 673531 672385
51751 672385 671862 673187 675876 678465 679735 679259 677228 674290 671470 669653 668786 667894 666170 663716 660983
51736 660983 658050 655064 652864 652130 652039 650852 648099 645186 643367 642090 640167 637861 636715 637445 638912
51721 638912 639374 638189 636130 634458 633846 633855 633176 630635 626207 621071 616581 613244 610710 608599 607071 606535
51705 606535 607010 608026 609057 609669 609278 607414 604628 602555 602283 602931 602672 601152 599961 600473 602138 603412
51689 603412 603614 603182 602698 602468 602797 603825 605108 605989 606451 607143 608461 609911 610395 608931 605329 600612
51673 600612 596663 594897 595168 596158 596664 596184 594593 592112 589679 588578 589205 590584 591440 591364 590618 589319
51657 589319 587447 585406 583759 582324 580168 576833 573082 570072 568130 566895 566385 567186 569463 572335 574536
51642 574536 575322 574497 571940 567584 561714 555036 548550 543474 540809 540515 541400 542327 543234 544491 545636 545582
51626 545582 544049 542006 540629 540391 541189 542592 543877 544574 545161 546509 548503 550059 550716 551270 552389 553562
51610 553562 554002 553762 553307 552873 553020 554906 558829 563110 565669 566402 566925 568252 569885 571090 571883 572542
51594 572542 573101 573640 574422 575549 576989 578815 580717 581546 580304 577701 575820 576148 578639 582600 587405
51579 587405 592247 596358 599933 603773 607581 609750 609586 608768 609619 612561 616170 619267 621983 624946 628230
51564 628230 631232 633264 634343 635484 637715 640659 642816 643652 644533 646845 650048 652636 654322 656025 658122
51549 658122 660139 662080 664613 667698 670365 672297 674328 676670 677932 677097 675490 675342 676860 678261 678742
51534 678742 679823 683121 687952 692190 694786 696253 696949 696223 693691 690486 688417 688164 688908 689596 689973 690228
51518 690228 690192 689363 687655 685718 684410 684088 684581 685730 687593 689932 691808 692120 690634 688263 686257 685307
51502 685307 685365 685963 686606 687230 688381 690471 692702 693345 691613 688674 686196 684362 682198 679495 677231 675972
51486 675972 675071 674030 673776 675792 680408 686508 692595 697627 701145 703332 704866 706220 707121 707038 706113 705159
51470 705159 704811 705145 706113 707740 709564 710474 709753 708224 707680 708910 710810 711845 711997 712449 713603 714408
51454 714408 713960 712759 711709 710693 709133 707385 706366 706051 705574 704806 704564 705011 705128 704345 703515 703423 703283
51437 703283 701735 698697 695150 691569 687676 683678 680617 679252 679259 679815 680519 681455 682637 683631 683662 682114
51421 682114 678997 674999 671144 668479 667765 668867 670485 671169 670744 670092 669488 668087 665471 662699 661042
51406 661042 660432 660034 659716 659894 660308 660017 658466 655802 652372 648641 645283 642521 639687 636289 633130 631220
51390 631220 629956 627671 623961 620092 616907 613744 609905 605945 602727 600098 597255 593858 590179 586662
51376 586662 583684 581134 577995 573190 567257 562287 559617 558481 557566 556863 556929 557130 555989 553015 549031
51361 549031 544777 540312 535861 532283 530306 529856 530213 530303 528944 525627 521299 517708 515658 514429 513142
51346 513142 511996 511670 512002 512076 511494 510942 511329 512745 514448 515588 515685 514617 512585 510168 508137 506925
51330 506925 506356 506077 506047 506375 506794 506756 506045 504913 503427 501196 498075 494813 492457 491171 490108 488458
51314 488458 486210 483743 481164 478389 475662 473476 471931 470512 468658 466294 463718 461297 459511 458804
51300 458804 458867 458421 456557 454255 453549 454921 456514 456442 454894 453070 450980 447770 443677 440093 437541 435128
51284 435128 432450 430673 430884 432304 433176 432820 431980 431471 431311 431116 430734 430404 430461 430730 430246 428097 424784
51267 424784 422096 421180 421246 420647 418690 415812 412570 409401 407077 406377 407058 407816 407573 406455 405337 404719
51251 404719 404246 403132 400958 398091 395434 393834 393666 394634 395661 395402 393514 391258 390039 389409 387531
51236 387531 383783 379689 376786 374850 373157 372347 373510 375970 377483 376622 373937 370880 368736 368470 370301
51221 370301 372999 374685 374909 375168 376800 378979 379473 377160 373234 369873 368146 367463 366937 366681 367295 368422
51205 368422 368868 368227 367290 366378 364510 361218 358097 357154 358189 359277 359402 359159 359061 358843 358563 358863 359664
51188 359664 359929 359105 357768 356489 355187 353937 353232 353039 352783 352735 354042 356721 358824 358485 355815 352098
51172 352098 348275 345087 343419 343229 342983 341459 339482 338667 339151 339862 340470 341573 343138 344132 343912 342933
51156 342933 341877 340881 339790 338567 337254 335944 334770 333677 332554 331844 332396 334137 335650 335859 335515
51141 335515 336033 337392 338317 338108 337107 335725 334295 333691 334619 336284 337090 336754 336301 335811 333911 330206
51125 330206 326654 325310 325755 326010 325243 324240 323671 323293 322973 323337 324868 326997 328593 329095 328815 328346 328114
51108 328114 328500 329852 331933 333600 333777 332851 332348 332923 333516 333134 332628 333495 335465 336652 336021 334360 332696
51091 332696 331143 329681 328774 328527 328357 328199 328962 330842 332280 331883 330663 330962 333473 336762 339617 342336
51075 342336 345283 347511 347788 346273 344221 342419 340831 339647 339660 341134 343073 344322 345052 346265 347921
51060 347921 348659 347845 346891 347660 350159 352843 354803 356403 357821 358376 357678 356350 355120 354208 354231 356635
51044 356635 362106 369063 374685 377330 377384 376216 375034 374533 374810 375518 376413 377513 378502 378570 377464 376386
51028 376386 377059 379991 384152 388107 390946 392465 393183 394122 395979 398591 401639 405478 410458 415688 419524
51013 419524 421524 423114 425993 430481 435752 441121 446593 452427 458624 464916 471149 477624 484939 493400
50999 493400 502722 512362 521897 531011 539667 548661 559408 572462 586552 599746 611383 622262 633364
50986 633364 645277 658668 674120 691233 708671 725578 742457 760481 780346 801665 822893
50975 822893 842015 858302 873590 890915 911563 934211 957110 979933 1002925 1025364 1045970
50964 1045970 1064325 1081082 1097166 1113429 1130576 1148579 1166511 1183724 1200833 1218655 1236478
50953 1236478 1252475 1265810 1277334 1288066 1297989 1306860 1315261 1324061 1333210 1341790 1349062 1354942 1359573
50940 1359573 1363088 1365982 1369189 1373332 1377920 1381624 1383389 1383288 1382340 1381673 1381718 1381918 1381059 1378166 1373407 1368115
50924 1368115 1363741 1360773 1358619 1356293 1353049 1348763 1344108 1340245 1337833 1336343 1334722 1332706 1331025 1330321
50910 1330321 1330444 1330911 1331467 1331927 1332037 1332020 1332871 1335509 1339590 1343567 1346109 1347442 1349288 1353400 1359908 1367136
50894 1367136 1373325 1378453 1383995 1390970 1398924 1407001 1415322 1424705 1435432 1446822 1457856 1467934 1477363
50881 1477363 1487423 1499571 1514140 1530063 1546192 1562453 1579238 1596288 1613118 1630309 1649382
50870 1649382 1671135 1694704 1718467 1741430 1763758 1786672 1811984 1840944 1872924 1905654 1937339
50859 1937339 1968380 2000673 2035463 2072376 2110302 2148454 2186377 2223623 2260118 2296655 2334326
50848 2334326 2373197 2411890 2448771 2483422 2516758 2549937 2583333 2616273 2647423 2675763 2701627
50837 2701627 2726528 2751385 2775145 2795922 2813347 2828885 2843786 2857880 2870791 2883134 2895554
50826 2895554 2907349 2917081 2924194 2929194 2932697 2935178 2937251 2939062 2939618 2937937 2934938 2932999 2933247 2934285
50812 2934285 2934097 2932389 2930350 2928774 2927404 2925931 2924778 2924517 2924835 2924418 2922087 2918071 2914064 2911856 2911962
50797 2911962 2913680 2916182 2919180 2922718 2926858 2931668 2937046 2942426 2947002 2950465 2953429 2957044 2962195 2968844
50783 2968844 2975925 2982106 2987005 2991529 2996709 3002366 3007253 3010228 3011055 3010489 3010059 3011128 3013355 3014550 3013074
50768 3013074 3010052 3008033 3007741 3007612 3006516 3005226 3004582 3003893 3002313 3000591 3000093 3000858 3001891 3002849 3004110 3005529
50752 3005529 3006416 3006767 3007477 3009278 3012409 3017438 3025298 3036022 3048059 3059353 3068856 3076898 3084530 3092800
50738 3092800 3102345 3113288 3125456 3138600 3152301 3165847 3178482 3189803 3199834 3208927 3217773 3227098
50726 3227098 3236971 3246511 3254595 3260672 3264785 3267330 3269216 3271740 3275518 3279723 3283028 3285097 3286510 3287545
50712 3287545 3287927 3287675 3287191 3286259 3283896 3279647 3274424 3269609 3265795 3262666 3259613 3256104 3252014 3248023 3245295
50697 3245295 3244319 3244449 3244980 3246253 3249133 3253770 3259543 3266109 3273879 3283352 3294425 3306541 3319281 3332681
50683 3332681 3347069 3362640 3379168 3396362 3414587 3434916 3458094 3483460 3509150 3533369 3555503
50672 3555503 3576357 3597641 3620843 3645993 3671495 3695626 3718144 3739998 3761580 3782060 3800705
50661 3800705 3818059 3835130 3851814 3866907 3879643 3890554 3900784 3911038 3921382 3931548 3941079
50650 3941079 3949548 3956968 3963764 3970118 3975627 3979878 3982928 3984836 3985121 3983549 3981300 3980362 3981405 3983059
50636 3983059 3983888 3984410 3986194 3989325 3991918 3992474 3991641 3991003 3990876 3990404 3989514 3989484 3991116 3993326 3994323 3993644 3992203
50619 3992203 3990804 3989736 3989693 3991650 3995120 3997482 3996006 3990202 3981622 3972044 3962734 3954893 3949264 3944864
50605 3944864 3939131 3930029 3917773 3904352 3891771 3880770 3870625 3859898 3847733 3834557 3821168 3807391
50593 3807391 3792450 3776699 3761904 3749323 3738367 3727762 3717235 3707329 3698153 3689259 3680392 3671617
50581 3671617 3662922 3654479 3647105 3641710 3638246 3635731 3633295 3630921 3629420 3630144 3634301 3641861 3651252 3660745
50567 3660745 3670020 3679881 3690826 3702740 3715715 3730131 3745830 3762075 3778619 3796048 3814819 3834734
50555 3834734 3855661 3878009 3901852 3926136 3949465 3971466 3992871 4014409 4036161 4058004 4080193
50544 4080193 4103205 4127134 4151448 4175340 4198148 4219337 4238348 4254976 4270000 4285005 4301231
50533 4301231 4318718 4336606 4353877 4369700 4383714 4396445 4408951 4421546 4433289 4443197 4451405 4458555
50521 4458555 4464686 4469694 4474330 4479574 4485161 4489869 4493161 4495580 4497600 4499305 4501142 4503673 4506225 4507054
50507 4507054 4505351 4502039 4498148 4493420 4487081 4479023 4469758 4460217 4452098 4447071 4444642 4441906 4436609 4429552
50493 4429552 4422723 4415990 4407340 4396002 4383438 4370951 4357869 4342884 4326049 4308633 4291573 4274933
50481 4274933 4258559 4242500 4226632 4210490 4193805 4176989 4160575 4144230 4126936 4108552 4090545
50470 4090545 4074323 4059147 4042778 4024290 4005232 3987710 3972296 3958220 3944639 3930994 3917037
50459 3917037 3903313 3890958 3880211 3869818 3858690 3847525 3837778 3829591 3821773 3813502 3804984 3796714
50447 3796714 3789020 3782243 3776540 3771628 3767300 3763841 3761331 3759187 3757267 3756680 3758193 3760429 3761120 3759918
50433 3759918 3758469 3757882 3757725 3757499 3757364 3757072 3755853 3753838 3752043 3750487 3748068 3745069 3743856 3745671 3748132
50418 3748132 3747647 3743357 3737195 3730894 3724660 3718288 3711795 3704945 3697563 3690353 3684166 3678371 3671164 3661659
50404 3661659 3650604 3638893 3626608 3613838 3601187 3588798 3575837 3561693 3547011 3532694 3518414
50393 3518414 3502955 3485741 3467430 3449197 3432000 3416228 3401352 3386067 3369466 3352192 3335785
50382 3335785 3320793 3306079 3290277 3273399 3256623 3240838 3225926 3211305 3196686 3182210 3168197
50371 3168197 3154889 3142282 3130099 3118000 3105808 3093419 3080619 3067263 3053600 3040134 3027138
50360 3027138 3014637 3002855 2992163 2982330 2972225 2960741 2947841 2934327 2920845 2907552 2894602
50349 2894602 2882241 2870280 2858056 2845375 2833163 2822533 2813165 2803172 2791035 2777427 2764482 2753169
50337 2753169 2742212 2730258 2718514 2709913 2705517 2702799 2698149 2690358 2681028 2672318 2665197 2659383 2653889
50324 2653889 2647689 2640734 2634314 2629718 2626622 2623602 2620111 2616919 2614414 2611591 2607243 2601443 2595231 2589403
50310 2589403 2584147 2579355 2574649 2569303 2562623 2554331 2544398 2532874 2520156 2507139 2494675 2483097 2472405
50297 2472405 2462613 2453549 2444671 2435485 2426005 2416517 2407010 2397053 2386095 2373759 2360175 2346216 2333078
50284 2333078 2321221 2309914 2298142 2285758 2273285 2260684 2246908 2231097 2214128 2198601 2186939
50273 2186939 2179358 2173703 2167268 2158611 2147862 2135980 2124152 2113360 2103843 2095018 2086354 2078062 2070497
50260 2070497 2063295 2055789 2047934 2040115 2032471 2025376 2020124 2017638 2016490 2013744 2008164 2001185 1994245 1986826
50246 1986826 1977990 1968339 1958969 1949607 1939451 1929256 1920962 1915441 1911860 1909047 1906221 1902470 1896993
50233 1896993 1890143 1883179 1876555 1869333 1860663 1851086 1841889 1833724 1826270 1818908 1811384 1804113 1797992 1793614
50219 1793614 1790382 1786639 1780989 1773580 1765898 1759113 1752661 1744889 1735340 1725794 1718196 1711951 1704540 1694918
50205 1694918 1684876 1676589 1670261 1665000 1660551 1656834 1652918 1648054 1642924 1638275 1633057 1625734 1617005 1609326
50191 1609326 1603707 1598734 1592802 1585616 1577275 1567773 1557918 1549160 1541782 1534591 1526980 1519879 1514031 1508759
50177 1508759 1503262 1497686 1491978 1485110 1476778 1468745 1463001 1459218 1455401 1450577 1445627 1441711 1438878 1436032
50163 1436032 1431545 1424348 1415301 1407131 1402185 1400387 1399908 1399180 1397417 1393935 1388382 1381516 1374683 1368463
50149 1368463 1362593 1357042 1352232 1348297 1345116 1343058 1342725 1343766 1344866 1345209 1345276 1345812 1346540 1346273 1343973 1339619
50133 1339619 1334340 1329782 1326998 1325858 1325648 1325994 1326772 1327482 1327493 1326918 1326448 1326125 1325039 1322735 1320419 1320073
50117 1320073 1322233 1325090 1326077 1324399 1321759 1320476 1321153 1322669 1324185 1326199 1329285 1332777 1335535 1337493
50103 1337493 1339527 1342062 1344687 1347076 1349512 1352392 1355753 1359328 1362715 1365735 1369040 1373965 1380985 1388708
50089 1388708 1395310 1400738 1406467 1413237 1420341 1427310 1434941 1443908 1453442 1462336 1470633 1479437 1489432 1500348
50075 1500348 1511657 1523182 1535194 1548356 1563386 1580234 1597783 1614860 1631461 1648486 1666379
50064 1666379 1684539 1702315 1720133 1739206 1760093 1781838 1802846 1822657 1842490 1863859 1886961
50053 1886961 1910793 1934509 1958032 1981545 2005242 2029753 2055919 2083632 2111456 2138048 2163612
50042 2163612 2189377 2215780 2241758 2265833 2287574 2307860 2327874 2347935 2367249 2384756 2400053
50031 2400053 2413442 2425459 2436735 2447912 2458932 2468487 2475071 2478810 2481472 2484316 2486706 2487316 2485896
50018 2485896 2483158 2479595 2475249 2470162 2464148 2456566 2447326 2437866 2429904 2423178 2415589 2406001 2395836 2387181
50004 2387181 2380038 2372284 2362026 2349268 2335511 2322550 2311788 2303896 2298431 2293924 2288835 2282703 2276290
49991 2276290 2270594 2265991 2262325 2259395 2256851 2253901 2249901 2245443 2242093 2240648 2240150 2239110 2237205 2235172
49977 2235172 2233573 2232553 2232474 2233608 2235163 2235739 2235070 2234348 2234310 2234013 2232335 2230007 2229088 2230733 2234309 2238558
49961 2238558 2242732 2246670 2250612 2255090 2260391 2266043 2271589 2277801 2286150 2296702 2307623 2317478 2327199
49948 2327199 2338762 2352576 2367360 2382255 2397741 2414426 2432276 2451400 2472425 2495396 2519322
49937 2519322 2543601 2569024 2596463 2625403 2654946 2685606 2718577 2753456 2788337 2822424 2857056
49926 2857056 2893467 2930763 2966921 3000839 3032489 3061926 3089319 3115465 3141235 3166672 3191412
49915 3191412 3215609 3239527 3262463 3283056 3300580 3315061 3326440 3334864 3341835 3349592 3358630 3366679
49903 3366679 3370763 3369576 3363484 3353293 3340022 3325166 3309993 3294664 3278764 3262497 3246542 3230843
49891 3230843 3214341 3196059 3175935 3154585 3132782 3111149 3089889 3068701 3047326 3025961 3004690
49880 3004690 2982901 2960213 2937859 2917975 2901127 2885559 2869442 2852998 2837716 2824373 2812802
49869 2812802 2802858 2794266 2785828 2776262 2766010 2756883 2749429 2741718 2731547 2719127 2706770 2696404 2688163
49856 2688163 2681063 2674129 2666847 2659162 2651204 2642807 2633476 2623195 2613016 2604248 2597155 2590871 2584435
49843 2584435 2577343 2569283 2560126 2550337 2540652 2531150 2521228 2510733 2500496 2491386 2483399 2476029 2469032
49830 2469032 2462393 2456090 2450398 2445916 2442674 2439662 2435988 2432176 2429586 2428739 2429103 2430415 2433132 2437284
49816 2437284 2441812 2445605 2448690 2451936 2456074 2461541 2468773 2477841 2487862 2497548 2506595 2516094 2527182
49803 2527182 2539497 2551344 2561358 2569721 2577581 2585566 2593216 2599817 2605208 2609555 2612907 2615496 2618152
49790 2618152 2621602 2625221 2627112 2625737 2621149 2614539 2607016 2598963 2590065 2579553 2566808 2552054 2536244
49777 2536244 2520082 2503571 2486727 2470108 2454056 2437911 2420751 2402671 2384598 2366950 2349260
49766 2349260 2331158 2313028 2295582 2279346 2264535 2250694 2236379 2220221 2202730 2186157 2171967
49755 2171967 2159260 2146475 2133842 2122876 2113993 2106088 2098461 2091651 2085892 2080101 2073283 2065913 2058932
49742 2058932 2052174 2045020 2038072 2032608 2028288 2022835 2014612 2004540 1994825 1986558 1979425 1973081 1967645 1962823
49728 1962823 1957620 1951308 1944141 1936750 1929183 1921031 1912379 1904189 1897487 1892108 1886411 1878524 1867984 1856010
49714 1856010 1844039 1832427 1820941 1810049 1800731 1792846 1784704 1775004 1764640 1755630 1748395 1741027 1731426
49701 1731426 1719311 1705782 1691824 1678105 1665670 1655541 1647361 1639408 1630335 1620296 1609972 1599345
49689 1599345 1588233 1577389 1567965 1559933 1552180 1544384 1537765 1533366 1530303 1526591 1521333 1515321 1509554
49676 1509554 1503887 1497443 1490014 1482689 1476940 1473097 1469904 1465923 1461285 1457484 1455274 1453408 1449944 1444346
49662 1444346 1437787 1431722 1426733 1422555 1418675 1414965 1412057 1410725 1410621 1410238 1408757 1407197 1406752 1406653 1405162
49647 1405162 1402294 1399783 1398155 1395771 1391608 1387414 1385692 1386558 1387945 1388239 1387497 1386576 1386311 1387291 1389228
49632 1389228 1390578 1389903 1387798 1386601 1387971 1391321 1394760 1397021 1398405 1400270 1403718 1408560 1413839 1419436
49618 1419436 1426356 1434790 1442934 1449023 1453961 1460262 1468504 1476565 1482737 1487936 1494066 1501619 1510024 1519330
49604 1519330 1530119 1542181 1554425 1566144 1577702 1590063 1603995 1619609 1636331 1653560 1671348
49593 1671348 1689957 1708692 1726141 1741964 1757586 1774724 1794126 1816254 1841709 1869778 1897713
49582 1897713 1923194 1946943 1971333 1996914 2022193 2046647 2071743 2098411 2125462 2151655 2177847
49571 2177847 2205729 2235248 2264622 2292365 2318196 2342284 2364870 2386667 2408792 2431941 2455978
49560 2455978 2480385 2504778 2529080 2553428 2577866 2602021 2625358 2647831 2669878 2691579 2712339
49549 2712339 2731682 2749809 2767046 2783408 2799176 2815198 2831853 2848353 2863914 2879080 2894873
49538 2894873 2911170 2927213 2943408 2961108 2980494 3000063 3018613 3036376 3053765 3070464 3086674
49527 3086674 3103868 3123015 3142886 3161551 3178946 3196545 3214954 3233381 3251285 3268859 3285684
49516 3285684 3300528 3313156 3324923 3336789 3348053 3358064 3367906 3378760 3389358 3396972 3400888 3403166
49504 3403166 3405533 3407118 3406080 3402233 3396818 3390488 3382895 3374020 3364619 3355174 3345409 3335142 3324756
49491 3324756 3314289 3302780 3289200 3273759 3257727 3242075 3226650 3210483 3192559 3172572 3151506
49480 3151506 3131357 3113756 3098638 3084501 3069902 3054408 3038302 3022042 3006137 2990972 2976353
49469 2976353 2961561 2946168 2930593 2915670 2901933 2889377 2877421 2864864 2850565 2834762 2819276
49458 2819276 2805724 2793846 2782280 2770585 2759424 2748935 2738190 2726706 2715308 2704633 2693701
49447 2693701 2681082 2667086 2653659 2642125 2631964 2621977 2611752 2601611 2591872 2582714 2574347 2566762
49435 2566762 2559464 2551881 2543842 2535338 2526121 2516097 2505945 2496685 2488523 2480628 2472256 2463579 2455134
49422 2455134 2446930 2438646 2430430 2422940 2416627 2411498 2407520 2404642 2402341 2399755 2396536 2393071 2389647 2386066
49408 2386066 2382500 2379965 2379121 2379107 2378562 2377536 2377331 2378435 2379785 2380387 2380617 2381372 2382821 2384740 2387338 2390961
49392 2390961 2395478 2400718 2406966 2414213 2421413 2427635 2433796 2442153 2453908 2468101 2482838 2496736 2509178
49379 2509178 2520416 2531935 2545740 2562437 2580553 2598442 2616357 2635943 2658094 2682081 2706624
49368 2706624 2731071 2755591 2780930 2808131 2837858 2869716 2902584 2935867 2970102 3006061 3043643
49357 3043643 3082076 3121006 3160783 3201582 3242928 3284594 3327387 3372141 3418088 3463433 3507998
49346 3507998 3554104 3603768 3655846 3707365 3757341 3807663 3859970 3913361 3966059 4017942 4070083
49335 4070083 4122536 4173963 4223258 4270388 4315769 4359887 4403578 4447697 4492221 4536371 4579833
49324 4579833 4623174 4666730 4709844 4751647 4792082 4831686 4870829 4909738 4948921 4988715 5028300
49313 5028300 5065851 5100146 5131891 5163065 5194963 5227202 5258697 5289234 5319689 5350998 5383438
49302 5383438 5416836 5450758 5484335 5516625 5547656 5578630 5610589 5643275 5675847 5708192 5740694
49291 5740694 5773112 5804687 5835359 5865826 5896186 5925498 5953170 5979955 6006868 6033650 6059077
49280 6059077 6082573 6104832 6126743 6148174 6168006 6185196 6199759 6212682 6224838 6236099 6245656
49269 6245656 6253083 6258637 6262586 6264874 6265597 6265203 6263818 6260934 6256329 6250832 6245404 6239716 6232475 6223201
49255 6223201 6212847 6202426 6191681 6179643 6165939 6150946 6135061 6118592 6102315 6087267 6073619
49244 6073619 6060344 6046482 6032304 6018710 6005845 5992999 5979682 5965934 5951662 5936597 5921315
49233 5921315 5907367 5895687 5885346 5874477 5862045 5848267 5833985 5820378 5808609 5798583 5788280
49222 5788280 5775520 5760457 5745379 5732082 5720465 5709718 5699506 5689506 5678995 5667652 5655827
49211 5655827 5643327 5628942 5612209 5594922 5579651 5567031 5555400 5542958 5529510 5516260 5504587
49200 5504587 5494860 5485867 5475596 5463102 5449241 5435090 5420395 5404607 5388794 5375003 5363722 5353511
49188 5353511 5343373 5334025 5326108 5318500 5309689 5300046 5291433 5284851 5279623 5274864 5270657 5267361 5264575 5261506
49174 5261506 5258080 5255192 5253774 5253882 5254755 5255646 5256544 5258206 5261512 5266667 5272915 5279074 5284572 5290079 5297051
49159 5297051 5306597 5318751 5332592 5346814 5360252 5372503 5384444 5397789 5413565 5430958 5447992
49148 5447992 5463476 5478137 5493805 5511610 5531002 5550422 5568946 5587172 5606374 5626826 5647371
49137 5647371 5666744 5684927 5702935 5721641 5741120 5760822 5779999 5798225 5815930 5834179 5853562
49126 5853562 5873576 5893528 5913632 5934539 5956079 5977226 5997373 6017056 6037377 6059143 6082477
49115 6082477 6106716 6130802 6154189 6177208 6200036 6221807 6241642 6260334 6279795 6300844 6322711
49104 6322711 6344916 6368282 6393409 6419328 6444570 6468771 6492337 6515295 6537604 6560119 6584032
49093 6584032 6609357 6634876 6659629 6683804 6708117 6732832 6757511 6781308 6803575 6824486 6844914
49082 6844914 6865392 6885516 6904758 6923517 6942762 6962937 6983823 7005152 7026529 7046943 7065367
49071 7065367 7081984 7098015 7114079 7129582 7144116 7158555 7173919 7189581 7203603 7214937 7224712
49060 7224712 7235081 7247115 7260007 7272114 7282400 7290852 7297838 7303491 7307943 7311934 7316784 7323513 7331929
49047 7331929 7340671 7348334 7354813 7361550 7370211 7380982 7392353 7402766 7412222 7421935 7432542 7443165 7452492
49034 7452492 7460494 7468618 7478142 7488600 7498265 7506178 7513169 7520608 7528767 7537173 7546196 7556987 7569559
49021 7569559 7582004 7592414 7600998 7609585 7619564 7631060 7643619 7656574 7668858 7679451 7688278 7696092
49009 7696092 7703365 7709945 7715835 7721505 7727111 7732049 7735759 7738574 7741295 7744131 7746390 7747094 7745776 7742902
48995 7742902 7739703 7737385 7736137 7734885 7732174 7727345 7720882 7713743 7706450 7698925 7691116 7683357 7675697 7667208
48981 7667208 7656828 7645098 7634102 7625115 7617059 7608058 7597800 7587344 7577154 7566707 7555835 7545076
48969 7545076 7534527 7523623 7512388 7501733 7492116 7483015 7474229 7466571 7460575 7455509 7450488 7445609 7441116
48956 7441116 7436406 7430957 7425502 7421109 7417728 7414939 7413534 7414787 7418294 7422071 7424994 7427844 7431659 7436410
48942 7436410 7441818 7448215 7455775 7463863 7472102 7481443 7493159 7507131 7521966 7536609 7551176 7566411
48930 7566411 7583143 7602252 7624285 7648741 7674162 7699266 7723866 7748671 7774561 7802212 7831917
48919 7831917 7863278 7895242 7926952 7958688 7991668 8026749 8063578 8101237 8139373 8178279 8218011
48908 8218011 8258015 8297817 8337551 8377507 8417543 8457500 8498018 8540306 8584890 8630782 8676078
48897 8676078 8719426 8761113 8802878 8846466 8892008 8937788 8981732 9022953 9061851 9099278 9136123
48886 9136123 9173147 9210174 9245506 9277310 9305993 9334201 9363732 9393209 9419860 9442997 9464383
48875 9464383 9485158 9503992 9519168 9531482 9543688 9557241 9570883 9582733 9592656 9601729 9610093 9616570
48863 9616570 9620356 9622016 9622460 9621832 9620054 9617863 9616346 9615598 9614528 9612130 9608440 9604205 9599927 9595315 9589449
48848 9589449 9581670 9572753 9564964 9560314 9558607 9557624 9555323 9551445 9547139 9543670 9541506 9539953 9537547 9533702
48834 9533702 9530252 9530423 9535546 9543448 9550773 9556241 9560839 9565610 9570693 9576322 9583267 9591696 9600652 9609351
48820 9609351 9618344 9628671 9640276 9652010 9663194 9674645 9687955 9703863 9721377 9738468 9753811
48809 9753811 9767981 9782921 9800145 9819438 9839210 9858008 9875828 9894214 9914978 9938494 9963187
48798 9963187 9986889 10008553 10028409 10046852 10064048 10080745 10098399 10117783 10137956 10157362 10175697
48787 10175697 10193963 10212803 10231617 10249433 10266020 10281723 10296799 10311449 10326183 10341453 10356854
48776 10356854 10371182 10383552 10394182 10403827 10412713 10420450 10426853 10432277 10436868 10439910 10440351 10437795 10432658
48763 10432658 10425531 10416890 10407385 10397799 10388415 10378673 10367682 10354919 10340444 10324790 10308774 10293094
48751 10293094 10277859 10262663 10247031 10230576 10212929 10194304 10176211 10160509 10147108 10133440 10117143
48740 10117143 10098754 10080738 10064384 10048947 10033623 10018715 10004531 9990676 9977277 9965631 9956330
48729 9956330 9947697 9937587 9926405 9916790 9910263 9905577 9900804 9895814 9891876 9889664 9888675 9888197 9887971 9888063 9888874
48714 9888874 9891254 9895828 9902034 9908383 9913946 9919117 9924758 9931150 9938239 9946352 9955992 9967111 9979275
48701 9979275 9992462 10007011 10022617 10038098 10052633 10066702 10081302 10096659 10112421 10128899 10147129
48690 10147129 10167356 10188165 10207891 10226650 10246309 10268186 10291249 10313019 10332083 10349324 10366648
48679 10366648 10385150 10404794 10425195 10445662 10464595 10480086 10491802 10501441 10510542 10518504 10523729 10526243
48667 10526243 10527864 10529758 10531230 10531215 10529684 10526732 10521277 10511896 10498653 10483154 10466829 10449774 10431170
48654 10431170 10410280 10387012 10361897 10335522 10307873 10278645 10248353 10218350 10189074 10158958 10126164
48643 10126164 10090987 10055310 10019865 9983491 9945388 9906690 9868948 9832165 9795334 9758154 9721087
48632 9721087 9684144 9646973 9610130 9575092 9542484 9510962 9478384 9443796 9407955 9372212 9337296
48621 9337296 9303025 9268859 9234635 9200783 9167815 9135639 9103581 9071097 9038183 9004995 8971433
48610 8971433 8937478 8903773 8871264 8840046 8809012 8777160 8745028 8714181 8685067 8655953 8624569
48599 8624569 8590642 8556232 8523506 8492639 8462165 8430902 8399021 8367311 8335923 8304259 8271985
48588 8271985 8239896 8209516 8181740 8155856 8129899 8102023 8071690 8039876 8008384 7978699 7951022
48577 7951022 7924086 7896053 7865864 7833880 7801329 7769331 7738501 7709203 7681709 7655882 7630916
48566 7630916 7605891 7580809 7556877 7535252 7515482 7495597 7474040 7451281 7429209 7409100 7390542
48555 7390542 7372233 7353437 7334671 7317273 7302259 7289228 7276333 7261803 7245709 7229829 7215530
48544 7215530 7202169 7188029 7172635 7157601 7145060 7135618 7128098 7121043 7114103 7107836 7102570 7097948 7093669
48531 7093669 7090206 7088374 7088323 7089360 7090637 7091567 7091532 7089933 7087178 7085345 7087046 7093220 7102342 7112120 7121644
48516 7121644 7131320 7140971 7149224 7155459 7161551 7170376 7182693 7196734 7211001 7225975 7242333 7258952
48504 7258952 7274189 7288388 7303372 7319677 7335977 7351491 7367361 7384899 7403597 7421741 7438218
48493 7438218 7452996 7466533 7479589 7493149 7507726 7522790 7537272 7550324 7561369 7570081 7576855 7582810
48481 7582810 7588666 7593900 7597481 7598987 7598504 7596025 7591726 7586543 7581579 7577028 7572213 7566496 7559530 7550874
48467 7550874 7540135 7527560 7513863 7499421 7484160 7468201 7451976 7435494 7417923 7398279 7376491
48456 7376491 7353756 7331813 7311602 7292480 7272999 7252538 7231751 7211322 7190913 7169784 7147734
48445 7147734 7124795 7100636 7075229 7049784 7026081 7004848 6985452 6966990 6949013 6931331 6913943
48434 6913943 6897137 6881099 6865557 6850371 6836101 6823131 6810564 6797057 6782696 6768910 6756442
48423 6756442 6744530 6732331 6720044 6708146 6696405 6684273 6671653 6658886 6646432 6634773 6624019
48412 6624019 6613460 6602259 6590758 6580272 6571358 6563175 6554823 6546266 6537458 6527725 6516810 6505626
48400 6505626 6495039 6484583 6473425 6461988 6451595 6442835 6435195 6428014 6420796 6412807 6403476 6393388
48388 6393388 6384021 6376231 6369475 6362635 6354979 6346204 6336313 6326047 6317024 6310689 6306837 6303564 6299046 6293362
48374 6293362 6288273 6285180 6283739 6282644 6281196 6279628 6278382 6277846 6278529 6280579 6283257 6285777 6288540 6292562
48360 6292562 6297743 6302948 6308047 6314394 6322633 6331268 6338395 6343984 6349476 6355881 6363175 6370927 6378510 6385259
48346 6385259 6391320 6398015 6406588 6417012 6428539 6440772 6453501 6466299 6479216 6493083 6508022 6522320
48334 6522320 6534029 6543283 6551936 6561396 6571941 6583614 6596377 6609670 6623142 6637545 6653635 6670537
48322 6670537 6686538 6701189 6715093 6728073 6739476 6750142 6761939 6774975 6787445 6798910 6811539
48311 6811539 6826951 6843610 6858995 6873003 6887542 6903598 6920257 6936170 6950704 6963937 6976514
48300 6976514 6989260 7002150 7014072 7024228 7033172 7041810 7050131 7057954 7066219 7076142 7087331 7097854
48288 7097854 7106213 7112342 7116699 7119373 7120284 7119615 7117761 7115155 7112158 7108836 7104900 7100089 7094369 7087598
48274 7087598 7079516 7070358 7060851 7051032 7039788 7026280 7011210 6995771 6979861 6962412 6943139 6922727
48262 6922727 6901402 6878605 6854475 6830529 6808149 6786940 6765116 6741234 6715278 6688391 6661974
48251 6661974 6636893 6613131 6589820 6565543 6539002 6510146 6480669 6452676 6426553 6400886 6374787
48240 6374787 6349046 6324110 6298175 6269020 6237248 6205925 6177010 6149751 6122725 6095626 6068368
48229 6068368 6040055 6010099 5979378 5949154 5919487 5889612 5859260 5828702 5798062 5767552 5737854
48218 5737854 5709103 5679741 5647589 5612342 5576214 5541833 5509937 5479150 5447488 5413937 5379066
48207 5379066 5344306 5310479 5277057 5243077 5208501 5174207 5140770 5107857 5074946 5042118 5009841
48196 5009841 4978229 4946714 4914454 4881136 4847458 4814483 4782297 4749843 4716669 4684265 4654507
48185 4654507 4626849 4598413 4567375 4535154 4504488 4476195 4448954 4421656 4394673 4368839 4344262
48174 4344262 4320326 4296148 4271039 4245325 4220758 4199130 4180197 4161804 4142370 4122342 4102879
48163 4102879 4084184 4065794 4047472 4028883 4009372 3989281 3970715 3955502 3942720 3929765 3915714
48152 3915714 3902184 3890791 3881369 3872952 3864839 3856058 3845410 3833186 3821597 3812266 3804249 3795760 3786934
48139 3786934 3779416 3773733 3768701 3763320 3757914 3753247 3749559 3746665 3744185 3741553 3738478 3735289 3732292 3729153
48125 3729153 3725788 3723355 3723064 3724273 3725247 3725798 3727538 3731147 3735058 3737812 3740302 3744415 3750270 3756028 3760129
48110 3760129 3762790 3765630 3770491 3778250 3788062 3798046 3807209 3816330 3826515 3837576 3848527 3859023 3869394
48097 3869394 3879725 3889953 3900595 3912306 3924877 3937687 3951162 3966602 3984267 4002542 4019517
48086 4019517 4034738 4048997 4063099 4077469 4092557 4108784 4125987 4143191 4159035 4172496 4183400
48075 4183400 4192539 4201292 4210993 4222322 4234910 4247458 4258751 4268910 4279320 4290809 4302249 4311590
48063 4311590 4318105 4322882 4327195 4331351 4335276 4339197 4343121 4346485 4349238 4352815 4358886 4367028 4374512 4378829
48049 4378829 4380012 4380100 4380699 4381649 4381920 4381044 4379194 4376302 4371972 4366533 4361561 4358770 4358394 4358972 4358522 4355642
48033 4355642 4349895 4341986 4333678 4326709 4321246 4315763 4308753 4300186 4290948 4281403 4271245 4260494 4249823
48020 4249823 4239712 4229869 4219714 4209008 4197813 4186253 4174543 4162910 4151120 4138446 4124530
48009 4124530 4109984 4095687 4081743 4067752 4053960 4041140 4029069 4016110 4001068 3984897 3969534
47998 3969534 3955320 3940733 3924771 3908469 3893461 3879889 3866516 3852323 3837123 3820947 3803774
47987 3803774 3785980 3768304 3751226 3734796 3719123 3704507 3690985 3678195 3665702 3653010 3639328
$$ [...]
##END NTUPLES=NMR SPECTRUM
##END=
