
##TITLE=AC1068_TOPL01_6519229_qYJ3gEzVqc
##JCAMPDX= 6.0         $$ Bruker NMR JCAMP-DX V2.0
##DATA TYPE= NMR SPECTRUM
##DATA CLASS= NTUPLES
##ORIGIN= BRUKER
##OWNER= Administrator
$$ 1.72 TOPSPIN		Version 2.1
$$ 2012-07-14 10:06:06.828 -0500  Administrator@TOPSPIN
$$ Compression mode = diff/dup
##.OBSERVE FREQUENCY= 400.02188249412
##.OBSERVE NUCLEUS= ^1H
##.ACQUISITION MODE= SIMULTANEOUS (DQD)
##.ACQUISITION SCHEME= undefined
##.AVERAGES= 8
##.DIGITISER RES= 22
##SPECTROMETER/DATA SYSTEM= spect
##.PULSE SEQUENCE= zg30
##.SOLVENT NAME= COFFEE_meoh
##.SHIFT REFERENCE= INTERNAL, COFFEE_meoh, 1, 14.98509
##AUDIT TRAIL= $$ (NUMBER, WHEN, WHO, WHERE, PROCESS, VERSION, WHAT)
$$ ##TITLE= Audit trail, TOPSPIN		Version 2.1
$$ ##JCAMPDX= 5.01
$$ ##ORIGIN= Bruker BioSpin GmbH
$$ ##OWNER= Administrator
$$ $$ C:\Bruker\TOPSPIN/data/COFFEE/nmr/AC1068_TOPL01_6519229_qYJ3gEzVqc/50/pdata/1/auditp.txt
$$ ##AUDIT TRAIL=  $$ (NUMBER, WHEN, WHO, WHERE, PROCESS, VERSION, WHAT)
(   1,<2012-07-14 10:05:59.843 -0500>,<Administrator>,<TOPSPIN>,<go>,<TOPSPIN 2.1>,
      <created by zg
	started at 2012-07-14 10:04:52.921 -0500,
	POWCHK enabled, PULCHK disabled,
       configuration hash MD5:
       6B 1B 68 BB D9 2E 58 E2 7F 35 AD 54 07 DF 0E 41
       data hash MD5: 64K
       D8 1A CE DA C7 23 07 69 7A 88 33 D5 75 F2 99 FA>)
(   2,<2012-07-14 10:06:02.546 -0500>,<Administrator>,<TOPSPIN>,<proc1d>,<TOPSPIN 2.1>,
      <Start of raw data processing
       efp LB = 0 FT_mod = 6 PKNL = 1 PHC0 = 0 PHC1 = 0 SI = 32K 
       data hash MD5: 32K
       73 AD 8E 61 68 D1 8F 2D ED ED E1 7F 8E F8 88 52>)
(   3,<2012-07-14 10:06:02.828 -0500>,<Administrator>,<TOPSPIN>,<proc1d>,<TOPSPIN 2.1>,
      <pk PHC0 = 178.4784 PHC1 = 0 
       data hash MD5: 32K
       B5 0C E5 A3 F0 B8 43 06 4B 1B E6 AA DE 8F 62 91>)
(   4,<2012-07-14 10:06:02.968 -0500>,<Administrator>,<TOPSPIN>,<proc1d>,<TOPSPIN 2.1>,
      <abs ABSG = 1 
       data hash MD5: 32K
       D0 39 B5 16 E9 A7 94 21 95 98 58 A3 F5 E3 9D 31>)
(   5,<2012-07-14 10:06:03.031 -0500>,<Administrator>,<TOPSPIN>,<proc1d>,<TOPSPIN 2.1>,
      <abs ABSG = 2 
       data hash MD5: 32K
       76 E4 E6 49 6F B6 42 C9 E9 8F FB D3 40 27 BF 34>)
(   6,<2012-07-14 10:06:03.093 -0500>,<Administrator>,<TOPSPIN>,<proc1d>,<TOPSPIN 2.1>,
      <abs ABSG = 3 
       data hash MD5: 32K
       C8 2E 77 EA 76 EA E2 34 DD DC EE 9B F9 43 77 BD>)
(   7,<2012-07-14 10:06:03.156 -0500>,<Administrator>,<TOPSPIN>,<proc1d>,<TOPSPIN 2.1>,
      <abs ABSG = 4 
       data hash MD5: 32K
       18 44 3D 61 72 1C FB 50 68 EA 93 2A B8 4F B7 48>)
(   8,<2012-07-14 10:06:03.203 -0500>,<Administrator>,<TOPSPIN>,<proc1d>,<TOPSPIN 2.1>,
      <abs ABSG = 5 
       data hash MD5: 32K
       92 B7 A2 F1 28 1C AF 51 EC 33 D2 49 E9 A9 74 39>)
$$ ##END=
$$ 
$$ $$ hash MD5
$$ $$ 5C C4 4C EC 71 B0 DA 46 23 7E C3 4D 95 E6 27 4C
##$RELAX= 
##$RELAX= 
##$RELAX= 
##$RELAX= 
##$RELAX= 
##$RELAX= 
##$RELAX= 
##$RELAX= 
$$ Bruker specific parameters
$$ --------------------------
$$ [...]
150 150 150 150 150 150 150 150
##$TP07= 0
##$TPNAME0= <>
##$TPNAME1= <>
##$TPNAME2= <>
##$TPNAME3= <>
##$TPNAME4= <>
##$TPNAME5= <>
##$TPNAME6= <>
##$TPNAME7= <>
##$TPOAL= (0..7)
0.5 0.5 0.5 0.5 0.5 0.5 0.5 0.5
##$TPOFFS= (0..7)
0 0 0 0 0 0 0 0
##$TUNHIN= 0
##$TUNHOUT= 0
##$TUNXOUT= 0
##$USERA1= <user>
##$USERA2= <user>
##$USERA3= <user>
##$USERA4= <user>
##$USERA5= <user>
##$V9= 5
##$VALIST= <valist>
##$VCLIST= <CCCCCCCCCCCCCCC>
##$VD= 0
##$VDLIST= <DDDDDDDDDDDDDDD>
##$VPLIST= <PPPPPPPPPPPPPPP>
##$VTLIST= <TTTTTTTTTTTTTTT>
##$WBST= 2048
##$WBSW= 25
##$XGAIN= (0..3)
0 0 0 0
##$XL= 0
##$YL= 0
##$YMAX_a= 491144
##$YMIN_a= -640005
##$ZGOPTNS= <>
##$ZL1= 120
##$ZL2= 120
##$ZL3= 120
##$ZL4= 120
##$ABSF1= 14.98509
##$ABSF2= -5.573092
##$ABSG= 5
##$ABSL= 3
##$ALPHA= 0
##$AQORDER= 0
##$ASSFAC= 0
##$ASSFACI= 0
##$ASSFACX= 0
##$ASSWID= 0
##$AUNMP= <proc_prof1d_extract_pilot.lims>
##$AXLEFT= 0
##$AXNAME= <>
##$AXNUC= <1H>
##$AXRIGHT= 0
##$AXTYPE= 0
##$AXUNIT= <>
##$AZFE= 0.1
##$AZFW= 0.1
##$BCFW= 0
##$BC_mod= 0
##$BYTORDP= 0
##$COROFFS= 0
##$CY= 15
##$DATMOD= 1
##$DC= 0
##$DFILT= <>
##$DTYPP= 0
##$F1P= 0
##$F2P= 0
##$FCOR= 0.5
##$FTSIZE= 32768
##$FT_mod= 6
##$GAMMA= 0
##$GB= 0
##$INTBC= 1
##$INTSCL= 1
##$ISEN= 128
##$LB= 0
##$LEV0= 0
##$LPBIN= 0
##$MAXI= 10000
##$MC2= 0
##$MEAN= 0
##$ME_mod= 0
##$MI= 0
##$NCOEF= 0
##$NC_proc= -8
##$NLEV= 6
##$NOISF1= 0
##$NOISF2= 0
##$NSP= 0
##$NTH_PI= 0
##$NZP= 0
##$OFFSET= 14.98509
##$PC= 1
##$PHC0= 178.4784
##$PHC1= 0
##$PH_mod= 1
##$PKNL= yes
##$PPARMOD= 0
##$PPDIAG= 0
##$PPIPTYP= 0
##$PPMPNUM= 2147483647
##$PPRESOL= 1
##$PSCAL= 4
##$PSIGN= 0
##$PYNMP= <proc.py>
##$REVERSE= no
##$SF= 400.02
##$SI= 32768
##$SIGF1= 0
##$SIGF2= 0
##$SINO= 400
##$SIOLD= 32768
##$SPECTYP= <>
##$SREGLST= <1H.CDCl3>
##$SSB= 0
##$STSI= 32768
##$STSR= 0
##$SW_p= 8223.68421052631
##$SYMM= 0
##$S_DEV= 0
##$TDeff= 65536
##$TDoff= 0
##$TI= <>
##$TILT= no
##$TM1= 0
##$TM2= 0
##$TOPLEV= 0
##$USERP1= <user>
##$USERP2= <user>
##$USERP3= <user>
##$USERP4= <user>
##$USERP5= <user>
##$WDW= 1
##$XDIM= 32768
##$YMAX_p= 470704020
##$YMIN_p= -705343
##$CURPLOT= <Network HP LaserJet P1505>
##$CURPRIN= <$Network HP LaserJet P1505>
##$DFORMAT= <normdp>
##$LAYOUT= <+/1D_H.xwp>
##$LFORMAT= <normlp>
##$PFORMAT= <normpl>
##$SURQMSG= 1
$$ End of Bruker specific parameters
$$ ---------------------------------
##NTUPLES= NMR SPECTRUM
##VAR_NAME=  FREQUENCY,     SPECTRUM/REAL,   SPECTRUM/IMAG
##SYMBOL=    X,             R,               I
##VAR_TYPE=  INDEPENDENT,   DEPENDENT,       DEPENDENT
##VAR_FORM=  AFFN,          ASDF,            ASDF
##VAR_DIM=   32768,         32768,           32768
##UNITS=     HZ,            ARBITRARY UNITS, ARBITRARY UNITS
##FACTOR=    0.250966925370066, 1,           1
##FIRST=     8223.43324360094, -221629,      -123126
##LAST=      0,             60055,           -195337
##MIN=       0,             -705343,         0
##MAX=       8223.43324360094, 470704020,    0
$$ Real data points
##PAGE= N=1
##DATA TABLE= (X++(R..R)), XYDATA
$$ [...]
$$ plain form
19475 176719 -252541 132965 11049 -53583 139262 -220712 -177624 -446485 190736 -256764
19464 -45164 -17263 -186617 -159784 43437 2654 94792 -257372 -147826 -212630 -226881 -457089
19453 -457089 127587 -75374 -38430 37528 14390 59134 130205 -161236 -19867 -123275 -349983
19442 -349983 179219 -94330 119274 -272503 -373845 -55013 73175 218603 53736 -109034
19431 40780 -162040 -146931 122472 71226 -159861 -1271 -362246 -918 -258473 39920 -239506
19419 285353 -148792 40040 104637 172570 59747 186350 -160629 247606 -163792 75554
19408 -100960 171180 -70624 -338223 -155313 -30670 8283 -200948 215858 -497714 -69730
19397 283022 307742 -15425 -130703 -204011 -116781 243438 -67458 73732 -245396 -91923 -149468
$$ packed form
19475A76719b52541A32965A1049e3583A39262b20712M3088k68861A90736b56764
19464d5164a7263j69354K6833D3437B654R2138b57372J09546o4804j4251k30208
19453d57089A27587g5374L6944C7528A4390M4744P1071a61236a9867j03408k26708
19442c49983A79219i4330A19274b72503j01342e5013G3175J45428E3736a09034
19431D0780a62040J5109A22472n1246a59861a271l60975i18k57555C9920b39506
19419B85353a48792D0040O4597O7933E9747J26603a60629B47606a63792G5554
19408a00960A71180g0624k67599a55313c0670H283b00948B15858d97714f9730
19397B83022K4720a5425j15278p3308Q7230B43438f7458G3732b45396i1923n7545
$$ plain form
19386 -149468 266920 283562 65853 -3878 -233826 85675 -128872 -215713 17085 82629 203824
19375 203824 281257 -239226 210874 -65127 -181649 -274431 290242 46177 365625 -1958 -401839
19364 -401839 -25190 -164933 100144 -208223 -343525 -32680 127706 -15221 11002 -114845
19353 -83147 166898 -145223 92100 12701 -46570 -19665 -327928 -93975 -66276 26477 45696
19342 45696 -661982 -165901 68430 462128 -66036 30020 45179 -143608 35242 273501 96689
19330 -165337 -39271 122062 314650 -35125 -8877 278663 -197622 -449567 -405696 -290915
19320 -290915 -177523 -149110 -145067 -82557 -35478 -115512 -338592 6943 -213003 -148227 -18795
19308 -419638 76447 85431 43784 -47006 35523 269675 -545602 -3070 -208277 -25160 -150280
$$ packed form
19386a49468B66920J6642F5853c878k29948H5675a28872q6841A7085O5544J21195
19375B03824P7433b39226B10874f5127j16522r2782B90242D6177L19448a958l99881
19364d01839b5190j39743A00144b08223j35302c2680A27706a5221A1002a14845
19353h3147A66898a45223I2100A2701d6570a9665l08263i3975K7699B6477J9219
19342D5696f61982a65901F8430L93698f6036C0020J5159a43608C5242K38259I6689
19330a65337c9271A22062J92588c5125h877B78663a97622k51945M3871J14781
19320b90915J13392K8413M043O2510c5478q0034k23080F943b13003O4776a8795
19308d19638G6447Q984m1647d7006C5523K34152e45602c070k05207b5160j25120
$$ plain form
19297 -150280 -31751 -97869 -298645 -19864 227263 -217627 18975 118586 45585 -119828 -427704
19286 -427704 207215 -83490 -322018 131396 28947 43630 51418 -14483 -232543 -153953 -6806
19274 -175098 -191163 69211 50448 238537 -356758 -46687 -104588 222393 -221296 -155421 -108179
19263 -108179 332234 255616 -90967 -241734 -8076 -223113 -362483 -125160 -279841 84709
19252 -370614 -453872 -156784 87851 262506 -162391 -246443 275679 -129231 -63633 -75658
19242 -75658 -492491 131575 -57945 -332859 -47672 -123267 -48439 -169059 208899 -121614
19231 14175 240649 -38839 -12876 -130219 4232 67673 -257692 -243152 195495 -195277 17613
19219 102712 -5164 -91741 -320850 -91881 -117929 -404306 -144334 -160132 -327216 23715 102618
$$ packed form
19297a50280c1751o6118k00776a9864B27263b17627A8975R9611D5585a19828l07876
19286d27704B07215h3490k38528A31396B8947J4683P788a4483k18060P8590f806
19274a75098j6065F9211j8763J88089c56758d6687n7901B22393b21296O5875M7242
19263a08179C32234p6618i0967j50767h076k15037j39370a25160j54681H4709
19252c70614q3258a56784H7851J74655a62391q4052B75679a29231f3633j2025
19242g5658m16833A31575e7945k74914d7672p5595d8439j20620B08899a21614
19231A4175K26474c8839a2876j17343D232O3441b57692J4540A95495a95277A7613
19219A02712e164q6577k29109i1881k6048k86377a44334j5798j67084B3715P8903
$$ plain form
19208 102618 121765 29119 -163836 -562093 -52620 -99060 83423 -134770 -198246 156671 245922
19197 245922 -410526 -54277 -6607 -115673 122750 165032 -128022 -138559 -162601 -60079 -269016
19186 -269016 -258457 -160162 -2571 -149430 -150117 -247728 207510 -258644 99357 -370129 190543
19174 -113658 -84366 -258255 -29793 -219907 -209061 -166596 -369041 167322 -106656 185738
19163 -14075 -171588 -121538 210733 -184523 -249030 -11537 36312 -153071 -403956 238927
19152 203235 48654 -145861 -33208 24923 -205994 -227096 30378 -149633 189812 -109861
19141 -136762 -281985 -323775 -185828 22088 -26406 135425 -30606 -90705 20277 101670 246788
19130 246788 -325175 -398994 -283851 87864 -332255 -84109 -46668 -86202 183864 -117840
$$ packed form
19208A02618J9147B9119a63836l98257e2620m6440H3423a34770o3476A56671Q9251
19197B45922d10526e4277f607j09066A22750M2282a28022j0537k4042f0079k08937
19186b69016J0559R8295b571j46859o87r7611B07510b58644I9357c70129A90543
19174a13658K9292j73889b9793j90114J0846M2465k02445A67322a06656A85738
19163a4075j57513N0050B10733a84523o4507a1537C6312a53071k50885B38927
19152B03235D8654a45861c3208B4923b05994k1102C0378a49633A89812a09861
19141a36762j45223m1790J37947B2088b6406A35425c0606o0099B0277Q1393J45118
19130B46788c25175p3819J15143H7864c32255h4109L7441l9534A83864a17840
$$ plain form
19119 110724 -77371 -87738 145185 408621 -151790 242808 103669 88266 -227018 -96974
19108 -213725 -90608 205072 -54860 -29459 32148 49804 -185677 -172626 64252 113079 -167644
19096 -4085 167275 -152346 -191231 -170524 246812 87829 58435 -553487 148723 244971 -432087
19084 -326049 -9930 75843 126789 -132630 -188862 -83732 131414 234133 49238 -272412 146725
19072 -305130 -18809 -206085 10858 112569 -262269 42022 -120588 337562 38328 -226840
19061 -53592 -89505 -182566 -109037 -106013 -46034 -195803 -115582 -148214 104363 87533 -27092
19049 -38725 -67696 9423 -408346 -182668 -119536 6287 47748 -30253 132833 -241125 179966
19037 -130426 -105920 -106188 -388188 18236 -143 -172447 -90043 -183990 51727 230943 -61465 105094
$$ packed form
19119A10724g7371j0367A45185K63436a51790B42808A03669j5403b27018i6974
19108b13725i0608B05072e4860K5401C2148J7656a85677J3051F4252M8827a67644
19096d085A67275a52346l8885K0707B46812H7829k9394e53487A48723R6248d32087
19084c26049i930G5843N0946a32630n6232h3732A31414J02719D9238b72412A46725
19072c05130a8809j87276A0858J01711b62269D2022a20588C37562C8328b26840
19061e3592l5913r3061P3529L024d6034j49769Q0221l2632A04363j6830b7092
19049c8725k8971I423d08346a82668O3132F287M1461c0253A32833b41125A79966
19037a30426K4506k68k82000A8236a43j72304Q2404r3947E1727J79216f1465A05094
$$ plain form
19024 -21901 -948 78624 134860 -296658 -198202 -181782 -117044 105989 221517 100745 -181572
19012 -183508 2245 26117 -114618 76747 -32214 186447 139495 -192380 102371 -286077 71848
19000 -119415 -229805 239892 44999 -203343 -13082 -43375 -319863 -151933 195965 99604
18990 99604 -51718 -285339 -74072 178730 -10239 145269 161624 -254768 453320 -229949
18979 274132 6701 41905 87207 219083 -207949 135053 225742 334934 478612 568221 182251
18967 -41517 -125961 -347236 46260 211517 -181666 87049 39481 -223767 53305 5824 190687
18956 190687 81716 123045 -95907 216945 -24596 -129653 -194888 -225974 -280 -19187 14847
18944 -3774 267568 -49335 -189689 -59919 -155288 152531 3373 -135658 196126 -19146 304152
$$ packed form
19024b1901i48G8624N6236b96658R8456J6420O4738A05989J15528A00745a81572
19012a83508B245K3872a14618G6747c2214A86447m6952a92380A02371b86077G1848
19000a19415j10390B39892D4999b03343a3082l0293k76488a51933A95965r6361
18990I9604e1718k33621g4072A78730a0239A45269J6355b54768D53320b29949
18979B74132F701L5204M5302J31876b07949A35053R0689J09192J43678Q9609A82251
18967d1517q4444k21275D6260J65257a81666H7049C9481b23767E3305E824J84863
18956A90687H1716M1329i5907B16945b4596j05057o5235l1086b80j8907A4847
18944c774B67568d9335j40354e9919r5369A52531C373a35658A96126a9146C04152
$$ plain form
18932 -86415 -87091 -109568 -111661 -458890 -2151 -150601 230562 -168847 -190302 -355916 -24252
18920 -164081 85550 -175980 -286000 -189894 -11217 -84457 52831 -118739 -199992 241761 200897
18909 200897 131855 168218 800309 140760 372322 -23853 -77305 390246 294884 -144146
18898 13661 26082 -230509 -180879 -125696 -33727 -140700 -86545 -229540 -120203 -70951 71846
18886 59633 -139602 80490 168711 -316357 -134711 -39545 -88211 -149149 -180816 -236003 73213
18874 7597 -23689 -108821 -383551 -271349 -100851 -99669 -25110 -155810 -72951 -37825 -217562
18863 -217562 -62435 -306972 -129387 186916 -77431 217863 166175 -349598 105321 -282915
18852 -80342 184238 371655 -339001 -10725 216355 -225013 62066 125444 203833 -178442
$$ packed form
18932h6415o76k2477k093l47229b151j48450B30562a68847k1455j65614b4252
18920a64081H5550a75980j10020R6106a1217p3240E2831a18739q1253B41761m0864
18909B00897o9042L6363O32091A40760K31562b3853n3452C90246r5362a44146
18898A3661J2421b30509M9630N5183c3727j06973N4155j42995J09337M9252G1846
18886E9633a39602H0490Q8221c16357a34711c9545m8666o0938l1667n5187G3213
18874G597b3689q5132k74730J12202a00851J182b5110j30700g2951L5126j79737
18863b17562f2435k44537a29387A86916g7431B17863n1688c49598A05321b82915
18852h0342A84238J87417c39001a0725B16355b25013F2066O3378P8389a78442
$$ plain form
18841 32408 125543 5486 -189806 -179396 -153259 470583 -121814 -66962 179309 6559 -91442
18829 51586 -78286 -182253 26198 151736 -51454 -140959 -103552 294103 207384 -250243 301467
18817 70371 -241965 -280919 193690 191740 -4571 -135535 -70547 143753 -97467 75746 -27335
18805 -142288 137124 -348457 -101461 112821 65763 -370097 -190972 241432 -30361 -219016
18795 -219016 145775 -64772 -181597 34602 323517 -15047 49551 87833 59204 -20506 -224274
18784 -224274 26299 -249918 -125703 28742 -21029 -119951 -283646 -115611 45848 -55368 -282665
18773 -282665 94780 -250140 151807 -165542 -92716 -37955 38153 209308 201727 94562 -256607
18761 -210855 -513279 -260176 -280507 -201350 95277 49472 -166968 -63963 -126423 -165747 -107515
$$ packed form
18841C2408R3135E486a89806J0410K6137D70583a21814N4852A79309F559i1442
18829E1586g8286j03967B6198J25538e1454q9505L7407B94103q6719b50243C01467
18817G0371b41965l8954A93690j950d571j30964O4988A43753i7467G5746b7335
18805a42288A37124c48457a01461A12821m7058c70097J79125B41432c0361j88655
18795b19016A45775f4772j16825C4602K88915a5047D9551L8282k8629b0506k03768
18784b24274B6299b49918J24215B8742b1029r8922j63695a15611D5848e5368k27297
18773b82665I4780b50140A51807a65542P2826c7955C8153J71155p581I4562b56607
18761b10855l02424K53103k0331P9157I5277m5805a66968f3963o2460l9324N8232
$$ plain form
18750 -107515 141142 -31268 -54822 -220964 -30962 -109367 -126059 1206 -18094 -83778 -182053
18739 -182053 295475 -290904 177031 163404 -128785 31810 -155125 22852 -364851 -262782
18729 -262782 148771 -257383 141059 -212618 13837 -82795 126069 -63849 -177875 -320468
18719 -320468 148344 -263673 -325501 69036 -229909 -98775 226026 -74351 -44447 -321737
18709 -321737 -329102 59325 154481 -131827 195714 218621 -55657 236982 -71618 146428 154210
18698 154210 102433 201600 -264284 -264678 -149767 -65923 -72742 75047 339645 -417202 -492060
18687 -492060 32442 54880 -197712 9957 -122648 85972 216404 27171 -223070 159459 80715
18676 80715 -417816 149235 -212410 -25547 -237751 -82241 188608 -347301 -143037 -26735
$$ packed form
18750a07515A41142c1268k3554j66142c0962p8405j6692A206a8094o5684r8275
18739a82053B95475b90904A77031j3627a28785C1810a55125B2852c64851J02069
18729b62782A48771b57383A41059b12618A3837h2795A26069f3849j14026j42593
18719c20468A48344b63673o1828F9036b29909i8775B26026g4351K9904k77290
18709c21737p365E9325R5156a31827A95714K2907e5657B36982g1618A46428P782
18698A54210n1777R9167b64284l94J14911f5923o819G5047K64598d17202p4858
18687d92060C2442K2438a97712I957a22648H5972J30432B7171b23070A59459p8744
18676H0715d17816A49235b12410b5547k12204h2241A88608c47301a43037b6735
$$ plain form
18665 -251401 -57398 -78409 -135678 2990 -187085 194417 -117952 195661 -46405 -84704 -136671
18654 -136671 -57450 -23058 -540142 -170243 301345 -2642 -2601 -177966 14220 -212342 260007
18642 103682 20303 28510 -257939 -146684 103058 114219 -479061 -48937 -215678 -50125 200150
18630 -218783 -68291 -171674 239347 -102402 -116493 15706 35102 -188163 159485 -121725
18619 77104 208040 -64252 152767 -100010 -30639 -161712 94994 87614 154783 -410470 -224694
18608 -224694 -165558 75410 66687 140148 40113 -160811 117803 -100019 37504 -311575 -415937
18597 -415937 126209 -144885 -12022 160626 -19805 -210359 151565 -147855 -64291 -181471
18587 -181471 85682 34942 -241240 -19451 -131705 49152 -145530 30214 -116247 -35081 -252906
$$ packed form
18665b51401e7398k1011n7269B990a87085A94417a17952A95661d6405l8299n1967
18654a36671e7450b3058n17084a70243C01345b642M1j75365A4220b12342B60007
18642A03682B0303Q207b57939J11255A03058J1161d79061d8937j66741e0125B00150
18630b18783f8291j03383B39347a02402j4091A5706J9396a88163A59485a21725
18619G7104J30936f4252A52767a00010c0639j31073I4994p380O7169d10470J85776
18608b24694N9136G5410q723P3461D0113a60811A17803a00019C7504c11575j04362
18597d15937A26209a44885a2022A60626a9805j90554A51565a47855f4291j17180
18587a81471H5682C4942b41240a9451j12254D9152a45530C0214a16247c5081k17825
$$ plain form
18576 -252906 -66157 -443524 -117524 282712 14382 116162 167341 64550 140412 -374525
18565 131646 -56693 33176 -187708 -33186 -61823 -145196 -104776 100553 309727 82358 -99596
18553 89074 -99129 -203197 -72569 133475 -439699 -356019 -65951 195663 162953 12611 94639
18542 94639 -96999 211869 -52325 54945 -39541 104127 41147 363641 335207 -300167 -43842
18530 233687 -19921 30495 -189091 -50082 40882 -126253 17949 -344126 -211393 83869 -54210
18518 -147152 -248118 -58319 -268470 -156722 125484 99998 187657 25209 66993 -170443
18507 -136292 25623 59679 -231743 -204916 -64983 132504 -8539 -292134 106767 126397 179716
18496 179716 -115939 6925 -172446 -98205 -15084 148633 96423 122675 302317 117949 -386896
$$ packed form
18576b52906f6157l77367a17524B82712A4382J01780N1179F4550P5862c74525
18565A31646e6693C3176a87708c3186k8637q3373M0420A00553K09174H2358i9596
18553H9074i9129j04068g2569A33475d39699Q3680f5951A95663l2710A2611Q2028
18542I4639i6999B11869e2325E4945c9541A04127D1147L22494k8434c00167d3842
18530B33687a9921C0495a89091e0082D0882a26253A7949c44126J32733H3869e4210
18518a47152j00966e8319k10151J11748A25484k5486Q7659B5209M1784a70443
18507a36292B5623L4056b31743K6827f4983A32504h539k83595A06767J9630N3319
18496A79716a15939F925a72446P4241a5084A48633n2210K6252J79642A17949c86896
$$ plain form
18484 73854 -102256 -191739 -4971 391661 -115167 -142834 -256042 -85091 -202061 -147562 -93988
18473 -93988 92305 60939 77192 232730 -271647 -127704 -214201 -90541 -179947 -395835 -237700
18462 -237700 -434694 -314462 -363045 -176039 79202 -114233 -206384 -219455 201160 -248447
18451 75628 -201886 -105805 -242488 31837 -517544 -207910 -126408 228484 -6391 103431 81227
18440 81227 170458 -378602 327545 -65203 44586 111238 50716 -266924 -89351 -117688 41896
18428 -73925 93514 -61828 244188 -82364 -28541 -139230 -13742 -63787 -187936 -241179 -153462
18417 -153462 186165 -32178 -148675 -446999 -143355 -21738 -32489 38180 29562 -129539 107594
18405 -86758 70589 -171017 -198131 -22745 -202433 -181347 45148 -595885 303320 96767 -188082
$$ packed form
18484G3854a02256q9483d971C91661a15167k7667j13208h5091j16970N4499N3574
18473i3988I2305l1366J6253J55538b71647a27704q6497i0541q9406k15888J58135
18462b37700j96994J20232m8583a76039G9202a14233r2151j3071B01160b48447
18451G5628b01886R6081j36683C1837e17544b07910Q1502B28484f391A03431k2204
18440H1227Q9231c78602C27545f5203D4586O6652E0716b66924h9351k8337D1896
18428g3925I3514f1828B44188h2364b8541j10689a3742n0045j24149n3243Q7717
18417a53462A86165c2178j16497k98324a43355b1738j0751C8180q618a29539A07594
18405h6758G0589a71017k7114b2745j79688K1086D5148e95885C03320I6767a88082
$$ plain form
18393 22451 -122716 -343632 107120 -69868 156294 -135497 91826 -41241 -178474 -343170
18383 -343170 -133525 182461 -225134 -158772 -64072 -81570 262939 -257945 7848 144673
18373 144673 -225562 33398 189732 -254324 210469 -12099 -45146 -205451 -30558 -100518
18363 -100518 -137997 31575 -220831 66426 -66636 61693 -217480 -303512 271762 -183192 52569
18351 28470 -37580 -21221 301694 130539 202613 135020 257840 -196279 -353031 49437 -4129
18339 12163 -110651 -170393 112801 57962 -241429 67136 121508 -47904 275217 -219615 -135528
18328 -135528 -149606 86589 -165712 233614 -30218 -5772 168535 16927 10049 -335557 132467
18316 -15326 -114764 -100960 -8178 203080 -99012 111475 -89142 -181763 -28905 131176 -80939
$$ packed form
18393B2451a22716k20916A07120f9868A56294a35497I1826d1241j37233j64696
18383c43170a33525A82461b25134O6362f4072j7498B62939b57945G848J36825
18373A44673b25562C3398J56334b54324B10469a2099l3047j60305c0558o9960
18363a00518l7479C1575b20831F6426f6636F1693b17480q6032B71762a83192E2569
18351B8470c7580J6359C01694A30539P2074o7593J22820a96279j56752D9437d129
18339A2163a10651n9742A12801n4839b41429F7136N4372d7904B75217b19615Q4087
18328a35528j4078H6589a65712B33614c0218e772A68535A6927o878c35557A32467
18316a5326r9438J3804h178B03080i9012A11475h9142r2621b8905A31176h0939
$$ plain form
18304 -265235 -126210 23321 22294 187620 -53703 -355888 65529 133889 70364 57618 -189539
18292 -68923 -150224 -327244 -237569 -32606 -26756 -39705 -384401 -128059 -72141 14418 -111614
18280 -2999 212142 367341 -50786 -99301 -201979 398768 -175220 11746 -132902 -109524 57047
18268 -255298 -494756 -132426 -65867 102094 289390 -31423 95172 75694 -88526 -42878 9427
18256 -342946 2812 223524 -91835 -91050 -95173 146009 312829 76396 -77436 -297530 -363110
18245 -363110 -22967 -75444 -338247 283405 -78248 -188658 57448 -18078 55035 117189 -729
18233 -183516 149040 109806 23342 -207984 -307178 107326 -239576 -227255 183327 -512377
18222 -127655 7534 -177988 84941 9183 265271 -91484 -249048 35218 -256305 -92682 -19454
$$ packed form
18304b65235a26210B3321j027J65326e3703l02185F5529O8360o3525j2746a89539
18292f8923q1301j77020Q9675c2606N850j2949l44696a28059N5918A4418a11614
18280b999B12142J55199e0786m8515j02678C98768a75220A1746a32902K3378E7047
18268b55298k39458a32426f5867A02094J87296c1423I5172j9478h8526d2878I427
18256c42946B812K20712i1835P85m123A46009J66820G6396g7436k20094o5580
18245c63110b2967n2477k62803B83405g8248j10410E7448a8078E5035O2154g29
18233a83516A49040l9234B3342b07984r9194A07326b39576J2321A83327e12377
18222a27655G534a77988H4941I183K56088i1484j57564C5218b56305i2682a9454
$$ plain form
18210 -226692 -85370 -200538 -111634 307722 -127088 -172489 186400 298519 -131591 31100
18199 71192 255894 -39630 -344625 105342 87668 -162040 -172369 -288033 -430326 157987
18188 72792 268120 -135930 151410 144049 -251107 47016 208121 27510 -148071 95360 122513
18177 122513 -149404 -142850 185001 -156805 -143603 -43959 154856 95837 -47573 -72391 159383
18165 -79143 -57894 -25637 77920 -146442 -197734 85760 -461852 14058 -214394 -322728 -196172
18154 -196172 -136235 150826 -72060 -274636 199580 -385408 15403 -82958 -172843 -123484 298870
18142 87945 -47044 -4668 -83869 -178159 -122783 -73976 -38085 -235961 127788 271673 -55292
18130 -136324 -143631 -176398 -10052 -131254 -457 225202 47190 -140990 -218451 11464 565697
$$ packed form
18210b26692h5370j15168Q8904C07722a27088m5401A86400J12119a31591C1100
18199G1192J84702c9630l04995A05342j7674a62040j0329j15664j42293A57987
18188G2792J95328a35930A51410p361b51107D7016J61105B7510a48071I5360K7153
18177A22513a49404O554A85001a56805J3202d3959A54856n9019d7573k4818A59383
18165g9143K1249b5637G7920a46442n1292H5760d61852A4058b14394j08334J26556
18154a96172N9937A50826g2060k02576A99580c85408A5403h2958q9885M9359B98870
18142H7945d7044d668p9201r4290N5376M8807L5891j97876A27788J43885e5292
18130a36324p307l2767a0052j21202d57B25202D7190a40990p7461A1464N54233
$$ plain form
18119 565697 82237 68080 69904 -107660 493865 139666 143799 48022 -315025 15305 172749
18108 172749 81723 205956 -201099 150666 -84814 -338943 -318283 -317431 -32775 49103 -142470
18096 -111459 33333 283247 74278 83650 120449 166930 -217126 -87219 -54281 -402870 146890
18084 -119522 -130424 -7076 -201041 -37719 333061 203229 -124520 37041 -193091 -200648 96384
18072 108593 -159741 87612 1689 120560 -166570 238782 156203 -249079 144922 113034
18062 113034 -40484 -84833 -43195 117721 -146592 37991 77089 -161702 175008 176399 -126285
18050 375796 307140 -54393 318147 -36204 -41030 239163 13365 -41628 -68519 -14054 63323
18038 96724 156080 243719 109610 -46612 -293412 235203 122738 105201 8193 -56732 133219
$$ packed form
18119E65697H2237j4157J824a07660D93865A39666M133D8022c15025A5305J57444
18108A72749H1723J24233b01099A50666h4814k54129K0660Q52c2775D9103a42470
18096a11459C3333K49914G4278R372L6799M6481b17126h7219L2938l48589A46890
18084a19522j0902g076j93965c7719C33061j29832a24520C7041a93091p557I6384
18072A08593a59741H7612A689J18871a66570B38782q2579b49079A44922l1888
18062A13034d0484m4349M1638A17721a46592C7991L9098a61702A75008J391a26285
18050C75796o8656e4393C18147c6204m826B39163A3365d1628k6891a4054F3323
18038I6724N9356Q7639A09610d6612k46800B35203j12465j7537H193e6732A33219
$$ plain form
18026 27509 -329461 666 -239329 -248316 125665 -12806 21508 358509 187922 9135 -67832
18014 -93629 -244498 -26565 282475 291417 -41572 28392 -262170 -487079 -107773 161568 -38117
18002 -63495 79000 74787 70153 152940 152403 103719 -125603 -81724 30000 -933 495182 174493
17989 -90814 108704 212603 300510 -161573 108562 92309 -61550 -135954 -2171 73079 -283072
17977 -28665 132442 242865 -29079 386925 36885 -371544 62515 183805 -68863 -247029
17967 -247029 -126323 -152033 -335450 145792 -307050 41154 -118934 -77509 -12350 -240163
17957 -240163 139091 -131445 -35794 300257 -246508 -98149 216727 66785 -163496 251594
17946 108352 107840 232334 -101038 -22822 20153 6695 87678 103112 126277 194709 -129717
$$ packed form
18026B7509c29461F66b39329q987A25665a2806B1508L37001j70587I135f7832
18014i3629j50869b6565B82475Q942d1572B8392b62170k24909a07773A61568c8117
18002f3495G9000m213m634Q2787n37m8684a25603M3879C0000i33D95182A74493
17989i0814A08704J03899Q7907a61573A08562j6253f1550p4404b171G3079b83072
17977b8665A32442J10423b9079C86925C6885c71544F2515J21290f8863j78166
17967b47029J20706k5710j83417A45792c07050D1154a18934M1425a2350k27813
17957b40163A39091a31445c5794C00257b46508i8149B16727F6785a63496B51594
17946A08352n12J24494a01038b2822B0153F695Q0983J5434K3165O8432a29717
$$ plain form
17934 99649 -117756 -262096 -15406 -308252 -151743 -93476 -77252 32598 -103763 439455
17923 91091 -106643 78839 269170 11696 -244324 2334 196950 64622 206258 -238902 372094
17911 -39864 133920 125705 -144054 288709 -67087 78415 26465 -40256 -4639 -62347 201214
17899 185625 51488 -2501 325021 -349109 -116827 174660 96860 65815 130152 45547 228917
17888 228917 -56687 -28597 34205 211750 -35463 -13598 174446 125563 -54769 260317 -16634
17876 74884 50044 154157 107298 -108858 -143180 7262 -238197 62714 122559 -145582 310
17864 -172477 311434 -377452 33895 -165881 -61288 286528 -132468 186210 70132 80512
17854 80512 393670 -367440 -117216 -21156 162994 -234019 380595 95569 305111 42734
$$ packed form
17934I9649a17756j44340a5406k92846a51743N8267J6224C2598a03763D39455
17923I1091a06643G8839J90331A1696b44324B334J94616F4622J41636b38902C72094
17911c9864A33920q215a44054B88709f7087G8415B6465d0256d639n7708B01214
17899A85625E1488b501C25021c49109a16827A74660p7800l1045O4337D5547J83370
17888B28917e6687K8090C4205J77545c5463a3598A74446m8883e4769B60317a6634
17876G4884k4840J04113m6859a08858l4322G262b38197F2714N9845a45582C10
17864a72477C11434c77452C3895a65881f1288B86528a32468A86210G0132J0380
17854H0512L13158c67440a17216b1156A62994b34019C80595I5569K09542D2734
$$ plain form
17843 -100199 113875 -141688 51337 -106568 19935 -60610 -188483 277154 -368 198676 -133054
17831 112197 -42125 183921 -60583 -283569 -158160 29825 -78067 -72697 47966 475640 -9392
17819 -14698 128942 215490 251319 -213342 142302 -220416 186725 -29485 -279094 -191250
17809 -191250 70167 146608 14988 -172484 52071 -49514 98093 349717 -22972 111272 115562
17798 115562 13636 -96281 -28985 45351 194096 440175 -98397 216431 -87198 -15034 324314
17786 122109 60602 -103337 -8021 125712 188949 218403 -46911 223969 -54353 -52897 179101
17774 171053 149388 474961 -74595 -22009 43818 -25271 -243639 -18037 -10416 126449 -39346
17762 -116097 87862 116819 234104 188128 59073 20959 102004 163292 143151 -91691 -253471
$$ packed form
17843a00199A13875a41688E1337a06568A9935f0610j27873B77154c68A98676a33054
17831A12197d2125A83921f0583k22986J25409B9825g8067N370D7966M27674i392
17819a4698A28942Q6548L5829b13342A42302b20416A86725b9485k49609Q7844
17809a91250G0167P6441A4988a72484E2071d9514I8093K51624b2972A11272M290
17798A15562A3636i6281b8985D5351J48745K46079i8397B16431h7198a5034C24314
17786A22109F0602a03337h021A25712O3237K9454d6911B23969e4353J456A79101
17774A71053k1665L25573g4595b2009D3818b5271k18368a8037P621A26449c9346
17762a16097H7862K8957J17285m5976E9073B0959Q1045O1288k0141i1691j61780
$$ plain form
17751 -253471 -46676 -167379 475105 44894 116650 16491 202570 -289295 62314 -28184 189140
17739 106162 -110331 18755 95902 -30502 110900 55012 115554 158523 -105971 -17343 -59841
17728 -59841 22487 -94930 96710 -187737 -159432 328578 233202 -169111 -40459 -47605 136908
17716 175726 239875 145353 193076 118861 319516 -39871 373594 286059 290631 205216 80442
17704 230925 18621 210329 -160020 435047 184906 16216 881 148250 -116784 30375 248488
17693 248488 -173135 115294 196172 115577 -9956 -39698 309299 -54387 203450 392620 -163611
17681 200922 24473 -28977 137685 -111695 196973 20278 42029 321355 182953 136210
17671 136210 -98520 9734 54020 -16925 -261279 -42999 -10394 231708 111564 -20384 16334
$$ packed form
17751b53471d6676j20703D75105D4894P1756A6491J86079b89295F2314b8184A89140
17739A06162a10331A8755P7147c0502A10900E5012O0542M2969a05971a7343m2498
17728e9841B2487i4930I6710a87737K8305C28578r5376a69111d0459p146A36908
17716A75726O4149r4522M7723p4215K00655c9871C73594q7535M572q5415H0442
17704B30925A8621J91708a60020D35047A84906A6216H81J47369a16784C0375K18113
17693B48488a73135A15294Q0878q0595i956k9742C09299e4387B03450J89170a63611
17681B00922B4473b8977A37685a11695A96973B0278K1751K79326j38402m6743
17671A36210i8520I734M4286a6925k44354d2999a0394B31708A11564b0384A6334
$$ plain form
17659 56659 -77211 -106596 195973 17106 90974 361632 378854 -200755 32650 -173777 41970
17647 90236 315743 256368 167062 286363 81540 -265872 -223098 101770 -81209 419707 199497
17635 13916 161006 310745 -50911 173702 140749 206621 214639 19383 -134575 269373 282141
17624 282141 193549 301941 62093 170859 92964 227042 300918 -51430 216104 -256891
17613 187073 267599 -6194 -6862 93063 49497 89837 -81316 286722 -2196 72894 385436 255175
17601 255175 10195 -87698 353079 369381 -22228 173251 -55794 210598 -322016 151991
17590 -27445 244421 -24347 -303412 40312 -189944 177412 -96506 -74195 265853 -47039 418104
17578 -92043 131365 13266 249720 96183 -45372 107463 37029 419245 101065 175276 91073
$$ packed form
17659E6659g7211k9385A95973A7106P3868K70658J7222b00755C2650a73777D1970
17647I0236K25507n9375q9306J19301H1540b65872M2774A01770h1209D19707A99497
17635A3916J47090J49739e0911A73702l2953O5872Q018A9383a34575B69373J2768
17624B82141q8592J08392F2093J08766p7895J34078P3876e1430B16104b56891
17613A87073Q0526f194o68I3063m3566M0340h1316B86722b196G2894L12542j30261
17601B55175A0195h7698C53079J6302b2228A73251e5794B10598c22016A51991
17590b7445B44421b4347k79065D0312a89944A77412i6506K2311B65853d7039D18104
17578i2043A31365A3266K36454I6183d5372A07463C7029L82216A01065P4211q4203
$$ plain form
17567 91073 137543 -259591 185903 281827 295457 359814 83029 145805 255777 205562 -55431
17555 -19434 129868 70445 499628 106815 357029 46992 280725 232561 270575 194912 396586
17544 396586 67482 255006 252958 41038 355391 394779 410170 354584 107784 275567 199953
17533 199953 435688 342071 431677 509382 339498 403271 642526 738436 714944 1225679 1128564
17522 1128564 919790 817451 424481 873582 853800 203499 481318 349376 340045 509735
17512 509735 442961 870262 722509 1103361 1048422 947595 881022 545539 445119 289550
17502 289550 271574 224662 571907 349288 254117 191100 360319 413430 524956 185227
17491 369481 254547 322705 -285057 315757 381387 246989 156978 457775 346841 106980
$$ packed form
17567I1073M6470b59591A85903R5924J3630O4357H3029O2776J09972n0215e5431
17555a9434A29868n9423M29183A06815K50214D6992K33733m8164L8014p5663K01674
17544C96586F7482J87524k048D1038L14353L9388J5391n5586A07784J67783p5614
17533A99953K35735r3617Q9606P7705j69884O3773K39255R5910k3492N10735r7115
17522A128564k08774j02339l92970M49101j9782B03499K77819j31942r331J69690
17512E09735o6774M27301j47753L80852n4939j00827o6573l35483j00420j55569
17502B89550j7976m6912L47245k22619r5171o3017J69219N3111J11526A85227
17491C69481j14934O8158b85057C15757O5630j34398r0011L00797j10934A06980
$$ plain form
17480 64194 408925 315063 378584 134983 213984 -115161 230400 351232 192130 184760 234597
17469 234597 137169 394757 -99170 550332 457601 234785 290344 344334 243373 59220 497196
17458 497196 -2472 420574 581518 231593 43038 314501 459866 377744 380856 406425 600242
17447 600242 396922 677775 397681 354170 244477 434723 396928 393007 230325 264374
17437 264374 668009 205351 471501 338334 258647 571866 372317 369183 286277 538519
17427 538519 615257 615213 402286 147117 206678 33180 490830 196038 204629 685645 199955
17415 575370 129112 395882 553054 926452 677087 446174 384377 258360 11868 183231
17405 183231 486783 202762 201071 563184 272403 105194 184470 359560 226320 147724
$$ packed form
17480F4194L44731r3862O3521A34983P9001a15161B30400J20832j59102p370M9837
17469B34597r7428K57588i9170E50332r2731k22816N5559N3990j00961E9220M37976
17458D97196b472D20574J60944B31593D3038K71463J45365q2122L112K5569J93817
17447F00242k03320K80853k80094m3511j09693J90246l7795l921j62682L4049
17437B64374M03635B05351K66150j33167p9687L13219j99549l134q2906K52242
17427E38519P6738m4k12927A47117N9561C3180M57650A96038Q591M81016A99955
17415E75370A29112K66770J57172L73398k49365k30913o1797j26017A1868J71363
17405A83231L03552B02762j691L62113B72403A05194P9276J75090j33240p8596
$$ plain form
17395 147724 458159 394006 133945 369885 309468 69504 132044 370437 486552 511715
17385 511715 128405 331571 371135 222766 313249 315596 95077 83716 -104822 34029 71528
17374 71528 512460 279116 180079 440306 241182 447497 549442 331686 426726 -228067
17363 127847 222573 96685 188804 142477 395781 444128 445939 278410 171395 240571 534119
17352 534119 285708 -42137 327481 520866 295790 124171 433226 107329 319288 54417
17341 273468 288445 82252 172588 200221 369449 7117 130828 152948 282605 70 161638
17330 161638 219919 340849 316224 486128 297367 391158 156764 47590 305637 491629
17320 491629 379773 452863 371879 459631 275618 158119 306702 527042 81307 341004
$$ packed form
17395A47724L10435o4153A33945K35940o0417F9504O2540K38393J16115K5163
17385E11715A28405K03166L9564j48369R0483K347I5077j1361a04822C4029L7499
17374G1528M40932k33344r9037K60227j99124K06315J01945k17756R5040b28067
17363A27847R4726I6685R2119m6327K53304M8347J811j67529j07015O9176K93548
17352E34119k48411d2137C27481J93385k25076A24171L09055A07329K11959E4417
17341B73468J4977H2252R0336K7633J69228G117J23711K2120J29657G0J61568
17330A61638N8281J20930k4625J69904j88761R3791A56764D7590K58047J85992
17320D91629j11856P3090q0984Q7752j84013j17499J48583K20340H1307K59697
$$ plain form
17310 341004 362729 -167266 317223 521904 287116 127223 274150 305312 549138 89310
17299 247061 351110 294441 136828 139403 234334 359345 614619 285681 -22806 507420
17288 232524 73894 582717 512899 464729 575117 615043 458939 322169 135687 189647
17278 189647 215747 505218 315489 653492 248024 50080 257091 354383 112084 512230
17268 512230 454877 318320 81251 474013 269081 181471 435189 24959 691491 485064
17258 485064 568180 593665 67757 233518 552299 276372 161281 443297 168850 219634
17248 219634 610991 183831 41011 369097 546884 395728 424999 148273 364338 324427
17238 324427 630414 9883 219835 352398 349315 173369 644701 576453 145366 627724
$$ packed form
17310C41004K1725a67266C17223K04681k34788A27223J46927L1162K43826H9310
17299B47061J04049n6669A36828K575R4931J25011K55274B85681b2806E07420
17288B32524G3894N08823o9818m8170J10388L9926j56104j36770A35687N3960
17278A89647K6100K89471j89729L38003B48024E0080K07011R7292A12084M00146
17268E12230n7353j36557H1251L92762k04932q7610K53718B4959O66532k06427
17258D85064Q3116K5485F7757J65761L18781k75927j15091K82016A68850N0784
17248B19634L91357A83831D1011L28086J77787j51156K9271A48273K16065l9911
17238C24427L05987I883K09952J32563l083A73369M71332o8248A45366M82358
$$ plain form
17228 627724 342412 382932 520947 424227 53561 596326 54223 317556 648402 528059
17218 528059 672461 499315 460126 510678 525090 265319 272678 129369 564541 678609
17208 678609 157491 458755 192745 468881 447577 829261 244365 585087 505610 633600
17198 633600 651079 520160 238879 581098 655759 341348 309355 543365 708810 799289
17188 799289 488953 298562 504855 408401 573322 507148 827159 548349 411875 350645
17178 350645 583201 468013 627166 400732 218014 376153 381878 545463 462091 642111
17168 642111 593787 446106 867284 612151 540275 751995 647740 803402 320698 716467
17158 716467 463898 284481 669239 589126 534953 382264 603473 417664 162707 446142
$$ packed form
17228F27724k85312M0520J38015r6720E3561N42765E4223K63333L30846j20343
17218E28059J44402j73146l9189N0552J4412k59771P359A29369M35172J14068
17208F78609A57491L01264A92745K76136k1304L81684B44365L40722p9477J27990
17198F33600J7479j30919B38879L42219P4661l14411l1993K34010J65445R0479
17188G99289l10336j90391K06293r6454J64921o6174L20011k78810j36474o1230
17178C50645K32556j15188J59153k26434j82718J58139N725J63585q3372J80020
17168F42111m8324j47681M21178k55133p1876K11720j04255J55662C20698L95769
17158G16467k52569j79417L84758q0113n4173j52689K21209j85809A62707K83435
$$ plain form
17148 446142 884478 600351 530831 396785 958949 487101 971890 591117 565853 429164
17138 429164 892874 401380 459777 515689 476347 760733 509385 630483 660314 671413
17128 671413 461636 546884 578808 576850 762920 792347 935215 888372 167295 626798 820348
17117 820348 560234 371357 635645 358302 485884 503078 741262 628354 415272 874154
17107 874154 428983 543682 816272 654529 500842 525436 427483 865650 745680 966980
17097 966980 849235 248421 776535 860813 1011447 562096 628575 579500 684126 880304
17087 880304 784733 799613 547003 548638 675286 793849 733148 966705 1044629 743990 861916
17076 861916 964947 919715 658838 1044272 627436 811129 967068 1071713 1016797 1028056
$$ packed form
17148D46142M38336k84127o9520j34046N62164m71848M84789l80773k5264j36689
17138D29164M63710D01380N8397N5912l9342K84386k51348J21098K9831J1099
17128F71413k09777Q5248L1924j958J86070K9427J42868m6843A67295M59503J93550
17117H20348k60114j88877K64288k77343J27582J7194K38184j12908k13082M58882
17107H74154D28983J14699K72590j61743j53687K4594r7953M38167j19970K21300
17097I66980j17745B48421N28114Q4278J50634m49351O6479m9075J04626J96178
17087H80304r5571J4880k52610J635J26648J18563o0701K33557P7924l00639J17926
17076H61916J03031m5232k60877L85434m16836J83693J55939J04645n4916J1259
$$ plain form
17066 1028056 879355 755206 742101 561292 846414 1056144 1093675 1061435 1105778 1042533
17056 1042533 1005376 1051003 994062 620541 1012841 811813 1084295 861260 641534 974890
17046 974890 1088122 1404035 1137460 893081 925632 1154632 901157 1083536 842998 836698
17036 836698 1170792 1102274 900729 938504 1102059 973671 928404 1250561 977093 1410848
17026 1410848 1330496 849081 1022199 1017916 1068900 1314516 910325 1136648 1159326 1040305
17016 1040305 1094981 962498 1212742 1315396 1115950 1065799 797316 893454 1551014 1316158
17006 1316158 1092174 1303134 1181662 1180572 1484091 1400234 1252983 1139976 1438083 1285311
16996 1285311 1253966 1485905 1568709 1207792 1480503 1319805 1483811 1532633 1512255 1430315
$$ packed form
17066A028056j48701j24149j3105j80809K85122K09730L7531l2240M4343o3245
17056A042533l7157M5627n6941l73521L92300k01028K72482k23035k19726L33356
17046I74890J13232L15913k66575k44379L2551K29000k53475J82379k40538o300
17036H36698L34094o8518k01545L7775J63555j28388m5267L22157k73468M33755
17026A410848q0352m81415J73118m283N0984K45616m04191K26323K2678j19021
17016A040305N4676j32483K50244J02654j99446n0151k68483R6138O57560k34856
17006A316158k23984K10960j21472j090L03519q3857j47251j13007K98107j52772
16996A285311l1345K31939Q2804l60917K72711j60698J64006M8822k0378q1940
$$ plain form
16986 1430315 1424330 1484811 1488503 1914550 1478236 1563497 1526090 1579737 1800122 1630876 1949389
16975 1949389 1613793 1708508 1603590 1454022 1730341 1714908 1758395 1885059 1834283 1674139
16965 1674139 1739752 1349104 1376998 1680680 1389093 1711305 1635497 1439231 1721606 1683847
16955 1683847 2042687 1839808 1744265 1776828 2312720 2067494 2072409 1927067 1994709 1768198
16945 1768198 1895401 2255868 2262285 2140172 2116218 2057590 2040314 2083978 2029444 2193830 1994019
16934 1994019 2112473 2553379 2022248 2560217 2099296 2235833 2339107 2256922 2056939 2220200
16924 2220200 2499953 2053278 2340851 2457532 2512436 2521254 2608222 2461635 2676587 2510205
16914 2510205 2702266 2832352 2469771 2663161 2779983 2711008 2831380 2773203 3042548 3127761
$$ packed form
16986A430315n985O0481L692M26047m36314Q5261l7407N3647K20385j69246L18513
16975A949389l35596R4715j04918j49568K76319j5433M3487J26664n0776j60144
16965A674139O5613l90648K7894L03682k91587L22212p5808j96266K82375l7759
16955A683847L58840k02879r5543L2563N35892k45226M915j45342O7642k26511
16945A768198J27203L60467O417j22113k3954n8628j7276M3664n4534J64386j99811
16934A994019J18454M40906n31131N37969m60921J36537J03274q2185j99983J63261
16924B220200K79753m46675K87573J16681N4904Q818Q6968j46587K14952j66382
16914B510205J92061J30086l62581J93390J16822o8975J20372n8177K69345Q5213
$$ plain form
16904 3127761 2973138 2929296 3093150 3107719 3219119 3214390 3263265 3185020 3179865 3111861 3386547
16893 3386547 3292124 3176751 3697083 3746823 3502650 3452313 3943938 3455737 3836540 3677054
16883 3677054 3622032 3801737 3823327 3880401 4121872 4076008 4238361 3853065 4189615 4119593
16873 4119593 4150562 4244662 4640199 4608944 4583068 4638245 4678987 4541594 4780494 5000088
16863 5000088 4985354 4983295 4784344 5071563 4952414 5202646 5049191 5165203 5493497 5276778
16853 5276778 5390598 5531512 5636684 5482378 5845579 5991633 6004309 6040517 6443652 6658384
16843 6658384 6077933 6727501 6765199 6849925 7133160 7023802 7318323 6984602 7304127 7102620
16833 7102620 7353716 7767904 8022731 8067088 8167050 8186157 8409037 8302230 8523328 9089838
$$ packed form
16904C127761j54623m3842J63854J4569J11400m729M8875p8245n155o8004K74686
16893C386547r4423j15373N20332M9740k44173n0337M91625m88201L80803j59486
16883C677054n5022J79705K1590N7074K41471m5864J62353l85296L36550p0022
16873D119593L0969R4100L95537l1255k5876N5177M0742j37393K38900K19594
16863E000088j4734k059j98951K87219j19149K50232j53455J16012L28294k16719
16853E276778J13820J40914J05172j54306L63201J46054J2676L6208M03135K14732
16843F658384n80451O49568L7698Q4726K83235j09358K94521l33721L19525k01507
16833G102620K51096M14188K54827M4357R9962J9107K22880j06807K21098N66510
$$ plain form
16823 9089838 9084044 8913006 9428153 9132923 9708467 9848363 9909602 10442217 10454148 10305039
16813 10305039 11017771 11332851 11316396 11487235 11866558 12066655 12213224 12441962 12534906 13154710
16803 13154710 13490289 13975678 13911795 14415302 14547111 14831922 14953914 15688978 16108696
16794 16108696 16707759 16523868 17406502 17473537 18219198 18500325 19007175 19331995 19772604
16785 19772604 20584132 20864398 21469362 21792807 22784136 23499304 24012853 24773255 25281627
16776 25281627 25944322 26989128 27544318 28350830 29083690 29826157 30838487 32129556 32788370
16767 32788370 33804276 35016651 36025488 37256300 38827103 39674377 40905134 42165774
16759 42165774 43561562 44989877 46950051 48165969 49824634 51534296 53096775 55321292
$$ packed form
16823I089838n794j71038N15147k95230N75544J39896O1239N32615J1931j49109
16813A0305039P12732L15080j6455J70839L79323K00097J46569K28738R2944O19804
16803A3154710L35579M85389o3883N03507J31809K84811J21992P35064M19718
16794A6108696N99063j83891Q82634O7035P45661K81127N06850L24820M40609
16785A9772604Q11528K80266O04964L23445R91329P15168N13549P60402N08372
16776B5281627O62695J044806N55190Q06512P32860P42467J012330J291069O58814
16767C2788370J015906J212375J008837J230812J570803Q47274J230757J260640
16759D2165774J395788J428315J960174J215918J658665J709662J562479K224517
$$ plain form
16751 55321292 57286376 59121376 60914349 63650133 65575626 68034026 69938097 72680422
16743 72680422 75095312 77269670 79802088 82535700 85148491 87649290 90299283 93205456
16735 93205456 95835728 98207462 101244644 103045572 105815262 108263071 109903519 112049836
16727 112049836 113544276 115255991 116252221 117336751 118088415 118692520 118909337 118631723 118357490
16718 118357490 117534825 116528194 115427545 113713762 112043754 110253332 108346547 106016802
16710 106016802 103347218 101358332 98445810 95935721 93189808 90031687 87732241 85059371
16702 85059371 82188683 79702206 76774875 74201000 71502313 69295172 66733270 64097932
16694 64097932 62103403 60070868 57920009 56155786 53987206 51855024 50046086 48331288
$$ packed form
16751E5321292J965084J835000J792973K735784J925493K458400J904071K742325
16743G2680422K414890K174358K532418K733612K612791K500799K649993K906173
16735I3205456K630272K371734L037182J800928K769690K447809J640448K146317
16727A12049836J494440J711715R96230J084530P51664O04105K16817k77614k74233
16718A18357490q22665j006631j100649j713783j670008j790422j906785k329745
16710A06016802k669584j988886k912522k510089k745913l158121k299446k672870
16702H5059371k870688k486477k927331k573875k698687k207141k561902k635338
16694F4097932j994529k032535k150859j764223k168580k132182j808938j714798
$$ plain form
16686 48331288 46781464 45136176 43647881 42062341 40927034 39429247 38068334 36785699
16678 36785699 35451266 34376128 33146558 31901088 31090909 29820428 28949080 28546259
16670 28546259 27420447 26758118 26180970 25141705 24305019 23525723 22746254 22393256 21595856
16661 21595856 21023473 20680096 20075594 19206248 18967204 18548597 17921896 17555765 17207806
16652 17207806 16547410 16238258 15807346 15496117 14786631 14952754 14524202 13747350 13618099
16643 13618099 13518872 13184821 12917753 12498610 12000846 12073154 11944912 11398049 10827532 11228781
16633 11228781 10481138 10738543 10366350 9877423 9866344 9402124 9419625 9208081 9229113 8379102
16623 8379102 8826686 8831807 8055629 8368091 8035548 7820172 7936092 7569487 7528602 7608830
$$ packed form
16686D8331288j549824j645288j488295j585540j135307j497787j360913j282635
16678C6785699j334433j075138j229570j245470q10179j270481q71348m02821
16670B8546259j125812o62329n77148j039265q36686p79296p79469l52998p97400
16661B1595856n72383l43377o04502q69346k39044m18607o26701l66131l47959
16652A7207806o60396l09152m30912l11229p09486J66123m28552p76852j29251
16643A3618099r9227l34051k67068m19143m97764P2308j28242n46863n70517M01249
16633A1228781p47643K57405l72193m88927j1079m64220J7501k11544K1032q50011
16623H379102M47584N121p76178L12462l32543k15376J15920l66605m0885Q0228
$$ plain form
16613 7608830 7152537 7299421 7175725 6742996 6672798 6759526 6414826 6580125 6290845 5847850
16603 5847850 6079359 5929428 5951275 6168460 5999609 5505643 5553456 5447690 5571713 5504625
16593 5504625 5109591 5050979 5314635 5108776 4649555 4469474 4960589 4974529 4809941 4717759
16583 4717759 4661394 4597790 4290484 4485481 4070947 3939255 4142430 3712204 4036881 3677573
16573 3677573 3859682 4133646 3781210 3551950 3752074 3816617 3670328 3579280 3677792 3664087
16563 3664087 3138804 3267763 3412833 3114191 3145274 2993493 3371934 3120973 3131847 3229465
16553 3229465 3190440 3029037 2747351 2810296 2743260 2983076 2589369 2792530 2854357 2548304
16543 2548304 3035247 2470401 2421210 2286817 2529147 2619318 2250720 2138627 2180004 2352039
$$ packed form
16613G608830m56293J46884j23696m32729p0198Q6728l44700J65299k89280m42995
16603E847850K31509j49931K1847K17185j68851m93966M7813j05766J24023o7088
16593E504625l95034n8612K63656k05859m59221j80081M91115J3940j64588r2182
16583D717759n6365o3604l07306J94997m14534j31692K03175m30226L24677l59308
16573C677573J82109K73964l52436k29260K00124O4543j46289r1048R8512j3705
16563C664087n25283J28959J45070k98642L1083j51781L78441k50961J0874R7618
16553C229465l9025j61403k81686O2945o7036K39816l93707K03161O1827l06053
16543B548304M86943n64846m9191j34393K42330R0171l68598j12093M1377J72035
$$ plain form
16533 2352039 2299546 2598605 2043593 2115491 2377182 2466714 2503078 2081425 2335372 1953322
16523 1953322 2252116 2117110 2110650 2414466 2308719 2107770 1936821 1899717 1744154 1990286
16513 1990286 1733645 1923439 1972086 1965669 2170621 1977290 1833478 1927400 1926060 1358902
16503 1358902 1549361 1771835 1911435 1759931 1461603 1361719 1974603 1718831 1776170 1625846
16493 1625846 1323612 1607759 1614424 1640810 1577891 1423631 1333220 1493745 1469898 1630812
16483 1630812 1282683 1192181 1237363 1345012 1206853 1309932 996640 1224735 1427068 1676378
16473 1676378 1533370 1063799 1300720 1209702 1704801 1391555 1374513 1475491 1341611 1379045
16463 1379045 1622052 1091804 1213551 1109229 1154990 958893 1264295 1453469 1206553 1452105
$$ packed form
16533B352039n2493K99059n55012P1898K61691Q9532L6364m21653K53947l82050
16523A953322K98794j35006o460L03816j05747k00949j70949l7104j55563K46132
16513A990286k56641J89794M8647o417K04952j93331j43812R3922j340n67158
16503A358902J90459K22474J39600j51504k98328r9884O12884k55772N7339j50324
16493A625846l02234K84147O665K6386o2919j54260r0411J60525k3847J60914
16483A630812l48129r0502M5182J07649j38159J03079l13292K28095K02333K49310
16473A676378j43008m69571K36921r1018M95099l13246j7042J00978j33880L7434
16463A379045K43007n30248J21747j04322M5761j96097L05402J89174k46916K45552
$$ plain form
16453 1452105 1115968 925112 1023003 873970 1127187 1173165 829666 1075678 1229272 842467
16443 842467 808273 1260231 768355 1103608 1061445 1098886 1133197 893881 979627 995593 725326
16432 725326 1055801 929938 1050920 971202 939675 875815 653243 962258 901218 744721
16422 744721 650654 734349 915815 641606 648014 926136 692370 947480 895073 656782
16412 656782 637531 631918 846918 849116 1004347 705311 597052 665884 968081 728350 765485
16401 765485 501378 530422 955119 792766 809455 732376 479253 471427 649838 991768
16391 991768 700274 605050 696223 482429 530390 474072 499514 1036124 761300 523995
16381 523995 540547 781681 664954 688559 671041 582799 584560 909902 909628 551428 348044
$$ packed form
16453A452105l36137j90856R7891j49033K53217M5978l43499K46012J53594l86805
16443H42467l4194M51958m91876L35253m2163L7441L4311k39316Q5746J5966k70267
16432G25326L30475j25863J20982p9718l1527o3860k22572L09015o1040j56497
16422G44721r4067Q3695J81466k74209O408K78122k33766K55110n2407k38291
16412F56782j9251n613K15000K198J55231k99036j08259O8832L02197k39731L7135
16401G65485k64107K9044M24697j62353J6689p7079k53123p826J78411L41930
16391I91768k91494r5224R1173k13794M7961n6318K5442N36610k74824k37305
16381E23995J6552K41134j16727K3605j7518q8242J761L25342k74l58200k03384
$$ plain form
16370 348044 324068 408032 523916 737553 529594 673473 394559 851679 559898 683179
16360 683179 440700 381782 855923 475534 717047 771551 589646 295031 322363 657674
16350 657674 706120 637049 393152 470528 388100 699715 488771 929983 482172 373366
16340 373366 399386 512080 446768 478076 182626 774585 154391 611772 500851 679707
16330 679707 455025 649772 147704 648164 545882 531105 527461 523545 583156 380051 423406
16319 423406 542075 330483 318927 519391 647421 181435 522279 530132 235297 303079
16309 303079 356097 290313 492782 346332 410455 455486 105441 213510 216021 413958 520073
16298 520073 409724 539325 230443 277922 328366 335062 380885 227406 327748 281618 37892
$$ packed form
16370C48044k3976Q3964J15884K13637k07959J43879k78914M57120k91781J23281
16360F83179k42479n8918M74141l80389K41513N4504j81905k94615K7332L35311
16350F57674M8446o9071k43897P7376q2428L11615k10944M41212m47811j08806
16340C73366K6020J12694o5312L1308A82626N91959A54391M57381j10921J78856
16330F79707k24682J94747A47704N00460j02282j4777l644l916N9611k03105M3355
16319D23406J18669k11592j1556K00464J28030A81435L40844P853B35297O7782
16309C03079N3018o5784K02469j46450O4123M5031A05441J08069K511J97937J06115
16298E20073j10349J29601B30443M7479N0444O696M5823j53479J00342m6130C7892
$$ plain form
16286 119467 -17701 82430 245088 104577 281881 561325 724565 234106 405164 495890
16276 495890 431718 266944 209353 116247 126700 319553 292206 264950 427223 85449 383635
16265 383635 286088 175387 229230 360040 346594 314182 477204 213257 265242 207542 546299
16254 546299 242103 440903 128611 110478 486892 799079 246985 316057 322373 278149
16244 278149 332112 227867 171796 422205 474576 -48984 422787 392281 254754 473916
16234 473916 302191 282976 202149 283137 328974 252501 515203 -47687 -121561 514847 147731
16222 237672 42990 188567 235245 301700 249147 279832 170444 201994 356016 127124 219816
16211 219816 402474 104860 208276 102432 -4392 242669 319982 260669 476278 -171914
$$ packed form
16286A19467a7701H2430J62658A04577J77304K79444J63240B34106J71058R0726
16276D95890o4172j64774n7591r3106J0453J92853k7347k7256J62273H5449K98186
16265C83635r7547j10701N3843J30810j3446l2412J63022B13257N1985n7700L38757
16254E46299B42103J98800A28611j8133L76414L12187B46985O9072O316m4224
16244B78149N3963j04245n6071K50409N2371d8984D22787l0506j37527K19162
16234D73916j71725j9215q0827Q0988M5837p6473K62702d7687p3874E14847A47731
16222B37672D2990J45577M6678O6455n2553L0685j09388L1550J54022A27124R2692
16211B19816J82658A04860J03416A02432d392B42669P7313n9313K15609a71914
$$ plain form
16200 312080 155433 227860 160853 491738 115401 481431 -376086 321422 189106 155054
16190 155054 114096 135279 92273 396224 174003 344261 199820 267017 -12047 155449
16179 -113722 338151 40228 154445 164300 202730 62292 292263 237747 467624 -146730 211702
16167 115144 75482 -218557 192646 134564 72169 -34171 23403 -2802 308965 4748 -8270
16155 11065 522054 176586 228960 84720 222170 159184 348752 6052 183358 169547 200139
16144 200139 -242702 73749 523824 23541 -32529 117017 304177 401991 193146 112028
16134 112028 233257 17234 205104 363321 104440 -118294 -180278 368080 85236 319236
16124 319236 -57971 290643 1973 -351527 -21427 135834 122129 300915 200271 497919
$$ packed form
16200C12080A55433P2427o7007L30885A15401L66030c76086C21422j32316l4052
16190A55054m0958K1183m3006L03951A74003J70258j44441O7197a2047A55449
16179a13722C38151D0228J14217R855L8430F2292K29971n4516K29877a46730B11702
16167A15144l9662b18557A92646n8082o2395c4171B3403b802C08965D748h270
16155A1065N10989A76586N2374H4720J37450o2986J89568F052J77306j3811L0592
16144B00139b42702G3749M50075B3541c2529A17017J87160R7814A93146q1118
16134A12028J21229A7234J87870J58217A04440a18294o1984C68080H5236K34000
16124C19236e7971B90643A973c51527b1427A35834j3705J78786j00644K97648
$$ plain form
16114 497919 -300664 171597 13037 -779 -63981 92037 98307 419623 331093 356542 263445
16103 263445 -68413 459049 62150 241068 59954 78330 71252 -90222 253073 131168 -32137
16091 35572 -162428 156277 125767 75259 -203110 100853 19863 -65420 -118155 17180 288101
16080 288101 196735 35976 -318514 143764 155196 -47226 -22942 -146254 56426 -39643 -57800
16069 -57800 -111887 32017 184477 160498 35503 -189626 -31427 -143051 106617 -54119 -63370
16058 -63370 -87879 -228045 -278242 -41344 -105241 137746 220211 -219960 -103809 28169 -431902
16046 227018 -165849 -49170 -222039 127225 -338086 22289 281552 289594 142761 -77712
16035 344537 42608 120249 154474 -71975 149776 346757 89281 218987 13196 -524147 -93229
$$ packed form
16114D97919c00664A71597A3037g79o3202I2037O270L21316q8530K5449r3097
16103B63445f8413D59049F2150J78918E9954J8376p078i0222B53073j21905c2137
16091C5572a62428A56277l0510n0508b03110A00853A9863f5420n2735A7180K70921
16080B88101r1366C5976c18514A43764J1432d7226b2942j23312E6426c9643j8157
16069e7800n4087C2017J52460k3979C5503a89626c1427j11624A06617e4119r251
16058f3370k4509j40166n0197d1344o3897A37746Q2465b19960a03809B8169d31902
16046B27018a65849d9170j72869A27225c38086B2289K59263Q042A42761g7712
16035C44537D2608P7641L4225g1975A49776J96981H9281J29706A3196e24147i3229
$$ plain form
16023 39332 187630 107266 253370 406400 330599 -103427 -106425 78229 167873 137623 -229663
16011 -107706 247048 -46693 89818 205667 84685 46266 29073 91895 -236442 251075 -128275
15999 -222338 150594 316234 5746 -133785 172654 21393 -98646 -61797 228402 -6687 478085
15987 577028 759423 987235 1335508 1481861 1277271 706269 463434 454700 153787 160237
15977 160237 316814 -3288 -396266 341371 145785 20486 2564 205888 113606 4494 -255846
15965 70363 -43295 -79984 133911 -248845 -247359 28343 -32099 144950 -304331 -68770 -256453
15954 -256453 12941 -12921 -113395 -118357 146502 -220993 -194345 -8249 -154145 38963 -92196
15942 449431 -254082 -294104 114024 369024 238115 -260757 -312993 344565 -320103 -40885
$$ packed form
16023C9332J48298q0364J46104J53030p5801a03427k998G8229Q9644l0250b29663
16011a07706B47048d6693H9818J15849H4685l8419j7193O2822b36442B51075a28275
15999b22338A50594J65640E746a33785A72654B1393i8646L6849B28402f687D78085
15987E77028J82395K27812L48273J46353k04590n71002k42835q734A53787O450
15977A60237J56577c288l92978C41371A45785B0486B564K03324r2282D494b55846
15965G0363d3295l6689A33911b48845J486B8343c2099A44950c04331f8770j87683
15954b56453A2941a2921j00474m962A46502b20993K6648h249j45896C8963i2196
15942D49431b54082m0022A14024K55000j30909b60757n2236C44565c20103d0885
$$ plain form
15931 446472 125036 211733 -42322 -269903 129379 207141 -226151 90987 224485 -367636
15920 -197489 77995 69781 73186 -113606 126171 -7276 -117844 -95581 22426 -34930 111697
15908 137400 -55083 10007 -82214 94443 -34792 -198940 152674 204924 165119 -2546 54148
15896 42473 -165206 170985 -86517 36966 154823 -55622 -236510 -425904 -162304 -22964
15885 -132815 -152185 88594 -359162 -103501 189040 113429 99090 -236902 -252374 135291
15874 -183870 -116765 -103155 143199 -43761 143599 48652 -76402 -139444 70551 -8279 38310
15862 309336 58625 79541 21093 -161988 -240318 -171361 -119739 129310 310317 -176994 -38772
15850 -93209 -7537 132021 -59015 -140566 133892 171146 67978 -80260 -87100 166948 -110797
$$ packed form
15931D46472A25036Q6697d2322k27581A29379P7762b26151I0987J33498c67636
15920a97489G7995q214L405a13606A26171g276j10568K2263B2426c4930A11697
15908A37400e5083A0007h2214I4443c4792j64148A52674N2250l9805b546E4148
15896D2473a65206A70985h6517C6966J17857e5622j80888j89394a62304b2964
15885a32815j9370H8594c59162a03501A89040p5611j4339b36902j5472A35291
15874a83870O7105J3610A43199d3761A43599D8652g6402o3042G0551h279C8310
15862C09336E8625K0916B1093a61988p8330O8957N1622A29310J81007a76994c8772
15850i3209g537A32021e9015q1551A33892L7254F7978h0260o840A66948a10797
$$ plain form
15838 -39715 -21438 -55970 89734 51474 32079 -166472 277715 -134841 -8194 107579 -1308
15826 64725 -214873 29434 25503 -121684 -241137 48528 -504175 -352985 269840 -317051
15815 -15116 -27056 49000 178505 -394779 208142 -77926 -2743 177726 104 -179413 -292338
15804 -292338 -15663 90056 125794 -25860 -21382 -77096 6784 301488 -281818 -180034 -310951
15793 -310951 201546 -97296 18649 79071 -116119 236778 -53285 217078 -81921 129911
15782 -65312 43715 -128651 -1996 -39825 213146 264655 -381473 -163103 -123902 168473 303499
15771 303499 -107226 152922 -88945 68858 -158703 37410 98252 -102047 -45170 194745
15760 112071 148495 -71252 188183 -134118 144055 61267 65125 -26288 145988 43246 -57367
$$ packed form
15838c9715J8277l4532H9734l8260j9395a66472B77715a34841h194A07579a308
15826F4725b14873B9434l931a21684j19453D8528e04175J51190B69840c17051
15815a5116j1940D9000J29505c94779B08142g7926b743A77726A04a79413j12925
15804b92338a5663I0056L5738b5860M478n5714F784K94704b81818J01784j30917
15793c10951B01546i7296A8649O0422a16119B36778e3285B17078h1921A29911
15782f5312D3715a28651a996l7829B13146N1509c81473a63103L9201A68473J35026
15771C03499a07226A52922h8945F8858a58703C7410O0842a02047d5170A94745
15760A12071L6424g1252A88183a34118A44055F1267L858b6288A45988D3246e7367
$$ plain form
15748 -393388 29070 64211 13741 -69233 83184 -9616 -115012 -34683 72535 -184864 -87540
15736 127954 65479 104390 304811 -140227 60024 80695 163806 -149659 -173794 9107 -90234
15724 1273 -158181 235176 37363 209885 -396472 216827 -76174 23033 191441 -175181
15713 67958 -23688 -84829 -119118 706 -132995 -26590 -30731 -232407 239409 -215759 241458
15701 203571 21780 -227116 180945 52910 -88954 -181283 -133357 -88460 -338696 -134557 36254
15689 52196 300167 39130 -17307 -80191 -188523 -102599 234758 -242246 27170 -41081 -376656
15678 -376656 -17521 -76032 -120103 117134 136502 3726 -186372 271436 292787 222288 -49394
15666 171254 126779 -228618 -73714 86873 -260094 278839 269823 -49128 -36545 -111056 314764
$$ packed form
15748c93388B9070L5141A3741f9233H3184i616j05396c4683G2535a84864h7540
15736A27954o2475L8911K00421a40227F0024K0671Q3111a49659k4135I107i0234
15724A273a58181B35176C7363J72522c96472B16827g6174B3033J68408a75181
15713F7958b3688o1141l4289G06a32995b6590m141k01676B39409b15759B41458
15701B03571B1780b27116A80945E2910h8954r2329M7926M4897k50236a34557C6254
15689E2196K47971C9130a7307o2884j08332Q5924B34758b42246B7170d1081l35575
15678c76656a7521n8511m4071A17134J9368C726a86372B71436K1351p0499d9394
15666A71254m4475b28618g3714H6873b60094B78839r016d9128J2583p4511C14764
$$ plain form
15654 133051 329271 25857 -81595 -199557 -139011 77484 31767 235130 -565613 258725
15643 -12487 -66265 -104463 151697 -21690 59310 -50373 76418 259258 -94136 -62822 -909 81230
15630 222707 -334882 -177294 -32814 -132259 3876 -90360 -119615 189529 74287 -59875 -194145
15619 -194145 -108137 -300417 14580 72745 44694 14499 63904 -28488 148333 130244 81025
15608 81025 -84230 -78983 -284388 -737 -190130 17085 275561 -173358 24987 70223 -41157
15596 -78815 -574475 237337 -189046 -68155 -146215 157436 -15757 -137339 129518 135689 -124832
15584 -119114 212789 -131387 -56655 -244468 128774 295434 -200229 7489 -64824 -57574 278053
15572 256994 49014 -7068 -103688 -191727 -157387 -63093 -94278 -73582 133412 56499 145408
$$ packed form
15654A33051J96220B5857h1595j17962O0546G7484C1767K03363e65613B58725
15643a2487n3778l8198A51697b1690E9310e0373G6418J82840i4136L1314i09H1230
15630B22707c34882J57588c2814r9445C876i0360k9255A89529G4287e9875j34270
15619a94145Q6008j92280A4580N8165k8051A4499M9405b8488A48333j8089m9219
15608H1025h4230N247k05405g37j89393A7085K58476a73358B4987M5236d1157
15596g8815m95660B37337a89046f8155p8060A57436a5757j21582A29518O171a24832
15584a19114B12789a31387e6655j87813A28774J66660b00229G489f4824P250B78053
15572B56994D9014g068r6620q8039L4340f3093l1185K0696A33412E6499Q8909
$$ plain form
15561 145408 -219644 80040 394424 173086 -260009 -44479 53124 106177 -104483 2957 -476895
15549 68940 -261002 49693 317685 -256250 248404 137950 125253 -130888 310859 142549
15538 194688 -253575 -17668 145209 -81843 261998 -105625 242108 -25971 -257313 76757
15527 29594 171083 -259071 -242598 8171 99153 -47745 237861 -56723 -101064 255131 168749
15516 168749 -155721 325747 16121 196031 -244046 106760 -42971 219494 278049 458801
15506 458801 335301 300842 246887 171586 114634 170146 225566 371506 447942 257773 539641
15495 539641 -5906 248578 388273 224769 93500 115808 142943 -189660 303546 463432
15485 463432 313721 308105 201878 397465 242125 -244180 -27958 110114 195591 351064
$$ packed form
15561A45408b19644H0040L14384A73086b60009d4479E3124N3053a04483B957d76895
15549F8940b61002D9693K67992b56250B48404j10454j2697a30888C10859A42549
15538A94688b53575a7668A45209h1843B61998a05625B42108b5971k31342G6757
15527B9594J41489b59071J6473H171R0982d7745B37861e6723m4341B55131q6382
15516A68749a55721C25747A6121J79910b44046A06760d2971B19494N8555J80752
15506D58801j23500l4459n3955p5301n6952N5512N5420J45940P6436j90169K81868
15495E39641e906B48578J39695j63504I3500K2308K7135a89660C03546J59886
15485D63432j49711n616j06227J95587j55340b44180b7958A10114Q5477J55473
$$ plain form
15475 351064 744960 641658 868196 537714 377123 160509 49728 -62429 -46395 -64172
15465 -64172 -203067 -95285 64257 -249483 81525 195665 147780 -42131 224941 25769 247407
15454 247407 180963 229333 43209 -105699 -15547 -56045 9101 -132077 -109633 212222 242982
15443 242982 241565 644390 881333 1216012 1141308 747428 160315 418897 84751 72123
15433 72123 -209213 163555 -219271 -3283 -23759 314976 -36879 -67196 -308922 357969 -115953
15421 -178063 161551 -147801 137659 -77608 9640 -57670 133529 138768 403574 -40139 41156
15409 176386 28981 170118 -412118 -69737 -107939 -82933 -27426 375269 326567 -188957 -25904
15397 76603 43079 -8679 -4744 -290006 39066 26242 221840 93026 188523 3263 -25349 141241
$$ packed form
15475C51064L93896j03302K26538l30482j60591A60509D9728f2429J6034j7777
15465f4172j38895i5285F4257b49483H1525J14140m7885d2131B24941B5769K21638
15454B47407o6444M8370D3209a05699a5547m0498I101a32077K2444B12222L0760
15443B42982j417M02825K36943L34679p4704l93880A60315K58582H4751j2628
15433G2123b09213A63555b19271c283k0476C14976c6879l0317k41726C57969a15953
15421a78063A61551a47801A37659g7608I640e7670A33529N239K64806d0139D1156
15409A76386B8981J41137d12118f9737l8202K5006b7426C75269m8702a88957b5904
15397G6603l3524h679L935k85262C9066j2824J95598I3026R5497C263b5349A41241
$$ plain form
15384 143397 133431 340743 140781 131738 102318 -263638 -230815 88044 229311 14629 100079
15373 100079 264983 414806 567686 423735 61394 -104108 -88466 73026 59831 66920 358066
15362 358066 33499 41338 -148931 255108 128182 429640 254401 53876 -80248 174118
15351 -68404 10210 -13834 -48000 -187836 258296 238705 372583 49249 73121 472723 -68354
15339 433972 234672 299554 270586 440982 244789 -230633 378808 140223 282115 540876
15329 540876 96601 -103505 387838 251843 31970 -148349 62283 85764 -147506 158271
15318 58309 142960 285259 130306 -328566 400420 324525 -240115 -6831 51194 118225 125565
15307 125565 294286 459694 408132 80559 -24496 -15512 -205634 374815 101986 -69181 172765
$$ packed form
15384A43397r966K07312A40781r043k9420b63638L2823H8044J41267A4629Q5450
15373A00079J64904J49823J52880j43951F1394a04108J5642G3026j3195P089K91146
15362C58066C3499P839a48931B55108j26926L01458j75239E3876h0248A74118
15351f8404A0210a3834l4166j39836B58296j9591J33878D9249K3872L99602f8354
15339D33972j99300O4882k8968J70396j96193b30633C78808A40223J41892K58761
15329E40876I6601a03505C87838j35995C1970a48349F2283K3481a47506A58271
15318E8309Q4651J42299A30306c28566D00420p5895b40115f831E1194O7031P340
15307A25565J68721J65408n1562H0559b4496Q984j90122C74815A01986f9181A72765
$$ plain form
15295 -9086 -11744 177320 179794 235372 -182329 -51263 346450 98476 -45915 309493 139721
15283 -151469 220682 -64895 180191 76353 87015 198519 -231724 221047 -42264 37369
15272 3124 -164828 -92142 -41689 -157609 102855 252961 -37866 -69892 107964 59380 -30222
15260 81797 -87653 145523 192511 -54610 44421 -6763 325890 84084 -60234 243920 233290
15249 233290 142569 39575 284300 -10674 -56881 590663 735900 1216878 2576435 1332748
15239 1332748 1759408 1636730 376538 277469 -86895 269016 -4317 -104920 67404 156464
15229 156464 -197881 20595 20025 -522422 -23762 459571 364712 -209742 13723 18481 55659
15218 55659 467262 134465 -361338 -196517 -1195 -201600 -61557 -88925 -30832 229504 107958
$$ packed form
15295i086k658A77320K474N5578a82329e1263C46450I8476d5915C09493A39721
15283a51469B20682f4895A80191G6353J0662J11504b31724B21047d2264C7369
15272C124a64828P2686d1689j15920A02855J50106c7866l2026A07964m8584c0222
15260H1797h7653A45523M6988e4610D4421f763C25890H4084f0234B43920j0630
15249B33290r0721C9575K44725a0674m6207E90663J45237M80978J359557j243687
15239A332748M26660j22678C76538r9069h6895B69016d317j00603F7404Q9060
15229A56464a97881B0595n70e22422b3762D59571r4859b09742A3723M758L7178
15218E5659M11603A34465c61338J64821a195k00405f1557k7368c0832B29504A07958
$$ plain form
15206 248144 496370 37800 92097 -96187 -12162 47101 -132610 -118811 31481 22387 224856
15195 224856 61862 210474 -134022 -281913 201277 -88913 84773 -446610 -143631 464797
15184 204699 189100 229190 167035 26900 -78387 -19088 56471 268603 572020 -273084 -158240
15173 -158240 150698 -153099 -57966 98694 131019 163464 18355 108908 2187 506668 281940
15162 281940 175646 -137494 -157265 238643 -10757 310388 137343 590935 96063 135497
15152 135497 18035 214486 -133853 -57721 295964 131424 117939 198219 121496 -12742 179318
15140 21000 -176406 98880 266698 137306 323954 -94606 113162 203673 208673 283747 -386557
15128 91274 117861 -50780 324457 139522 26954 32429 95159 267672 215941 366414 422346
$$ packed form
15206B48144K48226C7800N4297i6187a2162D7101a32610J3799C1481r094K02469
15195B24856F1862J48612a34022j47891B01277h8913H4773d46610a43631D64797
15184B04699j5599M0090o2155B6900g8387a9088E6471K12132L03417b73084J14844
15173a58240A50698a53099e7966I8694L2325L2445A8355R0553B187N04481k24728
15162B81940j06294a37494j9771B38643a0757C10388A37343M53592I6063L9434
15152A35497A8035J96451a33853e7721B95964A31424j3485Q0280p6723a2742A79318
15140B1000a76406I8880J67818j29392J86648i4606A13162R0511N000P5074c86557
15128I1274K6587e0780C24457A39522B6954N475O2730J72513n1731J50473N5932
$$ plain form
15117 422346 392946 454861 80432 76831 80463 168649 345707 47284 310409 314849 231493 -59588
15104 285673 164045 33068 -80590 267878 433862 127891 130305 802 156281 119037 -209192
15092 44287 52528 -88123 451478 -207679 269023 348147 114350 -208956 341239 377168 193459
15081 193459 -137283 220063 -177959 393961 90028 30391 -97980 330369 357899 32609
15070 -294217 95190 190484 93554 308401 237631 53265 92185 413769 439692 -19242 189962
15058 473728 565399 -76740 335033 -215249 534562 289536 345370 823280 430150 179320
15047 368695 370397 520203 98229 220356 619622 299477 590032 516848 409018 -1305 307877
15035 66699 475961 149717 672009 242225 910669 571543 829901 569272 1001601 786845
$$ packed form
15117D22346k9400O1915H0432l601L632Q8186J77058D7284K63125M440q3356e9588
15104B85673j21628C3068h0590B67878J65984A27891K414H02J55479l7244b09192
15092D4287Q241h8123D51478b07679B69023P9124A14350b08956C41239L5929j83709
15081A93459a37283B20063a77959C93961I0028C0391i7980C30369K7530C2609
15070b94217I5190R5294I3554K14847p0770E3265L8920L21584K5923a9242A89962
15058D73728R1671g6740C35033b15249E34562k45026N5834M77910l93130A79320
15047C68695J702J49806I8229J22127L99266B99477K90555p3184j07830a305C07877
15035F6699M09262A49717N22292B42225O68444l39126K58358k60629M32329k14756
$$ plain form
15025 786845 229093 488489 741109 463446 368107 232548 553486 552234 783619 170921
15014 567652 169370 963458 328990 232241 377472 355076 605397 518707 338924 157701
15003 134926 247081 521807 419281 702694 411434 353937 442726 410846 374275 559772
14993 559772 561423 447250 253411 547530 374649 528000 542847 449237 497529 684311
14983 684311 695419 816355 991983 866373 923809 383927 548770 106183 751926 646669
14973 646669 248815 484896 357478 360708 584807 367226 347879 297822 712823 35077
14962 361577 222863 448023 585260 457503 463965 372955 476374 198743 601219 293135
14951 577192 369104 585371 423271 380701 141953 410029 575500 684441 714281 543165
$$ packed form
15025G86845B29093K59396K52620k77663r5339j35559L20938j252K31385A70921
15014E67652A69370P94088C28990r6749J45231k2396K50321q6690j79783A57701
15003A34926J12155K74726j02526K83413k91260n7497Q8789l1880l6571J85497
14993E59772J651j14173j93839K94119j72881J53351J4847r3610M8292J86782
14983F84311J1108J20936J75628j25610N7436C83927J64843A06183O45743j05257
14973F46669B48815K36081j27418L230K24099k17581j9347n0057M15001C5077
14962C61577j38714K25160J37237j27757O462r1010J03419A98743M02476B93135
14951E77192k08088K16267j62100m2570A41953K68076J65471J08941K9840j71116
$$ plain form
14941 543165 706815 761685 452629 619055 859047 669816 706337 472919 454709 1116423
14931 1116423 1040875 874201 1058232 875786 1532133 1712028 1647328 1951372 1495869 1529990
14921 1529990 1223216 1357771 1622659 1988374 2055845 2264268 2133178 1744194 1453142 1376742
14911 1376742 984184 1054144 530491 673207 381978 215405 280364 382059 394266 219620
14901 219620 616627 520609 55115 513997 547301 366035 207961 422466 528766 467515
14891 467515 531474 559865 787576 484537 616460 729114 429095 699479 833140 722480
14881 722480 696696 1115732 969910 1096893 535325 719232 441294 416776 421052 379044
14871 379044 457640 113199 606566 531527 422748 654038 650771 566973 632544 661545 573697
$$ packed form
14941E43165J63650N4870l09056J66426K39992j89231L6521k33418j8210O61714
14931A116423p5548j66674J84031j82446O56347J79895o4700L04044m55503L4121
14921A529990l06774J34555K64888L65715O7471K08423j31090l88984k91052p6400
14911A376742l92558O9960n23653J42716k91229j66573O4959J01695J2207j74646
14901B19620L97007r6018E5115M58882L3304j81266j58074K14505J06300o1251
14891D67515O3959K8391K27711l03039J31923J12654l00019K70384J33661j10660
14881G22480k5784M19036j45822J26983E35325J83907k77938k4518M276m2008
14871C79044P8596A13199M93367p5039j08779K31290l267q3798O5571K9001q7848
$$ plain form
14860 573697 247001 714956 469151 234175 499202 572537 518298 620580 771841 421057
14850 421057 326645 682544 390374 614621 629443 823052 887400 871775 794037 1069386
14840 1069386 1218433 1357196 971266 781679 915516 896603 652431 583309 644080 399241
14830 399241 595585 496554 748290 584063 243261 664469 629890 557102 745509 755517
14820 755517 676652 625073 617756 626262 872810 610871 834265 648489 653805 732518 711623
14809 711623 701231 747378 930937 931568 1080921 938728 1038221 919067 950374 791090 728805
14798 728805 777045 500675 349715 297337 434791 772231 640472 538983 863706 503286
14788 503286 439200 575700 597582 751501 975312 730742 915012 731097 845193 438976
$$ packed form
14860E73697B47001M67955k45805B34175K65027P3335n4239J02282J51261l50784
14850D21057r4412L55899k92170K24247J4822J93609O4348j5625p7738K75349
14840A069386J49047J38763l85930j89587J33837j8913k44172o9122O0771k44839
14830C99241J96344r9031K51736j64227B43261M21208l4579p2788J88407J0008
14820G55517p8865n1579p317Q506K46548k61939K23394j85776N316P8713k0895
14809G11623j0392M6147J83559O31J49353j42193R9493j19154L1307j59284o2285
14798G28805M8240k76370j50960n2378J37454L37440j31759j01489L24723l60420
14788E03286o4086J36500K1882J53919K23811k44570J84270j83915J14096m06217
$$ plain form
14778 438976 837779 761833 838750 1045432 583446 912851 858810 623115 448199 426811
14768 426811 898339 633898 475824 515795 798583 510453 692320 918389 444761 583042
14758 583042 540982 531235 839978 431276 538782 345506 489235 717062 687805 737344
14748 737344 570066 408334 860108 856493 806816 701340 720926 687320 708533 803877 735573
14737 735573 817465 673425 729454 821919 824282 890296 1315682 1279046 1582641 1436085 1915398
14726 1915398 1695573 1808185 1353281 1295095 814830 896434 844285 843017 958628 980632
14716 980632 1067839 968998 844459 869288 1018982 899816 1072619 941824 807298 1246096
14706 1246096 949112 1373892 1193126 1353632 1821036 2077914 2455176 2161453 1467354
$$ packed form
14778D38976L98803p5946P6917K06682m61986L29405n4041k35695j74916k1388
14768D26811M71528k64441j58074L9971K82788k88130J81867K26069D44761J38281
14758E83042m2060r747L08743m08702J07506j93276J43729K27827k9257M9539
14748G37344j67278j61732M51774l615m9677j05476J9586l3606K1213R5344o8304
14737G35573Q1892j44040N6029R2465K363O6014M25386l6636L03595j46556M79313
14726A915398k19825J12612m54904n8186m80265Q1604n2149j268J15611K2004
14716I80632Q7207r8841j24539K4829J49694j19166J72803j30795j34526M38798
14706A246096k96984M24780j80766J60506M67404K56878L77262k93723o94099
$$ plain form
14697 1467354 1297288 1223788 1123719 1229590 639862 1119300 818994 950827 778920 1182906
14687 1182906 928212 899854 871396 1055271 679861 848360 900976 1187385 953483 888385
14677 888385 1073742 939025 838176 925909 1092744 844604 1291804 934140 954361 1198248
14667 1198248 723422 1261271 1209155 706754 1110104 952271 963595 727968 1160605 1060465
14657 1060465 1298768 1394387 947369 1147100 1478215 1493869 1469854 1442740 1003750 1315511
14647 1315511 1081540 891190 1276125 1299424 1136020 1072648 1214523 1060864 1211177 1089813
14637 1089813 1205254 1482865 1348650 1229902 1347666 1923458 1214745 1309877 1294024 1335535
14627 1335535 1187526 1213718 1617783 1556286 1195851 1071394 1340922 1575708 1207908 1476269
$$ packed form
14697A467354j70066p3500j00069J05871n89728M79438l00306J31833j71907M03986
14687A182906k54694k8358k8458J83875l75410J68499N2616K86409k33902o5098
14677H88385J85357j34717j00849Q7733J66835k48140M47200l57664K0221K43887
14667A198248m74826N37849n2116n02401M03350j57833J1324k35627M32637j00140
14657A060465K38303R5619m47018J99731L31115J5654k4015k7114m38990L11761
14647A315511k33971j90350L84935K3299j63404o3372J41875j53659J50313j21364
14637A089813J15441K77611j34215j18748J17764N75792p08713R5132j5853M1511
14627A335535j48009K6192M04065o1497l60435j24457K69528K34786l67800K68361
$$ plain form
14617 1476269 1521136 1330786 1358487 1580811 1286692 1404935 1274584 1339198 1766753 1574701
14607 1574701 1428419 1567607 1514286 1689345 1731777 1373753 1627547 1761036 1643265 1870589
14597 1870589 1973328 1521225 1668034 2065297 1731257 1915657 1823180 1828173 1903439 2315228
14587 2315228 2036436 1814288 1583429 1599130 1736541 1834467 2286108 2321729 1799862 1946140
14577 1946140 2074590 2202386 2122811 1910310 2289528 2352802 2286040 2069328 2126090 2248123
14567 2248123 2487952 2627446 2386276 2412574 2363113 2674294 2731588 2624535 3035039 3249357
14557 3249357 3099685 3252906 3510909 3771382 3775420 4175444 4918766 5425672 7369413 11038964
14547 11038964 19494328 39811272 50303885 17475917 6519830 3612510 2778973 2489469
$$ packed form
14617A476269M4867j90350K7701K22324k94119J18243j30351O4614M27555j92052
14607A574701j46282J39188n3321J75059M2432l58024K53794J33489j17771K27324
14597A870589J02739m52103J46809L97263l34040J84400r2477M993P5266M11789
14587B315228k78792k22148k30859J5701J37411R7926M51641L5621n21867J46278
14577A946140J28450J27796p9575k12501L79218O3274o6762k16712N6762J22033
14567B248123K39829J39494k41170K6298m9461L11181N7294j07053M10504K14318
14557C249357j49672J53221K58003K60473M038M00024P43322N06906J943741L669551
14547A1038964Q455364K0316944J0492613A7475917F519830k907320q33537k89504
$$ plain form
14539 2489469 2546826 3436109 5550180 4525939 2547587 1821864 2176217 2182026 2287770
14530 2287770 2178089 2036495 2375658 2411747 2244213 2325409 2518866 2037556 2484990 2576983
14520 2576983 2308879 2619430 2487945 2833865 2455195 2378509 2686576 2960569 2510214 2773576
14510 2773576 2910266 3135667 2637920 2858937 3374726 3183625 3171899 3076788 3180600 3049216
14500 3049216 3164909 3164363 3362832 3398617 3433515 3539652 3582517 3372169 3263251 3723216
14490 3723216 3405026 3206522 3504935 3515715 3001419 3767856 3984040 3565045 3858898 3880304
14480 3880304 3796019 4194033 3884137 4089673 4140332 4239130 4084385 4362028 4241258 4148617
14470 4148617 4424272 4044380 4477866 4166967 4553858 4568760 4836343 5022829 4638951 4908167
$$ packed form
14539B489469N7357Q89283K114071j024241j978352p25723L54353N809J05744
14530B287770j09681j41594L39163L6089j67534Q1196J93457m81310M47434R1993
14520B576983k68104L10551j31485L45920l78670p6686L08067K73993m50355K63362
14510B773576J36690K25401m97747K21017N15789j91101j1726r5111J03812j31384
14500C049216J15693n46J98469L5785L4898J06137M2865k10348j08918M59965
14490C723216l18190j98504K98413J0780n14296P66437K16184m18995K93853K1406
14480C880304q4285L98014l09896K05536N0659R8798j54745K77643j20770r2641
14470D148617K75655l79892M33486l10899L86891J4902K67583J86486l83878K69216
$$ plain form
14460 4908167 4808374 4761534 5021627 5048530 5136573 5242010 4897976 5056718 5235836 5384830
14450 5384830 5708403 5341028 5771438 5586126 5727228 5558719 5690360 5843393 5971563
14441 5971563 6242617 6593525 6528896 6354555 6040418 6801091 6560625 6602500 6627189 6751148
14431 6751148 6924944 7209824 6875645 7195797 7512957 7488115 7385164 7683803 7936323 8307353
14421 8307353 8023028 8431748 8742041 8466287 8433988 8726107 8858106 8576990 8781240 8809258
14411 8809258 9125405 9376402 9708633 9762209 9785223 10005629 10131159 10268313 10681829 10692534
14401 10692534 10514667 10835212 11002100 11237709 11417785 11736318 11585626 11798204 12125801
14392 12125801 12139472 12269148 12632116 13018224 13130510 13298644 13620068 13585675 14356861 14559236
$$ packed form
14460D908167r9793m6840K60093K6903Q8043J05437l44034J58742J79118J48994
14450E384830L23573l67375M30410j85312J41102j68509J31641J53033J28170
14441E971563K71054L50908o4629j74341l14137P60673k40466M1875K4689J23959
14431F751148J73796K84880l34179L20152L17160k4842j02951K98639K52520L71030
14421H307353k84325M08720L10293k75754l2299K92119J31999k81116K04250K8018
14411H809258L16147K50997L32231N3576K3014K20406J25530J37154M13516J0705
14401A0692534j77867L20545J66888K35609J80076L18533j50692K12578L27597
14392A2125801J3671J29676L62968L86108J12286J68134L21424l4393P71186K02375
$$ plain form
14382 14559236 14939675 15060685 15431423 15495288 15650994 16339193 16441057 16851502 17025875
14373 17025875 17096193 17463358 18169927 18521286 18846518 19231298 19600185 20350056 20791507
14364 20791507 21190653 21316728 21848131 22545940 22446950 23060348 23651800 24063542 24750324
14355 24750324 25076484 25731859 26434736 27236634 27731488 28575087 29114981 30203625 30477159
14346 30477159 31309164 32332644 33102975 34151224 34719089 35880910 36753910 38235839 39052480
14337 39052480 40282641 41369765 42419842 43685878 45180158 46468373 47804152 49077281
14329 49077281 50959880 52365416 54252193 56269269 57899970 59635361 61928473 63973819
14321 63973819 66079807 68530853 71309990 73601058 76317737 78958311 81929876 84997453
$$ packed form
14382A4559236L80439J21010L70738O3865J55706O88199J01864M10445J74373
14373A7025875P0318L67165P06569L51359L25232L84780L68887P49871M41451
14364B0791507L99146J26075N31403O97809r8990O13398N91452M11742O86782
14355B4750324L26160O55375P02877Q01898M94854Q43599N39894J088644K73534
14346C0477159Q32005J023480P70331J048249N67865J161821Q73000J481929Q16641
14337C9052480J230161J087124J050077J266036J494280J288215J335779J273129
14329D9077281J882599J405536J886777K017076J630701J735391K293112K045346
14321F3973819K105988K451046K779137K291068K716679K640574K971565L067577
$$ plain form
14313 84997453 88288234 91792217 95481015 99348734 103746408 107777772 112593369 117467449
14305 117467449 122525760 128046001 133791794 139843162 146295738 153132064 159798100 167476084
14297 167476084 175589566 183816249 192844303 202103093 212119525 222749291 233613766
14290 233613766 244783562 257166002 269957273 283340684 297228439 311252248 325944576
14283 325944576 340274328 355372399 370820084 385607352 400828000 415041011 428559263
14276 428559263 441057450 452269919 461471688 467183078 469287366 469259464 469120586 470704020
14268 470704020 467431323 460715228 453213143 443234660 431286521 418070399 402919185
14261 402919185 387288063 371127756 354770189 338410008 322351053 306800019 291546344
$$ packed form
14313H4997453L290781L503983L688798L867719M397674M031364M815597M874080
14305A17467449N058311N520241N745793O051368O452576O836326O666036P677984
14297A67476084Q113482Q226683R028054R258790J0016432J0629766J0864475
14290B33613766J1169796J2382440J2791271J3383411J3887755J4023809J4692328
14283C25944576J4329752J5098071J5447685J4787268J5220648J4213011J3518252
14276D28559263J2498187J1212469R201769N711390K104288k7902j38878J583434
14268D70704020l272697o716095p502085r978483j1948139j3216122j5151214
14261D02919185j5631122j6160307j6357567j6360181j6058955j5551034j5253675
$$ plain form
14254 291546344 276684960 262871433 249454430 236734970 224617560 213105605 203013437
14247 203013437 194350611 184484059 175190547 167101065 158999236 151233275 144458720 137610992
14239 137610992 131358677 125707208 120541749 115070721 109859844 105296616 100866059 96913416
14231 96913416 93562626 89415399 85816729 82513842 79324599 76451597 73545975 70522447
14223 70522447 68329597 65786148 63567867 61798762 59661212 57557922 55473706 53637252
14215 53637252 52094838 50495574 49769595 47939328 46098303 44466614 43298670 42172326
14207 42172326 41745136 40491155 38771818 37960230 36712852 35691875 34929041 34226814 33285160
14198 33285160 31918083 31537362 30643982 29818557 29388034 28823634 27929365 27010227 26334232
$$ packed form
14254B91546344j4861384j3813527j3417003j2719460j2117410j1511955j0092168
14247B03013437q662826r866552r293512q089482q101829p765961o774555o847728
14239A37610992o252315n651469n165459n471028n210877m563228m430557l952643
14231I6913416l350790m147227l598670l302887l189243k873002k905622l023528
14223G0522447k192850k543449k218281j769105k137550k103290k084216j836454
14215E3637252j542414j599264p25979j830267j841025j631689j167944j126344
14207D2172326m27190j253981j719337q11588j247378j020977p62834p02227r41654
14198C3285160j367077l80721q93380q25425m30523n64400q94269r19138o75995
$$ plain form
14189 26334232 25449585 25293787 24829312 24082538 23258993 22612892 22580995 21888289 21622122
14180 21622122 20922252 20558348 20563113 19693161 19388431 18991329 18824767 18325070 17765621 17296809
14170 17296809 17390766 16971395 16422443 16466697 15910134 15534441 15394469 15248633 15106840 14574760
14160 14574760 14460918 14382692 13861492 13776475 13181023 13157163 12948975 12936024 12677205 12290319
14150 12290319 12327176 12317115 11711048 11704482 11790701 10862314 10930242 10554898 10821936 10623432
14140 10623432 10331505 10324183 10030049 10014745 9524892 9360243 9446940 9214203 9196504 8968378
14130 8968378 8927644 8537977 8842126 8592677 8787412 8388458 8432700 8283903 8128288 7707070
14120 7707070 7654180 7666809 7357120 7626756 7424307 7279369 7405686 6799031 7094315 7169150
$$ packed form
14189B6334232q84647j55798m64475p46774q23545o46101l1897o92706k66167
14180B1622122o99870l63904M765q69952l04730l97102j66562m99697n59449m68812
14170A7296809R3957m19371n48952M4254n56563l75693j39972j45836j41793n32080
14160A4574760j13842p8226n21200q5017n95452k3860k08188j2951k58819l86886
14150A2290319L6857j0061o06067o566Q6219r28387O7928l75344K67038j98504
14140A0623432k91927p322k94134j5304m89853j64649Q6697k32737j7699k28126
14130H968378m0734l89667L04149k49449J94735l98954M4242j48797j55615m21218
14120G707070n2890J2629l09689K69636k02449j44938J26317o06655K95284P4835
$$ plain form
14110 7169150 6900339 6922979 6524420 6703243 6408583 6695136 6418565 6158098 6283291 6155464
14100 6155464 6266235 6079463 5599690 5734904 5845225 5785507 5601766 5589793 5946929 5705755
14090 5705755 5257655 5447496 5563132 5322031 5341004 5258212 5017572 5403489 4876836 4708353
14080 4708353 5120642 4630062 4734866 4700581 4743829 4820927 4555490 4652373 4297137 4362317
14070 4362317 4107756 4438501 4006441 4237946 4390192 4267483 4383458 4017678 4181047
14061 4181047 4167866 4172531 4234531 3807485 3919183 3928302 3818736 3564046 3462915 3497321 3396701
14050 3396701 3559505 3633683 3344071 3262161 3405266 3485988 3350786 3195689 3421811 3231576
14040 3231576 3495398 3010959 3176107 3081352 2993294 3284423 3228069 2917217 3385704 3362983
$$ packed form
14110G169150k68811K2640l98559J78823k94660K86553k76571k60467J25193j27827
14100F155464J10771j86772m79773J35214J10321n9718j83741j1973L57136k41174
14090E705755m48100J89841J15636k41101J8973q2792k40640L85917n26653j68483
14080D708353M12289m90580J04804l4285M3248P7098k65437R6883l55236O5180
14070D362317k54561L30745m32060K31505J52246j22709J15975l65780J63369
14061D181047j3181M665O2000m27046J11698R119j09566k54690j01131L4406j00620
14050C396701J62804P4178k89612q1910J43105Q0722j35202j55097K26122j90235
14040C231576K63822m84439J65148r4755q8058K91129n6354l10852M68487k2721
$$ plain form
14030 3362983 3073339 3163438 3150646 2587292 2928645 2758499 2944543 3233645 2969693 2642184
14020 2642184 2884378 2799618 2659469 2909043 2341602 2472318 2828826 2197359 2333374 2397778
14010 2397778 2422445 2502602 2258943 2303446 2349016 2260257 2269644 2502164 2360843 2013377 2053138
13999 2053138 2408903 2367216 1967073 2080539 2091803 2007442 2276143 1968104 2695558 2544307
13989 2544307 3593063 6463007 12265674 29993130 54063888 26597143 12146108 7217359
13981 7217359 5485667 4749818 3773015 3365121 3273726 3137604 3105533 3002740 2584029 2515950
13971 2515950 2861750 2463456 2249471 2205401 2004536 2462137 2307101 2490750 2545158 2562584
13961 2562584 2392207 2365196 1769828 1849700 2236659 2135183 1912163 2019090 1857500 2168475
$$ packed form
14030C362983k89644R0099j2792n63354L41353j70146J86044K89102k63952l27509
14020B642184K42194q4760j40149K49574n67441J30716L56508o31467J36015O4404
14010B397778K4667Q0157k43659M4503M5570q8759R387K32520j41321l47466L9761
13999B053138L55765m1687m00143J13466J1264q4361K68701l08039P27454j51251
13989B544307J048756K869944N802667J7727456K4070758B6597143A2146108m928749
13981G217359j731692p35849r76803m07894r1395j36122l2071j02793m18711o8079
13971B515950L45800l98294k13985m4070k00865M57601j55036J83649N4408J7426
13961B562584j70377k7011n95368P9872L86959j01476k23020J06927j61590L10975
$$ plain form
13951 2168475 2250749 1685156 2065010 1994249 1889541 1763509 1777630 1686145 1581519 1875248
13941 1875248 1706963 1813152 1682399 1479560 1862811 1831315 1900261 1668992 1792160 1507146
13931 1507146 1777403 1446007 1503931 1520554 1869936 1767791 1949779 1504097 1539015 1333494
13921 1333494 1545305 1537019 1721600 1772383 1340416 1583392 1424341 1488719 1257607 1293133
13911 1293133 1509978 1237610 1321632 1172688 1251271 1228793 1482397 1466720 1454448 1552138
13901 1552138 1687471 1235921 1434560 1161788 1315078 1491353 1160655 1037455 1409804
13892 1409804 838215 1178422 1193169 1060090 1322818 1355820 1570688 1368841 799367 1255870
13882 1255870 1104706 1037200 1386192 1317015 1235730 1013379 1534550 1062930 1317068 1121193
$$ packed form
13951B168475Q2274n65593L79854p0761j04708j26032J4121r1485j04626K93729
13941A875248j68285J06189j30753k02839L83251l1496O8946k31269J23168k85014
13931A507146K70257l31396N7924J6623L49382j02145J81988m45682L4918k05521
13921A333494K11811q286J84581N0783m31967K42976j59051O4378k31112L5526
13911A293133K16845k72368Q4022j48944P8583k2478K53604j5677j2272R7690
13901A552138J35333m51550J98639k72772J53290J76275l30698j23200L72349
13892A409804n71589L40207J4747j33079K62728L3002K14868k01847n69474M56503
13882A255870j51164o7506L48992o9177q1285k22351N21171m71620K54138j95875
$$ plain form
13872 1121193 1149651 1340402 1152593 922084 869698 1039485 711808 1478641 972364 1154036
13862 1154036 1317565 1206216 1362544 1156711 1133987 981276 740299 947581 1082688 1156351
13852 1156351 865474 1256544 907486 1206938 1261992 1151205 998562 751053 1150152 1104013
13842 1104013 812003 869656 862652 1057745 922851 856009 841062 750301 988349 1053579 816708
13831 816708 1147466 1168720 710028 1194682 1010860 1029233 799003 1003060 787207 936331
13821 936331 876932 516831 819775 849184 686599 1042001 1108272 755662 1055462 897784
13811 897784 1069402 1277398 874842 732913 697101 776409 1047114 802123 870563 748376
13801 748376 800303 941644 470816 654857 799782 858958 936484 839610 703778 1166572
$$ packed form
13872A121193K8458J90751j87809k30509n2386J69787l27677P66833n06277J81672
13862A154036J63529j11349J56328k05833k2724j52711k40977K07282J35107P3663
13852A156351k90877L91070l49058K99452N5054j10787j52643k47509L99099m6139
13842A104013k92010N7653p004J95093j34894o6842j4947r0761K38048O5230k36871
13831H16708L30758K1254m58692M84654j83822J8373k30230K04057k15853J49124
13821I36331n9399l60101L02944K9409j62585L55402O6271l52610K99800j57678
13811H97784J71618K07996m02556j41929l5812P9308K70705k44991O8440j22187
13801G48376N1927J41341D70816J84041J44925N9176P7526r6874j35832M62794
$$ plain form
13791 1166572 847324 1120684 784252 286128 433323 574121 540822 793256 1031667 933306
13781 933306 863156 835163 717168 412980 608425 834658 761365 499087 781650 720314
13771 720314 771625 562215 979604 783857 674661 720924 849112 329862 526227 624604
13761 624604 274316 841640 806763 504831 657429 184082 424892 557286 809819 641185
13751 641185 659056 743710 540235 712420 403127 587301 469528 490948 723517 883937
13741 883937 754699 573117 587020 278418 487201 856410 695243 612077 507275 843415
13731 843415 532339 566086 327598 707171 858087 531553 833064 446725 808651 443548
13721 443548 761233 583738 599317 508747 480824 436893 482747 688051 403843 566229
$$ packed form
13791A166572l19248K73360l36432B86128J47195J40798l3299K52434K38411r8361
13781I33306p0150k7993j17995l04188J95445K26233p3293k62278K82563o1336
13771G20314N1311k09410M17389j95747j09196M6263J28188C29862J96365R8377
13761F24604B74316N67324l4877l01932J52598A84082K40810J32394K52533j68634
13751F41185J7871Q4654k03475J72185l09293J84174j17773K1420K32569J60420
13741H83937j29238j81582J3903B78418K08783L69209j61167q3166j04802L36140
13731H43415l11076L3747k38488L79573J50916l26534L01511l86339L61926l65103
13721D43548L17685j77495J5579r0570k7923m3931M5854K05304k84208J62386
$$ plain form
13711 566229 618065 501653 467631 653481 638860 568255 453316 455156 349216 437254 597289
13700 597289 527097 622065 637154 429188 719742 409075 464412 438358 461865 241044 435877
13689 435877 604974 295064 372231 287384 624951 437398 565963 586421 633256 724580
13679 724580 467913 657889 242839 613933 523740 441260 215858 464956 603629 526520
13669 526520 178999 655149 538290 463735 425891 636262 176565 314591 407392 568070
13659 568070 582425 289160 442751 260419 505446 269346 427914 385136 400868 452023
13649 452023 427731 116328 208572 314023 197284 509069 286845 205203 494803 476213
13639 476213 106603 383304 486217 456247 467525 505622 544791 247500 201384 460001
$$ packed form
13711E66229N1836j16412l4022J85850j4621p0605j14939J840j05940Q8038J60035
13700E97289p0192R4968J5089k07966K90554l10667N5337k6054K3507k20821J94833
13689D35877J69097B95064P7167q4847L37567j87553J28565K0458M6835R1324
13679G24580k56667J89976B42839L71094r0193q2480B15858K49098J38673p7109
13669E26520A78999M76150j16859p4555l7844K10371A76565J38026R2801J60678
13659E68070J4355B89160J53591j82332K45027k36100J58568m2778J5732N1155
13649D52023k4292A16328R2244J05451j16739L11785k22224q1642K89600j8590
13639D76213A06603K76701J02913k9970J1278L8097L9169B47500m6116K58617
$$ plain form
13629 460001 765716 860357 289239 314387 320130 554487 460147 178843 397776 374103 202635
13618 202635 682138 207452 498201 300261 262668 451147 268275 67461 374097 360239
13608 360239 -140926 224064 226115 420739 546977 284410 441210 472497 310159 199422
13598 199422 -95229 518277 426595 186460 268304 359584 134966 449453 695436 397544
13588 397544 315194 144329 417952 207712 353994 316368 -48669 239912 412680 566711
13578 566711 128560 -62966 370446 655443 344820 336745 148399 304080 916908 91102
13567 743758 196651 593133 231013 278525 225953 659992 341662 478674 29355 334761
13557 334761 242137 131956 127855 401791 271095 235978 450400 300516 547527 490615
$$ packed form
13629D60001L05715R4641B89239K5148N743K34357r4340A78843K18933k3673j71468
13618B02635M79503B07452K90749j97940l7593J88479j82872F7461L06636j3858
13608C60239a40926B24064K051J94624J26238k62567J56800L1287j62338j10737
13598A99422i5229E18277r1682A86460Q1844R1280A34966L14487K45983k97892
13588C97544q2350A44329K73623B07712J46282l7626d8669B39912J72768J54031
13578E66711A28560f2966C70446K84997l10623q075A48399J55681O12828I1102
13567G43758A96651L96482B31013M7512n2572M34039l18330J37012B9355L05406
13557C34761r2624j10181m101K73936j30696l5117K14422j49884K47011n6912
$$ plain form
13547 490615 445831 176648 83858 274891 148502 339174 139820 222286 240065 -131545
13536 284871 286835 266675 382764 348405 342759 403229 215935 308073 217190 142588 203016
13525 203016 327500 277474 239593 335639 406566 293014 638629 535151 46113 357759
13515 357759 514842 307691 542622 561783 167628 487141 404618 333982 208475 -376787
13504 147823 276455 231327 273219 249890 -337843 37985 120757 7833 301530 -182977 146919
13492 287579 294331 166268 293357 21812 469207 136548 1910 351079 185980 359638
13482 359638 486877 315887 214407 397606 274677 270901 291705 343804 388963 172443
13471 125419 -45434 314870 237673 192807 276550 593769 235823 481362 450722 195106
$$ packed form
13547D90615m4784A76648H3858J91033j26389J90672A39820Q2466J7779a31545
13536B84871J964k0160J16089l4359n646O0470j87294R2138r0883p4602O0428
13525B03016J24484n0026l7881R6046P0927j13552L45615j03478D6113L11646
13515C57759J57083k07151K34931J9161A67628L19513q2523p0636j25507c76787
13504A47823J28632m5128M1892k3329c37843C7985Q2772G833K93697a82977A46919
13492B87579O752j28063J27089B1812M47395A36548A910L49169j65099J73658
13482C59638J27239j70990j01480J83199j22929l776K0804N2099M5159A72443
13471A25419d5434C14870p7197m4866Q3743L17219B35823K45539l0640A95106
$$ plain form
13460 296512 206751 269296 208583 234733 208598 259687 175694 256728 39643 64248 432062
13449 432062 196632 353935 30878 365058 404544 156460 375808 84291 62493 23413
13438 111710 -60873 505032 194724 517401 288987 75599 336636 262389 442628 137628
13427 350947 12215 246997 169947 438 204825 49015 -38786 82938 286246 263505 -199105
13415 -31177 453930 260896 -26299 730599 227719 2697 -175402 184411 34615 230079
13405 230079 73354 90067 235173 165743 6271 286928 -84702 36393 -8750 162930 298538
13394 298538 151661 262313 -186034 392660 197086 496198 236781 182314 387799 377420
13384 377420 -63661 75707 -128107 -44486 81824 153051 230357 77003 204133 256468 219085
$$ packed form
13460B96512q9761O2545o0713K6150k6135N1089q3993Q1034C9643K4605L67814
13449D32062A96632J57303C0878L34180L9486A56460K19348H4291k1798B3413
13438A11710f0873E05032A94724L22677k28414G5599K61037p4247J80239A37628
13427C50947A2215K34782p7050D38K04387D9015c8786H2938K03308k2741a99105
13415c1177D53930j93034b6299G30599B27719B697a75402A84411C4615J95464
13405B30079G3354J6713J45106o9430F271K80657h4702C6393h750A62930J35608
13394B98538j46877J10652a86034C92660j95574K99112B36781n4467K05485j0379
13384C77420f3661G5707a28107d4486H1824P1227P7306G7003J27130N2335l7383
$$ plain form
13373 219085 238173 490080 -56310 296285 123756 355185 88123 299284 279908 307034
13363 307034 -73678 198042 411293 397571 101800 77435 252937 -94722 337929 130173
13352 223557 322351 72891 198672 46868 209484 -220178 129270 121924 314709 544230
13342 544230 644934 123127 364752 449559 396186 218027 40431 303511 121918 403202
13332 403202 131897 516770 241825 -23087 297737 70841 427991 340855 78758 254651
13322 254651 14054 -3718 322301 359910 80415 109916 199567 297244 219416 301183 371995
13311 371995 -4211 523583 323849 232357 99627 63068 252306 124363 -42686 291023 228486
13300 228486 319643 358594 11439 99755 140263 257042 370961 273907 10769 213864 192878
$$ packed form
13373B19085J9088K51907e6310B96285A23756K31429H8123K11161j9376K7126
13363C07034g3678A98042K13251j3722A01800k4365J75502i4722C37929A30173
13352B23557R8794G2891J25781D6868J62616b20178A29270p346J92785K29521
13342E44230J00704A23127K41625Q4807n3373j78159D0431K63080A21918K81284
13332D03202A31897L84873B41825b3087B97737G0841L57150q7136G8758J75893
13322B54651A4054c718C22301L7609H0415K9501Q9651R7677p7828Q1767P0812
13311C71995d211E23583j99734r1492I9627l6559J89238A24363d2686B91023o2537
13300B28486R1157L8951A1439Q8316M0508J16779J13919r7054A0769K03095k0986
$$ plain form
13289 192878 186650 10607 272112 132544 345899 79591 300906 7105 234896 52209 133569
13278 133569 187250 -39083 26017 251788 54767 182982 202269 274001 66022 -46570 107782
13266 102251 -113580 76220 24172 88040 -215391 194180 158319 386319 -99622 226617
13255 156045 253681 149351 223648 512317 217278 35746 -100899 419567 132477 57571
13244 -77217 377659 59067 -8269 -138072 208047 -127189 -31225 306768 1608 33508 -41673
13232 122522 136482 -92512 157758 7135 108249 155269 265732 211195 409759 292514 110674
13220 -94515 71861 165301 154465 -89021 150071 217258 278949 97974 354795 -33873 96177
13208 252901 356324 185887 53553 89865 122033 339627 167363 254648 -225715 174383
$$ packed form
13289A92878o228A0607K61505A32544K13355G9591K21315G105K27791E2209Q1360
13278A33569N3681c9083B6017K25771E4767J28215J9287P1732F6022d6570A07782
13266A02251a13580G6220B4172O3868b15391A94180l5861K28000i9622B26617
13255A56045R7636j04330P4297K88669B17278C5746a00899D19567A32477E7571
13244g7217C77659E9067h269j29803B08047a27189c1225C06768A608L1900d1673
13232A22522J3960i2512A57758G135J01114M7020J10463n4537J98564j17245A10674
13220i4515G1861R3440j0836h9021A50071O7187O1691I7974K56821c3873I6177
13208B52901J03423j70437E3553L6312L2168K17594A67363Q7285b25715A74383
$$ plain form
13197 141005 45437 -94504 -157151 -18651 146390 520306 -31312 -132 -50726 780356 199364
13185 69215 250115 -97464 18066 294628 -38994 385420 144212 -11239 194696 310816
13175 310816 -151213 -7252 324268 -108223 -86573 24877 119415 307684 200310 47664 -8149
13163 -165743 143730 110008 64437 397454 288360 -132742 77149 304997 -170498 -119524
13153 -119524 120995 191611 -227300 107068 153409 63866 -142170 110061 -208450 226576
13142 -88230 -25158 336312 63794 162108 107532 388044 112885 85041 14646 34040 137143
13131 137143 -180933 191442 -26788 -40776 -234821 89768 163302 255387 362406 57115 -71714
13119 12932 27097 294113 113882 14856 110904 116478 405969 229928 -72285 -298410 -222968
$$ packed form
13197A41005D5437i4504o2647a8651A46390L73916c1312a32n0594G80356A99364
13185F9215J80900i7464A8066K76562c8994C85420A44212a1239A94696J16120
13175C10816a51213g252C24268a08223K1650B4877R4538J88269j07374D7664h149
13163a65743A43730l3722m5571L33017j09094a32742G7149K27848a70498N0974
13153a19524A20995P0616b27300A07068M6341F3866a42170A10061b08450B26576
13142h8230b5158C36312F3794R8314n4576K80512A12885k7844A4646J9394J03103
13131A37143a80933A91442b6788j3988j94045H9768P3534R2085J07019E7115g1714
13119A2932J4165K67016A13882A4856R6048N574K89491j76041g2285k26125P5442
$$ plain form
13108 -222968 251962 124351 -76399 -61556 200814 218583 113745 -113506 -124613 -135779
13098 -135779 -252893 -9600 -33045 57322 153907 177074 -114029 379294 293271 59990 252081
13087 252081 -65230 16249 -192678 -42593 -267457 -192317 132735 83590 224681 -132407
13076 28420 67559 38605 296544 401370 68524 -115911 225606 -64075 -178905 14887 119959
13065 119959 27325 302128 -53436 111163 295711 -32423 34858 107794 131942 141347 300663
13054 300663 94641 195742 201255 -160385 202033 203958 -17035 108978 -91056 118315 -298471
13042 -137385 32171 54287 49198 -181788 -65638 259001 -26933 357426 -333321 229992 145564
13031 145564 240825 124820 79149 312920 -32549 41816 60501 -492693 115594 -45068 -78341
$$ packed form
13108b22968B51962A24351g6399J4843B00814J7769j04838a13506j1107j1166
13098a35779j17114i600k3445E7322R6585K3167a14029C79294q6023E9990J92091
13087B52081f5230A6249a92678d2593k24864P5140A32735m9145J41091a32407
13076B8420L9139k8954K57939J04826F8524a15911B25606f4075j14830A4887J05072
13065A19959B7325K74803e3436A11163J84548c2423C4858P2936K4148R405J59316
13054C00663I4641J01101N513a60385B02033J925a7035A08978i1056A18315b98471
13042a37385C2171K2116n089a81788f5638B59001b6933C57426c33321B29992q4428
13031A45564R5261j16005m5671K33771c2549D1816J8685d92693A15594d5068l3273
$$ plain form
13020 -78341 199601 325142 315811 108085 104386 176263 42629 29779 95183 -3954 -93414 27353
13007 16329 31048 179379 151228 137009 123475 43710 -43920 217655 -76163 -19005 -160469
12996 -160469 -27646 -271688 -217399 -65663 -8044 192525 380468 -21731 143376 27342 -205798
12984 43563 -381123 -68079 109046 -65434 39042 302403 -26916 75720 429137 199205 58080
12972 -65679 -18347 -164245 -433175 -348253 34088 -84942 -150828 -36378 -29802 116647 -103990
12960 169755 71593 109765 -49802 -203585 -123142 244505 25292 200883 117203 110877 -185507
12948 -163177 -22449 -330229 151756 149289 30615 122089 -220593 185149 -102588 -16165 -70547
12937 -70547 194315 136309 179670 -256943 -116931 -198453 189222 145590 -98642 133920 -40789
$$ packed form
13020g8341A99601J25541r331A08085l699P1877D2629j2850O5404c954q9460B7353
13007A6329J4719J48331k8151j4219j3534D3710d3920B17655g6163a9005j41464
12996a60469b7646k44042N4289f5663h044A92525J87943b1731A43376B7342b05798
12984D3563c81123f8079A09046f5434C9042K63361b6916G5720L53417A99205E8080
12972f5679a8347j45898k68930Q4922C4088h4942o5886c6378O576A16647a03990
12960A69755G1593L8172d9802j53783Q0443B44505B5292J75591q3680o326a85507
12948a63177b2449l07780A51756k467C0615R1474b20593A85149a02588a6165n4382
12937g0547A94315n8006M3361b56943a16931q1522A89222m3632i8642A33920d0789
$$ plain form
12925 -66629 -72665 -93846 254573 -98744 206341 156790 55570 315146 -48531 -288247 238570
12913 213938 16063 186270 204467 47595 -44319 42019 -106349 247287 -219665 82446 60016
12902 60016 198156 66992 200347 55518 -139456 -290320 -334528 60738 -187216 129082
12891 127905 229217 -1751 -20332 31193 -95170 -272108 -165906 -9686 40047 149274 -64881
12879 -81415 -11913 -96029 43408 -184999 124492 140485 -24276 76470 211283 54457 170733
12868 170733 -252407 50481 150702 -67988 -200904 -93956 -130183 89849 16877 130372 87310
12857 87310 221260 -62355 -95880 94876 201512 -213638 275533 -227733 -297460 79737 29614
12845 68851 133968 389605 130464 -58119 234278 -435498 -29896 104971 87118 -39325 249159
$$ packed form
12925f6629o036k1181B54573i8744B06341m9551E5570K59576d8531k39716B38570
12913B13938A6063J70207J8197D7595d4319D2019a06349B47287b19665H2446k2430
12902F0016J38140F6992J33355E5518a39456j50864m4208F0738a87216A29082
12891A27905J01312a751j8581C1193i5170j76938J06202i686D0047J09227f4881
12879h1415a1913q4116D3408a84999A24492J5993b4276G6470J34813E4457J16276
12868A70733b52407E0481J00221f7988j32916i3956l6227H9849A6877J13495m3062
12857H7310J33950f2355l3525I4876J06636b13638B75533b27733o9727G9737B9614
12845F8851O5117K55637A30464e8119B34278d35498b9896A04971j7853c9325B49159
$$ plain form
12833 253249 -1681 15455 -81613 -59494 40739 2844 89619 -242605 -143464 17637 123666
12822 123666 -82875 48605 -400945 19672 -134805 -215093 251448 69438 48690 -265367 -406238
12811 -406238 -264369 111434 50833 65921 157890 151446 -87246 29789 139116 -123780 -263853
12800 -263853 -148697 -4835 49072 273196 -123486 92512 -101831 -41450 381387 -37370 -4750
12788 -5726 16651 -27627 217286 28400 -205913 56749 -293025 233483 -523056 -178993 60799
12776 16684 140928 -415827 15991 -28206 -188022 252152 200757 3786 113738 261996 -177361
12764 -164047 -120293 -83988 -141799 233825 -165728 -153007 196910 202311 -134053 150731 -45522
12752 -19323 -356511 -11552 123225 -419665 159631 -284260 -47275 -15856 43277 -293812
$$ packed form
12833B53249a681A5455h1613K2119D0739B844Q6775b42605R9141A7637J06029
12822A23666h2875D8605d00945A9672a34805q0288B51448F9438k0748b65367j40871
12811d06238J41869A11434E0833J5088R1969o444h7246B9789J09327a23780j40073
12800b63853J15156d835D9072K24124a23486I2512a01831d1450C81387c7370d750
12788e726A6651b7627B17286B8400b05913E6749b93025B33483e23056a78993F0799
12776A6684J24244d15827A5991b8206j59816B52152n1395C786J09952J48258a77361
12764a64047M3754L6305n7811B33825a65728J2721A96910N401a34053A50731d5522
12752a9323l37188a1552A23225d19665A59631b84260d7275a5856D3277b93812
$$ plain form
12741 -204423 -293199 -32553 88152 -291 102131 -349343 -159205 28677 206575 212771 239871
12730 239871 44303 -2880 -56156 92906 -59330 113206 -124529 -88894 -209015 124647 -46608
12718 -116030 109996 -61061 -71002 295991 -191615 -118852 -321381 446874 334420 165787
12707 -301032 532510 397359 61399 179386 456708 -264825 145715 -22642 252229 239880
12697 239880 66666 -352465 -113992 -54916 67406 35393 79057 -127230 -320454 198133
12686 -87137 -79945 -168390 -14964 73318 12565 255268 183133 342211 243706 26255 194351
12675 194351 -17847 256671 -87025 -17212 409559 18375 18737 78113 192401 84827 -192858
12663 -8731 -55880 -51357 127681 99198 173080 283940 192392 141949 -97139 69472 -8547 -79843
$$ packed form
12741b04423q8776c2553H8152b91A02131c49343a59205B8677J77898O196K7100
12730B39871D4303b880n3276I2906e9330A13206a24529L5635j20121A24647d6608
12718a16030A09996f1061r941B95991a91615P2763k02529D46874j12454A65787
12707c01032E32510j35151F1399J17987K77322b64825A45715b2642B52229j2349
12697B39880F6666c52465a13992e4916F7406l2013M3664a27230j93224A98133
12686h7137P192q8445a4964G3318A2565K42703p2135J59078r8505B6255J68096
12675A94351a7847B56671h7025a7212D09559A8375L62N9376J14288H4827a92858
12663h731m7149M523A27681k8483P3882J10860r1548n0443i7139F9472h547p1296
$$ plain form
12651 -79843 65774 530217 137842 1670 -136215 249999 297449 -41926 -57026 110618 51019
12639 -273348 42985 -2646 40825 24303 -220544 207648 323814 -15029 -101085 183557 452958
12628 452958 -3118 240140 229190 70349 122683 -53449 209098 388201 234244 198719 -92168
12616 -23650 48724 10326 149139 -67813 208370 -132208 -115293 -22315 148167 -428155 124253
12604 205915 257614 329420 -91588 203851 192091 135812 35466 104391 -249525 98036 -53576
12592 -21166 -211358 335083 280572 242969 120750 84910 142241 -7693 -12221 25812 -43062
12580 137236 -73102 -1503 -99323 55909 131664 262717 -98726 -140183 -12243 16571 -222690
12568 166127 177371 -45257 -319646 -234806 182890 -123920 -13598 -91248 -102882 -31596 -120095
$$ packed form
12651g9843F5774M64443A37842A670a36215B49999M7450d1926j5100A10618E1019
12639b73348D2985b646D0825j6522b20544B07648J16166a5029q6056A83557K69401
12628D52958c118B40140j0950G0349N2334e3449B09098J79103j53957l5525i2168
12616b3650D8724A0326J38813f7813B08370a32208J6915b2315A48167d28155A24253
12604B05915N1699P1806i1588B03851j1760n6279C5466O8925b49525I8036e3576
12592b1166j90192C35083n4511l7603A20750l5840N7331g693m528B5812d3062
12580A37236g3102a503r7820E5909P5755J31053i8726m1457a2243A6571b22690
12568A66127J1244d5257k74389Q4840A82890a23920a3598p7650j1634c1596q8499
$$ plain form
12557 -120095 96249 -104760 -391665 12706 -44269 160284 -145749 -52094 265399 -116123
12546 147425 -92195 176559 -45816 -98211 -486860 -32652 73148 17788 -47729 -3227 195219
12534 -207302 -9524 -77692 -57029 -179072 253086 66367 448923 22760 -396660 -16389 -130684
12523 -130684 -82862 -15705 296391 -51054 44666 141199 217291 430916 -20460 262623 69059
12511 -35020 -121400 -15711 145921 -163226 162987 150948 -117070 139170 -27121 312888
12500 -74564 170664 -62541 -42796 152871 263843 525981 -155147 -133206 -154938 -48292 165885
12488 193045 -12712 305023 6495 342966 -74472 -444150 -230621 -43786 10193 175909 369452
12477 369452 83090 82619 -168334 243110 232054 -8212 193495 17829 -209272 504637 290171
$$ packed form
12557a20095I6249a04760k86905A2706d4269A60284a45749e2094B65399a16123
12546A47425i2195A76559d5816n2395l88649c2652G3148A7788d7729c227A95219
12534b07302i524o8168K0663j22043B53086F6367L82556B2760c96660a6389j14295
12523a30684M7822a5705B96391e1054D4666R6533P6092K13625b0460B62623F9059
12511c5020q6380a5711A45921a63226A62987j2039a17070A39170b7121C12888
12500g4564A70664f2541J9745A52871J10972K62138a55147K1941k1732d8292A65885
12488A93045a2712C05023F495L36471g4472l69678K13529d3786A0193J65716J93543
12477C69452H3090m71a68334B43110j1056h212A93495A7829b09272E04637k14466
$$ plain form
12466 290171 -16372 -34058 -247640 -213313 -326265 116196 39439 -247131 26041 -63258 53727
12454 -54983 -34441 -146798 228050 101267 -101788 -130693 -276337 131625 -360169 31184
12443 86208 40959 14838 258783 48338 -25278 87606 -165586 -201700 25459 87309 -101691
12431 31091 -44665 -151155 -129937 28716 -272272 -129236 30168 44139 161521 -198690 -15550
12419 -169101 23314 109903 -99087 99779 -134311 -13859 -82024 -92250 53804 -304994 -57235
12407 -125113 -215228 -88961 204078 -257389 -343690 -52554 235663 -178597 -75942 181165
12396 -2553 -189726 -353304 238949 -129122 245917 -95819 -354717 -44832 -301782 -115552
12385 137154 7197 101228 -115356 -193482 214605 -87821 -86671 171795 322956 -86369 151021
$$ packed form
12466B90171a6372j7686k13582L4327j12952A16196C9439b47131B6041f3258E3727
12454e4983K0542j12357B28050A01267a01788k8905j45644A31625c60169C1184
12443H6208D0959A4838K43945D8338b5278H7606a65586l6114B5459O1850a01691
12431C1091d4665j06490K1218B8716b72272a29236C0168J3971J17382a98690a5550
12419a69101B3314Q6589i9087I9779a34311a3859o8165j0226E3804c04994e7235
12407a25113r0115h8961B04078b57389q6301e2554B35663a78597g5942A81165
12396b553j87173j63578B38949a29122B45917i5819k58898d4832k56950a15552
12385A37154G197R4031a15356p8126B14605h7821J150A71795J51161h6369A51021
$$ plain form
12373 97921 13242 -134342 143050 -10880 326866 154380 -89200 544141 121291 98626
12363 98626 67933 -161251 -63307 -336712 -91458 -14929 344092 -113581 167877 11963 -311763
12351 -171991 122878 -103975 76495 359147 77588 -134301 149147 -193140 115823 -36577
12340 -244260 131495 189746 193536 -458910 155921 21122 102272 21236 -167216 150645 -22968
12328 309921 -37474 185079 34537 -44004 -104279 21377 88237 352768 67395 301475 337934
12317 337934 94787 92070 -58511 386926 329570 73387 -205440 302824 194224 150831 -38839
12305 192706 21516 -23273 153160 243046 156836 318187 -225870 -51450 279211 -69457 126868
12293 -476023 -101238 -209536 419447 36160 44502 124511 344251 -176060 -123077 134653
$$ packed form
12373I7921A3242a34342A43050a0880C26866A54380h9200E44141A21291k2665
12363I8626l0693a61251f3307k73405i1458a4929C44092a13581A67877A1963c11763
12351a71991A22878a03975G6495K82652G7588a34301A49147a93140A15823c6577
12340b44260A31495N8251L790d58910A55921B1122Q1150B1236a67216A50645b2968
12328C09921c7474A85079C4537d4004o0275B1377O6860K64531F7395K34080L6459
12317C37934I4787k717e8511C86926n7356G3387b05440C02824j08600m3393c8839
12305A92706B1516b3273A53160Q9886q6210J61351b25870e1450B79211f9457A26868
12293d76023a01238j08298D19447C6160Q342Q0009K19740a76060N2983A34653
$$ plain form
12282 186981 20648 -31069 -108292 366846 255969 219566 597089 -93071 233612 78315 252410
12271 252410 -161625 520257 306666 274019 20205 333848 114472 244493 135544 -2635
12260 266382 43814 294566 269875 102294 -110518 380035 319178 -60640 98355 80922 210338
12249 210338 -39800 53290 212187 246413 459533 -122592 167000 -140080 197158 533241
12239 533241 331209 11422 51628 196518 309461 118776 410454 -35672 134060 1804
12228 103726 305768 258281 211865 535365 227738 -84259 -90528 296939 398732 393726 456604
12217 456604 309119 585180 272395 -99824 10956 340664 322089 393200 183106 -55067
12206 105492 316299 345132 178141 162934 306088 320781 -153055 332972 -74640 117128
$$ packed form
12282A86981B0648c1069p7223C66846j10877l6403L77523i3071B33612G8315J74095
12271B52410a61625E20257k13591l2647B0205L13643A14472J30021j08949b635
12260B66382D3814K50752k4691A02294a10518C80035o0857f0640I8355j7433J29416
12249B10338c9800E3290J58897L4226K13120a22592A67000a40080A97158L36083
12239E33241k02032A1422M0206J44890J12943A18776K91678c5672A34060A804
12228A03726K02042m7487m6416L23500B27738h4259o269B96939J01793n006O2878
12217D56604j47485K76061B72395i9824A0956L29708j8575P1111A83106e5067
12206A05492K10807K8833j66991j5207J43154J4693a53055C32972g4640A17128
$$ plain form
12195 463106 -45159 295858 -9574 -301692 293579 242396 95826 299653 276534 -80830 149962
12183 -119936 206584 84896 212478 297513 262281 72868 -210736 130320 560636 307528
12173 307528 107647 352437 57335 437480 131469 77139 -48443 366954 227722 282127
12163 282127 405725 379482 165599 421383 281671 113985 280678 370518 58304 74857
12153 74857 56472 -80559 149745 83988 -69153 -34226 223034 115845 -245549 141851 84973
12142 84973 -34005 104578 -55272 133268 -94563 -33576 -34250 -46446 109539 -120887 314957
12130 409370 -241523 -14860 83078 225035 98587 330969 62200 -168892 -9718 69371 395310
12119 395310 437191 236641 213088 42207 -173737 -81307 48361 411934 -47351 -17575 -58858
$$ packed form
12195D63106d5159B95858i574k92118B93579n1183I5826K03827k3119h0830A49962
12183a19936B06584H4896J27582Q5035l5232G2868b10736A30320M30316k53108
12173C07528A07647K44790E7335L80145A31469n4330d8443C66954j39232N4405
12163B82127J23598k6243A65599K55784j39712A13985J66693Q9840E8304J6553
12153G4857j8385h0559A49745o5757f9153c4226B23034j07189b45549A41851n6878
12142H4973c4005A04578e5272A33268i4563c3576o74j2196A09539a20887C14957
12130D09370b41523a4860H3078J41957I8587K32382F2200a68892i718F9371L25939
12119C95310M1881k00550k3553D2207a73737h1307D8361L63573d7351a7575m1283
$$ plain form
12108 -58858 58236 -157482 163336 -300588 -105030 369595 106917 362422 -34764 -66080
12098 -66080 46968 226234 46173 320210 11950 45158 138345 204344 73891 218968 152731
12087 152731 124891 -132986 -281100 -56502 -166034 114256 -60389 107957 -90887 305379
12076 -72861 124518 -6810 484804 -147945 -239364 -3795 399930 -19758 87546 132793 76882
12065 76882 97056 189048 -201191 34285 -54753 106897 142162 2085 169055 -121704 -162598
12054 -162598 -79608 -202584 284008 12821 383319 -99077 153370 155968 119632 -264104 -230345
12043 -230345 55492 -211006 -175029 229853 88568 121333 200996 -32838 -195221 -460104 200132
12031 81208 -58655 253142 -535998 -100298 214232 -145518 -119126 434159 -110589 79734
$$ packed form
12108e8858E8236a57482A63336c00588a05030C69595A06917K55505c4764l1316
12098f6080D6968J79266D6173K74037A1950L3208R3187O5999G3891J45077o6237
12087A52731k7840a32986j48114e6502j09532A14256f0389A07957i0887C05379
12076g2861A24518f810D84804a47945r1419c795C99930a9758H7546M5247n5911
12065G6882K0174R1992b01191C4285e4753A06897L5265B085J66970a21704m0894
12054a62598g9608j22976B84008A2821L70498i9077A53370K598l6336b64104L3759
12043b30345E5492b11006L5977B29853H8568L2765P9663c2838j62383k64883B00132
12031H1208e8655B53142e35998a00298B14232a45518K6392D34159a10589G9734
$$ plain form
12020 -99966 233962 -296545 345402 218909 284372 -19078 315569 -96540 -89419 -199002 226069
12008 -151390 149178 170503 81885 8073 -205261 422298 52622 15348 -106203 44211 -6884
11996 6932 -234692 102847 -54729 -133586 -42171 124151 -182578 -182713 -272752 51624 -39981
11984 -128708 -92781 -126879 -20279 16413 128183 -187349 111933 -285452 106642 -193757
11973 -9062 -142938 -192985 76252 22413 336807 9052 -80845 -224171 -226058 -26539 -53092 4794
11960 -14802 -180718 134108 -170563 150174 35805 -14342 -30070 20395 -181020 -194872 31701
11948 -112049 52910 42728 -140806 -95005 -303093 118257 -88157 48961 219536 176434 -51766
11936 18332 192283 138977 132338 103257 226441 234948 73748 -378854 242878 159325 71223
$$ packed form
12020i9966B33962b96545C45402j26493O5463a9078C15569i6540P121j09583B26069
12008a51390A49178K1325H1885H073b05261D22298E2622A5348a06203D4211f884
11996F932b34692A02847e4729p8857d2171A24151a82578j35r0039E1624c9981
11984a28708L5927l4098b0279A6413J11770a87349A11933b85452A06642a93757
11973i062j33876n0047G6252B2413L14394I052h0845j43326j887b6539k6553D794
11960a4802j65916A34108a70563A50174C5805a4342j5728B0395a81020j3852C1701
11948a12049E2910j0182a40806M5801k08088A18257h8157D8961J70575m3102e1766
11936A8332J73951n3306o639k9081J23184Q507G3748c78854B42878q3553G1223
$$ plain form
11924 -91122 -18275 -208071 11048 -212196 21558 35089 82576 -121703 232975 -10982 -220357
11913 -220357 139645 -163146 -222550 -9575 -23753 -63593 177184 45746 -27916 -443570 55562
11901 174851 55685 -108958 238063 141565 -313417 127819 -55090 114317 -248161 -210212
11891 -210212 -71730 72858 -366851 -3498 61681 -27588 -16570 19307 184044 -204285 -79906
11879 -226451 -544559 -309298 39828 -104168 -268567 128114 95734 -111071 87148 -103809
11868 -41683 360253 95714 57951 214624 40137 -5309 8263 -160267 -88870 39445 -128291
11856 -274487 -68868 -72538 57315 -384800 82190 -210615 31455 -60881 95821 115055 204259
11845 204259 87521 106757 238032 -260535 -138777 -258060 -211054 -138743 292734 -94816
$$ packed form
11924i1122a8275j89796A1048b12196B1558J3531M7487a21703B32975a0982k09375
11913b20357A39645a63146n9404i575j4178l9840A77184D5746b7916m15654E5562
11901A74851E5685a08958B38063r6498c13417A27819e5090A14317b48161L7949
11891b10212g1730G2858c66851c498F1681b7588J1018A9307J64737b04285g9906
11879b26451l18108K35261C9828a04168j64399A28114l2380a11071H7148a03809
11868d1683C60253I5714l7763J56673D0137e309H263a60267P1397C9445a28291
11856b74487f8868l670E7315c84800H2190b10615C1455f0881I5821J9234Q9204
11845B04259H7521J9236J31275b60535J21758j19283M7006P2311B92734i4816
$$ plain form
11834 -186151 132012 1342 -143986 -1239 -391698 106527 207044 -335032 -274902 -61715 37638
11822 -111922 54554 60114 -362190 219095 -123101 -133105 -148703 -183938 81737 -154126 -275755
11811 -275755 175713 -52050 -73671 -254287 -121210 -210342 57220 -243851 -85312 54969 234714
11800 234714 -10002 130434 -250082 -54394 201391 -54313 -42205 140770 20156 -27029 265724
11788 -3180 79473 45172 -115462 -174649 214077 -190221 -99877 374234 -70179 75420 -99623
11776 298720 -205953 41502 -80717 -159687 -478690 112967 -42955 220853 -174476 70809
11765 129910 -150428 226013 -242443 -562994 -193924 27970 67141 78534 -238265 242255
11754 -86742 -158070 -282211 539421 -200814 -353552 78940 130526 18495 132639 14129 -60144
$$ packed form
11834a86151A32012A342a43986a239l90459A06527J00517c35032O0130f1715C7638
11822a11922E4554N560c62190B19095a23101j0004j5598l5235H1737a54126j21629
11811b75755A75713e2050k1621j80616a21210q9132E7220b43851h5312E4969J79745
11800B34714a0002A30434b50082e4394B01391e4313J2108A40770B0156b7029B65724
11788c180G9473l4301a15462n9187B14077a90221R0344C74234g0179G5420i9623
11776B98720b05953D1502h0717p8970l19003A12967d2955B20853a74476G0809
11765A29910a50428B26013b42443l20551a93924B7970L9171J1393b38265B42255
11754h6742p1328j24141E39421b00814j52738G8940N1586A8495J14144A4129f0144
$$ plain form
11742 -325797 59995 84074 101682 -224086 -45249 -195039 -225598 51584 59215 103136 91332
11731 91332 -253660 169685 318814 236191 -192692 -229295 -74646 -68190 -82080 7773 -258597
11719 186052 121371 267172 45469 -196439 -154914 302697 -242705 107060 113951 132509 99165
11708 99165 -45516 48176 78706 82152 -40294 -93509 75382 -103618 -100858 -178830 -87272 -294250
11696 -294250 153214 -1318 62397 51280 -134987 276074 216747 -114816 200706 65046 87465
11685 87465 -98917 -124189 183762 230346 -96990 334143 68641 -31395 48663 -80191 128221
11673 -154381 -107138 -388784 -228764 -65212 25863 11080 150751 -204353 -3646 -90660 -62847
11662 -62847 -108808 -351817 5211 81402 -99099 -135351 -414858 227583 -85872 134423 34147
$$ packed form
11742c25797E9995K4079J7608b24086d5249j49790l0559E1584P631M3921j1804
11731I1332b53660A69685J49129q2623a92692l6603g4646O456j3890G773b58597
11719A86052o4681J45801D5469a96439M1525C02697b42705A07060O891J8558l3344
11708I9165d5516D8176L0530L446d0294n3215G5382a03618K760p7972h7272k06978
11696b94250A53214a318F2397j1117a34987B76074n9327a14816B00706F5046K2419
11685H7465i8917k5272A83762M6584i6990C34143F8641c1395D8663h0191A28221
11673a54381M7243k81646J60020f5212B5863A1080J39671b04353c646q7014K7813
11662f2847m5961k43009E211P6191i9099l6252k79507B27583h5872A34423C4147
$$ plain form
11650 79436 -62732 177835 -137194 -156462 69950 -174918 50767 177278 35013 58843 136547
11639 136547 70209 55848 -174327 -192044 202975 323444 -22782 5209 73497 5135 -68252
11627 42232 -142609 -143367 -330713 99994 329542 -76942 151616 95613 17119 -74317 61522
11615 -182304 -10813 -58461 -427307 -228141 -98316 -48750 84231 -155975 -18096 -18335 -254405
11604 -254405 406989 -229395 73316 -171242 224567 -63254 98896 -32155 190166 54669
11593 182455 115838 -34697 -2386 324164 6632 135827 273751 174797 255526 120114 -286533
11581 -78905 -31876 444978 71557 8400 -74238 175002 19636 -116728 361014 -231065 97101
11569 170891 -274346 -136002 218430 -17030 159663 -210509 25591 268163 -57854 171598
$$ packed form
11650G9436f2732A77835a37194j9268F9950a74918E0767J26511C5013K3830P7704
11639A36547o6338j4361a74327j7717B02975J20469b2782E209O8288E135f8252
11627D2232a42609p58j87346I9994K29548g6942A51616n6003A7119g4317F1522
11615a82304a0813m7648l68846J99166i8316d8750H4231a55975a8096k39k36070
11604b54405D06989b29395G3316a71242B24567f3254I8896c2155A90166E4669
11593A82455o6617c4697b386C24164F632J29195J37924r8954Q0729A20114b86533
11581g8905c1876D44978G1557H400g4238A75002A9636a16728C61014b31065I7101
11569A70891b74346a36002B18430a7030A59663b10509B5591K42572e7854A71598
$$ plain form
11558 32932 169044 -77306 92214 -24830 -238893 -218352 39712 -114290 -186694 144013 -85339
11546 10486 -239782 191497 71354 271519 186837 124416 186677 381761 63876 -28879 125540
11534 116362 232912 278614 118352 120542 -81014 146503 74008 -40360 272607 -230159 98799
11522 -103360 81608 123828 202915 72645 77951 -159290 -52906 229245 -237005 37978 281836
11511 281836 -68190 -27285 -74992 248669 346924 497120 167686 -249965 -37024 -79346 279374
11499 149784 60725 199522 -49982 -150634 -70542 -92198 122181 43957 27676 148136 147035
11488 147035 -82586 38104 44187 -30679 238251 -177560 -119455 323585 68620 -49452 377613
11476 239529 20829 473287 -55142 -371128 142848 301555 198710 252140 317957 86692
$$ packed form
11558C2932J36112g7306I2214b4830k14063K0541C9712a14290p2404A44013h5339
11546A0486b39782A91497G1354K00165q4682o2421O2261J95084F3876b8879A25540
11534A16362J16550M5702A18352K190h1014A46503p2495d0360B72607b30159I8799
11522a03360H1608M2220P9087G2645N306a59290e2906B29245b37005C7978K43858
11511B81836f8190b7285m7707B48669R8255J50196A67686b49965c7024m2322B79374
11499A49784F0725J38797d9982j00652g0542k1656A22181D3957j6281J20460j101
11488A47035h2586C8104O083c0679B38251a77560N8105C23585F8620d9452C77613
11476B39529B0829M52458e5142l15986A42848J58707j02845N3430O5817H6692
$$ plain form
11465 -33370 72454 192452 -40752 122527 71936 45786 -224656 312687 223867 55715 -181609
11453 -130191 458040 -141967 -172138 313440 27039 82138 270417 66048 -14609 186668
11442 37954 -139242 -203718 150688 432601 95947 -21138 78743 55319 -224321 277174 13500
11430 5145 -66361 177141 -63200 -207037 2451 -263673 234662 112509 209836 -89375 78063
11418 -242527 294824 -92005 224186 151975 132363 59822 48080 69041 42857 -38683 112178
11406 394149 15044 128158 -109099 114987 93155 -76390 182980 156631 -159948 -267038
11396 -267038 -226542 121182 91194 81102 -343726 44817 -72337 -161308 113705 73286 219962
11385 219962 194414 -117693 -20387 46646 -136919 -250040 205526 240730 112494 53057
$$ packed form
11465c3370G2454J19998d0752A22527n0591k6150b24656C12687q8820E5715a81609
11453a30191D58040a41967l0171C13440B7039N5099J88279F6048a4609A86668
11442C7954a39242o4476A50688K81913I5947b1138G8743k3424b24321B77174A3500
11430E145f6361A77141f3200j43837B451b63673B34662A12509R7327h9375G8063
11418b42527B94824i2005B24186p2211j9612E9822j1742K0961k6184c8683A12178
11406C94149A5044J13114a09099A14987k1832g6390A82980k6349a59948j07090
11396b67038M0496A21182k9988j0092c43726D4817g2337q8971A13705m0419J46676
11385B19962k5548a17693b0387D6646a36919j13121B05526L5204A12494E3057
$$ plain form
11374 -245899 106349 5746 -299170 36432 40022 141310 -46141 -34483 215443 133872 -95911
11362 102722 308470 -152669 42599 -51960 -87997 -36560 97557 107040 220185 269184 -101917
11350 129481 -34752 -45330 -159655 -263508 175114 -67408 147642 329636 -88006 -231772
11340 -231772 -372016 137748 310965 21987 73140 18676 -52972 -92138 -266363 -347693 -100495
11328 -218014 12622 -118812 -132963 110778 -36683 35414 78186 -104435 -66094 -330968 6617
11316 -142891 141799 -206090 40204 -209558 159557 139042 -168977 -223463 141328 -95432
11305 -99734 -80441 -63609 -97843 -27350 -190444 -110588 -145781 -572587 -116373 -36433 -287485
11294 -287485 -61569 -322845 -133348 65294 102381 -205663 43582 157466 -104353 -407562
$$ packed form
11374b45899A06349E746b99170C6432L590J01288d6141J1658B15443q1571i5911
11362A02722K05748a52669D2599e1960l6037c6560I7557R483J13145M8999a01917
11350A29481c4752j0578j14325j03853A75114f7408A47642J81994h8006j43766
11340b31772j40244A37748J73217B1987N1153A8676e2972l9166j74225q1330a00495
11328b18014A2622a18812j4151A10778c6683C5414M2772a04435L8341k64874F617
11316a42891A41799b06090D0204b09558A59557k0515a68977n4486A41328i5432
11305i9734J9293J6832l4234b7350j63094P9856l5193m26806a16373c6433k51052
11294b87485f1569k61276a33348F5294L7087b05663D3582J13884a04353l03209
$$ plain form
11284 -407562 -383821 118048 -172473 -126346 -83297 -144424 16024 169307 -126650 104028
11273 66297 -111781 -61946 100007 -338208 122995 167087 -103352 -66137 -91200 -123743 319700
11261 164047 -223971 -68145 57245 -31704 -94219 110437 217455 -62641 298856 -314105
11250 74351 6944 19256 77460 -150192 -265667 66900 11073 -229543 184715 151471 -33211
11238 226029 36122 7511 99420 167027 -27203 197067 -48270 -136080 -334193 43483 -91569
11226 235411 -380248 -131359 230486 253633 272755 -297818 -224354 -102344 -257543 145442
11215 -430321 6197 -76955 5370 -83408 67995 -72976 -174285 79764 -199052 166989 379399
11204 379399 -64775 28171 276031 -337532 -539391 -19091 -52874 -141866 217771 -328244
$$ packed form
11284d07562K3741A18048a72473M6127M3049o1127A6024J53283a26650A04028
11273F6297a11781M9835A00007c38208A22995M4092a03352L7215k5063l2543C19700
11261A64047b23971f8145E7245c1704o2515A10437J07018f2641B98856c14105
11250G4351F944J2312N8204a50192j15475F6900A1073b29543A84715l3244c3211
11238B26029C6122G511R1909O7607b7203A97067d8270q7810j98113D3483i1569
11226B35411c80248a31359B30486K3147J9122b97818P3464a02344j55199A45442
11215d30321F197g6955E370h3408F7995g2976j01309G9764a99052A66989K12410
11204C79399f4775B8171K47860c37532k01859a9091l3783q8992B17771c28244
$$ plain form
11193 -112861 -324475 227106 -83706 -212952 -123643 -107987 -44547 -198107 123200 -264634
11182 148 65681 -30961 -54749 -163836 -184426 -121926 -167479 -74512 -305451 124682 -136927
11170 195308 -44712 -132020 -355755 306356 -47072 19027 -109415 88868 90241 -59484 97506
11158 -48000 -97058 -98260 1248 -202925 -109334 218899 -94289 -127463 -191848 215670 -41258
11146 50529 -32183 367902 -69244 -267322 -306874 -17622 135248 -29763 -25801 -21451 20393
11134 22007 -89755 -39972 51293 -189752 -373151 125846 263436 -44496 9626 37793 15823
11122 230954 180406 -118114 25230 -341291 77881 72704 -336314 257637 -154844 -16251 81481
11110 -33743 301287 228921 122838 334708 38812 364067 -84548 325944 262431 138730
$$ packed form
11193a12861k11614B27106h3706j29246Q9309J5656d4547j53560A23200b64634
11182A48O5533c0961k3788j09087k0590O2500m5553g4512k30939A24682a36927
11170A95308d4712q7308k23735C06356d7072A9027a09415H8868J373e9484I7506
11158d8000m9058j202A248b02925R3591B18899i4289l3174o4385B15670d1258
11146E0529c2183C67902f9244j98078l9552a7622A35248b9763L962M350B0393
11134B2007h9755c9972E1293a89752j83399A25846J37590d4496I626K8167A5823
11122B30954n0548a18114B5230c41291G7881n177c36314B57637a54844a6251H1481
11110c3743C01287p2366j06083K11870C8812L25255h4548C25944o3513j23701
$$ plain form
11100 138730 105615 147759 141284 295730 276896 267559 55239 243631 -25319 82396 375345
11089 375345 90624 327478 274372 270805 400439 231325 169594 206596 182086 107077 148855
11078 148855 260037 216266 392796 235997 179693 320853 568223 267883 364361 342934
11068 342934 313235 393352 402200 234231 711497 453641 96952 421274 699840 763281 506378
11057 506378 830676 686296 567805 677316 866378 486167 790599 677843 811326 943337
11047 943337 703927 729357 1071240 880283 1056015 1102635 1007546 992023 1051972 1050081 1008919
11036 1008919 991943 898767 899280 898240 647636 1098081 1161030 997769 1053658 863552 1002272
11025 1002272 1180882 1098051 870183 1082411 909724 1111382 681414 812751 812562 734489
$$ packed form
11100A38730l3115M2144o475J54446j8834r337E5239J88392b5319H2396K92949
11089C75345I0624K36854n3106l567J29634j69114o1731L7002k4510p5009M1778
11078A48855J11182m3771J76530j56799n6304J41160K47370B67883R6478k1427
11068C42934k9699Q0117Q848j67969M77266k57856I6952L24322K78566O3441k56903
11057E06378L24298j44380j18491J09511J89062l80211L04432j12756J33483J32011
11047I43337k39410K5430L41883j90957J75732M6620r5089j5523N9949j891m1162
11036A008919j6976r3176N13j040k50604M50445O2949j63261N5889j90106J38720
11025A002272J78610q2831k27868K12228j72687K01658m29968J31337j89p8073
$$ plain form
11015 734489 742767 1167374 620497 550788 650526 857642 730228 737174 634190 602428 1045318
11004 1045318 558344 814778 658972 868695 622128 804010 1089466 754095 868496
10995 868496 904800 944319 942357 742073 456548 880282 891952 926977 652862 773115 860535
10984 860535 1057790 804390 1063830 945115 976081 1100029 1357695 1615166 1345316 1580342
10974 1580342 1471225 1677608 2172279 2376846 2664685 2881325 3098510 3271849 3403110
10965 3403110 3732868 3447944 3071917 2741562 2238905 2020588 1584081 1402443 1606354
10956 1606354 1544722 1594416 1803324 1345198 1424474 1504325 1212772 1332158 773737 1225249
10946 1225249 674549 834670 369105 530206 269311 42727 271162 17703 207363 62801
$$ packed form
11015G34489Q278M24607n46877o9709R9738K07116j27414O946j02984l1762M42890
11004A045318m86974K56434j55806K09723k46567J81882K85456l35371J14401
10995H68496L6304L9519j962k00284k85525M23734J1670L5025k74115J20253Q7420
10984H60535J97255k53400K59440j18715L0966J23948K57666K57471k69850K35026
10974A580342j09117K06383M94671K04567K87839K16640K17185J73339J31261
10965C403110L29758k84924l76027l30355n02657k18317m36507j81638K03911
10956A606354o1632M9694K08908m58126P9276P9851k91553J19386n58421M51512
10946A225249n50700J60121C69105J61101k60895D2727K28435A7703J89660F2801
$$ plain form
10935 110933 -36614 -34811 238855 44823 247848 522636 138173 109172 434687 136778
10924 497185 616348 280898 -88578 -106014 33370 -67941 -50078 173335 34805 34872 -195185
10912 73005 -322571 -33725 -237540 -7340 22219 153567 -89561 86714 -495982 -231567 -20863
10900 42606 92183 148205 -53891 -241550 -36842 -2135 214895 -60052 -309539 -148551 -202842
10889 -202842 -285012 236720 57203 53511 65014 238531 190795 -151187 19702 21047 316362
10878 316362 -617424 -19552 66785 -194372 7899 223386 270395 -320559 200615 -260409
10867 -12300 -205916 -64884 -159074 -226962 -94352 -259484 34518 -53235 -271260 -264345 -154524
10856 -154524 -15585 58839 -387098 66639 -98997 73547 -313375 138232 -137641 -219897 95490
$$ packed form
10935A10933c6614J803B38855D4823K03025K74788A38173k9001L25515A36778
10924D97185J19163B80898h8578j7436C3370f7941J7863A73335C4805O7a95185
10912G3005c22571c3725k03815g340B2219J31348h9561H6714d95982b31567b0863
10900D2606M9577N6022e3891j87659c6842b135B14895f0052k49487a48551n4291
10889b02842q2170B36720E7203l692J1503J73517m7736a51187A9702J345K95315
10878C16362f17424a9552F6785a94372G899K15487M7009c20559B00615b60409
10867a2300j93616f4884r4190o7888i4352j65132C4518e3235k18025O915J09821
10856a54524a5585E8839c87098F6639i8997G3547c13375A38232a37641q2256I5490
$$ plain form
10844 24046 100467 320171 -241411 61769 -147128 -411207 -213002 102651 -236291 -96147
10833 -80764 157124 91633 -217843 266806 106323 -43424 -111134 2365 -312972 -77354 185840
10821 -191248 72273 96039 -654252 -156088 -24614 161755 -178580 -192923 45561 -289082
10810 -90169 -45622 -45189 64347 -97687 -165429 -106343 200585 -47474 -141375 -120970 -277705 -212428
10798 -212428 64297 -56766 106820 164951 227858 -781 -121012 -6020 110212 -451698 -54676
10786 -228795 -186095 94752 -207507 -8154 -23576 62024 177654 -91637 203270 7196 -215475
10774 -13685 -131649 -48385 52085 -208182 40519 -262123 172179 -115930 -315935 -296645
10764 -296645 -284241 15555 -167752 78246 220031 -120683 -37590 -146044 -95740 -152297 90615
$$ packed form
10844B4046P6421K19704b41411F1769a47128k64079J98205A02651b36291i6147
10833h0764A57124o5491b17843B66806A06323d3424o7710B365c12972g7354A85840
10821a91248G2273K3766f54252a56088b4614A61755a78580j4343D5561b89082
10810i0169M4547M33F4347i7687o7742N9086B00585d7474r3901K0405j56735O5277
10798b12428F4297e6766A06820N8131O2907g81j20231f020A10212d51698e4676
10786b28795M2700I4752b07507h154j5422F2024J15630i1637B03270G196b15475
10774a3685j17964d8385E2085b08182D0519b62123A72179a15930k00005J9290
10764b96645J2404A5555a67752G8246J41785a20683c7590j08454N0304n6557I0615
$$ plain form
10752 52706 -215031 151982 91747 -230960 140719 21223 70301 -80577 73596 -139029 -393194
10741 -393194 191582 -190575 -72180 -43337 -202839 -105570 -112409 -213542 31873 122882 152973
10730 152973 -78191 -206188 -285155 288955 -184065 335654 -188044 523663 257153 -265787
10719 -11476 323885 192319 -120289 142926 313918 -250309 200607 92047 -37074 100250
10708 -363920 -110605 -67877 49616 -154366 -30396 -291422 -141519 -581144 -329350 -7340
10697 -149650 -388164 175969 -179987 -395372 124655 -194258 -98366 -119303 43173 -330520
10686 -138628 -353778 295672 307137 490886 87313 -43848 -113187 93804 -263774 -197390 -470516
10675 -470516 -273793 -111882 107461 -361441 -106572 -33034 -134691 138208 -21560 -146284
$$ packed form
10752E2706b15031A51982o0235b30960A40719B1223M9078h0577G3596a39029k54165
10741c93194A91582a90575g2180K8843j59502R7269o839j01133C1873R1009L0091
10730A52973g8191j27997p8967B88955a84065C35654a88044E23663B57153b65787
10719a1476C23885j31566a20289A42926J70992b50309B00607I2047c7074A00250
10708c63920a10605M2728D9616a54366c0396k61026a41519m39625K51794g340
10697a49650k38514A75969a79987k15385A24655a94258R5892k0937D3173c30520
10686a38628k15150B95672J1465J83749H7313d3848o9339I3804b63774O6384k73126
10675d70516J96723a11882A07461c61441a06572c3034j01657A38208b1560j24724
$$ plain form
10665 -146284 328234 -13035 -85180 -173917 -277049 -243084 -322882 -335487 -33163 -23121 130854
10653 -294224 -1001 122055 -427742 -184814 42822 -129290 -376886 -238742 -24660 46231
10642 -304443 87298 -170828 196151 -284296 -48274 -213282 -114026 71631 -299571 -149061
10631 -123343 68410 130268 -2840 -191085 289111 -187081 155688 -200475 182790 -219369
10620 210319 31532 -3521 20509 -249078 195110 -171516 -189012 -267440 -106672 -180365 273912
10608 -57926 107426 -339893 -84203 268448 47052 257598 168123 -1512 -190850 -230384 -27708
10596 -173439 -214800 -361145 -192034 -178400 -253226 -86000 64091 -34594 -249150 155114 -19821
10584 -24390 191722 45337 -65353 -33204 -322807 237543 -189954 -113460 -532359 -116214
$$ packed form
10665a46284C28234a3035p2145q8737j03132L3965p9798j2605c3163J0042A30854
10653b94224a001A22055d27742a84814D2822a29290k47596J38144b4660D6231
10642c04443H7298a70828A96151b84296d8274j65008R9256G1631b99571a49061
10631a23343F8410O1858b840j88245B89111a87081A55688b00475A82790b19369
10620B10319C1532c521B0509b49078A95110a71516j7496p8428a06672p3693B73912
10608e7926A07426c39893h4203B68448D7052K10546q9475a512j89338l9534b7708
10596a73439m1361j46345J69111J3634p4826h6000F4091c4594k14556A55114a9821
10584b4390A91722D5337f5353L2149k89603B37543a89954P6494m18899a16214
$$ plain form
10573 29310 439695 148121 -183649 -185685 -34164 230671 -27394 -91025 13088 160462 24261
10561 296616 -227892 62516 -97499 127284 -238892 190107 57286 -156772 -339567 2733
10550 89321 -116234 308420 -31185 -148388 206827 50027 -42765 -114608 56037 14263 10834
10539 10834 -147596 38765 136210 -67235 208424 30045 -235175 83525 -96443 -359267 -14461
10527 -135293 -95990 -87581 -98158 -164451 -127707 881 -88806 -115987 37567 11649 -76360 -3122
10514 250040 51150 -430410 -318140 -396931 89969 126002 73898 162000 359725 181000 -191895
10502 177917 -183834 35352 -38171 -317317 -58490 -144039 -121793 184601 150999 22116 123161
10491 123161 -169552 242137 160974 12582 -127443 -198906 -8148 -244343 5549 59387 191607
$$ packed form
10573B9310M10385A48121a83649k036c4164B30671b7394o3631A3088J47374B4261
10561B96616b27892F2516i7499A27284b38892A90107E7286a56772j82795B733
10550H9321a16234C08420c1185j17203B06827E0027d2765p1843E6037A4263l429
10539A0834a47596C8765R7445f7235B08424C0045b35175H3525i6443k62824a4461
10527a35293L9303Q409j0577o6293L6744H81h8806k7181C7567A1649g6360c122
10514B50040E1150d30410J12270p8791H9969L6033n2104Q8102J97725j78725a91895
10502A77917a83834C5352c8171k79146e8490q5549K2246A84601l3602B2116J01045
10491A23161a69552B42137q1163A2582a27443p1463h148k36195E549N3838J32220
$$ plain form
10480 191607 71236 75581 184763 335485 168474 379607 224627 231390 213412 462129 -238865
10468 -300481 135779 -20388 128258 457059 -266119 -43885 -81568 25857 -102983 105919
10457 -109855 152564 167991 -286753 -171367 107473 -351603 48411 17364 -196542 79829
10446 44182 320757 -120713 21124 -86620 -132901 -393636 -76588 8772 -51777 -97338 -9960
10434 100131 -225308 213239 -335109 -214666 12800 52409 89385 -194294 -117764 190848
10423 96268 21056 -17330 67119 -22542 49391 -359354 -184265 -211480 62304 113988 251227
10412 251227 91526 196856 -43395 14867 64321 58008 -106296 118056 -143299 -24576 35692
10400 294927 -297371 108976 126459 -164268 -34498 -481868 48697 -712 -242069 -4698 401415
$$ packed form
10480A91607G1236M345J09182J50722j67011K11133j54980O763j7978K48717b38865
10468c00481A35779b0388A28258L28801b66119d3885l7683B5857a02983A05919
10457a09855A52564J5427b86753J15386A07473c51603D8411A7364a96542G9829
10446D4182K76575a20713B1124h6620m6281k60735g6588H772e1777m5561i960
10434A00131b25308B13239c35109J20443A2800L9609L6976a94294P6530A90848
10423I6268B1056a7330F7119b2542D9391c59354J75089k7215F2304N1684J37239
10412B51227I1526J05330d3395A4867M9454o313a06296A18056a43299b4576C5692
10400B94927b97371A08976J7483a64268c4498m47370D8697g12k41357d698D01415
$$ plain form
10388 119899 104227 -308274 180452 156590 164529 78619 242534 -180471 250658 222757 235399
10377 235399 50684 -55703 94369 166980 455103 426319 197504 476233 460249 103407 -100844
10365 181231 189851 293801 523792 659427 437593 862153 174943 306716 -139822 329289
10354 143391 148938 49396 -110416 240788 221189 261057 497160 1038275 293688 514468
10344 514468 494390 171380 418827 381111 424767 198493 27400 -80202 198490 99208 165488
10333 165488 242201 216738 61730 122180 -34304 306800 256971 -55676 51996 -172867 293517
10321 343270 181089 218986 -177429 169973 181772 14126 151036 633153 118662 217622
10311 217622 71254 -72875 -570691 -111156 273624 -92898 136280 -402114 -49955 -66753
$$ packed form
10388A19899j5672c08274A80452k3862P939G8619J63915a80471B50658k7901J2642
10377B35399E0684e5703I4369P2611K88123k8784A97504K78729j5984A03407a00844
10365A81231Q620J03950K29991J35635k21834M24560A74943J31773a39822C29289
10354A43391N547D9396a10416B40788j9599L9868K36103N41115B93688K20780
10344E14468k0078A71380K47447l7716M3656A98493B7400h0202A98490I9208O6280
10333A65488P6713k5463F1730O0450c4304C06800m9829e5676E1996a72867B93517
10321C43270j62181L7897a77429A69973J1799A4126J36910M82117A18662R8960
10311B17622G1254g2875m97816a11156B73624i2898A36280d02114d9955j6798
$$ plain form
10301 -66753 -28580 -142028 -233555 -136123 -315924 -257414 -177588 -196887 -12060 29818 49760
10290 49760 230281 -154853 240662 -40624 -191889 -44929 -94865 -51250 -263397 217939
10279 121855 12467 -396019 -113417 377663 85402 -259931 -70554 -226341 -37324 6444 -104696
10267 -156749 157069 165601 -131611 -235685 -93720 -442210 110930 207113 -77226 228829
10256 -44654 -290880 -22833 300702 -50695 293335 202065 184792 -93591 -10051 -86655 33009
10244 74056 96972 -77387 -231555 -203561 149061 -112919 -220322 143099 115920 -109030
10233 -26253 292182 -220250 -163027 -226705 -9016 -233107 254929 -230175 -136695 -114128 -163918
10222 -163918 126261 -192355 -131068 -16068 -4579 -144460 -193740 -292363 -91372 163417 -573007
$$ packed form
10301f6753b8580j13448r1527R7432j79801N8510P9826j9299a2060B9818J9942
10290D9760J80521a54853B40662d0624j51265d4929m9936M3615k12147B17939
10279A21855A2467c96019a13417C77663H5402b59931g0554j55787c7324F444a04696
10267a56749A57069Q532a31611j04074i3720l48490A10930R6183g7226B28829
10256d4654k46226b2833C00702e0695B93335r1270j7273i3591a0051p6604C3009
10244G4056K2916g7387j54168K7994A49061a12919j07403A43099k7179a09030
10233b6253B92182b20250N7223o3678i016k24091B54929b30175R3480K2567m9790
10222a63918A26261a92355O1287a6068d579j39881m9280r8623i1372A63417e73007
$$ plain form
10210 -82393 116649 -79481 98031 -105439 19020 40698 41400 -37670 -37904 54304 -63234 -19616
10197 -12941 -190865 125352 -108085 98688 -174521 -20798 99245 -186823 -45631 -238804
10187 -238804 -57642 -202786 -125731 -289374 -65698 58761 69652 -163653 59784 -96257 140989
10175 -74410 -225548 54685 -148958 -44042 74483 -88499 -175570 56736 -359663 70392 12254
10163 -338711 -14495 -290866 125707 -161923 -192524 177732 -292102 12158 -17075 -255823
10153 -255823 -252507 -42436 83590 379225 -83510 139389 -421005 -107182 -38260 -2265 169268
10141 -177786 -194028 -3192 -120096 -2427 30037 -92909 70912 88802 92134 59230 -160873 -2959
10128 357115 27230 -216198 -228036 -178508 -41663 -206164 -53723 -187378 -502125 235339
$$ packed form
10210h2393A16649g9481I8031a05439A9020K1678P02c7670k34E4304f3234a9616
10197a2941j77924A25352a08085I8688a74521b0798I9245a86823d5631j93173
10187b38804e7642j45144P7055j63643f5698E8761J0891a63653E9784i6257A40989
10175g4410j51138E4685a48958d4042G4483h8499q7071E6736c59663G0392A2254
10163c38711a4495k76371A25707a61923l0601A77732b92102A2158a7075k38748
10153b55823L316d2436H3590K95635h3510A39389d21005a07182c8260b265A69268
10141a77786j6242c192j16904b427C0037i2909G0912J7890L332l2904a60873b959
10128C57115B7230b16198j1838M9528d1663j64501e3723j33655l14747B35339
$$ plain form
10117 -302121 -75822 -94159 -163730 -307379 -142754 -172148 -176338 -389544 237572 -171681 273462
10105 -179755 9620 -251676 -107280 -367653 -366148 -99845 -74902 266619 -138600 -9532 -38247
10094 -38247 213993 -170649 -344098 -273078 -117362 169726 -168019 73767 -144889 -71167
10083 103139 -340551 -21769 -377947 -103395 -10950 -259743 -137844 203157 44510 182567
10073 182567 -45717 366662 -55427 -97782 40600 -98775 -294411 55848 -263862 140557 -106901
10061 -108050 -126453 -140411 -215859 -178218 271615 -203824 -119694 28876 -34068 -28947 10934
10049 -10565 101263 189724 22634 162181 -132198 -138488 -270410 56416 117577 -106802 -155410
10038 -155410 -87298 -40172 -259092 265677 186301 106677 -122731 -6478 -89167 -18318 -71203
$$ packed form
10117c02121g5822j8337o9571j43649a42754k9394m190k13206B37572a71681B73462
10105a79755I620b51676a07280k60373J505i9845K4943B66619a38600i532k8715
10094c8247B13993a70649j73449P1020a17362A69726a68019G3767a44889g1167
10083A03139c40551b1769l56178a03395a0950k48793J21899B03157D4510J38057
10073A82567d5717C66662e5427m2355D0600i8775j95636E5848b63862A40557a06901
10061a08050j8403j3958p5448L7641B71615b03824Q4130B8876c4068N121A0934
10049a0565A01263Q8461B2634J39547a32198o290j31922E6416O1161a06802m8608
10038a55410O8112d0172k18920B65677p9376p9624a22731f478q2689a8318n2885
$$ plain form
10027 -71203 194310 -182508 -312986 45174 -53522 -259410 21355 252112 -73844 -153772 -125549
10016 -125549 2774 -216097 -166153 70304 -484175 114147 -116233 52458 -47794 -167706 -9778
10004 12267 -402064 -69844 18913 26596 -165242 -270518 -94576 -136354 -21628 -242590 113196
9992 13066 -99939 -334885 -54110 -175341 -80400 75544 -233801 147215 151004 -273850 -246237
9981 -246237 -89404 -76713 2417 -397902 -193257 36083 52744 -1763 -174629 -92576 2319 314605
9969 314605 -218398 28885 60157 44341 -139600 -285001 56269 261847 -118655 16784 -219545
9957 -110815 -344169 -425800 -207082 -175573 19682 11555 17937 -53807 160518 43119 190663
9946 190663 -42226 57593 -352173 -260584 235008 28068 29146 -91392 228986 -183478 138836
$$ packed form
10027g1203A94310a82508j30478D5174e3522k05888B1355K30757g3844p9928K8223
10016a25549B774b16097M9944G0304d84175A14147a16233E2458d7794j19912i778
10004A2267d02064f9844A8913P683a65242j05276i4576m1778b1628k20962A13196
9992A3066i9939k34946e4110j21231h0400G5544b33801A47215L789b73850K7613
9981b46237h9404J2691B417c97902a93257C6083J6661a763j72866Q2053B319L12286
9969C14605b18398B8885L1272j5816a39600j45401E6269K05578a18655A6784b19545
9957a10815k33354q1631b07082L1509A9682q127O382e3807A60518D3119J47544
9946A90663d2226E7593c52173R1589B35008B8068J078i1392B28986a83478A38836
$$ plain form
9934 -208112 -6720 182827 -347079 319 200872 -110177 4770 -256724 -310673 138437 -64402
9922 -97346 31211 -203312 -68104 115428 134139 73768 8004 189519 -18110 164008 -89582
9910 -82460 164768 74196 -115661 -193512 144880 -9061 -557528 142046 140848 -67873 -244781
9899 -244781 -490871 68375 -190976 100396 19951 -203076 6173 -239475 -12360 -38919 -77462
9888 -77462 -136536 -357722 -67973 208250 -119997 -264432 -253211 -16274 -211127 -197143 -98201
9876 267353 2842 264851 -245151 204110 28516 13083 76590 -50867 -67077 -287775 -94168
9864 -53402 208868 31600 -132685 31488 174960 -238785 -200557 -169501 -304455 198694 138931
9853 138931 -167468 -305465 -32711 52671 51921 32498 -142078 75587 -32752 86005 -36582
$$ packed form
9934b08112f720A82827c47079C19K00553a10177D770b56724n3949A38437f4402
9922i7346C1211b03312f8104A15428J8711o0371H004J81515a8110A64008h9582
9910h2460A64768G4196a15661p7851A44880i061n48467A42046j198f7873j76908
9899b44781k46090F8375a90976A00396A9951b03076F173b39475a2360k6559l8543
9888g7462n9074k21186f7973B08250a19997j44435J1221a6274j94853J3984i8201
9876B67353B842K62009b45151B04110B8516A3083O3507e0867j6210k20698i4168
9864e3402B08868C1600a32685C1488J43472b38785L8228L1056j34954A98694n9763
9853A38931a67468j37997c2711E2671p50j9423a42078G5587c2752H6005c6582
$$ plain form
9841 89099 106329 107765 -96481 -344665 99260 455767 -14990 36310 -170430 -9473 -118261
9830 -118261 -192284 151029 107529 -373736 89980 -121397 -115272 790 -59097 -39266 -146262
9819 -146262 -8405 -326591 -98769 -149173 -142374 95056 -86291 -14865 25697 -410814 -58369 -539411
9807 -539411 -253855 23631 66092 157965 -204742 -118448 124097 -212733 -32305 -87610 122460
9795 -103286 33833 -179044 104112 -240480 -384616 -183815 -395370 -81200 111258 -128625
9784 46938 -11035 42809 -183711 137249 -192277 -6007 -164898 -252295 142498 -260331 -86585
9772 -344264 -229291 -48873 262926 -147608 -170601 58941 251724 -332542 4750 64106 -177148
9760 -374816 165385 67244 -201325 22205 -35810 -221353 -29177 184745 -85070 76936 -319897
$$ packed form
9841H9099J7230J436i6481k48184I9260L56507a4990C6310a70430i473j08788
9830a18261p4023A51029m3500c73736H9980a21397O125G90e9097J9831j06996
9819a46262h405l18186i8769n0404O799I5056h6291a4865B5697d10814e8369m81042
9807e39411b53855B3631M2461R1873b04742Q6294A24097b12733c2305n5305A22460
9795a03286C3833a79044A04112b40480j44136a83815k11555h1200A11258a28625
9784D6938a1035D2809a83711A37249a92277f007j58891q7397A42498b60331h6585
9772c44264J14973d8873B62926a47608k2993E8941J92783c32542D750N9356a77148
9760c74816A65385F7244b01325B2205c5810j85543b9177A84745h5070G6936c19897
$$ plain form
9748 -15465 -209509 -185078 -196766 36339 -30742 -137985 328370 -232778 -71043 99833 17194
9736 66359 29108 -335947 -184523 -127934 -282666 -266000 165579 -380376 148698 -71328 -167483
9725 -167483 213642 64792 -196680 122857 -120372 -77967 -395764 -527181 -185191 -292849
9715 -292849 -956 -42213 -231259 -5094 57758 -246739 -154766 -108798 69685 11335 74538 -7599
9702 -45926 -38329 65620 -196963 -297745 -48739 162273 -40414 132397 -210846 -380518 -130119
9690 191515 -38580 181222 -149634 136165 208557 301430 37348 -59162 175229 -214879 264271
9678 46738 -181579 -149571 191002 168569 -384740 -353412 -221339 -29319 210002 83702 -260656
9666 -191698 -343507 162378 -26617 -100543 -195550 -206828 -154108 82901 -115499 -335323 -57434
$$ packed form
9748a5465j94044K4431j1688C6339c0742j07243C28370b32778g1043I9833A7194
9736F6359B9108c35947J51424N6589j54732J6666A65579c80376A48698g1328r6155
9725a67483B13642F4792a96680A22857a20372M2405l17797j31417a85191j07658
9715b92849i56m1257j89046e094E7758b46739R1973M5968F9685A1335O3203g599
9702d5926P597F5620a96963j00782d8739A62273d0414A32397b10846j69672a30119
9690A91515c8580A81222a49634A36165P2392R2873C7348e9162A75229b14879B64271
9678D6738a81579L2008A91002k2433c84740L1328J32073b9319B10002H3702b60656
9666a91698j51809A62378b6617p3926r5007j1278N2720H2901a15499k19824e7434
$$ plain form
9654 -71353 -279310 156337 -303824 70186 -157939 -61137 -55504 -109476 -439550 -27163 -109763
9643 -109763 241164 158817 -73724 -261739 -259868 -237083 -308776 -220252 -191461 88144 216908
9632 216908 135689 117240 -274190 -60592 -59915 -285351 -83979 70607 -2141 -83844 -250223 -163115
9620 -163115 -39538 -59158 -170618 -283794 186195 -125987 -94874 -76266 144599 -341986
9609 143571 -268638 -67065 54049 -33734 -178745 -465978 22250 47434 -207902 75297 246220
9598 246220 -33515 -296555 -70887 -197991 -312171 -277611 -212439 -187548 100848 222881 -131994
9586 -388173 -75569 160866 82179 -186196 88308 -420471 -201136 -12004 229084 -282925
9575 -69182 -450314 -153889 -166369 -186928 1055 -37227 -128008 -20643 -76486 22415 -116847
$$ packed form
9654g1353k07957A56337c03824G0186a57939f1137N633n3972l30074b7163q2600
9643a09763B41164q2347g3724j88015J871K2785p1693Q8524K8791H8144J28764
9632B16908q1219j8449b74190f0592O77k25436h3979G0607b141q1703j66379Q7108
9620a63115c9538j9620j11460j13176A86195a25987L1113J8608A44599c41986
9609A43571b68638f7065E4049c3734j45011k87233B2250K5184b07902G5297J70923
9598B46220c3515k63040g0887j27104j14180L4560O5172K4891A00848J22033a31994
9586c88173g5569A60866p8687a86196H8308d20471b01136a2004B29084b82925
9575f9182l81132a53889j2480k0559A055c7227r0781b0643n5843B2415a16847
$$ plain form
9563 89815 -161476 -37271 177004 -106350 -265798 5283 11597 -154039 -273453 -184433 105433
9551 120459 49126 -116087 69263 -37642 18317 -111629 384474 -98136 48031 -326660 59704
9539 -3564 -94613 81323 -141089 -190621 107162 198984 70655 -241726 49195 -251492 -47394
9527 77360 -162608 -100558 -132222 310550 -302686 18835 -331412 -61940 -344709 -327713 191459
9515 55738 -133881 -72790 -88812 -185207 -71544 305371 -80775 -154648 -52948 168748 -325900
9503 -127054 -113543 -30221 -33931 -406469 -42146 -124420 -361341 -242143 -349389 -30317 -65146
9492 -65146 -309334 80144 -64729 11695 -444901 128723 -25780 -147489 -108799 -63577 112820
9480 32307 -210836 -133181 -160172 -200973 113292 -84464 -77059 -269993 -39242 -263897 -253938
$$ packed form
9563H9815a61476c7271A77004a06350j59448E283O314a54039j19414Q9020A05433
9551A20459D9126a16087F9263c7642A8317a11629C84474i8136D8031c26660E9704
9539c564r1049H1323a41089m9532A07162R1822G0655b41726D9195b51492d7394
9527G7360a62608O2050l1664C10550c02686A8835c31412f1940k82769J6996A91459
9515E5738a33881O1091j6022r6395g1544C05371h0775p3873e2948A68748c25900
9503a27054J3511c0221l710l72538d2146q2274k36921J19198j07246c0317l4829
9492f5146k44188H0144f4729A1695d44901A28723b5780j21709L8690M5222A12820
9480C2307b10836P7655k6991m0801A13292h4464P405j92934c9242k24655R959
$$ plain form
9469 -253938 -268808 35640 -226821 46571 -126796 -195543 -5833 -282987 141316 -200949 -221273
9458 -221273 -15410 -137952 -112062 178226 -5141 5430 -171935 -93229 -114042 -295770 -195073
9447 -195073 118751 244220 -231027 30787 -293538 209163 200722 -395131 223213 -41534
9436 4027 -160973 253395 -107083 -271359 70580 -177450 132062 -328455 -125148 29478
9425 -108700 -271717 -104348 -62935 -196667 -70807 -123749 -322170 -105213 -119694 -164347 48385
9413 -172843 -123253 -8840 3666 -121155 -555200 -5783 -60877 161172 -61216 -226609 -177929
9402 -177929 -107125 -275513 111348 98460 -78779 4576 223537 187811 -33711 247601 -248768
9390 -458324 110050 136090 18194 44931 -182613 51042 79806 92465 -133896 46870 67556
$$ packed form
9469b53938j4870C5640b26821D6571a26796o8747e833k77154A41316b00949k0324
9458b21273a5410j22542K5890A78226e141E430a71935P8706k0813j81728J00697
9447a95073A18751J25469b31027C0787b93538B09163q441c95131B23213d1534
9436D027a60973B53395a07083j64276G0580a77450A32062c28455a25148B9478
9425a08700j63017a04348M1413j33732g0807n2942j98421a05213j4481m4653D8385
9413a72843M9590h840C666a21155m34045e783n5094A61172f1216j65393M8680
9402a77929P0804j68388A11348j2888g8779D576K18961l5726c3711B47601b48768
9390d58324A10050K6040A8194K6737a82613E1042K8764J2659a33896D6870K0686
$$ plain form
9379 67556 -26247 -61796 -125964 -216583 -116227 -86944 -246297 38796 -264099 -106186 162935
9367 -397707 -319699 9569 -352466 142082 -82656 -300279 183206 -170754 162135 -64888 -20143
9355 -120047 -60788 -327561 -35240 -129038 -173679 -7045 -382856 1892 -142366 -218238 -275977
9344 -275977 -217713 72886 -138738 94307 -252489 -22236 -261905 -66846 -130233 -17961 -129255
9333 -129255 21053 -14155 79975 11690 2882 -82859 185242 -245250 183979 125231 16416
9321 -177546 -33795 193563 274811 -233206 151463 -229638 -2461 -121663 -144546 104544 -235845
9309 -373537 -27476 -188583 19935 -220535 -412298 -299404 -118525 182700 260187 151557
9299 151557 297634 153371 -51491 -170734 -317867 31064 -131264 -141153 29943 -242450 34114
$$ packed form
9379F7556b6247l5549o4168r0619J00356K9283j59353C8796b64099a06186A62935
9367c97707P8008I569c52466A42082h2656k17623A83206a70754A62135f4888b0143
9355a20047N9259k66773c5240r3798m4641g045l75811A892a42366p5872n7739
9344b75977N8264G2886a38738I4307b52489b2236k39669f6846o3387a7961j11294
9333a29255B1053a4155G9975A1690B882h2859A85242b45250A83979n8748A6416
9321a77546c3795A93563Q1248b33206A51463b29638b461j19202k2883A04544b35845
9309c73537b7476j61107A9935b20535j91763J12894a18525A82700P7487j08630
9299A51557J46077j44263e1491j19243j47133C1064a31264r889B9943b42450C4114
$$ plain form
9287 -142864 -240113 -213724 43859 -171334 -182409 -185534 -384352 -102647 384780 -188148 -193814
9276 -193814 -46214 -72523 86487 -158110 -78720 -209771 336541 103111 27571 -31152 -76104
9265 -76104 -351077 -113644 172434 -52427 -107203 347792 -138986 -216445 140274 116043 -37404
9253 -86849 80936 314988 -78845 -10236 -27890 -81599 -278820 -46287 169496 134977 4599
9241 -56026 -358645 370945 32633 -122571 135817 -91571 86972 -346220 39921 92826 -201882
9229 -127981 -31797 76619 -105731 -107223 12664 -112059 -144401 97536 -244791 -173004 -32562
9217 185634 -151390 31056 -81559 -601888 -60090 156290 44947 3882 -132145 -44738 -43625
9206 -43625 -95975 -115769 -284069 -565139 -11077 -129564 -368582 54721 -244646 -207715 -835
$$ packed form
9287a42864r7249K6389D3859a71334j1075l125j98818a02647C84780a88148n666
9276a93814d6214k6309H6487a58110g8720j31051C36541A03111B7571c1152m4952
9265g6104k74973a13644A72434e2427n4776C47792a38986p7459A40274k4231c7404
9253h6849H0936K34052g8845a0236j7654n3709j97221d6287A69496l4519D599
9241e6026l02619C70945C2633a22571A35817i1571H6972c46220C9921N2905b01882
9229a27981c1797G6619a05731j492A2664a12059l2342I7536b44791P1787c2562
9217A85634a51390C1056h1559n20329f0090A56290D4947C882a32145d4738J113
9206d3625n2350j9794j68300k81070a1077j18487k39018E4721b44646L6931h35
$$ plain form
9194 -212577 7626 50213 263074 -334445 -37704 31302 182594 -210343 -360464 -339015 -180530
9183 -180530 -419679 -266489 -175280 23073 -80514 84188 -132966 -80754 -262273 131851 65772
9171 82954 -28064 65178 -120859 -303097 215693 72693 -87349 24340 -377250 93353 -157464
9159 -85402 -138540 -134451 130604 -153975 -11610 -212180 -74282 84479 -87855 71767 -156644
9147 -3404 -37680 -1580 200274 -191067 -425983 210068 173819 -26380 60051 -35156 -24802
9136 -24802 95770 -207394 -109321 -10282 -123367 -224213 -27274 -73269 -183341 -117077 -54767
9124 237515 -137002 38768 62930 48504 -257241 22902 -173651 -4177 234119 -22641 -464234
9113 -464234 9734 -187142 20356 -220244 -225761 31959 -13082 203096 201366 -391392 91423
$$ packed form
9194b12577G626M2587K12861c34445c7704C1302J51292b10343j50121K1449J58485
9183a80530k39149J53190R1209B3073h0514H4188a32966N2212j81519A31851F5772
9171H2954b8064F5178a20859j82238B15693G2693h7349B4340c77250I3353a57464
9159h5402n3138M089A30604a53975a1610k00570g4282H4479h7855G1767a56644
9147c404l4276a580B00274a91067k34916B10068l6249b6380F0051c5156J0354
9136b4802I5770b07394R8073a0282j13085j00846b7274m5995j10072O6264e4767
9124B37515a37002C8768K4162j4426b57241B2902a73651d177B34119b2641m41593
9113d64234I734a87142B0356b20244n517C1959a3082B03096j730c91392I1423
$$ plain form
9101 -279230 -133758 -225773 76002 27722 311783 -53573 -130373 -374230 -205059 -346751 411
9089 -244328 245989 -250059 287635 -164006 -19931 -59104 80220 45760 -202194 -190509 -275083
9078 -275083 201559 -167610 -123154 -75574 -187937 266453 -475032 210907 -319173 -232917
9068 -232917 -165863 809 -71389 62121 -61162 45035 3941 -279245 -89868 76487 62063 -429012
9055 -53119 -302081 21771 115740 -191808 -87589 -152857 -133758 -265291 51982 -224669 174354
9043 -61134 -57243 -141921 294374 -331111 -87096 -223723 131362 -229542 82194 -143718 -48754
9031 -57868 171513 54564 -282598 -360271 289218 -268111 14464 -163292 105483 239437
9021 239437 -240668 196895 173383 120946 85785 -45561 82921 146468 -67431 -5059 180143
$$ packed form
9101b79230a33758r2015G6002B7722K84061e3573p6800k43857J69171j41692D11
9089b44328B45989b50059B87635a64006a9931l9173H0220l4460b02194J1685q4574
9078b75083B01559a67610M4456M7580j12363B66453d75032B10907c19173Q6256
9068b32917O7054H09g1389F2121f1162D5035C941b79245h9868G6487j4424d29012
9055e3119k48962B1771R3969a91808h7589o5268J9099j31533E1982b24669A74354
9043f1134L891q4678B94374c31111h7096j36627A31362b29542H2194a43718d8754
9031e7868A71513E4564b82598p7673B89218b68111A4464a63292A05483J33954
9021B39437b40668A96895k3512n2437l5161d5561H2921O3547f7431e059A80143
$$ plain form
9009 70703 93575 50910 -167798 -71504 -124351 -391439 221385 116036 18735 93840 71133
8998 71133 238276 -102431 45131 -42314 55039 -114205 85605 -87009 -26951 -133041 -282120
8987 -282120 -79129 -259610 17142 96004 -55573 -146764 20772 -146364 -325502 -46830 -109190
8976 -109190 253025 -43631 123856 -103509 -126989 -222553 19055 -278899 192349 -128094
8965 -349512 -39336 68051 -118977 -526916 -93580 342048 244656 13446 -127349 -32466 396198
8953 90583 -63072 -108763 -15905 -25913 -812 -235160 -354005 -157150 -2717 -36733 -82310 6 36769
8940 36769 -163558 164189 116294 -40767 -98815 -154780 -258630 74216 472588 189944 101295
8929 101295 131769 -219606 220392 249488 378937 156530 258139 527385 1512703 3486940
$$ packed form
9009G0703K2872m2665a67798g1504n2847k67088B21385j05349A8735P5105k2707
8998G1133J67143a02431D5131d2314E5039a14205H5605h7009b6951j06090j49079
8987b82120g9129j80481A7142P8862e5573r1191B0772a46364j79138d6830o2360
8976a09190B53025d3631A23856a03509k3480r5564A9055b78899A92349a28094
8965c49512c9336F8051a18977m07939i3580C42048r7392A3446a27349c2466C96198
8953I0583f3072m5691a5905j0008h12k34348j18845a57150b717l4016m5577FL6763
8940C6769a63558A64189m7895d0767n8048n5965j03850G4216L98372A89944q8649
8929A01295L0474b19606B20392K9096J29449A56530J01609K69246R85318J974237
$$ plain form
8919 3486940 12054841 5094675 851021 127934 -33933 66797 -3659 -32798 -132905 17294
8908 161636 -300729 268425 -5863 253619 -6038 -166432 -227678 83492 -157310 3543 -57624
8896 -151572 -132701 -110361 32336 61607 -161347 -120944 -157666 -76425 79967 157276 -146407
8884 79289 -175295 -255977 124912 -416420 -32889 -60085 78545 -392532 -203580 -364174 31039
8872 -128514 -388981 -59749 -38691 -152146 -225888 262805 155757 4542 -323848 117640 -45462
$$ packed form
8919C486940Q567901E094675H51021A27934c3933F6797c659k9139j00107A7294
8908A61636c00729B68425e863B53619f038j60394o1246H3492a57310C543e7624
8896a51572J8871K2340C2336K9271a61347M0403l6722g6425G9967P7309a46407
8884G9289a75295q0682A24912d16420c2889k7196G8545c92532J88952j60594C1039
8872a28514k60467e9749K1058j13455p3742B62805j07048D542c23848A17640d5462
$$ [...]
##END NTUPLES=NMR SPECTRUM
##END=
