
##TITLE=AC1068_TOPL01_6519229_qYJ3gEzVqc
##JCAMPDX= 6.0         $$ Bruker NMR JCAMP-DX V2.0
##DATA TYPE= NMR SPECTRUM
##DATA CLASS= NTUPLES
##ORIGIN= BRUKER
##OWNER= Administrator
$$ 1.72 TOPSPIN		Version 2.1
$$ 2012-07-14 10:19:11.843 -0500  Administrator@TOPSPIN
$$ Compression mode = diff/dup
##.OBSERVE FREQUENCY= 400.02188249412
##.OBSERVE NUCLEUS= ^1H
##.ACQUISITION MODE= SIMULTANEOUS (DQD)
##.ACQUISITION SCHEME= undefined
##.AVERAGES= 64
##.DIGITISER RES= 22
##SPECTROMETER/DATA SYSTEM= spect
##.PULSE SEQUENCE= noesygpps1d.comp
##.SOLVENT NAME= COFFEE_meoh
##.SHIFT REFERENCE= INTERNAL, COFFEE_meoh, 1, 14.96255
##AUDIT TRAIL= $$ (NUMBER, WHEN, WHO, WHERE, PROCESS, VERSION, WHAT)
$$ ##TITLE= Audit trail, TOPSPIN		Version 2.1
$$ ##JCAMPDX= 5.01
$$ ##ORIGIN= Bruker BioSpin GmbH
$$ ##OWNER= Administrator
$$ $$ C:\Bruker\TOPSPIN/data/COFFEE/nmr/AC1068_TOPL01_6519229_qYJ3gEzVqc/52/pdata/1/auditp.txt
$$ ##AUDIT TRAIL=  $$ (NUMBER, WHEN, WHO, WHERE, PROCESS, VERSION, WHAT)
(   1,<2012-07-14 10:19:06.296 -0500>,<Administrator>,<TOPSPIN>,<go>,<TOPSPIN 2.1>,
      <created by zg
	started at 2012-07-14 10:07:35.968 -0500,
	POWCHK enabled, PULCHK disabled,
       configuration hash MD5:
       6B 1B 68 BB D9 2E 58 E2 7F 35 AD 54 07 DF 0E 41
       data hash MD5: 64K
       8D BF 35 51 CB 0C 32 3D 08 53 9A E8 C0 16 7A 32>)
(   2,<2012-07-14 10:19:08.984 -0500>,<Administrator>,<TOPSPIN>,<proc1d>,<TOPSPIN 2.1>,
      <Start of raw data processing
       efp LB = 0.3 FT_mod = 6 PKNL = 1 PHC0 = 0 PHC1 = 0 SI = 128K 
       data hash MD5: 128K
       01 12 78 F9 93 48 70 0B 07 C3 E2 F9 DB DF C3 48>)
(   3,<2012-07-14 10:19:10.265 -0500>,<Administrator>,<TOPSPIN>,<proc1d>,<TOPSPIN 2.1>,
      <pk PHC0 = 1.895142 PHC1 = 0 
       data hash MD5: 128K
       4D 95 F0 D8 CC 19 8A 87 C2 98 F1 27 52 6E FA 59>)
(   4,<2012-07-14 10:19:10.671 -0500>,<Administrator>,<TOPSPIN>,<proc1d>,<TOPSPIN 2.1>,
      <abs ABSG = 1 
       data hash MD5: 128K
       4C 08 41 6C 58 55 FA 6D B4 54 E3 3A 59 B0 4D B5>)
(   5,<2012-07-14 10:19:10.859 -0500>,<Administrator>,<TOPSPIN>,<proc1d>,<TOPSPIN 2.1>,
      <abs ABSG = 2 
       data hash MD5: 128K
       98 25 C4 F5 72 9B F6 79 FB 18 44 52 9C 7B 9A 48>)
(   6,<2012-07-14 10:19:11.078 -0500>,<Administrator>,<TOPSPIN>,<proc1d>,<TOPSPIN 2.1>,
      <abs ABSG = 3 
       data hash MD5: 128K
       CE FA 01 B2 30 72 80 7D FF CF 37 12 0C 6A B3 4E>)
(   7,<2012-07-14 10:19:11.328 -0500>,<Administrator>,<TOPSPIN>,<proc1d>,<TOPSPIN 2.1>,
      <abs ABSG = 4 
       data hash MD5: 128K
       F7 01 4C F1 96 E3 BC E9 56 6E FE AD C7 48 D1 73>)
(   8,<2012-07-14 10:19:11.468 -0500>,<Administrator>,<TOPSPIN>,<proc1d>,<TOPSPIN 2.1>,
      <abs ABSG = 5 
       data hash MD5: 128K
       95 0D 4B C2 7B 37 C7 B0 6B 25 64 B9 35 A4 43 4C>)
$$ ##END=
$$ 
$$ $$ hash MD5
$$ $$ 31 6D CE 34 8C 05 D8 A7 F0 8D B8 46 E3 59 F7 EE
##$RELAX= 
##$RELAX= 
##$RELAX= 
##$RELAX= 
##$RELAX= 
##$RELAX= 
##$RELAX= 
##$RELAX= 
##$RELAX= 
$$ Bruker specific parameters
$$ [...]
##$TP07= 0
##$TPNAME0= <>
##$TPNAME1= <>
##$TPNAME2= <>
##$TPNAME3= <>
##$TPNAME4= <>
##$TPNAME5= <>
##$TPNAME6= <>
##$TPNAME7= <>
##$TPOAL= (0..7)
0.5 0.5 0.5 0.5 0.5 0.5 0.5 0.5
##$TPOFFS= (0..7)
0 0 0 0 0 0 0 0
##$TUNHIN= 0
##$TUNHOUT= 0
##$TUNXOUT= 0
##$USERA1= <user>
##$USERA2= <user>
##$USERA3= <user>
##$USERA4= <user>
##$USERA5= <user>
##$V9= 5
##$VALIST= <valist>
##$VCLIST= <CCCCCCCCCCCCCCC>
##$VD= 0
##$VDLIST= <DDDDDDDDDDDDDDD>
##$VPLIST= <PPPPPPPPPPPPPPP>
##$VTLIST= <TTTTTTTTTTTTTTT>
##$WBST= 2048
##$WBSW= 25
##$XGAIN= (0..3)
0 0 0 0
##$XL= 0
##$YL= 0
##$YMAX_a= 17993533
##$YMIN_a= -10923594
##$ZGOPTNS= <>
##$ZL1= 120
##$ZL2= 120
##$ZL3= 120
##$ZL4= 120
##$ABSF1= 14.96255
##$ABSF2= -5.595632
##$ABSG= 5
##$ABSL= 3
##$ALPHA= 0
##$AQORDER= 0
##$ASSFAC= 0
##$ASSFACI= 0
##$ASSFACX= 0
##$ASSWID= 0
##$AUNMP= <proc_prof1d_extract.lims>
##$AXLEFT= 0
##$AXNAME= <>
##$AXNUC= <1H>
##$AXRIGHT= 0
##$AXTYPE= 0
##$AXUNIT= <>
##$AZFE= 0.1
##$AZFW= 0.1
##$BCFW= 0
##$BC_mod= 0
##$BYTORDP= 0
##$COROFFS= 0
##$CY= 15
##$DATMOD= 1
##$DC= 0
##$DFILT= <>
##$DTYPP= 0
##$F1P= 0
##$F2P= 0
##$FCOR= 0.5
##$FTSIZE= 131072
##$FT_mod= 6
##$GAMMA= 0
##$GB= 0
##$INTBC= 1
##$INTSCL= 1
##$ISEN= 128
##$LB= 0.3
##$LEV0= 0
##$LPBIN= 0
##$MAXI= 10000
##$MC2= 0
##$MEAN= 0
##$ME_mod= 0
##$MI= 0
##$NCOEF= 0
##$NC_proc= -2
##$NLEV= 6
##$NOISF1= 0
##$NOISF2= 0
##$NSP= 0
##$NTH_PI= 0
##$NZP= 0
##$OFFSET= 14.96255
##$PC= 1
##$PHC0= 1.895142
##$PHC1= 0
##$PH_mod= 1
##$PKNL= yes
##$PPARMOD= 0
##$PPDIAG= 0
##$PPIPTYP= 0
##$PPMPNUM= 2147483647
##$PPRESOL= 1
##$PSCAL= 4
##$PSIGN= 0
##$PYNMP= <proc.py>
##$REVERSE= no
##$SF= 400.02000901863
##$SI= 131072
##$SIGF1= 0
##$SIGF2= 0
##$SINO= 400
##$SIOLD= 131072
##$SPECTYP= <>
##$SREGLST= <1H.CDCl3>
##$SSB= 0
##$STSI= 131072
##$STSR= 0
##$SW_p= 8223.68421052631
##$SYMM= 0
##$S_DEV= 0
##$TDeff= 65536
##$TDoff= 0
##$TI= <>
##$TILT= no
##$TM1= 0
##$TM2= 0
##$TOPLEV= 0
##$USERP1= <user>
##$USERP2= <user>
##$USERP3= <user>
##$USERP4= <user>
##$USERP5= <user>
##$WDW= 1
##$XDIM= 131072
##$YMAX_p= 453833310
##$YMIN_p= -14372
##$CURPLOT= <Network HP LaserJet P1505>
##$CURPRIN= <$Network HP LaserJet P1505>
##$DFORMAT= <normdp>
##$LAYOUT= <+/1D_H.xwp>
##$LFORMAT= <normlp>
##$PFORMAT= <normpl>
##$SURQMSG= 1
$$ End of Bruker specific parameters
$$ ---------------------------------
##NTUPLES= NMR SPECTRUM
##VAR_NAME=  FREQUENCY,     SPECTRUM/REAL,   SPECTRUM/IMAG
##SYMBOL=    X,             R,               I
##VAR_TYPE=  INDEPENDENT,   DEPENDENT,       DEPENDENT
##VAR_FORM=  AFFN,          ASDF,            ASDF
##VAR_DIM=   131072,        131072,          131072
##UNITS=     HZ,            ARBITRARY UNITS, ARBITRARY UNITS
##FACTOR=    0.0627417313425164, 1,          1
##FIRST=     8223.62146879497, -46,          -68546
##LAST=      0,             2150,            -69547
##MIN=       0,             -14372,          0
##MAX=       8223.62146879497, 453833310,    0
$$ Real data points
##PAGE= N=1
##DATA TABLE= (X++(R..R)), XYDATA
$$ [...]
60941E694402o09524n04862m20057l53115l01759k62731k32634k08708j89058
60932B611954j72587j58609j46160j34067j21764j09583r7990q7041p6861o8078
60922A439214o1475n7458n5832n5605n5113n3057m9573m5698m1832l7589l3099
60911H92883k9254k6376k3726k0819j8238j6486j5024j3237j1489j0374r628q661
60899F89571p561o741o048n134m247l723l069j493Q45K947M257N067N800O579
60885F77050P455Q370Q895Q651P904P191O453N219L537K013Q55l82j948l462m632
60870G33169n726o988q016q248p845p575p892q497q802q547p826o791n550m254
60856F30612l031j816n07O93J455J933K751M107N412O324P632J0275J3799J6718
$$ y = [5694402, 5084878, 4580016, 4159959, 3806844, 3505085, 3242354, 3009720, 2801012, 2611954, 2439367, 2280758, 2134598, 2000531, 1878767, 1769184, 1671194, 1584153, 1507292, 1439214, 1377739, 1320281, 1264449, 1208844, 1153731, 1100674, 1051101, 1005403, 963571, 925982, 892883, 863629, 837253, 813527, 792708, 774470, 757984, 742960, 729723, 718234, 707860, 698232, 689571, 682010, 675269, 669221, 664087, 659840, 656117, 653048, 651555, 652400, 655347, 659604, 664671, 670471, 677050, 684505, 692875, 701770, 710421, 718325, 725516, 731969, 737188, 740725, 742738, 743593, 743211, 741263, 737801, 733169, 727443, 720455, 712439, 704191, 696346, 688771, 680879, 672382, 663580, 655033, 647207, 640416, 634866, 630612, 627581, 625765, 625258, 625951, 627406, 629339, 632090, 636197, 641609, 647933, 655565, 665840, 679639, 696357]
60842F96357J8369J9362K0162K0385J9846J9185J8754J7821J5734J3189J1421
60831H90585J0679J0325J0047J0007R997R321P592N108K498M22o81j004j248j668
60817I61980j680j002o53j882m436o851q330r385j0649j2028j3208j4161j4846
60804H62869j5106j5103j5194j5188j4403j2720j0983r888r115p996o484m958
60792G25731l457j754M2J635L185N188P590R574J0493J0700J1059J1773J2114
60779H03873J1416R996Q848Q570Q820Q803Q016O648N451N126N584N892N360M506
60765I06909M426N314O241O539O590O956P451P586P416P340P458P600P636P278
60751A002740O066M165K733K733L621M032L560L067L230L549L083J555n01k390
$$ y = [696357, 714726, 734088, 754250, 774635, 794481, 813666, 832420, 850241, 865975, 879164, 890585, 901264, 911589, 921636, 931643, 941640, 950961, 958553, 963661, 966159, 966581, 965900, 964896, 963648, 961980, 960300, 959298, 958645, 956763, 952327, 945476, 937146, 927761, 917112, 905084, 891876, 877715, 862869, 847763, 832660, 817466, 802278, 787875, 775155, 764172, 754284, 745169, 737173, 730689, 725731, 722274, 720520, 720562, 722197, 725382, 730570, 738160, 747734, 758227, 768927, 779986, 791759, 803873, 815289, 825285, 834133, 842703, 851523, 860326, 868342, 874990, 880441, 885567, 891151, 897043, 902403, 906909, 911335, 916649, 922890, 929429, 936019, 942975, 950426, 958012, 965428, 972768, 980226, 987826, 995462, 1002740, 1008806, 1012971, 1015704, 1018437, 1022058, 1026090, 1029650, 1032717, 1035947, 1039496, 1042579, 1044134, 1043633, 1041243]
60737A041243l737m537m858m662m106l892m853o890q860r805r836r498q937q237
60723I48535p875q039q050p343o578o796p788q393q208p896p897p918p876q226
60709H39652r026r579r297q245o650m687k934k107j986j381M28K853M916O267
60695G98224P011P274P317P377P035N400K374r94l765o092q484j0831j2730j4149
60681G84967j5169j5661j5722j5874j6168j5756j4045j1705r774q232o409m369
60669F36083k932k376k056j322r5J453L076M269M611M366M220M300M097L369K474
60654F63537J657O99l70q64k25J195K583L566M230M567M481M157L965L906L605
60639G00689K964K442K623L758N745Q204J0409J1612J1801J1918J2897J4652J6300
$$ y = [1041243, 1037506, 1032969, 1028111, 1023449, 1019343, 1015451, 1010598, 1003708, 994848, 985043, 975207, 965709, 956772, 948535, 940660, 932621, 924571, 917228, 910650, 903854, 896066, 887673, 879465, 871569, 863672, 855754, 847878, 839652, 830626, 821047, 811750, 803505, 796855, 792168, 789234, 787127, 785141, 783760, 784188, 787041, 791957, 798224, 805235, 812509, 819826, 827203, 834238, 839638, 842012, 841018, 837253, 831161, 822677, 811846, 799116, 784967, 769798, 754137, 738415, 722541, 706373, 690617, 676572, 664867, 655093, 646861, 640452, 636083, 633151, 630775, 628719, 627397, 627302, 628755, 631831, 636100, 640711, 645077, 649297, 653597, 657694, 661063, 663537, 665194, 665893, 665523, 664659, 664434, 665629, 668212, 671778, 676008, 680575, 685056, 689213, 693178, 697084, 700689, 703653, 706095, 708718, 712476, 718221, 726425, 736834, 748446, 760247, 772165, 785062, 799714, 816014]
60626H16014J7179J7328J7139J7013J7224J7546J7136J5333J2609J0038P868N339
60614I87766K126r55l082m511n990p772r661j1348j2149j1235q882o724n885n576
60600H96122m575l292l076m044n173o213p918j0284j2083j2415j1486r622o879
60587G99062l962k065j257k63J565L326M143M438M748M544L307J781J015R06P98
60572H22086Q42J567K613K999K438J503P06J16m18j260k873n058o807p463p517
60557H03474p602p495o895o467o903p472o730m392j454J311L851O006P386Q141
60543G74759Q929J0091J1694J4145J7818K2158K6271L0312L5116M0276M3833M4199
60531A079601M1362L5866K7759J7214N345o307j6669k5047l0770l3441l3191l0404
$$ y = [816014, 833193, 850521, 867660, 884673, 901897, 919443, 936579, 951912, 964521, 974559, 982427, 987766, 989892, 988937, 985855, 981344, 975354, 967582, 957921, 946573, 934424, 923189, 914307, 907583, 901698, 896122, 891547, 888255, 885179, 881135, 875962, 869749, 861831, 851547, 839464, 827049, 815563, 805941, 799062, 795100, 793035, 791778, 791515, 793080, 796406, 800549, 804987, 809735, 814279, 817586, 819367, 820382, 821288, 822086, 822928, 824495, 827108, 830107, 832545, 834048, 834754, 834870, 834452, 833192, 830319, 825261, 818454, 810991, 803474, 795872, 788377, 781482, 775015, 768112, 760640, 753910, 749518, 748064, 749375, 753226, 759232, 766618, 774759, 783688, 793779, 805473, 819618, 837436, 859594, 885865, 916177, 951293, 991569, 1035402, 1079601, 1120963, 1156829, 1184588, 1201802, 1207147, 1200840, 1184171, 1159124, 1128354, 1094913, 1061722, 1031318]
60519A031318k5545j9434j3065o952j110M131Q050J0478J2062J3260J3755J3318
60507A040266J2481J1946J1927J2634J4613J7965K1868K5741L0389L7084M5853
60496A282767N5618O5909P7511R1354J07474J25258J44133J63819J84374K06220
60486B504437K29869K55542K83229L12677L42168L66761L78243L67783L29424
60477E370133K61961J68841N7215o2925j79844k81698l58723m05449m21996m13497
60467C734018l87697l52165l12698k73237k36351k03437j74835j50199j29040
60458A514359j11022r5951q3613p3594o5172n7537n0245m3434l7437l2406k8388
60447H35560k5457k3409k1538j9279j7003j5537j4834j3905j2267j0719j0147
$$ y = [1031318, 1005773, 986339, 973274, 966322, 965212, 969343, 977393, 987871, 999933, 1013193, 1026948, 1040266, 1052747, 1064693, 1076620, 1089254, 1103867, 1121832, 1143700, 1169441, 1199830, 1236914, 1282767, 1338385, 1404294, 1481805, 1573159, 1680633, 1805891, 1950024, 2113843, 2298217, 2504437, 2734306, 2989848, 3273077, 3585754, 3927922, 4294683, 4672926, 5040709, 5370133, 5632094, 5800935, 5858150, 5795225, 5615381, 5333683, 4974960, 4569511, 4147515, 3734018, 3346321, 2994156, 2681458, 2408221, 2171870, 1968433, 1793598, 1643399, 1514359, 1403337, 1307386, 1223773, 1150179, 1085007, 1027470, 977225, 933791, 896354, 863948, 835560, 810103, 786694, 765156, 745877, 728874, 713337, 698503, 684598, 672331, 661612, 651465]
60436F51465j0211r941r144q408q008p675p268o837o050m441k366r31o63r15q44
60421E67763l60K06P15J172J533J968K785L725L993L401K946L521M544M685L669
60406F06266K578K385K982L710M187M385M423M554M960N335N079M102L116K880
60392F60942L457M408N303N765N405M232K952K328K308K171J516O01k75j169k057
60377F97887k540k408k075k053k216k117j757j458j096j67J227K161J970J150
60363F86508P01R80J558J972K148K190K227K448K995L793M641N428O064O424O586
60348G36663O928P660Q385Q539Q193P981Q178Q283P644O145M119J868l76k227
60334H17983l197l114k321j401o42J56J300K772M322N947P860R821J0889J0252
$$ y = [651465, 641254, 631313, 622169, 613761, 605753, 598078, 590810, 583973, 577923, 573482, 571116, 570185, 569522, 568607, 567763, 567403, 567609, 568324, 569496, 571029, 572997, 575782, 579507, 583500, 586901, 589847, 593368, 597912, 602597, 606266, 608844, 611229, 614211, 617921, 622108, 626493, 630916, 635470, 640430, 645765, 650844, 654946, 658062, 660942, 664399, 668807, 674110, 679875, 685280, 689512, 692464, 694792, 697100, 699271, 700787, 701388, 701113, 699944, 697887, 695347, 692939, 690864, 688811, 686595, 684478, 682721, 681263, 680167, 680000, 681227, 683388, 685358, 686508, 687209, 688189, 689747, 691719, 693867, 696057, 698284, 700732, 703727, 707520, 712161, 717589, 723653, 730077, 736663, 743591, 751251, 759636, 768175, 776368, 784349, 792527, 800810, 808454, 814599, 818718, 820586, 820210, 817983, 814786, 811672, 809351, 807950, 807308, 807464, 808764, 811536, 815858, 821805, 829665, 839486, 850375, 860627]
60320H60627Q145N524K953K19k919o057q411r530r603r145q445p339n646l793
60306H06580k715k856l493l492k549j328m97j26L4K24P70K014L843N574O560O730
60290H15273O436N952N264M254K981J833J318J505J774J442O00nQ9O40J188J599
60274H52143K008K655L817N518P179Q073Q288Q750J0042J1665J2903J3945J5507
60261I62493J7657J9770K1636K3939K7270L1226L4906L8122M1599M5974N0970
60250A315562N5863O0522O5589P1656P8582Q5857R3215J00588J07619J13738J18695
60239B267486J22641J25502J26633J25314J21363J15078J06713R6236Q3617O9248
60229C359831N4057L9082K4801J0868l339j7833l1742m3732n2623n7823n9523
$$ y = [860627, 868772, 874296, 877249, 877468, 874549, 868492, 860081, 850551, 840948, 831803, 823358, 816019, 810373, 806580, 803865, 801009, 797516, 794024, 791475, 790147, 789650, 789524, 789558, 789782, 790552, 792566, 796409, 801983, 808543, 815273, 821709, 827661, 832925, 837179, 840160, 841993, 843311, 844816, 846590, 848032, 848632, 848627, 848716, 849356, 850544, 852143, 854151, 856806, 860623, 866141, 873320, 881393, 889681, 898431, 908473, 920138, 933041, 946986, 962493, 980150, 999920, 1021556, 1045495, 1072765, 1103991, 1138897, 1177019, 1218618, 1264592, 1315562, 1371425, 1431947, 1497536, 1569192, 1647774, 1733631, 1826846, 1927434, 2035053, 2148791, 2267486, 2390127, 2515629, 2642262, 2767576, 2888939, 3004017, 3110730, 3206966, 3290583, 3359831, 3413888, 3452970, 3477771, 3488639, 3485300, 3467467, 3435725, 3391993, 3339370, 3281547, 3222024]
60218C222024n8522n5529n0591m3395l4095k3489j2234k71J2777K6827M1204N5231
60206C079937O8721Q1872R4722J06842J17515J26173J32394J35576J34932J30089
60196D208773J21373J09252R3788P5143N4363L3120J2460p680k7769m7724o6772
60185D558327q3772r7596j07415j12844j13787j10361j03164r3287q1559o8020
60175C586522n2534l5750j8723j727J5719L3526N0548O5681P8681Q9520R7583
60164C909046J01998J02354R8623R0786P9028O4074M7049K9168J1639m593j9282
60153D509890l2635m4291n3018n7641n7900n4086m6447l5395k1832o642R886K7817
60141D137706M7068O7489Q9030J11474J34447J58141J83466K10831K39268K67364
$$ y = [3222024, 3163502, 3107973, 3057382, 3013987, 2979892, 2956403, 2944169, 2943898, 2956675, 2983502, 3024706, 3079937, 3148658, 3230530, 3325252, 3432094, 3549609, 3675782, 3808176, 3943752, 4078684, 4208773, 4330146, 4439398, 4533186, 4608329, 4662692, 4695812, 4708272, 4700592, 4672823, 4625099, 4558327, 4474555, 4376959, 4269544, 4156700, 4042913, 3932552, 3829388, 3736101, 3654542, 3586522, 3533988, 3498238, 3479515, 3477788, 3493507, 3527033, 3577581, 3643262, 3721943, 3811463, 3909046, 4011044, 4113398, 4212021, 4302807, 4381835, 4445909, 4492958, 4522126, 4533765, 4529172, 4509890, 4477255, 4432964, 4379946, 4322305, 4264405, 4210319, 4163872, 4128477, 4106645, 4100003, 4109889, 4137706, 4184774, 4252263, 4341293, 4452767, 4587214, 4745355, 4928821, 5139652, 5378920, 5646284]
60131E646284K94707L21591L47651L71560L91879M07402M16806M18806M12817
60122I029503L98843L76759L46415L08508K64599K16030J63419J07354M9018j0320
60112A1250128o9942j29390j87701k43009k92691l33941l64670l84119l92448
60103H852217l89866l76556l53538l23070k87924k50362k11724j72514j32716
60094F353947r2439n2441j3918K2242N5609Q5609J11195J31282J45144J52259
60084F898489J52131J44537J29652J07996Q0592M9370J6844j4966m5103p3036
60074G446506r7973j19261j37152j52584j66172j77702j86535j92237j94805j94468
60064E827617j91326j85114j75482j62636j47485j30997j13529r5053p5754n6094
$$ y = [5646284, 5940991, 6262582, 6610233, 6981793, 7373672, 7781074, 8197880, 8616686, 9029503, 9428346, 9805105, 10151520, 10460028, 10724627, 10940657, 11104076, 11211430, 11260448, 11250128, 11180186, 11050796, 10863095, 10620086, 10327395, 9993454, 9628784, 9244665, 8852217, 8462351, 8085795, 7732257, 7409187, 7121263, 6870901, 6659177, 6486663, 6353947, 6261508, 6209067, 6195149, 6217391, 6273000, 6358609, 6469804, 6601086, 6746230, 6898489, 7050620, 7195157, 7324809, 7432805, 7513397, 7562767, 7579611, 7564645, 7519542, 7446506, 7348533, 7229272, 7092120, 6939536, 6773364, 6595662, 6409127, 6216890, 6022085, 5827617, 5636291, 5451177, 5275695, 5113059, 4965574, 4834577, 4721048, 4625995, 4550241, 4494147]
60054D494147l6381j6693K769K1673M0011N8240P6689R4959J11982J26468J37172
60043E111036J43088J43749J39326J30172J16362R7938P5508N0232K3159n049
60033F025521l3614o1389q7375j11068j31856j48399j59302j64355j64548j60888
60023D802727j53742j43388j30477j15602r9037q1317o3581m6685l0243j3154
60013C925501M936K3291M1209N9024P7745R7868J18745J39107J58062J75386J90741
60002E011615K02792K09513K09434K02290J88503J68620J43505J14503Q2980M9929
59992F583684J6290j6871m8929p9869j09285j35633j57101j72889j82926j86798
59982E509673j84003j75144j61851j45355j26050j04518q2051n9656l7399j5165
$$ y = [4494147, 4457766, 4441073, 4443842, 4465515, 4505526, 4563766, 4640455, 4735414, 4847396, 4973864, 5111036, 5254124, 5397873, 5537199, 5667371, 5783733, 5881671, 5957179, 6007411, 6030570, 6025521, 5991907, 5930518, 5843143, 5732075, 5600219, 5451820, 5292518, 5128163, 4963615, 4802727, 4648985, 4505597, 4375120, 4259518, 4160481, 4079164, 4015583, 3968898, 3938655, 3925501, 3930437, 3953728, 3994937, 4053961, 4131706, 4229574, 4348319, 4487426, 4645488, 4820874, 5011615, 5214407, 5423920, 5633354, 5835644, 6024147, 6192767, 6336272, 6450775, 6533755, 6583684, 6599974, 6583103, 6534174, 6454305, 6345020, 6209387, 6052286, 5879397, 5696471, 5509673, 5325670, 5150526, 4988675, 4843320, 4717270, 4612752, 4530701, 4471045, 4433646, 4418481]
59972D418481O599K7449M7502O6770Q4376R9222J11064J20293J26872J30161J29755
59961E368544J25912J19085J09521R7423Q3172O7334N0730L4467J9650O929l480
59950F079287j1380j6278j7510j4380o360O682K4406M6342P2205J01740J34425
59939F399179J69683K07372K47611K89977L33124L75346M15208M51182M80781
59930I369463N00355N05998M94553M63898M12749L40873K49809J43478K8073q8762
59920A2420487j99241k96817l77086m37659m77514m96924m98060m84846m61361
59911H690979m30230l92917l51278l07977k65079k22960j81101j39656r9590o1501
59901F238690k4916J1031M6605Q1359J14638J45772J73828J97536K15662K27230
$$ y = [4418481, 4425080, 4452529, 4500031, 4566801, 4651177, 4750399, 4861463, 4981756, 5108628, 5238789, 5368544, 5494456, 5613541, 5723062, 5820485, 5903657, 5970991, 6021721, 6056188, 6075838, 6082767, 6079287, 6067907, 6051629, 6034119, 6019739, 6013379, 6020061, 6044467, 6090809, 6163014, 6264754, 6399179, 6568862, 6776234, 7023845, 7313822, 7646946, 8022292, 8437500, 8888682, 9369463, 9869818, 10375816, 10870369, 11334267, 11747016, 12087889, 12337698, 12481176, 12509249, 12420487, 12221246, 11924429, 11547343, 11109684, 10632170, 10135246, 9637186, 9152340, 8690979, 8260749, 7867832, 7516554, 7208577, 6943498, 6720538, 6539437, 6399781, 6300191, 6238690, 6213774, 6224805, 6271410, 6352769, 6467407, 6613179, 6787007, 6984543, 7200205, 7427435]
59891G427435K31123K25601K08748J79578J38650Q7503K8061l7018j03766j67495
59881H218420k24280k71747l08598l34050l48035l51436l45694l32277l12803
59872E389500k89373k64228k38925k13965j89266j64934j41607j20162j01095
59863C665945q4280o9475n7019m7707m1879l8931l7959l8574m0703m3778m6528
59852C119112m7732m6815m3759l8719l2020k4267j6176q345j351L899O242M867
59840B874936p9p630j6699k6486l6231m4793n0870n3695n3412n0671m6025l9803
59828B448542l2504k4905j7543j0169k131O610J5139K2623K9413L6546M4092N0733
59816B566446N5167N7565N9222O1293O4331O8479P3171P6657P6710P2107O3163
$$ y = [7427435, 7658558, 7884159, 8092907, 8272485, 8411135, 8498638, 8526699, 8489681, 8385915, 8218420, 7994140, 7722393, 7413795, 7079745, 6731710, 6380274, 6034580, 5702303, 5389500, 5100127, 4835899, 4596974, 4383009, 4193743, 4028809, 3887202, 3767040, 3665945, 3581665, 3512190, 3455171, 3407464, 3365585, 3326654, 3288695, 3250121, 3209418, 3165640, 3119112, 3071380, 3024565, 2980806, 2942087, 2910067, 2885800, 2869624, 2861279, 2859928, 2863827, 2870069, 2874936, 2874857, 2867227, 2850528, 2824042, 2787811, 2743018, 2692148, 2638453, 2585041, 2534370, 2488345, 2448542, 2416038, 2391133, 2373590, 2363421, 2361290, 2367900, 2383039, 2405662, 2435075, 2471621, 2515713, 2566446, 2621613, 2679178, 2738400, 2799693, 2864024, 2932503, 3005674, 3082331, 3159041, 3231148, 3294311]
59805C294311N0880L6343K1032O822m873j3669j9629k2592k2438j9552j4475p403
59793C284757J517J1756K2886L5269M9619O5900Q3324J01513J21145J43237J68354
59782D089277J96704K28554K63990L02379L42367L82143M18985M48013M61487
59773G133899M49904M04956L23111K08229P1982o8429j94885k93532l58035l89350
59763G287850l92976l76050l45718l08282k68407k28866j91153j56226j24512
59754D895660r5686o9249m5304k4315n974J1031K7872M4620O0734P6138R1411
59743D966938J07188J23811J41504J60358J80100K00291K20939K42749K66647
59734F610525K93234L22712L54997L89763M26572M65163N05388N46627N87358
$$ y = [3294311, 3345191, 3381534, 3402566, 3409388, 3404515, 3390846, 3371217, 3348625, 3326187, 3306635, 3292160, 3284757, 3286274, 3298030, 3320916, 3356185, 3405804, 3471704, 3555028, 3656541, 3777686, 3920923, 4089277, 4285981, 4514535, 4778525, 5080904, 5423271, 5805414, 6224399, 6672412, 7133899, 7583803, 7988759, 8311870, 8520099, 8592081, 8523652, 8328767, 8035235, 7677200, 7287850, 6894874, 6518824, 6173106, 5864824, 5596417, 5367551, 5176398, 5020172, 4895660, 4799974, 4730725, 4685421, 4661106, 4655132, 4666163, 4694035, 4738655, 4799389, 4875527, 4966938, 5074126, 5197937, 5339441, 5499799, 5679899, 5880190, 6101129, 6343878, 6610525, 6903759, 7226471, 7581468, 7971231, 8397803, 8862966, 9368354, 9914981, 10502339]
59725A0502339O25449O58641O84493P00151P02823O90822O64187O24629N75454
59716A6428988N21737M69938M26628L97085L84629L90531M13939M52036N00657
59707B0386168N55080O10217O60413O99406P20865P19228O90564O33186N47897
59698B6223024M37963L09095J69343K8394j03846k18684l09616l72881m07546
59689B5755246m14840l97007l56789k97732k24159j40031m7891N0968J55717K65858
59679B4349340L81271N01516O24921P48850Q70368R85724J088819J170806J221172
59670C1942787J228808J182573J072944Q95137O51605L52623J5856l34598o71164
59661C6336571r68170j206682j376079j473294j502194j472732j398236j292076
$$ y = [10502339, 11127788, 11786429, 12470922, 13171073, 13873896, 14564718, 15228905, 15853534, 16428988, 16950725, 17420663, 17847291, 18244376, 18629005, 19019536, 19433475, 19885511, 20386168, 20941248, 21551465, 22211878, 22911284, 23632149, 24351377, 25041941, 25675127, 26223024, 26660987, 26970082, 27139425, 27167819, 27063973, 26845289, 26535673, 26162792, 25755246, 25340406, 24943399, 24586610, 24288878, 24064719, 23924688, 23876797, 23927765, 24083482, 24349340, 24730611, 25232127, 25857048, 26605898, 27476266, 28461990, 29550809, 30721615, 31942787, 33171595, 34354168, 35427112, 36322249, 36973854, 37326477, 37342333, 37007735, 36336571, 35368401, 34161719, 32785640, 31312346, 29810152, 28337420, 26939184, 25647108]
59653B5647108j166567j034221r08297q01496p24649o86106o89933p32398q00228
59644A8103213q74031r35228r71600r78661r58072r15247q57157p90591p21070
59635A0101556o52453n87019n25955m70004m19695l74966l34965k98639k65469
59626F172391k35429k08486j84448j63101j43985j26226j09125r2885p8247o5436
59616D765023n4174m4702l7970l4482l3703l5114l9102m6100n5348o5339p5133
59605D243856q4454r2699r8820j02251j03190j01921r8541r3447q7359q0626p3121
59594C227427o4938n6566m8143l9367l0422k2167j4947p967n54O624J2407J6756
59582B978143K0601K4323K7271K8783K8920K8122K6774K5300K4138K3463K3270
$$ y = [25647108, 24480541, 23446320, 22538023, 21736527, 21011878, 20325772, 19635839, 18903441, 18103213, 17229182, 16293954, 15322354, 14343693, 13385621, 12470374, 11613217, 10822626, 10101556, 9449103, 8862084, 8336129, 7866125, 7446430, 7071464, 6736499, 6437860, 6172391, 5936962, 5728476, 5544028, 5380927, 5236942, 5110716, 5001591, 4908706, 4830459, 4765023, 4710849, 4666147, 4628177, 4593695, 4559992, 4524878, 4485776, 4439676, 4384328, 4318989, 4243856, 4159402, 4066703, 3967883, 3865632, 3762442, 3660521, 3561980, 3468533, 3381174, 3300548, 3227427, 3162489, 3105923, 3057780, 3018413, 2987991, 2965824, 2950877, 2942910, 2942356, 2948980, 2961387, 2978143, 2998744, 3023067, 3050338, 3079121, 3108041, 3136163, 3162937, 3188237, 3212375, 3235838, 3259108]
59571C259108K3838K5739K9262L4185M0192M7168N4997O3432P2352Q1909R2245
59560C824427J03278J14978J27673J41883J57778J74968J92880K11304K30340
59551E279509K49813K69001K87159L03955L18899L30675L37771L39773L37268
59542H053823L30332L18132L00508K79263K57150K36033K16341J97547J78384
59533A0367513J57351J34203J11002R1115P7287P0862P2068Q0017R2683J07710
59523A1361811J22990J35783J41908J36994J18632Q6682M2012j3927p8478j48003
59513A1906404k18932k87912l51293m05678m49115m80805m99861n05651m99393
59504H207764m83978m61901m34448m03088l70096l37073l04070k70983k38827
$$ y = [3259108, 3282946, 3308685, 3337947, 3372132, 3412324, 3459492, 3514489, 3577921, 3650273, 3732182, 3824427, 3927705, 4042683, 4170356, 4312239, 4470017, 4644985, 4837865, 5049169, 5279509, 5529322, 5798323, 6085482, 6389437, 6708336, 7039011, 7376782, 7716555, 8053823, 8384155, 8702287, 9002795, 9282058, 9539208, 9775241, 9991582, 10189129, 10367513, 10524864, 10659067, 10770069, 10861184, 10938471, 11009333, 11081401, 11161418, 11254101, 11361811, 11484801, 11620584, 11762492, 11899486, 12018118, 12104800, 12146812, 12132885, 12054407, 11906404, 11687472, 11399560, 11048267, 10642589, 10193474, 9712669, 9212808, 8707157, 8207764, 7723786, 7261885, 6827437, 6424349, 6054253, 5717180, 5413110, 5142127, 4903300]
59495D903300k08914j81570j56458j33462j12563r3429p5692n9177m3564k8444
59485C810027j3862l0J3629K8138M3452N8520P3228Q8898J06296J24556J42901
59474D475753J61982J82319K02819K22318K41402K60925K79453K93864L02062
59465F622897L03422K96872K80301K52253K12983J63714J05969M1910k5484r2811
59455H162026j56474k12945k59765k96231l22492l38320l43646l39892l29569
59446E562692l14708k96528k76326k55488k34642k13921j93994j75752j58975
59437C442358j42584j26437j11699r9033q7552p6153o5021n5193m7111m0109l3067
59426B558399k5394j7623j0992o009j764K900P813J1968J5181J8216K1417K4432
$$ y = [4903300, 4694386, 4512816, 4356358, 4222896, 4110333, 4016904, 3941212, 3882035, 3838471, 3810027, 3796165, 3796135, 3809764, 3837902, 3881354, 3939874, 4013102, 4102000, 4208296, 4332852, 4475753, 4637735, 4820054, 5022873, 5245191, 5486593, 5747518, 6026971, 6320835, 6622897, 6926319, 7223191, 7503492, 7755745, 7968728, 8132442, 8238411, 8280321, 8254837, 8162026, 8005552, 7792607, 7532842, 7236611, 6914119, 6575799, 6232153, 5892261, 5562692, 5247984, 4951456, 4675130, 4419642, 4185000, 3971079, 3777085, 3601333, 3442358, 3299774, 3173337, 3061638, 2962605, 2875053, 2798900, 2733879, 2678686, 2631575, 2591466, 2558399, 2533005, 2515382, 2504390, 2498381, 2496617, 2499517, 2507330, 2519298, 2534479, 2552695, 2574112, 2598544]
59414B598544K7415L1271L6408M2199M7713N1867N2792M8876M1312L4369L1993
59403C044759L4949M1912N2102O5478Q1294R8099J14858J30734J44069J53291
59393C961545J59465J66757J79563J99597K26023K57543K93582L33753L77166
59384F154994M22634M69056N15191N59059N97863O28428O47678O52855O41969
59375A1289727O14721N73116N20987M62711M02126L42178K85134K32810J86483
59366A4909993J46261J10618P6912M2570N597l5836q3252j36595j93550k50682
59356A4592036l04761l52385l89237m11306m17267m09050l90222l64697l36885
59347A1216226l11672k93215k83885k84281k93523l09291l28364l47703l64928
$$ y = [2598544, 2625959, 2657230, 2693638, 2735837, 2783550, 2835417, 2888209, 2937085, 2978397, 3012766, 3044759, 3079708, 3121620, 3173722, 3239200, 3320494, 3418593, 3533451, 3664185, 3808254, 3961545, 4121010, 4287767, 4467330, 4666927, 4892950, 5150493, 5444075, 5777828, 6154994, 6577628, 7046684, 7561875, 8120934, 8718797, 9347225, 9994903, 10647758, 11289727, 11904448, 12477564, 12998551, 13461262, 13863388, 14205566, 14490700, 14723510, 14909993, 15056254, 15166872, 15243784, 15286354, 15291951, 15256115, 15172863, 15036268, 14842718, 14592036, 14287275, 13934890, 13545653, 13134347, 12717080, 12308030, 11917808, 11553111, 11216226, 10904554, 10611339, 10327454, 10043173, 9749650, 9440359, 9111995, 8764292, 8399364]
59338H399364l77900l84702l84381l77162l63757l45022l22413k97919k72955
59329E273153k47824k22601j97975j74761j53132j32860j14003r6757q0994o6353
59319C785893n2691m0011k8186j7072o662L097J2581K2269L2327M2557N2591O2076
59307C868769P0952P9568Q8251R6711J04147J09961J14005J16121J15965J13322
59297D877772J08110R9935Q8351P3926N8500M3919L0715J8351O549l893j1330
59286E390905j4133j1697m867M763J6111K9067M3816O0171P7631R5463J12457
59275E799687J27057J38071J44924J47093J43705J34084J18328R7027P0604L9243
59265F959823L545l4696p2081j04287j27809j41415j45826j42313j32108j16867
$$ y = [8399364, 8021464, 7636762, 7252381, 6875219, 6511462, 6166440, 5844027, 5546108, 5273153, 5025329, 4802728, 4604753, 4429992, 4276860, 4144000, 4029997, 3933240, 3852246, 3785893, 3733202, 3693191, 3665005, 3647933, 3641271, 3644368, 3656949, 3679218, 3711545, 3754102, 3806693, 3868769, 3939721, 4019289, 4107540, 4204251, 4308398, 4418359, 4532364, 4648485, 4764450, 4877772, 4985882, 5085817, 5174168, 5248094, 5306594, 5350513, 5381228, 5399579, 5406128, 5402235, 5390905, 5376772, 5365075, 5360208, 5364971, 5381082, 5410149, 5453965, 5514136, 5591767, 5687230, 5799687, 5926744, 6064815, 6209739, 6356832, 6500537, 6634621, 6752949, 6849976, 6920580, 6959823, 6963368, 6928672, 6856591, 6752304, 6624495, 6483080, 6337254, 6194941, 6062833, 5945966]
59255E945966r8601p8763n8050l7347j8141j610J2086K3236L1836L7782M1254
59244E799648M2510M1730L9366L6246L3111L0607K9879L2536L9700N1677O8712
59233F245722R1144J18486J49315J82804K19456K59417L00637L39601L73211L98931
59223H678724M13505M12907L93933L55387K97950K23698J35734L7689o6496j71977
59213A0711054k72698l62606m37407m94749n33213n52165n52804n38404n12953
59204F454055m79949m42457m03455l65181l28394k92961k59241k28454k01521
59195C452442j78067j56981j37833j21115j07128r5252q4704p5441o7762o1377
59185B366782n5648n0475m6095m2127l7703l2705k8039k4451k1755j9407j6961
$$ y = [5945966, 5847365, 5768602, 5710552, 5673205, 5655064, 5653454, 5665540, 5688776, 5720612, 5758394, 5799648, 5842158, 5883888, 5923254, 5959500, 5992611, 6023218, 6053097, 6085633, 6125333, 6177010, 6245722, 6336866, 6455352, 6604667, 6787471, 7006927, 7266344, 7566981, 7906582, 8279793, 8678724, 9092229, 9505136, 9899069, 10254456, 10552406, 10776104, 10911838, 10949527, 10883031, 10711054, 10438356, 10075750, 9638343, 9143594, 8610381, 8058216, 7505412, 6967008, 6454055, 5974106, 5531649, 5128194, 4763013, 4434619, 4141658, 3882417, 3653963, 3452442, 3274375, 3117394, 2979561, 2858446, 2751318, 2656066, 2571362, 2495921, 2428159, 2366782, 2311134, 2260659, 2214564, 2172437, 2134734, 2102029, 2073990, 2049539, 2027784, 2008377, 1991416]
59174A991416j3738r030l198K262O329R526J2881J6617K0409K4292K8471L2745
59162B118982L6803M0761M4889M9127N3331N7563O1755O5726O9926P5357Q2133
59151B756353Q8904R4490R9385J04764J10629J15896J19781J22048J22284J20031
59141C854565J15335J08314R8517Q5696P0834N5345L9551K3140O883p419j8730
59130D432031k7224l2863l4812l2716k7394j9680r525L242J8050L4238N1926P1589
59118D426862R3052J15451J37945J60021J81412K02134K22390K41970K59576K72934
59108F313747K79677K78177K67558K46905K14937J71090J17200N7587k781n9811
59098G884286j09954j49683j76663j91257j96004j93663j86411j76578j66840
$$ y = [1991416, 1977678, 1968648, 1965450, 1967712, 1974041, 1983567, 1996448, 2013065, 2033474, 2057766, 2086237, 2118982, 2155785, 2196546, 2241435, 2290562, 2343893, 2401456, 2463211, 2528937, 2598863, 2674220, 2756353, 2845257, 2939747, 3039132, 3143896, 3254525, 3370421, 3490202, 3612250, 3734534, 3854565, 3969900, 4078214, 4176731, 4262427, 4333261, 4388606, 4428157, 4451297, 4458180, 4450761, 4432031, 4404807, 4371944, 4337132, 4304416, 4277022, 4257342, 4247817, 4251059, 4269109, 4303347, 4355273, 4426862, 4519914, 4635365, 4773310, 4933331, 5114743, 5316877, 5539267, 5781237, 6040813, 6313747, 6593424, 6871601, 7139159, 7386064, 7601001, 7772091, 7889291, 7946878, 7944097, 7884286, 7774332, 7624649, 7447986, 7256729, 7060725, 6867062, 6680651, 6504073, 6337233]
59089F337233j59251j54658j53164j54564j58226j63283j69133j75359j81187
59080D868408j85710j88676j90357j90615j88736j84447j78419j71480j63907
59071C226061j55733j47124j38084j28318j17874j07656r8749r1362q4705p7894
59061B078562p0834o4099n8068n2447m6958m2249l9454l8610l8228l6919l4820
59050A555876l2810l0980k8778k6238k3909k1806j9354j6448j3498j0509p055
59039A324491l411p35K90K44J35M15J191K661M846P342R748J2132J4746J7503
59025A391598J9785K0652J9440J6484J3029R942O817L026q25l385m320m410l937
59012A483896k206J014M725P914J0553J2878J4569J5280J5255J4691J3192J0450
$$ y = [6337233, 6177982, 6023324, 5870160, 5715596, 5557370, 5394087, 5224954, 5049595, 4868408, 4682698, 4494022, 4303665, 4113050, 3924314, 3739867, 3561448, 3389968, 3226061, 3070328, 2923204, 2785120, 2656802, 2538928, 2431272, 2332523, 2241161, 2156456, 2078562, 2007728, 1943629, 1885561, 1833114, 1786156, 1743907, 1704453, 1665843, 1627615, 1590696, 1555876, 1523066, 1492086, 1463308, 1437070, 1413161, 1391355, 1372001, 1355553, 1342055, 1331546, 1324491, 1321080, 1320345, 1320635, 1320879, 1321014, 1321429, 1322620, 1325281, 1330127, 1337469, 1347217, 1359349, 1374095, 1391598, 1411383, 1432035, 1451475, 1467959, 1480988, 1490930, 1497747, 1500773, 1499948, 1496563, 1492243, 1487833, 1483896, 1481690, 1482704, 1487429, 1495343, 1505896, 1518774, 1533343, 1548623, 1563878, 1578569, 1591761, 1602211]
59000A602211O923L197p43m908q556j0762j1421j0987r634p396m842k798j412
58987A538872q3J692L869O167Q258R746J0423J0679J1209J2252J3389J4198J4806
58974A655477J5727J7253J9274K1540K3981K6603K9167L1279L2949L4780L7178
58963A945208L9530M0727M0500L9741L9413L9657M0222M1163M2680M4591M6562
58952B399994M8666N1325N4672N8395O2299O6771P2410P9243Q6587R3841J01278
58941C175481J09755J19612J30242J40906J51612J62922J75219J88599K03258
58932D557606K19559K37826K58421K81843L08418L37983L70242M05255M43225
58923G420378M84038N27512N73799O22929O73899P24641P72813Q16185Q52218
$$ y = [1602211, 1609134, 1612331, 1611588, 1606680, 1598124, 1587362, 1575941, 1564954, 1555320, 1547924, 1543082, 1540284, 1538872, 1538789, 1540481, 1544350, 1550517, 1558775, 1568521, 1578944, 1589623, 1600832, 1613084, 1626473, 1640671, 1655477, 1671204, 1688457, 1707731, 1729271, 1753252, 1779855, 1809022, 1840301, 1873250, 1908030, 1945208, 1984738, 2025465, 2065965, 2105706, 2145119, 2184776, 2224998, 2266161, 2308841, 2353432, 2399994, 2448660, 2499985, 2554657, 2613052, 2675351, 2742122, 2814532, 2893775, 2980362, 3074203, 3175481, 3285236, 3404848, 3535090, 3675996, 3827608, 3990530, 4165749, 4354348, 4557606, 4777165, 5014991, 5273412, 5555255, 5863673, 6201656, 6571898, 6977153, 7420378, 7904416, 8431928, 9005727, 9628656, 10302555, 11027196, 11800009, 12616194, 13468412]
58914A3468412Q77544Q87718Q77341Q41002P74958O78159N51842L99103K25590
58905A9581669M0120j46637l24330m84096o18966p24870q01241q49757q72571
58896A4799321q72525q54259q23323p83858p38202o88589o37717n87288n37593
58887H275967m89124m43441m01797l63977l29347k98088k70668k46847k26015
58878E206663k07889j92193j78228j65382j53590j42805j32494j22172j11908
58869C800002j01954r2373q3462p5869o9754o4325n8693n2818m7222m2159l7457
58858C073916l2724k7551k1833j6027j0588n205O93O763J2047J6634K1870K8520
58846C046515L5765M2635M9420N6857O4747P2292P9262Q6145R3431J01368J10038
$$ y = [13468412, 14345956, 15233674, 16111015, 16952017, 17726975, 18405134, 18956976, 19356079, 19581669, 19621789, 19475152, 19150822, 18666726, 18047760, 17322890, 16521649, 15671892, 14799321, 13926796, 13072537, 12249214, 11465356, 10727154, 10038565, 9400848, 8813560, 8275967, 7786843, 7343402, 6941605, 6577628, 6248281, 5950193, 5679525, 5432678, 5206663, 4998774, 4806581, 4628353, 4462971, 4309381, 4166576, 4034082, 3911910, 3800002, 3698048, 3605675, 3522213, 3446344, 3376590, 3312265, 3253572, 3200754, 3153532, 3111373, 3073916, 3041192, 3013641, 2991808, 2975781, 2965193, 2959988, 2960681, 2967444, 2979491, 2996125, 3017995, 3046515, 3082280, 3124915, 3174335, 3231192, 3295939, 3368231, 3447493, 3533638, 3627069, 3728437, 3838475]
58835C838475J19292J28987J39496J51388J64512J78177J92496K08605K27158
58826E348586K47621K69557K93715L21108L51864L85664M22522M62559N05684
58817H608880N51980O01434O52608P02550P48626P89366Q22630Q44034Q48235
58808A5170343Q30846P88244P16910O14818M83339L26912J51776l3730k18715
58799A8830743l91861n44516o71321p68908q35835q73665q86393q78401q53698
58790A2126145q16644p71791p22667o71609o20736n71915n25758m81848m40215
58781F502962m01660l66554l34319l04412k76979k52294k30298k10941j94310
58772C931195j80215j68193j57967j49314j41537j33714j25490j17051j08420
$$ y = [3838475, 3957767, 4086754, 4226250, 4377638, 4542150, 4720327, 4912823, 5121428, 5348586, 5596207, 5865764, 6159479, 6480587, 6832451, 7218115, 7640637, 8103196, 8608880, 9160860, 9762294, 10414902, 11117452, 11866078, 12655444, 13478074, 14322108, 15170343, 16001189, 16789433, 17506343, 18121161, 18604500, 18931412, 19083188, 19049458, 18830743, 18438882, 17894366, 17223045, 16454137, 15618302, 14744637, 13858244, 12979843, 12126145, 11309501, 10537710, 9815043, 9143434, 8522698, 7950783, 7425025, 6943177, 6502962, 6101302, 5734748, 5400429, 5096017, 4819038, 4566744, 4336446, 4125505, 3931195, 3750980, 3582787, 3424820, 3275506, 3133969, 3000255, 2874765, 2757714, 2649294]
58763B649294r9527r0776q2755p5358o8028o0837n4494m9121m3873l8051l1983
58752A954491k6522k2158j8774j5874j2943r953p437n712m288k618j104o25j296
58739A825187k568m532q019j3193j8828k3396k6235k7451k7409k6697k6016k5616
58727A595227k5202k4721k4857k6295k8766l1198l2762l3472l3737l3662l2961
58716A267594l1574l0018k8815k7703k5878k3061j9911j7222j5235j3881j3120
58705A021176j2612j1617r767p628o044n268n011m943m763m221l582l550m249
58692I37921m689l832j852J53J293J207k04k703n571q155j0323j1983j2620j1825
58678H66817r889p436m844k418n67P62K194L950N299N560N052M416L727K970K715
$$ y = [2649294, 2549767, 2458991, 2376236, 2300878, 2232850, 2172013, 2117519, 2068398, 2024525, 1986474, 1954491, 1927969, 1905811, 1887037, 1871163, 1858220, 1848267, 1840830, 1835118, 1830830, 1828212, 1827108, 1826483, 1825187, 1822619, 1818087, 1810068, 1796875, 1778047, 1754651, 1728416, 1700965, 1673556, 1646859, 1620843, 1595227, 1570025, 1545304, 1520447, 1494152, 1465386, 1434188, 1401426, 1367954, 1334217, 1300555, 1267594, 1236020, 1206002, 1177187, 1149484, 1123606, 1100545, 1080634, 1063412, 1048177, 1034296, 1021176, 1008564, 996947, 987180, 979552, 973508, 968240, 963229, 958286, 953523, 949302, 945720, 942170, 937921, 933232, 929400, 927548, 927701, 928994, 930201, 929997, 927294, 921723, 913568, 903245, 891262, 878642, 866817, 856928, 849492, 844648, 842230, 841663, 842425, 844619, 848569, 853868, 859428, 864480, 868896, 872623, 875593, 878308]
58663H78308L457M776N891O423O009M013O21k605m281m676m590l703j342J787
58649H90088M224N690P053Q750J0625J2906J5811J8534K0154K1413K3915K7620
58637A066783L0758L2532L4249L7305M1490M5901N0410N5495O1432O8242P5899
58626A600496Q4319R3637J04460J17232J31466J46453J62544J80755K01082K22130
58616C044574K42335K60528K75173K84029K84731K75024K52648K16186J66397
58607E301625J06161L9273k9976r6426j54768k01226k34210k53707k61014k58763
58597C956969k49979k36781k20537k02788j84999j67743j51232j36228j23297
58588B283385j11540r9632q7851p7520o8630n9706n0193m1238l3743k7214k1126
$$ y = [878308, 881765, 886541, 892432, 898855, 904864, 908877, 909498, 906893, 902612, 897936, 893346, 889643, 888301, 890088, 894312, 900002, 907055, 915805, 926430, 939336, 955147, 973681, 993835, 1015248, 1039163, 1066783, 1097541, 1130073, 1164322, 1201627, 1243117, 1289018, 1339428, 1394923, 1456355, 1524597, 1600496, 1684815, 1778452, 1882912, 2000144, 2131610, 2278063, 2440607, 2621362, 2822444, 3044574, 3286909, 3547437, 3822610, 4106639, 4391370, 4666394, 4919042, 5135228, 5301625, 5407786, 5447059, 5417083, 5320657, 5165889, 4964663, 4730453, 4476746, 4215732, 3956969, 3706990, 3470209, 3249672, 3046884, 2861885, 2694142, 2542910, 2406682, 2283385, 2171845, 2072213, 1984362, 1906842, 1838212, 1778506, 1728313, 1687075, 1653332, 1626118, 1604992]
58577A604992j5872j1811q601o139n034n534o871q245r486j0412j0479r517q055
58564A488936o557n189m556n762r413j5080k1789k8279l3045l5138l5022l3754
58552A255352l1562k8035k3422j8523j3748r425o654o260p254p957q419r953j2499
58539A071641j4385j4886j5050j5710j6460j6957j7361j7225j5688j3218j1442
58528I03259j0936j0879j1036j2037j3453j3789j2969j2604j3151j3066j1616
58517G67723j0243r969r657q190o345n110l989k397j061n13J82J843L761N097
58503G21132O181P174P211O269O117P892J0298J1780J2828J4440J6009J6634J7069
58490H61034J8313J9548J9508J8760J8491J8068J5968J2468R239O767M066O04
$$ y = [1604992, 1589120, 1577309, 1568708, 1562569, 1557535, 1552001, 1545130, 1536885, 1527399, 1516987, 1506508, 1496991, 1488936, 1482379, 1477190, 1472634, 1466872, 1457459, 1442379, 1420590, 1392311, 1359266, 1324128, 1289106, 1255352, 1223790, 1195755, 1172333, 1153810, 1140062, 1130637, 1123983, 1117723, 1110469, 1102512, 1094093, 1084140, 1071641, 1057256, 1042370, 1027320, 1011610, 995150, 978193, 960832, 943607, 927919, 914701, 903259, 892323, 881444, 870408, 858371, 844918, 831129, 818160, 805556, 792405, 779339, 767723, 757480, 747511, 737854, 729664, 723319, 718209, 714220, 711823, 710762, 710249, 710431, 712274, 716035, 721132, 727313, 734487, 741698, 747967, 754084, 761976, 772274, 784054, 796882, 811322, 827331, 843965, 861034, 879347, 898895, 918403, 937163, 955654, 973722, 989690, 1002158, 1011397, 1018164, 1022230, 1022834]
58478A022834l197p161j1375j5273j8044j9737k0825k1126k0374j9265j8637j8113
58466H29707j6778j4749j2844j1226r560q034p029o223n130m028l385k964k426
58453G25331k155k455k668k127j211m59N55K314M167N280O089P544R618J1685
58439G61508J3669J5664J7081J7391J7015J6389J4940J2084Q523N365K762M95
58427I02886r64j196q60o58j21J259K599K698J919J478J478J038n3j121j664j610
58411I07108q99L41J640K901M588O588P889Q002P524O547M025k14m362o866q293
58396I36519r638j0342r676q617q429q502p460n491l735k300o87O77J151J402
58382H64872K475M083N295O187P293Q231Q442Q427Q837R184Q925Q717R122R223
$$ y = [1022834, 1019637, 1012476, 1001101, 985828, 967784, 948047, 927222, 906096, 885722, 866457, 847820, 829707, 812929, 798180, 785336, 774110, 764550, 756516, 749487, 743264, 738134, 734106, 730721, 727757, 725331, 723176, 720721, 718053, 715926, 714715, 714256, 714811, 717125, 721292, 726572, 732661, 740205, 749823, 761508, 775177, 790841, 807922, 825313, 842328, 858717, 873657, 885741, 894264, 899629, 902391, 902886, 901922, 900726, 899866, 899208, 899087, 900346, 902945, 905643, 907562, 909040, 910518, 911556, 911503, 910382, 908718, 907108, 906209, 906550, 908190, 911091, 915679, 922267, 930156, 938158, 945682, 952229, 956254, 956040, 951678, 944812, 936519, 926881, 916539, 906863, 898246, 889817, 881315, 873855, 868364, 864629, 862329, 861642, 862319, 863470, 864872, 867347, 871430, 876725, 882912, 890205, 898436, 906878, 915305, 924142, 933326, 942251, 950968, 960090, 969313]
58368I69313Q193P019O943P338P041O634P427R148J0482J1144J1539J1431J0702
58355A084354J0502J1814J3777J5055J5733J6204J5558J2917R156N467J631k517
58343A209651n491o114n487m901l555p05J877K407K375M309P650R939J0868J2048
58329A234871J3715J4845J5697J7173J8448J8080J6853J6747J7826J8755J9461
58318A422471K0673K1844K2220K2811K4581K6034K5437K3908K3148K1779J7496
58307A672402J1572P521O273O219O821Q560J0378J0967J1612J4151J7311J8782
58295A802569J9435K1459K3851K4271K3949K5851K9063L0119K9175K9596L1887
58284B091225L3345L3625L5313L8761M1577M3651M7713N4195O0210O4212O7246
$$ y = [969313, 977506, 984525, 991468, 998806, 1005847, 1012481, 1019908, 1029056, 1039538, 1050682, 1062221, 1073652, 1084354, 1094856, 1106670, 1120447, 1135502, 1151235, 1167439, 1182997, 1195914, 1205070, 1210537, 1212168, 1209651, 1204160, 1198046, 1192559, 1187658, 1184103, 1183398, 1185275, 1187682, 1190057, 1194366, 1202016, 1211955, 1222823, 1234871, 1248586, 1263431, 1279128, 1296301, 1314749, 1332829, 1349682, 1366429, 1384255, 1403010, 1422471, 1443144, 1464988, 1487208, 1510019, 1534600, 1560634, 1586071, 1609979, 1633127, 1654906, 1672402, 1683974, 1691495, 1697768, 1703987, 1710808, 1719368, 1729746, 1740713, 1752325, 1766476, 1783787, 1802569, 1822004, 1843463, 1867314, 1891585, 1915534, 1941385, 1970448, 2000567, 2029742, 2059338, 2091225, 2124570, 2158195, 2193508, 2232269, 2273846, 2317497, 2365210, 2419405, 2479615, 2543827, 2611073]
58273B611073O9258O8657O5897O3109O0028N4612M7642M2170L8660L5393L3187
58262C189686L4555L8485M1447M3377M7230N2923N7490O1060O6675P4200Q0460
58251C787588Q5443R2142J00261J06447J10873J16958J24457J29627J32374J36364
58241D922534J41985J46409J50527J58201J68627J77439J85210J96438K10190
58232F457560K21085K29674K42112K59113K75405K90819L11062L36314L60402
58223H983546L82747M09580M41663M73003N03673N41151N86663O33665O82351
58214A3638042P41422Q12661Q88850R70282J067585J184870J317175J468179J651946
58205B3741012J873345K127673K424933K792830L251083L807385M483407N315077
$$ y = [2611073, 2680331, 2748988, 2814885, 2877994, 2938022, 2992634, 3040276, 3082446, 3121106, 3156499, 3189686, 3224241, 3262726, 3304173, 3347550, 3394780, 3447703, 3505193, 3566253, 3632928, 3707128, 3787588, 3873031, 3965173, 4065434, 4171881, 4282754, 4399712, 4524169, 4653796, 4786170, 4922534, 5064519, 5210928, 5361455, 5519656, 5688283, 5865722, 6050932, 6247370, 6457560, 6678645, 6908319, 7150431, 7409544, 7684949, 7975768, 8286830, 8623144, 8983546, 9366293, 9775873, 10217536, 10690539, 11194212, 11735363, 12322026, 12955691, 13638042, 14379464, 15192125, 16080975, 17051257, 18118842, 19303712, 20620887, 22089066, 23741012, 25614357, 27742030, 30166963, 32959793, 36210876, 40018261, 44501668, 49816745]
58197D9816745O320686P503891Q900901J0591588J2658152J5180103J8281301
58190A29253367K2123360K6827798L2424088L8730444M4897095M8805476M7255021
58183C90316649L7593920J9911405k180929k3173142l8487220m6336326m7601839
58176B90042518m4475801l9160249l3239159k7606012k2645596j8463632j5041854
58169H9410215j2292867j0086487q298301o841653n650241m656702l806873l074085
58161C4703006k438863j868842j333298q19164l13931K12632P92793J443001K174747
58152C2552081K982322L754788M194284L900317K636756N72337j742535l670963
58144D5179387m820573n166178m931283m389239l743777l114039k558711k094989
$$ y = [49816745, 56137431, 63641322, 72542223, 83133811, 95791963, 110972066, 129253367, 151376727, 178204525, 210628613, 249359057, 294256152, 343061628, 390316649, 427910569, 447821974, 445641045, 422467903, 383980683, 337644357, 290042518, 245566717, 206406468, 173167309, 145561297, 122915701, 104452069, 89410215, 77117348, 67030861, 58732560, 51890907, 46240666, 41583964, 37777091, 34703006, 32264143, 30395301, 29062003, 28242839, 27928908, 28141540, 28934333, 30377334, 32552081, 35534403, 39289191, 43483475, 47383792, 50020548, 50592885, 48850350, 45179387, 40358814, 35192636, 30261353, 25872114, 22128337, 19014298, 16455587, 14360598]
58136A4360598j715915j409654j167007r76212q22090o94028n88395n01906m29336
58127F056055l69029l23258k90889k65875k44733k29099k18881k09286j97080
58118C707925j83952j71258j57080j41010j26397j14988j04198r2341q1953p5529
58108B459219p2322p1603p4398p9573q2649q1164p7309p3164o7492n9578n1831
58097A668136m5962m0453l4372l0037k9205l0134l0864l2120l4495l6042l5201
58086A289251l3286l1824l0264k8322k7620k8863l0136k9939k9239k8759k7130
58075I63869k3658k0121j8022j6597j5106j4345j4353j3532j1660j0792j1581
58064G94102j1748r944q007p521p245n977m956n261n733n638o478q952j0885j0629
$$ y = [14360598, 12644683, 11235029, 10068022, 9091810, 8269720, 7575692, 6987297, 6485391, 6056055, 5687026, 5363768, 5072879, 4807004, 4562271, 4333172, 4114291, 3905005, 3707925, 3523973, 3352715, 3195635, 3054625, 2928228, 2813240, 2709042, 2616701, 2534748, 2459219, 2386897, 2315294, 2240896, 2161323, 2078674, 1997510, 1920201, 1847037, 1779545, 1719967, 1668136, 1622174, 1581721, 1547349, 1517312, 1488107, 1457973, 1427109, 1394989, 1360494, 1324452, 1289251, 1255965, 1224141, 1193877, 1165555, 1137935, 1109072, 1078936, 1048997, 1019758, 990999, 963869, 940211, 920090, 902068, 885471, 870365, 856020, 841667, 828135, 816475, 805683, 794102, 782354, 772410, 764403, 756882, 749637, 743660, 738704, 733443, 727710, 722072, 715594, 706642, 695757, 685128]
58050F85128r789j0136j0426q950o819n900n565m168k092o94J91J434K599K891
58036F27704K777K962L127L194M097N834O523N002K626R55k23j189q23J210K969
58021F66745K894K044J859J772R52L31P62J079J78q29p06m32j312k481k623k446
58005F67787l119l856l432k583k565k794k287k046l526n967p684q811j0322j1523
57991E97272j1098r666q756q034o064l205j222m55L62J694K747L197L466L524
57977E63762L120K906L666M781N034M593M528M827M425K968J068q40k650l993
57963E98195m640n105n745n922n153m203l908l770l012k131k037k517k836k991
57949E44225l054k297m39J214J391P50O38R69Q54L62k3p81k432m077m629m692
$$ y = [685128, 675339, 665203, 654777, 645827, 639008, 633108, 627543, 623375, 621283, 620589, 620780, 622214, 624813, 627704, 630481, 633443, 636570, 639764, 643861, 649695, 656218, 661220, 663846, 664801, 664578, 663389, 662566, 663776, 666745, 669639, 671683, 673542, 675314, 676266, 676597, 677359, 678438, 678616, 677787, 677081, 676649, 675337, 672856, 670233, 667787, 664668, 660812, 657380, 654797, 652232, 649438, 647151, 645105, 641579, 635612, 627928, 619117, 608795, 597272, 586174, 576508, 567752, 559718, 553654, 550449, 549227, 548772, 549134, 550828, 553575, 556772, 560238, 563762, 566882, 569788, 573454, 578235, 583269, 587862, 592390, 597217, 601642, 604610, 605678, 604838, 602188, 598195, 593555, 588450, 582705, 576783, 571630, 567427, 563519, 559749, 556737, 554606, 552569, 550052, 547216, 544225, 541171, 538874, 538435, 539649, 541040, 541790, 542428, 543397, 544251, 544613, 544590, 543809, 541377, 537300, 532671, 527979]
57933E27979n454o523o786o669p527r243j0393j0509j0340j0115r325q001o672
57920D20422n199l182j155Q5R18K233L768M634N025N829O978P807Q579R974J1459
57905D78175J1939J1645J1655J1784J0859Q897P194O204N095L538K268J637J042
57892E71932P0j070k380m046n609o334o513p116q127q473p642o286n123m266l646
57877D95371l165k496j594j056j183j090J65K179L939N338O698P492P056O095
57863E23749N921O490O641N951M906L676K182R78M99n0j499k881k700j579j550
57848E50734k892l804l349k560k298k015j286p93r73j206j008q19j036j412j816
57833E23467k507l321l677l645l985m931o033p151q507r761j0299j0362j0548
$$ y = [527979, 522525, 516002, 509216, 502547, 495020, 485777, 475384, 464875, 454535, 444420, 435095, 427094, 420422, 415223, 412041, 410886, 410971, 411889, 414122, 417890, 422524, 427549, 433378, 440356, 448163, 456742, 466716, 478175, 490114, 501759, 513414, 525198, 536057, 544954, 552148, 558352, 563447, 566985, 569253, 570890, 571932, 572002, 570932, 568552, 564506, 558897, 552563, 546050, 538934, 530807, 522334, 514692, 508406, 503283, 499017, 495371, 492206, 489710, 488116, 487060, 485877, 484787, 484952, 487131, 491070, 496408, 503106, 510598, 517654, 523749, 529670, 536160, 542801, 548752, 553658, 557334, 559516, 560494, 560993, 560943, 559444, 556563, 553863, 552284, 550734, 547842, 544038, 540689, 538129, 535831, 533816, 532530, 531737, 530764, 529558, 528550, 527731, 526695, 525283, 523467, 520960, 517639, 513962, 510317, 506332, 501401, 495368, 488217, 479710, 469949, 459650, 449288, 438740]
57820D38740j0367q820o469n118n329n861n858n795n857n157l370j640j020j164
57806C66915j164o19N31K047K915K233R08J061L280N869P392Q449J0225J2707
57792D22749J5177J7124J7730J5787J1241N959J972k84j433j904k027k378l127
57779D96586l686l686l654m102m777n298n715n910n362m103l048k707k447j596
57765D40495n25J00L81P80J330J892K596L476M131M232L911L406K858K622L070
57750D74755L898M408M545M819N162M981M470M600N458N917N423M839M853M832
57736E42960M129L412L679M770N790O311O458O484O859Q098R904J1216J1698J2242
57722F44010J3484J4725J5152J5189J5701J6616J7295J7729J8472J9702K1051
$$ y = [438740, 428373, 419553, 413084, 407966, 402637, 396776, 390918, 385123, 379266, 374109, 370739, 369099, 368079, 366915, 365751, 365132, 365663, 367710, 370625, 372858, 373766, 374827, 378107, 383976, 391368, 399817, 410042, 422749, 437926, 455050, 472780, 488567, 499808, 505767, 507739, 507455, 506022, 504118, 502091, 499713, 496586, 492900, 489214, 485560, 481458, 476681, 471383, 465668, 459758, 454396, 450293, 447245, 444538, 442091, 440495, 439970, 440070, 440451, 441231, 442561, 444453, 447049, 450525, 454656, 458888, 462799, 466205, 469063, 471685, 474755, 478653, 483061, 487606, 492425, 497587, 502568, 507038, 511638, 517096, 523013, 528436, 533275, 538128, 542960, 547089, 550501, 554180, 558950, 564740, 571051, 577509, 583993, 590852, 598950, 608854, 620070, 631768, 644010, 657494, 672219, 687371, 702560, 718261, 734877, 752172, 769901, 788373, 808075, 829126]
57711H29126K2186K3082K3995K5380K7462K9845L2118L4758L8510M2968M7040
57700A176470N0896N6034O3055P0931P9101Q8636J00315J13120J25907J39345
57690B063810J54776J72192J90700K09982K29659K47841K61883K70151K71639
57681D072633K64187K44674K11305J65060J09355M9283r088o0058r9459j24615
57671D823277j34053j28177j09796q3348n4462l1236k4287m2164q4793j41617
57661C989344j96792k36871k55421k53301k36061k10462j81857j53600j27759
57652B137220j05504q6841p0863n6671m4015l3047k3696j5460p736l31O597J3203
57640A712856K0301K8423L6923M4766N2239O0888P1592Q3662R6162J09174J23211
$$ y = [829126, 851312, 874394, 898389, 923769, 951231, 981076, 1013194, 1047952, 1086462, 1129430, 1176470, 1227366, 1283400, 1346455, 1417386, 1496487, 1585123, 1685438, 1798558, 1924465, 2063810, 2218586, 2390778, 2581478, 2791460, 3021119, 3268960, 3530843, 3800994, 4072633, 4336820, 4581494, 4792799, 4957859, 5067214, 5116497, 5107409, 5047351, 4947892, 4823277, 4689224, 4561047, 4451251, 4367903, 4313441, 4282205, 4257918, 4215754, 4130961, 3989344, 3792552, 3555681, 3300260, 3046959, 2810898, 2600436, 2418579, 2264979, 2137220, 2031716, 1944875, 1874012, 1817341, 1773326, 1740279, 1716583, 1701123, 1693387, 1693056, 1699653, 1712856, 1733157, 1761580, 1798503, 1843269, 1895508, 1956396, 2027988, 2111650, 2207812, 2316986, 2440197]
57629B440197J38216J53809J69825J85931K01243K14596K24500K28540K23757
57620D180614K08279J81804J44361R6025L8906k1746p9841j31345j74232k06687
57610D236138k27089k35617k34618k27161k15730k01936j86662j70545j54516
57601B382264j39611j25978j12962j00537q9762q1164p3709o6225n8878n2353
57591A481085m6451m0677l5450l1460k8445k5724k3321k1464j9576j7048j4482
57580A176987j2881j2032j0916r367q049p137o212n221m339l146j143J144K752
57567A100440L689M636N578O042O431P679R666J1290J2190J3119J4596J6333J8023
57554A229712J9551K0540K0847K1505K3781K7339L0599L3053L5731L9383M3645
$$ y = [2440197, 2578413, 2732222, 2902047, 3087978, 3289221, 3503817, 3728317, 3956857, 4180614, 4388893, 4570697, 4715058, 4811083, 4849989, 4828243, 4748402, 4617057, 4442825, 4236138, 4009049, 3773432, 3538814, 3311653, 3095923, 2893987, 2707325, 2536780, 2382264, 2242653, 2116675, 2003713, 1903176, 1813414, 1732250, 1658541, 1592316, 1533438, 1481085, 1434634, 1393957, 1358507, 1327047, 1298602, 1272878, 1249557, 1228093, 1208517, 1191469, 1176987, 1164106, 1152074, 1141158, 1131791, 1123742, 1116605, 1110393, 1105172, 1100833, 1097687, 1096544, 1097688, 1100440, 1104129, 1108765, 1114343, 1120385, 1126816, 1134495, 1144161, 1155451, 1167641, 1180760, 1195356, 1211689, 1229712, 1249263, 1269803, 1290650, 1312155, 1335936, 1363275, 1393874, 1426927, 1462658, 1502041, 1545686]
57543A545686M8385N4239O1220O8199P4670Q1784R0764J01269J12264J23652J36039
57532B498171J49345J62480J74085J82922J87751J87361J80584J66088J42545
57523D031332J09482O8035K1023k7460p2884j11619j41846j63091j75283j78879
57513C358810j75590j67833j57271j44571j30580j16693j03818r1770q0111o8924
57503B121649n8593m9434m1796l5756l0585k5181j9360j3956r458n276p49L874
57491A835379P999J1573J4925J8167K1321K4676K8527L2758L7082M1610M6913
57480B120930N3541O1483P0128P8851Q7769R7595J08526J19770J30632J41570
57470C070795J53278J65012J74625J80095J80082J73065J57114J31073R5503N2417
$$ y = [1545686, 1594071, 1648310, 1709530, 1777729, 1852399, 1934183, 2024947, 2126216, 2238480, 2362132, 2498171, 2647516, 2809996, 2984081, 3167003, 3354754, 3542115, 3722699, 3888787, 4031332, 4140814, 4208849, 4229872, 4202412, 4129528, 4017909, 3876063, 3712972, 3537689, 3358810, 3183220, 3015387, 2858116, 2713545, 2582965, 2466272, 2362454, 2270684, 2190573, 2121649, 2063056, 2013622, 1971826, 1936070, 1905485, 1880304, 1860944, 1846988, 1837530, 1832254, 1831505, 1835379, 1843378, 1854951, 1869876, 1888043, 1909364, 1934040, 1962567, 1995325, 2032407, 2074017, 2120930, 2174471, 2235954, 2306082, 2384933, 2472702, 2570297, 2678823, 2798593, 2929225, 3070795, 3224073, 3389085, 3563710, 3743805, 3923887, 4096952, 4254066, 4385139, 4480642, 4533059]
57460D533059M734m3797q9011j27325j56396j75181j84052j84806j79802j70758
57450C226665j58699j44787j30441j16561j03326r0870p9557o9522o0551n2474
57440B219877m5244l8672l2669k7575k3685k0580j7556j4531j1782r156o382l926
57428A968119k486j723n83J185K829L954M976O078O852P256P871Q909R788J0021
57414B033046R783R395R064R240J0392J2232J3863J4808J5187J5054J4516J4297
57402B180877J5088J6421J7331J7946J9048K0210K0116J8836J8038J8486J9125
57391B381522J9240J9697K1134K2507K2654K1984K1523K1415K1467K1942K2855
57380B617940K3413K3245K3117K3516K3647K2944K2391K3068K4388K5127K5308
$$ y = [4533059, 4537793, 4493996, 4404985, 4277660, 4121264, 3946083, 3762031, 3577225, 3397423, 3226665, 3067966, 2923179, 2792738, 2676177, 2572851, 2481981, 2402424, 2332902, 2272351, 2219877, 2174633, 2135961, 2103292, 2075717, 2052032, 2031452, 2013896, 1999365, 1987583, 1978427, 1972045, 1968119, 1965633, 1963910, 1963327, 1964512, 1967341, 1971295, 1976271, 1982349, 1989201, 1996457, 2004328, 2013237, 2023025, 2033046, 2042829, 2052224, 2061288, 2070528, 2080920, 2093152, 2107015, 2121823, 2137010, 2152064, 2166580, 2180877, 2195965, 2212386, 2229717, 2247663, 2266711, 2286921, 2307037, 2325873, 2343911, 2362397, 2381522, 2400762, 2420459, 2441593, 2464100, 2486754, 2508738, 2530261, 2551676, 2573143, 2595085, 2617940, 2641353, 2664598, 2687715, 2711231, 2734878, 2757822, 2780213, 2803281, 2827669, 2852796, 2878104]
57369B878104K5617K5823K5295K4523K4640K5711K6842K7630K8326K8920K9184
57358C170615K9421L0091L0947L1453L1711L2097L2478L2685L3238L4474L5524
57347C524734L5406L4671L4670L5478L5937L5607L5327L5764L6645L7545L8349
57336C920133L8796L8556L8027L8098L8942L9768L9937L9604L9192L8954L9110
57325D349117L9754M0569M1224M2018M3463M5310M6721M7327M7489M7631M7933
57314D838556M8600M9605N0393N0467N0225N0387N0841N0986N0913N1297N2088
57303E394358N2472N2316N2504N3569N4953N6074N7195N8660O0073O0937O1592
57292F014703O2825O4798O6942O8733P0143P1374P2535P3616P4623P5581P6441
$$ y = [2878104, 2903721, 2929544, 2954839, 2979362, 3004002, 3029713, 3056555, 3084185, 3112511, 3141431, 3170615, 3200036, 3230127, 3261074, 3292527, 3324238, 3356335, 3388813, 3421498, 3454736, 3489210, 3524734, 3560140, 3594811, 3629481, 3664959, 3700896, 3736503, 3771830, 3807594, 3844239, 3881784, 3920133, 3958929, 3997485, 4035512, 4073610, 4112552, 4152320, 4192257, 4231861, 4271053, 4310007, 4349117, 4388871, 4429440, 4470664, 4512682, 4556145, 4601455, 4648176, 4695503, 4742992, 4790623, 4838556, 4887156, 4936761, 4987154, 5037621, 5087846, 5138233, 5189074, 5240060, 5290973, 5342270, 5394358, 5446830, 5499146, 5551650, 5605219, 5660172, 5716246, 5773441, 5832101, 5892174, 5953111, 6014703, 6077528, 6142326, 6209268, 6278001, 6348144, 6419518, 6492053, 6565669, 6640292, 6715873, 6792314]
57281F792314P7049P7274P7111P6432P4743P1650O7679O3985O0870N7204N1842
57270G548153M5170L8693L3535K9969K7999K7493K7902K8594K9496L0869L2584
57259G900457L4216L5596L6680L7136L6787L6289L6492L7207L7414L6768L6087
57248H301129L6162L6885L7794L8867M0351M2202M4086M5806M7488M9360N1326
57237H771456N2824N3400N3524N4193N5462N6043N4924N2759N0934M9795M8703
57226I354017M7362M5970M4324M1923L9009L6491L4703L3092L1176K9048K6832
57215I763947K4475K2178K0291J8715J7135J5773J5027J4438J3062J1014R551
57204I945606R381R896J0335J0663J0792J0141Q692P560P557P836O897M478J602
$$ y = [6792314, 6869363, 6946637, 7023748, 7100180, 7174923, 7246573, 7314252, 7378237, 7439107, 7496311, 7548153, 7593323, 7632016, 7665551, 7695520, 7723519, 7751012, 7778914, 7807508, 7837004, 7867873, 7900457, 7934673, 7970269, 8006949, 8044085, 8080872, 8117161, 8153653, 8190860, 8228274, 8265042, 8301129, 8337291, 8374176, 8411970, 8450837, 8491188, 8533390, 8577476, 8623282, 8670770, 8720130, 8771456, 8824280, 8877680, 8931204, 8985397, 9040859, 9096902, 9151826, 9204585, 9255519, 9305314, 9354017, 9401379, 9447349, 9491673, 9533596, 9572605, 9609096, 9643799, 9676891, 9708067, 9737115, 9763947, 9788422, 9810600, 9830891, 9849606, 9866741, 9882514, 9897541, 9911979, 9925041, 9936055, 9945606, 9954987, 9964883, 9975218, 9985881, 9996673, 10006814, 10015506, 10023066, 10030623, 10038459, 10045356, 10049834, 10051436]
57191A0051436r17l039m725n450m794l056j069M08J129J349J468J673J968K423
57177A0038804L163M071M865N402N690N551M749L395J715n44l862p874j1261j3214
57163A0040650j4477j6428j9479k3046k6850l1472l7516m4742n2364n9904o7425
57152I646947p4937q1906q7381r0589r1280q9604q5794q0036p2606o4029n5047
57141H773738m6389l8502l1720k6764k4854k6938l2853m1549n1994o3309p4146
57130H314720q2725q7881q9659q8542q4638p8043o9545o0462n2047m5443m1737
57119G533998m1428m3724m6612m7709m5125l8149k7484j4699j253J1807K3514
57108G263136L3355M2549N4533P3559J02870J44015J97251K62456L40536M34845
$$ y = [10051436, 10050519, 10047480, 10042755, 10037305, 10032511, 10029455, 10028386, 10028794, 10029923, 10031272, 10032740, 10034413, 10036381, 10038804, 10041967, 10046038, 10050903, 10056305, 10061995, 10067546, 10072295, 10075690, 10077405, 10076861, 10072999, 10065125, 10053864, 10040650, 10026173, 10009745, 9990266, 9967220, 9940370, 9908898, 9871382, 9826640, 9774276, 9714372, 9646947, 9572010, 9490104, 9402723, 9312134, 9220854, 9131250, 9045456, 8965420, 8892814, 8828785, 8773738, 8727349, 8688847, 8657127, 8630363, 8605509, 8578571, 8545718, 8504169, 8452175, 8388866, 8314720, 8231995, 8144114, 8054455, 7965913, 7881275, 7803232, 7733687, 7673225, 7621178, 7575735, 7533998, 7492570, 7448846, 7402234, 7354525, 7309400, 7271251, 7243767, 7229068, 7227815, 7239622, 7263136, 7296491, 7339040, 7393573, 7467132, 7570002, 7714017, 7911268, 8173724, 8514260, 8949105]
57098H949105N51350O97271Q79311J102362J368854J679194K032870K428117K859161
57089B2547595L314063L775382M220763M620991M940075N141525N195083N078303
57081E8833780M782190M329639L785869L225592K665856K032453J212363J54680
57073H1022422j074191k326287l452726m357508n002352n388198n538566n489208
57065D8393386n281423m958296m561708m127730l683399l248234k837446k461883
57057A7233267k126390j830968j573835j352345j162340r99069q59039p39921
57049F589360o39183n54014m82180m21842l71024l28141k92362k62571k36759
57040C001284k13375j92414j74207j58098j43353j30279j19211j09334r9723r0706
$$ y = [8949105, 9500455, 10197726, 11077037, 12179399, 13548253, 15227447, 17260317, 19688434, 22547595, 25861658, 29637040, 33857803, 38478794, 43418869, 48560394, 53755477, 58833780, 63615970, 67945609, 71731478, 74957070, 77622926, 79655379, 80867742, 81022422, 79948231, 77621944, 74169218, 69811710, 64809358, 59421160, 53882594, 48393386, 43111963, 38153667, 33591959, 29464229, 25780830, 22532596, 19695150, 17233267, 15106877, 13275909, 11702074, 10349729, 9187389, 8188320, 7329281, 6589360, 5950177, 5396163, 4913983, 4492141, 4121117, 3792976, 3500614, 3238043, 3001284, 2787909, 2595495, 2421288, 2263190, 2119837, 1989558, 1870347, 1761013, 1661290, 1570584]
57030A570584q2903p5812o8663o1843n6083n1072m6171m1757l8400l5477l2050
57019I80353k8474k5644k3222k0192j6648j3537j0986q336n435k436J277O523
57007H33243J2983J9831K7357L6525M7292N9069P2630Q9927J12265J40250J74756
56996A626128K14181K48562K58492K24272J39949K0830j02247j98446k51458k63290
56986A916973k46757k15317j78449j42411j11377q7356p0773o1616n9106o0589
56976F83222o2363o1922n8628n2592m4348l5417k7552k1080j5120r516n040j543
56964B88101K412P553J2875J7331K1306K5751L0879L6374M1620M4776M2581L2622
56952F04181J5917l231j9893l0971l5958l6233l3674k9608k4798j9949j5580j1553
$$ y = [1570584, 1487681, 1411869, 1343206, 1281363, 1225280, 1174208, 1128037, 1086280, 1047880, 1012403, 980353, 951879, 926235, 903013, 882821, 866173, 852636, 841650, 833314, 827879, 825443, 826720, 833243, 846226, 866057, 893414, 929939, 977231, 1036300, 1108930, 1198857, 1311122, 1451372, 1626128, 1840309, 2088871, 2347363, 2571635, 2711584, 2732414, 2630167, 2431721, 2180263, 1916973, 1670216, 1454899, 1276450, 1134039, 1022662, 935306, 864533, 802917, 743811, 683222, 620859, 558937, 500309, 447717, 403369, 367952, 340400, 319320, 304200, 294684, 289644, 288101, 290513, 298066, 310941, 328272, 349578, 375329, 406208, 442582, 484202, 528978, 571559, 604181, 620098, 616867, 596974, 566003, 530045, 493812, 460138, 430530, 405732, 385783, 370203, 358650]
56940C58650p381l109P88M434Q666J3901J9636K5442L1829L9415M7273N2271N0324
56927F42139L8905J9196m076k5375m1141n0296n3103n0606m4744l7665l0688k4367
56915C38179j9301j5964j3923j2253j0736r718q978p823o325n237m580l518j925
56902B17898p65m80j42J092K753M043N093O393P771Q875J0125J2252J5237J8514
56888C08659K1949K5907L0416L4732L7489L6930L1435K0694O532p823j9493k7003
56876E00424l0087k9117k4938j8995j3048q284m530o09M285R821J5448K1558K9002
56863D50930L7748M7010N6753O7920Q0245R0233R1952Q0326N4387J8476j9250
56852A056730n0329o9594p6574p4161o6137n5471m3905l2326k1246j0835p64R547
$$ y = [358650, 351269, 348160, 348948, 353382, 362048, 375949, 395585, 421027, 452856, 492271, 539544, 591815, 642139, 681044, 700240, 696164, 670789, 629648, 579352, 526249, 475643, 430899, 393234, 362546, 338179, 318878, 302914, 288991, 276738, 266002, 256284, 247306, 239483, 233158, 227921, 223341, 219823, 217898, 217133, 216653, 216511, 217603, 220356, 224399, 229492, 235885, 243656, 252531, 262656, 274908, 290145, 308659, 330608, 356515, 386931, 421663, 459152, 496082, 527517, 548211, 554743, 546920, 527427, 500424, 470337, 441220, 416282, 397287, 384239, 375955, 371425, 370816, 375101, 384922, 400370, 421928, 450930, 488678, 535688, 592441, 660361, 740606, 830839, 922791, 1003117, 1057504, 1075980, 1056730, 1006401, 936807, 860233, 786072, 719935, 664464, 620559, 588233, 566987, 556152, 555388, 564935]
56840E64935K0222L0996M2236N5282P1137Q9324J08598J27718J43768J49793J36518
56829A540527R8743M0746k4629q2318j21693j39563j39233j27331j10422r2871
56819H41956p6391o0887m5919l1683j8766p066M371J6281K8555M1086N4621O9981
56807H16139Q6499J01265J09126J03460P9115L7141j3260n9145r1223j07295j10068
56796I51754j03645r1981p8368o4837n2230m1023l1449k3016j4925p139j21O517
56784D49537J3984K2737L2005M1016M9261N4916N4248M3956K4116j376k6767m6914
56772G10719n9036o3206o1367n5776m8383m0915l4472k9089k4425k0700j8091
56761B55259j5654j2243q474o209n887n833m696l103k242k088j944j664j424j107
$$ y = [564935, 585157, 616153, 658389, 713671, 784808, 874132, 982730, 1110448, 1254216, 1404009, 1540527, 1639270, 1680016, 1655387, 1573069, 1451376, 1311813, 1172580, 1045249, 934827, 841956, 765565, 704678, 658759, 627076, 608310, 601244, 605615, 621896, 650451, 691537, 746158, 816139, 902638, 1003903, 1113029, 1216489, 1295604, 1332745, 1319485, 1260340, 1169117, 1061822, 951754, 848109, 756128, 677760, 612923, 560693, 519670, 488221, 465205, 450280, 443141, 443020, 449537, 463521, 486258, 518263, 559279, 608540, 663456, 717704, 761660, 785776, 784400, 757633, 710719, 651683, 588477, 527110, 471334, 422951, 382036, 347564, 318475, 294050, 273350, 255259, 239605, 227362, 218888, 212679, 206792, 200959, 196263, 193160, 190918, 188830, 186886, 185222, 183798, 182691]
56747A82691o95n99r43j246j344j777k686l201k696j851j687k154k495k391k056
56732A54870j642j265j195j470j662j423r23n02l23n03r78j188o75p5n27j897
56716A38622k667j974o29L53J037J759K193K047J765J697J369L71q41j660k056
56701A41386k000j126K41P92j40j500j946j529j018m85L48J091J138O68K52%j39
56684A36033J49R47J634J863K230L129L745L284K432K378L011L258K783K137J618
56669A70631J082O70O87R58J177J511K031K068J159J55K32J141J535Q74j51r25
56653A84835j555k211k724k961k918k494j868j812k959m816o191o470n934n134
56639A34788m531m424m619m408l441k263j533j234j104j165j240p44K55O64mm57
$$ y = [182691, 181996, 181397, 180454, 179208, 177864, 176087, 173401, 170200, 167504, 165653, 163966, 161812, 159317, 156926, 154870, 153228, 151963, 150768, 149298, 147636, 146213, 145290, 144788, 144465, 143962, 142984, 141796, 141121, 141046, 140519, 138622, 135955, 133981, 133352, 133705, 134742, 136501, 138694, 140741, 142506, 144203, 145572, 145943, 145102, 143442, 141386, 139386, 138260, 138501, 139293, 139153, 137653, 135707, 134178, 133160, 132675, 133023, 134114, 135252, 135920, 136172, 136172, 136033, 136182, 137129, 138763, 140626, 142856, 145985, 149730, 153014, 155446, 157824, 160835, 164093, 166876, 169013, 170631, 171713, 172383, 173070, 174028, 175205, 176716, 178747, 180815, 181974, 182129, 182361, 183502, 185037, 185911, 185760, 184835, 183280, 181069, 178345, 175384, 172466, 169972, 168104, 166292, 163333, 158517, 152326, 145856, 139922, 134788, 130257, 125833, 121214, 116806, 113365, 111102, 109569, 108335, 107231, 106066, 104826, 104082, 104337, 105001, 104997, 104540]
56623A04540N89K325K890K066J370J670K180J929R78M1k03N27J681J943P33p04
56607A24555p25M83J284R76M34M26O35O32O42Q82J098J128J193J335J266R59P88
56590A37991Q84R45P70M57Q0k84k78L36J143J599J841K286K679K431J755J470
56574A56105J698J733J388J412K267L276L508K965K472K731L738M919N629N659
56560A99500N299M904M589M399M400M440M299M104M106L894K695P67n31n28j04
56545B46233j51l28k87q48k611m388m575l480k761l005l345l223k973k804k477
56530B08977k099k049k230k287k323k475k159r30L97O94J53k97p27j814l103l352
56514A84376k544j903j907j825j378j275j753k090j885j570j368r48m19l33n41
$$ y = [104540, 105129, 107454, 110344, 112410, 113780, 115450, 117630, 119559, 120537, 120578, 120375, 120902, 122583, 124526, 125259, 124555, 123830, 124313, 125597, 126573, 127007, 127433, 128068, 128700, 129342, 130224, 131322, 132450, 133643, 134978, 136244, 137203, 137991, 138875, 139820, 140590, 141047, 141127, 140843, 140565, 140901, 142044, 143643, 145484, 147770, 150449, 152880, 154635, 156105, 157803, 159536, 160924, 162336, 164603, 167879, 171387, 174352, 176824, 179555, 183293, 188212, 193841, 199500, 204799, 209703, 214292, 218691, 223091, 227531, 231830, 235934, 240040, 243934, 246629, 247396, 246865, 246337, 246233, 246082, 245754, 245467, 244619, 242008, 237620, 233045, 229565, 226804, 223799, 220454, 217231, 214258, 211454, 208977, 206878, 204829, 202599, 200312, 197989, 195514, 193355, 192425, 192822, 193516, 193669, 193372, 192645, 190831, 187728, 184376, 181832, 179929, 178022, 176197, 174819, 173544, 171791, 169701, 167816, 166246, 164878, 163930, 163511, 163178, 162637]
56499A62637k33O31J160J057J007J294J337R40P57J069J299J135J026J180J158
56484A77454Q48P97J218J631J778J887J884J433R77J430K556K997K276J553J830
56469B02549K675L262L503L512L090K444K463L453M429M334L304K187J529J413
56455B44147J619J526N74q68j773j794j489j197o55M6L19J87M57J338J914J571
56439B45922R19P71J047J226J120P05o0q61j166j079j326k118k846l132l335l729
56423B32058l988l836l483l132k761k475k396k194j543r05q85j005k51J161J898
56408B06263J488Q67P78R33R76J039J041O37J91N70J697K548K779L014L321K863
56392B31005J588P26R39J388J202P46O90R91J443K217L200L736L514K910K219
$$ y = [162637, 162404, 163035, 164195, 165252, 166259, 167553, 168890, 169830, 170587, 171656, 172955, 174090, 175116, 176296, 177454, 178302, 179099, 180317, 181948, 183726, 185613, 187497, 188930, 189907, 191337, 193893, 196890, 199166, 200719, 202549, 205224, 208486, 211989, 215501, 218591, 221035, 223498, 226951, 231380, 235714, 239018, 241205, 242734, 244147, 245766, 247292, 247866, 246998, 245225, 243431, 241942, 240745, 240090, 240136, 240455, 240642, 241099, 242437, 244351, 245922, 246841, 247612, 248659, 249885, 251005, 251710, 251650, 250789, 249623, 248544, 247218, 245100, 242254, 239122, 235787, 232058, 228070, 224234, 220751, 217619, 214858, 212383, 209987, 207793, 206250, 205345, 204460, 203455, 203204, 204365, 206263, 207751, 208618, 209396, 210329, 211305, 212344, 213385, 214022, 214213, 214783, 216480, 219028, 221807, 224821, 228142, 231005, 232593, 233319, 234258, 235646, 236848, 237594, 238284, 239275, 240718, 242935, 246135, 249871, 253385, 256295, 258514]
56377B58514J478J162J788K716K625J433M77N13R90J450K094K675K409J387N85
56362B82296J38p32j819j808n21O09R20J407K563L302K985K530K512K071Q95L95
56346B97743J526L145L823L791L728L339K487K293L476M905N308N210N754O747
56332C53275P322P511P810Q078Q067Q187Q621Q725Q159P607P487P222O630O626
56318D61327P519Q047P263O016N353M883L845K485J183l55j918k362j597j361
56304E00328k559l610k968j618j216j337n77Q60J798K263L081M145M872N570O716
56289E15748P746Q161Q848J0681J2702J3450J3321J3900J5655J7849K0060K2246
56277F80367K4004K5229K6842K9546L2560L4870L6949M0011M4334M9435N5085
$$ y = [258514, 259992, 261154, 262942, 265658, 268283, 269716, 270193, 270706, 271696, 273146, 275240, 277915, 280324, 281711, 282296, 282434, 281702, 279883, 278075, 277554, 278163, 279083, 280490, 283053, 286355, 289340, 291870, 294382, 296453, 297348, 297743, 299269, 302414, 306237, 310028, 313756, 317095, 319582, 321875, 325351, 330256, 335564, 340774, 346528, 353275, 360597, 368108, 375918, 383996, 392063, 400250, 408871, 417596, 425755, 433362, 440849, 448071, 454701, 461327, 468846, 476893, 484156, 490172, 495525, 500408, 504253, 506738, 507921, 507566, 505648, 503286, 501689, 500328, 497769, 494159, 491191, 489573, 488357, 487020, 486443, 487303, 489101, 491364, 494445, 498590, 503462, 509032, 515748, 523494, 531655, 540503, 551184, 563886, 577336, 590657, 604557, 620212, 638061, 658121, 680367, 704371, 729600, 756442, 785988, 818548, 853418, 890367, 930378, 974712, 1024147, 1079232]
56266A079232O1106O7172P3759Q2173R2622J03645J14384J25856J38693J51436
56256B090078J62545J72424J81777J89623J94699J97183J97116J92673J82172
56247C760290J66424J47150J24431R7783O8447L8515Q989j9289m4158o3777p8704
56236D206101r0392r8844j03548j05370j05488j03951j01270r9721j00711j02498
56226C194308j03046j03490j06090j10294j13792j16083j17971j18797j17352
56217B187393j14643j12556j10514j06496j00643r4845q9375q3033p6096p0012
56207A229180o4501n7951n0577m4349l9868l5925l2003k8686k5871k2953k0430
56196H06066j8967j7433j4389j0899r239r317r064p789o374m830k467n2J092J688
$$ y = [1079232, 1140338, 1207510, 1281269, 1363442, 1456064, 1559709, 1674093, 1799949, 1938642, 2090078, 2252623, 2425047, 2606824, 2796447, 2991146, 3188329, 3385445, 3578118, 3760290, 3926714, 4073864, 4198295, 4296078, 4364525, 4403040, 4412029, 4392740, 4348582, 4284805, 4206101, 4115709, 4016865, 3913317, 3807947, 3702459, 3598508, 3497238, 3397517, 3296806, 3194308, 3091262, 2987772, 2881682, 2771388, 2657596, 2541513, 2423542, 2304745, 2187393, 2072750, 1960194, 1849680, 1743184, 1642541, 1547696, 1458321, 1375288, 1299192, 1229180, 1164679, 1106728, 1056151, 1011802, 971934, 936009, 904006, 875320, 849449, 826496, 806066, 787099, 769666, 755277, 744378, 735139, 725822, 716758, 708969, 702595, 697765, 695298, 695246, 696338, 698026]
56182F98026L356N466O110N714O446Q435R748R978J0619J1890J2353J1814J1572
56169H11527J1696J0913R344Q489Q360P392N327L506K367J237L85O03J128P61
56155H83035N74K487N601P227P182P837J0095J2773J5746K0222K5847L0939L5742
56142A065307M2139N0261N8686O7873P9762R4008J08209J21788J35809J48724
56132A972566J56256J55979J48611J34861J15261R3543P5793O4830N8642N4541
56122C030883N1037M5299L3582J5906l052j8889l0338l7196l9726m1176m6805
56111B959525n8777p4912r2835j11470j27866j37166j37460j31368j21629j08722
56101A857320r3748p9640o7961n7808m8990m2852l9013l4978l0057k6123k3703
$$ y = [698026, 701382, 706848, 712958, 718672, 725118, 733553, 743301, 753279, 763898, 775788, 788141, 799955, 811527, 823223, 834136, 843480, 851969, 860329, 867721, 873048, 876554, 878921, 880158, 880543, 881146, 882274, 883035, 883609, 886096, 891697, 898924, 906106, 913943, 924038, 936811, 952557, 972779, 998626, 1029565, 1065307, 1107446, 1157707, 1216393, 1284266, 1364028, 1458036, 1566245, 1688033, 1823842, 1972566, 2128822, 2284801, 2433412, 2568273, 2683534, 2777077, 2852870, 2917700, 2976342, 3030883, 3081920, 3127219, 3160801, 3176707, 3173655, 3154766, 3124428, 3087232, 3047506, 3006330, 2959525, 2900748, 2825836, 2733001, 2621531, 2493665, 2356499, 2219039, 2087671, 1966042, 1857320, 1763572, 1683932, 1615971, 1558163, 1509173, 1466321, 1427308, 1392330, 1362273, 1336150, 1312447]
56090A312447k0957j7330j4390j2282r307n710l814l579k311M74K324K749M187
56077A232501P041Q603Q187Q544J0719J2253J2050J2282J3831J4516J3600J3392
56065A367519J4751J5542J5151J5845J8095J9355J8992J9558K1603K2417K1407
56054A570235K1475K3411K4415K3813K4586K7316K8441K6667K5324K6230K7090
56043A849003K7055K8735L2367L4324L3880L5098L9424M3020M4018M5668M9302
56032B261894N1285N0230N0196N3155N5374N4876N5341N8670O0936N9899N9272
56021B871128O1342O2620O1220O1070O4213O6545O5972O7153P3087P9706Q3897
56010C617953Q9066R7438J04873J08823J13423J21062J27180J29144J31809J38397
$$ y = [1312447, 1291490, 1274160, 1259770, 1247488, 1238181, 1232471, 1228657, 1225078, 1222767, 1223241, 1225565, 1228314, 1232501, 1239542, 1248145, 1256332, 1264876, 1275595, 1287848, 1299898, 1312180, 1326011, 1340527, 1354127, 1367519, 1382270, 1397812, 1412963, 1428808, 1446903, 1466258, 1485250, 1504808, 1526411, 1548828, 1570235, 1591710, 1615121, 1639536, 1663349, 1687935, 1715251, 1743692, 1770359, 1795683, 1821913, 1849003, 1876058, 1904793, 1937160, 1971484, 2005364, 2040462, 2079886, 2122906, 2166924, 2212592, 2261894, 2313179, 2363409, 2413605, 2466760, 2522134, 2577010, 2632351, 2691021, 2751957, 2811856, 2871128, 2932470, 2995090, 3056310, 3117380, 3181593, 3248138, 3314110, 3381263, 3454350, 3534056, 3617953, 3707019, 3804457, 3909330, 4018153, 4131576, 4252638, 4379818, 4508962, 4640771, 4779168]
56000D779168J44719J48333J54295J65425J76435J84260J94164K08816K21848
55991F377463K29739K39092K54229K68981K79358K92463L13386L35414L53269
55982H943394L73795M02885M34450M63559M97605N42699N92279O41367O98070
55973A3590103P68386Q44663R22660J014045J127832J256822J397757J565900
55965B2488168J773006K012187K283969K615402L033297L543900M161481M927342
55957D6838752N872906O997023Q314040R892676J1816562J4153263J7005690K0538576
55949A41429488K4896517L0140464L6232210M2740494M8145141M9510133M3577638
55942D16672085K9038830Q122395j4136468l2494407m3894971m8117076m6856449
$$ y = [4779168, 4923887, 5072220, 5226515, 5391940, 5568375, 5752635, 5946799, 6155615, 6377463, 6607202, 6846294, 7100523, 7369504, 7648862, 7941325, 8254711, 8590125, 8943394, 9317189, 9720074, 10154524, 10618083, 11115688, 11658387, 12250666, 12892033, 13590103, 14358489, 15203152, 16125812, 17139857, 18267689, 19524511, 20922268, 22488168, 24261174, 26273361, 28557330, 31172732, 34206029, 37749929, 41911410, 46838752, 52711658, 59708681, 68022721, 77915397, 89731959, 103885222, 120890912, 141429488, 166326005, 196466469, 232698679, 275439173, 323584314, 373094447, 416672085, 445710915, 453833310, 439696842, 407202435, 363307464, 315190388, 268333939]
55935B68333939m2383696l6616241l0772470k5443761k0845970j7025431j3933068
55928H1313302j1450951r451156p842939o557240n519268m664713l961455l390066
55920B8475514k919126k518984k181359j904443j672941j470326j295965j152630
55912A3359740j030038r16861q16491p35348o66825o01425n41912m94287m53668
55903G102885m12680l74614l45349l20838k94787k70495k53251k38877k21217
55894D370777k03557j91545j81802j68389j54002j44240j36843j26816j16523
55885B947060j10766j07074j00326r2131q6707q2176p4720o6849o3111o1737n8591
55874B042872n5250n5269n6418n4338n0388m8537m7940m5570m2830m2706m3669
$$ y = [268333939, 225950243, 189334002, 158561532, 133117771, 112271801, 95246370, 81313302, 69862351, 60411195, 52568256, 46011016, 40491748, 35827035, 31865580, 28475514, 25556388, 23037404, 20856045, 18951602, 17278661, 15808335, 14512370, 13359740, 12329702, 11412841, 10596350, 9861002, 9194177, 8592752, 8050840, 7556553, 7102885, 6690205, 6315591, 5970242, 5649404, 5354617, 5084122, 4830871, 4591994, 4370777, 4167220, 3975675, 3793873, 3625484, 3471482, 3327242, 3190399, 3063583, 2947060, 2836294, 2729220, 2628894, 2536763, 2450056, 2367880, 2293160, 2226311, 2163200, 2101463, 2042872, 1987622, 1932353, 1875935, 1821597, 1771209, 1722672, 1674732, 1629162, 1586332, 1543626, 1499957]
55863A499957m2706m1116m1103m0159l5048k7987k2749j7953j0298j179N834J0868
55851A236361J5157J5808R337k020j3059k2005k9266l3054l1990k9195k8332k8159
55839A059583k5978k3448k3610k5115k4905k3966k4901k6335k5303k2847k1924
55828G91251k1877k0185j7636j6541j5963j3757j1413j1827j4005j4862j4369
55817F18816j4272j3713j0965p617o268n797l626p38L19M78K333N001N751N135
55803E74837N570O299M779J858N49O85m20k942m839o314r316j3105j4923j4577
55789E28141j4291j4468j3663j2167j1667j1804j0821r120q451q264o451l097
55777D03877o3K245M178M069J3o302j1211j3769j5391j5964j4184j0895q148n604
$$ y = [1499957, 1457251, 1416135, 1375032, 1334873, 1299825, 1271838, 1249089, 1231136, 1220838, 1219659, 1225493, 1236361, 1251518, 1267326, 1276663, 1274643, 1261584, 1239579, 1210313, 1177259, 1145269, 1116074, 1087742, 1059583, 1033605, 1010157, 986547, 961432, 936527, 912561, 887660, 861325, 836022, 813175, 791251, 769374, 749189, 731553, 715012, 699049, 685292, 673879, 662052, 648047, 633185, 618816, 604544, 590831, 579866, 572249, 565981, 560184, 556558, 555820, 556139, 556617, 558950, 563951, 569702, 574837, 580407, 586706, 591485, 593343, 593892, 594577, 594157, 591215, 586376, 580062, 570746, 557641, 542718, 528141, 513850, 499382, 485719, 473552, 461885, 450081, 439260, 430140, 421689, 413425, 406974, 403877, 403814, 406059, 410237, 414306, 414319, 408017, 396806, 383037, 367646, 351682, 337498, 326603, 318455, 312851]
55763C12851j603K891N134M610K617j065p083j2961j5045j3634j2176j1746j0407
55750B42383p733n681m787l565j960j628k470k492j539j621l144m184l903l510
55736A94166l377k371m34J033J702K503L244K842J784J467J255p63m187o577p222
55721A85065p569p974p258n508m216l472k075m00p8p38l43J230K140K259L486
55706A54549O099Q196R159J0390J2042J2280J0547Q406O510L801M53j532j562
55693B39338j398k007k305j869k025l269m289m503m943n737n348l335j310k31
55679A96769Q65K505L606L612L485L688L430K666K529L041K738J377O25J192J622
55664B33750R21N5p2J0q0K54R62J005M31O43J828K343J435L67m4p31k314l935
$$ y = [312851, 311248, 314139, 319273, 323883, 326500, 325435, 318352, 305391, 290346, 276712, 264536, 252790, 242383, 234650, 228969, 224182, 220617, 218657, 217029, 214559, 212067, 210528, 208907, 205763, 201579, 197676, 194166, 190789, 188418, 187984, 189017, 190719, 193222, 196466, 199308, 201092, 202559, 203814, 203051, 198864, 192287, 185065, 177496, 169522, 162264, 156756, 152540, 149068, 146993, 146593, 146515, 145777, 145434, 146664, 148804, 151063, 154549, 160648, 168844, 178003, 188393, 200435, 212715, 223262, 231668, 238178, 241979, 242432, 240900, 239338, 237940, 235933, 233628, 231759, 229734, 226465, 222176, 217673, 212730, 206993, 201645, 198310, 197000, 196769, 197634, 200139, 203745, 207357, 210842, 214530, 217960, 220626, 223155, 226196, 228934, 230311, 230936, 232128, 233750, 234671, 234726, 234654, 234664, 234584, 234838, 235800, 236805, 237236, 237879, 239707, 242050, 243485, 243852, 243808, 243077, 240763, 236828]
55646B36828n119o698q885j0497j0987j1274j1682j1132r294p530o750o309n786
55633A24885n798o305o197n348m941m999m021j928q44j760k858k537j782j965
55619G3602k472k170j370p76j26O98P96j84j133j303j342j611j262j53K98o20
55603F0872j611j640j505j855j649j62J305J420Q53P34O93R2m54l46l84j157j595
55586E3611p62L03K41m19m97l14p86j477j316m77J19L18L16k96j556k175j119
55569D3714N31R05j25j191j517j390r92j65Q98J786K364K495J851O27k39k44P1
55552D9379K06L82N86K02o98q87K46J659K277K376K467K161J314R71J888L264
55536F7793M122M751N587N902N115M227M370M837M151K374P24l29j157j742j817
$$ y = [236828, 231709, 225011, 216126, 205629, 194642, 183368, 171686, 160554, 151260, 143730, 136980, 130671, 124885, 119087, 112782, 106585, 101237, 96296, 91297, 87276, 85348, 84504, 82744, 79886, 77349, 75567, 73602, 71130, 68960, 67590, 66814, 66688, 67386, 68182, 67998, 66865, 65562, 64220, 62609, 61347, 61194, 61492, 60872, 59261, 57621, 56116, 54261, 52612, 52450, 53755, 55175, 56028, 56762, 57455, 57547, 57093, 56747, 56363, 55206, 53611, 52849, 53152, 53393, 52974, 52477, 52163, 51377, 49900, 48584, 48107, 48226, 48544, 48860, 48564, 47008, 44833, 43714, 44245, 45150, 45025, 43834, 42317, 40927, 39935, 39770, 40668, 42454, 44818, 47313, 49164, 49791, 49552, 49308, 49379, 49585, 49967, 50553, 50755, 50057, 49170, 49416, 51075, 53352, 55728, 58195, 60356, 61670, 62641, 64529, 67793, 71915, 76666, 82253, 88155, 93270, 97497, 101867, 106704, 110855, 113229, 113953, 113624, 112467, 110725, 108908]
55521A08908j830k379l078l184k949l176l857m365m677n172n556n068l763k611
55507E7243k359k872l468l423k455j135m61p20j269j582j775j829j283j25Q37
55492C3324J015N75k72j530k633k619j547o31m97n70n29q69j472j244JQ93N98
55475B1993Q4K43M02j65p73o67m57q15j087n51J50K44K23O49Q29J82l10L17J127
55456B1618O67p09j593j706j701j604j077n50n21m71J24N44J9o69l76M38N84K29
55438A3246L47Q37Q88O76R20J295R79L44L85R03R22N62P77J517J839J607J525
55421B9569J612J223M01k03n98j235j765j439m96J93N84J140J455Q07k19k71O93
55404C1451J467J594J680J824J339K34o44j062j615k276k232j359n69l66l26k43
$$ y = [108908, 107078, 104699, 101621, 98437, 95488, 92312, 88455, 84090, 79413, 74241, 68685, 63617, 59854, 57243, 54884, 52012, 48544, 45121, 42666, 41531, 41070, 40350, 39081, 37499, 35724, 33895, 32612, 32487, 33324, 34339, 34914, 34642, 33112, 30479, 27860, 26313, 25682, 25185, 24615, 24086, 23217, 21745, 20501, 20502, 21395, 21993, 22077, 22320, 22722, 22557, 21784, 21117, 20660, 19845, 18758, 18207, 18357, 18601, 18824, 19473, 20302, 20484, 20174, 20491, 21618, 22285, 21576, 19983, 18277, 16576, 14972, 13895, 13345, 12824, 12353, 12477, 13021, 13040, 12371, 11995, 12433, 13017, 13246, 13593, 14430, 15318, 15994, 16914, 18209, 19188, 19532, 19917, 20820, 21742, 22304, 23081, 24598, 26437, 28044, 29569, 31181, 32404, 32805, 32602, 32004, 30769, 29004, 27565, 27069, 27262, 27846, 28986, 30441, 31248, 31029, 30758, 31451, 32918, 34512, 36192, 38016, 39355, 39589, 38945, 37883, 36268, 33992, 31760, 30401, 29832, 29466, 29140, 28897]
55388B8897n93j510k333k526k181j506o68r4j10k77M2O74J029J159J322J020k73
55371B2072j715j947j153q29j433j834j199q1P13J081J165R91Q36R45Q42p6j307
55354A7071j721j270r53j083q77K9R58J431J752K045J842J013J41l73p25r40p39
55337A7601l10l09p70j001p18l82k72j73j42n51j178j228n30K82Q68J436J736
55320A4359J033n54j712j452j67J161J906J804R40P9Q7O41M66p69j804j496k93
55303A4229N77O40K51k30p13j066j084p07j25K07o2n77m60M42J072O80K06R36
55285A4216K273K331O64j112j595j064l88J72N14L24j91k11M32Q72N83K35M06
55268A8461N18j10q76o33O40J729J602L63j104j964j970j517j097p39j29Q09J771
$$ y = [28897, 28304, 26794, 24461, 21935, 19754, 18248, 17580, 17486, 17376, 17099, 17141, 17815, 18844, 20003, 21325, 22345, 22072, 20357, 18410, 17257, 16428, 14995, 13161, 11962, 11881, 12594, 13675, 14840, 15831, 16667, 17612, 18454, 18378, 17071, 15350, 14080, 13127, 12044, 11167, 11196, 12154, 13585, 15337, 17382, 19224, 20237, 20378, 20005, 19280, 18340, 17601, 17291, 16982, 16212, 15211, 14493, 14111, 13839, 13666, 13524, 12973, 11795, 10567, 10037, 10319, 11187, 12623, 14359, 15392, 14838, 13126, 11674, 11507, 12668, 14574, 16378, 17318, 17397, 17484, 18125, 18591, 17822, 16018, 14522, 14229, 14806, 15446, 15697, 15467, 14754, 13688, 12604, 11897, 11772, 11979, 11917, 11340, 10880, 11322, 12394, 13074, 13280, 14216, 16489, 18820, 19484, 18372, 16777, 15713, 15325, 15497, 16011, 16335, 16144, 15933, 16365, 17237, 17820, 18055, 18461, 18979, 18869, 17993, 17360, 18000, 19729, 21331, 21694, 20590, 18626, 16656, 15139, 14042, 13303, 13174, 13983, 15754]
55251A5754K464K733K429J562N42j90o70j164j606j713j503j184p79l55k13l31
55235A5776j46M45N22n10j604j312J07J129J183J044J214J368J467J937K530K357
55219B7507J367N55M05K61l75j032j199r96o17N7Q67J298J213Q72K03r72j980
55202B7434j780n04N98R22R53R20L46o58j124p44l91n88p32m25l43j027j867k022
55184A8968j468n36O09J506J468O53J56M73Q71P78O55R07J078Q11N85P19O94J66
55166B9093l02k23Kn8j80k78p84j565j648p81j35n64j308j357r80q27o11N6N25
55147A8075J04o09o54k61k80o56p76o52n14P3J446K668K513J284L52J97K18J77
55129B2705M56R27R54N95O46J272J717J535J260J422J806J871J372L57q74j710
$$ y = [15754, 18218, 20951, 23380, 24942, 25484, 25294, 24624, 23460, 21854, 20141, 18638, 17454, 16675, 16320, 16107, 15776, 15630, 16075, 16597, 16087, 14483, 13171, 13278, 14407, 15590, 16634, 17848, 19216, 20683, 22620, 25150, 27507, 28874, 29429, 29834, 30095, 29720, 28688, 27489, 26493, 25876, 25933, 26800, 28098, 29311, 30183, 30386, 29414, 27434, 25654, 25150, 25748, 26670, 27623, 28543, 28889, 28231, 27107, 26363, 25972, 25384, 24652, 24227, 23884, 22857, 20990, 18968, 17500, 16964, 17573, 19079, 20547, 21200, 21356, 21829, 22700, 23478, 24133, 25040, 26118, 26929, 27514, 28233, 28927, 29093, 28791, 28568, 28570, 28512, 28332, 28054, 27270, 25705, 24057, 23276, 23141, 22577, 21269, 19912, 18932, 18105, 17494, 17550, 18075, 18179, 17570, 16916, 16655, 16375, 15719, 14943, 14291, 13777, 13850, 15296, 17964, 20477, 21761, 22113, 22310, 22528, 22705, 23161, 24088, 25042, 25637, 26283, 27555, 29272, 30807, 32067, 33489, 35295, 37166, 38538, 38895, 38021, 36311]
55113C6311j665j037n54l81K4R23J722J668P14n10j359j594j327p62r4L76L36
55096C2791o4q8P91K001K407J709P30K66L83Q57J483J729J054o1l54M62J164Q37
55078D8097K20L90J026J103O36N31R96J248P71l6n36m79O7Q49J444J541J178N25
55060E9571k95j010j264j122j065j173r07q0O05M90j47o76r64j103q62j70M69
55043E0297O50O89R49J092P14J37j51l68q67j255r55l37k64p53r93n89n7k4n71
55024D7344j255j370m07J230K355K263J555J177J162R87O21M05K54j22m85m04
55008E5310j35l02q81j270j318j420j620j448p83j78j19m35o37m73oN34R70J320
54990D7109J649J729J222L45j19J38M45R6o17q54l93J64K06k98q08o36M01J657
$$ y = [36311, 34646, 33609, 33055, 32674, 32698, 33621, 35343, 37011, 37725, 37215, 35856, 34262, 32935, 32173, 32079, 32455, 32791, 32727, 32639, 33430, 35431, 37838, 39547, 40277, 40543, 40926, 41783, 43266, 44995, 46049, 45988, 45634, 46096, 47260, 48097, 48317, 48707, 49733, 50836, 51472, 52003, 52999, 54247, 55018, 54982, 54446, 53967, 54034, 54883, 56327, 57868, 59046, 59571, 59276, 58266, 57002, 55880, 54815, 53642, 52735, 52655, 53260, 53750, 53603, 52927, 51963, 50860, 49998, 49828, 50297, 50947, 51636, 52585, 53677, 54391, 54528, 54377, 54009, 53142, 51887, 50932, 50595, 50331, 49578, 48585, 47996, 47939, 47915, 47344, 46089, 44719, 44312, 45542, 47897, 50160, 51715, 52892, 54054, 55041, 55662, 56067, 56321, 56199, 55714, 55310, 55175, 54873, 53992, 52722, 51404, 49984, 48364, 46916, 46133, 45955, 45836, 45401, 44764, 44291, 44285, 44819, 45789, 47109, 48758, 50487, 51709, 52054, 51935, 52073, 52518, 52614, 51997, 51143, 50750, 50914, 51120, 50822, 50014, 49378, 49779, 51436]
54972E1436K324K405K455K477K015J414J732K979L749L283K733L395M833N881
54958I3111O542P542Q750R430R641J0116J1096J2253J3454J4609J5169J4709J3516
54945B39938J1669Q302K919l128p939j1326j4364j7161j8592j8166j6620j4599
54933A40933j2185r791q161p225o145m709l585k981k229r94J76Q49J313J824K135
54918H9225K114K064K228K560L188M367N897P238Q330R589J1096J2444J3457J4260
54904A88057J4662J4095J2243R162M904k67n465r750j2955j5304j6537j6285j5022
54891A51538j3655j2358j0789r121p824o655n093l558k933k996k719k016j708
54878G0113j742j105J65N30p67k392k724j826q41m13n53j205k118k679k524j877
$$ y = [51436, 53760, 56165, 58620, 61097, 63112, 64526, 66258, 69237, 72986, 76269, 79002, 82397, 87230, 93111, 99653, 107195, 115945, 125375, 135016, 145132, 156228, 168481, 181935, 196544, 211713, 226422, 239938, 251607, 259909, 262828, 259700, 251761, 240435, 226071, 208910, 190318, 172152, 155532, 140933, 128748, 118957, 110796, 103571, 97426, 92717, 89132, 86151, 83922, 82928, 83104, 83953, 85266, 87090, 89225, 91339, 93403, 95631, 98191, 101379, 105746, 111643, 118881, 127211, 136800, 147896, 160340, 173797, 188057, 202719, 216814, 229057, 238219, 243123, 242856, 237391, 227641, 214686, 199382, 182845, 166560, 151538, 137883, 125525, 114736, 105615, 97791, 91136, 86043, 82485, 79552, 76556, 73837, 71821, 70113, 68371, 67266, 67431, 67961, 67194, 64802, 62078, 60252, 59411, 58998, 58445, 57240, 55122, 52443, 49919, 48042]
54862D8042j045j78L37J05m15k54N41P47k31j346j373m53L81N34N9p53j430j495
54844D1773j082q55r83q59j54N89Q14O74M77J62k52l42J03P64J382K079K791L085
54826E0166K823K323J659O59k32j47P53J203O44N6L18Q81R04O49P38R72R39J049
54808F6357J870L001L705M134M948O099P064P930R211J0745J1899J2694J3753
54795A63410J5083J5840J5558J4722J3753J2023Q505L188k547p081r916j1726
54783B30812j3119j3787j3170j1637j0257r496q794p597o091m712l595k799k484
54770A23274k472k187j334k64O19J343K025K643L374M578O146P456Q278R171J0667
54755A73317J2621J4714J6977J9435K1676K3114K3231K1515J7697J2257O024p53
$$ y = [48042, 46997, 46819, 47156, 47261, 46846, 46592, 47133, 47880, 47649, 46303, 44930, 44477, 44858, 45392, 45451, 44698, 43268, 41773, 40691, 39836, 38853, 37994, 37840, 38429, 39243, 39917, 40394, 40556, 40304, 39962, 40065, 40829, 42211, 44290, 47081, 50166, 52989, 55312, 56971, 57630, 57398, 57251, 58004, 59207, 59851, 59907, 60225, 61106, 62010, 62659, 63397, 64369, 65308, 66357, 68227, 71228, 74933, 79067, 84015, 90114, 97178, 105108, 114319, 125064, 136963, 149657, 163410, 178493, 194333, 209891, 224613, 238366, 250389, 258894, 262082, 259535, 252454, 242538, 230812, 217693, 203906, 190736, 179099, 168842, 159346, 150552, 142955, 136864, 132152, 128557, 125758, 123274, 120802, 118615, 117281, 117017, 117636, 118979, 121004, 123647, 127021, 131599, 137745, 145201, 153479, 162650, 173317, 185938, 200652, 217629, 237064, 258740, 281854, 305085, 326600, 344297, 356554, 362578, 361825]
54743C61825q106j5053j9793k1657k1814k1547k0858j9364j7493j5843j4187j2113
54731A53997j0030q622p804p051o230n418m423l204k329k257k587k679k507k346
54717H6510k125j722j344j087o58n1K07J8O3N50N94k93j084p10K55N96M22P11
54699H0852J470J768J274N10k27r01j045k77O97P97K12M2N00P52N37N03Q12P39
54681H9015M5m64j83N06J064J499J851J911J802K101K890L493L535L516M022M942
54665A21545N862O556O786O317N457M952M964M813M107L414L311L405L043K530
54651A87062K852M237N715O278O041N963O622P671Q577R552J1228J3417J4900
54638B90115J4676J2941J0390P136K905k105p244j2008j5999j8609j9465j9006
$$ y = [361825, 353719, 338666, 318873, 297216, 275402, 253855, 232997, 213633, 196140, 180297, 166110, 153997, 143967, 135345, 127541, 120490, 114260, 108842, 104419, 101215, 98886, 96629, 94042, 91363, 88856, 86510, 84385, 82663, 81319, 80232, 79574, 79523, 79730, 79748, 79811, 80361, 80955, 80662, 79578, 78868, 79123, 79719, 80141, 80852, 82322, 84090, 85364, 85874, 85647, 84746, 83701, 83424, 84121, 84918, 85130, 85172, 85672, 86424, 86961, 87464, 88276, 89015, 89060, 88596, 88413, 88919, 89983, 91482, 93333, 95244, 97046, 99147, 102037, 105530, 109065, 112581, 116603, 121545, 127407, 133963, 140749, 147066, 152523, 157475, 162439, 167252, 171359, 174773, 178084, 181489, 184532, 187062, 189914, 194151, 199866, 206144, 212185, 218148, 224770, 232441, 241018, 250570, 261798, 275215, 290115, 304791, 317732, 328122, 335258, 338163, 336058, 328814, 316806, 300807, 282198, 262733, 243727]
54626B43727j7957j6501j4626j2840j1577j0275q180n886m772m873m717l542k280
54613A25701j771j338n1J616K553K697K864L325L580L357K907K373J613P01k9
54598A50098n48j188k048k822l291l664m169m601m515l787k890k512k866l450
54584A07747l603l262k932k941l055k967k759k603k381j882j264r52j039j140
54570G4967q72k89K29M03K65L2j44k30k25q3J83M02M01K14R1J90L78M43M89Q58
54550G7702J500J677P25q02j326K8K249L520L213K246J690J766K286L180M242
54535A03896N018N372N715O303O822P002P028O926O181M544K652J125l97k510
54521A65677m767o161o609o993p636p773o785n217m079l653l445l019k549k508
$$ y = [243727, 225770, 209269, 194643, 181803, 170226, 159951, 151771, 145885, 141113, 136240, 131523, 127981, 125701, 123930, 122592, 122541, 124157, 126710, 129407, 132271, 135596, 139176, 142533, 145440, 147813, 149426, 150127, 150098, 149550, 148362, 146314, 143492, 140201, 136537, 132368, 127767, 123252, 119465, 116575, 114063, 111197, 107747, 104144, 100882, 97950, 95009, 91954, 88987, 86228, 83625, 81244, 79362, 78098, 77146, 76107, 74967, 74095, 73806, 74035, 74438, 74703, 74735, 74591, 74361, 74136, 74053, 74236, 74638, 75039, 75253, 75344, 75534, 75912, 76355, 76844, 77702, 79202, 80879, 81604, 80802, 79476, 79504, 81753, 85273, 88486, 90732, 92422, 94188, 96474, 99654, 103896, 108914, 114286, 120001, 126304, 133126, 140128, 147156, 154082, 160263, 164807, 167459, 168584, 168187, 165677, 160910, 154749, 148140, 141147, 133511, 125738, 118953, 113736, 109657, 106004, 102559, 99540, 96991, 94483]
54507I4483l068l807m056l519k411j108OM30j16j059j277m06O96J181J207J205
54491G8381R41J25o19m55L63R09J048J398J916J736O30l51q4J323K754L106K057
54474I5178K82r55r17l6Q49J502K026K042J149o4n67l59l13o02n09O3J53p02j677
54455I6543j984j931k023j990j463p97m57k62K8J00k29l70Q5M45r4j039j266p59
54437H2537n27r14j095n31J20K2n76p03J7R30J138M38n76j186j231j065r16n55
54419G5327K11J025J292R32M82L79M97N24N46Q96J558K024J996J844K113K683
54403I4329K919K676K621L282M252M723M558M294M324M560M803M958M882M460
54389A51641L826L181K430J362M9j236k396l402l942l712k985k450k463k864l379
$$ y = [94483, 91415, 87608, 83552, 80033, 77622, 76514, 76520, 76950, 76834, 75775, 74498, 74092, 74788, 75969, 77176, 78381, 79322, 79447, 78828, 78373, 78736, 79645, 80693, 82091, 84007, 85743, 86373, 86022, 85938, 87261, 90015, 93121, 95178, 95460, 94505, 93588, 93552, 94401, 95903, 97929, 99971, 101120, 101056, 100489, 100130, 99817, 99215, 98706, 98769, 98922, 98220, 96543, 94559, 92628, 90605, 88615, 87152, 86355, 85898, 85636, 85664, 85764, 85535, 85165, 85250, 85695, 85601, 84562, 83296, 82537, 82010, 81096, 80001, 79470, 79590, 79612, 79036, 78333, 78350, 79280, 80418, 80856, 80280, 79094, 77863, 76798, 75882, 75327, 75538, 76563, 77855, 78787, 79269, 79648, 80145, 80669, 81215, 82111, 83669, 85693, 87689, 89533, 91646, 94329, 97248, 99924, 102545, 105827, 110079, 114802, 119360, 123654, 127978, 132538, 137341, 142299, 147181, 151641, 155467, 158648, 161078, 162440, 162489, 161253, 158857, 155455, 151513, 147801, 144816, 142366, 139903, 137039, 133660]
54374A33660l760l702l170k710k819l113k775j822j190j472k185k485k063j178
54360I9216k76K77M56O06Q54P51k9q93j029n96l29j80N10J586K120K061K514L898
54342A11517N131N297M953M989N236N163N026N216N231M416L178K342J690L26
54328A69711j703l250l608l308l314l993m998n661n507m830m604n350o299o231
54314A07055m950l451k670k643k787k565j839j021p46j157j667j738j588j711
54300G6522k020k047j752j575j740k052k257k163j566n61K22K06l41o34l49J53
54284E8046M98N69K60m07q94n33N39J383J367Q16L44Q9p9j10J11M26N98P06J019
54265F4748J541J964J984J541P48j59q29r43n06J02M97O28O72O79N15J93kJ53
$$ y = [133660, 129900, 126198, 123028, 120318, 117499, 114386, 111611, 109789, 108599, 107127, 104942, 102457, 100394, 99216, 98940, 99217, 99673, 100279, 101133, 101884, 101855, 100962, 99933, 99337, 99008, 98828, 99338, 100924, 103044, 105105, 107619, 111517, 116648, 121945, 126898, 131887, 137123, 142286, 147312, 152528, 157759, 162175, 165353, 167695, 169385, 169711, 168008, 164758, 161150, 157842, 154528, 150535, 145537, 139876, 134369, 129539, 124935, 119585, 113286, 107055, 102105, 98654, 95984, 93341, 90554, 87989, 86150, 85129, 84383, 83226, 81559, 79821, 78233, 76522, 74502, 72455, 70703, 69128, 67388, 65336, 63079, 60916, 59350, 58789, 59011, 59217, 58876, 58242, 57893, 58046, 58544, 59113, 59373, 58966, 58072, 57539, 58078, 59461, 60828, 61644, 61988, 62077, 61998, 61888, 61999, 62425, 63023, 63729, 64748, 66289, 68253, 70237, 71778, 72526, 72367, 71538, 70595, 70089, 70191, 70688, 71316, 71988, 72667, 73182, 73375, 73373, 73526]
54247G3526M74N83L40o8l69l70r4J60P6k16k28J10K46j04m01j86pn76j411j394
54227G0091n37l1m22r09p50l41l09n10n12l03k4L31M36k82j508j866o95Q37J237
54208F3933O69L56O36O87l1j117j923k095j555o41j04k60m04J99J018Q54m40j744
54190E8038k111j553m64Q34J811J896J211N95N69Q83J068R24L72n01j174j062
54174F1336m10j15m98q96p52m65o71j153j112k27R80J783J860J329M96k99q26
54157F0360j064j152j170r79l50O23J428J675J556J499J414Q67J1l55R1P01Q29
54140F5984O79O61N87J74j81JL34O0p56j380j560j665j807j676j280r60o50J8
54122E6583Q02Q84J06o59o48r3L63N21M89K79n8k45p7M00J028J560J510O24m64
$$ y = [73526, 74000, 74583, 74923, 74855, 74486, 74116, 74022, 74182, 74258, 74042, 73814, 73924, 74170, 74066, 73665, 73479, 73472, 72896, 71485, 70091, 69554, 69523, 69101, 68192, 67442, 67101, 66792, 66282, 65770, 65467, 65443, 65774, 66210, 65928, 64420, 62554, 61859, 62696, 63933, 64602, 64958, 65594, 66281, 66250, 65133, 63210, 61115, 59560, 58919, 58815, 58555, 58151, 58350, 59368, 60222, 59782, 58038, 55927, 54374, 53910, 54744, 56555, 58451, 59662, 60257, 60826, 61709, 62777, 63701, 64073, 63572, 62398, 61336, 60926, 60811, 60313, 59417, 58665, 58200, 57529, 56376, 55264, 55037, 56017, 57800, 59660, 60989, 61485, 61186, 60360, 59296, 58144, 56974, 55995, 55645, 56268, 57696, 59371, 60927, 62426, 63840, 64707, 64718, 64363, 64454, 65155, 65984, 66663, 67324, 67911, 68085, 67904, 67905, 68239, 68299, 67543, 66163, 64603, 62938, 61131, 59455, 58175, 57215, 56565, 56583, 57385, 58269, 58375, 57716, 57068, 56975, 57338, 57859, 58348, 58627, 58569, 58324, 58247, 58647, 59675, 61235, 62745, 63369, 62905]
54103F2905p22j45J04o70j582j389k22O46N00j52n52o22o83p99p38m37j48p5r2
54084E5127O5L61M53K17k4O0K59J41k33l33N0M33K72k64m64P6R78J561J625J572
54064F1932J705J703J123K01l70m04m13p53j127j169q79k23R83K323K715J830
54048F9177R19J277K380K641J710Q49R88J599J784J537J393J581J992K577L332
54033I5736M113M700M915M718M420M581N329O011O047N820O119O852P122O523
54019A73006N562M790M261L945L858L683K994K001J347J109Q01L91L76O39K35
54004B08998j265l093m376n081n490n612n617n972o517o228m629k758j902k027
53990A48431k197k074k016k151k234k209k161j899j293q00r44j408j336n43K63
$$ y = [62905, 62183, 62038, 62142, 61472, 59890, 58501, 58279, 58925, 59425, 59273, 58721, 58099, 57416, 56617, 55879, 55442, 55294, 55219, 55127, 55192, 55553, 56006, 56223, 56199, 56259, 56518, 56659, 56426, 56093, 56143, 56576, 56848, 56584, 56120, 56196, 57174, 58735, 60360, 61932, 63637, 65340, 66463, 66664, 66294, 65890, 65477, 64724, 63597, 62428, 61549, 61326, 62309, 64632, 67347, 69177, 70096, 71373, 73753, 76394, 78104, 78953, 79941, 81540, 83324, 84861, 86254, 87835, 89827, 92404, 95736, 99849, 104549, 109464, 114182, 118602, 123183, 128512, 134523, 140570, 146390, 152509, 159361, 166483, 173006, 178568, 183358, 187619, 191564, 195422, 199105, 202099, 204100, 205447, 206556, 207357, 207748, 208124, 208763, 208998, 207733, 204640, 200264, 195183, 189693, 184081, 178464, 172492, 165975, 159747, 155118, 152360, 150458, 148431, 146234, 144160, 142144, 139993, 137759, 135550, 133389, 131490, 130197, 129397, 128453, 127045, 125709, 125166, 125429]
53975A25429M28J7n44q87p85k77K31K44k96r78j268p77N24K030K756K371J706
53958A29924J732K246K235J394N58M72Q45J008R14R49J101R34L85Q5O30J820K905
53941A50137L419L507L542L749M177M751N131M910M085L010J855N38o72j193j204
53926A89742j775l208m013k727j75J469J634J732K614L310K996K575L200M454
53912B01828N175N262N435N825N968N856N863N956N916O051O750P450P042N284
53898B85661L005R73o49j762k103j817j556j745k214k665l061l508m091m931n973
53883B53564o763o843o389o085o346o918p212o824n851m963m892n536n862n111
53869A67969l827l148l440m086m416m197l437k424j845k120k717k782k342k148
$$ y = [125429, 125857, 125874, 125330, 124443, 123658, 123381, 123612, 123856, 123560, 122582, 121314, 120537, 121061, 123091, 125847, 128218, 129924, 131656, 133902, 136137, 137531, 138089, 138561, 139406, 140414, 141328, 142277, 143378, 144312, 144697, 144782, 145412, 147232, 150137, 153556, 157063, 160605, 164354, 168531, 173282, 178413, 183323, 187408, 190418, 192273, 192811, 192139, 190946, 189742, 187967, 184759, 180746, 178019, 177844, 179313, 180947, 182679, 185293, 188603, 191599, 194174, 197374, 201828, 207003, 212265, 217700, 223525, 229493, 235349, 241212, 247168, 253084, 259135, 265885, 273335, 280377, 285661, 288666, 289639, 288990, 287228, 285125, 283308, 281752, 280007, 277793, 275128, 272067, 268559, 264468, 259537, 253564, 246801, 239958, 233569, 227484, 221138, 214220, 207008, 200184, 194333, 189370, 184478, 178942, 173080, 167969, 164142, 160994, 157554, 153468, 149052, 144855, 141418, 138994, 137149, 135029, 132312, 129530, 127188, 125040]
53855A25040k353k267j633j239j766k689k849j903o26p3o09j700k438k313j526
53840I9056n65K66P37N28l37j172j320j012q70p92j18J071J839J713J274J045
53824A01343O82j89j034j092m47K02N54Q05R90Q75M67J31J73N72J121J529J600
53807A08282J507J721K349K788K507J915J913K622L177K957K507K884M334N987
53793A47450O835O689O104N506M698L364J878J194J744K790L183K637J843J406
53779A97321J196Q67N73O81J080J164N80m30j399k116k553k693k631k621k798
53764A86221k984l047l230l791m425m464l700k597j649q99k63Q3m5m40o85o38
53748A53447n09n45q03j112j201r36n63m72o69p16l56J35M80Q96J669K514K797
$$ y = [125040, 122687, 120420, 118787, 117548, 115782, 113093, 110244, 108341, 107715, 107642, 107033, 105333, 102895, 100582, 99056, 98491, 98757, 99494, 100022, 99685, 98513, 97193, 96181, 95311, 94519, 94401, 95472, 97311, 99024, 100298, 101343, 102025, 101836, 100802, 99710, 99263, 99465, 100019, 100824, 101814, 102689, 103156, 103287, 103460, 104032, 105153, 106682, 108282, 109789, 111510, 113859, 116647, 119154, 121069, 122982, 125604, 128781, 131738, 134245, 137129, 141463, 147450, 154285, 160974, 167078, 172584, 177282, 180646, 182524, 183718, 185462, 188252, 191435, 194072, 195915, 197321, 198517, 199384, 199957, 200638, 201718, 202882, 203462, 203032, 201633, 199517, 196964, 194271, 191640, 189019, 186221, 183237, 180190, 176960, 173169, 168744, 164280, 160580, 157983, 156334, 155435, 155172, 155255, 155210, 154770, 154085, 153447, 152938, 152393, 151590, 150478, 149277, 148341, 147778, 147306, 146637, 145921, 145565, 145700, 146180, 147076, 148745, 151259, 154056]
53731A54056K283J274J06j020j804j962j653j436j572j673j262m13L14M92J86
53716A45916j94l10j16K63P41J246J563J503J256J336J936K655L019L033K945
53701A66792K800K587K556K932L402L457L140L064L557M275M709M724M481M209
53687B16685M136M387M778M951M874M924N363N930O075N524M550L722L357L180
53673B82436K593J451L06l17o28j150j824k087j800j499j591j791j652j252r85
53658B70210j002j148j295j461j651j791j798j645j406j232j169j028o15q6J41
53643B53024j47q01j554k131k135j308q6N27l8j268k145k151j466m49O59J625
53627B40156K227K478K571K574K359J941J635J709K005K151K140K400L149L889
$$ y = [154056, 156339, 157613, 157719, 156699, 154895, 152933, 151280, 149844, 148272, 146599, 145337, 144924, 145238, 145730, 145916, 145722, 145412, 145296, 145559, 146300, 147546, 149109, 150612, 151868, 153204, 155140, 157795, 160814, 163847, 166792, 169592, 172179, 174735, 177667, 181069, 184526, 187666, 190730, 194287, 198562, 203271, 207995, 212476, 216685, 220821, 225208, 229986, 234937, 239811, 244735, 250098, 256028, 262103, 267627, 272177, 275899, 279256, 282436, 285029, 286480, 286786, 286469, 285841, 284691, 282867, 280780, 278980, 277481, 275890, 274099, 272447, 271195, 270210, 269208, 268060, 266765, 265304, 263653, 261862, 260064, 258419, 257013, 255781, 254612, 253584, 252969, 252883, 253024, 252877, 252076, 250522, 248391, 246256, 244948, 244862, 245389, 245351, 244083, 241938, 239787, 238321, 237872, 238531, 240156, 242383, 244861, 247432, 250006, 252365, 254306, 255941, 257650, 259655, 261806, 263946, 266346, 269495, 273384]
53613B73384L903L224K747L202M315N231N519N402N145M744M296M250M957O095
53599C36414O876O849O382O218O648P272P625P743P920Q074P787P022O311O084
53585D35225O157O154O038N957N899N850N955O133N942N238M614M551M554L864
53571E12131K783K326K685K996K825K805L304L442K287M16o67l80M18P44N00J16
53555E38731k39o45j045j257j269j243j180q25j49L18j3q77j186l14R47J276M63
53538E31493l80l18L12N94L25J46O31J628K478K712K454K310K720L557M420N261
53522E60343O271P259P680P543P741R037J0993J2461J2993J3284J4177J5714J7356
53509G02852J8822K0264K1705K2744K3090K3217K3999K5639K7334K8228K8392
$$ y = [273384, 277287, 280511, 283258, 286460, 290775, 296006, 301525, 306927, 312072, 316816, 321112, 325362, 330319, 336414, 343290, 350139, 356521, 362739, 369387, 376659, 384284, 392027, 399947, 408021, 415808, 422830, 429141, 435225, 441382, 447536, 453574, 459531, 465430, 471280, 477235, 483368, 489310, 494548, 499162, 503713, 508267, 512131, 514914, 517240, 519925, 522921, 525746, 528551, 531855, 535297, 537584, 538000, 537333, 536953, 537371, 538115, 538615, 538731, 538492, 537847, 536802, 535545, 534276, 533033, 531853, 531028, 530879, 531197, 531184, 530307, 529121, 528807, 529754, 531030, 531493, 531113, 530795, 531107, 531701, 532026, 532172, 532803, 534431, 536909, 539621, 542075, 544385, 547105, 550662, 555082, 560343, 566614, 573873, 581553, 589096, 596837, 605874, 616867, 629328, 642321, 655605, 669782, 685496, 702852, 721674, 741938, 763643, 786387, 809477, 832694, 856693, 882332, 909666, 937894, 966286]
53498I66286K8491K8903K9639L0847L2639L4422L5209L4870L4407L4699L5502
53487A325914L6063L6165L5996L5532L4746L4102L4158L4760L5311L5730L6475
53476A714952L7465L7767L6711L4821L3116L1892L0673K9202K7777K6541K5052
53465B065969K2995K0858J9309J8024J5934J2872J0235R469J0291J1135J0961
53454B228052R833P784M365l36n075q680j1289j3780j6325j8443k0206k2447k5586
53441B107867k8948l1556l3077l3784l4030l4163l4641l5766l7305l8675l9431
53430A726491l9533l9185l8560l7584l5941l3438l0507k8058k6621k5740k4527
53419A366797k2717k0786j9104j7346j5004j2151r324o752m041p57K874O033Q167
$$ y = [966286, 994777, 1023680, 1053319, 1084166, 1116805, 1151227, 1186436, 1221306, 1255713, 1290412, 1325914, 1361977, 1398142, 1434138, 1469670, 1504416, 1538518, 1572676, 1607436, 1642747, 1678477, 1714952, 1752417, 1790184, 1826895, 1861716, 1894832, 1926724, 1957397, 1986599, 2014376, 2040917, 2065969, 2088964, 2109822, 2129131, 2147155, 2163089, 2175961, 2186196, 2195665, 2205956, 2217091, 2228052, 2237885, 2245669, 2250034, 2249698, 2244623, 2235943, 2224654, 2210874, 2194549, 2176106, 2155900, 2133453, 2107867, 2078919, 2047363, 2014286, 1980502, 1946472, 1912309, 1877668, 1841902, 1804597, 1765922, 1726491, 1686958, 1647773, 1609213, 1571629, 1535688, 1502250, 1471743, 1443685, 1417064, 1391324, 1366797, 1344080, 1323294, 1304190, 1286844, 1271840, 1259689, 1250365, 1243613, 1239572, 1238815, 1241689, 1247722, 1255889]
53406A255889R745J1937J5350J9200K2119K3768K5217K7455L0117L2215L3637
53395A506649L5159L7157L9217M1123M3302M5942M8488N0517N2448N4836N7527
53384B012365O0171O3061O6638P0482P3620P5697P7223P8772Q0537Q2554Q4600
53373B825720Q5971Q6015Q5020Q3991Q3420Q2857Q1651P9552P6494P2416O7551
53362C710658O2295N6758N0929M5338M0901L7769L4827L0705K4961J8136J1063
53351D124340M427j508o981j2436j8082k4091l1111l9971n0641o1953p2494q1320
53339C728179q7847r1736r3211r3009r1743q9795q7781q6362q5337q3728q1229
53328B756401p8784p7252p6255p4976p3374p1807p0020o7487o4417o1476n8687
$$ y = [1255889, 1265634, 1277571, 1292921, 1312121, 1334240, 1358008, 1383225, 1410680, 1440797, 1473012, 1506649, 1541808, 1578965, 1618182, 1659305, 1702607, 1748549, 1797037, 1847554, 1900002, 1954838, 2012365, 2072536, 2135597, 2202235, 2272717, 2346337, 2422034, 2499257, 2578029, 2658566, 2741120, 2825720, 2911691, 2997706, 3082726, 3166717, 3250137, 3332994, 3414645, 3494197, 3570691, 3643107, 3710658, 3772953, 3829711, 3880640, 3925978, 3966879, 4004648, 4039475, 4070180, 4095141, 4113277, 4124340, 4128767, 4127259, 4120278, 4107842, 4089760, 4065669, 4034558, 3994587, 3943946, 3881993, 3809499, 3728179, 3640332, 3548596, 3455385, 3362376, 3270633, 3180838, 3093057, 3006695, 2921358, 2837630, 2756401, 2677617, 2600365, 2524110, 2449134, 2375760, 2303953, 2233933, 2166446, 2102029, 2040553, 1981866]
53317A981866n5400n1310m6806m2288l7871l3811l0595k8352k6658k5043k3305
53306A580427k1260j8593j5248j1704q640o340m472k445k7K374M119M979N289
53293A508459N490N790O232O739P125P478Q467J0647J3500J5905J7746K0139K3673
53280A657390K7428L0407L3051L6218L9353M0866M0208L8530L7345L7306L8183
53269B056285L9207L9353L8104L6028L4057L2294L0197K7753K5549K3680K1555
53258B404062J8995J6676J5059J3567J1223P637L128j650n997r658j3234j7625
53246B442183k2761k7544l1236l4324l7578m0859m3432m4994m5878m6449m6890
53235B020238m7288m7507m7141m6034m4684m3656m2754m1245l8988l6834l5737
$$ y = [1981866, 1926466, 1875156, 1828350, 1786062, 1748191, 1714380, 1683785, 1655433, 1628775, 1603732, 1580427, 1559167, 1540574, 1525326, 1513622, 1504982, 1498642, 1494170, 1491725, 1491698, 1494072, 1498191, 1503170, 1508459, 1513949, 1519739, 1525971, 1532710, 1539835, 1547313, 1555780, 1566427, 1579927, 1595832, 1613578, 1633717, 1657390, 1684818, 1715225, 1748276, 1784494, 1823847, 1864713, 1904921, 1943451, 1980796, 2018102, 2056285, 2095492, 2134845, 2172949, 2208977, 2243034, 2275328, 2305525, 2333278, 2358827, 2382507, 2404062, 2423057, 2439733, 2454792, 2468359, 2479582, 2487219, 2490347, 2488697, 2482700, 2473042, 2459808, 2442183, 2419422, 2391878, 2360642, 2326318, 2288740, 2247881, 2204449, 2159455, 2113577, 2067128, 2020238, 1972950, 1925443, 1878302, 1832268, 1787584, 1743928, 1701174, 1659929, 1620941, 1584107, 1548370]
53224A548370l5783l6275l6588l6622l6500l6196l5608l4822l4007l3092l1802
53213A161075l0089k8169k6099k3713k1287j9692j9408j9759j9720j9275j9210
53202I14654j9727k0159k0163k0245k0711k0893k0053j8448j6917j5763j4777
53191G06798j4061j4027j4620j5205j5370j5325j5375j5465j5438j5374j5428
53180E41110j5531j5466j5106j4437j3575j2866j2716j3108j3357j2658j0879
53169C91411q691o961o211o404p036p335o856o019n783o506p393p401o484n537
53155B96794n194n181m919m310l633l053k482j903j487j447j781k192k251j826
53141B55135j334j307j708j901j438o29j60k73n04j49R26J985K159J663J791L236
$$ y = [1548370, 1512587, 1476312, 1439724, 1403102, 1366602, 1330406, 1294798, 1259976, 1225969, 1192877, 1161075, 1130986, 1102817, 1076718, 1053005, 1031718, 1012026, 992618, 972859, 953139, 933864, 914654, 894927, 874768, 854605, 834360, 813649, 792756, 772703, 754255, 737338, 721575, 706798, 692737, 678710, 664090, 648885, 633515, 618190, 602815, 587350, 571912, 556538, 541110, 525579, 510113, 495007, 480570, 466995, 454129, 441413, 428305, 414948, 402290, 391411, 382720, 375759, 369548, 363144, 356108, 348773, 341917, 335898, 330115, 323609, 316216, 308815, 302331, 296794, 291600, 286419, 281500, 277190, 273557, 270504, 268022, 266119, 264632, 263185, 261404, 259212, 256961, 255135, 253801, 252494, 250786, 248885, 247447, 246818, 246658, 246385, 245881, 245732, 246658, 248643, 250802, 252465, 254256, 257492]
53125B57492M822M853L485K624L295M353M331L330K253J154m50k277l547m240
53111B81478m947n635n713n241m990n176n169m683m307m535n030n240n045m545
53097B11222l783l077l019l699m399m425l883l331l015k750k227j269j01M86k54
53082A72476k023l482l570k549j510j201j558k056k213j941j614j585j640j236
53068A44298k86O95J286J453J108Q9j115j306O2J845K248Q34j093k078j936j486
53052A44618j307j196p60j22J87nk64j64J93M75N95N02j06j247k094j734m42N26
53034A37655N32K03K93P01R35Q74N70m6p44q21j4Q74R32L83J00J39k94j405k181
53015A38686j636j30J039J070K64o64j301j458r23K61J444J842J491J180J296
$$ y = [257492, 262314, 267167, 270652, 273276, 276571, 280924, 285255, 288585, 290838, 291992, 291542, 289265, 285718, 281478, 276531, 270896, 265183, 259942, 254952, 249776, 244607, 239924, 235617, 231082, 226052, 220812, 215767, 211222, 207439, 204362, 201343, 197644, 193245, 188820, 184937, 181606, 178591, 175841, 173614, 172345, 172244, 172730, 172476, 170453, 166971, 163401, 160852, 159342, 158141, 156583, 154527, 152314, 150373, 148759, 147174, 145534, 144298, 144012, 144707, 145993, 147446, 148554, 148643, 147528, 146222, 146284, 148129, 150377, 151211, 150118, 148040, 146104, 144618, 143311, 142115, 141355, 141233, 141420, 141415, 141151, 140987, 141180, 141655, 142250, 142752, 142646, 141399, 139305, 137571, 137129, 137655, 138187, 138390, 138683, 139384, 140319, 141193, 141763, 141717, 140973, 140152, 140138, 141012, 141944, 142327, 142427, 142566, 142272, 140867, 138686, 137050, 136920, 137959, 139029, 139293, 138629, 137328, 135870, 134947, 135208, 136652, 138494, 139985, 141165, 142461]
53000A42461J239M54n50q49m74k56m82n95k35K39M98P19J041J274J487K140L235
52983A51346M015M036L881M285N064N578N655N439M839L883L218L346L629K908
52969B11122J120n12r36k94N36P79J14j202k364k698k445k420k824l023k637k186
52953A90130k222k404k090j449j276j752k094j653p87k78k31r7L55P29P18O43
52937A76242Q77J142Q88K03k64k54k33n90r88q84l61Kl3q4K43P37Q10K61m18o02
52917A76694k72P7J81K64M34L68r6m82l11R6M3m62p32m57j04j93o99j228j279
52898A71842m30J171K513K548J404K05l35m23l39K6N81Q59P56P01P95O02R1j01
52880A82466J91K54k04k52Q22K087K105R48M7K69J116J744J904J790J630J562
$$ y = [142461, 143700, 144154, 143604, 142755, 142281, 142025, 141543, 140948, 140713, 140952, 141450, 142169, 143210, 144484, 145971, 148111, 151346, 155361, 159397, 163278, 167563, 172627, 178205, 183860, 189299, 194138, 198021, 201239, 204585, 208214, 211122, 212242, 211730, 210794, 210500, 211036, 211815, 211929, 210727, 208363, 205665, 203220, 200800, 197976, 194953, 192316, 190130, 187908, 185504, 183414, 181965, 180689, 178937, 176843, 175190, 174403, 174125, 173894, 173797, 174152, 174881, 175599, 176242, 177119, 178261, 179149, 179352, 179088, 178834, 178601, 178011, 177023, 176139, 175778, 175780, 175747, 175663, 175906, 176643, 177453, 177714, 177296, 176694, 176422, 176499, 176680, 176944, 177378, 177746, 177650, 177168, 176857, 176953, 176996, 176534, 175802, 175345, 175241, 175048, 174349, 173121, 171842, 171412, 172583, 175096, 177644, 179048, 179253, 178918, 178495, 178156, 178182, 178763, 179622, 180378, 181079, 181874, 182476, 182567, 182466, 182657, 182911, 182707, 182455, 183277, 185364, 187469, 188417, 188464, 188733, 189849, 191593, 193497, 195287, 196917, 198479]
52864A98479J574J570J637J965K362K341K023K256L379M523M723M149L519K951
52850B37451K266J796J910K117J667P34Pm88j166j768j689j246j414k261k872
52835B35044k855k803l049l181l061l241l875m255l942l478l393l308k670j696
52821A90237r44n67m98q62j553j950j632j032q98j379k088k651k786k276j349
52806A67772p49r17j405j536j325j241j362j331r96n91l65m06p59j351j825j762
52790A49851j176n37l39p46j503k080k068j617j293j351j414j072n56m24p62j134
52774A31779j238j240j357j452j237o83j79k45j078k215k752k159r47k47n83j318
52758A12849j564j379j559k249k505j601k19K78m61j540k162k378k495k504k426
$$ y = [198479, 200053, 201623, 203260, 205225, 207587, 209928, 211951, 214207, 217586, 222109, 226832, 230981, 234500, 237451, 239717, 241513, 243423, 245540, 247207, 247941, 247948, 247460, 246294, 244526, 242837, 241591, 240177, 237916, 235044, 232189, 229386, 226337, 223156, 220095, 216854, 212979, 208724, 204782, 201304, 197911, 194603, 191933, 190237, 189293, 188726, 188228, 187366, 185813, 183863, 182231, 181199, 180301, 178922, 176834, 174183, 171397, 169121, 167772, 167023, 166106, 164701, 163165, 161840, 160599, 159237, 157906, 156910, 156319, 155954, 155548, 154789, 153438, 151613, 149851, 148675, 148138, 147799, 147053, 145550, 143470, 141402, 139785, 138492, 137141, 135727, 134655, 134099, 133675, 132913, 131779, 130541, 129301, 127944, 126492, 125255, 124572, 124393, 124148, 123070, 120855, 118103, 115944, 114997, 114750, 114167, 112849, 111285, 109906, 108347, 106098, 103593, 101992, 101773, 102051, 101590, 100050, 97888, 95510, 93015, 90511, 88085]
52743H8085k458k399j651k45Q10Q07L04J43J53k59p86n87K99R43R19P17P30P66
52725H6291O96P90J174J639K108K584K642J792M91r3L99J067J157J040J366K021
52709A07164K539K896L257L427L141K603K222K117K204K354K140R00j340l420
52695A32204m130l533k772k702l171l487l178k331j487j228j637k236k520k386
52681I5406k035j743j741k004k078j552p58n23j039j598j635j471j604j800j479
52666G2346o87n0Q3l5lK17K88j13q48j276r52k81QMM59J395J672N59j017j505
52646G0264o38M63Q27N31J10k07n08p77p66k58N51J062R39O60R19J550J616P77
52628G7115k35p38r22j073q78j90L20J18j24M82J461J487L33q25j070p05m11k98
$$ y = [88085, 85627, 83228, 81577, 81332, 82142, 82949, 83253, 83396, 83549, 83290, 82504, 81917, 82216, 83159, 84078, 84795, 85525, 86291, 86987, 87777, 88951, 90590, 92698, 95282, 97924, 99716, 100207, 100114, 100513, 101580, 102737, 103777, 105143, 107164, 109703, 112599, 115856, 119283, 122424, 125027, 127249, 129366, 131570, 133924, 136064, 136964, 135624, 132204, 128074, 124541, 121769, 119067, 115896, 112409, 109231, 106900, 105413, 104185, 102548, 100312, 97792, 95406, 93371, 91628, 89887, 87883, 85805, 84253, 83495, 82972, 81933, 80335, 78700, 77229, 75625, 73825, 72346, 71659, 71609, 71692, 71657, 71654, 71871, 72159, 72046, 71198, 69922, 68970, 68689, 68697, 68701, 69160, 70555, 72227, 72786, 71769, 70264, 69626, 70089, 70916, 71447, 71557, 71350, 70842, 70065, 69299, 69041, 69592, 70654, 71593, 72253, 73172, 74722, 76338, 77115, 76880, 76142, 75220, 74147, 73269, 73079, 73399, 73517, 73393, 73875, 75336, 76823, 77156, 76331, 75261, 74556, 74145, 73847]
52610G3847j73L8L78R22J437J471R76L81qk77m45k89J87N38M13Nk19J8O83J459
52590H1342J835J490O74j8k33m4L83Q72J164J180J281J818K448K491J924J442
52574A00049J405J409J111Q46J082J729K354K715K703K162J110m7q32j072p97
52559A15927q4Q21J495J793J980K238K298J867J100L82q1j61L40J304K068K038
52543A35325J436R13N98Q1p04j161q03R3Q43J029O61M2l20N9J140K264K741K464
52525A46701J725P32l91j328j705j538j165p87l95j63l92q93r62l09L79K52n62
52508A39199j166j073o42l95m38o46r37j169j134q41m67M2R04J878K216J597O82
52491A37610K96M02M09K62N12J295J898J647Q72N39J006J595J386K84r18j398
$$ y = [73847, 73674, 73712, 74090, 75012, 76449, 77920, 78896, 79277, 79269, 78992, 78547, 78258, 78445, 78983, 79396, 79401, 79182, 79200, 79883, 81342, 83177, 84667, 85341, 85323, 85090, 85046, 85429, 86301, 87465, 88645, 89926, 91744, 94192, 96683, 98607, 100049, 101454, 102863, 103974, 104820, 105902, 107631, 109985, 112700, 115403, 117565, 118675, 118628, 117796, 116724, 115927, 115843, 116664, 118159, 119952, 121932, 124170, 126468, 128335, 129435, 129817, 129736, 129575, 129915, 131219, 133287, 135325, 136761, 137674, 138272, 138353, 137649, 136488, 135685, 135778, 136621, 137650, 138311, 138353, 138033, 138092, 139232, 141496, 144237, 146701, 148426, 149158, 148767, 147439, 145734, 144196, 143031, 142244, 141849, 141686, 141294, 140401, 139439, 139130, 139509, 139761, 139199, 138033, 136960, 136318, 135923, 135485, 134839, 133902, 132733, 131599, 130758, 130291, 130333, 131237, 133115, 135331, 136928, 137610, 137906, 138308, 138717, 138979, 139491, 140786, 142684, 144331, 145203, 145742, 146748, 148343, 149729, 150013, 149095, 147697]
52475A47697r84o8Q33J255R05J0o70n48J15O50R57J470K158K312J667J002J157
52458A59918J816J952J236M09K91Q53J427J503J186J012J302J792J992J848J722
52443A80259J709J457P84J7n19r31j372j718j898k180k723l227l410l356l066
52428A59826k247j081n53j235k292k544k046j670j522j025m00o28j754k459j843
52413A36527o31J4Lq2j38n13j198j803k055j826j044M9Q00Q27M95L58M18M12M38
52394A31051P16J006R01N91O91J346K041K358K400K333K038J487J098J327K052
52379A53436K645K643K148J597J224R00M54N1J13P79J624K122K310K732L588M255
52363A82621L939K727J637J489K039K530K740L018L384L324K661K090K319L056
$$ y = [147697, 146713, 146645, 147478, 148733, 149638, 149648, 148978, 148430, 148545, 149195, 150152, 151622, 153780, 156092, 157759, 158761, 159918, 161734, 163686, 164922, 165331, 165622, 166475, 167902, 169405, 170591, 171603, 172905, 174697, 176689, 178537, 180259, 181968, 183425, 184209, 184226, 183707, 182776, 181404, 179686, 177788, 175608, 172885, 169658, 166248, 162892, 159826, 157579, 156498, 155945, 154710, 152418, 149874, 147828, 146158, 144636, 143611, 143211, 142583, 140829, 138370, 136527, 135896, 135910, 135913, 135831, 135693, 135180, 133982, 132179, 130124, 128298, 127254, 127303, 128103, 128930, 129425, 129783, 130201, 130613, 131051, 131767, 132773, 133674, 134265, 134956, 136302, 138343, 140701, 143101, 145434, 147472, 148959, 150057, 151384, 153436, 156081, 158724, 160872, 162469, 163693, 164593, 165047, 165098, 165211, 165990, 167614, 169736, 172046, 174778, 178366, 182621, 186560, 189287, 190924, 192413, 194452, 196982, 199722, 202740, 206124, 209448, 212109, 214199, 216518, 219574]
52349B19574L439L178K732K436K184J974K140K679K958K475J644J322J736K248
52335B52719K182J546R09P85J221J823K159K152K090K229K441K367J913J460J473
52320B79469J958K393K330J925J748K167L023L948M639M896M761M685N232O354
52306C29528P319P628P671Q117R047J0070J0960J1676J2035J2013J2141J2903
52294D51108J3859J4147J3814J3871J4808J5931J6496J6747J7181J7482J7009
52283F22453J6063J5753J6491J7354J7269J6326J5396J4724J3572J1552R620R041
52271G95614R536R449Q000O446O265O982O879N476L982L257K691J489nj020j511
52256H63530j851k028j904j818k115k418k140j424q64m99J61J215K199K883L520
$$ y = [219574, 223013, 226191, 228923, 231359, 233543, 235517, 237657, 240336, 243294, 245769, 247413, 248735, 250471, 252719, 254901, 256447, 257356, 258141, 259362, 261185, 263344, 265496, 267586, 269815, 272256, 274623, 276536, 277996, 279469, 281427, 283820, 286150, 288075, 289823, 291990, 295013, 298961, 303600, 308496, 313257, 317942, 323174, 329528, 336847, 344475, 352146, 360263, 369310, 379380, 390340, 402016, 414051, 426064, 438205, 451108, 464967, 479114, 492928, 506799, 521607, 537538, 554034, 570781, 587962, 605444, 622453, 638516, 654269, 670760, 688114, 705383, 721709, 737105, 751829, 765401, 776953, 786573, 795614, 805150, 814599, 822599, 829045, 835310, 842292, 849171, 854647, 858629, 861886, 864577, 866066, 866061, 865041, 863530, 861679, 859651, 857747, 855929, 853814, 851396, 849256, 847832, 846968, 846469, 846630, 847845, 850044, 852927, 856447]
52241H56447M216M729N099N879P379R102J0324J0907J1186J1285J0988J0228R400
52228I67169R047R359J0029J0529J0511R949R007P853O624N491M623M045L532
52215A067768K708J348l77k024l317m388n449o380o934p254p781q621r353r665
52201A000281r841j0258j0727j0651r797q531p411o759o614o818p019o831o100
52188H92924n005l845k784j842j071o82q35j330j722j831j986k450k877k711j983
52173H59970j231o42P9Q50R49J2j250j885j905k055k681l425l971m401m757m805
52157H28852m498m220m235m295m040l603l384l385l187k690k442k905l597l477
52143G78894k270r84q37j876l063l506l238k866k864l297l848m002l492k635k002
$$ y = [856447, 860663, 865392, 870491, 876370, 883749, 892851, 903175, 914082, 925268, 936553, 947541, 957769, 967169, 976216, 985575, 995604, 1006133, 1016644, 1026593, 1035600, 1043453, 1050077, 1055568, 1060191, 1064236, 1067768, 1070476, 1071824, 1071447, 1069423, 1066106, 1061718, 1056269, 1049889, 1042955, 1035701, 1027920, 1019299, 1009946, 1000281, 990440, 980182, 969455, 958804, 949007, 940476, 933065, 926306, 919692, 912874, 905855, 899024, 892924, 887919, 884074, 881290, 879448, 878377, 877695, 876860, 875530, 873808, 871977, 869991, 867541, 864664, 861953, 859970, 858739, 858097, 858176, 859026, 859975, 859987, 858737, 856852, 854947, 852892, 850211, 846786, 842815, 838414, 833657, 828852, 824354, 820134, 815899, 811604, 807564, 803961, 800577, 797192, 794005, 791315, 788873, 785968, 782371, 778894, 776624, 775640, 774803, 772927, 769864, 766358, 763120, 760254, 757390, 754093, 750245, 746243, 742751, 740116, 738114]
52128G38114j788j838k164k891l686l849l282k761k890l309l324k861k298j753
52114F99420j120n27j46K18Q40J481J661J435J367J790K557L512M644N746O475
52099G29353O941P789R381J1256J2671J3478J4199J5372J6991J8558J9561J9862
52087H95412J9699J9381J9074J8838J8634J8228J7423J6423J5758J5572J5341
52076A089783J4532J3246J1846J0331Q501O504M674K989J293j71j026j554k513
52063A158435m126n783o920p601q105q461q676q882q982q590p648o755o480o667
52049A054759o711o271n411m362l408k758k144r11J139L221M254M028L285K874
52035A041584L165M054N115N738N652N288N277N653N901N820N740N830N666M827
$$ y = [738114, 736326, 734488, 732324, 729433, 725747, 721898, 718616, 715855, 712965, 709656, 706332, 703471, 701173, 699420, 698300, 697773, 697627, 697845, 698685, 700166, 701827, 703262, 704629, 706419, 708976, 712488, 717132, 722878, 729353, 736294, 744083, 753464, 764720, 777391, 790869, 805068, 820440, 837431, 855989, 875550, 895412, 915111, 934492, 953566, 972404, 991038, 1009266, 1026689, 1043112, 1058870, 1074442, 1089783, 1104315, 1117561, 1129407, 1139738, 1148239, 1154743, 1159417, 1162406, 1163699, 1163528, 1162502, 1160948, 1158435, 1154309, 1148526, 1141606, 1134005, 1125900, 1117439, 1108763, 1099881, 1090899, 1082309, 1074661, 1067906, 1061426, 1054759, 1048048, 1041777, 1036366, 1032004, 1028596, 1025838, 1023694, 1022783, 1023922, 1027143, 1031397, 1035425, 1038710, 1041584, 1044749, 1048803, 1053918, 1059656, 1065308, 1070596, 1075873, 1081526, 1087427, 1093247, 1098987, 1104817, 1110483, 1115310]
52021A115310L547K425J718J197N63k79j257k214l013l760m744o023p256q203
52007A088011r193j0685j2474j3838j4516j5128j6352j8018j9270j9558j9225
51996I19754j9200k0137k1765k3056k3211k2404k1396k0550j9702j8947j8822
51985F90564j9377j9751j9219j8214j7668j7685j7675j7458j7415j7486j6997
51974D91619j5635j3935j2476j1295j0376j0018j0230j0329r736q753q010p468
51962C63358o579n229l981l373l438l826m110m084l969m183m596m411l222j873
51948C06484j574k306k832k370j495j108j162r81m49k06o64j384j590j045k32
51933B87086J47l07j506k862l552l177k296j975k573l277l187k523k183k382k458
$$ y = [1115310, 1118857, 1121282, 1123000, 1124197, 1124760, 1124481, 1123224, 1121010, 1117997, 1114237, 1109493, 1103470, 1096214, 1088011, 1078818, 1068133, 1055659, 1041821, 1027305, 1012177, 995825, 977807, 958537, 938979, 919754, 900554, 880417, 858652, 835596, 812385, 789981, 768585, 748035, 728333, 709386, 690564, 671187, 651436, 632217, 614003, 596335, 578650, 560975, 543517, 526102, 508616, 491619, 475984, 462049, 449573, 438278, 427902, 417884, 407654, 397325, 387589, 378836, 370826, 363358, 356779, 351550, 347569, 344196, 340758, 336932, 332822, 328738, 324769, 320586, 315990, 311579, 308357, 306484, 304910, 302604, 299772, 297402, 295907, 294799, 293637, 292656, 292207, 292001, 291337, 289953, 288363, 287318, 287086, 287233, 286926, 285420, 282558, 279006, 275829, 273533, 271558, 268985, 265708, 262521, 259998, 257815, 255433, 252975]
51918B52975k007j449j218j172j165j508k245k616j929n91L89O43N22K00m80j330
51902B37019j718j349n86R0M69M29j34r38j356j076m54p9j30k62l4N74R55M26
51884B31846q67j826j588n40L27P62J255J858J928J228N40O83J423J814J320K63
51868B40426o11o91P4J087J599J528J528K022K510K219J230N35Q94K020K944L060
51852B62374K599K130J861J555J161J111J825L035L877L669K436P83n19j025r83
51837B85889j137j910k797k916k105j074n21m92o55p44n80q0N54R35R57R03R77
51820B75204J066J138J516K410L352L479K483J055K92O40J401J447M28q34j350
51805B93727j076p94j006j447j654j594j566j769k079k063j272K19J618K165J939
$$ y = [252975, 250968, 249519, 248301, 247129, 245964, 244456, 242211, 239595, 237666, 237075, 237464, 238107, 238629, 238829, 238349, 237019, 235301, 233952, 233366, 233456, 233925, 234354, 234220, 233282, 231926, 230850, 230396, 230317, 230187, 229925, 229891, 230465, 231420, 231846, 230979, 229153, 227565, 227025, 227352, 228114, 229369, 231227, 233155, 234383, 234923, 235606, 237029, 238843, 240163, 240426, 239815, 239124, 239198, 240285, 241884, 243412, 244940, 246962, 249472, 251691, 252921, 253456, 254350, 256370, 259314, 262374, 264973, 267103, 268964, 270519, 271680, 272791, 274616, 277651, 281528, 285197, 287633, 288416, 287897, 286872, 285889, 284752, 282842, 280045, 277129, 275024, 273950, 273429, 272937, 272282, 271538, 270958, 270878, 271432, 272367, 273324, 274227, 275204, 276270, 277408, 278924, 281334, 284686, 288165, 290648, 291703, 291995, 292635, 294036, 295483, 295911, 295077, 293727, 292651, 291857, 290851, 289404, 287750, 286156, 284590, 282821, 280742, 278679, 277407, 277626, 279244, 281409, 283348]
51790B83348J635J500J133L95j56m9L45L20k51r50j518j996k261j944j015j00
51774B78436J32j93k26N02J354J304K85p20j000q93r16q52l38J76Qn64o39q4L84
51755B76156N15Q32J414J474O90j4L56J535K540K862K535J584J57j231k171k840
51739B86394l425l532k791j675j018r38q84n52j50J29K96L14J75J52M69Q29P03
51722B74496Oq46j456j653j522j550k381l833m653l905k348j574k020k772l150
51707B40839l438l862l926l221k107j162m98j01j83p66j394j705j794j661r20
51692B14101L57J144O19n20p63L67J999L292M270N077N453N389N549O393P238
51677B59965O948N350L370J895J177J230K071L256L836L360K517K292K657K684
$$ y = [283348, 284983, 286483, 287616, 288011, 287855, 287806, 288151, 288471, 288220, 287270, 285752, 283756, 281495, 279551, 278536, 278436, 278568, 278375, 278149, 278651, 280005, 281309, 281594, 280874, 279874, 278981, 278065, 277213, 276875, 277051, 277059, 276495, 275856, 275772, 276156, 276671, 277503, 278917, 280391, 281081, 281067, 281423, 282958, 285498, 288360, 290895, 292479, 292636, 291405, 289234, 286394, 282969, 279437, 276646, 274971, 273953, 273015, 272131, 271579, 271429, 271558, 271854, 272168, 272343, 272495, 272964, 273793, 274496, 274502, 273656, 272200, 270547, 269025, 267475, 265094, 261261, 256608, 252703, 250355, 248781, 246761, 243989, 240839, 237401, 233539, 229613, 226392, 224285, 223123, 222625, 222524, 222341, 221575, 220181, 218476, 216682, 215021, 214101, 214458, 215602, 216221, 215701, 214938, 215305, 217304, 220596, 224866, 229943, 235396, 240785, 246334, 252727, 259965, 266913, 272263, 275633, 277528, 278705, 279935, 282006, 285262, 289098, 292458, 294975, 297267, 299924, 302608]
51663C02608J889Q21K60J61k46j528l385m916n499n479n760o624p333p153o451
51648B51365o093o059n454l995k537j848j673j483j437j875k407k387j966j887
51634B10264k317k619k298j576r54o30n53o28p21p00n22j62L36O00O5j154j900
51617A94531j165N19J603J443R41J150J994K682K778K345J509M80k87m18j18J21
51601B10108J89M40J093J854K292K428K659L160L524L319K873L096M329N766O444
51586B53574O446O575P138P793Q456R499J0785J1359J0520Q745P044N821M731
51573C58486L344J542m19j973k695k966l670m905n572m803l243k158j736j165
51559C28067j19Q97J649K568L797M800N271N657O331O989P376P907Q868R535Q905
$$ y = [302608, 304497, 305318, 305578, 305739, 305493, 303965, 300580, 295664, 290165, 284686, 278926, 272302, 264969, 257816, 251365, 245272, 239213, 233759, 229764, 227227, 225379, 223706, 222223, 220786, 218911, 216504, 214117, 212151, 210264, 207947, 205328, 203030, 201454, 200500, 199870, 199317, 198689, 197968, 197268, 196746, 196584, 196920, 197520, 197585, 196431, 194531, 193366, 193885, 195488, 196931, 197872, 199022, 201016, 203698, 206476, 208821, 210330, 210810, 210523, 210105, 209987, 210108, 210297, 210737, 211830, 213684, 215976, 218404, 221063, 224223, 227747, 231066, 233939, 237035, 241364, 247130, 253574, 260020, 266595, 273733, 281526, 289982, 299481, 310266, 321625, 332145, 340890, 347934, 353755, 358486, 361830, 363372, 362953, 360980, 358285, 355319, 351649, 346744, 341172, 336369, 333126, 330968, 329232, 328067, 327948, 328845, 330494, 333062, 336859, 341659, 346930, 352587, 358918, 365907, 373283, 381190, 390058, 399593, 408498]
51544D08498P035M955L363K089P96m61j427j976k102j919j654j371q42k9N77N85
51528D16117M55R23J799K097J489P28M04P6q44k014k710k988l587m889o471p643
51512C92942p990p482o538n863n841o137o121n603m902m399m324m730n292n392
51498C12328m750l827l195k798k257j637j322j283j174j081j517k533l385l314
51484B78255k227o16Q18J445J191P88J063J868K222J661Q90R19J978L523M819
51469B98597N341N042M565M746N715O759P253P336P488P883Q312Q493Q176P314
51455C93020O231N284M317K925J339L58K03J42l61q43o94k12j16m27n51k67m6
51438D10302l96j398k780m159n282o209p171q153q891r365r784j0031r619q558
$$ y = [408498, 415533, 420488, 423851, 425940, 426736, 426275, 424848, 422872, 420770, 418851, 417197, 415826, 414984, 414955, 415532, 416117, 416572, 417495, 419294, 421391, 422880, 423608, 424012, 424088, 423244, 421230, 418520, 415532, 411945, 407056, 400585, 392942, 384952, 377470, 370932, 365069, 359228, 353091, 346970, 341367, 336465, 332066, 327742, 323012, 317720, 312328, 307578, 303751, 300556, 297758, 295501, 293864, 292542, 291259, 290085, 289004, 287487, 284954, 281569, 278255, 276028, 275412, 276230, 277675, 278866, 279654, 280717, 282585, 284807, 286468, 287358, 288277, 290255, 293778, 298597, 303938, 308980, 313545, 318291, 324006, 330765, 338018, 345354, 352842, 360725, 369037, 377530, 385706, 393020, 399251, 404535, 408852, 411777, 413116, 413474, 413677, 413819, 413458, 412615, 411921, 411709, 411593, 411166, 410615, 410348, 410302, 409906, 408508, 405728, 401569, 396287, 390078, 382907, 374754, 365863, 356498, 346714, 336683, 327064, 318506]
51424C18506p567p069o554n470m177l398l159k948k561k125j620r74l39L10J434
51409B72289L174M740N335N342N717O523P047P178P555Q228Q217O729M078J056
51395C53208j899m601o857q687j0313j1588j1937j1228j0219r704r503q831p515
51382B40326o333o051o442o613o144n572n503n604n105m147l777m360m835m172
51368A65668k853k110k159k175j728j257j099j053j010j189j563j661j275p03
51354A43833j86L94J024J338J203J028J205J550J552R81Q9o05p26l71M2M06J051
51337A53808J970K453K074J582J983L004L435K930K400K548K967L046K961L293
51323A90454M234N526O767P590P948Q197Q464Q111O578M501L079K324J150p32
$$ y = [318506, 310939, 303870, 297316, 291846, 287669, 284271, 281112, 278164, 275603, 273478, 271858, 270884, 270545, 270855, 272289, 275463, 280203, 285538, 290880, 296597, 303120, 310167, 317345, 324900, 333128, 341345, 348074, 352152, 353208, 351309, 346708, 339851, 331164, 320851, 309263, 297326, 286098, 275879, 266175, 256672, 247841, 240326, 233993, 227942, 221500, 214887, 208743, 203171, 197668, 192064, 186959, 182812, 179035, 174675, 169840, 165668, 162815, 160705, 158546, 156371, 154643, 153386, 152287, 151234, 150224, 149035, 147472, 145811, 144536, 143833, 143647, 144041, 145065, 146403, 147606, 148634, 149839, 151389, 152941, 153922, 154011, 153406, 152680, 152309, 152351, 152757, 153808, 155778, 158231, 160305, 161887, 163870, 166874, 170309, 173239, 175639, 178187, 181154, 184200, 187161, 190454, 194688, 200214, 206981, 214571, 222519, 230716, 239180, 247291, 253869, 258370, 261449, 263773, 264923, 264191]
51309B64191k311l038l793n355p057p917q102q244q138p262o064n500n614n635
51295A80161n287m981m755m056k752j549j078j195j371j335j136q92p39p09o38
51280A47688l56M0K74K27kk94n55o98p35p93q98q94p05m85l47j96j9r3n70j146
51260A39443j376j171o68Q7R58J429J016J7o13l28L14L12n49j462j731j729k272
51243A31677l155l123j630J04N05l84j195j127o13j51L53Q96J018N24j44n78p57
51226A22220n19M46J771K426K062J486J323J136N00MK88Q40P90L28K86P30R81
51209A37098P98N89N63N20M76O47Q41O15K2m15n53p54j100j112m65N02J159J155
51191A40586O03m5k96n0L21N04O51J042J561J863J766J257L75n48r40o08n5K68
$$ y = [264191, 261880, 258842, 255049, 249694, 242637, 234720, 226618, 218374, 210236, 202974, 196910, 191410, 185796, 180161, 174874, 169893, 165138, 161082, 158330, 156781, 155703, 154508, 153137, 151802, 150666, 149774, 149035, 148326, 147688, 147332, 147372, 147646, 147873, 147871, 147577, 147022, 146324, 145589, 144796, 143898, 143004, 142299, 141814, 141467, 141271, 141252, 141159, 140589, 139443, 138067, 136896, 136228, 136315, 137273, 138702, 139718, 139735, 139122, 138794, 139108, 139420, 138871, 137409, 135678, 133949, 131677, 128522, 125399, 123769, 123873, 124378, 123994, 122799, 121672, 121059, 120908, 121261, 122157, 123175, 123699, 123555, 122977, 122220, 121701, 122147, 123918, 126344, 128406, 129892, 131215, 132351, 132851, 132855, 133143, 133983, 134773, 135101, 135387, 136117, 137098, 137896, 138485, 139048, 139568, 140044, 140691, 141532, 142147, 142169, 141754, 141201, 140447, 139347, 138235, 137770, 138272, 139431, 140586, 141189, 141144, 140848, 140798, 141119, 141623, 142274, 143316, 144877, 146740, 148506, 149763, 150138, 149590, 148650, 148042, 147987, 148255]
51173A48255N57J088J487J218M80j14m34p51r86p50j47J86j72j078k097k708k461
51156A41573j448n72o68j548k272k307j861j298p92m47k52K1M41O61M99M03Q01
51139A30934J338J451J396J921L047L948M000L291K247J331Q85P10M5j337k465
51124A52742k450j916k070k749k718j772j090j319j787j915k041k289j976q60
51110A25790J20K17k0J35L09q6n34j26Q78J418J206R43J048J203J167J137J139
51093A35944Q38J99j54L18J313J954J731R68M41O06J205J637J630J428J354J365
51077A52777J144M99m09j151j368j153r28q12l85O22J689K044J698J318J184R63
51061A57732N30K90M56O98P68Q91J206J437J448J556J918K102J826J535J694J945
$$ y = [148255, 148812, 149900, 151387, 152605, 153085, 152971, 152537, 151786, 150800, 150050, 149903, 150089, 149917, 148839, 146742, 144034, 141573, 140125, 139553, 138885, 137337, 135065, 132758, 130897, 129599, 128807, 128360, 128108, 128129, 128570, 129231, 129730, 130133, 130934, 132272, 133723, 135119, 137040, 140087, 144035, 148035, 151326, 153573, 154904, 155789, 156499, 156544, 155207, 152742, 150292, 148376, 146306, 143557, 140839, 139067, 137977, 136658, 134871, 132956, 130915, 128626, 126650, 125790, 125910, 126127, 126107, 126242, 126551, 126465, 125931, 125805, 126683, 128101, 129307, 130250, 131298, 132501, 133668, 134805, 135944, 136782, 136981, 136827, 137145, 138458, 140412, 142143, 143111, 143552, 144158, 145363, 147000, 148630, 150058, 151412, 152777, 153921, 154420, 154011, 152860, 151492, 150339, 149411, 148599, 148214, 148836, 150525, 152569, 154267, 155585, 156769, 157732, 158262, 158552, 159008, 159706, 160474, 161365, 162571, 164008, 165456, 167012, 168930, 171032, 172858, 174393, 176087, 178032]
51045A78032J640Q68K70K8k35o10p14m78m55j007j692j809j283o25j27L99J036
51028A73238J404J165N85K29K32L34N82J280K191K435J622M77j03q7J67P15J570
51011A88036K017J488P73J153K441L187K919K761L419L912L127J594P50J138K245
50996B20960L530M672N271N196N037N417O015O040N535N404O140P265Q193Q999
50982C03674J0046J1281J2323J3085J4026J5629J7808J9956K1659K3159K4999
50971D87645K7463L0572L4353L8571M2446M5292M7444M9882N2890N5738N7829
50960I70125N9368O0644O1351O1007N9367N6126N0947M4291L7443L1162K4912
50949A516743J8132J1470N922J300l362q089j1697j3310j3337j2795j2254j1624
$$ y = [178032, 179672, 180540, 180810, 180838, 180603, 179993, 179279, 178801, 178346, 177339, 175647, 173838, 172555, 171930, 171803, 172202, 173238, 174642, 175807, 176392, 176621, 176853, 177187, 177769, 179049, 181240, 183675, 185297, 185774, 185671, 185584, 185751, 186466, 188036, 190053, 191541, 192314, 193467, 195908, 199095, 202014, 204775, 208194, 212106, 215233, 216827, 217577, 218715, 220960, 224490, 229162, 234433, 239629, 244666, 250083, 256098, 262138, 267673, 273077, 279217, 286482, 294675, 303674, 313720, 325001, 337324, 350409, 364435, 380064, 397872, 417828, 439487, 462646, 487645, 515108, 545680, 580033, 618604, 661050, 706342, 753786, 803668, 856558, 912296, 970125, 1029493, 1090137, 1151488, 1212495, 1271862, 1327988, 1378935, 1423226, 1460669, 1491831, 1516743, 1534875, 1546345, 1552267, 1553567, 1550205, 1542116, 1530419, 1517109, 1503772, 1490977, 1478723, 1467099]
50937A467099j0606r200p898p365p880r361j1969j6035k1089k5700k9034l2003
50925A278959l6015m0871m4927m7220m8453m9702n0927n1210m9902m7193m3781
50914G68758m0220l6513l2361k7957k4261k2079k1046j9933j7920j5189j2425
50903D98854j0196q766p912o892n058k657o94J33M1k74m26n11p49j095j191p35
50887D51872J57J071J791K430L006L330L437L750M493N323N866O270O862P716
50873E07374Q785J0103J1462J2354J2713J3231J4435J5988J7445J9117K1421K3976
50861F88404K6219K8531L1711L5644L9585M3613M8635N4927O1728O8502P5623
50850A203122Q3513R1979J00655J09312J17434J24282J29676J34030J37379J38969
$$ y = [1467099, 1456493, 1447293, 1439395, 1432030, 1424150, 1414789, 1402820, 1386785, 1365696, 1339996, 1310962, 1278959, 1242944, 1202073, 1157146, 1109926, 1061473, 1011771, 960844, 909634, 859732, 812539, 768758, 728538, 692025, 659664, 631707, 607446, 585367, 564321, 544388, 526468, 511279, 498854, 488658, 479892, 471980, 465088, 460030, 457373, 456679, 456812, 456853, 456579, 456153, 455642, 454893, 453798, 452607, 451872, 452029, 453100, 454891, 457321, 460327, 463657, 467094, 470844, 475337, 480660, 486526, 492796, 499658, 507374, 516159, 526262, 537724, 550078, 562791, 576022, 590457, 606445, 623890, 643007, 664428, 688404, 714623, 743154, 774865, 810509, 850094, 893707, 942342, 997269, 1058997, 1127499, 1203122, 1286635, 1378614, 1479269, 1588581, 1706015, 1830297, 1959973, 2094003, 2231382, 2370351]
50840B370351J38105J34518J27755J17065J02490Q5385O7311M8954L0521J2547
50830C235002m152j8897l0929l9350m3674m4225m1615l6363k9275k1534j3987
50819B911001o942j105J967J004l887j1839k2296l4787m8222o1380p3903q5919
50807B563692r6894j05686j11649j14969j15894j14342j10348j04270r6472q7262
50797A505906p7141o6599n5741m4689l4204k5143j7211r011L49J0228J9321K7015
50785A233080L3542L9229M3954M7165M8163M6663M3170L8570L3225K6863J9507
50774A653131J1880M633k238q736j4198j8020k0738k3631k7294l1236l4820l7939
50762A450794m0639m2691m3860m4099m3282m1125l7646l3353k8746k4011j9347
$$ y = [2370351, 2508456, 2642974, 2770729, 2887794, 2990284, 3075669, 3142980, 3191934, 3222455, 3235002, 3230850, 3211953, 3181024, 3141674, 3098000, 3053775, 3012160, 2975797, 2946522, 2924988, 2911001, 2904059, 2902954, 2904921, 2905925, 2902038, 2890199, 2867903, 2833116, 2784894, 2723514, 2649611, 2563692, 2466798, 2361112, 2249463, 2134494, 2018600, 1904258, 1793910, 1689640, 1593168, 1505906, 1428765, 1362166, 1306425, 1261736, 1227532, 1202389, 1185178, 1176167, 1176516, 1186744, 1206065, 1233080, 1266622, 1305851, 1349805, 1396970, 1445133, 1491796, 1534966, 1573536, 1606761, 1633624, 1653131, 1665011, 1669644, 1667406, 1658670, 1644472, 1626452, 1605714, 1582083, 1554789, 1523553, 1488733, 1450794, 1410155, 1367464, 1323604, 1279505, 1236223, 1195098, 1157452, 1124099, 1095353, 1071342, 1051995]
50751A051995j5097j1291p535l748m95J904M067O726R643J2219J4790J8348K3003
50738A104529K7854L2520L7766M4196N1240N8103O4865P1882P8743Q4666Q9473
50727A745837R3223R5241R4544R1196Q6212P9973P1663O0662M7662L3882J9743
50716B519838N003j0055k4351l6841m7029n4442n8118n7298n2517m5609l8268
50705B100313l0938k3339j5754r236m601j886r91k299o220j2543k0579k9641l9029
50692A903257m7836n5224o0757o4162o5071o3466o0092n5866n0895m4514l6316
50681A299058k6739j6772p380R08Q255J5423K3202L1944M1679N2286O3297P4044
50669A559205Q4436R5067J05953J15558J21838J23952J22238J16945J08063R6314
$$ y = [1051995, 1036898, 1025607, 1018072, 1014324, 1013829, 1015733, 1019800, 1026526, 1036169, 1048388, 1063178, 1081526, 1104529, 1132383, 1164903, 1202669, 1246865, 1298105, 1356208, 1421073, 1492955, 1571698, 1656364, 1745837, 1839060, 1934301, 2028845, 2120041, 2206253, 2286226, 2357889, 2418551, 2466213, 2500095, 2519838, 2524841, 2514786, 2490435, 2453594, 2406565, 2352123, 2294005, 2236707, 2184190, 2138581, 2100313, 2069375, 2046036, 2030282, 2021046, 2016445, 2014559, 2013568, 2011269, 2005049, 1992506, 1971927, 1942286, 1903257, 1855421, 1800197, 1739440, 1675278, 1610207, 1546741, 1486649, 1430783, 1379888, 1335374, 1299058, 1272319, 1255547, 1248167, 1249075, 1257330, 1272753, 1295955, 1327899, 1369578, 1421864, 1485161, 1559205, 1643641, 1738708, 1844661, 1960219, 2082057, 2206009, 2328247, 2445192, 2553255, 2649569]
50659B649569Q3191O9780N6465M3848L2858K3597J5068O550j563q855j5984k3858
50647B930666l2312m0328m7234n2955n7343n9954o0405n8532n4341m8207m0973
50636B378082l3436k5844j8129j0564l869J139L936M559L699K204L28k272n679
50623B294154r289j2424j4834j6241j5964j3589r706n381j058L511Q484J3545
50611B221208J8247K2214K4959K5836K4323K0380J4711Q675L422j129o124j2364
50599B364358j9555k7229l5688m5294n5277o4217p1434p7117q1177q2961q2303
50588A722106q0045p7030p3290o8598o3342n8310n3763m9218m4121l8500l2967
50577A082922k8176k4270k0768j7154j3392r761o230k465J504N043P589R405J1385
$$ y = [2649569, 2732760, 2802540, 2859005, 2902853, 2935711, 2959308, 2974376, 2980926, 2979363, 2970508, 2954524, 2930666, 2898354, 2858026, 2810792, 2757837, 2700494, 2640540, 2580135, 2521603, 2467262, 2419055, 2378082, 2344646, 2318802, 2300673, 2290109, 2286240, 2287379, 2291315, 2295874, 2299573, 2301777, 2302105, 2299833, 2294154, 2284865, 2272441, 2257607, 2241366, 2225402, 2211813, 2202107, 2196726, 2195668, 2199179, 2207663, 2221208, 2239455, 2261669, 2286628, 2312464, 2336787, 2357167, 2371878, 2380553, 2383975, 2382846, 2376722, 2364358, 2344803, 2317574, 2281886, 2236592, 2181315, 2117098, 2045664, 1968547, 1887370, 1804409, 1722106, 1642061, 1565031, 1491741, 1423143, 1359801, 1301491, 1247728, 1198510, 1154389, 1115889, 1082922, 1054746, 1030476, 1009708, 992554, 979162, 969401, 963171, 960706, 962210, 967253, 974842, 984247, 995632]
50564I95632J4196J7786K1608K5262K8847L2743L7058M1434M5555M9704N4529
50553A364354O0266O6524P2903P9405Q6010R2187R7163J00451J01810J00834R7078
50542B318985R0628Q2192P2594O2531N2953M5050L9421L5416L1877K8422K5504
50531B885573K3228K0806J7533J3895J1190J0302J1227J3710J7743K3280K9714
50520C078201L5921M0888M4357M6752M8311M8322M5595L9814L1918K2798J2178
50509C495055n29j4746k8924m2144n4642o6650p7534q6374r2642r5921r5595r1349
50497B748005q3625p3209o0738m6816l2180j7477l353R108J8760K5637L0988L5362
50485B550462L7338L5016K8190J8021N021j1278l0565n0850o9759q5864r8539
$$ y = [995632, 1009828, 1027614, 1049222, 1074484, 1103331, 1136074, 1173132, 1214566, 1260121, 1309825, 1364354, 1424620, 1491144, 1564047, 1643452, 1729462, 1821649, 1918812, 2019263, 2121073, 2221907, 2318985, 2409613, 2491805, 2564399, 2626930, 2679883, 2724933, 2764354, 2799770, 2831647, 2860069, 2885573, 2908801, 2929607, 2947140, 2961035, 2972225, 2982527, 2993754, 3007464, 3025207, 3048487, 3078201, 3114122, 3155010, 3199367, 3246119, 3294430, 3342752, 3388347, 3428161, 3460079, 3482877, 3495055, 3494526, 3479780, 3450856, 3408712, 3354070, 3287420, 3209886, 3123512, 3030870, 2934949, 2839354, 2748005, 2664380, 2591171, 2530433, 2483617, 2451437, 2433960, 2430607, 2439715, 2458475, 2484112, 2515100, 2550462, 2587800, 2622816, 2651006, 2669027, 2674048, 2662770, 2632205, 2581355, 2511596, 2425732, 2327193]
50474B327193j07425j12690j15036j14779j11435j04838r6261q7665q0012p2977
50464A324075o6018n9125n2487m6149m0226l4888k9972k5076k0220j5949j2460
50453I21505r141n377j468J805M288O467Q563J0366J2011J4166J7052J9867K1718
50440A021822K2599K3140K3716K4400K5390K6879K8658L0429L2267L4208L5647
50429A329155L5900L5258L4748L4796L4910L4727L4528L4403L3810L2396L0617
50418A705248K9002K7396K5520K3792K2994K3364K4527K6053K7575K8697K9244
50407A993412K9519K9880L0229L0210K9606K8264K5970K2820J9250J5315J0272
50396B264747L544m243j1927j9336k7397l6681m6505n5654o3423o9764p4728p8159
$$ y = [2327193, 2219768, 2107078, 1992042, 1877263, 1765828, 1660990, 1564729, 1477064, 1397052, 1324075, 1258057, 1198932, 1146445, 1100296, 1060070, 1025182, 995210, 970134, 949914, 933965, 921505, 912364, 906987, 905519, 907324, 911612, 918079, 926642, 937008, 949019, 963185, 980237, 1000104, 1021822, 1044421, 1067561, 1091277, 1115677, 1141067, 1167946, 1196604, 1227033, 1259300, 1293508, 1329155, 1365055, 1400313, 1435061, 1469857, 1504767, 1539494, 1574022, 1608425, 1642235, 1674631, 1705248, 1734250, 1761646, 1787166, 1810958, 1833952, 1857316, 1881843, 1907896, 1935471, 1964168, 1993412, 2022931, 2052811, 2083040, 2113250, 2142856, 2171120, 2197090, 2219910, 2239160, 2254475, 2264747, 2268291, 2264048, 2252121, 2232785, 2205388, 2168707, 2122202, 2066548, 2003125, 1933361, 1858633, 1780474]
50384A780474p9657p8804p5540p0363o4002n6907m9220m1055l2593k3983j5404
50373A192946p089Q14Q217J4695J9411K1805K2030K0393J6735J0955L774l809
50361A320877j1660k0204k8889l5841l9583m0539m0379m0238m0010l9077l7162
50350I47295l4452l1380k8434k6017k4240k2797k1154j8977j6426j3923j1666
50339F97829r558p667o304n458m525k965r80R26K715M673O665Q231R465J1061
50325G04108J3245J5168J5850J5360J4722J4752J5452J6394J7414J8669K0161
50314H81295K1450K2059K2132K2421K3463K4891K5760K5474K4248K2721K1379
50303A137293K0276J9201J7930J6374J4460J1978Q715M777N58l545p220j0109
$$ y = [1780474, 1700817, 1622013, 1546473, 1476110, 1412108, 1355201, 1305981, 1264926, 1232333, 1208350, 1192946, 1185857, 1186671, 1194888, 1209583, 1228994, 1250799, 1272829, 1293222, 1309957, 1320912, 1324686, 1320877, 1309217, 1289013, 1260124, 1224283, 1184700, 1144161, 1103782, 1063544, 1023534, 984457, 947295, 912843, 881463, 853029, 827012, 802772, 779975, 758821, 739844, 723418, 709495, 697829, 688271, 680604, 674300, 668842, 664317, 661352, 660372, 661298, 664013, 668686, 675351, 683582, 693047, 704108, 717353, 732521, 748371, 763731, 778453, 793205, 808657, 825051, 842465, 861134, 881295, 902745, 924804, 946936, 969357, 992820, 1017711, 1043471, 1068945, 1093193, 1115914, 1137293, 1157569, 1176770, 1194700, 1211074, 1225534, 1237512, 1246227, 1251004, 1251562, 1248017, 1240797, 1230688]
50291A230688j2011j3213j4186j4949j5310j5768j7387k0331k3326k5157k6030
50280A033020k6731k7112k6507k5181k4193k3831k3255k1949k0583k0035k0207
50269G73436k0273j9618j8223j6434j4614j2934j1352r891q748p850o585m477
50257F22437k018k42M39N31O32R00J280J680J812J477J046J222K166L259L792
50242F40413L565K871K227J995J889J151l19j423j261o13j056k712m108m340m154
50227F34125m530n334n930o190o237n937n258m543l900k984j773q93o29l29N75
50212E80233J672K330K724L345M026M266M128M008L837L300K587K168J928J282
50198F21834R3j114j856k126k123k021k043k347k828l225l454l678m156n118o509
$$ y = [1230688, 1218677, 1205464, 1191278, 1176329, 1161019, 1145251, 1127864, 1107533, 1084207, 1059050, 1033020, 1006289, 979177, 952670, 927489, 903296, 879465, 856210, 834261, 813678, 793643, 773436, 753163, 733545, 715322, 698888, 684274, 671340, 659988, 650097, 641349, 633499, 626914, 622437, 620419, 620177, 620616, 621147, 621779, 622679, 623959, 625639, 627451, 628928, 629974, 631196, 633362, 636621, 640413, 643978, 646849, 649076, 651071, 652960, 654111, 653792, 652369, 651108, 650495, 649439, 646727, 642619, 638279, 634125, 629595, 624261, 618331, 612141, 605904, 599967, 594709, 590166, 586266, 583282, 581509, 580616, 579987, 579658, 580233, 581905, 584235, 586959, 590304, 594330, 598596, 602724, 606732, 610569, 613869, 616456, 618624, 620552, 621834, 621927, 620813, 618957, 616831, 614708, 612687, 610644, 608297, 605469, 602244, 598790, 595112, 590956, 585838, 579329]
50183E79329p794q382q300q107q033p778p291o974o812o163m880l871l763l790
50169D87391k883j285k5O94J445K212K279J531P15J95n42j872l339m361m876m972
50153D72307m591l980l762m074m193l550k661k440k884l105k537j567q28m31o2
50138D31642L93P39R20J184J641J893J528R07R67K063L417M098M212M658N859
50123D66121P244P972P810P184O723O773P150P283O751N700M674M034L758L646
50109E52823L511L169K464J425L51l06k40L52P66L97n71j317j256n05N24J541
50093E63128K338K805L193L890M756N135M885M851N920P941J0009J1353J1675
50080F41879J1076J0186R919J0570J1516J2206J2854J3669J4097J3725J3307J3856
$$ y = [579329, 571535, 563153, 554853, 546746, 538713, 530935, 523644, 516670, 509858, 503695, 498815, 494944, 491181, 487391, 484508, 483223, 483198, 483892, 485337, 487549, 489828, 491359, 492074, 492269, 491727, 489855, 486516, 482155, 477279, 472307, 467716, 463736, 459974, 455900, 451707, 448157, 445496, 443056, 440172, 437067, 434530, 432963, 432135, 431704, 431642, 432035, 432774, 433694, 434878, 436519, 438412, 439940, 440847, 441814, 443877, 447294, 451392, 455604, 460262, 466121, 473365, 481337, 489147, 496331, 503054, 509827, 516977, 524260, 531011, 536711, 541385, 545419, 549177, 552823, 556334, 559503, 561967, 563392, 563743, 563437, 563197, 563549, 564315, 564712, 564141, 562824, 561568, 561063, 561587, 563128, 565466, 568271, 571464, 575354, 580110, 585245, 590130, 594981, 600901, 608842, 618851, 630204, 641879, 652955, 663141, 673060, 683630, 695146, 707352, 720206, 733875, 747972, 761697, 775004, 788860]
50068G88860J5065J5747J5581J5302J5252J4915J4053J3275J3103J3382J3815
50057I48350J4348J4782J4840J4849J5538J6935J8272J9280K0693K2997K5609
50046A146493K7880L0197L3390L7674M2810M8784N5617O3005P0754P9209Q8450
50035A724263R7360J04071J07192J06011R9957Q8680P2814N4102L4705J6706K054
50024B507915p729j2169j1951q435l269J763M948M940O81q615k2910m0742n9674
50011B344753p7517r2899j04694j11584j12788j09008j02079r3614q4338p4762
50001A381470o5810n8300n2099m6558m1623l7821l5010l2135k8679k5603k4042
49990I33790k3640k3033k1681k0160j8806j7250j5431j4035j3496j3331j2904
$$ y = [788860, 803925, 819672, 835253, 850555, 865807, 880722, 894775, 908050, 921153, 934535, 948350, 962698, 977480, 992320, 1007169, 1022707, 1039642, 1057914, 1077194, 1097887, 1120884, 1146493, 1174373, 1204570, 1237960, 1275634, 1318444, 1367228, 1422845, 1485850, 1556604, 1635813, 1724263, 1821623, 1925694, 2032886, 2138897, 2238854, 2327534, 2400348, 2454450, 2489155, 2505861, 2507915, 2500186, 2488017, 2476066, 2467631, 2464362, 2466125, 2471073, 2476013, 2476694, 2468079, 2445169, 2404427, 2344753, 2267236, 2174337, 2069643, 1958059, 1845271, 1736263, 1634184, 1540570, 1456232, 1381470, 1315660, 1257360, 1205261, 1158703, 1117080, 1079259, 1044249, 1012114, 983435, 957832, 933790, 910150, 887117, 865436, 845276, 826470, 809220, 793789, 779754, 766258, 752927, 740023]
49979G40023j2177j1327j0286r079q006p049n748m103k876k479k259j559p86n90
49965F61699n80J11J329K108K214K492L486M696N409N556N430N188M945M936N258
49950G14277N718O175O719P477Q475R721J1103J2241J2878J3400J4537J6435J8494
49937H57650K0205K1673K3209K4981K7243L0311L3980L7559M0941M5214N1578
49926A214544N9962O9366P9322R0336J02863J16574J30784J44974J58294J68861
49916B335880J74187J72514J63724J49120J30671J10564R1083P4373O1844N3744
49906C517704M9367M7709M7760M8152M6764M1173K9660J1863j1392l8461o6999
49895C723300r4155j17337j35045j47015j53761j56235j55658j53143j49321j44530
$$ y = [740023, 727846, 716519, 706233, 697154, 689148, 682099, 676351, 672248, 669372, 666893, 664634, 663075, 662289, 661699, 661119, 661230, 662559, 664667, 666881, 669373, 672859, 677555, 682964, 688520, 693950, 699138, 704083, 709019, 714277, 719995, 726170, 732889, 740366, 748841, 758562, 769665, 781906, 794784, 808184, 822721, 839156, 857650, 877855, 899528, 922737, 947718, 974961, 1005272, 1039252, 1076811, 1117752, 1162966, 1214544, 1274506, 1343872, 1423194, 1513530, 1616393, 1732967, 1863751, 2008725, 2167019, 2335880, 2510067, 2682581, 2846305, 2995425, 3126096, 3236660, 3327743, 3402116, 3463960, 3517704, 3567071, 3614780, 3662540, 3710692, 3757456, 3798629, 3828289, 3840152, 3828760, 3790299, 3723300, 3629145, 3511808, 3376763, 3229748, 3075987, 2919752, 2764094, 2610951, 2461630, 2317100]
49885B317100j39273j33952j28149j20920j12181j03228r5250q7884q0045p1808
49875A244410o4411n8431n3075m7561m2182l7444l3032k8488k4374k1735k0554
49864H13123j9677j8320j6914j6242j6303j6459j6256j5730j5047j4234j3264
49853F34677j2189j1106j0020q819p457o106n069m521m500n001n832o340n832
49840E41885m453l298l151l502l213j990o15J59L81N27R04J554K270K610K311
49825E32379J829K030L120M347M988N270N888P058Q394R547J0503J1451J2698
49812F19502J4561J7021J9624K2069K4710K8106L2221L6609M1241M6605N2964
49801I55233O0183O8441P8386R0077J02245J13060J21389J26706J28018J23634
$$ y = [2317100, 2177827, 2043875, 1915726, 1794806, 1682625, 1579397, 1484147, 1396263, 1316218, 1244410, 1179999, 1121568, 1068493, 1020932, 978750, 941306, 908274, 879786, 855412, 833677, 813123, 793446, 775126, 758212, 741970, 725667, 709208, 692952, 677222, 662175, 647941, 634677, 622488, 611382, 601362, 592543, 585086, 578980, 573911, 569390, 564890, 559889, 554057, 547717, 541885, 537432, 534134, 530983, 527481, 524268, 522278, 521663, 521822, 522203, 522730, 523634, 525188, 527458, 530068, 532379, 534208, 536238, 539358, 543705, 548693, 553963, 559851, 566909, 575303, 584850, 595353, 606804, 619502, 634063, 651084, 670708, 692777, 717487, 745593, 777814, 814423, 855664, 902269, 955233, 1015416, 1083857, 1162243, 1252320, 1354565, 1467625, 1589014, 1715720, 1843738, 1967372]
49791A967372J12314R4534P2591M9689K8815J1993J95o258p416l996K299R039
49779B331171J3745J4148Q344m612k3997m7552p2447r5873j15125j28126j34407
49768A745269j35078j31419j23955j13244j00876q8845p8071o8260n9070n0701
49758G95750m3398l7094l1772k7547k4171k1002j7841j5250j3690j2692j1301
49747E39992r121o602m487l311l138l450l383k490j254n42n95q47o56M0Q19J245
49731E02220J102M37m65j241j661j693j387q75n14p45j560k252k033j073n05j149
49715D86606k427l037k553j802j554j561j269q14o01l50N21J734K283J832J140
$$ y = [1967372, 2079686, 2174220, 2246811, 2296500, 2325315, 2337308, 2337503, 2331245, 2323829, 2319833, 2322132, 2331171, 2344916, 2359064, 2367408, 2362796, 2338799, 2291247, 2218800, 2122927, 2007802, 1879676, 1745269, 1610191, 1478772, 1354817, 1241573, 1140697, 1051852, 973781, 905521, 846451, 795750, 752352, 715258, 683486, 655939, 631768, 610766, 592925, 577675, 563985, 551293, 539992, 530871, 524269, 519782, 516471, 513333, 509883, 506500, 504010, 502756, 502214, 501619, 500772, 500116, 500156, 500975, 502220, 503322, 503759, 503294, 502053, 500392, 498699, 497312, 496437, 495923, 495178, 493618, 491366, 489333, 488260, 487755, 486606, 484179, 481142, 478589, 476787, 475233, 473672, 472403, 471589, 470988, 470638, 471159, 472893, 475176, 477008, 478148]
$$ [...]
##END NTUPLES=NMR SPECTRUM
##END=
