
##TITLE=AC1068_TOPL01_6519229_qYJ3gEzVqc
##JCAMPDX= 6.0         $$ Bruker NMR JCAMP-DX V2.0
##DATA TYPE= NMR SPECTRUM
##DATA CLASS= NTUPLES
##ORIGIN= BRUKER
##OWNER= Administrator
$$ 1.72 TOPSPIN		Version 2.1
$$ 2012-07-14 11:10:53.375 -0500  Administrator@TOPSPIN
$$ Compression mode = diff/dup
##.OBSERVE FREQUENCY= 400.02188249412
##.OBSERVE NUCLEUS= ^1H
##.ACQUISITION MODE= SIMULTANEOUS (DQD)
##.ACQUISITION SCHEME= undefined
##.AVERAGES= 8
##.DIGITISER RES= 22
##SPECTROMETER/DATA SYSTEM= spect
##.PULSE SEQUENCE= zg30
##.SOLVENT NAME= COFFEE_meoh
##.SHIFT REFERENCE= INTERNAL, COFFEE_meoh, 1, 14.98509
##AUDIT TRAIL= $$ (NUMBER, WHEN, WHO, WHERE, PROCESS, VERSION, WHAT)
$$ ##TITLE= Audit trail, TOPSPIN		Version 2.1
$$ ##JCAMPDX= 5.01
$$ ##ORIGIN= Bruker BioSpin GmbH
$$ ##OWNER= Administrator
$$ $$ C:\Bruker\TOPSPIN/data/COFFEE/nmr/AC1068_TOPL01_6519229_qYJ3gEzVqc/60/pdata/1/auditp.txt
$$ ##AUDIT TRAIL=  $$ (NUMBER, WHEN, WHO, WHERE, PROCESS, VERSION, WHAT)
(   1,<2012-07-14 11:10:46.015 -0500>,<Administrator>,<TOPSPIN>,<go>,<TOPSPIN 2.1>,
      <created by zg
	started at 2012-07-14 11:09:39.468 -0500,
	POWCHK enabled, PULCHK disabled,
       configuration hash MD5:
       6B 1B 68 BB D9 2E 58 E2 7F 35 AD 54 07 DF 0E 41
       data hash MD5: 64K
       FC 24 9C B5 BB 09 9F 7D 07 1D 7F 71 C4 16 97 1A>)
(   2,<2012-07-14 11:10:49.250 -0500>,<Administrator>,<TOPSPIN>,<proc1d>,<TOPSPIN 2.1>,
      <Start of raw data processing
       efp LB = 0 FT_mod = 6 PKNL = 1 PHC0 = 0 PHC1 = 0 SI = 32K 
       data hash MD5: 32K
       A8 78 0B AD 8D 85 D6 F4 C5 D6 30 3F 64 9D FC 26>)
(   3,<2012-07-14 11:10:49.640 -0500>,<Administrator>,<TOPSPIN>,<proc1d>,<TOPSPIN 2.1>,
      <pk PHC0 = 180.1263 PHC1 = 0 
       data hash MD5: 32K
       76 D9 2F FA 74 C5 43 1C 90 DA 91 9D 17 03 9A 81>)
(   4,<2012-07-14 11:10:49.750 -0500>,<Administrator>,<TOPSPIN>,<proc1d>,<TOPSPIN 2.1>,
      <abs ABSG = 1 
       data hash MD5: 32K
       46 0F DD 72 BF DF 5F D9 61 BC 08 B6 BE 15 BB D5>)
(   5,<2012-07-14 11:10:49.781 -0500>,<Administrator>,<TOPSPIN>,<proc1d>,<TOPSPIN 2.1>,
      <abs ABSG = 2 
       data hash MD5: 32K
       BB 12 9F 08 EB AD F2 24 77 77 02 8C AB 1B 9E 85>)
(   6,<2012-07-14 11:10:49.812 -0500>,<Administrator>,<TOPSPIN>,<proc1d>,<TOPSPIN 2.1>,
      <abs ABSG = 3 
       data hash MD5: 32K
       BD 22 D2 17 79 9C 1F AC 7A F0 3C 9C DB A3 7C 38>)
(   7,<2012-07-14 11:10:49.843 -0500>,<Administrator>,<TOPSPIN>,<proc1d>,<TOPSPIN 2.1>,
      <abs ABSG = 4 
       data hash MD5: 32K
       43 CD F5 83 C8 47 EF 84 D4 56 74 C1 CF 69 7D 77>)
(   8,<2012-07-14 11:10:49.875 -0500>,<Administrator>,<TOPSPIN>,<proc1d>,<TOPSPIN 2.1>,
      <abs ABSG = 5 
       data hash MD5: 32K
       03 A6 E8 72 BF 8B 8C E5 2A DE 60 18 BA 21 C6 17>)
$$ ##END=
$$ 
$$ $$ hash MD5
$$ $$ 75 C4 4F 77 7D 92 1B 56 3B 97 37 93 35 5D D9 E2
##$RELAX= 
##$RELAX= 
##$RELAX= 
##$RELAX= 
##$RELAX= 
##$RELAX= 
##$RELAX= 
##$RELAX= 
$$ Bruker specific parameters
$$ --------------------------
$$ [...]
150 150 150 150 150 150 150 150
##$TP07= 0
##$TPNAME0= <>
##$TPNAME1= <>
##$TPNAME2= <>
##$TPNAME3= <>
##$TPNAME4= <>
##$TPNAME5= <>
##$TPNAME6= <>
##$TPNAME7= <>
##$TPOAL= (0..7)
0.5 0.5 0.5 0.5 0.5 0.5 0.5 0.5
##$TPOFFS= (0..7)
0 0 0 0 0 0 0 0
##$TUNHIN= 0
##$TUNHOUT= 0
##$TUNXOUT= 0
##$USERA1= <user>
##$USERA2= <user>
##$USERA3= <user>
##$USERA4= <user>
##$USERA5= <user>
##$V9= 5
##$VALIST= <valist>
##$VCLIST= <CCCCCCCCCCCCCCC>
##$VD= 0
##$VDLIST= <DDDDDDDDDDDDDDD>
##$VPLIST= <PPPPPPPPPPPPPPP>
##$VTLIST= <TTTTTTTTTTTTTTT>
##$WBST= 2048
##$WBSW= 25
##$XGAIN= (0..3)
0 0 0 0
##$XL= 0
##$YL= 0
##$YMAX_a= 497827
##$YMIN_a= -649136
##$ZGOPTNS= <>
##$ZL1= 120
##$ZL2= 120
##$ZL3= 120
##$ZL4= 120
##$ABSF1= 14.98509
##$ABSF2= -5.573092
##$ABSG= 5
##$ABSL= 3
##$ALPHA= 0
##$AQORDER= 0
##$ASSFAC= 0
##$ASSFACI= 0
##$ASSFACX= 0
##$ASSWID= 0
##$AUNMP= <proc_prof1d_extract_pilot.lims>
##$AXLEFT= 0
##$AXNAME= <>
##$AXNUC= <1H>
##$AXRIGHT= 0
##$AXTYPE= 0
##$AXUNIT= <>
##$AZFE= 0.1
##$AZFW= 0.1
##$BCFW= 0
##$BC_mod= 0
##$BYTORDP= 0
##$COROFFS= 0
##$CY= 15
##$DATMOD= 1
##$DC= 0
##$DFILT= <>
##$DTYPP= 0
##$F1P= 0
##$F2P= 0
##$FCOR= 0.5
##$FTSIZE= 32768
##$FT_mod= 6
##$GAMMA= 0
##$GB= 0
##$INTBC= 1
##$INTSCL= 1
##$ISEN= 128
##$LB= 0
##$LEV0= 0
##$LPBIN= 0
##$MAXI= 10000
##$MC2= 0
##$MEAN= 0
##$ME_mod= 0
##$MI= 0
##$NCOEF= 0
##$NC_proc= -8
##$NLEV= 6
##$NOISF1= 0
##$NOISF2= 0
##$NSP= 0
##$NTH_PI= 0
##$NZP= 0
##$OFFSET= 14.98509
##$PC= 1
##$PHC0= 180.1263
##$PHC1= 0
##$PH_mod= 1
##$PKNL= yes
##$PPARMOD= 0
##$PPDIAG= 0
##$PPIPTYP= 0
##$PPMPNUM= 2147483647
##$PPRESOL= 1
##$PSCAL= 4
##$PSIGN= 0
##$PYNMP= <proc.py>
##$REVERSE= no
##$SF= 400.02
##$SI= 32768
##$SIGF1= 0
##$SIGF2= 0
##$SINO= 400
##$SIOLD= 32768
##$SPECTYP= <>
##$SREGLST= <1H.CDCl3>
##$SSB= 0
##$STSI= 32768
##$STSR= 0
##$SW_p= 8223.68421052631
##$SYMM= 0
##$S_DEV= 0
##$TDeff= 65536
##$TDoff= 0
##$TI= <>
##$TILT= no
##$TM1= 0
##$TM2= 0
##$TOPLEV= 0
##$USERP1= <user>
##$USERP2= <user>
##$USERP3= <user>
##$USERP4= <user>
##$USERP5= <user>
##$WDW= 1
##$XDIM= 32768
##$YMAX_p= 472416038
##$YMIN_p= -666925
##$CURPLOT= <Network HP LaserJet P1505>
##$CURPRIN= <$Network HP LaserJet P1505>
##$DFORMAT= <normdp>
##$LAYOUT= <+/1D_H.xwp>
##$LFORMAT= <normlp>
##$PFORMAT= <normpl>
##$SURQMSG= 1
$$ End of Bruker specific parameters
$$ ---------------------------------
##NTUPLES= NMR SPECTRUM
##VAR_NAME=  FREQUENCY,     SPECTRUM/REAL,   SPECTRUM/IMAG
##SYMBOL=    X,             R,               I
##VAR_TYPE=  INDEPENDENT,   DEPENDENT,       DEPENDENT
##VAR_FORM=  AFFN,          ASDF,            ASDF
##VAR_DIM=   32768,         32768,           32768
##UNITS=     HZ,            ARBITRARY UNITS, ARBITRARY UNITS
##FACTOR=    0.250966925370066, 1,           1
##FIRST=     8223.43324360094, 255838,       -447985
##LAST=      0,             43139,           -78828
##MIN=       0,             -666925,         0
##MAX=       8223.43324360094, 472416038,    0
$$ Real data points
##PAGE= N=1
##DATA TABLE= (X++(R..R)), XYDATA
$$ [...]
19471a86123A94604a58236B55752c2251l4916B39967q7724a64945G287c84260
$$ -186123 194604 -158236 255752 -32251 -67167 239967 152243 -164945 7287 -384260
19460f6927B399c48702A29301I228J780f9249A4712J56895E6523p830h1611A41594
$$ -66927 2399 -348702 129301 9228 11008 -69249 14712 171607 56523 48693 -81611 141594
19447c15463A03253h5685n3582E8242J0843d09932e7748j87051N8275A30336Q8744
$$ -315463 103253 -85685 -139267 58242 69085 -409932 -57748 -244799 -186524 130336 219080
19436B19080c62006i788j03072l15596c9614A26845a74768k07502d2784l3933
$$ 219080 -362006 -9788 -112860 -428456 -39614 126845 -174768 -382270 -42784 -76717
19426g6717m3458J5675L7049l1657B83340b78631a05968F3566K4904l8804E948
$$ -76717 -120175 -104500 -67451 -99108 283340 -278631 -105968 63566 88470 49666 5948
19414A44558A1537a30960A33602c4438D1906J04560B1463b86190i8724G884L2635
$$ 144558 11537 -130960 133602 -34438 41906 146466 21463 -286190 -98724 7884 40519
19403D0519b72608B2573J22080o9244a358D9835c41961B22626c35675K5551m1570
$$ 40519 -272608 22573 144653 75409 -1358 49835 -341961 222626 -335675 -310124 -351694
19392c51694J46477A6877J39776a1900o3896o8774R565k10431Q9360a06196o4765
$$ -351694 -205217 16877 156653 -11900 -75796 -144570 -135005 -345436 -256076 -106196 -170961
19381a70961f6101A0107Q544a62657m9951g1404F0849b70246A7868c46693J34851
$$ -170961 -66101 10107 18651 -162657 -212608 -71404 60849 -270246 17868 -346693 -211842
19370b11842i742j93168j81506e9600K040A33010f9524j95651b152G655O6490
$$ -211842 -9742 -202910 -384416 -59600 -57560 133010 -69524 -265175 -2152 7655 74145
19359G4145b9048l04691N6746a34928E0428b06789C670d6959A17296i7713k8093
$$ 74145 -29048 -333739 -276993 -134928 50428 -206789 3670 -46959 117296 -97713 -125806
19348a25806k6490A82883n8058C2728h877l9264B36083a60809O0128A46366M4375
$$ -125806 -152296 182883 124825 32728 -8877 -48141 236083 -160809 -100681 146366 190741
19337A90741a70635D7807a8594A43878l9758d38171J74361g5733k6645L6358A76448
$$ 190741 -170635 47807 -18594 143878 104120 -438171 -263810 -75733 -102378 -66020 176448
19325b66143k42762a17506M4673G9320b06057m6689g2100k43335A21134i8885
$$ -266143 -508905 -117506 -72833 79320 -206057 -252746 -72100 -315435 121134 -98885
19314B49151D9210K2403a1337k75767G7298j7435a76017j66566B28841h8420l07234
$$ 249151 49210 71613 -11337 -287104 77298 59863 -176017 -342583 228841 -88420 -395654
19303c95654R6507A52023a44331l0903B243a63551A33078L0869f1490H0260b8438
$$ -395654 -299147 152023 -144331 -175234 2243 -163551 133078 163947 -61490 80260 -28438
19291G4775a96018g7637A79425b16176d34A45753a29120G9089a04848M9740o5212
$$ 74775 -196018 -77637 179425 -216176 -434 145753 -129120 79089 -104848 -55108 -120320
19280a20320A6093J12408A9895b8747j23491L2876A43056b10127O2931B22993
$$ -120320 16093 128501 19895 -28747 -152238 -119362 143056 -210127 -147196 222993
19269a26746A06992h6845q4525f0948D4641b60579F2400g0708j29946d6154i244
$$ -126746 106992 -86845 -171370 -60948 44641 -260579 62400 -70708 -200654 -46154 -9244
19257f2775C50242A4488b00551A25700g4278A06527b94417C55052b40275J12690
$$ -62775 350242 14488 -200551 125700 -74278 106527 -294417 355052 -240275 -127585
19247a27585r4496B45260a86759P7189F2398a26656j38924Q8705g7359B48712
$$ -127585 -222081 245260 -186759 -109570 62398 -126656 -265580 -176875 -77359 248712
19236E8137J36359a24497p333q9841q3831J19881R827l320O2572A5909b03871
$$ 58137 194496 -124497 -131830 -221671 -305502 -185621 -175794 -179114 -116542 15909 -203871
19224D3367a50429M6604l2216B37284a08550K2073k2703j58487J11170a3640k80918
$$ 43367 -150429 -103825 -136041 237284 -108550 -86477 -109180 -267667 -156497 -13640 -294558
19213b94558A21478a21550j7865A43071F7536N2214a35209C0808b36456l8238
$$ -294558 121478 -121550 -139415 143071 67536 119750 -135209 30808 -236456 -274694
19203b74694a26618a8658I0047G167a6879j44121n1209j03331n6293A365e3766
$$ -274694 -126618 -18658 90047 7167 -16879 -161000 -212209 -315540 -371833 1365 -53766
19191I6119h0825L5436J5206j66636A16279b44987A68019b76297R4056j54535
$$ 96119 -80825 -45389 -30183 -196819 116279 -244987 168019 -276297 -182241 -336776
19181c36776A49473b90778a27315C99830c98163a39438l6498l1732r8129q2900
$$ -336776 149473 -290778 -127315 399830 -398163 -139438 -175936 -207668 -305797 -388697
19171c88697J74784f0022p1034r0975D25614c62986A0551b82245i7001E5247b7202
$$ -388697 -213913 -60022 -131056 -222031 425614 -362986 10551 -282245 -97001 55247 -27202
19159B31901a80239Q785b4558B67253A21961E6723g9107l41872B754P0775b37380
$$ 231901 -180239 -171454 -24558 267253 121961 56723 -79107 -420979 2754 73529 -237380
19147C0556J31324J5358b36438R9851l4036L9417E7462a95030I4939a37017b1697
$$ 30556 161880 177238 -236438 -136587 -170623 -131206 57462 -195030 94939 -137017 -21697
19135i7202j84949b4879m8256N674K0343A70488J41009c1219j63587B9527m457
$$ -97202 -282151 -24879 -73135 -67461 -47118 170488 311497 -31219 -194806 29527 25070
19124B5070J28247b67414M3115k2194A78407A5686a25016e0027a6951n24775F4354
$$ 25070 153317 -267414 -224299 -246493 178407 15686 -125016 -50027 -16951 -541726 64354
19112a54671J8128J5434B07133d35701B79256b9027r696k36862i4148j83464Q2833
$$ -154671 -136543 -121109 207133 -435701 279256 -29027 -38723 -275585 -94148 -277612 -194779
19101a94779f4792n12942b13924i74j55347L7770B73220b40495A0124O1890a29196
$$ -194779 -64792 -577734 -213924 -974 -156321 -118551 273220 -240495 10124 72014 -129196
19089A575a72128A7104b71409B11791a82473A13300c92165A5474J51105a51827
$$ 1575 -172128 17104 -271409 211791 -182473 113300 -392165 15474 166579 -151827
19078f3001j20642k4682O1065e4768A88564m4900j6013b27174A18719D9653a32473
$$ -63001 -183643 -208325 -147260 -54768 188564 143664 127651 -227174 118719 49653 -132473
19066a0913k8709k10744O4004k46157A65907b97936C12125J704A9013e5003A428
$$ -10913 -39622 -250366 -186362 -432519 165907 -297936 312125 313829 19013 -55003 1428
19054b41868A22750N6087i5003B91990b00851O7261o3116h0953p282j03356M0151
$$ -241868 122750 178837 -95003 291990 -200851 -133590 -196706 -80953 -88235 -191591 -151440
19043a51440C9360J86953b04662B4568a07597m12844i0515k89901P3598e116B53744
$$ -151440 39360 226313 -204662 24568 -107597 -520441 -90515 -380416 -306818 -5116 253744
19031A0624O4735l7509b85037A16213R9978a65118e9461J5297A80985h0522E4770
$$ 10624 75359 37850 -285037 116213 216191 -165118 -59461 -44164 180985 -80522 54770
19019G6633l6978O1711b17458f4971o1726A59138g5984D4290c0193k18669e8292
$$ 76633 39655 101366 -217458 -64971 -126697 159138 -75984 44290 -30193 -248862 -58292
19007F3780e4017A82179a15389A09033b41015h9455k18189A04152M928m2042L3421
$$ 63780 -54017 182179 -115389 109033 -241015 -89455 -307644 104152 109080 67038 100459
18996A00459C0233f2318a8371r9689n8141c8197k9p965k18455q4450A04822l820
$$ 100459 30233 -62318 -18371 -118060 -176201 -38197 -38226 -46191 -264646 -349096 104822 101002
18984A01002J20369j09737g1663j97433A2797K87128b5116j1864B96300F5811
$$ 101002 221371 111634 -71663 -269096 12797 299925 -25116 -36980 296300 65811
18973A60561J80627A33484M29810p1643J404D2713K55396m678H3149f8172g561
$$ 160561 341188 133484 563294 491651 493055 42713 298109 293431 83149 -68172 -7561
18961i6931j90662h2522j10959q2076i7499C184c31885C0382a086B21578B7486
$$ -96931 -287593 -82522 -193481 -275557 -97499 3184 -331885 30382 -1086 221578 27486
18949b22763a10015A20197Q8791a81209F5998j2181b24302f8495j90188R8233
$$ -222763 -110015 120197 208988 -181209 65998 53817 -224302 -68495 -258683 -160450
18939a60450B73999B9465r492i5116j6143J4093l6942H1299b77242B42341J5500
$$ -160450 273999 29465 19973 -95116 -111259 -97166 -134108 81299 -277242 242341 257841
18928B57841C5141K23b07819A62702d4089D0948O4384d19031c0142B40976a25079
$$ 257841 35141 35364 -207819 162702 -44089 40948 105332 -419031 -30142 240976 -125079
18916c21845A57909L7157a30188k65299I5535J69596c19779C76456N7585J8549
$$ -321845 157909 195066 -130188 -395487 95535 265131 -319779 376456 434041 452590
18906D52590B23801r2156a0747D2651a56461B07062A01696j8645a8355l0736A20614
$$ 452590 223801 131645 -10747 42651 -156461 207062 101696 83051 -18355 -49091 120614
18894d3581E135g4244C7373J5002h2924k26406a54326B4984J06740j3742l5034
$$ -43581 5135 -74244 37373 52375 -82924 -309330 -154326 24984 131724 117982 82948
18883H2948a60101b2100j50269D4086A8076c9679q4684k1472F500K9487c3895
$$ 82948 -160101 -22100 -172369 44086 18076 -39679 -124363 -145835 6500 35987 -33895
18871a99055k83523F6168a28760l4180A6386e1061I405J57471b1918E4242a19719
$$ -199055 -482578 66168 -128760 -162940 16386 -51061 9405 166876 -21918 54242 -119719
18859d06459F2844J11961O475h5896F894d47923h7969j38899i5745E6520B4436
$$ -406459 62844 174805 181280 -85896 6894 -447923 -87969 -226868 -95745 56520 24436
18847A91648G9378a87422a0826B28970d7681A11965c7823G1161b11401M1111r1210
$$ 191648 79378 -187422 -10826 228970 -47681 111965 -37823 71161 -211401 -170290 -261500
18836b61500C14562A36850g6012A09283d8692C4571G902J44070i5612a4375l9125
$$ -261500 314562 136850 -76012 109283 -48692 34571 7902 151972 -95612 -14375 -53500
18825e3500n9793e4383j87256g0749I2705f5776l75599B33996e7910k2201a0303
$$ -53500 -113293 -54383 -241639 -70749 92705 -65776 -441375 233996 -57910 -80111 -10303
18813b64825f8124o769I5025m6094M9347K05966b26B4662J10548K04270c1825
$$ -264825 -68124 -74893 95025 48931 98278 304244 -226 24662 135210 339480 -31825
18801b07142j53862a25242j29859k55092b27965O0280n0599B71791a7224j37835
$$ -207142 -361004 -125242 -255101 -510193 -227965 -167685 -218284 271791 -17224 -155059
18791a55059r0031B573b06557g0206A52609J23534f7452o2025l1451l050P9947
$$ -155059 -245090 2573 -206557 -70206 152609 276143 -67452 -129477 -160928 -163978 -84031
18780h4031L1464I6657a95931A06427D8909A90b73564D93699E1226i7166n0354
$$ -84031 -52567 96657 -195931 106427 48909 190 -273564 493699 51226 -97166 -147520
18769a47520b53A82827a35757F5956b27128e7786q0776A39507a94650L2535G4351
$$ -147520 -253 182827 -135757 65956 -227128 -57786 -138562 139507 -194650 -162115 74351
18757H9728b56220R9188A130d44719a20650k95866b1034n6000j92191H8480b38523
$$ 89728 -256220 -157032 1130 -444719 -120650 -416516 -21034 -77034 -269225 88480 -238523
18745E5054J01577D8285b15385A43276E3702K18894I504g1272j57664d777A011
$$ 55054 156631 48285 -215385 143276 53702 272596 9504 -71272 -228936 -4777 1011
18733d9570l1157j02822A43060M9941J75830c00314B432b54172Q8562C3852c6778
$$ -49570 -80727 -183549 143060 193001 368831 -300314 2432 -254172 -165610 33852 -36778
18721c12504J09282P8792E4740a18877c8772d359q2027n8119O3904k31994N7662
$$ -312504 -203222 -124430 54740 -118877 -38772 -4359 -86386 -144505 -80601 -312595 -254933
18710b54933h8197J6829j46087M3084a0794C4677c5587r7140k48757C38058b14131
$$ -254933 -88197 -71368 -217455 -174371 -10794 34677 -35587 -132727 -381484 338058 -214131
18698a93037E4262K48175G7876b46137a07702j55760H7400H91b9984k05750E3776
$$ -193037 54262 302437 77876 -246137 -107702 -263462 87400 891 -29984 -235734 53776
18686B20171K1703e5796E8934b4383j52298p9294B8650d0884J18B14794d580A76085
$$ 220171 241874 -55796 58934 -24383 -176681 -255975 28650 -40884 -40766 214794 -4580 176085
18673e3816D1166e2178j73321B7608b85271A62748f3628I9427f0795J6690D3808
$$ -53816 41166 -52178 -225499 27608 -285271 162748 -63628 99427 -60795 -44105 43808
18661a01007A23563l4127i272k97982a22686a9220E3383b26724I8419g3646B2747
$$ -101007 123563 89436 -9272 -307254 -122686 -19220 53383 -226724 98419 -73646 22747
18649F3444k3486i2765o5662E1493a49048r1650B31553A10509a39152e2402p1011
$$ 63444 39958 -92765 -158427 51493 -149048 -240698 231553 110509 -139152 -52402 -123413
18638a23413B71105a70976B54431c44285a26661B94939c170j51078d3060k13148
$$ -123413 271105 -170976 254431 -344285 -126661 294939 -3170 -154248 -43060 -256208
18628b56208A09314a33912A23868b74294E3688a80622B3267a37123j81201B88046
$$ -256208 109314 -133912 123868 -274294 53688 -180622 23267 -137123 -318324 288046
18617C7741a45978k07662a46063B5446b04451d6396o715A69466b7564a1255j49127
$$ 37741 -145978 -353640 -146063 25446 -204451 -46396 -53111 169466 -27564 -11255 -160382
18606a60382A95465b51991a7514B74887B4271a3016C1137K84066H9352b01371
$$ -160382 195465 -251991 -17514 274887 24271 -13016 31137 315203 89352 -201371
18595d56760a69146h1672j56732k24094e2250o3862m9020a8931B18595j07542
$$ -456760 -169146 -81672 -238404 -462498 -52250 -116112 -165132 -18931 218595 111053
18585A11053E4492O474a36589c2552l40047E4704a01758k22917g4504j96072R9426
$$ 111053 54492 60966 -136589 -32552 -372599 54704 -101758 -324675 -74504 -270576 -171150
18574a71150k2631A4256a2932j46687M2375B69700i1158F9772a10100F2864b00522
$$ -171150 -193781 14256 -12932 -159619 -117244 269700 -91158 69772 -110100 62864 -200522
18562E6932b32617J04981j20233K3327k73945a2959r498k84401F7210a83594a3852
$$ 56932 -232617 -127636 -247869 -224542 -498487 -12959 -22457 -306858 67210 -183594 -13852
18550B61804a45000p668A91643a79191b1270A49005h6363q779j57483a3793A73918
$$ 261804 -145000 -152668 191643 -179191 -21270 149005 -86363 -95142 -252625 -13793 173918
18538G2915B037a04920j64850F5469b03346E1816a03521B42653I7599f3441b6886
$$ 72915 2037 -104920 -269770 65469 -203346 51816 -103521 242653 97599 -63441 -26886
18526b8876I6345b0716R942j85056m7139A07392A3643c7510a5728A29091e5203
$$ -28876 96345 -20716 -10774 -195830 -242969 107392 13643 -37510 -15728 129091 -55203
18514A01728k1415a03952F8069b67047R4350b6042k27925A20583B9790c10464
$$ 101728 80313 -103952 68069 -267047 -172697 -26042 -253967 120583 29790 -310464
18503A6752R4461a26895B44041e13235h8820B941i3856k6624l37091A23678a96318
$$ 16752 111213 -126895 244041 -513235 -88820 2941 -93856 -120480 -457571 123678 -196318
18491A59194A6092a38924f8565j63561C80296a43374N76J085e2294j10671E0171
$$ 159194 16092 -138924 -68565 -232126 380296 -143374 -142798 -141713 -52294 -162965 50171
18479b92106G3819b105l64469J67302f7506A31197J59112c78087f296C9996L62355
$$ -292106 73819 -2105 -366574 -199272 -67506 131197 290309 -378087 -6296 39996 402351
18468D02351i8714c99A2811b55382F1787j7155m963D39a38608B9648i4216k3843
$$ 402351 -98714 -399 12811 -255382 61787 44632 39669 439 -138608 29648 -94216 -118059
18456a18059M3823j98184g9845j08849j41871f3306A39426k142e9374D12784a88611
$$ -118059 -74236 -272420 -79845 -188694 -330565 -63306 139426 137284 -59374 412784 -188611
18444h0491G3728J15504b63614J3119M5315a01679r8033A4198L28022c92045a50657
$$ -80491 73728 189232 -263614 -250495 -205180 -101679 -199712 14198 342220 -392045 -150657
18432B55930a81185n0107R1786j3589j1436J2361O5100A95103J1656p2829Q8690
$$ 255930 -181185 -231292 -139506 -153095 -164531 -152170 -87070 195103 206759 133930 222620
18421B22620b32938N5358f2323k26542A75433f4843k76085C92141I826a81705
$$ 222620 -232938 -177580 -62323 -288865 175433 -64843 -340928 392141 9826 -181705
18410a35667q1736O5575B20368e6m90568K30320r7553n5780M6289a02743j13251
$$ -135667 -217403 -151828 220368 -56 -490624 -260304 -357857 -413637 -367348 -102743 -215994
18399b15994A63450h703r8908N0943D4746J24438j0872R0385a74778D16018A05291
$$ -215994 163450 -8703 -107611 -56668 44746 169184 158312 248697 -174778 416018 105291
18387A99900J6944e7452b5883k71839f7549n7917A6366J12118a83562P9939d1147
$$ 199900 216844 -57452 -25883 -297722 -67549 -125466 16366 128484 -183562 -103623 -41147
18375A33297F1185J34603a15717d8114j64396J02801D3410i7728L1659A21759
$$ 133297 61185 195788 -115717 -48114 -212510 -109709 43410 -97728 -66069 121759
18364a30215L6957q5175F640h6763A5403a31664A19674e0311A8071b87880J40443
$$ -130215 -93258 -178433 6640 -86763 15403 -131664 119674 -50311 18071 -287880 -147437
18353a47437k0804o5975B62688B2799d26298i7631j04386M1793q2013B57686A0778
$$ -147437 -168241 -234216 262688 22799 -426298 -97631 -202017 -160224 -242237 257686 10778
18341B89480a9501l55005Q8114b3341o9241q8948b9044B23448a45553F1707J55333
$$ 289480 -19501 -374506 -286392 -23341 -92582 -181530 -29044 223448 -145553 61707 217040
18330B17040a20381q2736H9480O3344a76053H2255g8884G8817c1938j96028L1063
$$ 217040 -120381 -203117 89480 152824 -176053 82255 -78884 78817 -31938 -227966 -196903
18319a96903c2875B60612i7040j62591a9110B43470K9484d34519D1267J83760
$$ -196903 -32875 260612 -97040 -259631 -19110 243470 272954 -434519 41267 225027
18309B25027b10223A27895b46764c2700B23486L2309q1264G967a33736P823B19648
$$ 225027 -210223 127895 -246764 -32700 223486 255795 174531 7967 -133736 -125913 219648
18297e3379j67878q4091J30835j60129a51200L1287H7960l3072b6771A83699d18957
$$ -53379 -221257 -305348 -174513 -334642 -151200 -119913 87960 54888 -26771 183699 -418957
18285a20756A1862J45119a68596m6632n8908o2131G0193J13549a26161k68516
$$ -120756 11862 156981 -168596 -215228 -274136 -336267 70193 183742 -126161 -394677
18275c94677J40911e4097k7955k72448i8925p0497p2222f3088F0755J84000D1024
$$ -394677 -253766 -54097 -82052 -354500 -98925 -169422 -241644 -63088 60755 244755 41024
18263a14651A30099L5701d4009k8693A50944b57051H6802a83854N4808H7884b85341
$$ -114651 130099 165800 -44009 -72702 150944 -257051 86802 -183854 -129046 87884 -285341
18251c63621a41533K4993A32312f0750J5397G4697a97288Q6643I5098k8733a77570
$$ -363621 -141533 -116540 132312 -60750 -45353 74697 -197288 -110645 95098 66365 -177570
18239c6471a3655m9152j30083b5371j81062o9790I9655J1063B5822a49821o1610
$$ -36471 -13655 -62807 -192890 -25371 -206433 -276223 99655 110718 25822 -149821 -211431
18228b11431f9309B29768a54132F2727b43698N7766A44855B7848J23114a36356
$$ -211431 -69309 229768 -154132 62727 -243698 -185932 144855 27848 150962 -136356
18217b69163C8450J8402A1981K37493b56021f5852A08774i3643j51493B8894L5782
$$ -269163 38450 56852 11981 249474 -256021 -65852 108774 -93643 -245136 28894 64676
18206F4676J84270b20389f1371A22529C3607Q0580c23397J15502E5997K38172
$$ 64676 248946 -220389 -61371 122529 33607 114187 -323397 -207895 55997 294169
18196B94169c97464a75789P4258K7566C05415b12481A04147J4992d0644m0589
$$ 294169 -397464 -175789 -101531 -73965 305415 -212481 104147 119139 -40644 -81233
18186h1233E5333d3748b1238l2863k1319H6334C9551b32530D1971J93815c1575
$$ -81233 55333 -43748 -21238 -54101 -75420 86334 39551 -232530 41971 235786 -31575
18174A58878g3572J6535p7099D4993a03738L1454A04365b19665q1632A45740c3141
$$ 158878 -73572 -57037 -134136 44993 -103738 -72284 104365 -219665 -301297 145740 -33141
18162A70413a17119j49230N9343g4731j58424P8160r315B63929h7006L5369A12845
$$ 170413 -117119 -266349 -207006 -74731 -233155 -154995 -164310 263929 -87006 -51637 112845
18150d4995A54326J48911i3658g194l94696c7281k85900H3733O0978c914B83091
$$ -44995 154326 303237 -93658 -7194 -401890 -37281 -323181 83733 144711 -3914 283091
18138B89558H2713b26462A8745J3323J7033J87745q2734b01694A82707d885A30866
$$ 289558 82713 -226462 18745 32068 49101 236846 154112 -201694 182707 -4885 130866
18126b41192f5254A14543h1765q1140B62249d2362A13773a27732j0676A12033
$$ -241192 -65254 114543 -81765 -162905 262249 -42362 113773 -127732 -138408 112033
18115g2159A43477c80557J36073G956J34957b79175a18472N1798A82737f8737
$$ -72159 143477 -380557 -244484 7956 142913 -279175 -118472 -66674 182737 -68737
18104b94024A49217n5780b00704a7311A25625i7270B5555a14745j29068a6188
$$ -294024 149217 93437 -200704 -17311 125625 -97270 25555 -114745 -243813 -16188
18093a32564q2212a0273k67144c4865D1792K40555R289I9754f7378p5944D6616
$$ -132564 -214776 -10273 -277417 -34865 41792 282347 291636 99754 -67378 -143322 46616
18081B1772K86724b6944A47548a10459j30076P280E5529q950J5438a62261B05590
$$ 21772 308496 -26944 147548 -110459 -240535 -233255 55529 46579 62017 -162261 205590
18069B31681f3992C14905k3568J41038A15318a91846f438j92576N0952E1528a8985
$$ 231681 -63992 314905 291337 432375 115318 -191846 -6438 -199014 -148062 51528 -18985
18057a88360h40D1414b18703O1557e792A76366c9997A6107K30869b474j09559
$$ -188360 -840 41414 -218703 -157146 -5792 176366 -39997 16107 246976 -2474 -112033
18046a12033H2806J63537c87871B25584a49629g556j12980A78061n3007b35913
$$ -112033 82806 246343 -387871 225584 -149629 -7556 -120536 178061 125054 -235913
18035A56076M9123a47943m4778e5089A26769b3464n5265P346E8957N5404c26555
$$ 156076 205199 -147943 -192721 -55089 126769 -23464 -78729 -71383 58957 114361 -326555
18023I8591L996b31025d2751B81156h6753c8683G0998c75314a67962j85162a31206
$$ 98591 102587 -231025 -42751 281156 -86753 -38683 70998 -375314 -167962 -353124 -131206
18011b28579B14641a21338B65235i4597C89565A54463d2443E044b6978j7098G605
$$ -228579 214641 -121338 265235 -94597 389565 154463 -42443 5044 -26978 -44076 7605
17999i5015d0341A24653B7525R8122J43338c01j888k5942l67j44726B8873a1977
$$ -95015 -40341 124653 27525 125647 268985 -301 -2189 -28131 -28498 -173224 28873 -11977
17986b44560c8830j90633c1746A08255h727k63504C23745A07316K6641c03284
$$ -244560 -38830 -229463 -31746 108255 -8727 -272231 323745 107316 133957 -303284
17975a45365E7060D110M7937J96992M8874q3517C7928b4712F3513a38742f3517
$$ -145365 57060 4110 52047 249039 297913 214396 37928 -24712 63513 -138742 -63517
17963C05464b80135A4654L62333c1067B87822a20462g424C9096a22015A62921
$$ 305464 -280135 14654 376987 -31067 287822 -120462 -7424 39096 -122015 162921
17952b42833K7622E3431a6845A44637h5753A04221P1656p8200J1334a27782a7863
$$ -242833 -215211 53431 -16845 144637 -85753 104221 175877 97677 109011 -127782 -17863
17940a57052D5131K27547C9371J50316c12111d5613k626j13809P7061j07457F4265
$$ -157052 45131 272678 39371 189687 -312111 -45613 -48239 -162048 -84987 -192444 64265
17928b71981N7693l8586F1352H735K06775m0501j5565j4187b898A81925a60315
$$ -271981 -214288 -252874 61352 8735 215510 175009 159444 145257 -2898 181925 -160315
17916i5163B7487g9924A44880b8743K362B75778b68170k5106A44653F2845b29697
$$ -95163 27487 -79924 144880 -28743 -26381 275778 -268170 -293276 144653 62845 -229697
17904B21323N4436I36J67297A3308e1650E5967a20943n8531B22628o7993B2298
$$ 221323 275759 936 168233 13308 -51650 55967 -120943 -179474 222628 154635 22298
17892A45785K13531k7085j867f0272L058C80607A25339D5823K3700K8164J5556
$$ 145785 359316 332231 330364 -60272 -57214 380607 125339 45823 69523 97687 113243
17881A13243b37713g7243a5148D873e0957k87842D0034M0337l8809L94935k11412
$$ 113243 -237713 -77243 -15148 4873 -50957 -338799 40034 80371 41562 436497 225085
17870B25085c39988E16264a30661m550A00016J37709k9985B3481M29723E9217
$$ 225085 -339988 516264 -130661 -135211 100016 237725 207740 23481 453204 59217
17859D37452B8232p116a27241k6162A47345O8751a09852B34624f666A0850K08094
$$ 437452 28232 21116 -127241 -153403 147345 216096 -109852 234624 -6666 10850 218944
17848B18944A00125J412e2007q539A32450K10871j67549J106k2513a55460b3200
$$ 218944 100125 101537 -52007 -60546 132450 343321 175772 176878 154365 -155460 -23200
17836A77717H5905a1850A76572a64055H5374l6457c05567f0309K0843j51987h6550
$$ 177717 85905 -11850 176572 -164055 85374 48917 -305567 -60309 -39466 -191453 -86550
17824b67229C95243g1193J0640k79675A57607q563d48614F7899J11506H1115J2693
$$ -267229 395243 -71193 -60553 -340228 157607 149044 -448614 67899 179405 81115 93808
17813I3808j3185a02886l6698B33759m3139d5902B53594P0060A9866F670J35847
$$ 93808 80623 -102886 -139584 233759 190620 -45902 253594 323654 19866 6670 142517
17802A42517g3718B72366a52330B73575m5014A13560g1936a4825k7431m5166B22657
$$ 142517 -73718 272366 -152330 273575 228561 113560 -71936 -14825 -42256 -87422 222657
17790B4253b48426A69303J42864D555N7856c29847B14309Q0335b02617D92372
$$ 24253 -248426 169303 312167 4555 62411 -329847 214309 294644 -202617 492372
17779B42226k9333l5581H1797h7307b9808a133F9864a73113G6985e681A89380
$$ 242226 212893 177312 81797 -87307 -29808 -1133 69864 -173113 76985 -5681 189380
17767C75050i9783G1309I583Q0838a05479A56068D8774J19868o2725C1521J2421
$$ 375050 -99783 71309 9583 90421 -105479 156068 48774 168642 105917 31521 43942
17756D3942h091C32773A23535R164h8521C03689D4838a96476A80348E7584e3241
$$ 43942 -8091 332773 123535 132699 -88521 303689 44838 -196476 180348 57584 -53241
17744A79008G8180J05668p161J07830n0052J68267a4881j02687a7477C77522F0329
$$ 179008 78180 183848 176687 284517 234465 402732 -14881 -117568 -17477 377522 60329
17732b39373a076n7299A8064R2968i0419A9775e7511A66536l8373J01626c6168
$$ -239373 -1076 -58375 18064 111032 -90419 19775 -57511 166536 128163 229789 -36168
17720B64902a39088B9541K12236B5378c1531j70128B68463a14436I6747R0001
$$ 264902 -139088 29541 241777 25378 -31531 -201659 268463 -114436 96747 186748
17710A86748i0612A71180G388b7385J0101D6794D497K74925e9853j87229a5873
$$ 186748 -90612 171180 7388 -27385 -17284 46794 4497 279422 -59853 -247082 -15873
17698b60700B5108K6003J72035I9525Q7210j5212l139E8897b34801A3109L03681
$$ -260700 25108 51111 223146 99525 186735 171523 168384 58897 -234801 13109 316790
17687C16790h6086l909k8527F1385H65L10420j34026R7391J01349j70080a27705
$$ 316790 -86086 -89995 -118522 61385 865 311285 177259 274650 375999 205919 -127705
17675A32456i810B8796f8396C11425J47617i5806J3370K3988j35525Q3646E50822
$$ 132456 -9810 28796 -68396 311425 459042 -95806 -82436 -58448 -193973 -110327 550822
17663A31370j3912K7338J60837A33899f2537B50156k2716k5798N5007h1753m7571
$$ 131370 117458 144796 305633 133899 -62537 250156 227440 201642 256649 -81753 -129324
17652a29324D7934P982K6905K35387b78536J25412E35151g3787j68692a10713
$$ -129324 47934 55916 82821 318208 -278536 -153124 535151 -73787 -242479 -110713
17641c5274A5258L33399j04317j18510b12234G9494C7157L3561b85790H0635c4940
$$ -35274 15258 348657 244340 125830 -212234 79494 37157 70718 -285790 80635 -34940
17629A79943d7008F4766K91878c57746A58369E0052a05482D33828A26477J75339
$$ 179943 -47008 64766 356644 -357746 158369 50052 -105482 433828 126477 301816
17619C01816m6674i4614B44590h1106C4675L96364a49680A18231A3458K48443
$$ 301816 255142 -94614 244590 -81106 34675 431039 -149680 118231 13458 261901
17609B61901a56652A22783L5369p2938k7794J56726I8582k7211B3217J46067K90839
$$ 261901 -156652 122783 158152 85214 57420 214146 98582 71371 23217 169284 460123
17598D60123j93427I5473D5920j4792c3997A26098J87883J16258K4595j73431
$$ 460123 266696 95473 45920 31128 -33997 126098 313981 430239 454834 281403
17588B81403j9366I5744K24362q0170P3123j44112a43398B16079o2999b6115j51227
$$ 281403 262037 95744 320106 239936 313059 168947 -143398 216079 153080 -26115 -177342
17577a77342B10679a32093A01605l3839K50662H6673J38558h2493H2562e2655
$$ -177342 210679 -132093 101605 67766 318428 86673 225231 -82493 82562 -52655
17566C62562k0602C2562L48351M8464j29630m7266c0319E8964L2151C9653j3267
$$ 362562 341960 32562 380913 429377 299747 252481 -30319 58964 91115 39653 26386
17555B6386J84883m5664R0021A18436m6123J38082R5688k1396E7881P2478b8068
$$ 26386 211269 165605 255626 118436 72313 210395 306083 284687 57881 130359 -28068
17543c7876C75941m9160g5687A41309M1663F2635L1203H088J59557L92407M7033
$$ -37876 375941 326781 -75687 141309 182972 62635 93838 8088 167645 560052 607085
17532F07085A0463J89204J28804c7312B94039L43613L09337j50181P2951L99943
$$ 607085 10463 199667 328471 -37312 294039 637652 946989 796808 869759 1269702
17522A269702m86079k55155l1993E8214Q84600A20352J74214J54457q5870A57627
$$ 1269702 783623 528468 496475 58214 942814 120352 294566 449023 363153 157627
17511C35166J86686L01033K6394M40303j8839n66952k14551k4495j13054J60097
$$ 335166 521852 822885 849279 1289582 1270743 703791 489240 464745 351691 511788
17501E11788j35962F8428K46561r5640L37053A99534J88096B8114L74276j72693
$$ 511788 375826 68428 314989 219349 556402 199534 387630 28114 402390 229697
17491B29697J20292M30971C80089j14903K24226j69613A19742K60123j82690P8642
$$ 229697 349989 780960 380089 265186 489412 319799 119742 379865 197175 275817
17481B75817r427K20124A90058l9815K44507I0703K01599I1074L91660R0862a94371
$$ 275817 266390 486514 190058 150243 394750 90703 292302 91074 482734 573596 -194371
17469I2355K72377M26194B90880e5995F4597M7679L1371J81954J82628j37491
$$ 92355 364732 790926 290880 -55995 64597 112276 143647 325601 508229 370738
17459C70738J65754k44560K66086A34447R6302J87316A61390D2434K67420J35117
$$ 370738 536492 291932 558018 134447 230749 418065 161390 42434 309854 444971
17449D44971j45595K27961j53610n1102L12354j72428M18912C90700A50456K84635
$$ 444971 299376 527337 373727 322625 634979 462551 881463 390700 150456 435091
17439D35091a37183A82093J11285j45688N67999C26916J01205L1802A09973K81438
$$ 435091 -137183 182093 293378 147690 715689 326916 428121 459923 109973 391411
17429C91411j6305L17366j95860J3832l1254j71246N2212L37641k18451B35738
$$ 391411 375106 692472 496612 510444 479190 307944 360156 697797 479346 235738
17418F30879C14873k7184P8734o7267P4553M14J79763k05092J28513n8205B9518
$$ 630879 314873 287689 366423 299156 373709 374123 553886 348794 477307 419102 29518
17406E16255j70858l8365Q8424j80010n5994G2619k4916J89807J90726r2350J94940
$$ 516255 345397 307032 395456 215446 159452 72619 47703 237510 428236 335886 530826
17395E30826k14200m3267p8762J72934r5666N4889Q2827A29678j9607K05981C1557
$$ 530826 316626 273359 194597 367531 271865 326754 409581 129678 110071 316052 31557
17383D68398J36700B62359J22636J63948A01834A105J88660K00891j22097K15702
$$ 468398 605098 262359 384995 548943 101834 1105 189765 390656 268559 484261
17373D84261R316A65391M36610l2809k02775l8429L0639m5701n4407p8916K62918
$$ 484261 493577 165391 602001 569192 366417 327988 358627 312926 258519 179603 442521
17362D42521k17861F8227J70452K08575K0025J2874j70273L0871m7700J83455
$$ 442521 224660 68227 238679 447254 467279 480153 309880 340751 293051 476506
17352D76506k16314j00570K06316A09670K35157r6868e4813G5144a98903e5316
$$ 476506 260192 159622 365938 109670 344827 247959 -54813 75144 -198903 -55316
17341B01146G473J09716K12805K58934B64601L68020G3743K99220n5897R3685
$$ 201146 7473 117189 329994 588928 264601 632621 73743 372963 317066 410751
17331D10751j75556r8534F3194Q6594K87425B09740B4147L26619J21588K199j21149
$$ 410751 235195 136661 63194 149788 437213 209740 24147 350766 472354 474553 353404
17320C53404j8688R0254j16854A03792M05675A92334Q3259K77302A67328L83131
$$ 353404 334716 424970 308116 103792 509467 192334 275593 552895 167328 550459
17310E50459I2186M87217A16042O6362L84715B17638e2559B98940E6875L09065
$$ 550459 92186 579403 116042 182404 567119 217638 -52559 298940 56875 365940
17300C65940C4917L56471j33866H346L97305A83696K6800J08856A05462M26104
$$ 365940 34917 391388 257522 8346 405651 183696 210496 319352 105462 531566
17290E31566B27233L48309j41963J79160k87969j32072a19674C53832A72136K64056
$$ 531566 227233 575542 433579 612739 324770 192698 -119674 353832 172136 436192
17280D36192A44221L04571a40936B01016O07334B91976l6351J41483R8954I5445
$$ 436192 144221 448792 -140936 201016 808350 291976 255625 397108 496062 95445
17269C23126J52829j57126o6614K67332j1489B39017A10311N921J97968J85706
$$ 323126 475955 318829 252215 519547 508058 239017 110311 116232 314200 499906
17259D99906J04178h5824A28079C7353O20654A56322L0811A717L28048d1631C69529
$$ 499906 604084 -85824 128079 37353 658007 156322 187133 1717 329765 -41631 369529
17247C58196j0797m427P6266A81427J39161p6258J27006j55465K76704m0960B06591
$$ 358196 347399 342972 419238 181427 320588 244330 371336 215871 492575 451615 206591
17235B54421G8987J54849A14026K65367J41928L7325j58273R7047j35131n4230
$$ 254421 78987 233836 114026 379393 521321 558646 400373 497420 362289 308059
17225C08059P699r5893p2072J75227j37702K09217j85295J1904o8847J82038R5383
$$ 308059 315758 219865 147793 323020 185318 394535 209240 221144 152297 334335 429718
17214D29718Q1127j1247n9040L310A27853L20405j14501j20134K49651j94432
$$ 429718 510845 499598 440558 443868 127853 448258 333757 213623 463274 268842
17204B68842K74058J9193B45054K91761J07592B66239L01418k46032K47716j66922
$$ 268842 542900 562093 245054 536815 644407 266239 567657 321625 569341 402419
17194D02419J35997A18951J08469L49016k67427K05025M005k05215r6094M30384
$$ 402419 538416 118951 227420 576436 309009 514034 518039 312824 216730 647114
17184F47114j59501J85766q8752j91952P0264A96018R6805M04576j08594k4952
$$ 647114 487613 673379 584627 392675 462939 196018 292823 697399 588805 563853
17174E63853R6322k09929Q6290L41995j09413j87444N4540j53637J37176K96711
$$ 563853 660175 450246 536536 878531 769118 581674 636214 482577 619753 916464
17164I16464k02512C26020N49526l90759q9425P2353L51624l59750N921K69655
$$ 916464 713952 326020 875546 484787 395362 467715 819339 459589 465510 735165
17154G35165j07570A90084K64198R2461p4892j44437j9940M51660M3424l18135
$$ 735165 627595 190084 454282 546743 471851 327414 307474 759134 802558 484423
17144D84423J74575j76337J52684L21844C39977L20509K42669m48432N2730K07202
$$ 484423 658998 482661 635345 957189 339977 660486 903155 454723 507453 714655
17134G14655k5666m2301B10238K35914K0486N3903Q531J35917j4353K3939l18012
$$ 714655 688989 646688 210238 446152 466638 520541 529072 664989 650636 674575 356563
17123C56563K75750j19541J54702k15781J62314k97247L09309l6151J4125j11463
$$ 356563 632313 512772 667474 451693 614007 316760 626069 589918 604043 492580
17113D92580M24052l46602K53343j86756P9688j00131K03486r473L49645C89149
$$ 492580 916632 570030 823373 636617 716305 616174 819660 810187 1159832 389149
17102G81962O9488j83721j25989J24292K09934m6918k3561J4543m030n0113k19188
$$ 781962 851450 667729 541740 666032 875966 829048 805487 820030 816000 765887 546699
17091E46699Q3479N16301j07316m44136K78945r6598L29922k68541q5973l6934
$$ 546699 630178 1146479 1039163 595027 873972 777374 1107296 838755 752782 715848
17081G15848K05808q2027k88998M41409L7182k97032J43243l80458L91727l02810
$$ 715848 921656 839629 550631 992040 1029222 732190 875433 494975 886702 583892
17071E83892L15968q3717k05129r2101R2415n8214N23648k37508k13230L15150
$$ 583892 899860 816143 611014 518913 611328 553114 1076762 839254 626024 941174
17061I41174l31970L42226j61967j10917N65064n47205K14247k19863r7104L30868
$$ 941174 609204 951430 789463 678546 1243610 696405 910652 690789 593685 924553
17051I24553J42584p1935J51689N4038m18133L99974m5082p6161k00606j85460
$$ 924553 1067137 995202 1146891 1200929 782796 1182770 1137688 1061527 860921 675461
17041F75461M80384m4511m6808k88313K12673l02861l919L42857J8946N0173k23419
$$ 675461 1155845 1111334 1064526 776213 988886 686025 682106 1024963 1043909 1094082 870663
17030H70663J47899L68280m26803J73384k26000j14847q0085K29505K73118k38779
$$ 870663 1018562 1386842 960039 1133423 907423 792576 712491 941996 1215114 976335
17020I76335K74045J27573k22688P0206o7536j745J31211j55791r8551K20813
$$ 976335 1250380 1377953 1155265 1225471 1157935 1156190 1287401 1131610 1033059 1253872
17010A253872k60114K67138l8662P079k9520k88939M10883N3086j06247k6241
$$ 1253872 993758 1260896 1222234 1229313 1199793 910854 1321737 1374823 1268576 1242335
17000A242335m5991j19154L63461l48750K02881P5540J31806j8935j63274J45727
$$ 1242335 1196344 1077190 1440651 1091901 1294782 1370322 1502128 1483193 1319919 1465646
16990A465646m62637J78838J61821J12724l6648R2821J1168j30467M11986n31498
$$ 1465646 1003009 1181847 1343668 1456392 1419744 1512565 1523733 1393266 1805252 1273754
16980A273754Q5516J19564j09882Q1990k85130L74849K8146l55256K38783J49585
$$ 1273754 1359270 1478834 1368952 1450942 1165812 1540661 1568807 1213551 1452334 1601919
16970A601919K3424m4424J39804k70726K39724k07318J81020K57158m28997N55770
$$ 1601919 1625343 1580919 1720723 1449997 1689721 1482403 1663423 1920581 1491584 2047354
16960B047354o58969K94987J44423P9039k73642N4808O5465K38626m49602K25513
$$ 2047354 1388385 1683372 1827795 1906834 1633192 1688000 1753465 1992091 1542489 1768002
16950A768002K01598J9290k19168M64259l52578K25150k52444j24908O03930j67102
$$ 1768002 1969600 1988890 1769722 2233981 1881403 2106553 1854109 1729201 2333131 2166029
16940B166029k94212k08900N79798o38377Q77769m07558j49981J75978J20271
$$ 2166029 1871817 1662917 2242715 1604338 2482107 2074549 1924568 2100546 2220817
16931B220817n58022K00779N52422k19992R3981k69548K23232J04728j18592R1807
$$ 2220817 1662795 1863574 2415996 2196004 2289985 2020437 2243669 2348397 2229805 2321612
16921B321612K39655j37637K30455j28892J57326J24304N1213j57307j99646n4392
$$ 2321612 2561267 2423630 2654085 2525193 2682519 2806823 2858036 2700729 2501083 2446691
16911B446691J9296J54511J44960m8605o580K28603k25744J61196n636m32615
$$ 2446691 2465987 2620498 2765458 2716853 2710273 2938876 2713132 2874328 2868692 2436077
16901B436077O01665L37178j96955k69451M16493L8463j1802j38502m0045M7306
$$ 2436077 3037742 3374920 3177965 2908514 3325007 3363470 3351668 3213166 3173121 3220427
16891C220427J47595J24345K3246k05512J76186N50268n17535K01614L6881j81924
$$ 3220427 3368022 3492367 3515613 3310101 3486287 4036555 3519020 3720634 3757515 3575591
16881C575591L18397L7043K03111K27883J8947j86674n1472k78156K46821j50473
$$ 3575591 3893988 3931031 4134142 4362025 4380972 4194298 4142826 3864670 4111491 3961018
16871C961018M52937j30213N8496K20056j60726K18398K29994l55093N1195J44465
$$ 3961018 4413955 4283742 4342238 4562294 4401568 4619966 4849960 4494867 4546062 4690527
16861D690527L14208R5491J82674l20000K51332l38303N02408R7395o1855K03456
$$ 4690527 5004735 5100226 5282900 4962900 5214232 4875929 5378337 5475732 5413877 5617333
16851E617333L69201m35564L46107L8502J50407j27269O79418k55901J80854j35262
$$ 5617333 5986534 5550970 5897077 5935579 6085986 5958717 6638135 6382234 6563088 6427826
16841F427826L44379J01851P7310p2841L42549p9853p7512M66444k53577M15820
$$ 6427826 6772205 6874056 6951366 6878525 7221074 7141221 7063709 7530153 7276576 7692396
16831G692396J22399j13459J86312L52918j2861N1873K30174M78154J77664O5739
$$ 7692396 7814795 7701336 7887648 8240566 8227705 8279578 8509752 8987906 9165570 9231309
16821I231309J33727Q5361J28089J48037L95538K1136M97478j97129M76066l12434
$$ 9231309 9365036 9450397 9578486 9726523 10122061 10143197 10640675 10443546 10919612 10607178
16811A0607178L00287K87380M96005n0909P92519j64841K00956N71600L12119
$$ 10607178 10907465 11194845 11690850 11639941 12432460 12267619 12468575 13040175 13352294
16802A3352294k5432O31617L75933q9759K03459O56067L63474K14889P79820r1770
$$ 13352294 13326862 13958479 14334412 14244653 14448112 15104179 15467653 15682542 16462362 16370592
16792A6370592P58642M38785O20681j7592O69271K65011P06742O20606N60848
$$ 16370592 17129234 17568019 18188700 18171108 18840379 19105390 19812132 20432738 20993586
16783B0993586O65009K51716R11599M92980L18132O77094Q21234R35368P45116
$$ 20993586 21658595 21910311 22821910 23314890 23633022 24310116 25131350 26066718 26811834
16774B6811834N62662R48871R35254P12332R08948J156550P61174J113887R45326
$$ 26811834 27374496 28323367 29258621 29970953 30879901 32036451 32797625 33911512 34856838
16765C4856838J151298J256665J212538J217494J322465J472929J603765J650182
$$ 34856838 36008136 37264801 38477339 39694833 41017298 42490227 44093992 45744174
16757D5744174J340699J976734J633762J588537J672436K254720J754880K088211
$$ 45744174 47084873 49061607 50695369 52283906 53956342 56211062 57965942 60054153
16749F0054153K072059K382161K025559K581548K336326K376239K521694K838330
$$ 60054153 62126212 64508373 66533932 69115480 71451806 73828045 76349739 79188069
16741G9188069K752284K770615K805884K632132L017563K482981L214169K461987
$$ 79188069 81940353 84710968 87516852 90148984 93166547 95649528 98863697 101325684
16733A01325684K327023K989386K282314K329285J962606K034401J794989J231182
$$ 101325684 103652707 106642093 108924407 111253692 113216298 115250699 117045688 118276870
16725A18276870J410545R04718J056769k09017J89397m7520n45901q16480r97423
$$ 118276870 119687415 120592133 121648902 121439885 121629282 121581762 121035861 120219381 119221958
16716A19221958j768294j503389j709908k080497k320095k451676k295853l443339
$$ 119221958 117453664 115950275 114240367 112159870 109839775 107388099 105092246 101648907
16708A01648907k051117l141972k999079k733443k704680k858248k815798k834752
$$ 101648907 99597790 96455818 93456739 90723296 88018616 85160368 82344570 79509818
16700G9509818k640069l171848j861237k842967k524347k312033k075327k495611
$$ 79509818 76869749 73697901 71836664 68993697 66469350 64157317 62081990 59586379
16692E9586379k113608j867333k504306j761723j763040j573137j692157j902715
$$ 59586379 57472771 55605438 53101132 51339409 49576369 48003232 46311075 44408360
16684D4408360j444122j398185j382703j467141j477535j011620j021527j298363
$$ 44408360 42964238 41566053 40183350 38716209 37238674 36227054 35205527 33907164
16676C3907164j189067j001487r92344q41978j032283q67775j014791r98439l47474
$$ 33907164 32718097 31716610 30724266 29882288 28850005 27982230 26967439 25969000 25621526
16667B5621526j061161p25178l81196o89712r85231l01121o98822n00889n94508
$$ 25621526 24560365 23835187 23453991 22764279 21779048 21477927 20779105 20278216 19683708
16658A9683708n05862j22138p93472m10978n11326l54842r99605k09176l04727
$$ 19683708 19177846 19055708 18262236 17851258 17339932 16985090 15985485 15776309 15471582
16649A5471582k10579m32288m13086k97025n47879J27076n43705j78620n46278
$$ 15471582 15261003 14828715 14415629 14118604 13570725 13697801 13154096 12975476 12429198
16640A2429198j47462l38129n38262q4783L0223j42682m02189J02358k06894o82274
$$ 12429198 12281736 11943607 11405345 11320562 11350785 11208103 10805914 10908272 10701378 10019104
16630A0019104n2622k98103m60308P0711j76605k81944m7115L21651o28544j86628
$$ 10019104 9966482 9668379 9208071 9278782 9102177 8820233 8773118 9094769 8466225 8279597
16620H279597j88388n6140n51801J90186L8490l62397j14085J32474l13197J46766
$$ 8279597 8091209 8035069 7483268 7673454 7711944 7349547 7235462 7367936 7054739 7201505
16610G201505l36458j02463j10652l97304K99750n10542k2977L9770l01745O3772
$$ 7201505 6865047 6762584 6651932 6254628 6554378 6043836 6020859 6060629 5758884 5822656
16600E822656m4234n7571l2456L0586m7594k82779q5308m84155K81713j34259
$$ 5822656 5778422 5720851 5688395 5718981 5671387 5388608 5303300 4819145 5100858 4966599
16590D966599k45914J46583k28186l84704M87726j03264r4498k51015J02560k50202
$$ 4966599 4720685 4867268 4639082 4254378 4742104 4638840 4544342 4293327 4395887 4145685
16580D145685K00098j97764j53861K80771j65896j36509l16224K04717K66685
$$ 4145685 4345783 4148019 3994158 4274929 4109033 3972524 3656300 3861017 4127702
16571D127702q35709L40935K44346k59903P8368j4296j15728l88711J74645Q7242
$$ 4127702 3291993 3632928 3877274 3617371 3695739 3681443 3565715 3177004 3351649 3438891
16561C438891j15051J10413j98020n14154M42541m8483K81943o22329J13190j24309
$$ 3438891 3323840 3434253 3236233 2722079 3164620 3116137 3398080 2775751 2888941 2764632
16551B764632K31023j233m04058L05438J9073m2402j01641J57855M431k35613
$$ 2764632 2995655 2994422 2590364 2895802 2914875 2872473 2770832 2928687 2933118 2697505
16541B697505j51728l16863L46438k89457K82698K68695n58083K15716l70477
$$ 2697505 2545777 2228914 2575352 2285895 2568593 2837288 2279205 2494921 2124444
16532B124444O2701M58045m01211j97996J59317K5020j38817p8963J66329k36443
$$ 2124444 2187145 2645190 2243979 2045983 2205300 2230320 2091503 2012540 2178869 1942426
16522A942426K51532N747N1367l01263l0518Q1875J01495k61798j52439J76205
$$ 1942426 2193958 2199705 2251072 1949809 1919291 2001166 2102661 1840863 1688424 1864629
16512A864629j50687k9788L82594k92628o3127Q3231j06441K05215j90349J16576
$$ 1864629 1713942 1684154 2066748 1774120 1710993 1794224 1687783 1892998 1702649 1819225
16502A819225l0389N7320M08970o41702k5002k54133K20527Q1096r6326m6455
$$ 1819225 1788836 1846156 2255126 1613424 1588422 1334289 1554816 1635912 1539586 1493131
16492A493131K73584k77216R1499L4661P924M3385l18904J70283l15471Q9196
$$ 1493131 1766715 1489499 1580998 1615659 1623583 1666968 1348064 1518347 1202876 1292072
16482A292072L56134k93018N5952k10948q5814J08690J69319j30279Q3336j88370
$$ 1292072 1648206 1355188 1411140 1200192 1114378 1223068 1392387 1262108 1345444 1157074
16472A157074J18344k02734L21412k93259N04518k38423k48876O4998J88214j28066
$$ 1157074 1275418 1072684 1394096 1100837 1605355 1366932 1118056 1183054 1371268 1243202
16462A243202K00572q0102k99790j61437L07194L845j93903R1479L2444p5551
$$ 1243202 1443774 1363672 1063882 902445 1209639 1213484 1019581 1111060 1143504 1067953
16452A067953M2578j3691r737L16728n20833L03074k56479L51898k68909K17331
$$ 1067953 1110531 1096840 1087103 1403831 882998 1186072 929593 1281491 1012582 1229913
16442A229913j00313K11821l66687l04316L22638J97596m24292K77243j08894
$$ 1229913 1129600 1341421 974734 670418 993056 1190652 766360 1043603 934709
16433I34709J4090m2257j0912J6945o1912J56553J41119k87057k32079L46715
$$ 934709 948799 906542 895630 912575 850663 1007216 1148335 861278 629199 975914
16423I75914j43162j89526M21043l42402k3912L55723l26245J59789J2099R5066
$$ 975914 832752 643226 1064269 721867 697955 1053678 727433 887222 899321 994387
16413I94387j79848k83922K30064L97704k48718N6197j93405Q8511r6305Q096
$$ 994387 814539 530617 760681 1158385 909667 965864 772459 860970 764665 772761
16403G72761P3287k47633L32407j70777j39055J88842N8346j25617K075r5283
$$ 772761 846048 598415 930822 760045 620990 809832 868178 742561 744636 649353
16393F49353J08510k26488N3183R6548m2908q2136j36587J40276j24943O67742
$$ 649353 757863 531375 584558 681106 638198 556062 419475 559751 434808 1102550
16383A102550C29347L40464j11877L05977k41872L4149R3461j60231j39955M84042
$$ 1102550 329347 669811 557934 863911 622039 656188 749649 589418 449463 933505
16373I33505k74967j66976J04071K15344l01038L70234j62975j7712p7495J31519
$$ 933505 658538 491562 595633 810977 509939 880173 717198 699486 621991 753510
16363G53510l03912R3286p8824J30682p7752l3815A10429L14455j83928K50084
$$ 753510 449598 542884 464060 594742 516990 483175 110429 424884 240956 491040
16353D91040R1098j16436m0254A62677N32523l40138K3675J7562j14827L16234
$$ 491040 582138 465702 425448 162677 695200 355062 378737 396299 281472 597706
16343E97706j68223O0770M0475R055k13120J81703o920J30495B15973J79874r5079
$$ 597706 429483 490253 530728 539783 326663 508366 501446 631941 215973 395847 300768
16332C00768M72833C83313A58182L82049o9751j68685L90443j47169A50825M19136
$$ 300768 773601 383313 158182 540231 470480 301795 692238 545069 150825 569961
16322E69961Q648k41349J65561m2901j11343N1711r4676L57585l25161L01120
$$ 569961 578609 337260 502821 459920 348577 400288 305612 663197 338036 639156
16312F39156k62642K4610o4706A03894L93045B03877L95381j12352K31499k40479
$$ 639156 376514 401124 336418 103894 496939 203877 599258 486906 718405 477926
16302D77926o6570f3321E63630J60001j84617D4383K09715l4718M40711j58604
$$ 477926 411356 -63321 563630 723631 539014 44383 254098 219380 660091 501487
16292E01487A84970n408L96910r8705j94282r0429P8258m2552K45809J15246b419
$$ 501487 184970 179562 576472 477767 283485 193056 271314 228762 474571 589817 -2419
16280D52628m9279K9477J37142k28332J57046B19162K55224p4068A11534k7019
$$ 452628 403349 432826 569968 341636 498682 219162 474386 400318 111534 84515
16270H4515P7305R3777l2043N6888b2322B50135q013A1882O02185C00763L1146
$$ 84515 161820 255597 223554 280442 -22322 250135 242122 11882 614067 300763 331909
16259C31909E5387D134L45874j34436P4719k309r1577d09E00598p7774J37705
$$ 331909 55387 4134 350008 215572 290291 287982 196405 -409 500598 422824 560529
16248E60529b1660B79578A8217R315L75762j59326Q9009F6917M0241j3404L53266
$$ 560529 -21660 279578 18217 27532 403294 243968 332977 66917 107158 93754 447020
16237D47020B08781j3930J96210j5406j36357N3384D2939L70280R5826A89845
$$ 447020 208781 194851 391061 375655 239298 292682 42939 413219 509045 189845
16226E8254N60086E4024b243D78840k22198J88068B7004L20185C0485M2653N6311
$$ 58254 618340 54024 -2243 478840 256642 444710 27004 347189 30485 73138 129449
16215A29449L0077J95296L7800A27888K257Q7739m7680J34902H1681K9331M09746
$$ 129449 159526 354822 392622 127888 130145 217884 170204 305106 81681 111012 520758
16204E20758k47077b61524I6742K09878j51692R8603d1087A44620K7632J92567
$$ 520758 273681 -261524 96742 306620 154928 253531 -41087 144620 172252 364819
16194C64819k0864q7942K70188C6155b25012B11025g4874A78024O1097n2747A813
$$ 364819 343955 256013 526201 36155 -225012 211025 -74874 178024 239121 186374 1813
16182A40281i6456A74440F7361K46464J3350j8952m0119M02471B18233c7859B89983
$$ 140281 -96456 174440 67361 313825 327175 308223 268104 670575 218233 -37859 289983
16170H3514K31098H671J09023n2046k1310K23858K0390A38235R2605H5468J91638
$$ 83514 314612 8671 117694 65648 44338 268196 288586 138235 230840 85468 277106
16159B77106q6917j2632h9369B10632O820b61885A72975D6464M6060J2431f0189
$$ 277106 190189 177557 -89369 210632 217452 -261885 172975 46464 92524 104955 -60189
16147f8821A94125J68371J06532f6813a409A21727n1516a7361F6155c9498B21625
$$ -68821 194125 362496 469028 -66813 -1409 121727 70211 -17361 66155 -39498 221625
16135a63413C16494J14096G1054a02370D2208b2269B2007K97977A55258O9295
$$ -163413 316494 430590 71054 -102370 42208 -22269 22007 319984 155258 224553
16125B24553J17926N494A09237J55236b60206J5892j89979C95267d5292B6235
$$ 224553 342479 347973 109237 264473 -260206 -244314 -434293 395267 -45292 26235
16114A71076M4061L442h160j88156b6445m7732c4772A00028J0916L3674B1071
$$ 171076 215137 218579 -8160 -196316 -26445 -74177 -34772 100028 110944 144618 21071
16102B97829q839H5684K03920A34873J15940A9866J76499J03293C4776J57916
$$ 297829 288990 85684 289604 134873 250813 19866 196365 299658 34776 192692
16092A92692k8136o1993J39876a42648M7714J0621A19075a26435b183G0965b78338
$$ 192692 164556 102563 242439 -142648 -94934 -84313 119075 -126435 -2183 70965 -278338
16080A67166c5037m1556j45534J03451l6217O619e8706r0957M5257A5082a5332
$$ 167166 -35037 -76593 -222127 -118676 -154893 -148274 -58706 -149663 -104406 15082 -15332
16068e005H9120J99669l4395m9725J37755d61045a14618B88550K07745D9582b28878
$$ -5005 89120 288789 254394 204669 342424 -461045 -114618 288550 496295 49582 -228878
16056a14552D0031J63816K5763J14504A36076a93188B90338H3885R1500b24795
$$ -114552 40031 203847 229610 344114 136076 -193188 290338 83885 175385 -224795
16045D6190a30106G6301a9263L588j55312f6134n4315B34549a32597I9215a16704
$$ 46190 -130106 76301 -19263 -15675 -170987 -66134 -120449 234549 -132597 99215 -116704
16033a62728B80297A30190E7142b80797c9236D5146a30592e1056j02446d0125
$$ -162728 280297 130190 57142 -280797 -39236 45146 -130592 -51056 -153502 -40125
16022h0629A20149a38600b4867r2379A5721b91175A92236i1057A75795f7778j67609
$$ -80629 120149 -138600 -24867 -117246 15721 -291175 192236 -91057 175795 -67778 -235387
16011b35387A64877F9839B9289O7249J47762j302j15070g6285M511p5451D01762
$$ -235387 164877 69839 29289 96538 244300 242998 127928 -76285 -71774 -147225 401762
15999A88705N4723c222j70671P2368A04448h76A8080N2786d1355B70184A07955
$$ 188705 243428 -3222 -173893 -101525 104448 -876 18080 70866 -41355 270184 107955
15987B90697K76356L80146Q2879M60906j23856k99866m37404C00553Q2348A04500
$$ 290697 567053 947199 1030078 1490984 1367128 1067262 629858 300553 382901 104500
15976a24201b9246j31222j5717J5702A08977a95718B4626Q2170d9243A39443K7011
$$ -124201 -29246 -160468 -176185 -160483 108977 -195718 24626 106796 -49243 139443 166454
15965A66454L3861P1735a98246A33350J26225j27026c50203F176b77355A7081
$$ 166454 200315 272050 -198246 133350 259575 132549 -350203 6176 -277355 17081
15954a95660C53697a84220C06237c4762a4270A08270J41809g4230k22027a05023
$$ -195660 353697 -184220 306237 -34762 -14270 108270 250079 -74230 -296257 -105023
15943b08944D1133a63601A78592a67068B61279r2691a36511B29002b92647J03234
$$ -208944 41133 -163601 178592 -167068 261279 168588 -136511 229002 -292647 -189413
15933a89413C37365b05387F7399a18831o5246e9575k8671c692B68890A13692b32477
$$ -189413 337365 -205387 67399 -118831 -184077 -59575 -88246 -3692 268890 113692 -232477
15921a91500A35844c2513F0795b47223G3730M238d76728F3789c88634F2396g7900
$$ -191500 135844 -32513 60795 -247223 73730 77968 -476728 63789 -388634 62396 -77900
15909C7618g749C33101c0499r2080O0645j94626D8243N1116a23633A34166b37331
$$ 37618 -7749 333101 -30499 -122579 -61934 -256560 48243 99359 -123633 134166 -237331
15897C8520h9859p0313B91847i172D2766c15379a7623j04750l9936A83295E0826
$$ 38520 -89859 -160172 291847 -9172 42766 -315379 -17623 -122373 -162309 183295 50826
15885B57516j18360b9760k22010d4061B89139a75513a6324A9387J60260m0093
$$ 257516 139156 -29760 -251770 -44061 289139 -175513 -16324 19387 179647 139554
15875A39554j5466a2182j15991c9130l70145B1470a70838A36458b7461j28199
$$ 139554 124088 -12182 -128173 -39130 -409275 21470 -170838 136458 -27461 -155660
15865a55660e7683F9635c19620A41595j6881c43767A42702J42742b47558C8908
$$ -155660 -57683 69635 -319620 141595 124714 -343767 142702 285444 -247558 38908
15854C08535K2370B7041O4668P4100A5301a50507D7843a70922e0803B17131l6346
$$ 308535 330905 27041 91709 165809 15301 -150507 47843 -170922 -50803 217131 180785
15843A80785a43277A28263d4621A13947J20070A12470K408h4824I6088J04040
$$ 180785 -143277 128263 -44621 113947 234017 112470 114878 -84824 96088 200128
15833B00128H3852j1922i4365q0080F4626N8100a36401F8733K66549b26616B82406
$$ 200128 83852 71930 -94365 -174445 64626 122726 -136401 68733 335282 -226616 282406
15821a97545b0349A57366f3282F1232e2379j82825I9382E578a51700A10868a06272
$$ -197545 -20349 157366 -63282 61232 -52379 -235204 99382 5578 -151700 110868 -106272
15809a5568l24085a62405O7483A81024a1047l345E2928b64930B49433a39673A28386
$$ -15568 -339653 -162405 -94922 181024 -11047 -14392 52928 -264930 249433 -139673 128386
15797b35443D1274Q3157j447l8934Q9360h5793K9445B58948I4557J18609a4344
$$ -235443 41274 124431 122984 84050 173410 -85793 -56348 258948 94557 213166 -14344
15785B25816h2805I6656a17969B18760p3930O1109N9848A26338O2572a8483I5417
$$ 225816 -82805 96656 -117969 218760 144830 205939 265787 126338 188910 -18483 95417
15773B56349a30011A02589C3811a29275D7386i5728E2620b3756C68500F9832h5768
$$ 256349 -130011 102589 33811 -129275 47386 -95728 52620 -23756 368500 69832 -85768
15761A96170c13622a05595F0501J72146J13371r8495A00644b427A37883a68954
$$ 196170 -313622 -105595 60501 232647 346018 247523 100644 -2427 137883 -168954
15750B74124B5403K09573e852D01974J3441H2565k2884j5791f7336k45427F8291
$$ 274124 25403 234976 -5852 401974 415415 82565 59681 43890 -67336 -312763 68291
15738D4790i969l39809C2915a92720N4478m4090L5782A56200b69802N9930N4579
$$ 44790 -9969 -349778 32915 -192720 -138242 -182332 -146550 156200 -269802 -209872 -155293
15727a55293E9717c10694A9557m032b19833P6707f7406n2355C40458a40849L073
$$ -155293 59717 -310694 19557 15525 -219833 -143126 -67406 -119761 340458 -140849 -137776
15716a37776D2316c77298A31810b0368j34637A0384P7296d7544C1159R1986b20039
$$ -137776 42316 -377298 131810 -20368 -155005 10384 87680 -47544 31159 123145 -220039
15704e7025r997A90538e2220A51070o2173B7174a81766d5467l37359G8284J54706
$$ -57025 -67022 190538 -52220 151070 88897 27174 -181766 -45467 -382826 78284 232990
15693B32990g1983A1234J28285M6554m9442a7395A42450a60289I8824K23613F9159
$$ 232990 -71983 11234 139519 186073 136631 -17395 142450 -160289 98824 322437 69159
15681e0313E120e8806B6975J92412a53374p2576L7190N5055G1064f2508B4032
$$ -50313 5120 -58806 26975 219387 -153374 -225950 -188760 -133705 71064 -62508 24032
15669a47961J9654D5378J30034a43583p4563j99996J46921B5068J43602b9620
$$ -147961 -128307 45378 175412 -143583 -218146 -418142 -271221 25068 168670 -29620
15658b73809H542b14072E496J15444J82355d3362E7508J08940j6293A4114P9887
$$ -273809 8542 -214072 5496 120940 303295 -43362 57508 166448 150155 14114 94001
15647I4001A2385h3008b3739F6440d63720B3998b76195A07437K0077L0564b47536
$$ 94001 12385 -83008 -23739 66440 -463720 23998 -276195 107437 127514 158078 -247536
15635A7418b89511a29084A41605c6885j50166K7190A05189a17524J6722k2466
$$ 17418 -289511 -129084 141605 -36885 -187051 -159861 105189 -117524 -100802 -123268
15625a23268r0453J00591j7031j22736B56599a3285j09732L6397K0179k7979j29435
$$ -123268 -213721 -113130 -130161 -252897 256599 -13285 -123017 -86620 -66441 -94420 -223855
15614b23855A45969o8309a21445I2314i6821A83434H165c9844F271f7606A24024
$$ -223855 145969 77660 -121445 92314 -96821 183434 8165 -39844 6271 -67606 124024
15602b62930B13480F1868a57213C17867E8648N3560c95096a13195j43139F722
$$ -262930 213480 61868 -157213 317867 58648 112208 -395096 -113195 -256334 6722
15591B66901h7813B11450D1608L81851a5622l36073f517o5859A13386a70266l9112
$$ 266901 -87813 211450 41608 423459 -15622 -351695 -6517 -72376 113386 -170266 -209378
15580b09378f0902A69427E538d7023H968M2440f3278j06209r5281J06566K7791
$$ -209378 -60902 169427 5538 -47023 8968 51408 -63278 -169487 -264768 -158202 -130411
15569a30411l05353h3164m9420B75762A25153R7921f2233k1928A754L33063A29301
$$ -130411 -435764 -83164 -132584 275762 125153 223074 -62233 -84161 1754 334817 129301
15557e638j51924E986Q4334m627f5209j09189G096d0134D872a34509A03271a95877
$$ -5638 -157562 5986 90320 85693 -65209 -174398 7096 -40134 4872 -134509 103271 -195877
15544a12480A12249b4503a2102F4875J33212j5523c3979A24928F2307b51541B0011
$$ -112480 112249 -24503 -12102 64875 198087 182564 -33979 124928 62307 -251541 20011
15532d0777m17848e8173j29627B62087H6694n492J13218i1407n607l6075B3076
$$ -40777 -458625 -58173 -187800 262087 86694 81202 194420 -91407 -97014 -133089 23076
15520F850a99404E69129B06807j1790b165j1806C04524J36231q2037j10624J19407
$$ 6850 -199404 569129 206807 195017 -2165 -13971 304524 440755 358718 248094 367501
15509C67501G437h0013B77026R0160j64022o4463K685O9314G4389k5931N0560
$$ 367501 7437 -80013 277026 367186 203164 138701 141386 210700 74389 48458 99018
15498I9018a86728A40175Q602J01043J4313J23122j75506J57831A03375l2898
$$ 99018 -186728 140175 148777 249820 264133 387255 211749 369580 103375 70477
15488G0477J23489K09829A41419K79580k05923a71853B43919K33019A48732F4396
$$ 70477 193966 403795 141419 420999 215076 -171853 243919 476938 148732 64396
15477B52797G9628K4733B3086M27852n2120L09653C48293L3930A77566J24368
$$ 252797 79628 104361 23086 450938 398818 708471 348293 382223 177566 301934
15467C01934H003M38762F1842i3769B43249a34987D8910K40915j42604K9476J24286
$$ 301934 8003 446765 61842 -93769 243249 -134987 48910 289825 147221 176697 300983
15456C00983a497B73398a51276C5242K45269a8181A21704i9229M7293C09536a54510
$$ 300983 -1497 273398 -151276 35242 280511 -18181 121704 -99229 -51936 309536 -154510
15444B15910N0816q1905J69552O25737J67922J6625l08168m08428j52845j16441
$$ 215910 266726 184821 354373 980110 1148032 1164657 856489 448061 295216 178775
15434A78775d7410A89210M7671F2187O98a51487B16880d0859A31212c9689D07685
$$ 178775 -47410 189210 236881 62187 62885 -151487 216880 -40859 131212 -39689 407685
15422e2947C9915J01887B9315e7566A13693j6191a99317A63829b57870f6484a3706
$$ -52947 39915 141802 29315 -57566 113693 97502 -199317 163829 -257870 -66484 -13706
15410a58634k20380H616J57668a58954C23782j58046a47435C4705b12066k6388
$$ -158634 -379014 8616 166284 -158954 323782 165736 -147435 34705 -212066 -238454
15400b38454C5994a32414B0822J72740b11575h1556A10106b5660B45540H6439
$$ -238454 35994 -132414 20822 193562 -211575 -81556 110106 -25660 245540 86439
15389b5820A52372L56420A8879O6366l0948a95080A66815a09614C81008A60521
$$ -25820 152372 508792 18879 85245 54297 -195080 166815 -109614 381008 160521
15378A85321j7460K08832d1035p112A46893f1254E1375J072J33496i1755B95547
$$ 185321 167861 376693 -41035 -48147 146893 -61254 51375 52447 185943 -91755 295547
15366a27171F1524L8571l0423Q3823F0341Q6324D0497O1969C8974e4373B05558
$$ -127171 61524 100095 69672 153495 60341 146665 40497 102466 38974 -54373 205558
15354A34766n5182K42489j54583O1762I6236R3037R1251B1362L42175a0698B72109
$$ 134766 79584 322073 167490 229252 96236 189273 280524 21362 363537 -10698 272109
15342B35172J82960A37538K75099k7047A70863g6460j09797A60702c22290A12085
$$ 235172 418132 137538 412637 385590 170863 -76460 -186257 160702 -322290 112085
15331i7575L077C68234j47409M9778A3691K13228H1189J30541K70276k01175a0478
$$ -97575 -94498 368234 220825 270603 13691 226919 81189 211730 482006 280831 -10478
15319C34346B4172h3220D2054b50599o8764I3444a43676A68916l8941J48326K725
$$ 334346 24172 -83220 42054 -250599 -319363 93444 -143676 168916 129975 278301 281026
15308B81026j16989A7289K89804a7562A65829a16381B29621a00703D1728N5762
$$ 281026 164037 17289 307093 -17562 165829 -116381 229621 -100703 41728 97490
15298I7490J69595O2801a19669M9431n0908C23031c52246G5514a61999A67413
$$ 97490 267085 329886 -119669 -70238 -121146 323031 -352246 75514 -161999 167413
15287B4345a67928g4951j09141Q3494A2055L9718K4728R434k7685N3536M22584
$$ 24345 -167928 -74951 -184092 -100598 12055 51773 76501 85935 58250 111786 534370
15276E34370C9652K33045B4536O7969b13096A02239A4112J94920b29032A7230
$$ 534370 39652 272697 24536 92505 -213096 102239 14112 209032 -229032 17230
15265I4259J76535j26662J06488Q2266a37766A78570a73300B47421A9714J07925
$$ 94259 270794 144132 250620 332886 -137766 178570 -173300 247421 19714 127639
15255A27639m2680J36663J63892a04707k3554B00010c53159C11574a62811A80942
$$ 127639 84959 221622 385514 -104707 -128261 200010 -353159 311574 -162811 180942
15244H3143K09552N76748R58429J07601l80302K67239n38159C37293A38708c31434
$$ 83143 292695 869443 1827872 1935473 1555171 1822410 1284251 337293 138708 -331434
15233a02913a3895B48301a69131B3902a2726B20679f6344E3810J46170D7714K1947
$$ -102913 -13895 248301 -169131 23902 -12726 220679 -66344 53810 199980 47714 69661
15222F9661A8785K60301L7839J93207g1117q9612A85146n7003g7284j43551A6328
$$ 69661 18785 279086 316925 510132 -71117 -160729 185146 128143 -77284 -220835 16328
15210A77490n1530m2325f6894j01564i873D48583I176J03799J99114b19627A58216
$$ 177490 125960 83635 -66894 -168458 -9873 448583 9176 112975 312089 -219627 158216
15198E1813K36658j08925H736J288P527L17723j31573B0551K33490R0548b7870
$$ 51813 288471 179546 8736 10024 17551 335274 203701 20551 254041 344589 -27870
15186B2743L39565n4034o811a82324g9994k93174B37336b43247B3059K56757i2204
$$ 22743 362308 308274 301463 -182324 -79994 -373168 237336 -243247 23059 279816 -92204
15174G5493b67936I4543a54552e2477A9407J52582L9907j03799J82273a7370r8668
$$ 75493 -267936 94543 -154552 -52477 19407 171989 211896 108097 290370 -17370 -116038
15163a16038F3697K21840b2006D47J75210a2200n9401n1155G2383B7037P339J39475
$$ -116038 63697 285537 -22006 447 175657 -12200 -71601 -122756 72383 27037 34376 173851
15151A73851J40591b01134C28333q7200d2768A32278A1439J64785H4551q656J24328
$$ 173851 314442 -201134 328333 241133 -42768 132278 11439 176224 84551 75895 200223
15140B00223G1434J23038K12923j9595l6092c1371A63272K2920m5936k2737a19404
$$ 200223 71434 194472 407395 387800 351708 -31371 163272 186192 140256 117519 -119404
15128B57011q0166k6057c554B05230I0250K84774B2025J14054K64558L2973l5371
$$ 257011 176845 150788 -3554 205230 90250 375024 22025 136079 400637 433610 398239
15117C98239A93208k1637L71790A57590O8885l7183P7062m1114L9003H4538K94945
$$ 398239 193208 171571 543361 157590 226475 189292 266354 225240 264243 84538 379483
15106C79483A59337J33637r2178F7824K56040F7030L31091a84191A90770q9987
$$ 379483 159337 292974 200796 67824 323864 67030 398121 -184191 190770 100783
15096A00783L09277A74660l2408O5131J44734A58287J7770C4471r540M0768a9043
$$ 100783 410060 174660 142252 207383 352117 158287 176057 34471 24931 65699 -19043
15084I9382P4914c28701B17117J38965A32656m6592J3864J42107b3542D49411
$$ 99382 174296 -328701 217117 356082 132656 86064 99928 242035 -23542 449411
15073C28967C8766b57966D36176q6234A11091a33342C99731I6130a71779b0947
$$ 328967 38766 -257966 436176 349942 111091 -133342 399731 96130 -171779 -20947
15062C44229E1490L62656b9261B64303K333b3180E23670j70051A76435K19151
$$ 344229 51490 414146 -29261 264303 266636 -23180 523670 353619 176435 395586
15052C95586j89029C6215J1995M79057j20657J41506A25885O25631B97165A3088
$$ 395586 206557 36215 48210 527267 406610 548116 125885 751516 297165 13088
15041D57290j78576j14438L54953B25797H6554P3199K87798F0015L64524J799
$$ 457290 278714 164276 519229 225797 86554 159753 447551 60015 424539 426338
15031D26338M43929C67852M5465N02812j53577j78915J79482a4837D64993N9620
$$ 426338 870267 367852 413317 916129 762552 583637 763119 -14837 464993 524613
15021E24613o4042J17041J15924j98591l0866J62328j95495B1380O95876H895
$$ 524613 460571 577612 693536 494945 464079 626407 430912 21380 717256 8895
15010E62996k07230P2286j38962M4364K68026A70157K42816j51066M71727j64980
$$ 562996 355766 428052 289090 333454 601480 170157 412973 261907 733634 568654
15000E68654K168P5109l8867A16815L39720N4281B2222M40117j08529J23183m6407
$$ 568654 570822 645931 607064 116815 456535 510816 22222 462339 353810 476993 430586
14989D30586B09421R2502K81283B52367M6989M67926k57060j56733P13429k47398
$$ 430586 209421 301923 583206 252367 299356 767282 510222 353489 1066918 819520
14979H19520J05945l41217O7547o2895j73534j06816j37550O63151k55666O5886
$$ 819520 925465 584248 651795 588900 415366 308550 171000 834151 578485 644371
14969F44371K73906k95867B38083K0125O7176A61802P1677F5467P6793N14610
$$ 644371 918277 622410 238083 258208 325384 161802 233479 65467 142260 656870
14959F56870k07664k01777j5131k353N7969A01150K60068A03680M89126k55624
$$ 656870 449206 247429 232298 229945 287914 101150 361218 103680 592806 337182
14949C37182j68391m4617J00994J08373J76522O733J83018M4192j00165A51785
$$ 337182 168791 124174 225168 333541 510063 516796 699814 744006 643841 151785
14938I7681K18738J92261A59134L57402q7805J24554J6658M48630k7735L16730
$$ 97681 316419 508680 159134 516536 428731 553285 569943 1018573 990838 1307568
14928A307568m90712K43652K23066M0774J17663K72321k58126M1000j00412J22390
$$ 1307568 816856 1060508 1283574 1324348 1442011 1714332 1456206 1497206 1396794 1519184
14918A519184L97173L41562o6651O5436p09563j46122k71516O2429k46561j8543
$$ 1519184 1916357 2257919 2191268 2256704 1547141 1401019 1129503 1191932 945371 926828
14908I26828m9865l42643n2981j79204O13028k48770l20351J12267J29891r9484
$$ 926828 876963 534320 481339 302135 915163 666393 346042 458309 588200 488716
14898D88716a7562E08092D4065K70194j396p7354J50069Q2620Q518j41395J66937
$$ 488716 -17562 508092 44065 314259 312863 235509 385578 468198 476716 335321 502258
14887E02258n9234L42506N06612k71797j64495P9572j01767j75477K25605j77491
$$ 502258 443024 785530 1292142 1020345 855850 935422 833655 658178 883783 706292
14877G06292n0090K23962m23275q6804L91933j93231k68733M35722r5870r1984
$$ 706292 656202 880164 456889 370085 762018 568787 300054 735776 639906 547922
14867E47922l2498N52218j30833j79520J34699D31637O2606j4190l0081j29624
$$ 547922 515424 1067642 936809 757289 891988 431637 494243 480053 449972 320348
14857C20348N07345k13401J7007k22593J43689j05195K99747B87307J38110K54204
$$ 320348 827693 614292 631299 408706 552395 447200 746947 287307 425417 679621
14847F79621B47979K42083J75903J47641L01969j43496O0339J53262n18926j3149
$$ 679621 247979 490062 665965 813606 1115575 972079 1032418 1185680 666754 653605
14837F53605L59794D82075K83078l75805J7097A75900J61636K6131K19875k16437
$$ 653605 1013399 482075 765153 389348 406445 175900 337536 363667 583542 367105
14827C67105K76200C05572N36028j88411n4991j64420J39045R6825j95194J94176
$$ 367105 643305 305572 841600 653189 598198 433778 572823 669648 474454 668630
14817F68630L25042m71995N01765k43614j67697J02284J24386j04294k37498L77721
$$ 668630 993672 521677 1023442 779828 612131 714415 838801 734507 497009 874730
14807H74730j15965j91428N20756n3592O0546j81047l54075j89204J38776j71547
$$ 874730 758765 567337 1088093 1034501 1095047 914000 559925 370721 509497 337950
14797C37950J56150r624R5794j48035N53716m62772L08051j92623P6262k10571
$$ 337950 494100 484476 580270 432235 985951 523179 831230 638607 714869 504298
14787E04298O9317K17531n426l17040K60752l1457j41020K04647j36816N15062
$$ 504298 573615 791146 785720 468680 729432 697975 556955 761602 624786 1139848
14777A139848r8591j05753Q9001K24683m08681n1262r8497n0635C08868L64068
$$ 1139848 1041257 935504 1024505 1249188 840507 789245 690748 640113 308868 672936
14767F72936l5603n1208J65545P3852l06649K12299j55200Q9807k3839Q762B33770
$$ 672936 637333 586125 751670 825522 518873 731172 575972 665779 641940 650702 233770
14755E68937L6844p3153J3801J38260k26720M82079D16034J61022J01352m0203
$$ 568937 605781 532628 546429 684689 457969 940048 416034 577056 678408 638205
14745F38205N5649P6586l45112L33566n8400J51160J31471J20028j51960k11598
$$ 638205 693854 770440 425328 758894 700494 851654 983125 1103153 951193 739595
14735G39595P8089J88110j40730J24159K37236j71542N36184N25157n60000M71176
$$ 739595 817684 1005794 865064 989223 1226459 1054917 1591101 2116258 1556258 2027434
14725B027434o0238p70802J31185j49946k70168N8265m3673L4181q0437K82902
$$ 2027434 1967196 1196394 1327579 1177633 907465 965730 922057 956238 875801 1158703
14715A158703j48452q9364K57589l07818L91327n16150N11287k73749J94162k21220
$$ 1158703 1010251 920887 1178476 870658 1261985 745835 1257122 983373 1177535 956315
14705I56315J75080J72693J99845j60896L88214L76854k22957o8372o40397l4633
$$ 956315 1131395 1304088 1503933 1343037 1731251 2108105 1885148 1816776 1176379 1141746
14695A141746j30456O0610m69698L66954K10626k73644R9066j00675L1538k21453
$$ 1141746 1011290 1071900 602202 969156 1179782 906138 1005204 904529 936067 714614
14685G14614K42174L2190m9540p3071L91749n0684j45149k62320J95738o4506
$$ 714614 956788 988978 939438 866367 1258116 1207432 1062283 799963 995701 931195
14675I31195k5400K04786k96226K36136J39751l03588Q0109q0431k93643P08983
$$ 931195 905795 1110581 814355 1050491 1190242 886654 966763 886332 592689 1301672
14665A301672n5780l20504K66067n3424J33018j64525k64873K17094O6774j15384
$$ 1301672 1245892 925388 1191455 1138031 1271049 1106524 841651 1058745 1125519 1010135
14655A010135R8296L41573j23022k1159J05150r5422j64827J20775j88897K76167
$$ 1010135 1108431 1450004 1326982 1305823 1410973 1315551 1150724 1271499 1082602 1358769
14645A358769k81413L7504J05416m0242R574M31480l15456J5159j63605K44927
$$ 1358769 1077356 1114860 1220276 1180034 1189608 1621088 1305632 1320791 1157186 1402113
14635A402113n2915j66850k27754K28243m0173J23962J95597j25171j77100R2888
$$ 1402113 1349198 1182348 954594 1182837 1142664 1266626 1462223 1337052 1159952 1252840
14625A252840L11811m89839k3668J15691N8790j35593J11010J56163J77292j28690
$$ 1252840 1564651 1074812 1051144 1166835 1225625 1090032 1201042 1357205 1534497 1405807
14615A405807L8931K95691l50229J35862q1383k37743M51657l59717J52511M5183
$$ 1405807 1444738 1740429 1390200 1526062 1444679 1206936 1658593 1298876 1451387 1496570
14605A496570J04712j12053K00177l8859R5726m25531O7137K18354J6272M92291
$$ 1496570 1601282 1489229 1689406 1650547 1746273 1320742 1387879 1606233 1622505 2114796
14595B114796k84510m4893M1054j12008K36887j3358j61421n228J00802k64014
$$ 2114796 1830286 1785393 1826447 1714439 1951326 1937968 1776547 1771319 1872121 1608107
14585A608107L24753l10968M96409m93218K51989M06216n42225L26716j0022j88568
$$ 1608107 1932860 1621892 2118301 1625083 1877072 2283288 1741063 2067779 2057757 1869189
14575A869189M37382l88626J15973J59386k70873J40124M09533l39480M70732
$$ 1869189 2306571 1917945 2033918 2193304 1922431 2062555 2472088 2132608 2603340
14566B603340j08535p5621K40711j8031p9030K29117k03288J47273K22672p0511
$$ 2603340 2494805 2419184 2659895 2641864 2562834 2791951 2588663 2735936 2958608 2888097
14556B888097K96206J12077J38561L73197M94851O80217L29367K323630M400223
$$ 2888097 3184303 3296380 3434941 3808138 4302989 4983206 5312573 7636203 12036426
14547A2036426P817086J5993433J2735000B1005453H264170D105420j195585Q2445
$$ 12036426 19853512 35846945 48581945 21005453 8264170 4105420 2909835 2992280
14539B992280J59997J141981J247859k404584o59354j53285m3834j56308k69416
$$ 2992280 3152277 4294258 5542117 3137533 2478179 2324894 2281060 2124752 1855336
14530A855336L88817J97280k12410j24735N55692k20750l58553L22108l440J48144
$$ 1855336 2244153 2441433 2229023 2104288 2659980 2439230 2080677 2402785 2399345 2547489
14520B547489J81818P0257n20363O01200j18842m68556N64805p7585k49562L95747
$$ 2547489 2729307 2799564 2279201 2880401 2761559 2293003 2857808 2780223 2530661 2926408
14510B926408j58144j91774Q4478K66018K10517O9668j31999K30775j81821K99116
$$ 2926408 2768264 2576490 2660968 2926986 3137503 3207171 3075172 3305947 3124126 3423242
14500C423242l69482K35575Q6167q4758k3462J0487J7698J98320n6632j2451L96185
$$ 3423242 3053760 3289335 3375502 3290744 3267282 3277769 3295467 3493787 3437155 3424704 3820889
14489C820889p043l33928M64779p30115O21609Q5413k59000K85811j23662J65386
$$ 3820889 3813846 3479918 3944697 3214582 3836191 3921604 3662604 3948415 3824753 3990139
14479C990139j8821n8870L87491j84602K70475n3145k93254L14904k30222L65215
$$ 3990139 3971318 3912448 4299939 4115337 4385812 4332667 4039413 4354317 4124095 4489310
14469D489310q4533K56244J99167L8135m63473n968K31824O0387M53956k03502
$$ 4489310 4404777 4661021 4860188 4898323 4434850 4428882 4660706 4721093 5175049 4971547
14459D971547J60964p019M78712m99906R6782K50342j10470P8680J38340l3211
$$ 4971547 5132511 5125492 5604204 5104298 5201080 5451422 5340952 5419632 5557972 5524761
14449E524761l36855L67050K57194J85446j36714o3180L06707K92621j64394J18764
$$ 5524761 5187906 5554956 5812150 5997596 5860882 5797702 6104409 6397030 6232636 6351400
14439F351400K4204J41381k14758M89366l94310N46152k38085L50075k2878M82334
$$ 6351400 6375604 6516985 6302227 6791593 6397283 6943435 6705350 7055425 7032547 7514881
14429G514881r3987j70460K31587o376J89752l38778P30332N1660n4514k2770
$$ 7514881 7420894 7250434 7482021 7475645 7665397 7326619 8056951 8108611 8054097 8031327
14419H031327Q23041K91695n83693L86540Q7641k08086J32519l9737O84375n1743
$$ 8031327 8854368 9146063 8562370 8948910 9036551 8828465 8960984 8921247 9605622 9553879
14409I553879J06066n7238M65462K98083K48971P2488r60j44901L76522j69874
$$ 9553879 9659945 9602707 10068169 10366252 10615223 10687711 10686751 10541850 10918372 10748498
14399A0748498M01848P5144M34077J45378J08824j08662J59373L96532J47088
$$ 10748498 11150346 11225490 11659567 11804945 11913769 11805107 11964480 12361012 12508100
14390A2508100K27066M07601K35265L18950P2874L31211K49965M06329K80899
$$ 12508100 12735166 13142767 13378032 13696982 13769856 14101067 14351032 14757361 15038260
14381A5038260Q2244L48130L48323M10025K2686J61067J9118O03435L35569j3784
$$ 15038260 15120504 15468634 15816957 16226982 16249668 16410735 16429853 17033288 17368857 17355073
14371A7355073P54704K68273N89700L58393M19554K09093R43696L56129j53128
$$ 17355073 18109777 18378050 18967750 19326143 19745697 19954790 20898486 21254615 21101487
14362B1101487O88130J92760L80814N37411N21213R31322J8092O79661Q32520
$$ 21101487 21789617 21982377 22363191 22900602 23421815 24353137 24371229 25050890 25883410
14353B5883410O35080L34994J011997L28124P97235K75140Q72215J254785N13295
$$ 25883410 26518490 26853484 27865481 28193605 28990840 29265980 30138195 31392980 31906275
14344C1906275P86139R18621N99578R88505J160080J058767P92200J468458J419413
$$ 31906275 32692414 33611035 34210613 35199118 36359198 37417965 38210165 39678623 41098036
14335D1098036O58943J530444J452244J177661J202138J436921J248920J732486
$$ 41098036 41756979 43287423 44739667 45917328 47119466 48556387 49805307 51537793
14327E1537793J978111J318752J964468K187188J776479K448751J942271K571189
$$ 51537793 53515904 54834656 56799124 58986312 60762791 63211542 65153813 67725002
14319F7725002K215794K477831K650414K431844L299051K651597L175190L661037
$$ 67725002 69940796 72418627 75069041 77500885 80799936 83451533 86626723 90287760
14311I0287760L784824L466480M403305M216571M561087M779331M972453N441752
$$ 90287760 94072584 97539064 101942369 106158940 110720027 115499358 120471811 125913563
14303A25913563N833661N979797O344045P179938P017506P892267Q076660Q318037
$$ 125913563 131747224 137727021 144071066 151251004 158268510 166160777 174237437 182555474
14295A82555474R318938R531333J0150273J0605637J1395104J1745698J2312479
$$ 182555474 191874412 201405745 211556018 222161655 233556759 245302457 257614936
14288B57614936J2875430J3724897J3830491J4753762J4891389J5109666J5436931
$$ 257614936 270490366 284215263 298045754 312799516 327690905 342800571 358237502
14281C58237502J5162257J5213439J4590491J4026482J3263596J2028003J1032797
$$ 358237502 373399759 388613198 403203689 417230171 430493767 442521770 453554567
14274D53554567R447541O058337J120732m05680R57361J683180l215656m516443
$$ 453554567 463002108 469060445 470181177 469775497 470732858 472416038 469200382 464683939
14266D64683939p307252r861630j1543603j2768489j4361656j5566751j5563463
$$ 464683939 457376687 447515057 435971454 423202965 408841309 393274558 377711095
14259C77711095j6223454j6278260j6016000j6245230j5470308j4469597j4380817
$$ 377711095 361487641 345209381 329193381 312948151 297477843 283008246 268627429
14252B68627429j3606853j3055770j2342509j1513028r578868j0069315j0358640
$$ 268627429 255020576 241964806 229622297 218109269 208530401 198461086 188102446
14245A88102446q934073q649911q116358p604486p245821o812976o509878o028291
$$ 188102446 179168373 170518462 162402104 154797618 147551797 140738821 134228943 128200652
14237A28200652n228576n539844n083747m835514m490724m281056l644825l682466
$$ 128200652 122972076 117432232 112348485 107512971 103022247 98741191 95096366 91413900
14229I1413900l703119l161148l700147k938041k744704k906301k704054k413090
$$ 91413900 87710781 84549633 80849486 77911445 75166741 72260440 69556386 67143296
14221F7143296k166354k231807j810291k469472k055637j649630j816501j522811
$$ 67143296 64976942 62745135 60934844 58465372 56409735 54760105 52943604 51420793
14213E1420793p35221k241484j770815j137803j548608r90283p33939r89057j381644
$$ 51420793 50685572 48444088 46673273 45535470 43986862 42996579 42262640 41273583 39891939
14204C9891939j286501j489262o06979r80677o39569j231235j032845q88707m47487
$$ 39891939 38605438 37116176 36509197 35528520 34888951 33657716 32624871 31736164 31288677
14195C1288677r02583q72204k87979q86491j104580k84783p82778o74304k46500
$$ 31288677 30386094 29513890 29225911 28339420 27234840 26950057 26167279 25492975 25246475
14186B5246475r97543n36948m19824l42844q26816J62028n25553q40753l98691
$$ 25246475 24248932 23711984 23292160 22949316 22122500 22284528 21758975 20918222 20519531
14177B0519531n62577m85338k44884l14190n39329j31132m90762m8980r22599
$$ 20519531 19956954 19471616 19226732 18912542 18373213 18242081 17751319 17702339 16779740
14168A6779740l54601r5577l03227k74833q7185n91187k26707J38637o67599J06259
$$ 16779740 16425139 16329562 16026335 15751502 15664317 15073130 14846423 14985060 14317461 14423720
14158A4423720l77912k27867n07771N2290l27977N9621l87863n96171J39065k11226
$$ 14423720 14045808 13817941 13310170 13362460 13034483 13094104 12706241 12110070 12249135 12037909
14148A2037909j07828n31087k08865J26758l59534p2741o0782k90977o4316L0613
$$ 12037909 11930081 11398994 11190129 11316887 10957353 10884612 10823830 10532853 10468537 10499150
14138A0499150k68926p28705K41239j32331l13498j4533o334k27354k49434L62953
$$ 10499150 10230224 9501519 9742758 9610427 9296929 9282396 9276062 9048708 8799274 9162227
14128I162227l74287j85930m7821o4967m92849M03787r1051l85095n3216m0143
$$ 9162227 8787940 8602010 8554189 8489222 7996373 8400160 8309109 7924014 7870798 7830655
14118G830655l45389J50156n51202L59706p4438k05768J93900m36151K06344l09389
$$ 7830655 7485266 7635422 7084220 7443926 7369488 7163720 7357620 6921469 7127813 6818424
14108F818424K05880m82928j89038L52687m62391K04662j84148J11749J81050
$$ 6818424 7024304 6541376 6352338 6705025 6242634 6447296 6263148 6374897 6555947
14099F555947n56677K02897l47132k7064n4641o4722J19468j03299l84412J56581
$$ 6555947 5999270 6202167 5855035 5827971 5773330 5708608 5828076 5724777 5340365 5496946
14089E496946P9987k20428o2714j66233m042k79155M07151k35822j99584n9613
$$ 5496946 5576933 5356505 5293791 5127558 5123516 4844361 5251512 5015690 4816106 4756493
14079D756493J55095M2424N973J21442l77864O691j33361q7214J96606j19595
$$ 4756493 4911588 4954012 4959985 5081427 4703563 4710254 4576893 4489679 4686285 4566690
14069D566690l13486K77254k61138k18073L24547k78437q0229k02300J60777J59483
$$ 4566690 4253204 4530458 4269320 4051247 4375794 4097357 4017128 3814828 3975605 4135088
14059D135088k80721K92981n9063j18245K01355j70476m34096J52226J41453l93895
$$ 4135088 3854367 4147348 4088285 3970040 4171395 4000919 3566823 3719049 3860502 3466607
14049C466607m371Q4248j02019q2339r575q9325j93972L48828j34149l29239N66198
$$ 3466607 3462236 3546484 3444465 3362126 3352551 3263226 3069254 3418082 3283933 2954694 3520892
14038C520892l50625K0162l75057R4612K04812j20949M23428l42046j23513J43375
$$ 3520892 3170267 3190429 2815372 2909984 3114796 2993847 3417275 3075229 2951716 3095091
14028C095091k9450m0557J58996O8339j11556k26257k01487J00303K36652l58069
$$ 3095091 3065641 3025084 3184080 3252419 3140863 2914606 2713119 2813422 3050074 2692005
14018B692005Q1649j85882j23050K3530R7575r9789R236J62343n7015l97830J16055
$$ 2692005 2773654 2587772 2464722 2488252 2585827 2486038 2495274 2657617 2600602 2202772 2318827
14007B318827M84499l14213k49885K31673O1009m08121P232M26540m05275Q0641
$$ 2318827 2803326 2489113 2239228 2470901 2531910 2123789 2131021 2557561 2152286 2232927
13997B232927J05389l03704o4220J15727K00214q6525K79024L82927N16730K842949
$$ 2232927 2338316 2034612 1970392 2086119 2286333 2199808 2478832 2861759 3378489 6221438
13987F221438O743586J4739866K1307356j9232870A3598060n455631j990230j375244
$$ 6221438 12965024 27704890 49012246 29779376 13598060 8142429 6152199 4776955
13979D776955p96361n52752k711k00797m84317L17410k97939J42417l63398K86722
$$ 4776955 3980594 3427842 3425131 3224334 2740017 3057427 2759488 2901905 2538507 2825229
13969B825229k47470j38055J13543r3124k41604n7208r1546K5276j23753N60927
$$ 2825229 2577759 2439704 2553247 2460123 2218519 2161311 2069765 2095041 1971288 2532215
13959B532215k46421k07442K04031k78001j54767N4804q3529O7458j87678K23533
$$ 2532215 2285794 2078352 2282383 2004382 1849615 1904419 1820890 1888348 1700670 1924203
13949A924203K26199q1503l70614K90027j16307N2190J53937q4973p6051J46820
$$ 1924203 2150402 2068899 1698285 1988312 1872005 1924195 2078132 1993159 1917108 2063928
13939B063928k66197k71852K22858Q3865o5510j4680j57686K58355k89663K8210
$$ 2063928 1797731 1525879 1748737 1832602 1767092 1752412 1594726 1853081 1563418 1591628
13929A591628n3296j55902N4688O6847J99761J697j70414q0151R7416k79671J5769
$$ 1591628 1538332 1382430 1437118 1503965 1703726 1705423 1535009 1454858 1552274 1272603 1288372
13918A288372J70978j42358J28808l5083R096J87316j92577L34494j79432k47527
$$ 1288372 1459350 1316992 1445800 1410717 1419813 1607129 1414552 1749046 1569614 1322087
13908A322087J12784J54548k60125L65875j03733l42170R4626J54891l7308j56721
$$ 1322087 1434871 1589419 1329294 1695169 1591436 1249266 1343892 1498783 1461475 1304754
13898A304754j08154r9536K65866p4902k73900K05561N5103p4571j93720J85468
$$ 1304754 1196600 1097064 1362930 1288028 1014128 1219689 1274792 1200221 1006501 1191969
13888A191969J50643k79002J7798K49538k30357K50938L6838l40194L20897l45883
$$ 1191969 1342612 1063610 1081408 1330946 1100589 1351527 1388365 1048171 1369068 1023185
13878A023185J7458L8576k13842M44713l75977K25958J00597j76004n6459O2798
$$ 1023185 1040643 1079219 865377 1310090 934113 1160071 1260668 1084664 1028205 1091003
13868A091003j39797K20536j3813K6081l0260k95356J33104j16235K72199o5177
$$ 1091003 951206 1171742 1157929 1184010 1153750 858394 991498 875263 1147462 1082285
13858A082285j07962k84041K51396K0128L9082J78530j98681j72685J47625J17061
$$ 1082285 974323 690282 941678 961806 1000888 1179418 980737 808052 955677 1072738
13848A072738K27377m7517k85195J19181o8513k8628J39476p535k15333J99860
$$ 1072738 1300115 1252598 967403 1086584 1018071 989443 1128919 1121384 906051 1105911
13838A105911j29756n6300J11174k1397j97640M69474n94325J19122K57534j37519
$$ 1105911 976155 919855 1031029 1009632 811992 1281466 687141 806263 1063797 926278
13828I26278J66719l07725L07225j94396j64617r8460K88794Q9273m5685M7837
$$ 926278 1092997 785272 1092497 898101 733484 635024 923818 1013091 967406 1015243
13818A015243j2860l67581J91650J10199l46729O0761L72881P6002k16759j08395
$$ 1015243 1002383 634802 826452 936651 589922 650683 1023564 1099566 882807 774412
13808G74412J87366k81220r0965L58040p6112j19095l7813J76519L8479j41155
$$ 774412 961778 680558 589593 947633 871521 752426 714613 891132 929611 788456
13798G88456l75464L02263K36699n1123r8955j06157k54165N19844l91990J97626
$$ 788456 412992 715255 951954 900831 801876 695719 441554 961398 569408 767034
13788G67034j63203K26880C31871M69397K24642K8005j78037m01948M91898l24568
$$ 767034 603831 830711 331871 801268 1025910 1053915 875878 473930 965828 641260
13778F41260j58224K97934j68888K22163j81333j87048J00627M07396D80326K17320
$$ 641260 483036 780970 612082 834245 652912 465864 566491 973887 480326 697646
13768F97646r8888j55519K66157k08064M7284m8630J41460M26563B93167K04383
$$ 697646 598758 443239 709396 501332 548616 499986 641446 1068009 293167 497550
13758D97550J21114K60483m0064j21263j21161K9215A69251L97925J08751n2266
$$ 497550 618664 879147 839083 717820 596659 625874 169251 567176 675927 623661
13748F23661k21750L23451p2586j72093L28668j56190C22147M89180j30886m6128
$$ 623661 401911 725362 652776 480683 809351 653161 322147 811327 680441 634313
13738F34313J78389k13330j57374J00414K62314n4093l4090C38600J17192J75938
$$ 634313 812702 599372 441998 542412 804726 750633 716543 338600 455792 631730
13728F31730K0259K3517j94163M6245j43959K32029j49831N3693P8196A84207
$$ 631730 651989 675506 481343 527588 383629 615658 465827 519520 597716 184207
13717E70269r8046J78004j89221m3373J31672k8042l9490J56852J16390k66621
$$ 570269 472223 650227 461006 417633 549305 521263 481773 638625 755015 488394
13707D88394J57334r3215K77570B10551L46774j66468j09994K25937K8611J23063
$$ 488394 645728 552513 830083 210551 557325 390857 280863 506800 535411 658474
13697F58474j33502B01593K31243j21755J90495j80320O2321K22272p6022R0795
$$ 658474 524972 201593 432836 311081 501576 321256 383577 605849 529827 620622
13687F20622P5433k69208J17107k15511J46865L0881P3856j09054L19819C45560
$$ 620622 696055 426847 543954 328443 475308 506189 580045 470991 790810 345560
13676D99437J81131k62506O2197A83989K31480D6902Q17202m01617q6112J0313
$$ 499437 680568 418062 480259 183989 415469 46902 864104 462487 376375 386688
13666C86688j37158K80387j64172j27952o4349J67941L14943j52451q5568r1794
$$ 386688 249530 529917 365745 237793 173444 341385 656328 503877 418309 326515
13656C26515K54702k40635m5080Q1751Q815N8632A90888q5625M16395j24518Q93
$$ 326515 581217 340582 295502 377253 386068 444700 190888 105263 521658 397140 398033
13645C98033M138J17765J9028A73492K66968j2602j03500q5644m9238N19244a91692
$$ 398033 402171 519936 538964 173492 440460 427858 324358 238714 189476 708720 -191692
13633C08051R4790K4698B08544K79695l2482j46328A07942L27220j19347N4725
$$ 308051 402841 427539 208544 488239 455757 309429 107942 435162 315815 370540
13623C70540P30Q6790J8645k19864l6943G3167J4510J50743R9132L7209J20975
$$ 370540 371270 458060 476705 256841 219898 73167 87677 238420 337552 374761 495736
13612D95736j18425j23767F7887J87956J53462o2124o119l1954j564J54606M0968
$$ 495736 377311 253544 67887 255843 409305 347181 341062 309108 307544 462150 503118
13601E03118q4586Q7195r403k30000K00178j42561K87052l00766L3998J70643
$$ 503118 418532 505727 496324 266324 466502 323941 610993 310227 344225 514868
13591E14868j55628A73622K37163k8660j04730J04647j8431j23745l530F0617
$$ 514868 359240 173622 410785 382125 277395 382042 363611 239866 236336 60617
13580C77443k2761P1392o7918o2863N01176a06883C26823K63705A06750K61316
$$ 377443 354682 426074 358156 295293 796469 -106883 326823 590528 106750 368066
13570C68066A2562K0166O5628K26965k2860F5440L06989j22444R7467J68376J38217
$$ 368066 12562 32728 98356 325321 302461 65440 372429 249985 347452 515828 654045
13559F54045l13694j9649N6700Q3366l1497K3433j91650m1098o3403L83518j59697
$$ 654045 340351 320702 377402 460768 429271 452704 261054 219956 156553 540071 380374
13548C80374R4813j60573r7421o1722N3601Q9838D9317N19548B17096L0677O7867
$$ 380374 475187 314614 217193 155471 209072 298910 49317 568865 217096 247773 315640
13537C15640K41112B49647j14722R5309J36437j07722n6408K48223A86151E2267
$$ 315640 556752 249647 134925 230234 366671 258949 202541 450764 186151 52267
13526D71002j36279l5271j27288K44293A53894a03505B69313A09559c0760B9700
$$ 471002 334723 299452 172164 416457 153894 -103505 269313 109559 -30760 29700
13515C14613a14A97094L819K47588p1840r4548r5602E7463G967N42280H488J39577
$$ 314613 -114 197094 200913 448501 376661 282113 186511 57463 7967 550247 8488 148065
13503A48065J95632L85944k60702r9478J83582a00322b276B65025N1024R6108
$$ 148065 343697 729641 468939 369461 553043 -100322 -2276 265025 316049 412157
13493D12157A79840O1639c7405A14924O6467K19533j99144J42836l7858m8158
$$ 412157 179840 241479 -37405 114924 181391 400924 201780 344616 306758 258600
13483B58600R637I0927J54309E7615J37668C2307M58994r008j05304b5093A66804
$$ 258600 268237 90927 245236 57615 195283 32307 491301 482293 376989 -25093 166804
13471b38548B20008Q4932K99529B8069O6290K82428n3791O8982A03637k0374L73552
$$ -238548 220008 304940 604469 28069 94359 376787 322996 391978 103637 83263 456815
13460D56815H6202j9331b35946G1022K36434O672q7208M6409r3090E3530a01437
$$ 456815 86202 66871 -235946 71022 307456 314128 226920 273329 180239 53530 -101437
13448H230J48514C6278d4688A88288F1980K04125A28832I561a3856C3456e8297
$$ 8230 156744 36278 -44688 188288 61980 266105 128832 9561 -13856 33456 -58297
13436C48482E4055J83273o571j494H4786K32146a65385G7521J46671K0284h4790
$$ 348482 54055 237328 230757 229263 84786 316932 -165385 77521 224192 244476 -84790
13424A27821d7637D20026r5091d18955A80584N1519a16278D21858j13870a15439
$$ 127821 -47637 420026 324935 -418955 180584 232103 -116278 421858 307988 -115439
13413D18165A53349L3936J9457F4574O418a2775G1485M20049k43344B6232J60391
$$ 418165 153349 187285 206742 64574 70992 -12775 71485 491534 248190 26232 186623
13402A86623J21648M3775G7939J84513O4418J00881A86194b7398B69481h7711
$$ 186623 308271 352046 77939 262452 326870 427751 186194 -27398 269481 -87711
13391D56J49114C1672K81688J34515B19261k5389H9306L50936F7989J14658l5749
$$ 456 149570 31672 313360 447875 219261 193872 89306 440242 67989 182647 146898
13380A46898Q2943P3176F7877k3147A0270a06052B86595F9886L37702J4225B4805
$$ 146898 229841 303017 67877 44730 10270 -106052 286595 69886 407588 421813 24805
13368F0400J19190K34520j79267j14223K29627m7124C3399J38428m6718a50090
$$ 60400 179590 414110 234843 120620 350247 303123 33399 171827 125109 -150090
13357A67867A3356L04876j00930C7675P474N5800Q3648M667M4087N0892Q0677
$$ 167867 13356 318232 217302 37675 45149 100949 184597 189264 233351 284243 364920
13346C64920q0903j36937J00279A6824L66049B4146N80934j58496j10976J20402
$$ 364920 284017 147080 247359 16824 382873 24146 605080 446584 335608 456010
13336D56010j7517j55143J02280R4586k2256D2282K69515A36749a09083A57054
$$ 456010 438493 283350 385630 480216 457960 42282 311797 136749 -109083 157054
13325E39939j76152B9448J20853P0305a08273B03414m1293J53218r8043j0550
$$ 539939 363787 29448 150301 220606 -108273 203414 162121 315339 217296 206746
13315B06746f6067A15825K58785o0472b5309D99604B01704J5207E5134a81658
$$ 206746 -66067 115825 374610 314138 -25309 499604 201704 216911 55134 -181658
13304G514J92678I6791J74482j7808J16894j13516J15457d10249B94709A37589
$$ 7514 200192 96791 271273 253465 370359 256843 372300 -410249 294709 137589
13293I6863J0529K36430i8155D09816f9646D24106h8513E3466L4935K86108a17213
$$ 96863 107392 343822 -98155 409816 -69646 424106 -88513 53466 88401 374509 -117213
13281D1035L76224A75602K69508D6120J97008j3014j01358J04518f3736o2170
$$ 41035 417259 175602 445110 46120 243128 230114 128756 233274 -63736 -125906
13271a25906C44895K498h856A33729c0590C36749G5663a45525A236J70872h2077
$$ -125906 344895 347393 -8856 133729 -30590 336749 75663 -145525 1236 172108 -82077
13259a25496B10574B0093J44789K78942b7985I2946J54325L3667J47434j85823
$$ -125496 210574 20093 164882 443824 -27985 92946 247271 280938 428372 242549
13249B42549a30063j09641A99534D3321O925K48447J52576C0984J74249B7272
$$ 242549 -130063 -239704 199534 43321 50246 298693 451269 30984 205233 27272
13238E3764l024K09155k3141E0262g6939B9125a5586F3379L7722J32194d2795
$$ 53764 50740 259895 236754 50262 -76939 29125 -15586 63379 101101 233295 -42795
13226B36079G0912m348J7145j9834L22889j18057m6672p2109a34355A70559o8693
$$ 236079 70912 66564 83709 63875 386764 268707 222035 149926 -134355 170559 101866
13215A01866K4814g5860A0069d8988j7200A65984K10370A36646K87945A45869
$$ 101866 126680 -75860 10069 -48988 -66188 165984 376354 136646 424591 145869
13204A35338f2110r8920B61589j27064b22318a00787G4134L0019P9030J13246
$$ 135338 -62110 -161030 261589 134525 -222318 -100787 74134 104153 183183 296429
13194B96429O1713b19566N9329K644A25136f6113G0816K8356J74591I8182a43216
$$ 296429 358142 -219566 -160237 -157593 125136 -66113 70816 99172 273763 98182 -143216
13182C64436a05837A34172K1595e0543B17024d7305F3741b32089F4148L29811
$$ 364436 -105837 134172 155767 -50543 217024 -47305 63741 -232089 64148 393959
13172C93959l8107j56918A7927N4076B6632I731N3575R0114J83209a66841f7854
$$ 393959 355852 198934 17927 72003 26632 9731 63306 153420 336629 -166841 -67854
13160a2859k24077a4750H1320J9342J5758b7532q4356A52117k8127f9688r8556
$$ -12859 -236936 -14750 81320 100662 116420 -27532 -111888 152117 123990 -69688 -168244
13149a68244B52161f3711B58105A03902a1534A6159e3002p7174F9131J31807P6757
$$ -168244 252161 -63711 258105 103902 -11534 16159 -53002 -130176 69131 200938 277695
13138B77695N292I5586a9624A26009C3209L62452I4773M9150P1369K43925A90904
$$ 277695 282987 95586 -19624 126009 33209 395661 94773 143923 215292 459217 190904
13126A40516J2622b10195k41244E4577J00655K8115a35516B44821f1715G4013
$$ 140516 153138 -210195 -451439 54577 155232 183347 -135516 244821 -61715 74013
13115a21125I6217A7443R8390J78896j12405o1109h5954I7895K06099a32968C99434
$$ -121125 96217 17443 115833 294729 182324 121215 -85954 97895 303994 -132968 399434
13103E3679F133J82818P8589G0553a2450A2758K15668K810a91864A4009D679d6706
$$ 53679 6133 188951 267540 70553 -12450 12758 228426 231236 -191864 14009 4679 -46706
13090B7804J05965c4038p1431A00686b23908C854K6106c1685I6960i3494C9711
$$ 27804 133769 -34038 -105469 100686 -223908 3854 29960 -31685 96960 -93494 39711
13078A88047e2228J198E4384J61654D7223J87588P217q3113D8706J14040b1613
$$ 188047 -52228 -51030 54384 216038 47223 234811 242028 158915 48706 162746 -21613
13066A49083j5196J3402l5722L90599a55628g0774A44008n7830K61293H5912a7392
$$ 149083 133887 147289 111567 502166 -155628 -70774 144008 86178 347471 85912 -17392
13054a88935B36472p2839J76771b2970k4703B54541m4985h0800A24965d916B31224
$$ -188935 236472 163633 340404 -22970 -47673 254541 209556 -80800 124965 -4916 231224
13042B83016a79427D8343A5720K42519A22715M6000b28128e3719E07194b34708
$$ 283016 -179427 48343 15720 258239 122715 168715 -228128 -53719 507194 -234708
13031i2159j48068F0949J90379l0472j08875b56080E0804h140A39465Q6483q6840
$$ -92159 -240227 60949 251328 220856 111981 -256080 50804 -8140 139465 225948 139108
13020A39108k827a24123C0533d7920F9861P6197a05113C33802e7589C83266I8189
$$ 139108 136281 -124123 30533 -47920 69861 146058 -105113 333802 -57589 383266 98189
13008E2115b38466C06298G0337h844A45663F2389a17588K4008A42683J57440E3708
$$ 52115 -238466 306298 70337 -8844 145663 62389 -117588 -93580 142683 300123 53708
12996i7520a626G8862K34624c43729H1933N08097B032a55672P558C33041d3392
$$ -97520 -1626 78862 313486 -343729 81933 590030 2032 -155672 -148114 333041 -43392
12984C36233c6502A32668b78607A87076l1182A3833a2710H4709h1763K3878A97269
$$ 336233 -36502 132668 -278607 187076 155894 13833 -12710 84709 -81763 -57885 197269
12972A5220Q5105J5059j4593D2513L61921d1739B4531C466a04229B4481d503j28415
$$ 15220 100325 115384 100791 42513 404434 -41739 24531 3466 -104229 24481 -4503 -132918
12960a32918d2126B15810b0030r9074p2028A63875M6844r2927a37871A89247b39517
$$ -132918 -42126 215810 -20030 -119104 -191132 163875 210719 117792 -137871 189247 -239517
12948D5541R895F122a52429B1830a12734j23979A71303b90475A66134a40652A57058
$$ 45541 55436 6122 -152429 21830 -112734 -236713 171303 -290475 166134 -140652 157058
12936B45531l8372H7072d01535q494A15682J62773A37369l2931d5488m1089j53271
$$ 245531 207159 87072 -401535 -410029 115682 278455 137369 104438 -45488 -86577 -239848
12925b39848b2001I993M391J39280Q6320a11516L9773A67074n4711e3793I0065
$$ -239848 -22001 9993 14384 153664 239984 -111516 -71743 167074 112363 -53793 90065
12913D16124a52335r6605L4123A31923D7151a05420m7114C5567R8243J71282a71256
$$ 416124 -152335 -248940 -214817 131923 47151 -105420 -152534 35567 133810 305092 -171256
12901a23785A68093g1803h704C5386J33845b83445A64897C1266a90345a8585j76934
$$ -123785 168093 -71803 -8704 35386 169231 -283445 164897 31266 -190345 -18585 -195519
12890a95519N9400G0813g3804j58989C5700d6105C62962C5127i6595B33407n5560
$$ -195519 -136119 70813 -73804 -232793 35700 -46105 362962 35127 -96595 233407 177847
12879A77847f0224n0141J3629A80963f3976j62070A20720e3315A20000g5021Q974
$$ 177847 -60224 -110365 -96736 180963 -63976 -226046 120720 -53315 120000 -75021 -66047
12868f6047A78165e1020B78894D9691K4890Q2006L55929B25200a50451e2702j40079
$$ -66047 178165 -51020 278894 49691 74581 156587 512516 225200 -150451 -52702 -192781
12857a92781A88190c10231A55627a15784B83073A2212i3552a2375k12408f2857
$$ -192781 188190 -310231 155627 -115784 283073 12212 -93552 -12375 -224783 -62857
12846i5190m7009j9751E3897A1508K85547c5693k15483I6833b17728e8693l97837
$$ -95190 -142199 -161950 53897 11508 297055 -35693 -251176 96833 -217728 -58693 -456530
12835d56530b7987H9344R5949o5919J23550L106c46553a68075B35588b35457a5206
$$ -456530 -27987 89344 185293 119374 242924 246030 -346553 -168075 235588 -235457 -15206
12823C283b6402G3118C4056c3562B80643j39219a96640A91495B3684c7678h588
$$ 3283 -26402 73118 34056 -33562 280643 141424 -196640 191495 23684 -37678 -8588
12811A26033C955b36788K4883B271l75a27264N7321k11438J19792j22764A22658
$$ 126033 3955 -236788 -211905 2271 1896 -127264 -69943 -281381 -161589 -284353 122658
12799h8209m0358A35887g3547k01378e0511B69718J66786E3034a94651p7000A3247
$$ -88209 -128567 135887 -73547 -274925 -50511 269718 436504 53034 -194651 -271651 13247
12787B00312g9465o7030B18868J96104A1903a79799O3500A71617e94F9517a98592
$$ 200312 -79465 -146495 218868 414972 11903 -179799 -116299 171617 -594 69517 -198592
12775a13178E6444N1873a12024D6512h1008A02233f6039K322A3600a2826H2311
$$ -113178 56444 108317 -112024 46512 -81008 102233 -66039 -63717 13600 -12826 82311
12763A4912K25901d9736B5378F622J7718L90017D3612a72056A65875o9467A5133
$$ 14912 240813 -49736 25378 6622 24340 414357 43612 -172056 165875 96408 15133
12751b46354M453A20902E7244e41445A47685b6701B8844a63808o8374J08317C18908
$$ -246354 -241901 120902 57244 -541445 147685 -26701 28844 -163808 -232182 -123865 318908
12739I8779C9542b23580a5660D4442J53925a94846A9742a6390l1604B88351p3493
$$ 98779 39542 -223580 -15660 44442 198367 -194846 19742 -16390 -47994 288351 214858
12728B14858Q5162b46253I9578L6603a105q1334B57000G5537A0781N15674a71900
$$ 214858 300020 -246253 99578 136181 -1105 -82439 257000 75537 10781 526455 -171900
12716B74361o7164a2406j34602C38882c1831I1694a5410k0351B8925J14417L05276
$$ 274361 207197 -12406 -147008 338882 -31831 91694 -15410 -35761 28925 143342 448618
12705D48618b22877g3679C33651d6660K634B06392b7137A17976a17600A15806
$$ 448618 -222877 -73679 333651 -46660 -44026 206392 -27137 117976 -117600 115806
12694f5933j52542I1747J03476Q0294J04350c3234b834j46947M2677q7067A9152
$$ -65933 -218475 91747 195223 275517 379867 -33234 -2834 -149781 -107104 -194171 19152
12682i1280B86194L5981A44721n0206M8949J74903B9434i5367L7001B95126I2089
$$ -91280 286194 322175 144721 94515 143464 318367 29434 -95367 -58366 295126 92089
12670i2103I4210J32626c6960A08162c7702A35851J67519m3654H3304C6499J85998
$$ -92103 94210 226836 -36960 108162 -37702 135851 303370 259716 83304 36499 222497
12659B22497Q8756N956h3490B2360Q089J9893b05787B20652c1592a0733A14627
$$ 222497 311253 317209 -83490 22360 30449 50342 -205787 220652 -31592 -10733 114627
12647a84226k5599D3582Q51L05570D3807K29J31794a87089M2289N7932b2643B38371
$$ -184226 -209825 43582 44433 350003 43807 44036 175830 -187089 -144800 -86868 -22643 238371
12634C32639a93771H0135a0719A35896D9119J03179J76994a59729D29492B6715
$$ 332639 -193771 80135 -10719 135896 49119 152298 329292 -159729 429492 26715
12623A45327J48270A15722J01531l3861E7452e3177m2273M1147k5840L5472o4444
$$ 145327 293597 115722 217253 183392 57452 -53177 -95450 -54303 -80143 -44671 -109115
12612a09115G1920a88991D95698A81809l1321J6334J4575c8652F0522b41365O5136
$$ -109115 71920 -188991 495698 181809 150488 166822 181397 -38652 60522 -241365 -176229
12601a76229B28082j2218a6218B24583A0550a34392D4205K542c2854H7519M1745
$$ -176229 228082 215864 -16218 224583 10550 -134392 44205 46747 -32854 87519 129264
12590A29264K1348r496B8378r345Q4506K25598c5537A5657R1990a42042A07431
$$ 129264 150612 141116 28378 19033 103539 329137 -35537 15657 107647 -142042 107431
12578f8614A37725P5893r0282b85918i5261A42788a02779A8360K98242a13781
$$ -68614 137725 213618 123336 -285918 -95261 142788 -102779 18360 316602 -113781
12567h0822L886c4938A52812Q645b68270L6427b1459l34404A22563a18996C12875
$$ -80822 -76936 -34938 152812 161457 -268270 -231843 -21459 -355863 122563 -118996 312875
12555a91226k05855h8278A21759b05270A9213b51926a5716E4102h0914j97540
$$ -191226 -397081 -88278 121759 -205270 19213 -251926 -15716 54102 -80914 -278454
12545b78454A8333d05260N8769d2361A93535F3638J49730a09250N1864b4412k0908
$$ -278454 18333 -405260 -346491 -42361 193535 63638 213368 -109250 -57386 -24412 -45320
12534d5320k21199F1452K8509O0961K76385B6824L1174J53637R217c9856A14124
$$ -45320 -266519 61452 89961 150922 427307 26824 57998 211635 220852 -39856 114124
12522e3593H1409B5809A2455J42361f2539k32194D158J07361b51941E10817j44735
$$ -53593 81409 25809 12455 154816 -62539 -294733 4158 111519 -251941 510817 366082
12511C66082j47829N379g2724j22441b6579D06201A28640e4019K0604C78859i6161
$$ 366082 218253 223632 -72724 -195165 -26579 406201 128640 -54019 -33415 378859 -96161
12499C79530E9989a7636j12497e5527B07096J09712a71439j33933Q4879J9841
$$ 379530 59989 -17636 -130133 -55527 207096 316808 -171439 -305372 -220493 -200652
12489b00652l7633A4459e1807C67641A83405H8100B4982e306r0978A8861L7117
$$ -200652 -238285 14459 -51807 367641 183405 88100 24982 -5306 -96284 18861 55978
12478E5978L86948a15180B48507K55893A95135J02926r546d462D4278L09033h5980
$$ 55978 442926 -115180 248507 504400 195135 298061 288515 -4462 44278 353311 -85980
12466G4506K68751j62439n106b38870e806j48926g6142G028g5602L7558j37860
$$ 74506 343257 180818 175712 -238870 -5806 -154732 -76142 7028 -75602 -38044 -175904
12455a75904k29613B46946b69681c1898p3239A96776d27785G0276J17068h5534
$$ -175904 -405517 246946 -269681 -31898 -105137 196776 -427785 70276 187344 -85534
12444G8761e0783p206A72361a40756C37333J15445A56666N3285b48743a01962
$$ 78761 -50783 -57989 172361 -140756 337333 452778 156666 209951 -248743 -101962
12433D2715J06755F3327Q6752h6911j27952J04409A94032E4502a96936B28148
$$ 42715 149470 63327 150079 -86911 -214863 -110454 194032 54502 -196936 228148
12422D9112J7607a00709A11065a08470b2219g155o0039k3204l23080B4357a84176
$$ 49112 66719 -100709 111065 -108470 -22219 -7155 -67194 -90398 -413478 24357 -184176
12410f8939n6930D5989J24661f5050a3394n6174I0307K17144b55370K331a13178
$$ -68939 -125869 45989 170650 -65050 -13394 -69568 90307 307451 -255370 -253039 -113178
12398c45326A79735m3125j6444e8814F2698g7463G3486b82760A12187E235J14880
$$ -345326 179735 136610 120166 -58814 62698 -77463 73486 -282760 112187 5235 120115
12387A20115N1867k0947m2835h3159j76306E4996K09508k9227l966l8112g8252
$$ 120115 171982 151035 108200 -83159 -259465 54996 264504 235277 231311 193199 -78252
12375B53521J81053A5697L79856a21307D78884b1152j51228j153E5929i9138A13269
$$ 253521 434574 15697 395553 -121307 478884 -21152 -172380 -173533 55929 -99138 113269
12363A1650J63686G7947b23552C4284C198R8330c1529D3105a62741C67924a39762
$$ 11650 175336 77947 -223552 34284 3198 101528 -31529 43105 -162741 367924 -139762
12351e5494m7704d6929j54746j10218B28745a10185c3132B77897I6506a35184
$$ -55494 -103198 -46929 -201675 -311893 228745 -110185 -33132 277897 96506 -135184
12340a37173D31273H0235O330i3094F7753O6061J80618A55783J37385j1516B3633
$$ -137173 431273 80235 86565 -93094 67753 133814 314432 155783 293168 281652 23633
12328a00927A03304K03808b0774A13435A7474a99500C88095a9264N320B59058
$$ -100927 103304 307112 -20774 113435 17474 -199500 388095 -19264 -13944 259058
12317I0637K16090C1110Q4427c24472A18238a76684B25170b51498P999D7921h3489
$$ 90637 306727 31110 115537 -324472 118238 -176684 225170 -251498 -243499 47921 -83489
12305B40666J05399A57113a37825A66391h3405j51729i718j32026B43078H733
$$ 240666 346065 157113 -137825 166391 -83405 -235134 -9718 -141744 243078 8733
12294a28710F7394b34957A93863D574L61428j82888a4136A3573c33760A13250
$$ -128710 67394 -234957 193863 4574 366002 183114 -14136 13573 -333760 113250
12283C88834j76948H5492A8525K80869P9109i1925B61079A13369K84664a8777
$$ 388834 211886 85492 18525 299394 378503 -91925 261079 113369 398033 -18777
12272B09633F6132K18213H8562N7883J45256O9526l9200j33776g2740A5827a11350
$$ 209633 66132 284345 88562 146445 291701 361227 322027 188251 -72740 15827 -111350
12260A76425a45206B00168O6279r8879e190j01683A83211c3265A17997L31510
$$ 176425 -145206 200168 266447 167568 -5190 -106873 183211 -33265 117997 449507
12250D49507o5268j02723F0481a55769B79499o1023b78057J12480A02189b1571
$$ 449507 384239 281516 60481 -155769 279499 218476 -278057 -165577 102189 -21571
12239D3977J25955f9106A24902J74548j30023L1508M8333a23224A67176D2312
$$ 43977 169932 -69106 124902 299450 169427 200935 249268 -123224 167176 42312
12228A25094n029B6842a0087E4256O6398J47604k4139O4598j27970M5301l0209
$$ 125094 120065 26842 -10087 54256 120654 268258 244119 308717 180747 226048 195839
12217A95839K05180k5673N2100R5080I2383P5307M14822D4279g0217A29857c1704
$$ 195839 401019 375346 427446 522526 92383 167690 582512 44279 -70217 129857 -31704
12205B39000o2131J69822A16404K57800A48300k1616M52771F2051Q2572J05821
$$ 239000 176869 346691 116404 374204 148300 126684 579455 62051 144623 250444
12195B50444L31308A46117O4901A01735L36923N661j29663l4750J27618j44131
$$ 250444 581752 146117 211018 101735 438658 444319 314656 279906 407524 263393
12185B63393c4402A03107L50451j83937c09641A85903o7535K99392b0257A10605
$$ 263393 -34402 103107 453558 269621 -309641 185903 118368 417760 -20257 110605
12174A71861G1256j0678M75636k11167k2193K24018A68682L5149B6354L87669
$$ 171861 71256 60578 536214 325047 302854 526872 168682 203831 26354 414023
12164D14023r5076D7437d0149A87540D9055L70293A71392a19311I1715b4335H3317
$$ 414023 318947 47437 -40149 187540 49055 419348 171392 -119311 91715 -24335 83317
12152b60418B49686a75917A12919f7014A20133b50138a13956C1017b83891B92218
$$ -260418 249686 -175917 112919 -67014 120133 -250138 -113956 31017 -283891 292218
12141A33273J34754p7905b33300A24021a32878B4413K52300D6650O6148M1369
$$ 133273 268027 190122 -233300 124021 -132878 24413 276713 46650 112798 154167
12131A54167g300j61628P3796C09366o3583a58785C51986A39111L33480A69354
$$ 154167 -7300 -168928 -95132 309366 245783 -158785 351986 139111 472591 169354
12120a0639B36786K00601A35332J01890J8656K08958A25496C310K95742G4631
$$ -10639 236786 437387 135332 237222 255878 464836 125496 3310 299052 74631
12109I6374R590c56247a6367A51707F7101J73740o1067E7790Q2708i4463A99482
$$ 96374 105964 -356247 -16367 151707 67101 240841 179774 57790 140498 -94463 199482
12097A80528E441a46891M5722m4378C9729b7870F7439a65958P2050c2268C63855
$$ 180528 5441 -146891 -101169 -145547 39729 -27870 67439 -165958 -93908 -32268 363855
12085A39808J09963J66362l2384p6053a94294B10734G9491a57532A36402K20880
$$ 139808 249771 416133 383749 307696 -194294 210734 79491 -157532 136402 357282
12075C57282q5867o8535b36985B90385b35397G9916j9963L2565f5101A73124J09718
$$ 357282 271415 202880 -236985 290385 -235397 79916 59953 92518 -65101 173124 282842
12064B82842h1001B13054o1078b95741D6506K20925a12640r910C80588C1716R9280
$$ 282842 -81001 213054 151976 -295741 46506 267431 -112640 -122550 380588 31716 130996
12053A30996m3830A2257P7462L43001i810C88184i0069O989k13271A63968b06640
$$ 130996 87166 12257 89719 432720 -9810 388184 -90069 -83080 -296351 163968 -206640
12041a79728F5007b36594h2024L0404b1704A6424R3499g0530j10601B60672n0430
$$ -179728 65007 -236594 -82024 -51620 -21704 16424 109923 -70530 -181131 260672 210242
12030B10242c4241q1319k25272J03058A45779m8391g1771L4938A59025b70840
$$ 210242 -34241 -115560 -340832 -237774 145779 97388 -71771 -36833 159025 -270840
12019a90972E7139J44070b50618R6843D07869A58169a70215J2046H0521J50127
$$ -190972 57139 201209 -250618 -153775 407869 158169 -170215 -158169 80521 230648
12009B30648b49162A4535L77782H6883j4061i250C55657b33285A04386L01149
$$ 230648 -249162 14535 392317 86883 72822 -9250 355657 -233285 104386 405535
11999D05535b23709A05306m2327a50609C09166A44520L0400A2422a79242E0245
$$ 405535 -223709 105306 62979 -150609 309166 144520 174920 12422 -179242 50245
11988a30588A4261K15665H2304a17722b8262j20590j46153l0970R6038B41460
$$ -130588 14261 229926 82304 -117722 -28262 -148852 -295005 -325975 -229937 241460
11977C28219m5182e0247A88783b0247D874f091j82554F9374b78370B136a1021
$$ 328219 283037 -50247 188783 -20247 4874 -6091 -188645 69374 -278370 2136 -11021
11965H7964K3315a49453A97810b20631A22472a359A23935f6446m4757C20820d27881
$$ 87964 111279 -149453 197810 -220631 122472 -1359 123935 -66446 -111203 320820 -427881
11953A37748a05301j33980m9385A4588J43233J2961m3731m0903b16875Q8410j43420
$$ 137748 -105301 -239281 -288666 14588 157821 170782 127051 86148 -216875 -128465 -271885
11942b71885D2224N5585b15250A4715L92537a0935B16925Q4542F9559f7594B29367
$$ -271885 42224 97809 -215250 14715 407252 -10935 216925 301467 69559 -67594 229367
11930A30873E569f1105A39607g3780l2049A98181J3122H2794a44423q2024j5642
$$ 130873 5569 -61105 139607 -73780 -105829 198181 211303 82794 -144423 -226447 -242089
11919b42089A22900b05057q1494l1024a37535d1298D3511a5367B19816a01896
$$ -242089 122900 -205057 -286551 -317575 -137535 -41298 43511 -15367 219816 -101896
11908A66338B7802J8294g9487B82677a718q4631J9299A19099m6639J16692l0540
$$ 166338 27802 46096 -79487 282677 -1718 -86349 -67050 119099 72460 189152 158612
11897A58612g4669k58653a59385B19058h3112b7438r4950E1955B194L48245c46454
$$ 158612 -74669 -333322 -159385 219058 -83112 -27438 -122388 51955 2194 350439 -346454
11885B60700a01786J3448A47144p275o7923J97233a50208c1563r3679e010C1935
$$ 260700 -101786 -88338 147144 139869 71946 269179 -150208 -31563 -125242 -5010 31935
11873e1875k2175B63009c3284B16971A05082M3425c26599A76218B9111h2344k01016
$$ -51875 -74050 263009 -33284 216971 105082 148507 -326599 176218 29111 -82344 -283360
11862b83360B2820e1740j82115E11156c51724a04022L5147A62340b80894E803
$$ -283360 22820 -51740 -233855 511156 -351724 -104022 -68875 162340 -280894 5803
11851b37378A71920A6987a92354e3464k77171a61553G3250a30045j8622l4054
$$ -237378 171920 16987 -192354 -53464 -330635 -161553 73250 -130045 -148667 -182721
11841a82721e8951B27824a19765k7392g2401p0456K2353r7282l8998J21190H9291
$$ -182721 -58951 227824 -119765 -147157 -72401 -142857 -120504 -217786 -256784 -135594 89291
11829a4680A41506a40820c4638B1147J2488a03504k04159q5209d1178o7219b7588
$$ -14680 141506 -140820 -34638 21147 33635 -103504 -307663 -392872 -41178 -108397 -27588
11817c12801E8157J07962L6172b77782D68342I9468b21285q0924J50124a9565
$$ -312801 58157 166119 202291 -277782 468342 99468 -221285 -302209 -152085 -19565
11806c20631E45143B61b52998J24795d2322n7085M4654j08591E968h3404k64527
$$ -320631 545143 261 -252998 -128203 -42322 -99407 -54753 -163344 5968 -83404 -347931
11795c47931J6200F3205a86209J8106j00599a3114C9753f3386o6040B77171A8254
$$ -347931 -331731 63205 -186209 -168103 -268702 -13114 39753 -63386 -129426 277171 18254
11783b4960k91343A56703B5812J15697j5828e5405j70829e6996j8801A67864q1122
$$ -24960 -316303 156703 25812 141509 125681 -55405 -226234 -56996 -75797 167864 86742
11772H6742L72460c47674a0385j15930a2396j63341e2993j07019j27500D7661
$$ 86742 459202 -347674 -10385 -126315 -12396 -175737 -52993 -160012 -287512 47661
11761c11016c0693A81091d1548q0613B948J06456a49182A80047d32569a48393
$$ -311016 -30693 181091 -41548 -122161 2948 109404 -149182 180047 -432569 -148393
11750A10478a80744H4046a8102n5939f302C8040J77299c75115b8356j12420C6010
$$ 110478 -180744 84046 -18102 -74041 -6302 38040 215339 -375115 -28356 -140776 36010
11738F6250g9652j5106j33143A70186d65893J99193L9928o611k6233B4913J9618
$$ 66250 -79652 -94758 -227901 170186 -465893 -266700 -226772 -233383 -259616 24913 44531
11727D4531e6140l8569L5550H4910a4512q653a179A57038a24291M9270k31168
$$ 44531 -56140 -94709 -59159 84910 -14512 -23165 -1179 157038 -124291 -75021 -306189
11716c06189a45607B82002i1749j43287j0289F1996J44884M2326a23568A12249
$$ -306189 -145607 282002 -91749 -235036 -245325 61996 206880 249206 -123568 112249
11705G6901K11227c9827E5912a27937E4673e3021C59871f1405A14135a92102B9853
$$ 76901 288128 -39827 55912 -127937 54673 -53021 359871 -61405 114135 -192102 29853
11693a04335k02842a34324C8434d2817j63200A55352h5008j52876R2567m6749
$$ -104335 -307177 -134324 38434 -42817 -206017 155352 -85008 -237884 -145317 -192066
11683a92066j99542A82870J3172q2274a25258B43294G9989c86543D68342A29481
$$ -192066 -391608 182870 196042 113768 -125258 243294 79989 -386543 468342 129481
11672B08563C9811c5596l6675k4038D07415a9987H1082d0843A37617L3865J57249
$$ 208563 39811 -35596 -72271 -96309 407415 -19987 81082 -40843 137617 171482 328731
11661C28731c411j5683k23877D231J8722J64377R4267j20436a0443H3920N7124
$$ 328731 -3411 -19094 -242971 4231 22953 187330 281597 161161 -10443 83920 141044
11650A41044E7583L9707b6068B57150A11275a57987A02504g6628K1179J9690i915
$$ 141044 57583 97290 -26068 257150 111275 -157987 102504 -76628 -55449 -35759 -9915
11638A38965i0298j9075H954b6507A28159J08561b34284A38016E7824b66027B11930
$$ 138965 -90298 -109373 8954 -26507 128159 236720 -234284 138016 57824 -266027 211930
11626C4040J059i4084B50863D5012M7289g3912B9435J76338L1606E0742O3602
$$ 34040 35099 -94084 250863 45012 92301 -73912 29435 205773 237379 50742 114344
11615A14344r385a93075p4737P6421B82243J0536h3856A2531a31261D79882I3082
$$ 114344 104959 -193075 -267812 -191391 282243 292779 -83856 12531 -131261 479882 93082
11603H9056P8563J1480C2800e2114A50107g961A68620a06325l0737A07436O4673
$$ 89056 167619 179099 32800 -52114 150107 -7961 168620 -106325 -137062 107436 172109
11592A72109D2475n429J5935C733a36427A76840R3959h4820C39676a30898E3403
$$ 172109 42475 37046 52981 3733 -136427 176840 270799 -84820 339676 -130898 53403
11580H1579C6429a3998C42635a99301l4079A05122c7018l351A33996C8276J2722
$$ 81579 36429 -13998 342635 -199301 -233380 105122 -37018 -40369 133996 38276 50998
11569E0998e3790a6440B59667G7592g9742p1556i810B23671E3694K24715D1321
$$ 50998 -53790 -16440 259667 77592 -79742 -151298 -9810 223671 53694 278409 41321
11557A15378d997C8560d4638l65668C96360c4579k7009A17796J027h3448j31143
$$ 115378 -4997 38560 -44638 -410306 396360 -34579 -61588 117796 118823 -83448 -214591
11546b14591B13674b04875A28213j5169J1967J042L48848A84065Q4037j10147
$$ -214591 213674 -204875 128213 113044 125011 126053 474901 184065 268102 157955
11536A57955C2071d0953o9134m2107j38732C2006G160a05891p8533I3890a18398
$$ 157955 32071 -40953 -110087 -152194 -290926 32006 7160 -105891 -184424 93890 -118398
11524C54159a03521A94424m9475a22685a225m0044J8953j36055A8651i747A43855
$$ 354159 -103521 194424 144949 -122685 -1225 -41269 -22316 -158371 18651 -9747 143855
11512g7124m5151A74782K92619c12064b5037k1830A68199j4504A5473J76467a41257
$$ -77124 -122275 174782 467401 -312064 -25037 -46867 168199 153695 15473 191940 -141257
11500i6402A14904J13051K06964a6958H1098J63546q3772M90832D3727d8286B79116
$$ -96402 114904 227955 434919 -16958 81098 244644 160872 651704 43727 -48286 279116
11488A72878p588a57343D18751A42102n5558L87800A53968M5074c6682B68625
$$ 172878 165290 -157343 418751 142102 86544 474344 153968 199042 -36682 268625
11477b5158A67493m2303a1432A78088a63000B62287p7986q1846K16199A48440
$$ -25158 167493 125190 -11432 178088 -163000 262287 184301 102455 318654 148440
11466F43262H2727J86357j09516e0235B91563j13977k0289o2810j5568a5658D2364
$$ 643262 82727 269084 159568 -50235 291563 177586 157297 94487 78919 -15658 42364
11454d07418d5625A72396K7583F8434O5352J75501a93564D2779K49511F6314L5640
$$ -407418 -45625 172396 199979 68434 133786 309287 -193564 42779 292290 66314 101954
11443A01954L2454A9275f3763B64381L2565r3889C2860O8699l7065M6421a60177
$$ 101954 134408 19275 -63763 264381 296946 203057 32860 101559 64494 110915 -160177
11431G312e3783K4796B13475F2271L58084A712J53296a48593B16555b81669a1776
$$ 7312 -53783 -28987 213475 62271 420355 1712 155008 -148593 216555 -281669 -11776
11419B90155o631d4953k24275a05566A23538a44206C90338b49844a14063j3875
$$ 290155 283524 -44953 -269228 -105566 123538 -144206 390338 -249844 -114063 -127938
11409a27938I7973c63991B18709g6491L848B69397a44059k8872L7942d7010C42837
$$ -127938 97973 -363991 218709 -76491 -72643 269397 -144059 -172931 -134989 -47010 342837
11397H314J41783K9449c0933B85038j40758g86j71393C18330a76836J6015E5627
$$ 8314 150097 179546 -30933 285038 144280 -786 -172179 318330 -176836 -160821 55627
11385b1810k45805C02636a88678O9773H3994e12274H1349b9328q8239K8465m5891
$$ -21810 -267615 302636 -188678 -118905 83994 -512274 81349 -29328 -117567 -89102 -134993
11374a34993A83356K0178a30680j29846A65028c11646f6387l0230p5337e2499
$$ -134993 183356 203534 -130680 -260526 165028 -311646 -66387 -96617 -171954 -52499
11363e4680G2915a27289e3873k2889j0007m53834A44872H963K9391d31542J13582
$$ -54680 72915 -127289 -53873 -76762 -86769 -540603 144872 8963 38354 -431542 -317960
11352c17960B12792a66578g4198j08774f4954A89504d17051A85709a51714A10547
$$ -317960 212792 -166578 -74198 -182972 -64954 189504 -417051 185709 -151714 110547
11341A44340f5159j7508m123H8625k4051B5122a65828N952A81168b07109Q8905
$$ 144340 -65159 -82667 -86790 88625 64574 25122 -165828 -159876 181168 -207109 -118204
11330a18204N6147l2669J1406r003B17388J64828h7376E1340Q8162c7388A9174
$$ -118204 -62057 -94726 -83320 -92323 217388 382216 -87376 51340 139502 -37388 19174
11318A12342A6910Q325J6776c68705H1696J03993b62358a10301I0406k5314J14335
$$ 112342 16910 25235 42011 -368705 81696 185689 -262358 -110301 90406 65092 179427
11307A79427G8497a16008C4845J47301a8959k04033j94098a91325r4304I6325
$$ 179427 78497 -116008 34845 182146 -18959 -222992 -417090 -191325 -285629 96325
11296C2730K3816M03362g6858D8101a69546j77521f3155A64475a0280j71620d8703
$$ 32730 56546 459908 -76858 48101 -169546 -347067 -63155 164475 -10280 -181900 -48703
11284f6604l8440N2135C32760j06005g422G2657d9368F8082a51447A2662f8514
$$ -66604 -105044 -52909 332760 226755 -7422 72657 -49368 68082 -151447 12662 -68514
11272F4120P2194a43925a6151j84741a3745A14296K4793o5012l1353a08637A813
$$ 64120 136314 -143925 -16151 -200892 -13745 114296 139089 74077 42724 -108637 1813
11260f9107j0978G7051J16929B0418N3437g9349j39292B95924c83542a59946B3580
$$ -69107 -80085 77051 193980 20418 73855 -79349 -218641 295924 -383542 -159946 23580
11248A7234c4340j62209e735A7090b42821j6763p4994F4165A762K77397j20444
$$ 17234 -34340 -196549 -5735 17090 -242821 -259584 -334578 64165 1762 279159 158715
11237A58715n9455a07809l80156A80163c81215B1419i2633K8895a3748n1852q7149
$$ 158715 99260 -107809 -487965 180163 -381215 21419 -92633 -63738 -13748 -65600 -152749
11226a52749A54204a30354q0115F1763a1827j95760c4915r4008B03979I2623a29246
$$ -152749 154204 -130354 -210469 61763 -11827 -207587 -34915 -128923 203979 92623 -129246
11214b25056d2650j88682c2879C96614d6966j20776L5676C7328c56756j47811
$$ -225056 -42650 -231332 -32879 396614 -46966 -167742 -132066 37328 -356756 -504567
11204e04567C8268n061J14864J94387a02660A1399K36351e0816H7265a46811f2056
$$ -504567 38268 33207 148071 342458 -102660 11399 247750 -50816 87265 -146811 -62056
11192c92154B38472A02632a25032e0027k01636F6534j6748A1081a2213r5547e1678
$$ -392154 238472 102632 -125032 -50027 -251663 66534 49786 11081 -12213 -107760 -51678
11180c9791j01351E7851j5076i4530L4989q1936e571p0439j03026A23860k2697
$$ -39791 -141142 57851 42775 -94530 -59541 -141477 -5571 -76010 -179036 123860 101163
11169A01163b85908a08048B5291d1080j37891N4195b5151n448n16942K00349B46201
$$ 101163 -285908 -108048 25291 -41080 -178971 -124776 -25151 -30599 -547541 -347192 246201
11157d2665J5991k20285A51565b43890m103D7162b83432a01135q6828h5946d756
$$ -42665 -26674 -246959 151565 -243890 -247993 47162 -283432 -101135 -187963 -85946 -4756
11145a44661c7436j63805A84502c58005c8065A34202o2639O1744a88900E6775
$$ -144661 -37436 -201241 184502 -358005 -38065 134202 71563 133307 -188900 56775
11134D3215g5002B9897b83899H5897J37127D6945N5814N5020J46151A07032a39726
$$ 43215 -75002 29897 -283899 85897 223024 46945 102759 157779 303930 107032 -139726
11122A64410M6090o8449J18691r6215b08296E9746J50176K4338b65158B63261
$$ 164410 210500 142051 260742 164527 -208296 59746 209922 234260 -265158 263261
11111G4696P2214F6064B4012a65669B27477B3658M3925A0131L90144A23133C1686
$$ 74696 146910 66064 24012 -165669 227477 23658 67583 10131 400275 123133 31686
11099F1070k1340d7319B70863J43782H3848K31247k4014H2959h8255D89968A66856
$$ 61070 39730 -47319 270863 414645 83848 315095 291081 82959 -88255 489968 166856
11087D48368j93186a22516B53473N8864A05087J02617K65604A33001l8829J78499
$$ 448368 255182 -122516 253473 312337 105087 207704 473308 133001 94172 272671
11077B72671N238J3119G2374L27420j34107j05762J93445j04088K33883B28315
$$ 272671 277909 291028 72374 399794 265687 159925 353370 249282 483165 228315
11066B1764L56136A71677N1963K72164k16275K65808Q2298J8146H8378N62391
$$ 21764 377900 171677 223640 495804 279529 545337 627635 645781 88378 650769
11056F50769j87102N05383k89364J15648k26001j2828K42864K4227L89718E98269
$$ 650769 463667 969050 679686 795334 569333 556505 799369 823596 1213314 598269
11045A379866n28569m5016J59168N2547L6020R3860r4178k6393M3956m55940K46946
$$ 1379866 851297 806281 965449 1017996 1054016 1147876 1053698 1027305 1071261 615321 862267
11034H62267L15915m20100J36469M7864K5141k23985K11268N3733k17160j763
$$ 862267 1178182 758082 894551 942415 967556 743571 954839 1008572 791412 789649
11024G89649K9953Q1721K51118m15362k08689K07410B18771O56033j73517o9450
$$ 789649 819602 901323 1152441 737079 528390 735800 218771 874804 701287 631837
11014F31837M35252m38856j44049j34324N8701K26947L5559j8145J37122k46690
$$ 631837 1067089 628233 484184 349860 408561 635508 671067 652922 790044 543354
11004E43354J30123j30537R8322q2904J85508m7327J48581k13519K59467j8397
$$ 543354 673477 542940 641262 558358 743866 696539 845120 631601 891068 872671
10994H72671k47333J12984j34194B80557N70087j34811k61845K02849L12116K4556
$$ 872671 625338 738322 604128 280557 850644 715833 453988 656837 968953 993509
10984I93509n7867R3053j5673J30512K16630j30908J43851k15228J89563L98970
$$ 993509 935642 1028695 1013022 1143534 1360164 1229256 1373107 1157879 1347442 1746412
10974A746412j91690L63545K5101Q85673m04495L81441L93122n3936M6753K31263
$$ 1746412 1554722 1918267 1943368 2829041 2424546 2805987 3199109 3145173 3191926 3423189
10964C423189k94441j19936l94154m0449l54951m29095o0264k25030K57951k49410
$$ 3423189 3128748 3008812 2614658 2574209 2219258 1790163 1729899 1504869 1762820 1513410
10954A513410J0438k25200J92631j3237l75168J31739j36580L0947j17618j8004
$$ 1513410 1523848 1298648 1491279 1478042 1102874 1234613 1098033 1128980 1011362 993358
10944I93358D60500j07321l6607I2053K72596P4673j64810J1009G0485J82882
$$ 993358 460500 353179 316572 92053 364649 439322 274512 285521 70485 253367
10934B53367A06929A7448J55591P8945B5243J14457J80733e3720p7098O3889A4197
$$ 253367 106929 17448 173039 251984 25243 139700 320433 -53720 -130818 -66929 14197
10922A31435b43262B57872G3775J43777a52758l6046j9174A3362a84747C1818
$$ 131435 -243262 257872 73775 217552 -152758 -188804 -207978 13362 -184747 31818
10911B21657P4027a93061D2347k1105J18332a16206p0606C71976b01419I3153
$$ 221657 295684 -193061 42347 21242 139574 -116206 -186812 371976 -201419 93153
10900b21921I6963a37038A65425B214J54962D641N3098a47205K580A9414i3215
$$ -221921 96963 -137038 165425 2214 157176 4641 57739 -147205 -144625 19414 -93215
10888b50908A45100o7264j4796R7481O8392c4617D0105c11518B0879b24120F2473
$$ -250908 145100 77836 63040 160521 228913 -34617 40105 -311518 20879 -224120 62473
10876a25864A78972L1849G0332c34867a57866B38566E6435a29193c0590B61248
$$ -125864 178972 210821 70332 -334867 -157866 238566 56435 -129193 -30590 261248
10865a15751A11249e1032I8977b61781A77353a63836G5786J72500c30558F9043
$$ -115751 111249 -51032 98977 -261781 177353 -163836 75786 248286 -330558 69043
10854a61047B68971d4466o7279A47486d14465i2706j78196E0443b05034j99187
$$ -161047 268971 -44466 -111745 147486 -414465 -92706 -270902 50443 -205034 -404221
10844d04221c6865k52286J39478b0155P589j0060F103b65979j63654B2321a64989
$$ -404221 -36865 -289151 -149673 -20155 -12566 -22626 6103 -265979 -429633 22321 -164989
10832c5324A21202c25686d7437D0802b46323B1362e86465a81300F9505b04077
$$ -35324 121202 -325686 -47437 40802 -246323 21362 -586465 -181300 69505 -204077
10821G3022b37984C33969b50930D3204b44815F3388a77833G1994a92728L600N5842
$$ 73022 -237984 333969 -250930 43204 -244815 63388 -177833 71994 -192728 -189128 -133286
10810a33286A51630E8823M8552b51901O4393R0903G3231J92262i0938F4050b76256
$$ -133286 151630 58823 107375 -251901 -187508 -96605 73231 265493 -90938 64050 -276256
10798A03281k661a44126e6833k65499A17994b81296H78J22474m2238c34881J63864
$$ 103281 100620 -144126 -56833 -322332 117994 -281296 878 123352 81114 -334881 -171017
10787a71017P6659E9123f4829j23352h1375l0173B6660a3150l10118A39399K27913
$$ -171017 -94358 59123 -64829 -188181 -81375 -111548 26660 -13150 -323268 139399 367312
10776C67312a32842B4001a30304C37964a5512j2101j63218A59939p8649B6727
$$ 367312 -132842 24001 -130304 337964 -15512 -27613 -190831 159939 81290 26727
10765b66746C9635b4592k80471I6432a40386p0535F9634a69195C1554P678J45669
$$ -266746 39635 -24592 -305063 96432 -140386 -210921 69634 -169195 31554 39232 184901
10754A84901b48170H2153b05845H2107l2031b84966b9294A03594j435L0887B5761
$$ 184901 -248170 82153 -205845 82107 50076 -284966 -29294 103594 102159 133046 25761
10742c43245C47717a46900A13506c4788B55321A2625J16587a75417l1877A22676
$$ -343245 347717 -146900 113506 -34788 255321 12625 129212 -175417 -207294 122676
10731g5689l0297j61892e4380j18936p325N283j02304e1613B03537a25976L122
$$ -75689 -105986 -267878 -54380 -173316 -180641 -175358 -277662 -51613 203537 -125976 -122854
10720a22854H4522a72380H442b6766A21610c9989B6093K54685d51291J72411D1120
$$ -122854 84522 -172380 8442 -26766 121610 -39989 26093 280778 -451291 -278880 41120
10708G7223a20426d6305k06275K6279a2388k00646A346b79519Q4385K1735A36591
$$ 77223 -120426 -46305 -252580 -226301 -12388 -213034 1346 -279519 -195134 -173399 136591
10696C5112a86952I0733J56971e8567A91976Q6058a57264B25539i2478A01932
$$ 35112 -186952 90733 247704 -58567 191976 278034 -157264 225539 -92478 101932
10685h6962j98330h3024F8759i8990n5083A48712i0134O20f138H5619a31681G4545
$$ -86962 -285292 -83024 68759 -98990 -154073 148712 -90134 -89514 -6138 85619 -131681 74545
10672i5167B85309a59969I2524b63663a11035K8184E4628a18850o2201A0260h1323
$$ -95167 285309 -159969 92524 -263663 -111035 -82851 54628 -118850 -181051 10260 -81323
10660A22153e4358j44909F6303c79982a34519L650k35637B06047a0043j3435A157
$$ 122153 -54358 -199267 66303 -379982 -134519 -130869 -366506 206047 -10043 -23478 1157
10648A22063Q8149E7916e9124F6904b1229j15924L1023d1496k17538j07526A54340
$$ 122063 210212 57916 -59124 66904 -21229 -137153 -106130 -41496 -259034 -366560 154340
10636H0160h946j66397P4384j2040p9657H3648b96366B50563e5476j47913A4325
$$ 80160 -8946 -175343 -100959 -112999 -192656 83648 -296366 250563 -55476 -203389 14325
10624A63171m0729i3464j08144B7083c22795A29834c45943d0974I2688C6068O0868
$$ 163171 122442 -93464 -201608 27083 -322795 129834 -345943 -40974 92688 36068 96936
10613I6936h4339H4495a28975A23043a96228f165j54605A26209a49061I1127d71517
$$ 96936 -84339 84495 -128975 123043 -196228 -6165 -160770 126209 -149061 91127 -471517
10601A45985g1455D5203a38972B10157p4843B1832a18824B9093M0270a54262A4846
$$ 145985 -71455 45203 -138972 210157 135314 21832 -118824 29093 69363 -154262 14846
10589B6283J25911A1751c6979k93551F1387a27991L8621G746J02277b23038C7979
$$ 26283 152194 11751 -36979 -330530 61387 -127991 -89370 7746 110023 -223038 37979
10577e9307j78647d3404k64313a50680A63021b86284k0482a899A38695E4818e8867
$$ -59307 -237954 -43404 -307717 -150680 163021 -286284 -306766 -1899 138695 54818 -58867
10565B49286a74135g5282D0275R3096C5767c48371D9870b59194k9492a22593p8680
$$ 249286 -174135 -75282 40275 133371 35767 -348371 49870 -259194 -288686 -122593 -201273
10554b01273g9404A31220c7014j86036M649B02651a34798C2289K04448a89380
$$ -201273 -79404 131220 -37014 -223050 -218401 202651 -134798 32289 236737 -189380
10543a95623M1938f5528E1567d2875A67392h8644q6833G8113f8983A46119b7793
$$ -195623 -153685 -65528 51567 -42875 167392 -88644 -175477 78113 -68983 146119 -27793
10531e1004J5358k29759A42027c39394b7084j42889P0533k8356L0329j5458a5419
$$ -51004 -35646 -265405 142027 -339394 -27084 -169973 -99440 -127796 -97467 -112925 -15419
10519F4289D661Q6943B8432e5014o558a9961k14725a9911m1534J4832m41720h826
$$ 64289 4661 91604 28432 -55014 -61572 -19961 -234686 -19911 -61445 -46613 -488333 -8826
10506i0829C25264A9250a31076G5454a8051q4785a2944p3346o0950k452c2562
$$ -90829 325264 19250 -131076 75454 -18051 -102836 -12944 -86290 -147240 -149692 -32562
10494c13674K7308B26522a21927B25648b35831a10428k08455P9891A49616b6146
$$ -313674 -286366 226522 -121927 225648 -235831 -110428 -318883 -238992 149616 -26146
10483g7882B12400d0756l53901C45527p3683K4540r0258L43949B46399j4159J94871
$$ -77882 212400 -40756 -394657 345527 271844 296384 206126 550075 246399 232240 427111
10472D27111N4816B6103R5780M34334a8197j53699d1786l0299G1526f1237D26070
$$ 427111 481927 26103 121883 556217 -18197 -171896 -41786 -72085 71526 -61237 426070
10460b62186g4532B35217A02700a5654F908J40254F9331b17957J05565B6506c25407
$$ -262186 -74532 235217 102700 -15654 6908 147162 69331 -217957 -112392 26506 -325407
10448A26137i4009k7977e8755K5751l06540a27035K4906r9726h591r0936J0283
$$ 126137 -94009 -121986 -58755 -33004 -339544 -127035 -102129 -201855 -8591 -99527 -89244
10437h9244j30652E40b46718h6475A08834K7789g1232j36839e7342l83560C8427
$$ -89244 -219896 540 -246718 -86475 108834 136623 -71232 -208071 -57342 -440902 38427
10425B1197Q5683j8159e6595B35094c69461A31474m6034d1164G5001i9041A5107
$$ 21197 106880 88721 -56595 235094 -369461 131474 85440 -41164 75001 -99041 15107
10413E5603J2179Q5681c6123G7655B8712F737c0406j95307f1328H40d9579j68535
$$ 55603 67782 153463 -36123 77655 28712 6737 -30406 -225713 -61328 840 -49579 -218114
10401b18114C7314J54299b89254A41945D2238b92860A34852J67689I6581g151
$$ -218114 37314 191613 -289254 141945 42238 -292860 134852 302541 96581 -7151
10390a5928R51B26554j5278F5708L12786A28832h6372a1569G3805a2415D55900
$$ -15928 -14977 226554 211276 65708 378494 128832 -86372 -11569 73805 -12415 455900
10378D52313n8757a02473I3445N41461A05029M9903K37528A91183K18524j86824
$$ 452313 393556 -102473 93445 634906 105029 154932 392460 191183 409707 222883
10368B22883J6909M0433q9578L61053j62510L39566j79778J8523k59788j00819
$$ 222883 239792 280225 190647 551700 389190 728756 548978 567501 307713 206894
10358B06894l3166n6155L73766B45362J31803j55302J61735J2708A83654J16251
$$ 206894 173728 117573 491339 245362 377165 221863 383598 396306 183654 299905
10348B99905L61585k38227M21633l44780j40531K43522k18061O9302A70217L56158
$$ 299905 661490 423263 844896 500116 359585 603107 385046 454348 170217 526375
10338E26375A45878h5772A93032o3697l4746J14262K65981c5667H2824a41801
$$ 526375 145878 -85772 193032 129335 94589 208851 474832 -35667 82824 -141801
10327g2044J1211l7452B68376B2879P2055e1351I2156e4176C58019h1151B79403
$$ -72044 -60833 -98285 268376 22879 94934 -51351 92156 -54176 358019 -81151 279403
10315d7362B10181J1781e2489A59066K21602j90158a11873C9416O919L2636K02606
$$ -47362 210181 221962 -52489 159066 380668 190510 -111873 39416 46335 78971 281577
10304B81577a1471A15697a85306j252H3384i8954M5518A54537J38235D3111a24314
$$ 281577 -11471 115697 -185306 -186558 83384 -98954 -53436 154537 292772 43111 -124314
10292b36869P7295j1901O3491H8878b43286D8097c9140A91769D1010J71134c31400
$$ -236869 -159574 -171475 -107984 88878 -243286 48097 -39140 191769 41010 212144 -331400
10280b05657J7224m7833B8122A1367M2119P8964b38982F4860M5553k6660l9653
$$ -205657 -188433 -236266 28122 11367 53486 132450 -238982 64860 110413 83753 44100
10269D4100P4026l2278D1420b9033l8887l3434j43916A74757a17592r2066j86221
$$ 44100 118126 85848 41420 -29033 -67920 -101354 -245270 174757 -117592 -209658 -395879
10258c95879g0561k6483C47450a14176B01912F2773J4274R7742f8996B19202b31123
$$ -395879 -70561 -97044 347450 -114176 201912 62773 77047 174789 -68996 219202 -231123
10246b39461O2461a3203p4619l24310J36384J30153E6876m661j4429b31811A5154
$$ -239461 -177000 -13203 -87822 -412132 -275748 -145595 56876 52215 37786 -231811 15154
10234A63323b37248B13878b02987K5339A56344d25479A08508J17880d9896j03124
$$ 163323 -237248 213878 -202987 -177648 156344 -425479 108508 226388 -49896 -153020
10224a53020j10229D971c46649A40934b1369A42726b34152H6518e21405A5054
$$ -153020 -263249 4971 -346649 140934 -21369 142726 -234152 86518 -521405 15054
10213g4281I6984a76548P0508K0600K2192E0944K53202a11616M0062j9531r9740
$$ -74281 96984 -176548 -106040 -85440 -63248 50944 304146 -111616 -71554 -91085 -190825
10202a90825B60024d8474j78016N9743K7818C3340a1679A08744a32950c8198A33471
$$ -190825 260024 -48474 -226490 -166747 -138929 33340 -11679 108744 -132950 -38198 133471
10190g5114p7887i043A7441b19493C90683j25205C4409a92573H1499a88204L4622
$$ -75114 -153001 -9043 17441 -219493 390683 265478 34409 -192573 81499 -188204 -153582
10179a53582O4299j1585k3315j19456G4157c58809J57643F9203c6466j7488j09758
$$ -153582 -89283 -100868 -124183 -243639 74157 -358809 -201166 69203 -36466 -53954 -163712
10168a63712L1861e6142D9494a77978j09916J32533d6088A00440e5836j26786
$$ -163712 -131851 -56142 49494 -177978 -287894 -155361 -46088 100440 -55836 -182622
10158a82622a8546D9385b77058N5916J01812F0617c58918J75669A6885J452c19922
$$ -182622 -18546 49385 -277058 -221142 -119330 60617 -358918 -183249 16885 18337 -319922
10146d464E6928i7748j63242i9569J5043c427m09316a5407j46828o335L8296b1500
$$ -4464 56928 -97748 -260990 -99569 -84526 -3427 -412743 -15407 -162235 -168570 -130274 -21500
10133D8512J20614h88n8663j23760k67960b7815l21510C8362e1483D6029L9534
$$ 48512 169126 -888 -59551 -183311 -451271 -27815 -349325 38362 -51483 46029 85563
10122H5563b9287l47702d1173n7469j00571l8195m2665k2370f7543H2415C5565
$$ 85563 -29287 -376989 -41173 -98642 -199213 -237408 -280073 -302443 -67543 82415 35565
10110A48973J02184N2886b7876j24091k5190E8846i5258b6202I065a64519A74861
$$ 148973 251157 304043 -27876 -151967 -177157 58846 -95258 -26202 9065 -164519 174861
10098a06453j84891k37956h8060q5943D2543c21140B84930q9655g6446J9396A19944
$$ -106453 -291344 -529300 -88060 -174003 42543 -321140 284930 195275 -76446 -57050 119944
10086a3576g62A84310k5622m2892E7438c1566C640a65489h2615A81733a45674
$$ -13576 -762 184310 158688 115796 57438 -31566 3640 -165489 -82615 181733 -145674
10074c33266e4278A03458J27239b77712F8297l726K6321Q9648c9607p1495C21070
$$ -333266 -54278 103458 230697 -277712 68297 64571 90892 180540 -39607 -111102 321070
10062c8898B56057B0165K6761a0226p4885j85045A44644a12553D3730F059b93717
$$ -38898 256057 20165 46926 -10226 -85111 -270156 144644 -112553 43730 6059 -293717
10050i6109q5756k29190b9103r0304k65588G4531d5240C9598c3918l8536B47520
$$ -96109 -181865 -411055 -29103 -119407 -384995 74531 -45240 39598 -33918 -72454 247520
10038E7659e0698k16134Q7383g6715n3780B3110a45383n8528f230j53576O0218
$$ 57659 -50698 -266832 -179449 -76715 -130495 23110 -145383 -203911 -6230 -159806 -99588
10027i9588M3029H2695c37067J63247f7445j27511j96286C7587a4810H0919M6934
$$ -99588 -56559 82695 -337067 -173820 -67445 -194956 -391242 37587 -14810 80919 127853
10016A27853b66025B02211B4122a6216E5638c01496h749N48j73423B8425c43425
$$ 127853 -266025 202211 24122 -16216 55638 -301496 -8749 -8201 -181624 28425 -343425
10004D3108a44582A22954B7447i0642k18329A22124a04196l2157j63739g4678
$$ 43108 -144582 122954 27447 -90642 -308971 122124 -104196 -136353 -300092 -74678
9993A71443F2994h1486B07644e5707n02840a07880H062b44973A37022a29064H5703
$$ 171443 62994 -81486 207644 -55707 -558547 -107880 8062 -244973 137022 -129064 85703
9981a96430j23296J00098D0322a40957n3603b9842d239j56723l3121Q2010A80473
$$ -196430 -319726 -219628 40322 -140957 -194560 -29842 -4239 -160962 -194083 -112073 180473
9969b17883M570g7877I6922i3634C36588f5760A39135m6833b9641A35166c08357
$$ -217883 -213313 -77877 96922 -93634 336588 -65760 139135 92302 -29641 135166 -308357
9957C4934a34664r0395r4032a6107l61224B2531p435e9642A3245a582j3905k6032
$$ 34934 -134664 -225059 -319091 -16107 -377331 22531 15096 -59642 13245 -1582 -15487 -41519
9945d1519k61866a11817p7448F1494a28486L5870A2980K17613b97877B08881a90258
$$ -41519 -303385 -111817 -189265 61494 -128486 -92616 12980 230593 -297877 208881 -190258
9933h6475j67535a14182K9394k26184J1915a3870p5013k53462a48971j64572O0770
$$ -86475 -254010 -114182 -84788 -310972 -299057 -13870 -88883 -342345 -148971 -313543 -252773
9922b52773A08740N1847g1236o3326r2446J03201E6825b75141b1716n4474F5576
$$ -252773 108740 160587 -71236 -134562 -227008 -123807 56825 -275141 -21716 -76190 65576
9910d4642p636l15221h983B05253o4522c98793J90261J8322E4558b14221G5409
$$ -44642 -52278 -367499 -8983 205253 140731 -398793 -208532 -190210 54558 -214221 75409
9898c0492j47758J4687I0146d08367J96124j47921J71554h2543L7871H0134J2746
$$ -30492 -178250 -163563 90146 -408367 -212243 -360164 -188610 -82543 -44672 80134 92880
9887I2880m2911b34488j05570A63138a6882B6206a27500F8663N7566e4338B16837
$$ 92880 49969 -234488 -340058 163138 -16882 26206 -127500 68663 126229 -54338 216837
9875c56765i6151c2918B19358k2711H4733K5905b44992j36339B1217c59177O7024
$$ -356765 -96151 -32918 219358 196647 84733 110638 -244992 -381331 21217 -359177 -292153
9864b92153A03875A4780f2727k2905j30834h5812D4498c26744A55590a92036A64650
$$ -292153 103875 14780 -62727 -85632 -216466 -85812 44498 -326744 155590 -192036 164650
9852c34062b9449m57586B9352a35150n5020o2572O1959l420A72357d92624a04997
$$ -334062 -29449 -487035 29352 -135150 -190170 -252742 -190783 -194203 172357 -492624 -104997
9840b04535a01624J7839q6338k10832a5249k08613b5031m11385a38636m8696L8817
$$ -204535 -101624 -83785 -170123 -380955 -15249 -223862 -25031 -436416 -138636 -187332 -148515
9829a48515D4689j0619h5440A1564b71695d4698j72309d4466A96234m4982b19201
$$ -148515 44689 34070 -85440 11564 -271695 -44698 -217007 -44466 196234 151252 -219201
9817C72988b11137O1366G6893c7610j81744N3709H6452c31344B39251c03861a1144
$$ 372988 -211137 -149771 76893 -37610 -219354 -165645 86452 -331344 239251 -303861 -11144
9805b15086M5174J3753J9930j91416a15374c0100q7457c8089j44506A35761d4898
$$ -215086 -169912 -156159 -136229 -327645 -115374 -30100 -117557 -38089 -182595 135761 -44898
9793a56405P3141C01010g8383Q194r4583H0645J7826i4543j88368A27731a7145
$$ -156405 -83264 301010 -78383 -70189 -164772 80645 98471 -94543 -282911 127731 -17145
9781A8403L4015L66584a67306A67116a82713I1856a18681G3776d5913A11378a32202
$$ 18403 52418 419002 -167306 167116 -182713 91856 -118681 73776 -45913 111378 -132202
9769a26724l8572B0650b3507q7403l3646D8430L8041L2562a64366m6849m5766
$$ -126724 -165296 20650 -23507 -110910 -144556 48430 86471 119033 -164366 -211215 -256981
9758b56981o4477c5163a1711H5176h7234o1207c5156H647b19898A35645Q7018
$$ -256981 -321458 -35163 -11711 85176 -87234 -148441 -35156 8647 -219898 135645 222663
9747B22663j08529b52885M636f6977j86277d8521k29089A83772C3494a19882B23347
$$ 222663 114134 -252885 -248249 -66977 -253254 -48521 -277610 183772 33494 -119882 223347
9735A72319g1887j82989c7628j79230b1958A28692a08000j30751G9104C2801b30422
$$ 172319 -71887 -254876 -37628 -216858 -21958 128692 -108000 -238751 79104 32801 -230422
9723h097C5020a62332E3301O5936K60964A0772b89656c8540j75668A50404a28203
$$ -8097 35020 -162332 53301 119237 380201 10772 -289656 -38540 -214208 150404 -128203
9711b04006i9804A87191b18452C52940g0549j08817f4029B52020a65258g0054
$$ -204006 -99804 187191 -218452 352940 -70549 -179366 -64029 252020 -165258 -70054
9700A26342a28748o2698E9432b89970a3075B4105K2836f8623j43883c7649j49508
$$ 126342 -128748 -191446 59432 -289970 -13075 24105 46941 -68623 -212506 -37649 -187157
9689a87157G1795a31871m342C7572a06780B16008c13846Q4487H7149f6583k5884
$$ -187157 71795 -131871 -136213 37572 -106780 216008 -313846 -229359 87149 -66583 -92467
9678i2467A15532e4310k6517J2719j72059d2682m90770J53364R7608G8788k8837
$$ -92467 115532 -54310 -80827 -68108 -240167 -42682 -533452 -380088 -282480 78788 49951
9667D9951b5322j48187N9343J6800M100C55457I6205c2338o9984e0461j41838
$$ 49951 -25322 -173509 -114166 -97366 -93266 355457 96205 -32338 -102322 -50461 -192299
9656a92299B97642E9171J73478C7698e6463r672C4763b86776A17884J9106F3934
$$ -192299 297642 59171 232649 37698 -56463 -66135 34763 -286776 117884 136990 63934
9644B9119a36418N747I0557a01052A27718c5540j37643m6722d7778L227o6764
$$ 29119 -136418 -130671 90557 -101052 127718 -35540 -173183 -219905 -47778 -44551 -111315
9633a11315A5288b73792R2267B7583a62702P4740c1643A3289N3641c42537L6773
$$ -111315 15288 -273792 -181525 27583 -162702 -87962 -31643 13289 66930 -342537 -305764
9622c05764a49201L0032C07134H4210b14459G7902c02242D125J12670e3455A14717
$$ -305764 -149201 -119169 307134 84210 -214459 77902 -302242 4125 116795 -53455 114717
9610A01809A0624b57805G6970I662O8226J0555l6764b34823h1672B09578A2420
$$ 101809 10624 -257805 76970 9662 77888 88443 51679 -234823 -81672 209578 12420
9598e47717B0790f4190r931B30684a43890k24958d1055l39735G0632M4730f4249
$$ -547717 20790 -64190 -74121 230684 -143890 -368848 -41055 -380790 70632 115362 -64249
9586B18994a14698j71810c8928j33459O6794r8419G2542h419E43758a97519p8096
$$ 218994 -114698 -286508 -38928 -172387 -105593 -204012 72542 -8419 543758 -197519 -275615
9575b75615f7233m2475L6204K2370j11242C41689b35310A0150d98542B21973A2984
$$ -275615 -67233 -109708 -73504 -51134 -162376 341689 -235310 10150 -498542 221973 12984
9563a24759b6581A48557a93719Q5295B92813F3983d41775f9674K1060r6779b7502
$$ -124759 -26581 148557 -193719 -108424 292813 63983 -441775 -69674 -48614 -145393 -27502
9551I9506h3172o1366m2227A55553i1770A72665F2900g1806k61532c9214j80550
$$ 99506 -83172 -144538 -186765 155553 -91770 172665 62900 -71806 -333338 -39214 -219764
9540b19764Q1190k37824B11285b45415P4749j17269B15657A1167e3992j17936
$$ -219764 -138574 -376398 211285 -245415 -170666 -287935 215657 11167 -53992 -171928
9530a71928F5011d44058a95884c5929E5402b94314A62456a16588j07684f9121
$$ -171928 65011 -444058 -195884 -35929 55402 -294314 162456 -116588 -224272 -69121
9519A11956a90876A13664c50036E7777n351b85716q1147g3326j68455A34336q840
$$ 111956 -190876 113664 -350036 57777 52426 -285716 -366863 -73326 -241781 134336 125496
9508A25496O6865j3534B7220M9176a75297o2736j87728K3028K192L3542b760n0716
$$ 125496 192361 178827 27220 76396 -175297 -238033 -425761 -402733 -400541 -366999 -2760 -53476
9496e3476l82100d889I133f523F0933b05341c9040D28811d78807a51485c3799
$$ -53476 -435576 -4889 9133 -6523 60933 -205341 -39040 428811 -478807 -151485 -33799
9484b48508f5118j4029j53685e7806M72j41569q9911M5820E6060a46108j50570
$$ -248508 -65118 -79147 -232832 -57806 -57334 -198903 -288814 -242994 56060 -146108 -296678
9473b96678Q2127c4430I0757L5020b00134A96327a08885k48395a72281L5570j36593
$$ -296678 -214551 -34430 90757 125777 -200134 196327 -108885 -357280 -172281 -136711 -273304
9462b73304B07101a16925E9490d7107B89473D4985b50507g0412A04526c10066
$$ -273304 207101 -116925 59490 -47107 289473 44985 -250507 -70412 104526 -310066
9451c59826H8199b54166E5518h5653B23831l5538a69181A83448L38913A40191
$$ -359826 88199 -254166 55518 -85653 223831 188293 -169181 183448 522361 140191
9440B9332a31907A61352a62824k7912c8013F6579a8555C06312b10252h727k44306
$$ 29332 -131907 161352 -162824 -190736 -38013 66579 -18555 306312 -210252 -8727 -253033
9429b53033Q624N7749g7244A7007g5083j04964B705J08137a68403N5488j41861
$$ -253033 -244409 -186660 -77244 17007 -75083 -180047 2705 110842 -168403 -112915 -254776
9418b54776a1509A66635M348a99704M9548f6787H4255c256k10767K1546O5858
$$ -254776 -11509 166635 170983 -199704 -150156 -66787 84255 -3256 -214023 -192477 -126619
9407a26619F0739J36088d02028J57509K1765A11284b58254J24861f4631j44702
$$ -126619 60739 196827 -402028 -244519 -222754 111284 -258254 -133393 -64631 -209333
9397b09333N1427B11581A03287c6213P411A17269b08816a6364j09146r8916h7978
$$ -209333 -157906 211581 103287 -36213 -28802 117269 -208816 -16364 -125510 -224426 -87978
9385c58814i7444K9316K9099a8247k34572a13255j27312Q8100L5666n7990B79020
$$ -358814 -97444 -68128 -39029 -18247 -252819 -113255 -240567 -152467 -116801 -174791 279020
9373e6857b7241A28016a91675j59716a14922B0557b18972j82195e4501j00542
$$ -56857 -27241 128016 -191675 -351391 -114922 20557 -218972 -401167 -54501 -155043
9363a55043p4085m6215A31935i5370a5900j31539M6642d883p7178o1650A42566
$$ -155043 -229128 -275343 131935 -95370 -15900 -147439 -100797 -4883 -82061 -143711 142566
9351A2160h3700j03440A21350a34786m2453A85984E2460d2696A81465a27319H7481
$$ 12160 -83700 -187140 121350 -134786 -177239 185984 52460 -42696 181465 -127319 87481
9339c81202A35343a3441k66833c4645A07268a65605A30899b28653A15272g7535
$$ -381202 135343 -13441 -280274 -34645 107268 -165605 130899 -228653 115272 -77535
9328A71746d50677A15341A9062J47606Q9262I7203J22886c19851J12398M9254
$$ 171746 -450677 115341 19062 166668 255930 97203 220089 -319851 -207453 -158199
9318a58199M8449j34622c1117A04743m2482B8867a18032j31045P730A28573o3754
$$ -158199 -109750 -244372 -31117 104743 62261 28867 -118032 -249077 -241347 128573 64819
9307F4819e4951C7338j1043J5548b62914F6358a60175E3646g8037j79507a17190
$$ 64819 -54951 37338 26295 41843 -262914 66358 -160175 53646 -78037 -257544 -117190
9295B51357a45237l54973A97551H1569a79886K3899e0469E7050e0449l33513D362
$$ 251357 -145237 -500210 197551 81569 -179886 -155987 -50469 57050 -50449 -383962 4362
9283a99758c1869k65970A96941a18717B59045C5543Q1614a8253A05993a42659
$$ -199758 -31869 -297839 196941 -118717 259045 35543 117157 -18253 105993 -142659
9272i3988I5118b36255E3675b54643P3775A92169H3148K90955g1796O88E8975
$$ -93988 95118 -236255 53675 -254643 -180868 192169 83148 374103 -71796 -71108 58975
9260a7820j56672j92008A9997o913Q316N855K77142c6631H7692a07371K8217l7107
$$ -17820 -174492 -366500 19997 13084 21400 27255 304397 -36631 87692 -107371 -79154 -116261
9248a16261H5947c5021n572p1734B03314R111q7610a42951k54644G5466g7629
$$ -116261 85947 -35021 -40593 -112327 203314 212425 124815 -142951 -397595 75466 -77629
9236A02450O1966m8345J18395l9978B3876c06421A12569F458J4458b59288o113
$$ 102450 164416 116071 234466 194488 23876 -306421 112569 6458 20916 -259288 -265401
9225b65401r4961E1613M35633c31599Q1217R3725k8003h3585b1377I8948a11345
$$ -265401 -360362 51613 487246 -331599 -250382 -156657 -184660 -83585 -21377 98948 -111345
9213b809r8870A01793f3487j03357o6380R7605A48693B6725K42883D6579h1174
$$ -2809 -101679 101793 -63487 -166844 -233224 -135619 148693 26725 269608 46579 -81174
9201a72218A11004a58549l752o6605A22665B8987J71009i3128J4708b0306p9433
$$ -172218 111004 -158549 -162301 -228906 122665 28987 199996 -93128 -78420 -20306 -99739
9190i9739B75841h7931n7496A36207i2740q357F1917F491L6928Q118c6360j85010
$$ -99739 275841 -87931 -145427 136207 -92740 -101097 61917 6491 43419 51537 -36360 -221370
9178b21370e7237b0670C8521a43881q9469A19838b92346A15735a72153q2492j7377
$$ -221370 -57237 -20670 38521 -143881 -233350 119838 -292346 115735 -172153 -254645 -272022
9167b72022h8695o5302f8116C6596b02713c3467B9074e1040a5407m952l5570K0510
$$ -272022 -88695 -153997 -68116 36596 -202713 -33467 29074 -51040 -15407 -20359 -55929 -35419
9155c5419k30751i9855k31821A5722c15095J55451B51713a71739A5881J3770K1489
$$ -35419 -266170 -99855 -331676 15722 -315095 -159644 251713 -171739 15881 29651 51140
9144E1140a30256P118L5133H9856g4476k21810B19548E0359b23026F3304J5443
$$ 51140 -130256 -123138 -88005 89856 -74476 -296286 219548 50359 -223026 63304 78747
9133G8747k6540a52501A34155a71613F3626L22876j59704b07707k0381a09874
$$ 78747 52207 -152501 134155 -171613 63626 386502 226798 -207707 -228088 -109874
9122g4955m4806j16507B18123a2176j00147N2055k515B7683c21031E3607b54681
$$ -74955 -119761 -236268 218123 -12176 -112323 -60268 -62783 27683 -321031 53607 -254681
9110e4499b2039H560a22668l26086a12711B5506a33103q4432h8005m1355K2679
$$ -54499 -22039 8560 -122668 -448754 -112711 25506 -133103 -217535 -88005 -129360 -106681
9099a06681a9016r0428C7082M9363d20816A64730a25491A12316A7347J09532B8197
$$ -106681 -19016 -109444 37082 86445 -420816 164730 -125491 112316 17347 126879 28197
9087a10863M2762B12418r3665i7476q181G3555R2770c41495E0029I378a66575
$$ -110863 -68101 212418 118753 -97476 -105657 73555 166325 -341495 50029 9378 -166575
9075b41448O6195H0543k0459g6841c7113l02190a36852M8171E043b18865A63026
$$ -241448 -175253 80543 60084 -76841 -37113 -339303 -136852 -88681 5043 -218865 163026
9063b22889P638g629B9246g7646d805k64058k0256J18868j8536E7984M284D920
$$ -222889 -215251 -7629 29246 -77646 -4805 -268863 -289119 -170251 -188787 57984 62268 4920
9050a1898k44971B33138d563j99985F4224J55932A2095a30266A21072c75837C4825
$$ -11898 -256869 233138 -4563 -204548 64224 220156 12095 -130266 121072 -375837 34825
9038a89303N8844B41101r0853b58345I7873a0609o1111n4003B81745a77664l1482
$$ -189303 -130459 241101 150248 -258345 97873 -10609 -71720 -125723 281745 -177664 -209146
9027b09146e2211q3919C0932g0724I0334d0496k24522h5569k20597B68389g8674
$$ -209146 -52211 -136130 30932 -70724 90334 -40496 -265018 -85569 -306166 268389 -78674
9015B28396b88549A28176e3150A65976h4582p6088j01432L8422R581M066A64907
$$ 228396 -288549 128176 -53150 165976 -84582 -160670 -262102 -223680 -214099 -210033 164907
9003b06924a9053B04666b18117J7972C576c62996E0323J1498c82413A1949a31207
$$ -206924 -19053 204666 -218117 -200145 3576 -362996 50323 61821 -382413 11949 -131207
8991b81607i7573L4373n3712B28551h8499g481B40251F8085b17626b8957o7516
$$ -281607 -97573 -63200 -116912 228551 -88499 -7481 240251 68085 -217626 -28957 -96473
8980i6473b1364k1999k5262k48104B49254I6503A9410N8000a38499c8247A20587
$$ -96473 -21364 -43363 -68625 -316729 249254 96503 19410 77410 -138499 -38247 120587
8968c1872j33982A94005a82514c4945C44315b0592j02890o7951I8012K46058k5471
$$ -31872 -165854 194005 -182514 -34945 344315 -20592 -123482 -191433 98012 344070 318599
8957C18599c42498b1186j58370n3259A29193E3345i6979J0775p1332g5924b3815
$$ 318599 -342498 -21186 -179556 -232815 129193 53345 -96979 -86204 -157536 -75924 -23815
8945a63346f3471B56288c63748g9903j23640G8543b36565i1798n6023C7967K11293
$$ -163346 -63471 256288 -363748 -79903 -203543 78543 -236565 -91798 -147821 37967 249260
8934B49260b8930A19945k5136j9260K3816b0499p2145A90196B6270m107J60848
$$ 249260 -28930 119945 94809 75549 99365 -20499 -92644 190196 26270 22163 183011
8923A83011L36638L85210Q76766K755525P705087E711487A253975k87532D20415
$$ 183011 519649 904859 1781625 4537150 12242237 5711487 1253975 966443 420415
8913d9402A3088c84202A09436a62972D67804a7781b934A20715J32056b54446B3751
$$ -49402 13088 -384202 109436 -162972 467804 -17781 -2934 120715 252771 -254446 23751
8901H8544b27471i6322a6866A1943M330i8264M1978b7298k46126I0277a25289
$$ 88544 -227471 -96322 -16866 11943 16273 -98264 -56286 -27298 -273424 90277 -125289
8889a08621d3691j57168M9407l04579a12253E3955c04590e4543j43891A97959
$$ -108621 -43691 -200859 -151452 -456031 -112253 53955 -304590 -54543 -198434 197959
8878A10803J16746h9848j20242A41711a32133A99311l8651D2246c6429G9906h1379
$$ 110803 227549 -89848 -210090 141711 -132133 199311 160660 42246 -36429 79906 -81379
8866c5556m3678R170K7636j50367c3351l26943J40276p4943A84822K4469a72709
$$ -35556 -79234 -70064 -42428 -192795 -33351 -360294 -220018 -294961 184822 209291 -172709
8854A32822R6395b54589G0077a60761A23872J86224G7782O5061J36901c53390
$$ 132822 229217 -254589 70077 -160761 123872 310096 77782 142843 279744 -353390
$$ [...]
##END NTUPLES=NMR SPECTRUM
##END=
