
##TITLE=AC1068_TOPL01_6519229_qYJ3gEzVqc
##JCAMPDX= 6.0         $$ Bruker NMR JCAMP-DX V2.0
##DATA TYPE= NMR SPECTRUM
##DATA CLASS= NTUPLES
##ORIGIN= BRUKER
##OWNER= Administrator
$$ 1.72 TOPSPIN		Version 2.1
$$ 2012-07-14 11:23:58.218 -0500  Administrator@TOPSPIN
$$ Compression mode = diff/dup
##.OBSERVE FREQUENCY= 400.02188249412
##.OBSERVE NUCLEUS= ^1H
##.ACQUISITION MODE= SIMULTANEOUS (DQD)
##.ACQUISITION SCHEME= undefined
##.AVERAGES= 64
##.DIGITISER RES= 22
##SPECTROMETER/DATA SYSTEM= spect
##.PULSE SEQUENCE= noesygpps1d.comp
##.SOLVENT NAME= COFFEE_meoh
##.SHIFT REFERENCE= INTERNAL, COFFEE_meoh, 1, 14.96253
##AUDIT TRAIL= $$ (NUMBER, WHEN, WHO, WHERE, PROCESS, VERSION, WHAT)
$$ ##TITLE= Audit trail, TOPSPIN		Version 2.1
$$ ##JCAMPDX= 5.01
$$ ##ORIGIN= Bruker BioSpin GmbH
$$ ##OWNER= Administrator
$$ $$ C:\Bruker\TOPSPIN/data/COFFEE/nmr/AC1068_TOPL01_6519229_qYJ3gEzVqc/62/pdata/1/auditp.txt
$$ ##AUDIT TRAIL=  $$ (NUMBER, WHEN, WHO, WHERE, PROCESS, VERSION, WHAT)
(   1,<2012-07-14 11:23:52.875 -0500>,<Administrator>,<TOPSPIN>,<go>,<TOPSPIN 2.1>,
      <created by zg
	started at 2012-07-14 11:12:22.640 -0500,
	POWCHK enabled, PULCHK disabled,
       configuration hash MD5:
       6B 1B 68 BB D9 2E 58 E2 7F 35 AD 54 07 DF 0E 41
       data hash MD5: 64K
       9D FA 24 A2 78 03 B9 82 FA C1 CD C6 4A D5 05 28>)
(   2,<2012-07-14 11:23:56.265 -0500>,<Administrator>,<TOPSPIN>,<proc1d>,<TOPSPIN 2.1>,
      <Start of raw data processing
       efp LB = 0.3 FT_mod = 6 PKNL = 1 PHC0 = 0 PHC1 = 0 SI = 128K 
       data hash MD5: 128K
       2E 41 F7 B0 72 AF BE 02 DB 29 44 6B 23 A8 37 7B>)
(   3,<2012-07-14 11:23:57.375 -0500>,<Administrator>,<TOPSPIN>,<proc1d>,<TOPSPIN 2.1>,
      <pk PHC0 = 2.416992 PHC1 = 0 
       data hash MD5: 128K
       A9 F5 58 C6 05 BF 3A 06 BD F9 EC CF 1E 20 83 67>)
(   4,<2012-07-14 11:23:57.875 -0500>,<Administrator>,<TOPSPIN>,<proc1d>,<TOPSPIN 2.1>,
      <abs ABSG = 1 
       data hash MD5: 128K
       22 06 A4 D6 6A C8 58 78 E5 F5 BF A0 77 A6 D2 66>)
(   5,<2012-07-14 11:23:57.953 -0500>,<Administrator>,<TOPSPIN>,<proc1d>,<TOPSPIN 2.1>,
      <abs ABSG = 2 
       data hash MD5: 128K
       00 A0 D5 F6 EC DB 6A DB 01 11 3D 42 45 9B 07 2D>)
(   6,<2012-07-14 11:23:58.000 -0500>,<Administrator>,<TOPSPIN>,<proc1d>,<TOPSPIN 2.1>,
      <abs ABSG = 3 
       data hash MD5: 128K
       ED 2F 74 A1 FD EC 94 DC 94 5B 59 19 BE 14 2D F4>)
(   7,<2012-07-14 11:23:58.062 -0500>,<Administrator>,<TOPSPIN>,<proc1d>,<TOPSPIN 2.1>,
      <abs ABSG = 4 
       data hash MD5: 128K
       25 4A 14 FF 67 8F 1D 7D 0F D2 B0 8C E1 BD 1E 7B>)
(   8,<2012-07-14 11:23:58.125 -0500>,<Administrator>,<TOPSPIN>,<proc1d>,<TOPSPIN 2.1>,
      <abs ABSG = 5 
       data hash MD5: 128K
       66 80 13 76 CF A7 82 0F F6 81 1F EA 8A DE 78 C6>)
$$ ##END=
$$ 
$$ $$ hash MD5
$$ $$ F8 C3 66 58 AE 2B DA EC FF FA AF 1A 8F 98 FD ED
##$RELAX= 
##$RELAX= 
##$RELAX= 
##$RELAX= 
##$RELAX= 
##$RELAX= 
##$RELAX= 
##$RELAX= 
##$RELAX= 
$$ Bruker specific parameters
$$ [...]
##$TP07= 0
##$TPNAME0= <>
##$TPNAME1= <>
##$TPNAME2= <>
##$TPNAME3= <>
##$TPNAME4= <>
##$TPNAME5= <>
##$TPNAME6= <>
##$TPNAME7= <>
##$TPOAL= (0..7)
0.5 0.5 0.5 0.5 0.5 0.5 0.5 0.5
##$TPOFFS= (0..7)
0 0 0 0 0 0 0 0
##$TUNHIN= 0
##$TUNHOUT= 0
##$TUNXOUT= 0
##$USERA1= <user>
##$USERA2= <user>
##$USERA3= <user>
##$USERA4= <user>
##$USERA5= <user>
##$V9= 5
##$VALIST= <valist>
##$VCLIST= <CCCCCCCCCCCCCCC>
##$VD= 0
##$VDLIST= <DDDDDDDDDDDDDDD>
##$VPLIST= <PPPPPPPPPPPPPPP>
##$VTLIST= <TTTTTTTTTTTTTTT>
##$WBST= 2048
##$WBSW= 25
##$XGAIN= (0..3)
0 0 0 0
##$XL= 0
##$YL= 0
##$YMAX_a= 17578210
##$YMIN_a= -10628358
##$ZGOPTNS= <>
##$ZL1= 120
##$ZL2= 120
##$ZL3= 120
##$ZL4= 120
##$ABSF1= 14.96253
##$ABSF2= -5.595652
##$ABSG= 5
##$ABSL= 3
##$ALPHA= 0
##$AQORDER= 0
##$ASSFAC= 0
##$ASSFACI= 0
##$ASSFACX= 0
##$ASSWID= 0
##$AUNMP= <proc_prof1d_extract.lims>
##$AXLEFT= 0
##$AXNAME= <>
##$AXNUC= <1H>
##$AXRIGHT= 0
##$AXTYPE= 0
##$AXUNIT= <>
##$AZFE= 0.1
##$AZFW= 0.1
##$BCFW= 0
##$BC_mod= 0
##$BYTORDP= 0
##$COROFFS= 0
##$CY= 15
##$DATMOD= 1
##$DC= 0
##$DFILT= <>
##$DTYPP= 0
##$F1P= 0
##$F2P= 0
##$FCOR= 0.5
##$FTSIZE= 131072
##$FT_mod= 6
##$GAMMA= 0
##$GB= 0
##$INTBC= 1
##$INTSCL= 1
##$ISEN= 128
##$LB= 0.3
##$LEV0= 0
##$LPBIN= 0
##$MAXI= 10000
##$MC2= 0
##$MEAN= 0
##$ME_mod= 0
##$MI= 0
##$NCOEF= 0
##$NC_proc= -2
##$NLEV= 6
##$NOISF1= 0
##$NOISF2= 0
##$NSP= 0
##$NTH_PI= 0
##$NZP= 0
##$OFFSET= 14.96253
##$PC= 1
##$PHC0= 2.416992
##$PHC1= 0
##$PH_mod= 1
##$PKNL= yes
##$PPARMOD= 0
##$PPDIAG= 0
##$PPIPTYP= 0
##$PPMPNUM= 2147483647
##$PPRESOL= 1
##$PSCAL= 4
##$PSIGN= 0
##$PYNMP= <proc.py>
##$REVERSE= no
##$SF= 400.020009024022
##$SI= 131072
##$SIGF1= 0
##$SIGF2= 0
##$SINO= 400
##$SIOLD= 131072
##$SPECTYP= <>
##$SREGLST= <1H.CDCl3>
##$SSB= 0
##$STSI= 131072
##$STSR= 0
##$SW_p= 8223.68421052631
##$SYMM= 0
##$S_DEV= 0
##$TDeff= 65536
##$TDoff= 0
##$TI= <>
##$TILT= no
##$TM1= 0
##$TM2= 0
##$TOPLEV= 0
##$USERP1= <user>
##$USERP2= <user>
##$USERP3= <user>
##$USERP4= <user>
##$USERP5= <user>
##$WDW= 1
##$XDIM= 131072
##$YMAX_p= 422144209
##$YMIN_p= -11128
##$CURPLOT= <Network HP LaserJet P1505>
##$CURPRIN= <$Network HP LaserJet P1505>
##$DFORMAT= <normdp>
##$LAYOUT= <+/1D_H.xwp>
##$LFORMAT= <normlp>
##$PFORMAT= <normpl>
##$SURQMSG= 1
$$ End of Bruker specific parameters
$$ ---------------------------------
##NTUPLES= NMR SPECTRUM
##VAR_NAME=  FREQUENCY,     SPECTRUM/REAL,   SPECTRUM/IMAG
##SYMBOL=    X,             R,               I
##VAR_TYPE=  INDEPENDENT,   DEPENDENT,       DEPENDENT
##VAR_FORM=  AFFN,          ASDF,            ASDF
##VAR_DIM=   131072,        131072,          131072
##UNITS=     HZ,            ARBITRARY UNITS, ARBITRARY UNITS
##FACTOR=    0.0627417313425164, 1,          1
##FIRST=     8223.62146879497, 1810,         -65971
##LAST=      0,             2929,            -65816
##MIN=       0,             -11128,          0
##MAX=       8223.62146879497, 422144209,    0
$$ Real data points
##PAGE= N=1
##DATA TABLE= (X++(R..R)), XYDATA
$$ [...]
64429 75233 74123 72878 72318 72523 72846 72741 72416 72511 73196 73812 73608 72686 71919 71870 72135 71947 71228 70661 70772
64410 70772 71245 71307 70573 69380 68390 68060 68475 69479 70754 71829 72238 71853 71046 70342 69896 69451 68797 68131
64392 68131 67844 68072 68569 68997 69209 69247 69129 68817 68455 68542 69584 71445 73236 74121 74124 73856 73563 72919 71812
64373 71812 70843 70669 71231 72005 72790 73792 75027 76072 76482 76173 75382 74534 74165 74617 75672 76713 77353
64356 77353 77703 77942 77936 77479 76700 75987 75621 75680 76180 77022 77846 78247 78246 78350 79021 80204 81481 82577 83506 84214
64336 84214 84343 83558 82092 80763 80286 80628 81191 81582 81994 82761 83748 84478 84738 84785 84911 85156 85616 86710
64318 86710 88708 91083 92813 93420 93334 93075 92505 91304 89856 89063 89218 89600 89358 88492 87732 87758 88760 90525
64300 90525 92537 94095 94735 94671 94634 95081 95692 95771 95186 94758 95526 97624 100031 101643 102418 103232 104689 106505
64282 106505 108161 109737 111751 114439 117572 120905 124424 128123 131840 135444 138954 142313 145156 146980
64268 146980 147584 147266 146496 145418 143776 141445 138842 136561 134662 132720 130631 128949 128243 128406 128891 129211
64252 129211 128914 127520 125084 122635 121345 121295 121600 121732 122056 122894 123737 123845 123216 122580 122639 123597 125198 126924
64234 126924 128380 129737 131658 134619 138519 143073 148186 153589 158525 162337 165197 167775 170285 172380
64220 172380 173874 174928 175370 174454 171728 167821 163952 160759 157958 155070 152142 149587 147507 145482 143108
64205 143108 140559 138396 136872 135739 134871 134728 135861 138131 140730 142916 144452 145457 146278 147466 149394
64190 149394 151707 153538 154450 154790 155000 155005 154602 154020 153604 153160 152193 150750 149596 149435 150249 151446 152443 153084
64172 153084 153709 154851 156666 158696 160369 161672 162992 164398 165499 166131 166775 168086 170331 173493 177611
64157 177611 182723 188671 195280 202598 210674 219248 228006 237069 246915 257789 269493 281761 294533
64144 294533 307710 320907 333652 345662 356712 366311 373723 378379 380186 379388 376255 370934 363599
64131 363599 354579 344266 332941 320822 308315 296111 284866 274801 265675 257212 249529 243102
64119 243102 238325 235072 232747 230761 228841 226839 224470 221584 218644 216510 215570 215395 215462 215882 217113
64104 217113 219192 221709 224429 227505 231034 234788 238522 242270 246242 250639 255661 261480 268140 275690
64090 275690 284385 294411 305339 316182 326255 335660 344691 353049 360047 365422 369464 372259 373277
64077 373277 372004 368781 364644 360250 355294 349199 342228 335494 329763 324609 319061 312866 306706 301250
64063 301250 296535 292449 289342 287755 287656 288328 289060 289838 291283 293983 297871 302323 306842 311567 317016
64048 317016 323478 330838 338820 347102 355351 363574 372488 383053 395497 409098 422988 436817 450580
64035 450580 464333 478285 492682 507261 521235 534110 546086 557323 567278 575379 581972 588013
64023 588013 594045 600095 606418 613640 622165 631894 642511 653564 664262 673740 681569 687622 691577
64010 691577 693055 692285 690023 686829 682963 679100 676374 675437 676020 677740 680782 685454 691613 699047 708036
63995 708036 719014 731962 746601 762967 781313 801594 823487 846819 871598 897844 925890
63984 925890 956760 991676 1031005 1074091 1120249 1169574 1222605 1279570 1340346 1404972 1473877
63973 1473877 1547607 1626587 1711311 1802712 1902277 2011788 2132983 2267491 2417175 2584618
63963 2584618 2773329 2987548 3231923 3511468 3831775 4199007 4619390 5098604 5641623
63954 5641623 6252668 6934443 7686790 8506092 9386111 10319081 11295798 12305105 13333889
63945 13333889 14367086 15386646 16370209 17291838 18125216 18847020 19438506 19885879 20180482
63936 20180482 20318361 20298569 20121458 19788695 19304837 18678794 17924438 17060681 16110949
63927 16110949 15101435 14058262 13004769 11960049 10938990 9953524 9014181 8130736
63919 8130736 7311493 6562157 5885431 5281226 4746843 4277377 3866845 3509391 3199475
63910 3199475 2931288 2698728 2496150 2318850 2162830 2024605 1901449 1791390 1692722 1603768
63900 1603768 1523238 1450319 1384038 1322831 1265157 1210445 1159077 1111490 1067464 1026104 986151
63889 986151 946473 906659 867283 829321 793201 758574 724993 692509 661507 632220 604718
63878 604718 579191 555897 534696 514864 495629 476924 459467 444022 430642 418701 407541
63867 407541 396950 387113 378360 370998 365070 360043 354960 349208 343139 337722 333682 331128 329840 329418
63853 329418 329173 328402 327109 326120 326174 327196 328780 330997 334101 337666 340735 342908 344583 345855 345826 343476
63837 343476 338790 332536 325289 317245 308732 300219 291811 283302 274761 266645 259191 252128 245054 237748
63823 237748 230099 222182 214524 207814 202138 196904 191773 187202 183706 180910 177836 174032 170061 166896
63809 166896 165000 163895 162527 160195 157248 154703 153155 152397 152154 152578 153627 154509 154409 153509 152618 151937
63793 151937 150874 149057 146876 144919 143468 142685 142655 142885 142313 140349 137635 135381 134109 133405 132683 131711
63777 131711 130469 128957 127339 126012 125268 124977 124761 124515 124632 125608 127304 128773 129002 127898 126390 125504
63761 125504 125481 125829 126025 125909 125588 125260 125194 125626 126530 127527 128154 128260 128126 128211 128796 129873 131355 133288 135729
63742 135729 138425 140807 142475 143658 145016 146927 149177 151526 154361 158407 163716 169463 175103 181366
63728 181366 189467 199359 209507 218674 227334 236761 247148 257315 266097 273201 278554 281614 281905 279903
63714 279903 276764 273152 268672 262574 254820 246351 238331 231174 224353 217232 209973 203410 197996 193192
63700 193192 188131 182658 177391 172842 168872 165106 161517 158323 155560 153114 151188 150345 150947 152692 154893
63685 154893 157066 159126 161186 163433 166179 169768 174349 179873 186241 193305 200871 209002 218227 228925
63671 228925 240408 251151 260268 268315 276167 283471 288818 291319 291319 289451 285581 279116 270107 259689
63657 259689 249348 239788 230532 220722 210338 200449 192143 185502 179927 175147 171380 168667 166689 165357
63643 165357 165070 166141 168223 170491 172166 172932 173201 173969 176005 179146 182772 186889 192110 198550 205529
63628 205529 212637 220292 228764 237449 245844 254644 264984 276972 289854 303404 318256 334867 353044
63615 353044 372603 393695 416168 439229 462006 483940 504371 522281 536764 547346 553661 555400
63603 555400 553013 548002 542066 536214 530954 526812 524082 522315 520617 518261 514662 509064 500917 490430
63589 490430 478177 464289 448785 432615 417412 403818 390875 377699 365111 354715 346619 339078
63577 339078 330544 321356 313072 306713 302157 298832 296391 294785 294232 295240 298224 302879 308184 313305
63563 313305 318443 324590 332570 342508 354100 367094 381427 397194 414713 434445 456568 480590
63551 480590 505588 530890 556282 581382 604941 625070 640318 650503 656516 659541 660611 660747
63539 660747 661110 662712 665996 670746 676354 682028 686778 689478 689143 685177 677267 665151 648637 627922
63525 627922 603754 577206 549317 520864 492343 464081 436501 410340 386455 365197 346100
63514 346100 328386 311791 296781 283950 273382 264568 256841 249871 243859 239204 235852 233125 230365
63501 230365 227611 225261 223245 221112 219032 218049 218917 221171 223840 226767 230627 235868 242216 249202 256618
63486 256618 264416 272688 281825 292231 303704 315497 327054 338269 348895 358244 365771 371467 375352
63473 375352 376961 375801 372022 366173 358511 349063 338265 327049 316287 306586 298583 292815 288988
63460 288988 285750 281686 276576 271405 267169 263897 260959 258078 255642 253974 252733 251426 250307 250232 251586
63445 251586 253937 256947 261076 266907 274193 282137 290439 299488 309611 320739 332847 346155 360753
63432 360753 376533 393639 412458 432901 454237 476075 499107 524330 551780 580641 610385
63421 610385 641033 672126 702077 729019 751947 770708 785121 794580 798546 797142 791298 782521
63409 782521 772456 762330 752634 743339 734280 725084 714853 702369 686800 667986 646025 621032
63397 621032 593659 565492 538383 513358 490447 469413 450175 432552 416164 400935 387441
63386 387441 376462 368281 362478 358249 354884 352220 350789 351288 353735 357319 361290 365772 371529 379187
63372 379187 389001 401167 415837 432759 451203 470436 490217 510790 532499 555432 579382 604168
63360 604168 629896 656586 683279 707740 727486 741286 749596 753622 754201 751637 746292 739019 730931
63347 730931 722802 714816 706914 699202 691713 683797 674188 661941 647107 630193 611291 590205 567344
63334 567344 543975 521358 499889 479172 458749 438687 419622 402278 386765 372443 358686
63323 358686 345738 334475 325325 317861 311579 306640 303441 301706 300478 299073 297753 297301 298032 299380
63309 299380 300482 301066 301610 302589 303771 304471 304399 303911 303399 302760 301633 299949 298032 296284 294936 294034 293455
63292 293455 292947 292238 291185 289857 288588 287865 287991 288763 289627 290219 290667 291332 292396 293779 295280 296673
63276 296673 297773 298530 299062 299578 300364 301819 304266 307595 311231 314562 317324 319567 321475 323351 325555
63261 325555 328200 331019 333735 336509 339802 343827 348313 352822 357130 361268 365337 369370 373358 377373
63247 377373 381641 386426 391760 397356 402875 408330 414194 421131 429563 439497 450713 463175 477126
63234 477126 492716 509627 527301 545521 564523 584523 605417 627000 649183 671740 694098
63223 694098 715688 736451 756695 776509 795561 813549 830642 847372 864152 880969 897555
63212 897555 913795 929740 945046 958484 968409 973786 974524 970780 962420 949433 932398 911992 888357
63199 888357 861643 833101 804869 778489 754114 731389 710502 691943 675745 661621 649676
63188 649676 640388 633944 630102 628810 630468 635289 642748 651972 662463 674197 687179 701279 716425
63175 716425 732582 749401 766255 782877 799740 817460 835829 853744 870213 885194 899327
63164 899327 912929 925433 935721 942891 946666 947170 944397 937990 927605 913387 895993 876126 854285
63151 854285 830952 806825 782676 759120 736665 715836 697007 680150 664922 650975 638047
63140 638047 625845 614157 603163 593361 584994 577722 571021 564800 559382 554874 550831 546760 542794
63127 542794 539571 537420 535926 534469 532991 531983 531856 532674 534449 537250 540890 544860 548793 552740 556793
63112 556793 560816 564862 569518 575311 581921 588489 594675 600909 607614 614684 621891 629296 636975 644699
63098 644699 652177 659372 666281 672660 678235 682937 686627 688874 689486 689162 689061 689590 690072 689830 689262 689395
63082 689395 690525 691773 692155 691751 691515 692126 693465 695235 697615 700983 705372 710613 716822 724233 732649
63067 732649 741596 751004 761164 771893 782520 793103 805041 819808 837362 856467 876415 897855
63055 897855 922002 949619 980779 1014996 1051427 1089393 1129001 1170938 1215569 1262473 1310858
63044 1310858 1359970 1409012 1457240 1504475 1551148 1597470 1642858 1686498 1728249 1768690 1808570
63033 1808570 1848562 1889142 1930078 1969990 2006996 2039951 2068749 2093365 2112906 2125715 2130096
63022 2130096 2124783 2109094 2083104 2047731 2004447 1954769 1900022 1841490 1780682 1719329 1659100
63011 1659100 1601354 1547167 1497536 1453430 1415599 1384456 1360121 1342431 1330883 1324831 1323917 1328215
62999 1328215 1337774 1352228 1370891 1393036 1417853 1444490 1472547 1502371 1534459 1568585 1603804
62988 1603804 1639187 1674057 1707641 1739143 1768361 1795650 1820922 1843035 1860468 1872255 1877943
62977 1877943 1876974 1868621 1852427 1828396 1796808 1758143 1713097 1662525 1607543 1549741 1490847 1431759
62965 1431759 1372319 1312631 1254354 1199932 1150574 1105679 1064303 1026364 992073 961006 932484
62954 932484 906480 883470 863525 846123 830749 817141 804955 793768 783553 774711 767384 761101
62942 761101 755275 749696 744272 738613 732323 725601 719163 713522 708592 703981 699406 694718 689776 684486
62928 684486 678899 673206 667720 662841 658803 655282 651393 646361 640255 633953 628331 623490 618788 613570
62914 613570 607849 602311 597673 594064 591011 587883 584220 579753 574469 568768 563378 558925 555668 553657
62900 553657 552847 552881 553078 553001 552912 553324 554233 555121 555577 555497 554721 552978 550309 547119 543639 539742 535456 531265
62882 531265 527649 524673 522267 520559 519632 519300 519476 520454 522353 524566 526237 527182 527918 528920 530283 532025
62866 532025 534169 536443 538336 539574 540354 541073 542112 543731 545736 547238 547268 545804 543872 542439 541505
62851 541505 540391 538604 536239 533796 531785 530298 528887 527084 525067 523468 522439 521337 519518 517069
62837 517069 514518 512195 510178 508509 507063 505430 503301 500810 498211 495479 492635 490193 488672 487703
62823 487703 486166 483398 479880 476539 473725 471092 468271 465307 462460 459825 457334 455052 453317 452450
62809 452450 452439 453125 454607 457056 460031 462483 463857 464946 467137 470964 475850 481189 487137 494208 502602
62794 502602 512197 522836 534380 546692 559864 574287 590284 607818 626712 646922 668470 691422
62782 691422 716211 743764 774945 809955 848586 890869 937103 987379 1041562 1099768 1162336
62771 1162336 1229157 1299463 1372435 1447513 1523732 1599147 1671474 1739029 1800472 1853812 1896405
62760 1896405 1926183 1942411 1945145 1934496 1910793 1875063 1828884 1773950 1712070 1645216 1575017
62749 1575017 1502298 1427628 1352296 1278277 1207162 1139503 1075309 1014759 958205 905843 857701
62738 857701 813771 773862 737468 704080 673652 646539 622862 601972 582639 563934 546059
62727 546059 530192 517271 506895 497635 488431 479479 471681 465571 460955 457369 454515 452309 450774
62714 450774 449998 450133 451376 453932 457929 463369 470192 478341 487678 497957 509155 521836 536908 554920
62700 554920 575805 599369 625752 655237 687883 723591 762397 804485 850010 899026 951391
62689 951391 1006571 1063726 1122194 1181641 1241393 1299669 1353862 1401682 1441821 1473568 1496081
62678 1496081 1508332 1509641 1500030 1479955 1449914 1410576 1363325 1310311 1253662 1194761 1134505 1074016
62666 1074016 1014599 957079 901728 848948 799474 753758 711724 673412 639253 609241 582311
62655 582311 557205 533667 512227 493059 475699 459757 445212 431957 419594 407853 396735
62644 396735 386205 376143 366772 358682 352163 346790 341828 336898 332113 327752 323915 320429 317001 313472
62630 313472 309782 305734 301175 296581 292992 290887 289482 287676 285448 283619 282528 281812 281423 281833 282982
62615 282982 283982 284418 285130 287098 290102 293217 296129 299219 302659 306332 310594 316330 323973 332963 342372
62600 342372 351803 361588 372446 385101 399937 416802 435204 454792 475648 498230 523194 551184
62588 551184 582468 616677 653008 690799 729767 769679 809834 848894 885164 917064 943472
62577 943472 963757 977575 984697 985038 978756 966267 948171 925141 897835 866927 833341 798354
62565 798354 763303 729103 696146 664654 634934 607297 581945 558986 538351 519687 502512
62554 502512 486594 472006 458734 446462 434793 423421 412018 400323 388570 377601 368198 360376
62542 360376 353453 346706 339843 333087 327022 322174 318496 315369 312336 309709 308215 308176 309236 310822 312644
62527 312644 314794 317593 321311 325946 331240 336979 343195 350117 358117 367655 378908 391307 403867
62514 403867 416298 429499 444624 462031 481547 503404 528245 556256 586828 619070 652162
62503 652162 685261 717660 749174 779819 808895 834863 856368 872916 884268 889687 888346 880289
62491 880289 866510 848134 825889 800351 772337 742923 713215 684103 656069 629227 603674
62480 603674 579813 558224 539205 522569 507912 494999 483859 474579 467043 460861 455549 450760
62468 450760 446382 442448 438977 435916 433180 430789 428989 428154 428522 430088 432750 436423 440903 445856 451166
62453 451166 457155 464154 471933 479950 488149 497104 507181 517924 528400 537827 545652 551425 555039
62440 555039 556867 557204 555615 551168 543325 532376 519209 504982 490839 477406 464430 451296 437962
62427 437962 425057 413126 402274 392608 384412 377663 371939 367207 364124 363021 363089 363301 363832 365743
62413 365743 369423 374232 379714 386229 394020 402469 410830 419107 427632 436299 444875 453674 463103 472647
62399 472647 481061 487653 492798 497049 500287 501980 501858 500058 496885 492721 487965 482832 477279 471260
62385 471260 464984 458887 453412 448837 445175 442277 440176 439335 440348 443408 448261 454696 462844 472994
62371 472994 485401 500351 518232 539429 564245 592876 625254 660957 699564 741100 785891
62360 785891 833973 884940 938314 993601 1049766 1104982 1157170 1204640 1246179 1280759 1307311
62349 1307311 1324678 1331920 1329139 1317982 1300775 1278896 1252347 1221038 1185820 1147951 1108215 1067191
62337 1067191 1025930 985523 946158 907369 869283 833069 799955 770246 743437 718948 696461
62326 696461 675772 656524 638203 620486 603674 588599 575920 565637 557419 551091 546490 543091
62314 543091 540284 537955 536399 535590 534922 533707 531667 528888 525516 521569 516921 511468 505438 499383 493656
62299 493656 488079 482369 476679 471421 466707 462375 458452 455184 452745 451322 451339 453079 456149 459840 463993
62284 463993 468949 474719 480850 487213 494236 502143 510643 519596 529354 540017 551015 561945 573322
62271 573322 585864 599471 613553 628086 643678 660809 679658 700587 724124 750403 779254
62260 779254 810983 846532 886636 931161 979399 1030522 1083439 1136485 1187554 1234493 1275359
62249 1275359 1308584 1333155 1348522 1354338 1350566 1337892 1317671 1291155 1258995 1221717 1180384 1136390
62237 1136390 1090774 1044193 997523 952045 908854 868486 831328 798099 769541 745688 725727
62226 725727 708639 693820 681107 670416 661464 653813 647136 641404 636758 633137 630092 627059 623789
62213 623789 620433 617307 614686 612782 611680 611248 611231 611557 612517 614583 618049 622777 628353 634598 641962
62198 641962 651203 662556 675433 689178 703827 719768 736902 754781 773571 794196 817262 842237
62186 842237 868000 893712 918824 942589 964082 982560 997556 1008938 1017275 1023866 1029831 1035203
62174 1035203 1039376 1042426 1045614 1050594 1058603 1070495 1087061 1108788 1135269 1165106 1196601 1228599
62162 1228599 1260593 1291948 1321249 1346729 1367272 1382590 1392519 1396835 1395978 1391230 1383638 1373232
62150 1373232 1359791 1343841 1326215 1307070 1286167 1263921 1241367 1219231 1197822 1177735 1159788
62139 1159788 1144135 1130236 1117804 1107036 1097725 1088974 1080131 1071431 1063426 1056422 1050732 1046782 1044579
62126 1044579 1043614 1043688 1045199 1048298 1052407 1057191 1063362 1071900 1082912 1095883 1110608 1127076 1144684
62113 1144684 1162409 1179781 1197089 1214606 1232122 1249355 1266444 1283923 1302463 1322657 1344853
62102 1344853 1369191 1395822 1424873 1456087 1488908 1523248 1559881 1599668 1642679 1688364 1736286
62091 1736286 1786153 1837325 1888849 1939891 1989755 2037744 2083701 2128764 2174954 2223705 2275019
62080 2275019 2327900 2381098 2433257 2482929 2528960 2570910 2609019 2643900 2676349 2707348 2738106
62069 2738106 2770029 2804364 2841616 2881263 2922183 2963326 3004005 3043823 3082543 3119859 3155071
62058 3155071 3187247 3215981 3241771 3265292 3286580 3305437 3322458 3339003 3355957 3372914 3388708
62047 3388708 3402482 3414289 3425075 3436215 3448704 3462611 3477556 3493666 3511675 3532000 3554179
62036 3554179 3577453 3601534 3626450 3651910 3677185 3701523 3724414 3745465 3764274 3780420 3793460
62025 3793460 3802924 3808511 3810287 3808603 3803729 3795698 3784580 3770894 3755587 3739555 3723303 3707165
62013 3707165 3691597 3677002 3663437 3650995 3640446 3632959 3629007 3628077 3629755 3634596 3643448 3656362 3672756
62000 3672756 3692238 3714467 3738297 3761877 3783759 3803335 3820109 3833255 3842232 3847283 3848851 3846860
61988 3846860 3841002 3831573 3819720 3806875 3794135 3782038 3770704 3760109 3750142 3740373 3729980 3718267
61976 3718267 3705161 3690860 3675073 3657087 3636642 3614227 3590328 3564803 3537290 3507836 3476859
61965 3476859 3444863 3412475 3380383 3348775 3317108 3284900 3252613 3221383 3191965 3164343 3138281
61954 3138281 3113825 3091252 3070946 3053468 3039469 3029352 3023184 3021021 3023103 3029600 3040325 3054879
61942 3054879 3073072 3095042 3120887 3150115 3181503 3213652 3245870 3278507 3312289 3347311 3382711
61931 3382711 3417256 3450031 3480521 3508371 3533360 3555581 3575439 3593479 3610502 3627933 3647823
61920 3647823 3672266 3702892 3741088 3788517 3847175 3919033 4005896 4109477 4231202 4371913 4532245
61909 4532245 4713467 4917603 5146634 5402160 5686298 6002530 6355133 6747913 7183820
61900 7183820 7665239 8193480 8767133 9380467 10022382 10675248 11313554 11903780 12406799
61891 12406799 12782742 12997226 13027559 12867131 12526413 12030354 11413625 10715215 9973318
61882 9973318 9221250 8485212 7784088 7130286 6530766 5988023 5501237 5067494 4682831
61873 4682831 4342903 4043211 3779157 3546355 3341155 3160698 3002362 2863490 2742004
61864 2742004 2636924 2547704 2473092 2411122 2360239 2319973 2290467 2271799 2263796 2266035 2277785
61853 2277785 2298115 2325979 2359955 2398166 2438995 2481688 2525568 2568626 2607638 2639805 2663639
61842 2663639 2678301 2683177 2678670 2666621 2649320 2628648 2606604 2585810 2568560 2555760 2547558 2544645
61830 2544645 2548074 2557893 2572601 2589852 2607108 2621734 2631110 2632853 2624841 2605555 2574983 2534861
61818 2534861 2487401 2433993 2375753 2314864 2254290 2196124 2141149 2090152 2044693 2006178 1974921
61807 1974921 1950641 1933349 1923296 1920463 1924639 1935829 1954241 1979961 2012748 2052050 2097245 2148255
61795 2148255 2205921 2271342 2344792 2425800 2514376 2611591 2718738 2836614 2966065 3108741
61785 3108741 3266771 3442087 3636658 3853119 4094653 4364521 4666393 5005161 5386888
61776 5386888 5817891 6304228 6852109 7468318 8159923 8933571 9794732 10746737 11789344
61767 11789344 12916954 14116532 15365383 16629163 17860840 19001297 19982572 20734834
61759 20734834 21196822 21326994 21111537 20566834 19736294 18682612 17477180 16189479 14879495
61750 14879495 13594499 12368970 11225695 10177225 9227837 8375919 7616188 6941371 6343398
61741 6343398 5814178 5345976 4931515 4564151 4238146 3948697 3691555 3462642 3258211
61732 3258211 3075366 2912160 2767001 2638117 2523709 2422305 2332500 2252464 2180180 2114185
61722 2114185 2053556 1997018 1942737 1889463 1837463 1787756 1740694 1695937 1653616 1614650 1579690
61711 1579690 1548374 1520008 1494501 1472136 1452715 1435392 1419296 1403971 1389256 1375033 1361138
61700 1361138 1347353 1333405 1319038 1304104 1288578 1272551 1256192 1239597 1222710 1205499 1188149
61689 1188149 1170777 1153029 1134499 1115721 1098227 1083131 1069929 1057184 1044206 1031557 1020044
61678 1020044 1009815 1000588 992267 985084 979363 975338 973025 972165 972476 974022 977108 981798 987668 994005
61664 994005 1000009 1004837 1007819 1008813 1008238 1006803 1005328 1004564 1004708 1005200 1005457 1005765 1006928 1009118 1011782 1014702
61648 1014702 1018217 1022104 1025163 1026533 1026703 1026441 1025386 1022579 1017978 1012455 1006516 999996 992999 986295
61634 986295 980675 976709 975137 976648 981020 987243 994743 1003822 1014574 1026119 1037259 1047264 1055524
61621 1055524 1061129 1063561 1063453 1061983 1059629 1056074 1051206 1045702 1040535 1036201 1032402 1028260 1022940 1016331
61607 1016331 1009130 1002137 995509 988793 981508 973563 965260 957031 949065 941131 932869 924217 915336 906268
61593 906268 897066 888128 879823 871761 863223 854545 847279 842442 839342 836785 834785 834204 835247 837391
61579 837391 840614 845642 852907 862168 873320 886701 902337 919717 938695 959892 983789 1010026
61567 1010026 1038108 1068235 1100854 1135769 1172263 1209730 1247569 1284657 1319596 1351543 1380441
61556 1380441 1406570 1430282 1452112 1472607 1491981 1510244 1527631 1544376 1560043 1573587 1584355
61545 1584355 1592579 1598619 1602053 1601908 1597549 1588973 1576417 1560220 1541080 1520032 1497942 1475276 1452502
61532 1452502 1430485 1410213 1392153 1376020 1361222 1347562 1335630 1326508 1320963 1318908 1319786 1323467
61520 1323467 1330504 1341461 1356415 1375393 1398986 1428066 1463044 1503886 1550900 1605094 1667589
61509 1667589 1738983 1819553 1909965 2011584 2126113 2254922 2398705 2557740 2732439 2923389
61499 2923389 3130637 3352998 3588020 3832047 4079668 4323139 4552926 4759100 4932336
61490 4932336 5064443 5149322 5184237 5170031 5110121 5009761 4876062 4717562 4542745 4358919
61480 4358919 4172397 3988839 3812601 3646103 3490530 3347063 3217101 3101677 3001300
61471 3001300 2916171 2846011 2789860 2746649 2715897 2697342 2690031 2692404 2703340 2722617 2750271 2785912
61459 2785912 2828658 2877254 2930106 2985592 3042441 3099632 3156052 3210681 3263111 3313504 3362008
61448 3362008 3408579 3453335 3496772 3539671 3583053 3627914 3674418 3721532 3768128 3814344 3861052
61437 3861052 3908018 3953553 3996227 4035984 4072988 4106250 4134177 4155953 4171487 4180222 4180844 4172237
61425 4172237 4154265 4127654 4093572 4053395 4008544 3960463 3910818 3861420 3813621 3768015 3725122
61414 3725122 3686148 3652545 3624925 3602924 3586119 3574492 3567859 3565406 3566076 3569029 3573366 3577713 3580509
61401 3580509 3580640 3577528 3570781 3560155 3545885 3528786 3509927 3490495 3472107 3456981 3447491 3445658
61389 3445658 3453234 3472144 3504421 3551568 3614289 3693133 3789297 3904597 4040645 4198198 4377144
61378 4377144 4576775 4795856 5032484 5283942 5546579 5815607 6084842 6346511 6591383
61369 6591383 6809441 6991061 7128306 7215979 7252217 7238476 7178853 7078970 6944943 6782651
61359 6782651 6597213 6392822 6173257 5942710 5705914 5467379 5230717 4998779 4774031
61350 4774031 4558487 4353467 4159717 3977619 3807166 3648232 3501249 3367265 3246833
61341 3246833 3139194 3043145 2958405 2885374 2823821 2772784 2731856 2701642 2682574 2674046 2675058
61330 2675058 2684956 2702935 2727475 2757044 2791056 2829455 2871613 2916225 2962110 3008382 3053906
61319 3053906 3097307 3137843 3175806 3211717 3245361 3275908 3302825 3326404 3347413 3366485 3383947
61308 3383947 3400004 3414695 3427455 3436934 3441593 3440583 3433926 3421938 3404784 3382647 3355975 3325307
61296 3325307 3290954 3252976 3211405 3166448 3118581 3068499 3016916 2964459 2911919 2860511 2811576
61285 2811576 2766021 2724335 2687124 2655190 2628903 2607929 2591834 2580736 2574972 2574221 2577152 2581897
61273 2581897 2586863 2591284 2595198 2598871 2602266 2605223 2607990 2611136 2614756 2618140 2620368 2620971 2619883 2617157
61259 2617157 2613060 2608240 2603599 2600227 2599673 2603979 2615164 2634842 2664457 2705466 2758862 2824745 2902693
61246 2902693 2992286 3092724 3201990 3316739 3432958 3546270 3651487 3742337 3812091 3854690
61236 3854690 3865556 3841927 3783147 3691146 3570700 3428777 3273045 3110568 2947398 2788512
61226 2788512 2637335 2495446 2363473 2242329 2133058 2035545 1948347 1870180 1800882 1740450
61216 1740450 1687872 1641619 1600785 1565015 1533764 1506474 1483264 1464592 1450293 1439694 1432695
61205 1432695 1429999 1432061 1438454 1448471 1461850 1478549 1498174 1519846 1542470 1564970 1586496 1606490
61193 1606490 1624442 1639658 1651601 1660474 1667139 1672358 1676300 1678688 1679084 1676985 1672065 1664496 1654820
61180 1654820 1643380 1630022 1614400 1596366 1576011 1553533 1529112 1502800 1474600 1444808 1414166
61169 1414166 1383384 1352584 1321565 1290544 1260218 1230972 1202414 1173885 1145190 1116640 1088622
61158 1088622 1061454 1035532 1011283 988877 968111 948666 930399 913197 896533 879409 860996
61147 860996 841231 820591 799417 777878 756565 736552 718623 702870 689267 678123 669552 662951
61135 662951 657563 653301 650509 649147 648833 649544 651676 655423 660602 667044 674667 683107 691777 700398 709105
61120 709105 717999 727017 736389 746800 758835 772419 786897 801559 816096 830681 845557 860499
61108 860499 874859 888249 900747 912185 921672 928284 931846 932668 931011 927483 923302 919149 914054
61095 914054 906605 897204 887915 879916 872265 863599 853872 843675 832835 820702 807327 793443 779518
61082 779518 765534 751531 737771 724457 711749 699994 689569 680561 672875 666515 661487 657579
61070 657579 654489 652038 650117 648586 647438 646840 646872 647406 648300 649479 650788 652034 653227 654494 655817
61055 655817 657295 659555 663176 667580 671313 673731 675748 678522 682101 685802 689268 692454 695224 697792
61041 697792 701191 706524 713900 722676 732466 743232 754647 766177 777755 789776 802381 815332
61029 815332 828557 842265 856500 871052 885819 900793 915649 929800 943036 955840 969051
61018 969051 983340 998849 1015105 1031515 1048254 1066403 1086881 1109578 1134032 1160569 1190136
61007 1190136 1223244 1259848 1300138 1344715 1393903 1447510 1505319 1567199 1632736 1701550 1774293
60996 1774293 1852824 1939222 2035126 2142132 2262104 2396653 2546714 2713095 2897392 3102587
60986 3102587 3333508 3597185 3902635 4260429 4682988 5185174 5783632 6495500 7339129
60977 7339129 8336967 9516686 10908374 12541130 14440917 16621120 19053984 21629349
60969 21629349 24134308 26290340 27847531 28686896 28868903 28603744 28169857 27824820 27733352
60960 27733352 27917416 28238293 28431231 28197730 27321776 25751987 23609198 21124537 18549920
60951 18549920 16087264 13859571 11918292 10266651 8881918 7730731 6778255 5992411
60943 5992411 5344372 4808058 4360932 3985160 3666834 3393838 3155094 2941884 2748918
60934 2748918 2573523 2414002 2268686 2135760 2013482 1900760 1797603 1704472 1620870 1544948
60924 1544948 1474599 1408423 1345365 1284211 1224249 1166160 1111481 1061129 1014905 972324 933347
60913 933347 898134 866597 838410 813181 790439 769731 750856 733819 718421 704190 690880
60902 690880 678766 668232 659281 651647 645157 639669 634831 630290 626110 622717 620455 619426 619679 621217
60888 621217 623813 627227 631611 637331 644282 651732 659083 666397 673853 681093 687561 693308 698902 704464
60874 704464 709292 712592 714260 714695 714054 711983 708071 702395 695562 688243 680726 672942 664895 656871 649211
60859 649211 642067 635565 629932 625201 620986 616995 613673 611883 611901 613184 615324 618734 624126 631668 640999
60844 640999 651806 664008 677571 692506 708866 726282 743652 759755 774238 787606 800259
60833 800259 812055 822999 833853 845581 858277 870952 882341 891721 899002 904295 907589 908948
60821 908948 909009 908987 909811 911214 912103 912006 911774 912519 914184 915573 915561 913729 909884 903706 895141 884709 873035
60804 873035 860314 846533 831944 817010 802067 787396 773429 760495 748472 737143 726852
60793 726852 718310 711670 706282 701643 698203 696877 698008 701185 705878 711817 718792 726508 734766 743550
60779 743550 752823 762460 772422 782755 793220 803155 811926 819499 826456 833501 840984 848750 856277 863039
60765 863039 868879 874049 878839 883344 887715 892405 897813 903696 909337 914468 919724 925945 933242 941051
60751 941051 948931 956860 964727 971941 977919 982861 987747 993467 999995 1006362 1011368 1014267 1014900 1013449
60737 1013449 1010353 1006474 1002895 1000128 997527 993890 988732 982749 976899 971290 965176 957856 949366 940397
60723 940397 931710 923587 915708 907628 899385 891438 883931 876376 868319 860061 852325 845351 838695 831772
60709 831772 824168 815495 805547 794882 784806 776434 769914 764774 760785 758143 756969 757027 758031 760001
60695 760001 763162 767576 773012 779190 785956 793102 800049 805908 809902 811582 810684 807053 800798 792193
60681 792193 781281 768004 752995 737687 723009 708398 692919 677140 662931 651309 641552 632733
60669 632733 625109 619304 615078 611860 609909 609818 611204 612996 615034 618222 622804 627462 630709 632516 633929
60654 633929 635548 637057 638061 638704 639402 640384 641615 642989 644580 646808 650214 654814 659813 664269 667957
60639 667957 671217 674113 676353 678220 680923 685510 691770 698780 706295 714960 725218 736813 749516
60626 749516 763588 779063 795216 811443 828192 846226 865119 883326 899764 914631 928463
60615 928463 941092 951817 960092 965652 968452 968957 968144 966715 964416 960486 954641 947349 939283 930888
60601 930888 922360 913679 904559 894616 883677 871837 859192 845679 831291 816547 802620 790732
60589 790732 781243 773543 767071 762116 759208 758078 757955 758768 761099 764816 768656 771615 773920 776071 777795
60574 777795 778739 779544 781173 783547 785853 787949 790424 793311 795815 797531 799028 800828 802547 803455 803298
60559 803298 802137 799844 796309 791824 786838 781521 775906 770298 765245 761160 758155 756174 755197 755471 757702
60544 757702 762843 771536 783745 798958 816714 836979 860180 886877 917238 950791 986643 1023675
60532 1023675 1060187 1093557 1120736 1139353 1148336 1147640 1137783 1119742 1095111 1066158 1035670 1006430
60520 1006430 980516 959009 942439 931215 925431 924568 927887 934955 945394 958313 972541 987388
60508 987388 1002708 1018311 1033877 1049525 1065917 1083780 1103864 1127511 1156627 1192828 1237012
60497 1237012 1289964 1352910 1427267 1514318 1615513 1732696 1867715 2021994 2196688 2392922
60487 2392922 2611606 2853251 3118111 3405993 3715143 4040553 4372419 4695196 4988090
60478 4988090 5227839 5393021 5467705 5443264 5319248 5104043 4814388 4472698 4103117 3728005
60468 3728005 3365512 3028151 2722632 2451087 2212810 2005505 1825970 1670719 1536488
60459 1536488 1420438 1320136 1233394 1157953 1091403 1031844 978685 932269 892475 858024 827308
60448 827308 799458 774336 751959 732299 715270 700466 687179 674879 663340 652133 640570
60437 640570 628554 616962 606628 597401 588732 580735 573906 568116 562720 557589 553276 550101 547689
60424 547689 545558 543639 542045 540736 539603 538610 537857 537766 539059 542125 546430 550986 555363 559807 564400
60409 564400 568710 572445 575946 579782 584186 589044 594089 598867 602851 605943 608742 612079 616348 621333
60395 621333 626532 631541 636256 640838 645410 649752 653407 656188 658505 661083 664318 667827 670608 671804
60381 671804 671454 670385 669286 668057 666255 663994 661994 660748 659951 658894 657284 655564 654516 654531 655240
60366 655240 655904 656158 656257 656614 657423 658843 661181 664549 668586 672778 676871 680696 684032 687136 691095 696936
60350 696936 704355 711987 719030 726071 734068 743034 752077 760391 767826 774568 780608 785564 788939 790578
60336 790578 790859 790411 789700 788900 787930 786453 784168 781491 779796 780540 784135 790018 797602 806554 816096 824730
60320 824730 831062 834605 835568 834165 830403 824335 816321 807145 797900 789455 781942 774995 768569 763145
60306 763145 759083 756189 754073 752532 751373 750282 749200 748468 748290 748421 748752 749791 752034 755106 758108
60291 758108 760777 763699 767316 771216 774627 777280 779525 781767 783994 785826 787003 787849 789211 791717
60277 791717 795134 798623 801615 804227 806887 809916 813591 818296 824268 831302 838997 847284 856519 867031
60263 867031 878845 891950 906706 923696 943147 964628 987522 1011834 1038493 1068755 1103250
60252 1103250 1141677 1183533 1229143 1279730 1336270 1398481 1465294 1536420 1613074 1696942 1788601
60241 1788601 1887229 1991596 2100861 2214282 2330506 2447473 2562986 2675248 2782868 2884470
60231 2884470 2978358 3062524 3134911 3193675 3237505 3266144 3280733 3283197 3274895 3255932 3226189 3186970
60219 3186970 3141338 3092789 3043888 2996195 2951067 2910257 2875888 2850113 2834674 2830609 2838374 2858300
60207 2858300 2890810 2936118 2993976 3063974 3146020 3240153 3345631 3460283 3580899 3704329
60197 3704329 3828061 3949663 4065778 4172076 4264465 4340349 4398585 4438408 4458765 4458800 4438708
60186 4438708 4399861 4344239 4273932 4191205 4098767 3999813 3897796 3796264 3698891 3609384 3530987
60175 3530987 3465821 3414757 3378051 3356140 3349783 3359519 3385133 3425672 3479893 3546569 3624284 3710890
60163 3710890 3803209 3897340 3989218 4074868 4150461 4212687 4259386 4289734 4303771 4302050 4285875
60152 4285875 4257533 4219903 4175918 4128575 4081153 4036971 3998867 3969179 3950163 3944141 3953158 3978678
60140 3978678 4021681 4082995 4163754 4265650 4390556 4539596 4712755 4909714 5130902 5377346
60130 5377346 5649576 5947003 6268142 6610741 6971486 7345934 7728886 8114527 8496275
60121 8496275 8867037 9219828 9547858 9844114 10101685 10315117 10481143 10597613 10661940 10671137
60111 10671137 10623329 10518882 10360195 10150977 9896103 9601988 9276767 8929925 8571624
60102 8571624 8212111 7861229 7527786 7218846 6939438 6692971 6481836 6307583 6170846
60093 6170846 6071578 6009377 5983283 5991227 6029958 6095559 6183779 6289963 6409090 6535993 6665137
60082 6665137 6790078 6903740 6999744 7073523 7122243 7144276 7139225 7108068 7052667 6975039 6877306
60071 6877306 6762001 6631750 6488441 6333147 6167156 5992983 5814247 5634695 5457497
60062 5457497 5285277 5120506 4965577 4822607 4693349 4579371 4482068 4402340 4340473 4296584
60052 4296584 4271094 4264460 4276566 4306799 4354706 4420098 4502314 4599757 4710269 4831430 4960018
60041 4960018 5091480 5220483 5342056 5452062 5546833 5622887 5677158 5707397 5712345 5691724 5646061
60030 5646061 5576443 5484489 5372632 5244273 5103548 4954954 4803147 4652665 4507439 4370656
60020 4370656 4245126 4133412 4037171 3956587 3891077 3840681 3806467 3789528 3789948 3807001 3840108
60009 3840108 3889448 3955844 4040257 4143269 4264726 4403726 4558816 4728016 4908480 5096225
59999 5096225 5286299 5473241 5651385 5814994 5958609 6077674 6168986 6230611 6261555 6261614 6231346
59988 6231346 6171852 6084533 5971378 5835692 5682368 5517273 5346353 5175198 5008942 4852092
59978 4852092 4708414 4581117 4472891 4385549 4319810 4275822 4253728 4253354 4273519 4312235 4367682
59967 4367682 4438602 4523695 4621076 4728467 4843467 4963403 5085143 5205182 5319791 5425396
59957 5425396 5519472 5601166 5670502 5726938 5769385 5797829 5814083 5820533 5819017 5811718 5802445 5795961
59945 5795961 5796312 5806812 5831491 5875388 5943041 6037451 6160923 6316277 6506743 6734963 7002354
59934 7002354 7308976 7653423 8032823 8442883 8877533 9328011 9782407 10226307 10643806
59925 10643806 11018007 11331511 11567986 11714515 11763244 11711617 11562142 11322570 11005941 10629233
59915 10629233 10210739 9767764 9315842 8868828 8438596 8034236 7661848 7325274 7026935
59906 7026935 6768081 6548872 6368826 6227294 6123505 6056441 6024994 6028132 6064591 6132509
59896 6132509 6229638 6353890 6503159 6674345 6862598 7061580 7264158 7462493 7647472 7808553
59886 7808553 7934849 8016925 8048002 8024003 7943230 7806596 7618139 7384854 7115674 6820367
59876 6820367 6508772 6190151 5872592 5562848 5266552 4988171 4730606 4495194 4282410
59867 4282410 4092503 3925450 3780649 3656858 3552283 3464660 3391566 3330772 3280018 3236453
59857 3236453 3196901 3159044 3121911 3084914 3047014 3007526 2967289 2928176 2891513 2857642 2826984
59846 2826984 2800725 2780171 2765905 2757677 2754436 2754088 2753668 2750226 2741536 2725988 2702444 2670695 2631894
59833 2631894 2588077 2541281 2493305 2446073 2401770 2362467 2329804 2304927 2288397 2280108 2279543 2286305
59821 2286305 2300184 2320585 2346182 2375529 2407993 2443820 2483377 2526835 2574731 2628204 2687977
59810 2687977 2753089 2820974 2888689 2953706 3013749 3066692 3110911 3145426 3169609 3183350 3187741
59799 3187741 3185064 3177666 3167236 3155432 3144576 3137067 3134418 3137548 3147867 3167445 3198201 3241540
59787 3241540 3298841 3371800 3462162 3571569 3701786 3854885 4033174 4239200 4475625 4744547
59777 4744547 5046686 5381149 5745190 6132882 6533105 6928597 7296819 7611916 7847648
59768 7847648 7982046 8002900 7911084 7719751 7450632 7129846 6784013 6436410 6104070 5797341
59758 5797341 5521735 5280106 5073627 4901846 4762806 4653561 4570794 4511390 4472927 4453931
59748 4453931 4453595 4471114 4505350 4555275 4620665 4702083 4800052 4914405 5044628 5190718 5353578
59737 5353578 5534756 5736049 5959308 6206279 6478569 6777884 7106396 7466739 7861508
59728 7861508 8292659 8761147 9266939 9809241 10386467 10995557 11630967 12284413 12945748
59719 12945748 13604124 14248498 14867894 15452522 15995765 16495968 16957049 17387909 17800980
59710 17800980 18210371 18630128 19072854 19548452 20062970 20617915 21210167 21831810 22469654
59701 22469654 23105373 23717076 24281564 24776039 25179619 25475675 25654516 25714500 25661085 25505564
59691 25505564 25264708 24960346 24617325 24260422 23912265 23593042 23320689 23110336 22973616
59682 22973616 22919244 22954579 23086435 23320425 23660434 24109374 24669845 25342642 26124104 27005120
59672 27005120 27971982 29006180 30081885 31163781 32207824 33163948 33978773 34599019 34977136
59663 34977136 35078014 34884034 34397641 33641853 32657855 31498977 30223296 28888191 27546887
59654 27546887 26244791 25015853 23881480 22852097 21928338 21100641 20349565 19648530 18967505
59645 18967505 18276512 17550105 16773051 15943968 15074057 14182389 13291224 12422450 11594339
59636 11594339 10819201 10103360 9449033 8856037 8322388 7844557 7417976 7037504 6697800
59627 6697800 6393929 6121960 5878986 5662681 5470974 5301979 5153873 5024810 4912994
59618 4912994 4816704 4734083 4663100 4601894 4548912 4502415 4460017 4419040 4377216 4332803 4284136
59607 4284136 4229490 4167482 4097446 4019454 3934225 3843085 3747891 3650886 3554512 3461042 3372125
59596 3372125 3288685 3211352 3140900 3078097 3023245 2976069 2936121 2903238 2877683 2859881 2849908
59585 2849908 2847106 2850308 2858530 2871346 2888484 2909261 2932662 2957891 2984521 3011987 3039232 3065168
59573 3065168 3089501 3112894 3136326 3160561 3186421 3215224 3248458 3287048 3331389 3382160 3440616
59562 3440616 3507848 3584237 3670013 3766000 3873392 3993198 4126396 4274340 4438317 4618802
59552 4618802 4815702 5029258 5260115 5508452 5773472 6053612 6346610 6649335 6958157
59543 6958157 7269570 7579912 7884494 8177889 8455558 8714886 8954561 9173596 9371209
59534 9371209 9546878 9699889 9829187 9934424 10017338 10082084 10134536 10181232 10228376 10281160
59524 10281160 10343850 10420206 10512987 10622484 10745635 10876601 11007670 11129276 11229896 11297056
59514 11297056 11319143 11286789 11193476 11035834 10813751 10530202 10190997 9804565 9381431 8933247
59504 8933247 8471793 8008251 7552581 7113020 6696041 6306492 5947418 5619901 5323741
59495 5323741 5058529 4823812 4618404 4440237 4287118 4157117 4048207 3958267 3885798 3830063
59485 3830063 3790208 3764925 3753430 3756192 3774180 3807848 3857286 3922802 4004735 4103058 4217749
59474 4217749 4349359 4498759 4666530 4852928 5058033 5281411 5521703 5776676 6043158
59465 6043158 6316498 6590336 6857156 7108694 7335733 7528453 7677844 7776733 7819567 7802513
59455 7802513 7724957 7590510 7405657 7177651 6914224 6624432 6318133 6004267 5690192 5382311
59445 5382311 5086099 4805155 4541058 4294515 4066253 3856803 3666174 3494040 3339722
59436 3339722 3201755 3078036 2966803 2867329 2779505 2702983 2636815 2579756 2530825 2489637 2456055
59425 2456055 2429466 2408734 2393051 2382486 2377360 2377475 2382371 2391882 2405806 2423390 2443802 2466937
59413 2466937 2493135 2522423 2554764 2590672 2630338 2671896 2711582 2746314 2775944 2803014 2831016
59402 2831016 2863157 2902134 2950272 3009670 3082001 3167776 3265743 3373385 3488280 3609167 3736433
59391 3736433 3872438 4021513 4188872 4379130 4595899 4842468 5122049 5437228 5789812
59382 5789812 6181451 6613739 7087146 7599935 8148072 8725456 9323617 9931347 10535190
59373 10535190 11120853 11675052 12187247 12650645 13061937 13420288 13726682 13983790 14195518
59364 14195518 14365970 14498634 14596113 14659785 14689165 14681687 14633428 14540203 14398491 14206299
59354 14206299 13964170 13675956 13348953 12993260 12620354 12241132 11864271 11495555 11137839
59345 11137839 10790946 10451796 10115419 9776556 9430812 9075219 8708722 8332541 7949846
59336 7949846 7564972 7182930 6809121 6448704 6105834 5783537 5483957 5208210 4956157
59327 4956157 4727033 4520504 4336673 4175018 4033931 3911541 3806539 3717843 3643876 3582696
59317 3582696 3532823 3493715 3465385 3447636 3439698 3440638 3450055 3468079 3494658 3529227 3571389 3621598
59305 3621598 3680755 3749334 3827211 3913961 4008734 4110025 4216156 4325922 4438315 4551703
59295 4551703 4663749 4772059 4874416 4968565 5052418 5124576 5184342 5231511 5266753 5292101 5310386
59284 5310386 5324243 5336229 5349699 5368647 5396423 5435092 5485945 5549866 5627049 5717004 5818857
59273 5818857 5930899 6049689 6170259 6287306 6395449 6488245 6558120 6598184 6604174 6575051
59263 6575051 6512943 6422975 6312140 6187254 6053989 5917753 5784424 5659316 5545915 5446267
59253 5446267 5362254 5295782 5247989 5218932 5207948 5213795 5234507 5267544 5310231 5359994 5414489
59242 5414489 5471816 5530477 5588961 5645666 5699610 5751185 5802103 5854831 5912299 5977973 6055935
59231 6055935 6150695 6266701 6407665 6576296 6774836 7005592 7270274 7568470 7896661 8248261
59221 8248261 8613812 8981013 9335296 9660986 9942311 10164099 10312908 10378353 10353651 10235607
59211 10235607 10025273 9729041 9358434 8928190 8454383 7953513 7441710 6933479 6440884
59202 6440884 5973432 5537745 5137078 4772037 4442303 4147257 3885038 3652244 3445420
59193 3445420 3262210 3100559 2957628 2830424 2717030 2616346 2526967 2447110 2375448 2311226
59183 2311226 2253593 2201407 2153757 2110278 2070898 2035520 2003945 1975969 1951634 1931320 1915217
59172 1915217 1902750 1893041 1886098 1882933 1884326 1890062 1899620 1912881 1929748 1949786 1972869 1999643
59160 1999643 2030784 2066280 2105869 2149601 2197360 2248471 2302530 2360175 2422300 2489013 2560197
59149 2560197 2636606 2719312 2808192 2901981 2999887 3102287 3209607 3321162 3435250 3549821
59139 3549821 3662807 3772259 3876427 3973451 4060916 4136186 4197459 4244456 4277995 4299053 4308312
59128 4308312 4306585 4295681 4278807 4259937 4242717 4230034 4224412 4228369 4244282 4274224 4319986 4382872
59116 4382872 4463546 4562576 4681010 4819771 4978377 5155033 5348067 5556309 5777660 6008108
59106 6008108 6242515 6475284 6699391 6905676 7084377 7227339 7328540 7383647 7390660 7351152
59096 7351152 7270121 7154540 7012277 6851639 6680601 6505970 6333223 6166484 6007892 5857259
59086 5857259 5713031 5573524 5436962 5301109 5163781 5023586 4879601 4730770 4576410
59077 4576410 4416960 4253526 4087050 3918678 3750448 3584609 3422472 3264710 3112481
59068 3112481 2967278 2829867 2700350 2579046 2466311 2361667 2264217 2173999 2091851 2017863
59058 2017863 1950923 1889930 1834438 1783856 1737045 1693119 1651905 1613190 1576211 1540341 1505787
59047 1505787 1473256 1443319 1416233 1391912 1369986 1350327 1333544 1320434 1310957 1304320 1299966 1297737
59035 1297737 1297094 1297111 1297460 1298618 1300926 1304278 1309039 1316331 1326823 1339878 1354401 1369945 1386329 1402624
59021 1402624 1417254 1428977 1437343 1442351 1444144 1443167 1440348 1436900 1433735 1431014 1428520 1426747 1427303 1431736
59007 1431736 1440066 1450947 1463073 1475855 1488792 1500913 1511034 1518151 1521639 1521638 1519255 1515684 1510974
58994 1510974 1504266 1495378 1485564 1476456 1468817 1462640 1457895 1454792 1453594 1454504 1457566 1462532 1469034 1476917
58980 1476917 1486125 1496369 1507272 1518839 1531437 1545346 1560653 1577436 1595595 1614777 1634952
58969 1634952 1656851 1681189 1707704 1735685 1765132 1796497 1829419 1862833 1896424 1930850 1966374
58958 1966374 2002357 2038471 2075279 2113134 2151573 2190536 2231201 2274732 2320916 2368962 2419186
58947 2419186 2473091 2532169 2597349 2669232 2748036 2833494 2925474 3024614 3131891 3247749 3372223
58936 3372223 3505732 3649235 3803741 3970132 4149435 4342937 4552164 4779114 5026368
58927 5026368 5296671 5592466 5915989 6269572 6655555 7076180 7533910 8031624 8572085
58918 8572085 9157117 9787271 10461728 11177860 11930712 12712750 13513493 14318845 15110933
58909 15110933 15868931 16570031 17189808 17703015 18086150 18321023 18397097 18311796 18069947 17683305
58899 17683305 17169757 16551570 15853129 15099044 14312836 13515726 12725423 11955518 11215878
58890 11215878 10513640 9853769 9239108 8670623 8148108 7670588 7235989 6841049 6482139
58881 6482139 6156162 5860294 5591232 5345316 5119445 4911376 4719209 4541172 4376025
58872 4376025 4223076 4081574 3950425 3828724 3716260 3613279 3519827 3435329 3358598 3288299
58862 3288299 3223656 3164644 3111354 3063442 3020558 2982948 2951072 2924759 2903359 2886600 2874730
58851 2874730 2867936 2866274 2870128 2880025 2895965 2917601 2945114 2979216 3020204 3067724 3121656 3182529
58839 3182529 3250874 3326842 3410662 3502832 3603527 3712466 3829723 3956230 4093160 4241280
58829 4241280 4401143 4573493 4759346 4960200 5178359 5416556 5677082 5961778 6272938
58820 6272938 6613561 6986513 7394169 7839188 8324864 8854068 9428081 10046530 10707588
58811 10707588 11407523 12140129 12896628 13665401 14431180 15174700 15873531 16503418 17039594
58802 17039594 17458535 17740182 17869825 17839430 17648918 17306869 16829372 16237481 15555153
58793 15555153 14807983 14021183 13216946 12413421 11625733 10866587 10145207 9466646 8833073
58784 8833073 8245443 7703686 7206212 6750254 6332712 5950545 5600965 5281632 4990218
58775 4990218 4723637 4478384 4251852 4042585 3848995 3668801 3500146 3342327 3194828
58766 3194828 3056492 2926354 2804514 2691452 2587103 2491186 2403688 2324300 2252028 2186049
58756 2186049 2126372 2073137 2026081 1985252 1951215 1923571 1900182 1878960 1859785 1843608 1830458
58745 1830458 1819562 1810792 1804431 1799764 1795319 1790438 1785284 1779199 1770421 1757794 1741703 1722877 1701272
58732 1701272 1676853 1650774 1624900 1600198 1576127 1551713 1526893 1502472 1478773 1454784 1429137
58721 1429137 1401661 1373299 1344658 1315521 1285890 1256411 1227370 1198323 1169429 1142150 1117707
58710 1117707 1095606 1074673 1054903 1037204 1021751 1007709 994409 981850 970141 959220 949067
58699 949067 939594 930502 921768 913970 907545 902110 897021 892097 887194 881748 875718 870458 867545 867005
58685 867005 867593 868567 870102 872088 873551 873368 870863 865845 858849 851335 844850 839937 836334 833987 833156
58670 833156 833763 835382 837749 840640 843482 845855 848176 851162 854818 858675 862695 866992 870805 872705
58656 872705 871892 868637 863624 857653 851919 847735 845832 846398 849533 855058 862234 870473 880120 891745
58642 891745 905057 919482 935515 954358 976285 1000455 1026370 1054462 1085170 1118520 1154845
58631 1154845 1194968 1239319 1287738 1340483 1398733 1463807 1536499 1617487 1707814 1808697 1921307
58620 1921307 2046867 2186573 2341384 2512237 2700227 2905897 3128251 3364702 3611461
58611 3611461 3863112 4111955 4348614 4563385 4746677 4888864 4981247 5017955 4997028 4920495
58601 4920495 4794492 4628886 4435143 4223644 4002930 3780570 3563045 3354427 3156288
58592 3156288 2969457 2795197 2634536 2487370 2352808 2230006 2118514 2018325 1929657 1852290
58582 1852290 1785183 1727217 1678108 1637979 1606196 1581307 1561815 1546299 1533153 1521238 1510687
58571 1510687 1502128 1495237 1489029 1483355 1478866 1475475 1471965 1467272 1461087 1452986 1442100 1427894 1410318
58558 1410318 1388920 1362802 1331886 1297484 1261362 1225022 1189986 1157801 1129278 1104308 1082612
58547 1082612 1064096 1048494 1035461 1025071 1017409 1011696 1006723 1002161 998543 995887 993321 990078 985849
58534 985849 980136 972359 962754 952089 940367 926977 912246 897460 883004 867842 851347 834346
58522 834346 817742 801389 785138 769873 756486 744639 733505 723058 713792 705735 698589 692480
58510 692480 687835 684692 682646 681306 680559 680632 681973 684736 688402 692396 696928 702587 709255 716289 723732
58495 723732 732338 742370 753360 765188 778242 792289 806291 819771 833275 846997 859891 870758
58483 870758 879418 886295 891643 895699 898906 901499 903374 904637 905559 905767 904230 900416 894803 887974 879826
58468 879826 869855 857606 842851 826100 808877 792607 777237 761941 747048 734068 723713 715273
58456 715273 708171 702758 699152 696567 694316 692354 690380 687623 684072 680859 678876 678061 678422 680563 684658
58441 684658 690065 696515 704622 714653 725983 738278 751973 766844 781218 793329 802508 808479
58429 808479 810727 809451 806169 802504 799100 796169 794167 793350 793631 795420 799626 806313 814387 823109 832803
58414 832803 843568 854436 864444 873456 881371 887724 892735 897626 903180 908966 914390 919288 923037
58401 923037 924494 923493 921096 917610 911733 902429 890507 877613 864935 853516 844352 837284 831020
58388 831020 824987 819923 816159 812976 810381 809696 811404 814110 816710 819856 824105 828362 831655 834925
58374 834925 839544 845357 851585 858270 865407 872000 877544 883300 890657 899271 908088 916985 926070 934646
58360 934646 942294 949904 958339 967173 975940 985276 995622 1006185 1016540 1027741 1040335 1052714 1063061
58347 1063061 1071575 1079174 1085369 1089186 1090890 1091114 1089555 1086302 1083195 1081977 1082159 1082476 1083375 1086253 1091291
58332 1091291 1097851 1106062 1116243 1127658 1139489 1152196 1166482 1181925 1197956 1214954 1232914 1250436
58320 1250436 1266657 1282789 1300130 1318050 1335700 1354102 1374458 1395763 1416174 1435534 1454512
58309 1454512 1472488 1488223 1501500 1512343 1520102 1525156 1529964 1536448 1543753 1550532 1557671 1566724 1577529
58296 1577529 1589673 1604390 1622427 1641898 1660990 1681085 1704409 1730324 1756843 1784119 1813325
58285 1813325 1843639 1873657 1904520 1938433 1975302 2013888 2054989 2100291 2149262 2200340 2253903
58274 2253903 2310865 2369575 2427441 2484397 2541470 2597215 2649055 2697035 2742828 2786244 2826210
58263 2826210 2864050 2902218 2940933 2979544 3020018 3065416 3116152 3171231 3231704 3299140 3372241
58252 3372241 3448934 3530251 3618132 3711136 3806627 3905519 4010266 4119859 4231673 4346667
58242 4346667 4467829 4594975 4726275 4863517 5010601 5168159 5334813 5512096 5702597
58233 5702597 5904914 6116328 6338945 6577293 6831591 7099711 7384048 7689799 8018157
58224 8018157 8368077 8742952 9148442 9585678 10054256 10559804 11110465 11708320 12353309
58215 12353309 13053525 13822156 14666351 15589033 16599168 17709297 18925927 20255349 21718057
58206 21718057 23346096 25170416 27226614 29572171 32285060 35452149 39179237 43608034
58198 43608034 48900578 55213810 62723321 71675451 82385006 95184002 110420661 128519128
58190 128519128 149978741 175268367 204730625 238512470 276276124 316530194 355964476
58183 355964476 389542326 411723122 418335034 408098634 383016545 347516700 306872687
58176 306872687 265700331 227140448 192827920 163302307 138453549 117833449 100860156
58169 100860156 86952015 75587334 66311957 58741278 52568682 47560816 43539701 40370969
58161 40370969 37959579 36241541 35175537 34742527 34944030 35790587 37287954 39414236
58153 39414236 42057274 44920933 47487882 49124907 49303223 47803294 44787458 40716600
58145 40716600 36167676 31645448 27474911 23803154 20662842 18027919 15840120 14027356
58137 14027356 12522953 11272447 10227654 9345409 8594129 7953606 7405974 6932220 6517285
58128 6517285 6151194 5823636 5523357 5243712 4982956 4738016 4503550 4277960 4064891
58119 4064891 3867475 3685678 3519779 3371292 3239413 3121016 3014906 2921632 2838565 2759697
58109 2759697 2681146 2602744 2523883 2442394 2358497 2275639 2196385 2121055 2050717 1987383 1930598
58098 1930598 1877791 1828723 1785664 1748590 1714253 1680794 1649269 1619702 1589607 1557672 1525262
58087 1525262 1493018 1459531 1424618 1390486 1358244 1326322 1293598 1261074 1229368 1197576 1165824
58076 1165824 1136008 1108863 1083118 1058581 1037087 1019184 1002760 986250 970526 956389 942973
58065 942973 929936 918562 909250 900350 890834 881822 874127 866619 858301 849746 841238 831646 820478
58052 820478 809013 798242 787722 777499 768936 762467 756713 750957 746296 743126 739860 735626 732017
58039 732017 730495 730057 729188 728323 728579 729657 730744 732188 734657 737794 741079 744816 749025 752593 754762
58024 754762 756305 758157 760142 762093 764763 768349 771447 772827 773114 773390 773274 771740 768891 765612 762180
58009 762180 758363 754249 750001 745398 740371 735299 730256 724823 719202 714502 711301 708913 706540 704066
57995 704066 701180 697030 691399 685056 678395 670981 663058 655974 650322 645116 639729 635275 633032 632834
57981 632834 633985 636419 639821 642930 645057 647259 650741 655084 659155 662796 666378 669602 671958 673566
57967 673566 674516 674260 672718 670976 669654 667487 662941 656507 650043 644468 639398 634579 630276 626446 622643
57952 622643 618607 614198 609155 603771 599259 596547 595084 593773 592622 592545 593902 596164 598713 601019 602299
57937 602299 601865 599784 596590 592561 587791 582608 577266 571523 565071 558057 550698 542847 534556 526636
57923 526636 519994 514627 509810 504988 500129 495620 492266 490918 491630 493571 496191 499915 505247 511743
57909 511743 518591 525770 534036 543966 555425 567676 579708 590787 600924 610450 619019 625647 629901
57896 629901 632455 634182 635366 635963 635882 634699 631845 627437 622221 616499 609947 602672 595419 588411 581106
57881 581106 573558 566841 561508 556836 552385 549127 547984 548191 548207 547617 547215 547896 550320 554907 561245 568015
57865 568015 574283 580256 586216 591688 596516 601680 607851 613905 618142 620402 621814 623005 623797 624217 624516
57850 624516 624301 622817 620072 616911 614152 612294 611670 611998 612127 611107 609259 607480 605886 603961 601692
57835 601692 599556 597631 595498 592845 589472 585017 579323 572808 565850 558270 550022 541798 534169 526686
57821 526686 518682 510412 502543 495128 488059 481907 477160 473162 468972 464830 461556 458936 456137 453404
57807 453404 451867 451692 451926 452281 453694 456753 460775 464926 469238 474090 479622 486236 494899 506263 519728
57792 519728 533686 546346 556350 563099 566863 568445 568753 568758 569361 570752 572158 572705 572235 570812 567937
57777 567937 562981 556022 547482 537327 525505 512977 501507 492473 486432 483324 482293 481774 480807 480160
57763 480160 481265 484322 488360 492840 498010 503799 509526 514800 519820 524812 529987 535850 542546 549074
57749 549074 554254 558300 562313 566431 569823 572574 576073 581126 586842 591874 595754 598750 601386 604436
57735 604436 608436 612940 617132 621251 626350 632554 638856 644841 651234 658372 665589 672742 680938 690937
57721 690937 702069 713630 726094 739940 754404 768605 782990 798437 814718 831184 848341
57710 848341 867375 888412 910514 933251 957178 982925 1010856 1041607 1075916 1113766 1154567
57699 1154567 1198400 1246459 1300148 1360294 1427345 1501814 1584465 1676472 1779405 1894648 2022888
57688 2022888 2164687 2321443 2495142 2686936 2896283 3121371 3359630 3607301 3858667
57679 3858667 4105939 4339810 4550284 4727723 4864246 4955158 4999928 5002361 4969966 4912759
57669 4912759 4841812 4767414 4696557 4630166 4561708 4478725 4367339 4217759 4028140 3805098
57659 3805098 3561156 3310975 3068171 2843258 2642593 2468447 2320145 2195435 2091337
57650 2091337 2004766 1933329 1875599 1830272 1795323 1768641 1749335 1737628 1733367 1735382 1742552 1754842
57638 1754842 1772960 1797541 1829080 1868170 1915345 1971028 2035900 2111024 2197305 2295273 2405669
57627 2405669 2529745 2668409 2821354 2987468 3165772 3355196 3553199 3754844 3953183
57618 3953183 4140253 4307745 4447216 4550369 4609862 4620638 4581140 4493658 4363838 4199785
57608 4199785 4010980 3806969 3596296 3386170 3182460 2989324 2808877 2641810 2488535
57599 2488535 2349459 2224296 2111859 2010799 1920137 1838918 1765911 1700007 1640578 1587197
57589 1587197 1539376 1496767 1459223 1426322 1397180 1370982 1347398 1326264 1307240 1290107 1275040
57578 1275040 1262202 1251219 1241372 1232173 1223601 1215995 1209882 1205620 1202983 1201308 1200245 1200126 1201437 1204156
57564 1204156 1207813 1212018 1216763 1222373 1229306 1237866 1248112 1260122 1274133 1290164 1307696 1326144
57552 1326144 1345483 1365945 1387376 1409641 1433496 1460147 1489885 1522099 1556805 1595149 1638030
57541 1638030 1685237 1736554 1792869 1855436 1924750 2000908 2084500 2176451 2277505 2388592 2511009
57530 2511009 2645267 2790068 2943237 3103221 3268595 3436153 3600253 3753836 3889301
57521 3889301 3998728 4074683 4111714 4107176 4061230 3977118 3861463 3723031 3570200 3409464
57511 3409464 3246070 3085097 2931266 2787967 2656850 2538255 2431911 2337434 2254439 2182269
57501 2182269 2119862 2066197 2020660 1982630 1950871 1923899 1901025 1882583 1868997 1860128 1855652 1855576
57489 1855576 1859935 1868255 1879746 1894021 1911422 1932729 1958696 1989745 2025807 2066412 2111232 2160824
57477 2160824 2216803 2281029 2354419 2436694 2527389 2626948 2736621 2857436 2989524 3132177
57467 3132177 3284011 3442878 3605792 3768774 3926277 4070903 4194460 4289706 4351023 4374005
57457 4374005 4355892 4297192 4202222 4077514 3930164 3767912 3599297 3431903 3270279 3116479
57447 3116479 2972408 2840555 2722333 2616921 2522517 2438234 2364296 2300714 2246351 2199301
57437 2199301 2157962 2121651 2090216 2063207 2039754 2019309 2002000 1987877 1976217 1966168 1957736
57426 1957736 1951444 1947064 1943501 1940080 1937303 1936059 1936571 1938455 1941343 1945065 1949412 1954151 1959258 1964925
57412 1964925 1971352 1978554 1986323 1994337 2002449 2010884 2020071 2030210 2041047 2052115 2063242 2074884 2087845
57399 2087845 2102378 2117553 2131902 2144941 2157737 2171671 2186902 2202376 2217089 2230900 2244249
57388 2244249 2257590 2271195 2285206 2299734 2314922 2330809 2346991 2362706 2377518 2391789 2406208
57377 2406208 2421037 2436098 2451294 2466832 2482992 2499920 2517509 2535268 2552566 2569256 2585888
57366 2585888 2603044 2620763 2638874 2657442 2676426 2695264 2713457 2731411 2750086 2769838 2790087
57355 2790087 2810044 2829330 2847959 2866268 2884888 2904344 2924600 2945294 2966305 2987780 3009709
57344 3009709 3031854 3053975 3075827 3097171 3118224 3139829 3162591 3186022 3209086 3231523 3254023
57333 3254023 3277254 3301321 3326120 3351551 3377282 3402869 3428255 3453749 3479534 3505594 3531987
57322 3531987 3558647 3585116 3611135 3637433 3665093 3694149 3723561 3752678 3781903 3811710 3841847
57311 3841847 3871958 3902296 3933341 3965125 3997272 4029344 4060922 4091860 4122729 4154582 4187924
57300 4187924 4222299 4257082 4292233 4327980 4364277 4401024 4438553 4477482 4518160 4560445 4603889
57289 4603889 4648129 4693247 4739723 4787812 4837151 4887272 4938217 4990125 5042507 5094666 5146645
57278 5146645 5198892 5251038 5301949 5350986 5398097 5442390 5481778 5514611 5540798 5560832 5574764
57267 5574764 5582890 5586557 5587292 5585783 5582588 5579155 5577006 5576283 5576177 5576616 5578525 5582508 5588295 5595655 5604915
57252 5604915 5616271 5629276 5643412 5658687 5675285 5692961 5711163 5729653 5748751 5768991 5790604
57241 5790604 5813331 5836715 5860511 5884713 5909163 5933376 5956867 5979511 6001453 6022794 6043432
57230 6043432 6063083 6081436 6098440 6114428 6129757 6144332 6157748 6169830 6180728 6190591 6199639 6208456
57218 6208456 6217593 6226832 6235483 6243624 6252400 6262781 6274625 6287362 6301029 6316145 6332981 6351395
57206 6351395 6371105 6391775 6413161 6435492 6459329 6484827 6511583 6539455 6568893 6599953 6631557
57195 6631557 6662386 6692153 6721434 6750556 6779252 6807165 6834082 6859711 6883685 6905742 6925759
57184 6925759 6943799 6960370 6976250 6991751 7006521 7020400 7034015 7048094 7062537 7076604 7089666
57173 7089666 7101385 7111514 7120025 7127068 7132251 7134205 7131364 7123088 7109784 7092337 7071890 7049750
57161 7049750 7026935 7003848 6980690 6957959 6936273 6916124 6898056 6882739 6870455 6860905 6853726 6848682
57149 6848682 6845254 6842854 6841951 6844116 6850278 6859597 6870699 6883238 6897430 6912759 6928161 6943011 6956945
57136 6956945 6969149 6978796 6985868 6990735 6993319 6993555 6992200 6990132 6987231 6982978 6977965 6973738 6971365 6971194
57122 6971194 6973958 6981151 6994246 7014130 7040982 7073826 7110541 7149385 7190602 7236105 7288174 7349383
57110 7349383 7423266 7513836 7624501 7758025 7916752 8101846 8313443 8553878 8831501 9161009
57100 9161009 9561221 10054390 10667341 11431502 12381827 13557197 15001904 16765277 18899089
57091 18899089 21454068 24474263 27988240 32000615 36486885 41388540 46608273 52015915
57083 52015915 57470867 62842870 68006313 72815681 77100673 80698495 83490745 85403816
57075 85403816 86378812 86354516 85286365 83179569 80104001 76184304 71579944 66467895
57067 66467895 61030823 55449521 49896525 44526901 39466436 34803207 30587047 26834783
57059 26834783 23537121 20666284 18184235 16049034 14217866 12648841 11303637 10149422
57051 10149422 9158109 8304598 7566484 6924895 6364516 5872762 5439187 5055050 4712581
57042 4712581 4404690 4125686 3871823 3640466 3428776 3233598 3052380 2883765 2727350
57033 2727350 2583148 2451096 2330676 2220922 2120886 2029950 1947625 1873262 1806154 1745716
57023 1745716 1691372 1642416 1598187 1558338 1522776 1491322 1463519 1438815 1417005 1398486 1383953
57012 1383953 1373798 1368005 1366771 1371064 1382454 1402518 1432498 1473410 1526475 1593779 1678546 1784452
57000 1784452 1914715 2071968 2257430 2466297 2680730 2867984 2989694 3018151 2948091 2796608
56990 2796608 2593686 2370778 2152806 1955119 1784620 1642893 1528792 1439545 1371119 1318598
56980 1318598 1276544 1239395 1202286 1161974 1117156 1068317 1017618 968386 923548 884132 849647
56969 849647 819880 795679 777895 766296 759938 758116 760624 767502 779001 795527 817268 843936
56957 843936 875014 909868 947070 983450 1014122 1033959 1039711 1031202 1010787 981836 947911 912932
56945 912932 880885 854405 833840 818213 806832 799504 795732 794768 796507 801616 810802 824611 843877
56932 843877 869509 901564 938933 979636 1020310 1055249 1077293 1081006 1065351 1033593 991210 943835
56920 943835 895927 850242 808336 771546 741092 717161 698573 683658 671112 659973 649559
56909 649559 639892 631637 625159 620061 615867 612622 610415 608914 607833 607396 607841 608947 610511 612919 616747
56894 616747 622213 629475 639025 651191 665691 682335 701845 725307 752965 784026 817146 850124
56882 850124 879208 899839 908815 905697 892383 871903 847613 822625 799190 778537 761313 748116
56870 748116 739670 736751 739909 749041 763382 782397 806801 838382 878751 928573 987926 1056551
56858 1056551 1132712 1211424 1283910 1339338 1368271 1366145 1334944 1282086 1217197 1148909 1083455
56847 1083455 1025038 976517 939456 913952 899107 894145 899163 914864 941775 980002 1029786 1092168
56835 1092168 1168926 1261650 1370324 1491853 1618784 1738684 1835180 1891716 1897314 1851176 1762768
56824 1762768 1647385 1520722 1395628 1281057 1181865 1099314 1032680 980962 943305 918644
56814 918644 905968 905048 916246 939623 974885 1022250 1082579 1156093 1240901 1332067 1420895 1495032
56802 1495032 1541101 1549558 1518537 1453999 1366787 1268915 1170609 1078731 996987 927159 869773
56791 869773 823874 787430 758892 738217 726116 722852 728163 741734 763057 791249 825637 866014
56779 866014 911151 956790 995745 1020474 1025856 1010359 975826 926638 868643 807954 749857 697879
56767 697879 653245 615318 582939 555433 532424 513210 496873 482854 470960 460867 451995 443967
56755 443967 436888 431114 426805 423626 420796 417668 414345 411508 409486 407836 406086 404447 403381 402726
56741 402726 401748 399948 397459 394737 392217 390081 388026 385372 381767 377661 373779 370338 367144 364295
56727 364295 362216 361027 360332 359769 359423 359577 360229 360985 361313 360900 359857 358539 357179 355834 354705 354155
56711 354155 354277 354766 355376 356146 356950 357302 357034 356739 357052 357769 358180 358007 357465 356630 355397 354030 353200 353354
56693 353354 354370 355727 356757 356962 356535 356388 357166 358425 359260 359561 360007 360970 362127 363147 364008 364491 364077
56676 364077 362605 360483 357999 354952 351279 347520 344188 341008 337210 332468 327214 322132 317556 313368
56662 313368 309385 305848 303415 302504 302721 303251 303745 304449 305438 306177 306080 305164 303898 302619 301313 299853 298223
56645 298223 296491 294687 292719 290479 288066 285814 284003 282599 281373 280105 278593 276662 274438 272403
56631 272403 270954 270078 269662 269812 270517 271295 271640 271556 271193 270226 268310 265991 264397 263943 264010 264028 264140 264599
56613 264599 265171 265542 265756 265860 265617 264978 264403 264229 264127 263685 263275 263744 265382 267634 269749 271262 271891
56596 271891 271443 270063 268276 266583 265066 263479 261659 259820 258460 257965 258285 259014 259737 260219 260353 260169
56580 260169 259909 259869 260039 260143 260188 260688 262087 264048 265671 266457 266866 267831 269912 273027 276818 281003 285368
56563 285368 289690 293887 298151 302694 307394 311826 315672 318905 321612 323879 325898 327935 330102 332374
56549 332374 334849 337657 340501 342688 343814 344091 343783 342724 340752 338216 335569 332780 329627 326330 323287
56534 323287 320353 316979 313061 309058 305223 301363 297461 293936 290984 288180 285128 282137 279806 278141
56520 278141 276529 274547 272392 270403 268409 265838 262462 258808 255736 253707 252605 252051 251626 250875 249587
56505 249587 248109 247078 246692 246659 246830 247284 247630 247024 245381 243878 243519 243741 243288 242033 240955 240533 240299
56488 240299 240037 240320 241462 242779 243464 243621 243940 244737 245800 246849 247775 248602 249583 251108 253195 255240
56472 255240 256607 257464 258733 261123 264352 267462 269824 271652 273507 275583 277791 280280 283301 286550
56458 286550 289296 291347 293254 295231 296541 296515 295666 295143 295481 296456 297735 298985 299723 299846 300012 300775 301673
56441 301673 301957 301888 302311 303191 303629 303331 302928 302664 301790 299719 296967 294491 292642 291121 289500 287504 285092
56424 285092 282485 279860 277108 274216 271617 269595 267628 265014 261940 259125 256658 254152 251936 250898
56410 250898 251059 251394 251316 251278 251627 251913 251852 251968 252609 253135 252803 251896 251373 251745 252705 253538 253655 253123 252790 253379
56390 253379 254502 255200 255392 255885 256915 257724 257871 257896 258319 258936 259546 260365 261298 261811 262143 263605 266910 271145
56372 271145 275130 278911 283037 287218 290769 293846 297183 300919 304486 307419 309696 311644 314026 317745
56358 317745 322785 327874 331740 334283 335973 336682 335826 333326 329777 325966 322659 320433 319177 318182 317122
56343 317122 316547 317001 318255 319845 321752 324041 326499 329191 332778 337644 343287 349122 355206 361570 367612
56328 367612 372990 378460 384922 392133 399245 406197 413692 422090 431066 440056 448460 455829 462449 469285
56314 469285 476728 483945 490047 495233 499999 503942 506396 507698 508701 509397 509055 507548 505564 503577 501433
56299 501433 498897 496059 493400 491884 492545 495379 499125 502794 506827 512111 518567 525664 533663 543186
56285 543186 553955 565149 576727 589348 603166 617805 633450 651018 671213 694144 719675
56274 719675 747423 776713 807433 840721 878029 919714 965422 1015476 1070892 1132256 1199679
56263 1199679 1273838 1356090 1447508 1548517 1659419 1780511 1911784 2053283 2205540 2368796
56253 2368796 2541742 2721612 2905242 3089419 3270559 3444972 3609262 3759783 3892134
56244 3892134 4002208 4087634 4147496 4181176 4188599 4171378 4132647 4075771 4004024 3921034 3830345
56233 3830345 3734524 3635529 3535539 3436233 3337529 3238372 3138715 3039421 2940230 2839268 2735005
56222 2735005 2627574 2517824 2406235 2293319 2180282 2068625 1959471 1853553 1751355
56213 1751355 1653131 1559217 1470382 1387470 1310814 1240417 1176430 1118817 1066854 1019607 976660
56202 976660 937814 902544 870562 842400 818469 797921 779459 762859 748542 735944 723663
56191 723663 711278 699937 690938 684488 679788 675575 670862 665977 662600 661957 663370 665479 668270 672641
56177 672641 678568 685220 692571 701282 711060 720728 730040 740001 751214 763247 775748 788720 801370
56164 801370 812073 820076 826232 831690 836772 841355 845340 848456 850523 852154 854405 857643 861586 866476
56150 866476 873344 883053 895942 912344 932544 956311 983410 1014613 1051487 1095399 1147510 1209348
56138 1209348 1282373 1367294 1464589 1575025 1698408 1832139 1971946 2113316 2251150 2379276
56128 2379276 2492479 2589059 2670283 2738224 2795578 2846169 2892625 2933344 2963657 2980033 2981677
56117 2981677 2969045 2943574 2908833 2869060 2825561 2775972 2716983 2645980 2560513 2459228 2344347
56106 2344347 2221498 2096595 1974374 1859525 1756458 1667114 1590788 1526479 1473570 1430222
56096 1430222 1393486 1361481 1333519 1308089 1283200 1259001 1237497 1219193 1202476 1186730 1173341
56085 1173341 1162909 1154145 1146440 1140897 1137834 1135797 1134204 1134442 1137047 1140274 1142899 1146269 1152096 1160159
56071 1160159 1169504 1180027 1191619 1203502 1215527 1228486 1242371 1256130 1269765 1284521 1300362
56060 1300362 1315556 1329591 1344135 1360251 1377076 1394156 1412590 1432798 1453563 1474280 1495733
56049 1495733 1517826 1539200 1560065 1582643 1607690 1633330 1658511 1684798 1713544 1744161 1776417
56038 1776417 1811486 1849355 1888106 1927100 1967894 2010794 2053722 2095907 2139367 2185240 2232087
56027 2232087 2279413 2329265 2382449 2436646 2490297 2544988 2602113 2660759 2720812 2784425 2852256
56016 2852256 2921931 2992331 3065610 3142930 3222324 3303074 3387924 3478429 3572415 3668618 3769289
56005 3769289 3875424 3984241 4094623 4210373 4334692 4466054 4602979 4748067 4903639
55996 4903639 5068277 5241430 5426463 5625303 5835255 6055099 6288872 6539457 6804348
55987 6804348 7082335 7378207 7695900 8033436 8390207 8772776 9187495 9633955 10111963
55978 10111963 10628241 11189749 11797749 12455886 13176946 13973846 14851107 15812656 16869835
55969 16869835 18033761 19309640 20709183 22260698 23998617 25955037 28174023 30725127
55961 30725127 33694275 37177751 41299464 46217406 52098078 59109244 67466314 77467957
55953 77467957 89459045 103785062 120823378 141029316 164883695 192788366 225010820
55946 225010820 261530296 301496364 342423050 379843492 408104086 422144209 419309404
55939 419309404 400229938 368429827 328999670 287013016 246360889 209359215 177003067
55932 177003067 149445811 126379093 107267466 91510071 78542431 67864425 59035557
55925 59035557 51685621 45526697 40336209 35930360 32159846 28914796 26112354 23678981
55917 23678981 21551101 19683040 18040545 16589394 15298214 14146086 13117485 12193624
55909 12193624 11356534 10596766 9908920 9283488 8710289 8185553 7708013 7271357 6867414
55900 6867414 6493534 6150152 5833941 5539546 5265410 5012012 4776695 4555606 4348378
55891 4348378 4155967 3976285 3806688 3648094 3501814 3364790 3232824 3106306 2988104
55882 2988104 2877874 2772956 2673023 2579501 2491999 2409327 2332375 2262263 2197298 2135274 2076981
55871 2076981 2024056 1975273 1928474 1884175 1843653 1805297 1766386 1726855 1687965 1649084 1609418
55860 1609418 1571315 1538248 1510809 1487855 1470022 1458613 1452152 1447236 1441632 1433635 1420051 1398440
55848 1398440 1370516 1340213 1309192 1277023 1244569 1213983 1186023 1160198 1136868 1116635 1098456
55837 1098456 1080855 1064119 1048894 1033700 1016408 997210 977642 957652 936194 913727 891562
55826 891562 869607 847279 825691 806440 789018 771861 755025 739354 723969 707310 690002
55815 690002 674123 660281 647866 637478 630463 626526 624236 623419 624699 627258 629572 631945 635822
55802 635822 640924 645489 649035 652446 655452 656386 654472 650222 643622 634018 621847 608503 594513 579644
55788 579644 564653 551036 539135 528288 518653 511024 505017 499368 494024 490195 488328 487682 487731 488223
55774 488223 487865 484706 477999 468361 456338 442371 427949 415100 404569 395830 388802 384249 382547
55761 382547 383171 385010 386067 383543 375916 364695 352841 341836 331466 321594 312406 303461 294238
55748 294238 285320 277599 270872 264678 259668 256381 253463 249128 243759 239017 235056 230957 227379 226175
55734 226175 227398 229129 230457 232339 235159 237704 239064 239602 239402 237534 233441 227632 220743 213392 206980
55719 206980 202834 200303 197441 193846 191049 189859 189291 188626 188619 189944 192128 194779 198348 202930 207758
55704 207758 212566 218098 224566 230929 236396 241341 245948 249135 249716 247857 244801 241913 240282 240271 241008
55689 241008 241168 240540 239969 239697 238928 237245 235255 233544 232144 231311 231637 233033 234640 236104 237846 239832
55673 239832 241261 241797 241932 241829 241043 239809 239355 240322 241914 243164 244094 245182 246623 248592 251308 254425
55657 254425 257138 259201 261007 262542 263244 263055 262598 262103 261223 260018 258909 257375 253956 247936 239962
55642 239962 230760 220500 209751 199661 190608 181891 173256 165530 159145 153315 147343 141595 136426
55629 136426 131322 125936 120900 116725 112832 108555 104271 100651 97593 94743 92400 91000 90256 89591 88957
55614 88957 88544 88119 87310 86187 85112 84313 83894 83802 83560 82629 81264 80348 80157 79936 79024 77671 76504 75853
55596 75853 75829 76347 76901 77069 77335 78511 80285 81399 81469 81393 81626 81347 79952 78144 76789 75765 74741
55579 74741 74055 73946 73794 73092 72421 72554 73224 73615 73517 73173 72557 71627 70869 70837 71421 72153 72864 73554 74075 74412
55559 74412 74862 75470 75790 75542 75032 74561 74028 73463 73259 73478 73592 73362 73318 73896 74814 75761 76996 78763 80801
55540 80801 82912 85262 87593 88946 88855 88133 87808 87950 88153 88476 89172 90079 91046 92397 94322 96393 98315
55523 98315 100556 103433 106116 107369 106919 105415 103531 101744 100520 99910 99231 97799 95683 93210 90151
55508 90151 86048 80995 75498 69898 64418 59406 54961 50707 46458 42709 39909 37673 35288 32650
55494 32650 30140 27924 25930 24243 23011 22174 21590 21164 20638 19780 18993 19106 20216 21395 21949 22170 22385
55477 22385 22145 21126 20062 19884 20416 20765 20575 20119 19550 18797 17945 17035 15835 14348 13223 13088 13834
55460 13834 14972 16236 17358 17880 17768 17663 17906 17912 17101 15785 14431 12770 10569 8676 8282 9522 11672
55443 11672 14282 17193 19869 21697 22747 23461 23881 23906 23895 24169 24364 24150 24124 24987 26280 26998 27117 27435
55425 27435 28211 29136 30392 32420 34620 35647 35188 34327 33844 33308 32244 31177 30892 31363 31983 32323 32265
55408 32265 31866 31491 31741 32841 34298 35295 35303 34379 33141 32394 32443 32823 32956 32826 32675 32376 31678 30756 29931
55389 29931 29049 27803 26494 25712 25381 24871 24031 23336 22923 22248 20933 19362 18158 17457 16929 16252 15507
55372 15507 15263 16079 17656 18832 18851 18286 18112 18272 17969 17080 16271 15765 15009 13834 13007 13245 14335 15566
55354 15566 16492 16910 16635 15696 14429 13086 11651 10196 9050 8426 8222 8329 8806 9572 10229 10429 10249
55337 10249 10056 10166 10659 11392 12187 13135 14548 16409 18106 19036 19300 19397 19393 18870 17648 16056 14486 13121
55319 13121 12101 11565 11420 11399 11406 11618 12189 13117 14312 15592 16677 17389 17805 18093 18374 18866 19858 21290
55301 21290 22638 23456 23711 23426 22461 20953 19448 18203 16816 15035 13396 12519 12326 12514 13183 14249
55285 14249 14865 14410 13558 13407 13908 14256 14434 15122 16211 16761 16561 16507 17151 17937 18291 18463 18795 19009 18760
55266 18760 18232 17741 17285 16860 16651 16603 16400 16199 16747 18383 20425 21936 22658 22869 22816 22687 22740 23015 23136
55247 23136 22702 21722 20497 19347 18475 17808 16883 15254 13058 10915 9265 8237 8041 8940 10759 12899
55231 12899 14924 16680 17900 18327 18275 18462 19107 19715 19912 19880 19805 19523 19019 18749 19139 20134 21491 23124
55213 23124 24901 26517 27763 28666 29246 29511 29709 30141 30629 30731 30580 30878 31797 32452 31903 30271 28472
55196 28472 27150 26267 25534 24822 24193 23762 23669 24090 25110 26399 27146 26770 25821 25541 26246 26781 26143 24928
55178 24928 24332 24318 23845 22569 21132 19944 18886 18144 18137 18539 18598 18610 19747 22020 23661 23198 21149 19058
55160 19058 17854 17754 18707 20028 20436 19419 18072 17782 18627 19725 20572 21199 21515 21392 21151 21182 21291 21005
55142 21005 20373 19900 19883 20268 20917 21610 22002 22035 22180 22916 24184 25602 26908 27984 28816 29687 31009 32732
55124 32732 34317 35483 36412 37067 37086 36685 36809 37795 38620 38185 36738 35276 34174 33263 32712 32816 33118 32729
55106 32729 31523 30361 30097 30856 32146 33255 33755 33994 34847 36621 38624 40212 41628 43203 44371 44443
55090 44443 43857 43627 43824 43700 43196 43205 44215 45650 46901 48114 49605 51132 52205 52665 52649 52339 51998 51928
55072 51928 52192 52613 53055 53461 53619 53334 52831 52572 52669 52856 53047 53417 53877 54003 53710 53590 54272 55677 57029
55053 57029 57432 56434 54340 52082 50464 49426 48293 46790 45431 44820 44941 45332 45633 45647 45184 44294 43571
55036 43571 43790 45085 46713 47786 48075 47951 47776 47706 47985 48888 50141 50842 50422 49474 49143 49869 51232 52868
55018 52868 54750 56508 57294 56798 55849 55505 55931 56579 57059 57298 57112 56255 54888 53616 52984 53093 53573 53764
55000 53764 53132 51755 50277 49227 48570 48012 47435 46841 46221 45736 45720 46222 46826 47190 47419 47694 47892 47923 48026
54981 48026 48290 48263 47570 46714 46754 48237 50737 53331 55264 56441 57575 59552 62337 64816 66098 66635
54965 66635 67587 69441 71797 74238 76743 79393 82311 85893 90648 96737 104011 112321 121425 130789 140046
54950 140046 149642 160516 173085 186854 200952 214555 226751 236428 242581 244678 242753 237272 228792
54937 228792 217623 204004 188782 173582 159931 148283 138078 128546 119275 110325 102221 95634
54925 95634 90816 87507 85509 84899 85401 86085 86207 86025 86269 87172 88551 90463 93183 96715 100949 106156
54909 106156 112825 121104 130827 141892 154198 167362 180853 194122 206257 215917 222100 224626 223512
54896 223512 218454 209559 197978 185020 171099 156363 141826 128835 117741 108089 99794 93039
54884 93039 87290 81677 76347 72275 69710 67943 66618 66011 65846 65165 63843 62932 62935 62803 61444 59290
54868 59290 57518 56468 55610 54541 53250 51850 50672 50200 50318 50039 48588 46454 44856 44462 44995 45783
54852 45783 46223 46032 45435 44930 44608 44089 43270 42586 42205 41601 40474 39539 39732 40941 42198 42851 42964 42776
54834 42776 42393 42004 41916 42314 43236 44665 46396 47989 49176 50123 51024 51678 51883 52006 52662 53919 55212
54817 55212 56067 56543 56915 57259 57446 57482 57720 58764 60989 64141 67512 70596 73458 76474 79973 84140
54801 84140 88989 94374 100372 107689 117252 129154 142415 156069 170098 184973 200539 215689 228922
54788 228922 238894 244694 246037 243231 236807 227295 215461 202428 189270 176667 165156 155385 147692
54775 147692 141636 136333 131247 126405 122044 118430 115901 114614 114160 113832 113443 113604 114995 117660 121268
54760 121268 125890 132005 139653 148067 156593 165749 176739 189888 204204 218805 234157 251308 270255
54747 270255 289680 307935 323492 334659 339902 338862 332523 322137 308421 291840 273084 252999
54735 252999 232517 212780 194786 178751 164355 151657 141102 132480 124799 117591 111500 107031
54723 107031 103531 100188 97319 95690 94989 94020 92230 90116 88123 86016 83533 80967 78826 77316 76335
54708 76335 75693 75255 75130 75629 76693 77591 77692 77424 77823 79081 80222 80415 79952 79570 79350 78945 78569 79021
54690 79021 80613 82605 83976 84499 84776 85395 86363 87353 88158 88743 89139 89521 90236 91438 92792 93875 94808
54673 94808 96132 97997 99883 101359 102781 104981 108434 112900 117753 122422 126660 130593 134582 138986
54659 138986 143992 149516 155059 159861 163499 166364 169230 172438 175800 179247 183030 187186 191345 195327
54645 195327 199552 204630 210879 218453 227483 237808 248869 260225 271833 283548 294639 304128 311301
54632 311301 315571 316155 312392 304241 292222 277135 260151 242926 226980 212882 200267 188671
54620 188671 178152 169104 161612 155102 148777 142567 137433 134344 133059 132514 132332 133147 135180 137378 138552
54605 138552 138727 138751 139131 139953 141370 143203 144339 143551 140972 137966 135418 132851 129424 125191 121003 117548
54589 117548 114797 112254 109534 106699 104015 101389 98375 94869 91407 88454 85834 83304 81251 80119
54575 80119 79474 78466 77089 76108 75712 75181 74209 73682 74509 76186 77210 76683 75020 73205 71809 70822 70093
54558 70093 69699 69899 70800 72172 73611 74795 75496 75526 74868 73835 72922 72554 73027 74435 76457 78440 80031
54541 80031 81544 83412 85545 87626 89857 92784 96431 100205 103831 107841 112902 119059 125830 132712
54527 132712 139324 145338 150581 155058 158644 160869 161171 159320 155496 150111 143680 136812 130108 123939
54513 123939 118240 112594 106733 101055 96404 93129 90548 87680 84330 81107 78461 76200 74079 72414
54499 72414 71747 72092 72772 73068 72892 72733 72978 73393 73441 73032 72660 72736 73179 73837 74929 76624 78481 79797
54481 79797 80467 81073 82103 83451 84706 85598 86181 86893 88443 91228 94735 97772 99469 99915 99827 99826 100080
54464 100080 100397 100495 100242 99709 99054 98424 97976 97706 97239 96090 94367 92882 92301 92418 92552 92308 91584 90211
54446 90211 88224 86305 85339 85485 86132 86636 86636 85810 84051 81974 80677 80758 81856 83149 83865 83426 81745
54429 81745 79548 77861 76978 76365 75663 75163 75093 75049 74588 73979 73885 74577 75812 77301 78922 80560 82064 83346
54411 83346 84446 85482 86508 87333 87644 87576 87972 89680 92623 95998 99338 102882 106876 111148 115574 120394
54395 120394 125705 131102 136181 141002 145694 149932 153238 155628 157626 159699 161827 163404 163494 161521 157915
54380 157915 153739 149544 144993 139888 135006 131404 129190 127504 125488 122815 119475 115683 111983 108901
54366 108901 106362 103881 101412 99590 98909 99008 99039 98603 98050 97914 98306 98850 99067 98735 98044 97490 97559 98387
54348 98387 99753 101482 103782 106911 110556 113885 116416 118590 121232 124688 128768 133282 138159 143082
54334 143082 147484 151015 153787 156093 158068 159568 160142 159223 156662 153069 149339 145858 142438 138789 134656
54319 134656 129652 123641 117293 111676 107120 103008 98823 94815 91348 88132 84617 80851 77502 75142
54305 75142 73736 72712 71396 69536 67517 65879 64662 63514 62411 61780 61771 61905 61704 61274 60944 60666 60112
54288 60112 59163 58053 57159 56781 56908 57145 57098 56881 56929 57346 57867 58382 58989 59460 59390 58982 58999 59681 60471 61168
54268 61168 62420 64500 66443 67250 67322 67765 68742 69549 69978 70534 71373 72102 72693 73655 74951 75624 74920 73226
54250 73226 71510 70320 69728 69812 70662 72041 73390 74147 74001 73022 71683 70596 70080 70061 70405 71074 71863 72308
54232 72308 72126 71622 71336 71288 70876 69723 68440 68154 69148 70337 70361 69005 67194 65776 64859 64307 64196 64499
54214 64499 64848 64943 64920 64995 65147 65441 66192 67378 68293 68359 68013 68209 69165 70131 70356 69833 69038 68326 67617 66490
54194 66490 64607 62222 60113 58788 57968 57089 56034 55055 54269 53624 53111 52565 51525 49806 48075 47314
54178 47314 47771 48854 49919 50670 51010 51037 51162 51641 52056 51821 51206 51245 52490 54382 56024 57167 58275
54161 58275 59903 62122 64294 65461 65247 64296 63512 63037 62406 61446 60432 59550 58872 58706 59158 59488 58832
54144 58832 57648 57407 58587 59994 60494 60385 60325 59913 58401 56263 54947 55156 56207 57010 57032 56360 55477
54127 55477 54991 55100 55267 54803 53622 52047 50123 47708 45140 43152 42083 41745 42094 43352 45243 46750
54111 46750 47077 46530 46104 46462 47632 49409 51589 53805 55471 56063 55487 54241 53199 53018 53655 54601 55609
54094 55609 56901 58487 59651 59549 58228 56645 55741 55765 56450 57392 58194 58670 59100 59812 60340 59508 56905
54077 56905 53803 51950 51653 51820 51757 51988 53062 54488 55414 55702 55707 55534 55264 55496 56805 58775 60327 60973
54059 60973 61086 61003 60654 60236 60455 61729 63690 65748 67646 69211 70165 70647 71384 72836 74557 75930 77176
54042 77176 78998 81486 83996 86099 88027 90133 92394 94606 96726 98936 101626 105319 110243 115925
54028 115925 121524 126665 131672 136949 142541 148343 154279 160045 165137 169559 174151 179622 185442 190276
54014 190276 193555 196068 198787 201618 203691 204546 204524 204113 203332 201830 199245 195429 190582 185255 179988
53999 179988 174875 169665 164321 159167 154453 150101 146111 142857 140629 139006 137122 134546 131674 129183
53985 129183 127341 125911 124540 123090 121615 120162 118748 117585 117135 117643 118617 119147 118848 118186 117753 117621
53969 117621 117708 118346 119892 122017 123913 125200 126197 127332 128719 130297 131915 133274 134213 135099 136417 137921
53953 137921 138791 138797 138675 139068 139678 140011 140379 141423 142881 143708 143519 143272 144247 146831 150560 154988 160052
53936 160052 165701 171546 176929 181233 184131 185754 186552 186836 186446 185095 183070 181289 180423 180193 179869 179361
53920 179361 179323 180170 181518 182896 184600 187366 191428 196393 201888 207799 213846 219463 224363 228918 233766
53905 233766 239239 245286 251697 258142 264146 269223 273033 275367 276155 275594 274169 272365 270347 267938 264848
53890 264848 260978 256548 251976 247541 243162 238591 233725 228649 223437 218081 212519 206637 200349 193925
53876 193925 188037 183134 178830 174234 168921 163260 157862 153080 149121 146168 144118 142433 140467 137870
53862 137870 134631 131024 127581 124856 122957 121492 120016 118403 116713 114985 113262 111622 110048 108414
53848 108414 106684 104976 103429 102154 101244 100591 99793 98598 97369 96644 96239 95381 93866 92487 92004 92186
53832 92186 92244 91839 91287 91119 91797 93510 95807 97696 98547 98710 98911 99287 99404 98959 98039 96862 95741 95118
53814 95118 95169 95483 95587 95707 96575 98497 101037 103544 105654 107360 109073 111528 115170 119495 123473 126611
53798 126611 129279 131969 134822 137952 141692 146158 151018 155984 161181 166636 171749 175770 178681 181162
53784 181162 183672 185930 187453 188299 189019 189962 190896 191372 191363 191355 191779 192494 192930 192640 191585 189966 188001 185887
53766 185887 183799 181779 179702 177399 174774 171821 168602 165255 161958 158871 156109 153796 152064 151002
53752 151002 150550 150391 149963 148761 146816 144817 143628 143598 144386 145393 146355 147447 148860 150285 150999 150668
53736 150668 149957 149992 151086 152283 152388 151259 149774 148735 148149 147593 146811 145793 144552 143134 141799 140968
53720 140968 140896 141467 142358 143302 144112 144544 144408 143998 144127 145413 147520 149459 150642 151341 152116 153242 154839
53703 154839 157104 160027 163129 165869 168170 170339 172726 175724 179786 184958 190559 195742 200294 204578
53689 204578 208885 213310 218076 223328 228537 232745 235676 238223 241628 246423 252229 258159 263250 266904
53675 266904 269240 270878 272233 273238 273811 274176 274476 274392 273509 271904 270122 268648 267574 266585 265093 262658
53659 262658 259529 256642 254782 253829 253036 251892 250447 248960 247569 246299 245101 243853 242512 241256 240286
53644 240286 239531 238727 237719 236464 234836 232810 230786 229378 228772 228662 228941 230012 232141 234764 236821
53629 236821 237671 237435 236642 235924 235915 236985 238915 241148 243480 246271 249857 253985 257996 261383 264088 266459
53613 266459 269053 272335 276393 281009 286023 291378 296785 301731 306087 310394 315209 320372 325352 330144
53599 330144 335344 341329 347801 354226 360356 366228 372009 378024 384657 392012 399783 407538 414954 421828
53585 421828 428121 434048 439849 445441 450575 455366 460308 465649 471064 476103 480641 484763 488504 491887
53571 491887 494859 497103 498271 498611 498983 500003 501598 503590 506120 509013 511289 512015 511473 510846 510922 511593
53555 511593 512439 513135 513370 513035 512529 512336 512256 511595 510168 508526 507063 505548 503828 502418 501946 502391 503243
53538 503243 504166 505123 506127 507229 508594 510194 511547 512153 512190 512493 513788 516236 519798 524751 531449 539592
53522 539592 548044 555748 562781 570256 579160 589646 601527 614904 629802 645577 661420 677431
53510 677431 694517 713113 732600 752215 771983 792396 813728 836165 860218 886361 914356
53499 914356 943448 973237 1003995 1036183 1069955 1105104 1141117 1177268 1213089 1248872 1285342
53488 1285342 1322639 1359852 1395823 1430258 1463924 1497931 1533023 1569384 1606757 1644620 1682429
53477 1682429 1719773 1756361 1791971 1826573 1860381 1893522 1925592 1955800 1983671 2009446 2033674
53466 2033674 2056640 2078345 2098786 2117917 2135418 2150835 2164016 2175191 2184745 2193124 2200838 2208042
53454 2208042 2213979 2217233 2216742 2212329 2204281 2192899 2178768 2162872 2145847 2127250 2106019 2081600
53442 2081600 2054286 2024563 1992679 1958951 1924107 1889023 1854174 1819354 1783890 1747211 1709428
53431 1709428 1671363 1633937 1597547 1562071 1527380 1493702 1461628 1431824 1404564 1379425 1355634
53420 1355634 1332885 1311634 1292525 1275836 1261640 1250124 1241358 1235152 1231470 1230710 1233109 1238163 1245132
53407 1245132 1253912 1264921 1278427 1294546 1313680 1336190 1361681 1389291 1418661 1449986 1483173
53396 1483173 1517747 1553705 1591624 1631714 1673520 1716946 1762802 1811924 1864350 1919848 1978563
53385 1978563 2040440 2104586 2170105 2237397 2307849 2382147 2459490 2538520 2618555 2699653 2781848
53374 2781848 2864650 2947311 3029440 3111225 3192908 3274081 3353689 3430758 3504835 3575577 3642254
53363 3642254 3703984 3760333 3811437 3857615 3899107 3936108 3968736 3996848 4019919 4037231 4048226
53352 4048226 4052727 4050805 4042413 4027329 4005531 3977401 3943249 3902724 3854894 3798830 3734070 3660958
53340 3660958 3580992 3496564 3409813 3321800 3233169 3145102 3058791 2974247 2890695 2808178 2727697
53329 2727697 2649572 2572802 2496607 2421554 2348527 2277503 2208192 2141133 2077165 2016356 1958457
53318 1958457 1904007 1853985 1808558 1767032 1728908 1694131 1662401 1633132 1606171 1581795 1559918
53307 1559918 1539965 1521676 1505438 1491724 1480718 1472540 1467249 1464480 1463594 1464307 1466703 1470589 1475365
53294 1475365 1480652 1486581 1493333 1500878 1509330 1519060 1530206 1542464 1555633 1570109 1586739 1606410
53282 1606410 1629767 1656883 1687118 1719675 1754373 1791425 1830382 1869905 1908901 1947383 1985839
53271 1985839 2024110 2061440 2097381 2132151 2165983 2198527 2229023 2256969 2282486 2306048 2327988
53260 2327988 2348313 2366894 2383519 2397695 2408783 2416659 2421926 2425052 2425435 2421776 2413270 2399983 2382224
53247 2382224 2360186 2334275 2305120 2273021 2237872 2199879 2159873 2118583 2076028 2032005 1986878
53236 1986878 1941493 1896492 1851981 1807757 1763665 1719871 1676967 1635671 1596294 1558644 1522434
53225 1522434 1487441 1453246 1419254 1385245 1351524 1318284 1285191 1251949 1219005 1187293 1157479
53214 1157479 1129734 1103989 1080065 1057685 1036686 1017091 998723 980949 963128 945107 926932
53203 926932 908322 888911 868882 848873 829268 810028 791254 773390 756691 740811 725112
53192 725112 709146 692760 676036 659321 643049 627309 611706 595871 580013 564785 550610
53181 550610 537244 523960 510153 495783 481301 467147 453433 440151 427510 415818 405130
53170 405130 395302 386371 378442 371175 363784 355883 347984 340810 334302 327722 320664 313559 307094 301475
53156 301475 296404 291529 286766 282285 278276 274677 271140 267448 263862 260800 258169 255447 252578 250301
53142 250301 249231 248916 248304 246985 245459 244243 243231 242061 240646 239087 237393 235583 233922 232808 232538
53127 232538 233257 234979 237488 240330 243026 245294 247088 248649 250511 253199 256758 260681 264321 267228
53113 267228 269257 270721 272404 274815 277217 277933 276054 272478 268853 265841 262837 259093 254480 249280
53099 249280 243815 238335 232934 227525 222106 216918 212067 207255 202330 197837 194465 192029 189592 186554
53085 186554 183037 179285 175393 171781 169190 167809 166863 165446 163377 160986 158502 156049 153891 152214
53071 152214 150845 149481 148054 146605 145068 143500 142291 141736 141493 140846 139536 138063 137139 137033 137498 138132
53055 138132 138656 138905 138753 138268 137921 138303 139337 140063 139649 138473 137659 137572 137418 136487 135117 134048 133449 133112
53037 133112 133170 133921 135119 136065 136357 136112 135514 134671 133917 133694 133990 134236 133951 133259 132623 132293 132151 131949 131558
53018 131558 131069 130713 130645 130804 130998 131037 130767 130166 129505 129247 129583 130259 130969 131726 132661 133714 134829 136141
53000 136141 137563 138460 138301 137498 136954 136782 136179 134739 133186 132390 132273 132266 132409 133239 134696 135898 136255 136323
52982 136323 137274 139710 143194 146791 149864 152419 154824 157305 159818 162438 165649 169999 175442 181279
52968 181279 186833 191991 196974 201758 205947 209171 211456 213176 214645 215718 215773 214213 211140 207505 204482
52953 204482 202677 201835 201175 199894 197625 194665 191770 189537 187970 186720 185571 184479 183319 181958 180582
52938 180582 179532 178751 177810 176656 175934 176224 177209 177985 178018 177456 176635 175663 174546 173419 172541 172127 172185 172398
52920 172398 172317 171858 171478 171664 172361 173093 173459 173256 172399 171158 170357 170733 172012 173097 173311 172993 172694 172321
52902 172321 171479 170314 169477 169313 169566 169884 170283 170943 171784 172470 172783 172838 172860 172859 172686 172354 172136 172245 172591 172915
52882 172915 173017 172763 172145 171497 171380 171966 172752 173244 173646 174503 175867 177365 178873 180476 181829 182265 181715
52865 181715 180898 180407 180200 180205 180765 182068 183672 185044 186200 187424 188803 190402 192517 195220 198075 200830
52849 200830 204072 208540 213948 219137 223361 226890 230338 233905 237388 240502 242999 244702 245547 245521 244538
52834 244538 242534 239590 235895 231710 227461 223594 220114 216529 212481 208195 204068 200164 196463 193241
52820 193241 190669 188298 185485 182236 179095 176311 173701 171229 169136 167393 165584 163486 161327 159353
52806 159353 157541 155893 154653 154027 153900 153886 153440 152060 149838 147719 146636 146295 145354 143027 139982 137413
52790 137413 135748 134681 133950 133538 133293 132919 132348 131744 131145 130322 129079 127540 126162 125415 125321 125244 124387 122627
52772 122627 120642 119111 118054 117246 116909 117467 118617 119191 118269 116196 114183 112919 111885 110160 107665
52757 107665 105259 103665 102708 101737 100426 98857 97160 95516 94278 93525 92598 90643 87724 84851 82716
52742 82716 80943 78913 76801 75285 74529 74052 73526 73258 73731 74929 76242 76966 76923 76631 76788 77553 78452
52725 78452 79038 79364 79674 79931 79940 79729 79442 79001 78290 77658 77826 79149 81209 83307 85130 86813 88527 90226
52707 90226 91737 92891 93617 94124 95001 96910 99970 103539 106840 109816 113161 117358 121867 125436 127187
52692 127187 127268 126501 125555 124414 122546 119618 116136 113259 111779 111332 110789 109373 107162 104642 102129 99738
52676 99738 97589 95769 94208 92673 90873 88603 85973 83428 81325 79528 77717 76055 75086 74915 74875
52661 74875 74277 73127 71909 70981 70458 70291 70098 69275 67688 66041 65104 64800 64543 64243 64317 64755 64969 64766
52643 64766 64788 65541 66502 66755 66200 65555 65279 65069 64504 63741 63364 63819 65210 67382 69943 72263 73710 73938
52625 73938 72963 71062 68754 66751 65658 65578 66083 66609 66828 66712 66425 66258 66536 67409 68687 69895 70544
52608 70544 70453 69965 69763 70252 71086 71547 71481 71603 72624 74314 75734 76315 76387 76661 77447 78437 79068 79087 78860
52589 78860 79049 79869 80774 81134 81028 81031 81425 82106 83200 85089 87638 89990 91499 92425 93319 94120 94408 94242
52571 94242 94190 94555 95179 96041 97512 99817 102548 104987 106709 107746 108327 108670 108925 109263 109982 111499 114025
52554 114025 117208 120232 122385 123462 123706 123585 123651 124286 125345 126254 126690 127044 127910 129233 130342 130837 131078
52537 131078 131561 132148 132281 131806 131222 131101 131544 132189 132508 132130 131192 130430 130580 131530 132414 132686 132669 132785 132723
52518 132723 131950 130723 129935 130001 130498 130929 131269 131597 131748 131625 131442 131360 131252 131146 131469 132402 133271 133109 131798
52499 131798 130185 129044 128293 127355 126038 124841 124487 125270 126822 128396 129370 129511 128931 127934 126940 126408 126742
52482 126742 128170 130609 133537 136185 138070 139316 140271 141005 141422 141780 142587 143924 145250 146011 146137 145814
52466 145814 145157 144269 143373 142703 142556 143473 145839 149048 151605 152568 152600 153149 154798 156833 158224 158573 158155
52449 158155 157488 156994 156840 157057 157748 158925 160139 160727 160686 160878 161949 163486 164695 165486 166243 166880 166912 166369
52431 166369 165787 165228 164078 162033 159682 157808 156554 155500 154167 152260 149796 147197 144937 142991 140979
52416 140979 138871 137063 135684 134373 132980 131891 131354 131010 130536 130292 130760 131602 131856 130991 129378 127781
52400 127781 126731 126327 126307 126308 126261 126476 127157 128016 128617 129028 129784 131245 133206 135096 136369 136772 136530 136281
52382 136281 136638 137709 139106 140387 141394 142283 143355 144826 146637 148543 150467 152609 155053 157451 159357
52367 159357 160784 162153 163722 165388 167087 169085 171650 174637 177622 180412 183222 186336 189782 193448
52353 193448 197319 201364 205210 208233 210168 211439 212751 214503 216726 219338 222083 224409 225912 226947
52339 226947 228404 230748 233629 236490 239126 241487 243431 245057 246948 249594 252748 255694 258039 259917
52325 259917 261494 262716 263602 264530 266065 268521 271672 274834 277386 279355 281390 284114 287666 291921 296827
52310 296827 302333 308196 314196 320409 327055 334244 342038 350530 359624 368980 378490 388593 399802 412130
52296 412130 425292 439177 453714 468520 483237 498056 513387 529147 544960 560943 577631
52285 577631 595042 612502 629551 646419 663343 680006 696006 711464 726774 742059 757094
52274 757094 771486 784736 796494 806913 816366 824706 831301 835966 839321 841882 843427 843743 843442 843383
52260 843383 843669 843822 843614 843051 841779 839322 835862 832124 828490 824921 821811 820175 820636 822667 825199
52245 825199 827714 830560 834439 839765 846333 853525 860975 868944 877820 887394 897114 906946 917394 928565
52231 928565 939838 950690 961304 971927 982177 991502 1000018 1008272 1016247 1023167 1028307 1031619 1033456
52218 1033456 1034061 1033533 1032064 1029952 1027344 1024140 1020196 1015570 1010424 1004687 998021 990292 981890 973327
52204 973327 964601 955308 945346 935124 924976 914755 904264 893837 884226 876043 869422 864038 859337
52191 859337 854925 850861 847414 844557 842039 839919 838480 837460 835946 833499 830928 829356 828862 828571 827858
52176 827858 826821 825692 824481 823258 822232 821354 820240 818610 816503 814056 811480 809234 807724 806716
52162 806716 805498 803811 802203 801244 800808 800362 799621 798571 797134 795129 792444 789067 785135 781116 777631
52147 777631 774793 771922 768240 763760 759275 755579 752842 750496 747534 743132 737431 731588 726757 723045
52133 723045 719753 716547 713959 712622 712314 711939 710315 706977 702496 698116 694876 692789 690932 688483 685588
52118 685588 683061 681330 679975 678395 676691 675602 675641 676597 678000 679767 682130 685109 688439 692069 696402
52103 696402 701901 708694 716673 725835 736282 747964 760627 773998 787927 802423 817650 833840
52091 833840 851084 869209 887932 907064 926441 945727 964473 982468 999875 1016833 1032959
52080 1032959 1047499 1060121 1071398 1082232 1092799 1102347 1110132 1116148 1120708 1123665 1124607 1123731 1121972
52067 1121972 1120099 1118036 1115235 1111303 1106062 1099385 1091403 1082691 1073849 1064914 1055570 1045905 1036686 1028777
52053 1028777 1022464 1017472 1013439 1010173 1007499 1005132 1002899 1001029 1000026 1000112 1000952 1002085 1003522 1005738 1009085
52038 1009085 1013445 1018475 1023977 1029876 1036014 1042129 1048017 1053658 1059142 1064481 1069492 1073968 1078021 1082029
52024 1082029 1086071 1089538 1091570 1091830 1090659 1088588 1085909 1082662 1078684 1073707 1067622 1060610 1052764 1043827
52010 1043827 1033680 1022880 1012095 1001107 988968 975255 960536 945508 930352 915114 899978
51999 899978 884760 868745 851535 833573 815415 796987 778071 759015 740369 722127 703856
51988 703856 685274 666294 646933 627666 609447 592656 576373 559364 541525 523774 506820
51977 506820 490794 475786 461880 448667 435525 422489 410247 399330 389860 381879 375183 368918
51965 368918 362218 355309 349185 344096 339243 334037 328738 323628 318517 313574 309713 307465 306100 304509
51951 304509 302397 300026 297404 294493 291787 289811 288169 285872 282583 279043 276193 274296 272928 271453
51937 271453 269522 267360 265607 264720 264593 264829 265055 264868 263871 262146 260342 258831 257081 254351 250840 247563
51921 247563 245177 243487 242155 241310 241213 241650 241975 241642 240605 239253 238024 236985 235842 234386 232788 231279
51905 231279 229733 227899 225976 224549 223860 223425 222550 221070 219476 218443 218272 218697 219144 219268 219247 219431 219771
51888 219771 219783 219182 218344 217905 217995 218114 217836 217392 217397 218123 219293 220506 221576 222441 223063 223611 224438 225636 226827
51869 226827 227642 228170 228611 228778 228461 228079 228410 229636 231222 232816 234679 237055 239621 241893 243801 245578
51853 245578 247426 249497 251849 254190 256071 257604 259489 261964 264184 265228 265384 265792 266941 268117 268339
51838 268339 267353 265720 264347 263953 264515 265135 264811 263458 261915 260992 260848 261291 262146 263102 263653 263617 263456 263754
51820 263754 264497 265294 266221 267935 270756 273999 276628 278411 279926 281458 282495 282565 282009 281357 280415 278719
51804 278719 276673 275273 274628 273743 272122 270646 270182 270164 269456 268134 267362 267681 268465 269103 269758 270631 271282
51787 271282 271212 270679 270472 271078 272363 273831 274924 275245 274790 273968 273317 273197 273589 273931 273329 271383 268885
51770 268885 267232 266998 267408 267379 266649 265654 264752 264056 263736 263936 264444 264849 265032 265196 265404 265422 265105 264609 264193
51751 264193 264128 264917 267172 270890 275051 278370 280499 282201 284269 286519 287980 287842 286072 283273 280173
51736 280173 277252 274689 272577 271132 270535 270599 270806 270783 270515 269991 269015 267640 266438 265822 265314 264070 262060
51719 262060 260113 258723 257472 255771 253531 250746 247057 242324 237224 232718 229089 225984 223164 220704
51705 220704 218640 216888 215481 214434 213412 212005 210333 208988 208326 208209 208444 208994 209681 210078 209977 209690
51689 209690 209664 210064 210913 212388 214661 217605 220952 224755 229450 235332 242082 248874 254884 259624 262922
51674 262922 264884 266018 267185 269096 271825 275009 278490 282467 286989 291633 295852 299413 302254 304126
51660 304126 304599 303394 300593 296596 291911 286814 281160 274771 268073 261991 256980 252420 247240 241035
51646 241035 234398 228337 223569 220168 217647 215369 212986 210437 207737 205116 203258 202750 203106 202938 201341
51631 201341 198665 195682 192754 190238 188914 189084 189704 189310 187660 185744 184484 184145 184784 186262 187808
51616 187808 188524 188542 188925 190195 191676 192545 192874 193254 193958 194924 196116 197463 198687 199609 200464 201663 203292
51599 203292 204980 206236 206984 207856 209770 212917 216399 219274 221758 224855 229024 233950 239631 246786 255785
51584 255785 265818 275612 284626 293111 301394 309516 317401 324983 332108 338452 343519 346780 348021 347555
51570 347555 345868 343095 339049 333751 327683 321594 316308 312441 309908 307905 305930 304705 305453 308356
51556 308356 312410 316778 321554 327035 333077 339491 346416 353906 361654 369443 377323 385055 391888 397224
51542 397224 401058 403531 404609 404521 403854 402775 400738 397487 393836 390920 389047 387840 387155 387325 388691
51527 388691 391292 394802 398503 401684 404304 406794 408948 409686 408430 405996 403407 400383 395929 390000
51513 390000 383561 377116 370230 362610 354838 347698 341377 335643 330333 325443 321013 317084 313490 309648
51499 309648 304984 299735 295038 291940 290435 289548 288228 286129 283687 281574 280070 278879 277463 275479
51485 275479 272998 270660 269537 270382 272732 275051 276049 275742 275099 275037 275947 277753 280005 282155 284165 286704
51469 286704 290486 295605 301696 308441 315591 322854 330204 337966 346161 354001 360586 365910 370688 375326
51455 375326 379577 383163 386163 388756 390908 392412 393000 392476 390992 389123 387418 386015 384907 384342 384563
51440 384563 385369 386311 387181 387855 387817 386333 383134 378576 373129 366988 360117 352424 343903 334815 325577 316338
51424 316338 306987 297856 289933 283873 279082 274346 269220 264285 260240 257333 255558 254745 254444 254294 254582
51409 254582 255978 258720 262486 267043 272489 278820 285805 293312 301242 309021 315710 320846 324781 327964
51395 327964 330203 330806 329175 325155 319092 311693 303589 294902 285368 274859 263694 252572 242381
51382 242381 233818 226800 220378 213631 206521 199587 193103 187085 181882 177981 175156 172466 169316 165999
51368 165999 163048 160523 158175 155906 153829 152103 150845 149961 149100 148036 147063 146643 146675 146543 145904 145013
51352 145013 144240 143652 143176 142745 142233 141589 141144 141392 142330 143289 143551 143025 142368 142519 143899 145912 147619 149120
51334 149120 151625 155617 159596 161648 161858 162103 163717 166523 170091 174498 179498 184267 188653 193714 200273
51319 200273 207738 215046 222037 229110 236074 242199 247105 250905 253640 255141 255273 253963 251146 246955
51305 246955 241749 235727 228881 221490 214202 207372 200769 194264 188241 182978 178165 173545 169540 166701
51291 166701 164821 163098 160891 157983 154503 151040 148470 147206 146822 146709 146697 146731 146472 145694 144623 143389
51275 143389 141586 138991 136269 134340 133286 132465 131458 130380 129509 129152 129608 130757 131902 132561 133149 134371
51259 134371 136254 138296 140242 141991 143057 142852 141512 139815 138348 137260 136612 136305 135790 134576 133015
51244 133015 131921 131403 130702 129245 127274 125372 123953 123278 123343 123576 123208 122164 121129 120610 120417 120271 120373
51227 120373 121008 121881 122295 121892 121012 120353 120294 120556 120582 120267 120075 120305 120646 120753 120835 121170 121434 121199 120958 121857
51207 121857 124353 127718 130936 133446 134953 135278 134739 134173 134187 134689 135341 136112 137092 138113 138788 138770 137892
51190 137892 136337 134695 133567 133025 132789 132936 133967 136042 138549 140613 141733 141869 141355 140840 140873 141317
51174 141317 141547 141408 141481 142187 143083 143440 143175 142781 142597 142468 142007 140896 139100 137040 135328 134087 132737
51157 132737 130756 128445 126645 125834 125787 125986 126051 125793 125198 124435 123683 122884 121807 120388 118960 118115 118316
51140 118316 119558 121386 123265 124934 126338 127408 128202 129228 131200 134295 137926 141370 144302 146489
51126 146489 147386 146567 144445 142057 140048 138162 135890 133200 130440 127818 125381 123381 122181 121629 120953
51111 120953 119656 118216 117505 117626 117894 117944 118203 119028 119975 120393 120284 120057 119826 119573 119703 120744 122575 124565
51093 124565 126339 127800 128536 128150 127238 127150 128443 130342 132062 133816 135914 137695 138260 137855 137594 137975
51077 137975 138486 138681 138842 139349 140024 140488 140815 141434 142522 143768 144733 145328 145909 146917 148440 150115 151479
51060 151479 152352 152940 153657 154793 156185 157249 157657 157947 159047 161071 163047 164173 164881 166179 168248 170313
51044 170313 171716 172500 172904 172908 172510 171981 171541 171079 170430 169689 169035 168470 167989 167831 168267 169189 170163 170856 171250
51025 171250 171466 171632 171928 172468 172977 172848 171847 170685 170536 171828 173743 175143 175804 176482 177886 179950
51009 179950 182187 184321 186362 188284 189978 191460 192946 194711 196962 199724 202743 205634 208311 211191
50995 211191 214755 218993 223512 228099 232923 238169 243826 249941 256808 264632 273221 282261 291792 302084
50981 302084 313135 324652 336692 349952 365127 382144 400410 419766 440850 464483 491131
50970 491131 521063 554550 591470 631044 672550 716305 763390 814277 868137 923678 980290
50959 980290 1037985 1096484 1154732 1211197 1264346 1312894 1355988 1393298 1424805 1450411 1469871
50948 1469871 1483104 1490437 1492505 1490106 1484181 1475767 1465756 1454677 1442837 1430723 1419209 1409207
50936 1409207 1401036 1394120 1387368 1379803 1370692 1359205 1344309 1325307 1302320 1275849 1245809 1211381
50924 1211381 1172086 1128805 1083334 1036914 989571 941033 891981 844013 798548 756101 716648
50913 716648 680247 647037 616897 589502 564751 542901 524176 508317 494620 482417 471501
50902 471501 462096 454353 448002 442574 437912 434199 431490 429478 427872 426757 426345 426524 426951 427580 428847
50887 428847 431258 434806 438811 442350 445002 447251 450041 453897 458594 463729 469269 475364 481958 488923
50873 488923 496429 504800 514147 524427 535761 548346 562160 577143 593617 612123 632814 655431
50861 655431 679924 706781 736664 770089 807538 849581 896749 949506 1008441 1074180 1147086
50850 1147086 1227305 1315161 1411112 1515159 1626584 1744410 1867821 1995928 2127369 2260297
50840 2260297 2392462 2521098 2643015 2755183 2855232 2941285 3011574 3064461 3098978 3115408
50830 3115408 3115597 3102697 3080259 3051219 3017666 2981464 2944859 2910465 2880800 2857646 2841428 2831084
50818 2831084 2824824 2820945 2817514 2811428 2798643 2775853 2741603 2695645 2637902 2568621 2488912 2400330
50806 2400330 2304095 2201385 2094330 1985928 1878856 1774823 1675220 1581834 1496557 1420645
50796 1420645 1354545 1298291 1251855 1215180 1188065 1170113 1160801 1159667 1166442 1181028 1203304 1232766
50784 1232766 1268138 1307400 1348452 1389921 1431064 1470803 1507160 1537923 1561760 1578495 1588496
50773 1588496 1592187 1590064 1582786 1570931 1554690 1533964 1508863 1480136 1448932 1415890 1380548 1342008
50761 1342008 1300341 1257106 1214383 1173519 1135000 1099191 1066815 1038698 1015326 996736 982748
50750 982748 973225 968078 967004 969395 974658 982520 992810 1005183 1019482 1036235 1056230 1079603 1106001
50737 1106001 1135834 1170680 1212003 1259940 1313750 1373001 1437842 1508452 1584708 1666109 1751513
50726 1751513 1839130 1927097 2013741 2096927 2173646 2240959 2297280 2342324 2375996 2397813 2407172
50715 2407172 2403641 2387220 2358899 2320970 2276337 2227634 2177338 2128240 2082993 2043227 2009654
50704 2009654 1982872 1963273 1950190 1941869 1936414 1932178 1927240 1919309 1906443 1887314 1860753 1825760
50692 1825760 1782320 1731690 1675685 1616189 1555454 1496041 1439943 1388178 1341536 1301103 1267635
50681 1267635 1241060 1221206 1208674 1204421 1208868 1222059 1244410 1276592 1318712 1370250 1430949 1501267
50669 1501267 1581674 1671745 1770052 1874662 1983494 2094200 2203953 2309579 2408114 2497251
50659 2497251 2575304 2641021 2693853 2734446 2764477 2785684 2799038 2804743 2802771 2793308 2776912 2754358
50647 2754358 2726238 2692814 2654534 2612603 2568547 2523289 2477202 2431331 2387960 2349552 2317429
50636 2317429 2291780 2272553 2259772 2253149 2251865 2254741 2260391 2267312 2274106 2279604 2282688 2282277 2277809
50623 2277809 2269642 2258736 2246034 2232266 2218120 2204349 2191857 2181920 2176059 2175334 2179788 2188816 2201858
50610 2201858 2218484 2237945 2258959 2279875 2298910 2314495 2325727 2332292 2333619 2328425 2315555 2295020
50598 2295020 2267487 2232763 2189499 2136638 2074681 2005291 1930222 1851085 1769821 1688691 1609637
50587 1609637 1533800 1461648 1393457 1329641 1270750 1217150 1168707 1124934 1085561 1050777 1020791
50576 1020791 995321 973729 955607 940896 929459 920885 914965 912114 912957 917539 925305 935993 950180
50563 950180 968614 991183 1016946 1045187 1076069 1110165 1147825 1189319 1235371 1287029 1344906
50552 1344906 1408837 1478339 1553222 1633514 1718910 1808390 1900324 1992754 2083558 2170621 2252091
50541 2252091 2326626 2393424 2452174 2503143 2547348 2586413 2622106 2655940 2688902 2721155 2751894
50530 2751894 2779996 2805180 2828372 2850664 2872364 2893627 2915789 2941314 2972225 3009065 3051457
50519 3051457 3098994 3151147 3206667 3263514 3319228 3371220 3417000 3454506 3482146 3498396 3501622
50508 3501622 3490489 3464408 3423505 3368605 3301459 3224565 3140318 3050565 2957336 2863703 2773469
50497 2773469 2690100 2616319 2554387 2506076 2472205 2452535 2446185 2451895 2467983 2492484 2523362 2558315
50485 2558315 2594331 2627808 2655125 2672814 2677363 2665522 2635230 2586096 2518973 2435473 2338110
50474 2338110 2230535 2117075 2001811 1887946 1777719 1672646 1573875 1482363 1398697 1322764
50464 1322764 1253903 1191574 1135767 1086638 1043933 1006989 975291 948736 927262 910334 896951
50453 896951 886187 877734 871943 869436 870631 875431 883184 893009 904378 917420 932559 949891 969089
50440 969089 989866 1012173 1035867 1060557 1085969 1112206 1139436 1167633 1196843 1227372 1259292
50429 1259292 1291966 1324491 1356525 1388260 1419751 1450732 1481097 1511065 1540813 1570235 1599129
50418 1599129 1627299 1654496 1680638 1706149 1731716 1757763 1784585 1812955 1843865 1877324 1911930
50407 1911930 1946126 1979576 2012923 2046477 2079656 2111575 2141633 2169325 2193811 2213862 2228174
50396 2228174 2235737 2236028 2228828 2213802 2190263 2157440 2114957 2063044 2002486 1934525 1860769 1783085
50384 1783085 1703586 1624684 1548908 1478366 1414350 1357561 1308649 1268438 1237573 1216071 1203278
50373 1203278 1198304 1200408 1208893 1222612 1239810 1258579 1277338 1294638 1308729 1317719 1320194 1315407
50361 1315407 1302907 1282477 1254664 1220956 1183169 1142786 1101047 1059312 1018879 980502 944335
50350 944335 910251 878082 847700 819162 792793 768990 748000 729883 714447 701066 688859
50339 688859 677383 667009 658391 651708 646688 643145 641138 640756 642107 645455 650949 658242 666753 676348
50325 676348 687420 700224 714451 729481 744792 760053 775223 790711 807215 825192 844598
50314 844598 865070 886097 907042 927510 947863 969004 991397 1014545 1037611 1060183 1082144
50303 1082144 1103177 1122804 1140724 1156679 1170140 1180555 1187880 1192482 1194521 1193771 1190041 1183481 1174469
50290 1174469 1163528 1151399 1138775 1125755 1111685 1095688 1077164 1055882 1031954 1005990 979059
50279 979059 952215 926085 900933 876923 854094 832214 810920 790045 769777 750486 732428
50268 732428 715528 699458 684064 669691 656903 645840 636186 627884 621517 617638 615900 615221 614711
50255 614711 614142 613679 613613 614381 616341 619273 622384 625037 627258 629369 631400 633203 634913 636849 638874
50240 638874 640224 640214 638961 637215 635509 633674 631232 628067 624511 620770 616514 611243 604981 598377 592045
50225 592045 586034 580096 574343 569338 565504 562657 560295 558250 556896 556705 557773 559889 562889 566715
50211 566715 571160 575776 580175 584245 587957 591131 593541 595193 596308 597069 597489 597414 596505 594380 591010
50196 591010 586901 582592 578078 573101 567986 563588 560157 556701 551987 546002 539964 534971 530950 526922
50182 526922 521902 515435 507687 499382 491586 485221 480595 477315 474605 471744 468362 464546 460829 458021
50168 458021 456820 457285 458664 459940 460647 461071 461597 462062 461866 460526 457922 454138 449427 444340 439554 435365
50152 435365 431499 427607 423845 420745 418515 416664 414502 411904 409405 407530 406264 405226 404121 402815
50138 402815 401227 399538 398357 398229 398917 399633 400086 400847 402468 404779 407466 410900 415756 421998 428812
50123 428812 435495 441873 447870 453362 458637 464464 471324 478863 486412 493744 501033 508280 515117 521089
50109 521089 525907 529571 532480 535253 538144 540719 542405 543249 543819 544364 544544 544109 543471 543275 543652 544271
50093 544271 545032 546329 548563 551726 555611 560207 565599 571702 578317 585368 592780 600189 607151 613779
50079 613779 620889 629308 639113 649686 660323 670712 681015 691720 703333 716019 729558 743723
50067 743723 758507 773807 789048 803427 816583 828881 841095 853877 867443 881536 895741
50056 895741 909971 924642 940275 956974 974393 992037 1009476 1026450 1043129 1060196 1078466
50045 1078466 1098420 1120231 1144067 1170140 1198654 1230007 1264987 1304497 1349276 1400181 1458414
50034 1458414 1524820 1599001 1679655 1765667 1856054 1948526 2038831 2122052 2194268 2252925 2296476
50023 2296476 2324621 2338806 2341987 2337922 2330755 2324535 2321992 2323477 2327311 2331064 2332099 2327115 2312122
50010 2312122 2283514 2239267 2179384 2105694 2021306 1929631 1833484 1735161 1637311 1543189 1455630
49999 1455630 1375952 1304053 1239242 1180620 1127054 1077557 1031945 990728 954082 921186 890757
49988 890757 862029 834958 809725 786409 765126 746048 729096 713858 699982 687419 676148
49977 676148 665876 656292 647450 639625 632915 627317 622981 619963 617773 615708 613752 612598 612513 612741 612490
49962 612490 612096 612538 613983 615450 616023 615838 615733 616346 617843 620184 623256 626861 630883 635444 640731 646640
49946 646640 652834 659196 666144 674334 684059 694988 706572 718669 731643 745847 761224 777557
49934 777557 795001 814113 835395 859071 885291 914357 946598 982310 1022034 1066812 1117947
49923 1117947 1176518 1243255 1318820 1404000 1499584 1606261 1724611 1854852 1996172 2146283
49913 2146283 2301686 2458278 2611514 2756346 2887843 3002552 3099415 3179429 3244864 3299033
49903 3299033 3346154 3390283 3433718 3476404 3516668 3551981 3578942 3593273 3590572 3567237 3520851
49892 3520851 3450519 3357586 3245856 3120310 2985269 2843906 2699195 2554430 2412443 2274727
49882 2274727 2141752 2013926 1891921 1776270 1667175 1564848 1469764 1382428 1302920 1230812
49872 1230812 1165445 1106280 1053007 1005350 962829 924794 890716 860333 833419 809550 788234
49861 788234 769201 752204 736494 720834 704393 687529 671336 656440 642542 629145 616260
49850 616260 604089 592443 580957 569751 559368 550047 541537 533765 527142 521917 517532 513045 508091
49837 508091 503157 499007 496078 494298 493208 492243 491119 489999 489185 488760 488697 489141 490264 491879 493580 495356
49821 495356 497773 501366 506045 511276 516675 522216 527978 534037 540688 548647 558785 571604 586920
49808 586920 604084 622608 642687 665178 691048 720868 754874 793482 837608 888395 946662
49797 946662 1012728 1086731 1168920 1259535 1358365 1464361 1575367 1688029 1798073 1900896
49787 1900896 1992150 2068136 2126379 2166429 2190155 2201023 2203018 2200170 2196418 2194892 2196884 2201640
49775 2201640 2207023 2209891 2205901 2189922 2157448 2105804 2034237 1943728 1837298 1720024 1597833
49764 1597833 1476002 1358736 1249387 1150165 1061601 982957 913360 852261 798987 752575 712241
49753 712241 677557 647966 622601 600802 582440 567393 554943 544056 534126 525177 517418 510854
49741 510854 505324 500692 496906 493853 491278 488942 486934 485658 485391 485914 486695 487300 487425 486755 485126 482836
49725 482836 480505 478566 477071 475933 475034 474070 472599 470380 467529 464365 461324 458954 457691 457490 457870
49710 457870 458325 458567 458462 458045 457625 457612 458157 459141 460388 461661 462614 463193 463934 465380 467231 468710 469776
49693 469776 471302 473835 476821 479430 481555 483620 485829 488062 490070 491433 491819 491770 492706 495513 499473
49678 499473 503171 506061 508448 510366 511447 511844 512344 513385 514655 515757 516605 516981 516479 515266 514278 514284
49662 514284 515153 516374 517742 519193 520474 521538 522879 524899 527158 528772 529412 529405 528971 527913 526099 523745
49646 523745 521135 518472 516139 514716 514468 514978 515497 515556 515193 514761 514616 514876 515362 515904 516712 518208 520456
49629 520456 522966 525227 527188 529020 530648 531882 532863 533976 535276 536351 536906 537215 537839 539133 541111
49614 541111 543603 546352 549171 552266 556183 561228 567066 573158 579404 586029 593039 600290 607999 616631
49600 616631 626228 636439 647324 659462 672880 686526 699446 712083 725688 740617 755998 771100
49588 771100 786330 802580 820152 838739 858244 879283 902824 929317 958086 987801 1017894
49577 1017894 1049329 1083511 1120582 1159459 1199548 1241518 1286044 1332617 1380305 1429055 1479370
49566 1479370 1531104 1583553 1636645 1691088 1747132 1803928 1860363 1915983 1970795 2024717 2077438
49555 2077438 2128359 2176274 2219585 2257238 2289149 2315481 2335879 2349722 2356705 2356711 2349598 2335705
49543 2335705 2316250 2292587 2265309 2234704 2201915 2168807 2136589 2105247 2074538 2044946 2017449
49532 2017449 1992924 1972048 1955210 1942179 1932341 1925647 1922911 1924827 1931171 1941441 1955791 1974683
49520 1974683 1997896 2024600 2054255 2086841 2122288 2160334 2200924 2244067 2289114 2334683 2379495
49509 2379495 2422814 2463952 2501826 2535350 2563933 2587273 2604888 2616029 2619809 2615307 2601851 2579471
49497 2579471 2548840 2510633 2465173 2412838 2354465 2291143 2223947 2154155 2083354 2012816 1942840
49486 1942840 1873014 1803100 1733544 1665363 1599830 1538028 1480320 1426288 1375381 1327495 1282744
49475 1282744 1241037 1202210 1166276 1132968 1101284 1070145 1039534 1010368 983148 957354 932419
49464 932419 908757 887335 868525 851742 836086 821007 806513 793004 780911 770300 760855 752301
49452 752301 744702 738271 733011 728648 724776 720991 717113 713361 710083 707149 703858 699665 694820 690098
49438 690098 686110 683111 681229 680457 680522 681113 682260 684209 686949 690133 693488 697109 701378 706791 713771
49423 713771 722346 732050 742375 753212 764500 775556 785322 793388 800357 807011 813552 819857 826015
49410 826015 832269 838804 845912 854031 863213 872847 882397 892181 902949 914863 927377 939966 952417
49397 952417 964478 975913 986991 998319 1009957 1021182 1031305 1040328 1048629 1056529 1064393 1072549
49385 1072549 1080664 1087710 1093166 1097929 1103481 1110328 1117789 1125168 1132542 1140372 1148900 1158094 1167837 1178089
49371 1178089 1189071 1201264 1214901 1229521 1244413 1259529 1275627 1293465 1313192 1334557 1357389
49360 1357389 1381824 1408309 1437353 1468909 1501999 1535470 1569233 1604335 1641724 1681454 1723268
49349 1723268 1767325 1813898 1862818 1913794 1967066 2023203 2082422 2144565 2209642 2277891 2349364
49338 2349364 2423914 2501670 2582973 2667657 2754834 2843727 2934478 3027754 3123635 3221218 3319315
49327 3319315 3417117 3513969 3608787 3700227 3787468 3870419 3948869 4021783 4087734 4145717 4195059
49316 4195059 4234795 4263917 4282356 4291070 4290863 4281702 4263609 4237687 4205685 4168937 4128342 4085145
49304 4085145 4041054 3997452 3955028 3914281 3876003 3841161 3810599 3784934 3764414 3748799 3737613
49293 3737613 3730670 3728194 3730441 3737426 3749094 3765541 3786952 3813371 3844512 3879704 3918092 3959106
49281 3959106 4002654 4048710 4096740 4145652 4194179 4241164 4285771 4327679 4366809 4402377 4432315
49270 4432315 4454124 4466386 4469117 4462712 4446997 4421352 4385291 4338858 4282944 4219330 4149910 4075638
49258 4075638 3996644 3913578 3828305 3742883 3658347 3574956 3493288 3414374 3338889 3266793 3197877
49247 3197877 3132266 3070234 3011854 2957021 2905687 2857914 2813711 2772811 2734649 2698647 2664668
49236 2664668 2633055 2604014 2577088 2551403 2526419 2502235 2479175 2457328 2436591 2416961 2398583
49225 2398583 2381541 2365816 2351518 2338986 2328425 2319455 2311252 2303259 2295638 2288895 2283285 2278773 2275365
49212 2275365 2273049 2271477 2270069 2268504 2266807 2264952 2262719 2259992 2256844 2253225 2248948 2244118 2239184 2234356
49198 2234356 2229336 2223844 2218005 2211927 2205353 2198173 2190933 2184275 2178099 2171794 2165195 2158810 2153121 2148136
49184 2148136 2143672 2139642 2136043 2132980 2130767 2129679 2129586 2130173 2131539 2134212 2138499 2144130 2150618 2157683 2165260
49169 2165260 2173494 2182838 2193870 2206813 2221407 2237240 2253961 2271162 2288514 2306172 2324804 2344990
49157 2344990 2366783 2389884 2413969 2438756 2464077 2490049 2516912 2544638 2573002 2602071 2632168
49146 2632168 2663287 2695100 2727755 2761980 2797874 2834154 2869229 2902624 2934673 2965290 2994072
49135 2994072 3021632 3049739 3079744 3111473 3143921 3176401 3208615 3240231 3271047 3301259 3330987
49124 3330987 3359701 3386629 3411693 3435561 3458790 3481240 3502420 3522060 3540257 3557300 3573507
49113 3573507 3589056 3603856 3617614 3630075 3641151 3650849 3659238 3666524 3673087 3679415 3686017 3693279 3701280
49100 3701280 3709762 3718516 3727778 3738127 3749909 3762923 3776785 3791443 3807217 3824323 3842533 3861356
49088 3861356 3880577 3900519 3921625 3943744 3965978 3987419 4008011 4028520 4049616 4071158 4092380
49077 4092380 4112592 4131517 4149175 4165681 4181229 4196022 4210071 4223052 4234457 4243906 4251303 4256729
49065 4256729 4260276 4262000 4261956 4260139 4256440 4250822 4243572 4235159 4225670 4214637 4201671 4187090 4171511
49052 4171511 4154902 4136604 4116444 4095329 4074357 4053740 4033052 4012241 3991822 3972239 3953588
49041 3953588 3935918 3919114 3902442 3884968 3866778 3849254 3833710 3820198 3808068 3797170 3787834
49030 3787834 3780077 3773728 3769198 3767254 3767825 3769887 3772867 3777463 3784592 3794073 3804966 3816840 3830056
49017 3830056 3845086 3862204 3881702 3903661 3927370 3951603 3975740 4000216 4025724 4052303 4079389
49006 4079389 4106319 4132531 4157644 4181731 4205200 4228022 4249236 4267626 4282831 4295407 4305826
48995 4305826 4313804 4318710 4320337 4319056 4315373 4309541 4301582 4291572 4279803 4266613 4252062 4235886 4217747
48982 4217747 4197472 4174980 4150141 4122835 4093150 4061413 4028106 3993724 3958592 3922779 3886333
48971 3886333 3849643 3813348 3777776 3742683 3707602 3672201 3636221 3599464 3562207 3525317 3489592
48960 3489592 3455163 3421905 3390103 3360224 3332300 3306178 3282227 3261029 3242329 3225120 3209059
48949 3209059 3195153 3184615 3177582 3173340 3171256 3170951 3171997 3174099 3177436 3182363 3188943 3197176 3207413
48936 3207413 3220000 3234672 3250822 3268270 3287229 3307551 3328681 3350484 3373577 3398558 3425356
48925 3425356 3453676 3483695 3515806 3549883 3585265 3621577 3659152 3698439 3739263 3781077 3823933
48914 3823933 3868790 3916532 3966950 4019121 4072736 4128547 4187405 4249375 4314116 4381639 4452174
48903 4452174 4525528 4601165 4678878 4758904 4841346 4925900 5012215 5100117 5189323 5279180 5368904
48892 5368904 5457948 5546176 5633759 5720849 5807140 5891765 5973790 6052700 6128171 6199518 6265828
48881 6265828 6326645 6382169 6432719 6478318 6518900 6554550 6585318 6610938 6630902 6644698 6652055
48870 6652055 6653107 6648214 6637319 6619597 6594237 6561623 6523282 6480498 6433428 6381763 6325709 6265866
48858 6265866 6202517 6135564 6065038 5991273 5914610 5835377 5754116 5671550 5588246 5504559 5420918
48847 5420918 5337865 5255755 5174667 5094791 5016721 4941139 4868325 4798143 4730543 4665783 4604087
48836 4604087 4545302 4489233 4436285 4387456 4343502 4304242 4268736 4236017 4205622 4177712 4152920
48825 4152920 4131951 4115082 4102109 4092769 4086977 4084572 4085245 4088962 4096020 4106372 4119310 4134292 4151666
48812 4151666 4171944 4194792 4219576 4246629 4276976 4310778 4347029 4384918 4424532 4465936 4508588
48801 4508588 4552252 4597554 4644876 4693388 4742013 4790795 4840386 4890500 4939914 4987961 5035282
48790 5035282 5082984 5131642 5181236 5231521 5282250 5333322 5384839 5436915 5489559 5542930 5597397
48779 5597397 5653022 5709241 5765513 5822043 5879328 5937091 5994233 6049810 6103495 6155000 6203568
48768 6203568 6248242 6288263 6323009 6351856 6374302 6390103 6399221 6401761 6397869 6387421 6369879 6344793
48756 6344793 6312508 6274072 6230368 6181574 6127480 6067985 6003176 5933225 5858467 5779429 5696605
48745 5696605 5610274 5520728 5428701 5335453 5242260 5149780 5058063 4967340 4878716 4793744 4713355
48734 4713355 4637606 4566482 4500376 4439410 4382910 4330179 4281562 4238113 4200267 4167406 4138730
48723 4138730 4114049 4093538 4077110 4064230 4054108 4045982 4039379 4034229 4030780 4029478 4030892 4035386 4042646
48710 4042646 4051854 4062551 4074977 4089218 4104425 4119372 4133526 4147041 4160007 4172408 4184677
48699 4184677 4197560 4211325 4225606 4240089 4254981 4270901 4288784 4309681 4334039 4361291 4390759
48688 4390759 4422864 4458751 4498861 4542730 4590261 4642173 4698902 4759906 4824530 4892899 4965490
48677 4965490 5042403 5123511 5208849 5298407 5391860 5488798 5588721 5690620 5793099 5895202 5996508
48666 5996508 6096083 6192103 6282997 6368252 6447388 6518733 6580018 6629785 6667474 6692498 6704124
48655 6704124 6702150 6686933 6658730 6617623 6564176 6499633 6425474 6343161 6254233 6160107 6061685
48644 6061685 5959407 5853596 5744558 5632588 5518320 5402944 5287644 5172971 5059086
48635 5059086 4946375 4835414 4726581 4620240 4517171 4418301 4324067 4234388 4148962 4067166
48625 4067166 3988108 3911580 3838699 3770748 3707436 3647180 3589040 3533406 3480674 3430401 3382312
48614 3382312 3337181 3295896 3258162 3222764 3188699 3155454 3122598 3089861 3057546 3026350 2996833
48603 2996833 2969269 2943722 2919831 2896806 2874091 2851763 2829834 2807555 2784237 2760586 2738288
48592 2738288 2718058 2698907 2679750 2661061 2644231 2629737 2616735 2604441 2593177 2583736 2576193 2569795
48580 2569795 2563910 2558699 2554793 2552543 2551776 2552148 2553532 2556005 2559669 2564663 2571243 2579603 2589526 2600454
48566 2600454 2611991 2624081 2636441 2648083 2657926 2665880 2672820 2679260 2684639 2688331 2690928 2693874 2697969
48553 2697969 2702894 2708163 2713775 2719651 2725096 2729415 2732757 2735889 2739298 2742916 2746582 2750319 2754173 2758177
48539 2758177 2762571 2767833 2774424 2782622 2792577 2804346 2817817 2832725 2848723 2865406 2882401 2899524
48527 2899524 2916734 2933855 2950517 2966558 2982266 2997952 3013380 3027805 3040423 3050611 3058035
48516 3058035 3062952 3066294 3069072 3071782 3074715 3078668 3084744 3093361 3104011 3116207 3130257 3146905 3166629
48503 3166629 3189579 3215855 3245434 3277969 3313057 3350709 3391377 3435513 3483252 3534362 3588303
48492 3588303 3644411 3702271 3761925 3823619 3887332 3952662 4019052 4085885 4152283 4217000 4278683
48481 4278683 4336277 4389127 4436648 4477954 4511867 4537321 4553718 4560982 4559515 4550249 4534567 4513807
48469 4513807 4488731 4459607 4426842 4391444 4354759 4317855 4281182 4244749 4208554 4172830 4137803
48458 4137803 4103187 4068029 4031109 3991453 3948413 3901518 3850547 3795622 3736944 3674463 3608151
48447 3608151 3538627 3467117 3394625 3321342 3247091 3172197 3097756 3025143 2955382 2888823 2825213
48436 2825213 2764138 2705519 2649734 2597250 2548232 2502550 2460002 2420458 2383879 2350374 2320206
48425 2320206 2293688 2270974 2251911 2236018 2222684 2211541 2202616 2196022 2191535 2188759 2187667 2188699
48413 2188699 2192152 2197714 2204786 2213085 2222647 2233436 2245283 2258248 2272689 2288810 2306276 2324459
48401 2324459 2342961 2361676 2380393 2398588 2415850 2432394 2448879 2465674 2482488 2498798 2514429
48390 2514429 2529600 2544516 2559084 2572834 2584960 2594679 2601929 2607598 2612694 2617334 2620841 2622771 2623397
48377 2623397 2623188 2622342 2621082 2620016 2619880 2621138 2624001 2628497 2634312 2640895 2648108 2656496 2666619 2678326
48363 2678326 2691102 2704907 2720168 2737054 2755269 2774549 2794872 2816052 2837538 2858834 2879856
48352 2879856 2900724 2921509 2942336 2963468 2985047 3006921 3028893 3050948 3073053 3094968 3116518
48341 3116518 3137876 3159224 3180161 3199763 3217325 3232850 3246793 3259574 3271488 3282892 3294182
48330 3294182 3305516 3316668 3327330 3337547 3347834 3358757 3370389 3382233 3393763 3405007 3416531
48319 3416531 3428860 3441960 3455253 3468083 3480206 3491963 3504003 3516746 3530083 3543638 3557233
48308 3557233 3570918 3584520 3597467 3609291 3620167 3630727 3641415 3652259 3663209 3674399 3685987
48297 3685987 3698097 3711036 3725314 3741134 3758072 3775605 3793906 3813710 3835381 3858463 3882382
48286 3882382 3907304 3933956 3962671 3992898 4023709 4054498 4085025 4114914 4143327 4169144 4191312
48275 4191312 4209001 4221564 4228487 4229310 4223544 4210742 4190695 4163502 4129427 4088885 4042695 3992069
48263 3992069 3938016 3880810 3820420 3757439 3693230 3629109 3565808 3503878 3443983 3386341 3330293
48252 3330293 3275112 3221152 3169543 3120697 3073670 3027213 2980943 2935230 2890381 2846425 2803493
48241 2803493 2761829 2721367 2681654 2642313 2603383 2565059 2527350 2490203 2453865 2418820 2385229
48230 2385229 2352598 2320134 2287514 2255188 2223960 2194271 2165838 2137838 2109452 2080340 2050668
48219 2050668 2020680 1990402 1959896 1929696 1900604 1872965 1846420 1820440 1794701 1768852 1742462
48208 1742462 1715670 1689499 1664832 1641240 1617419 1592805 1568059 1543810 1519593 1494556 1468784
48197 1468784 1443374 1419286 1396598 1374871 1353838 1333475 1313640 1293978 1274290 1254873 1236314
48186 1236314 1218903 1202431 1186620 1171569 1157529 1144423 1131882 1119785 1108418 1098044 1088565
48175 1088565 1079716 1071390 1063673 1056691 1050525 1045168 1040516 1036499 1033222 1030870 1029487 1028919 1028926 1029179 1029376
48160 1029376 1029586 1030417 1032514 1035933 1040244 1045153 1050646 1056631 1062871 1069331 1076191 1083487 1091177 1099590
48146 1099590 1109322 1120467 1132398 1144418 1156199 1167487 1177927 1187532 1196850 1206393 1216303 1226811
48134 1226811 1238380 1250971 1263707 1275893 1287971 1300849 1314673 1328912 1343388 1358364 1373731
48123 1373731 1388879 1403557 1418206 1433261 1448555 1463601 1478122 1492163 1506031 1520173 1534760
48112 1534760 1549323 1563094 1575789 1587769 1599425 1610737 1621524 1631748 1641411 1650445 1658843 1666774
48100 1666774 1674524 1682465 1691020 1700434 1710688 1721885 1734524 1748969 1764815 1781387 1798866 1818258
48088 1818258 1840124 1864031 1889597 1917358 1948057 1981535 2017089 2054734 2095419 2140014 2188728
48077 2188728 2241699 2299491 2362209 2427848 2491641 2547273 2589295 2615087 2625399 2623558 2614122 2601616
48065 2601616 2589558 2579996 2573688 2570567 2570042 2571133 2572851 2574642 2576351 2577694 2578069 2577086 2575037 2572514
48051 2572514 2569596 2565675 2560161 2553146 2545194 2536476 2526409 2514395 2500911 2487522 2475554 2464900
48039 2464900 2454313 2442684 2429742 2415740 2401041 2386040 2371008 2355776 2339944 2323602 2307442
48028 2307442 2291841 2276205 2259636 2242016 2223919 2205540 2186188 2165035 2142007 2117685 2092482
48017 2092482 2066179 2038322 2008958 1978790 1948566 1918450 1888198 1857789 1827561 1797690 1767993
48006 1767993 1738504 1709854 1682650 1656635 1630928 1605095 1579557 1554978 1531589 1509299 1488074
47995 1488074 1467910 1448724 1430577 1413930 1399288 1386537 1374824 1363232 1351439 1339713 1328429
47984 1328429 1317715 1307487 1297644 1288211 1279335 1271095 1263313 1255717 1248426 1242067 1237034 1232750 1228124
47971 1228124 1222886 1217965 1214198 1211109 1207580 1203500 1199955 1197658 1195860 1193246 1189466 1185291 1181459 1177891
47957 1177891 1174001 1169322 1163717 1157249 1150046 1142181 1133580 1124135 1113954 1103356 1092480 1080940 1068124
47944 1068124 1053956 1039235 1024996 1011479 997964 983746 968986 954346 940027 925671 911216
47933 911216 897380 885052 874570 865772 858402 852117 846374 840770 835478 831003 827551 824986 823376
47920 823376 823125 824397 826717 829442 832451 836094 840534 845462 850544 855870 861725 868031 874315 880289
47906 880289 886133 891983 897386 901690 904885 907594 910130 912024 912770 912630 912308 912096 911862 911695 911885 912145
47890 912145 911422 908937 905176 901474 898733 896818 895114 893376 891911 891110 890929 890882 890617 890470 891257 893381
47874 893381 896319 899272 902179 905734 910374 915670 920965 926241 931957 938192 944472 950478 956489 962957
47860 962957 969967 977348 984961 992552 999506 1005156 1009305 1012210 1014137 1015166 1015232 1014034 1011058 1006183 1000154
47845 1000154 993886 987212 978937 968401 956442 944388 932638 920765 908661 896821 885608 874873
47833 874873 864447 854465 845022 835883 826805 817898 809523 802014 795570 790161 785385 780653 775663 770541
47819 770541 765430 760188 754665 749004 743414 737795 731924 725990 720645 716333 712697 708752 703748 697831
47805 697831 691892 686805 682824 679687 677066 674725 672390 669739 666632 663202 659737 656617 654332 653155
47791 653155 652735 652337 651691 651373 652079 653821 656165 659069 663053 668560 675518 683601 692556 702251 712690
47776 712690 724140 736938 750961 765534 780151 795184 811617 830096 850485 872331 895494
47765 895494 920083 945947 972568 999566 1027075 1055304 1083852 1111791 1138529 1164223 1189069
47754 1189069 1212526 1233602 1251722 1266838 1278849 1287549 1293261 1296930 1299168 1299587 1297425 1292513 1285304
47741 1285304 1276209 1265389 1253041 1239457 1224829 1209330 1193326 1177158 1160837 1144315 1127968
47730 1127968 1112412 1097836 1083971 1070714 1058331 1046975 1036512 1026996 1018937 1012817 1008599 1005899
47718 1005899 1004365 1003734 1003859 1004832 1006906 1010117 1014282 1019343 1025289 1031609 1037424 1042418 1047094 1051729 1055658
47703 1055658 1058173 1059583 1060613 1061053 1059856 1056485 1051415 1045314 1038465 1031081 1023452 1015514 1006858 997419
47689 997419 987603 977525 966675 954785 942640 931565 922278 914489 907357 900129 892665 885677 880211
47676 880211 876650 874427 872961 872556 874030 877709 883142 889633 896724 904276 912460 921597 931778 942738
47662 942738 954300 966672 979986 993805 1007555 1021325 1035625 1050309 1064377 1077126 1089036
47651 1089036 1100952 1112640 1122711 1130058 1135006 1138754 1141953 1144094 1144312 1142416 1138932 1134365 1128768
47638 1128768 1122111 1114749 1107340 1100357 1093858 1087679 1081753 1076303 1071818 1068881 1067873 1068770 1071163 1074517
47624 1074517 1078606 1083807 1090843 1100069 1111067 1123067 1135607 1148427 1160873 1171918 1180940 1188098
47612 1188098 1193756 1197916 1200416 1201243 1200256 1196860 1190514 1181504 1170755 1158768 1145024 1128479 1108493
47599 1108493 1085251 1059485 1031928 1002987 972945 942399 912255 883088 854734 826743 799150
47588 799150 772498 747156 722976 699781 677940 658200 640943 625763 611911 599062 587468
47577 587468 577242 567835 558593 549644 541703 534906 528457 521740 515233 509829 505623 501999 498734 496304
47563 496304 495055 494631 494438 494270 494328 494985 496638 499507 503293 507304 511183 515398 520859 528111 536981 546914
47547 546914 557440 568360 579607 591057 602568 614114 625710 637088 647624 656737 664354 670814
47535 670814 676351 680734 683346 683667 681863 678916 675805 672411 667522 660169 650653 639973 628682 616799
47521 616799 604512 592243 580070 567720 555260 543259 532135 521834 512295 503704 496030 488743
47509 488743 481424 474383 468347 463638 459958 456831 454077 451796 450051 448670 447514 446917 447514 449305 451088
47494 451088 451350 449697 446998 444159 441276 438082 434622 431113 427537 423794 420037 416556 413445 410567
47480 410567 407758 404940 402156 399467 396650 393187 388968 384914 382266 381162 380511 379476 378379 377852 377846
47465 377846 378051 378702 380140 381923 383142 383535 383637 383980 384705 385923 387801 390252 392995 395929 398937 401450
47449 401450 402839 403384 404236 406165 408821 411469 413991 416820 420212 423949 427564 430586 432669 433765 434182
47434 434182 434433 435108 436712 439300 442228 444770 447159 450593 455870 462357 468780 474737 480908 487914 495630
47419 495630 503795 512684 522738 533862 545645 558211 572344 588624 606774 626049 645973 666473
47407 666473 687515 709031 731065 753543 775813 796845 816099 833916 850806 866620 880709
47396 880709 892711 902679 910501 915575 917296 915587 910791 903210 893006 880521 866461 851608 836383
47383 836383 820743 804529 787824 770972 754360 738262 722781 707798 693141 679040 666329
47372 666329 655822 647491 640582 634624 629932 626895 625197 624085 623150 622536 622560 623470 625424 628396 632161
47357 632161 636589 641730 647385 652881 657706 662142 666773 671465 675319 677581 678117 677043 674397 670304
47343 670304 665019 658691 651402 643427 635041 626052 616065 605280 594480 584158 574175 564382 554864
47330 554864 545288 534800 523201 511703 501833 493869 486979 480483 474250 468046 461412 454374 447751
47317 447751 442425 438613 435880 433584 431256 428914 427072 426133 425810 425436 424841 424463 424553 424759 424729 424733 425399 427009
47299 427009 429276 431649 433633 435021 435997 436908 437826 438434 438430 437847 436905 435763 434548 433382 432180 430652
47283 430652 428779 427141 426441 426743 427417 427882 428173 428780 430069 431927 433918 435668 437153 438619 440367 442684
47267 442684 445905 450260 455550 461243 467026 473114 479808 486933 493965 500641 507248 514311 522102 530383
47253 530383 538511 545924 552691 559413 566405 573196 579108 584143 588886 593648 598155 602018 605030 606914
47239 606914 607381 606683 605632 604697 603394 600960 597356 593237 589224 585653 582813 580764 578870 576089 572025
47224 572025 567411 563353 560297 557885 555615 553394 551513 550264 549597 549177 548846 548904 549786 551544 553928 556956
47208 556956 561042 566442 572906 580069 587813 595975 603983 611325 618277 625680 633905 642423 650532 658150
47194 658150 665602 672869 679456 684930 689220 692283 693804 693482 691466 688234 684095 679092 673448 667778
47180 667778 662602 657796 652814 647400 641876 636743 632323 628834 626529 625487 625458 626107 627381 629476 632579
47165 632579 636839 642467 649577 657896 666845 676051 685628 695938 707215 719518 732785 746752 760966
47152 760966 775160 789588 804672 820211 835193 848585 860211 870660 880442 889458 897218 903254
47140 903254 907248 909124 909223 908175 906273 903160 898450 892590 886705 881481 876576 871270 865408 859394 853518
47125 853518 847686 841844 836308 831507 827497 823868 820145 816255 812591 809622 807478 805982 805051 804869 805518
47110 805518 806623 807631 808467 809736 812156 815897 820500 825339 829996 834301 838200 841680 844729 847217
47096 847217 848848 849351 848747 847303 845118 841830 836876 829979 821307 811287 800498 789631 779138 768773
47082 768773 757816 746014 734090 723008 712885 703051 693136 683676 675460 668594 662432 656242 649708
47069 649708 643002 636700 631598 628201 626247 624952 623831 623125 623275 624258 625731 627662 630332 633629 636799
47054 636799 639310 641754 645414 650844 657236 663346 668788 674141 679946 686033 691875 697195 701924 705819
47040 705819 708661 710861 713334 716456 719531 721812 723776 726700 730970 735588 739607 743357 747687 752609
47026 752609 757510 762370 767834 774114 780678 787231 794229 802042 810205 817973 825217 832307 839474 846736
47012 846736 854210 862056 870227 878568 887001 895376 903456 911417 920027 929822 940301 950418 959845 969227
46998 969227 979229 989793 1000344 1010256 1018966 1026078 1031608 1035844 1038851 1040392 1040554 1040106 1039879 1039895 1039369
46983 1039369 1037566 1034476 1030674 1026716 1022813 1018968 1015304 1012127 1009693 1007994 1006801 1005845 1004942 1004077 1003500
46968 1003500 1003668 1005000 1007640 1011359 1015570 1019665 1023692 1028658 1035694 1044708 1054364 1063608 1072693 1082240
46954 1082240 1091879 1100536 1107826 1114289 1120350 1125866 1130836 1135699 1140482 1144350 1146515 1147192 1147165 1146778 1145870
46939 1145870 1144435 1142695 1140552 1137539 1133505 1128987 1124735 1121087 1117970 1115295 1113080 1111224 1109401 1107373
46925 1107373 1105365 1104022 1103904 1105073 1107120 1109511 1111912 1114380 1117352 1121236 1125868 1130579 1135027 1139732
46911 1139732 1145483 1152383 1159852 1167449 1175255 1183452 1192003 1200834 1209907 1219008 1227835 1236418 1245153 1254297
46897 1254297 1263708 1273066 1281920 1289496 1295063 1298690 1301033 1302079 1300692 1295928 1288366 1279599 1270770 1262189
46883 1262189 1254034 1246615 1239935 1233709 1228035 1223606 1221123 1220793 1222540 1226372 1232332 1240286 1249821 1260299
46869 1260299 1271092 1282009 1293385 1305479 1317896 1329923 1341388 1352661 1363737 1373831 1382148
46858 1382148 1388735 1394264 1399206 1403603 1407489 1411154 1414916 1418888 1423129 1427917 1433697 1440680 1448594 1456957
46844 1456957 1465590 1474691 1484309 1494062 1503622 1513323 1523821 1535130 1546431 1556983 1566831 1576313 1585130
46831 1585130 1592416 1597719 1601543 1604807 1607946 1610654 1612310 1612503 1611247 1608919 1606071 1603224 1600680 1598443
46817 1598443 1596262 1593833 1591096 1588389 1586306 1585305 1585535 1587043 1590059 1594850 1601375 1609237 1618110 1628076
46803 1628076 1639447 1652419 1666999 1683090 1700481 1718825 1737808 1757239 1776806 1795893 1813930
46792 1813930 1830860 1846922 1861977 1875303 1886103 1893944 1898714 1900591 1900215 1898444 1895622 1891281 1884838
46779 1884838 1876380 1866519 1855730 1844146 1831860 1819018 1805723 1792171 1778883 1766474 1755142 1744554
46767 1744554 1734240 1723911 1713431 1702753 1691959 1681206 1670610 1660319 1650646 1641907 1634066 1626681
46755 1626681 1619276 1611692 1604165 1597203 1591393 1587095 1584183 1582155 1580568 1579400 1579076 1580160 1582901 1586987
46741 1586987 1591882 1597464 1604191 1612483 1622141 1632562 1643348 1654415 1665669 1676942 1688202 1699518
46729 1699518 1710836 1722154 1733832 1746208 1758773 1770184 1779477 1787019 1794027 1801278 1808558 1815157
46717 1815157 1820608 1824979 1828670 1831957 1834726 1836770 1838389 1840483 1843873 1848692 1854645 1861614 1869666 1878571
46703 1878571 1887760 1896880 1906014 1915131 1923577 1930434 1935327 1938729 1941454 1943944 1945876 1946212 1943666 1937416
46689 1937416 1927526 1914613 1899096 1880926 1860069 1836988 1812446 1786959 1760614 1733325 1705125
46678 1705125 1676330 1647636 1619867 1593353 1567639 1542104 1516885 1492846 1470585 1449826 1429864
46667 1429864 1410279 1391071 1372405 1354521 1337666 1321831 1306707 1292046 1277903 1264372 1251378
46656 1251378 1239007 1227803 1218443 1211187 1205869 1202219 1199963 1198921 1199377 1202166 1207851 1215926 1225296 1235560
46642 1235560 1247324 1261139 1276619 1292800 1308968 1324846 1340254 1354921 1368531 1380718 1391099
46631 1391099 1399458 1405861 1410524 1413609 1415238 1415589 1414885 1413343 1411254 1409098 1407542 1407247 1408535 1411203 1414808
46616 1414808 1419357 1425586 1434372 1445939 1459827 1475540 1492899 1511802 1531956 1552939 1574265 1595346
46604 1595346 1615636 1634876 1652949 1669365 1683115 1693230 1699368 1701793 1700887 1696855 1689813 1679964 1667618
46591 1667618 1653003 1636149 1617150 1596539 1575189 1553664 1531965 1510129 1488798 1468802 1450325
46580 1450325 1432958 1416385 1400565 1385239 1369860 1354163 1338399 1322959 1308151 1294312 1281588
46569 1281588 1269476 1257170 1244513 1232049 1219991 1207901 1195708 1184270 1174227 1164966 1155563 1146353
46557 1146353 1138595 1132730 1127864 1123086 1118489 1114631 1111624 1109111 1106741 1104373 1102158 1100676 1100633 1102123
46543 1102123 1104389 1106622 1108814 1111592 1115362 1119929 1124947 1130400 1136520 1143373 1150796 1158784 1167728 1177931
46529 1177931 1188871 1199232 1208007 1215517 1223201 1232402 1243468 1255844 1268713 1281561 1294428 1307781
46517 1307781 1322058 1337299 1353296 1370028 1387718 1406476 1426090 1446272 1466905 1487964 1509393
46506 1509393 1531233 1553702 1576915 1600586 1624140 1647083 1669034 1689452 1707675 1723468 1737349
46495 1737349 1750076 1761852 1772297 1781099 1788245 1793527 1796324 1796358 1794378 1791599 1788586 1785133 1781118 1776860
46481 1776860 1772534 1767840 1762498 1756585 1750108 1742724 1734261 1725116 1715706 1705809 1694898 1682897 1670137
46468 1670137 1656724 1642393 1626849 1609836 1591032 1570283 1547908 1524358 1499738 1474084 1447965
46457 1447965 1422215 1397096 1372265 1347570 1323368 1300026 1277753 1257017 1238487 1222213 1207405
46446 1207405 1193385 1180414 1169261 1160445 1154252 1151046 1150979 1153620 1158380 1165108 1173765 1183684 1193726
46433 1193726 1203281 1212736 1222842 1233908 1245610 1257248 1268151 1278093 1287385 1296313 1304509 1311168 1315928
46420 1315928 1319207 1321676 1323702 1325403 1326807 1327737 1327852 1327134 1326168 1325665 1325869 1326732 1328482 1331610 1336331 1342487
46404 1342487 1350114 1359820 1372349 1387878 1405881 1425596 1446637 1469297 1494332 1522238 1552699 1584915
46392 1584915 1618551 1653993 1691446 1730104 1768707 1806754 1844689 1882795 1920331 1955940 1988559
46381 1988559 2017733 2043324 2065250 2083444 2097805 2108252 2114849 2117730 2116759 2111498 2101760 2088047
46369 2088047 2071220 2051849 2030154 2006429 1981257 1955345 1929511 1904734 1881808 1860813 1841236
46358 1841236 1822823 1806114 1792008 1780981 1772924 1767603 1765094 1765853 1770494 1779388 1792412 1809140 1829396
46345 1829396 1853428 1881437 1913119 1947998 1986168 2028308 2074768 2124804 2176985 2230292 2284575
46334 2284575 2339821 2395195 2449034 2499725 2546413 2588801 2626500 2658771 2684752 2703764 2715380
46323 2715380 2719384 2715808 2704991 2687523 2663999 2634728 2599787 2559554 2515161 2468130 2419461 2369374
46311 2369374 2318168 2266997 2217427 2170351 2125749 2083534 2044234 2008744 1977706 1951221 1928972
46300 1928972 1910466 1895412 1884010 1876701 1873565 1874172 1878145 1885641 1897110 1912672 1931884 1953987
46288 1953987 1978338 2004752 2033460 2064519 2097240 2130558 2164099 2198478 2234209 2270663 2306523
46277 2306523 2341040 2374282 2406255 2436382 2464037 2489117 2511824 2532135 2549668 2563832 2574014
46266 2574014 2579893 2581827 2580650 2576791 2569803 2559035 2544629 2527522 2508623 2488355 2466991 2445044
46254 2445044 2423150 2401818 2381409 2362212 2344451 2328402 2314519 2303221 2294446 2287624 2282211 2278070
46242 2278070 2275314 2274092 2274630 2277115 2281109 2285421 2289053 2292157 2295633 2299833 2304169 2307969 2311013 2313004
46228 2313004 2313103 2310560 2305575 2299082 2291772 2283596 2274084 2262816 2249733 2235330 2220473 2205721 2190838
46215 2190838 2175264 2158998 2142662 2126721 2111005 2095129 2079068 2063163 2047844 2033520 2020543
46204 2020543 2008997 1998610 1989023 1980159 1972331 1966049 1961791 1959778 1959824 1961421 1963985 1967086 1970605 1974960
$$ [...]
##END NTUPLES=NMR SPECTRUM
##END=
