
##TITLE=AC1068_TOPL01_6608529_kxjj5BuZwT
##JCAMPDX= 6.0         $$ Bruker NMR JCAMP-DX V2.0
##DATA TYPE= NMR SPECTRUM
##DATA CLASS= NTUPLES
##ORIGIN= BRUKER
##OWNER= Administrator
$$ 1.72 TOPSPIN		Version 2.1
$$ 2012-08-01 14:05:38.796 -0500  Administrator@TOPSPIN
$$ Compression mode = diff/dup
##.OBSERVE FREQUENCY= 400.02188249412
##.OBSERVE NUCLEUS= ^1H
##.ACQUISITION MODE= SIMULTANEOUS (DQD)
##.ACQUISITION SCHEME= undefined
##.AVERAGES= 8
##.DIGITISER RES= 22
##SPECTROMETER/DATA SYSTEM= spect
##.PULSE SEQUENCE= zg30
##.SOLVENT NAME= COFFEE_meoh
##.SHIFT REFERENCE= INTERNAL, COFFEE_meoh, 1, 14.98509
##AUDIT TRAIL= $$ (NUMBER, WHEN, WHO, WHERE, PROCESS, VERSION, WHAT)
$$ ##TITLE= Audit trail, TOPSPIN		Version 2.1
$$ ##JCAMPDX= 5.01
$$ ##ORIGIN= Bruker BioSpin GmbH
$$ ##OWNER= Administrator
$$ $$ C:\Bruker\TOPSPIN/data/COFFEE/nmr/AC1068_TOPL01_6608529_kxjj5BuZwT/10/pdata/1/auditp.txt
$$ ##AUDIT TRAIL=  $$ (NUMBER, WHEN, WHO, WHERE, PROCESS, VERSION, WHAT)
(   1,<2012-08-01 14:05:14.046 -0500>,<Administrator>,<TOPSPIN>,<go>,<TOPSPIN 2.1>,
      <created by zg
	started at 2012-08-01 14:04:05.359 -0500,
	POWCHK enabled, PULCHK disabled,
       configuration hash MD5:
       6B 1B 68 BB D9 2E 58 E2 7F 35 AD 54 07 DF 0E 41
       data hash MD5: 64K
       49 05 91 AE 87 91 DE 9D 37 05 7A 03 4C 5D 1B 89>)
(   2,<2012-08-01 14:05:26.515 -0500>,<Administrator>,<TOPSPIN>,<proc1d>,<TOPSPIN 2.1>,
      <Start of raw data processing
       efp LB = 0 FT_mod = 6 PKNL = 1 PHC0 = 0 PHC1 = 0 SI = 32K 
       data hash MD5: 32K
       FF 08 37 9C 3C 47 1C A7 56 31 D3 90 4C 3C 2C 59>)
(   3,<2012-08-01 14:05:27.390 -0500>,<Administrator>,<TOPSPIN>,<proc1d>,<TOPSPIN 2.1>,
      <pk PHC0 = 177.2424 PHC1 = 0 
       data hash MD5: 32K
       14 1D AD B9 67 76 B6 1B F7 CE 5D F2 C5 B3 30 71>)
(   4,<2012-08-01 14:05:27.734 -0500>,<Administrator>,<TOPSPIN>,<proc1d>,<TOPSPIN 2.1>,
      <abs ABSG = 1 
       data hash MD5: 32K
       20 72 F3 D2 AD 4B 9E 9B 6C 65 2C 8E E6 32 89 06>)
(   5,<2012-08-01 14:05:28.015 -0500>,<Administrator>,<TOPSPIN>,<proc1d>,<TOPSPIN 2.1>,
      <abs ABSG = 2 
       data hash MD5: 32K
       67 47 42 55 8A 18 6B 80 61 94 AA E6 15 DC D8 86>)
(   6,<2012-08-01 14:05:28.281 -0500>,<Administrator>,<TOPSPIN>,<proc1d>,<TOPSPIN 2.1>,
      <abs ABSG = 3 
       data hash MD5: 32K
       39 81 A8 3D B1 B1 7D A6 59 B3 19 AE 34 A4 8C 4B>)
(   7,<2012-08-01 14:05:28.531 -0500>,<Administrator>,<TOPSPIN>,<proc1d>,<TOPSPIN 2.1>,
      <abs ABSG = 4 
       data hash MD5: 32K
       BC 53 95 68 2E ED 13 EB 86 29 FB 71 13 A2 17 39>)
(   8,<2012-08-01 14:05:28.828 -0500>,<Administrator>,<TOPSPIN>,<proc1d>,<TOPSPIN 2.1>,
      <abs ABSG = 5 
       data hash MD5: 32K
       5A AB 05 54 40 EB CB DD E0 9F B3 59 3E 31 5D 63>)
$$ ##END=
$$ 
$$ $$ hash MD5
$$ $$ 4A F4 22 D6 86 75 E4 D9 F1 F1 4A 26 70 56 D6 6C
##$RELAX= 
##$RELAX= 
##$RELAX= 
##$RELAX= 
##$RELAX= 
##$RELAX= 
##$RELAX= 
$$ Bruker specific parameters
$$ --------------------------
$$ [...]
##$TP= (0..7)
150 150 150 150 150 150 150 150
##$TP07= 0
##$TPNAME0= <>
##$TPNAME1= <>
##$TPNAME2= <>
##$TPNAME3= <>
##$TPNAME4= <>
##$TPNAME5= <>
##$TPNAME6= <>
##$TPNAME7= <>
##$TPOAL= (0..7)
0.5 0.5 0.5 0.5 0.5 0.5 0.5 0.5
##$TPOFFS= (0..7)
0 0 0 0 0 0 0 0
##$TUNHIN= 0
##$TUNHOUT= 0
##$TUNXOUT= 0
##$USERA1= <user>
##$USERA2= <user>
##$USERA3= <user>
##$USERA4= <user>
##$USERA5= <user>
##$V9= 5
##$VALIST= <valist>
##$VCLIST= <CCCCCCCCCCCCCCC>
##$VD= 0
##$VDLIST= <DDDDDDDDDDDDDDD>
##$VPLIST= <PPPPPPPPPPPPPPP>
##$VTLIST= <TTTTTTTTTTTTTTT>
##$WBST= 1024
##$WBSW= 4
##$XGAIN= (0..3)
0 0 0 0
##$XL= 0
##$YL= 0
##$YMAX_a= 484084
##$YMIN_a= -629540
##$ZGOPTNS= <>
##$ZL1= 120
##$ZL2= 120
##$ZL3= 120
##$ZL4= 120
##$ABSF1= 14.98509
##$ABSF2= -5.573092
##$ABSG= 5
##$ABSL= 3
##$ALPHA= 0
##$AQORDER= 0
##$ASSFAC= 0
##$ASSFACI= 0
##$ASSFACX= 0
##$ASSWID= 0
##$AUNMP= <proc_prof1d_extract_pilot.lims>
##$AXLEFT= 0
##$AXNAME= <>
##$AXNUC= <1H>
##$AXRIGHT= 0
##$AXTYPE= 0
##$AXUNIT= <>
##$AZFE= 0.1
##$AZFW= 0.1
##$BCFW= 0
##$BC_mod= 0
##$BYTORDP= 0
##$COROFFS= 0
##$CY= 15
##$DATMOD= 1
##$DC= 0
##$DFILT= <>
##$DTYPP= 0
##$F1P= 0
##$F2P= 0
##$FCOR= 0.5
##$FTSIZE= 32768
##$FT_mod= 6
##$GAMMA= 0
##$GB= 0
##$INTBC= 1
##$INTSCL= 1
##$ISEN= 128
##$LB= 0
##$LEV0= 0
##$LPBIN= 0
##$MAXI= 10000
##$MC2= 0
##$MEAN= 0
##$ME_mod= 0
##$MI= 0
##$NCOEF= 0
##$NC_proc= -8
##$NLEV= 6
##$NOISF1= 0
##$NOISF2= 0
##$NSP= 0
##$NTH_PI= 0
##$NZP= 0
##$OFFSET= 14.98509
##$PC= 1
##$PHC0= 177.2424
##$PHC1= 0
##$PH_mod= 1
##$PKNL= yes
##$PPARMOD= 0
##$PPDIAG= 0
##$PPIPTYP= 0
##$PPMPNUM= 2147483647
##$PPRESOL= 1
##$PSCAL= 4
##$PSIGN= 0
##$PYNMP= <proc.py>
##$REVERSE= no
##$SF= 400.02
##$SI= 32768
##$SIGF1= 0
##$SIGF2= 0
##$SINO= 400
##$SIOLD= 32768
##$SPECTYP= <>
##$SREGLST= <1H.CDCl3>
##$SSB= 0
##$STSI= 32768
##$STSR= 0
##$SW_p= 8223.68421052631
##$SYMM= 0
##$S_DEV= 0
##$TDeff= 65536
##$TDoff= 0
##$TI= <>
##$TILT= no
##$TM1= 0
##$TM2= 0
##$TOPLEV= 0
##$USERP1= <user>
##$USERP2= <user>
##$USERP3= <user>
##$USERP4= <user>
##$USERP5= <user>
##$WDW= 1
##$XDIM= 32768
##$YMAX_p= 463433940
##$YMIN_p= -721507
##$CURPLOT= <Network HP LaserJet P1505>
##$CURPRIN= <$Network HP LaserJet P1505>
##$DFORMAT= <normdp>
##$LAYOUT= <+/1D_H.xwp>
##$LFORMAT= <normlp>
##$PFORMAT= <normpl>
##$SURQMSG= 1
$$ End of Bruker specific parameters
$$ ---------------------------------
##NTUPLES= NMR SPECTRUM
##VAR_NAME=  FREQUENCY,     SPECTRUM/REAL,   SPECTRUM/IMAG
##SYMBOL=    X,             R,               I
##VAR_TYPE=  INDEPENDENT,   DEPENDENT,       DEPENDENT
##VAR_FORM=  AFFN,          ASDF,            ASDF
##VAR_DIM=   32768,         32768,           32768
##UNITS=     HZ,            ARBITRARY UNITS, ARBITRARY UNITS
##FACTOR=    0.250966925370066, 1,           1
##FIRST=     8223.43324360094, 8159,         -25575
##LAST=      0,             192832,          226290
##MIN=       0,             -721507,         0
##MAX=       8223.43324360094, 463433940,    0
$$ Real data points
##PAGE= N=1
##DATA TABLE= (X++(R..R)), XYDATA
$$ [...]
23775 -52235 277283 167587 37147 74407 333975 -90671 11153 156431 -168625 26481 -177711
23763 50155 -91960 156319 -284407 -124060 68453 -26877 37617 -129896 -119782 18596 41137
23752 41137 -161228 -170852 155843 -34356 -261507 -28052 28771 297942 -179141 -91883 -55861
23741 -55861 41337 -89165 -72896 155986 296497 -72310 -302451 -208301 -254228 39541 -116182
23729 -94855 -169439 -96217 69939 99427 174832 57396 -167635 -149610 41759 38908 -34220 -118477
23717 -118477 247118 200257 248218 75446 -151775 103564 -190190 58887 130409 17447 -200921
23705 144742 -167041 -179895 -146511 57206 211830 -133716 214210 61345 189024 84618
23694 186392 62996 -132057 36895 -123334 -59378 144508 -25169 -57886 246770 60589 364002
23683 364002 111896 -241218 165068 -293789 201508 83696 -98745 45293 -111427 -382702
23673 -382702 -318229 177905 -106641 524650 -418125 172764 47800 235574 133731 339304
23663 339304 79306 105348 -1398 126968 115718 -92037 -330383 -195478 -117115 -28993 -15118
23652 -15118 189211 38567 104549 -77677 14574 48745 31530 -174246 -19437 106841 83139
23641 83139 1824 91204 -193225 -15588 -53252 -216788 -226182 51488 -258200 -188008 152156
23629 159626 -129690 56558 -214434 347265 96653 -328580 152113 -46459 60601 -93772
23618 67724 -144901 109212 182994 171556 271228 100743 -85318 48052 -198424 -35082 -238477
23607 -238477 -110105 281306 -127409 -333799 -132041 136318 18848 48180 -79103 231545
23596 413510 108517 -126553 142315 95080 -40559 27720 271397 300037 221369 -25331 62177
23584 478171 -34918 38296 513390 92180 -64663 10832 111412 12128 152340 -228574 -121611
23573 -121611 -57769 166427 -157371 -175583 -70924 -196404 -32309 119966 -64798 127670
23562 -194997 62729 -211200 -109727 -87268 -41896 -226222 -226854 28997 -84214 -8568 -317947
23551 -317947 -251159 -39494 35167 -1342 348516 -9553 -168006 68595 -91220 102116 -148257
23539 159642 -86219 119146 -2337 226392 216064 -85334 107071 -139520 63934 105490 42520
23527 -68801 50388 -136348 -159957 32934 -390316 -39318 113530 78356 -73032 166731 -319223
23515 61485 -94003 -117771 116640 -26261 -114439 -299629 136297 -138509 -58704 -47403 78925
23503 51064 -289545 -40151 -85089 72106 -342262 -233340 204962 -65706 -292795 5632 80565
23492 80565 227018 -74648 -44872 135506 70243 -19755 -3611 104451 -199758 -52077 -48930
23481 -48930 -136339 134106 -165732 75366 52627 -246312 153554 119052 42047 240902 -49546
23469 -284547 -164529 -69183 35362 38566 77972 64564 144543 -364374 120724 96545 -276388
23457 167286 60684 -106098 -99384 -155819 -302209 84746 -270512 -303768 19323 67404 -107495
23445 -39492 -280872 -162268 128341 -183203 119431 30916 -211418 272701 253489 -277866
23434 -378639 -74015 -47977 48889 125291 -51030 69442 -162955 -63331 -318412 -111157 170883
23422 -207015 238420 -235970 27704 73618 175978 146791 46614 227159 61671 -127582
23411 -401540 93246 55999 -54839 15146 -188401 -28509 209800 66798 55620 -178059 32126
23399 95986 11716 -93010 44704 -179593 185589 152538 -68192 -150566 14999 100622 -51584
23387 18153 -215641 -3751 57632 -63892 131425 -132962 -225022 -179385 -190318 85816 131832
23376 131832 -231886 -119879 594954 168750 28658 16178 234581 -127848 -20741 -350999
23366 -350999 -345033 163374 -263706 -50323 -186949 -30622 72274 -31132 -232658 -224600 239558
23354 122494 160364 -156100 -84745 -145898 -2629 107765 86990 -106554 -34228 104062 350609
23343 350609 71998 88103 43986 -173207 -157656 53678 -260107 -513548 2596 -134674 -256883
23332 -256883 -349305 -42022 27396 -138136 36059 181824 -116525 -39653 -27885 -227472 -254071
23321 -254071 31408 -260511 -176776 -121133 148474 -65869 72808 -2914 -66796 -117891 262864
23309 -152268 -241155 247299 -275098 -166710 -296882 48648 42170 126373 -245919 -275424 -6975
23297 -284596 -68379 -64557 -235682 366007 -100805 255060 112763 60457 -140419 113165
23286 -236407 147495 -774 48159 88384 9085 72845 150270 -163556 -74139 -153476 -248552 -238126
23274 -238126 -214792 24264 231053 147382 387247 -56264 -130110 9230 -162929 -147516 129803
23262 118323 56261 69540 141819 260749 -63392 73215 -193003 -66914 215469 -128445 141296
23250 28418 -280074 -244484 -3686 -124936 31439 -121206 -81061 14898 191696 15411 191619
23239 191619 70985 -232364 -253498 -73582 -209421 -6798 -208599 -51395 -263849 -41587 20543
23227 53465 -84041 -286569 3828 -126061 -284142 -389208 -5182 -141145 -235408 -150806 -95398
23216 -95398 24396 -31462 -123284 176014 3371 28542 203127 -9289 -154921 -152930 55689 -179439
23203 -138835 186010 -236109 -231176 -14510 -238874 -3667 516038 -23027 -156385 170177 134956
23192 134956 -160704 320 -171503 -185425 170473 -249497 -187568 102536 130569 -116525 171870
23180 -76217 -199387 272645 -371680 12230 291133 -8828 89517 67138 -54056 123186 230570
23169 230570 46673 70420 179494 -231229 1143 -111055 9227 -131022 134178 -294296 -68222
23157 29401 -41128 -35277 -123932 83619 -317017 190384 173600 -108567 97373 -305951 -6109
23145 -301956 -54193 -166374 183889 -245878 -273866 254627 -92412 156137 -53168 -39429
23135 -39429 -37155 -251306 118569 309716 -194902 161264 -181250 327352 47808 12707
23124 -12143 64531 20047 167927 91888 -34176 123273 32830 -9016 -82437 -243610 -27894
23112 -43472 -136508 -60787 127039 -116182 156250 -65792 86121 316513 -32932 128965 263338
23101 263338 -198407 245348 -283848 99549 -191929 31943 285444 169970 41033 109564
23091 109564 81844 -87551 248249 243226 -83680 -390816 42562 227190 84781 -57073 -54740
23080 -54740 10495 -50506 -60083 -252395 -314626 -2700 -64262 147631 -253670 -16210 -100266
23069 -100266 257455 187516 -91166 67876 -38530 84637 -26329 154079 -186473 459907 -192241
23057 129895 -205162 -136270 187490 -357932 96723 188108 86829 -133777 30781 -21492 209559
23045 28750 354344 117597 6218 -94494 186055 117647 -180471 -28864 -105853 171381 -78779
23033 61712 254865 134246 -227102 18230 -95954 466988 137001 -139947 208517 -319060
23022 -131308 259716 1347 -155136 363495 29778 -77020 -364309 -215153 27221 187979
23012 187979 321482 84750 -238617 81595 175958 -81089 -198552 125933 15464 -198654
23001 -81520 -2789 -4069 130653 -86513 115529 -248469 105164 98160 -53422 9136 -269990
22989 -142685 -111832 79077 14966 68267 -131907 -194526 6972 -121079 216342 14653 108552
22978 108552 -41648 203149 -54674 -15849 64182 -90734 166227 -71100 -162812 161420 273649
22967 273649 112377 -134551 -75645 152723 -304230 98040 122746 -334158 18430 -177766
22956 -307720 -197173 172747 48384 220801 -48498 -151527 -246479 -114608 163776 -19127
22945 126618 -16650 -252507 -378366 -195164 11462 -49610 -187923 33288 48740 -5531 -50426
22934 -50426 109747 -146096 -86935 -19213 -12407 -253955 -156862 -180055 4054 84092 -211748
22922 -104663 -362189 -9887 10825 -93062 232370 -116041 -353867 -213288 -105335 -390904
22912 -390904 -50881 53254 -114176 -174479 -389270 291344 -238375 -83392 -10899 472751
22901 -127265 393290 -158820 151607 159114 -234623 217822 -54908 102565 281485 -55752
22890 53241 206247 91228 -67006 17705 -324579 190673 99206 211149 -41180 -123197 389233
22878 -244216 37919 -265640 -99741 -166131 -230365 -161066 83342 11806 71805 157355 -211136
22866 -110482 -238146 59349 24284 300450 -62525 208554 -78513 146546 232911 -347600
22855 194880 -107240 50726 108859 30141 85403 30203 145592 316876 283815 64689 -63652
22843 159155 -35787 165359 130952 56800 196341 43174 76280 -60415 -332047 3316 -141130
22831 -87913 -159946 -69392 -246311 -53666 -240460 41104 155341 -8062 -3255 24246 99880
22820 99880 -72345 -91634 -154382 194197 58018 60027 -120570 -115953 -121293 30506 34013 127426
22808 127426 5997 -135515 100918 -203540 16834 -202309 187270 -544438 -91565 -27445
22797 278244 196655 -1930 -75722 167862 61794 117478 -167592 260826 -347197 -84807 -183076
22786 -183076 -203846 -22076 65738 -209798 -132871 -71726 -23483 -320778 -127188 -52127 -470667
22775 -470667 167442 -29024 -250021 -173466 -207454 -261507 240074 -63248 -305750 -346276 -37838
22763 -191516 -177754 -144464 -124295 -652683 271667 -271243 38831 -72196 -152124 -53127 -352895
22752 -352895 128995 -192957 -112411 -153856 -266250 42677 78227 185892 -26629 -187714
22742 -187714 -101889 -174020 -106607 172708 230937 -16398 374955 -36268 165876 -62767 -178611
22731 -178611 133631 3078 -348112 -111003 -32686 -155943 -294496 -199916 -309352 -38381
22720 44161 -12500 38900 -125836 -45011 25809 25961 66858 -175494 310333 38143 58924
22709 58924 145027 -52550 -71852 -301574 -289075 -119135 353265 -193620 -139748 -54680 149506
22697 -31895 137155 -195508 88352 -161968 65687 49761 -23638 -242968 181781 -46983 -337375
22686 -337375 7450 -276390 114372 106214 127398 -331085 -182732 40101 -45618 -98152 154458
22674 32286 17626 -117132 -49616 -291808 -78253 124098 238696 38236 -267840 90474 -38992
22662 -90964 -332478 14635 -94215 -27905 -100229 -277710 -6679 -21577 -56630 -110512 -213353
22651 -213353 -57919 140490 79935 33959 262582 224356 -72933 -76252 -207157 -293581 -103621
22639 -123544 7992 -118734 -56504 127550 71151 -24294 -105899 55986 -81506 20333 102178
22628 102178 141132 -168281 -191827 -242909 52106 -349162 -5052 145470 140281 153737 53804
22616 -7380 -189956 -150887 -39808 -241722 -95929 71788 56563 90896 -124991 -143131 -6317
22604 -150336 79493 46155 22731 369985 63830 255273 112327 -89032 -308686 10813 119206
22593 119206 17137 -64833 83059 64356 50680 36493 -216754 116808 -234931 -218200 -24741
22581 102215 -272026 -197185 81033 54753 65891 -178155 98189 159768 133696 -70179 180634
22569 20486 -31967 -21610 -307750 -273080 93647 -144245 228587 -164444 16568 -351220 85058
22557 -152603 118692 -118235 -262943 73281 -137038 3312 -104632 58187 22627 -59011 -52040
22546 -52040 37836 -50105 -362061 212009 291551 -3556 176288 -310207 72166 -225983 -57488
22534 -50912 -15697 347740 -148268 170940 -366384 -223041 102064 -50814 168496 74928
22523 -4731 152020 33140 -84908 5573 267245 156557 -1914 -60504 -135561 7403 -23145 112225
22510 202038 104766 120966 -40394 105671 78232 -155994 -51998 479336 -47780 314684 -248173
22498 4310 118592 -145065 405112 -81518 -88006 -227151 -129035 50666 -23638 -276907 38733
22486 84772 -250462 -141205 -436715 -134720 10700 27587 -444094 -335420 -108105 -276749
22476 -276749 -164897 -103393 -147188 -247124 -116246 -244108 123457 -149034 -46141 18755
22465 -35908 -7462 135024 68922 136474 -235007 -188483 -121481 56007 298392 28460 -258502
22453 -151270 18545 141825 40952 50164 39082 315248 -153520 -168204 -310548 -23259 144427
22441 -232242 -5576 106184 -62162 83359 50610 104171 259488 -166054 43588 -78833 -27043
22429 8810 84040 -265626 -51475 -75207 -80828 -73552 -223491 -6082 110235 -180807 -210011 -202981
22417 -202981 -225120 -131131 -11295 -242614 18876 67731 -310127 -30507 -45914 -142668 -61075
22405 38286 154632 137246 -134845 -339013 11300 -326159 -289293 78505 83586 238061 -306501
22393 -270420 -112594 -415053 -444124 -60626 -100678 43142 60648 256209 261478 -22078 -298989
22382 -298989 93888 -82118 -50311 -70121 84664 361006 54716 154875 -8050 -203407 -41328
22370 2938 -247374 -78000 -132078 -122436 363345 37321 -93215 -175530 6417 174834 -213263
22358 -106776 65861 -27489 81929 23311 -47446 -161018 18296 -141889 -116156 104586 -289
22346 98782 108799 -313259 209457 102181 82210 -51514 -368786 -326840 -271040 307345 -251600
22334 -66220 -231141 -84562 -73578 -230036 -34600 -213276 71904 -44177 -427061 -247096 16939
22322 -90880 175067 -67457 -16926 -10194 -114609 42724 29867 47320 81800 -247791 165552
22310 -35146 -46007 -26826 292101 -77892 557269 -147293 252522 -42843 69073 66157 -177359
22298 -235961 -76613 -298564 449223 -118699 -365386 -167756 182429 -96004 32893 -73590
22287 -52415 191257 248409 134593 -93606 -316506 300411 47902 112934 -150925 77965 71629
22276 71629 89516 171849 70555 258728 -214689 -200730 -301006 4160 -197133 26233 -109915
22264 -219674 -29652 60850 -101925 24284 410882 298533 55253 50918 -32386 -296351 127813
22252 -64807 219416 -57360 -420719 -96791 -72541 -42812 -247643 -239818 -104717 175092 -55383
22240 10490 -52705 -59366 -143656 75239 -119270 117537 1574 13051 -13903 240066 -140686
22228 -199612 -18972 -121298 302482 -109502 -124774 -44751 79710 -228144 -161924 -74452 -197213
22217 -197213 -24590 -176323 45222 86502 -32920 -8442 -261111 58989 -214248 -308642 -16631
22205 17669 -114278 -64107 -8202 136505 111051 166308 67278 -62461 -72952 -82391 14420 -300213
22192 -292257 19609 -29028 -139211 258656 115400 322599 -44094 140039 -120389 -186755
22182 -186755 358101 110536 -54431 1466 -232323 124715 -204868 -27333 -48025 -137674 169369
22170 -53316 -41538 95061 -214854 -33755 -114888 20680 6800 -74435 -66497 -218823 -227749 -509267
22158 -509267 9240 118271 -43498 84981 -96479 156910 42685 203048 -135819 -40113 -214216
22147 -214216 -191632 12702 -99901 223363 -180711 -183635 14078 -49230 305351 -369131 9126
22135 190562 -172342 -134651 -22388 113471 -62104 -208001 233761 147309 -213024 63856
22124 -13520 31686 15620 -147093 166155 159806 131332 39495 -67049 15398 325840 18916
22112 45791 -321606 -98516 -3252 75316 -14975 -214641 112878 -182519 -273899 -142689 -120224
22101 -120224 -139480 -365503 -250183 167003 -59114 -423660 -93893 -339565 -89701 -96783 -69172
22090 -69172 86376 36143 -93269 231775 -370491 102035 -221228 6057 -387293 -70138 243382
22078 -265403 -400413 -189591 130435 -60461 27356 363672 -143014 177436 240044 162278
22068 162278 -428256 62974 -265639 -243916 271657 8571 131134 99543 -317068 63474 -7335
22056 -97769 144082 -21215 -70533 5367 122637 90777 -81860 -134403 -188204 -191261 -92963 29411
22043 -155889 11539 -164898 230870 -85713 -17438 -161307 -141800 121821 -424455 73997
22032 118163 -280300 72107 -124286 7212 -263381 -41513 -2306 -326 -224336 -6799 -28520 168174
22019 -57776 -215841 225916 -68946 -41349 -7308 -197216 122225 -244751 21982 -209710 232832
22007 -160095 46635 311716 -21010 210917 -85055 -55553 128067 5910 137382 -76697 -304197
21996 -304197 280915 -64341 144464 -247534 -107844 -143299 21067 -194867 -178326 58977
21985 248120 -118783 41307 -169623 1284 -226152 75527 183025 139524 -399229 -9246 -145631
21974 -145631 -403243 183622 -303574 -24869 -246231 -18863 -168574 -235780 -253088 269390
21963 -65516 -153902 144681 34319 217216 -240368 -103394 -4890 -242901 -227383 -103436 -21974
21951 -123777 -160407 17594 -15417 41205 -481018 242768 -209455 210948 286207 -268859
21940 137762 162094 -162255 71742 -86587 -258919 141897 337080 -84609 18240 -221639
21929 -401459 -68264 -38096 -261054 -243289 -204052 -115613 -25440 56075 -24007 -24176 62861 -139321
21916 -498763 -2626 -299285 -2048 36337 -105762 -79015 -372089 15493 -188664 -218601 -82830
21904 43650 28338 76677 -107017 143280 -101934 -95047 -363343 46845 -115977 123566 -418699
21892 17721 -185194 1005 -342771 61994 190419 -216660 -116747 50316 -55849 -116487 -305054
21881 -305054 62136 -163707 -204554 558 196471 -314917 -219048 44740 253292 -20927 -125748
21870 -125748 -84644 50795 -214786 -21686 -43077 -165560 32470 250220 198434 51684 -240164
21858 -203509 331111 -63389 254879 51280 -119159 -93768 123437 -138848 -973 -80948 -241084
21847 -241084 -75362 291798 217764 -239594 -37260 -85421 -269165 72133 -99031 -104719 269000
21835 -287418 -156531 70025 51704 -12062 -144079 9756 105641 -99997 16854 -67603 -104488
21824 -104488 403279 -189321 142202 -184582 60520 -10742 29210 -175990 -565188 -115916
21813 -173942 -95924 122121 -30061 -4923 252705 -120260 -147250 84374 -124157 -120493 70423
21801 -97327 178153 -236153 -202569 -249715 -178884 -53498 -169307 -475389 403 29384 -3720
21789 282669 -98691 305788 -3024 189476 -196140 316212 289608 173101 -80159 93218 115084
21778 115084 86491 128536 -219946 -347322 -142558 -8888 278672 -194466 150182 106738
21768 106738 -7742 -27334 173771 -48267 -38798 98742 -100577 123749 123169 272834 61312
21756 -167106 -299 -16763 -271494 17776 32775 115808 -26874 -258 48705 -90450 1940 -83601
21743 -187971 -223969 -36377 -278747 27659 -108109 280780 109634 -63728 -23245 -82257 76540
21731 -106225 296230 34002 299272 94680 52742 183963 78504 161525 -46365 -111950 -209867
21720 -209867 4451 -62205 -228463 -39672 -167236 -2090 -204750 -62338 -49446 -293253 -403668
21709 -403668 -47783 -99198 -39539 -241751 278955 274141 106156 -149425 154426 94746 31611
21697 271779 94927 31029 -272224 29184 50028 -213011 -157272 43054 -224976 -126289 -9414
21685 174384 -349434 -362852 -225855 -119897 87190 66306 -224173 1500 145013 -249543
21674 7489 -230416 -159073 124376 -159731 -208824 -322465 -130145 -169082 -99505 -55482 -46190
21663 -46190 -86022 -110655 -118032 -398388 -320682 -241102 -281087 -162108 -232538 -76280 127189
21651 320656 -183941 232868 -244358 36858 -89633 -200055 30882 -144765 -229354 48283
21640 -74315 -17870 -278744 193685 115200 -331836 -28767 96513 -131284 -23256 -257995 12529
21628 48245 -146846 107431 -194185 33576 154354 -75339 -25006 -220683 -340761 -87299
21617 -486 -371945 -30720 3985 -156959 -124939 127254 -215053 55108 -77725 94594 85266 -273651
21604 -119028 510724 234707 117619 100164 -398515 -41685 -93606 1323 -21285 -30747 -116168
21593 -116168 -253744 42514 -23273 209544 87861 330444 -181376 2621 -90508 200053 -404172
21581 149781 -332374 -314894 61110 -178520 -28181 -329368 -84246 79760 -138641 165476
21570 -233139 157765 -164815 -68072 178418 160000 -3162 -82266 251737 -117051 3182 -61365
21558 118587 -5816 92146 -361995 -95082 83209 -271682 -159001 -133859 56220 -239925 334556
21546 302536 -125625 91480 -30166 -98319 43851 -195890 67661 -281159 -235501 95791 -336845
21534 -242984 -164328 181877 -188947 74608 -73388 223065 -264939 203523 -134045 42659
21523 -445239 -41786 -135066 -86119 -86634 -5327 -145890 -197274 32300 -4217 124734 -91562 -42819
21510 -219974 128880 233849 81032 51985 -96386 -25560 -7828 -186624 -183774 107269 -109910
21498 -208515 -182546 -206031 130195 161034 -23733 46618 -4955 155814 -116463 -175098 3868
21486 -213571 -131532 -201403 -200797 -181129 15713 -76969 216453 -236899 -109778 -248051 240277
21474 -232718 275433 -302938 -39474 4061 3436 -234835 99285 -11706 -154628 -349111 76117
21462 -250823 -67704 -350820 -60606 -421828 -156541 -106360 -110647 -17638 -51598 -91386 -153219
21451 -153219 -120948 -33419 -100420 52816 -285663 -421972 17894 -26634 -189879 -162078 106137
21439 233168 106407 280028 536578 382313 725274 598716 50457 172247 -354656 312044
21428 83322 29456 165901 -161430 58739 -149173 -303597 14688 174757 136833 -351647
21417 -92761 192827 -296859 107228 269386 144096 -272376 -237336 78845 235196 58557
21406 -152915 120540 -82286 -35365 45294 -188200 45845 98747 65966 -13162 171414 102467
21395 102467 -123540 -88934 -349171 -16747 19292 -189816 -364067 -320081 -323468 273087 185545
21384 185545 -140197 -8705 121393 -266299 -10733 -75498 116099 -46485 -231557 -117235
21374 -117235 -117007 194097 -55808 -338796 -162016 -47786 -171922 316865 -191216 -36743 -71247
21363 -71247 -97731 -128931 -52041 -214831 -73440 -134113 -296133 -157190 -117714 -302133 -122895
21351 -163117 -107700 -55137 -326193 -172868 70554 90257 -141610 -43491 -47957 117758 -153567
21339 -43402 152266 14158 -260069 -25428 156591 123046 -50162 97995 11584 -369100 60081
21327 -303580 3397 -260674 53977 268125 -201020 -334614 126650 -294575 138060 -298799
21316 149529 91182 -214161 -92144 -85504 202544 2159 -5508 -170188 234829 150582 -225474
21304 194370 -49572 259826 191114 232765 -298625 -45124 -122622 -25691 -264761 -170801 -87826
21293 -87826 -43980 -101709 -130633 29821 -74004 -58494 -270431 68212 -190135 44965 -42883
21281 -224150 -70854 42730 -81982 -315933 -112093 105758 -22443 49812 100184 -102402 51889
21269 -63129 2082 -276825 94182 251391 -204521 29535 113598 164284 -57652 -55808 -172941
21258 -172941 352109 12841 -106399 -123788 -250824 -118340 -69219 122459 -83604 -202200
21248 -202200 11940 -148872 242496 234002 -240635 71990 -11876 10871 -86322 -57525 -163886
21237 -163886 -269538 -197229 -359358 -272059 63630 -283372 -112511 -197116 -59830 -238348
21227 -238348 -78784 -77564 216297 261691 -124689 -43583 353288 51127 194844 123679 -641243
21215 24783 124127 -11912 -210571 75688 -133054 14540 -68230 74737 -30079 -157249 17614
21203 -135039 229338 29479 -87436 -179391 59690 -224986 -284866 -315987 189173 85124 -179315
21191 -482558 -29733 62068 76479 -238117 7319 -329971 -164316 -151517 -33475 146421 -363056
21179 16164 -202921 60445 -37230 89151 146514 -235114 -253973 157996 -85378 -84110 -330896
21168 -330896 -241963 71816 -133925 -280659 -183420 -174650 106893 -109981 -1028 -62479 -99636
21157 -99636 14393 -235207 -78321 -26750 -148760 5499 -34653 374072 -92806 29484 21617
21146 21617 -267835 -6469 -22738 188042 111178 -201364 -75585 -7725 -83073 54012 -94193
21134 -185839 232578 37873 -345898 -183795 324644 2861 -230316 97044 -192560 -337792
21124 -337792 -134113 -65666 -60005 -277859 -9873 73066 -1331 19210 213338 9363 193956
21113 193956 -87068 -253914 281753 -167517 -282852 129660 -118564 52751 -210828 26736
21102 -104696 175859 -142074 -69151 187909 200655 -144717 -85680 105279 -13876 -39436
21092 -39436 25658 331072 -22403 9387 161919 59838 -167467 -195755 137140 -148015 10228
21080 -256045 145623 99176 -26921 -183074 -41485 44602 265667 214852 -216788 -122936 7727
21068 -81578 -134203 -50044 -83579 77742 -276914 -273321 -358423 222628 -83058 243560 -130557
21056 80684 -41988 -297128 -47790 79213 -37579 -183249 -130950 417253 -10541 -90850 -19096
21044 -121308 -77878 150608 -214175 58662 400791 -41580 -86441 30803 -41524 306515 22649
21032 -77455 133382 -37256 -277411 312304 -23352 -129931 -85326 -178407 -41394 -9788 21808
21020 -30878 81535 -224706 -100225 55963 -107184 -183921 -58487 149677 -141652 -45377 253923
21008 248654 43485 308672 636301 28155 357113 247152 25084 -115936 50705 -123512
20997 13839 274228 58441 -256795 -38854 -387371 93456 67874 -18252 119751 -148785 -230938
20986 -230938 -243393 68360 46043 307056 53369 -90841 -171230 38318 -23781 -237466 35990
20974 -76884 112963 293479 -300786 -23038 113721 79929 -148160 -57926 -406463 6590 -150553
20962 -30915 -240467 45706 -30942 130753 446280 251040 114435 -234366 -101619 -169037
20952 -169037 48357 71892 -92118 -299532 -77241 -18561 106298 114440 326373 237966 517033
20941 517033 399313 258909 150304 144786 -2106 -154292 -188482 -63972 -139808 -23720 -72466
20930 -72466 -308950 -36353 -279299 34752 -21218 109798 -152497 -103488 -42353 -269357 -128258
20918 -161952 -133958 -237076 -80323 -200617 -85506 268846 16355 -38473 25261 -114215 185833
20906 173803 51185 -195793 -81479 -231893 -35289 -123362 2001 -148743 73436 -202296 -326275
20895 -326275 -191640 -212276 -96692 -41600 109108 -198825 -261966 271339 80933 -509740
20884 -111487 -79930 -264734 149099 -24629 36141 -17603 -128043 129756 3058 -283403 355412
20872 -138337 -75988 -61888 -219292 114550 -223634 25859 -90055 -12458 -22067 -379910 42772
20860 -482666 17050 -117709 -275768 192264 141968 -14952 -333806 -62438 61568 -101743
20849 -59825 -263106 -318865 -9367 82778 -18270 -281250 -201701 -187499 136605 206657 210558
20838 210558 -244329 -313552 -108745 -203693 -167236 6614 -333094 33410 -75606 -127023 -206083
20827 -206083 98553 152131 -65286 172064 -160894 -81018 -83007 473049 -348158 -89743 57009
20815 -28069 -268000 -399161 -107166 -262651 -48585 97967 -259109 -182633 -141482 79216 -137814
20803 -146312 387145 -150615 -77200 -263556 20455 -68425 -63443 -38715 -38735 -127174 -51530 72423
20790 -243654 -14878 -106850 266802 -223203 6361 -18592 -389269 -206246 129339 80024 -47350
20778 288097 -136257 2114 -41807 275901 -32525 184671 -146471 -144031 -314694 3753 140950
20767 140950 40354 25692 -171563 263459 -217935 -183638 2995 99434 -106397 -182880 -188045
20756 -188045 -24542 210176 -130756 -172086 -141189 -54008 -183564 -110558 184957 -195917
20745 -274711 -83342 -270193 76513 -227932 -412699 56116 -305872 -279026 15087 -82312 -257524
20734 -257524 -247151 -8469 -304124 -124836 287 -20198 -199765 -237919 133511 -344131 -93020
20722 174207 -343376 175500 -416280 371793 -70202 -59063 -58570 198506 -77081 16930 -283943
20710 -179447 -234872 -435620 70683 -210104 -186520 -102454 -37328 286705 -32884 -198420 190309
20698 17424 -230909 -603423 327834 -6838 51521 -1718 469020 98765 -279202 35461 176740
20687 176740 70440 248006 -141103 -43031 -214395 -91186 -186230 -135649 -82025 -85279 -118540
20676 -118540 179394 -231250 -191855 -103498 -1529 -111248 -117575 -48657 -262070 -89325 -181120
20665 -181120 111522 69163 -283465 17578 -24142 33794 -97853 -260504 -170754 -9656 -26778
20654 -26778 -19066 -41844 -46115 133140 -345790 -116897 -9820 -145091 43506 -43310 -276302
20643 -276302 -26880 260585 -92685 -127512 -202555 -20809 -349349 -456106 -81370 187910 -286508
20631 -87948 -199670 -231571 -258990 -312995 -150212 -5496 -266758 -152367 -330105 -263142 -110278
20619 -173118 75365 108070 318328 -217151 88404 -158578 -226690 50322 93434 -38243 -75869
20608 -75869 76180 -121046 -162320 -37496 258558 -40945 -112397 58940 -98700 93122 -177602
20596 -128078 -99641 -75901 -105003 160553 348416 31347 95097 -82495 -255505 178049 99695
20585 99695 28344 -68182 -166116 257961 -116276 -57190 307059 307651 -50866 -256331 138474
20573 -578963 -87165 38647 -73968 -442203 -5326 128021 -172957 -107861 -28618 -363494 -178798
20561 79591 -31067 99770 -167746 -137498 169602 90100 100713 82520 81763 79712 -240446 -200596
20549 -200596 168507 -26889 -286452 51606 -247470 -141633 -7906 374697 -171157 350128
20538 -85586 -136230 -35341 -127287 -143032 227490 -264159 70640 143550 -98409 -258886 -35150
20526 -28587 -192024 -130107 -37736 -63857 -54462 31953 -140150 -90327 -99251 58915 -71201 -87939
20514 -87939 11465 -296613 96188 215411 -144458 -30100 -148501 -356413 -343611 -229114
20504 -229114 -59557 -150059 23315 172341 217331 -464 -206065 66529 -121665 56650 83197
20493 83197 -69126 266321 139194 -151956 123701 -245969 -328076 145394 -278433 10312
20482 103639 -191955 109237 -269357 -5033 164602 -308053 -81555 -254413 -67194 15911
20471 -161018 -328142 -121426 -252232 -142609 -229774 -134720 -222164 56428 -45153 -76256 18822
20459 -116626 71772 223422 104957 -97254 39308 304741 128636 -145112 -140281 170134
20448 -1196 -129825 -337967 -226480 -128209 -135744 -163356 -219534 183207 -263749 -75468 85325
20436 203578 -307246 -166793 439678 -114067 -4118 -61844 36939 -172741 -180329 -40468 31328
20424 -223894 -348664 -234282 140242 -222862 -239040 -207698 -529785 -191688 -217823 -22270
20413 -146751 -219564 240412 -123383 34037 40997 -299369 -128709 -131504 -264668 286751 189925
20402 189925 203403 96075 -263235 -1926 -194715 43293 -169825 86907 -27401 320288 36122
20390 -231918 -104 -53528 -336349 -115594 -394083 -365559 155398 155569 -161985 -162327 -31668 -103676
20378 -103676 -64877 -52241 5394 -263898 -87716 81821 92709 -172413 -118100 221963 271095
20367 271095 -187633 123544 161155 -105261 -103079 -97621 24179 68452 -52970 8679 -216631
20355 -309240 14726 197228 -150377 65365 105117 -115351 -186634 241317 -83988 210851
20344 -150838 -7328 -239530 -48962 -73626 -158538 3708 84094 -94630 -9059 -257604 -22722 205746
20331 -101164 -131873 65916 -19988 -231378 5711 -15472 -282792 18262 222843 -134464 -165947
20320 -165947 -235172 57488 -45301 -275576 -64360 177523 -130668 -298148 -377341 -480944
20310 -480944 -276668 -79028 -98652 -94724 -299671 47305 -29166 -93789 118295 -288444 -260921
20299 -260921 319615 -265372 94899 -60704 -56123 90456 -79562 187544 -285025 -20301 31416
20287 -161312 -52008 258770 149607 -133740 155593 -113533 56802 -87928 -16772 -256322
20277 -256322 363360 70696 48592 -336392 -154883 250895 -292784 -36091 -61521 164682
20266 -243573 180819 -46680 -170252 349188 -353089 -221471 67147 100403 -344468 -196060
20256 -196060 218384 -72160 -56940 108723 -468300 -13695 -135895 223821 140549 31795
20245 -195630 -65205 -103812 30205 10804 457 -220777 27866 139731 -140456 -187707 -183859
20234 -183859 -95131 144003 -76539 -12566 -66524 19067 -63113 224784 -351377 250333 -172016
20222 -145370 -48173 -20367 63055 -15044 182536 -86298 -30007 76958 18709 -333673 -309099
20211 -309099 -123660 -311451 -97120 -150745 217871 178333 23979 75372 79443 -300472 255872
20199 21612 119748 -157496 58898 -239607 -44286 179428 -588631 190645 -44698 -69923 342298
20187 -134277 30933 65292 284297 14802 -122641 -15043 55096 13070 -248657 -24726 139243
20175 165083 165899 -205117 -86992 37415 -65374 -86683 -229025 150986 139816 -110718 33587
20163 -43152 -20410 11111 120721 -241877 -119490 156610 11625 70201 85469 112823 220779
20152 220779 311754 560472 214334 182287 296223 258065 458839 77490 292876 393053
20142 393053 466825 396542 207375 209158 789745 189482 188248 253178 79656 -138078 -57229
20130 -241855 115470 135806 -283023 -171702 -37953 -35623 -374490 -208536 -82971 58651 -324947
20118 -179635 93205 52933 -49739 -67263 222296 33624 4588 -60746 173922 -208546 -190092
20107 -190092 -110971 -54829 -80960 40975 168867 191365 228973 -116970 -419490 16404 -174346
20095 -12801 -60563 -145581 -267239 210462 30263 -1692 -278041 205942 -24855 192829 -371973
20083 -322758 74599 -148594 -76205 -47346 -36252 -180792 -163396 111203 -75522 -136881 -46721
20071 -7722 340383 -212209 -255164 -167307 -64257 -67004 -169190 -96696 -176753 52506 150510
20060 150510 -289693 184400 38073 -47075 20634 -211316 -209131 -206765 -214336 -94501 218901
20048 -49225 -31213 91235 -167505 -124604 -26804 43994 -258515 -474924 -205121 -190032 -119373
20037 -119373 -131255 29138 137080 32140 -18108 6051 164457 -30340 -205223 -12342 21613
20025 154852 -195093 62034 -222601 -187437 -29859 53912 39778 -58469 -446924 73975 -33869
20013 -16019 -377845 104033 -302085 268118 2429 -49816 362899 -57161 -164333 -86665 98745
20001 45344 229611 -79856 299291 -171526 153383 369162 385053 564497 591618 58859
19990 -82331 293313 -270464 -2883 290452 278534 -125678 78266 145137 -64862 44593 -62602
19978 929 -104754 -166710 246633 -17255 151843 242 -38602 173998 23204 -149811 225118
19966 -379290 -207884 281863 213929 610080 -24235 46608 2470 30693 42075 -260984 208256
19954 108212 32238 155811 -155770 152190 38984 109001 -162110 85601 -339516 -323502
19944 -323502 -164371 -3217 -201270 12244 -70179 85325 -193162 -292145 -53676 -21025 -61079
19933 -61079 49729 28887 124630 -426165 -155523 -33619 -284161 58920 154174 13098 -145850
19921 -38723 -172856 109169 -146489 2226 -335779 -106592 74199 -339693 -110925 -104592 -62921
19910 -62921 272618 -270373 27227 -261432 170517 -186409 7895 -34148 90593 -148065 -205716
19899 -205716 -165982 -11447 -209532 -234234 -367627 -109705 337298 217783 -173257 -49869
19888 134012 -267635 -310528 -163665 -228571 -46689 -29647 112575 -108329 -156939 -185421 169018
19876 318634 -303641 -122095 40957 188115 162017 -94730 70898 -52907 -250020 -265406 -125679
19864 108211 -139150 -148452 38720 -286484 21980 332555 -229742 -152169 394804 211021
19854 211021 100797 -343423 -132005 -83316 52167 -381013 -84312 213913 -217942 12648
19843 124675 212158 -70645 -239101 -346800 236589 40317 197195 32413 -269246 -59971
19832 -236145 13072 -76540 231525 -13063 -133652 -102905 162846 -389404 -36561 -205910
19822 -205910 115354 -32862 -79765 -253358 -263614 88041 64428 279157 -158117 -47655 -365320
19811 -365320 -47809 -288483 -263329 -213190 106861 136834 -97482 158095 -117458 -12961 30186
19799 -258695 1957 -483303 92127 -311478 -78601 -39654 -277793 -55872 -140154 -13867 261674
19787 -227570 -163786 228488 -416 -317954 9972 58291 135870 -194415 64499 -311649 -293505
19776 -293505 2295 -200370 -100307 89153 91076 36241 -291540 115918 52826 -35282 -220399
19765 -220399 -62304 3936 -31659 104676 -367520 -88940 -116842 -271992 164489 -197925 -235691
19754 -235691 288788 132437 -75832 -62415 176258 219093 126589 36986 40381 235198 -33114
19742 134163 105271 -28916 -86556 197531 47806 115537 219517 -117946 289619 168796
19732 168796 156852 -38377 388143 817698 515534 253765 -103179 381148 17591 -104799
19721 -55269 -231620 9260 78401 184508 -173125 -68665 -199915 -56747 -523069 -108086 -127291
19710 -127291 -1594 101505 251943 13011 73432 -207889 -1849 145794 241760 107478 -92809
19698 253140 419155 451168 480575 -77939 -110677 -60325 -12460 137883 -1178 -191813 193442
19686 67636 35913 -169831 247578 47652 -92702 -133192 -285751 32395 -226339 -164842 -246417
19675 -246417 -219524 -29649 -55947 -7376 215174 15915 -253162 -140323 198818 -128471 -61946
19663 -54062 -2905 45827 -113364 247363 -15622 199358 105594 62505 28113 97157 -288589
19651 88856 -200736 -200471 -227789 148990 209084 -164279 -314413 -219938 -82048 19560 -383678
19639 -197782 1921 -270996 -142653 -120292 243737 333283 -129680 205785 -221012 192360
19628 -221017 9619 86723 -150363 14118 242127 131955 24467 169181 -236905 87 -140485
19616 -345930 -330131 96082 -46815 -453085 -3713 36944 425139 -133418 19600 -41739 -315451
19605 -315451 -177029 -50995 -193687 62219 -304111 70316 -108501 -18384 -108960 -164598 -218979
19594 -218979 -324262 -203321 -171332 -340485 -4421 284928 150106 101201 39904 -373342
19583 -225498 -150453 84338 -410086 -269445 -202032 -9993 -287697 -7132 -142049 143586 -85210
19571 -45948 -168758 222201 -164095 118828 -260342 -90636 -28397 164892 -296699 136510
19560 -3790 -120032 70237 -248302 -195299 -57747 83246 17982 -259373 -19338 -17547 92153
19548 55815 -17433 -142781 166236 45965 -52378 -96591 -156465 -156999 16645 -10963 -256617
19537 -256617 245757 -20235 -62942 -143224 -35127 -22633 163445 -89295 102816 252627 -141622
19525 131926 -231608 30000 55241 -19221 -9032 61924 139896 -133088 -264408 -306168 -340702
19514 -340702 -321966 69148 -418566 -187634 68967 -70766 21912 24826 -277049 -78754 87 -103385
19501 111689 -36094 30424 -50007 -60836 125950 324874 -116822 -230878 -204124 -21914 -331971
19490 -331971 264752 -214480 -98529 -187103 165997 8273 -58880 -400617 169974 -40624 -100931
19479 -100931 1470 -233778 -120239 -39790 11085 943 -103535 -174398 128687 53585 325122
19468 325122 -25675 231547 -64267 86833 -360793 -29987 165432 -105371 -4057 -227133 -281580
19457 -281580 100555 -135108 -130732 -34090 -154216 1248 36678 -48436 -233509 -1955 -237563
19446 -237563 -81427 224420 -281538 33971 -240768 -88794 -85143 45845 228771 -236309 -140973
19435 -140973 59884 -52854 18128 -169347 -163006 -160459 -183188 -178303 115865 5352 -62176 -246927
19423 -246927 -112237 -132817 -163751 -203735 76135 -122790 111238 -461926 -39753 -85117 -43646
19412 -43646 317805 315548 -173434 56427 24512 -40874 -92725 -35401 -225561 -178407 215925
19400 -365484 -401643 -364977 259186 -58797 -228644 -226838 -88009 -202813 110812 -7296 -214854
19389 -214854 -14911 -14015 243504 -313763 9245 -273346 117779 563 -85068 86351 227846
19378 227846 -65375 180785 -244062 -181204 -111349 54540 -229847 -142035 -145422 -109330 128831
19366 -39046 -101301 -56594 188847 -61870 -20820 314820 -115300 -161575 56444 -362065 -48855
19354 -92076 -70651 -105605 -132135 -88980 -234741 -395296 -268349 106049 129115 -39392 -247038
19343 -247038 23391 -225834 202776 -189613 -184108 -113455 219159 -149508 447995 -220781
19332 -211620 -96528 -50876 -167939 -62044 -326973 -153594 12762 -147634 377804 -263501
19321 26227 -30687 51904 -244298 140355 99423 -131249 -134366 27682 -225421 -180692 -252264
19310 -252264 202814 53600 -109641 48364 -293899 -106761 -212146 186779 273870 -22881
19299 -268079 -172322 -87900 -9910 240012 227141 -288909 -20076 378562 6953 213784 120628
19288 120628 256934 -117193 -309175 23166 -267973 97462 -99896 -228932 313893 -337353
19277 -42343 -114987 141424 126187 -22035 -434959 -215402 12581 142245 -249876 -5552 -2938
19266 -2938 -195047 -70268 -381122 -94941 -181582 39976 94038 22935 -47593 -41870 -51822 -67244
19254 -67244 7045 -111956 42218 -169244 -18409 -138897 106153 -359391 -253522 -131591
19244 -131591 -174966 -192410 -362634 -294505 -346197 -22885 209716 48763 -115349 -186165 -51531
19232 18365 -127880 -37112 -405957 -236902 -114356 -489693 -128260 -149317 82570 -241925
19221 46938 31462 -507796 -470376 -51932 -114748 -334425 -70585 -207653 47679 61208 -175595
19209 84550 -42770 -65217 159683 -15311 152819 -9462 -138709 343383 -11159 19724 50896
19198 50896 185153 -402734 -242901 175378 239127 -35030 -313123 9825 -58108 -212126 139183
19186 -37894 252304 -133193 -209788 -270068 187420 93925 -125815 -55050 -137494 -272659 325134
19174 -1903 -1989 -113655 56064 -12140 -252318 -216941 123415 86987 19103 -227066 -247902 -89492
19161 -199952 -113723 -183076 -107066 20484 187233 -255562 174753 -264595 -2750 -16367 -96909
19150 -96909 -240819 -14008 -32521 -182879 -563203 -128471 250257 132147 -156656 179133
19139 -62066 90895 -436381 -443147 -205880 -92218 -39199 -324178 -201881 -3644 17496 -47933
19127 -339491 -176179 -260427 -157261 198086 -315043 -324484 -450541 -295909 -154874 58311
19116 -14508 306013 -308466 218293 64714 63401 130299 240392 93699 -2556 -360474 -116910
19104 -92182 -28699 -199410 123938 -59454 17051 153106 -107906 252509 -79890 64003 -71836
19092 199281 467660 104197 20146 -103423 -17127 -195506 -12145 243371 -400649 -236335
19082 -236335 158671 -449715 100132 88591 -82345 -122925 -1535 -196489 -291004 -144124 -330919
19071 -330919 -192398 221638 84879 -288824 -108853 196 -230916 -296067 -98174 372068 3565
19059 91660 -264447 99358 -254394 -65046 -301360 36638 -35252 -193218 87000 -154132 190667
19047 -77772 28296 -127410 248592 -88498 -2432 177090 1392 -52758 -415776 -9827 -99825
19036 -99825 -175819 -97658 -267751 -217055 -155703 -46336 37030 41944 -83183 -69967 -72881 43209
19023 -139807 191506 38767 176125 157996 -269749 102288 65998 -273747 34936 -70762
19012 -137005 93551 -219526 80525 23587 44302 34250 -72067 -77375 -27114 200895 -27251
19000 51115 -226641 26385 47505 226479 87235 106088 93586 366782 7404 25212 6905
18988 108697 94222 120286 43891 62123 32801 -62427 77444 -94638 34674 -171146 47032
18976 -189562 -112899 -80926 174699 158579 496440 606186 275994 -85610 21918 462165
18966 462165 600060 262558 62491 66999 -400161 -57785 -64860 142938 -283650 -7156 -198940
18955 -198940 -57141 87309 261196 261106 202712 -61728 87183 -38794 -93683 103849 31105 27051
18943 27051 175622 -3037 -190041 131359 -16160 201401 73306 -76430 -5407 -90835 177962
18931 -159087 -239599 240113 28641 109613 -156955 35232 17686 -219344 131033 135512 -86764
18919 238737 -315488 79445 69187 -150717 -200756 78695 12541 336933 16889 230737 382709
18908 382709 189331 336909 310539 -32804 -277024 116132 36278 26199 -65042 -225748
18898 -225748 -471892 -197714 -61230 -314524 -37362 8252 15422 78567 33814 -333417 -2591
18886 -104297 126439 31894 -494991 213467 -121132 28250 56560 178295 -223101 -201810
18876 -201810 215541 38472 -32726 163183 -40925 -7795 -84615 -246041 -2933 -173476 22565
18864 -253340 -77844 -123244 -94736 -97640 -371253 -122311 120292 -213051 -251987 179388 172261
18853 172261 -318572 -328748 -13615 222838 -179836 -73141 -100868 77908 -118407 63644 -62939
18841 -68512 -119903 119645 -11676 -706289 -23307 -80282 57084 -79838 129261 90876 98664
18830 98664 -55186 -187665 -101561 -155224 -167522 -40370 -111267 9155 -94052 -133994 72136 -127393
18817 -62350 -54781 40330 92299 20888 -246181 201651 -29206 -202202 437447 -60405 56163
18805 -86837 -44523 352535 39668 22319 183690 -138350 -263049 -173918 207048 116685 60310
18794 60310 -53329 10004 -273511 -261417 -7811 88454 -302324 67032 -16133 20659 -153715
18782 -81416 -10851 -289259 -101155 -287706 172126 65123 243585 119024 -395969 89692
18771 -40537 91660 189043 -85192 8169 -67737 322860 -106194 31267 -54128 201122 -151169
18759 -197079 63122 -110329 -43816 30722 -28293 102600 -77796 -258171 -105289 -288107
18749 -288107 100432 -347616 47883 -193588 141131 -97331 -346809 284619 -26459 88422
18738 69069 304498 -163948 -125431 50155 -39138 -68197 153683 -35876 -4448 -51311 164901
18726 3515 88537 -25967 -200030 111342 -124400 -81007 -311551 40460 -444317 -360438 132733
18714 -77665 10472 168774 60514 67606 149588 198 21714 -274836 -407907 -93509 60139 -193512
18701 -301825 32781 97540 95808 -261922 -90465 -200219 40755 -49714 4934 37800 256886
18690 256886 -346513 170249 -3565 -222737 -5262 27886 35806 -254674 -42014 170248 -81060
18678 -33485 184602 -13863 -241038 -45525 -150439 -185627 -147516 -182937 -63155 -350322 -176193
18667 -176193 17806 326941 -217445 -19766 68872 212863 -222744 67383 52493 -126942
18656 162715 139134 -70351 11653 -147429 -227018 62675 -3284 28665 -187850 8132 -434581
18644 -255631 -36116 157366 194930 228412 -114629 81907 -67226 66678 104676 -270011 -112318
18632 -108842 148593 -203746 -260977 -257883 64221 154032 120947 -30916 484519 180532 -1152
18620 -253033 -40927 9343 -257632 138862 -215283 -292840 -414511 19614 137397 122837 -15273
18608 36235 40284 126971 171232 -45971 -263328 -71107 125618 -162248 -204580 -112961 -256382
18597 -256382 -170101 -41856 71366 -7784 -171106 -191485 11187 64969 -35170 91490 -105396
18585 -223522 -97942 -7747 -218288 -351036 -199865 29812 -201252 -375970 43917 137782 -184891
18573 114498 87955 -197400 -424010 -117693 63895 258450 -340807 63559 -224804 -311340
18563 -311340 -156294 164674 -146958 287036 171895 107935 -118460 104223 -273199 384948
18552 -361842 -18322 216027 -65354 -427859 -155489 -61202 -105696 -269495 -138371 76460
18541 -158760 -179291 -99317 -333806 -132048 -91818 -216015 -14660 47546 -206319 65597 84371
18530 84371 -393366 -41143 18467 -264696 190574 -27396 331358 21332 -392847 -248158
18520 -248158 82322 -92356 -53265 31174 -75245 -180507 -163131 -443158 -174697 -115889 139015
18508 -87709 -157922 280905 11274 31892 -313703 -201426 -231264 -95772 210876 84477 -100381
18496 162841 -106326 87768 -41035 -329731 -59113 -150131 -101893 27932 128220 -446938 -118910
18484 -128312 20352 -123554 123298 -151038 184628 -42765 -50357 69160 -270736 -183488 -102112
18473 -102112 -48489 -41023 -121626 -64865 -269931 42590 -50420 -189761 66894 -43776 6943
18461 -5191 362257 -136579 166027 95397 -246305 126896 -144850 -239948 59622 -179740
18450 -184835 219280 -232300 -162296 76891 8414 -291720 -208049 -121453 79687 366373 -193532
18438 282459 59012 -79989 -3450 -45969 -139871 27649 -20717 -201970 -25971 270571 -191082
18426 55525 106580 13551 -278616 403868 42788 85956 73111 -51701 194150 -88257 -104127
18415 -104127 317695 -103264 -61362 207991 129639 -238859 96438 179100 -31434 90204 -165615
18403 -250064 -135612 180114 -60444 -122095 -17128 64283 7145 -320699 -33516 -194737 -184096
18392 -184096 177913 -240620 413230 -402061 22354 -25460 256354 -117285 -295655 54859
18381 -195390 -166100 -492955 -396921 -134207 -187298 170822 -31270 124358 -130460 -170500
18371 -170500 -4251 -114904 264008 -19077 -140416 -23189 -48335 -155824 -51064 32975 -281242
18359 47762 125195 -237939 387786 283281 233869 217725 -347219 50692 126758 -127963 -205906
18348 -205906 -117282 73322 84032 -197768 -162642 271115 -305245 -130849 245671 225409
18338 225409 145983 29845 -338233 -58890 -219438 31275 115763 -31878 -106664 85675 -153237
18326 -19884 -229624 359362 -274773 4977 -26136 -154325 -110906 -15085 103849 -120171 -400181
18315 -400181 149302 44266 -30244 -104667 158550 25796 -95368 -269634 -80815 -15880 -324397
18304 -324397 -42655 70376 -153662 9134 -188172 64423 -78398 60791 -18823 -77659 143942
18292 280073 -117464 89864 -164865 229459 -93115 -88327 -91878 -165573 -239207 -3659 -157379
18281 -157379 -218003 27969 -175227 -243948 -252975 178170 -203424 -7708 -55245 8296 171788
18270 171788 269520 -57841 -243624 258405 -269677 -187347 105999 -120755 -80269 -121561
18260 -121561 -13781 -126525 72511 -5288 -17109 -216687 -145130 231539 72126 -201398 28366
18248 -100725 204476 -210329 -154646 439184 -84755 -60454 -207183 -87312 -75168 90549 34672
18236 -235058 -20356 92338 56209 86157 81501 82878 64988 -49747 144216 -82885 -10670 -144718
18224 -144718 -134241 -128408 -245064 103412 109765 128441 -85326 81316 348598 48913 -60822
18212 47624 -116857 -49486 187506 -98860 19545 -24403 -59778 -205222 -194934 -378 -167451
18201 -167451 -134498 66788 139507 486235 39711 64344 -157758 -10213 30656 150130 78356
18190 78356 64946 48686 200505 -83001 -58004 110613 -75136 68898 410725 91092 -218683
18178 258862 -215024 22000 -115634 -102119 88552 84463 -64128 58437 34265 171795 -102931
18166 103717 -184154 -9891 264787 233020 -127823 -167078 -18929 139545 -300730 -136498
18155 -89995 162417 -145305 16841 -122662 228279 -93420 -272581 -73895 -292025 -25689
18144 -4563 -136559 -22788 -98935 -125560 252134 28006 237619 72746 -282228 -53403 17214
18132 169888 -28305 197774 -162235 -6547 -66200 75642 -210034 42426 -30057 98280 243335
18121 243335 -442 -17953 -66689 -196695 -186256 -36751 -2739 174200 53865 106820 4653 -25100
18108 135543 -177316 92111 234275 349047 31900 95650 84380 -62748 186734 -340495
18097 320005 -70217 254231 150666 -55257 -170544 182277 -23978 -69709 -239724 -64970
18086 -39217 -103640 -77300 -204489 80300 -110362 -144258 27020 -207681 199167 113754 106651
18075 106651 -191678 164303 -105719 190023 -32688 246937 49551 386595 162425 -96488
18064 -32753 -210170 425529 16133 219899 -294091 6261 -156666 -186428 -88490 -139398 58720
18052 -9353 -93464 253276 -193260 -50360 -26436 181923 -243187 60109 -102832 -108026 -56521
18041 -56521 -111307 -28104 250142 -317558 271146 8633 -14763 -165769 -7796 -662 87216 -177255
18028 16002 63717 -300135 -17211 -116471 176067 -298428 100639 5487 -171079 66538 188280
18017 188280 82365 33724 -178709 -12210 -36352 -127679 -300305 437456 -215527 -137250 38463
18005 95936 -222991 16306 -336150 -34731 169085 -198604 6911 -223597 167135 5542 225275
17994 225275 -59527 13740 18368 59809 249997 196330 -196507 409883 213539 64150 61732
17983 61732 -46164 -288085 -142477 -50419 16096 8622 -167298 -118204 160058 -290130 -272917
17972 -272917 26920 147410 -164522 80686 124192 163786 280437 -242070 -82262 -340363
17962 -340363 -31365 -79260 -42993 -11726 124819 99031 -198482 -54456 142491 50792 -86368
17950 174471 -68435 49070 -231960 200000 4247 -87215 103222 230137 -32892 240529 60086
17938 27066 -198814 -111951 -68494 108503 -93282 294430 -59883 19580 -59834 231035 -162241
17926 73238 -5609 147978 184602 -314861 23527 49516 96301 159785 -111588 102228 -37839
17914 -123063 280679 -52934 212945 -236950 -163187 133853 -215892 147767 133188 145034
17904 145034 188139 152750 217699 -239162 375787 -27977 7249 -66098 128086 -314322 109898
17892 75324 -163883 -199103 -196074 118665 -204942 -111084 -199718 104934 20548 -111146 137668
17880 208134 191671 -116691 267457 151097 174647 192139 -196822 199791 217851 -179307
17869 434143 95558 -39444 41369 -94966 -75505 214058 259166 87239 301170 -40042 100472
17857 124752 -153357 145651 10213 -99072 -36453 151014 243073 108025 296110 -114529
17846 -19773 80400 42515 -63620 20757 92536 -102987 -426940 193434 186782 163885 198832
17835 198832 -9135 16485 -250562 270831 -22548 -252103 -122696 -19351 199600 -19287 142139
17823 -2712 419476 388535 -70086 -108063 220250 -27240 -56228 138396 58045 -101391 47714
17811 -32342 197358 167946 65568 -196416 89943 147696 -45979 104444 -65519 94122 204384
17800 204384 -123545 126756 303829 -105699 -32846 102702 43076 206244 -244448 38538
17789 -23469 229289 211430 -141820 172009 -131464 -31635 98711 187474 -19458 -14157 65923
17777 196286 -50243 284258 -242971 127616 85841 -11923 -157305 36682 270976 -147997
17766 223335 -184442 -80926 -11494 8996 224438 56392 87744 85449 -155777 181177 -91577
17754 99172 -106139 -36503 162229 339836 -98607 -139147 184578 -191987 -64352 -233563
17744 -233563 190473 -62018 59260 254857 -63559 -49735 -12804 133141 -98140 240193 77280
17732 -110145 66327 134192 -172500 44736 82342 433582 -280328 -151299 186247 -113839
17721 254754 -82584 -127055 -121808 58832 -40358 -156782 55572 -10793 61942 -55185 49216
17709 217838 8283 -96700 84896 340831 73423 -106741 -106045 7832 322922 -123522 296308
17697 128457 212547 311987 -46467 -121882 237639 77210 289335 -108272 141461 -55582 72923
17685 -94582 -2324 -64202 -19849 -52714 152445 104703 313017 98076 130000 -64194 155977
17673 -5804 248388 32681 36968 154477 259809 63761 123417 -68532 141862 78874 -8122
17661 110076 158663 -275060 26544 222989 82774 53529 178580 -142405 -59706 197861
17650 18549 -132260 249435 323761 127992 -126616 205576 298524 -9701 152022 420028
17640 420028 5211 136078 -328398 -64493 253682 230737 475446 -867 -137135 97650 249090
17629 249090 -150242 231737 -16465 -19627 156498 75247 -84150 486555 -197405 7790 20602
17618 20602 64075 -85409 402648 -72901 221958 538318 304128 258869 103665 284984
17608 284984 337657 -149364 8000 135400 300305 70166 307955 15670 163721 228557 73432
17596 -119267 202776 -131612 198341 71003 298 129330 77213 91581 187013 106190 -666
17584 171648 158511 195834 67833 238148 54234 217138 130124 181012 201808 322584 6375
17572 -31677 15020 56477 -58222 79127 3641 129123 31960 220424 296170 228138 14068
17560 420108 -23145 -31919 242154 -13981 -25997 147341 44947 71426 231881 99471 163759
17549 163759 177562 245998 412566 107891 214227 179128 144129 112514 329958 -46656 188527
17537 184440 383880 279037 417344 -35177 261704 5034 291788 409496 162178 365442
17527 365442 424132 298913 1085300 774661 1227754 1017319 954718 658379 474555 380331
17517 380331 334233 530944 369769 535049 148904 495847 745267 563713 670844 1134855
17507 1134855 982288 687918 730048 233044 582758 121437 480183 339279 165255 274321
17497 274321 281857 321306 197315 485675 212948 388714 -100955 164807 87303 231346
17487 231346 91352 205755 419628 206503 263402 -14241 258101 481356 322736 36132
17476 157344 100006 450049 131551 57694 -16549 137630 246194 424905 244100 61276
17465 414792 42597 248347 197545 462307 290773 294845 150066 -26123 216181 479964
17455 479964 382404 377275 617368 116691 392681 530118 548038 427214 304750 542123
17445 542123 588175 529117 459990 303722 366082 485070 386904 661336 240460 392616
17435 392616 185885 428087 515608 354171 706648 487474 107383 384060 352852 397849
17425 397849 341136 293870 352516 336628 478857 352894 338661 312824 184785 199000 519971
17414 519971 509211 690971 134849 533570 455433 196818 499058 663874 -19313 688815
17403 362504 235016 273669 259308 98001 353367 313027 347573 299170 74236 427357 382400
17392 382400 461470 227013 434457 -101978 -294342 259340 341322 237174 432518 490934
17382 490934 313607 201512 367918 501009 360587 29670 -31498 302824 259452 276194
17372 276194 260002 198227 503584 315429 178681 256837 129195 358569 530886 390919
17362 390919 110327 64613 623943 257796 354908 90394 290110 380974 453200 115282
17351 466026 282684 488878 603308 475799 485120 -163015 25867 148216 529915 397281
17341 397281 66900 628720 170624 259228 97224 613329 212695 239891 330428 373975 129489
17329 292959 145118 527383 306818 117128 232410 801814 244410 64150 418585 399463
17319 399463 487312 274600 155387 -67280 -78320 392102 178579 90356 180036 231401 447873
17308 447873 139120 324986 365462 252842 -6571 421766 223655 267940 255434 233611 263412
17297 263412 -30909 114856 140971 364326 466605 204339 401438 263837 287054 242289
17287 242289 242711 322487 177707 283174 578032 449186 274324 -160480 403334 501325
17277 501325 486985 245176 369938 515296 197304 278133 440011 248351 178468 305393
17267 305393 384666 288039 63103 304846 559684 246999 473095 134214 552109 -17504
17256 450256 609697 642480 302235 576010 415956 465847 -23453 402221 107815 315958
17246 315958 107253 137678 -67177 440473 303119 811940 690540 352211 112469 682368
17236 682368 304635 298705 367382 431512 509094 289045 450697 221506 564912 446245
17226 446245 499823 478662 355833 594466 420394 537758 196848 374668 416832 268511
17216 268511 374537 428203 270780 296505 516692 374958 266951 454723 311089 526896
17206 526896 736651 550192 506776 294544 450157 305817 329466 341775 450440 316368
17196 316368 258404 286449 301484 479521 242111 415150 468114 497315 446928 29454 327589
17185 327589 434631 470971 402367 442073 154989 355685 197478 553806 480976 618434
17175 618434 446976 659870 365101 462887 504313 533402 401676 244935 497182 425001
17165 425001 454574 664648 610201 674078 628969 792268 470417 550390 727939 736237 678189
17154 678189 609471 534358 593238 740202 286176 499054 786127 654084 331711 646586
17144 646586 578817 432581 857592 114427 530612 462982 443777 612801 26637 420993
17134 420993 628806 902933 704305 391981 537529 611448 359259 242088 650846 689519
17124 689519 452496 225591 648833 387403 583443 827115 440565 804542 649622 109861
17113 441562 729171 619463 593720 1032474 442858 456139 794548 630063 1134825 1024373
17103 1024373 571843 144572 387141 476033 800679 942566 681991 796894 481966 1001038
17093 1001038 556949 1169304 774105 659776 728462 638981 607344 701663 407442 656969
17083 656969 870038 713577 697908 586504 732593 901482 637154 601121 966046 755180
17073 755180 628620 1020200 948292 886474 726113 714679 677883 892955 1021700 747799
17063 747799 786202 1070437 758892 857653 733575 879796 608218 565833 928918 631621
17053 631621 857806 660357 995323 760027 1008265 805135 1151051 1007094 834839 613342
17043 613342 1014231 969939 1070009 1141838 1039151 1098464 1034306 906303 920124 1208437
17033 1208437 955162 975197 1064691 1557858 910726 1093323 1255763 849096 1411855 1042257
17023 1042257 853660 824499 964952 960934 1300300 1134680 1379698 1000222 1306543 1302675
17013 1302675 1196581 1154036 1080656 982526 1248913 1231582 1292751 1144196 1165834 1238329 1322657
17002 1322657 1063981 1154871 1001702 1275089 1432928 1206518 1356449 1216778 1065809 1377233
16992 1377233 1374354 1562047 1469527 1222017 1479160 1536326 1146590 1394189 1274400 1236161
16982 1236161 1455573 1225092 1336849 1577602 1641922 1211605 1341526 1665635 1374630 1480741
16972 1480741 1520940 1607655 1951731 1408591 1519436 1404174 1497375 1557085 1693114 1567723
16962 1567723 1616614 1692736 1432741 1551326 1653220 1394800 1693613 1735350 1870824 1825880
16952 1825880 1531302 2050427 1777744 1955270 1917540 2258796 1782548 1924529 1588489 2136163
16942 2136163 1944241 2050639 1937570 1880842 1923090 2150163 2039574 2315129 1795912 2027119
16932 2027119 1830469 2416094 2136264 2466363 2333917 2476642 2309501 2331129 2329153 2309688
16922 2309688 2643976 2421932 2051308 2232107 2404734 2617582 2446216 2457357 2601385 2744798
16912 2744798 2698941 2458471 2474867 2906260 2491946 2888531 2772911 2916736 2801579 2840120
16902 2840120 2703090 3044997 3226554 3203529 2990317 2788344 2928470 3381925 3245635 3292153
16892 3292153 3270757 3458794 3278487 3207603 3714594 3305247 3585681 3360255 3510836 3717961
16882 3717961 3601312 3638667 3932892 3863413 3975945 3805481 4040817 4152155 3761819 3899913
16872 3899913 4209767 4146141 4059415 4345761 4366779 4587806 4368277 4754936 4555290 4593437
16862 4593437 4869984 5115544 4658831 5123092 4760305 4916570 5452003 5351495 5534828
16853 5534828 5483471 5450865 5588918 5606167 5742348 5828076 5808481 5704784 6115058 6149105
16843 6149105 6532014 6226470 6225521 6376408 6761465 6716668 6800129 7149440 7171771 7160667 7429080
16832 7429080 7518202 7556285 7819900 7794235 8076656 7984802 8278870 8722753 8906138 8391069
16822 8391069 9121584 8901752 9081526 9671077 10120258 9727272 9804635 10634579 10304989 10694191
16812 10694191 10782856 11060870 11622867 11793860 11751644 12130830 12376214 12770021 12859247 13014240
16802 13014240 13427211 13855831 14053596 14281456 14775668 15064047 15226075 15708718 16160819
16793 16160819 16402308 17049021 17303509 17635538 18150413 18744376 19151937 19825267 20125557
16784 20125557 21058142 21341193 21748462 22494582 23239074 23788412 24505099 25355281 25938086
16775 25938086 27120528 27335201 28247371 28801695 30178196 30817447 31753806 33189803 34204664
16766 34204664 35342978 36565950 37381194 39055520 40120281 41676423 42980900 44773626
16758 44773626 46645915 48078569 49656695 51288351 53078800 55109632 56974686 59215574
16750 59215574 61064782 63559560 65803014 68341671 70844508 73533488 75823112 78582494
16742 78582494 81353466 84330705 86994581 89432101 92391656 95532636 98300754 101130207
16734 101130207 103843067 106616875 108859596 111214334 113685122 115504027 117508178 119012506
16726 119012506 119799601 121092745 121899672 122095942 122238600 121636314 121772977 120403058 119091082
16717 119091082 117814831 115892108 114077064 111765384 109664350 106759990 103983800 101464763
16709 101464763 98407774 95891335 92621244 90015910 86973706 84073607 81361872 78063308
16701 78063308 75681531 72677836 69995029 67652409 65033178 63017112 60509968 58160433
16693 58160433 56106878 54117499 52479749 50167907 48348061 46704506 45044971 43183440
16685 43183440 41980931 40344792 38946550 37712020 36417385 35450819 34038317 32960736
16677 32960736 31959580 30858015 30021094 28805102 27974401 27252236 26079675 25482199 24780660
16668 24780660 23801063 23227432 22295996 21671483 21115426 20612707 20268467 19109745 18963040
16659 18963040 18599351 17886244 17500174 17170300 16476580 16249317 15950404 15273697 15372105
16650 15372105 14752801 14383926 13753955 13661539 13191596 13278343 12832747 12302008 12092802 11958115
16640 11958115 11509267 11116871 11280400 10837940 10650587 10557671 10275054 9886472 10108790
16631 10108790 9466466 9117449 9045333 8770144 8778121 8303087 8425547 8143609 8307188 7838613
16621 7838613 7599794 7669944 7846722 7184081 7209652 7091633 7112239 7062388 6695717 6619745
16611 6619745 6431974 6201772 6247858 6298397 6115181 6330511 5726543 5790268 5873021 5712042
16601 5712042 5294393 5583908 5276436 5611664 5282973 5029164 5204912 5180919 4903049 4883797
16591 4883797 4989186 4906808 4571808 4816771 4384948 4485827 4480264 4405943 4318683 4212112
16581 4212112 3996518 3942522 3820552 3954658 3799742 3559726 3813910 3381618 3776350 3499403
16571 3499403 3394842 3707630 3645172 3744276 3092532 3054172 3232676 3351896 3164556 3136668
16561 3136668 3305242 3216754 3102518 2571679 2969139 3022723 2988589 2867540 2978960 2517412
16551 2517412 2607978 2946189 2546111 2602517 2710645 2900800 2698400 2536383 2410455 2631215
16541 2631215 2399829 2412314 2381628 2476135 2203396 2116595 2381143 2206268 2076680 2197906
16531 2197906 2141860 1923570 2149643 2341516 2022448 2169749 1999307 2073079 1960767 2072951
16521 2072951 2050575 2404697 2104650 1905914 1842306 1789437 1873258 1836043 1614116 1889141
16511 1889141 2030272 1777855 1641329 2019705 1690052 1797409 1539389 2041585 1641186
16502 1641186 1460808 1731171 1419234 1805729 1510583 1743211 1785487 1643675 1651142 1792859
16492 1792859 1777272 1324818 1327366 1309359 1401940 1440497 1357267 1158676 1549603 1189521 1600430
16481 1600430 1406861 977662 1250551 1461416 1258338 1564577 1228180 1204479 1258830 1255682
16471 1255682 1322869 1173322 1145616 1052614 1445954 1421066 1193649 1170504 1113265 1014480 1376149
16460 1376149 1045015 1189268 953088 1164343 1180001 1392219 994954 1404742 977264 830781
16450 830781 1194859 1401643 1147586 973940 919284 1024082 807951 1075926 1283398 1065017
16440 1065017 766121 980118 989846 782721 1057764 766364 800788 793927 1103573 1230552
16430 1230552 629869 729684 833139 984839 811419 742102 819149 805499 817707 549941
16420 549941 719684 727311 809034 856226 744465 859433 773523 1067201 917734 776602
16410 776602 687907 861196 693888 669847 347919 778905 650440 536405 594831 787688
16400 787688 843754 387688 714030 900331 628223 794769 698986 465020 750822 912289
16390 912289 657195 620715 738879 606856 882034 351857 600279 767389 844391 380753
16379 695456 513323 845305 385411 566659 609932 559869 507228 621172 533823 624967
16369 624967 397918 604820 808426 506230 667699 624628 441240 586401 506560 704476
16359 704476 600044 521625 508647 549626 429202 495908 464044 765373 651350 786835
16349 786835 207618 661821 688958 462964 214128 795290 326062 482624 674995 608555
16339 608555 319198 370575 315299 871134 319795 395516 775093 423628 378961 354098
16329 354098 379782 401814 269023 431454 323752 325271 474556 838261 198035 362502
16319 362502 552656 471457 304307 695512 211548 469882 791331 440130 360528 334125
16309 334125 -68469 569659 514525 398598 595284 649063 520501 218275 290337 394996
16299 394996 396093 198988 497986 508054 141377 494246 299991 572719 294769 287059
16289 287059 506738 77067 420211 655374 388432 -103042 230034 481915 223618 524938
16279 524938 350799 289760 603213 337654 184920 396794 271441 584491 433944 167381
16268 249985 207169 60816 400685 57218 327983 476388 44848 341140 306388 244586 137341
16257 137341 102224 173246 476280 277991 87821 -1207 181479 583344 431540 497995 343177
16246 343177 164387 322809 -33895 110278 273599 234408 308163 63267 331002 312162
16236 312162 414332 45958 60864 524602 412005 100465 256638 341240 269889 111416
16225 210451 383451 207305 558890 388799 -13925 151175 643674 483471 238673 18278
16214 -56383 46699 -226024 -69191 172792 297010 81124 69729 262199 129080 135522 362243
16203 362243 344749 221525 165206 -82538 216742 257359 -76928 119985 -38856 173535 -133972
16191 274237 183843 252875 298417 188321 26984 77160 -69079 288954 153687 296469 -141962
16179 335383 101290 61514 177062 59993 571382 214511 116937 212668 180532 473738
16169 473738 456350 146207 577527 74759 224975 -1123 263767 -111545 389942 -88601
16158 -27342 244587 483457 344462 121094 160196 275595 107083 85356 363216 190986
16148 190986 56111 9957 359962 401288 122492 347573 -25108 77414 -195025 59493 162271
16137 162271 -220197 300476 -131716 145509 249723 140800 -12622 39101 201739 -84240
16126 -101827 67258 236843 176240 296381 -141472 84264 173639 276082 171503 -13354
16115 -145124 185751 -93801 -213725 76527 165483 -12350 143100 285664 132113 -25353
16104 -36830 -293178 -56768 59907 32172 -88801 193733 318417 -116284 -85736 2567 39691
16093 39691 122696 162821 -66111 161116 -144807 175712 220354 103087 17320 -61137 -19714
16081 -39837 153178 156148 324980 133558 237730 125669 -209089 -186420 211372 286741
16071 286741 96778 171164 40849 -35214 49611 -265061 124135 55625 56029 -34064 53948
16059 36391 26272 80411 -63431 58540 -26824 -54850 -92763 160428 -123302 -832 -186633
16048 -186633 179757 187661 127022 103091 7317 -21130 -139246 -287291 -218228 -71877 46099
16036 -34273 144280 43463 -77142 162458 -35661 239458 -21483 205950 -254303 327507
16025 29138 158128 -185592 144183 143099 364412 -248691 -73612 51887 -118874 337616
16014 34284 364551 67527 -186402 17439 -278882 29226 -69989 -294054 125322 245373
16004 245373 9080 -60890 -266327 109204 -226069 -19284 76402 218677 78026 42437 30421
15993 30421 381197 219896 176332 108678 230677 481954 628849 589128 881638 1668060
15983 1668060 1480120 1333129 787608 395020 101538 539124 189739 336220 241060 195420
15973 195420 -66816 -77709 202957 2077 35952 269388 -74638 134802 -72696 -33379 125539
15961 -62172 117287 -161123 -92259 -206228 -47033 27441 310431 -45239 121780 -51788 54731
15949 -90571 36072 87071 41255 34256 65794 94778 -244040 -165371 32601 -243950 -125147
15938 -125147 -279739 10570 -43725 -82247 -64064 -102853 11943 10799 271787 -298766 452540
15926 -38320 -412153 -199456 -15898 67287 95595 63295 142771 -49940 -229959 73150 141856
15915 141856 -164631 213681 151984 -81631 -19806 34073 170989 -212171 28935 -36141 117996
15903 -235326 64719 -114896 180701 -238807 253360 -211561 134498 102122 119199 -45212
15892 138159 181100 38030 150319 -46211 78986 -135184 -375759 39830 303125 -14054 114140
15880 187824 -161195 -328743 181159 108186 -12157 -155290 -366369 222230 10845 -368154
15869 202699 93115 35780 35303 154399 107354 -72169 -41448 -381612 23122 53456 -13728
15857 59526 -100183 176425 95986 311034 -18311 -1337 -268115 447324 310477 362519 220737
15846 220737 16604 173719 245249 171085 -246933 259710 -48387 26221 -353823 40156 -337907
15834 23488 171328 -256958 91852 254128 -20597 121945 -188563 -53610 -2177 -124699 56431
15822 340953 245615 210025 -22852 200943 -100295 -42348 -200293 138120 13250 172768
15812 172768 -247549 409950 -128141 289070 -233507 67776 -509923 -43090 162409 14916
15801 152726 24412 -117578 125874 66864 111377 -257425 -319628 -214340 -209871 -84175 77312
15789 -90201 -43615 -128219 68766 -188235 -352218 12551 -13719 -57429 40490 -39387 -378789
15778 -378789 -12393 -180483 172709 175869 40891 -160467 95217 -126637 87116 -382652 177560
15766 -403154 -21729 -16171 -139065 69180 95921 -91769 137559 -86839 -4007 -350021 251899
15754 -43996 69531 -85113 138804 235776 58129 -64456 89905 -42218 109389 228040 -101292
15742 113278 -173363 -170312 -3824 25173 -144254 -294485 -128396 159311 205577 93673 169166
15731 169166 -283269 58668 -89944 -138804 23105 109192 -29598 257218 -87685 -361849 50476
15719 81090 71995 -207137 -288545 -247077 83802 -185329 -18341 -359003 317575 -417637 127392
15707 -136181 201534 -7933 52663 192005 -141774 -167440 -98699 -300361 -9822 -203858 92429
15695 -141732 -107177 -16832 96643 64463 -211442 47911 -114888 324535 18908 194016 12132
15683 -323615 219869 -8237 159670 -130906 49685 -76703 -200976 -365240 266751 366542
15673 366542 -1659 -218447 201460 293004 -94129 34599 219915 18153 28662 38481 -49236
15661 360795 -88679 -37282 -154073 191656 9962 173295 -324190 47606 37859 -345113 -192380
15650 -192380 226761 34503 -278981 -121824 -115498 -247330 -168788 30248 -150237 100445
15639 225114 87087 -116744 304149 119366 380085 -307777 173360 39879 3125 -208216
15628 211898 -135756 109111 -128367 29919 286009 128420 50179 -26520 4923 -102984
15617 73516 -28294 290741 -84042 67907 -332704 -108232 -238198 219593 39107 270014
15607 270014 11387 -354294 36964 -67159 248159 -14886 19282 -136849 -47081 71994 -37221
15595 -25989 -169564 51943 -111766 83581 353678 29859 -123995 -313001 -128846 253449
15584 134296 -96993 -84461 323346 213572 231695 68352 435840 -132576 -121540 -108936 316660
15572 171539 -69334 -122385 73659 -55061 -49269 -42324 -251704 -485099 -25808 -47618 203328
15560 -210751 -45666 -198524 -304638 87376 25792 133620 -137728 276695 -276815 100426
15549 -187021 43612 57987 -137647 -49698 28270 193410 96580 335293 68410 -181039 189865
15537 -19820 -66606 1644 2596 -111566 -35884 -149794 -86563 -15226 202895 206554 178223 -26218
15524 82021 88701 275939 224010 -24469 -52370 111787 189595 136696 35738 309186 -220419
15512 209242 -39290 -48754 -125637 5280 67552 91973 348365 198821 127467 86507 -159195
15500 195135 57265 105792 49022 49332 173838 366707 -178385 362936 179004 -61032 199555
15488 95103 39201 -92096 -117873 -92073 259749 173217 105283 481552 -33131 348018 202964
15477 202964 225946 190607 445316 798302 394863 864357 616895 653066 34532 -77582
15466 -69328 189407 -536120 13378 -53148 62122 580247 -374197 192126 7405 -106050 -174722
15455 -174722 98604 -31660 92741 -117886 106117 152688 16495 116505 -193920 132328
15444 199718 290430 441125 251290 727435 1005153 1287860 674377 652097 305424 97004
15433 29541 250518 140632 298912 -100689 505651 56094 -146148 193425 282117 94609
15422 -26089 187863 38222 30097 138405 110492 109429 -64442 -242217 143108 84582 -139793
15410 78087 -130618 88174 13790 -180250 147713 7554 63764 25633 -36231 203580 329096
15399 329096 210450 -266730 176160 -168670 47612 16190 293190 -204397 164283 -248964
15388 148020 -162871 9193 127754 -73287 345487 -287990 379277 -102049 224358 -162364
15377 -88028 253518 323763 206824 304777 161274 126399 268190 307797 -240925 141921
15366 46900 468090 425582 -45340 287719 137105 17525 54449 244288 307906 95577 24517
15354 310840 100264 132279 -40158 202380 430717 386326 172479 82755 142002 205083 368521
15343 368521 603005 363568 177892 373199 217727 465451 186400 474204 -24808 21221
15332 -159380 108292 221709 406492 231886 93172 111412 346114 168803 125367 -113759
15321 295888 -162928 118061 202937 249459 159325 -389564 457360 351371 93363 147415
15311 147415 -21413 345141 183446 244393 61181 411001 109407 -69710 118167 -87957
15300 209946 376095 -210998 153689 -238495 278004 229922 245946 108309 -187410 -228573
15290 -228573 66602 -75465 245075 166519 -14852 -14355 -416220 100978 84384 224991 -156367
15278 128441 103507 -202363 -186547 69642 -211825 -258676 33100 131379 381997 -15256 11241
15266 -67800 -153679 -339867 45767 -75933 187227 117897 223878 -105306 53209 133066 127559
15255 127559 -96462 89491 47353 34821 -36959 -266068 -37532 -316056 245670 71183 382408
15244 382408 397514 881531 2061182 1444896 1465805 1423635 649670 425585 -6687 88102
15233 -37449 -82481 -16934 -218402 -68743 130824 121285 -86668 -92310 254046 -522483 67284
15221 130132 202431 37958 -233203 77769 160224 131094 90637 -128579 -285288 241752 248446
15210 248446 252387 -310930 -178227 83484 80990 -31996 177321 399117 -2700 293414 122806
15198 65062 245027 93878 155777 104581 47572 -38748 20053 -176921 -94545 439501 -947
15186 157211 227872 115094 164939 263222 -54487 -126278 44234 337190 -55476 168282 419006
15175 419006 135833 134285 121054 179340 394785 -136812 -23659 -51171 28264 289608 207610
15164 207610 192820 177409 256081 -72671 389637 -98920 96614 -114936 -280351 -247704 -19727
15152 40629 -58812 -246853 83529 64857 246087 54858 -11513 254528 168845 189284 -9166
15140 -107431 344828 86563 67999 197608 199778 -64549 110126 223126 15583 301720 -172099
15128 288065 -6393 80874 42208 98756 94425 348130 344843 320132 636227 531598 392625
15117 392625 97037 181463 -214137 110972 -37923 216879 -181236 99888 101606 170222 600102
15106 600102 91831 -10236 -75813 -57874 -238315 -126896 56636 64809 209694 18732 205923
15095 205923 551017 -74606 67644 301073 302978 88680 276304 287742 197941 -61810 -242986
15084 -242986 164589 174289 365216 263453 102976 399965 407303 160289 -127398 112806
15073 185017 84557 50840 279740 362127 340886 -32515 278323 308685 381762 421155 342884
15062 342884 136840 292978 114658 245552 56119 189135 140571 497987 -64768 609558
15051 377279 151758 465246 149285 161239 287498 243416 220148 483961 246367 316860
15041 316860 340196 332182 594314 509335 226327 452186 193775 286912 419422 185296
15030 797905 669768 577469 891045 859082 660116 399413 310956 389710 592123 254410
15019 377512 754163 448544 628919 512215 454433 536250 463733 533503 409085 587233
15009 587233 589325 154890 463221 281513 613241 327097 309225 235619 119690 697972
14999 697972 548844 409800 792096 522231 408625 346238 515169 180431 559600 414974
14989 414974 281899 629812 682675 304221 453598 396911 243790 666311 1027347 928549
14979 928549 834288 888661 550257 378341 760532 336337 78575 376305 906367 513474
14969 513474 509650 431317 349815 -105857 -52176 357026 632228 575690 334648 427584 139538
14957 612685 420967 151638 267886 293510 317051 352668 526257 257803 205428 371419
14947 371419 61903 43327 514504 533876 456582 814085 929213 563213 476610 458262 84748
14935 544009 166362 780990 542369 604289 532385 861305 744213 1295171 1277640 1218790
14925 1218790 1308843 1845848 1626364 1520865 1613541 1651801 1687305 1425049 1884470 2074957
14915 2074957 2214114 1596070 1215583 1345268 1098982 904587 724119 707992 461269 442249
14905 442249 634988 471298 571261 269033 339786 692527 362450 551758 158064 252714
14895 252714 416851 488774 228071 172427 699849 613785 596487 604366 401081 746546 431423
14884 431423 793585 895956 508216 534162 614291 770451 983015 640035 639588 612792 593084
14873 593084 351706 490244 413059 369971 487695 463849 428193 857316 811456 937895
14863 937895 641608 560236 270356 152055 443820 396517 680948 172887 426894 422325
14853 422325 715523 556784 589474 650280 819068 144932 887948 383790 731733 611325
14843 611325 1004414 1116674 1093414 820481 828400 1017893 975333 753118 750464 715297 840120
14832 840120 525595 214234 271224 618548 631448 599807 755623 417771 427478 664969
14822 664969 502566 824757 744636 612530 342520 794554 626057 854613 533185 476740
14812 476740 488470 630229 809895 873491 720644 748993 843475 960480 918023 1042727
14802 1042727 784551 945906 625109 923425 758927 623476 734674 604411 585954 491450
14792 491450 486108 480509 547298 709026 914024 677670 784895 717459 378083 779047 727493
14781 727493 786532 754087 646777 964813 714825 844732 1025105 748917 1026306 820126
14771 820126 1082547 646057 574076 490543 698326 830477 449031 990735 635409 600600
14761 600600 800968 762030 268620 408356 551216 616583 679390 781343 595310 435288
14751 435288 882302 690837 636142 776725 578037 686998 591712 797732 885350 565713
14741 565713 664575 1013086 857156 910877 659445 1116047 1119114 957975 892668 803443 1062313
14730 1062313 915527 1260728 1381495 1759647 1791476 1783521 1604314 1539582 1074526 872829
14720 872829 751856 1049606 1099068 591861 674291 988473 747321 966184 934446 964883
14710 964883 1014117 629768 1014929 780879 869448 845178 1230442 1084187 1390323 1749385
14700 1749385 1513892 1987437 1681225 1354359 978154 1139098 1051042 1175119 1117118 1050644
14690 1050644 847242 751081 810483 787192 1031245 1056732 1161172 1015176 1060698 1066335 1059284
14679 1059284 962636 963008 1252525 1066142 958107 942786 933490 911483 815465 1048200 1253739
14668 1253739 871282 1052118 923536 731035 1001914 1002741 1169812 923848 1099361 978921
14658 978921 1088890 964714 965836 1292956 1321356 1196538 1382112 1427714 1136197 1304580
14648 1304580 1656157 1494926 1095209 1326076 1196128 1127095 1263158 1440756 953656 1157521
14638 1157521 1116114 962637 1199842 1394374 1169216 1483612 1183794 1199200 1157974 1180181
14628 1180181 1424706 1343657 1778410 1270708 1015994 1461075 1524047 1843214 1277906 1237862
14618 1237862 1237535 1547959 1200334 1229510 1418770 1636050 1297120 1837805 1559812 1653678
14608 1653678 1595763 1547659 1723507 1179896 1556556 1728587 1753742 1828539 1968306 1754169
14598 1754169 1552405 1908058 1591879 1463771 2009868 1561340 1913962 1607705 1421886
14589 1421886 1871419 1814971 1834801 1849017 2087703 1575104 1899541 2236400 1838150 2173178
14579 2173178 1904577 1977557 1933744 1711939 1967400 2262153 2163454 1975462 1878129 1939617
14569 1939617 2230659 2523673 2100217 2092782 2275368 2571311 2432549 2274139 2232508 2393289
14559 2393289 3045323 2964102 3062333 3185394 3322091 3194185 3651191 4068096 4656791 5715283
14549 5715283 7135682 10736703 19700288 40492725 47039337 19771586 7531857 3471733
14540 3025154 2890105 3034297 5067186 4716434 2323898 1796186 2021024 1919163 2265513
14531 2265513 1950756 2313993 1958142 2217298 2391095 2221405 2293440 2449249 2493335 2364655
14521 2364655 2825624 2291365 2572561 2434640 2784148 2358225 2666402 2605876 2995321 2833973
14511 2833973 2534130 2746849 2857849 2839429 2816071 3230344 2864260 2932463 3142064 3133739
14501 3133739 3770278 3031301 3204531 3107857 3186492 3284754 3378830 3254088 3332987 3486523
14491 3486523 3580588 3301236 3385393 3607707 3721630 3608782 3683423 3691341 3525608 3713798
14481 3713798 3695498 3838162 3826839 3810305 3951217 3776335 3749049 4255143 3959642 4456791
14471 4456791 4234827 4383134 4595969 4706982 4607426 4607606 4547807 4699116 4604771 4715348
14461 4715348 4660843 4992424 4472362 4925884 4580931 4994981 4918516 5169593 5366324 5318191
14451 5318191 5272926 5162833 5392853 5396143 5656879 5603900 5591442 5794502 5621930 6055526
14441 6055526 5890016 5977802 6411428 6248875 6300449 6318776 6444134 6785707 6766576 6952455
14431 6952455 6882220 7085927 7029139 7345280 7561157 7483565 7493792 7451818 7784638 8096310
14421 8096310 7980157 8269936 8684293 8714875 8694533 8576084 8943659 8869665 8831778 9059367
14411 9059367 9441923 9277411 9403588 9502433 9676453 9664599 10081588 10973188 10591919 10492434
14401 10492434 10644187 10723255 10634020 11223181 11314586 11748909 11557362 11866671 11788320 11951925
14391 11951925 12303481 12717464 12722121 13114516 13384422 13720965 14201265 13875701 14682311 14988415
14381 14988415 15288725 15571972 15935192 15872752 16103145 16385763 16737241 17214391 17327075
14372 17327075 17379679 17996692 18440244 18458841 19132457 19463455 20273077 20604715 21006170 21206774
14362 21206774 21700461 22309384 22424244 22731106 23228925 24233747 24590415 25028207 25609428
14353 25609428 26256490 26930568 27673024 27949299 28971518 29509577 30467131 31290012 31937659
14344 31937659 32744469 33493852 34345880 35649633 36535337 37746817 38423370 39576116 40672973
14335 40672973 41967109 43199364 44309230 45343475 46961063 48555364 49973514 51767739
14327 51767739 53378517 54944750 57146713 59049628 60949938 63186028 65389089 67688640
14319 67688640 70444200 72784955 75360141 77718762 80908968 84104820 87755376 90965099
14311 90965099 94473837 98410265 102684257 106728730 111245559 116591424 121817526 127056833
14303 127056833 133036688 138855219 145234210 152208940 159328612 167134314 175244232 183562963
14295 183562963 192532166 201970396 212062221 222728017 233955229 246040310 257851575
14288 257851575 270923166 284062151 297862874 312069078 326377708 341273833 355873745
14281 355873745 370686300 385143916 399291715 413094159 425665876 437341442 447218044
14274 447218044 455656800 461634762 463433940 461895043 461129809 459009039 456105795 450931366
14266 450931366 443485029 433276045 421427311 408389060 394179465 379233098 363690693
14259 363690693 348087233 331999689 316645004 301707993 286667631 272640560 259173393
14252 259173393 246012731 233504262 221804389 211103410 201807377 191775404 182207148
14245 182207148 173260691 165188221 157332204 150232122 143017105 136594634 130163725 124849628
14237 124849628 119288736 114213738 109204723 104540601 100197737 96372770 92957669 89075028
14229 89075028 85701372 82286731 78857547 76426322 73341038 70470853 67929359 65573950
14221 65573950 63424078 61604179 59723647 57248510 55303594 53813925 51952439 50693765
14213 50693765 49284572 47716784 46007900 44579038 43444643 42465729 41340893 40283379
14205 40283379 38962335 37666200 36467680 35876629 34861430 34455844 33140089 32195662
14197 32195662 31394662 30409200 29738471 29451842 28778058 27727766 27220933 26299568 25673566
14188 25673566 24861579 24657221 24003223 23866753 23315869 22577663 21649162 21327886 21097925
14179 21097925 20605016 20409567 19931583 19323403 18886573 18388661 18081484 17736063 17426340
14170 17426340 17192291 17080952 16277051 16238463 16002630 15268130 15313752 14746309 14948935 14625940
14160 14625940 14281232 13709172 13733387 13462613 13274893 13050972 12910865 12516810 12498897 12146655
14150 12146655 12166219 11928405 11796255 11624122 11236537 11168842 10811356 10959613 10712776 10004314
14140 10004314 10117943 10287922 10179024 9804750 9817300 9473457 9541926 9394420 9254525 9052641
14130 9052641 8964018 8668145 8661750 8863801 8462330 8301285 8298410 8044724 8383971 7591829
14120 7591829 8202434 7758560 7630992 7609821 7204566 7577945 7077233 7239996 6875501 7074817
14110 7074817 7163385 6688988 6924148 6841224 6817533 6377935 6329910 6390601 6046754 5942379
14100 5942379 5881082 6327363 6115028 5985289 5345194 5705640 5417103 5631580 5645579 5325311
14090 5325311 5481655 5441483 5356603 5417961 5000828 5174390 4943747 5182648 4859505 5105929
14080 5105929 4830748 4742750 4715168 4569117 4790868 4722108 4855843 4379822 4766181 4497834
14070 4497834 4398746 4572536 4408554 4456199 4398142 4154686 4170406 4409890 3801742 4261564
14060 4261564 4319241 4338577 4157341 3729637 3778854 4016956 4004217 3679579 3774607 3974989
14050 3974989 3616670 3577135 3474092 3385062 3209831 3354991 3396313 2981373 3317819 3165886
14040 3165886 3081891 3389800 3460065 3140406 3049703 3492229 3092308 3138127 3353796 3166665
14030 3166665 3215194 3130886 2960523 2886433 3016109 3112675 2744694 2745707 2888991 2689791
14020 2689791 2630469 2593898 2822912 2630594 2968609 2652806 2763496 2381286 2229371 2436050
14010 2436050 2550569 2444711 2419377 2375605 2245744 2493772 2369807 2447626 2024823 1866922
14000 1866922 2022774 2235958 2189146 2227034 2401830 2263045 2178341 2425578 2154965 2421819
13990 2421819 2647062 3137424 5411065 11843024 30394788 50350642 28271491 13315435
13981 7663114 5726325 4733460 3997459 3926185 3479134 2976107 2986488 3057625 2789390 2557728
13971 2557728 2961982 2465274 2566661 2562911 2283956 2543962 2516101 2274026 2265589 2059670
13961 2059670 1907284 2279356 2238216 2180022 2190264 1756345 2104128 2085267 1859652 1608604
13951 1608604 1929490 1884699 2010785 1947922 1915496 2068655 2015315 2125961 1783350 1668898
13941 1668898 1560679 1662981 1980519 1738443 1597089 1575809 2239328 1991564 1705105 1583500
13931 1583500 1662677 1276276 1724428 1564301 1658745 1580577 1699695 1589864 1424786 1211460
13921 1211460 1317737 1276102 1340496 1375525 1514606 1733506 1780104 1523943 1738039 1414265
13911 1414265 1333929 1186029 1234744 1299984 1563002 1513719 1637600 1544578 1018636 1344350
13901 1344350 1551218 1158846 1433448 1196296 1300042 1171674 1549714 1608405 1368717 1353121
13891 1353121 1442216 1014802 1202629 1422022 1393649 953558 1217438 1387863 1371287 1382140
13881 1382140 1102252 1135689 1304610 1121603 1309956 1088555 1105979 1284644 1194353 1340094
13871 1340094 862352 1191933 1146899 939517 866395 1267795 1361754 836863 1257444 1125839
13861 1125839 1230948 920771 1187036 993876 1189307 1182718 1496700 1068378 940164 1109726
13851 1109726 1118798 814665 1066734 1215665 1165568 1267451 1025036 952077 1081987 718304
13841 718304 1049273 1002874 907043 733232 1046571 1013044 795852 1237702 893147 895631
13831 895631 837530 910454 1172690 482359 1057456 984451 773190 901010 569036 650730
13821 650730 391271 901340 1082852 918867 643686 916452 1059286 1000667 634163 930914
13811 930914 886706 930191 1088157 841469 494918 1040559 1080133 1051552 987325 627056
13801 627056 580130 937018 917534 776695 854109 824046 763859 679571 653634 879231 1015651
13790 1015651 812666 767312 981016 923442 800329 926483 659082 951892 926537 709056
13780 709056 781821 673543 650201 797448 1133844 599098 773238 966720 1023236 743182
13770 743182 572222 771718 566947 746271 759245 904676 806594 935774 921819 470325
13760 470325 600758 475192 483670 685572 829072 421574 782806 464628 665510 615474
13750 615474 629562 932030 590654 535400 932610 391033 801392 684533 550146 612389
13740 612389 890331 456386 722967 620681 424718 777417 860872 702263 363795 467629
13730 467629 696049 683383 699083 632078 577054 572931 677457 852227 203012 829647 787456
13719 787456 672014 584914 298438 209902 590610 170756 407912 397882 555416 459958
13709 459958 663181 203382 614428 215704 267209 473087 628553 486088 752739 461271
13699 461271 555905 899831 73650 331830 546637 429379 667380 355555 414694 324672
13689 324672 504066 337690 632180 567859 501862 750678 362732 230816 389698 475256
13679 475256 446727 588976 576727 500651 186990 626978 519904 707678 513440 707328
13669 707328 365656 467861 97294 502465 469191 370753 519437 664079 662525 211791
13658 492638 526026 384325 401391 31222 751698 387991 347876 464432 64518 532988
13648 532988 644423 451122 568446 102763 231455 340649 120413 552737 477400 371204
13638 371204 408628 734852 459049 484231 269222 380450 680866 393052 204431 195440
13628 195440 653426 371305 194825 288425 480818 343751 120021 485185 412346 572136
13618 572136 593728 351825 329617 655768 624169 363571 258386 360216 427092 53535
13607 670058 -171185 365679 401474 769416 406088 416054 501813 577705 309901 501931
13597 501931 273062 639410 503429 466434 172643 240143 238527 303673 418046 201483
13586 438204 720197 173722 128006 225726 51510 235309 503678 675120 345222 45651
13575 810918 246456 362267 371966 47520 132883 369700 213128 236155 254011 317024 459146
13564 459146 380218 411407 552848 134301 144209 155351 530215 494173 341781 437034 512720
13553 512720 8757 393632 365372 505439 -35613 230435 554805 417163 -103928 209911
13542 128896 337323 612011 336714 -19003 396142 -72665 399339 274860 396122 479397
13532 479397 138767 506405 309667 516736 109272 419753 304705 -41004 183065 387960
13522 387960 271603 47741 52049 111492 540832 479726 273582 465943 246084 426546
13512 426546 468415 6854 281046 203968 365236 379101 332068 121410 -116150 536326 142923
13500 36271 699232 -27002 321899 208030 273104 518377 273349 169036 299799 635734
13490 635734 243153 223231 212870 509734 662471 252292 -90444 362837 383120 142007
13479 309094 195801 432568 22305 351193 37293 431503 282480 175236 268864 -44551
13468 118866 373706 114770 245120 143379 -40299 224756 18620 22701 403125 352879
13458 352879 421053 48374 39299 591331 -38316 227648 106200 288915 146010 242579 209005
13447 209005 230561 337566 387953 90914 170566 552859 404834 454154 219748 262388 196046
13436 196046 17897 382583 -8806 146256 277124 75029 209682 197287 369045 170215
13425 378741 138619 267871 214033 345781 85626 280288 -132318 -117558 408263 317058
13415 317058 265988 288625 4027 585474 72505 277506 160884 192583 177627 86252 163728
13404 163728 233280 148790 316997 178181 25560 -25660 13865 118187 201763 317757 86130
13392 237047 44708 -258645 570280 197582 59931 256979 -191270 214981 320965 19624
13381 292104 488361 -70995 156419 112951 206334 268256 -14775 430616 54726 267078 387236
13370 387236 131636 136300 451597 368904 364746 258025 292866 508111 -120331 557259 501109
13359 501109 35660 321518 271443 118985 159603 218881 562093 102535 298219 29896
13348 51059 294795 317869 203065 294960 75761 468542 545567 338653 344424 234821 696452
13337 696452 385131 52742 221461 207823 281037 -137828 274986 362292 155059 7544 536049
13326 536049 410033 131946 114019 378311 482884 101404 -85786 62908 332745 443887
13316 443887 132343 324709 352226 341021 537599 -57051 251744 407442 224732 93005
13305 236882 311864 161245 -114618 421201 225766 217148 412379 21231 139985 29923
13294 167789 249711 99527 132861 -9298 213344 475995 280998 237011 257721 320569 -60496
13282 348752 325608 -130253 439734 -60731 68573 191591 301550 -373163 16558 65833
13272 65833 155818 60061 125796 71828 -33052 285757 250775 -105809 -103211 -15777 231140
13260 209986 141234 -81334 195483 -128321 91563 -192611 137389 -173091 62187 111621
13250 111621 373744 -159361 889 184215 251444 209380 -90246 246962 12212 -78725 132952
13238 156897 -162234 -188510 366372 -91651 65365 -109479 -63283 50043 110845 112521 296613
13227 296613 338496 36298 82235 16074 95639 122083 152932 -42243 1974 314121 386463
13216 386463 -23914 62811 -21711 181894 -138526 180764 -41057 118942 179291 296646
13206 296646 324046 44774 -18123 -226178 -54339 -172760 198860 65546 -94495 146892 92763
13195 92763 126819 28953 93263 220952 277459 -95368 66700 -99432 494490 -36215 154309
13183 -21058 -87426 213839 59421 13458 227225 162865 406946 139227 101875 202520 329733
13172 329733 273387 163952 21543 253066 67685 65261 152948 -204079 -131750 203119 -34180
13160 -54294 6746 -31937 142501 15202 79352 -248441 -126422 -76460 -117411 339227 -108404
13148 240815 48718 261244 -27288 -69943 117747 340870 98550 -79804 282687 195118 -93602
13136 36960 11860 389085 -24071 103198 7912 393435 235251 123827 284329 205082 307163
13125 307163 247555 -107765 99119 -214329 190885 173178 71529 333046 -113051 -231439
13115 -231439 29438 158143 198641 174935 -199743 355858 277230 338342 -66447 -208630 288369
13103 -49373 188505 184885 321768 -55695 177375 124899 44763 -8182 299739 -13137 23974
13091 152766 201632 -195886 29080 -33015 -106551 88336 399087 130256 -279504 63256 -74639
13079 10107 -164095 -253016 -116748 162134 -150889 -8491 563269 300734 87077 34622 85923
13068 85923 135397 83103 274499 150600 -202814 -87971 296140 419696 -87624 343302
13057 137262 -37027 41203 -200820 37842 56235 -46081 54211 250474 61988 280124 197383
13046 197383 29665 508594 -146184 -304562 237947 53540 64204 -325648 -59362 192725
13035 183115 -175733 231884 307468 -20716 21815 -94992 -3713 145030 76050 -281743 113981
13023 -138099 94482 339212 128425 135127 -174994 226179 -113387 126245 116294 264330
13013 264330 97856 138937 172415 346832 -139789 222332 36011 307135 294155 254620 -111507
13001 285386 157512 -292954 -160903 90759 -207802 -10838 104909 80791 -148184 -254975
12991 -254975 114280 41562 194055 166163 57145 513433 184620 188194 240042 -281723 106365
12979 382539 -216196 -128859 -200645 -160742 211466 27467 100393 104444 -24354 58105 253706
12968 253706 26857 -39974 -93827 98119 96330 -58806 -76645 97439 -440583 30947 102510
12957 102510 141332 -45250 7701 143976 39196 -109768 -248360 358324 -130502 60284 -150295
12945 44726 217908 -211615 107749 -104876 19515 84840 356942 177319 -75595 -43732
12935 -43732 -13317 183561 112513 88890 56203 259431 -119618 -69472 -113101 -40226 91146
12923 -211217 -72016 245797 244803 102432 -389978 -193073 -90639 -13476 -95085 10389 -247512
12911 9764 -51225 359837 -37136 -179253 25127 -213465 -102718 -174487 88094 -80193 -243128
12900 -243128 187019 -70495 -22636 407812 108711 58201 210665 175392 -92914 -404997
12890 -404997 69466 262294 9033 -38530 181597 -59635 35274 -128763 -208837 368282 109531
12878 -82182 19340 54227 189348 189022 -61877 127976 132931 -2809 -285388 97429 -145435 111001
12865 -50523 485528 77315 164993 324016 -12825 424227 155284 179157 -52110 -139082 -95941
12854 -95941 115676 -207369 207523 56183 40128 105470 -91957 -116893 30342 134225 147327
12843 147327 -251286 -3926 -17293 92890 39075 -66585 62863 37987 -3044 -75801 33524 5333
12830 190299 69330 -63218 170792 70437 -68115 194354 224391 -9573 8807 232689 -101206
12818 144107 -11281 -59329 -25723 -281998 -160187 -47223 75667 40966 113755 -205172 85404
12806 141014 4707 256244 51591 25097 -66812 -51816 284069 277018 11494 511356 93907
12794 153096 -28531 -261016 -174597 207372 84923 -27011 -140277 -131254 99527 109439 -151189
12782 105036 80394 -57259 91143 109905 -336505 -77661 -244871 -350117 -51934 -58576 15397
12770 -99123 26952 132670 46978 13134 172391 -46887 189622 -90192 100001 70370 93569
12759 93569 -67455 101845 121506 181683 -122220 -44896 -139613 -19456 -62965 -38121 90203
12747 106590 -291136 -414697 307242 99702 -132004 -233535 -222404 -221174 -196567 151252
12736 92781 169186 47335 -54493 -72655 -66241 13178 313827 1511 132479 -70944 -157440 -325194
12724 -325194 -6997 -54597 121589 99305 279248 312719 -46316 39589 -138067 -9221 180443
12712 -127335 -65581 271977 273755 227183 360365 128257 317925 -132238 141020 -157736
12701 -118198 -36123 189631 181624 351348 -65893 75261 266872 -39137 -232998 103450 249222
12690 249222 -3992 -57441 -229829 -323341 216971 -53854 106235 8695 -258278 280698 584894
12679 584894 -87413 208222 -4623 185769 69019 5867 108794 112795 41183 54725 -310873
12667 98318 163380 269607 308051 -209364 195727 218043 12067 -98771 269670 104862 -75202
12655 156409 -59465 240740 66569 -265478 -48382 226435 95422 408980 443297 200223
12644 -98900 -47694 -2418 56917 178005 -286170 220322 203943 -120135 263760 6580 -1667
12632 41343 355386 -1045 -50368 68956 244240 295935 -13812 155755 13188 -18345 -182266
12621 -182266 -3128 -102316 -21214 258409 333574 461996 111896 75081 -139141 -134485 -57796
12609 60940 -150942 257725 -53584 47431 241698 34409 64031 -253304 73435 -268630 14432
12597 143051 257043 22751 173302 -371132 66400 206576 -93202 -103983 29061 -3559 109791
12585 12683 -72257 -276758 75462 -49254 -170757 47137 191668 543992 59596 258045 129774
12574 129774 -7076 15612 152766 -254954 32430 -120361 24285 162232 -100837 83524 207842
12563 207842 216669 -212445 -33163 -333751 -86962 -6804 -155770 102448 -147827 -16725 217310
12551 30238 -277914 -346758 -366191 72669 208262 107724 -78678 -94625 91756 -171597 -137836
12540 -137836 116069 -135465 -119262 -176632 -284758 -292826 -167999 -118475 -138345 -64079 68022
12528 -266037 119449 231373 -488100 -213749 -333003 -219203 -66449 210603 46265 -105698
12517 324450 -98778 -360210 47408 -113764 -83799 20840 -32226 104825 -189416 -335308
12507 -335308 530375 142133 202644 130542 233498 214849 -139733 181291 261717 78074
12496 62319 80495 172138 225497 227616 -128221 77173 -149952 20574 263242 17015 307966
12485 307966 -143397 5830 153705 46889 91340 306047 52612 -5676 400670 220403 59492
12473 393949 176311 216890 141726 62544 -9244 147531 -30000 83328 -184863 164398 -252224
12461 175356 -271172 150604 -90164 -26239 179138 -132970 -65252 -172957 -145884 -42098
12450 -174946 -28007 96209 19569 35392 123975 106150 -116444 133414 -57757 -187859 -96286
12439 -96286 -3719 232640 23811 312253 81114 8192 -50301 -45267 52824 136589 -98842 -93503
12427 -93503 -34632 -387243 -57210 222472 150060 42651 -66835 184028 -221981 126707 116464
12416 116464 -133836 -184343 -350008 -39142 26940 -1862 -220563 -63943 -591 -272680 -116454
12404 -423729 -75812 -123433 65846 -106082 129097 -67897 319810 352801 -248113 -120227
12393 -130976 -31095 -159809 49603 125411 178894 323989 -334579 173945 428505 305971
12383 305971 90563 128607 -70221 -89150 37166 -19583 -73991 -121053 225781 -83720 390285
12371 -308110 85501 106269 198733 -172403 -511671 78389 98447 -120254 124247 -67296 92947
12359 -125979 -62269 -249494 -217772 -1905 -12516 270379 -18572 -239785 -170692 407586 139736
12347 14515 70634 79041 -159216 -286594 -323874 -123172 -124650 -88423 -222118 -51881 98569
12335 -223694 -2667 -120341 140251 194842 333730 52627 4167 68659 259974 201401 219514
12324 219514 169739 219323 232690 181382 92576 432203 316854 -92141 217393 31652 279591
12313 279591 26935 109220 329217 56086 147337 -222025 -380963 -115454 345017 141870
12302 479322 267300 255322 84482 100220 158721 82512 165428 80599 154897 -50499 60267
12290 -105937 122255 -189411 107618 112020 231673 298572 -101855 -63683 -37729 280841
12279 108937 14451 336524 345961 309984 28151 149846 56425 -35192 -260748 46569 285670
12268 285670 287510 -51957 231041 43743 319719 352935 159902 108471 260374 181040 -204145
12256 -111132 28797 225229 197160 176970 315258 154673 258068 352865 269743 85108 319030
12245 319030 244974 -71833 109910 -42157 -95648 91626 193653 -73351 128522 158486 28539
12233 102488 107786 21358 -161618 303547 51589 231167 17175 946 485825 472434 512866
12222 512866 283568 398618 439051 355406 299108 111995 399081 -90605 13911 148783
12212 148783 137796 298421 251661 83889 73123 14591 347011 194798 260761 182645 221053
12201 221053 84708 -41643 180104 253874 -122621 49431 -341 378147 259283 552817 534160
12190 534160 267267 465351 258097 208137 365062 -127528 153595 63007 -70520 144641
12179 -260043 56210 -44717 159138 385378 235709 93382 317557 248302 242428 269716 297688
12168 297688 296572 20700 -44041 -34889 265759 310604 61625 521161 404469 262211 70452
12156 -54438 142434 37492 -101455 -58659 -21079 144069 91000 116906 233184 52233 103186
12145 103186 194846 332029 144784 277275 175098 72448 -87796 156507 -156331 102914
12134 -47338 116761 221660 -123454 33513 -30114 -6595 290802 -30294 451545 57844 118599
12123 118599 -277772 316128 -130744 -48236 186124 -199163 48161 -167834 455584 52552
12112 78183 276029 -71116 119473 -383958 -81348 40266 -155431 20047 -7032 67005 118561
12101 118561 68510 -53801 123296 153150 58230 -171111 -91246 -301075 7225 -184670 45087
12089 35792 150311 225789 314064 90598 199230 5555 80573 3996 248732 -104992 -193358
12078 -193358 262979 -85164 -132133 214479 264661 131345 370236 278389 63522 174890
12068 174890 145245 450958 -49834 164933 383469 170124 329621 -9635 -11359 -180909 388008
12056 -18294 -134589 -325607 40018 198858 113719 -181589 67273 163065 199785 -19890 130586
12044 -54867 -65620 -27123 -280386 38523 -185677 8814 -8684 -24027 211062 204149 256008 38081
12031 61016 191835 234578 32505 86964 255129 5106 -207871 10498 75479 136528 -21174
12019 75898 164054 -135211 -94850 -55876 205615 41408 -58508 171385 -88103 -56160 123681
12007 204358 -90108 -228899 244966 3543 94536 146521 69568 188033 406558 -463775 -98776
11995 -235496 -2069 -75038 43686 350966 8186 -274145 -63651 -223076 36639 176735 1329
11983 -132818 45899 121008 -61533 -182267 249411 -84136 37346 -282194 -167310 134096
11972 -13698 146129 235407 97484 -209335 270914 93938 -318206 -148865 -226096 -56757 139063
11960 101518 176006 -53386 -105475 -277861 4271 203180 -180704 204154 -113410 49325 163536
11949 163536 102639 127636 -126250 -80351 -40539 -208640 -165053 8243 -41796 96722 -240342
11937 185344 49153 -237727 -2860 -198325 254035 -371489 4678 -102823 -99884 73336 133370
11926 133370 -170651 -24743 -31637 48602 21424 -80148 -62141 78040 135879 33812 27581 147248
11914 147248 240526 -144397 -202188 267761 -236912 62125 9403 -320697 -230850 -222599 186212
11902 -187576 178127 324504 29804 -65783 -171217 47838 56588 124680 -27366 220226 3661
11890 -13691 38449 -216871 -38544 -180347 -220010 69912 393747 30949 -103770 -92545 -73045
11879 -73045 -275649 -131657 236899 -57926 38820 -15259 -207860 -167038 90959 -97131 -379950
11868 -379950 163849 58954 -83115 90502 -223850 46270 112876 -264055 -69606 55150 -183647
11856 238707 -248674 -30242 8396 198807 -222183 -41665 14770 -196751 229848 110165
11845 -188651 134488 56477 -72510 -194523 174161 -24205 -42163 80152 187372 94262 -515724
11833 -300345 -22935 -336121 -94519 -78904 266385 57565 84929 -153450 -44503 -43192 -34909
11822 -34909 -120748 187768 5224 -214142 -175943 30686 -248584 63167 217091 -170585 -127874
11811 -127874 -339780 -5662 81551 186215 169525 212708 441868 -18916 179871 -83313 37200
11799 -870 108169 -61994 -360861 -34351 -84225 162000 -360144 173219 -26436 43680 -4952
11787 -225112 -54775 -114392 82964 422 -288998 -41181 -245694 128159 -53226 -108188 -179276
11776 -179276 -45989 -24381 -139827 51473 84443 124840 -47379 -215900 222407 97490 -182923
11764 -141252 -49706 -218328 -85077 -104165 35256 -198779 -187356 174820 -138342 -64409 207576
11752 -45960 12370 -161544 -145761 254266 -168556 208319 -144159 -274164 -11661 118918
11741 72830 -355989 -208503 76957 -87615 -168059 141471 -145805 267120 155601 94801
11731 94801 -172283 -140377 65799 -316262 -280712 -15987 9654 124368 103134 114854 -128283
11719 225135 -175894 -271896 204590 50098 140042 64669 605 -222729 -165644 48081 -107263
11707 -337298 -151827 -41628 -5425 217500 245705 -173542 -39522 115688 -39351 278057 -390640
11695 -38358 -21490 4545 230771 32015 -95651 153099 47688 18983 440860 48472 -311627
11683 168016 -27938 -77908 -3096 38718 263766 -105487 -217697 -11593 128642 -92296 -105116
11672 -105116 -558690 -126983 -2995 -233119 -46007 164667 3162 -117855 -225582 -86134 85202
11660 30565 51906 482316 -28257 265249 206295 55912 -113658 -28477 -116710 -5510 8305
11648 14141 43110 -161327 121242 225069 -49749 25649 15938 -80514 -350313 -100399 -190299
11637 -190299 197307 172888 -7217 -175539 -389197 141201 190291 178308 290951 150292
11627 150292 6546 31309 31701 182954 -73788 -100849 -25493 -256061 242895 -2572 380309
11615 -33962 56046 -260909 -69998 311969 165246 -281948 -23096 34781 260255 183176 99871
11604 99871 77271 -174657 261467 -80013 207041 -148650 365337 -4525 211776 -6142 200570
11592 177705 10951 55594 39796 70705 10967 213208 -4046 21540 -141203 132560 80012
11581 80012 343006 57322 254818 165747 3192 298595 -164633 -89819 -227158 127311 9040
11569 -288173 -38807 485061 61936 102486 22317 149890 120414 -18 -71268 56627 369143
11558 369143 116795 196369 -100610 -102191 -177840 74619 -38488 -155215 196080 20958 -77847
11546 113843 166372 -169743 -108431 57093 207809 284842 7477 82178 -18551 321 64873 159519
11534 159519 192279 -17551 151904 -152375 95651 -264502 75979 57421 47774 297608 -289930
11522 143447 40466 -14762 110948 12032 69178 -106022 132914 -167674 100273 295734
11512 295734 159753 -50021 1319 148613 205930 -83814 228274 212487 -5869 277051 -95090
11500 169716 292527 -147242 353110 196825 -202568 246472 -101585 170754 262911 105467
11489 234765 -69956 5012 -23283 136947 138714 318273 178435 -50532 3259 345764 153020
11477 213049 243814 17465 -14387 211635 -21470 111802 183220 12250 106854 7313 238703
11466 238703 228823 304429 3296 133399 448362 211815 -172532 39932 333119 -55384 -74737
11455 -74737 -228703 171533 255958 231644 183754 74939 28169 -57347 210656 272971 -180160
11443 390278 61654 226864 34961 -14837 -25246 -16104 229661 114894 72830 -131836 -118256
11432 -118256 149421 91053 111676 180154 263541 174439 15889 -161944 -25866 131998 1535
11420 -83716 2282 -336982 -44996 64073 -36057 250656 -164552 104857 -211218 -132756 255028
11408 162109 -60616 178489 46740 -79033 142526 -49662 -189443 -105119 -94072 -255487 169190
11396 106224 -90914 171415 42140 89628 57463 215781 244550 -67048 74630 32090 -44403
11384 -115131 110238 -152883 286988 65809 107881 -351452 136654 7336 193472 226055
11374 226055 -147510 -68678 -119606 -242513 109551 -120305 30899 53312 163452 209902
11364 209902 -123391 -184863 12708 168159 214566 -32880 -27350 -91579 -40632 231849 22564
11352 50776 70322 -338870 62902 8249 176162 -211303 161752 -44772 -307561 191542 2783
11340 319390 60179 -179263 -7755 -104687 -102043 24977 -48955 -64827 27500 -118561 -318930
11329 -318930 -72433 -273014 -89525 -200577 -23375 -106587 -130874 -310583 -114114 29271 196135
11318 196135 -41113 -80449 -177788 -280209 -17818 -191767 -165264 41318 75810 -406978 240922
11306 -374748 32767 41403 -119204 -200807 -194178 231294 -39119 -111108 -164380 20581 -301254
11294 -49665 222223 -93787 -34168 58455 -272352 -97674 401221 189382 80051 -400178 49520
11282 -90287 -310797 101966 -238440 -967 -239706 2059 55630 72012 176989 87320 97305
11271 97305 -228478 9791 369270 83529 189462 17874 -62650 271219 103853 -81621 -116226
11260 -116226 -271119 32764 -472204 -236942 25732 -372793 109095 581613 62279 -352118
11249 -22516 -523 147310 -126807 304279 -315646 -28862 -197647 246581 82510 -193729 133384
11237 299595 -83751 -214707 -163659 -127985 134653 340546 -71281 57612 390 49414 -272062
11225 15138 -971 -127761 -312742 -170030 -94652 24079 32231 -277989 -19728 217550 -384773
11213 -68987 -79189 -73650 -166035 -307139 184877 25100 -59524 -115532 52989 -377473 -258047
11202 -258047 -190342 -292012 25583 -13646 100282 202261 -446385 -240672 99669 -158825
11191 -23991 -281015 -13237 30021 -179073 234459 91994 -371779 -93554 -58101 -36858 -428915
11180 -428915 67628 -163202 -11433 -121044 -177031 -21631 -328829 277826 75132 111094 231313
11169 231313 -5428 66272 -358755 -34450 -64908 -40755 24070 -228819 -243505 -78886 -158437
11158 -158437 142073 55827 59493 -101329 -189593 -10240 -140994 34114 -368595 -331667 -114700
11146 -79694 -21389 -107020 150319 -78213 180335 7366 35922 -105907 23317 138997 175154
11135 175154 30113 -71902 66180 61123 97386 -150366 58117 -97735 363756 87824 189017
11124 189017 98968 160555 -134920 128736 87550 -85379 64158 243982 -81514 126894 -19267
11112 293150 -193195 -160527 68645 -2947 -157667 345322 177010 -99078 177781 237355 152960
11101 152960 204334 303693 252105 145927 47188 423292 413529 417198 237519 499564 288984
11090 288984 -93535 22545 112610 249117 151828 60267 172180 328931 72362 90671 295996
11079 295996 394258 195290 -91279 74050 -61057 433429 27084 641115 189012 385231
11069 385231 19100 311130 147063 548689 518842 433460 412151 98249 557101 518921 656654
11058 656654 549740 524265 1032387 708127 599733 755764 1131765 663795 418753 441406
11048 441406 495326 1077877 1218032 983138 676829 1101873 884608 1025772 903298 1080501
11038 1080501 671059 740201 846898 1026280 840704 866467 686708 790696 1015827 1114735
11028 1114735 807229 980183 940971 857274 751012 803612 1119702 876162 910508 834439
11018 834439 991985 815881 607722 519861 698401 805305 702425 864911 607899 920385
11008 920385 788756 600537 858656 791971 749609 553519 986566 782968 1011523 552221
10998 552221 677764 559866 798827 1263519 787161 906054 833533 983464 486350 1031365
10988 1031365 776303 690662 999073 883682 660547 1046596 861635 945121 1184378 1276823
10978 1276823 1103698 1261592 1113553 1622884 1704014 1926653 1751252 2393026 2789457 2964967
10968 2964967 3047798 3097030 3368602 3184345 3312676 3273463 2431200 2363718 2188343 1829527
10958 1829527 1880760 1514638 1537008 1506559 1520928 925319 1376335 1388392 1203412 1219392
10948 1219392 977089 831855 552186 208809 537819 448104 276238 370664 273328 159969
10938 159969 18002 -232596 147148 33681 179282 270893 184754 154423 -66736 85968 615396
10927 615396 -358475 82449 251521 41115 124439 251924 -102558 130084 -179071 2083
10916 -126843 123686 94175 -93228 166992 24177 236684 225149 -88893 -25816 -154701 -139704
10905 -139704 -268949 181933 -54609 269943 -102247 73122 -4200 264601 154114 -13352
10894 -450791 36710 85965 -276393 233091 -238633 -151039 193831 -67726 108820 -166136
10883 -20016 -266873 160608 232387 -69828 -194568 -237756 161150 -187458 32922 -205773
10872 -216879 77051 151630 48449 3136 78691 189679 -248968 -98158 26245 295372 -395521
10860 -91879 -19805 14347 -179078 -44238 178143 54978 -284474 -12985 -152563 12742 33497
10849 33497 37452 -359339 -100486 -33269 116882 257490 -216345 -201852 -50042 -345966 -33271
10837 -241972 -314574 -133429 -45200 -171302 -105 -295813 30559 -81351 77807 -137584 101735
10825 -167405 83012 94234 159909 18842 -98519 -388774 -180742 -15982 -502270 22185 12312
10814 12312 -225739 205613 -525391 -103464 20299 -353976 135457 171563 -26535 -135852
10804 -135852 -76046 -6187 137870 131519 -402358 -172196 248397 58482 207974 118009 -178575
10792 -99355 -98842 252380 -137533 -418351 244051 -45135 -387296 3760 -179267 104190 -149134
10780 188293 -86401 197040 -201341 140575 193644 -37071 116936 -369949 203367 36523
10769 2268 299666 33863 -102908 -192869 145733 237418 51421 -325986 2081 76848 -246184
10757 158860 -370097 -230099 71500 -190962 -370338 -148889 114683 219802 267116 -110027
10746 -93635 -80882 18034 -22628 -81634 -290747 -75309 160390 -7043 -12774 29612 -47921 -136790
10734 -136790 278555 155522 -48679 -80859 -81870 -117245 -364326 -57997 11406 -179050 -95282
10723 -95282 -261144 355185 -304977 39569 158003 -66220 74732 56075 -178649 171959
10712 -294055 130013 -162412 -100667 205614 -44442 140863 193271 -81787 -108280 -204809 -7339
10700 -30922 -286321 114522 163838 -393853 177534 -193667 176754 352056 191916 -31109
10689 -257686 -275710 -82789 83013 -450350 -145786 -32650 218334 -298284 59264 106321 148635
10678 148635 -142679 -7112 12578 -122414 -112739 303457 -178147 -71938 153145 -23027 -256899
10667 -256899 -75854 -183876 -351306 -86487 -39973 -143578 147908 31477 -42469 -246759
10657 -246759 75760 -418952 -79502 -105196 -44338 -11411 398060 -181509 -207754 154749 -126524
10645 175580 -228032 29178 -513711 120780 4524 -192426 146068 -362450 -203129 -105302
10635 -105302 -271457 285636 14797 -102423 -1435 -265262 266916 -45344 -192907 -261086
10625 -261086 -80867 62228 -121047 78753 163962 -480062 -84262 -94316 -118432 -288349 -108037
10613 -250391 165176 23236 107967 -201906 -95557 106511 -201139 -269968 -222323 -111663
10603 -111663 89434 -115980 29398 305588 -190405 503476 -515346 -168666 82814 256057
10593 256057 -98264 -157164 -31899 -331034 76194 501209 303334 -8423 -163930 -65742 164418
10581 -149665 -135273 -18004 -177152 -65097 32449 -259648 -89386 -279088 -134856 -59982 66767
10569 -196148 -195475 -143008 26198 374596 155391 33809 -108967 148611 -128284 54598 54775
10558 54775 45359 125593 -66575 -55830 228668 4860 -154019 -298889 -264143 -129926 -119015
10547 -119015 75933 61906 -37103 -142005 227371 33213 53410 -100453 -70781 110451 6970
10535 200621 -149773 103958 -164105 -72080 83778 31873 -103434 -81683 -335254 -30415
10524 -151493 -79662 -181516 -151017 -12133 47998 127496 -136721 44561 -188578 -233786 168288
10512 -100777 29302 8612 264388 -89540 -167876 -364631 -79860 -227835 -366551 144488 -217805
10500 -198265 36708 63875 -207488 -111392 38812 -358448 144934 -128716 140446 28501
10489 -197422 -70051 -396487 -347621 133706 -98587 -330744 -228244 -175801 -575 69343 -32946
10477 -11758 79620 29407 327759 354398 251164 157060 96111 184266 23212 147075 -112274
10465 6219 207408 -280807 -17046 -45528 -283832 151848 -254617 -75266 -159192 103553 93733
10454 93733 -111676 124584 84680 -149132 -37425 45109 79147 -194396 62782 -189292 129446
10442 -128188 -22759 -232123 144281 45901 122068 -176077 96427 35701 -45324 88831 -153363
10430 -96684 -102972 -109725 -33981 -238157 -42103 -175161 48767 -192576 87634 100927 172056
10419 172056 69235 -158399 -15095 -295107 -68979 -355696 20388 -185693 243149 -21949
10408 -222645 -132436 -310957 -299714 -162651 307342 122461 -14144 184714 -140943 311099
10397 -126121 79694 56152 -119267 -220252 296042 305842 358570 94429 200632 35260 505602
10386 505602 346433 187670 248121 102374 -300414 44703 184609 204561 36759 401696
10376 401696 -155118 241225 213310 313857 18113 77940 182703 364314 260528 315523
10366 315523 554648 576933 505337 681795 852742 883066 564652 547655 405120 120986
10355 362804 -57762 244243 374407 56846 457174 399955 489439 496197 409688 576583 344515
10344 344515 285909 357334 347634 353143 374878 450391 69913 152696 197217 350912 45229 24700
10332 24700 223090 623714 -70143 104701 -285751 152241 -69052 75402 -67545 178504
10321 358254 25696 317638 -306226 -111017 22904 140311 55175 222084 64928 29093
10310 -125529 104475 184740 249129 287578 -71799 -106454 -52361 -49166 278297 141146 103678
10299 103678 207759 82172 129916 -163728 263519 -271251 -21825 -163546 59147 -110309
10288 -247795 -32416 -301422 -97743 101645 29620 -298351 54938 -44068 -245906 -248864 -31040
10276 384714 -113591 -180367 289580 -234773 -57731 274265 88505 -14743 -388254 -239447
10266 -239447 -25227 -116379 376657 -256481 211733 146291 -54727 217477 -254370 191188
10255 188828 26814 296070 333005 156353 69346 167789 201750 375654 373094 -192862 58331
10243 6998 -195181 -207806 94170 45838 116016 -103429 89066 -320611 -1213 -259309 -104965
10231 88170 -250237 -219934 37328 71022 -313429 -213194 -47509 -123988 -19953 -270480 -151634
10220 -151634 116367 3539 123753 -48221 100349 -166081 -218496 -57305 -12045 134964 135696
10209 135696 -721507 -125488 -79640 -278742 54704 -217460 -73141 -122967 -197230 -193350 -13282
10197 84533 -89610 -122652 -79475 -11971 -195374 56174 -6387 -111436 -157848 -249629 -176439
10186 -176439 -161100 75576 -207566 -2384 -64198 425403 142674 31765 26955 214267 -196743
10174 173475 317062 -73706 -316946 102044 -53044 37529 -94835 3940 -124062 -210697 -199700
10163 -199700 156946 -164044 68810 55177 -60513 -366818 37150 -127251 -44280 -303588
10153 -303588 -201012 -269919 24548 -58038 -257246 -44199 -340511 -228968 136719 -329338
10142 37671 -250679 -152370 -344856 475227 -291786 239008 -259314 37958 -250564 -142047
10132 -142047 227697 -89877 -85368 14641 -132510 -16722 -402336 171152 -22714 56667 83531
10121 83531 -275746 -71742 11785 22769 -95552 198934 167120 30483 -78649 -333420 -280019
10110 -280019 26855 242670 -197786 -277938 36543 -19283 -345001 200959 -304181 -357045
10100 -357045 -28601 108231 -419226 -311767 -274087 130000 121071 -11592 124 -316079 -26359
10088 184868 -334293 9388 -111882 352300 -59402 55255 88552 -69742 -249930 -222782 59097
10076 35327 -392527 379678 -140599 -84715 -58201 -495895 96007 28872 70391 -152446 20976
10064 -351754 83609 344279 50894 -207483 290839 -83924 -94967 -130350 -250358 92078 -221529
10052 101925 -30999 -158821 -420973 -177108 -70310 -28514 -115686 -99492 -91312 -282044 70053
10040 168553 -409132 702 35483 -631412 -7274 266038 145943 85342 -30557 248870 -283768
10028 163078 22418 -374760 -84207 -61245 -126482 -379173 35575 -38631 -277567 -67832 -92555
10017 -92555 -37125 -10241 -10919 -67236 13045 -104511 -285118 -103971 45609 76537 -54696
10005 127923 207791 -46529 -164329 -143859 119126 228731 80488 -324428 -337127 -140563
9994 -399545 104980 405425 -275287 -304125 96374 56951 -84836 -334224 219655 -74290 -59764
9983 -59764 -85245 27867 -101545 -37378 278487 -180385 -294048 -46825 -131282 -92986 -283571
9972 -283571 -11966 159526 -140889 -33595 304580 -483759 -11210 270584 -207019 419939
9961 -225201 -215200 124856 -249764 161440 193460 -139762 -90152 -74553 -2523 45880 147723
9950 147723 -403210 216887 -240275 432797 8796 34339 -16451 -65882 -127522 -108725 3308
9938 -217986 15598 -367548 -43673 14972 -388887 127486 6335 -9336 105552 -181799 67527
9926 -165402 -260372 43891 -195686 -120730 -371268 13827 -143640 150140 -269683 -216304 -247020
9915 -247020 -18106 -440390 -102493 -180154 -9215 -406554 21896 21957 -172265 -1434 -358836 -136498
9902 -302210 -168289 150916 -103806 89442 -93661 -250842 -7889 -219246 -385919 105388
9891 -181208 -606461 -354281 282112 -66052 -88680 -155047 114898 -49501 140943 -73360 -118878
9880 -118878 100398 226264 -191379 -165372 145123 -261250 -93271 92564 208489 -155599
9869 96698 297545 -235076 -223705 -190078 -185137 -67959 71570 -410020 20025 -306220 84044
9857 210445 -91311 142740 -36547 263135 -61226 -43737 17505 -227546 -133359 -247007 -3098
9845 60682 -195024 38526 -160002 -160779 -38298 149966 -145237 110256 186394 120951 -146354
9833 -23059 -5144 -54351 -67948 -57919 -139331 123784 -299559 -150633 306141 146975 86745
9822 86745 -53756 -180165 274605 -178821 41566 75934 80211 21727 -348072 -198581 -142015
9811 -142015 -179039 -322589 89926 -14703 176883 -256361 45360 1145 178228 -14354 -253402
9800 -253402 -501729 211848 149927 7228 72281 -115286 282399 129689 -15984 1496 -233724
9788 -312962 -105977 -454032 -289694 23642 61801 -42916 -22326 98420 -163643 -248815 -107058
9776 383766 -169426 -313541 -114763 -178277 -211837 -145434 115622 -227370 -4696 -57039 87158
9764 -186787 207800 -179050 3702 133499 -189461 99034 -274241 -159403 23189 24361 -9507
9752 36061 -367808 -328973 -382938 116896 58991 55697 -169253 17154 -89846 -186656 113036
9740 -70048 -209544 -379098 133556 -146453 -70996 -294680 257667 158679 -326748 -584796
9730 -584796 41652 -209010 -90275 -6680 2527 161663 69798 27243 79065 -67140 -173220
9719 -173220 -161100 -5266 -71737 -13123 -212073 -62593 100348 173573 -110682 -88133 -107763
9708 -107763 -86556 -23104 6452 -65931 -342417 -171158 -131503 162694 -43047 52329 16329
9696 174082 -249320 46025 -172646 -83702 -287524 -15357 -119940 41929 -30106 -193600 -207
9684 -194635 -20278 -12845 -122422 -24385 25217 -176993 -163900 136515 -54955 -28483 -395835
9673 -395835 3787 -116999 425845 54997 -467650 56613 -249893 -249478 285231 -192608 -84972
9661 -52394 -17967 112285 -352079 307664 -97390 -111185 -182782 167121 -168374 -193847 176870
9649 -372667 -23245 64568 -279398 84851 -122678 305863 214704 21357 -126891 36573 -149595
9637 -215188 -8224 -49584 89050 137325 -49263 106054 12381 -233063 -64773 -267392 162775
9625 -25493 -179455 -241270 -132258 -480864 129018 -220259 106284 -412023 86751 -40491
9614 -158997 7572 -37024 148142 -137288 94607 -308471 -293168 -244136 -359220 -23476 286238
9602 6465 23677 -100422 93465 -107822 304792 -186092 -11163 -66995 -33746 -96001 -140004
9591 -140004 68372 155435 -233209 20047 -144675 -18225 162605 158478 110475 131053 -116430
9579 34469 -215998 -48813 18987 125568 1166 -152429 -26127 57903 189506 -342685 85494
9567 -7649 71638 -120655 -32665 93505 -430043 -246284 -165104 318497 44292 171511 -112928
9555 -45365 -312382 -301468 58014 -117144 144071 -245294 -67499 -163599 -137157 -228422 -31375
9543 -87399 -94535 -106437 241592 -260421 -42137 -141562 -15563 -132353 -401640 -466223 83863
9531 50938 95478 -72979 42591 140631 -184915 158458 -27613 168466 16226 -250597 201671
9519 -238051 -62140 41065 -105108 -235445 -36651 -162243 40702 -150356 -58468 -21021 -375097
9508 -375097 335949 -77601 -342843 26359 -204492 -78577 77009 116665 -440458 133795 39714
9496 -28573 -78031 -141201 -66405 -300540 -337179 45034 -174154 -121153 -201138 -139348 -172223
9485 -172223 47569 -42847 -32441 78935 -29744 -81278 84701 -162452 -90042 21079 -117519
9473 149906 90020 -102264 18514 -289869 -563384 -29571 20038 -216918 -128659 113371 -119871
9461 -165410 -28192 -65808 -64720 67758 -276660 -150052 -195521 185885 170508 -190807 158010
9449 93790 226443 -226798 82764 -132903 -387 -330717 31262 7596 61576 123561 -15358 -218824
9437 -218824 207157 -99979 123111 30820 60795 -151490 -339956 -506140 12133 -367280
9426 229447 -222568 -101162 -274396 -158904 -120771 -118870 100475 -37690 -270215 128229
9415 74646 -137942 -193003 -234741 -344657 187478 -456525 16123 -467232 -100484 -108295 127173
9403 -40252 -39001 113329 -191872 -153908 104826 82181 -196252 43385 151377 -245175 -198380
9392 -198380 -100380 -169064 -92863 110532 -191221 9272 -231744 13747 -142238 66677 129280
9381 129280 -133795 197051 -25471 -326229 -132062 -328046 -80234 -15196 -300998 207378
9370 -147429 -86979 -97100 -84973 -83755 -264471 -135217 -230620 71896 83011 -57138 3979 -3546
9357 222236 123569 80196 -254991 -221 -255693 -204309 99704 -112512 -237117 -159482 94581
9345 118756 -81093 -442406 -170178 -3515 -374758 -108268 -53560 -2184 -178889 -38905 -119245
9334 -119245 -141826 -113280 81140 3545 52399 -390580 -116207 -22488 -117253 -75545 -124862
9323 -124862 -99618 -232816 -358653 -107414 -246250 61726 -74946 -254421 -51302 90554 206853
9312 206853 -4821 318803 115111 112808 -314513 -184083 25883 -126575 -159299 10274 -118342
9300 179414 -342655 -255664 -70450 -186792 -272204 76974 -157038 59930 -205296 -123543 -95599
9289 -95599 -213071 -414651 106124 -323042 196067 -261183 63056 103521 -20969 -106658 -165165
9278 -165165 -505479 -96708 488382 72328 -307429 -255695 39294 55011 -131817 -153746 -33233
9266 8801 139368 32590 202991 -289245 -184371 -8814 177807 -32755 -82931 -18762 -229297
9255 -229297 71395 -97198 92269 120790 -218649 -130292 -381757 111411 -104740 97054 -119296
9243 -5177 -1922 -40600 -290318 435896 -80584 -210324 -293147 -292222 64780 -109884 -179166 -39348
9230 152912 -79527 -395875 206350 117208 462838 -65865 438802 -118996 -253179 -173084
9220 -173084 -130235 -194847 -28674 -9637 -278812 -111181 -112194 213125 205929 -53364 -40882 -444328
9208 -444328 -71533 81319 28312 173543 -143708 10936 -298516 33128 -236742 -386922 -42979
9196 66528 -140229 -502471 -125034 129618 -134052 43045 -132619 -24044 -124114 216299
9185 231710 -96839 -97238 -134406 -207780 -2153 32701 -32131 -466308 166707 -71871 -117389 -281530
9173 -281530 149848 -187363 -210255 87015 4592 -32749 39625 -234816 127616 -56817 -252059
9162 -252059 -383384 277298 -29788 -309684 -210774 -371392 -173878 -512500 62870 -62832
9151 144498 185997 36262 -126703 -228027 53618 -157492 -34150 141273 -337772 -477917
9141 -477917 -15262 -6197 69437 5247 -6288 -14401 -9698 -62757 41239 -180660 -38205 -28490 -17127
9128 -17127 121820 -309211 -315735 -103599 -89259 -223724 26255 -80504 274185 31408 -45164
9116 75678 -107832 -114834 -136812 -131238 -145691 -240571 -252307 -251546 -69844 -79094 -52487 303576
9103 -1458 -360410 -146742 127915 -428519 -214519 -267383 22551 -254149 -315083 215531 167092
9092 167092 191714 -88819 -126794 -139692 147643 134665 -56179 94427 59983 -445037 -34504
9080 -23708 -142074 -192765 110256 -340604 -157530 -69063 -2639 95691 228545 19659 94304
9069 94304 -132680 -100945 -109477 -117491 -218827 -105776 -184832 102547 -192071 16692 -122839
9057 -177280 -303939 -17648 36805 -53232 31050 -48896 51042 15366 -22317 84288 -41938
9045 -34445 143237 459456 21479 27547 -138815 59252 67233 23639 -307444 52238 105480
9034 105480 -30939 -133440 -94146 -112432 -79532 -62962 -232340 -94244 -240594 169892 -255324
9022 -274033 79103 67903 -143101 -254698 31413 -107935 -104846 -263165 -373011 121081 -46792
9010 47385 -73042 -54600 -64692 76009 148694 203730 -162017 26295 64562 86582 -303171
8998 109517 -225994 15357 18267 -105158 240361 -166562 -346755 -6289 -10784 -30007 -290261
8987 -290261 -122528 198287 -57496 -187726 -134278 -362764 44654 298308 70782 257614
8977 257614 148818 128147 -250506 154388 -128365 -221228 68062 -368435 50938 -331216
8966 26223 -109269 -101429 -166462 -317960 130210 -108087 -144824 387858 -229036 -352366 -35619
8954 185505 -289856 213289 -9561 -9332 19701 -32763 19222 80583 -141987 -35958 95718 -96606
8941 -204666 -192837 105523 -305661 220237 153677 -44102 419 93652 -231628 529962 56750
8929 -40756 127129 26465 91011 -23536 237073 179650 228408 480024 1520520 5767009
8919 5767009 14913829 4937978 1005910 508376 149741 335339 272187 116108 -117659
8909 276135 -222174 179233 295666 353143 -66109 157250 15840 114996 65875 710 -32244
8897 -83037 -90886 125506 -4408 -166290 -225210 154272 258382 331140 352502 216089 296536
8886 296536 97787 40617 -119582 16882 13374 -284543 176421 -266507 -129823 71983 47982
8875 47982 -243037 -207658 -350401 53096 141126 -436038 29685 -344009 -140767 46564 -185535
8863 90373 32154 -103718 113698 -253666 -151470 -61843 -230557 -165851 -308390 -192206
8853 -192206 95532 -240719 -117946 -77549 -54952 148953 84218 -256623 271669 115414
8842 -225692 -369444 -109867 -35025 118376 97549 -53756 -141058 -129067 147027 -39956 240038
8830 -55729 22342 -33231 25999 -48139 -110834 -321035 59250 -133896 -62713 -10129 -127276
8819 -127276 62636 37909 56939 -313986 -81146 -63143 -153516 -3199 177858 75208 251417
8808 251417 -272093 -205905 82104 44247 -251178 -85624 48895 -246198 61902 62547 40792
8797 40792 2630 -131120 -57850 83634 162452 16139 158757 101608 -93535 -169781 -151286 -49243
8784 -228147 -279233 -96948 40495 -62240 -380731 30859 -236086 -123680 -64272 -141118 7192
8772 -56662 -74218 -58092 76829 181861 -80461 79282 223195 3033 15028 -60132 -134677 -36233
8759 -49539 -75398 -288475 148724 71816 -309777 -12390 -337906 94065 290814 -42102 102683
8747 26856 -108288 -46753 348235 75566 116445 -233891 -330092 163133 247863 -42207 136916
8735 -119959 -108141 88426 12508 181023 96012 79343 -149 -1019 319569 53134 -262600 6944
8722 -304632 -53137 -107448 -192674 -19496 -262530 -128923 -82372 73703 -78004 -131462 -164358
8711 -164358 34394 -372547 -20467 -304324 -261117 -211049 14020 210469 236739 274038 58165
8699 -126339 21823 -238677 140205 140885 5686 -154603 -284628 25689 -28449 93260 119464
8688 119464 221224 -86467 -80266 131730 62098 -95116 -114262 127645 92985 -228475 -72112
8676 -258753 -69819 -2112 -118807 46619 -274740 -53260 -187684 -16636 -211167 -170678 256649
8664 54273 724 -27749 -192575 178845 -111963 -233840 136896 -38281 -28069 -63038 32279
8652 -247644 -112452 140628 185890 -256775 -44437 -94079 -40175 -257919 -208290 -322392 -237482
8641 -237482 -427037 -51963 -69928 199559 -256166 -213673 -237307 -91842 67044 197207 187879
8630 187879 -290263 442065 -36397 28334 146713 43634 -277168 -206656 -168223 -20256 -6360
8618 -20503 103201 81588 67590 -168500 -138480 -269201 -24153 -50982 62991 -59092 -15178
8606 -19999 -76822 -31306 110779 239694 -57958 -126506 -182423 -77728 56839 -183319 -159145
8595 -159145 21894 17603 -130402 -34067 180517 -130212 -51536 -108342 248573 -382331 -102889
8583 4317 -270372 -138586 102537 -340970 -215449 -271614 163720 -187237 -199544 -180823 -193198
8572 -193198 191294 -335507 -92444 -202533 -208976 -129770 -326168 -33369 -38395 311759 80342
8560 -141130 123302 -76230 -92715 31425 226696 -47224 87286 -23621 332695 60161 114049
8549 114049 -191841 158529 -174781 -83135 -3819 -276944 176944 -371325 -72118 -313163
8539 -313163 87470 -408244 64323 341225 86218 -190522 199241 -73451 -70153 -117307 -218736
8528 -218736 -6606 58682 -87454 102196 27805 324110 -79775 158303 -140051 -396296 -122343
8516 -251194 -105736 -152831 21892 -31006 87661 -32481 -324362 -151105 -13972 -211012 -138373
8505 -138373 -181011 -70981 -23207 49124 -170705 -31484 -269517 245318 279365 -115346 -85252
8494 -85252 -172899 -402451 -67926 46962 115535 114741 239823 -9060 -125540 -57868 252349 20052
8481 57625 -347841 -286460 -66311 -183718 109144 -192702 124569 155579 -60202 -293133 -1320
8469 310096 144191 -146419 -95476 20171 264008 32810 -13156 -18028 -171259 80331 -176177
8457 114795 55931 -109930 -160544 -324012 -316446 -138440 -380646 -229426 282088 399047
8447 399047 -6104 -311411 -287738 31767 -339687 29847 -115224 -155497 -46381 -16874 -247626
8436 -247626 59242 -46278 -50105 -110269 -109175 -17175 70135 34771 -107837 -156567 -149317 -64153
8423 212182 -167744 -463636 -166392 -72550 51940 -167192 -59703 -155555 -356107 -7247 -103249
8412 -103249 -57405 26409 -9932 225022 -9442 133399 148218 -12608 -127598 141802 209221
8401 209221 -60349 -179085 -182580 305680 56324 125829 -44643 -40102 -31751 257548 -9668 101439
8388 73708 -107141 96821 -409801 37690 -105534 251530 143284 -269976 245519 139596
8378 139596 180231 -346031 123808 -343257 -94773 -226929 100314 -224459 70922 -154607
8367 1581 -8623 -315490 -25166 -149292 -15137 344632 240336 -78815 -27412 -326618 -213034
8356 -213034 180287 -185933 304869 -264354 -79395 -42253 -265937 116482 -166529 123136
8345 -324963 53024 121057 -31110 -311312 3212 -296882 -354948 133670 -121833 -245848 32849
8333 142615 -149783 78969 -105320 17887 72197 127669 -22466 -203534 166489 -109357 -43040
8321 -103681 -261221 -10873 -111331 283874 224666 -99813 -402622 -98022 71141 75060 179897
8310 179897 -21172 39497 -116550 192891 -111488 -150086 218656 -2462 -60167 11826 254785
8299 254785 -168309 -221587 -161592 -45412 -7102 259611 -347755 -218070 -299178 -548136 102098
8287 -190652 -4344 35994 -40409 -41525 -61291 -147876 -66584 318304 25977 105522 307098 -22350
8274 -148879 -58033 53952 -245666 -79233 -268128 -5495 -141764 60034 86021 -103024 144252
8262 -10869 -40662 -351523 -48769 -196242 -145810 205338 7493 -254049 -304272 -109504 62475
8250 -107255 204885 235784 -137050 -273031 406830 229058 -5552 -125162 -26029 -290646
8240 -290646 -90762 -50827 -157547 -54152 -133919 55567 57300 -350384 -281700 -98823 328359
8228 -272734 -102278 6251 -80779 -249657 21539 65497 1750 124147 111434 -1772 157448
8216 -85663 -120641 -56543 -122734 38641 -48892 163767 -261015 -3471 -122500 -260487 -163948
8205 -163948 -65381 -165577 -146278 198144 -59181 213059 -320743 -36806 18187 -177242 -72138
8193 -199743 -148480 -145636 -21889 -84512 193028 151 -160311 -195204 -17625 107027 -17025 -169226
8181 -169226 -107017 103116 -95480 -296355 -24026 -226529 -65821 -287167 19475 128016 -199383
8169 -47163 -218254 -196085 -169160 -97669 -150413 275176 -33438 325700 -258251 -59791 -322591
8158 -322591 232069 -12713 -41750 -115964 -15626 230656 -145745 -172767 -99781 238191 -59763
8146 -126532 -122821 97599 -99781 212221 164177 127219 -81462 124467 -13937 -172328 -22969
8134 239858 99840 -138519 -147015 -14961 -410780 -113747 -230508 -63433 -96452 -44641 91399
8122 110603 -141265 -155490 -2489 109948 -240795 40681 -65695 -85805 21254 -301996 77267
8110 -14426 120474 142554 -6699 220893 -94484 -148675 239695 80306 141572 -30766 -62774
8099 -62774 188411 -316819 -472345 -210129 228519 33327 -116788 -187371 372660 -38572
8088 -406851 -91107 111979 72388 59520 -88557 -157361 -133303 -228739 204829 -108140 -10763
8076 428943 -131213 -167783 -62097 -7248 132501 158891 -96195 -222434 24398 -135002 -182741
8065 -182741 14005 -16806 29607 -85546 -230461 -155710 -245369 4208 -435706 45502 -204713
8053 -78841 -36751 -260522 -139477 -358272 -44470 73707 -9076 206992 -106659 75961 99440
8042 99440 -34601 -97026 -492449 186930 -204712 275099 140019 140821 -272600 -97383 -29584
8030 -188625 -20243 43516 87848 -162542 -256848 -149565 -126161 41023 -77142 -158578 -2753
8018 153085 42022 139568 33828 -35292 -93098 54930 -289300 -219323 -221747 91004 110499 -87618
8005 79776 68626 183279 -303 14583 -364814 -28951 -121303 99919 -136845 -353795 -152072
7993 46448 4723 323199 -128313 103826 99686 -58510 -29647 -240618 -138899 17095 -164999
7981 -267447 -233848 129781 82101 -120613 -28706 189412 -113227 -206424 -165173 -83452 84309
7969 -117106 -95834 -246497 -24826 -146869 -229707 189041 225648 110159 -135561 -2291 14854
7957 124739 -196107 -24826 158062 -27860 -47875 205188 -187447 109851 62587 -111106
7946 -15508 -41875 41601 358924 -16325 -160606 90453 260648 -272603 -51443 -167741 -247191
7935 -247191 -80527 64919 507190 -30598 -274637 394947 -220334 60902 163274 233551 -125208
7923 -12874 -87385 -399081 -38768 -447782 230012 -84328 -489024 -261478 -73201 -121753 95404
7911 178791 -61140 -66387 -28139 -82139 -179810 135999 -451317 -150041 -1093 232494 189978
7900 189978 128585 -128462 -142921 137642 -152565 -95223 -156416 181424 -186872 -48411 -92624
7889 -92624 90818 82574 11069 -87143 -114095 225797 -198456 -109885 -65514 -204735 181506
7877 -270531 114471 137657 24395 185295 21514 -151758 -2496 -80353 -171881 -130637 191332
7865 82670 -264658 -192602 -215063 -313469 58364 -183928 20350 122679 177746 -22758 -207546
7854 -207546 -222173 -355647 -255446 259319 -7153 -131694 17907 27819 -429464 22247 -23645
7842 237014 -483352 -91070 -92084 -8445 -54193 -72649 73705 -256804 -282175 -115545 89409
7830 57683 -102628 139961 -117122 230009 -62263 -114423 166602 -128679 5539 310565 -165052
7818 55413 -75301 130465 68598 -77398 15832 181026 -56606 -132741 -344333 72010 -9464
7806 -227334 -210550 -187516 -95538 -93631 73601 -19076 -187205 -27348 35362 -265885 16499
7794 -194176 -179907 80413 -70511 -49496 47652 133473 -36022 -207362 246185 216225 -357168
7782 -78058 -151776 120062 103835 -40972 -609595 163489 65446 12789 -92057 380142 -161434
7770 -235131 -23936 -82767 173765 -125649 -1132 -18378 -2108 -18269 -250283 -28009 125460
7758 340183 -29639 -180245 -26924 244248 177937 -230092 150933 51576 -4199 137811 -152172
7746 -113681 106362 153036 -358588 -31514 143648 186681 -22873 -160359 1501 175570 -297660
7734 113501 31837 -214506 169407 62745 152487 -121010 90930 -48340 -219744 -105566 -54682
7723 -54682 -192708 -251649 189783 149620 -37226 -59392 -152541 54751 101464 114132 -67353
7711 72988 -325454 -109287 -57095 89749 -309260 -96617 82479 -237010 -207192 -209556 -127817
7700 -127817 42836 251828 195851 89 -294565 -124111 -119674 -532315 -143962 -83303 17564
7688 215324 -237698 -539819 191746 149795 -22057 -203787 115913 -252925 16468 -160832
7677 -79996 3754 -213849 -287195 -222641 78136 -52739 31825 -1526 53430 221922 37337 101014
7665 101014 48047 199499 -223460 287352 -55984 -447182 100743 192275 -142055 258024
7654 -57675 -37984 -106784 38338 782 124380 -213011 -31145 -391415 -254362 -173726 -165236 -12817
7641 -105369 -80766 -217077 122260 68916 -211364 -44328 6230 -33144 -481991 -203549 -260441
7630 -260441 3612 197204 101371 -256632 362080 -197672 -285351 35649 -176408 3440 95255
7619 95255 59145 -146257 27522 -275943 79481 27941 -66864 -283486 94181 -148364 -57870
7607 -160671 118313 -86975 -122727 77949 36407 -79948 124100 -138719 118160 -5468 -38214
7596 -38214 -128895 171559 -27984 -1569 112551 -275817 196558 -49101 -75827 41878 79897
7585 79897 133985 -42238 -151669 -194501 86566 -340646 87473 -130228 -147621 -50315 135557
7573 -127771 -233091 -186378 -30403 52407 153728 -206099 244858 157157 -300572 10680 300
7561 93066 134110 160472 73639 -179505 -130066 48855 113144 -25154 -80121 131168 -127809
7549 300142 -24326 316852 94377 -47185 141177 94091 -129315 -322288 -34223 -166236 54150
7537 26543 249012 -212065 30365 147686 215532 25827 63264 66326 -18083 -251124 -64168
7525 -59097 38255 -41062 25301 -75506 304041 -129287 -406313 465950 -362157 -96886 78836
7513 -85236 -184821 -4873 -114257 144123 -199906 64368 -64130 -141466 187820 30397 -32039
7501 -183831 -65184 -313588 208079 -180791 78969 -234498 13271 75117 86137 82969 119813
7490 119813 -250768 158833 176145 -323942 -84022 223197 -110183 50727 185837 261127
7480 261127 -18135 36764 199665 69086 -125360 282881 -237960 -101907 -99855 -110899 -55698
7469 -55698 -109290 -165966 -90390 74227 -205408 -93624 86871 -185665 -229852 -50305 110774
7457 41058 259920 -76927 -104978 -11047 66023 -126596 -47932 115845 44594 87246 57529
7446 57529 109448 41911 118051 296580 -217164 325554 -153593 165681 129035 85456 66709
7435 66709 -361516 4122 -135792 -198416 -36054 78877 -239258 14533 227153 -151864 892
7423 271313 266 194437 -23063 -57287 18247 -204639 62035 366542 111948 -29712 -118009
7412 -118009 -208082 -120058 -59931 -216509 -208667 -566148 -123063 -194017 -77202 -112682 231462
7400 -116228 -94579 -399686 -218650 -29862 -196921 -56287 -281905 241050 -125613 -58926
7389 -239284 -108610 -20311 72942 251284 254663 -254864 11376 -130491 39365 -61512 -167987
7378 -167987 18475 139278 64973 -214915 -63679 310541 100698 106766 248405 153604 104153
7367 104153 22028 162827 -115307 -131836 98421 -240695 -41475 -372637 -221826 -27262 -118369
7356 -118369 112312 -158973 108602 -175593 155154 301511 127259 -15635 -182378 27012
7345 -8758 -76077 68813 50594 273218 244712 36042 -75747 -78400 -62773 184979 29993 -299557
7332 -245248 174266 166660 26605 -180123 -265372 -238193 -56358 -129916 248090 126837 -294116
7320 -162780 -321348 -197351 366762 62534 57274 -85143 -79366 3843 65582 -184543 -122485
7309 -122485 67664 -43907 98425 -177803 -46041 20354 -151489 232335 62239 -4551 -180428
7298 -180428 -344757 -123857 151409 -25791 -151621 -17001 -26672 -115171 141406 71678 -188877
7286 -120435 -157040 106624 96819 -139847 -167941 -64518 -210784 -408094 103727 93729 -91192
7274 80462 -121708 -145035 104813 221326 -55075 -37430 203958 88989 -259336 -268297 181928
7262 -111330 -48812 -273401 -186610 -330794 -227379 200977 103242 -110446 4855 -64578 -248951
7251 -248951 86456 123875 39761 -168944 -130253 -106887 -90791 63902 85895 -121040 -247325
7240 -247325 -215711 -137155 -70140 -276226 60319 48552 -88110 -166689 243725 -1830 94048
7228 123740 170797 -63986 -178270 479772 -109311 390180 138774 -220640 -157442 -255412
7218 -255412 -138 397965 -4589 -267750 -219993 46786 6339 173192 455126 -3825 -258814 -97917
7205 126385 -37029 130927 -153777 28161 -140439 -11071 -146087 158455 97325 -58605 105596
7193 116466 -141752 9655 -105489 -121096 179990 -138949 -381 125104 -200163 27149 -225500
7181 224309 -196133 17942 -324617 3439 168285 -189313 32657 37176 -35056 -47943 -380759
7170 -380759 -386880 -112661 252248 89405 -193344 -39238 23540 457086 -279800 -35060 -125250
7159 -125250 28066 88207 -72171 19585 133789 3936 -103064 -178527 -41223 -32021 325739
7147 -273269 -132947 -291239 -36016 -72451 290597 131221 80759 216717 21909 -333329
7136 -251215 157839 79610 173284 51955 111950 -67989 -329366 -380821 115712 150778 85457
7125 85457 -181575 108430 -238714 -261588 -529160 -58349 142032 131292 188588 155173 -42974
7113 24843 -176004 171634 348608 -84732 -169945 -44380 -34537 364619 401921 -35588 168302
7101 122646 31022 111943 -193373 -59006 -448530 -103028 -313857 -22143 311263 88199 -49684
7089 -263421 -366926 173681 -85192 -106692 136367 -180544 -245699 -85303 79139 50525 -300455
7077 241324 206664 62982 -227244 -14783 -142604 447161 -110931 41152 44725 189094 -102847
7065 10531 -154917 56144 -319745 -17702 54594 -149667 32867 52495 418357 -111586 137071
7053 125161 -302846 -84020 153258 152428 -155104 -397292 -226193 -152454 240477 -367710 157647
7041 61334 -97849 -98353 86897 88836 172235 247972 -314124 129089 -198613 35535 153107 -102168
7028 75489 -253071 -49743 88771 -41338 -152203 -96521 -77859 -78786 -307095 -67582 11088 -100585
7015 -190039 -32526 180020 -63750 38722 9717 -289251 -139073 -75002 157567 -388203 207315
7003 143521 122480 216427 -39327 -292336 -191931 -166063 -169542 -76575 -281245 29647 19271
6992 19271 32939 -221299 -160657 111365 -33259 57488 192040 -101339 -12214 -117095 -261143
6981 -261143 -132088 -64331 2614 -131743 251202 -143358 -160226 -219100 -57609 255830 -80145
6969 -128993 142031 -243146 192263 -254752 -176827 -5458 -150819 -7280 -50033 -58125 353201
6957 353246 139004 32988 -56427 253947 -90325 -153553 3176 55640 -81067 43069 -135552
6945 158152 -2861 85430 57891 229732 36680 -260990 -327685 93045 -104932 -161714 -98015
6934 -98015 56618 -67482 29454 87349 -6496 -486430 -146788 248460 -10534 -189644 152692
6922 -291000 -267352 -206060 -151580 29914 233995 268414 195118 -184672 -44683 -531 -22725 -8755
6909 -70557 -120165 139664 -136622 11861 163553 -97556 72938 -97721 173288 2582 -325736
6897 123023 -277496 248161 -61191 -325911 -153375 243602 -327697 184882 165855 229219
6887 229219 149296 -374800 46035 -141038 -53821 -106685 -228521 166958 -37476 13763 -81394
6875 -90609 -50991 68931 -12069 13808 3133 219022 -90247 13840 -12300 178816 267424 21065
6862 67851 19180 161917 -24138 189985 190053 14083 -301067 169830 -101203 -235930 148091
6850 -105268 12739 -346615 38122 132238 -107473 80671 -38085 240199 119202 79710 28585
6838 -141728 -127096 -66252 32512 7109 46733 281199 -203938 -170027 -38252 159672 -302537
6826 5124 -99939 163306 -290651 -180032 60374 -31073 280171 -99131 13392 149968 -132794
6814 310001 634 6589 255782 -86150 151058 -386201 117733 90009 -412928 358394 85496
6802 170145 107890 -27774 444028 330630 -72893 111667 31016 -6393 49746 -87957 -92857
6791 -92857 160962 148565 -26646 -34064 -153667 -261777 -185754 -54103 40542 -113034 -332175
6780 -332175 -85432 -50639 -224656 43394 14820 12740 -299483 -33522 -118822 -92000 -118239
6769 -118239 123956 38935 -68885 -406066 -205361 175105 -241040 74422 122008 -278765
6758 199854 -220700 262336 253271 141336 -79153 120147 -30088 -23059 -14926 -132097 -166540
6747 -166540 -198247 -728 289611 -306401 -257845 86271 131166 20468 -138120 -13620 306516
6735 198686 -154311 -1359 62849 206201 228555 -44647 77374 -300711 -230500 279939 -34626
6723 73526 -49224 -253803 -205966 11517 -14781 17285 -16836 -3979 -443666 -116313 -201338
6712 -201338 33559 168989 82823 -191037 244548 67799 -60652 -191112 57406 33283 51525
6701 51525 -85977 244820 -22260 -31139 -180723 -28863 -3354 189349 174101 -186155 -177119 -62971
6688 -7897 -178507 14859 420273 105178 -103361 -179586 -54102 -58129 -137453 180160 -10678
6676 114567 -286510 74963 165483 -170214 -147919 71119 -151063 319168 -380204 268420
6665 145125 -75408 163792 213743 -136100 35789 4383 300279 34602 -324570 -132671 96055
6653 -59069 102068 34189 249291 189634 174262 -38401 242046 249035 36071 -321971 -156498
6641 127437 -147480 36486 -201100 73571 -3029 137342 -133937 109715 -26920 102564 -280275
6629 32514 -251985 -216307 154644 81694 -158359 213219 -140726 -209287 1564 -85536 -225432
6618 -225432 -55100 84198 145049 247005 266349 -227384 286436 -248766 -256998 -86184 -41534
6606 3935 -116453 -189047 102122 -145141 106767 45903 3281 127397 -423137 -40211 -30278
6595 -30278 3287 -34446 -84765 152534 228618 165700 -18836 -206581 -63514 178150 230945
6584 230945 -113559 31628 -172356 -121494 245670 61149 35379 144606 161730 -117168 204290
6572 101140 128284 61000 -218922 39208 -279158 152810 201176 -33566 14246 357311 111580
6560 -11880 -117757 -149377 99918 -157501 -194680 -69334 381829 -15803 302793 35596 -219122
6548 -318295 -271055 94679 177973 109228 205973 -16193 -76899 17074 -139211 320866 -151504
6536 -55105 -34031 -57857 272744 -208788 -375777 -308600 113167 -210431 67725 15732 -225971
6524 123734 -32863 -89773 174643 -244211 340167 -104596 -192207 22770 -179845 70467 -293329
6512 43584 72247 -88960 -10871 219935 -112201 -409988 19443 -30155 -5512 7745 -18788 -96373
6500 -96373 62078 -65473 -434402 -216713 -115240 156568 61640 -193176 -81016 -84571 60090
6488 -171211 -259717 -81141 9118 -307049 -97614 -79433 53767 190209 -102981 46594 -194653
6476 -225863 32653 26662 -12016 181637 -102155 -151395 89898 98559 321131 -123084 181707
6464 -347314 -261781 -12359 16724 -170972 -186755 264205 -102408 153376 -167137 -56361 68556
6452 -195644 212399 88462 214602 120913 -87766 -20638 -237714 127779 7930 -164072 75936
6440 -169311 -174233 -307010 11819 -88867 -330357 233765 -43883 -97800 -37317 -129805 -291127
6429 -291127 41562 168052 -23305 -130709 276979 160966 -38200 59182 179422 -13448 234452
6417 -72733 -288259 -44666 68420 -111990 33159 116618 52623 141716 -168273 -135082 75684
6405 -187560 -113638 8800 -94830 -104275 226766 101191 340862 41006 -22074 297528 56917
6393 -16658 119128 -25536 9804 201829 -283697 -248969 151494 156529 154305 -19377 -74228 -106230
6381 -106230 247923 -128741 69089 -172876 20120 -93492 62817 84928 82190 -118254 -306290
6370 -306290 64497 269960 227198 -231050 29157 1039 37197 -226326 43294 387929 -49160
6358 152608 -105603 -69392 -90495 -45661 154921 4279 102969 -257333 -132395 -103373 -53167
6347 -53167 198820 362567 -182229 94298 -186024 274543 204190 -76453 99725 -179652 -187366
6336 -187366 -870 44251 269843 -71646 -23958 -49697 57439 -17769 -107691 -264533 100657
6324 -346109 2725 -33853 -547390 290899 -168502 -428880 -72825 117772 348704 -270275
6313 457846 104220 -96540 191699 -42218 -178917 72636 199264 -27833 -236736 -242406 -272999
6302 -272999 -77812 -82253 142765 -21011 30023 25837 -65733 91320 -140376 94221 114427 -299191
6289 -140063 -203018 137096 217668 -368473 -166699 2752 -231767 211023 -227309 -110673
6278 -347124 -60432 -105561 133137 -179504 5309 -85065 -295679 4976 378044 22006 -54894
6266 419 -279349 -240472 59746 214161 162652 31775 -138613 154765 -105676 -24328 -58428
6255 -58428 70694 -121176 -197139 391204 -42309 -34160 190536 -4152 209394 -111537 272571
6243 -93150 -104799 50054 114077 -397014 120669 -256371 61619 76181 123829 -178447 90990
6231 -221078 131517 25344 -219240 4430 40574 17699 -280983 -132196 56684 156515 212849
6220 212849 342689 154467 -142665 162130 -164630 -191833 329495 4580 -25123 -148290
6210 -148290 40578 343930 -208421 105209 27434 -134134 194455 -164878 15221 -45303
6199 31637 -181464 61475 -9216 112740 -48371 -286750 117041 153178 44677 -398083 9896
6187 159122 -152270 -225943 293108 -163349 158339 -316412 -304480 243141 -106177 -142641
6177 -142641 -354767 -50565 -157829 177640 106026 93736 182067 -6500 18767 -189910 473326
6165 11096 -90724 164007 84121 -95254 -18277 -29592 -52037 -34561 -284360 178582 60039
6153 455485 239154 -65953 -163725 152797 43299 -319113 -187106 235551 191352 -115926
6142 179418 326349 -28726 -62821 -208013 341069 -139074 -23670 -108972 -156689 -223088 196687
6130 288678 -96485 362986 225084 61872 -69670 69697 124346 126700 -62094 294974 154898
6119 154898 147590 -202089 -373317 -219557 157788 -145930 78000 150713 209063 98564 91412
6108 91412 319938 161500 344099 -34922 -169858 -134876 219028 10842 -120004 157407
6097 -171813 88247 -341495 33090 268619 -163101 264715 63302 -144631 218742 -119689
6086 59548 359701 -124170 -101839 109181 -30430 112480 84294 -252149 -7953 270376 22363
6074 257118 7636 -33512 -180564 238820 161970 68282 -194496 -31813 -122989 228145 -206160
6062 133011 -235590 -141550 185830 -298501 85231 4533 -125869 -103213 193028 127554 -92535
6050 454273 -4160 -154240 -38327 -222624 207769 13638 92030 -216891 -111261 121103 224411
6039 224411 -41025 -412571 264562 -152366 42928 -85191 83794 2413 -278515 110902 -216420
6027 321236 -82520 -437975 -22989 107299 35671 85620 274328 131545 -143885 46057 311586
6016 311586 49725 211922 155803 -92912 64194 -69498 87102 -40250 -80965 132499 573210
6005 573210 -116482 16458 167654 106548 -134957 34662 -290181 -94122 210012 61031 -130859
5993 39530 209866 -19233 -9935 -218624 163547 146848 -91766 -352938 36731 -49648 -297139
5982 -297139 -146056 53197 -87520 -348591 64673 40288 -22199 174226 -118082 249001 57658
5970 -395937 -65980 166540 36376 -37167 -90679 81692 -265906 -182936 -20917 -107601 39843
5958 102713 -32466 83484 199920 50846 213658 177136 -270787 -2533 318503 462977 186333
5946 104320 -168430 -161971 249840 85189 -104811 261551 115991 10307 -15364 -38638 -285993
5935 -285993 275172 79041 -202949 126674 321496 146338 140963 258854 -114990 -219197
5925 -219197 131294 -4222 -111175 -54143 279739 -201272 946 -241525 -7717 -82819 36560
5913 -276994 90526 -185661 -234413 18968 -245156 97641 113982 -121510 -89986 -114506 70868
5901 148043 41755 308122 -109037 8238 -100063 70218 71317 182345 211910 132718 201226
5890 201226 -157306 -59262 135748 238207 68541 -43527 75362 28911 273838 -23754 -65672
5879 -65672 154831 232407 -96256 56787 -123423 -20861 -226346 106880 159667 -105343 -69054
5868 -69054 -17379 112029 136201 -173256 -65781 -77593 28350 -232578 -110902 232820 -64231
5856 -256236 88951 -128892 32757 334464 -204745 -302540 -239068 -102161 -35366 70945 16817
5844 -1485 -62013 144289 -169611 4385 -13671 136952 -135037 40798 149699 160024 178891
5833 178891 233360 -89112 42534 74508 49629 215822 52651 -190860 54419 84706 -211516
5821 -75484 -44294 62689 117744 69496 26245 -211544 -160630 86984 275414 6660 -116753
5809 49168 61008 -396884 243519 -75850 -247549 262358 385337 41206 -41383 62400 45866
5798 45866 63838 82634 172315 253517 -77382 -66157 -74111 74897 -57193 258887 143754 87869
5786 87869 -230053 -222633 49050 -251590 -5501 -32060 -57063 -146900 1293 -5137 122519 -85835
5773 87885 -47106 166244 304115 -294756 -183697 43827 -35403 220634 -271655 101848
5762 148161 95920 -213103 107631 247033 103515 -203293 68661 53044 -111188 -125291
5752 -125291 78375 -184131 50661 4245 -333993 -250251 93079 329529 -231015 210699 -263544
5740 -90379 -131997 39388 210049 251307 -73937 -103611 58339 -164349 -94607 -17281 -102725
5729 -102725 -187205 10142 33215 84311 80999 45305 -189518 -103897 -149246 -302373 324883
5717 79598 -250983 304491 4365 -86678 143507 305865 145141 -240294 169971 -64684 126620
5705 319677 182373 -94196 30000 -40263 148032 50727 -152310 27326 13306 -37513 295076
5693 -224127 -456379 232341 -458291 -207025 -13947 69281 79024 8692 -122826 -102606 -95009
5682 -95009 -29169 -67295 -128080 -90831 117210 9150 208546 143232 605569 -506433 -275 319127
5669 -38396 37618 141163 69926 -79254 307596 -360947 -28522 -79845 -89193 147142 78778
5658 78778 -353725 -220752 -91636 47894 360337 56956 -132384 -159109 -108098 66041 -320344
5646 51199 229586 118447 -49638 45430 178731 207617 274247 191790 20010 -6569 40496
5634 -131674 -101240 117503 131124 -196281 -53491 187089 -105116 341499 -216170 -135178
5624 -135178 -276459 241976 96352 88420 45532 43318 -103018 131794 33783 23586 50805
5613 50805 107004 -193729 109239 -29901 205337 -31439 4315 48082 125982 312423 335924
5602 335924 382337 247001 -52820 -58727 -62870 -99997 -172254 -143109 -34527 128947 -181573
5590 83650 -160710 -86421 64790 352929 -167670 -99162 30088 -64976 -335565 308717 -2457
5578 80803 -1333 -121393 154480 -91567 -20264 98623 2924 -106383 139132 -119198 -280405
5567 -280405 -78458 48809 211511 -361773 -220072 -115881 181595 -189144 -80062 143026
5556 -86263 110554 -55023 -286122 204975 -144938 -34936 -123721 -11640 -39129 -27483 -13894
5545 -13894 -72452 -215502 -23293 -149226 -218294 -175457 -41699 168 415124 320454 -146053
5533 63064 -6395 -107820 93280 177137 -72277 -285461 -58493 -128522 -260422 136231 -25769
5521 128922 86180 -5783 97310 142139 -83889 142274 61624 136582 -139797 -151760 57093
5509 47354 -75521 -12086 209928 -110494 -201439 125339 145397 -87253 -39927 50264 118584
5498 118584 -33115 20338 53349 -204907 81934 51551 14606 34937 -325270 -134533 -102309
5487 -102309 -83238 102216 102328 -135583 137889 252718 185811 278631 -132129 122147 219519
5476 219519 52782 -165055 -206199 -119903 129609 -126522 -51562 7323 -128546 -209015 -220997
5465 -220997 72010 158132 296932 411763 1951 -89649 -36359 -126705 131346 -11452 -21884
5454 -21884 -31280 -174987 -97196 4894 -27803 84267 211043 -97680 -51982 165105 102696 163960
5442 163960 204007 107211 321874 34669 -147421 -115112 -36451 133525 -187478 -38701 -19753
5431 -19753 85865 -117780 -109552 302465 122807 -167276 -61629 -30859 22348 134347 -9518
5419 80910 -24974 109554 162923 128103 -86234 -126857 -27204 -111929 98314 -382670 -111449
5407 -68780 68809 241967 -84832 -19616 221323 223925 -320376 -36709 154267 108241 -51844
5395 -102889 -119807 -46491 85127 305848 -40971 173235 -517894 -325745 139377 127048 224877
5384 224877 -14490 299017 -11457 76666 159538 20920 -151001 -107689 -19014 211386 207035
5373 207035 135911 40542 287424 -14381 180223 -174957 -107673 -408341 40088 -304552 33743
5361 274502 236914 362227 -88142 312877 59620 -266557 438588 213472 -145857 369209
5350 -239272 -231594 -186411 -204920 -43019 25258 78054 -107908 54022 -40665 62556 159511 62918
5337 316356 186643 19770 -169119 88171 -63069 -225719 79470 -62080 168982 -48198 135317
5325 -50360 -26746 -36633 -29652 43487 228569 -35332 -149942 -8188 -335950 123009 197152 -274393
5312 -139593 199115 -86471 33640 24507 -177074 112149 165071 111467 206839 405476 117424
5300 -42030 -148352 51259 -74307 -30671 -170941 58380 -69412 -387647 200919 298267 34236
5288 379462 -128002 -327924 3994 -255372 -20876 -160553 -20759 -62906 -104901 66431 84498
5277 84498 95706 178646 -50397 -262286 -62338 63599 183746 -67284 9205 8365 28675 -86812
5264 -217389 -403509 59056 -301408 -110585 259704 79010 -395235 -210031 183644 94857
5254 94857 -289666 22680 -259937 -209662 -39046 -135635 -110431 -31051 -30729 104521 -184568
5242 84806 -162728 -172125 -159740 -216840 302075 43384 -18050 136221 46439 190604 -53733
5230 38864 -177692 47609 176152 77250 1971 -282266 -32740 -187591 -281519 39919 -166642
5218 -349622 355143 133745 -114503 -59375 -89338 434673 52975 13210 145036 -210367
5207 -61823 408698 172309 -32566 -410640 209175 -126623 -124043 -140504 99924 45359 -139745
5195 -352619 -38174 82501 -167813 261767 -38222 -345160 -204680 115573 44963 274375
5185 274375 -110653 165531 -34915 -123579 -59220 43198 64899 116931 -132283 -326023 25199
5173 297835 56621 34641 -447672 230583 -321611 7193 -44435 51852 301541 -97630 249980
5161 198254 -14188 -298969 85597 291579 2391 -65747 -333599 10299 33557 -149455 137402
5149 206374 -135233 -197413 -224340 92942 -245059 146733 226150 -22266 -98035 160312 125670
5138 125670 171352 -103476 60357 -145238 273595 23807 -17619 247577 -79334 101885 50650
5126 6745 -13000 171064 -169123 146996 -275057 216175 225541 312648 -180869 -141167 134937
5114 260465 -119866 -27272 -210769 87663 -25319 125022 217817 139306 46493 -4784 146846
5102 108086 -136064 -174192 -265849 -362114 315765 61143 -310424 98791 -98086 -67671 28368
5090 -220635 -144492 283096 -92279 846 -213460 104448 -122982 34733 178738 107062 289560
5079 289560 327164 146241 94983 -144317 -112195 220570 222433 58315 129554 -149312 -209109
5068 -209109 -66398 61224 -46434 139389 -41171 -148568 111399 28976 -186813 132478 90476
5057 90476 74816 -1673 -769 290654 23372 50915 -181513 -19621 152633 -168491 -39846 -30187
5045 -30187 -400845 -2232 -3265 93530 76405 1825 108624 322807 -27693 106202 51480 35856
5033 35856 196912 73063 34647 166082 -185321 -30225 127351 -247626 -109963 1539 -197665
5021 43766 -349349 -175154 -130597 -6022 190019 15349 42788 38458 -145482 69150 94571
5010 94571 134660 114721 93826 -90621 81109 -163995 334596 276864 264959 -65545 75963
4998 -96408 -11994 159193 215349 -97699 -74306 113242 -85775 42727 38899 -53393 29569 130467
4986 130467 166725 -322440 185075 26474 -167288 -587332 3911 242414 217460 44668 279085
4975 279085 -127493 188809 94079 -46466 -330329 142215 59889 -334012 -165826 46049
4964 231265 -227047 -164018 -89833 442094 -29319 312286 68396 76552 -103094 -52363 -57482
4953 -57482 92264 6721 -7965 -276196 233446 -123063 48109 458891 125883 -195284 -221035
4942 -221035 -129688 -220952 -180213 -240153 358595 -94390 18436 -110254 -288477 -217740 10235
4930 2254 -76229 32434 -105484 -77768 159086 -138643 67522 -177672 -325915 215175 -184887
4918 -137934 91360 -67359 170678 13460 -262388 -374178 -46280 127869 54686 -19201 123958
4906 8762 -1394 -130292 22234 -118822 8965 62089 -208363 87028 201908 195745 134301 117449
4894 117449 146816 -19449 106183 -137397 -38826 86327 148429 257691 -49893 201609 -17545
4882 95901 -77496 -290847 -106205 -54893 -104458 -74030 -72016 -51920 314334 153768 121842
4871 121842 -183682 -98612 158894 78991 35344 -81040 30912 -64809 112438 269551 47493
4859 322343 160762 -2708 -23391 165600 56817 -18681 212612 -150668 -91078 -171479 84219
4847 -36462 -195908 -123991 366269 -114809 304630 33617 -31189 61454 -86120 -263876 61788
4835 130765 -178700 -17865 444500 30283 -82887 258589 -18124 54625 108748 -124526 -39960
4823 291840 -53417 -239450 227247 -19301 215067 -19873 -994 136999 116413 -250481 -152800
4812 -152800 -1476 29316 141757 203881 -42099 -136679 127526 101106 30401 -105106 85078
4800 57934 -89348 132169 179194 -153338 -342099 113656 -231308 -2376 141708 -77739 -129489
4789 -129489 328222 94363 -193588 237777 -202889 283611 161965 179401 -253475 22169
4778 4225 -96572 252135 -35130 -605241 -217600 43147 283324 -305493 -70783 -217625 -77896
4766 130118 222987 -51775 -164930 -171031 -96248 238739 25333 12675 -336807 -264829 23352
4754 -82531 233768 2728 -308958 163804 233007 -206912 62143 -254271 59166 -123598 -4782
4742 37462 89390 -196949 -135444 237775 173632 13559 -54871 -115607 -29729 -11362 -17489 160506
4729 284695 59271 -24362 209194 87762 -48325 -103892 -77709 -106680 -62466 -133350 192772
4717 -206622 41721 -224092 105090 -113153 4561 -63652 -216134 127619 -73737 -83269 335505
4705 279219 166853 126975 -84003 54884 73807 136714 -184122 144740 90555 -225065 -36043
4693 196667 69939 -133083 -175249 -28373 -201424 -274921 147553 -24416 -224225 -30730 -228726
4682 -228726 -69530 -12977 -208024 176934 -112850 -173370 181398 121510 -100636 144995
4671 55741 -121793 75926 -68375 303803 -34031 154035 287 309622 -163326 345413 438494
4660 438494 295834 -292282 -81545 -296683 -10458 112515 -82935 225895 -42983 -18319 266362
4648 185502 -279394 -173356 -142302 93464 -61491 94729 -85064 -43761 -81375 229598 72692
4636 30034 83478 -30146 -98716 198577 -75715 -120947 249252 -94992 200398 7867 -109746
4624 248993 -226364 90375 -104224 -150113 213777 -218792 230563 -54332 205161 -52266
4613 236760 -145651 -99458 258619 -184353 216365 56408 -167266 -140951 256146 7978 157780
4602 157780 -90762 -299726 20283 81998 217934 -126542 -42902 25045 -41604 367704 -247114
4590 -70300 -243738 274959 79851 195499 -35139 -158167 -260508 347042 73471 104288 -33188
4578 -115731 111724 47507 36594 161747 5812 133272 -91184 366052 29607 77862 185620
4567 185620 192275 -114433 -140429 4714 187747 -179544 -260341 -126864 36508 324157 81637
4555 -82613 -28234 128236 215947 -118321 186800 -240383 -180374 -55665 247113 68707 152223
4544 152223 152513 -79624 24004 443982 -93609 107016 88104 -177916 -250666 -89594 -6843 309234
4531 -112357 -129059 -15483 -111229 -227227 42857 82071 -132655 488611 28970 16859 157854
4520 157854 -18929 -148043 -131479 -109342 263853 -182668 246676 -46673 -60434 -29818 95943
4508 -55358 -100568 49392 -232570 66720 -16282 126234 41575 230678 15250 31782 70090
$$ [...]
##END NTUPLES=NMR SPECTRUM
##END=
