
##TITLE=AC1068_TOPL01_6608529_kxjj5BuZwT
##JCAMPDX= 6.0         $$ Bruker NMR JCAMP-DX V2.0
##DATA TYPE= NMR SPECTRUM
##DATA CLASS= NTUPLES
##ORIGIN= BRUKER
##OWNER= Administrator
$$ 1.72 TOPSPIN		Version 2.1
$$ 2012-08-01 14:19:33.562 -0500  Administrator@TOPSPIN
$$ Compression mode = diff/dup
##.OBSERVE FREQUENCY= 400.02188249412
##.OBSERVE NUCLEUS= ^1H
##.ACQUISITION MODE= SIMULTANEOUS (DQD)
##.ACQUISITION SCHEME= undefined
##.AVERAGES= 64
##.DIGITISER RES= 22
##SPECTROMETER/DATA SYSTEM= spect
##.PULSE SEQUENCE= noesygpps1d.comp
##.SOLVENT NAME= COFFEE_meoh
##.SHIFT REFERENCE= INTERNAL, COFFEE_meoh, 1, 14.96242
##AUDIT TRAIL= $$ (NUMBER, WHEN, WHO, WHERE, PROCESS, VERSION, WHAT)
$$ ##TITLE= Audit trail, TOPSPIN		Version 2.1
$$ ##JCAMPDX= 5.01
$$ ##ORIGIN= Bruker BioSpin GmbH
$$ ##OWNER= Administrator
$$ $$ C:\Bruker\TOPSPIN/data/COFFEE/nmr/AC1068_TOPL01_6608529_kxjj5BuZwT/12/pdata/1/auditp.txt
$$ ##AUDIT TRAIL=  $$ (NUMBER, WHEN, WHO, WHERE, PROCESS, VERSION, WHAT)
(   1,<2012-08-01 14:19:16.796 -0500>,<Administrator>,<TOPSPIN>,<go>,<TOPSPIN 2.1>,
      <created by zg
	started at 2012-08-01 14:07:45.406 -0500,
	POWCHK enabled, PULCHK disabled,
       configuration hash MD5:
       6B 1B 68 BB D9 2E 58 E2 7F 35 AD 54 07 DF 0E 41
       data hash MD5: 64K
       F7 0A 1D 2B 73 81 A9 C0 73 76 7E 7C 70 92 BE 4A>)
(   2,<2012-08-01 14:19:28.015 -0500>,<Administrator>,<TOPSPIN>,<proc1d>,<TOPSPIN 2.1>,
      <Start of raw data processing
       efp LB = 0.3 FT_mod = 6 PKNL = 1 PHC0 = 0 PHC1 = 0 SI = 128K 
       data hash MD5: 128K
       C8 50 BC 06 1C 77 32 52 36 C0 20 3E CC 71 7F EF>)
(   3,<2012-08-01 14:19:29.593 -0500>,<Administrator>,<TOPSPIN>,<proc1d>,<TOPSPIN 2.1>,
      <pk PHC0 = -0.1702881 PHC1 = 0 
       data hash MD5: 128K
       BE ED 36 95 D4 99 F8 5A 86 6B D5 26 DD AB 50 3F>)
(   4,<2012-08-01 14:19:31.375 -0500>,<Administrator>,<TOPSPIN>,<proc1d>,<TOPSPIN 2.1>,
      <abs ABSG = 1 
       data hash MD5: 128K
       E3 5A AB EE 6E A1 11 B2 64 38 7F 9E AA 11 A3 DD>)
(   5,<2012-08-01 14:19:31.828 -0500>,<Administrator>,<TOPSPIN>,<proc1d>,<TOPSPIN 2.1>,
      <abs ABSG = 2 
       data hash MD5: 128K
       A9 B8 AD 3D 40 78 90 B4 04 6E 60 F9 2F E5 0A 25>)
(   6,<2012-08-01 14:19:32.234 -0500>,<Administrator>,<TOPSPIN>,<proc1d>,<TOPSPIN 2.1>,
      <abs ABSG = 3 
       data hash MD5: 128K
       C3 3A 83 41 1D 56 AA 1D B4 0C FF AB 7A 48 BA 9F>)
(   7,<2012-08-01 14:19:32.640 -0500>,<Administrator>,<TOPSPIN>,<proc1d>,<TOPSPIN 2.1>,
      <abs ABSG = 4 
       data hash MD5: 128K
       1D DA A8 EE F8 7C 5F 3A CF 4A 25 9E 09 D1 E8 CC>)
(   8,<2012-08-01 14:19:33.046 -0500>,<Administrator>,<TOPSPIN>,<proc1d>,<TOPSPIN 2.1>,
      <abs ABSG = 5 
       data hash MD5: 128K
       40 0E CF BB 2C 39 F2 6B D7 13 DE B3 13 2D 3A 89>)
$$ ##END=
$$ 
$$ $$ hash MD5
$$ $$ D9 68 D4 03 6E 29 8C 96 BC E6 22 22 6D 99 EF 19
##$RELAX= 
##$RELAX= 
##$RELAX= 
##$RELAX= 
##$RELAX= 
##$RELAX= 
##$RELAX= 
##$RELAX= 
$$ Bruker specific parameters
$$ [...]
##$TP07= 0
##$TPNAME0= <>
##$TPNAME1= <>
##$TPNAME2= <>
##$TPNAME3= <>
##$TPNAME4= <>
##$TPNAME5= <>
##$TPNAME6= <>
##$TPNAME7= <>
##$TPOAL= (0..7)
0.5 0.5 0.5 0.5 0.5 0.5 0.5 0.5
##$TPOFFS= (0..7)
0 0 0 0 0 0 0 0
##$TUNHIN= 0
##$TUNHOUT= 0
##$TUNXOUT= 0
##$USERA1= <user>
##$USERA2= <user>
##$USERA3= <user>
##$USERA4= <user>
##$USERA5= <user>
##$V9= 5
##$VALIST= <valist>
##$VCLIST= <CCCCCCCCCCCCCCC>
##$VD= 0
##$VDLIST= <DDDDDDDDDDDDDDD>
##$VPLIST= <PPPPPPPPPPPPPPP>
##$VTLIST= <TTTTTTTTTTTTTTT>
##$WBST= 1024
##$WBSW= 4
##$XGAIN= (0..3)
0 0 0 0
##$XL= 0
##$YL= 0
##$YMAX_a= 16638581
##$YMIN_a= -10522985
##$ZGOPTNS= <>
##$ZL1= 120
##$ZL2= 120
##$ZL3= 120
##$ZL4= 120
##$ABSF1= 14.96242
##$ABSF2= -5.595761
##$ABSG= 5
##$ABSL= 3
##$ALPHA= 0
##$AQORDER= 0
##$ASSFAC= 0
##$ASSFACI= 0
##$ASSFACX= 0
##$ASSWID= 0
##$AUNMP= <proc_prof1d_extract.lims>
##$AXLEFT= 0
##$AXNAME= <>
##$AXNUC= <1H>
##$AXRIGHT= 0
##$AXTYPE= 0
##$AXUNIT= <>
##$AZFE= 0.1
##$AZFW= 0.1
##$BCFW= 0
##$BC_mod= 0
##$BYTORDP= 0
##$COROFFS= 0
##$CY= 15
##$DATMOD= 1
##$DC= 0
##$DFILT= <>
##$DTYPP= 0
##$F1P= 0
##$F2P= 0
##$FCOR= 0.5
##$FTSIZE= 131072
##$FT_mod= 6
##$GAMMA= 0
##$GB= 0
##$INTBC= 1
##$INTSCL= 1
##$ISEN= 128
##$LB= 0.3
##$LEV0= 0
##$LPBIN= 0
##$MAXI= 10000
##$MC2= 0
##$MEAN= 0
##$ME_mod= 0
##$MI= 0
##$NCOEF= 0
##$NC_proc= -2
##$NLEV= 6
##$NOISF1= 0
##$NOISF2= 0
##$NSP= 0
##$NTH_PI= 0
##$NZP= 0
##$OFFSET= 14.96242
##$PC= 1
##$PHC0= -0.1702881
##$PHC1= 0
##$PH_mod= 1
##$PKNL= yes
##$PPARMOD= 0
##$PPDIAG= 0
##$PPIPTYP= 0
##$PPMPNUM= 2147483647
##$PPRESOL= 1
##$PSCAL= 4
##$PSIGN= 0
##$PYNMP= <proc.py>
##$REVERSE= no
##$SF= 400.020009068137
##$SI= 131072
##$SIGF1= 0
##$SIGF2= 0
##$SINO= 400
##$SIOLD= 131072
##$SPECTYP= <>
##$SREGLST= <1H.CDCl3>
##$SSB= 0
##$STSI= 131072
##$STSR= 0
##$SW_p= 8223.68421052631
##$SYMM= 0
##$S_DEV= 0
##$TDeff= 65536
##$TDoff= 0
##$TI= <>
##$TILT= no
##$TM1= 0
##$TM2= 0
##$TOPLEV= 0
##$USERP1= <user>
##$USERP2= <user>
##$USERP3= <user>
##$USERP4= <user>
##$USERP5= <user>
##$WDW= 1
##$XDIM= 131072
##$YMAX_p= 459846568
##$YMIN_p= -12936
##$CURPLOT= <Network HP LaserJet P1505>
##$CURPRIN= <$Network HP LaserJet P1505>
##$DFORMAT= <normdp>
##$LAYOUT= <+/1D_H.xwp>
##$LFORMAT= <normlp>
##$PFORMAT= <normpl>
##$SURQMSG= 1
$$ End of Bruker specific parameters
$$ ---------------------------------
##NTUPLES= NMR SPECTRUM
##VAR_NAME=  FREQUENCY,     SPECTRUM/REAL,   SPECTRUM/IMAG
##SYMBOL=    X,             R,               I
##VAR_TYPE=  INDEPENDENT,   DEPENDENT,       DEPENDENT
##VAR_FORM=  AFFN,          ASDF,            ASDF
##VAR_DIM=   131072,        131072,          131072
##UNITS=     HZ,            ARBITRARY UNITS, ARBITRARY UNITS
##FACTOR=    0.0627417313425164, 1,          1
##FIRST=     8223.62146879497, 1870,         -66499
##LAST=      0,             4294,            -66844
##MIN=       0,             -12936,          0
##MAX=       8223.62146879497, 459846568,    0
$$ Real data points
##PAGE= N=1
##DATA TABLE= (X++(R..R)), XYDATA
$$ [...]
63250C67574L484L952M266M604N131N457N111M388M126M725N895P258Q686J0102
63236D44759J1516J3082J4670J5577J5459J5293J6400J8552K0090K0196J9899
63225F25493K0339K1144K1323K0854K0443K0216J9660J8652J7702J7272J7357
63214H40455J7716J7926J7410J5871J3617J1159Q623N829K585j427o562j2470
63202I30732j7877k1723k4266k6335k7931k8382k7711k6755k5786k3981k0752
63191F59233j6830j3451j0904q510n780k991n91J495L785O562R420J1585J2691
63178F45714J3187J3829J4782J5572J5850J5930J6314J6931J7212J6848J6178
63167H18347J5739J5618J5386J4562J2950J0604P670M337P65l008o963j0813j4063
$$ y = [367574, 371058, 375010, 379276, 383880, 389011, 394468, 399579, 403967, 408093, 412818, 418713, 425971, 434657, 444759, 456275, 469357, 484027, 499604, 515063, 530356, 546756, 565308, 585398, 605594, 625493, 645832, 666976, 688299, 709153, 729596, 749812, 769472, 788124, 805826, 823098, 840455, 858171, 876097, 893507, 909378, 922995, 934154, 942777, 948606, 951191, 949764, 943202, 930732, 912855, 891132, 866866, 840531, 812600, 784218, 756507, 729752, 703966, 679985, 659233, 642403, 628952, 618048, 609538, 603758, 600767, 600176, 601671, 605456, 612018, 621438, 633023, 645714, 658901, 672730, 687512, 703084, 718934, 734864, 751178, 768109, 785321, 802169, 818347, 834086, 849704, 865090, 879652, 892602, 903206, 910876, 915213, 915978, 912970, 906007, 895194, 881131]
63154H81131j6492j8417k0248k1933k3086k3488k3136k1966k0041j7985j6637
63143F57702j6076j5425j3902j1765r902q763q079p396o580n780n182m803m424
63130E39625l788k944k289k133k340k404j906q33L18Q32N14N8L91J536K546K776
63114E29959K667K998L752M249M168L853L710L805M079M625N506O587P578Q199
63100E95735Q305P974P440O871O278N721N353N151M781M013L094K402J972J617
63086F66707J346J239J046M16m47q87o54j74K18Q00J882L129L955M387M944N728
63070F93635O262O348O482P086P802Q100Q348R486J1608J3583J4460J4740J5712
63057H23652J7893K0714K3614K6619K9732L2524L4744L6865L9397M2018M3985
$$ y = [881131, 864639, 846222, 825974, 804041, 780955, 757467, 734331, 712365, 692324, 674339, 657702, 641626, 626201, 612299, 600534, 590632, 581869, 573790, 566394, 559814, 554034, 548852, 544049, 539625, 535837, 532893, 530604, 528471, 526131, 523727, 521821, 520988, 521306, 522138, 522652, 522710, 523101, 524637, 527183, 529959, 532626, 535624, 539376, 543625, 547793, 551646, 555356, 559161, 563240, 567865, 573371, 579958, 587536, 595735, 604040, 612014, 619454, 626325, 632603, 638324, 643677, 648828, 653609, 657622, 660716, 663118, 665090, 666707, 668053, 669292, 670338, 670754, 670307, 669420, 668766, 668592, 668810, 669610, 671492, 674621, 678576, 682963, 687907, 693635, 699897, 706245, 712727, 719813, 727615, 735715, 744063, 753549, 765157, 778740, 793200, 807940, 823652, 841545, 862259, 885873, 912492, 942224, 974748, 1009492, 1046357, 1085754, 1127772, 1171757]
63046A171757M5334M6843M8674M9750M9010M6888M4868M3714M2893M1759M0551
63035A672041L9745L9087L8079L7034L6770L7210L7134L5565L2603K8510K2791
63024B056569J4937N538m154j3543k2845l2103m0860m8728n5557o0880o3899o4227
63012A670248o2244n8509n3435m7635m1947l6633l1059k4628j7758j1466o171
63001A278763j337L731R060J4048J8139K1378K4263K7086K9561L1268L2268L2933
62989A521161L3287L3021L2183L1318L0730L0051K8772K6776K4043K0260J5152
62978A826754Q947K037n591j4134k3195l1752l9071m5237n0631n5137n8205n9603
62966A455182n9711n8985n7503n5182n2203m8808m4953m0699l6796l4093l2232
$$ y = [1171757, 1217091, 1263934, 1312608, 1362358, 1411368, 1458256, 1503124, 1546838, 1589731, 1631490, 1672041, 1711786, 1750873, 1788952, 1825986, 1862756, 1899966, 1937100, 1972665, 2005268, 2033778, 2056569, 2071506, 2077044, 2072890, 2059347, 2036502, 2004399, 1963539, 1914811, 1859254, 1798374, 1734475, 1670248, 1608004, 1549495, 1496060, 1448425, 1406478, 1369845, 1338786, 1314158, 1296400, 1284934, 1278763, 1277426, 1281157, 1290217, 1304265, 1322404, 1343782, 1368045, 1395131, 1424692, 1455960, 1488228, 1521161, 1554448, 1587469, 1619652, 1650970, 1681700, 1711751, 1740523, 1767299, 1791342, 1811602, 1826754, 1835701, 1837738, 1832147, 1818013, 1794818, 1763066, 1723995, 1678758, 1628127, 1572990, 1514785, 1455182, 1395471, 1336486, 1278983, 1223801, 1171598, 1122790, 1077837, 1037138, 1000342, 966249, 934017]
62955I34017k9715k5796k1573j8581j6856j5288j3309j1269r388p450n610m508
62943G54674m341m612m946n383n701n348m416l897m441n502o149o166n938n754
62929F82080n709n831n918n657n185n068n448n708n411m918m704m619m377m264
62915F09263m673n270n251m342l107k413k779m028n271n610m996m161l524k793
62901E51045j824j112r31o64L08J549K076J638Q16J16m27r10j374j872k347k628
62885E43459k753k993l294l191k559j965j766j509p57Q5M25M49O53R04Q09O96
62869E26693J254K385L286L531L326K805J920R75M65K74k26j162j886j850j267
62854E40523p11n33p17r85r72n96k06j27l20p30j567k706l285k607j182j37J69
$$ y = [934017, 904302, 878506, 856933, 838352, 821496, 806208, 792899, 781630, 772242, 764792, 759182, 754674, 750333, 745721, 740775, 735392, 729691, 724343, 719927, 716030, 711589, 706087, 699938, 693772, 687834, 682080, 676371, 670540, 664622, 658965, 653780, 648712, 643264, 637556, 632145, 627227, 622523, 617904, 613527, 609263, 604590, 599320, 594069, 589727, 586620, 584207, 581428, 577400, 572129, 566519, 561523, 557362, 553838, 551045, 549221, 548109, 547178, 546514, 546822, 548371, 550447, 552085, 552901, 553017, 552590, 551680, 550306, 548434, 546087, 543459, 540706, 537713, 534419, 531228, 528669, 526704, 524938, 523429, 522672, 522757, 523182, 523631, 524284, 525188, 525997, 526693, 527947, 530332, 533618, 537149, 540475, 543280, 545200, 546175, 546640, 546914, 546688, 545526, 543640, 541790, 540523, 539812, 539279, 538562, 537577, 536605, 536009, 535803, 535676, 535356, 534626, 533059, 530353, 527068, 524461, 523279, 523142, 523311]
62837E23311J92J10l63j115j522j394j286j633k157k397k258j882j438j179j320
62822E03669j735k105k323k482k565k580k811l395l864l687l100k698k471j960
62808D65893j221p84o55k52O32J605K481L439M241M297L744L588M379N553O481
62793E03421P398Q770J0438J1945J3247J4605J6126J7763J9429K0933K2175K3588
62781F89838K5816K8835L1989L5092L8716M3145M7840N2332N6918O1816O6460
62770A178797P0223P3256P5776P7108P6321P3428O9084O3295N5310M4837L2567
62759A890002J9360N534q722k2748l5540m6411n5352o2797o8998p3652p6227p6735
62747A387714p5825p4063p1375o7528o2877n8268n4267n0743m7159m3069l8468
$$ y = [523311, 523503, 523613, 523250, 522135, 520613, 519219, 517933, 516300, 514143, 511746, 509488, 507606, 506168, 504989, 503669, 501934, 499829, 497506, 495024, 492459, 489879, 487068, 483673, 479809, 476122, 473022, 470324, 467853, 465893, 464672, 463888, 463233, 462981, 463613, 465218, 467699, 471138, 475379, 479676, 483420, 487008, 491387, 496940, 503421, 510819, 519589, 530027, 541972, 555219, 569824, 585950, 603713, 623142, 644075, 666250, 689838, 715654, 744489, 776478, 811570, 850286, 893431, 941271, 993603, 1050521, 1112337, 1178797, 1249020, 1322276, 1398052, 1475160, 1551481, 1624909, 1693993, 1757288, 1812598, 1857435, 1890002, 1909362, 1914896, 1906174, 1883426, 1847886, 1801475, 1746123, 1683326, 1614328, 1540676, 1464449, 1387714, 1311889, 1237826, 1166451, 1098923, 1036046, 977778, 923511, 872768, 825609, 782540, 744072]
62736G44072l3867l0006k7275k5396k3692k1642j9196j6736j4799j3608j2822
62725E05033j1897j0674r423q315p191n994n013m498m200l609k484j046L45J521
62711D32555K619L846N133O168O902P817R358J1296J3102J4767J6736J9129K1647
62698E71075K4296K7459L1055L4359L7088M0071M4186M9024N3226N5959N7550
62687A025348N8678N9482N9443N7870N4265M8518M0876L1855K2066J1981J759
62676A472141q688j9253k9359l8261m5534n1190n5449n8510o0363o0636n8991
62665I85907n5937n2772n0200m7509m3804l9619l6285l3976l1507k8221k4886
62654E41191k2421k0655j8882j6858j4731j2768j1505j1398j1852j1384r405p086
$$ y = [744072, 710205, 680199, 652924, 627528, 603836, 582194, 562998, 546262, 531463, 517855, 505033, 493136, 482462, 473039, 464724, 457533, 451539, 446526, 442028, 437828, 434219, 431735, 430689, 431034, 432555, 435174, 439020, 444153, 450321, 457223, 465040, 474398, 485694, 498796, 513563, 530299, 549428, 571075, 595371, 622830, 653885, 688244, 725332, 765403, 809589, 858613, 911839, 967798, 1025348, 1084026, 1143508, 1202951, 1260821, 1315086, 1363604, 1404480, 1436335, 1458401, 1470382, 1472141, 1463453, 1444200, 1414841, 1376580, 1331046, 1279856, 1224407, 1165897, 1105534, 1044898, 985907, 929970, 877198, 826998, 779489, 735685, 696066, 659781, 625805, 594298, 566077, 541191, 518770, 498115, 479233, 462375, 447644, 434876, 423371, 411973, 400121, 388737, 379332, 372246]
62642C72246n844n705n921o308o973p307o482m769l289k608k396k364k562k770
62628C06948k536k035k000k566k872k260j219p03r23j311j360j044m64M80J895
62613B88030L486M575M687M108L674L822M113L903L321L230M225N972P634Q718
62599C53498R394J0133J1191J2494J3930J5590J7597J9853K2194K4707K7614L0821
62587E69016L3906L6594L8863M0534M1174M0609L9188L7186L4220K9550K2865
62576I63705J4695O175j524p925j3532j9098k4558k9046l2011l3744l4615l4488
62564G54034l3349l1911l0875k9945k8253k5610k2699k0116j7837j5750j4103
62553D83586j3165j2732j2293j1617j1019j0913j1169j1113j0367r409q920q757
$$ y = [372246, 366402, 360697, 354776, 348468, 341495, 334188, 327706, 322937, 319648, 317040, 314644, 312280, 309718, 306948, 304412, 302377, 300377, 297811, 294939, 292679, 291460, 290757, 289834, 288523, 287163, 286119, 285655, 286135, 288030, 291516, 296091, 300778, 304886, 308560, 312382, 316495, 320398, 323719, 326949, 331174, 337146, 344780, 353498, 362892, 373025, 384216, 396710, 410640, 426230, 443827, 463680, 485874, 510581, 538195, 569016, 602922, 639516, 678379, 718913, 760087, 800696, 839884, 877070, 911290, 940840, 963705, 978400, 984575, 983051, 975126, 961594, 942496, 917938, 888892, 856881, 823137, 788522, 754034, 720685, 688774, 657899, 627954, 599701, 574091, 551392, 531276, 513439, 497689, 483586, 470421, 457689, 445396, 433779, 422760, 411847, 400678, 389565, 379198, 369789, 360869, 352112]
62541C52112q186p096o218n908n552m565l282k270j437n29J23J87K06Q98J934
62526C10417K407K374K892M385O041P099P766Q481R054R252R471J0222J1338J2402
62512D13601J3699J5924J9030K2097K4443K6307K8178L0021L1574L2979L4426
62501F92279L5293L4325L0965K6059K0922J5964J0590M309k523q986j4356j8527
62489H26314k1916k4927k7374k8611k8382k7327k6275k5385k4327k3089k1947
62478E46754k0791j9116j6724j3937j1186q896p589p335p164n899l698j908j226
62465D21285r91n45k48n27q30l65P60J872K731L467M078M594N375O577P734Q441
62449D63408Q981R693J0256J0331J0382J0920J1331J0455Q177N491K964J33l411
$$ y = [352112, 343926, 336830, 330612, 324704, 319152, 314587, 311305, 309035, 307598, 307069, 307192, 307379, 307585, 308483, 310417, 312824, 315198, 318090, 322475, 328516, 335615, 343381, 351862, 360916, 370168, 379639, 389861, 401199, 413601, 427300, 443224, 462254, 484351, 508794, 535101, 563279, 593300, 624874, 657853, 692279, 727572, 761897, 792862, 818921, 839843, 855807, 866397, 870706, 868183, 859197, 844841, 826314, 804398, 779471, 752097, 723486, 695104, 667777, 641502, 616117, 591790, 568701, 546754, 525963, 506847, 490123, 476186, 465000, 456104, 448515, 441180, 434016, 428117, 424419, 422511, 421285, 420294, 419749, 419501, 418974, 418144, 417779, 418539, 420411, 423142, 426609, 430687, 435281, 440656, 447233, 454967, 463408, 472389, 482082, 492338, 502669, 513051, 523971, 535302, 545757, 553934, 559425, 562389, 562522, 559111]
62436E59111p102r956j1661j2744j3902j5204j5957j5447j3919j2481j1812j1437
62424D07489j0545r046p348n628l962k721k118j608n60P53J543J745K111L168
62410C73273M716O299P584Q371Q744R146R756J0044R545Q783Q608Q842Q458P160
62396D89329N798N013M317K914Q52j127k550l580m582n579o229o352o307o515
62382D65402o640n842m014k113q15M02K202M177N586O729Q497J0985J3578J6223
62368E14357J9407K3007K6352K9402L2814L6688M0345M3521M6703N0080N3086
62357I15762N5321N6894N7550N6476N3352M8773M3054L5553K5797J4645L647o190
62345A360634j4525k1187k6233l0203l3781l7301m0711m3675m5541m5758m4529
$$ y = [559111, 552009, 542053, 530392, 517648, 503746, 488542, 472585, 457138, 443219, 430738, 418926, 407489, 396944, 387898, 380550, 374922, 370960, 368239, 366121, 364513, 363953, 364706, 366249, 367994, 370105, 373273, 377989, 384288, 391872, 400243, 408987, 418133, 427889, 437933, 447478, 456261, 464869, 473711, 482169, 489329, 495127, 500140, 504457, 507371, 508223, 507096, 504546, 500966, 496384, 490805, 484576, 478224, 471917, 465402, 458762, 452920, 448906, 446793, 445978, 446380, 448582, 452759, 458345, 465074, 473571, 484556, 498134, 514357, 533764, 556771, 583123, 612525, 645339, 682027, 722372, 765893, 812596, 862676, 915762, 971083, 1027977, 1085527, 1142003, 1195355, 1244128, 1287182, 1322735, 1348532, 1363177, 1366824, 1360634, 1346109, 1324922, 1298689, 1268486, 1234705, 1197404, 1156693, 1113018, 1067477, 1021719, 977190]
62334I77190m2612m0372l7596l4311l1080k8255k5689k3415k1845k0866j9683
62323F51466j8014j6620j5913j4946j2756j0045q362p848p043m990k514r73o25
62310E30817p26q14j110j776k415k616k712l440m874o142o524o395o570p065p178
62295D70460o618n845n110m027k399q54o0L19J292L282N538O854O703N745N239
62280D80519N904P332Q626R410R970J0607J1303J1960J2523J2903J3127J3543
62268F07727J4421J5533J6571J7825J9755K2106K4279K6589L0106L4974L9858
62257H69744M3599M6607M9903N3319N5512N5476N3270M9271M3331L5035K4498
62246A379565J2666P91j0250k0041k8219l4462l9030m2740m5952m8121m8860m8857
$$ y = [977190, 934578, 894206, 856610, 822299, 791219, 762964, 737275, 713860, 692015, 671149, 651466, 633452, 616832, 600919, 585973, 573217, 563172, 554810, 546962, 539919, 534929, 532415, 531442, 530817, 530091, 529277, 528167, 526391, 523976, 521360, 518648, 515208, 510334, 504192, 497668, 491273, 484703, 477638, 470460, 463842, 457997, 452887, 448860, 446461, 445607, 445547, 445866, 447158, 450440, 455978, 462832, 469535, 475280, 480519, 486423, 493755, 502381, 511791, 521761, 532368, 543671, 555631, 568154, 581057, 594184, 607727, 622148, 637681, 654252, 672077, 691832, 713938, 738217, 764806, 794912, 829886, 869744, 913343, 959950, 1009853, 1063172, 1118684, 1174160, 1227430, 1276701, 1320032, 1355067, 1379565, 1392231, 1393022, 1382772, 1362731, 1334512, 1300050, 1261020, 1218280, 1172328, 1124207, 1075347, 1026490]
62234A026490m8832m8115m5424m0878l5997l1684k7493k3126j9280j6445j4088
62223F75128j1667r497p915o542n152m344m450m597l895k920k809l463l725l127
62209F01025k288j669j015k23K70L22O39J935L946N726O799P653R056J1087J3060
62194F56323J4444J5520J6925J8734K0505K2013K3340K4333K4686K4637K4797
62183H86257K5046K4314K1895J8337J4623J1134P899N192L261J927J113J368L221
62170A025587O373J0095J4162J8727K3497K7715L0913L3187L4630L4866L3228
62159A292980K9333K3556J7004J0849N607J207k484n651q820j2446j6162j9171
62147A315802k1409k3461k5247k5822k4838k3118k1368j9297j6750j4564j3407
$$ y = [1026490, 977658, 929543, 884119, 843241, 807244, 775560, 748067, 724941, 705661, 689216, 675128, 663461, 653964, 646049, 639507, 634355, 630011, 625561, 620964, 617069, 614149, 611340, 607877, 604152, 601025, 598737, 597068, 596053, 595830, 596100, 596422, 597061, 598996, 602942, 608668, 615467, 623120, 632176, 643263, 656323, 670767, 686287, 703212, 721946, 742451, 764464, 787804, 812137, 836823, 861460, 886257, 911303, 935617, 957512, 975849, 990472, 1001606, 1009505, 1014697, 1017958, 1019885, 1020998, 1022366, 1025587, 1031960, 1042055, 1056217, 1074944, 1098441, 1126156, 1157069, 1190256, 1224886, 1259752, 1292980, 1322313, 1345869, 1362873, 1373722, 1379329, 1380536, 1378052, 1372401, 1363581, 1351135, 1334973, 1315802, 1294393, 1270932, 1245685, 1219863, 1195025, 1171907, 1150539, 1131242, 1114492, 1099928, 1086521]
62136A086521j2656j1484j0330j0119j0563j0454r345p854o499n185l789k354
62124I85889p71J022K657L879N207P262R592J1074J1405J1439J1999J3182J4742
62111A088578J6405J7644J7853J7072J6143J6006J6987J8713K0437K1702K2857
62100A290397K4672K7163K9462L1203L3369L6944M1347M5040M7268M8170M7632
62089A702667M5369M2161L9819L9558M1176M3883M7113N0238N2309N2588N0991
62078B207872M7954M4256M0890L8479L6776L5184L3749L3043L3271L4190L5724
62067B621388L7879M0052M1295M1445M1190M0859L9896L7711L4412L0447K6200
62056C032774K2224J9145J7033J5365J3924J3052J2788J2361J1070R180P487O410
$$ y = [1086521, 1073865, 1062381, 1052051, 1041932, 1031369, 1020915, 1011570, 1003716, 997217, 992032, 988243, 985889, 985118, 986140, 988797, 992676, 997883, 1005145, 1014737, 1025811, 1037216, 1048655, 1060654, 1073836, 1088578, 1104983, 1122627, 1140480, 1157552, 1173695, 1189701, 1206688, 1225401, 1245838, 1267540, 1290397, 1315069, 1342232, 1371694, 1402897, 1436266, 1473210, 1514557, 1559597, 1606865, 1655035, 1702667, 1748036, 1790197, 1830016, 1869574, 1910750, 1954633, 2001746, 2051984, 2104293, 2156881, 2207872, 2255826, 2300082, 2340972, 2379451, 2416227, 2451411, 2485160, 2518203, 2551474, 2585664, 2621388, 2659267, 2699319, 2740614, 2782059, 2823249, 2864108, 2904004, 2941715, 2976127, 3006574, 3032774, 3054998, 3074143, 3091176, 3106541, 3120465, 3133517, 3146305, 3158666, 3169736, 3178916, 3186403, 3192813]
62044C192813N963O295P720J0220J3289J6247J8602K0248K1468K2670K4002K5256
62032C384793K6133K6445K6086K4964K3131K0835J8449J6169J3686J0298N735
62021C596724Q28l171n953q346j0910j3147j4417j4928j5128j4834j3753j2309
62009C470656j1058r732p724n125k289J174N793J0827J4749J7223J9384K1942
61997C525820K4078K4599K3244K0372J6215J1029N442K24m034o978q673r737j0671
61984C610930j1181j0761r816r275r204q843q114p881q502r320j0085j1579j4124
61971C482245j6600j7990j8971k0827k3392k5301k5975k6196k6759k7523k7962
61960C224749k7981k7877k7879k7943k7738k6874k5286k3360k1468j9489j7000
$$ y = [3192813, 3198776, 3205071, 3212791, 3223011, 3236300, 3252547, 3271149, 3291397, 3312865, 3335535, 3359537, 3384793, 3410926, 3437371, 3463457, 3488421, 3511552, 3532387, 3550836, 3567005, 3580691, 3590989, 3596724, 3597552, 3594381, 3588428, 3580082, 3569172, 3556025, 3541608, 3526680, 3511552, 3496718, 3482965, 3470656, 3459598, 3449866, 3442142, 3437017, 3434728, 3435902, 3441695, 3452522, 3467271, 3484494, 3503878, 3525820, 3549898, 3574497, 3597741, 3618113, 3634328, 3645357, 3650799, 3651023, 3646989, 3640011, 3631338, 3621601, 3610930, 3599749, 3588988, 3579172, 3569897, 3560693, 3551850, 3543736, 3535855, 3527353, 3518033, 3507948, 3496369, 3482245, 3465645, 3447655, 3428684, 3407857, 3384465, 3359164, 3333189, 3306993, 3280234, 3252711, 3224749, 3196768, 3168891, 3141012, 3113069, 3085331, 3058457, 3033171, 3009811, 2988343, 2968854, 2951854]
61949B951854j3714r644n025l31L911P596J1205J5293J9882K4457K8322L0928
61937C064734L2162L2481L2583L2757L2826L2719L2612L2376L1352K9117K6088
61926C411807K3013K0093J7049J4047J2094J2393J5395K0586K7234L5348M5651
61915C654710N8522P3275Q8811J04882J22108J40900J60927J81785K03656K27159
61905E016735K53048K82301L16041L55020L99375M48838N02614N58563O12778
61896H745313O59864O92991P03272O79933O12927M97197L36048J41692o7318k70459
61886A2731460m49602n91872o90916p46972p65615p55046p23247o76891o21905
61877F709394n63742n06506m52316m01910l55687l13971k76754k43727k14509
$$ y = [2951854, 2938140, 2928496, 2923471, 2923140, 2927051, 2934647, 2945852, 2961145, 2981027, 3005484, 3033806, 3064734, 3096896, 3129377, 3161960, 3194717, 3227543, 3260262, 3292874, 3325250, 3356602, 3385719, 3411807, 3434820, 3454913, 3471962, 3486009, 3498103, 3510496, 3525891, 3546477, 3573711, 3609059, 3654710, 3713232, 3786507, 3875318, 3980200, 4102308, 4243208, 4404135, 4585920, 4789576, 5016735, 5269783, 5552084, 5868125, 6223145, 6622520, 7071358, 7573972, 8132535, 8745313, 9405177, 10098168, 10801440, 11481373, 12094300, 12591497, 12927545, 13069237, 13001919, 12731460, 12281858, 11689986, 10999070, 10252098, 9486483, 8731437, 8008190, 7331299, 6709394, 6145652, 5639146, 5186830, 4784920, 4429233, 4115262, 3838508, 3594781, 3380272]
61868C380272j88675j65710j45153j26623j09778r4404q0498o7925n6092m4406
61858B301008l3017k2492j2709k793P580J7467K5735L2330L7904M2524M5465M6170
61846B485172M4815M1753L6891K9864K0782J0510K33r166j7174k3223k6569k6710
61834B567178k3812j8515j1545l728L959J0673J5901J9214K0083J8252J3941P352
61822B618953j630j2721k4636l5836m5586n3716n9749o3174o4324o4011o2332
61811B131238n8653n2871m5816l8294l0628k3167j6403j0280m062K768J0022J7259
61799A881113K4147L0365L5910M1463M7759N4528O0961O7157P4095Q2090R0476
61788B490064R9102J08979J20942J34651J49560J65979J84605K05816K30084K58316
$$ y = [3380272, 3191597, 3025887, 2880734, 2754111, 2644333, 2549929, 2469431, 2401506, 2345414, 2301008, 2267991, 2245499, 2232790, 2229997, 2237577, 2255044, 2280779, 2313109, 2351013, 2393537, 2439002, 2485172, 2529987, 2571740, 2608631, 2638495, 2659277, 2669787, 2670020, 2660854, 2643680, 2620457, 2593888, 2567178, 2543366, 2524851, 2513306, 2509578, 2513537, 2524210, 2540111, 2559325, 2579408, 2597660, 2611601, 2618953, 2617323, 2604602, 2579966, 2544130, 2498544, 2444828, 2385079, 2321905, 2257581, 2193570, 2131238, 2072585, 2019714, 1973898, 1935604, 1904976, 1881809, 1865406, 1855126, 1851064, 1853832, 1863854, 1881113, 1905260, 1935625, 1971535, 2012998, 2060757, 2115285, 2176246, 2243403, 2317498, 2399588, 2490064, 2589166, 2698145, 2819087, 2953738, 3103298, 3269277, 3453882, 3659698, 3889782, 4148098]
61778D148098K91258L29138L72364M21902M78615N42965O15723O97926P89497
61769H687486Q88532R92123J096540J195622J279541J335475J348349J301025
61761A8124693J177129R67993O79135L30923m5873m15793p44783j007250j191207
61752A7874967j297707j335925j318922j261674j179059j083174r82280q81977
61744H534249p86299o97651o16988n44833m81707m27354l80292l38635l01012
61735C959478k66802k36028k09157j86399j66928j49226j32380j16696j02924
61726B392938r1301q1439p2890o5597n9877n5951n3442n1591m9960m8562m7177
61715A715151m5186m2391l9414l6686l3696k9899k5887k2725k0534j8601j6640
$$ y = [4148098, 4439356, 4768494, 5140858, 5562760, 6041375, 6584340, 7200063, 7897989, 8687486, 9576018, 10568141, 11664681, 12860303, 14139844, 15475319, 16823668, 18124693, 19301822, 20269815, 20948950, 21279873, 21234000, 20818207, 20073424, 19066174, 17874967, 16577260, 15241335, 13922413, 12660739, 11481680, 10398506, 9416226, 8534249, 7747950, 7050299, 6433311, 5888478, 5406771, 4979417, 4599125, 4260490, 3959478, 3692676, 3456648, 3247491, 3061092, 2894164, 2744938, 2612558, 2495862, 2392938, 2301637, 2220198, 2147308, 2081711, 2021834, 1965883, 1912441, 1860850, 1810890, 1762328, 1715151, 1669965, 1627574, 1588160, 1551474, 1517778, 1487879, 1461992, 1439267, 1418733, 1400132, 1383492]
61704A383492j5030j3874j2874j2159j2315j3318j4270j4506j4332j4426j4996
61693A231392j5884j6939j7922j8386j8089j7345j6749j6534j6359j5751j4630
61682A046804j3471j2782j2548j2323j1784j0900r573p695n667m191l302k157
61670I40411k22J966L672M937N983O268N068K748N74p20j454k155k758k736j623
61655I59959N11K857M372M844N017N362N302M292L003K454K456J971P98k80r92
61640A001926k063l924n904p100p399p150o424n049l062p95J417L466N539P875
61626I71353J0321J2235J3033J2575J0934Q222N014K288M17j297l451n473o503
61613A029668o783p135p458o996n922n379n811o392o414o249o489p017p401p544
$$ y = [1383492, 1368462, 1354588, 1341714, 1329555, 1317240, 1303922, 1289652, 1275146, 1260814, 1246388, 1231392, 1215508, 1198569, 1180647, 1162261, 1144172, 1126827, 1110078, 1093544, 1077185, 1061434, 1046804, 1033333, 1020551, 1008003, 995680, 983896, 972996, 963423, 955728, 950061, 945870, 942568, 940411, 940189, 942155, 945827, 950764, 956747, 963015, 968083, 970831, 971405, 970685, 969231, 967076, 964318, 961582, 959959, 960470, 963327, 967699, 972543, 977560, 982922, 988224, 992516, 995519, 997973, 1000429, 1002400, 1003198, 1002918, 1001926, 999863, 995939, 990035, 982935, 975536, 968386, 961962, 956913, 953851, 953056, 954473, 957939, 963478, 971353, 981674, 993909, 1006942, 1019517, 1030451, 1038673, 1043687, 1045975, 1046392, 1045095, 1041644, 1036171, 1029668, 1022885, 1015750, 1008292, 1001296, 995374, 989995, 984184, 977792, 971378, 965129, 958640, 951623, 944222, 936678]
61599I36678p546p493p664q408r517j0245j0220r775r208q304p011n926n648n946
61585H23767n939m954l027q31P91J547K052L189N102P157Q845J0269J1799J3722
61571H73489J6253J9359K2505K5112K7285K9604L2147L4329L5746L6602L6999
61560A189430L6502L4712L1921K8860K6093K3862K2287K1412K1121K1047K0578
61549A477825J9222J7176J5243J3842J2405J0106O725K417k796q530j3574j6949
61537A533112j9117k1147k3020k3881k3767k3571k3310k1867j8969j5952j3940
61526A304571j2401j0362p924n659l330l37L217O836J0613J4982J9817K4570K9169
61513A373762L4081L9622M5831N2835O0833O9829P9782R0865J03196J16518J30621
$$ y = [936678, 929132, 921639, 913975, 905567, 896050, 885805, 875585, 865810, 856602, 848298, 841287, 835361, 829713, 823767, 817828, 812874, 809847, 809016, 809807, 811354, 813406, 816595, 821697, 828854, 837699, 847968, 859767, 873489, 889742, 909101, 931606, 956718, 984003, 1013607, 1045754, 1080083, 1115829, 1152431, 1189430, 1225932, 1260644, 1292565, 1321425, 1347518, 1371380, 1393667, 1415079, 1436200, 1457247, 1477825, 1497047, 1514223, 1529466, 1543308, 1555713, 1565819, 1572544, 1574961, 1572165, 1563635, 1550061, 1533112, 1513995, 1492848, 1469828, 1445947, 1422180, 1398609, 1375299, 1353432, 1334463, 1318511, 1304571, 1292170, 1281808, 1273884, 1268225, 1264895, 1264558, 1267775, 1274611, 1285224, 1300206, 1320023, 1344593, 1373762, 1407843, 1447465, 1493296, 1546131, 1606964, 1676793, 1756575, 1847440, 1950636, 2067154, 2197775]
61502B197775J45773J62284J79890J97966K15973K33042K47209K55812K56698
61493D092422K48522K30011J99914J58392J08223N4073M74m9379r3306j29494
61483D819852j56756j75153j85811j89993j88600j82525j72945j60976j47393
61474C259700j32885j18210j03777q9467p5253o1561m8669l6236k4041j2678k712
61463B554211O390J5544K4560L2408L8924M4989N0795N5195N7357N8005N8232
61452B996610N7854N5948N2621M9281M7138M6165M5683M5398M5499M5980M6326
61441C534503M6063M5459M5181M5246M4737M2973M0459L8141L6016L3156K8929
61430C980863K3476J7111J0029K576m860j2348k0113k7692l4080l8927m2868m6367
$$ y = [2197775, 2343548, 2505832, 2685722, 2883688, 3099661, 3332703, 3579912, 3835724, 4092422, 4340944, 4570955, 4770869, 4929261, 5037484, 5091557, 5092031, 5042652, 4949346, 4819852, 4663096, 4487943, 4302132, 4112139, 3923539, 3741014, 3568069, 3407093, 3259700, 3126815, 3008605, 2904828, 2815361, 2740108, 2678547, 2629878, 2593642, 2569601, 2556923, 2554211, 2560601, 2576145, 2600705, 2633113, 2672037, 2717026, 2767821, 2823016, 2880373, 2938378, 2996610, 3054464, 3110412, 3163033, 3212314, 3259452, 3305617, 3351300, 3396698, 3442197, 3488177, 3534503, 3580566, 3626025, 3671206, 3716452, 3761189, 3804162, 3844621, 3882762, 3918778, 3951934, 3980863, 4004339, 4021450, 4031479, 4034055, 4029195, 4016847, 3996734, 3969042, 3934962, 3896035, 3853167, 3806800]
61418C806800m8849m9322m7453m3772l9192l4464k9766k4679j8911j2960p690
61407C449742l411O0K606L834L753K641K16m119j0045j6140k1177k4858k7131
61394C355971k7591k5913k2234j6731r412m71R801K1595L5384N1024O7742Q5235
61382C524400J03917J23941J44772J65996J87665K09431K30203K48934K64838
61373E204097K76489K81609K78239K65400K42343K08357J64161J12733N8197M456
61363G096081m5064q7835j23430j53451j79291k00596k16514k27439k34420k37632
61353E390409k36613k31630k23789k14058k03047j91449j79920j68659j57628
61344C583616j46784j35760j23961j11609r9900q9404p9003o7396n4973m3171
$$ y = [3806800, 3757951, 3708629, 3661176, 3617404, 3578212, 3543748, 3513982, 3489303, 3470392, 3457432, 3449742, 3446331, 3446391, 3448997, 3452831, 3456584, 3459225, 3459441, 3455322, 3445277, 3429137, 3407960, 3383102, 3355971, 3328380, 3302467, 3280233, 3263502, 3254090, 3253619, 3263420, 3285015, 3320399, 3371423, 3439165, 3524400, 3628317, 3752258, 3897030, 4063026, 4250691, 4460122, 4690325, 4939259, 5204097, 5480586, 5762195, 6040434, 6305834, 6548177, 6756534, 6920695, 7033428, 7091625, 7096081, 7051017, 6963182, 6839752, 6686301, 6507010, 6306414, 6089900, 5862461, 5628041, 5390409, 5153796, 4922166, 4698377, 4484319, 4281272, 4089823, 3909903, 3741244, 3583616, 3436832, 3301072, 3177111, 3065502, 2965602, 2876198, 2797195, 2729799, 2674826, 2631655]
61334B631655l2486k2299j2288k844N791J3763K0967K7106L2366L7199M1450M4468
61322B784848M6043M6559M6285M5205M3537M1689L9589L6716L2919K8760K5038
61311C217188K2311K0708J9717J8297J5688J2102Q278M510M75m194r518j5126
61299C310436k0315k4528k8093l1977l6454m0523m3254m5023m6795m8703n0152
61288B894619n0855n0835m9749m7186m3449l9234l4650k9344k3401j7405j1701
61277B496810o419j990J115L033M158M363L400J886Q74N43K24j78J20J362K515
61262B511816K429J123n47k004l261m381n011m350j481M056J2021K1869L3213
61249B565492M5745N8987P2488Q5963R8815J09873J18050J22887J23914J19732
$$ y = [2631655, 2599169, 2576870, 2564582, 2561738, 2567529, 2581292, 2602259, 2629365, 2661731, 2698930, 2740380, 2784848, 2830891, 2877450, 2923735, 2968940, 3012477, 3054166, 3093755, 3130471, 3163390, 3192150, 3217188, 3239499, 3260207, 3279924, 3298221, 3313909, 3326011, 3334289, 3338799, 3339274, 3335080, 3325562, 3310436, 3290121, 3265593, 3237500, 3205523, 3169069, 3128546, 3085292, 3040269, 2993474, 2944771, 2894619, 2843764, 2792929, 2743180, 2695994, 2652545, 2613311, 2578661, 2549317, 2525916, 2508511, 2496810, 2490391, 2488401, 2489516, 2492549, 2496707, 2501070, 2504470, 2506356, 2507230, 2507773, 2507997, 2507819, 2507939, 2509301, 2511816, 2514245, 2515368, 2514821, 2512817, 2509556, 2505175, 2500164, 2495814, 2494333, 2498389, 2510410, 2532279, 2565492, 2611237, 2670224, 2742712, 2828675, 2927490, 3037363, 3155413, 3278300, 3402214, 3521946]
61239C521946J08482Q9098O1774K7771j0400m8961q4156j13822j37220j53774
61229C260738j62954j65276j62343j55679j46276j35302j24132j13296j02305
61220A993175r0969q0115p0537o1957n3728m6033l9662l4851l0963k7279k3576
61209A433505j9974j6575j3382j0328p154l377J328O576J1307J4718J7150J9561
61197A433355K2179K4178K4819K4186K2576J9883J6265J2705J0086Q114N913L357
61185A627616J001j018l087n274p328r415j1935j4603j6648j8079j9829k2345
61173A499056k4919k6799k8199k9620l0832l1211l0739l0039k9472k8906k8344
61162A179976k8286k9069l0102l0204k8871k6817k4948k3183k0871j8225j6397
$$ y = [3521946, 3630428, 3719526, 3781300, 3809071, 3798671, 3749710, 3665554, 3551732, 3414512, 3260738, 3097784, 2932508, 2770165, 2614486, 2468210, 2332908, 2208776, 2095480, 1993175, 1902206, 1822091, 1751554, 1689597, 1635869, 1589836, 1550174, 1515323, 1484360, 1457081, 1433505, 1413531, 1396956, 1383574, 1373246, 1366092, 1362715, 1364043, 1370619, 1381926, 1396644, 1413794, 1433355, 1455534, 1479712, 1504531, 1528717, 1551293, 1571176, 1587441, 1600146, 1610232, 1618346, 1624259, 1627616, 1628617, 1627599, 1624512, 1619238, 1611910, 1602495, 1590560, 1575957, 1559309, 1541230, 1521401, 1499056, 1474137, 1447338, 1419139, 1389519, 1358687, 1327476, 1296737, 1266698, 1237226, 1208320, 1179976, 1151690, 1122621, 1092519, 1062315, 1033444, 1006627, 981679, 958496, 937625, 919400, 903003]
61151I03003j5963j6208j6362j6716j7842j9353k0272k0278j9765j9020j8011
61140G03213j6769j5269j3258j0795q601p194o066m479k668j315k44J275L146
61127F20976M475N030N553O504P514Q252Q923R631J0065J0185J0475J1215J2094
61114G30892J2782J3254J3391J2980J2327J2218J2914J3707J3778J3000J1578
61103H72821R472O538L006n15l327m951n429n349n330n491n715o112o823p591
61089H35204q142q804j0060j1605j2592j2851j3058j3604j4044j3932j3543j3312
61077F89657j3057j2172j0433q335o700n953n668m986l630k180j151k44R53K036
61063F18137K248J578O73q9o84p31L09K191L863M556M328L569K595J812J585J805
$$ y = [903003, 887040, 870832, 854470, 837754, 819912, 800559, 780287, 760009, 740244, 721224, 703213, 686444, 671175, 657917, 647122, 638521, 631327, 625261, 620782, 618114, 616799, 616555, 617830, 620976, 625451, 630481, 636034, 642538, 650052, 658304, 667227, 676858, 686923, 697108, 707583, 718798, 730892, 743674, 756928, 770319, 783299, 795626, 807844, 820758, 834465, 848243, 861243, 872821, 882293, 888831, 891837, 891322, 887995, 883044, 877615, 872266, 866936, 861445, 855730, 849618, 842795, 835204, 827062, 818258, 808198, 796593, 784001, 771150, 758092, 744488, 730444, 716512, 702969, 689657, 676600, 664428, 653995, 645660, 638960, 633007, 627339, 622353, 618723, 616543, 615392, 615148, 616101, 618137, 620385, 621963, 622636, 622547, 621863, 621132, 621441, 623632, 627495, 632051, 636379, 639948, 642543, 644355, 645940, 647745]
61047F47745K056K239K624L273L918M344M517M412M223M562N886P824R499J0473
61033G17595J1024J1650J2605J3690J4250J3855J3175J3506J5026J6376J6487
61022H69239J5915J5630J5504J5065J4713J5037J5619J5815J6037J7045J8654
61011A044273K0368K2614K5927K9688L3087L6569M0774M4901M7845N0109N2687
61000A448842N5024N6353N8277O3433P1983Q2032R3153J06603J22078J37276J51129
60989B446183J64999J80646J99963K26702K65139L16521L80236M58744N57295
60980E196428O78405Q21704R90392J192156J432652J715869K049647K426574K772857
60971A9276684K924607K701683K051598J131913K34589l87281o33420n36372j87379
$$ y = [647745, 649801, 652040, 654664, 657937, 661855, 666199, 670716, 675128, 679351, 683913, 689799, 697623, 707122, 717595, 728619, 740269, 752874, 766564, 780814, 794669, 807844, 821350, 836376, 852752, 869239, 885154, 900784, 916288, 931353, 946066, 961103, 976722, 992537, 1008574, 1025619, 1044273, 1064641, 1087255, 1113182, 1142870, 1175957, 1212526, 1253300, 1298201, 1346046, 1396155, 1448842, 1503866, 1560219, 1618496, 1681929, 1753912, 1835944, 1929097, 2035700, 2157778, 2295054, 2446183, 2611182, 2791828, 2991791, 3218493, 3483632, 3800153, 4180389, 4639133, 5196428, 5874833, 6696537, 7686929, 8879085, 10311737, 12027606, 14077253, 16503827, 19276684, 22201291, 24902974, 26954572, 28086485, 28321074, 27933793, 27300373, 26764001, 26576622]
60962B6576622K81678O70807P44199L58378m21083j342465k121462k590065k733126
60953A9423483k629312k379325k068265j754181j466957j215844j001834q24160
60945F083605o79091n60013m61743l82369l20274k72275k35458k08141j88134
60936B776107j72358j58902j47449j37216j26534j14924j03545r3105q3213p4262
60926A564599o7922o4939o4028o3511o2612o0747n7281n2667m8326m4806m1285
60915I36475l7286l3488l0380k7535k4705k2318k0389j8239j5786j3824j2561
60904F79964j1122r154p535o942o821o528o302o431o458n985n302m596l427j638
60890E91723N4J092J848K760L466L586L635M442O019P677Q843R381R407R159Q761
$$ y = [26576622, 26858300, 27529107, 28273306, 28631684, 28210601, 26868136, 24746674, 22156609, 19423483, 16794171, 14414846, 12346581, 10592400, 9125443, 7909599, 6907765, 6083605, 5404514, 4844501, 4382758, 4000389, 3680115, 3407840, 3172382, 2964241, 2776107, 2603749, 2444847, 2297398, 2160182, 2033648, 1918724, 1815179, 1722074, 1638861, 1564599, 1496677, 1431738, 1367710, 1304199, 1241587, 1180840, 1123559, 1070892, 1022566, 977760, 936475, 899189, 865701, 835321, 807786, 783081, 760763, 740374, 722135, 706349, 692525, 679964, 668842, 659688, 652153, 645211, 638390, 631862, 625560, 619129, 612671, 606686, 601384, 596788, 593361, 591723, 591777, 592869, 594717, 597477, 600943, 604529, 608164, 612606, 618625, 626302, 635145, 644526, 653933, 663092, 671853]
60875F71853P961O501M704L118J664j16j965l028l256l712n044o528p203p198
60861F57751p352p976q568q475p479n953m608l772l042j964q14j06M77J761L794
60846F03674N775P385R242J1787J4608J7028J8525J8459J6405J3137J0423R278
60834G55726R224R592J0517J2110J3541J3801J2787J0976Q587N815L388K045J683
60821H69792J667J743K073K528K637K284J839J529J045M5j191j992k199k566l954
60806H75280o298q739j0687j2256j3561j4318j4456j4437j4484j4100j2909j1394
60794G27641j0155r076p938p110o714n813l601q49J134K462M139N976O747O387
60780G03230O324P314Q537R255R809J0383J0234R000P559O785O399N860N398N405
$$ y = [671853, 679814, 686315, 691019, 694137, 695801, 695685, 693720, 690692, 687436, 683724, 678680, 672152, 664949, 657751, 650399, 642423, 633855, 625380, 617901, 611948, 607340, 603568, 600526, 598562, 597748, 597642, 598119, 599880, 603674, 609449, 616834, 626076, 637863, 652471, 669499, 688024, 706483, 722888, 736025, 746448, 755726, 764950, 774542, 785059, 797169, 810710, 824511, 837298, 848274, 856861, 862676, 866064, 868109, 869792, 871459, 873202, 875275, 877803, 880440, 882724, 884563, 886092, 887137, 887182, 885991, 883999, 881800, 879234, 875280, 868982, 860243, 849556, 837300, 823739, 809421, 794965, 780528, 766044, 751944, 739035, 727641, 717486, 708410, 700472, 693362, 686648, 680835, 677234, 676385, 677519, 679981, 684120, 690096, 696843, 703230, 709554, 716868, 725405, 734660, 744469, 754852, 765086, 774086, 781645, 788430, 794829, 800689, 806087, 811492]
60766H11492N615N710N956O496O761O367N900O024O423O418O044N843O062O683
60752H97794P721Q835R216Q510P414O770O581O464O388O286N613M096K379J075
60738I85142k34k142l998m521l654k713k630l108l659m499n897p381q269q644
60724I23793r124r748r701q474o846o233o999q005q073p368o865o831o705o327
60710H16494o290o903p598p759p635p835q356q545p866o406m753l447k386q77
60696G29838J465L990N727O638P480Q472Q910Q276O921N314L341P89k061m749
60682G90351p122r135j0657j1813j3080j4657j6108j6897j6882j6133j4691j2753
60670F30423j0665q559o405m477l120k002l41J872L663M353M363M261L883K921
$$ y = [811492, 817107, 822817, 828773, 835269, 842030, 848397, 854297, 860321, 866744, 873162, 879206, 885049, 891111, 897794, 905515, 914350, 923566, 932076, 939490, 946260, 952841, 959305, 965693, 971979, 977592, 981688, 984067, 985142, 984908, 982766, 978768, 974247, 970593, 967880, 965250, 962142, 958483, 953984, 948087, 940706, 932437, 923793, 914669, 904921, 895220, 886746, 879900, 873667, 866668, 858663, 850590, 843222, 836357, 829526, 822821, 816494, 810204, 803301, 795703, 787944, 780309, 772474, 764118, 755573, 747707, 741301, 736548, 733101, 730715, 729838, 731303, 735293, 741020, 747658, 755138, 763610, 772520, 780796, 787717, 793031, 796372, 797161, 795100, 790351, 783229, 774094, 763437, 751624, 738544, 723887, 707779, 690882, 674000, 657867, 643176, 630423, 619758, 611199, 604794, 600317, 597197, 595195, 594854, 596726, 600389, 604742, 609105, 613366, 617249, 620170]
60656F20170J747R92P54P67R13J084R80N79M13R17J822K562K904K861K454J939
60640F43858J744J875J850J557J569K264L247M104N024O168P157P827Q783J0479
60626G07506J2327J3578J4458J5583J6705J7086J6793J6549J6453J5846J4510
60615H77394J3052J1931J0867R474P792N896L579Q25j822l751m980o025p191q253
60601I08788q883r149r439r983j0739j1753j3232j4939j5985j5653j4278j2709
60589G62046j1143r144o654m182j993L5J694K496K556K578K710K388J600J224
60575G46211J646K048J808J542J925K358J957J138J110K069L026L209K820K336
60561G75203J858J142j39k038l960m986m957m730m995n420n443n168m722l510
$$ y = [620170, 621917, 622909, 623663, 624430, 625343, 626427, 627407, 627986, 628399, 629316, 631138, 633700, 636604, 639465, 641919, 643858, 645602, 647477, 649327, 650884, 652453, 654717, 657964, 662068, 667092, 673260, 680417, 688244, 697027, 707506, 719833, 733411, 747869, 763452, 780157, 797243, 814036, 830585, 847038, 862884, 877394, 890446, 902377, 913244, 922718, 930510, 936406, 939985, 940810, 938988, 935237, 930257, 924232, 917041, 908788, 899905, 890756, 881317, 871334, 860595, 848842, 835610, 820671, 804686, 789033, 774755, 762046, 750903, 741759, 735105, 730923, 728930, 728965, 730659, 733155, 735711, 738289, 740999, 743387, 744987, 746211, 747857, 749905, 751713, 753255, 755180, 757538, 759495, 760633, 761743, 763812, 766838, 770047, 772867, 775203, 777061, 778203, 778064, 776026, 772066, 767080, 762123, 757393, 752398, 746978, 741535, 736367, 731645, 728135]
60547G28135j070J817L963N389P112R620J2564J5793J9565K3807K8052L2165L6175
60534I23087L9310M0195L8111L3305K5942J5861L776q200j7960k4875k9389l1647
60522A007516l1280k8365k3958j9311j4856j0143m872L62M615P657J0005J1902
60510I09272J2913J2848J2375J2233J2381J2576J3284J5278J8615K2803K7785
60499A082363L3957M1359M9646N8947O9968Q3159R8293J15085J33558J53666J75114
60488B095115J97835K22205K48466K76162L04010L29496L47840L51799L33697
60479D706625K88902K18047J26368K1435q8081j92035k79235l40582l72863l79363
60469C709218l66628l41083l08174k72770k38568k07228j78942j53829j32285
$$ y = [728135, 727065, 728882, 732845, 738234, 745346, 754966, 767530, 783323, 802888, 826695, 854747, 886912, 923087, 962397, 1002592, 1040703, 1074008, 1099950, 1115811, 1119587, 1111387, 1093427, 1068552, 1039163, 1007516, 976236, 947871, 923913, 904602, 889746, 879603, 874731, 875093, 879708, 887365, 897370, 909272, 922185, 935033, 947408, 959641, 972022, 984598, 997882, 1013160, 1031775, 1054578, 1082363, 1116320, 1157679, 1207325, 1266272, 1336240, 1419399, 1517692, 1632777, 1766335, 1920001, 2095115, 2292950, 2515155, 2763621, 3039783, 3343793, 3673289, 4021129, 4372928, 4706625, 4995527, 5213574, 5339942, 5361377, 5273296, 5081261, 4802026, 4461444, 4088581, 3709218, 3342590, 3001507, 2693333, 2420563, 2181995, 1974767, 1795825, 1641996, 1509711]
60460A509711j14253r9118q6388p5900o7290n9788n2747m6055l9973l4801l0671
60449H02727k7375k4448k1584j8892j6615j4798j3434j2636j2370j2209j1631
60438F16735j0536r262q253p778p703p544o998o379o080n716m549k814j704j780
60424E29639k286k407k285k225j864r99k78j64R6J384L193M324M647M951N437
60409E41163N517N038M544M323M180M164M535M984M797L985L338L192L010K463
60395E99233K170K906M559O222O976O500N255M184L928M240M394M015L248K339
60381F60169J462P26k2j094k302k871k549k241k783l588l512k649k119k195j903
60366F32529o30R34J868K137K242K438K755L259L816M064L917L802M145M895N669
$$ y = [1509711, 1395458, 1296340, 1209952, 1134052, 1066762, 1006974, 954227, 908172, 868199, 833398, 802727, 775352, 750904, 729320, 710428, 693813, 679015, 665581, 652945, 640575, 628366, 616735, 606199, 596937, 588684, 580906, 573203, 565659, 558661, 552282, 546202, 540486, 535937, 533123, 531419, 529639, 527353, 524946, 522661, 520436, 518572, 517573, 517295, 517131, 517227, 518611, 521804, 526128, 530775, 535726, 541163, 546680, 551718, 556262, 560585, 564765, 568929, 573464, 578448, 583245, 587230, 590568, 593760, 596770, 599233, 601403, 604309, 608868, 615090, 622066, 628566, 633821, 638005, 641933, 646173, 650567, 654582, 657830, 660169, 661631, 662357, 662335, 661241, 658939, 656068, 653519, 651278, 648495, 644907, 641395, 638746, 636627, 634432, 632529, 631899, 632833, 634701, 636838, 639080, 641518, 644273, 647532, 651348, 655412, 659329, 663131, 667276, 672171, 677840]
60351F77840O193O514O908P563Q206Q331P928P622P770P932P612O987O338N361
60337G79105L798K236J367Q97J76m21J26J935M172O497R382J2834J5921J7841
60323H55866J8545J8077J6134J2682Q206L083k636q571j3779j7452j9371j9563
60311H51221j8209j5953j3676j1733r960q411p429o933o387n551m626l638k485
60298G36230j538j324j522j186r7R54J453J776K243K563K548K552K717K598K005
60283G51972J486J504J772J925K105K464K656K445K197K359K858L401L887M176
60269G87207M006L593L760M998O842Q555R984J1369J2756J4079J5470J7108J8969
60256I18696K0994K3246K5763K8545L1717L5339L9074M2600M6333N1058N6788
$$ y = [677840, 684033, 690547, 697455, 705018, 713224, 721555, 729483, 737105, 744875, 752807, 760419, 767406, 773744, 779105, 782903, 785139, 786506, 787403, 787579, 787158, 787284, 789219, 793391, 799888, 809270, 822104, 838025, 855866, 874411, 892488, 908622, 921304, 929510, 932593, 929957, 921386, 907607, 890155, 870784, 851221, 833012, 817059, 803383, 791650, 781690, 773279, 765850, 758917, 752530, 746979, 742353, 738715, 736230, 734692, 733368, 731846, 730660, 730563, 731517, 732970, 734746, 736989, 739552, 742100, 744652, 747369, 749967, 751972, 753458, 754962, 756734, 758659, 760764, 763228, 765884, 768329, 770526, 772885, 775743, 779144, 783031, 787207, 791213, 794806, 798566, 803564, 810406, 818961, 828945, 840314, 853070, 867149, 882619, 899727, 918696, 939690, 962936, 988699, 1017244, 1048961, 1084300, 1123374, 1165974, 1212307, 1263365, 1320153]
60245A320153O2724O8465P4421Q0803Q7152R3249R9595J06348J12566J17104J19598
60234B342178J19902J17306J11377J03075R3983Q4490P3594O0581M6097L1368
60224C183951J6975K925j0460k2304l1984l9737m6116n0926n3258n2649m9673
60213B846744m4967l8332k9418j8866p865L195J4790K7109L9735N2467O5519P8715
60201B988826R1329J02868J13168J21592J26903J28312J25875J19731J09784R6412
60191D124800Q0638O3144M3935K3365K642j7251l6355n4804p1715q5675r5847
60180C976877j02112j04598j03655r9791r3142q3315p0232n4829l8521k2312o615
60169C197755Q565K3608L8942N4264O8465Q0514Q9942R6116R7830R4249Q5896
$$ y = [1320153, 1382877, 1451342, 1525763, 1606566, 1693718, 1786967, 1886562, 1992910, 2105476, 2222580, 2342178, 2462080, 2579386, 2690763, 2793838, 2887821, 2972311, 3045905, 3106486, 3152583, 3183951, 3200926, 3203851, 3193391, 3171087, 3139103, 3099366, 3053250, 3002324, 2949066, 2896417, 2846744, 2801777, 2763445, 2734027, 2715161, 2707296, 2710491, 2725281, 2752390, 2792125, 2844592, 2910111, 2988826, 3080155, 3183023, 3296191, 3417783, 3544686, 3672998, 3798873, 3918604, 4028388, 4124800, 4205438, 4268582, 4312517, 4335882, 4338524, 4321273, 4284918, 4230114, 4158399, 4072724, 3976877, 3874765, 3770167, 3666512, 3566721, 3473579, 3390264, 3320032, 3265203, 3226682, 3204370, 3197755, 3206320, 3229928, 3268870, 3323134, 3391599, 3472113, 3562055, 3658171, 3756001, 3850250, 3936146]
60158C936146P4212O0389M5031K8587J1727m541j8970l0686l9767m6826n1746
60147C963556n3447n1043m4717l5281k3467r974M595K0228L7453N6363P6253R6560
60135D037079J17613J40101J64254J89876K16639K43978K71151K97672L23145
60126F001508L46511L66146L80980L90787L95027L92287L81465L62801L37152
60117I354664L04898K66199K21721J72464J19209O2726M030n5915j16239j75331
60107A0158426k30518k79016l18875l48657l66996l73269l68396l54365l33187
60098G185147l06424k75280k40646k03447j65087j27035q9786n3050j7210J6257
60088E723439M6183P2604R5580J14052J26557J32438J31581J23740J09035Q8675
$$ y = [3936146, 4010358, 4070747, 4115778, 4144365, 4156092, 4151551, 4132581, 4101895, 4062128, 4015302, 3963556, 3910109, 3859066, 3814349, 3779068, 3755601, 3745627, 3750222, 3770450, 3807903, 3864266, 3940519, 4037079, 4154692, 4294793, 4459047, 4648923, 4865562, 5109540, 5380691, 5678363, 6001508, 6348019, 6714165, 7095145, 7485932, 7880959, 8273246, 8654711, 9017512, 9354664, 9659562, 9925761, 10147482, 10319946, 10439155, 10501881, 10505911, 10449996, 10333757, 10158426, 9927908, 9648892, 9330017, 8981360, 8614364, 8241095, 7872699, 7518334, 7185147, 6878723, 6603443, 6362797, 6159350, 5994263, 5867228, 5777442, 5724392, 5707182, 5723439, 5769622, 5842226, 5937806, 6051858, 6178415, 6310853, 6442434, 6566174, 6675209, 6763884]
60078F763884O4474L8022J0858j5231l8906n9956p8788r5713j11129j25609j39210
60067F212696j51317j61642j70440j77157j79913j77415j70631j61567j51085
60058D711529j39022j25585j11285r5914p8929o0703m2321k4249o233J1825K9760
60047D068873M7756O5976Q3745R9973J14188J26220J35055J39033J37205J29808
60037E147832J17493J00938Q1083N8885L4805R088j7516m3953o9418r3132j13888
60026E212217j30628j43171j51601j55338j53783j47563j38179j26583j13040
60017C952331r8115q2703o7048n0820l4236j8194l084J1725K7065M3340O0746
60006C741007P9349R8709J18033J36799J54706J71005J84422J93718J97801J95542
$$ y = [6763884, 6828358, 6866380, 6877238, 6862007, 6823101, 6763145, 6684357, 6588644, 6477515, 6351906, 6212696, 6061379, 5899737, 5729297, 5552140, 5372227, 5194812, 5024181, 4862614, 4711529, 4572507, 4446922, 4335637, 4239723, 4160794, 4100091, 4057770, 4033521, 4027288, 4039113, 4068873, 4116629, 4182605, 4266350, 4366323, 4480511, 4606731, 4741786, 4880819, 5018024, 5147832, 5265325, 5366263, 5447346, 5506231, 5541036, 5550124, 5532608, 5488655, 5419237, 5326105, 5212217, 5081589, 4938418, 4786817, 4631479, 4477696, 4330133, 4191954, 4065371, 3952331, 3854216, 3771513, 3704465, 3653645, 3619409, 3601215, 3598131, 3609856, 3636921, 3680261, 3741007, 3820356, 3919065, 4037098, 4173897, 4328603, 4499608, 4684030, 4877748, 5075549, 5271091]
59996E271091J86247J70367J49214J24084R6115O6659L6756O417k4791n6312q6577
59985E939270j14271j38750j59076j73639j81161j81556j75581j64184j48477
59976D502575j29730j09074q7276o5018m3019k1816j545J8006L7111N5649P2784
59965D228647Q7497R9535J09412J17276J22394J24074J22323J17229J08575R6800
59955E333762Q3420O9651N5415M0671K6756J5120N482l091r774j2364r912l338
59943E591798O703K0863L9706O2768Q9592J20437J55211J92784K32004K72517
59933F784383L13911L54724L92881M26367M52848M69145M71794M57959M25669
59924A0549681L73794L02502K13907J12335M135j03227k02855k89729l60520m12828
$$ y = [5271091, 5457338, 5627705, 5776919, 5901003, 5997118, 6063777, 6100533, 6106950, 6082159, 6025847, 5939270, 5824999, 5686249, 5527173, 5353534, 5172373, 4990817, 4815236, 4651052, 4502575, 4372845, 4263771, 4176495, 4111477, 4068458, 4046642, 4045097, 4063103, 4100214, 4155863, 4228647, 4316144, 4415679, 4525091, 4642367, 4764761, 4888835, 5011158, 5128387, 5236962, 5333762, 5417182, 5486833, 5542248, 5582919, 5609675, 5624795, 5630277, 5627186, 5617412, 5605048, 5595136, 5591798, 5598501, 5619364, 5659070, 5721838, 5811430, 5931867, 6087078, 6279862, 6511866, 6784383, 7098294, 7453018, 7845899, 8272266, 8725114, 9194259, 9666053, 10124012, 10549681, 10923475, 11225977, 11439884, 11552219, 11556354, 11453127, 11250272, 10960543, 10600023, 10187195]
59914A0187195m45573m59944m59006m45935m23118l92761l57370l19232k79947
59905F604309k40567k01634j63076j24742q7207n1438j7571J5284M7898Q0078
59895E861334J11040J39971J65973J87967K04781K15018K16953K09076J90702
59886G502815J61702J22012P2282J4901m6357j07638j65505k16624k58262k89242
59876F790084l09738l20188l21253l14551l02293k86007k66485k44902k22782
59867D201885k00723j78287j55476j33356j12975r4602p8322o4370n2536m2330
59857C088908l4091k9004k7469k8346l0249l2696l5458l7662l8288l6875l3304
59846B725466k7565k0407j3415p822l671o96N45r49n556j2799k1735l1060l9242
$$ y = [10187195, 9741622, 9281678, 8822672, 8376737, 7953619, 7560858, 7203488, 6884256, 6604309, 6363742, 6162108, 5999032, 5874290, 5787083, 5735645, 5718074, 5733358, 5781256, 5861334, 5972374, 6112345, 6278318, 6466285, 6671066, 6886084, 7103037, 7312113, 7502815, 7664517, 7786529, 7858811, 7873712, 7827355, 7719717, 7554212, 7337588, 7079326, 6790084, 6480346, 6160158, 5838905, 5524354, 5222061, 4936054, 4669569, 4424667, 4201885, 4001162, 3822875, 3667399, 3534043, 3421068, 3326466, 3248144, 3183774, 3131238, 3088908, 3054817, 3025813, 2998344, 2969998, 2939749, 2907053, 2871595, 2833933, 2795645, 2758770, 2725466, 2697901, 2677494, 2664079, 2656257, 2652586, 2651890, 2652435, 2651486, 2645930, 2633131, 2611396, 2580336, 2541094]
59833B541094m5170m8612m9821m8983m6240m1792l5798k8536k0672j2925n424
59822B157121J987Q754J3754J6631J8382K0325K3184K7408L3431M1077M9216N6468
59810B467738O1778O4340O3805O1044N7755N4643N0542M3969L4997K5072J5475
59799C001158O729q86o948j1026j2795j2183r592n716p92N653J4045K4094L5221
59786C026962M7388O1083P6725R4361J13977J35910J60914J89691K22228K57741
59776D386980K95297L34041L72225M06085M29832M36223M17052L64972K77619
59767G720326J61371L0577r7503k07923k90791l42310l64639l63804l46427l18014
59757E580863k83267k46311k09856j75074j42679j13426q7400o3908m2521k3328
$$ y = [2541094, 2495924, 2447312, 2397491, 2348508, 2302268, 2260476, 2224678, 2196142, 2175470, 2162545, 2157121, 2159108, 2167862, 2181616, 2198247, 2216629, 2236954, 2260138, 2287546, 2320977, 2362054, 2411270, 2467738, 2529516, 2593856, 2657661, 2718705, 2776460, 2831103, 2881645, 2925614, 2960611, 2985683, 3001158, 3007887, 3007001, 3000053, 2989027, 2976232, 2964049, 2954457, 2948741, 2947949, 2953602, 2967647, 2991741, 3026962, 3074350, 3135433, 3212158, 3306519, 3420496, 3556406, 3717320, 3907011, 4129239, 4386980, 4682277, 5016318, 5388543, 5794628, 6224460, 6660683, 7077735, 7442707, 7720326, 7881697, 7912274, 7814771, 7606848, 7316057, 6973747, 6609108, 6245304, 5898877, 5580863, 5297596, 5051285, 4841429, 4666355, 4523676, 4410250, 4322850, 4258942, 4216421, 4193093]
59747D193093n905J0842K7324M2861N7262P1683Q7198J03399J19365J35180J51606
59736D993908J68948J87189K06752K28321K52212K78586L07823L40056L74794
59727G338589M11586M50506M91285N32440N71950O08276O39854O63916O76811
59718A2385213O75776O60095O30994N91188N44750M96846M53184M19263L99520
59709A7256829L96352M09660M37220M75461N20048N66032O07667O38422O51957
59700B1959648O43732O11575N54679M73129L69462K50050J23507k101j19736k22096
59690B4641849l02411l57180l86811l93030l77102l40930k88131k22642j47120
59681B1826492o3290K7327J23974K26907L35993M49692N66097O83822Q00722R12144
$$ y = [4193093, 4187188, 4198030, 4225354, 4268215, 4325477, 4397160, 4484358, 4587757, 4707122, 4842302, 4993908, 5162856, 5350045, 5556797, 5785118, 6037330, 6315916, 6623739, 6963795, 7338589, 7750175, 8200681, 8691966, 9224406, 9796356, 10404632, 11044486, 11708402, 12385213, 13060989, 13721084, 14352078, 14943266, 15488016, 15984862, 16438046, 16857309, 17256829, 17653181, 18062841, 18500061, 18975522, 19495570, 20061602, 20669269, 21307691, 21959648, 22603380, 23214955, 23769634, 24242763, 24612225, 24862275, 24985782, 24983681, 24863945, 24641849, 24339438, 23982258, 23595447, 23202417, 22825315, 22484385, 22196254, 21973612, 21826492, 21763202, 21790529, 21914503, 22141410, 22477403, 22927095, 23493192, 24177014, 24977736, 25889880]
59671B5889880J011223J090163J140303J151710J114143J019163Q62140O44200
59663C3922925L74071O8139k51927n62361q40212j066785j231183j331110j370233
59654B7711324j355509j296750j206255j096472r78040q60615p54507o70250o16794
59645A8876132o00095o21260o73692p42639q09934q60733q86825q85994q60686
59636A1934274q16855p61593p00452o36970n74091n14627m60299m11299l67112
59627F690976l27189k91012k58287k29120k03414j80301j58788j38800j20851
59618D783214j04918r0300p6572o4121n3677m5717m0187l6627l4752l5042l8326
59607D162975m4602n2851o2085p1748q0904q8089r2623r5106r6062r5053r1803
$$ y = [25889880, 26901103, 27991266, 29131569, 30283279, 31397422, 32416585, 33278725, 33922925, 34296996, 34365135, 34113208, 33550847, 32710635, 31643850, 30412667, 29081557, 27711324, 26355815, 25059065, 23852810, 22756338, 21778298, 20917683, 20163176, 19492926, 18876132, 18276037, 17654777, 16981085, 16238446, 15428512, 14567779, 13680954, 12794960, 11934274, 11117419, 10355826, 9655374, 9018404, 8444313, 7929686, 7469387, 7058088, 6690976, 6363787, 6072775, 5814488, 5585368, 5381954, 5201653, 5042865, 4904065, 4783214, 4678296, 4587996, 4511424, 4447303, 4393626, 4347909, 4307722, 4271095, 4236343, 4201301, 4162975, 4118373, 4065522, 4003437, 3931689, 3850785, 3762696, 3670073, 3574967, 3478905, 3383852, 3292049]
59596C292049q7126q1856p5794o8695o1211n3827m5824l6685k7618k0190j4120
59585B719103p932j308M800J0020J4933J9595K3205K5407K6716K7452K7284K6065
59573B915340K4269K2497K1156K0653K1198K2654K5107K9205L5264M2472M9814
59562C229629N7272O5269P3600Q2088R1656J03369J16757J30505J44632J60367
59552D255144J77880J95750K13015K30315K48276K65918K81416K93762L02891
59543F464367L08638L10182L06390K96598K81294K62181K41394K20465J99794
59534H891303J78475J54585J26752R6276O7232M3697K7167J7189J3536J6594K6262
59523I659068M1712O2056Q6107J11533J35167J53887J64458J63149J47084J16084
$$ y = [3292049, 3204923, 3123067, 3047273, 2978578, 2917367, 2863540, 2817716, 2781031, 2753413, 2733223, 2719103, 2711171, 2709863, 2714663, 2724683, 2739616, 2759211, 2782416, 2807823, 2834539, 2861991, 2889275, 2915340, 2939609, 2962106, 2983262, 3003915, 3025113, 3047767, 3072874, 3102079, 3137343, 3179815, 3229629, 3286901, 3352170, 3425770, 3507858, 3599514, 3702883, 3819640, 3950145, 4094777, 4255144, 4433024, 4628774, 4841789, 5072104, 5320380, 5586298, 5867714, 6161476, 6464367, 6773005, 7083187, 7389577, 7686175, 7967469, 8229650, 8471044, 8691509, 8891303, 9069778, 9224363, 9351115, 9447391, 9514623, 9558320, 9585487, 9602676, 9616212, 9632806, 9659068, 9700780, 9762836, 9848943, 9960476, 10095643, 10249530, 10413988, 10577137, 10724221, 10840305]
59513A0840305P2304J8184m4239j12220j81939k49611l12162l66786m10855m42604
59503H810377m61380m67279m61237m45309m22091l93816l62383l29728k97233
59494E169921k65124k33390k03029j75454j50956j28822j08622r0276p3123n6260
59484C684865l9808k4601j0586L361J7905L2718M7618O3176P9829R7299J15176
59473D066952J33414J52094J71369J91511K12296K32424K50332K65377K77233
59464E953002K84333K84026K74328K54603K24687J84596J35338P9041J8094m4968
59454G647080j06800j63651k12864k53258k84098l04726l15360l17348l12317
59445E376658l01757k87365k70783k52849k33838k14471j95757j77895j60388
$$ y = [10840305, 10912609, 10930793, 10886554, 10774334, 10592395, 10342784, 10030622, 9663836, 9252981, 8810377, 8348997, 7881718, 7420481, 6975172, 6553081, 6159265, 5796882, 5467154, 5169921, 4904797, 4671407, 4468378, 4292924, 4141968, 4013146, 3904524, 3814248, 3741125, 3684865, 3645057, 3620456, 3609870, 3613231, 3631136, 3663854, 3711472, 3774648, 3854477, 3951776, 4066952, 4200366, 4352460, 4523829, 4715340, 4927636, 5160060, 5410392, 5675769, 5953002, 6237335, 6521361, 6795689, 7050292, 7274979, 7459575, 7594913, 7673954, 7692048, 7647080, 7540280, 7376629, 7163765, 6910507, 6626409, 6321683, 6006323, 5688975, 5376658, 5074901, 4787536, 4516753, 4263904, 4030066, 3815595, 3619838, 3441943, 3281555]
59436C281555j43332j27678j13943j01669r0352q0028p0663o1847n3375m5474
59426B393194l8247l1500k5233j9696j4816j0126n295k87M790R564J3458J6460
59414B292266J9348K2658K6116K9791L4506L9665M1786L7451K7726J7886J2610
59403B601809J2899J7429K4778L3906M4227N5984O9261Q2039R0704R3430R2375
59392C218841R2068R6375J06977J23449J44110J67504J93456K22387K54051K87972
59382D907190L24681L64911M07679M50651M92413N32575N69203N97911O14290
59373I261504O16134O02974N75182N34556M84739M30030L74160L20234K70659
59364A3470172K26582J88050J54732J25422R7096O6099L0708q690n1957r9957
$$ y = [3281555, 3138223, 3010545, 2896602, 2794933, 2704581, 2624553, 2553890, 2492043, 2438668, 2393194, 2354947, 2323447, 2298214, 2278518, 2263702, 2253576, 2248281, 2247994, 2252784, 2262348, 2275806, 2292266, 2311614, 2334272, 2360388, 2390179, 2424685, 2464350, 2506136, 2543587, 2571313, 2589199, 2601809, 2614708, 2632137, 2656915, 2690821, 2735048, 2791032, 2860293, 2942332, 3033036, 3126466, 3218841, 3310909, 3407284, 3514261, 3637710, 3781820, 3949324, 4142780, 4365167, 4619218, 4907190, 5231871, 5596782, 6004461, 6455112, 6947525, 7480100, 8049303, 8647214, 9261504, 9877638, 10480612, 11055794, 11590350, 12075089, 12505119, 12879279, 13199513, 13470172, 13696754, 13884804, 14039536, 14164958, 14262054, 14328153, 14358861, 14350171, 14298214, 14198257]
59354A4198257j52427k06534k58171l03509l39135l62674l74355l76982l73793
59345A1450677l67463l61094l58102l60034l65872l74163l84265l94797m02710
59336H082177m05332m02220l94056l81021l63317l42055l18483k93253k67269
59327D915171k42022k18236j95346j73205j52990j35372j19215j03242q7835p3872
59317C413836o1069m8790l7432k7582j8614r543n64P523J4725K1715K8856L6382
59305C319443M4713N3648O2100O9668P7484Q6360R5132J02118J07293J11555J14590
59294D244104J15128J12803J08269J01673R2548Q1100O8542N6095M4562L4738
59284E059562K7311K2457K0241K1130K5506L3016M3068N5453O9781Q4769R8857
$$ y = [14198257, 14045830, 13839296, 13581125, 13277616, 12938481, 12575807, 12201452, 11824470, 11450677, 11083214, 10722120, 10364018, 10003984, 9638112, 9263949, 8879684, 8484887, 8082177, 7676845, 7274625, 6880569, 6499548, 6136231, 5794176, 5475693, 5182440, 4915171, 4673149, 4454913, 4259567, 4086362, 3933372, 3798000, 3678785, 3575543, 3487708, 3413836, 3352767, 3303977, 3266545, 3238963, 3220349, 3210806, 3210242, 3217765, 3232490, 3254205, 3283061, 3319443, 3364156, 3417804, 3479904, 3549572, 3627056, 3713416, 3808548, 3910666, 4017959, 4129514, 4244104, 4359232, 4472035, 4580304, 4681977, 4774525, 4855625, 4924167, 4980262, 5024824, 5059562, 5086873, 5109330, 5129571, 5150701, 5176207, 5209223, 5252291, 5307744, 5377525, 5462294, 5561151]
59273E561151J11122J20772J26074J24551J14157R4171O5734L2085k547l5104
59263F312166o4569r0486j11724j27258j37166j41906j41433j35832j26048j13097
59253E122647r7412p9781o1927m4976k8164j0416P337K2738L4622M3829N1544
59242D960041N7862O2065O3551O2413N9553N6183N3040N0456M9249N0780N5910
59231E581103O4814P8099R6951J21527J50372J82130K16700K53775K91314L26517
59221G363302L57123L80507L92491L88723L67024L27468K70945J98987J14537
59212A0161107K1559p6009j74071k67595l51115m20047m71210n02918n15685n12409
59202F891607m96944m72486m41595m06822l70389l33681k97876k64457k34475
$$ y = [5561151, 5672273, 5793045, 5919119, 6043670, 6157827, 6251998, 6317732, 6349817, 6347270, 6312166, 6247597, 6157111, 6045387, 5918129, 5780963, 5639057, 5497624, 5361792, 5235744, 5122647, 5025235, 4945454, 4883527, 4838551, 4810387, 4799971, 4807308, 4830046, 4864668, 4908497, 4960041, 5017903, 5079968, 5143519, 5205932, 5265485, 5321668, 5374708, 5425164, 5474413, 5525193, 5581103, 5645917, 5724016, 5820967, 5942494, 6092866, 6274996, 6491696, 6745471, 7036785, 7363302, 7720425, 8100932, 8493423, 8882146, 9249170, 9576638, 9847583, 10046570, 10161107, 10182666, 10106657, 9932586, 9664991, 9313876, 8893829, 8422619, 7919701, 7404016, 6891607, 6394663, 5922177, 5480582, 5073760, 4703371, 4369690, 4071814, 3807357, 3572882]
59193C572882k07871j84168j63213j44771j28227j13370j00555q9607p9563p0216
59183B291321o2648n7350n3076m8601m4363m1116l8242l4732l0827k7198k3520
59172A829648j9252j4977j1467q238m488o29K620N744R451J3071J5737J8331K2306
59159A857857K7125L0927L3486L6487M0913M5894N0318N4013N7203O0220O3925
59148B358368O9130P5408Q1529Q7066R2513R7975J02940J07199J10840J13352
59138C296320J13782J11728J07317J00407R0870P9399O6989N3805L9590K4943
59128D085150J1341m7q721j4442j7262j7491j4970q943N80J2156K4565L8203N3822
59115D143941P0954Q8858J07888J28287J48535J66748J83095J98979K14316K27249
$$ y = [3572882, 3365011, 3180843, 3017630, 2872859, 2744632, 2631262, 2530707, 2441100, 2361537, 2291321, 2228673, 2171323, 2118247, 2069646, 2025283, 1984167, 1945925, 1911193, 1880366, 1853168, 1829648, 1810396, 1795419, 1783952, 1775714, 1771226, 1770597, 1773217, 1778961, 1788412, 1801483, 1817220, 1835551, 1857857, 1884982, 1915909, 1949395, 1985882, 2026795, 2072689, 2123007, 2177020, 2234223, 2294443, 2358368, 2427498, 2502906, 2584435, 2671501, 2764014, 2861989, 2964929, 3072128, 3182968, 3296320, 3410102, 3521830, 3629147, 3729554, 3820424, 3899823, 3966812, 4020617, 4060207, 4085150, 4096491, 4096444, 4087723, 4073281, 4056019, 4038528, 4023558, 4014615, 4015195, 4027351, 4051916, 4090119, 4143941, 4214895, 4303753, 4411641, 4539928, 4688463, 4855211, 5038306, 5237285, 5451601, 5678850]
59105E678850K35951K38958K34190K19750J95643J63139J22906P5688K4589k5436
59095G164228p0580j09177j39926j61340j73301j77494j75833j69800j61373j52931
59085E672473j45698j39528j34459j31276j30430j31639j34733j39650j45509
59076D439551j50898j55203j58606j60906j61522j60498j58284j54637j48981
59067C030016j41776j34246j26858j19220j11286j03382r5382q7164p9492p3113
59057A958097o7389o1315n5378n0761m7183m3463l9811l7471l6233l4507l1934
59046A452652k9847k8759k7445k5043k2192j9522j6606j3111r479o091k991p05
59034A250861R1q0J53J227K593M352P167J0490J2837J4046J5378J6963J7113J4855
$$ y = [5678850, 5914801, 6153759, 6387949, 6607699, 6803342, 6966481, 7089387, 7165075, 7189664, 7164228, 7093648, 6984471, 6844545, 6683205, 6509904, 6332410, 6156577, 5986777, 5825404, 5672473, 5526775, 5387247, 5252788, 5121512, 4991082, 4859443, 4724710, 4585060, 4439551, 4288653, 4133450, 3974844, 3813938, 3652416, 3491918, 3333634, 3178997, 3030016, 2888240, 2753994, 2627136, 2507916, 2396630, 2293248, 2197866, 2110702, 2031210, 1958097, 1890708, 1829393, 1774015, 1723254, 1676071, 1632608, 1592797, 1555326, 1519093, 1484586, 1452652, 1422805, 1394046, 1366601, 1341558, 1319366, 1299844, 1283238, 1270127, 1260648, 1254557, 1251566, 1250861, 1250952, 1250872, 1251025, 1252252, 1254845, 1259197, 1266364, 1276854, 1289691, 1303737, 1319115, 1336078, 1353191, 1368046]
59020A368046J1290P738M221O05k301l748m039l730k952j910r27L82K835O232
59006A381742R381J1648J3247J3941J3010J0678P966M933P98l981p556r162r976
58993A436669j0932j1407j0742r493q270o696m298j383J525M038N572N859N900
58980A396342O985Q725R664R813J0648J2504J4039J4721J5665J7376J8823J9546
58968A554851K0692K2903K5103K6412K7550K9186L0558L0880L0778L1212L2206
58957A862331L3379L4511L4993L4152L2756L2618L4164L6092L7903M0810M5286
58946B258995M9890N3633N7558O2704O8335P3617P9299Q6285R4055J01981J10699
58935C097051J20697J30973J40628J50556J62119J75296J89593K05677K24527
$$ y = [1368046, 1379336, 1387074, 1391295, 1391900, 1389599, 1385851, 1381812, 1378082, 1375130, 1373220, 1372293, 1372675, 1375510, 1381742, 1391123, 1402771, 1416018, 1429959, 1442969, 1453647, 1461613, 1466546, 1467344, 1463363, 1455807, 1446645, 1436669, 1425737, 1414330, 1403588, 1394095, 1385825, 1379129, 1374831, 1373448, 1374973, 1379011, 1384583, 1390442, 1396342, 1403327, 1412052, 1421716, 1431529, 1442177, 1454681, 1468720, 1483441, 1499106, 1516482, 1535305, 1554851, 1575543, 1598446, 1623549, 1649961, 1677511, 1706697, 1737255, 1768135, 1798913, 1830125, 1862331, 1895710, 1930221, 1965214, 1999366, 2032122, 2064740, 2098904, 2134996, 2172899, 2213709, 2258995, 2308885, 2362518, 2420076, 2482780, 2551115, 2624732, 2704031, 2790316, 2884371, 2986352, 3097051, 3217748, 3348721, 3489349, 3639905, 3802024, 3977320, 4166913, 4372590, 4597117]
58926D597117K45917K69143K94464L22652L53820L87840M25044M65490N08285
58917G869772N52514N98081O44756O91131P35080P74145Q04832Q22632Q23448
58908A4316391Q04067P60977O90494N91171M65247L17387J53751j7194j85115
58899A7897176l40856m78397n93567o82877p44982p81760p96629p92860p74172
58890A1911076p44978p08552o66230o19532n71506n24725m79593m36047l95364
58881F764549l58834l26008k95925k68892k45559k25450k07727j92256j78643
58872D465255j65562j52378j40163j29736j20031j09897j00059r1654q4147p6511
58862C295117o9285o3545n8820n3716m8021m2587l7804l3519k9767k6346k2434
$$ y = [4597117, 4843034, 5112177, 5406641, 5729293, 6083113, 6470953, 6895997, 7361487, 7869772, 8422286, 9020367, 9665123, 10356254, 11091334, 11865479, 12670311, 13492943, 14316391, 15120458, 15881435, 16571929, 17163100, 17628347, 17945734, 18099485, 18082291, 17897176, 17556320, 17077923, 16484356, 15801479, 15056497, 14274737, 13478108, 12685248, 11911076, 11166098, 10457546, 9791316, 9171784, 8600278, 8075553, 7595960, 7159913, 6764549, 6405715, 6079707, 5783782, 5514890, 5269331, 5043881, 4836154, 4643898, 4465255, 4299693, 4147315, 4007152, 3877416, 3757385, 3647488, 3547429, 3455775, 3371628, 3295117, 3225832, 3162287, 3103467, 3049751, 3001730, 2959143, 2921339, 2887820, 2858053, 2831707, 2809273]
58851B809273j7690j2914q620m053J400P142J2763J9049K6325L3310L9130M5060
58839B950175N2580O0969O8566P5278Q2180Q9611R7391J05890J15351J24995J34327
58828C957313J44416J56472J70155J84688K00548K18672K39032K61447K86579
58819E819322L14822L45509L78589M15629M57451N02277N47910N94215O41371
58810A0017095O87103P27702P60521P83161P91272P79606P44646O84462N97190
58801A6572758M82286L43007J85976J8930j49635l10106m53818n75425o72153
58792A5441820p41992p84679q03335q02756p86590p57777p20291o78003o32534
58783H733863n84638n36775m91941m50649m11630l74975l42050l12772k85654
$$ y = [2809273, 2791583, 2778669, 2770049, 2765996, 2767396, 2774538, 2787301, 2806350, 2832675, 2865985, 2905115, 2950175, 3002755, 3063724, 3132290, 3207568, 3289748, 3379359, 3476750, 3582640, 3697991, 3822986, 3957313, 4101729, 4258201, 4428356, 4613044, 4813592, 5032264, 5271296, 5532743, 5819322, 6134144, 6479653, 6858242, 7273871, 7731322, 8233599, 8781509, 9375724, 10017095, 10704198, 11431900, 12192421, 12975582, 13766854, 14546460, 15291106, 15975568, 16572758, 17055044, 17398051, 17584027, 17602957, 17453322, 17143216, 16689398, 16113973, 15441820, 14699828, 13915149, 13111814, 12309058, 11522468, 10764691, 10044400, 9366397, 8733863, 8149225, 7612450, 7120509, 6669860, 6258230, 5883255, 5541205, 5228433, 4942779]
58774D942779k60518k38766k20845k05529j91867j79848j69122j58831j48773
58765C168680j39181j29534j19209j08949j00031r2341q4807p7318p0442o3867
58755B183001n6818m9608m3080l7049l1060k5903k2556k0305j7818j5325j3722
58744A849757j2384j0120p614o526o724o786o815q237j1155j4301j7423k1262
58732A720410k5216k7572k8099k8151k8103k6935k4516k2222k0948k0508k0994
58721A447146k2784k5079k6408k6754k7349k8441k8982k8531k7552k6033k3746
58710A155487k1668k1036k1098j9894j7243j4853j3503j2274j0677r433q812q184
58698I76812p534p630q489r250r630r905r707q615p621p995q875q124n547l099
$$ y = [4942779, 4682261, 4443495, 4222650, 4017121, 3825254, 3645406, 3476284, 3317453, 3168680, 3029499, 2899965, 2780756, 2671807, 2571776, 2479435, 2394628, 2317310, 2246868, 2183001, 2126183, 2076575, 2033495, 1996446, 1965386, 1939483, 1916927, 1896622, 1878804, 1863479, 1849757, 1837373, 1827253, 1819639, 1813113, 1806389, 1799603, 1792788, 1784551, 1773396, 1759095, 1741672, 1720410, 1695194, 1667622, 1639523, 1611372, 1583269, 1556334, 1531818, 1509596, 1488648, 1468140, 1447146, 1424362, 1399283, 1372875, 1346121, 1318772, 1290331, 1261349, 1232818, 1205266, 1179233, 1155487, 1133819, 1112783, 1091685, 1071791, 1054548, 1039695, 1026192, 1013918, 1003241, 993808, 984996, 976812, 969278, 961648, 953159, 943909, 934279, 924374, 914667, 906052, 898431, 890436, 881561, 873437, 867890, 864791]
58684H64791j789n34J549L636M408L352O92k629n099o046o487p204o968m482j099
58669H36091O64N87L46M02r1p68j81J592K903K980K235O06k026m311m944n112
58653H30973o630q283p281l948j455p74M43L481O600Q359R698J1559J3278J4490
58639H70510J6068J8161J9636K0391K1878K4602K7363K9685L2640L6571M0370
58628A157875M3651M7506N2489N8071O4480P2741Q2584R2752J03677J17104J32836
58617B025766J48652J63988J80620J98921K16412K30980K42620K50861K53126
58608C911946K46856K30834K03590J63421J11456N2554p924o6167j18453j60796
58598D567317j91454k11486k21969k23082k16673k06638j95375j82420j67695
$$ y = [864791, 863002, 862468, 864017, 867653, 872061, 875413, 876105, 873476, 868377, 862331, 855844, 848640, 841672, 837190, 836091, 836755, 837342, 837688, 838090, 837999, 837231, 837050, 838642, 841545, 844525, 846760, 847366, 845340, 841029, 836085, 830973, 824343, 816060, 808779, 804831, 803376, 802602, 803045, 806526, 813126, 821485, 831183, 842742, 856020, 870510, 886578, 904739, 924375, 944766, 966644, 991246, 1018609, 1048294, 1080934, 1117505, 1157875, 1201526, 1249032, 1301521, 1359592, 1424072, 1496813, 1579397, 1672149, 1775826, 1892930, 2025766, 2174418, 2338406, 2519026, 2717947, 2934359, 3165339, 3407959, 3658820, 3911946, 4158802, 4389636, 4593226, 4756647, 4868103, 4920657, 4912733, 4846566, 4728113, 4567317, 4375863, 4164377, 3942408, 3719326, 3502653, 3296015, 3100640, 2918220, 2750525]
58589B750525j53330j40897j29472j17971j07067r7318q7764p7751o8030n8973
58579A711952m9890m1114l4288k9499k4772j9424j5307j3395j1934r404o730m928
58567A451267l166q43Q31R61M97K1j755n835j1331j7351k4186l1339l6751l9363
58553A281657m0236l9932l7330l2373k7319k3663k0318j6394j3179j1656j0464
58542A008793q283n959m521l255j506l11n69j529k503m076o317q015q884j0244
58528I42821j2341j3502j3183j3210j4594j5895j6166j6612j7733j7762j5789
58517G76034j3694j2982j2406j0671q851q136p698o722n982n654m145j036J500
58504F79557K066K135K997L518K937K871M346N735N906O541Q940J1381J2154J2455
$$ y = [2750525, 2597195, 2456298, 2326826, 2208855, 2101788, 2004470, 1916706, 1838955, 1770925, 1711952, 1662062, 1620948, 1586660, 1557161, 1532389, 1512965, 1497658, 1484263, 1472329, 1462925, 1456195, 1451267, 1448101, 1447258, 1448089, 1449050, 1449547, 1449568, 1447813, 1441978, 1430647, 1413296, 1389110, 1357771, 1321020, 1281657, 1241421, 1201489, 1164159, 1131786, 1104467, 1080804, 1060486, 1044092, 1030913, 1019257, 1008793, 1000510, 994551, 990030, 986775, 985269, 984958, 984389, 982860, 980357, 976281, 969964, 961949, 953065, 942821, 930480, 916978, 903795, 890585, 875991, 860096, 843930, 827318, 809585, 791823, 776034, 762340, 749358, 736952, 726281, 717430, 709294, 701596, 694874, 688892, 683238, 679093, 678057, 679557, 681623, 683758, 686755, 690273, 693210, 696081, 700427, 706162, 712068, 718609, 727549, 738930, 751084, 763539]
58490G63539J3738J4882J4595J3980J4114J3620J1287Q697P668P383O423N252
58478H95178M451L084R97M4P84R11q50k438k516l367o804j0607j2309j3349j6031
58463H37178j9146k0233j9560j8540j6737j3733j1327j0588r366o094l191l171
58451F85492m172l183j034k13k14Q69K314K453K348L924O208P182P558R121J1259
58436G29912J2509J3567J5261J5759J3277R525O866M408M65l500n264n768o784
58423H00233p005m554j092P46J789M151O887Q089Q995J1540J3968J3504J1380
58410H68631J0629J0718R227P023O890Q394Q814P891P110N683J804l183o404q095
58396I35132j0436j3078j4026j3654j3633j3187j0604p076m910l468r64J449J716
$$ y = [763539, 777277, 792159, 806754, 820734, 834848, 848468, 859755, 868452, 876120, 883503, 889926, 895178, 899629, 902713, 903710, 903754, 904538, 905449, 904599, 902161, 899645, 896278, 889474, 878867, 866558, 853209, 837178, 818032, 797799, 778239, 759699, 742962, 729229, 717902, 707314, 697948, 691854, 688663, 685492, 681320, 678137, 677103, 676890, 676676, 677545, 679859, 682312, 684660, 688584, 694792, 701974, 709532, 718653, 729912, 742421, 755988, 771249, 787008, 800285, 809810, 816676, 821084, 821549, 818049, 812785, 807017, 800233, 793228, 788674, 787582, 788328, 790117, 794268, 801155, 809244, 818239, 829779, 843747, 857251, 868631, 879260, 889978, 899205, 906228, 913118, 921512, 930326, 938217, 945327, 951010, 952814, 949631, 943227, 935132, 924696, 911618, 897592, 883938, 870305, 857118, 846514, 839438, 834528, 831060, 830096, 831545, 833261]
58383H33261J182K423M516M972M475N084N571L456Oj662j818k624l143r98K565
58368H57266M328M466N368O661O394N598O623Q436Q535P873Q841J0294R797Q916
58354I59396J0653J3536J3988J2806J3413J5246J4911J2348J0007P384K465k879
58342A083274n017m723n276o115m498j732j254k038n25K441L287K776M503P810
58328A072913R206R441J1956J5652J6549J5387J6142J8258J7936J6024J6678J9213
58316A255355J9329J7627J8661K2124K3270K1643K1097K1466J8649J2919Q853
58305A460993P076M273J128J722N189O585N989Q081J2784J5244J5105J6724K0134
58292A581027K0975J9555K0624K3853K4071K1368K1264K4427K5898K5101K6717
$$ y = [833261, 834443, 836866, 841382, 846354, 850829, 855913, 861484, 864940, 864946, 863284, 861466, 858842, 855699, 854701, 857266, 861594, 866060, 871428, 878089, 884483, 890081, 896704, 905140, 913675, 921548, 930389, 940683, 950480, 959396, 970049, 983585, 997573, 1010379, 1023792, 1039038, 1053949, 1066297, 1076304, 1083688, 1086153, 1083274, 1078257, 1073534, 1068258, 1062143, 1057645, 1055913, 1054659, 1052621, 1052096, 1054537, 1057824, 1060600, 1065103, 1072913, 1082119, 1091560, 1103516, 1119168, 1135717, 1151104, 1167246, 1185504, 1203440, 1219464, 1236142, 1255355, 1274684, 1292311, 1310972, 1333096, 1356366, 1378009, 1399106, 1420572, 1439221, 1452140, 1460993, 1468069, 1472342, 1473470, 1475192, 1480381, 1486966, 1492955, 1501036, 1513820, 1529064, 1544169, 1560893, 1581027, 1602002, 1621557, 1642181, 1666034, 1690105, 1711473, 1732737, 1757164, 1783062, 1808163, 1834880]
58281A834880L1001L3265L3538L6662M2269M5049M5321M8702N4758N7157N5548
58270B318150N5799N7858N5362M8251M3448M1969L7952L1752L0818L5801L9077
58259B796237L9041M2333M9838N4425N5081N8951O6708P0422O8945P0644P7608
58248C450233Q2397Q3723Q9587J00894J08129J08713J11536J19801J25852J27674
58238D508539J33597J45567J54956J59883J69063J83660J93929J98860K09644
58229F057698K28357K43633K53050K68195K91603L11584L26443L49731L84091
58220H714385M15236M39792M72452N16997N58855N95947O46584P15956P86810
58211A3863014Q55188R41068J050853J166641J287439J441000J638344J860246
$$ y = [1834880, 1865881, 1899146, 1932684, 1969346, 2011615, 2056664, 2101985, 2150687, 2205445, 2262602, 2318150, 2373949, 2431807, 2487169, 2535420, 2578868, 2620837, 2658789, 2690541, 2721359, 2757160, 2796237, 2835278, 2877611, 2927449, 2981874, 3036955, 3095906, 3162614, 3233036, 3301981, 3372625, 3450233, 3532630, 3616353, 3705940, 3806834, 3914963, 4023676, 4135212, 4255013, 4380865, 4508539, 4642136, 4787703, 4942659, 5102542, 5271605, 5455265, 5649194, 5848054, 6057698, 6286055, 6529688, 6782738, 7050933, 7342536, 7654120, 7980563, 8330294, 8714385, 9129621, 9569413, 10041865, 10558862, 11117717, 11713664, 12360248, 13076204, 13863014, 14718202, 15659270, 16710123, 17876764, 19164203, 20605203, 22243547, 24103793]
58203B4103793K107549K417525K810263L273157L824082M530979N441017O559584
58195E5067949P935025R683765J1883383J4526905J7635814K1315872K5646396
58188A63695109L0645394L6330718M2349959M7061001M7228854L9601535K3602531
58181D30515101K566916j7960290l3384148m1959964m4439829m2659392l8479778
58174B14198616l3361065k8228855k3513386j9362623j5837783j2934946j0557950
58167G0402008q589051o964864n639273m526615l543184k665038j888289j167251
58159C5418443m45765K87458J036796J849531K717347L403917L468487K570597
58151E0306811P90714j356001l231289m427960m894386m811268m404245l848479
$$ y = [24103793, 26211342, 28628867, 31439130, 34712287, 38536369, 43067348, 48508365, 55067949, 63002974, 72686739, 84570122, 99097027, 116732841, 138048713, 163695109, 194340503, 230671221, 273021180, 320082181, 367311035, 406912570, 430515101, 433082017, 415121727, 381737579, 339777615, 295337786, 252678394, 214198616, 180837551, 152608696, 129095310, 109732687, 93894904, 80959958, 70402008, 61812957, 54848093, 49208820, 44682205, 41139021, 38473983, 36585694, 35418443, 34972678, 35260136, 36296932, 38146463, 40863810, 44267727, 47736214, 50306811, 51097525, 49741524, 46510235, 42082275, 37187889, 32376621, 27972376, 24123897]
58143B4123897l264430k726946k263518j870201j541956j279842j074812r06855
58135I195337p64691o50031n59874m82080m12528l59459l25056k98383k72455
58126E070780k52944k43195k35080k22041k08090j96686j83158j65281j49427
58117C214878j39045j28099j12729r8564r0093q3500p6465p4205p8879q3301q2171
58106B167827p9789q0014p8362p1151o3102n8588n4059m6199l9119l6412l4181
58095A526851k8880k4370k4385k5478k4150k3667k7055l0420k9952k8848l0714
58084A228932l2633l1318k9701l0914l1806k8992k5512k5063k5227k2712j9844
58073I25210j9600j9400j6118j2412j1957j2884j1855j0247j0628j1296r832q073
$$ y = [24123897, 20859467, 18132521, 15869003, 13998802, 12456846, 11177004, 10102192, 9195337, 8430646, 7780615, 7220741, 6738661, 6326133, 5966674, 5641618, 5343235, 5070780, 4817836, 4574641, 4339561, 4117520, 3909430, 3712744, 3529586, 3364305, 3214878, 3075833, 2947734, 2835005, 2736441, 2646348, 2562848, 2486383, 2412178, 2333299, 2249998, 2167827, 2088038, 2008024, 1929662, 1858511, 1795409, 1736821, 1682762, 1636563, 1597444, 1561032, 1526851, 1497971, 1473601, 1449216, 1423738, 1399588, 1375921, 1348866, 1318446, 1288494, 1259646, 1228932, 1196299, 1164981, 1135280, 1104366, 1072560, 1043568, 1018056, 992993, 967766, 945054, 925210, 905610, 886210, 870092, 857680, 845723, 832839, 820984, 810737, 800109, 788813, 778981, 770908]
58061G70908q418r009p494n610n547n866n287o059r249j1330r953q326r275r969
58047F59516p561n015n798p364n752k490j250j327j75J041Q8j328n10J141J057
58032F24273N63K053L923L307J279O42R91L92m67j07L68l14m45J458L185K483
58016F43584J159J542K002K53j984k064j279k235m045m507m453n567o410m944
58002F11052k605j773j640n97o5j770l960m531n226q350j1962j2841j1828j1631
57988E32273j1673r727o540m344k666PK432K739K259L092M018L151K287M008O660
57973E27976O987N695N588O103M782K413J605J650q2k855l734l048l618n337n490
57958E38635l983l393m192m502m302n417p387p771o493n823n991m911k315k73
$$ y = [770908, 762490, 753481, 745987, 740377, 734830, 728964, 723677, 717618, 708369, 697039, 687086, 678760, 669485, 659516, 651955, 646940, 641142, 633778, 628026, 625536, 624286, 622959, 622784, 623825, 623913, 622585, 622075, 623216, 624273, 624836, 626889, 630812, 634119, 635398, 636040, 637031, 637423, 636956, 636849, 637217, 636903, 636458, 637916, 641101, 643584, 644743, 646285, 648287, 648540, 646556, 644492, 643213, 640978, 636933, 632426, 627973, 622406, 615996, 611052, 608447, 606674, 605034, 604437, 604372, 602602, 598642, 594111, 588885, 580535, 568573, 555732, 543904, 532273, 520600, 510873, 504333, 499989, 497323, 497330, 499762, 502501, 504760, 507852, 511870, 515021, 517308, 521316, 527976, 534963, 540658, 546246, 552349, 557131, 559544, 561149, 562799, 562717, 559862, 556128, 553080, 549462, 544125, 538635, 534652, 531259, 527067, 522565, 518263, 512846, 505459, 497688, 491195, 485372, 479381, 474470, 472155, 471882]
57944D71882N39J440K599K814K427L011M206M092K572J171j09k365m676n020m052
57929D80531m493o814q923r956j0971j1954j1555r865q296o814m363j764r18j334
57915C82511p58R36J874K007L199N502O912P113Q023J0059J1219J0549R460Q883
57901D67489P990O417N174M619L884K796K171J937J159j2n89q17j708k851l067
57886D94592k957m131o178p060o392n707n622n353m873m870m821l676k214k036
57872D28702k582j911p4J206J823L193N142O092O186P025Q346Q276O943O509P340
57857D92216P434O055M689L955K770J102L88O14N5j457k089j446j327k361k961
57842E07637k507k475l461m005l448l117l624l700k823k384l144m000m309m890
$$ y = [471882, 472421, 473861, 476460, 479274, 481701, 484712, 488918, 493010, 495582, 496753, 496644, 494279, 489603, 484583, 480531, 476038, 469224, 460301, 450345, 439374, 427420, 415865, 406000, 397704, 390890, 386527, 384763, 383845, 382511, 381753, 382689, 384563, 386570, 389769, 395271, 402183, 409296, 417319, 427378, 438597, 449146, 458606, 467489, 475479, 481896, 487070, 491689, 495573, 498369, 500540, 502477, 503636, 503624, 503035, 502218, 500510, 497659, 494592, 491635, 487504, 481326, 474266, 467874, 462167, 456545, 451192, 446319, 441449, 436628, 432952, 430738, 428702, 426120, 424209, 424135, 425341, 427164, 430357, 435499, 441591, 447777, 454802, 463148, 471424, 478367, 484876, 492216, 499650, 505705, 510394, 514349, 517119, 518221, 518609, 519223, 519278, 517821, 515732, 514286, 512959, 510598, 507637, 505130, 502655, 499194, 495189, 491741, 488624, 485000, 481300, 478477, 476093, 472949, 468949, 464640, 459750]
57828D59750n892o141n590n884p455q644q639q731r618r981q963p644o934o251
57814C53383n297m900n065m543l281k878l718m078l082j993j567p62Q15J842J925
57799C16801K761N216P756R182J0394J1967J2486J0959Q558O358L707N23j237
57786D05431m05J249J679J447J919K520J900L52r57j878k731l197l234l762m985
57771C95348n553m706l686l641l789l135k317k164j956q58M34J032J508K646L894
57756C73057M506M924N573N737M950M174M204M316L845L550M042M391L788L008
57742D34065K721K005K45j125o34Q73J806K433L931N950P059O854N966M842L925
57727D80916M047N167N813N133M413N096O661P978R357J1404J3125J3277J2579
$$ y = [459750, 453858, 447717, 442127, 436243, 428788, 420144, 411505, 402774, 393156, 383175, 374212, 366568, 359634, 353383, 348086, 343186, 338121, 333578, 330297, 327419, 323701, 319623, 316541, 314548, 312981, 312219, 313034, 314876, 316801, 319562, 324778, 332534, 341716, 352110, 364077, 376563, 387522, 396080, 402438, 406145, 406668, 405431, 405026, 406275, 407954, 409401, 411320, 413840, 415740, 416092, 415135, 413257, 410526, 407329, 404095, 400333, 395348, 389795, 385089, 381403, 377762, 373973, 370838, 368521, 366357, 364401, 363543, 363977, 365009, 366517, 369163, 373057, 377563, 382487, 388060, 393797, 398747, 402921, 407125, 411441, 415286, 418836, 422878, 427269, 431057, 434065, 436786, 438791, 439036, 437911, 437277, 438150, 439956, 442389, 446320, 452270, 459329, 466183, 472149, 476991, 480916, 484963, 490130, 495943, 501076, 505489, 510585, 517246, 525224, 534581, 545985, 559110, 572387, 584966]
57714E84966J2654J3541J4159J4463J5202J6165J6530J6565J7311J8985K1058
57703G61599K3463K6307K9056L1314L3874L7640M2137M6392N0645N5841O2121
57692A200389O9140P7224Q6934R8110J10473J24446J40259J57134J74432J92567
57682B431108K11424K29055K43303K53467K58658K55767K41203K14180J76809
57673D514974J32074Q3661L6887k627l1331m7937n2985n1015n2358o8927j05875
57662D354541j57467k10800k52854k75714k78517k66038k44578k18423j90021
57653B260129j62026j37100j16021r7746q1502o7445n5370m4468l4609k6511k0249
57642A417082j4727q925k836L110Q752J4226J9821K5903L2538L9470M6835N5316
$$ y = [584966, 597620, 611161, 625320, 639783, 654985, 671150, 687680, 704245, 721556, 740541, 761599, 785062, 811369, 840425, 871739, 905613, 943253, 985390, 1031782, 1082427, 1138268, 1200389, 1269529, 1346753, 1433687, 1531797, 1642270, 1766716, 1906975, 2064109, 2238541, 2431108, 2642532, 2871587, 3114890, 3368357, 3627015, 3882782, 4123985, 4338165, 4514974, 4647048, 4730709, 4767596, 4764969, 4733638, 4685701, 4632716, 4581701, 4529343, 4460416, 4354541, 4197074, 3986274, 3733420, 3457706, 3179189, 2913151, 2668573, 2450150, 2260129, 2098103, 1961003, 1844982, 1747236, 1665734, 1598289, 1542919, 1498451, 1463842, 1437331, 1417082, 1402355, 1393430, 1390594, 1393704, 1402456, 1416682, 1436503, 1462406, 1494944, 1534414, 1581249, 1636565]
57630A636565O5126P5518Q5981R7161J09791J23575J37953J53014J68552J83064
57620B836300J94787K02877K06385K02972J90061J66694J33184R0128L9468j4285
57610D248571o5837j11938j51197j81962k02335k12102k13129k07827j98360j86732
57600B517152j74108j60294j45184j30232j17132j05742r4871q4624p6063o9040
57590A359862o2255n5394m9298m4130l9125l4322l0729k8498k6499k4003k1399
57579I44210j9074j6907j5056j3894j3007j1513r531q121p628p286o571n723m832
57566H05067l635k334j510j099m81M68J375K328L692N193O301P323Q897J0760
57552H42345J2217J3564J5551J7709J8757J8686J8939K0484K3052K6247L0025
$$ y = [1636565, 1701691, 1777209, 1863190, 1960351, 2070142, 2193717, 2331670, 2484684, 2653236, 2836300, 3031087, 3233964, 3440349, 3643321, 3833382, 4000076, 4133260, 4223388, 4262856, 4248571, 4182734, 4070796, 3919599, 3737637, 3535302, 3323200, 3110071, 2902244, 2703884, 2517152, 2343044, 2182750, 2037566, 1907334, 1790202, 1684460, 1589589, 1504965, 1428902, 1359862, 1297607, 1242213, 1192915, 1148785, 1109660, 1075338, 1044609, 1016111, 989612, 965609, 944210, 925136, 908229, 893173, 879279, 866272, 854759, 845228, 837107, 829479, 822193, 815622, 809899, 805067, 801432, 799098, 797588, 796489, 796008, 796476, 797851, 800179, 803871, 809064, 815365, 822688, 831585, 842345, 854562, 868126, 883677, 901386, 920143, 938829, 957768, 978252, 1001304, 1027551, 1057576]
57541A057576L4021L7776M1677M6485N2075N7836O4109P1805Q0866R0529J00814
57530A735569J12177J23985J35116J45730J56486J66098J71697J71696J66143
57521C084697J54162J33479J03319O5919K4589j7921n8644r4143j22256j42729
57511C130472j55620j60685j58994j53257j45565j36192j25338j14338j04125
57502A876358r4114q3659p3376o4080n5676m8041m1700l6663l1864k6647k1654
57491A298884j7411j3294q757m343n16L258P348J1090J4055J7012K0635K4480
57479A352441K8205L2578L8178M4228M9963N6109O3812P3022Q3066R3864J05427
57468B020893J16995J27880J38320J48329J56383J60408J59307J52406J38268
$$ y = [1057576, 1091597, 1129373, 1171050, 1217535, 1269610, 1327446, 1391555, 1463360, 1544226, 1634755, 1735569, 1847746, 1971731, 2106847, 2252577, 2409063, 2575161, 2746858, 2918554, 3084697, 3238859, 3372338, 3475657, 3541576, 3566165, 3548244, 3489600, 3395457, 3273201, 3130472, 2974852, 2814167, 2655173, 2501916, 2356351, 2220159, 2094821, 1980483, 1876358, 1782244, 1698585, 1625209, 1561129, 1505453, 1457412, 1415712, 1379049, 1347185, 1320538, 1298884, 1281473, 1268179, 1259422, 1255079, 1254563, 1257821, 1265169, 1276259, 1290314, 1307326, 1327961, 1352441, 1380646, 1413224, 1451402, 1495630, 1545593, 1601702, 1665514, 1738536, 1821602, 1915466, 2020893, 2137888, 2265768, 2404088, 2552417, 2708800, 2869208, 3028515, 3180921, 3319189]
57459C319189J15483Q4276M6298L538m1252q3712j19172j45146j61920j70887
57449B846695j73255j70069j62467j51651j39014j26088j13874j02439r1538q1249
57439A535051p1691o2728n4439m7399m1904l7453l3407k9687k6417k3487k0854
57428A085585j8696j6804j4570j1981r895q770p938o691n292m260l450k565j840
57415I72833j583j602j703j975k088j191P58K407K706K371K770M018N161N686
57401I88568N854N905N816N635N434N173N028N384O149O729P012P629Q787R750
57387A078853R991R959J0027R785R026Q482Q592Q603P916P313P751Q747R190R024
57373A203259Q937Q983Q842Q760R085R237Q527P519P330P853P992P505P407Q436
$$ y = [3319189, 3434672, 3518948, 3565246, 3568784, 3527532, 3443820, 3324648, 3179502, 3017582, 2846695, 2673440, 2503371, 2340904, 2189253, 2050239, 1924151, 1810277, 1707838, 1616300, 1535051, 1463360, 1400632, 1346193, 1298794, 1256890, 1219437, 1186030, 1156343, 1129926, 1106439, 1085585, 1066889, 1050085, 1035515, 1023534, 1013639, 1004869, 996931, 990240, 984948, 980688, 977238, 974673, 972833, 971250, 969648, 967945, 965970, 963882, 962691, 963449, 965856, 968562, 970933, 973703, 977721, 982882, 988568, 994422, 1000327, 1006143, 1011778, 1017212, 1022385, 1027413, 1032797, 1038946, 1045675, 1052687, 1060316, 1069103, 1078853, 1088844, 1098803, 1108830, 1118615, 1127641, 1136123, 1144715, 1153318, 1161234, 1168547, 1176298, 1185045, 1194235, 1203259, 1212196, 1221179, 1230021, 1238781, 1247866, 1257103, 1265630, 1273149, 1280479, 1288332, 1296324, 1303829, 1311236, 1319672]
57359A319672J0094J1353J1561J0729R568R133R820J0908J1535J1714J1849J1910
57347A449846J1813J2044J3024J4275J5085J5520J5945J6126J5680J5032J4889
57336A609279J5217J5572J6024J6844J7736J8307J8849J9636J9993J9207J7919
57325A804583J7406J7809J8213J8252J8362J8646J8720J8702J9205K0203K0953
57314B011054K1084K0927K0724K0504K0678K1832K3758K5475K6362K6603K6582
57303B265583K6538K6823K7741K9006L0005L0534L0901L1362L1991L2903L4115
57292B597502L5465L7034L9126M1424M2914M3371M4184M6657N0153N2985N4583
57281C085398N5642N6563N7062N7102N6945N6325N4667N2009M8744M4606L8944
$$ y = [1319672, 1329766, 1341119, 1352680, 1363409, 1372977, 1382110, 1391930, 1402838, 1414373, 1426087, 1437936, 1449846, 1461659, 1473703, 1486727, 1501002, 1516087, 1531607, 1547552, 1563678, 1579358, 1594390, 1609279, 1624496, 1640068, 1656092, 1672936, 1690672, 1708979, 1727828, 1747464, 1767457, 1786664, 1804583, 1821989, 1839798, 1858011, 1876263, 1894625, 1913271, 1931991, 1950693, 1969898, 1990101, 2011054, 2032138, 2053065, 2073789, 2094293, 2114971, 2136803, 2160561, 2186036, 2212398, 2239001, 2265583, 2292121, 2318944, 2346685, 2375691, 2405696, 2436230, 2467131, 2498493, 2530484, 2563387, 2597502, 2632967, 2670001, 2709127, 2750551, 2793465, 2836836, 2881020, 2927677, 2977830, 3030815, 3085398, 3141040, 3197603, 3254665, 3311767, 3368712, 3425037, 3479704, 3531713, 3580457, 3625063, 3664007]
57270C664007L1925K4440J7020R880L717o68l486n556o860o675n053l052j276
57257C718363P27L435O608R675J2146J3692J4625J6033J8583K1370K3031K3676
57245C881964K4628K6403K8313K9948L1716L3772L5571L6848L7924L8882L9264
57234D245233L8817L7741L6296L4884L4221L4420L4271L2718L0701L0131L1183
57223D620616L2245L2560L3169L4962L7402L9714M1845M3687M4696M4976M5511
57212E051383M6666M7592M7658M7411M7508M7684M7413M6654M5465M3812M2147
57201E561393M1278M1175M0914M0106L9378L9042L8492L7352L6106L5014L3590
57190E983840L1709L0178K9507K9213K8870K8712K8545K7296K4577K1624J9743
$$ y = [3664007, 3695932, 3720372, 3737392, 3747272, 3750989, 3750321, 3746835, 3741279, 3734419, 3727744, 3722691, 3719639, 3718363, 3719090, 3722525, 3729133, 3738808, 3750954, 3764646, 3779271, 3795304, 3813887, 3835257, 3858288, 3881964, 3906592, 3932995, 3961308, 3991256, 4022972, 4056744, 4092315, 4129163, 4167087, 4205969, 4245233, 4284050, 4321791, 4358087, 4392971, 4427192, 4461612, 4495883, 4528601, 4559302, 4589433, 4620616, 4652861, 4685421, 4718590, 4753552, 4790954, 4830668, 4872513, 4916200, 4960896, 5005872, 5051383, 5098049, 5145641, 5193299, 5240710, 5288218, 5335902, 5383315, 5429969, 5475434, 5519246, 5561393, 5602671, 5643846, 5684760, 5724866, 5764244, 5803286, 5841778, 5879130, 5915236, 5950250, 5983840, 6015549, 6045727, 6075234, 6104447, 6133317, 6162029, 6190574, 6217870, 6242447, 6264071, 6283814]
57179F283814J8714J7627J6398J5493J4969J4746J5162J6329J7559J8193J8416
57168F467420J8566J8345J7544J6828J6822J7044J6673J5891J5561J5871J6144
57157F652709J5796J4831J3605J2470J1419R812O888K728j835o394j1196j5956
57145F704877j9550k1441k2448k3360k3700k2645k0281j7138j3292q852m584j043
57133F506543K235N734Q692R952R516Q288O615M217J253j500l539m894n641n737
57119F541734n183l664l77N158J2350K0218K8533L7745M8058N9307P1532Q5185
57107F900596J01033J20392J45171J77193K17707K67914L29472M04275M94659
57098I158412O04679P40401R07848J110918J351830J632357J952445K306989K684720
$$ y = [6283814, 6302528, 6320155, 6336553, 6352046, 6367015, 6381761, 6396923, 6413252, 6430811, 6449004, 6467420, 6485986, 6504331, 6521875, 6538703, 6555525, 6572569, 6589242, 6605133, 6620694, 6636565, 6652709, 6668505, 6683336, 6696941, 6709411, 6720830, 6730642, 6737530, 6740258, 6738423, 6732029, 6720833, 6704877, 6685327, 6663886, 6641438, 6618078, 6594378, 6571733, 6551452, 6534314, 6521022, 6512170, 6507586, 6506543, 6508778, 6514512, 6523204, 6533156, 6542672, 6550960, 6557575, 6561792, 6563045, 6561545, 6558006, 6553112, 6547471, 6541734, 6536551, 6532887, 6532510, 6537668, 6550018, 6570236, 6598769, 6636514, 6684572, 6743879, 6815411, 6900596, 7001629, 7122021, 7267192, 7444385, 7662092, 7930006, 8259478, 8663753, 9158412, 9763091, 10503492, 11411340, 12522258, 13874088, 15506445, 17458890, 19765879, 22450599]
57089B2450599L070316L447198L799388M113050M376497M575085M681623M651266
57081E5165022M431801L990108L339809K548113J710497R05676J61353n44499
57073G1707880j249468j967984k676526l327437l872967m279894m531252m624192
57065D5178160m569754m391658m120657l787704l420696l044005k677191k333206
57057A6833289k019111j738789j494046j283824j104632r52754q25188p18588
57049F696357o28985n53188m89220m34964l87753l45899l09278k77764k50263
57040C019043k25918k04825j86679j70006j53742j38402j24730j12320j00720
57031A601701r0659q2882p6620p0547o4515n9095n4138m9060m3994l9483l5481
$$ y = [22450599, 25520915, 28968113, 32767501, 36880551, 41257048, 45832133, 50513756, 55165022, 59596823, 63586931, 66926740, 69474853, 71185350, 72091026, 72252379, 71707880, 70458412, 68490428, 65813902, 62486465, 58613498, 54333604, 49802352, 45178160, 40608406, 36216748, 32096091, 28308387, 24887691, 21843686, 19166495, 16833289, 14814178, 13075389, 11581343, 10297519, 9192887, 8240133, 7414945, 6696357, 6067372, 5514184, 5024964, 4590000, 4202247, 3856348, 3547070, 3269306, 3019043, 2793125, 2588300, 2401621, 2231615, 2077873, 1939471, 1814741, 1702421, 1601701, 1511042, 1428160, 1351540, 1280993, 1216478, 1157383, 1103245, 1054185, 1010191, 970708, 935227]
57020I35227l1658k8144k5033k1828j8389j5638j4046j2259q638l523J698P207
57008G64976J4668K4726L6546M9932O6043Q5593J08440J35842J70240K08897K37384
56997A903287K33161J80536Q4914k7626j25989j91069k20686k22728k06878j81431
56987A225491j52922j25290r9703p6392n6273m0383k9097k2820k2324k7181l4674
56976E38432m1422m5517m6543m4601m0368l5160k9764k3861j7442j1626p033k518
56964A92577L075Q891J3363J6664K0314K4990L0300L5976M1496M4747M2806L4258
56952E09457K0006K528j4514k7042l2981l3872l2654l0273k5959k0081j4531j0295
56940B89789o614k849O19L741P437J2294J7877K3851L0656L8524M6462N2310N3006
$$ y = [935227, 903569, 875425, 850392, 828564, 810175, 794537, 780491, 768232, 759594, 756071, 757769, 764976, 779644, 804370, 840916, 890848, 956891, 1042484, 1150924, 1286766, 1457006, 1665903, 1903287, 2136448, 2316984, 2401898, 2374272, 2248283, 2057214, 1836528, 1613800, 1406922, 1225491, 1072569, 947279, 847576, 771184, 714911, 674528, 645431, 622611, 600287, 573106, 538432, 497010, 451493, 404950, 360349, 319981, 284821, 255057, 231196, 213754, 202128, 195095, 192577, 195652, 204543, 217906, 234570, 254884, 279874, 310174, 346150, 387646, 432393, 475199, 509457, 529463, 531991, 517477, 490435, 457454, 423582, 390928, 360655, 334696, 314615, 300084, 289789, 283175, 280326, 280945, 284686, 292123, 304417, 322294, 346145, 376801, 415325, 461787, 514097, 567103]
56927E67103M5369K8291M820j8915l7439m8444n2379n1001m6468m0649l4600k8915
56915B86773k4239k0749j7608j3977j0291p695o566o396o654o747n831l864k223
56902A53933j975k195j424o7N06N33J549L689N494O494P951J0696J4013J7123
56888B16320K0173K3448K7032L1343L6251L9314L6716K6862J2092l388j6045k3755
56876D26363k6063k4481k1271j7397j2627p391k839J052N590J1127J6570K1585
56864C70218K7500L5242M4111N3461O3985P5915Q6706R1259Q4154O2438K8407
56853A023396r792m2247o3295p3200p4621o9619o0230m9088l7807k6231j4363
56842E02903l415O133J5786K7079L9749N3014O7249Q3183J00751J19425J37379
$$ y = [567103, 612472, 640763, 645583, 626668, 589229, 540785, 488406, 437405, 390937, 350288, 315688, 286773, 262534, 241785, 224177, 210200, 199909, 192214, 185648, 179252, 172598, 165851, 160020, 156156, 153933, 151958, 149763, 148339, 148272, 148778, 149311, 150860, 154549, 160043, 166537, 174488, 185184, 199197, 216320, 236493, 259941, 286973, 318316, 354567, 393881, 430597, 457459, 469551, 466163, 450118, 426363, 400300, 375819, 354548, 337151, 324524, 317133, 314294, 315346, 320936, 332063, 348633, 370218, 397718, 432960, 477071, 530532, 594517, 670432, 757138, 848397, 932551, 994989, 1023396, 1013604, 971357, 908062, 834862, 760241, 690622, 630392, 581304, 543497, 517266, 502903, 499488, 505621, 521407, 548486, 588235, 641249, 708498, 791681, 892432, 1011857, 1149236]
56831A149236J48432J42089J10366N5595r450o8941j11532j33246j36604j27798
56821A018147j13053r6294p9482o3914n0138l7395k4535j1393J433J3758K5984
56810E83118L8439N1336O5252Q0555R5786J06286J04763Q4828M6276k504m8678
56799A205457q2631j01796j08205j04869r5020q2316o9458n7148m5353l4760k5932
56788C97969j8080r958j345P244J5655K3998L2130M0015M7762N4135N5605M8182
56776F93312L0498N227k1870m4297n7813o2404o1132n6825n0524m3008l5929l0469
56764B64766k6162k2098j8338j5245j2491r792p667o527n805m893m082l692l188
56751A24786k147j231j209j745k071k055j847j300n95n49j341j906j475q26r87
$$ y = [1149236, 1297668, 1439757, 1550123, 1605718, 1596268, 1527327, 1415795, 1282549, 1145945, 1018147, 905094, 808800, 729318, 665404, 615266, 577871, 553336, 541943, 543376, 557134, 583118, 621557, 672893, 738145, 818700, 914486, 1020772, 1125535, 1210363, 1256639, 1254135, 1205457, 1122826, 1021030, 912825, 807956, 712936, 630620, 561162, 504014, 458661, 423901, 397969, 379889, 369931, 368586, 375830, 391485, 415483, 447613, 487628, 535390, 589525, 645130, 693312, 723810, 729037, 707167, 662870, 605057, 542653, 481521, 424696, 374172, 331164, 295235, 264766, 238604, 216506, 198168, 182923, 170432, 160640, 152973, 146446, 140641, 135748, 131666, 127974, 124786, 122639, 121408, 120199, 118454, 116383, 114328, 112481, 111181, 110586, 110037, 108696, 106790, 105315, 104489, 103502]
56736A03502j606j688j232j038j514k476l527l949l016j148J29L4o20j026j502
56721G9323k251k359j232J22M44j28p95j411j978j929j081l24k92l99j69k28q58
56704F4455j020j87L50m43j365r40qk71j293j192K74J558J836J695J489R08J98
56687F6044J89R65J756K023J682O79o09j040n6J168J180K68k01J37N95Q64J107
56670G6751J069M81q7j10k16j227k624l400l729m383n020m658l362k059j130m94
56654D5802n05j239j540l70J404K164J995K287L341M123M146L915L568K666J357
56639G3114M57L37P90J649K498K377J010l06k90N53J049J344K115K778K383J662
56623I3520K110L476M144L652K971K501J855J308J547K090J784Q18M04O10M39
$$ y = [103502, 101896, 100208, 98976, 97938, 96424, 93948, 90421, 86472, 83456, 82308, 82437, 82471, 81851, 80825, 79323, 77072, 74713, 73481, 73603, 74047, 73919, 73124, 71713, 69735, 67806, 66725, 66401, 66109, 65710, 65541, 65313, 64455, 63435, 63248, 63598, 63155, 61790, 60850, 60842, 60571, 59278, 58086, 58360, 59918, 61754, 63449, 64938, 65846, 66044, 66233, 67198, 68954, 70977, 72659, 73338, 72729, 71689, 71633, 72801, 73981, 74249, 74048, 74185, 74780, 75644, 76751, 77820, 78301, 78214, 78104, 77888, 76661, 74037, 70637, 66908, 62525, 57505, 52847, 49485, 47426, 46296, 45802, 45297, 44058, 42518, 42148, 43552, 45716, 47711, 49998, 53339, 57462, 61608, 65523, 69091, 71757, 73114, 73571, 73908, 74698, 76347, 78845, 81222, 82232, 81926, 81636, 82189, 83238, 84582, 86697, 89475, 91858, 93520, 95630, 99106, 103250, 106902, 109873, 112374, 114229, 115537, 117084, 119174, 120958, 121776, 122180, 122790, 123229]
56608A23229j08m5N30L80o31j174n55M53J136J571J692J204N91O67J042N82n93
56591A29971j199q75n28n76m15J46N57P70J265J836J787J352J420J861J761J209
56575A40342J275K162L028L545M000M015K927J410R16J515K009K108K615L534
56561A75401L949L864M204M917N004M493M447M860M628L726L287L348K706J374
56547B30208Q46J444J642P24r8l6p0r93k025k410k670l171l103j988q91r97k091
56530B14321l210l818l766l109k423k353k599k392j906j941k368k390k182k658
56516A77206l567l749l196l064l496l423k720k545l164l455k983k672k950l038
56502A33184k549k031j580o57M26O74K76M41J196J309N75J57M56P37R75J849K818
$$ y = [123229, 123121, 123076, 123606, 123986, 123355, 122181, 121626, 122079, 123215, 124786, 126478, 127682, 128273, 128940, 129982, 130564, 129971, 128772, 127897, 127369, 126793, 126378, 126524, 127081, 127851, 129116, 130952, 132739, 134091, 135511, 137372, 139133, 140342, 141617, 143779, 146807, 150352, 154352, 158367, 161294, 162704, 163620, 165135, 167144, 169252, 171867, 175401, 179350, 183214, 187418, 192335, 197339, 201832, 206279, 211139, 215767, 219493, 222780, 226128, 228834, 230208, 231054, 232498, 234140, 234864, 234766, 234730, 234660, 233667, 231642, 229232, 226562, 223391, 220288, 218300, 217409, 216412, 214321, 211111, 207293, 203527, 200418, 197995, 195642, 193043, 190651, 188745, 186804, 184436, 182046, 179864, 177206, 173639, 169890, 166694, 163630, 160134, 156711, 153991, 151446, 148282, 144827, 141844, 139172, 136222, 133184, 130635, 128604, 127024, 126367, 126793, 127467, 127743, 128184, 129380, 130689, 131264, 131421, 131877, 132614, 133589, 135438, 138256]
56485A38256K605J702J833K784K603J261J012K438L347K592J872K426K939K310
56471A69980J692K099K497K025J741K447L041K692K426K918K969J871J079J658
56457B01135K257J537N76Q12J527J397Q03O49M33m56j081m59N38O69L46N50R61
56440B12194Q27N34P95J338J670J945K019J018r90k373k112j168p16o55p90j586
56424B11950k691k686j454p47j321j736j265j435k983l885k529o39o90k308l466
56409A82115l546k987j543P84K511K485J682J398J157K16m41K34J232J097L94
56394A86788M59R78Q51L28L16O56P30P50Q64L06j061j740p64O62J162J245J683
56377A94213J700O40l25j30J19q42j944j442L21J839K827L670L951L462L345M318
$$ y = [138256, 140861, 142563, 144396, 147180, 149783, 151044, 152056, 154494, 157841, 160433, 162305, 164731, 167670, 169980, 171672, 173771, 176268, 178293, 180034, 182481, 185522, 188214, 190640, 193558, 196527, 198398, 199477, 201135, 203392, 204929, 205505, 206317, 207844, 209241, 210044, 210693, 211126, 210670, 209589, 209130, 209668, 210337, 210683, 211233, 212194, 213021, 213555, 214350, 215688, 217358, 219303, 221322, 222340, 221350, 218977, 216865, 215697, 214981, 214326, 213536, 211950, 209259, 206573, 205119, 204372, 203051, 201315, 200050, 198615, 195632, 191747, 189218, 188579, 187889, 185581, 182115, 178569, 175582, 174039, 174823, 177334, 179819, 181501, 182899, 184056, 184272, 183831, 184065, 185297, 186394, 186788, 187247, 188225, 189076, 189404, 189720, 190376, 191106, 191856, 192720, 193026, 191965, 190225, 189461, 190123, 191285, 192530, 194213, 195913, 196553, 196228, 196098, 196217, 195375, 193431, 191989, 192310, 194149, 196976, 200646, 204597, 208059, 211404, 215722]
56361B15722N136M628L730L587L410K249J254J827L036L185K587K528K769K342
56347B57990J612J447J443J008R21J868K739K372J623J771K264K069J743K223
56333B83093K982L352M068N619O749O533O179O785P290O743O435P491Q488Q038
56319C69845P506Q544J0033J0314J0334J1434J2175J0650Q237P512P959P219N235
56306D86997L739K857J558L85M59P44m80k391k917k265k074k119j019P09J349
56291D85532J064J412K532L470M348N646O535O487P115R748J2722J3930J4357
56278E74898J6047J8360J9570K0449K2656K5215K6340K7299L0551L5290L8835
56267H55510M1357M5238N0695N6002O1319O8406P7151Q6068R5592J07148J19713
$$ y = [215722, 220858, 225486, 229216, 232803, 236213, 238462, 239716, 241543, 244579, 247764, 250351, 252879, 255648, 257990, 259602, 261049, 262492, 263500, 264421, 266289, 269028, 271400, 273023, 274794, 277058, 279127, 280870, 283093, 286075, 289427, 293495, 299114, 305863, 312396, 318575, 325360, 332650, 339393, 345828, 353319, 361807, 369845, 377351, 385895, 395928, 406242, 416576, 428010, 440185, 450835, 459072, 466584, 474543, 481762, 486997, 490736, 493593, 495151, 495536, 495995, 496739, 496259, 493868, 490951, 488686, 486612, 484493, 483474, 484183, 485532, 486596, 488008, 490540, 494010, 498358, 504004, 510539, 517026, 524141, 533889, 546611, 560541, 574898, 590945, 609305, 628875, 649324, 671980, 697195, 723535, 750834, 781385, 816675, 855510, 896867, 942105, 992800, 1048802, 1110121, 1178527, 1255678, 1341746, 1437338, 1544486, 1664199]
56256A664199J30975J41186J52220J63546J72858J79918J85962J89989J89440
56247C170293J83955J74786J61316J41976J17884R1826O4463L5353O656j8333
56237D130175l9473n8532p4636q5403r1677r6545j00268j00842r9033r8049r8422
56226C187295r7982r6864r7764j01098j04399j06777j09544j12325j12952j11519
56216B136071j10243j09197j06344j01842r7901r4394q9024q1910p5553p0170
56206A199493o3645n6142n0151m5741m0572l4778l1038k9386k6915k3178k0899
56195G77048k0597j9389j6163j3312j2196j1306r916r284r298q051n607m114l641
56182F34174k027P80K519L048M466O566O858N529N579P541Q843Q914R943J1993
$$ y = [1664199, 1795174, 1936360, 2088580, 2252126, 2424984, 2604902, 2790864, 2980853, 3170293, 3354248, 3529034, 3690350, 3832326, 3950210, 4042036, 4106499, 4141852, 4148508, 4130175, 4090702, 4032170, 3957534, 3872131, 3780454, 3683909, 3583641, 3482799, 3383766, 3285717, 3187295, 3089313, 2992449, 2894685, 2793587, 2689188, 2582411, 2472867, 2360542, 2247590, 2136071, 2025828, 1916631, 1810287, 1708445, 1610544, 1516150, 1427126, 1345216, 1269663, 1199493, 1135848, 1079706, 1029555, 983814, 943242, 908464, 877426, 848040, 821125, 797947, 777048, 756451, 737062, 720899, 707587, 695391, 684085, 674169, 664885, 655587, 647536, 641929, 637815, 634174, 632147, 632927, 635446, 638494, 642960, 649526, 656384, 661913, 667492, 675033, 683876, 692790, 702733, 714726]
56168G14726J2476J1223J1058J2513J2892J1422J0351J0117Q569N757M398M656
56156H30158L670J142J39J409K262K089L559P139R927J1174J3584J7846K1410
56143I25508K3991K8803L6823M5205N2787O1850P3062Q4092R4559J06770J20290
56132A653740J31210J37913J41783J41347J32311J15163R6610Q1710P0355O2508
56122B764650N9832N9929N5795M3872K7265R361r359k6516l7033m0205m1804m6752
56110B819035n5370o8031q6390j07591j24113j32220j34560j32699j24213j09475
56100A744373r3973q0855o7912n4485m4272l8526l3571k7937k4918k5296k4777
56089A227851k1496j8884j8375j6679j2942j0835j0857q605l535r65k359k313
$$ y = [714726, 727202, 738425, 749483, 761996, 774888, 786310, 796661, 806778, 815347, 821104, 825502, 830158, 833828, 834970, 835109, 836518, 838780, 840869, 844428, 851567, 861494, 872668, 886252, 904098, 925508, 949499, 978302, 1015125, 1060330, 1113117, 1174967, 1248029, 1332121, 1426680, 1533450, 1653740, 1784950, 1922863, 2064646, 2205993, 2338304, 2453467, 2550077, 2631787, 2702142, 2764650, 2824482, 2884411, 2940206, 2984078, 3011343, 3020704, 3011345, 2984829, 2947796, 2907591, 2865787, 2819035, 2763665, 2695634, 2609244, 2501653, 2377540, 2245320, 2110760, 1978061, 1853848, 1744373, 1650400, 1569545, 1501633, 1447148, 1402876, 1364350, 1330779, 1302842, 1277924, 1252628, 1227851, 1206355, 1187471, 1169096, 1152417, 1139475, 1128640, 1117783, 1109178, 1105643, 1104678, 1102319, 1100006]
56077A100006J410L876K715K655O140Q568P351O842R563J1398J0198J0186J3117
56064A194025J4176J1512J0535J3754J5887J4235J4002J7829K0104J7720J6320
56053A360099J9570K2257K0644J9581K2497K4496K2390K1447K4920K7123K4431
56042A609455K2794K6565L0234K9187K8290L1695L4584L3348L3320L8004M1405
56031A958881L9613L8929M3708M7611M5955M5110N0096N4749N4008N3805N8658
56020B491123O1982N9365N8630O5487P2110P1563P0391P4885P8519P5660P4072
56009C253787Q0386Q6972Q6894Q7787R6796J06122J08260J10840J21082J30697
55999D269623J32255J34930J47248J60063J64168J68515J82705J98049K05132
$$ y = [1100006, 1101416, 1105292, 1108007, 1110662, 1116802, 1125370, 1132721, 1139563, 1149126, 1160524, 1170722, 1180908, 1194025, 1208201, 1219713, 1230248, 1244002, 1259889, 1274124, 1288126, 1305955, 1326059, 1343779, 1360099, 1379669, 1401926, 1422570, 1442151, 1464648, 1489144, 1511534, 1532981, 1557901, 1585024, 1609455, 1632249, 1658814, 1689048, 1718235, 1746525, 1778220, 1812804, 1846152, 1879472, 1917476, 1958881, 1998494, 2037423, 2081131, 2128742, 2174697, 2219807, 2269903, 2324652, 2378660, 2432465, 2491123, 2553105, 2612470, 2671100, 2736587, 2808697, 2880260, 2950651, 3025536, 3104055, 3179715, 3253787, 3334173, 3421145, 3508039, 3595826, 3692622, 3798744, 3907004, 4017844, 4138926, 4269623, 4401878, 4536808, 4684056, 4844119, 5008287, 5176802, 5359507, 5557556, 5762688]
55990E762688K13003K31015K49306K58125K68348K91033L15705L31463L49681
55981H270367L81724M15290M38357M64486N07309N53379N89541O32433O99285
55972A2952171P75360Q44208R22805J030341J151694J271970J416023J610131
55964B1974703J838047K083149K378103K760376L219710L751010M416214N286401
55956D7707713O372914P696096R365725J1495210J4092779J7146696K0748727
55949A34625860K5009731K9957964L5652155M2055240M8141863N1035343M6870708
55942D13348864L3541845J2955859r623074k8652558m1018042m6493972m6571599
55935B87487323m3211377l8169310l2696593k7470750k2773431j8729108j5376929
$$ y = [5762688, 5975691, 6206706, 6456012, 6714137, 6982485, 7273518, 7589223, 7920686, 8270367, 8652091, 9067381, 9505738, 9970224, 10477533, 11030912, 11620453, 12252886, 12952171, 13727531, 14571739, 15494544, 16524885, 17676579, 18948549, 20364572, 21974703, 23812750, 25895899, 28274002, 31034378, 34254088, 38005098, 42421312, 47707713, 54080627, 61776723, 71142448, 82637658, 96730437, 113877133, 134625860, 159635591, 189593555, 225245710, 267300950, 315442813, 366478156, 413348864, 446890709, 459846568, 450223494, 421570936, 380552894, 334058922, 287487323, 244275946, 206106636, 173410043, 145939293, 123165862, 104436754, 89059825]
55928H9059825j2645452j0411638q595640p149557n995793n047998m268822l648623
55920C1296302l149935k724556k362055k071414j833851j618410j425119j269891
55912A4841071j143193j022966r12346q26754p57829o85688o13845n58449n15056
55903G804945m67939m20924l88286l65268l36618l04972k83254k67875k45998
55894D723811k21154k06146j98031j84299j66799j56467j51047j40317j26908
55885C172643j20644j18215j09239r6564r0690q9779q4486p6920p5851p8408p5073
55874B156774o7898o5806o6684o1751n3073m9411m9070m3952l6488l5677l9834
55863A587130l9573l4722l2466l1960k6423j7698j3445j2537q110k671n277j5482
$$ y = [89059825, 76414373, 66002735, 57407095, 50257538, 44261745, 39213747, 34944925, 31296302, 28146367, 25421811, 23059756, 20988342, 19154491, 17536081, 16110962, 14841071, 13697878, 12674912, 11762566, 10935812, 10177983, 9492295, 8878450, 8320001, 7804945, 7337006, 6916082, 6527796, 6162528, 5825910, 5520938, 5237684, 4969809, 4723811, 4502657, 4296511, 4098480, 3914181, 3747382, 3590915, 3439868, 3299551, 3172643, 3051999, 2933784, 2824545, 2727981, 2637291, 2547512, 2463026, 2386106, 2310255, 2231847, 2156774, 2088876, 2023070, 1956386, 1894635, 1841562, 1792151, 1743081, 1699129, 1662641, 1626964, 1587130, 1547557, 1512835, 1480369, 1448409, 1421986, 1404288, 1390843, 1378306, 1370196, 1367525, 1362248, 1346766]
55851A346766k4208k8900l4154l9174l8399l3481l1601l2648l0216k4166k0281
55840A009538j8808j4983r701q197r468q113n255o637j1415j3739j3803j6464
55828H72955k0576k0640j7607j7176j8826j7442j4331j5529k0218k1712j9278
55817F69620j8248j9115j7235j2924j1376j2545j1267p363n743o491m704k62J923
55804E44270J572L403P567R133P534P266Q662P044J839k224l840o591j0995j3357
55790E61283j3245j4117j5887j4884j1644j0759j2426j2097r060p366p676o127
55778D25995k132M45O17J148J514k147r130j3882j4679j5233j6794j6292j3363
55765C26067j1689j1887j0368o698m971o319p071n804n478o988p397o147o501
$$ y = [1346766, 1322558, 1293658, 1259504, 1220330, 1181931, 1148450, 1116849, 1084201, 1053985, 1029819, 1009538, 990730, 975747, 966046, 957849, 948381, 940268, 935013, 928376, 916961, 903222, 889419, 872955, 852379, 831739, 814132, 796956, 778130, 760688, 746357, 730828, 710610, 688898, 669620, 651372, 632257, 615022, 602098, 590722, 578177, 566910, 559547, 553804, 547313, 542609, 542347, 544270, 545842, 549245, 556812, 565945, 573479, 580745, 589407, 596451, 598290, 596066, 592226, 585635, 574640, 561283, 548038, 533921, 518034, 503150, 491506, 480747, 468321, 456224, 447164, 439798, 432122, 425995, 423863, 424308, 424925, 426073, 427587, 425440, 416310, 402428, 387749, 372516, 355722, 339430, 326067, 314378, 302491, 292123, 285425, 280454, 274135, 267064, 261260, 255782, 248794, 241397, 235250, 228749]
55752B28749r116j0520r457q654q840p230l452q90o73k03J092N85j767k464o23
55737A66537O86L50N99J641J021o52L45L911N446L390J207N47j099m245n544m092
55721A70048l458n186o184m803l689m294m257k562j789k809k668q7K039J998J991
55706A34290L375M204L756M423O799P790N896L647K709J373j036k131j032j30
55692A73933k27J207M735O869N668L714L105K294K63q98k04l9j551k149k71J663
55676A98112J605J123J668J755M09m95K01P56K17M13K034K714J238k01j63l63
55660B11023j707k090n13O32j28o45O97K049J801J376J882J705k7j346j263j923
55644B11523m518o789p111p267q551r087p663o534p435q431p659o621o875o975
$$ y = [228749, 219633, 209113, 199656, 191002, 182162, 174932, 171480, 170590, 169917, 169714, 170806, 171391, 169624, 167160, 166537, 167223, 167573, 168172, 169813, 170834, 170182, 170527, 174438, 179884, 183274, 184481, 185028, 183929, 179684, 174140, 170048, 166590, 161404, 155220, 150417, 146728, 142434, 138177, 135615, 133826, 131017, 128349, 128262, 130301, 132299, 134290, 137665, 141869, 145625, 150048, 156847, 164637, 170533, 174180, 176889, 178262, 177226, 175095, 174063, 173933, 173706, 174913, 179648, 186517, 192185, 195899, 199004, 201298, 201561, 200663, 200459, 200420, 198869, 196720, 196449, 198112, 199717, 200840, 202508, 204263, 204672, 204177, 204378, 205134, 205351, 205764, 207798, 210512, 211750, 211549, 211386, 211023, 209316, 207226, 206713, 207345, 207217, 206572, 207269, 209318, 211119, 212495, 214377, 216082, 216055, 214709, 213446, 211523, 207005, 200216, 193105, 185838, 177287, 168200, 160537, 154003, 146568, 138137, 130478, 123857, 116982, 110007]
55630A10007n654m657n307n636m018k467l062m204l614k207j836j846r71j67n06
55615F3855p62J27N82q66k713k957k172j653r71L02Q89J48l92Q1m3j501k177p78
55597D8999O31K60k75P44J785R87l94n22l34j237j954q33R07J274Q27J064J474
55580E3403R23P9j00l35j124j141K75J293O28l9R29K243K416K650M210N488M740
55563G6538L373L428L906K738M65j055j856k922l822l951m318n535n935m262k211
55548E4581j702j755p54M08L02n0Q17J778J134j52k40L88M03N36J999L702L983
55531F5378L473L506L414K234J279K003L119K845K181K826L669K712Q88M19P85
55516A00731j95k423l980m614n450o218n815m855m636m481k975r57l39q54q68
$$ y = [110007, 104353, 99696, 94389, 88753, 84735, 82268, 79206, 75002, 71388, 69181, 67345, 65499, 64528, 64361, 63855, 63093, 63220, 63802, 62936, 60223, 57266, 55094, 53441, 52470, 52772, 53661, 53809, 53417, 53498, 53455, 51954, 49777, 48999, 49630, 49890, 49615, 50359, 52144, 53131, 52737, 52215, 51881, 50644, 48690, 47857, 48764, 50038, 50865, 51929, 53403, 54326, 54405, 54305, 53970, 52846, 51705, 51980, 53273, 53901, 53862, 54791, 57034, 59450, 62100, 66310, 71798, 76538, 79911, 83339, 87245, 89983, 90448, 89393, 87537, 84615, 80793, 76842, 72524, 66989, 61054, 56792, 54581, 52879, 51124, 50370, 50778, 51080, 51030, 51847, 53625, 54759, 54607, 54367, 54755, 55158, 55694, 57693, 61395, 65378, 68851, 72357, 75771, 78005, 79284, 81287, 84406, 87251, 89432, 92258, 95927, 98639, 99527, 99946, 100731, 100536, 98113, 94133, 89519, 84069, 77851, 72036, 67181, 62545, 58064, 55089, 54132, 53793, 52939, 52071]
55501E2071n25j165k383k561j744j289j341j145r94j442j567m84N01p0r64k90
55485C4608R41M61j171j500m56k24j270j854j407j240j757j841j282j204j808
55470A8996k000j419q23m72l6J22n68j429j375p42n18n20j39l2r88j945j354K18
55452D976R79O55K65rn71q35j14P31N95K30Q69J774J429K20m04n05r89j435r60
55433F901l03n29p76J71J242P75k60J31J246Q33p75j120J59R37M34J15O51R92
55415A0824P80R18J397J119J26l45j59k83n50R6J200J139m3o44k01P5j69N1P73
55396A6104P83q0n71k86j43m44m48j48l76j069j291r78q56p80j05O07L07m63l68
55377I395K64Qj001j402j219j616B162D97L9J037Q10N27N06j70j360A67i85r72
$$ y = [52071, 51546, 50381, 47998, 45437, 43693, 42404, 41063, 39918, 38924, 37482, 35915, 35431, 35932, 35862, 34898, 34608, 35549, 36010, 34839, 33339, 32883, 32659, 31389, 29535, 28128, 26888, 25131, 23290, 22008, 20804, 18996, 16996, 15577, 14754, 14282, 14246, 14368, 13800, 12371, 10996, 10254, 9736, 9216, 9077, 9045, 8057, 6112, 4758, 4976, 5955, 6610, 6875, 6866, 6295, 5460, 5346, 6077, 6672, 6902, 7771, 9545, 10974, 11194, 10790, 10285, 9296, 7861, 6901, 6598, 6069, 5293, 5464, 6706, 7481, 7221, 7352, 8598, 9431, 8656, 7536, 7695, 8632, 9066, 9181, 9832, 10824, 11604, 12522, 13919, 15038, 15164, 14819, 14660, 14377, 13827, 13923, 15123, 16262, 16219, 15575, 15374, 15449, 15280, 15331, 16104, 16887, 16807, 16236, 15950, 15807, 15363, 14915, 14767, 14391, 13322, 12031, 11053, 10197, 9417, 9312, 9919, 10226, 9763, 9395, 9659, 9667, 8666, 7264, 6045, 4429, 2162, 497, 536, 1573, 2383, 2910, 3416, 3246, 1886, 167, -985, -1957]
55359a957j383j204k39L49K78L60M31n09j877j808j80J142J311J303J435P67m97
55342b278p34L26R73M79K37H9J812J338M77L08N88O48M17p2q22j210o13K27J49
55323C336l57Q9J144J179K22k2P49R38k3p69n93n14j035j190n85k64p29D92c15
55303h03k74M32F68J191J60l80j27j01k79N20K011K335J216N99J344J895J240
55286A2292O15J032J479R35M9m50j036j937k264j770j512j824j515j63Q60O53
55270E444J24Pm06j356j504j74J185J200N94N92R39Q43M57J48l73j087j183m67
55252D983J15J66M95J314J475N36k22J08N67Q9p73j064r10p04j75O88J088P18
55234H494L45L81K90J2M10J532K073J385M64J67J05o4P2L69o9j070j249l70J54
$$ y = [-1957, -3340, -4544, -4783, -4434, -4156, -3796, -3365, -3874, -5751, -7559, -7739, -6597, -5286, -3983, -2548, -1781, -2278, -3012, -2686, -1713, -1234, -997, 89, 1901, 3239, 3716, 4024, 4612, 5260, 5677, 5605, 4783, 3573, 2960, 3187, 3336, 2979, 3068, 4212, 5391, 5613, 5591, 6340, 7278, 7255, 6486, 5893, 5379, 4344, 3154, 2569, 2305, 1576, 492, -315, -803, -1077, -645, 668, 1859, 2019, 1639, 1512, 1411, 1132, 1652, 3663, 5998, 7214, 7813, 9157, 11052, 12292, 12907, 13939, 15418, 16353, 16402, 15952, 14916, 12979, 10715, 8945, 7433, 5609, 4094, 3931, 4791, 5444, 5568, 5575, 5169, 3813, 2309, 2135, 3320, 4520, 5114, 5706, 6645, 7488, 7945, 8093, 7720, 6633, 5450, 4983, 5098, 5264, 5759, 7073, 8548, 9084, 8862, 8970, 9537, 9626, 8853, 7789, 6879, 6175, 6000, 6688, 7776, 8494, 8839, 9220, 9510, 9522, 9932, 11464, 13537, 14922, 15386, 15553, 15658, 15594, 15666, 16035, 15966, 14896, 13647, 13277, 13431]
55215A3431j93j70O42Q12k35q98j28P76O44M39J090J497N96n05n02j86p48j394
55197A4968q17L49O55K83L12O05L45j34N9P07R38O92L86j24r63j493j315j135
55179A4318j521j764j147k29K15M82J027J358J000M96L42R1m91n80K91J173J134
55162A6195N00k25j277k438k589j524o66q07q33Q3Q63N95L15R94J596J054M71
55145A2307J190K234J868M59m75q73j575k156j661o49l50m69Q7R51R05K12K34
55128A2239J062J532J274J000R06N77K88P97J843K354K008J455J074O43N2n80
55112B8524j208j561j154k21J95j99l59K66O82J29m79k31J69j13l05M53J224Q55
55094B6667J54N53J566J748J230J141J313Q20J02L41J117R48j06n47N1N96N39
$$ y = [13431, 13238, 13068, 13710, 14522, 14287, 13389, 13261, 14037, 14681, 15120, 16210, 17707, 18303, 17798, 17296, 17110, 16362, 14968, 14151, 14500, 15155, 15438, 15750, 16355, 16700, 16566, 16625, 17332, 18270, 18962, 19348, 19224, 18261, 16768, 15453, 14318, 12797, 11033, 9886, 9657, 9872, 10354, 11381, 12739, 13739, 14235, 14577, 14668, 14177, 13597, 13888, 15061, 16195, 16695, 16470, 15193, 12755, 10166, 8642, 7976, 7169, 6336, 6419, 7282, 7877, 8192, 9186, 10782, 11836, 12307, 13497, 15731, 17599, 18058, 17583, 16710, 15135, 12979, 11318, 10669, 10319, 9850, 9937, 10888, 11793, 12005, 12239, 13301, 14833, 16107, 17107, 18013, 18590, 18878, 19675, 21518, 23872, 25880, 27335, 28409, 29052, 29104, 28524, 27316, 25755, 24601, 24380, 24575, 24376, 24017, 24283, 24965, 25094, 24615, 24384, 24553, 24440, 24135, 24588, 25812, 26667, 26821, 27374, 28940, 30688, 31918, 33059, 34372, 35192, 35294, 35635, 36752, 37700, 37594, 37047, 37098, 37694, 38233]
55077C8233M09L00k87j019q68J03O98M19p6m36r83j569j399l19R17J726K118K055
55059D0022J466P99N82N62J45o01j232j686j904j354PJ005O93j54k78J22R3k02
55041C8085J16Q62J102P81N22K33n65j378j338q02q44j377j349n97O0L52P50J247
55023C5860J355J229J383J527J013K43J86P00O89j20q84r98n35M00J552K022J156
55006D6778k90j022r14p11n96l60m01j099j646j032K40R05R30J157J471J077K58
54989D4745K9K40j75j179j615j179o88l82L15J284J632J315J252J644J676J099
54973E0013O48O93Q11Q13R68J102P72L08M30R79J270J509K367L430L673L305L546
54956G6637M547N269N439N918O954P806Q339R422J1358J3375J4899J5904J5865
$$ y = [38233, 38642, 38942, 38655, 37636, 36768, 36871, 37569, 37988, 37912, 37476, 36493, 34924, 33525, 33206, 34123, 35849, 37967, 40022, 41488, 42287, 42869, 43431, 43576, 42975, 41743, 40057, 38153, 36799, 36806, 37811, 38504, 38350, 38072, 38194, 38287, 38085, 38201, 39063, 40165, 40946, 41468, 41701, 41136, 39758, 38420, 37618, 36774, 35397, 34048, 33451, 33511, 33863, 34613, 35860, 37215, 38444, 39827, 41354, 42367, 42610, 42796, 43496, 44185, 44065, 43181, 42183, 41648, 42048, 43600, 45622, 46778, 46488, 45466, 44552, 43841, 43245, 42885, 42484, 41385, 39739, 38707, 38947, 39852, 40782, 41939, 43410, 44487, 44745, 44774, 45014, 44839, 43660, 42045, 40866, 40178, 39796, 40111, 41395, 43027, 44342, 45594, 47238, 48914, 50013, 50661, 51354, 52165, 52978, 53946, 55048, 55820, 56128, 56558, 57537, 58807, 60316, 62683, 66113, 69786, 73091, 76637, 81184, 86453, 91892, 97810, 104764, 112570, 120909, 130331, 141689, 155064, 169963, 185867, 201732]
54943B01732J3917J0356O508K859j272n957j0043j2730j4344j5196j5003j3879
54931A46948j2592j1444j0022q303o894n955n040m104l535l146k402j617j538
54918G0356j774j100N35J798J953J674J669J955K688M334O617Q682J0425J2406
54904A22218J4342J5166J4721J3929J3009J1090P861M169N31l435p724j1415j3866
54891A80596j5251j5689j5038j3716j2438j1064r039o862n610n033l929k348j633
54878F2946j957j878p69K21K35j23l05p68j610j959j485j036j043p92nM17Nm63
54860D9631m25m14p35q20n51p91j759k367j950j209p27n1Q83R95k51j742k269
54843C5448j973j446o70K78P63P23R75J653J719Q00Q6M40J054R84O10N40L48l58
$$ y = [201732, 215649, 226005, 232513, 235372, 234100, 228143, 218100, 205370, 191026, 175830, 160827, 146948, 134356, 122912, 112890, 104587, 97693, 91738, 86698, 82594, 79059, 75913, 73511, 71894, 70356, 68582, 67482, 68017, 69815, 71768, 73442, 75111, 77066, 79754, 84088, 90705, 99387, 109812, 122218, 136560, 151726, 166447, 180376, 193385, 204475, 212336, 216505, 217036, 213601, 205877, 194462, 180596, 165345, 149656, 134618, 120902, 108464, 97400, 88361, 81499, 75889, 70856, 66927, 64579, 62946, 60989, 59111, 58342, 58563, 58798, 58675, 58370, 57602, 55992, 54033, 52548, 51512, 50469, 49677, 49672, 50089, 50094, 49631, 49206, 48792, 48057, 47237, 46686, 45895, 44136, 41769, 39819, 38610, 37883, 37832, 38715, 39710, 39459, 37717, 35448, 33475, 32029, 31359, 31637, 32400, 33123, 34098, 35751, 37470, 38270, 38356, 38796, 39850, 40834, 41444, 41984, 42332, 41974]
54825D1974q38l93M60R42J172J419J291O33J56K81M34L48P55J899K644K123J074
54808E6374M89K22l6L42J719L162L859M472N767P072P469P529Q374R873J1171
54793A27858J2226J3432J4429J4638J4337J3846J2320Q783L923n11l818o674r613
54780B15176j2168j3509j3238j1722j0038r112q639p532n703m300l786l227k131
54767A10071j509j986k320j283K58P09L43P65K389M151N418O653Q262R963J1382
54752A53266J2454J3370J4662J6946J9840K1784K1601J9732J7100J3545Q412K046
54740C34758m362j0011j4738j8341k0513k1177k0388j8351j5944j4433j4031j3528
54728A48941j1975r923q364p349o448n622m808l564k007j147j478k070k027j797
$$ y = [41974, 41136, 40743, 41203, 42145, 43317, 44736, 46027, 46660, 46816, 47097, 47531, 47879, 48634, 50533, 53177, 55300, 56374, 56863, 57085, 57049, 57391, 59110, 62272, 66131, 70603, 76370, 83442, 90911, 98440, 106814, 116687, 127858, 140084, 153516, 167945, 182583, 196920, 210766, 223086, 231869, 235792, 235281, 231463, 224789, 215176, 203008, 189499, 176261, 164539, 154501, 145389, 136750, 129218, 123515, 119215, 115429, 112202, 110071, 108562, 106576, 104256, 102973, 103231, 103940, 104283, 105048, 107437, 111588, 117006, 123659, 131921, 141884, 153266, 165720, 179090, 193752, 210698, 230538, 252322, 273923, 293655, 310755, 324300, 332712, 334758, 330396, 320385, 305647, 287306, 266793, 245616, 225228, 206877, 190933, 176500, 162469, 148941, 136966, 127043, 118679, 111330, 104882, 99260, 94452, 90888, 88881, 87734, 86256, 84186, 82159, 80362]
54714H0362k061k357j952j198q43p71n67m85p68q11j49N38N30L03N53Q66O40M03
54696G2233Q53J420J136K28m46q39j221j048J84J658K197J909J571J169M43M1
54680H1488M93Q43jj202j121R3R41J134J707K801L353L075K911L342L857M240
54664A07954M825N343N078M321M115M415M069K883K079K317K740K534K062J888
54650A56623J839J698J819K450L293M101N041O114P035P920R242J0915J2233J2966
54636B43289J3608J4270J4149J2484R371N317O49m363r251j3497j6602j8074j7839
54623B33511j6566j5142j3833j2439j0964r581q196o701n408m669m217l500k373
54610A19922r77O36K211L103L099K893L027L021K354J586J394J223J44j430k301
$$ y = [80362, 78301, 75944, 73992, 72794, 71951, 71180, 70613, 70128, 69360, 68549, 68400, 68938, 69468, 69771, 70324, 71190, 71830, 72233, 73086, 74506, 75642, 75870, 75424, 74585, 73364, 72316, 72500, 74158, 76355, 78264, 79835, 81004, 81447, 81488, 81981, 82824, 82823, 81621, 80500, 80593, 81534, 82668, 84375, 87176, 90529, 93604, 96515, 99857, 103714, 107954, 112779, 118122, 123200, 127521, 131636, 136051, 140120, 143003, 145082, 147399, 150139, 152673, 154735, 156623, 158462, 160160, 161979, 164429, 167722, 171823, 176864, 182978, 190013, 197933, 207175, 218090, 230323, 243289, 256897, 271167, 285316, 297800, 307171, 312488, 313137, 308774, 299523, 286026, 269424, 251350, 233511, 216945, 201803, 187970, 175531, 164567, 154986, 146790, 140089, 134681, 130012, 125795, 122295, 119922, 118945, 119581, 121792, 124895, 127994, 130887, 133914, 136935, 139289, 140875, 142269, 143492, 143636, 142206, 139905]
54595A39905k352k491k997l291l279l533m086m270l927l712l966m307m401m236
54581H9057l657k497j241o90r30j345j514j423j112p98r94j664j839r92j14k76
54565F7971q93p63k26n56j629j992j170j88K24L10J58m27q12pJ444J792P00j46
54547F3790L79J309J378Q19M52K81L7Q2P92J721K278K624L253M182N139N961O418
54530A00895O268N804N834O654P585P703O635M525J870n40k163l248m333n338
54516A38151n842o025o388o693o191m973l961l564l298k883k676k814k882k643
54502G7318k271j795j146p13q85j121n14P04J339R21J11n60j138j451j072k34
54486F7493L70P41J334J790J366N67P28J761K116J289O23R97J467J086M73N67
$$ y = [139905, 137553, 135062, 132065, 128774, 125495, 121962, 117876, 113606, 109679, 105967, 102001, 97694, 93293, 89057, 85400, 82903, 81662, 80972, 80042, 78697, 77183, 75760, 74648, 73850, 72856, 71192, 69353, 68361, 68247, 67971, 67078, 66315, 66089, 65533, 63904, 61912, 60742, 60554, 60778, 61088, 61246, 60819, 60007, 60000, 61444, 63236, 63936, 63790, 64169, 65478, 66856, 67675, 68127, 68408, 68445, 68527, 69319, 71040, 73318, 75942, 79195, 83377, 88516, 94477, 100895, 107163, 112967, 118801, 125455, 133040, 140743, 147378, 151903, 153773, 153233, 151070, 147822, 143489, 138151, 132309, 126284, 119896, 113203, 107012, 102039, 98078, 94514, 91216, 88333, 85657, 82843, 79961, 77318, 75047, 73252, 72106, 71393, 70508, 69387, 68873, 69577, 70916, 71837, 71948, 71388, 70250, 68799, 67727, 67493, 67863, 68604, 69938, 71728, 73094, 73661, 74389, 76150, 78266, 79555, 80178, 81175, 82642, 83728, 84201, 84768]
54470H4768J129J533J835K092J724N87l32k21L90N85K56l47j267k237k431j683
54454H6381j041j219j451p87L41Q34M47l05j083j682j707j119n28k83MM93N43
54437G7838j27o69l97L2l07j066j280q75m54j57K64O32O31M98O30Q25P26N64O20
54418G7928N00k09r46q70j68K75K74L97Q08J024R30J073J737K376K362J917J918
54401I1326K885M277M911M251L175L061M151N315N570N173M976N253N550N278
54387A55152M139K266K59j284k322l139l642l559l219l325l813l809l028k247
54373A28429k115k281k238k129k296k658l076l601l959l577k527j740j750j990
54359I2492j767j156m78K83J003J191Q47P62J330J895J892J804K247K810K707
$$ y = [84768, 85897, 87430, 89265, 91357, 93081, 93668, 93336, 93115, 93505, 94090, 94346, 93999, 92732, 90495, 88064, 86381, 85340, 84121, 82670, 81883, 82224, 83058, 83505, 83200, 82117, 80435, 78728, 77609, 77081, 76798, 76802, 77295, 77838, 77711, 77042, 76645, 76677, 76370, 75304, 74024, 73149, 72695, 72538, 72802, 73434, 74065, 74563, 75193, 76018, 76744, 77308, 77928, 78428, 78219, 77273, 76403, 76235, 76510, 76784, 77181, 77989, 79013, 79943, 81016, 82753, 85129, 87491, 89408, 91326, 94211, 98488, 103399, 107650, 110825, 113886, 118037, 123352, 128922, 134095, 139071, 144324, 149874, 155152, 159291, 161557, 161816, 160532, 158210, 155071, 151429, 147870, 144651, 141326, 137513, 133704, 130676, 128429, 126314, 124033, 121795, 119666, 117370, 114712, 111636, 108035, 104076, 100499, 97972, 96232, 94482, 92492, 90725, 89569, 89091, 89374, 90377, 91568, 92415, 93177, 94507, 96402, 98294, 100098, 102345, 105155, 107862]
54344A07862K017J478J504K033K843L502L588L435L971N309O277N927M719L478
54330A57943K086J35j887l074l399l580l987m420m680m714m495m193m095m077
54316A13563l679k993k752l168l564l540l530l714l462k592j999k241k589k402
54302G1338k261k612k548j349j30l18j290j337l91N5n30j133j142j159j531j603
54286E2059r04J8M82N20M35K60k7k58l16j74K54R13J361J301J064J064J060O24
54268E9736O7R1P26J386J767J951J820J172L19j53j66n9J10M65P53N93J61r9k42
54249G0398o11j052j118q95q27q43m97O2J52l06n05J02J006J272O54j98m66J0
54231F6338N58M55j89o37n79m27l93j33L69M48j46o29l46K01L10K54O02J001P43
$$ y = [107862, 109879, 111357, 112861, 114894, 117737, 121239, 124827, 128262, 132233, 137542, 143819, 149746, 154465, 157943, 160029, 160164, 158277, 155203, 151804, 148224, 144237, 139817, 135137, 130423, 125928, 121735, 117640, 113563, 109884, 106891, 104139, 100971, 97407, 93867, 90337, 86623, 83161, 80569, 78570, 76329, 73740, 71338, 69077, 66465, 63917, 62568, 62438, 62120, 60830, 59493, 59102, 59157, 58627, 57494, 56352, 55193, 53662, 52059, 51155, 51173, 51655, 52175, 52610, 52870, 52843, 52585, 52269, 52095, 52349, 53262, 54623, 55924, 56988, 58052, 59112, 59736, 59803, 59894, 60620, 62006, 63773, 65724, 67544, 68716, 69035, 68882, 68716, 68657, 68767, 69232, 69985, 70578, 70739, 70640, 70398, 69787, 68735, 67617, 66722, 65895, 65052, 64555, 64617, 64769, 64463, 63958, 64060, 65066, 66338, 66992, 66794, 66328, 66338, 66896, 67351, 67162, 66525, 65946, 65519, 65126, 64993, 65362, 65810, 65664, 65035, 64689, 64890, 65200, 65454, 66056, 67057, 67800]
54212F7800J6m43n39o48o57j95M15N28K39J30K00k8m89o78n82o00p35o92n84p28
54192F1730q93o96m03n26q13o26q3J69M3o1k47r50j897k246j743r05j60L64M25
54173E0482l2l99j14L96M27K89O91J289J133L72P1M04M26j94n96j86N73J131J493
54154E7656J600J151L86O2K83L37j48q00j359j914k124j426k24K90j69o27n05
54137E2469l66n30k72Q05J715J403K80m17k56J90L28K9n73j227j673j827j695
54120D8383j172l48K04R9n8N35J465J504M34o76j124j249j192m51Q20J379O44
54103D9197k62r9P90J288J171R29O40J8p58j197j192r65o00j91j7j07k4M74J013
54084E0108J310J655K166K184J167l21j276j497j457j316q63k25J85L29N30P99
$$ y = [67800, 67816, 67373, 66834, 66186, 65529, 65334, 65749, 66277, 66516, 66646, 66846, 66818, 66329, 65651, 65069, 64469, 63734, 63042, 62458, 61730, 60837, 60141, 59738, 59212, 58399, 57773, 57690, 57859, 57902, 57841, 57594, 56644, 54747, 52501, 50758, 49853, 49693, 50057, 50482, 50450, 50051, 49937, 50333, 50760, 51049, 51740, 53029, 54162, 54534, 54605, 55009, 55435, 55241, 54645, 54459, 55032, 56163, 57656, 59256, 60407, 60793, 60855, 61138, 61475, 61327, 60527, 59168, 57254, 55130, 53704, 53480, 53770, 53601, 52974, 52469, 52103, 51573, 51301, 52106, 53821, 55224, 55504, 55087, 54831, 55021, 55349, 55378, 54805, 53578, 51905, 50078, 48383, 47211, 46863, 47067, 47166, 47108, 47643, 49108, 50612, 51046, 50370, 49246, 47997, 46805, 46354, 47174, 48553, 49197, 48935, 48836, 49626, 50914, 52085, 53014, 53654, 53672, 52914, 51717, 50525, 49560, 48960, 48769, 48752, 48645, 48621, 49095, 50108, 51418, 53073, 55239, 57423, 58590, 58269, 56993, 55496, 54039, 52723, 51860, 51635, 51820, 52149, 52679, 53478]
54068E3478P58K87j88k11J73M60J44p53j485j177K24J776K501K319J900J824K100
54051F4130K264J851R01K4k28J5K13K28L87Q01J230J618K227L048L672L899L934
54034I0214L890L654L364L438L926M364M537M733N079N294N391N902O926P626
54020A58338P201N942M782M174L895L592L082K311J428P69M78L05p5p38j593k526
54004A91365l346l904m317m800n293n581n649n508m862l614k433k128k465k541
53990A34924k201k135k496k580k156j980k452k832k435j691j280j049n86j36j35
53975A08780m02n31o30q86r06k88O59J382J903K390K469J772Q51O62J252J815
53959A20292J891J781J787J760J509J118P27L43q3n75j088j383j192o59k84j45
$$ y = [53478, 54236, 54523, 54335, 54124, 54297, 54757, 54901, 54148, 52663, 51486, 51710, 53486, 55987, 58306, 60206, 62030, 64130, 66394, 68245, 69146, 69170, 68942, 68957, 69170, 69398, 69785, 70586, 71816, 73434, 75661, 78709, 82381, 86280, 90214, 94104, 97758, 101122, 104560, 108486, 112850, 117387, 122120, 127199, 132493, 137884, 143786, 150712, 158338, 165539, 171481, 176263, 180437, 184332, 187924, 191006, 193317, 194745, 195514, 195992, 196297, 196222, 195484, 193891, 191365, 188019, 184115, 179798, 174998, 169705, 164124, 158475, 152967, 148105, 144491, 142058, 139930, 137465, 134924, 132723, 130588, 128092, 125512, 123356, 121376, 118924, 116092, 113657, 111966, 110686, 109637, 109051, 108915, 108780, 108378, 107847, 107217, 106331, 105425, 105137, 105796, 107178, 109081, 111471, 113940, 115712, 116563, 117225, 118477, 120292, 122183, 123964, 125751, 127511, 129020, 130138, 130865, 131208, 131125, 130550, 129462, 128079, 126887, 126228, 125944, 125799]
53943A25799L30J446K548K841K528K534L225M107M665M968N215N215M596L317
53929A73334J783M32p03j822k745k763j556J4O94M26M33J472K849L557L671L943
53913A83019M548N004N043M911M872M978N303N925O677P167P113O465N354M067
53899B60446K898J910R47k3q27j344j631j738j729j887k485l373m148m743n324
53884B36949n667n364m657m376m814n432n804o116o415o287n674n186n095m846
53870A61216m132l610l800m042l501k580k353k918l333k968k108j326r48j149
53856A22448j883k716l171l179k905k360j598j006r43j275j648j953k124j844
53842I3843j015j75Q2o5J2M17O55M32O9M2M14P82O82N0o17p86n08k17lL57P24
$$ y = [125799, 126129, 127575, 130123, 132964, 135492, 138026, 141251, 145358, 150023, 154991, 160206, 165421, 170017, 173334, 175117, 175549, 174846, 173024, 170279, 167516, 165960, 165974, 166668, 167094, 167527, 168999, 171848, 175405, 179076, 183019, 187567, 192571, 197614, 202525, 207397, 212375, 217678, 223603, 230280, 237447, 244560, 251025, 256379, 260446, 263344, 265254, 266201, 266178, 265351, 264007, 262376, 260638, 258909, 257022, 254537, 251164, 247016, 242273, 236949, 231282, 225918, 221261, 216885, 212071, 206639, 200835, 194719, 188304, 182017, 176343, 171157, 166062, 161216, 157084, 153474, 149674, 145632, 142131, 139551, 137198, 134280, 130947, 127979, 125871, 124545, 123597, 122448, 120565, 117849, 114678, 111499, 108594, 106234, 104636, 103630, 102687, 101412, 99764, 97811, 95687, 93843, 92828, 92653, 92735, 92670, 92682, 93099, 93754, 94186, 94255, 94297, 94711, 95493, 96175, 96225, 95608, 94822, 94314, 94097, 94094, 94451, 95175]
53821I5175N97N8j43L28Q86R71P99P75Q24Q46J062J479J634J404J338J704J956
53804A11693J737J597J972K354K285K374L307M512M897M419L861L596L514L711
53790A55829M192M329L682K962L065L557L296K272J588J759K174K242J951J349
53776A94247M64l34p52j204k088k726k279j414j642l006l903l388k343j933k239
53761A65460k802l372l587l000j949j428j575j368l75L46r0r12q59m1M28J21l86
53744A44611n62l65J44Q86J482J562J281J035Q00K53n51j177j425j562j879k348
53728A42185k707k665k107j258o00l67k78J2L55L34ol6O69J664K072J613R28P32
53710A40540R13Q17L63K85J095K285K951K910K743K885L171L244L055K883L132
$$ y = [95175, 95772, 95830, 95687, 96015, 96901, 97872, 98671, 99446, 100270, 101116, 102178, 103657, 105291, 106695, 108033, 109737, 111693, 113430, 115027, 116999, 119353, 121638, 124012, 127319, 131831, 136728, 141147, 145008, 148604, 152118, 155829, 160021, 164350, 168032, 170994, 174059, 177616, 180912, 183184, 184772, 186531, 188705, 190947, 192898, 194247, 194711, 194377, 193625, 192421, 190333, 187607, 185328, 183914, 182272, 179266, 175363, 171975, 169632, 167699, 165460, 162658, 159286, 155699, 152699, 150750, 149322, 147747, 146379, 146004, 146350, 146260, 145348, 144489, 144448, 144876, 144997, 144611, 144049, 143684, 143828, 144714, 146196, 147758, 149039, 150074, 150874, 151127, 150576, 149399, 147974, 146412, 144533, 142185, 139478, 136813, 134706, 133448, 132848, 132481, 132203, 132215, 132570, 132904, 132898, 132862, 133531, 135195, 137267, 138880, 139808, 140540, 141453, 142270, 142633, 142918, 144013, 146298, 149249, 152159, 154902, 157787, 160958, 164202, 167257, 170140, 173272]
53695A73272M010N238O131O293O019N795N621N191M518M017L960M274M728N006
53681B44073M754L913K893K132J648J308J239J509J722J465R21N16J66m90j273
53666B66496j577j272q79q19j052j444j953k308k178j701j440j612j886j933j801
53651B42641j611j322r01m65j17P1nl24o52q86j283j942k330j837o65L61O92M10
53633B29835j41m92j26R22J774J709J222J291J826J867J197P37J087J714J904
53618B46326J675J394J283J645K804M319N026M443L521L483M365N315N847O127
53604B97573O378O597O778O897O777O355N997O211O983P670P598O714N675N280
53590C89483N746O459O598N995N271N142N747O517O619N682M295L528L755M183
$$ y = [173272, 177282, 182520, 188651, 194944, 200963, 206758, 212379, 217570, 222088, 226105, 230065, 234339, 239067, 244073, 248827, 252740, 255633, 257765, 259413, 260721, 261960, 263469, 265191, 266656, 267577, 268093, 268259, 267769, 266496, 264919, 263647, 262768, 261949, 260897, 259453, 257500, 255192, 253014, 251313, 249873, 248261, 246375, 244442, 242641, 241030, 239708, 238807, 238342, 238225, 238296, 238291, 237967, 237315, 236429, 235146, 233204, 230874, 229037, 228372, 228733, 229425, 229835, 229694, 229202, 229076, 229998, 231772, 233481, 234703, 235994, 237820, 239687, 240884, 241621, 242708, 244422, 246326, 248001, 249395, 250678, 252323, 255127, 259446, 264472, 268915, 272436, 275919, 280284, 285599, 291446, 297573, 303951, 310548, 317326, 324223, 331000, 337355, 343352, 349563, 356546, 364216, 371814, 378528, 384203, 389483, 395229, 401688, 408286, 414281, 419552, 424694, 430441, 436958, 443577, 449259, 453554, 457082, 460837, 465020]
53576D65020L890L020K499K808L526L970L773K982K036J550J680J804J324M56
53562E00338k20o91j232j539r89K86J407J890J966J813J284M58k85r20j771k671
53546D99124k920k292j384q12o87r51j501j787j142J91J110J052O54O89J083J399
53530D91826J599J905K389L109M207N502O496P010P384P829Q156Q341Q812R879
53516E74444J1406J3149J4886J6065J6160J5613J5658J6797J8192J9003J9566
53505G50939K0709K2575K4686K6689K8400K9571L0183L0708L1591L2727L3656
53494A062434L4058L3916L3589L3751L4763L6053L6718L6734L6734L6666L5811
53483A451227L4436L4053L5302L6851L7257L6967L7246L7943L7742L6247L4508
$$ y = [465020, 468910, 471930, 474429, 477237, 480763, 484733, 488506, 491488, 493524, 495074, 496754, 498558, 499882, 500338, 500118, 499427, 498195, 496656, 495667, 495953, 497360, 499250, 501216, 503029, 504313, 504771, 504486, 503566, 501795, 499124, 496204, 493912, 492528, 491716, 491029, 490078, 488577, 486790, 485648, 485839, 486949, 488001, 488655, 489344, 490427, 491826, 493425, 495330, 497719, 500828, 505035, 510537, 517033, 524043, 531427, 539256, 547412, 555753, 564565, 574444, 585850, 598999, 613885, 629950, 646110, 661723, 677381, 694178, 712370, 731373, 750939, 771648, 794223, 818909, 845598, 873998, 903569, 933752, 964460, 996051, 1028778, 1062434, 1096492, 1130408, 1163997, 1197748, 1232511, 1268564, 1305282, 1342016, 1378750, 1415416, 1451227, 1485663, 1519716, 1555018, 1591869, 1629126, 1666093, 1703339, 1741282, 1779024, 1815271, 1849779]
53472A849779L3396L2526L1014K8606K5876K3667K2356K1362J9620J6863J4116
53461B119181J2479J1869J1491J1035J0645R994Q329N455J948j663n362r166j2757
53448B173478j5799j8332k0638k2861k4894k6575k8018k9637l1681l3820l5389
53437A885834l6037l5887l5328l5031l5889l8043m0109m0308l8530l6338l4711
53426A479623l2948l0304k7478k5582k4521k3435k2077k0684j9024j6668j3870
53415A223032j1178q442n110j433J639L723N411P384R817J2646J5773J8914K1735
53402A293911K4199K6432K8405L0022L1397L2637L3723L4948L7004M0088M3337
53391A656103M5819M7758N0095N3062N6009N8475O0709O3132O5835O8682P1510
$$ y = [1849779, 1883175, 1915701, 1946715, 1975321, 2001197, 2024864, 2047220, 2068582, 2088202, 2105065, 2119181, 2131660, 2143529, 2155020, 2166055, 2176700, 2186694, 2195023, 2200478, 2202426, 2200763, 2195401, 2186235, 2173478, 2157679, 2139347, 2118709, 2095848, 2070954, 2044379, 2016361, 1986724, 1955043, 1921223, 1885834, 1849797, 1813910, 1778582, 1743551, 1707662, 1669619, 1629510, 1589202, 1550672, 1514334, 1479623, 1446675, 1416371, 1388893, 1363311, 1338790, 1315355, 1293278, 1272594, 1253570, 1236902, 1223032, 1211854, 1203412, 1198302, 1196869, 1198508, 1202231, 1207642, 1215026, 1224843, 1237489, 1253262, 1272176, 1293911, 1318110, 1344542, 1372947, 1402969, 1434366, 1467003, 1500726, 1535674, 1572678, 1612766, 1656103, 1701922, 1749680, 1799775, 1852837, 1908846, 1967321, 2028030, 2091162, 2156997, 2225679, 2297189]
53380B297189P4259P7113Q0244Q3146Q4803Q4962Q4653Q4784Q4857Q3954Q2391
53369C202355Q1243Q0459P8725P5183P0295O4829N9060N3209M7811M3202L9191
53358C895562L5465L1805K7776K2770J6603R683K520m476j0832j6287k1335k7052
53346C962202l4311m3385n4037o5256p5213q2331q6533q8892r0101r0130q9162
53335C162851q7859q6481q4691q2489q0569p9300p8212p6854p5500p4445p3277
53324B283174p1441o9023o6463o3858o1068n8047n4627n0310m4908l9240l4621
53313A669568l1705l0050k8721k6981k4609k1851j9182j6848j4646j2169r181
53302A433625n787k401L94K201L115L577L917M215M537N031N712O466P280Q345
$$ y = [2297189, 2371448, 2448561, 2528805, 2611951, 2696754, 2781716, 2866369, 2951153, 3036010, 3119964, 3202355, 3283598, 3364057, 3442782, 3517965, 3588260, 3653089, 3712149, 3765358, 3813169, 3856371, 3895562, 3931027, 3962832, 3990608, 4013378, 4029981, 4039664, 4042184, 4037708, 4026876, 4010589, 3989254, 3962202, 3927891, 3884506, 3830469, 3765213, 3690000, 3607669, 3521136, 3432244, 3342143, 3252013, 3162851, 3074992, 2988511, 2903820, 2821331, 2740762, 2661462, 2583250, 2506396, 2430896, 2356451, 2283174, 2211733, 2142710, 2076247, 2012389, 1951321, 1893274, 1838647, 1788337, 1743429, 1704189, 1669568, 1637863, 1607813, 1579092, 1552111, 1527502, 1505651, 1486469, 1469621, 1454975, 1442806, 1433625, 1427838, 1425437, 1425831, 1428032, 1431147, 1434724, 1438641, 1442856, 1447393, 1452424, 1458136, 1464602, 1471882, 1480227]
53288A480227R853J1954J4739J8025K1205K3810K6171K9046L2429L5318L6968
53277A739745L7798L8618L9347L9201L7987L6580L5905L5916L5898L5461L4777
53266B147233L3951L2619L0443K7659K4791K2054J9410J7050J5289J3879J1979
53255B396357R020N206R72l528q107j2253j5680j8837k2349k6180k9843l3179
53243B241599l6396l9495m2235m4513m6320m7369m7359m6635m5986m5690m5228
53232A754373m4093m2445m0790l9363l8094l6911l5855l5001l4392l4077l4106
53221A339246l4447l4835l4776l3940l2562l1040k9246k6695k3633k1157j9874
53210A017041j9097j7979j6923j6954j8035j8963j8885j8170j7714j7956j8663
$$ y = [1480227, 1490080, 1502034, 1516773, 1534798, 1556003, 1579813, 1605984, 1635030, 1667459, 1702777, 1739745, 1777543, 1816161, 1855508, 1894709, 1932696, 1969276, 2005181, 2041097, 2076995, 2112456, 2147233, 2181184, 2213803, 2244246, 2271905, 2296696, 2318750, 2338160, 2355210, 2370499, 2384378, 2396357, 2405377, 2410583, 2411555, 2408027, 2399920, 2387667, 2371987, 2353150, 2330801, 2304621, 2274778, 2241599, 2205203, 2165708, 2123473, 2078960, 2032640, 1985271, 1937912, 1891277, 1845291, 1799601, 1754373, 1710280, 1667835, 1627045, 1587682, 1549588, 1512677, 1476822, 1441821, 1407429, 1373352, 1339246, 1304799, 1269964, 1235188, 1201248, 1168686, 1137646, 1108400, 1081705, 1058072, 1036915, 1017041, 997944, 979965, 963042, 946088, 928053, 909090, 890205, 872035, 854321, 836365, 817702]
53199H17702j9172j8834j7657j6475j6037j6129j6071j5818j5806j5962j5753
53188F33988j5200j4975j5339j5756j5793j5616j5409j4984j4318j3795j3579
53177D69224j3314j2715j2010j1460j1012j0641j0523j0516j0077r050q009p422
53165C42475p032o522o237o608p212p225o530n783n340m845m028l294l175l512
53151B65132l677l470l360l678l974l563k554j799j800k131k170j869j420p44
53137B28923J39N71q6j442k358k273j610r43l68J41L74K03j62l75k19L39J055
53120B21909J422J240J063J597K695L569L920M218M662M731M041L056K428K131
53106B62682J647P30l91j330j811j855j949k687m055n283n727n555n385n533n850
$$ y = [817702, 798530, 779696, 762039, 745564, 729527, 713398, 697327, 681509, 665703, 649741, 633988, 618788, 603813, 588474, 572718, 556925, 541309, 525900, 510916, 496598, 482803, 469224, 455910, 443195, 431185, 419725, 408713, 398072, 387549, 377033, 366956, 357906, 349897, 342475, 335443, 328921, 322684, 316076, 308864, 301639, 295109, 289326, 283986, 279141, 275113, 271819, 268644, 265132, 261455, 257985, 254625, 250947, 246973, 243410, 240856, 239057, 237257, 235126, 232956, 231087, 229667, 228923, 229062, 229633, 229547, 228105, 225747, 223474, 221864, 220921, 220553, 220694, 221068, 221271, 221109, 220734, 220515, 220854, 221909, 223331, 224571, 225634, 227231, 229926, 233495, 237415, 241633, 246295, 251026, 255067, 258123, 260551, 262682, 264329, 265059, 264668, 263338, 261527, 259672, 257723, 255036, 250981, 245698, 239971, 234416, 229031, 223498, 217648]
53091B17648o138o322o358o164n705n011m167l260k358j566j154j392k121k728
53077A63204k801k615k590k621k342j854j621j751j887j796j571j277q81n12l87
53062A36698m73o30r04j225j126k87P51J169R74Q02P97N31Rk60k42m94j077j329
53044A33684j020q25j187j535j201l83K82M86J91o00j478j678j003j43L10N77
53028A24477R71J163P39L2l25k71k31m09o79q79q63n61k14j66k14K25J063J324
53010A25182M93o60j076o59P7Q61J541J698J199O45N59N37O8m26k76J13k06j074
52992A28596j301m51N22O98K95nj52n00r87j029j88J269K482K681J982J358J559
52975A36829K235K530K355K426L118L920M316M516M941N392N310M704M244M360
$$ y = [217648, 211510, 205188, 198830, 192666, 186961, 181950, 177783, 174523, 172165, 170599, 169445, 168053, 165932, 163204, 160403, 157788, 155198, 152577, 150235, 148381, 146760, 145009, 143122, 141326, 139755, 138478, 137597, 137085, 136698, 136225, 135595, 134691, 133466, 132340, 132053, 132804, 133973, 134947, 135749, 136546, 137077, 137086, 136826, 136584, 136090, 135013, 133684, 132664, 131839, 130652, 129117, 127916, 127533, 127815, 128301, 128492, 127892, 126414, 124736, 123733, 123590, 123900, 124477, 125448, 126611, 127350, 127382, 127057, 126786, 126555, 126146, 125467, 124588, 123725, 123164, 122950, 122784, 122570, 122795, 123858, 125182, 125675, 125015, 123939, 123280, 123357, 124218, 125759, 127457, 128656, 129301, 129860, 130397, 130465, 130039, 129763, 129876, 129670, 128596, 127295, 126844, 127366, 128064, 128359, 128354, 128202, 127702, 126715, 125686, 125498, 126767, 129249, 131930, 133912, 135270, 136829, 139064, 141594, 143949, 146375, 149493, 153413, 157729, 162245, 167186, 172578, 177888, 182592, 186836, 191196]
52961A91196M692M596L982L265K630J792O19m15p75o20o26j126j785k167k207
52946B03051k124k109k231k344k179j772j652k121k597k254j285p74j160j726
52932A76723j747j391j084p55l25j89n31p47k79L59K12o97j341j013p8O14N19
52915A68250l37j386j835j345l96K87N90R17J416J721J523R60L76p1m31p55r78
52898A68506r99q89r21j183j284p47K61J001J046P18N03M24K42o6k90k28J75P16
52880A66985R58O59J81K8J17Q1J25P52J621J689P99O4J62L20k94j130j185o18
52862A71314l04l25m1N99Q93N34Jj98k0L86Q39J147J381J954K873L393L036K622
52844A90084L275M761N743N652N225N109M995M417L628L078K668J967P73q33k653
$$ y = [191196, 195888, 200484, 204466, 207731, 210361, 212153, 212772, 212357, 211582, 210962, 210336, 209210, 207425, 205258, 203051, 200927, 198818, 196587, 194243, 192064, 190292, 188640, 186519, 183922, 181668, 180383, 179609, 178449, 176723, 174976, 173585, 172501, 171746, 171421, 171232, 170701, 169954, 169675, 170034, 170246, 169549, 168208, 167195, 167117, 167731, 168250, 167913, 166527, 164692, 163347, 162951, 163238, 163828, 164745, 166161, 167882, 169405, 170365, 170741, 170670, 170239, 169484, 168506, 167507, 166618, 165697, 164514, 163230, 162483, 162744, 163745, 164791, 165509, 166012, 166436, 166678, 166612, 166322, 166094, 166269, 166985, 167943, 168602, 168783, 168811, 168928, 169009, 169134, 169886, 171507, 173196, 173995, 174059, 174221, 174541, 174247, 173117, 171932, 171314, 171010, 170685, 170644, 171243, 172136, 172670, 172671, 172473, 172453, 172839, 173678, 174825, 176206, 178160, 181033, 184426, 187462, 190084, 193359, 198120, 203863, 209515, 214740, 219849, 224844, 229261, 232889, 235967, 238635, 240602, 241375, 240542, 237889]
52829B37889m251n037m811m079l553l442l434l283l167l365l684l553k840k277
52815A87113k662l725m401m221l707l327k881k249j956k307k640k184j176m21
52801A49256j89k09l54o42q71q90r11j011p97k51k30j323k673l005k378j897j927
52784A29698j830j322r45j069j410j690j887j767j053j49J29k70n68l78q0Q9L93
52767A15891Q16P79Rj088k124l044l591l253k138j100o82o36o84r71j398j408
52751I5378r71q83j495j942j414n25m34j057j164k84N20L1j527k829l008k464
52735G5932k038j822j202k8R21Q78R6n61o53k77M50J390K009J813J038L64l2m03
52717G7875o31l15L16M98J58J40Q95J663J470L64p71j165o24N23J558J865J569
$$ y = [237889, 233638, 228601, 223790, 219711, 216158, 212716, 209282, 205999, 202832, 199467, 195783, 192230, 189390, 187113, 184451, 180726, 176325, 172104, 168397, 165070, 162189, 159940, 157984, 155677, 153037, 150853, 149677, 149256, 149067, 148858, 148504, 147862, 146991, 146101, 145190, 144179, 143382, 143131, 142901, 141578, 138905, 135900, 133522, 131625, 129698, 127868, 126546, 125601, 124532, 123122, 121432, 119545, 117778, 116725, 116576, 116705, 116435, 115867, 115489, 115409, 115498, 115891, 116707, 117486, 117495, 116407, 114283, 111239, 107648, 104395, 102257, 101157, 100475, 99839, 99155, 98184, 96786, 95378, 94407, 93524, 92029, 90087, 88673, 88148, 87714, 86657, 85493, 85209, 85729, 85760, 84233, 81404, 78396, 75932, 73894, 72072, 70870, 70842, 71763, 72641, 72737, 72176, 71523, 71246, 71696, 73086, 75095, 76908, 77946, 78310, 78278, 77875, 77244, 76929, 77245, 77743, 77901, 78041, 78936, 80599, 82069, 82433, 81662, 80497, 79873, 80396, 81954, 83819, 85388]
52700H5388J383J692K178K473K701L132L763M424M970N162M731L705K367R24m66
52685A28527j470j930k242k805l242k930k211k067k566k668j912j216j483k287
52671I7498k635k349k053k154k481k566k026r81k42n82j629k190j823j301j212
52656G1274j107m97J43J55k63n42o18o86o13l50l56r01j394j136k79N64J175J507
52638F6076J242L72k84p5M28L10j56J2P81J090M99k20l88k63l26n74q67j236j509
52619F4912j246m71J34R7k47l47j56J23N10R91J168P08j8k32L14J093J500J473
52601G0306J245Q52J39p52j253r11J05J155J752J811J416O46k59q19o31K73J398
52584G6473K051J798Q76K06N48J613K278J867Q73K68L91Q84J357J750K053K090
$$ y = [85388, 86771, 88463, 90641, 93114, 95815, 98947, 102710, 107134, 112104, 117266, 121997, 125702, 128069, 128993, 128527, 127057, 125127, 122885, 120080, 116838, 113908, 111697, 109630, 107064, 104396, 102484, 101268, 99785, 97498, 94863, 92514, 90461, 88307, 85826, 83260, 81234, 80253, 80011, 79429, 77800, 75610, 73787, 72486, 71274, 70167, 69670, 69813, 69968, 69705, 69163, 68545, 67859, 67246, 66896, 66540, 65639, 64245, 63109, 62830, 63394, 64569, 66076, 67318, 67690, 67406, 67331, 67759, 68069, 67913, 67925, 68706, 69796, 70295, 70075, 69687, 69424, 69098, 68524, 67657, 66421, 64912, 63666, 63195, 63329, 63426, 63179, 62832, 62676, 62799, 63309, 64300, 65468, 66176, 66158, 65926, 66240, 67333, 68833, 70306, 71551, 72403, 72542, 71790, 70537, 69626, 69731, 70886, 72638, 74449, 75865, 76511, 76252, 75433, 74802, 75075, 76473, 78524, 80322, 81198, 81404, 81952, 83565, 85843, 87710, 88583, 88851, 89242, 90126, 91483, 93233, 95286, 97376]
52568I7376J703J038N45N92J063J426J355J130J222J630J948K004J965J884J578
52553A18459J068O50M43L30M06R22J604J699J044M32M99P37K45r29j834j820j066
52536A22889m6R89J925K618K901K620J708M35n54p30k18L81N88L87M7j80k70l91
52518A35099o32q04o93m30k96k06K08Q50J025K90q93j699j790j406q99n26m42
52501A26756n42m80j05K49J91j79m02k54M7J68Q5J05M86J026J172P00J08ML14
52482A29449M28O0m92p68m98L50J334J604Q42l0J46J122J564R50J48p9n5k37l43
52463A35495j1M96Q45J167J499J432R26O25Q10P81M7p12o62k2N97J291K249K750
52445A49603K042P79L51R62J477J162M46k1j36lL75Q75J332J833K382K444J544
$$ y = [97376, 99079, 100117, 100662, 101254, 102317, 103743, 105098, 106228, 107450, 109080, 111028, 113032, 114997, 116881, 118459, 119527, 120177, 120620, 120950, 121356, 122278, 123882, 125581, 126625, 127057, 127556, 128293, 128538, 127609, 125775, 123955, 122889, 122843, 123832, 125757, 128375, 131276, 133896, 135604, 136039, 135485, 134755, 134537, 134918, 135506, 135893, 135940, 135760, 135490, 135099, 134467, 133663, 132970, 132540, 132244, 132038, 132246, 133096, 134121, 134411, 133518, 131819, 130029, 128623, 127724, 127198, 126756, 126214, 125734, 125629, 125878, 126069, 125890, 125488, 125234, 125281, 125449, 125534, 125639, 126125, 127151, 128323, 129023, 129131, 129135, 129449, 129877, 129937, 129445, 128677, 128179, 128529, 129863, 131467, 132309, 132279, 132425, 133547, 135111, 136061, 136209, 136130, 136075, 135838, 135495, 135484, 135980, 136825, 137992, 139491, 140923, 141849, 142474, 143284, 144065, 144112, 143400, 142738, 142716, 143313, 144604, 146853, 149603, 151645, 152424, 152775, 153737, 155214, 156376, 156822, 156801, 156665, 156662, 157037, 157912, 159244, 161077, 163459, 165903, 167447]
52428A67447J80o62q30j072j747k381k623k819l293l659l361k437j494j090j332
52413A38827j870k162j932j378q75o08n80o64n32R2Q53R89L75k12k57k23n49p13
52395A28581j83M24K06m89n53R7N37M74O41J357J882J622R86O55P17R62J350J811
52377A41077J995J622P91j24n71QJ492K737K645J590R66J389K122K422K472K643
52361A65276K754K514K152K062K246K467K611K623K500K496K907L490L557K846
52347B02501J924J494J704K196K516K387J942J688J887K100J856J514J768K481
52333B29958K773K300J585J070O97N62J005J849K364K367K441K823L014K902L213
52318B60923M190M773M001K504J681J933K631L352M166M910N176N157N657P041
$$ y = [167447, 167627, 166965, 166135, 165063, 163316, 160935, 158312, 155493, 152200, 148541, 145180, 142743, 141249, 140159, 138827, 136957, 134795, 132863, 131485, 130610, 130002, 129422, 128758, 128226, 128318, 129171, 130160, 130535, 130323, 130066, 129843, 129294, 128581, 128398, 128822, 129028, 128539, 127986, 128083, 128620, 129094, 129735, 131092, 132974, 134596, 135582, 136237, 136954, 137916, 139266, 141077, 143072, 144694, 145485, 145361, 144790, 144798, 146290, 149027, 151672, 153262, 154228, 155617, 157739, 160161, 162633, 165276, 168030, 170544, 172696, 174758, 177004, 179471, 182082, 184705, 187205, 189701, 192608, 196098, 199655, 202501, 204425, 205919, 207623, 209819, 212335, 214722, 216664, 218352, 220239, 222339, 224195, 225709, 227477, 229958, 232731, 235031, 236616, 237686, 238383, 238945, 239950, 241799, 244163, 246530, 248971, 251794, 254808, 257710, 260923, 265113, 269886, 273887, 276391, 278072, 280005, 282636, 285988, 290154, 295064, 300240, 305397, 311054, 318095]
52304C18095Q712R854J0320J0575J0995J1454J1609J1481J1589J2386J3689J4928
52292D55687J5854J6546J6918J6744J6257J6096J6438J6726J6529J6115J5849
52281F35759J5628J5301J5197J5608J6086J5781J4413J2481J0658R274Q272P372
52269G91830O350N292M414L653K622J106o69k299l419l772l464l145l366l718
52255G91415l261j959q92p53q87l32Q15J727K059K170K528L396M808O371P421
52240H14626P831Q308R426J0771J1581J1826J1926J1890J1511J1084J1064J1083
52228I42927J0279Q671P311O783O412N318L704K459J894J452N57p53k078l196
52214I91740m116m836n256n472n920o992q536r973j0903j1363j1434j1016j0182
$$ y = [318095, 326807, 336661, 346981, 357556, 368551, 380005, 391614, 403095, 414684, 427070, 440759, 455687, 471541, 488087, 505005, 521749, 538006, 554102, 570540, 587266, 603795, 619910, 635759, 651387, 666688, 681885, 697493, 713579, 729360, 743773, 756254, 766912, 776186, 784458, 791830, 798180, 803472, 807886, 811539, 814161, 815267, 814598, 812299, 808880, 805108, 801644, 798499, 795133, 791415, 788154, 786195, 785303, 784550, 783663, 783331, 784146, 785873, 787932, 790102, 792630, 796026, 800834, 807205, 814626, 822457, 830765, 840191, 850962, 862543, 874369, 886295, 898185, 909696, 920780, 931844, 942927, 953206, 961877, 969188, 975971, 982383, 987701, 991405, 993864, 995758, 997210, 997767, 997014, 994936, 991740, 987624, 982788, 977532, 972060, 966140, 959148, 950612, 940639, 929736, 918373, 906939, 895923, 885741]
52201H85741r443r241r298q914p879o759o162n973n570m649l601k905k411j598
52187H01338n60j86r57k021k072j067l06p10j707k102j521n38O3j22r49j733j778
52170G83072j258j182k098l225l387k430j210m91m49j027j991k627k130n86Q78
52155G59859J195L67p96j630k021k144k134k116k309k921l847m584m673m240l947
52140G24059m306n155n838n804m923l523k247j672j793k004j747j161q98j347
52126F81641k204k797k741k262j908j979k269k410k281j986j507p22K59J037J294
52111F59165J139J003J317K157L098L583L620L922N019O544P811Q856J0227J1908
52097G29369J3246J4038J4900J6256J7624J8279J8140J7634J7176J7121J7688
$$ y = [885741, 876298, 867057, 857759, 848845, 840966, 834207, 828045, 822072, 816502, 811853, 808252, 805347, 802936, 801338, 800778, 800592, 799635, 797614, 795542, 794475, 794169, 793459, 791752, 789650, 788129, 787591, 787654, 787532, 786583, 784850, 783072, 781814, 780632, 778534, 775309, 771922, 769492, 768282, 767791, 767342, 766315, 764324, 761697, 759567, 758981, 759859, 761054, 761421, 760625, 758995, 756974, 754830, 752696, 750580, 748271, 745350, 741503, 736919, 732246, 728006, 724059, 719753, 714598, 708760, 702956, 698033, 694510, 692263, 690591, 688798, 686794, 685047, 683886, 682988, 681641, 679437, 676640, 673899, 671637, 669729, 667750, 665481, 663071, 660790, 658804, 657297, 656575, 656834, 657871, 659165, 660304, 661307, 662624, 664781, 667879, 671462, 675082, 679004, 684023, 690567, 698378, 707234, 717461, 729369, 742615, 756653, 771553, 787809, 805433, 823712, 841852, 859486, 876662, 893783, 911471]
$$ [...]
##END NTUPLES=NMR SPECTRUM
##END=
