
##TITLE=AC1068_TOPL01_6608529_kxjj5BuZwT
##JCAMPDX= 6.0         $$ Bruker NMR JCAMP-DX V2.0
##DATA TYPE= NMR SPECTRUM
##DATA CLASS= NTUPLES
##ORIGIN= BRUKER
##OWNER= Administrator
$$ 1.72 TOPSPIN		Version 2.1
$$ 2012-08-01 15:20:30.375 -0500  Administrator@TOPSPIN
$$ Compression mode = diff/dup
##.OBSERVE FREQUENCY= 400.02188249412
##.OBSERVE NUCLEUS= ^1H
##.ACQUISITION MODE= SIMULTANEOUS (DQD)
##.ACQUISITION SCHEME= undefined
##.AVERAGES= 8
##.DIGITISER RES= 22
##SPECTROMETER/DATA SYSTEM= spect
##.PULSE SEQUENCE= zg30
##.SOLVENT NAME= COFFEE_meoh
##.SHIFT REFERENCE= INTERNAL, COFFEE_meoh, 1, 14.98509
##AUDIT TRAIL= $$ (NUMBER, WHEN, WHO, WHERE, PROCESS, VERSION, WHAT)
$$ ##TITLE= Audit trail, TOPSPIN		Version 2.1
$$ ##JCAMPDX= 5.01
$$ ##ORIGIN= Bruker BioSpin GmbH
$$ ##OWNER= Administrator
$$ $$ C:\Bruker\TOPSPIN/data/COFFEE/nmr/AC1068_TOPL01_6608529_kxjj5BuZwT/20/pdata/1/auditp.txt
$$ ##AUDIT TRAIL=  $$ (NUMBER, WHEN, WHO, WHERE, PROCESS, VERSION, WHAT)
(   1,<2012-08-01 15:20:21.796 -0500>,<Administrator>,<TOPSPIN>,<go>,<TOPSPIN 2.1>,
      <created by zg
	started at 2012-08-01 15:19:15.343 -0500,
	POWCHK enabled, PULCHK disabled,
       configuration hash MD5:
       6B 1B 68 BB D9 2E 58 E2 7F 35 AD 54 07 DF 0E 41
       data hash MD5: 64K
       7F 2A 9F 44 31 6B D8 FF 66 E2 E6 D5 9C 8A 3C BD>)
(   2,<2012-08-01 15:20:26.203 -0500>,<Administrator>,<TOPSPIN>,<proc1d>,<TOPSPIN 2.1>,
      <Start of raw data processing
       efp LB = 0 FT_mod = 6 PKNL = 1 PHC0 = 0 PHC1 = 0 SI = 32K 
       data hash MD5: 32K
       C9 C8 5D E6 3B 65 06 83 97 61 37 ED AA 76 57 F5>)
(   3,<2012-08-01 15:20:26.484 -0500>,<Administrator>,<TOPSPIN>,<proc1d>,<TOPSPIN 2.1>,
      <pk PHC0 = 177.5446 PHC1 = 0 
       data hash MD5: 32K
       C5 44 0E C8 19 C3 AE D6 C5 9B A5 8F B1 CB E0 F9>)
(   4,<2012-08-01 15:20:26.578 -0500>,<Administrator>,<TOPSPIN>,<proc1d>,<TOPSPIN 2.1>,
      <abs ABSG = 1 
       data hash MD5: 32K
       C0 04 B0 13 48 C2 9E 0C DD F6 02 CC 3F AE 2E B0>)
(   5,<2012-08-01 15:20:26.609 -0500>,<Administrator>,<TOPSPIN>,<proc1d>,<TOPSPIN 2.1>,
      <abs ABSG = 2 
       data hash MD5: 32K
       4F F0 5E 68 C2 B5 61 3C 6E 11 7D 84 E4 87 1F A6>)
(   6,<2012-08-01 15:20:26.656 -0500>,<Administrator>,<TOPSPIN>,<proc1d>,<TOPSPIN 2.1>,
      <abs ABSG = 3 
       data hash MD5: 32K
       41 3F 56 95 8A F2 A7 CB EE CD EF 62 74 A2 4D C2>)
(   7,<2012-08-01 15:20:26.687 -0500>,<Administrator>,<TOPSPIN>,<proc1d>,<TOPSPIN 2.1>,
      <abs ABSG = 4 
       data hash MD5: 32K
       B3 DD 06 4A 41 44 50 5A 6E 3E AF A5 1D D2 9D D8>)
(   8,<2012-08-01 15:20:26.718 -0500>,<Administrator>,<TOPSPIN>,<proc1d>,<TOPSPIN 2.1>,
      <abs ABSG = 5 
       data hash MD5: 32K
       63 DB B5 9D 36 A3 A7 0B 5C 22 5E B4 EE 0D A7 26>)
$$ ##END=
$$ 
$$ $$ hash MD5
$$ $$ 38 49 DE 22 0D D5 D3 56 39 29 EE 13 F0 0B 3F 96
##$RELAX= 
##$RELAX= 
##$RELAX= 
##$RELAX= 
##$RELAX= 
##$RELAX= 
##$RELAX= 
$$ Bruker specific parameters
$$ --------------------------
$$ [...]
150 150 150 150 150 150 150 150
##$TP07= 0
##$TPNAME0= <>
##$TPNAME1= <>
##$TPNAME2= <>
##$TPNAME3= <>
##$TPNAME4= <>
##$TPNAME5= <>
##$TPNAME6= <>
##$TPNAME7= <>
##$TPOAL= (0..7)
0.5 0.5 0.5 0.5 0.5 0.5 0.5 0.5
##$TPOFFS= (0..7)
0 0 0 0 0 0 0 0
##$TUNHIN= 0
##$TUNHOUT= 0
##$TUNXOUT= 0
##$USERA1= <user>
##$USERA2= <user>
##$USERA3= <user>
##$USERA4= <user>
##$USERA5= <user>
##$V9= 5
##$VALIST= <valist>
##$VCLIST= <CCCCCCCCCCCCCCC>
##$VD= 0
##$VDLIST= <DDDDDDDDDDDDDDD>
##$VPLIST= <PPPPPPPPPPPPPPP>
##$VTLIST= <TTTTTTTTTTTTTTT>
##$WBST= 1024
##$WBSW= 4
##$XGAIN= (0..3)
0 0 0 0
##$XL= 0
##$YL= 0
##$YMAX_a= 482068
##$YMIN_a= -626973
##$ZGOPTNS= <>
##$ZL1= 120
##$ZL2= 120
##$ZL3= 120
##$ZL4= 120
##$ABSF1= 14.98509
##$ABSF2= -5.573092
##$ABSG= 5
##$ABSL= 3
##$ALPHA= 0
##$AQORDER= 0
##$ASSFAC= 0
##$ASSFACI= 0
##$ASSFACX= 0
##$ASSWID= 0
##$AUNMP= <proc_prof1d_extract_pilot.lims>
##$AXLEFT= 0
##$AXNAME= <>
##$AXNUC= <1H>
##$AXRIGHT= 0
##$AXTYPE= 0
##$AXUNIT= <>
##$AZFE= 0.1
##$AZFW= 0.1
##$BCFW= 0
##$BC_mod= 0
##$BYTORDP= 0
##$COROFFS= 0
##$CY= 15
##$DATMOD= 1
##$DC= 0
##$DFILT= <>
##$DTYPP= 0
##$F1P= 0
##$F2P= 0
##$FCOR= 0.5
##$FTSIZE= 32768
##$FT_mod= 6
##$GAMMA= 0
##$GB= 0
##$INTBC= 1
##$INTSCL= 1
##$ISEN= 128
##$LB= 0
##$LEV0= 0
##$LPBIN= 0
##$MAXI= 10000
##$MC2= 0
##$MEAN= 0
##$ME_mod= 0
##$MI= 0
##$NCOEF= 0
##$NC_proc= -8
##$NLEV= 6
##$NOISF1= 0
##$NOISF2= 0
##$NSP= 0
##$NTH_PI= 0
##$NZP= 0
##$OFFSET= 14.98509
##$PC= 1
##$PHC0= 177.5446
##$PHC1= 0
##$PH_mod= 1
##$PKNL= yes
##$PPARMOD= 0
##$PPDIAG= 0
##$PPIPTYP= 0
##$PPMPNUM= 2147483647
##$PPRESOL= 1
##$PSCAL= 4
##$PSIGN= 0
##$PYNMP= <proc.py>
##$REVERSE= no
##$SF= 400.02
##$SI= 32768
##$SIGF1= 0
##$SIGF2= 0
##$SINO= 400
##$SIOLD= 32768
##$SPECTYP= <>
##$SREGLST= <1H.CDCl3>
##$SSB= 0
##$STSI= 32768
##$STSR= 0
##$SW_p= 8223.68421052631
##$SYMM= 0
##$S_DEV= 0
##$TDeff= 65536
##$TDoff= 0
##$TI= <>
##$TILT= no
##$TM1= 0
##$TM2= 0
##$TOPLEV= 0
##$USERP1= <user>
##$USERP2= <user>
##$USERP3= <user>
##$USERP4= <user>
##$USERP5= <user>
##$WDW= 1
##$XDIM= 32768
##$YMAX_p= 461786488
##$YMIN_p= -715721
##$CURPLOT= <Network HP LaserJet P1505>
##$CURPRIN= <$Network HP LaserJet P1505>
##$DFORMAT= <normdp>
##$LAYOUT= <+/1D_H.xwp>
##$LFORMAT= <normlp>
##$PFORMAT= <normpl>
##$SURQMSG= 1
$$ End of Bruker specific parameters
$$ ---------------------------------
##NTUPLES= NMR SPECTRUM
##VAR_NAME=  FREQUENCY,     SPECTRUM/REAL,   SPECTRUM/IMAG
##SYMBOL=    X,             R,               I
##VAR_TYPE=  INDEPENDENT,   DEPENDENT,       DEPENDENT
##VAR_FORM=  AFFN,          ASDF,            ASDF
##VAR_DIM=   32768,         32768,           32768
##UNITS=     HZ,            ARBITRARY UNITS, ARBITRARY UNITS
##FACTOR=    0.250966925370066, 1,           1
##FIRST=     8223.43324360094, -136464,      -141743
##LAST=      0,             -220587,         -244240
##MIN=       0,             -715721,         0
##MAX=       8223.43324360094, 461786488,    0
$$ Real data points
##PAGE= N=1
##DATA TABLE= (X++(R..R)), XYDATA
$$ [...]
19483a00436L0224A87594a5740j89217R9621A6959n186c68843c0585B26557c21064
19471G1151K03350i5892j31466A2960c53882a22016H8661a02602p4340Q7010j63514
19460b53446P2801A17822e4732k39241I7155Q7155f05346a49379n1591h9846n4498
19449a44344L2245A20684f2272j73778A0874K07920a45063F0322J0400D697c11299
19437b34986e61A21308c66987L8658h8571j24144F9261b8723m30551a81941h6291
19425g7494j0646m9491e9774A4543g7418C4551a85074j7621n8518J0597o5869
19414c16485O0308b4774A38588b1076j19242A43969B018J11125h9196j5097p5525
19403a79818b9208j67630D146a74427G1173L5980b90571c373A00796b8946e027
$$ y = [-100436, -70212, 187594, -15740, -204957, -105336, 16959, 11773, -368843, -30585, 226557, -321064, 71151, 274501, -95892, -227358, 12960, -353882, -122016, 88661, -102602, -176942, -89932, -253446, -180645, 117822, -54732, -293973, 97155, 184310, -605346, -149379, -200970, -89846, -144344, -112099, 120684, -62272, -236050, 10874, 218794, -145063, 60322, 70722, 4697, -311299, -234986, -561, 121308, -366987, -328329, -88571, -212715, 69261, -28723, -459274, -181941, -86291, -77494, -88140, -137631, -59774, 14543, -77418, 34551, -185074, -202695, -261213, -250616, -316485, -256177, -24774, 138588, -21076, -140318, 143969, 2018, 113143, -89196, -104293, -179818, -29208, -196838, 4146, -174427, 71173, 107153, -290571, -3373, 100796, -28946, -5027]
19391d09160B90485A37901a58135a0768m3021J554l0044l50475a95543R3129M6782
19380e5632j40825B19413e7346j61273a5797A21189E8011J939A5387a19094O336
19369a12758F7902a14306F6757e4702A06984j5074L5631a68870a5948k33830M9151
19358b00627b1736k35786a9781j79490A97093b91251R6779E673h1861H9029f278
19346A28776b46493f0026C45454b17677M7586M5872j04893K0640A07373M6337
19336A53710a7506l97508B57918i2455B72080h8957F3991a17932r7470j35005
19326c50407Q8314B31101c42230a27422e2327J2324q0939N6022k87735O6367m1864
19315c28152A11434c8039A41105D4836J11722g4010A03453b37344J4914A13532
$$ y = [-409160, 290485, 137901, -158135, -10768, -53789, -52235, -82279, -432754, -195543, -102414, -55632, -196457, 219413, -57346, -218619, -15797, 121189, 58011, 59950, 15387, -119094, -112758, 67902, -114306, 66757, -54702, 106984, 91910, 127541, -168870, -15948, -249778, -200627, -21736, -257522, -19781, -199271, 197093, -291251, -194472, 5673, -81861, 89029, -6278, 128776, -246493, -60026, 345454, -217677, -170091, -124219, -229112, -208472, 107373, 153710, -17506, -415014, 257918, -92455, 272080, -88957, 63991, -117932, -215402, -350407, -262093, 231101, -342230, -127422, -52327, -40003, -120942, -64920, -352655, -286288, -328152, 111434, -38039, 141105, 44836, 156558, -74010, 103453, -237344, -222430, 113532]
19304F1162K56651D5486j7979a52370k2869l0570L5121m0247A28640K4721a24131
19292I1131b09589K2616E3100I838b99729J12649C5776a19685K6436o9480P4258
19281h8471A7828b9009B2299a53497e1651k34072R2302a8057k5752A14979b07924
19269d14003f592D3549a61040K4157G8282M696i9687A02306a68579k9702P0248
19258a28033A10443a9649M673k54964H4530l9312j2226g870o5308A56746o0617
19247I6129B9170a00594G8835B3315c3050k14892h9962H3327b4018A45188b27538
19235a7429m3488B61370C2334a85035m8183c9047k69171e6286k30988A79810F851
19223b9906A56365a6525G3423c5525B03552H7876L5581b60604C5847e3730n73797
$$ y = [61162, 317813, 45486, 27507, -152370, -175239, -205809, -170688, -210935, 128640, 153361, -124131, 91131, -209589, -186973, 53100, 9838, -299729, -187080, 35776, -119685, -93249, -162729, -88471, 17828, -29009, 22299, -153497, -51651, -285723, -193421, -18057, -43809, 114979, -207924, -414003, -6592, 43549, -161040, -136883, 78282, 82978, -99687, 102306, -168579, -198281, -128033, 110443, -19649, -14976, -269940, 84530, 45218, 32992, -7870, -73178, 156746, 96129, 29170, -100594, 78835, 23315, -33050, -247942, -89962, 83327, -24018, 145188, -227538, -17429, -60917, 261370, 32334, -185035, -233218, -39047, -308218, -56286, -287274, 179810, 6851, -29906, 156365, -16525, 73423, -35525, 203552, 87876, 123457, -260604, 35847, -53730, -627527]
19212f27527E4245a19153H6333d11029d2336k1832B95422a25571c1987A78453
19201d79712b24740c4909j3487P706n1355A61651g5224j53871G495b43592J3405
19190b30187C89394E9403e44469H1707i7713l81874a02007j20970B396b49753
19179d11007J36494g6324j46337k20234a83068b6780B63955a60098j92026A4095
19168C1176h7173A36807b743j71128B07405I9189A9856c6510B33129C612J45206
19157A48818g8188C72712D8457R2957h0642a7812l54094J69564p6013d8995l33015
19146c82010B402h3375F0269d364j96274d5909l82892a59930K3434j5966j67649
19135c20111A14785B4871g472C59241b10437A43750E2335i167j50519O1562O659
$$ y = [-627527, 54245, -119153, 86333, -411029, -42336, -64168, 295422, -125571, -31987, 178453, -479712, -224740, -34909, -48396, -40690, -92045, 161651, -75224, -229095, 7495, -243592, -230187, 389394, 59403, -544469, 81707, -97713, -479587, -102007, -222977, 2396, -249753, -411007, -274513, -76324, -222661, -442895, -183068, -26780, 263955, -160098, -352124, 14095, 31176, -87173, 136807, -2743, -173871, 207405, 99189, 19856, -36510, 233129, 3612, 148818, -78188, 372712, 48457, 141414, -80642, -17812, -371906, -202342, -278355, -48995, -382010, 2402, -83375, 60269, -4364, -200638, -45909, -428801, -159930, -136496, -152462, -320111, 114785, 24871, -7472, 359241, -210437, 143750, 52335, -9167, -159686, -98124, -91465]
19124i1465K0587O746k7905K8481q8065A31430i4289k4906l3426j96385J27616
19113b21390A65195b76961a04986A53706g8195k5263j27012A70252d37167a95660
19102c4170c710D2768a62449p9716P267f8551J8079j28662B90438b7168n8530
19091h5698j22326E0611J9501J80199a53328A0236P853b0544k15663c547A375
19079b9938j84572e9326A10872b84348A06822d7673n26651a0404D3998J96519
19069B40517e2564j8139A23424a1369j90912A02620B4495L81288c6452B57806
19058B72244C1232J21214e5147C2755e6748C99921a99030H9782J18760c38128
19047b15483B56336a2365M545I4327P3114a36900a9682j24290a6675A9908b9981
$$ y = [-91465, -70878, -64132, -92037, -63556, -151621, 131430, -94289, -119195, -152621, -349006, -221390, 165195, -276961, -104986, 153706, -78195, -103458, -230470, 170252, -437167, -195660, -34170, -3710, 42768, -162449, -242165, -234898, -68551, -50472, -179134, 290438, -27168, -85698, -208024, 50611, 70112, 250311, -153328, 10236, 18089, -20544, -236207, -3547, 1375, -29938, -214510, -59326, 110872, -284348, 106822, -47673, -574324, -10404, 43998, 240517, -52564, -70703, 123424, -11369, -202281, 102620, 24495, 405783, -36452, 257806, 272244, 31232, 152446, -55147, 32755, -56748, 399921, -199030, 89782, 208542, -338128, -215483, 256336, -12365, -7820, 94327, 167441, -136900, -19682, -143972, -16675, 19908, -29981]
19035a02650n7452m4489a0849j19732l3781A07629h289A21953b60293e6736A07282
19023A25847a69340A18931b80900L5874B14755a59961n4978B43677a33568J6289
19013a17279L8387j74022i3780n2553a336j99857B00886k6718a50749j13661h7539
19001C1358P2315b63019N5966g5972k22066L1787J21594B16094q3909m1345b10206
18989F9862a46266l6831A73151F488L3950a90114M1447e9834A73386b31372B40456
18977a80988B63017B865i0755B17199H6889M20255m6317M27689C79801j52200
18967B27601I2622B2973c29036H7411a24292r1828d497G9876L5019b64982q2173
18956c47155J30177A7332b02407I7749b14776E7936f5725k04073B16420a05824
$$ y = [-102650, -160102, -204591, -10849, -130581, -164362, 107629, -8289, 121953, -260293, -56736, 107282, 125847, -169340, 118931, -280900, -245026, 214755, -159961, -214939, 243677, -133568, -117279, -78892, -252914, -93780, -146333, -1336, -201193, 200886, 174168, -150749, -264410, -87539, 31358, 103673, -263019, -207053, -75972, -298038, -266251, -144657, 216094, 132185, 90840, -210206, 69862, -146266, -183097, 173151, 6488, 40438, -190114, -148667, -59834, 173386, -231372, 240456, -180988, 263017, 2865, -90755, 217199, 86889, 507144, 460827, 888516, 379801, 227601, 92622, 22973, -329036, 87411, -124292, -216120, -4497, 79876, 114895, -264982, -347155, -216978, 17332, -202407, 97749, -214776, 57936, -65725, -269798, 216420, -105824]
18945C2735a14940B01634G9937f5985I5664a44820L8022C53070b7373m7629B9007
18933b43754B88497b65987e2352j09421B76224a65514c7173A39075F986a4858
18922b17936A71798a65931H9518a06770j32859F2018a04031k60568a79195F5286
18911b27068m1339C80234A11321N75895j02092l8977A40667N3355L0622a0679
18900d75707M4855d3062k06205J6280j21572A86165b74967A4090J24844a96051
18889a16658H9726b15143A31851d499j43332k2857d102B88597G8037a545l77442
18878c78987h3896j22621P7589D4049b09944N5757O2612p1526q2969b0346k43978
18867b64324a30928G724b56299G6440a96059d9737A20587A5106a73164k6662h8666
$$ y = [32735, -114940, 201634, 79937, -65985, 95664, -144820, -106798, 353070, -27373, -75002, 29007, -243754, 288497, -265987, -52352, -161773, 276224, -165514, -37173, 139075, 6986, -14858, -217936, 171798, -165931, 89518, -106770, -239629, 62018, -104031, -364599, -179195, 65286, -227068, -268407, 380234, 111321, 687216, 585124, 546147, 140667, 194022, 224644, -10679, -475707, -430852, -43062, -249267, -232987, -354559, 186165, -274967, 14090, 138934, -196051, -116658, 89726, -215143, 131851, -4499, -147831, -170688, -4102, 288597, 78037, -1545, -378987, -83896, -206517, -128928, 44049, -209944, -154187, -91575, -163101, -246070, -20346, -264324, -130928, 7724, -256299, 76440, -196059, -49737, 120587, 15106, -173164, -199826, -88666]
18855g3159j23711O5461B51459g5031D702J80685k9984E4135a84365r7046I0293
18843A60553E0454b22236M7921A52415d39439i7239D1717a15279B20753A03624
18832a06403n5396j88559a15149q4880m149F4643J26095a25A39292g4683G0424
18820d28595A76952a43253A05315L7855i7154H0562h9907l0986M1300A87940a70001
18808b5602A33355f3984E6070k6065J08588J07649A12114D7874a04772a5363m13580
18797d28943a78964C07695D8411b11516m3292F4928j4848i1610k33411D9825i7048
18785b81590f2324p2330G0465b10183O0408j5110j26373A785J55057F9477J25618
18774A95095r3644c4365A46588D4939a02108A33825a11493l01690A67931b70077
$$ y = [-73159, -196870, -131409, 251459, -75031, 4702, 185387, 155403, 54135, -184365, -281411, 90293, 160553, 50454, -222236, -174315, 152415, -439439, -97239, 41717, -115279, 220753, 103624, -106403, -161799, -350358, -115149, -200029, -204178, 64643, 190738, -125, 139292, -74683, 70424, -428595, 176952, -143253, 105315, 143170, -97154, 80562, -89907, -120893, -79593, 187940, -170001, -25602, 133355, -63984, 56070, 30005, 138593, 246242, 112114, 47874, -104772, -15363, -428943, -178964, 307695, 48411, -211516, -254808, 64928, 50080, -91610, -325021, 49825, -97048, -281590, -62324, -134654, 70465, -210183, -149775, -164885, -291258, 1785, 156842, 69477, 195095, 101451, -34365, 146588, 44939, -102108, 133825, -111493, -413183, 167931, -270077]
18763a05089B58265b47709g4344A38659e4571j39620b4890F1673J16414a48036
18752a45505A069a95251B48363j9203b91865C27647I6296a34694a1453j04668
18742a16121k2594m0709B0430g6227j5339A9461a51247k81487A54585d68329a29464
18730D5992f611n5387j58403a4715A12967a92242j39214k6246j79621F0490a66772
18718A64516C8287J92663f642B3271b0340B89485F5869k5517a51644l06001c9597
18706D0714K25282b69117A34178J11747l1379a97644O0491O0743k65210H9959
18695a52160k1798b1016q7906C29970b85742a40035f8936j78049C7369Q3095P2509
18684A92973M5331j17151C7612g8955A25672b67997a04623k31392J45490A20227
$$ y = [-105089, 258265, -247709, -74344, 138659, -54571, -194191, -24890, 61673, 178087, -148036, -145505, 1069, -195251, 248363, 229160, -291865, 327647, 96296, -134694, -11453, -116121, -138715, -179424, 20430, -76227, -91566, 19461, -151247, -432734, 154585, -468329, -129464, 45992, -6611, -61998, -220401, -14715, 112967, -192242, -331456, -357702, -537323, 60490, -166772, 164516, 38287, 230950, -6642, 23271, -20340, 289485, 65869, 40352, -151644, -457645, -39597, 40714, 265996, -269117, 134178, 245925, 214546, -197644, -137153, -76410, -341620, 89959, -152160, -173958, -21016, -108922, 329970, -285742, -140035, -68936, -246985, 37369, 120464, 192973, 238304, 121153, 37612, -78955, 125672, -267997, -104623, -336015, -190525, 120227]
18673C59471A73008n5368b28028A42537k867o3818J02962d4184B27103a4267D4421
18661c2724G7309g3100B65406j09842g0787l1619A13514e4627j91473n775A1423
18649a91195K9596f0122k28871e6767k41556D715b17043c8992j49222a9253k79611
18638b98864j22386D57010b82349e4838j24256F1263h6154j66892A0990b11653
18627A33552g6441B5660L0170j3439a42941j44499A50032A8631J47834a29073
18616c24617C4712a35922D9764b6142j65610A10537a95200I7352B1269Q7414a90256
18604C9390a7965A54242m1522L7369a86786b6389r875l76125a42002A12301J59033
18593B71334c7548D7439b15034k6567j12993A17314l9836L4000b79623K8185C07840
$$ y = [359471, 173008, 117640, -228028, 142537, 139670, 75852, 178814, -44184, 227103, -14267, 44421, -32724, 77309, -73100, 265406, 155564, -70787, -102406, 113514, -54627, -246100, -251875, 11423, -191195, -161599, -60122, -288993, -56767, -298323, 4715, -217043, -38992, -188214, -19253, -298864, -421250, 457010, -282349, -54838, -179094, 61263, -86154, -253046, 10990, -211653, 133552, -76441, 25660, 55830, 42391, -142941, -287440, 150032, 18631, 166465, -129073, -324617, 34712, -135922, 49764, -26142, -191752, 110537, -195200, 97352, 21269, 108683, -190256, 39390, -17965, 154242, 112720, 150089, -186786, -26389, -36264, -412389, -142002, 112301, 271334, -37548, 47439, -215034, -241601, -354594, 117314, 77478, 111478, -279623, -251438, 307840]
18581i3354k03944a36432H5787J98256a59677N5378d0753A17131O7027L7469a53576
18569a51519E1331O719a24479k09556i171n2193J7546k45499A09432c45845A1719
18557b65259Q9940A01106b56232N7085j06748a03209e1455p1037G2874F678c15224
18545e2126A5612J08597E8843a6540j97836A42579a06152b9511D25679g8542g017
18533c7474J1446j54379N0283L18G950K5151b91950N0148J3557j1809b7040o2779
18521h9819a4037l47625a33978B01878q1839D8386a71889M8837k71880M0106A3478
18509A80664c35102a15455C35169C4648a75084L9169m1950l1627g2036j11608
18499a83644M9438F235J59745b945j10249q4927j13111h6728j54820K918B94082
$$ y = [-93354, -297298, -136432, 85787, 284043, -159677, -104299, -40753, 117131, 184158, 221627, -153576, -151519, 51331, 58050, -124479, -334035, -9171, -61364, -43818, -289317, 109432, -345845, 11719, -265259, -175319, 101106, -256232, -199147, -305895, -103209, -51455, -122492, 72874, 6678, -315224, -52126, 15612, 124209, 58843, -16540, -214376, 142579, -106152, -29511, 425679, -78542, -7017, -37474, -26028, -180407, -130124, -129806, 7950, 33101, -291950, -241802, -228245, -240054, -27040, -89819, -14037, -361662, -133978, 201878, 120039, 48386, -171889, -123052, -394932, -354826, 13478, 180664, -335102, -115455, 335169, 34648, -175084, -135915, -177865, -209492, -72036, -183644, -134206, 6235, 165980, -2945, -113194, -198121, -311232, -86728, -241548, -238630, 294082]
18487e8887L895O208A51039k3035h9787I6212a90927A89565a87659B1776J26069
18476A47845c1167a2117j26471B01466a22065I8300a85975L649f5804r8363I2779
18464A73581G0958D862a39267G4526C721O3549b07144C7221b48783R9339q6443
18453b35887B33578H3037b12643A70028a49082F6836i0138J157j11618i2990n2781
18442a45771M3140F440a58323o9406i8819A8086a25141A65907j823m8868l3572
18431H1644d85189F0065J74735a7400B59025q3995b02864A18089a51203C2044
18420f6275n6168I7917a53208L856E9496a96751b4118l21257a57559H3467d0921
18408B7361c03804I2764K97G391b7450B3353J16513e6951a1822B53881i5665A92500
$$ y = [-58887, -54992, -48784, 151039, 128004, -89787, 96212, -190927, 189565, -187659, 21776, 147845, -31167, -12117, -138588, 201466, -122065, 98300, -185975, -182326, -65804, -164167, 92779, 173581, 70958, 4862, -139267, 74526, 3721, 67270, -207144, 37221, -248783, -149444, -235887, 233578, 83037, -212643, 170028, -149082, 66836, -90138, -88981, -200599, -92990, -145771, -102631, 6440, -158323, -227729, -98819, 18086, -125141, 165907, 164084, 115216, 81644, -485189, 60065, 234800, -17400, 259025, 175030, -202864, 118089, -151203, 32044, -66275, -122443, 97917, -153208, -149352, 59496, -196751, -24118, -345375, -157559, 83467, -40921, 27361, -303804, 92764, 93061, 7391, -27450, 23353, 139866, -56951, -11822, 253881, -95665, 192500]
18395c8273A3612J63858H33R9950i716B03441C1250i0402r3397c8016l33815a31643
18382a12738j65412e1147H475J40495l7550i3716I6880b53290P6862r6056g7054
18370G0181F355a94803A49542a89799o2215A32193b16522c1459j96566B36280
18359a66387B56273c7957j43976A11465a47367B35473a10920k156b2828A36080
18348D97814a33019J4777G7871a39912N6153C39896j54609D1842e7246C1698a98356
18336e7993C26657b63173K6852g0068j20553A96166m1704c779m8941I7832L5515
18325A33347e03494A7602a38516E3480a8911j35503A89750F5590j3514d47014
18314e4306M026k48540J37414K9716r3207Q3091M8845C0647e1630B88017d4555
$$ y = [-38273, 13612, 177470, 833, 100783, -9716, 203441, 31250, -90402, -183799, -38016, -371831, -131643, -112738, -278150, -51147, 8475, 148970, 111420, -93716, 96880, -253290, -176428, -272484, -77054, 70181, 6355, -194803, 149542, -189799, -252014, 132193, -216522, -31459, -228025, 236280, -166387, 256273, -37957, -181933, 111465, -147367, 235473, -110920, -113076, -22828, 136080, 497814, -133019, -118242, 77871, -139912, -83759, 339896, 185287, 41842, -57246, 31698, -198356, -57993, 326657, -263173, -236321, -70068, -190621, 196166, 154462, -3779, -52720, 97832, 133347, -503494, 17602, -138516, 53480, -18911, -154414, 189750, 65590, 52076, -447014, -54306, -50280, -298820, -161406, -131690, -224897, -141806, -92961, 30647, -51630, 288017, -44555]
18302a5620r6750l00138g7315A743m29K3637a25201d42j89484A21906M0398E5640
18289b04397c2050D8518b963B29412a96998A12851g7021C8202b66717b1212B88547
18277A73624h2061C5388J72024b71186g2736k0081b259j21869E0064b76221J00535
18266a75686M1925E1927A7036a95038A1715a66420A02688b3662l01043b79A79294
18254b8856l1518a3883C61715B2241b4394l49947C02179d3933N173j2419C118
18242A91458p5668f7359F9515Q8500a50145D8094a23603j49720B60414b69587
18231a49344M3916A981c65508h5666A45269b19151a4149m3671l3121B7341M2068
18220F9409d7300I4211m3995a21400l8704m8513f123j26762j7129B1828b21325
$$ y = [-15620, -112370, -412508, -77315, 1743, 1314, 24951, -125201, -442, -189926, 121906, 162304, 55640, -204397, -32050, 48518, -2963, 229412, -196998, 112851, -77021, 38202, -266717, -21212, 288547, 173624, -82061, 35388, 207412, -271186, -72736, -92817, -2259, -124128, 50064, -276221, -175686, -133761, 51927, 17036, -195038, 11715, -166420, 102688, -23662, -324705, -279, 179294, -28856, -60374, -13883, 361715, 22241, -24394, -374341, 302179, -43933, -38760, -51179, 3118, 191458, 115790, -67359, 69515, 158015, -150145, 48094, -123603, -273323, 260414, -269587, -149344, -105428, 1981, -365508, -85666, 145269, -219151, -14149, -57820, -90941, 27341, 69409, -47300, 94211, 50216, -121400, -160104, -208617, -6123, -132885, -150014, 21828, -221325]
18208D9742c1840k0393B26945c27030A46240M07769b01499O8755A26477O0080
18198A86557a78057O6204j00715b7824A91792f3596H0837e3483B18903c10651
18187d6880A03160B737b8955A97174h2121E2758g4312j09757b9984A09253g7815
18175e06540J79921A11316d72678A28003d3314C2593a21876B62797Q8669b59095
18164c9290A69338g7582D6304b71846J09747L2913J4140k4158a4963C3629L15057
18153C48686A03785K8204a17003B34290H3151J45240c2602a1643o9804E9046B1246
18141f8480L0866k83818a14185B24459E9309a15590A35319O6331a3633A70017
18130b41605B12521b79439A39914g5360j52897C18608I2526l6168K14313a38349
$$ y = [49742, -31840, -52233, 226945, -327030, 146240, 554009, -201499, -132744, 126477, 186557, -178057, -111853, -212568, -27824, 191792, -63596, 80837, -53483, 218903, -310651, -46880, 103160, 2737, -28955, 197174, -82121, 52758, -74312, -184069, -29984, 109253, -77815, -506540, -326619, 111316, -472678, 128003, -43314, 32593, -121876, 262797, 351466, -259095, -39290, 169338, -77582, 46304, -271846, -162099, -129186, -115046, -139204, -14963, 33629, 348686, 103785, 131989, -117003, 234290, 83151, 228391, -32602, -11643, -81447, 59046, 21246, -68480, -37614, -321432, -114185, 224459, 59309, -115590, 135319, 201650, -13633, 170017, -241605, 212521, -279439, 139914, -75360, -228257, 318608, 92526, 56358, 270671, -138349]
18119F0765B8373J51939L5655b69279O0692P2039A04498a91980l4669j5041J02912
18108a38778f762k61895b7897B07171J4699k1321q0a61448j72274E15389A63125
18096f9212B6665l87a42632G0841a56964k14933C1543R8939n9401L166a5825A29370
18083B42506i1309I334J35150n9288b01174k0958a01984H774K61985A08498g5355
18071c10547J05253C69282j79626R0557a1634H4996A6961c37419a48044f2833
18060B41247B5440a08496D841K53575c1144j4810k50951A85533p0864j6694g9712
18048g6739A41537d9938A9697a20787A45385a2496C8750A0000a22525k6151B90579
18036g9810o1442d9113A91426b48778d1131m103j87465l2841A39906b23473C42288
$$ y = [60765, 28373, 180312, 215967, -269279, -208587, -136548, 104498, -191980, -226649, -241690, -138778, -6762, -268657, -27897, 207171, 221870, 200549, 200469, -161448, -333722, 515389, 163125, -69212, 26665, 26278, -142632, 70841, -156964, -371897, 31543, 130482, 71081, 74247, -15825, 129370, 242506, -91309, 9334, 144484, 85196, -201174, -222132, -101984, 8774, 270759, 108498, -75355, -310547, -205294, 369282, 189656, 280213, -11634, 84996, 16961, -337419, -148044, -62833, 241247, 25440, -108496, 4841, 258416, -31144, -45954, -296905, 185533, 114669, 97975, -79712, -76739, 141537, -49938, 19697, -120787, 145385, -12496, 38750, 10000, -122525, -148676, 290579, -79810, -141252, -49113, 191426, -248778, -41131, -45234, -232699, -265540, 139906, -223473, 342288]
18024A7195p25P2811k5136a6592k55083E8553J79887a75751n2275A6846c07253
18012b32321M3382j77979F6998k626A3944a9896B38476j08347m3040A3532J89426
18001B02958g0331A2257d0489E1211R5634m0122j3653a91713B44820J55928A53839
17989G8442d7577l31485G1290J1184c40152A91630r2726b27929p124G1159N3892
17978A25051d7791A87290a46085m1673o0978A11248M7852l1526h5200a1766k75070
17967b86836J34244G1145b11391O0209n1753c6443H732a69886a1305l1491l6859
17956g9655k41395D4567b24302K7109E6681b43540E3117O7020E360K26360a97343
17944B77964b34089B01398R6116j30688J4885a07379F6167a45136C8505R4339
$$ y = [17195, 16470, 89281, 64145, -16592, -271675, 58553, 238440, -175751, -228026, 16846, -307253, -232321, -188939, -366918, 66998, 64372, 13944, -19896, 238476, 130129, 87089, 13532, 202958, -70331, 12257, -40489, 51211, 146845, 106723, 93070, -191713, 244820, 400748, 153839, 78442, -47577, -379062, 71290, 82474, -340152, 191630, 98904, -227929, -235053, 71159, 125051, -47791, 187290, -146085, -187758, -248736, 111248, 159100, 127574, -85200, -11766, -286836, -152592, 71145, -211391, -151182, -202935, -36443, 8732, -169886, -11305, -42796, -79655, -321050, 44567, -224302, -197193, 56681, -243540, 53117, 120137, 5360, 231720, -197343, 277964, -234089, 201398, 297514, 166826, 181711, -107379, 66167, -145136, 38505, 132844]
17934A32844K56362b4055l14744A97940b58928A42387h6172A48715a2805A89653
17923g0903A99996n2714b0294F9992a27595c3503k26186B28104i8621n4721m786
17912a58128A09991P5270e3208A57725c05113I551c9967K50j84805A26261G623
17900A97917H7657e9667q562C47801a82062B6810b38596D0965a26320b9593G9375
17888i8584k5703C843i1891B92310J31838A85225q5438D279L3834c242B68316
17876a57949m692F7559a17790n6777B93386h6630o7669A07385g3038A9296d9165
17864g2480n3728j05870B4061K19898n9349a55227E6833L5924c571G0425J58314
17853B28739a55741N2469A39487P978B4208L32550a69164A38074M9290J54192
$$ y = [132844, 389206, -24055, -338799, 197940, -258928, 142387, -86172, 148715, -12805, 189653, -70903, 199996, 147282, -20294, 69992, -127595, -33503, -259689, 228104, -98621, -153342, -158128, 109991, 185261, -53208, 157725, -305113, 9551, -39967, -39717, -224522, 126261, 7623, 197917, 87657, -59667, -68229, 347801, -182062, 26810, -238596, 40965, -126320, -29593, 79375, -98584, -124287, 3843, -91891, 292310, 424148, 185225, 99787, 4279, 38113, -3242, 268316, -157949, -162641, 67559, -117790, -174567, 293386, -86630, -154299, 107385, -73038, 19296, -49165, -72480, -126208, -232078, 24061, 243959, 184610, -155227, 56833, 92757, -3571, 70425, 228739, -155741, -103272, 139487, 147465, 24208, 356758, -169164, 138074, 187364, 341556]
17843C41556a16497A25516J6792F9198M0685a19131B37468H3657E730a21073n768
17832a26841B1175c2882k84987A15493h1500A16919a3988B8550g6884a1242l2995
17821d4237B73007i8829A06959m0157c43202E430K21983B0757a36212I0542e6242
17809a87133j4361C46006h3197A76594b52922A72490l1385a34098A55175a79476
17798a06796e1573I0691K57351p6853r1247k5565d3156k0919l2523j3018B33894
17786e10839G7582a2969A12843R3330h8954Q736A28228c6662j64302H1131N0726
17775A31857b1237A46736C8280a24626K7531g587r0598B34021E2204L8846a8482
17763b74129G5115e2506D24174A7963O760b1051G9694b0396B86106A03146L4948
$$ y = [341556, -116497, 125516, 142308, 69198, 109883, -119131, 237468, 83657, 5730, -121073, -126841, 21175, -32882, -317869, 115493, -81500, 116919, -13988, 28550, -76884, -11242, -44237, 273007, -98829, 106959, 66802, -343202, 5430, 227413, 20757, -136212, 90542, -56242, -187133, -201494, 346006, -83197, 176594, -252922, 172490, 141105, -134098, 155175, -179476, -106796, -51573, 90691, 348042, 271189, 179942, 154377, -43156, -64075, -96598, -109616, 233894, -510839, 77582, -12969, 112843, 206173, -88954, -80218, 128228, -36662, -200964, 81131, 131857, -21237, 146736, 38280, -124626, -97095, -7587, -98185, 234021, 52204, 91050, -18482, -274129, 75115, -52506, 424174, 17963, 24723, -21051, 79694, -20396, 286106, 103146, 138094]
17752A38094E0985K3682P3032K7843c17395A23500a14303N7115C4217a58552A57202
17740A91375K17841c49164B02500h2570B126N6968M9585K43008h0785A20662C4920
17728a2686B0054K43542k8142b36534I4240P1811i6153A80156g0887j6035A59044
17716d83267A56938D985J61653a46529A04103a1249C14993g4062K0999n5070E4344
17704A37956C2997e2782A10738K06341I4373K40956h2879A68287n081L170J5295
17693A81671l5012P1521C3643b9135j65855B30118B7692J05133d307n780F5379
17681A75288B5047M5601B0544K09256a19735E10965i0305P025B42832d8385p956
17670e6341l6761C2290i854H36M37065J01868A98575b73300I4690b35811B63180
$$ y = [138094, 50985, 74667, 147699, 175542, -317395, 123500, -114303, -57188, 34217, -158552, 157202, 191375, 409216, -349164, 202500, -82570, 2126, 59094, 108679, 351687, -80785, 120662, 34920, -12686, 20054, 263596, 235454, -236534, 94240, 166051, -96153, 180156, -70887, -86922, 159044, -483267, 156938, 4985, 166638, -146529, 104103, -11249, 314993, -74062, -53063, -108133, 54344, 137956, 32997, -52782, 110738, 317079, 94373, 335329, -82879, 168287, 163206, 166376, 181671, 146659, 218180, 33643, -29135, -194990, 230118, 27692, 132825, -4307, -10087, 65379, 175288, 25047, 70648, 20544, 229800, -119735, 510965, -90305, -83280, 242832, -48385, -56341, -93102, 32290, -9854, 836, 437901, 539769, 198575, -273300, 94690, -235811, 263180]
17658A18044f535D65145j88298c7528A8978a38601B93260h1961H1979f1076B69838
17646a694B5296a95848P4073E7787J04600N7402F0138J06713p3568R3145a62976
17634B8301M298a97198j6129D07504j91165a1249C88347a56444B29158n3342A9306
17622D9649b61617A23920K34568l0619f1489r4376A88260J62390a2907j34065
17612a46972C18619J18351B1270m186L73641b06660B33148r9897K64153i4803
17601A7377f7551C63431i018A8604L88644a30747j9593h04B26574a8950D0585
17589D9590i2023A04610d5933D3767a84349B55943b4716A77739D1650J35932b8841
17577a46092D36920A78168Q7767j22908K90706j06090c68105A74566d6204f261
$$ y = [118044, -6535, 465145, 276847, -37528, 18978, -138601, 293260, -81961, 81979, -61076, 269838, -1694, 25296, -195848, -121775, 57787, 162387, 219789, 60138, 166851, 93283, 186428, -162976, 28301, 32599, -197198, -213327, 407504, 216339, -11249, 388347, -156444, 229158, 175816, 19306, 49649, -261617, 123920, 358488, 327869, -61489, -155865, 188260, 350650, -12907, -146972, 318619, 436970, 21270, 17084, 390725, -206660, 233148, 133251, 397404, -94803, 17377, -67551, 363431, -9018, 18604, 407248, -130747, -150340, -804, 226574, -18950, 40585, 49590, -92023, 104610, -45933, 43767, -184349, 255943, -24716, 177739, 41650, 177582, -28841, -146092, 436920, 178168, 265935, 143027, 433733, 327643, -368105, 174566, -46204, -6261]
17566a13794B42606A05296N042L22592j57410n4552H0647G075c5560C23711j03958
17555B19753L51142h1355E154L2668q059J23754K40000j36065J64864j66668J43309
17544C98957a92304A44038M19008B67480j06961q32K88377Q6893B32518J28047
17534C60565g6083C29537k4984q3162j4847j1243J44252K29121j51754O58123
17524A075043J64926k45775K1506k62646j00031L3968l35533L53285B73833l0499
17514B43334H2861N33072o7548O4460J60560J89637l40956O4940K16944C76408
17503E60909J01492A79171L02444J3166M9156k23394J37021j66694F0800K94876
17493C55676H1630M51294h9071D19806A18549M29550j65099L16832A3731M09844
$$ y = [-113794, 242606, 105296, 110338, 432930, 275520, 220968, 80647, 7075, -35560, 323711, 219753, 570895, -81355, 5154, 37822, 29763, 153517, 393517, 257452, 422316, 255648, 398957, -192304, 144038, 563046, 267480, 160519, 159687, 448064, 534957, 232518, 360565, -76083, 329537, 304553, 221391, 206544, 195301, 339553, 568674, 416920, 1075043, 1239969, 994194, 1015700, 753054, 653023, 686991, 351458, 704743, 273833, 243334, 82861, 615933, 548385, 612845, 773405, 963042, 622086, 687026, 903970, 376408, 560909, 662401, 179171, 481615, 494781, 543937, 320543, 457564, 290870, 60800, 355676, 81630, 532924, -89071, 419806, 118549, 548099, 383000, 699832, 13731, 423575]
17483D23575r5412a3432B17131A2553L77317P8631A13463L27026j53728p1631
17473B15130L17889L1823j83196A14326J95165K8699j22476A04952j5076j3731
17463G6145k3231M5490L35481A13547J78995A04635Q4751A3821L15876M8115N1893
17452D29705j24454A43272N0339K36333R8021k54266M76790l19066K71419j05622
17442E97220B05857K9583J38799F9680M51695A89201H7575J39938L09398A63403
17431B67118R801K38627R0544L8715C2562J50092l3098L7282K4669J95075I4111
17419B93953K25291j46825L7484j21241K39724j23722M2202A55062M10779k76214
17409B89627k5132L54374j91859I3240K57904g5203B50905J59468H4336M7667
$$ y = [423575, 328163, -13432, 217131, 12553, 389870, 468501, 113463, 440489, 286761, 215130, 533019, 564842, 381646, 114326, 309491, 338190, 215714, 104952, 89876, 76145, 52914, 98404, 433885, 113547, 292542, 104635, 189386, 13821, 329697, 377812, 429705, 305251, 143272, 193611, 429944, 527965, 273699, 750489, 431423, 702842, 597220, 205857, 235440, 374239, 69680, 521375, 189201, 87575, 227513, 536911, 163403, 267118, 276919, 515546, 606090, 644805, 32562, 182654, 149556, 186838, 211507, 406582, 94111, 293953, 519244, 372419, 409903, 288662, 528386, 404664, 446866, 155062, 565841, 289627, 264495, 618869, 427010, 93240, 351144, -75203, 250905, 410373, 84336, 132003]
17399A32003K2639L31689C6600D490L19110L6392F6892f4385E58485A30585n9567
17388G1018L04970k6233O1683N727l1444A84865o1481K72956A12203K67877q2024
17377B98056J12370j52682j06123J19003o9593J95499j4472J6432L14763B78782
17366c6808B97373J24637f7408A40783o4603O8647K4497r554p5130L02584A09618
17354D88708h0640A73602C4433L28718j55196j0667K99035A87877K22991j07969
17344C02899R5560p6236d7481B79504J37062b8373B71376l1486j07770K08427
17334C40547Q831K50278j78020A87970p6024K348K56045o4039m684K3702J56307
17323D81625j54898A05697C0896J79173O8739J78594C7903N25368j99789l375
$$ y = [132003, 154642, 486331, 36600, 4490, 323600, 359992, 66892, -64385, 558485, 130585, 71018, 375988, 349755, 411438, 417165, 385721, 184865, 123384, 396340, 112203, 380080, 298056, 410426, 257744, 151621, 270624, 201031, 396530, 382058, 398490, 713253, 278782, -36808, 297373, 422010, -67408, 140783, 76180, 144827, 169324, 159770, 84640, 387224, 109618, 488708, -80640, 173602, 34433, 363151, 207955, 197288, 496323, 187877, 410868, 302899, 398459, 322223, -47481, 279504, 416566, -28373, 271376, 239890, 132120, 340547, 349378, 599656, 421636, 187970, 111946, 114294, 370339, 306300, 301616, 325318, 481625, 326727, 105697, 30896, 210069, 278808, 457402, 37903, 563271, 363482, 360107]
17313C60107j04207m4583o9872Q7437P5109c6493A53569M61273B05736C7039L07370
17302C44409O663P9339A72033L35766d28C38502A36073L08309G1313L09229r4876
17291B85666j29467J61470J39518A31853J50736q3392K36100J69985B68665k2131
17281B46534G6052M68718j37741j2941q5842j9446N8550l8918f2116D46350j36998
17270C09352p1257L06760B02450P1323J26419o2996L60478k88854A27718N55242
17260F82960k58620N1597j14468J10412o1506Q0164J01261B06788L30457B18177
17249E17477B05008K10634J64569j16467j83824K15468Q1936k68344K54532B67501
17238D16626A00812m5993R8325M46783B42344J0619j14500K55993n51k9784l5751
$$ y = [360107, 255900, 211317, 141445, 228882, 303991, -36493, 153569, 614842, 205736, 37039, 344409, 351072, 430411, 172033, 507799, -428, 338502, 136073, 444382, 71313, 380542, 285666, 156199, 317669, 457187, 131853, 282589, 199197, 435297, 605282, 268665, 246534, 76052, 544770, 407029, 394088, 308246, 288800, 347350, 308432, -62116, 446350, 309352, 238095, 544855, 202450, 273773, 400192, 337196, 697674, 408820, 127718, 682960, 424340, 475937, 361469, 471881, 410375, 490539, 591800, 206788, 537245, 218177, 517477, 205008, 415642, 580211, 463744, 279920, 495388, 577324, 308980, 563512, 267501, 416626, 100812, 54819, 153144, 599927, 242344, 252963, 138463, 394456, 393905, 364121, 328370]
17227C28370j7743J49326j44206E0016L97795n3074K43688j55156k0271K91247
17217G54245k01634k44602o6568J15719m3133Q4899A00701M57079J3622j30732
17207D40670o0786L06758B77708j4952j8077K03475A0449J74216J22371J37281
17197D44317I2591K90435j2177j13941h9110D26571k1676J4438j64952E0548M15616
17186D66164o8491j97133M11645j68536P8276O2295A49284N92297B37852n0161
17176A87691Q9021L56313k02579A84696J4613J96351j6217K72551j51561r0324
17166D10109o7169A35764N53218q9719B23545L27773B70904M15376I5879N60772
17156F56651M8584C06315N6357L32820l3551C06453M42481r1395m3512o224B59500
$$ y = [328370, 310627, 459953, 315747, 50016, 447811, 394737, 638425, 483269, 462998, 754245, 552611, 308009, 241441, 357160, 314027, 398926, 100701, 557780, 571402, 440670, 379884, 686642, 277708, 262756, 244679, 448154, 10449, 184665, 307036, 444317, 92591, 383026, 370849, 256908, -89110, 426571, 404895, 419333, 254381, 50548, 466164, 397673, 200540, 612185, 443649, 521925, 584220, 149284, 741581, 237852, 187691, 276712, 633025, 430446, 184696, 199309, 395660, 379443, 651994, 500433, 410109, 342940, 135764, 688982, 599263, 223545, 551318, 270904, 686280, 95879, 656651, 705235, 306315, 362672, 695492, 661941, 306453, 748934, 657539, 614027, 607803, 259500]
17144E54874j17744J67033J7833o2975j94224R8840p0425F6523L94245O8863m6780
17133D82851J47428P0608l2389j38338J83981P9477k80423A85641L91285j66661
17123D10265M17860j38966j81495L38551j09149L2530k38968K24206j93512j02231
17113D59091J40319m2312o5126L76581k07525O7322k48975j64600O76396l38674
17103F52497K94998k84043j58284N28942k43074n4872k23464K80178N4346k23617
17093F23607K15471l17909r0838l9474K34476k1272K55658l51236J98938J16857
17083H24278D12085M58232j94205r8741J78687l8526k49077L61506j02186K06354
17073I34129r7335M6723n1255m7233J62907r7284o2020p9698P6521k33358O39136
$$ y = [554874, 437130, 604163, 621996, 559021, 364797, 463637, 393212, 66523, 460768, 529631, 482851, 630279, 700887, 668498, 530160, 714141, 793618, 513195, 185641, 576926, 410265, 828125, 689159, 507664, 846215, 737066, 769596, 530628, 754834, 561322, 459091, 599410, 557098, 491972, 868553, 661028, 728350, 479375, 314775, 991171, 652497, 947495, 663452, 505168, 1034110, 791036, 736164, 512700, 792878, 847224, 623607, 839078, 521169, 430331, 390857, 625333, 604061, 859719, 508483, 707421, 824278, 412085, 870317, 676112, 577371, 756058, 717532, 468455, 829961, 727775, 934129, 836794, 883517, 832262, 785029, 947936, 850652, 788632, 708934, 785455, 552097, 1191233]
17062A191233l48185m00609M50434p094j00617j14996K13523k94399J27833L05224
17052A022347m00388L69872k14818J11573J92828j7120m75351K78869n4727R1889
17042I04974J36094r7589j31056L8567J39204n5953R3729l58805R7833L0214K61518
17031A058730M2243Q3850l45511L97096m0001l74432J07921J85794R6666p1595
17021A140761k31336n6300L82759J02619j19913J44525j51496J62805k03142j03204
17011A068078j53578J02723N375K06701l28117L82929p9335J36732m27594L18954
17001A232868L6569j64637k34393N02560J01926l94387K78785N2772q7782R737
16991A334018j25726K32106n4136k3214j33955J89788k67167L09817j94653j66642
$$ y = [1191233, 843048, 442439, 892873, 885779, 785162, 670166, 883689, 589290, 717123, 1022347, 621959, 991831, 777013, 888586, 1081414, 1064294, 588943, 867812, 813085, 904974, 1041068, 943479, 812423, 850990, 990194, 934241, 1027970, 669165, 766998, 797212, 1058730, 1100973, 1184823, 839312, 1236408, 1196407, 821975, 929896, 1115690, 1212356, 1140761, 909425, 853125, 1235884, 1338503, 1218590, 1363115, 1211619, 1374424, 1171282, 1068078, 914500, 1017223, 1022598, 1229299, 901182, 1284111, 1204776, 1341508, 913914, 1232868, 1269437, 1104800, 870407, 1372967, 1474893, 1080506, 1359291, 1412063, 1324281, 1334018, 1208292, 1440398, 1386262, 1363048, 1229093, 1418881, 1151714, 1461531, 1266878, 1100236]
16981A100236K69839Q2627J34230j21077j25984r4024L6239Q5420j6091K0540
16971A371955L37777m35175K10102J46593k60750K48971N7889J65484j22667K32206
16961A952385k06588J93053l35570m9272k08295L72742P9289p0693n6298J4786
16951A685539M04580k30733J30234P8495j80385m0328P960J03629J23518M354
16941B086863j00554J86587J9489k55047j1966K37004J4213J5415r0065j42826
16931A959113K72131l30922J96556M9405j6832K69807p6404k36105J19371J27721
16921B333841J5229l35491K51288J8990K7855j03667n2763M59303k14873J17579
16911B517291O3320L43288J300j70642k03093J45307q4572O3018N15775m80558
$$ y = [1100236, 1370075, 1452702, 1586932, 1465855, 1339871, 1245847, 1282086, 1367506, 1351415, 1371955, 1709732, 1274557, 1484659, 1631252, 1370502, 1619473, 1677362, 1842846, 1720179, 1952385, 1745797, 1938850, 1603280, 1554008, 1345713, 1718455, 1797744, 1727051, 1670753, 1685539, 2090119, 1859386, 1989620, 2068115, 1887730, 1847402, 1855362, 1958991, 2082509, 2086863, 1986309, 2172896, 2192385, 1937338, 1925372, 2162376, 2176589, 2192004, 2101939, 1959113, 2231244, 1900322, 2096878, 2146283, 2129451, 2399258, 2322854, 2086749, 2206120, 2333841, 2349070, 2013579, 2264867, 2283857, 2311712, 2208045, 2155282, 2614585, 2399712, 2517291, 2580611, 2923899, 2925199, 2754557, 2551464, 2696771, 2612199, 2675217, 3190992, 2710434]
16901B710434J79842l3620p6129J57603J12697J46137m2532n0574Q6977M580R6709
16890C292124j42998k5351R303J65777Q8450Q359J21826K6934L8840J56154m481
16879C734937K14512O797k46607R3614O4978K09039k2062j87488K22860K78857
16869D369437J03563l67378K34865J25559J10369k07851R3118K01708L73404l65459
16859D671335L70811P0888k19476J03826L44582O889q4461J30579k27741P4784
16849E242016K81441K70705j72446M56115j76000K33113L78244n66165N06252
16840F453275k07924O56694q2771L2186m2248k4242O9254K58701K11458r0696
16830G233687M85376j69456L83714j28062M35904L74081k47486L07273k2904K86298
$$ y = [2710434, 2890276, 2856656, 2780527, 2938130, 3050827, 3196964, 3154432, 3103858, 3190835, 3195415, 3292124, 3149126, 3123775, 3133078, 3298855, 3387305, 3395664, 3517490, 3544424, 3583264, 3739418, 3734937, 3949449, 3956246, 3709639, 3803253, 3868231, 4077270, 4055208, 3867720, 4090580, 4369437, 4473000, 4105622, 4340487, 4466046, 4576415, 4368564, 4461682, 4663390, 5036794, 4671335, 5042146, 5113034, 4893558, 4997384, 5341966, 5348855, 5264394, 5394973, 5167232, 5242016, 5523457, 5794162, 5621716, 6077831, 5901831, 6134944, 6513188, 5947023, 6453275, 6245351, 6902045, 6819274, 6851460, 6809212, 6784970, 6854224, 7112925, 7324383, 7233687, 7719063, 7549607, 7933321, 7805259, 8241163, 8615244, 8367758, 8675031, 8652127, 8938425]
16820H938425k48593M55335J88836K74045P3277K87657P7323p1710N75316K25085
16810A0774996J59281M65284r0270K58289M54369R9804K67819M35168K37537K37755
16800A3300032J21896L16286O65372K85311M22972p4225M18988R06033j13946
16791A6248719R74585K11723J00742R02462P3628O39987N29621J81907R33534
16782B0796908M44148Q04592O17504P19749O46908O12078N38614Q48336Q70652
16773B6899489P22497J150746N97214P54357P34352J267546J188230J004399R38211
16764C5257041J298771R09043J365788J498298J519012J276268J542240J832494
16756D6498955J234803J751307J698508K004141J937428K004380K036034K047079
$$ y = [8938425, 8689832, 9145167, 9334003, 9608048, 9681325, 9968982, 10046305, 9974595, 10549911, 10774996, 10934277, 11399561, 11309291, 11567580, 12021949, 12121753, 12389572, 12824740, 13062277, 13300032, 13421928, 13738214, 14403586, 14688897, 15111869, 15037644, 15456632, 16362665, 16248719, 17223304, 17435027, 17535769, 18438231, 18511859, 19151846, 19681467, 19863374, 20796908, 21241056, 22045648, 22663152, 23382901, 24029809, 24641887, 25180501, 26028837, 26899489, 27621986, 28772732, 29369946, 30124303, 30858655, 32126201, 33314431, 34318830, 35257041, 36555812, 37464855, 38830643, 40328941, 41847953, 43124221, 44666461, 46498955, 47733758, 49485065, 51183573, 53187714, 55125142, 57129522, 59165556, 61212635]
16748F1212635K130812K336822K493949K512833K569610K671413K587347K618480
16740H1133901K925272K519090K724554L194350K819395K525420L026926K527181
16732A03396089K890723K393517K131473K071133K194558J441743J848294J142403
16724A19509933R00819L13897N65508j38138k09621m53155j101953j015903j749879
16715A16621508j579098k056753k165823k165937k848156k269030k837609l095907
16707I7603195k789352l107634k806675k764425l115177k602960k960844k850667
16699G4605461k332192k964664k490702k314265k571527j859315k290882k159988
16691E5621926k030610j882412j726365k043652j363080k113507j591926j335391
$$ y = [61212635, 63343447, 65680269, 68174218, 70687051, 73256661, 75928074, 78515421, 81133901, 84059173, 86578263, 89302817, 92497167, 95316562, 97841982, 100868908, 103396089, 106286812, 108680329, 110811802, 112882935, 115077493, 116519236, 118367530, 119509933, 120410752, 120724649, 121290157, 121152019, 120942398, 120489243, 119387290, 118371387, 116621508, 115042410, 112985657, 110819834, 108653897, 105805741, 103536711, 100699102, 97603195, 94813843, 91706209, 88899534, 86135109, 83019932, 80416972, 77456128, 74605461, 72273269, 69308605, 66817903, 64503638, 61932111, 60072796, 57781914, 55621926, 53591316, 51708904, 49982539, 47938887, 46575807, 44462300, 42870374, 41534983]
16683D1534983j556234j472006j096635j226388j387733j092800j014284j087353
16675C1601550j333836q64989q32216p42976n88688j360479n88766n02533r60214
16666B3826853q65309n98974r30739k93170n87614n89945o10153l67656p59319
16657A8223974l04826m48943m79907l47185p18065o1666l37006o36078m36324
16648A4453974n95217J98815m95922m39208m12362J19384m18037o3922n78235
16639A1769270m98452J14788k64252n47279R5233k09564j48585l51251k50698
16630I709210M3720k35445m78772j6261j88121k67331j82826k3596l33874k23491
16620G803213R8707o8920m16262N0223p9689l65125k16915Q3417j19798k01582
$$ y = [41534983, 39978749, 38506743, 37410108, 36183720, 34795987, 33703187, 32688903, 31601550, 30267714, 29402725, 28570509, 27827533, 27238845, 25878366, 25289600, 24787067, 23826853, 22961544, 22362570, 21431831, 21138661, 20551047, 19961102, 19350949, 18983293, 18223974, 17919148, 17470205, 16990298, 16643113, 15925048, 15863382, 15526376, 14890298, 14453974, 13858757, 14057572, 13561650, 13122442, 12710080, 12829464, 12411427, 12347505, 11769270, 11270818, 11385606, 11121354, 10574075, 10669308, 10459744, 10311159, 9959908, 9709210, 9752930, 9517485, 9038713, 9022452, 8834331, 8567000, 8384174, 8360578, 8026704, 7803213, 7901920, 7833000, 7416738, 7466961, 7387272, 7022147, 6805232, 6888649, 6768851, 6567269]
16610F567269l70663L00471m06012k3889L2483K6879m12681L9387j00233J67125
16600E820136m84350L988l62316n131K04003o2954m9422k55433J24736l02398
16590D630859R8701r7628j68822P5180K5129j40846Q4274k85557J85742k56678
16580D150354J38166k10617J11229o21226N34165l42480o0189m36530K69981j08419
16570C424434K08160J19240m2568k09960J6741m18310M41992l84563P7570p2268
16560C160468j31895j0425J2596o8177K94490j60225j45457k07386o5497L8558
16550B717050j9866l0667l3772K9928J07965k83882J08403L0959P2120l49023
16540B349215L57041j45899j47241k14706L19175n4090m8148o084k19159j1541
$$ y = [6567269, 6196606, 6497077, 6091065, 6067176, 6099659, 6126538, 5713857, 5753244, 5653011, 5820136, 5335786, 5339774, 4977458, 4972327, 5176330, 5113376, 5063954, 4808521, 4933257, 4630859, 4729560, 4631932, 4463110, 4538290, 4563419, 4422573, 4506847, 4221290, 4407032, 4150354, 4288520, 4077903, 4189132, 3567906, 4102071, 3759591, 3699402, 3262872, 3532853, 3424434, 3632594, 3751834, 3709266, 3499306, 3516047, 3097737, 3539729, 3155166, 3232736, 3160468, 3028573, 3018148, 3030744, 2962567, 3257057, 3096832, 2951375, 2743989, 2678492, 2717050, 2697184, 2666517, 2632745, 2662673, 2770638, 2486756, 2595159, 2626118, 2698238, 2349215, 2706256, 2560357, 2413116, 2198410, 2517585, 2463495, 2415347, 2409263, 2190104, 2178563]
16530B178563O8311K1887O4300k74243J81371j14689q3135K31743m52508M00464
16520B222064k18559n1795k01166K7225L24620L21774n05999N064k38571O7171
16510A751828P434l0692j08003M2021J91329j18992j02835l44870J62033L43775
16500A793028l93873K92284k61933J25109j42878K34497l78404L98676k72700
16491A393806p9994N2402K19617k09648J81386j81399K50751P64o6281j18838
16481A442566l1813j00948J2644j68312N19612j05562k74241R6529O7919j14414
16471A343980j23381J55195j34726J20301P1980k76692J63099j76377l1241j60310
16461I51828K18991k63759m7789K93671j05094P5532M61895o98154K21103L4008
$$ y = [2178563, 2246874, 2268761, 2333061, 2058818, 2240189, 2125500, 2042365, 2274108, 1821600, 2222064, 2003505, 1951710, 1750544, 1777769, 2102389, 2424163, 1918164, 1923228, 1684657, 1751828, 1759262, 1728570, 1620567, 1662588, 1853917, 1734925, 1632090, 1287220, 1449253, 1793028, 1399155, 1691439, 1429506, 1554615, 1411737, 1646234, 1267830, 1666506, 1393806, 1313812, 1366214, 1585831, 1376183, 1557569, 1376170, 1626921, 1627685, 1561404, 1442566, 1410753, 1309805, 1322449, 1154137, 1673749, 1568187, 1293946, 1390475, 1458394, 1343980, 1220599, 1375794, 1241068, 1361369, 1433349, 1156657, 1319756, 1143379, 1112138, 951828, 1170819, 907060, 859271, 1152942, 1047848, 1123380, 1585275, 887121, 1108224, 1142232]
16451A142232m23190N66130l92218p3150l3915M4313J06202q9605R2718n3241
16441H86276j15810L47352j17331K8533k45705q1883L13989J06379m31783K87478
16431I77495K44981l34676J00652J77261m36439j41469J71666L68378k62470m8989
16421H16390K61952D39590q2481L44834K18060k73638K46624O9391Q9535k09995
16411H41920L4506P6295l90722J70214K46948j03282n5879J7767n6542K1383j08252
16400F94356J60274l90792J74637O0144p4395J24925j88948K37900p9807p4169
16390F44125j04715M38063m08235o5621P6494K99399j69022l40613K45008n5257
16380E59626J76137l0027n2143o3964K5780k06498J62847P8k9954q524J36140
$$ y = [1142232, 719042, 1285172, 892954, 819804, 785889, 830202, 936404, 846799, 939517, 886276, 770466, 1117818, 1000487, 1029020, 783315, 701432, 1015421, 1121800, 690017, 977495, 1222476, 887800, 988452, 1165713, 729274, 587805, 759471, 1127849, 865379, 816390, 1078342, 439590, 357109, 701943, 920003, 646365, 892989, 962380, 1051915, 841920, 876426, 952721, 561999, 732213, 979161, 875879, 820000, 837767, 781225, 802608, 694356, 854630, 463838, 638475, 698619, 624224, 749149, 560201, 798101, 718294, 644125, 539410, 977473, 569238, 503617, 580111, 879510, 710488, 369875, 614883, 559626, 735763, 705736, 653593, 589629, 615409, 408911, 571758, 571836, 541882, 533358, 669498]
16369F69498K09827k58613j15928K8874p9180K24856k02944L06305o7403j99283
16359E16009r5549k9998J28211K4212K00265G7077L98268L09767k50224J67016
16349G01904k61233M06552l04833k07133K29813j87466J01663j63155J99060l3084
16339D82088A02683L49555j7744N8341A51298L07983J99026k28326k05129M68425
16329F93277l17314J0041j05860K43028m0125R6917K9081n7664q4853A88384M28444
16318F16828r131j85605j82318k2569L05185k29456J29756p6696l875J3910J30581
16307D86610A60034J91144n2199G1437K26371K3343g2834F23147j82125N8277
16297D99299k02119J86616A88842R0098k2846J43409j17753A29388K42488j1069
$$ y = [669498, 879325, 620712, 504784, 533658, 454478, 679334, 476390, 782695, 715292, 516009, 420460, 390462, 518673, 542885, 743150, 77077, 475345, 785112, 534888, 701904, 440671, 847223, 542390, 335257, 565070, 377604, 479267, 316112, 515172, 482088, 102683, 452238, 434494, 492835, 151298, 459281, 658307, 429981, 224852, 693277, 375963, 386004, 280144, 523172, 483047, 579964, 609045, 551381, 466528, 188384, 616828, 607697, 422092, 239774, 217205, 522390, 292934, 422690, 345994, 342119, 356029, 486610, 160034, 351178, 298979, 71437, 297808, 321151, -72834, 623147, 441022, 499299, 297180, 483796, 188842, 278940, 256094, 399503, 281750, 129388, 371876, 360807]
16287C60807Q497m3195L9272J05059a40813C57092M8760K9377j3089p6627P890
16276C53403j4022J42475l7191O0008K2990B01432N5846L25473p4086j30394J66198
16265E44469A02035a56614D51766A53438J03636a04779C45968p2472D5799N38404
16255E84203j51787p721f21D15693J39568A40051o637K56544R9000A73187J6586
16244A89773E0105J16660L48352E4719N38280A02950A0148K00028O6288A02533
16233B81163l4726a5306G1889J36868L83476B89365R0626g609C58256A0520N03965
16222E14485c2671F8509L24729A23988K59519D2711M13435E4555K37264d033B05879
16210C84690A82614b3875B40298N8960J9521O4610A32715L3835K2361F988J33339
$$ y = [360807, 369304, 326109, 365381, 470440, -140813, 357092, 405852, 435229, 422140, 345513, 353403, 339381, 481856, 444665, 504673, 527663, 201432, 257278, 582751, 508665, 378271, 544469, 102035, -156614, 451766, 153438, 257074, -104779, 345968, 273496, 45799, 584203, 432416, 424695, -621, 415693, 555261, 140051, 133414, 389958, 488958, 173187, 189773, 50105, 166765, 515117, 54719, 592999, 102950, 10148, 210176, 276464, 102533, 281163, 246437, -15306, 71889, 208757, 592233, 289365, 379991, -7609, 358256, 10520, 514485, -32671, 68509, 393238, 123988, 383507, 42711, 456146, 54555, 291819, -4033, 205879, 384690, 182614, -23875, 240298, 299258, 318779, 383389, 132715, 166550, 188911, 6988, 140327]
16199A40327J05830K65880A75781J9584p9801J08751K47321A98165I880L7220
16189D7100L43391a68083E7495c2457A72704H4868a48087A72067L3735P4945j06958
16178A73789o0311d4130A46552O5506L5595N0874A28224N1686J31619H7564J29525
16167B17089n8177J4730a22552A99922q7325L14611j99486A8212L26545A68642
16156B35123g5787A6345n614K52038d9285B4454f4590k38440B37488F05J55610
16145A56215N9331j494R1408M427p5602K671d7425k30299B79472A07008M20230
16134E27238e0717A03158D4359L0400J75334q8070b6117C05847b20448B22183
16123C5790K63156D3125J86510A3422a82537A18996O3664H029J7491Q0938A4108
$$ y = [140327, 246157, 512037, 175781, 195365, 115564, 224315, 471636, 198165, 9880, 47100, 390491, -168083, 57495, -32457, 172704, 84868, -148087, 172067, 205802, 280747, 173789, 113478, -44130, 146552, 212058, 247653, 298527, 128224, 179910, 311529, 87564, 217089, 158912, 173642, -122552, 199922, 112597, 427208, 227722, 18212, 344757, 168642, 235123, -75787, 16345, 10731, 262769, -49285, 24454, -64590, -303030, 237488, 605, 156215, 215546, 214052, 305460, 309887, 234285, 236956, -47425, -277724, 279472, 107008, 527238, -50717, 103158, 44359, 74759, 250093, 162023, -26117, 305847, -220448, 222183, 35790, 298946, 43125, 229635, 13422, -182537, 118996, 182660, 8029, 25520, 106458, 14108]
16111B59990q2366f5562b8544p1118A49306f8831j25663B22123C3641l570L20503
16100C50574A36080b77068B60503j27097L3732h7920F1190g4029B43118L7329
16090B80447i5029D8419R5919E9369i6865A87101J3351a91334J8379B53413m6766
16079B06647M7270i0835A08316a33506A46048A9205J2568K64652C5914L5482a6443
16067D1620L7096h6219B42238J60462A83459C9838A1868a58497B36981k0275P5376
16056B92082c41880A11194l2254g7432e484k9885A92799p0757G56L02862j32787
16045A70831D3578b96053a13363H9839a57521A21295D1468a73389e2454j15266
16035a67720A20433Q4273c1289B67301A32108D0522M0016J48996e7499I8553b2073
$$ y = [259990, 177624, -65562, -28544, -99662, 149306, -68831, -194494, 222123, 33641, 30071, 350574, 136080, -277068, 260503, 133406, 167138, -87920, 61190, -74029, 243118, 280447, -95029, 48419, 144338, 59369, -96865, 187101, 200452, -191334, -172955, 253413, 206647, 253917, -90835, 108316, -133506, 146048, 19205, 31773, 296425, 35914, 71396, -16443, 41620, 78716, -86219, 242238, 402700, 183459, 39838, 11868, -158497, 236981, 216706, 292082, -341880, 111194, 78940, -77432, -5484, -35369, 192799, 122042, 756, 303618, 170831, 43578, -296053, -113363, 89839, -157521, 121295, 41468, -173389, -52454, -167720, 120433, 204706, -31289, 267301, 132108, 40522, 80538, 229534, -57499, 98553, -22073]
16023I6379P2382E2788Q3397b24678D8636a92822I4221J16911Q6987a95584A71445
16011c66497k1741H3378B4492L97215b60584f711B98211d306B31296g9685A22334
15999c71638a71494d7306b0873C05651p2577N4869d03351d1301B0988J20434L07847
15988D49269j00001N4562N45828J94594o7234M1595k25216l06144j50988J05917
15978E42182A27426e3073c79l8806B18063E1793c4407H0749b20310e1078C7158
15966a07820j79489b0769B4062L02873a4007l3733n0757H6620H170J63635H0503
15954a61693j29678J43320j33717H8233Q477J00732b09380h4932A83356q8802
15944I4554h0595A4924Q0854E051c6882a640C35572a73146G2052J58124a43190
$$ y = [96379, 168761, 52788, 136185, -224678, 48636, -192822, 94221, 211132, 298119, -195584, 171445, -366497, -388238, 83378, 24492, 421707, -260584, -6711, 298211, -4306, 231296, -79685, 122334, -371638, -171494, -47306, -20873, 305651, 233074, 287943, -403351, -41301, 20988, 141422, 449269, 349268, 403830, 949658, 1144252, 1077018, 1118613, 893397, 587253, 436265, 542182, 127426, -53073, -379, -39185, 218063, 51793, -34407, 80749, -220310, -51078, 37158, -107820, -287309, -20769, 24062, 326935, -14007, -47740, -98497, 86620, 8170, 171805, 80503, -161693, -291371, -148051, -281768, 88233, 96710, 197442, -209380, -84932, 183356, 94554, -80595, 14924, 95778, 5051, -36882, -1640, 335572, -173146, 72052, 230176, -143190]
15932H6530N8167R583a40368m9761g3325k5750B2631K50069D0006a19994L08n7582
15920a77268r9917A06161i0463d0023j36121B47212h4584j07210B25193e9194
15909a43327j12163Q6434A49073e3893j41861C9527P2923j8710e3040k1193B05352
15897i9929B49749a07750k74646A55803J16654A19806a10070n5907e3506A52535
15886B30897A2382J21014F0998i6496a2874A30571b96599a2290F1738d6309d64
15874d2970j41602B28993a61019m6025e9034B10362a54654a4633C18342a40899
15863B1619c01505E5418b14579d7363F1221a11501B29813D366b09014A23208f8844
15851A27147g5509l6337d4281j93659g9084A43810k8578c35689a17899M2025B71756
$$ y = [86530, 144697, 154280, -140368, -190129, -73325, -99075, 22631, 272700, 40006, -119994, -119686, -177268, -277185, 106161, -90463, -40023, -176144, 247212, -84584, -191794, 225193, -59194, -143327, -255490, -169056, 149073, -53893, -195754, 39527, 112450, 93740, -53040, -74233, 205352, -99929, 249749, -107750, -382396, 155803, 272457, 119806, -110070, -165977, -53506, 152535, 230897, 12382, 133396, 60998, -96496, -12874, 130571, -296599, -12290, 61738, -46309, -464, -42970, -184572, 228993, -161019, -207044, -59034, 210362, -154654, -14633, 318342, -140899, 21619, -301505, 55418, -214579, -47363, 61221, -111501, 229813, 4366, -209014, 123208, -68844, 127147, -75509, -111846, -44281, -237940, -79084, 143810, 115232, -335689, -117899, -75874, 271756]
15839H3152a59720C81284c09397M9491I0580b72870a09212p7215O8608B81603
15828A53774K13915A01896C465b95588j41843d437l44598a24335A08018a514A41000
15816b76237A74441b9399M565A35466h1939q6424B7988K94620g1228B7616b00678
15804a3181l094j47318k6703G3235a4502E8391K53844A27038b44763A8196f7985
15792A13563K45848a4131j42196B24231q5919c439E3984d33578a22298I4534b70860
15780A30921A8168f8526j17196K4736j409a3484p0683r0577K5121C657a44970
15768b15798D9579e3223j23773b2092D4684J08685j5493b6112A83458c5147j68875
15757b04022R8734B53052A16236M2094a3903k26294I5713A9726L2273J74354B2740
$$ y = [83152, -159720, 381284, -309397, -259906, 90580, -272870, -109212, -186427, -117819, 281603, 153774, 367689, 101896, 3465, -295588, -437431, -4437, -349035, -124335, 108018, -1514, 141000, -276237, 174441, -29399, -24834, 135466, -81939, -168363, 27988, 322608, -71228, 27616, -200678, -13181, -16275, -163593, -190296, 73235, -14502, 58391, 312235, 127038, -244763, 18196, -67985, 113563, 359411, -14131, -156327, 224231, 138312, -3439, 53984, -433578, -122298, 94534, -270860, 130921, 18168, -68526, -185722, -160986, -162395, -13484, -84167, -174744, -149623, 3657, -144970, -215798, 49579, -53223, -176996, -22092, 44684, 153369, 137876, -26112, 183458, -35147, -204022, -105288, 253052, 116236, 158330, -13903, -240197, 95713, 19726, 51999, 226353, 22740]
15745g6282B59743I97K10434J07826F486b37048b116n8232A3881c2734k9654n6849
15733a19237n6089F2209B5485Q8474a57602D5764b21508A70007a49296j72484
15723c21780h9706j20054c6512j10895r1984C5567f1338k7540m3417I2573J27496
15712B20069a49269k6905L7155D9504f6350B91098H493J12294L8739Q6198c3457
15700A04450a56062c0928A20075c113j03392P159A3047J05829J24512a02837b8588
15688a07109b1590I6971a61825B95741a62155k6715B50724f8410D3838J14156
15678A57994i8445F8039B3810a90546d035r5593k8788A70856M26172B72635j14043
15667A58592a69556F5385K95895i1251j05975j25988E4778N71R1701a61357a4580
$$ y = [-76282, 259743, 997, 211431, 319257, 6486, -237048, -2116, -60348, 13881, -32734, -62388, -119237, -175326, 62209, 25485, 113959, -157602, 45764, -221508, 170007, -149296, -321780, -89706, -209760, -36512, -147407, -239391, 35567, -61338, -88878, -132295, 92573, 220069, -149269, -176174, -139019, 49504, -66350, 291098, 8493, 120787, 159526, 245724, -33457, 104450, -156062, -30928, 120075, -3113, -106505, -99346, 13047, 118876, 243388, -102837, -28588, -107109, -21590, 96971, -161825, 295741, -162155, -188870, 250724, -68410, 43838, 157994, -98445, 68039, 23810, -190546, -4035, -99628, -128416, 170856, 597028, 272635, 158592, -169556, 65385, 361280, -91251, -197226, -323214, 54778, 55349, 147050, -161357, -14580]
15655c1397j69074I7335a1481H3819c69319A22010b38849D9633b43635C03307
15644G7061H842K18058g6868A8828J13613N1376b51969G4190a96284P7033j34026
15633b53277f2920D4044M6726R039d47739c2500E3223K38002a75734B36644o2243
15622A74401k2568b94835B55419b3435B37564c6041A12257h2341a6245n1523B8242
15610B54088J23804c1865A713b65164N5456k07877b04977a7451A23785d64868
15599d8445J751k85677C66111b89996G0793C4860N5020b6551k13313A06470K1063
15588A27533R4242O216b48222O5457F8277K01757j32325K9250b98439b3802l1724
15577e5526A93503b2535a007A67992j1192a77287B5551J91972b02065A57107G251
$$ y = [-31397, -200471, 97335, -11481, 83819, -369319, 122010, -238849, 49633, -243635, 303307, 77061, 8842, 226900, -76868, 18828, 132441, 183817, -251969, 74190, -196284, -119251, -253277, -62920, 44044, 90770, 99809, -447739, -32500, 53223, 291225, -175734, 236644, 174401, 151833, -294835, 255419, -23435, 237564, -36041, 112257, -82341, -16245, -67768, 28242, 254088, 377892, -31865, 1713, -265164, -209708, -417585, -204977, -17451, 123785, -464868, -48445, -46694, -332371, 366111, -289996, 70793, 34860, 89880, -26551, -239864, 106470, 127533, 221775, 227991, -248222, -182765, 68277, 270034, 137709, 166959, -298439, -23802, -55526, 193503, -22535, -1007, 167992, 156800, -177287, 25551, 217523, -202065, 157107, 7251]
15565a24219l1800f4994B38852a58715d8101j20266C4796j5444M1927d8320k22747
15554b71067B79655d70714a53637B96663i5676A38290D9566N916E977K52857A02504
15542b37722j04641B22592B276b8822j86119e2022A25329b35141E6116g5936k15865
15531b91801A36768E049a42703a1408j1457E4895b8869G0659M4810J65273n0254
15520B30488d477I5561b07952F2727b36157F6480N3431M7971N112O4317E8922
15508D9866O7356J6687J64320G5268c4445A64807p7813A6635K4181c3713B48466
15496a2589j19138A72606J3451l1639J60310E0491J2711J20443c1234m3816c3418
15484b4522B85076E5810L1952k158D1040e7869B94189m8249j4935q0379L35012
$$ y = [-124219, -156019, -64994, 238852, -158715, -48101, -168367, 34796, 19352, 61279, -48320, -271067, 279655, -470714, -153637, 296663, -95676, 138290, 49566, 55482, 5977, 258834, 102504, -237722, -342363, 222592, 2276, -28822, -214941, -52022, 125329, -235141, 56116, -75936, -291801, 136768, 5049, -142703, -11408, -22865, 54895, -28869, 70659, 115469, 280742, 230488, -4477, 95561, -207952, 62727, -236157, 66480, 119911, 167882, 172994, 237311, 58922, 49866, 117222, 133909, 298229, 75268, -34445, 164807, 86994, 16635, 40816, -33713, 248466, -12589, -131727, 172606, 186057, 154418, 314728, 50491, 63202, 183645, -31234, -75050, -33418, -24522, 285076, 55810, 87762, 85604, 41040, -57869, 294189, 245940, 231005, 150626, 485638]
15473D85638O5607M56831l26805k56133j40343A31302K49808A64496A9589b18555
15462A21276J96364H9516J17624p339o2508A6827a45204B34245a81911B17231
15451h8712B24493m0000M3350m0011E3351h2744A43684j3257j5831L76845L51275
15440H42716N52695p8308E69018j15060j80726a4138j23739N3250a4807A41382
15429F9082L21808A01563M4486P5961p7034K445e2013B07228a16154l1069B14865
15417a75247A4673J20149L8957e0360k36246C8876b51049c9339j27270E5078g9275
15405a9353B04703a05384C48926a781D8074a9143m7633j78715e060C00300a49220
15393I5638j5879a47155C00500o9764k1679b48061A262L94579A74272p8145J12360
$$ y = [485638, 551245, 1008076, 681271, 425138, 284795, 131302, 381110, 164496, 19589, -218555, 121276, 317640, 89516, 207140, 199801, 137293, 16827, -145204, 234245, -181911, 217231, -88712, 224493, 184493, 227843, 187832, 53351, -82744, 143684, 130427, 114596, 491441, 842716, 1395411, 1317103, 569018, 453958, 273232, -14138, -137877, -84627, -14807, 141382, 69082, 390890, 101563, 146049, 222010, 144976, 147421, -52013, 207228, -116154, -147223, 214865, -175247, 14673, 134822, 173779, -50360, -286606, 38876, -251049, -39339, -166609, 55078, -79275, -19353, 204703, -105384, 348926, -1781, 48074, -19143, -66776, -245491, -5060, 300300, -149220, 95638, 79759, -147155, 300500, 230736, 209057, -248061, 1262, 395841, 174272, 96127, 208487]
15382B08487F4113a48777n1165A40031C1858J23776e6372A78739i926C34953k6674
15371C08279r2218K51991A5402M7377J82847H517J24379e5689C77868A42296P8132
15360B20428R8460o5251C225J35007R9879Q5174A59322R2987K666m2861j0701
15349B01413F1231M50242B42069b8253C9144J47857K09432o6035Q4174p1469O7082
15338D10185J21922b23189B46713p8279b48371A72612J7483m5524J0350b0952
15327I1522J71204a07779A8239L23256I8086l2424C205J72356c70624A50798c32955
15315A66509E6192Q1883q532e2597r5221O5746D69527j61658A17828A0985J75368
15304A86353n1034n5814a48328O7304K4373B25917b20449B59584j01716D0720
$$ y = [208487, 64113, -148777, -199942, 140031, 31858, 155634, -56372, 178739, -9926, 334953, 308279, 216061, 468052, 15402, 62779, 245626, 8517, 132896, -55689, 377868, 142296, 220428, 318888, 253637, 3225, 138232, 238111, 323285, 159322, 252309, 254975, 212114, 201413, 61231, 511473, 242069, -28253, 39144, 187001, 396433, 330398, 414572, 343103, 410185, 532107, -223189, 246713, 168434, -248371, 172612, 190095, 144571, 154921, -20952, 91522, 262726, -107779, 18239, 341495, 98086, 65662, 3205, 175561, -370624, 150798, -332955, 166509, 56192, 138075, 129543, -52597, -147818, -82072, 469527, 307869, 117828, 10985, 186353, 135319, 79505, -148328, -81024, -56651, 225917, -220449, 259584, 157868, 40720]
15293c0488E034c11371D2593h2249A75111D467L59343O458b9609p8468G0474g1919
15280h4583A07306c2210e097q1223A5794J68086f9584l5814r4775C1829J326J10950
15268A44105c19928B12619r8110c5664A39915f9433B67032C7047h724B03087J8172
15257B21259a51413A07294O5537h2942B48332c9515j38919C2774j1230b00841
15246B14599n0954K07269J59659N92595P32480n87912M74634j29749E91829j06736
15236D85093d317q6419G9161a1318C14652b43989G8303j7486N6936B5113a056
15224e0335B8009M013K5961b41460E8915e7814A09219J90800K7485H5148A4944
15212D77075f879l8319A89596o7141D4429A3094P3607J6250L7748J01874P362
$$ y = [-30488, 5034, -311371, 42593, -82249, 175111, 4467, 363810, 370268, -29609, -108077, 70474, -71919, -84583, 107306, -32210, -5097, -86320, 15794, 183880, -69584, -105398, -200173, 31829, 33155, 144105, -319928, 212619, 114509, -35664, 139915, -69433, 267032, 37047, -8724, 203087, 221259, -151413, 107294, 172831, -82942, 248332, -39515, -178434, 32774, 21544, -200841, 214599, 163645, 370914, 530573, 1123168, 1855648, 1267736, 1742370, 1612621, 591829, 485093, -4317, -90736, 79161, -11318, 314652, -243989, 78303, 60817, 117753, 25113, -1056, -50335, 28009, 32022, 57983, -241460, 58915, -57814, 109219, 300019, 327504, 85148, 14944, 477075, -6879, -45198, 189596, 122455, 44429, 13094, 86701, 102951, 140699, 242573, 249935]
15201B49935a28367A84448b13847A79310K2200a5457D4359M1636j3410J1364C7943
15189C10934m808e5208j26182l3776B46208e9549K3157F2179a45137C83863a83365
15177B8290a30184A32095a33247Q636B84718A10573A3504L68814H2395O574P2386
15166A61355d43660b9733E8570B8772J47410h7517G1147a87039a2407A48105n9219
15155H8886b3591G8038K74644a40919A23165L6971E8271k0538h6026E84558f9363
15143B48635i486A13865E127K99134a20508L298I0239C2789K6127L7456c9466
15131A27955O7255a43045B26982A09029a00710A47681K9117K25070k7584b6668
15120I9069K91001J13464k6703A17864d3930A40191d3234p3785B45403C0993e4860
$$ y = [249935, -128367, 184448, -213847, 179310, 201510, -15457, 44359, 85995, 72585, 83949, 37943, 310934, 306126, -55208, -181390, -215166, 246208, -59549, -36392, 62179, -145137, 383863, -183365, 28290, -130184, 132095, -133247, -124611, 284718, 110573, 13504, 382318, 82395, 88969, 161355, -443660, -29733, 58570, 28772, 176182, -87517, 71147, -187039, -12407, 148105, 88886, -23591, 78038, 352682, -140919, 123165, 160136, 58271, 37733, -86026, 584558, -69363, 248635, -9486, 113865, 5127, 304261, -120508, -117210, 90239, 32789, 58916, 96372, -39466, 127955, 195210, -143045, 226982, 109029, -100710, 147681, 176798, 401868, 374284, -26668, 99069, 390070, 503534, 476831, 117864, -43930, 140191, -43234, -117019, 245403, 30993, -54860]
15108A17644n7215k455M9491a11880B7732a59106A3179a75187C18150j20407F5418
15096c0727D50218H7109Q6136l1487L2436J06531g2647C55208r3222A15765K5964
15085A41729d1758A98815B6383Q446L03219j58225G055L46187b25044C07267F3928
15073f7255C54250A70075f6465B66897L0963A32821a1486j45946H9725j8314M3973
15062A15384k7798M8054J28524G2175M57748D6990L09678j55171A0108M74995
15052D85103l3226A97815a06788C76359K08357k67886J018K05137A96813K79354
15042D76167D8994M04458G3258L58970B13257K24228j24374m3917J9890j0576
15032B78508J94494k04777L45571K5664A65114K18054K83012M37480B84383J89305
$$ y = [117644, 60429, 57974, 107465, -111880, 27732, -159106, 13179, -175187, 318150, 197743, 65418, -30727, 450218, 87109, 173245, 141758, 174194, 280725, -72647, 355208, 261986, 115765, 141729, -41758, 198815, 26383, 34829, 338048, 179823, 7055, 353242, -225044, 307267, 63928, -67255, 354250, 170075, -66465, 266897, 297860, 132821, -11486, -157432, 89725, 71411, 115384, 87586, 135640, 264164, 72175, 529923, 46990, 356668, 201497, 10108, 485103, 451877, 197815, -106788, 376359, 584716, 316830, 317848, 522985, 196813, 476167, 48994, 453452, 73258, 432228, 213257, 437485, 313111, 269194, 289084, 278508, 473002, 268225, 613796, 639460, 165114, 383168, 666180, 1103660, 284383, 473688]
15022D73688K94701k24450L7968j42597l2512j7917q8131N7204K3242J59553B14674
15010B06887L23807q5686J05723J04603j58818L3828B37674L9283L44820A56457
14999E54692j24716P0614P7096A96680K66767A03438K13372L14250k81087j63303
14989A86670K05781N3935P4770O9078A67948J48663M19545K11808j45370Q9308
14979H91902j42648o8107l31381K01094l1192K871j8695k9080N0372J95831j65168
14968E55799O9343B76125L51924j0337B98981R0017C6674K21784K26517k19442
14958B65533K50629A70507N6148m5644M64947A35173J46786J44705J29876k1868
14948E34672k27692R658m0713O8646J94663J20713J04953j34705N5205J6434k7184
$$ y = [473688, 768389, 543939, 581907, 439310, 406798, 388881, 300750, 357954, 381196, 540749, 214674, 206887, 530694, 445008, 550731, 655334, 496516, 530344, 237674, 276957, 621777, 156457, 554692, 429976, 500590, 577686, 196680, 463447, 103438, 316810, 631060, 349973, 186670, 392451, 446386, 521156, 590234, 167948, 316611, 736156, 947964, 802594, 891902, 749254, 681147, 349766, 550860, 519668, 522539, 503844, 474764, 525136, 720967, 555799, 625142, 276125, 628049, 617712, 298981, 388998, 36674, 258458, 484975, 265533, 516162, 170507, 226655, 181011, 645958, 135173, 281959, 426664, 556540, 534672, 306980, 316638, 275925, 344571, 539234, 659947, 764900, 630195, 685400, 701834, 674650]
14937F74650k37563j19012m6723L44087J27564k3515k5428K32744Q4650n3616
14927I57838N1281Q8905M49508O6716k78968N52128n25659M3234K269K12877K49684
14916A869813J78305J40452n48514l06796m35544Q8701j66524Q0352m09194k19671
14906B71380K08851r4614j77885K93867K8346k55388j9937K43703R3327p0185
14896E21465r6081A42730N3299N28310H2957M75559l1729k01784R4442L16926
14886G36371P352k47309K62718k25416J48900K12523D42417K26355O2179N5096
14876G86047J7273g9870D4309L63497k5295K02283L38735D08751J90421j55845
14866D43327L49561q8624p9697K9691k37303K71454k8136k51628J14294j45787
$$ y = [674650, 437087, 318075, 271352, 615439, 743003, 719488, 694060, 926804, 1011454, 957838, 1009119, 1098024, 1547532, 1614248, 1335280, 1887408, 1361749, 1404983, 1407252, 1620129, 1869813, 2048118, 2188570, 1640056, 1333260, 897716, 986417, 819893, 900245, 491051, 271380, 480231, 385617, 207732, 501599, 529945, 274557, 254620, 498323, 591650, 521465, 425384, 142730, 196029, 724339, 82957, 558516, 526787, 325003, 419445, 736371, 743723, 496414, 759132, 533716, 682616, 895139, 442417, 668772, 730951, 786047, 803320, -79870, 44309, 407806, 382511, 584794, 923529, 408751, 599172, 443327, 792888, 704264, 624567, 654258, 416955, 688409, 660273, 408645, 522939, 377152]
14856C77152J08329J03858j78757n9761K7090M59239l60997B28281K71941k30900
14846B69322L34836j89313M28022K431J02699K9045k1309L63375k39017J08974
14836A189065m31964K40596C16658M36201l15079o0542K23030l3374j09576K38797
14826F96115k76645j4087K58571Q8147k75155K34903j06627J72970j32130M03810
14816A049872L44385F67537J7455L10206k28007M6612k27431M22251D24722L0959
14806D55681P5937M94950J13906k42831Q0792D48829L40935l15178P5636J71685
14796G21907k35266j4307J34466Q8551A81272J21047j12327K32064J32574q0395
14786D74235m8893O9520L70667o1953j03531R3824k86571M53027k73285J07997
$$ y = [377152, 485481, 589339, 410582, 350821, 377911, 837150, 476153, 228281, 500222, 269322, 604158, 414845, 842867, 845298, 947997, 977042, 955733, 1319108, 1080091, 1189065, 757101, 997697, 316658, 752859, 437780, 377238, 600268, 566894, 457318, 696115, 419470, 405383, 663954, 752101, 476946, 711849, 605222, 778192, 646062, 1049872, 1394257, 667537, 684992, 995198, 767191, 813803, 586372, 1008623, 424722, 455681, 531618, 1026568, 1140474, 897643, 978435, 448829, 789764, 474586, 550222, 721907, 486641, 472334, 606800, 695351, 181272, 302319, 189992, 422056, 554630, 474235, 425342, 494862, 865529, 803576, 700045, 793869, 507298, 960325, 687040, 795037]
14776G95037j5972J70045P1531r2284J33243m28980J00020K29740l42019M4692
14766F65053O5612J2005n4810l9937r0499J96505n7351J60446n2258l71157J29957
14755E63566M50234k40652k01143A98663L45235K86189l44506L20433j54170n1967
14745E99877J14063j09986K57803j84099j39547K03476j49921J70813P818L4421
14735H04718q2736k3708j88542L52490K38886j77073K61570J33710M68854k8733
14725A759436j58974j78934j15665J48234o37193L45424m05468M23960m39646
14716G41174J46507k41142P1124M42867l68731k3042K12902C62298M73878p2620
14706G63556J03231L69700q1618J64582L93828j32388K98218J03675n44009K6480
$$ y = [795037, 779065, 949110, 1020641, 928357, 1061600, 632620, 732640, 962380, 620361, 665053, 730665, 742670, 687860, 647923, 557424, 753929, 696578, 857024, 804766, 433609, 563566, 1013800, 773148, 572005, 198663, 543898, 830087, 485581, 806014, 651844, 599877, 713940, 603954, 861757, 677658, 538111, 741587, 591666, 762479, 770297, 804718, 721982, 698274, 509732, 862222, 1101108, 924035, 1185605, 1319315, 1788169, 1759436, 1600462, 1421528, 1305863, 1454097, 816904, 1162328, 756860, 1180820, 741174, 887681, 646539, 717663, 1160530, 791799, 768757, 981659, 362298, 836176, 763556, 866787, 1236487, 1154869, 1319451, 1713279, 1580891, 1879109, 1982784, 1438775, 1465255]
14696A465255k01059l29698k2814p8791j531L39094k88192k8414R1463M8916j52917
14685H41312k54755K87703J2138k33266M01396j59145j43960J73964J23134j25626
14675I22895J2171k74259N72421o5127n20782M87025n52992L69682Q1422K36126
14665A268582j05719k31423M03018k45903j318J36907l11269j329N42067l81802
14655A071811K13644O3843O7662l39985J49746n0525K98884k73905J02966k93286
14645A010855K82749m6914l30180J84616q4874l2439J44270k33774L43478K6899
14635A264686P5732J97897k04421j13664j83765K54530J53414k23500J48187k10942
14625A158154n8128K41012m7499Q174L6970K53093l37252L29093j36390q6393
$$ y = [1465255, 1264196, 934498, 911684, 832893, 831362, 1170456, 882264, 853850, 945313, 994229, 841312, 586557, 874260, 886398, 653132, 1054528, 895383, 751423, 925387, 1048521, 922895, 935066, 660807, 1233228, 1168101, 647319, 1134344, 581352, 951034, 1032456, 1268582, 1162863, 931440, 1334458, 1088555, 1087237, 1224144, 912875, 911546, 1453613, 1071811, 1285455, 1349298, 1416960, 1076975, 1226721, 1176196, 1475080, 1201175, 1304141, 1010855, 1293604, 1246690, 916510, 1101126, 1016252, 983813, 1128083, 894309, 1237787, 1264686, 1340418, 1538315, 1333894, 1220230, 1036465, 1290995, 1444409, 1220909, 1369096, 1158154, 1100026, 1341038, 1293539, 1301713, 1338683, 1591776, 1254524, 1583617, 1447227, 1360834]
14615A360834k0962p3757q8295L6280L19954r9875j70099L52128k94660N8058
14605A379606K27941r6172J1356L47060l12083l36566N01327m06237K87023L20204
14595A923459m22628J10502J11102r1706J70350j29645J74491l91732K84342L01914
14585B040449J33256n78541k8392M26915J6096m24700L52348O1355l78556L51173
14575A971403K37867l89751k9523M05124J8837M2898l93689N03301J13744k4452
14565B455759k43839N94754j5423o4865K57774j91244j67420l00747M15119K71230
14555C011098K38121K63954K12286M71470M81480P75479J819790L483290Q312752
14546A9069720K2767674K750999A9122895G823372C710713r19409k19074O15382
$$ y = [1360834, 1339872, 1266115, 1177820, 1214100, 1534054, 1434179, 1264080, 1616208, 1321548, 1379606, 1607547, 1511375, 1522731, 1869791, 1557708, 1221142, 1722469, 1316232, 1603255, 1923459, 1500831, 1611333, 1722435, 1630729, 1801079, 1671434, 1845925, 1454193, 1738535, 2040449, 2173705, 1595164, 1566772, 1993687, 2009783, 1585083, 1937431, 1998786, 1620230, 1971403, 2209270, 1819519, 1789996, 2195120, 2213957, 2256855, 1863166, 2366467, 2480211, 2455759, 2211920, 2806674, 2791251, 2726386, 2984160, 2792916, 2625496, 2324749, 2739868, 3011098, 3249219, 3513173, 3725459, 4196929, 4678409, 5453888, 7273678, 10756968, 19069720, 41837394, 44588393, 19122895, 7823372, 3710713, 2791304, 2572230, 3187612]
14538C187612K357487j446373j547583m61596j41325K59479l5098j56970l0303
14529A985330J35904m5712N9903L36117m5924j94523p0741J28650k79339L73103
14519B382768N2620L2242M65967j40555k36268J88211m82005K84331J29568K68070
14509B944949L4820p1833k86055K33414P4127O6408J56984O7285J17979j90954
14499C147124j2435n719K08520m28894J10492M32923N3912l42211K74885r6410
14489C342187R8612J0609O6505j97037K42592J07628N5020o9773Q667l74788M94767
14478C784989K05914J82698o0091M7239l15208N55519k61455j02227J73463o7174
14468D143667J54482q2028K93149K90414j19735K07182k67805L01432k57160p4646
$$ y = [3187612, 5545099, 4098726, 2551143, 2089547, 1948222, 2207701, 2172603, 2015633, 1985330, 2121234, 2075522, 2135425, 2471542, 2425618, 2231095, 2160354, 2289004, 2009665, 2382768, 2435388, 2467630, 2933597, 2793042, 2556774, 2744985, 2262980, 2547311, 2676879, 2944949, 2979769, 2907936, 2621881, 2855295, 2929422, 2995830, 3152814, 3220099, 3338078, 3147124, 3134689, 3128970, 3337490, 2908596, 3019088, 3452011, 3505923, 3163712, 3438597, 3342187, 3440799, 3451408, 3517913, 3320876, 3563468, 3671096, 3726116, 3656343, 3665010, 3290222, 3784989, 3990903, 4173601, 4113510, 4160749, 3845541, 4401060, 4139605, 4037378, 4210841, 4143667, 4298149, 4216121, 4509270, 4799684, 4679949, 4887131, 4619326, 4920758, 4663598, 4588952]
14458D588952N85080j58192Q0446k95295M84410q1370J94107k78088L62374k91208
14448E191216J93921K36583j22464K13925J79107m05708M77084q355J88092j88128
14438E955273K66368M05010l95532J53240L23909J80034k3145M8790j54956M25209
14428G184200k79767K70628J50510K19537r414L18882p1058N22812K9510j21122
14418H214718L96548P5827K07410j14739K8283M5826K91260o0348K02493L40733
14408I628011l25683O89106P9100o6141N01615K24748j12127J3276M14535j2608
14398A1033832l43069P29383P7090k50663P61034k67573L23713M40746j23551
14389A2380942M88196K43536K62169P1020J93962O08331L65526l26991O77878
$$ y = [4588952, 5174032, 5015840, 5096286, 4800991, 5285401, 5204031, 5398138, 5120050, 5482424, 5191216, 5385137, 5621720, 5499256, 5713181, 5892288, 5486580, 5963664, 5955309, 6143401, 5955273, 6221641, 6626651, 6231119, 6384359, 6708268, 6888302, 6865157, 6913947, 6758991, 7184200, 6904433, 7175061, 7325571, 7545108, 7535694, 7854576, 7783518, 8306330, 8335840, 8214718, 8611266, 8687093, 8894503, 8779764, 8808047, 8853873, 9145133, 9084785, 9287278, 9628011, 9302328, 9991434, 10070534, 10004393, 10506008, 10730756, 10618629, 10631905, 11046440, 11033832, 10690763, 11420146, 11497236, 11246573, 12007607, 11740034, 12063747, 12504493, 12380942, 12869138, 13112674, 13374843, 13445863, 13639825, 14248156, 14613682, 14286691, 14964569]
14380A4964569P77426k37873O3508L48706l091M41229J17185M07699P38653L23836
14370A7941847R3600M00734M74411M74163N14868L45403O77059L0527M70058J37867
14360B1560537O57291L03116M62020O55842Q25397M76319Q5938P11757J066077
14351B6804294P06377M34901O39317O41652Q35777Q44723O19167Q89453Q58247
14342C3273908J063890J218473M11420J127502J283257O49254J570675J200449
14334D1798828J160575J294531J587766R44559J542473J761809J260116J872447
14326E3223104J540344K023727J710475K493122J959375K359685K107590K438257
14318F9855679K804715K361814K806459L088879K925164L060992L627887M070241
$$ y = [14964569, 15741995, 15504122, 15567630, 15916336, 15913245, 16354474, 16471659, 16879358, 17618011, 17941847, 18035447, 18436181, 18910592, 19384755, 19899623, 20245026, 20922085, 20952612, 21422670, 21560537, 22217828, 22520944, 22982964, 23638806, 24464203, 24940522, 25026460, 25738217, 26804294, 27510671, 27945572, 28584889, 29226541, 30062318, 30907041, 31526208, 32415661, 33273908, 34337798, 35556271, 35967691, 37095193, 38378450, 39027704, 40598379, 41798828, 42959403, 44253934, 45841700, 46786259, 48328732, 50090541, 51350657, 53223104, 54763448, 56787175, 58497650, 60990772, 62950147, 65309832, 67417422, 69855679, 72660394, 75022208, 77828667, 80917546, 83842710, 86903702, 90531589, 94601830]
14310I4601830L555655M406646M132833M470860N193516M683103N398094O073149
14302A32515686N938885O478582O728826O835659Q016994P930393Q463209R015660
14294A91923894R188744J0301886J0573773J1096942J1261496J1982392J2865030
14287B69194157J3163339J3605706J3874596J4363956J4500682J4482332J4826349
14280C68011117J4025064J4487522J3085113J2624415J1628084J0471167Q174790
14273D52507272N636217L014442O28557k213565k834888l883935l922576o773469
14265D42158055r743677j1823850j3496301j4427467j5139159j5807560j5775344
14258C45944697j5694404j5405690j4994698j4737372j4409876j3224950j2971491
$$ y = [94601830, 98157485, 102564131, 106696964, 111167824, 116361340, 121044443, 126442537, 132515686, 138454571, 144933153, 151661979, 158497638, 166514632, 174445025, 182908234, 191923894, 201112638, 211414524, 221988297, 233085239, 244346735, 256329127, 269194157, 282357496, 295963202, 309837798, 324201754, 338702436, 353184768, 368011117, 382036181, 396523703, 409608816, 422233231, 433861315, 444332482, 452507272, 458143489, 461157931, 461786488, 459572923, 456738035, 452854100, 448931524, 442158055, 432414378, 420590528, 407094227, 392666760, 377527601, 361720041, 345944697, 330250293, 314844603, 299849905, 285112533, 270702657, 257477707, 244506216]
14251B44506216j2289270j2086950j0229712r395597j0189411r341107q903785
14244A72070384p693102p942918p370763o976216o469255o221119n353948n157118
14236A18885945n376448m630455m885161m507863l970186l072763l705447l582795
14228H5154827l220263l027606l052768k870195k639363k631716k360955k255352
14220F3096609k035794j739981j958139k050309j949096j606652j370422j297646
14212D9088570j677398j559939j445937j362127p81885r83990o64323j418609
14204C9194362j379763j371509r40024l52110o47349j574566o04458j010898q58950
14195C0454735n14395m77226p36792r43036p51192n36141o15577q69805n66677
$$ y = [244506216, 232216946, 220129996, 209900284, 200504687, 190315276, 180974169, 172070384, 164377282, 156434364, 149063601, 142087385, 135618130, 129397011, 124043063, 118885945, 113509497, 108879042, 103993881, 99486018, 95515832, 92443069, 88737622, 85154827, 81934564, 78906958, 75854190, 72983995, 70344632, 67712916, 65351961, 63096609, 61060815, 59320834, 57362695, 55312386, 53363290, 51756638, 50386216, 49088570, 47411172, 45851233, 44405296, 43043169, 42261284, 41277294, 40612971, 39194362, 37814599, 36443090, 35503066, 35150956, 34503607, 32929041, 32324583, 31313685, 30454735, 29940340, 29463114, 28726322, 27783286, 27032094, 26495953, 25880376, 25010571, 24443894]
14186B4443894k73435p33452n28715j88147r73792l76190J7044o82454o88975
14177B0015778l61578m36087l59789l47846k26521m02702m16444k13531k86729
14168A6964551l71977j53900m92627j98923k61498n35579m84353K05815j83663
14159A4487846l50801n51653j58428J20146n29641R210n01999j47189L63831p45828
14149A1995494J0368j89613k82264j95559j88022m18094Q8591j71254l59773P9732
14139A0369606j60954l10231j90016k04190K48631j44817k75526j38670j72426
14130I021407k34843J99659m47594j6359j78750J17475j14374p2182k07835m23860
14120G642744L07789n74953K24622j77884K7736j73446j03996k2215N150m2243
$$ y = [24443894, 24170459, 23437007, 22908292, 22720145, 21746353, 21370163, 21387207, 20704753, 20015778, 19654200, 19218113, 18858324, 18510478, 18283957, 17881255, 17464811, 17251280, 16964551, 16592574, 16438674, 15946047, 15747124, 15485626, 14950047, 14465694, 14671509, 14487846, 14137045, 13585392, 13426964, 13547110, 13017469, 13026679, 12524680, 12377491, 12741322, 11995494, 12005862, 11816249, 11533985, 11338426, 11150404, 10732310, 10820901, 10649647, 10289874, 10369606, 10208652, 9898421, 9708405, 9504215, 9752846, 9608029, 9332503, 9193833, 9021407, 8786564, 8986223, 8538629, 8522270, 8343520, 8460995, 8346621, 8274439, 8066604, 7642744, 7950533, 7375580, 7600202, 7422318, 7450054, 7276608, 7172612, 7150397, 7155547, 7113304]
14110G113304j91297l35681J94428p0647k26768n4119j11352r1932n3292K66281
14100F438925o76777K37428k36262m0875P1957j97970j28525K72832j00401j86313
14090E454019k42903J48762K64977j72607k79856R6713o9947k75880q0363O9149
14080D912064m2262o1226o9158P4598j16930K60903l94090k4478k7444j10441
14070D401536k1981j34341K62057l68203m5505M27438m78488N5191n7114J75201
14060D215791j14488r3112r3018N35318p62228L37206l68684m5084J38490p5092
14050C675099j4888q0746n4097q4434J09967j85964J28478L6070j17271J50814
14040C563028m92918K85717j80129j50005p7065Q0445j5402K62969J54824m29244
$$ y = [7113304, 6922007, 6586326, 6780754, 6710107, 6483339, 6429220, 6317868, 6225936, 6172644, 6438925, 5762148, 5999576, 5763314, 5722439, 5794396, 5596426, 5467901, 5740733, 5640332, 5454019, 5211116, 5359878, 5624855, 5452248, 5172392, 5269105, 5199158, 4923278, 4842915, 4912064, 4869802, 4808576, 4739418, 4814016, 4697086, 4957989, 4563899, 4539421, 4511977, 4401536, 4379555, 4245214, 4507271, 4139068, 4093563, 4521001, 4042513, 4097704, 4040590, 4215791, 4101303, 4008191, 3915173, 4450491, 3688263, 4025469, 3656785, 3611701, 3750191, 3675099, 3660211, 3579465, 3525368, 3440934, 3550901, 3364937, 3493415, 3529485, 3412214, 3563028, 3070110, 3355827, 3175698, 3025693, 2948628, 3029073, 3013671, 3276640, 3431464, 3002220]
14030C002220K74924k1149j88806j34288J44208n4179k48634j22119K38166j91075
14020B699268J82289k74637l03678O66356m85088K43909m41725L04510l1485j7102
14010B542617J68227j95185j36129J37733j5843J01298l19883L81122n37214L51096
14000B477839n60795N10303n90435M10435J74213r7825k75556M6968K30896L20098
13990B646141J40972P47297J824689O144105K1200063J5924819k1644508j3290259
13982A3693319n484470k470238j180930q48457l62152j3622k03620j13326O2673
13973C079177l77672K91207k19899l97088L53824m09994o7207J44844K22731n97772
13963B022151K41533k95301L07181J65013m73934L70622l2057j38638J3825l73965
$$ y = [3002220, 3277144, 3255995, 3067189, 2932901, 3077109, 3022930, 2774296, 2652177, 2890343, 2699268, 2881557, 2606920, 2303242, 2969598, 2484510, 2728419, 2286694, 2591204, 2559719, 2542617, 2710844, 2515659, 2379530, 2517263, 2501420, 2602718, 2282835, 2663957, 2126743, 2477839, 1917044, 2427347, 1836912, 2247347, 2421560, 2323735, 2048179, 2095147, 2326043, 2646141, 2787113, 3534410, 5359099, 11503204, 32703267, 48628086, 26983578, 13693319, 8208849, 5738611, 4557681, 3709224, 3347072, 3333450, 3129830, 3016504, 3079177, 2701505, 2992712, 2772813, 2375725, 2729549, 2319555, 2252348, 2397192, 2619923, 2022151, 2263684, 1968383, 2275564, 2440577, 1966643, 2337265, 2305208, 2166570, 2180395, 1806430]
13953A806430J42299K66593l82644Q9249J68348o6021q6747q0656o0353K14006
13943B010504j62461J90592k6355J06930n07231K25645j09098K8308k07657K39741
13933A788918j57814k1527K36013m23000L72325k08831J66977o8688q2133N9602
13923A661842l28884L39992l25743M21566n3997j5770l9003k925l52395L8966
13913A343649K61634k08k97957J95942j09445O0268k82254M72901j09953k40039
13903A294538L5137p1097j0342N0322k47736M91606l68442N4319J30543j18664
13893A240184K36235k20818k02569N18237k02932L9018m73546K39815o9216O524
13883A110932j41047K41883l906n3638r5392O06752l32572l2090l5664k88882
$$ y = [1806430, 1948729, 2215322, 1832678, 1921927, 2090275, 2024254, 1937507, 1856851, 1796498, 2010504, 1848043, 2038635, 2012280, 2119210, 1611979, 1837624, 1728526, 1756834, 1549177, 1788918, 1631104, 1609577, 1845590, 1422590, 1794915, 1586084, 1753061, 1684373, 1602240, 1661842, 1332958, 1672950, 1347207, 1768773, 1714776, 1699006, 1660003, 1657078, 1304683, 1343649, 1605283, 1605075, 1307118, 1503060, 1393615, 1453883, 1171629, 1644530, 1534577, 1294538, 1329675, 1258578, 1248236, 1298558, 1050822, 1542428, 1173986, 1228305, 1358848, 1240184, 1476419, 1255601, 1053032, 1571269, 1368337, 1407355, 933809, 1173624, 1104408, 1110932, 969885, 1211768, 1207862, 1154224, 1058832, 1665584, 1333012, 1300922, 1265258, 976376]
13873I76376K31234j71034O7745j93516K24549O3070M05178l69410J22268k32556
13863A123904j89767K12134J51684l3313J6655k88283N982N03978m16588l04565
13853G81821P28098m46353p7873K3660n053L1119L32361k18570j23235j8720o064
13842A001191k73269L86312l90943O85994n81084K28390J67497k77214j15281
13833H31593j41327M55137k01222k85461m5236M41285k32775J88268j69667J7487
13823H58082J89619K46275o29203N53968l43641R9982O248k41966J35353j24855
13813G49862L14407l95803M77682k09058j42190L18763l31674L04916j2270m9567
13803A025068P1724J8863l59485j50665J16764J09725j80973J07650k6055j37245
$$ y = [976376, 1207610, 1036576, 1104321, 910805, 1135354, 1198424, 1603602, 1234192, 1356460, 1123904, 934137, 1146271, 1297955, 1264642, 1281297, 993014, 998996, 1502974, 1086386, 781821, 1509919, 1063566, 985693, 1009353, 1004300, 1035419, 1367780, 1149210, 1025975, 1007255, 1001191, 727922, 1114234, 723291, 1409285, 828201, 1056591, 1224088, 946874, 831593, 690266, 1145403, 944181, 658720, 613484, 1054769, 821994, 1010262, 840595, 858082, 1047701, 1293976, 664773, 1218741, 875100, 975082, 981330, 739364, 874717, 749862, 1064269, 668466, 1146148, 937090, 794900, 1113663, 781989, 1086905, 1074635, 1025068, 1096792, 1115655, 756170, 605505, 722269, 831994, 651021, 758671, 732616, 595371]
13793E95371M02112m48997L52007n5933j68625Q2170M9875l4936M87611o25622
13783F35033J71774L51981n68742K43071o1305J94893l11707J41644k8535J66003
13773I34110k639D33764L04047p8467N8134j13934m4930R0888j09934q0980N8083
13762E16671o3220L35851n253k68355J75592M90777l95834k27384N95927n64916
13752E89856K12515l21485M19598m12438J88456M9638k4237N7749q5117k89981
13742C84554R5993j52071K98763L7463k6977L8674j25909k5312Q3490n4466L51755
13731I05957D10369Q1505K89109j48543k1560O6167k44531R2505J62102n0575
13721F36548J45918j20907K01807A74159N65507k41283J57137l0390k96657K12601
$$ y = [595371, 997483, 548486, 900493, 844560, 675935, 758105, 807980, 773044, 1260655, 635033, 806807, 1158788, 590046, 833117, 771812, 966705, 654998, 796642, 768107, 934110, 931471, 433764, 737811, 659344, 717478, 603544, 558614, 649502, 539568, 458588, 516671, 453451, 789302, 784049, 515694, 691286, 1182063, 786229, 558845, 1154772, 589856, 802371, 480886, 900484, 488046, 676502, 726140, 701903, 759652, 674535, 384554, 480547, 328476, 627239, 664702, 637725, 676399, 550490, 525178, 608668, 554202, 905957, 410369, 491874, 780983, 632440, 610880, 677047, 432516, 525021, 687123, 636548, 782466, 661559, 863366, 174159, 739666, 498383, 655520, 625130, 328473, 541074]
13711E41074r9718A50044L09686K93998J32473k25328C22513K53788j1889L2663
13701E97075q4823j47083M17747k29815p5848Q6873q7375p4732K98096j52570
13691E47545j30381J22926F2288K44822J54481J39696k34628K52883B82770q0431
13681B02339J97284K18591J98080C80849L9583J70298k47200J25747K84274n9122
13671F94429l6317k46903K17186Q258C11548j42699J44687J17423L05243r9267
13661F36935k45207K95215j52970r9455J38104m6024B02780K90742J85064k93555
13651C85031C2955L18152G2107K70430l1311J56315q133A95971J67956r1592K20957
13640D93292L7661D1692O14517j24929j99035M7486K370l1750j15268J14343K45697
$$ y = [541074, 441356, 150044, 459730, 753728, 886201, 660873, 322513, 576301, 564412, 597075, 512252, 365169, 782916, 553101, 477253, 564126, 476751, 402019, 700115, 547545, 417164, 540090, 62288, 307110, 461591, 601287, 366659, 619542, 282770, 202339, 399623, 618214, 816294, 380849, 420432, 590730, 343530, 469277, 753551, 694429, 658112, 411209, 628395, 636653, 311548, 168849, 313536, 430959, 736202, 636935, 391728, 686943, 533973, 434518, 572622, 526598, 202780, 493522, 678586, 385031, 32955, 351107, 72107, 342537, 311226, 467541, 459408, 195971, 363927, 272335, 493292, 530953, 41692, 656209, 531280, 332245, 379731, 382101, 350351, 235083, 349426, 595123]
13629E95123A62551K11409j51089L74619c63053E62242K76411k75466B29247Q7907
13619C17154K30065j52006J52758C6358N52829A95640L54263Q0160B68916O8872
13609C37788A31707J37530L6940L08439H9132M75961A54592J53663J77618A2639
13598D35418K56352A79434K42319j9653A81892J93117K04530B43948R8145G7104
13587C09855L46539A64664M17153n4583j56863K09120k32303j05412A04878L22115
13577D26993j46437l7116j06889J08517J35102K47422l02336o7243j21193J65855
13567C02675p9381J14667L01823B94798K8483L50340A94134l8579N04607k71683
13557C88479M9460r5448A02986M91921G9994J74830L1747Q3001J13242B28215
$$ y = [595123, 162551, 373960, 222871, 597490, -363053, 562242, 838653, 563187, 229247, 317154, 547219, 395213, 547971, 36358, 589187, 195640, 549903, 630063, 268916, 337788, 131707, 269237, 306177, 614616, 89132, 565093, 154592, 308255, 485873, 12639, 435418, 691770, 179434, 421753, 402100, 181892, 375009, 579539, 243948, 342093, 77104, 309855, 656394, 164664, 581817, 527234, 370371, 579491, 347188, 241776, 104878, 426993, 280556, 243440, 136551, 245068, 380170, 627592, 325256, 258013, 136820, 302675, 223294, 337961, 639784, 294798, 323281, 673621, 194134, 155555, 660162, 388479, 437939, 342491, 102986, 594907, 79994, 254824, 286571, 369572, 482814, 228215]
13546C61437A37856O75682l12693A72265K82618A56031M0569K97369j18061J52448
13536E28356k26289L12862B71986J46816N9037K03417A87084K97432B21508b1868
13525A50144L41754A98581Q1424K01021j62665J02828L4897A54708M70366k66426
13515C58648J61031B28185M5106K58230A87275O8950A8433K2926b3284m3134C00902
13503C93765j16671J08247j26259l2295J24989Q7458n7054j25406L22862k35950
13493C43686J10383D9151Q725J46269b38824A78540l1746D4365J58870J07361
13483C10596l4162E8118f8258B08323J50205m6484a45771f7733A25221P1772l2213
13472A64780J99330J16251I1025J58327r6323B2508L74974A88390a3099A27942
$$ y = [361437, 137856, 813538, 500845, 172265, 454883, 156031, 196600, 493969, 375908, 528356, 302067, 614929, 271986, 418802, 477839, 681256, 187084, 484516, 221508, -21868, 150144, 491898, 198581, 280005, 481026, 318361, 421189, 456086, 154708, 625074, 358648, 519679, 228185, 273291, 531521, 187275, 256225, 18433, 41359, -23284, -66418, 300902, 393765, 277094, 385341, 259082, 226787, 351776, 439234, 382180, 256774, 579636, 343686, 454069, 49151, 57876, 204145, -238824, 178540, 146794, 44365, 203235, 310596, 276434, 58118, -68258, 208323, 358528, 312044, -145771, -67733, 125221, 196993, 164780, 364110, 480361, 91025, 249352, 153029, 22508, 397482, 188390, -13099, 127942]
13461B85514R5207j0577f5433D46620G4850a62935A55333a98106c3307j73533
13451b06840A27789J7587O90072d355B64676G2358Q6585k5738J91737a3313D13368
13439c6484B00057J58430A50497F6513L38132N7112k30069A11981J5839E2522
13428B11281C0813J97027c4327C90142A67943d1468a7299K822H2851L04385E8486
13416D39435A37888K8748B9382K59065o4453k390J23709G7534J00285J49374M5839
13405C73032A55338K29738f3029A09527K04239F4176P9589J45562I3847M9239
13395A43086J62342a3665D53713B9756N2111J1426a8727G3926O4311J04871K96795
13384E39903A68853M5986J5419D8018R075J91970A21327J55158J67780G8912L38264
$$ y = [285514, 380721, 370144, -65433, 446620, 74850, -162935, 155333, -198106, -33307, -206840, 127789, 145376, 835448, -4355, 264676, 72358, 158943, 133205, 324942, -13313, 413368, -36484, 200057, 358487, 150497, 66513, 404645, 461757, 231688, 111981, 127820, 52522, 211281, 30813, 227840, -34327, 390142, 167943, -41468, -17299, -14477, 82851, 387236, 58486, 439435, 137888, 166636, 29382, 288447, 223994, 221604, 345313, 77534, 177819, 327193, 373032, 155338, 385076, -63029, 109527, 313766, 64176, 143765, 289327, 93847, 143086, 305428, -13665, 453713, 29756, 81867, 93293, -18727, 73926, 138237, 243108, 539903, 168853, 214839, 230258, 48018, 57093, 249063, 121327, 276485, 444265, 78912, 417176]
13373D17176j10015Q234q5156M970l969K13723N4378B39748J4717K48656J70913
13362F74034j95923C270O2219L09273J94974k29137A15303l9618K46847p287J62851
13351D78096j32623I8828K69184l2924A54098M69649k96225a20505B60272k4485
13341B35787R3131r7268J68331p035J1834J19155j0912A47952A3045J15488m7962
13330H0571k350L23274F0982K07696j18635K49246F2856J38353J08055P95B4587
13318C05341q393q856J82111G8651b3071B32827p6501F6839M43610A59701a12215
13306B08262K48513A72465H2085M0790J8904J72763p5110k2780K92634k27198
13296B82088R930N540C7820K54236a94270I1519b11121A19350D7411e2749B01321
$$ y = [417176, 307161, 315395, 230239, 235209, 231240, 444963, 499341, 239748, 254465, 503121, 674034, 478111, 3270, 65489, 374762, 569736, 340599, 115303, 75685, 322532, 315245, 478096, 345473, 98828, 368012, 335088, 154098, 623747, 327522, -120505, 260272, 235787, 328918, 231650, 399981, 392946, 404780, 523935, 513023, 147952, 13045, 128533, 80571, 78221, 401495, 60982, 268678, 150043, 399289, 62856, 201209, 309264, 310059, 24587, 305341, 296948, 288092, 470203, 78651, -23071, 232827, 156326, 66839, 510449, 159701, -112215, 208262, 456775, 172465, 82085, 122875, 141779, 314542, 239432, 216652, 509286, 282088, 292018, 297558, 37820, 292056, -194270, 91519, -211121, 119350, 47411, -52749, 201321]
13284g5153B07671J29302a25942D83980G7748J46092F5881P9594Q8279N0633J9735
13273C04122a75908d2929A92086B7300f4288B78420C2091O5483M3964n0936N9195
13262A49797J0685a30236C10056r9706r3412a14407B06300r0023E6712q339P2778
13251A21151L64585d7537q0636B1355L4702K32807Q1058j64886H0750C5315a57200
13239A58430Q3625o4941a53060B78056F0252J79095A2790K5345a16090B73704
13228C48354b73477A05414L32200l4425H3045J33368K28080B18576l1589J26033
13218C13020j42144c8763n2063A18388M34315A46427J0672p1042K26713c5591
13207I5216J87413a38562H0707b24997A90709a92809H6785j1049J721P8221p2105
$$ y = [-75153, 207671, 336973, -125942, 483980, 77748, 223840, 65881, 145475, 233754, 284387, 304122, -175908, -42929, 192086, 27300, -64288, 278420, 32091, 97574, 141538, 90602, 149797, 160482, -130236, 310056, 210350, 116938, -114407, 206300, 116277, 56712, 48373, 121151, 485736, -47537, -128173, 21355, 56057, 288864, 369922, 205036, 80750, 35315, -157200, 158430, 242055, 177114, -153060, 278056, 60252, 239347, 12790, 38135, -116090, 273704, 348354, -273477, 105414, 437614, 403189, 83045, 216413, 444493, 218576, 186987, 313020, 170876, -38763, -90826, 118388, 552703, 146427, 157099, 86057, 312770, -35591, 95216, 282629, -138562, 80707, -224997, 190709, -192809, 86785, 75736, 77457, 155678, 83573]
13196H3573b18235A37833h6460F6671J21406E0164K4493J64271r7087P8131I2247
13184A07464K48818A36802K5203b92946C53189A74454J6467l4989m4830L05913
13174D17015B07657A02775A189J71032J58904f9858B62740O8282I8238k0035B0557
13162d0111J4367C07384A02442K46756K8547g7962F2449B7598a17217C90664A27714
13150B49220Q2884D6280b43756N1878C36483D1787N8131k1904K720R5526a417
13138D7225A4091O1901A8207a78993h4870k4398L3307I6683M4191f9878G848O10
13126H458J47225O5071a17205A38661c423E16210a81417P3026K6285C83245A76465
13114D10401j63755f4413D29350A46183k9830b68118A77873o0407d07449A71465
$$ y = [83573, -218235, 137833, -86460, 66671, 188077, 50164, 74657, 238928, 141841, 219972, 92247, 107464, 356282, 136802, 162005, -292946, 353189, 174454, 190921, 155932, 111102, 417015, 207657, 102775, 1189, 172221, 331125, -69858, 262740, 331022, 98238, 78203, 20557, -40111, -25744, 307384, 102442, 349198, 377745, -77962, 62449, 27598, -117217, 390664, 127714, 249220, 332104, 46280, -243756, -191878, 336483, 41787, 99918, 78014, 80734, 176260, -1417, 47225, 14091, 75992, 18207, -178993, -84870, -109268, -75961, 96683, 140874, -69878, 7848, 8458, 155683, 220754, -117205, 138661, -3423, 516210, -181417, -108391, -82106, 383245, 176465, 410401, 246646, -64413, 429350, 146183, 116353, -268118, 177873, 117466, -407449, 171465]
13103a79668A47120l0494e065A60999C1874a28116C52150A12389a59531A84260
13092b4148B65663J43521j44086b3786k43538B17356J3685h8661C47615a7900
13081h1390E4858a7535I3451L2381J56304k4389A9542d5647e857A66828d1175
13069b5692o387l29883A03572J3987a66141C8967K70061r3143a70332C55478j59574
13058A95904H2955N3194C3918g9692B92343p4733L0031K6231G8322h3693B23208
13046A71816b03621A98549N9609a1393B5635J06801c0582n9511C23725q0656j296
13035B41773j14176B9471h0975C33088G2055g4422m1726A12455E1498c29587C13138
13023B49274j04052M6953L1118H5879K92143j35764A14163K22946a36796M8433
$$ y = [-179668, 147120, 116626, -5065, 160999, 31874, -128116, 352150, 112389, -159531, 184260, -24148, 265663, 409184, 265098, -23786, -267324, 217356, 231041, -88661, 347615, -17900, -81390, 54858, -17535, 93451, 125832, 282136, 257747, 19542, -45647, -5857, 166828, -41175, -25692, -32079, -361962, 103572, 117559, -166141, 38967, 309028, 215885, -170332, 355478, 195904, 82955, 136149, 33918, -79692, 292343, 217610, 247641, 273872, 78322, -83693, 223208, 171816, -203621, 198549, 258158, -11393, 25635, 132436, -30582, -90093, 323725, 243069, 241773, 127597, 29471, -80975, 333088, 72055, -74422, -116148, 112455, 51498, -329587, 313138, 249274, 145222, 192175, 223293, 85879, 378022, 242258, 114163, 337109, -136796, -88363]
13013h8363G1488d4139A58065a45213C25544a32697e8435D75109A58928L9216
13003A98144l846b42940F1696K59456H4227K55948a59723B80300a5083B25172
12992a42375K6111j90410I3870a02802b9185j41339G6993K7850a34283E5349K42944
12981B98293J52555a21105N0943q9585C5738K79920c8896J8611r6806p0799E344
12969A14305b7638I6809L18221H2482d4053A94179r6947L7677n6854e9130B2218
12957E2159K52906a66207G2033c9668p3362A6551J07237R5952m5326J01142d9388
12945B07381b22538B7456R6266g5846J2836I4484c45942a72779e5213k2326H9567
12933a44370l338m4345B31627b04901M4470R898F4942b80719P1233F0221A65K12543
$$ y = [-88363, 71488, -44139, 158065, -145213, 325544, -132697, -58435, 475109, 158928, 198144, 194298, -242940, 61696, 321152, 84227, 340175, -159723, 280300, -15083, 225172, -142375, -116264, -306674, 93870, -102802, -29185, -170524, 76993, 104843, -134283, 55349, 298293, 450848, -121105, -70162, -159747, 35738, 315658, -38896, -20285, -117091, -187890, 5344, 114305, -27638, 96809, 415030, 82482, -44053, 194179, 97232, 134909, 78055, -59130, 22218, 52159, 305065, -166207, 72033, -39668, -113030, 16551, 123788, 219740, 174414, 275556, -49388, 207381, -222538, 27456, 123722, -75846, -63010, 94484, -345942, -172779, -55213, -77539, 89567, -144370, -147708, -192053, 231627, -204901, -160431, -150533, 64942, -280719, -209486, 60221, 165, 212708]
12921B12708c868D25455A74318J33952A50294a01524C08408J12212a38376B36989
12910h8573I020b6064j91671A62752j8482k0355A8771K10336c5606B22254R6336
12899C18590j43348a33916C35202C0496a0950n632A81881q6596b1060N016j24261
12888a40305j9203B83222d0210A9667c12019c3802H005h0268j7773C95036a83879
12876A01957r480j999J06196o7999a15511B14176e070A12550E2674a24695E6434
12864a73224A69963b49194A50104a22159F8229a69021D03676a4867k9860D6916
12853I1020A3191a0730n7468B41706c0774F999J92003J8411c3477C6551J39490
12842A76041M4991G7429I120K03208A00672k1625B9622J91400A172L8553a08777
$$ y = [212708, -3868, 425455, 174318, 308270, 150294, -101524, 308408, 420620, -138376, 236989, -88573, 9020, -26064, -217735, 162752, 144270, 123915, 18771, 229107, -35606, 222254, 318590, 175242, -133916, 335202, 30496, -10950, -16582, 181881, 95285, -21060, -16044, -140305, -159508, 283222, -40210, 19667, -312019, -33802, 8005, -80268, -98041, 395036, -183879, 101957, 92477, 90478, 196674, 128675, -115511, 214176, -5070, 112550, 52674, -124695, 56434, -173224, 169963, -249194, 150104, -122159, 68229, -169021, 403676, -14867, -44727, 46916, 91020, 13191, -10730, -68198, 241706, -30774, 6999, 199002, 217413, -33477, 36551, 176041, 221032, 77429, 9120, 212328, 100672, 79047, 29622, 221022, 1172, 39725, -108777]
12830b04008A49432b85027B33646E7810J13797o8973f1158l34838a06102A29c6154
12818A53202G5436c58358A42679J31769a6704A19240E4490J00329A7576P3610
12808I1186a71627C228g291l2221F7190b0970B81795j16933f8598F0636c41251
12796B40571C3646c10238b288A82636f9554j51579B50673F3215a30467a3274E037
12784a85B04024b11825A14778a53136A28915d6239o9229M2124J2458D9070c08048
12772A85801J6607k4517a1661B8826b75806I2189d05699A42905F1951c3248A88254
12760b01396b71n4531l7470j7987F4492c04426h4765o5463K1040d6892E4445A3769
12747b9284j93352l0178P5111O3398q3576C0744P5229J48537a49249A38863a34786
$$ y = [-204008, 149432, -285027, 233646, 57810, 171607, 102634, -61158, -395996, -106102, 129, -36154, 153202, 75436, -358358, 142679, 274448, -16704, 119240, 54490, 154819, 17576, 91186, -171627, 3228, -7291, -39512, 67190, -20970, 281795, 164862, -68598, 60636, -341251, 240571, 33646, -310238, -2288, 182636, -69554, -221133, 250673, 63215, -130467, -13274, 5037, -185, 204024, -211825, 114778, -153136, 128915, -46239, -115468, -73344, -60886, 49070, -308048, 185801, 202408, 177891, -11661, 28826, -275806, 92189, -405699, 142905, 61951, -33248, 188254, -201396, -271, -54802, -92272, -110259, 64492, -304426, -84765, -150228, -129188, -46892, 54445, 13769, -29284, -222636, -252814, -177703, -114305, -197881, 30744, 105973, 254510, -149249, 138863, -134786]
12735B39384h0505D22164A61236c75328g0832r8983O1329A97841e678A27309B4291
12723B58746a61279C48336F8927J09686r79m4220K12313q7009E7157a95349P6536
12712a18813a1238C0391m672Q2322O7201q0185j5701R9606R3690J6180A04a21262
12699F5248k3755J7344a18760J4466F2783K20796J66060b45336A82074a0678j71033
12688a81711h0409j9575A72642D8251J8329J93616K6569l1285j25258k4346M8020
12677A53896C5057M4020J06173F2036J11850N02001A97761a33722E5181J58357
12667B13538b08651A11101a11045o8205I7821a53470A94255p9778g8472D6356
12656D52711B6157P5757O3350o8302d7862j36554B38565h1474c2373A54588n7544
$$ y = [239384, -80505, 422164, 161236, -375328, -70832, -169815, -108486, 197841, -5678, 127309, 24291, 258746, -161279, 348336, 68927, 178613, 177634, 133414, 345727, 258718, 57157, -195349, -118813, -11238, 30391, 25719, 108041, 175242, 95057, 79356, 178962, 272652, 288832, 104, -121262, 65248, 41493, 58837, -118760, -104294, 62783, 283579, 449639, -245336, 182074, -10678, -181711, -80409, -99984, 172642, 48251, 66580, 260196, 286765, 255480, 130222, 105876, 153896, 35057, 79077, 185250, 62036, 173886, 675887, 197761, -133722, 55181, 213538, -208651, 111101, -111045, -179250, 97821, -153470, 194255, 114477, -78472, 46356, 452711, 26157, 101914, 165264, 96962, -47862, -184416, 238565, -81474, -32373, 154588, 97044]
12645I7044b46849R4725H4384a18541a7686B11804b16493M5816e453A88802q2375
12634A06427b3252A44272d9617A70214J90782f9879A70456P834a11253F5826Q4342
12623A50168a83520D05665A84671K00450F5091J40360M731p9426g4692k21086
12613b95778a0018j34332f5725e277j36764A73031k6710J65001A36879c4516A46578
12601d5089j4618A28315J06536A5317L65154A72130j803o3990a45990a4336A83003
12589a52797A00663D3359J36464o2910a41923c223B08096b16126D7583J17312
12579A64895K1116b17629B93528b8307j62098p4394B01906K13868B7744d29249
12568b13047d8658C30956i7595b7581o3526F2966a17972p324A01311P7900K10195
$$ y = [97044, -246849, -152124, 84384, -118541, -17686, 211804, -216493, -170677, -5453, 188802, 106427, -23252, 144272, -49617, 170214, 360996, -69879, 170456, 178290, -111253, 65826, 150168, -183520, 405665, 184671, 385121, 65091, 205451, 210182, 130756, -74692, -295778, -10018, -144350, -65725, -5277, -142041, 173031, 146321, 311322, 136879, -34516, 146578, -45089, -59707, 128315, 234851, 15317, 380471, 172130, 170327, 106337, -145990, -14336, 183003, -152797, 100663, 43359, 179823, 116913, -141923, -3223, 208096, -216126, 47583, 164895, 186011, -217629, 293528, -28307, -190405, -264799, 201906, 415774, 27744, -429249, -213047, -48658, 330956, -97595, -27581, -91107, 62966, -117972, -125296, 101311, 179211, 389406]
12557C89406f8671A20097n6175B6634O8618O9427c38578a11064A4134K12125C1223
12545E8K22029D378b12590A55920a33999M7502l5413A10917O6104Q5099A27373
12533A17472b5064l9083m812B73366I0338J48242a37275d6747m4979d1075n5915
12522i6990k00614B1851c4882E0287L4605J2552J30673c3123A99650B902M13315
12511D16217E5982b90502A10854J26079b03786C58434F8850h5723C10588j42616
12501A67972a36579G3107J75986a00694C6333K3830a03526J3217l431m557B36950
12489A3486J69716E1974b40592c9312j60201H5116K6473a31828G4340K23151r4891
12478B02600M1707A05091J4968D0697O3311M913l1287j6234J25670k6199a22812
$$ y = [389406, -68671, 120097, 63922, 26634, 95252, 164679, -338578, -111064, 14134, 226259, 31223, 58, 222087, 4378, -212590, 155920, -133999, -86497, -121910, 110917, 177021, 262120, 127373, 117472, -25064, -64147, -68959, 273366, 90338, 238580, -137275, -46747, -91726, -41075, -96990, -297604, 21851, -34882, 50287, 84892, 97444, 228117, -33123, 199650, 2902, 416217, 55982, -290502, 110854, 236933, -203786, 358434, 68850, -85723, 310588, 167972, -136579, 73107, 249093, -100694, 36333, 60163, -103526, -90309, -93740, -98297, 236950, 13486, 183202, 51974, -240592, -39312, -199513, 85116, 111589, -131828, 74340, 297491, 202600, 244307, 105091, 120059, 40697, 104008, 108921, 77634, 61400, 187070, 160871, -122812]
12466d0664k32408A45201b18881H9480c41017f6010j79816M6601B9643L01624
12456C31267a83210l672L5417D7343e51614i7698P802E9062d2667A86872R0562
12445B77434d641B53151b44038i5114A04020a10893l11075C03106F5194O0064
12435A25258F1816P889b02271j22005B98336G1224k8343J9161c17392E8633e0893
12423I2597M2701D3829K32615J546G8857J40983a86356G0739c1283A706K2408
12412B4114a09622j17392a4577A66284c5341j59607n9066B79866a92027C06930
12401A79266E9165a46619C13958B1669M39918c04698a21195b7080j47907j3503
12391a88490A01916g1814D1411a06449F5315a95024l2905B9814g0605E52598B14000
$$ y = [-40664, -273072, 145201, -218881, 89480, -341017, -66010, -245826, -199225, 29643, 331267, -183210, -186882, -151465, 47343, -551614, -97698, -89896, 59062, -42667, 186872, 277434, -4641, 253151, -244038, -95114, 104020, -110893, -421968, 303106, 65194, 125258, 61816, 69705, -202271, -324276, 298336, 71224, 42881, 62042, -317392, 58633, -50893, 92597, 135298, 43829, 276444, 277990, 78857, 219840, -186356, 70739, -31283, 1706, 24114, -109622, -227014, -14577, 166284, -35341, -194948, -254014, 279866, -192027, 306930, 179266, 59165, -146619, 313958, 21669, 461587, -304698, -121195, -27080, -174987, -188490, 101916, -71814, 41411, -106449, 65315, -195024, -227929, 29814, -70605, 552598, 214000]
12379b7513I9697k4521A416K07762b25866i2151F7922l777e3151H2949e4401A09547
12366e7535j45258L7963D0922e2044B8643J29967F3698A0865b46768F4942g7031
12354a91861A83086o9649H908b96546G5632e3941j40113A35395D5160a66371A42435
12342D9332A1298J43671F4031k4773c5470j28338c040B56195e5929C08898O7526
12331C76424j59937j9952L536R2990a6737C66550N0224A60754M34060B48715M98649
12320G47364H2111b5192B27356J53447I4525N2676E1958K61029Q5717b32904g0743
12308B5747a63193A01740a5081B11924F2043K09864q9827a5772D627J90017J29692
12297C24336f6910H8968Q1978a73020C4988J33306K14365I9957Q4915q8914C1420
$$ y = [-27513, 99697, 75176, 1416, 209178, -225866, -92151, 67922, 64145, -53151, 82949, -54401, 109547, -57535, -202793, -164830, 40922, -52044, 28643, 158610, 63698, 10865, -246768, 64942, -77031, -191861, 183086, 113437, 8908, -296546, 75632, -53941, -194054, 135395, 45160, -166371, 142435, 49332, 11298, 154969, 64031, 39258, -35470, -163808, -3040, 256195, -55929, 308898, 376424, 216487, 196535, 200071, 293061, -16737, 366550, 416774, 160754, 594814, 248715, 747364, 82111, -25192, 227356, 380803, 94525, 147201, 51958, 312987, 398704, -232904, -70743, 25747, -163193, 101740, -15081, 211924, 62043, 271907, 182080, -15772, 4627, 194644, 324336, -66910, 88968, 170946, -173020, 34988, 168294, 382659, 99957, 184872, 95958, 31420]
12285A54304d5285R355B2172J71835f6972H9170f0546A62646J27173G624L97089
12274D04713J02914j74763A58361Q4494L33782G2738a23469A94084k3868k4592
12264A45624P8419k35j05527a03047B09527R8938A2339J28939N0647B0185Q9808
12253A09993l0476J07288K41998a83541M2309B13665r8568L32622j36836j03687
12243B07196H6711K25279A04808E495L69410q8970j9924G2142O5233M527b7392
12231G4560m612K24529j26399a7013B54666E6000K00263k7366J74611P5673j12698
12220C66483o9262Q2175A83518K08557l053j03194K32623B08137p9190P129n1686
12209H4390J4643c0071B69864J48130b1019B05678k263d6930B01280k5837K23006
$$ y = [154304, -45285, -35930, 22172, 194007, -66972, 89170, -60546, 162646, 289819, 7624, 404713, 507627, 332864, 158361, 242855, 576637, 72738, -123469, 194084, 170216, 145624, 224043, 223808, 118281, -103047, 209527, 308465, 12339, 141278, 191925, 20185, 109993, 79517, 186805, 428803, -183541, -141232, 213665, 115097, 447719, 310883, 207196, 86711, 311990, 104808, 5495, 374905, 285935, 266011, 72142, 137375, 141902, -27392, 74560, 69948, 294477, 168078, -17013, 254666, 56000, 256263, 228897, 403508, 479181, 366483, 297221, 379396, 183518, 392075, 389022, 285828, 518451, 208137, 128947, 136076, 84390, 99033, -30071, 269864, 417994, -21019, 205678, 203415, -46930, 201280, 175443, 398449]
12198C98449D7892J19029a16443D48871A23823O8411J22229l1805A37505K32894
12188C70399J68797B38809F6121K71264L00101A9219a7100C3626J3210a51498
12177A10491i9045B26110b8612G1241K3542f8167F2152k2998a33561A33405L81151
12166E14556C9908J96413J27402P23R5864A22953K43240J18038k15315f3665I6279
12154A76956J1547L1025a38988E8253c31484c1642A39316O8544N1700l2469i4284
12142B06739K5194b6653m873B66758j12441j504l6956K49687e1904a8131j06900
12131a25031C22672D0967f3231C48859j01788C3465J18166F6847K68729A31640
12120i2074A4542O6140L16988a94868R3009A31060e8513D99579A35964L0335l6568
$$ y = [398449, 47892, 166921, -116443, 448871, 123823, 192234, 314463, 282658, 137505, 370399, 539196, 238809, 66121, 337385, 637486, 19219, -17100, 33626, 46836, -151498, 110491, -99045, 226110, -28612, 71241, 94783, -68167, 62152, 39154, -133561, 133405, 514556, 39908, 236321, 363723, 364446, 460310, 122953, 366193, 484231, 268916, -63665, 96279, 176956, 188503, 219528, -138988, 58253, -331484, -31642, 139316, 207860, 259560, 227091, -94284, 206739, 231933, -26653, -31526, 266758, 154317, 152813, 115857, 365544, -51904, -18131, -125031, 322672, 40967, -63231, 348859, 247071, 33465, 151631, 66847, 335576, 131640, -92074, 14542, 80682, 397670, -194868, -101859, 131060, -58513, 499579, 135964, 166299, 129731]
12109A29731O9037I8627J13292O4760e1444a5168p6989A5970L0094f0214j44557
12098b04771F9641b3043j15754o6769L1650G5212K5427a61878A55911a11490B37211
12086a2939G8439R6374O5344a44665B96747r58j06117b48547C69504j47742j08479
12075A13283b15702C44065A15832K22841n6376j27605K52132A19055M34430k18742
12065C34743A14065L8973c2368B47520R2523J12700j30704A16646J1300o3574
12055F4372O3648a2978A81457a1356n0747I7595J35087m3984b58499f9317l1308
12044a00625A41311b5637A4320J00678K99667j80565n9938b8360B99771A7144
12033C1002a81073F6036a07827A86171b64817A66993b37322B18500g098A46356
$$ y = [129731, 198768, 98627, 211919, 276679, -51444, -15168, -92157, 15970, 46064, -60214, -204771, 69641, -23043, -138797, -205566, -173916, 75212, 100639, -161878, 155911, -111490, 237211, -12939, 78439, 174813, 240157, -144665, 296747, 295789, 189672, -248547, 369504, 221762, 113283, -215702, 344065, 115832, 338673, 282297, 154692, 406824, 119055, 553485, 334743, 114065, 153038, -32368, 247520, 340043, 452743, 322039, 116646, 127946, 64372, 128020, -12978, 181457, -11356, -62103, 97595, 232682, 188698, -258499, -69317, -100625, 141311, -25637, 14320, 114998, 414665, 234100, 174162, -28360, 299771, 17144, 31002, -181073, 66036, -107827, 186171, -264817, 166993, -237322, 218500, -7098, 146356]
12022a13528I4676J04143O8463b04312b340B30863a23392A43931N0537j7357c2848
12010A70761b72720A17905g4852A02380J8907C828K77834a11581d0138J2160B22560
11998B86069a7116A56410a57869B95462o5175I2018a94980B31807L4413A17430
11987a46418c2751A63889E9778h6175F7306a90465N3429p4656C761P3234K74989
11976C51984j33009M4828d4824p1384j27846j7417h3244k25461J52721E4448a19066
11964a65538A84702f5244n6315G2180N8238g4621k39201f6837B54557b05806e6623
11952b56996R2707A27901a1895j13973N3490j11962M835L3972O3228E2967g3867
11940b24776D2726K36185I5191a57001k46770B0730J32201L1735B2742b72721
$$ y = [-113528, 94676, 198819, 267282, -204312, -2340, 230863, -123392, 143931, 194468, 177111, -32848, 170761, -272720, 117905, -74852, 102380, 121287, 3828, 281662, -111581, -40138, -27978, 222560, 286069, -17116, 156410, -157869, 295462, 230287, 92018, -194980, 231807, 266220, 117430, -146418, -32751, 163889, 59778, -86175, 67306, -190465, -137036, -211692, 3761, 76995, 351984, 218975, 263803, -44824, -116208, -244054, -261471, -83244, -308705, -155984, 54448, -119066, -165538, 184702, -65244, -121559, 72180, 130418, -74621, -313822, -66837, 254557, -205806, -56623, -256996, -164289, 127901, -11895, -125868, -72378, -184340, -179505, -145533, -82305, 52967, -73867, -224776, 42726, 278911, 95191, -157001, -403771, 20730, 152931, 184666, 22742, -272721]
11929C6241L6822M3931a1035j16841j69459g684A75837k8115Q4119o1152N2393
11918B23082A04355c43417A68058a00504j13389M2489A76621a04471L6035A79276
11907b15844d5746C32598A50848M3933l5339k0D7400b70813A29313a65222B49144
11895G3648f5549k2509a1507A42367b0986r2666p5168A44367M7201f6565J3001
11884e3564G1416c16381a02344a1629e57E634b10890a02694m0516j74217A69386
11872a30080I68J41670f1133q9381B0231b14753G6869a71105k42338J43821p7590
11861c47212h0882H0706b49998Q8597F5276c5740A35580a75757f1745H7223f2859
11849d3171B163K78606r6316A5905a68502A07601a18247j56347i6016E39307i0142
$$ y = [36241, 73063, 116994, -11035, -127876, -297335, -7684, 175837, 147722, 231841, 170689, 223082, 104355, -343417, 168058, -100504, -213893, -171404, 176621, -104471, -68436, 179276, -215844, -45746, 332598, 150848, 194781, 159442, 159422, 47400, -270813, 129313, -165222, 249144, 73648, -65549, -88058, -11507, 142367, -20986, -113652, -188820, 144367, 191568, -66565, -53564, 71416, -316381, -102344, -11629, -557, 5634, -210890, -102694, -143210, -317427, 169386, -130080, 968, 142638, -61133, -150514, 20231, -214753, 76869, -171105, -413443, -269622, -347212, -80882, 80706, -249998, -161401, 65276, -35740, 135580, -175757, -61745, 87223, -62859, -43171, 2163, 280769, 184453, 15905, -168502, 107601, -118247, -274594, -96016, 539307, -90142]
11837a8742p175p1569C05512a85329D9726f8153B2563c78533D6694b20485B55514
11825c08976J49566C6228b97748J24960g9226A67859h9768E7248Q0350b4453A28559
11813E5494a67153b0110p2663A55974G0087j7989b34849A01101c3244g100m9125
11802e6225I7403O5347B530i1183a3048A69095e5827G3817h2479C1803J8187i3236
11789c94909a39877l8523B16804a0523k13393D7191a18176c186m79298G8472a15606
11777B3106Q7958a06250k13656d0333C9395b2541B25412p7334K25224b13024F6553
11765a85075A32482a5455G3495a54351L3117B13074b77795J16906a885j39476
11755a41361q3592h2815f920B43924F4564c644l2294P845A68007b39101Q6320
$$ y = [-18742, -25917, -97486, 305512, -185329, 49726, -68153, 22563, -378533, 46694, -220485, 255514, -308976, -159410, 36228, -297748, -172788, -79226, 167859, -89768, 57248, 137598, -24453, 128559, 55494, -167153, -20110, -92773, 155974, 70087, 52098, -234849, 101101, -33244, -7100, -56225, 97403, 162750, 2530, -91183, -13048, 169095, -55827, 73817, -82479, 31803, 49990, -93236, -394909, -139877, -178400, 216804, -10523, -223916, 47191, -118176, -3186, -482484, 78472, -115606, 23106, 111064, -106250, -319906, -40333, 39395, -22541, 225412, 148078, 373302, -213024, 66553, -185075, 132482, -15455, 73495, -154351, -121234, 213074, -277795, -160889, -1885, -141361, -224953, -82815, -6920, 243924, 64564, -3644, -35938, -28093, 168007, -239101, -152781]
11744a52781A24385l4378a45985D0552c1190j42347P6211A62861A4126g5965G2782
11732c0746F5726P7628c7955G0541l0363b25601b0517r3061c0000a2911A83668
11720B31926F2206J51124q1994N2017H2095a78249D0633d3966J0713E0444g8102
11708a09334o6199h5612n5652A9044a4089p9609C5164d1648A36541j7480J44770
11697B63831c8100k11311G2578J03455g6762I51e2636B77338q217a4253B0205
11685A66138d9570A4948b08525d6950k15119H1034a79454m73I9547K9196R7105
11674B25848c54034H4038J23837o8572B8318J13475a2549B4860c63368d0980J7474
11663b3506e752j75238Q7208A7475J39503k685b58152A24392o0471A0269R1133
$$ y = [-152781, 124385, 90007, -145985, 40552, -31190, -173537, -97326, 162861, 14126, -75965, 72782, -30746, 65726, 143354, -37955, 70541, 40178, -225601, -20517, -113578, -30000, -12911, 183668, 231926, 62206, 213330, 131336, 183353, 82095, -178249, 40633, -43966, -33253, 50444, -78102, -109334, -175533, -85612, -141264, 19044, -14089, -93698, 35164, -41648, 136541, 119061, 263831, -38100, -249411, 72578, 176033, -76762, 951, -52636, 277338, 269121, -14253, 20205, 166138, -49570, 14948, -208525, -46950, -262069, 81034, -179454, -179927, 99547, 128743, 225848, -354034, 84038, 207875, 139303, 28318, 141793, -12549, 24860, -363368, -40980, -23506, -5752, -180990, -93782, 17475, 156978, 154293, -258152, 124392, 63921, 10269, 101402]
11652A01402i2186K4077A0932J23607h0567D8701e2185B60295a54341H8802c8112
11640A71430G6759a15041n4649j27707D4058J2090b17357E4402e1381a6894A72818
11628I1351a3804B62536b80496H1987D912M00950A99635b4605m5185k10955F2591
11616A69397g7584c8226B76482j34749a12862A43247c63512M9167B34902Q653
11606B43555b79889B90907j25029p8752O3023E2828E605K45968a8960q3585A91020
11594H8170c600l55199f1441I7378K41741e5747E3995c60890E1690l385a57381
11582A30947J04209j10074c60350B57224D0535J30418C0457h3401f678p934A50787
11570C2785e6008m4352m1752a1314A72680P491L04845j90654K6325j47888D1448
$$ y = [101402, -92186, -68109, 10932, 134539, -80567, 48701, -52185, 260295, -154341, 88802, -38112, 171430, 76759, -115041, -169690, -297397, 44058, 56148, -217357, 54402, -51381, -16894, 172818, 91351, -13804, 262536, -280496, 81987, 4912, 405862, 199635, -24605, -69790, -280745, 62591, 169397, -77584, -38226, 276482, 141733, -112862, 143247, -363512, -314345, 234902, 243555, -279889, 290907, 165878, 87126, 150149, 52828, 5605, 251573, -18960, -102545, 191020, 88170, -3600, -358799, -61441, 97378, 339119, -55747, 53995, -360890, 51690, 48305, -157381, 130947, 235156, 125082, -360350, 257224, 40535, 170953, 30457, -83401, -6678, -14612, 150787, 32785, -56008, -100360, -142112, -11314, 172680, 180171, 485016, 294362, 320687, 172799, 41448]
11558A02052d8770C37717F1076L63508a05758D9387d5025A14986b05300n7338
11548b62638J08082A02741J3833K4884b74889A54873n2349k7088M4403n8305b95208
11536A49653P9145q2548J61611m1796A22921C0247C340K27303D470L08439C3673
11524C2020J94240j3450m1295b2162l56961f855B86348b13857N8591d6988p7378
11513a24366A34507b2496D5080J41491a73669A10934b28469o8799i7116A20873
11502A94752F8242R1579k361K35006I5150K14309A06458b44445C76092G4395K73436
11491C47831E6994a67471C63707F1388N7903R3021a18991j2583A69524d7526A25534
11479A39183P8131d754B31560d2501J8310B2128a33872M6107D76881g8738A19253
$$ y = [102052, -48770, 337717, 61076, 424584, -105758, 49387, -45025, 114986, -205300, -262638, -154556, 102741, 116574, 141458, -274889, 154873, 102524, 75436, 119839, 61534, -295208, 149653, 228798, 146250, 307861, 266065, 122921, 30247, 3340, 230643, 4470, 312909, 33673, 32020, 226260, 212810, 171515, -22162, -379123, -6855, 286348, -213857, -155266, -46988, -124366, 134507, -22496, 45080, 186571, -173669, 110934, -228469, -297268, -97116, 120873, 194752, 68242, 159821, 157460, 392466, 95150, 309459, 106458, -244445, 376092, 74395, 347831, 56994, -167471, 363707, 61388, 119291, 212312, -118991, -131574, 169524, -47526, 125534, 139183, 217314, -4754, 231560, -42501, -24191, 22128, -133872, -87765, 476881, -78738, 119253]
11467B70935F1012A966J86888J62162k3741J383K100D3730R9050J24718c52161
11455C84599B6320K13294j1149m7345K6418f992B63688j10569i1451A73413a82320
11443D00114a91277f1511B8759K4429K24889q1882m6129K46732A86579n5705k4851
11432A06023j6435c1808F3574g8473B84948d760A28182J6225f3722A34956D2875
11420B17142c0247j27000A15267K14623b09294A55554M5188G2976a98374E931
11409b57284B23752H3784J36121a42779B0262R3126m0736a26069B41622k2595
11399B19027C53a30004k45803A60175F8574J65705c12971B57087g5587F5711a8129
11387A58332N6168b21645F0529i5981n8129j62648A64735a51889g93E1793c24769
$$ y = [270935, 61012, 1966, 188854, 351016, 327275, 328658, 330758, 43730, 142780, 267498, -352161, 384599, 26320, 239614, 228465, 181120, 207538, -6992, 263688, 153119, -91451, 173413, -182320, 400114, -191277, -61511, 28759, 53188, 278077, 196195, 150066, 396798, 186579, 130874, 106023, 89588, -31808, 63574, -78473, 284948, -4760, 128182, 144407, -63722, 134956, 42875, 217142, -30247, -157247, 115267, 329890, -209294, 155554, 200742, 72976, -198374, 5931, -257284, 223752, 83784, 219905, -142779, 20262, 113388, 72652, -126069, 241622, 219027, 353, -130004, -375807, 160175, 68574, 234279, -312971, 257087, -75587, 65711, -18129, 158332, 214500, -221645, 60529, -95981, -154110, -316758, 164735, -151889, -793, 51793, -324769]
11375a36210I4537C4851d4779I1626b0657C79608b0234j6329B07783a49568a014
11363F2947J70632b46383h1697r0080a3739F9160N9465c17271I6147J9219a26416
11351H0948A655J4647J37605J34592b84342I1663a92345P6863b7193G7487b29310
11339I3241J91248j17601o664b2263B0826a03623F8619g3810l3409B24093N5123
11328B79216o2792a08089J6534d3607B895N9700b92822b6640K820m190j2551r8489
11316a39050A18033a12582k0801f5268P219k17549R0164C39664a09868p9579e4924
11304I5597K96414c6558l3469k202l8524a8735G871h6760a9924j79789I3778f1562
11291A65202a49912C8360m842g3260j52583L591G900J34403h8820q7787h2815
$$ y = [-136210, 94537, 34851, -44779, 91626, -20657, 379608, -20234, -36563, 207783, -149568, -1014, 62947, 233579, -246383, -81697, -171777, -13739, 69160, 128625, -317271, 96147, 115366, -126416, 80948, 1655, 16302, 153907, 288499, -284342, 91663, -192345, -115482, -27193, 77487, -229310, 93241, 284489, 166888, 160224, -22263, 20826, -103623, 68619, -73810, -107219, 224093, 279216, 216424, -108089, -91555, -43607, 2895, 62595, -292822, -26640, -23820, -28010, -40561, -139050, 118033, -112582, -133383, -65268, -58049, -275598, -185434, 339664, -109868, -189447, -54924, 95597, 392011, -36558, -70027, -72229, -110753, -18735, 7871, -86760, -19924, -199713, 93778, -61562, 165202, -149912, 38360, 33518, -73260, -225843, -222252, 7900, 142303, -88820, -176607, -82815]
11279B07350a05662l5895N4577J0261k05298A4680J907J31360h4357A4273J1128
11268B5401d779k7067j69093A51890K34762b14070n729B90949b30387N7539A25494
11256b56233c6438m8242B85381A4174J02143J11493c7911j84558O2403A77056
11245A0028a61025B36377A2134b03022b2690p1908A03458b56092M8995P0170A28345
11233c32776A37589e8489o2800l4974b6002B34808c12580H8865a25241A20638
11222C489O1624a94976f59A4005b26329h229K304n9385o9708C7451i512r109G5862
11208a04002a889j57100g2032A96059b78753R3795k50784j1140J98962A75635
11197D3375e6350q1182k297e807l27152f196P63H4920N2817f3331E4085c66917
$$ y = [207350, -105662, -141557, -86980, -76719, -282017, 14680, 16587, 147947, -84357, 14273, 25401, -4779, -31846, -200939, 151890, 386652, -214070, -219799, 290949, -230387, -172848, 125494, -256233, -36438, -84680, 285381, 14174, 116317, 227810, -37911, -222469, -160066, 177056, 10028, -161025, 236377, 12134, -203022, -22690, -94598, 103458, -256092, -207097, -136927, 128345, -332776, 137589, -58489, -121289, -156263, -26002, 234808, -312580, 88865, -125241, 120638, 3489, 65113, -194976, -659, 14005, -226329, -8229, -5925, -65310, -135018, 37451, -9512, -18621, 75862, -104002, -1889, -158989, -72032, 196059, -278753, -184958, -435742, -446882, -247920, 175635, 43375, -56350, -137532, -139829, -5807, -332959, -6196, -5433, 84920, 137737, -63331, 54085, -366917]
11184a2471j2529A71408c87320A6208K25417a66245j15852e749k37807j08721
11174c52277G3605f8921n0447I262L845a40194K4675A6360c92669A11385a98030
11162a71585j06264A31212m0574L9645A2406c54490A17129A3242a70275A66701
11151B0664a58753O0460D5218J60677a42666d2711I5265a10865k8366k47845J49031
11140b38045o8252i9422j45235D465f0750A0310a00111j87146H7150J25720n2083
11129A60787B1494K07989c8440B33954A0775d7912A94243a11809B5329i0016A25538
11117a16625p6914j09945C24011g3343A87833J30959e1607A63135J2086G9290
11106b3173B10254o4113J39111i4290B00066j6718o3109M24149A11660M4927o9999
$$ y = [-12471, -25000, 171408, -387320, 16208, 241625, -166245, -282097, -5749, -243556, -352277, 73605, -68921, -119368, 9262, 13107, -140194, -115519, 16360, -392669, 111385, -198030, -171585, -277849, 131212, 90638, 130283, 12406, -354490, 117129, 13242, -170275, 166701, 20664, -158753, -98293, 45218, 205895, -142666, -42711, 95265, -110865, -139231, -387076, -238045, -306297, -99422, -244657, 4465, -60750, 10310, -100111, -287257, 87150, 212870, 160787, 21494, 229483, -38440, 233954, 10775, -47912, 194243, -111809, 25329, -90016, 125538, -116625, -193539, -303484, 324011, -73343, 187833, 318792, -51607, 163135, 175221, 79290, -23173, 210254, 146141, 285252, -94290, 200066, 183348, 120239, 544388, 111660, 156587, 86588]
11095H6588Q5475o7880M53945A03462J39077J62856E9401B9128j1874J19251J3700
11084A50205k847i6288C66170j65390J95195N0077j69869J93249J05295k26601
11074C48126A54320M32215B85668J46607m6719L88386k57766A58058J03765J29557
11064C91380L79286j53411o9030k03395J88466N8315K78875B90281Q0003K27130
11054E97414Q3824P6377C60882M97735o1620j3L15332l83973L64238l42252L80663
11043A130992k12384j63933J38986P178P1527m3106j92618K2812p429k48160O79754
11032A183619l20699K12564k39205Q9031j75926M94231l07438k92280M4912N45462
11022A234271m40612N0944M41366m46650K36827m87341K15388q9604J15937J88748
$$ y = [86588, 172063, 104183, 558128, 103462, 242539, 405395, 59401, 29128, 17254, 136505, 150205, 147358, -96288, 366170, 200780, 395975, 446052, 276183, 469432, 574727, 348126, 154320, 586535, 285668, 432275, 385556, 773942, 516176, 158058, 261823, 391380, 770666, 617255, 548225, 344830, 533296, 591611, 870486, 290281, 370284, 597414, 681238, 757615, 360882, 858617, 796997, 796984, 1112316, 728343, 1092581, 750329, 1130992, 918608, 754675, 893661, 900839, 972366, 929260, 736642, 759454, 752025, 503865, 1183619, 862920, 1075484, 836279, 925310, 749384, 1243615, 936177, 643897, 688809, 1234271, 793659, 844603, 1285969, 839319, 1076146, 588805, 804193, 714589, 830526, 1019274]
11012A019274m05424J21370k31084J25340k5019m6476j43297K79553O5572j47627
11002F12182k40068L46125P230j19247K22248o6631O7136J68940n2528N0921K090
10991I98398j40417k36010R3371J59734j27491j1285k29344O17760l60696L60279
10981A124299j85156J53676J54517M4549j47318J50258J2962O22165j91780N57541
10971B295713K89981j7141J82935L92843K25118j99609q8318K74164m93624m27179
10961B434883l59124m28613j48018Q0132J73590l55116J71934J2984j44166M2297
10951A480783Q6858n81078P3992Q1526k17495m08697K75291J2355k77423I2706
10940E6998K94887J24123D5647O4330J46995Q6809K2760J01278c5419B4818J4804
$$ y = [1019274, 613850, 735220, 504136, 629476, 604457, 557981, 414684, 694237, 759809, 612182, 372114, 718239, 725469, 606222, 828470, 761839, 828975, 997915, 945387, 996308, 998398, 857981, 621971, 715342, 875076, 747585, 736300, 506956, 1124716, 764020, 1124299, 939143, 1092819, 1247336, 1291885, 1144567, 1294825, 1307787, 1929952, 1738172, 2295713, 2585694, 2568553, 2751488, 3144331, 3369449, 3169840, 3081522, 3355686, 2862062, 2434883, 2075759, 1647146, 1499128, 1579260, 1752850, 1397734, 1569668, 1582652, 1438486, 1480783, 1567641, 986563, 1060555, 1142081, 924586, 515889, 791180, 803535, 526112, 92706, 56998, 351885, 476008, 45647, 109977, 256972, 343781, 366541, 467819, -35419, 24818, 39622]
10929C9622b13815C41892H7859J45112M5190g0407c4730m7501l4294e663D4952
10917A76803E8072L06542A67923p5523J63693j1989j08905B0875b24646d8143
10906a00281q111b0253C6584g2460A44477A617b6489j33549j61560A97305l264
10895A94041l3605l0548l5358J07042D4077b56339D7457e6020B04749a23123r3
10884a23216c2160d016j56370A72052c3306d296A83839b25560e4613B68311a68395
10872f5785A512e3336o175j99059c0330D4964A6125J53914b9512E6640g0013A34577
10859a25208e200m0372l4096E0433j7042c88325A73556j6588a31280m5060A09009
10847f4681o986B4225a74904B4528R1279J08103f6940B29708c11494j95973d6079
$$ y = [39622, -213815, 341892, 87859, 232971, 278161, -70407, -34730, -82231, -116525, -5663, 44952, 176803, 58072, 364614, 167923, 92400, 256093, 244104, 135199, 20875, -224646, -48143, -100281, -108392, -20253, 36584, -72460, 144477, 1617, -26489, -160038, -321598, 197305, 194041, 160436, 129888, 94530, 201572, 44077, -256339, 47457, -56020, 204749, -123123, -123216, -32160, -4016, -160386, 172052, -33306, -4296, 183839, -225560, -54613, 268311, -168395, -65785, 1512, -53336, -59511, -258570, -30330, 44964, 16125, 170039, -29512, 56640, -70013, 134577, -125208, -5200, -45572, -79668, 50433, 33391, -388325, 173556, 156968, -131280, -176340, 109009, -64681, -71667, 24225, -174904, 24528, 115807, 223910, -66940, 229708, -311494, -507467, -46079]
10835F9896p194b8258A56956b26020P9711D3203L2872a87069f8769c0397A98183
10823H3721g3409p4575E3967i8323j64853A73952e5229k30730G2997e255k689
10812g944k63324B3703i2110c3935h793H7692B3774a1657j34588k5464g5064j53145
10800b28209N1513k88683B10853b15948o530f2147k13950H9108k6933a08800A55736
10788b4348k74598A59202a09597r4690p8288J30888j23180B68262k7480D8287
10777g4895o0843j45430a31214N7566k680B0350d01419A0211a9237l54484G9067
10765A63020b72217g2374k30335g1959K4121J0274B3633g9753j57767E0936M0133
10754I1069a17611O909I1796a65781j0053K36N9661A55277f9019G3504c37333
$$ y = [69896, 62702, -28258, 156956, -226020, -146309, 43203, 76075, -187069, -68769, -30397, 198183, 83721, -73409, -147984, 53967, -98323, -263176, 173952, -55229, -285959, 72997, -5255, -7944, -271268, 23703, -92110, -33935, -8793, 87692, 23774, -11657, -146245, -171709, -75064, -228209, -176696, -465379, 210853, -215948, -222478, -62147, -276097, 89108, 62175, -108800, 155736, -24348, -298946, 159202, -109597, -204287, -282575, -151687, -274867, 268262, 240782, 48287, -74895, -135738, -281168, -131214, -73648, -76328, 20350, -401419, 10211, -19237, -373721, 79067, 163020, -272217, -72374, -302709, -71959, -47838, -37564, 23633, -79753, -237520, 50936, 91069, -117611, -110702, 91796, -165781, -175834, -175598, -115937, 155277, -69019, 73504, -337333]
10742f5960j8623m5137a128A33448g1807a2832C4660c6458A48482a48497A51443
10730F2235b19995A33567g1675J0725F074a84477A0399b4283j24435B67778A01546
10718G7301b14973c2075j59289A30920b53500H5007a58914A45946J86313a6959
10707b4591q5421p8368B29382D4395a10534A8786c5868p4525A74811d2122k41464
10696b83586h5527r1428Q4709A82277a7088l4644K0933A256L1907b15354a00313
10684b85806h1289A97222J327M757a59018d2298p1036J1677k72599c4943l54529
10673c89472I8851N7754c69574A86522l7935b41818L9400I0676K16525b67444
10662a89164Q6840B11400I1731a62573d5796A7443f4875B7679i4048K5115A54315
$$ y = [-65960, -84583, -129720, -1128, 133448, -71807, -12832, 34660, -36458, 148482, -148497, 151443, 62235, -219995, 133567, -71675, -60950, 6074, -184477, 10399, -24283, -148718, 267778, 101546, 77301, -214973, -32075, -191364, 130920, -253500, 85007, -158914, 145946, 332259, -16959, -24591, -110012, -188380, 229382, 44395, -110534, 18786, -35868, -110393, 174811, -42122, -283586, -85527, -176955, -92246, 182277, -17088, -51732, -30799, 1256, 33163, -215354, -100313, -285806, -81289, 197222, 198549, 203306, -159018, -42298, -113334, -101657, -374256, -34943, -389472, 98851, 156605, -369574, 186522, 148587, -241818, -202418, 90676, 307201, -267444, -189164, -102324, 211400, 91731, -162573, -45796, 17443, -64875, 27679, -94048, -68933, 154315]
10650A4071b44440i3086k55850A77171l5969f3251a6131q747l21864e4091m8723
10639a02814L8143k32534g1646k06183B5738c862k26875a70n20777I7122g0091
10627c10885J43202N1302N2535C267a50142A19892a14144E5390a12294L4616G4958
10615a37035k3246A27738h4665E518N71902A3071l973i2347q6684j32065D0182
10603E0039c391j50383I6018L867R242B0448c7279k5266A02954b670E4883j3688
10591D1195a18304A88798i0952j6413A25165b09237G464K30410a31898A0397f7914
10579a30763k91010C08153D9414n874e1140k63A21075a55901B1756i5930A07737
10567c27398a21391N4206j22990l6459D10455a19052a8783A50503g2819o0289
$$ y = [14071, -244440, -93086, -348936, 177171, 141202, -63251, -16131, -24878, -346742, -54091, -102814, -64671, -297205, -71646, -277829, 25738, -3862, -230737, -170, -520947, 97122, -70091, -310885, -167683, -116381, -63846, 3267, -150142, 119892, -114144, 55390, -112294, -77678, 74958, -137035, -160281, 127738, -84665, 5518, 577420, 13071, 9098, -92347, -179031, -311096, 40182, 50039, -3391, -153774, 96018, 99885, 109127, 20448, -37279, -62545, 102954, -2670, 54883, 41195, -118304, 188798, -90952, -107365, 125165, -209237, 7464, 237874, -131898, 10397, -67914, -130763, -421773, 308153, 49414, 43540, -51140, -51403, 121075, -155901, 21756, -95930, 107737, -327398, -121391, -67185, -190175, -226634, 410455, -119052, -18783, 150503, -72819, -133108]
10557a33108l1262E2081Q2846C1105d0259q6083A27946a03861c2357j34972A35521
10545b37983f8173l1268l01498a6883j25971p070J854B35707b59894O6329e2589
10533a1047n748G9341e4009B58583c59805f3922j02077J7500A9649a3050j46927
10522a59977A17054a2329j61530k40286I5351K20496c70072B16125b51449H7169
10511b0888B59123R7236d62316p180C55468c4843F7690d20343H2081a93315B37659
10499a0881B26509c322k91548J14405A24802b21646e7272q3030A53423A902P8145
10488H0047C8444a83041e344j49633B2124d410j79330j3038d2753k14775A79879
10476C88622j80511O7659P7920o6307B2673P5047i6659j69931A25182a6115B56616
$$ y = [-133108, -164370, 52081, 134927, 31105, -40259, -126342, 127946, -103861, -32357, -167329, 135521, -237983, -68173, -99441, -400939, -16883, -142854, -149924, -148070, 235707, -259894, -193565, -52589, -11047, -16795, 79341, -54009, 258583, -359805, -63922, -165999, -148499, 19649, -13050, -159977, 117054, -12329, -173859, -414145, 95351, 315847, -370072, 216125, -251449, 87169, -20888, 259123, 356359, -462316, -469496, 355468, -34843, 67690, -420343, 82081, -193315, 237659, -10881, 226509, -3322, -294870, -180465, 124802, -221646, -57272, -140302, 153423, 1902, 80047, 38444, -183041, -5344, -154977, 22124, -4410, -183740, -196778, -42753, -257528, 179879, 388622, 208111, 275770, 353690, 287383, 22673, 97720, -96659, -266590, 125182, -16115, 256616]
10464a42073c7158n8974F6521b6270A0571O8976J56012b04740N9276M0745o5368
10453a70087B571b951A75203a75971g432m9376a1582j3821o5805j63066B10176
10441I5750b71789e4139l50506K9366H7048f0754A19654a74245b1093l78275J67103
10430b32265a05920B36582I2732k4779a00249a6814l39468A46432E6989K53320
10420C10309a10764O698r43m3191k0155b5817k02801F1211a93348P4157j32921
10409b52112A65798b21237A01468b7768J2000k257Q67j5827l4243A09653A8591
10397A25249B9470i4527B14589E0180J09531M2817h3029I5025a2642F171N5424
10386F1595O1034m9911O0454n7686J68837L7037c2923G2793N1519L7219J24634
$$ y = [-142073, -37158, -96132, 66521, -26270, 10571, 79547, 235559, -204740, -145464, -104719, -170087, 2571, -2951, 175203, -175971, -7432, -56808, -11582, -25403, -91208, -254274, 210176, 95750, -271789, -54139, -404645, -375279, 87048, -60754, 119654, -174245, -21093, -399368, -232265, -105920, 236582, 92732, 67953, -100249, -16814, -356282, 146432, 56989, 310309, -110764, -104066, -105009, -148200, -168355, -25817, -228618, 61211, -193348, -119191, -252112, 165798, -221237, 101468, -27768, -15768, -18025, -17158, -32985, -67228, 109653, 18591, 125249, 29470, -94527, 214589, 50180, 159711, 202528, -83029, 95025, -12642, 6171, 61595, 122629, 72718, 133172, 75486, 244323, 281360, -32923, 72793, 124312, 161531, 286165]
10375B86165a39098C05063j29052i61A03822L86066j76086O9933A5272L13769
10365C29041j273M62624C84380K27338j4537B71200J77530a31334E11009j48078
10355C62931A56092C3498J76581K12045q6631Q8305J09063j40775J22477B17903
10344C34600p522j21813I3457L91826K3946j61313G8809J88449l2782m3026K68594
10333D60044j53824A09398K05249H4031N2280m9083P098d4412J0772B7057j0131
10322A6926L70460j13732a30015K058o4409A27999J51071a73826B86082D9982
10311C0031N0011R9711p904G5772d5945l6216g407E3257a91581I420M50782b34908
10298b90120A50795N0443b38799C65420b48035e3973B43988G4384h4559m20306
$$ y = [286165, -139098, 305063, 176011, -961, 103822, 489888, 313802, 383735, 15272, 329041, 327768, 790392, 384380, 611718, 597181, 271200, 448730, -131334, 511009, 362931, 156092, 33498, 210079, 422124, 335493, 423798, 532861, 392086, 514563, 217903, 334600, 327078, 205265, 93457, 485283, 509229, 347916, 78809, 267258, 234476, 191450, 460044, 306220, 109398, 314647, 84031, 136311, 87228, 94326, -44412, -33640, 27057, 16926, 387386, 273654, -130015, -127957, -192366, 127999, 279070, -173826, 286082, 49982, 30031, 80042, 179753, 171849, 75772, -45945, -82161, -7407, 53257, -191581, 9420, 460202, -234908, -290120, 150795, 201238, -238799, 365420, -248035, -53973, 243988, 74384, -84559, -504865]
10288e04865K23719J39179E7949a75224q1666E3777a98567D16610b13303n4570
10278b67873b0057Q590F2214N9525b8007A49711D2800J1636i1877A66488a53928
10266b69711a31369M6350j57267m44110a10122e0687H9923B3243J36480J20447
10256B80170n2023P1691f2178C43852I1834L70122j73100b6653N998j56799B7538
10244c4970n4251o336j4237K4684J7848J6843B6989a11018k02155i8853L1649
10233f7204B73111a26661J1293k4759G092b62983h8214j9609k42338c2979C01699
10221c8365B49484b06810D6171d8946j65701M529B8305J69471a01846r3091k629
10210a97566e0223D6124b97806L0768B8821f7363P202l9715j89180J06134B509
$$ y = [-504865, -281146, -141967, 57949, -175224, -256890, 53777, -198567, 416610, -213303, -267873, -20057, -11467, 62214, 121739, -28007, 149711, 42800, 54436, -91877, 166488, -153928, -269711, -131369, -85019, -242286, -686396, -110122, -50687, 89923, 23243, 159723, 280170, 228147, 299838, -62178, 343852, 91834, 461956, 288856, -26653, -20655, -177454, 27538, -34970, -89221, -95557, -109794, -85110, -67262, -50419, 26989, -111018, -313173, -98853, -67204, 273111, -126661, -115368, -140127, 7092, -262983, -88214, -107823, -350161, -32979, 301699, -38365, 249484, -206810, 46171, -48946, -214647, -210118, 28305, 197776, -101846, -194937, -197566, -50223, 46124, -297806, -267038, 28821, -67363, -60161, -99876, -289056, -182922, 2509]
10198A2858b8292k38304I2431c05855I5709c56407B16102B4434b53768a23282
10187A48430a27784O3000k35514d6965j54086D5172K2548J10645m4056b54262
10176b29868f0775I0035K28796p3394j16340b17795e9055n3714A23680Q7263g0614
10164g8730j57268R6428m3246A88957c13175D3671J93965B7328c8654E07729j69184
10153C38545a63070b1106I2288g805C0434g9014j84787D8747B954b46210A34237
10141D792a21451e8043B0128K45793b608j89957O1408L9711C33010A24678b70180
10129B5778J53833G289i7782J9763I5017J15869A6519g514j09715A76338b38725
10117D8293a77122A56156a10336C5735c53540B9630c17394e8837j16538A88255
$$ y = [12858, -28292, -266596, 92431, -305855, 95709, -356407, 216102, 24434, -253768, -123282, 148430, -127784, -64784, -300298, -46965, -201051, 45172, 67720, 178365, 134309, -254262, -229868, -60775, 90035, 318831, 245437, 129097, -217795, -59055, -112769, 123680, 210943, -70614, -78730, -235998, -139570, -182816, 188957, -313175, 43671, 237636, 27328, -38654, 507729, 338545, -163070, -21106, 92288, -7805, 30434, -79014, -263801, 48747, 2954, -246210, 134237, 4792, -121451, -58043, 20128, 265921, -2608, -192565, -131157, -91446, 333010, 124678, -270180, 25778, 179611, 7289, -97782, -78019, 95017, 210886, 16519, -7514, -117229, 176338, -238725, 48293, -177122, 156156, -110336, 35735, -353540, 29630, -317394, -58837, -175375, 188255]
10106A8683b35569b8920p796A9624b75477a06435J3667C30681a57879a6983I9205
10094d45092d4725A82901E1112f5201p5581K9680E1531J0596b58285R7361k3829
10083a84753Q5505M6745i956r1266A23264h8166n2719o1796L3366O9731A11784
10071B4535b08346J02579j87837Q0121B14498b8329j23703C3751a27766f3831
10060i7681A35854a22681j63563Q7061A18464K9993j7281b75839A55938b51979
10049a259j365A93375b29209E9810K73573F6710g3307A07469a51928O4560j83563
10038b70931F2540a68567C5181c9906k07117d2175C33372A1892J62970a72213
10027b25103A25256b40395I72a84570A51215a91908A30746o72b06088O6533j27336
$$ y = [18683, -235569, -28920, -36716, 19624, -275477, -106435, -92768, 330681, -157879, -16983, 99205, -445092, -44725, 182901, 51112, -65201, -140782, -111102, 51531, 62127, -258285, -160924, -184753, -99248, -52503, -9956, -101222, 123264, -88166, -140885, -202681, -169315, -99584, 111784, 24535, -208346, -105767, -293604, -213483, 214498, -28329, -152032, 33751, -127766, -63831, -97681, 135854, -122681, -286244, -199183, 118464, 148457, 131176, -275839, 155938, -251979, -1259, -2624, 193375, -229209, 59810, 333383, 66710, -73307, 107469, -151928, -87368, -270931, 62540, -168567, 35181, -39906, -247023, -42175, 333372, 11892, 174862, -172213, -225103, 125256, -240395, 972, -184570, 151215, -191908, 130746, 130074, -206088, -139555, -266891]
10016b66891a27G6590f784b422p2237q6015G3271b18023H2871a32920A33681a58686
10003a43138c039n7801g362j737I7647b36676M9748m276A3963c49418i4835F0357
9990b69240D406a40259C78b53285B8139B229b49739n5209n7816A71044a5960A22964
9977d16903G3879b13871P8758k38730i4368B9296a06124K539K2855J6136j69939
9966b34533j76411R248A39944j009a64118N7139A64312D5735a47516F7068a21397
9954A62385b03577A8292i3282P115j62895H8688c24427A99210B9671b78046f0325
9942a17776k0351e7825j46193a6772d051D3170a04750A17323m5644a49845D2728
9930e5951j74513Q2001O0894A3787a54817G4763b49273l4899B70069b508j9274
$$ y = [-266891, -127, 76590, -6784, -2422, -74659, -160674, 73271, -218023, 82871, -132920, 133681, -158686, -143138, -3039, -60840, -7362, -9099, 97647, -236676, -186928, -191204, 13963, -349418, -94835, 60357, -269240, 4406, -140259, 378, -253285, 28139, 2229, -249739, -304948, -362764, 171044, -15960, 122964, -416903, 73879, -213871, -135113, -373843, -94368, 29296, -106124, -103585, -80730, -64594, -234533, -410944, -401696, 139944, 138935, -164118, -106979, 164312, 45735, -147516, 67068, -121397, 162385, -203577, 18292, -93282, -86167, -249062, 88688, -324427, 199210, 29671, -278046, -60325, -117776, -138127, -57825, -204018, -16772, -4051, 43170, -104750, 117323, 71679, -149845, 42728, -55951, -230464, -148463, -87569, 13787, -154817, 74763, -249273, -284172, 270069, -2508, -21782]
9919b1782B86953E5485R708B4817g969E7650n545d672r8123E0811a90729g118
9906a77124L7297G2664d1005j60811a0356j30632G1779M6642b32452r410D0731
9894b00089b3171j03114j99482J01853A24821b41443A6989h5499A53952h3777
9883h957j01386b8064j44635A45693c41022P9915r2429f9160A6493i9092n8317
9872a57409A54507e8818A15816C0138c7098B04167c14190n4977h2316G1842a47971
9860b43615g6061K0280A38444b23070J05949F6350e5817B1269b8257q1379C9055
9848c08834F268b60953Q2796e7740a8936D3146K37080A7163g309j23301o0684
9837a91294n8081d8619k32043j25415h8145m0693A7354b60764C48420a07882B0430
$$ y = [-21782, 286953, 55485, 65193, 24817, -7969, 57650, 52105, -4672, -102795, 50811, -190729, -7118, -177124, -139827, 72664, -41005, -201816, -10356, -140988, 71779, 118421, -232452, -241862, 40731, -200089, -23171, -126285, -325767, -223914, 124821, -241443, 16989, -85499, 153952, -83777, -8957, -110343, -28064, -172699, 145693, -341022, -261107, -353536, -69160, 16493, -99092, -157409, 154507, -58818, 115816, 30138, -37098, 204167, -314190, -369167, -82316, 71842, -147971, -243615, -76061, -55781, 138444, -223070, -117121, 66350, -55817, 21269, -28257, -109636, 39055, -308834, 6268, -260953, -178157, -57740, -18936, 43146, 280226, 17163, -7309, -130610, -191294, -249375, -48619, -280662, -406077, -88145, -128838, 17354, -260764, 348420, -107882, 20430]
9825h9323b03r2197n2498L4268A24168E4056K13348b11971f5172n9348c1099j3548
9813d4647B53084a11202j57234m437E5281J18308o200b18443B29740C2747a70345
9801C0892c14345P7555A18638a03438e0770A19049b01489C0305J3776b05642r2355
9790b97997J27832A32934J10324A07674c31729A11194b62941C05304A39789a11805
9779a91507J5143A2332a0520j56488A21919b95083k1111g3545j6874l8299C67671
9767i0093j90951a17652b1278H9244b6637A64909b19587A80189B5093b13158b8989
9755d4376A83665a10127k67j65292J3821A22428l4374b3932l7566A81916F1932
9743C1531J54401a91733m3715a12088c1995k37131b1371j85626L2197L8434A07532
$$ y = [-89323, -203, -92400, -144898, -110630, 124168, 54056, 267404, -211971, -65172, -124520, -31099, -44647, 253084, -111202, -268436, -272873, 55281, 173589, 167389, -218443, 229740, 32747, -170345, 30892, -314345, -236790, 118638, -103438, -50770, 119049, -201489, 30305, 44081, -205642, -297997, -170165, 132934, 243258, 107674, -331729, 111194, -262941, 305304, 139789, -111805, -191507, -176364, 12332, -10520, -167008, 121919, -295083, -316194, -73545, -90419, -128718, 367671, -90093, -281044, -117652, -21278, 89244, -26637, 164909, -219587, 180189, 25093, -213158, -28989, -44376, 183665, -110127, -110394, -275686, -261865, 122428, 88054, -23932, -61498, 181916, 61932, 31531, 185932, -191733, -235448, -112088, -31995, -269126, -21371, -206997, -174800, -136366, 107532]
9731a16953c2020l6476K5612o111K4063I970a6577j15827n994p140p3478g8726
9718i7673A57278b531j15489A22533a46353A25897A3093L971h9367j94146A51931
9706a04433A26525a12454l48368d4057h249l5472C0645K24849a53240j14364m2418
9695c10022A09353c42677C2666i4490J8436j98626J22062e3472k27592A22917
9684B48266c77601B22466m1633J24669n9143f0232k55599R5088C02854e4985B9172
9672E2209b33469F4060c57662F1537h9988k68037a25153b2796k80539a8891D9085
9660B59824a63961a0592R56E4491M8383a26486r9792N5941g2065A22346g2042
9648e4271j28035O8385A1104K22455h7839K7450J8015A61168g0111K6556B33261
$$ y = [-116953, -32020, -68496, -42884, -48995, -24932, 9970, -16577, -132404, -138398, -145538, -219016, -78726, -97673, 157278, -2531, -118020, 122533, -146353, 125897, 13093, 17064, -89367, -283513, 151931, -104433, 126525, -112454, -460822, -44057, -8249, -43721, 30645, 255494, -153240, -267604, -310022, 109353, -342677, 32666, -94490, -76054, -274680, -152618, -53472, -281064, 122917, 248266, -377601, 222466, 180833, 305502, 246359, -60232, -315831, -220743, 302854, -54985, 29172, 52209, -233469, 64060, -357662, 61537, -89988, -358025, -125153, -22796, -303335, -18891, 49085, 259824, -163961, -10592, -9636, 54491, 102874, -126486, -226278, -170337, -72065, 122346, -72042, -54271, -182306, -113921, 11104, 233559, -87839, -60389, -42374, 161168, -70111, -43555, 233261]
9636c5575P713p4112A8651b54815C3276Q5577b52364F9088b43186Q6378j9385
9625a76193C30940e4859J5970j73889a7339D3816c20915A62529h9951M1433j35930
9614a84448A5649a39915j02674a0260p5704q5081j0577I29M5663d782k8811A80000
9601C20558b54761F5851a8409k42562a0856k88265H4131b56231j76959b2445k68853
9590b91298I9635a21477H1344a69101N5891C98680e3322H9002a68164m2892k3247
9579b34303F9376J33352g036C79565b29773r3597J23610n2101a22460L7411j62115
9568b47164A43821K10366F124d9111l95638J72983h2749k9914B75448a50054O7922
9557h2132q3394j26355M5202A6607c16298a24334K5892k61930c7471A97630c18882
$$ y = [-35575, -27862, -101974, 18651, -254815, 33276, 118853, -252364, 69088, -243186, -156808, -176193, 330940, -54859, -38889, -212778, -17339, 43816, -320915, 162529, -89951, -48518, -184448, 15649, -139915, -242589, -10260, -85964, -171045, -181622, 929, 46592, -4782, -33593, 180000, 320558, -254761, 65851, -18409, -260971, -10856, -299121, 84131, -256231, -433190, -22445, -291298, 99635, -121477, 81344, -169101, -113210, 398680, -53322, 89002, -168164, -211056, -234303, 69376, 202728, -7036, 379565, -229773, -323370, -199760, -251861, -122460, -85049, -247164, 143821, 354187, 6124, -49111, -444749, -271766, -82749, -112663, 275448, -150054, -82132, -165526, -291881, -246679, 16607, -316298, -124334, -98442, -360372, -37471, 197630, -318882]
9545a28964o0734j06639R1319l19605B5514a79979j05271M7578R8522d3633A33736
9533c38990J24122j18217a09147j60730A15377c0525j58149A7998c2676k83444
9523c16120a00547j17580j43e615k23394E8247i0114b1913A2946b3052F0046J02379
9511A62425a22043H5268b0453k6383A59599A6983c46434B15908j0746b50146M3571
9500b06575N5838n64984a73988k06812Q8460J44489O9092k0039j26576P9700k11739
9489c57413J10282M0199h6277J5011G7871P1498b0771B22028e913A51835C5842
9477G1107b63753J30142q4898H150J37050a04730m4102j17882e4593j35969C26503
9465a47435A58497f0919C3545b75828D15795c6758k64603q5224J67323H0955a1554
$$ y = [-128964, -189698, -296337, -205018, -524623, 25514, -179979, -285250, -237672, -139150, -43633, 133736, -338990, -214868, -333085, -109147, -269877, 115377, -30525, -188674, 17998, -32676, -316120, -100547, -218127, -218270, -5615, -229009, 58247, -90114, -21913, 12946, -23052, 60046, 162425, -122043, 85268, -20453, -46836, 159599, 16983, -346434, 215908, 205162, -250146, -206575, -150737, -715721, -173988, -380800, -292340, -147851, -78759, -98798, -225374, -145674, -357413, -247131, -206932, -86277, -71266, 77871, 149369, -20771, 222028, -5913, 151835, 35842, 71107, -263753, -133611, -218509, 8150, 145200, -104730, -148832, -266714, -54593, -190562, 326503, -147435, 158497, -60919, 33545, -275828, 415795, -36758, -301361, -386585, -219262, 80955, -11554]
9453B17282g2303k23430h4931A09380M2333o9391a37173F2590b75319H5168i4206
9441h4534j83537a26937j26893D7498b5945r1613C32617e4G1777A9129K33494
9430B52623G2232R6506k7907c66575J70543n9257A07048J14642r3732a27308n7139
9419a84447k8801K1831O80L4753q337l5977e6454l0210j32937F2660c5229A2780
9406H7814c32473J41100q2178A06187c232j3968j24271K8070B49429J4371a42639
9394a09320K0567j11171C83087f8614A86029B6711i0259C7747K23411a27109A84903
9382c11541g2961B999J7480a28693A07765g0271j70860A04256d8932C85943H6203
9370a41548h913j5329n8354A71283i2373j09267A51002h0851A23235K21447j40867
$$ y = [217282, -72303, -295733, -84931, 109380, 151713, 82322, -137173, 62590, -275319, 85168, -94206, -84534, -268071, -126937, -253830, 47498, -25945, -117558, 332617, -54, 71777, 19129, 252623, 72232, 168738, 140831, -366575, -196032, -255289, 107048, 221690, 127958, -127308, -184447, -213248, -191417, -190737, -155984, -164321, -200298, -56454, -86664, -219601, 62660, -35229, 12780, 87814, -332473, -191373, -273551, 106187, -3232, -17200, -141471, -113401, 249429, 263800, -142639, -109320, -88753, -199924, 383087, -68614, 186029, 26711, -90259, 37747, 261158, -127109, 184903, -311541, -72961, 2999, 20479, -128693, 107765, -70271, -241131, 104256, -48932, 385943, 86203, -141548, -8913, -24242, -82596, 171283, -92373, -201640, 151002, -80851, 123235, 344682, 203815]
9359B03815d5291B16717c44961M2144c7764j49561A24950a06768B2002a64219
9348a64069D5164a7890B04760A7195a24272n5648M0501j8385j25787c6581A93019
9336H8619j9171c2843a4227I4825b78583i8963b8905k4092J3703D480b50559A5182
9323c08251B6840a46669a7675C77444d92328C68560A5740c56217d9623j34920
9313a84543A18216a20947A10379c7867P301E5317b68501a9489k35108R8456k9748
9302a85889I5432l5798b41108m0107K264A58515b07179a3640D3152J01184p291
9291A37045b11657i6526a1682j77903A37823n1261a14844F5945J74792f09772
9280E0267a59601j06267N3034B1621c97104a66042f3921E9132c15384J52224F3203
$$ y = [203815, -45291, 216717, -344961, -302817, -37764, -187325, 124950, -106768, 22002, -164219, -164069, 45164, -17890, 204760, 17195, -124272, -179920, -139419, -157804, -283591, -36581, 193019, 88619, 69448, -32843, -14227, 94825, -278583, -98963, -28905, -52997, -39294, 4480, -250559, 15182, -308251, 26840, -146669, -17675, 377444, -492328, 368560, 15740, -356217, -49623, -184543, 118216, -120947, 110379, -37867, -30566, 55317, -268501, -19489, -254597, -156141, -185889, 95432, 59634, -241108, -281215, -278951, 158515, -207179, -13640, 43152, 144336, 137045, -211657, -96526, -11682, -189585, 137823, 86562, -114844, 65945, 240737, -609772, 50267, -159601, -265868, -212834, 21621, -397104, -166042, -63921, 59132, -315384, -163160, 63203]
9268g2614q5623g4517o1379j15579e4943A19509a78453e4381b4475G4430A8803
9256A17507h5948k2495M3977r6460k08172J24156j06735J66378A08231e5009j7826
9245g2835l19313A69837a97757K0806m318A42825b30971A97786p8390a29435k50942
9234c80377B9365g9372N655A73357G5735a4840A7467C195J27516a51653n9325
9223b10978A001c1180j98394A10990B5724R6865b45565Q4745c3447H2139a80571
9211C109a87193P5710I4842i8702j61573O6464D18874d9312k8247f802H150a60384
9198a85810j16075E069g6060J4378a9791N542k1831F0414g4477m5306p335j28217
9186b55335A73036b60404B3386a99706A48985F9669b19740A49501D6275f3559
$$ y = [-72614, -158237, -74517, -135896, -251475, -54943, 119509, -178453, -54381, -24475, 74430, 18803, 117507, -85948, -108443, -64466, -160926, -369098, -244942, -351677, -185299, 108231, -55009, -72835, -392148, 169837, -197757, -176951, -181269, 142825, -230971, 197786, 119396, -129435, -380377, 29365, -79372, -73717, 173357, 75735, -14840, 17467, 3195, 130711, -151653, -210978, 1001, -31180, -229574, 110990, 25724, 122589, -245565, -160820, -33447, 82139, -180571, 3109, -187193, -111483, 94842, -98702, -260275, -193811, 418874, -49312, -77559, -6802, 8150, -160384, -185810, -301885, 5069, -76060, -61682, -19791, -14249, -36080, 60414, -74477, -119783, -127118, -255335, 173036, -260404, 23386, -199706, 148985, 69669, -219740, 149501, 46275, -63559]
9175A05327J40466C2109J89105a93286H7435a32324A58461J04907E0460a59195
9164h8365k96423B0708b7215r4890c22p1194A16561b71131m6733A75129H3030
9152b80809A78543d4387M580l5788C06271a21433l1235A25174a40473N0791j21569
9141b11251J6294L3476M5202B5314b92458J29303f8358F1469e9623C7094J59592
9130A96686b56232H2935c4699l75729i9312m4029j69640J50124N2029j95813k1674
9119c28315P1345k6136c0085A4413e2227I4532a97547k6542B9674g6932j59177
9108b36109M6447e3478K6647A28028N2174d1286A22159b11069k50049a34576K0205
9097a14371A25204P9922d7300B46756B1302b02147a5659P494j25995m5819L3882
$$ y = [105327, 245793, 32109, 221214, -193286, 87435, -132324, 158461, 263368, 50460, -159195, -88365, -384788, 20708, -27215, -122105, -322, -71516, 116561, -271131, -317864, 175129, 83030, -280809, 178543, -44387, -39807, -75595, 306271, -121433, -152668, 125174, -140473, -89682, -211251, -194957, -161481, -116279, 25314, -292458, -163155, -68358, 61469, -59623, 37094, 196686, -256232, 82935, -34699, -410428, -99312, -143341, -312981, -162857, -110828, -306641, -328315, -256970, -283106, -30085, 14413, -52227, 94532, -197547, -224089, 29674, -76932, -236109, -189662, -53478, -26831, 128028, 180202, -41286, 122159, -211069, -461118, -134576, -114371, 125204, 205126, -47300, 246756, 21302, -202147, -15659, -8165, -134160, -179979, -146097]
9086a46097B30755i0263j04351k46375a5900E034g8138A11448e984k52092A42427
9074c58818a20042a5508j52881B36769g0800A21981a93191E5103a33560A06132
9063d9107j11537N6284j01779L1600L5670M4667k76594a33257B15801a75191A66492
9051b16601a00043A09847a65634j73121J34816a371B45893c60934I108J41303
9041A50411a28640K062k6520J8435J9487B6851a12022A5465K0312d43437a85886
9029A23001a6902j95667i8538B47406B7044a70572f1562J2745k42016a28932b2903
9017A08038A6405a25220D5887b816k07354F6821f4225A18866a36096K9639A34815
9005g3808m8510B7439d45056a66432a5504j24868O9385G5247b03914C2525R7992
$$ y = [-146097, 230755, -90263, -194614, -440989, -15900, 5034, -78138, 111448, -5984, -258076, 142427, -358818, -120042, -15508, -168389, 236769, -70800, 121981, -193191, 55103, -133560, 106132, -49107, -160644, -104360, -206139, -174539, -138869, -94202, -370796, -133257, 215801, -175191, 166492, -216601, -100043, 109847, -165634, -338755, -203939, -1371, 245893, -360934, 9108, 150411, -128640, -126578, -153098, -134663, -115176, 26851, -112022, 15465, 35777, -443437, -185886, 123001, -16902, -212569, -98538, 247406, 27044, -170572, -61562, -48817, -290833, -128932, -22903, 108038, 16405, -125220, 45887, -2816, -210170, 66821, -64225, 118866, -136096, -106457, 134815, -73808, -122318, 27439, -445056, -166432, -15504, -140372, -70987, 75247, -203914, 32525, 130517]
8994A30517h1740B13497e3373q6913F4690i7769K9620k30539a30850C4253b48882
8982a62972k9211E4811b18552g9508A23739d39680J87817F9716K26934h5964j50020
8971b35984m8220J39028A21044J26870I4728m1116N9068R1029p6338a16492j81575
8960b98067c1222r6674E8789J7590a84589F0430H779K0477a19318A55256b20157
8948a12287j21815C0999J5606a61480e0483j62066L0638G2095d0015A5040c33824
8936A4382a93849B4250J52403J26725j25625k1291J08313a1619C31763I785i5775
8924C23963q9603J61990N07386J043161M767980P377285E012479A259558F14060
8914C88068J34258A19561K69626f1607p9959M7370A07967L7159k4714K33530c07109
$$ y = [130517, -81740, 213497, -53373, -140286, 64690, -97769, -68149, -298688, -130850, 34253, -248882, -162972, -192183, 54811, -218552, -79508, 123739, -439680, -251863, 69716, 296650, -85964, -235984, -284204, -145176, 121044, 247914, 94728, 53612, 112680, 203709, 127371, -116492, -298067, -31222, -127896, 58789, 76379, -184589, 60430, 8779, 29256, -119318, 155256, -220157, -112287, -234102, 30999, 46605, -161480, -50483, -212549, -181911, 72095, -40015, 15040, -333824, 14382, -193849, 24250, 176653, 303378, 177753, 156462, 264775, -11619, 331763, 9785, -95775, 323963, 234360, 396350, 903736, 1946897, 6714877, 14092162, 5012479, 1259558, 614060, 388068, 522326, 119561, 389187, -61607, -141566, -94196, 107967, 145126, 120412, 353942, -307109]
8902a99209H2113a81862A99232c1486B7419J66251n7126J4582j6519a60118C6783
8890D0452J1550e9359H6420A9717J56104O0365l6918a29116M4436q5129H7054
8878i8295j14118i9124c4965j88445n5952l33989G2551R5097a45104A50556b891
8866a7370A33760J9766b51000b2250m1348k25203A31226c84166A7241M306d0421
$$ y = [-199209, 82113, -181862, 199232, -31486, 27419, 193670, 136544, 151126, 134607, -160118, 36783, 40452, 52002, -59359, 86420, 19717, 175821, 236186, 199268, -129116, -84680, -169809, 87054, -98295, -212413, -99124, -34965, -223410, -279362, -613351, 72551, 167648, -145104, 150556, -2891, -17370, 133760, 153526, -251000, -22250, -63598, -288801, 131226, -384166, 17241, 21547, -40421]
$$ [...]
##END NTUPLES=NMR SPECTRUM
##END=
