
##TITLE=AC1068_TOPL01_6608529_kxjj5BuZwT
##JCAMPDX= 6.0         $$ Bruker NMR JCAMP-DX V2.0
##DATA TYPE= NMR SPECTRUM
##DATA CLASS= NTUPLES
##ORIGIN= BRUKER
##OWNER= Administrator
$$ 1.72 TOPSPIN		Version 2.1
$$ 2012-08-01 15:33:34.281 -0500  Administrator@TOPSPIN
$$ Compression mode = diff/dup
##.OBSERVE FREQUENCY= 400.02188249412
##.OBSERVE NUCLEUS= ^1H
##.ACQUISITION MODE= SIMULTANEOUS (DQD)
##.ACQUISITION SCHEME= undefined
##.AVERAGES= 64
##.DIGITISER RES= 22
##SPECTROMETER/DATA SYSTEM= spect
##.PULSE SEQUENCE= noesygpps1d.comp
##.SOLVENT NAME= COFFEE_meoh
##.SHIFT REFERENCE= INTERNAL, COFFEE_meoh, 1, 14.96239
##AUDIT TRAIL= $$ (NUMBER, WHEN, WHO, WHERE, PROCESS, VERSION, WHAT)
$$ ##TITLE= Audit trail, TOPSPIN		Version 2.1
$$ ##JCAMPDX= 5.01
$$ ##ORIGIN= Bruker BioSpin GmbH
$$ ##OWNER= Administrator
$$ $$ C:\Bruker\TOPSPIN/data/COFFEE/nmr/AC1068_TOPL01_6608529_kxjj5BuZwT/22/pdata/1/auditp.txt
$$ ##AUDIT TRAIL=  $$ (NUMBER, WHEN, WHO, WHERE, PROCESS, VERSION, WHAT)
(   1,<2012-08-01 15:33:28.312 -0500>,<Administrator>,<TOPSPIN>,<go>,<TOPSPIN 2.1>,
      <created by zg
	started at 2012-08-01 15:21:58.109 -0500,
	POWCHK enabled, PULCHK disabled,
       configuration hash MD5:
       6B 1B 68 BB D9 2E 58 E2 7F 35 AD 54 07 DF 0E 41
       data hash MD5: 64K
       19 95 FC B4 D0 E4 99 31 E8 38 E2 43 BA A8 E9 B5>)
(   2,<2012-08-01 15:33:31.343 -0500>,<Administrator>,<TOPSPIN>,<proc1d>,<TOPSPIN 2.1>,
      <Start of raw data processing
       efp LB = 0.3 FT_mod = 6 PKNL = 1 PHC0 = 0 PHC1 = 0 SI = 128K 
       data hash MD5: 128K
       AE 42 64 6A 09 D3 27 CC B1 0F DB E7 57 E7 6F 56>)
(   3,<2012-08-01 15:33:32.390 -0500>,<Administrator>,<TOPSPIN>,<proc1d>,<TOPSPIN 2.1>,
      <pk PHC0 = -0.09887695 PHC1 = 0 
       data hash MD5: 128K
       C5 0B 56 63 61 1A CA B4 EE FF B5 70 7D 8A E2 93>)
(   4,<2012-08-01 15:33:33.953 -0500>,<Administrator>,<TOPSPIN>,<proc1d>,<TOPSPIN 2.1>,
      <abs ABSG = 1 
       data hash MD5: 128K
       E7 09 50 1B 13 BE BD 8F 86 4E 4A E5 AC 33 2E F6>)
(   5,<2012-08-01 15:33:34.031 -0500>,<Administrator>,<TOPSPIN>,<proc1d>,<TOPSPIN 2.1>,
      <abs ABSG = 2 
       data hash MD5: 128K
       13 F1 DF 40 3F 97 63 4A 0A 2F D7 1B FA 32 E3 4C>)
(   6,<2012-08-01 15:33:34.078 -0500>,<Administrator>,<TOPSPIN>,<proc1d>,<TOPSPIN 2.1>,
      <abs ABSG = 3 
       data hash MD5: 128K
       E2 E6 C9 0E 86 02 E2 34 B7 60 CD 53 71 A0 7E F0>)
(   7,<2012-08-01 15:33:34.156 -0500>,<Administrator>,<TOPSPIN>,<proc1d>,<TOPSPIN 2.1>,
      <abs ABSG = 4 
       data hash MD5: 128K
       A6 A5 89 82 75 0C 08 9F 94 B6 19 64 11 AD 27 8C>)
(   8,<2012-08-01 15:33:34.203 -0500>,<Administrator>,<TOPSPIN>,<proc1d>,<TOPSPIN 2.1>,
      <abs ABSG = 5 
       data hash MD5: 128K
       99 1A 0B 8A EE CC D0 07 A4 DC 08 99 66 A1 87 F6>)
$$ ##END=
$$ 
$$ $$ hash MD5
$$ $$ 69 DD DB 7F E5 3C BE F4 7C BE 07 F1 A6 AE 89 E7
##$RELAX= 
##$RELAX= 
##$RELAX= 
##$RELAX= 
##$RELAX= 
##$RELAX= 
##$RELAX= 
##$RELAX= 
$$ Bruker specific parameters
$$ [...]
##$TP07= 0
##$TPNAME0= <>
##$TPNAME1= <>
##$TPNAME2= <>
##$TPNAME3= <>
##$TPNAME4= <>
##$TPNAME5= <>
##$TPNAME6= <>
##$TPNAME7= <>
##$TPOAL= (0..7)
0.5 0.5 0.5 0.5 0.5 0.5 0.5 0.5
##$TPOFFS= (0..7)
0 0 0 0 0 0 0 0
##$TUNHIN= 0
##$TUNHOUT= 0
##$TUNXOUT= 0
##$USERA1= <user>
##$USERA2= <user>
##$USERA3= <user>
##$USERA4= <user>
##$USERA5= <user>
##$V9= 5
##$VALIST= <valist>
##$VCLIST= <CCCCCCCCCCCCCCC>
##$VD= 0
##$VDLIST= <DDDDDDDDDDDDDDD>
##$VPLIST= <PPPPPPPPPPPPPPP>
##$VTLIST= <TTTTTTTTTTTTTTT>
##$WBST= 1024
##$WBSW= 4
##$XGAIN= (0..3)
0 0 0 0
##$XL= 0
##$YL= 0
##$YMAX_a= 16647372
##$YMIN_a= -10550054
##$ZGOPTNS= <>
##$ZL1= 120
##$ZL2= 120
##$ZL3= 120
##$ZL4= 120
##$ABSF1= 14.96239
##$ABSF2= -5.595792
##$ABSG= 5
##$ABSL= 3
##$ALPHA= 0
##$AQORDER= 0
##$ASSFAC= 0
##$ASSFACI= 0
##$ASSFACX= 0
##$ASSWID= 0
##$AUNMP= <proc_prof1d_extract.lims>
##$AXLEFT= 0
##$AXNAME= <>
##$AXNUC= <1H>
##$AXRIGHT= 0
##$AXTYPE= 0
##$AXUNIT= <>
##$AZFE= 0.1
##$AZFW= 0.1
##$BCFW= 0
##$BC_mod= 0
##$BYTORDP= 0
##$COROFFS= 0
##$CY= 15
##$DATMOD= 1
##$DC= 0
##$DFILT= <>
##$DTYPP= 0
##$F1P= 0
##$F2P= 0
##$FCOR= 0.5
##$FTSIZE= 131072
##$FT_mod= 6
##$GAMMA= 0
##$GB= 0
##$INTBC= 1
##$INTSCL= 1
##$ISEN= 128
##$LB= 0.3
##$LEV0= 0
##$LPBIN= 0
##$MAXI= 10000
##$MC2= 0
##$MEAN= 0
##$ME_mod= 0
##$MI= 0
##$NCOEF= 0
##$NC_proc= -2
##$NLEV= 6
##$NOISF1= 0
##$NOISF2= 0
##$NSP= 0
##$NTH_PI= 0
##$NZP= 0
##$OFFSET= 14.96239
##$PC= 1
##$PHC0= -0.09887695
##$PHC1= 0
##$PH_mod= 1
##$PKNL= yes
##$PPARMOD= 0
##$PPDIAG= 0
##$PPIPTYP= 0
##$PPMPNUM= 2147483647
##$PPRESOL= 1
##$PSCAL= 4
##$PSIGN= 0
##$PYNMP= <proc.py>
##$REVERSE= no
##$SF= 400.020009081862
##$SI= 131072
##$SIGF1= 0
##$SIGF2= 0
##$SINO= 400
##$SIOLD= 131072
##$SPECTYP= <>
##$SREGLST= <1H.CDCl3>
##$SSB= 0
##$STSI= 131072
##$STSR= 0
##$SW_p= 8223.68421052631
##$SYMM= 0
##$S_DEV= 0
##$TDeff= 65536
##$TDoff= 0
##$TI= <>
##$TILT= no
##$TM1= 0
##$TM2= 0
##$TOPLEV= 0
##$USERP1= <user>
##$USERP2= <user>
##$USERP3= <user>
##$USERP4= <user>
##$USERP5= <user>
##$WDW= 1
##$XDIM= 131072
##$YMAX_p= 439950084
##$YMIN_p= -12467
##$CURPLOT= <Network HP LaserJet P1505>
##$CURPRIN= <$Network HP LaserJet P1505>
##$DFORMAT= <normdp>
##$LAYOUT= <+/1D_H.xwp>
##$LFORMAT= <normlp>
##$PFORMAT= <normpl>
##$SURQMSG= 1
$$ End of Bruker specific parameters
$$ ---------------------------------
##NTUPLES= NMR SPECTRUM
##VAR_NAME=  FREQUENCY,     SPECTRUM/REAL,   SPECTRUM/IMAG
##SYMBOL=    X,             R,               I
##VAR_TYPE=  INDEPENDENT,   DEPENDENT,       DEPENDENT
##VAR_FORM=  AFFN,          ASDF,            ASDF
##VAR_DIM=   131072,        131072,          131072
##UNITS=     HZ,            ARBITRARY UNITS, ARBITRARY UNITS
##FACTOR=    0.0627417313425164, 1,          1
##FIRST=     8223.62146879497, 2122,         -64196
##LAST=      0,             4332,            -63921
##MIN=       0,             -12467,          0
##MAX=       8223.62146879497, 439950084,    0
$$ Real data points
##PAGE= N=1
##DATA TABLE= (X++(R..R)), XYDATA
$$ [...]
60960B8091043N96307K6352q00712j630097k243616k557405k607910k478040k244584
60951A4151338j967067j688623j432430j204086j003368q31639o88706n69951
60943D765468m70645l89684l26684k78517k41056k11918j89472j71259j55329
60934B330904j41556j30070j19797j09656r9750r0349q1158p2522o5938o2286
60924A357822o0715n9931n9288n8086n5391n1389m7513m4364m0865l6226l1462
60913H12592k7946k5585k3425k1105j8872j6904j5279j4053j2917j1497j0098
60902F14911r341q948q099o879o177n960n178l647k483k173j737m70R12J678K339
60887E58748L640N302O662P630Q331Q648Q651Q717Q763Q267P339O742O530N833
$$ y = [28091043, 28687350, 28713702, 27912990, 26282893, 24039277, 21481872, 18873962, 16395922, 14151338, 12184271, 10495648, 9063218, 7859132, 6855764, 6024125, 5335419, 4765468, 4294823, 3905139, 3578455, 3299938, 3058882, 2846964, 2657492, 2486233, 2330904, 2189348, 2059278, 1939481, 1829825, 1730075, 1639726, 1558568, 1486046, 1420108, 1357822, 1297107, 1237176, 1177888, 1119802, 1064411, 1013022, 965509, 921145, 880280, 844054, 812592, 784646, 759061, 735636, 714531, 695659, 678755, 663476, 649423, 636506, 625009, 614911, 605570, 596622, 588523, 581644, 575467, 569507, 564329, 560682, 558199, 556026, 554289, 553819, 554731, 556409, 558748, 562388, 567690, 574352, 581982, 590313, 598961, 607612, 616329, 625092, 633359, 640698, 647440, 653970, 659803]
60873F59803M367K892J790M86j136k223k564l323n258p396q465q561q466q294
60859F13652p825p268o749n814m362l223k987k936j959R5K634N123P050Q016Q549
60844F01996R960J2628J5321J6848J7328J7057J5420J2261R260Q397R548J0943
60832G56967J1594J1912J2247J2160J1235R624P652N650M103L325K965K431J672
60819H53537J149J218J958L193M231M082K529N81p51j667k952m599n942o907q111
60804H41549r804j1418j2364j2712j2966j3495j4220j4623j4100j2594j0702r037
60792F93514p666o387n211m226l234j888j00J854L583M840N792P001Q766J0479
60778G07117J1098J0442R539R411R945J0205R547Q144O728N946N766N501M653
$$ y = [659803, 664170, 667062, 668852, 669338, 668202, 665979, 663415, 660092, 654834, 647438, 638973, 630412, 621946, 613652, 605827, 598559, 591810, 585996, 581634, 578411, 575424, 572488, 570529, 570624, 573258, 578381, 585431, 593447, 601996, 611956, 624584, 639905, 656753, 674081, 691138, 706558, 718819, 728079, 736476, 746024, 756967, 768561, 780473, 792720, 804880, 816115, 825739, 833391, 839041, 843144, 846469, 849434, 851865, 853537, 854686, 855904, 857862, 861055, 865286, 869368, 871897, 872478, 871727, 870060, 867108, 862509, 856567, 849660, 841549, 831745, 820327, 807963, 795251, 782285, 768790, 754570, 739947, 725847, 713253, 702551, 693514, 685848, 679461, 674250, 670024, 666790, 664902, 664802, 666656, 670239, 675079, 680871, 687872, 696638, 707117, 718215, 728657, 738196, 747607, 757552, 767757, 777304, 785448, 792176, 798122, 803888, 809389, 814042]
60765H14042L660L341L801M429M838N149N421N543N765O480P412P798P515P224
60751H92418P252P227P019P086P536P718P165O183N152M021K862K049J442L15
60737I65445j449k848l061k555k325k782l814n282o835p832q095q155q425q681
60723H93306q703q652q464p712o552n901o122o397o035n580n834o620p299p800
60709G95635q266q395p962p493p568p889p727o884n595m038k495j340l07J489
60695G21165M125O285O966O920P384Q130P950O561M755K950P74j986m994p894
60681G69091j0419j2181j3124j3957j5287j6519j6500j5102j3321j1854j0467
60670F20360q848p239n958m921l827k533j091K58J287K107L064M063M402L709
$$ y = [814042, 817702, 821043, 824844, 829273, 834111, 839260, 844681, 850224, 855989, 862469, 869881, 877679, 885194, 892418, 899670, 906897, 913916, 921002, 928538, 936256, 943421, 949604, 954756, 958777, 961639, 963688, 965130, 965445, 963996, 961148, 958087, 955532, 953207, 950425, 946611, 941329, 934494, 926662, 918567, 910412, 901987, 893306, 884603, 875951, 867487, 859775, 853223, 847322, 841200, 834803, 828768, 823188, 817354, 810734, 803435, 795635, 787369, 778974, 771012, 763519, 755951, 748062, 740335, 733451, 727856, 723818, 721323, 719983, 719676, 721165, 725290, 731575, 738541, 745461, 752845, 760975, 768925, 775486, 780241, 783191, 783965, 781979, 776985, 769091, 758672, 746491, 733367, 719410, 704123, 687604, 671104, 656002, 642681, 630827, 620360, 611512, 604273, 598315, 593394, 589567, 587034, 585943, 586201, 587488, 589595, 592659, 596722, 601124, 604833]
60656F04833K551J653R72J66m88l78M91J609K793M136N229N235L954K228J167
60641F36151J158J699K008J758J354J376J868K504L306M577O092P169P787Q738
60627F87545J0328J1813J2699J3636J5228J6817J7378J7039J6647J6416J5900
60616H51446J4961J3752J2055R652P078N140L814K414P14q62k036k971l894n009
60602I06254o510q218r452r965j0519j1904j3776j5220j5982j6283j5857j4228
60590G58340j1742r295p161m996k851j264l02N31J484K390L286M292M830L980
60576G41522J839k40j069p19K5O80J285K008K812L382L461L291L382L620L173
60561G68452J730J63p12j378k716m437n457n556n435n338m800l774k742j660R5
$$ y = [604833, 607384, 609037, 610009, 610175, 609687, 609309, 609800, 611409, 614202, 618338, 623567, 628802, 632756, 634984, 636151, 637309, 639008, 641016, 642774, 644128, 645504, 647372, 649876, 653182, 657759, 663851, 671020, 678807, 687545, 697873, 709686, 722385, 736021, 751249, 768066, 785444, 802483, 819130, 835546, 851446, 866407, 880159, 892214, 901866, 908944, 914084, 917898, 920312, 921026, 920164, 918128, 915157, 911263, 906254, 899744, 891526, 882074, 872109, 861590, 849686, 835910, 820690, 804708, 788425, 772568, 758340, 746598, 737303, 730142, 725146, 722295, 721031, 720729, 721260, 722744, 725134, 728420, 732712, 737542, 741522, 743361, 743121, 742052, 741333, 741358, 742038, 743323, 745331, 748143, 751525, 754986, 758277, 761659, 765279, 768452, 770182, 770345, 769633, 768255, 765539, 761102, 755645, 750089, 744654, 739316, 734516, 730742, 728000, 726340, 726435]
60546G26435K433M387N619P052R478J2516J5591J9109K3761K9222L4296L8038
60534I27937L9966L9493L5925K9286K0618J1240J820p562j6581k4139k8964l0611
60522I98428k9640k6813k2557j7405j2288p883l892M09M996Q937J1394J2397J2655
60509I28738J2791J2832J2382J1454J1017J2269J5313J9165K3245K8125L4440
60498A121771M1933N0229N9816P1371Q4680R9134J14848J32402J51813J72772
60488B100769J95744K21749K50941K81998L12481L38648L54661L53175L27803
60479D737969K75631J98267J01548n510j12237k08040k84032l34849l60058l63641
60469C645048l51335l28279k98771k66751k35188k05362j77752j53204j32440
$$ y = [726435, 728868, 733255, 738874, 745926, 755404, 767920, 783511, 802620, 826381, 855603, 889899, 927937, 967903, 1007396, 1043321, 1072607, 1093225, 1104465, 1106285, 1098723, 1082142, 1058003, 1029039, 998428, 968788, 941975, 919418, 902013, 889725, 881842, 877950, 878359, 883355, 892292, 903686, 916083, 928738, 941529, 954361, 966743, 978197, 989214, 1001483, 1016796, 1035961, 1059206, 1087331, 1121771, 1163704, 1213933, 1273749, 1345120, 1429800, 1528934, 1643782, 1776184, 1927997, 2100769, 2296513, 2518262, 2769203, 3051201, 3363682, 3702330, 4056991, 4410166, 4737969, 5013600, 5211867, 5313415, 5307905, 5195668, 4987628, 4703596, 4368747, 4008689, 3645048, 3293713, 2965434, 2666663, 2399912, 2164724, 1959362, 1781610, 1628406, 1495966]
60460A495966j14965r9692q6367p5393o6525n8918n2260m6662m1606l6210l0648
60449G86720k6062k2897k0422j8045j6021j4520j3158j1816j0993j0843j0701
60438F11242j0068r346r139r367r488r150q300p085n832m793l850k874k255k409
60424E17286k902k833k063j283p97j14J101K446L484M279M935N267N210N051M972
60409E44039M810M438L929L307K612K160K190K321K021J558J754K747L784M337
60395E86007M673N170N739O120O127N530M369L353L254L841M172L967L742L534
60381F49598K572O20j286k062j856j627j898k430k727k475j774j092p71n87j74
60366F32031K73L49L26Q89J952K628K550K449L061M174N063N346N137M812M867
$$ y = [1495966, 1381001, 1281309, 1194942, 1119549, 1053024, 994106, 941846, 895184, 853578, 817368, 786720, 760658, 737761, 717339, 699294, 683273, 668753, 655595, 643779, 632786, 621943, 611242, 601174, 591828, 582689, 573322, 563834, 554684, 546384, 539299, 533467, 528674, 524824, 521950, 519695, 517286, 514384, 511551, 509488, 508205, 507408, 507294, 508395, 510841, 514325, 518604, 523539, 528806, 534016, 539067, 544039, 548849, 553287, 557216, 560523, 563135, 565295, 567485, 569806, 571827, 573385, 575139, 577886, 581670, 586007, 590680, 595850, 601589, 607709, 613836, 619366, 623735, 627088, 630342, 634183, 638355, 642322, 646064, 649598, 652170, 652790, 651504, 649442, 647586, 645959, 644061, 641631, 638904, 636429, 634655, 633563, 632792, 632205, 632031, 632304, 632653, 632979, 633868, 635820, 638448, 640998, 643447, 646508, 650682, 655745, 661091, 666228, 671040, 675907]
60351F75907N544O472P095P403P824Q427Q884R080R112Q768P720O238M905L740
60337G77119K331Q15j44l49j71L15J441L205N315P877J1092J4312J6489J7498
60323H57145J7909J7480J5251J1235O621J984l287r260j4530j7733j8942j8896
60311H44977j7969j6463j4834j3036j0549p690n762n304n302m795m132l820l353
60298G31968k168q01j1M79J297K232K684K674K551K326K062K196K660K560J576
60283G54285Q37J364K501K997K809K648K437J713J042J499K891L930M085M086
60269G89124M489N016N473O225P428Q672R738J1008J2806J4865J6768J8507K0396
60256I30515K2671K5295K7974L0429L2792L5531L8830M2451M6435N1385N7486
$$ y = [675907, 681451, 687923, 695018, 702421, 710245, 718672, 727556, 736636, 745748, 754516, 762236, 768474, 773379, 777119, 779450, 780265, 780121, 779772, 779601, 779916, 781357, 784562, 789877, 797754, 808846, 823158, 839647, 857145, 875054, 892534, 907785, 919020, 925641, 927625, 924338, 915078, 900548, 882815, 863873, 844977, 827008, 810545, 795711, 782675, 772126, 764436, 758674, 753370, 748068, 743273, 739141, 735321, 731968, 729800, 728999, 728988, 729467, 730764, 732996, 735680, 738354, 740905, 743231, 745293, 747489, 750149, 752709, 754285, 755122, 756486, 758987, 761984, 764793, 767441, 769878, 771591, 772633, 774132, 777023, 780953, 785038, 789124, 793613, 798629, 804102, 810327, 817755, 826427, 836165, 847173, 859979, 874844, 891612, 910119, 930515, 953186, 978481, 1006455, 1036884, 1069676, 1105207, 1144037, 1186488, 1232923, 1284308, 1341794]
60245A341794O3856O9582P5042Q1315Q8503R5559J01705J07158J12222J16364
60235B253100J18566J18154J15079J09686J02464R3745Q3494P1515N7965M3469
60225C167237K8751J4240J61j3087k4788l4320m1666m7213n0894n1866m9599m4883
60213B852073l9172l3029k5916j7423p803K778J4614K7668M1207N4594O7786Q0714
60201C018091R2868J03871J13714J21887J26997J27843J24376J17155J06454R2539
60191D145795P6227N8480L9776K0332M71j9584l9674n8887p5377q7760r6258j01782
60179C861759j04360j03192r7960q9324p8282o5608n1762l6879k0991m576J1464
60168C220289K6671M1430N6035O9759Q1349Q9943R5037R6016R2441Q4572P3115
$$ y = [1341794, 1405650, 1475232, 1550274, 1631589, 1720092, 1815651, 1917356, 2024514, 2136736, 2253100, 2371666, 2489820, 2604899, 2714585, 2817049, 2910794, 2994288, 3065803, 3123768, 3167237, 3195988, 3210228, 3210389, 3197302, 3172514, 3138194, 3096528, 3049315, 2998421, 2946555, 2896956, 2852073, 2812901, 2779872, 2753956, 2736533, 2728730, 2731508, 2746122, 2773790, 2814997, 2869591, 2937377, 3018091, 3110959, 3214830, 3328544, 3450431, 3577428, 3705271, 3829647, 3946802, 4053256, 4145795, 4222022, 4280502, 4320278, 4340610, 4341081, 4321497, 4281823, 4222936, 4147559, 4059799, 3963541, 3861759, 3757399, 3654207, 3556247, 3466923, 3388641, 3323033, 3271271, 3234392, 3213401, 3208825, 3220289, 3246960, 3288390, 3344425, 3414184, 3495533, 3585476, 3680513, 3776529, 3868970, 3953542, 4026657]
60157D026657N8794M2540K5704R438n820j9837l1885m1147m7346n0476n0274m6559
60145C869789l9793l0725j9691o795P644K3329M0368N8808P8165R8056J19045
60134D198200J42023J66888J92588K18492K44986K72424K99922L25569L47678
60125F408770L65606L79315L88324L91328L87006L74949L55493L28977K95681
60116I675449K56315K11841J62839J09621N3022n632o5204j24612j82021k34998
60106I856620k81502l19856l47980l64095l68577l63717l51136l30662l02409
60097F826686k68635k32474j95711j58694j21585q4684m8300j3185J9428M8923
60087E771769P5623R9212J17680J28812J32118J28454J18540J02913Q2682N9324
$$ y = [4026657, 4085451, 4127991, 4153695, 4163133, 4157313, 4137476, 4105591, 4064444, 4017098, 3966622, 3916348, 3869789, 3829996, 3799271, 3779580, 3772785, 3780429, 3803758, 3844126, 3902934, 3981099, 4079155, 4198200, 4340223, 4507111, 4699699, 4918191, 5163177, 5435601, 5735523, 6061092, 6408770, 6774376, 7153691, 7542015, 7933343, 8320349, 8695298, 9050791, 9379768, 9675449, 9931764, 10143605, 10306444, 10416065, 10469087, 10463455, 10398251, 10273639, 10091618, 9856620, 9575118, 9255262, 8907282, 8543187, 8174610, 7810893, 7459757, 7129095, 6826686, 6558051, 6325577, 6129866, 5971172, 5849587, 5764903, 5716603, 5703418, 5722846, 5771769, 5847392, 5946604, 6064284, 6193096, 6325214, 6453668, 6572208, 6675121, 6757803, 6817127]
60077F817127L4021P975j7208m0292o1091p9859r6703j12190j27449j42604j55984
60066F025743j65860j72238j75886j76560j73559j67294j58846j48502j36045
60057D550953j22071j07560r2545p6378n9122m1405k3275m441J4627L3096N0984
60046D122863O8803Q6146J01878J15411J26584J34404J37299J34686J27152J15142
60036E270368R8627P8144N5025L0306M399k2143m8334p3299r6298j16280j32201
60025E048314j43728j50890j53390j51066j44728j35556j23952j10001r4676p9365
60015C760962o4373m9074l3361j7818k445J3511L0381M7727O5288Q3294J01787
60004C935879J20475J39108J57086J72891J84874J92416J95282J92276J81970
$$ y = [6817127, 6851148, 6859123, 6841915, 6801623, 6740532, 6660673, 6563970, 6451780, 6324331, 6181727, 6025743, 5859883, 5687645, 5511759, 5335199, 5161640, 4994346, 4835500, 4686998, 4550953, 4428882, 4321322, 4228777, 4152399, 4093277, 4051872, 4028597, 4024156, 4038783, 4071879, 4122863, 4191666, 4277812, 4379690, 4495101, 4621685, 4756089, 4893388, 5028074, 5155226, 5270368, 5368995, 5447139, 5502164, 5532470, 5536869, 5514726, 5466392, 5393093, 5296795, 5180515, 5048314, 4904586, 4753696, 4600306, 4449240, 4304512, 4168956, 4045004, 3935003, 3840327, 3760962, 3696589, 3647515, 3614154, 3596336, 3593891, 3607402, 3637783, 3685510, 3750798, 3834092, 3935879, 4056354, 4195462, 4352548, 4525439, 4710313, 4902729, 5098011, 5290287, 5472257]
59995E472257J64834J43208J19002R2490O3521L2649P18l1522o3034r2550j19218
59984E782355j42431j60938j73111j78231j76756j69467j57222j41452j23662
59975D359085j04321q3236o1041l9214j8527J442K1085M0045N7894P4465Q9308
59964D336985J01706J11422J18602J22872J23447J20191J13744J04585R2962P9645
59954E426161O5735N1749L7838K4727J3381L877m140r911j1827r190k505Q001
59942E593896K2782M1843O4632R1196J22045J56664J93628K32405K73454L16068
59932G108613L57665L95683M28630M54481M69511M69711M52415M16012L59508
59923A0912229K83683J92099R0194j5996j20066k15542k97272l62309m09409m38494
$$ y = [5472257, 5637091, 5780299, 5899301, 5991791, 6055312, 6087961, 6088679, 6057157, 5994123, 5901573, 5782355, 5639924, 5478986, 5305875, 5127644, 4950888, 4781421, 4624199, 4482747, 4359085, 4254764, 4171528, 4110487, 4071273, 4052746, 4054188, 4075273, 4115318, 4173212, 4247677, 4336985, 4438691, 4550113, 4668715, 4791587, 4915034, 5035225, 5148969, 5253554, 5346516, 5426161, 5491896, 5543645, 5581483, 5606210, 5619591, 5623468, 5619328, 5609417, 5597590, 5588400, 5585895, 5593896, 5616678, 5658521, 5723153, 5814349, 5936394, 6093058, 6286686, 6519091, 6792545, 7108613, 7466278, 7861961, 8290591, 8745072, 9214583, 9684294, 10136709, 10552721, 10912229, 11195912, 11388011, 11478205, 11462209, 11342143, 11126601, 10829329, 10467020, 10057611, 9619117]
59913I619117m50931m49330m36330m14057l84654l50336l12772k73307k33818
59904F313582j95991j59716j23607q7383n2202j8383J5359M9595Q2851J13567
59894E937672J41796J67753J90022K06460K15724K16688K07444J86439J53913
59885G623911J11273N9928K009n8624j17541j71615k18931k57630k86168l04305
59875F382307l12908l13055l06199k94504k79831k62552k42288k19578j96076
59866C955316j73280j51806j31619j12469r4294p7680o3493n1820m1969l3918
59856C022968k8873k7660k9249l1743l4124l6127l7100l6216l3495k9615k4844
59845B673922j8973j2305n890q46K073K298n29o254j4116k2918l1320l8305m3572
$$ y = [9619117, 9168186, 8718856, 8282526, 7868469, 7483815, 7133479, 6820707, 6547400, 6313582, 6117591, 5957875, 5834268, 5746885, 5694683, 5676300, 5691659, 5741254, 5824105, 5937672, 6079468, 6247221, 6437243, 6643703, 6859427, 7076115, 7283559, 7469998, 7623911, 7735184, 7795112, 7797121, 7738497, 7620956, 7449341, 7230410, 6972780, 6686612, 6382307, 6069399, 5756344, 5450145, 5155641, 4875810, 4613258, 4370970, 4151392, 3955316, 3782036, 3630230, 3498611, 3386142, 3291848, 3214168, 3150675, 3098855, 3056886, 3022968, 2994095, 2966435, 2937186, 2905443, 2871319, 2835192, 2798092, 2761876, 2728381, 2698766, 2673922, 2654949, 2642644, 2636754, 2635908, 2637981, 2640279, 2639750, 2633496, 2619380, 2596462, 2565142, 2526837, 2483265]
59832B483265m7188m8889m8207m5211m0433l4029k5912j6849q398j385M590R803
59820B181157J3601J5691J7183J9610K3535K8833L5503M3320N1235N7897O2490
59809B550055O4682O4387O2115N8827N4843M9470M2248L3866K5306J6832Q431
59798C031062O26n821j0429j2756j2335r439n068L59P527J6792K7245L8029M9667
59785C115459O3160P8517R5364J14265J36331J61920J90822K23337K60002L00344
59775D739521L42501L83564M18946M41272M41042M09668L43200K44923J25405
59766G890042m75j18073k16239k88157l31471l48535l45242l27995l01544k69421
59756E342890k35046k01195j69021j38661j10389q4630o1403m0527k1800m503
$$ y = [2483265, 2436077, 2387188, 2338981, 2293770, 2253337, 2219308, 2193396, 2176547, 2168149, 2166764, 2171354, 2181157, 2194758, 2210449, 2227632, 2247242, 2270777, 2299610, 2335113, 2378433, 2429668, 2487565, 2550055, 2614737, 2679124, 2741239, 2800066, 2854909, 2904379, 2946627, 2980493, 3005799, 3022631, 3031062, 3031688, 3025867, 3015438, 3002682, 2990347, 2980908, 2975840, 2976199, 2983726, 3000518, 3027763, 3065792, 3115459, 3178619, 3257136, 3352500, 3466765, 3603096, 3765016, 3955838, 4179175, 4439177, 4739521, 5082022, 5465586, 5884532, 6325804, 6766846, 7176514, 7519714, 7764637, 7890042, 7889567, 7771494, 7555255, 7267098, 6935627, 6587092, 6241850, 5913855, 5612311, 5342890, 5107844, 4906649, 4737628, 4598967, 4488578, 4403948, 4342545, 4302018, 4280218, 4275715]
59746D275715J2591K9862M6360O1387P5770R0668J05995J21159J36635J53490
59736E109632J71731J90537K09960K31268K55495K82618L12244L44326L78971
59727G486782M16017M54890M94763N34789N74043O10697O41292O61820O69854
59718A2544947O64964O47123O16247N74209N26214M79019M38346M08405L92562
59709A7292036L92935M09537M40375M81800N28340N73489O11720O38919O50354
59700B2019505O39864O02811N39119M52281L46706K27710J02957j8618j29652
59691B4782683k24968l00055l51147l77139l79942l62484l27280k76822k13899
59682B1968947j40899n9419K9376J24696K26356L34257M47594N64939O84552Q03552
$$ y = [4275715, 4288306, 4318168, 4364528, 4425915, 4501685, 4592353, 4698348, 4819507, 4956142, 5109632, 5281363, 5471900, 5681860, 5913128, 6168623, 6451241, 6763485, 7107811, 7486782, 7902799, 8357689, 8852452, 9387241, 9961284, 10571981, 11213273, 11875093, 12544947, 13209911, 13857034, 14473281, 15047490, 15573704, 16052723, 16491069, 16899474, 17292036, 17684971, 18094508, 18534883, 19016683, 19545023, 20118512, 20730232, 21369151, 22019505, 22659369, 23262180, 23801299, 24253580, 24600286, 24827996, 24930953, 24912335, 24782683, 24557715, 24257660, 23906513, 23529374, 23149432, 22786948, 22459668, 22182846, 21968947, 21828048, 21768629, 21798005, 21922701, 22149057, 22483314, 22930908, 23495847, 24180399, 24983951]
59672B4983951R16776J016920J095369J142260J146576J097944R89282Q18417
59664C3207495N89094L12216N853l07577o05373q67281j077334j226246j312768
59655B8718079j341922j321711j261559j172157j064502r48817q35371p35807
59647B0036233o61844o21886o18771o49263p03831p67598q24551q63081q78297
59638A3447111q70288q41868p97752p43623o84444o23577n63489n06358m53730
59629G361982m06126l63190l24071k88018k55147k26185k01040j78315j56864
59620D963026j36993j19293j03201q7896p3787o1766n1715m3221l7067l4309l4338
59609D179440l5649l8316m3792n2239o1789p0664p8480q5124q9924r2494r3158
$$ y = [24983951, 25900727, 26917647, 28013016, 29155276, 30301852, 31399796, 32389078, 33207495, 33796589, 34108805, 34114658, 33807081, 33201708, 32334427, 31257093, 30030847, 28718079, 27376157, 26054446, 24792887, 23620730, 22556228, 21607411, 20772040, 20036233, 19374389, 18752503, 18133732, 17484469, 16780638, 16013040, 15188489, 14325408, 13447111, 12576823, 11734955, 10937203, 10193580, 9509136, 8885559, 8322070, 7815712, 7361982, 6955856, 6592666, 6268595, 5980577, 5725430, 5499245, 5298205, 5119890, 4963026, 4826033, 4706740, 4603539, 4515643, 4441856, 4380090, 4328375, 4285154, 4248087, 4213778, 4179440, 4143791, 4105475, 4061683, 4009444, 3947655, 3876991, 3798511, 3713387, 3623463, 3530969, 3437811]
59598C437811r2140q9328q5051q0023p4259o7126n8668m9917m1654l3877k6506
59587B739262j9664j3140o535j01N556J0541J5486K0288K4066K6363K7439K7478
59575B857039K6554K5293K4406K3692K2660K1910K2673K5055K8096L1544L6108
59564C145030M1964M8470N5552O3935P3665Q3852R4105J05066J17178J30252J44514
59553D103583J60654J78387J96329K13763K31310K49283K66583K81801K94300
59544F175993L03508L08247L07559L01631K91343K77586K61227K43034K23198
59535H693326K01324J77022J50125J20859R0837O3508M2247K7926J9412J6195
59525I602781J9128K8696M4243O4961Q9868J16245J39620J55934J62631J57561
$$ y = [3437811, 3345671, 3256343, 3171292, 3091269, 3017010, 2949884, 2891216, 2841299, 2799645, 2765768, 2739262, 2719598, 2706458, 2699923, 2699822, 2705378, 2715919, 2731405, 2751693, 2775759, 2802122, 2829561, 2857039, 2883593, 2908886, 2933292, 2956984, 2979644, 3001554, 3024227, 3049282, 3077378, 3108922, 3145030, 3186994, 3235464, 3291016, 3354951, 3428616, 3512468, 3606573, 3711639, 3828817, 3959069, 4103583, 4264237, 4442624, 4638953, 4852716, 5084026, 5333309, 5599892, 5881693, 6175993, 6479501, 6787748, 7095307, 7396938, 7688281, 7965867, 8227094, 8470128, 8693326, 8894650, 9071672, 9221797, 9342656, 9433493, 9497001, 9539248, 9567174, 9586586, 9602781, 9621909, 9650605, 9694848, 9759809, 9849677, 9965922, 10105542, 10261476, 10424107, 10581668]
59515A0581668J38673J05701O0746O378n5630j23043j92028k58393l19022l71426
59505I573624m12992m41807m57661m61512m54562m38381m15201l87352l56725
59496E747431l24879k92947k61281k30050k00337j73660j50253j28892j08583
59487C876549q9412p1504n4480l8311k3474r709M231J9083L4376M9694O5473Q2009
59475C844525R8811J15596J33041J51865J71960J92773K13674K33624K51373K66249
59465E673491K77747K84216K83083K72648K52400K21680J79811J28133P0300R767
59455G653276n1525j11425j66414k13420k51513k80712l00461l10558l12433l08132
59445E346683k98794k85158k68662k50860k32369k13410j94731j77051j60240
$$ y = [10581668, 10720341, 10826042, 10886788, 10893166, 10837536, 10714493, 10522465, 10264072, 9945050, 9573624, 9160632, 8718825, 8261164, 7799652, 7345090, 6906709, 6491508, 6104156, 5747431, 5422552, 5129605, 4868324, 4638274, 4437937, 4264277, 4114024, 3985132, 3876549, 3787137, 3715633, 3661153, 3622842, 3599368, 3589659, 3593890, 3612973, 3647349, 3697043, 3762516, 3844525, 3943336, 4058932, 4191973, 4343838, 4515798, 4708571, 4922245, 5155869, 5407242, 5673491, 5951238, 6235454, 6518537, 6791185, 7043585, 7265265, 7445076, 7573209, 7643509, 7653276, 7601751, 7490326, 7323912, 7110492, 6858979, 6578267, 6277806, 5967248, 5654815, 5346683, 5047889, 4762731, 4494069, 4243209, 4010840, 3797430, 3602699, 3425648, 3265408]
59436C265408j43930j28413j14120j00909q8578p7558o8325o0532n3317m6065
59426B383661l8576l1081k4297j8743j3845q579l037J732N548R410J3709J7630
59414B293532K0829K4253K8666L3595L8120M1115M0484L4423K4648J6483J4090
59403B610238J7039K2621K9772L8977M9985O1728P3495Q4196R1440R3619R2780
59392C265890R3627R9691J11496J27918J47757J70237J95301K23589K55340K89771
59382D980617L26314L65690M08587M53619M97679N37784N71556N96343O09247
59373I347436O08117N92130N61977N20286M71145M18389L64638L12358K64431
59364A3460907K22549J85898J52600J21561R1650O0223K4295j7195o3555j14070
$$ y = [3265408, 3121478, 2993065, 2878945, 2778036, 2689458, 2611900, 2543575, 2483043, 2429726, 2383661, 2345085, 2314004, 2289707, 2270964, 2257119, 2248540, 2245503, 2247235, 2252783, 2262193, 2275902, 2293532, 2314361, 2338614, 2367280, 2400875, 2438995, 2480110, 2520594, 2555017, 2579665, 2596148, 2610238, 2627277, 2649898, 2679670, 2718647, 2768632, 2830360, 2903855, 2988051, 3079491, 3173110, 3265890, 3359517, 3459208, 3570704, 3698622, 3846379, 4016616, 4211917, 4435506, 4690846, 4980617, 5306931, 5672621, 6081208, 6534827, 7032506, 7570290, 8141846, 8738189, 9347436, 9955553, 10547683, 11109660, 11629946, 12101091, 12519480, 12884118, 13196476, 13460907, 13683456, 13869354, 14021954, 14143515, 14235165, 14295388, 14319683, 14302488, 14238933, 14124863]
59354A4124863j67744k21647k71256l12785l44215l64521l73642l73600l68346
59345A1327107l61930l57214l56090l59524l66973l76558l86251l94638m00549
59336G967380m02627l99488l90245l75096l55624l34018l11567k88229k63929
59327D846557k39533k16059j93672j72138j51685j32734j15239r9017q4230p0901
59317C371349n8506m6652l5662k5872j6914q295j09P501J4964K2693L0457L7965
59305C292919M5575N3828O2777P2174Q1652R0361R7333J02691J07496J11868J14356
59294D233030J13850J10862J06127R9199Q9581P8164O6352N4680M3475L3912K7159
59283E056391K3214K1671K2893K7373L4745M4494N6716P1089Q6015R9867J12035
$$ y = [14124863, 13957119, 13735472, 13464216, 13151431, 12807216, 12442695, 12069053, 11695453, 11327107, 10965177, 10607963, 10251873, 9892349, 9525376, 9148818, 8762567, 8367929, 7967380, 7564753, 7165265, 6775020, 6399924, 6044300, 5710282, 5398715, 5110486, 4846557, 4607024, 4390965, 4197293, 4025155, 3873470, 3740736, 3625497, 3526480, 3442250, 3371349, 3312843, 3266191, 3230529, 3204657, 3187743, 3179448, 3179339, 3186840, 3201804, 3224497, 3254954, 3292919, 3338494, 3392322, 3455099, 3527273, 3608925, 3699286, 3796619, 3899310, 4006806, 4118674, 4233030, 4346880, 4457742, 4563869, 4663068, 4752649, 4830813, 4897165, 4951845, 4995320, 5029232, 5056391, 5079605, 5101276, 5124169, 5151542, 5186287, 5230781, 5287497, 5358586, 5444601, 5544468, 5656503]
59272E656503J21525J25589J21344J08093Q6950N9346K7381n547l6463o4613r0069
59261F110039j11400j26571j35409j39226j38467j32728j22727j10222r5944p9434
59251D917911o1004m2182k4059o670R741K4220L6148M5727N3191N8468O1587O2587
59239E135665O1306N8129N4548N1969N0439M9686N0850N5933O5843Q0325R9377
59228E814070J23397J52146J84768K20574K58627K96777L32105L61796L82625
59219H126885L90520L82200L56930L15405K57806J84524R8331M051r3516j89896
59209I833240k79874l58196m21461m68076m97006n08311n04503m89368m65555
59200E840890m34827m00013l64483l29794k95917k63626k34466k08454j84181
$$ y = [5656503, 5778028, 5903617, 6024961, 6133054, 6220004, 6279350, 6306731, 6301184, 6264721, 6200108, 6110039, 5998639, 5872068, 5736659, 5597433, 5458966, 5326238, 5203511, 5093289, 4997345, 4917911, 4856907, 4814725, 4790666, 4783996, 4793737, 4817957, 4854105, 4899832, 4953023, 5011491, 5073078, 5135665, 5196971, 5255100, 5309648, 5361617, 5412056, 5461742, 5512592, 5568525, 5634368, 5714693, 5814070, 5937467, 6089613, 6274381, 6494955, 6753582, 7050359, 7382464, 7744260, 8126885, 8517405, 8899605, 9256535, 9571940, 9829746, 10014270, 10112601, 10116652, 10023136, 9833240, 9553366, 9195170, 8773709, 8305633, 7808627, 7300316, 6795813, 6306445, 5840890, 5406063, 5006050, 4641567, 4311773, 4015856, 3752230, 3517764, 3309310, 3125129]
59191C125129j61545j42077j26132j12068r8927q7777p9351p2391o5531n9140
59181B120190n3958m9373m4350l9074l4452l0698k7398k4334k1404j8263j4705
59170A762181j0956p196l309O37M259P406J0352J3366J6645K0539K5146K9761
59158A868831L3502L6366L8997M1744M4771M8545N3195N7807O1601O5363P0413
59147B421135P6577Q2563Q8049R3690R9332J03940J07283J10020J11932J11744
59137C406265J08903J04062R7542Q8795P7722O5121N1614L7441K3517J1235J000
59126D073217p664j4393j7889j7674j4474q603M20J2323K5736L9843N5051P1618
59114D197511Q9116J07510J27203J47567J67044J85123K02558K18963K31764K38352
$$ y = [3125129, 2963584, 2821507, 2695375, 2583307, 2484380, 2396603, 2317252, 2244861, 2179330, 2120190, 2066232, 2016859, 1972509, 1933435, 1898983, 1868285, 1840887, 1816553, 1795149, 1776886, 1762181, 1751225, 1744029, 1740720, 1741357, 1745616, 1753022, 1763374, 1776740, 1793385, 1813924, 1839070, 1868831, 1902333, 1938699, 1977696, 2019440, 2064211, 2112756, 2165951, 2223758, 2285359, 2350722, 2421135, 2497712, 2580275, 2668324, 2762014, 2861346, 2965286, 3072569, 3182589, 3294521, 3406265, 3515168, 3619230, 3716772, 3805567, 3883289, 3948410, 4000024, 4037465, 4060982, 4072217, 4073217, 4065553, 4051160, 4033271, 4015597, 4001123, 3992520, 3992940, 4005263, 4030999, 4070842, 4125893, 4197511, 4286627, 4394137, 4521340, 4668907, 4835951, 5021074, 5223632, 5442595, 5674359, 5912711]
59104E912711K37871K29951K13294J86683J50641J07189N8892Q859l9237q2053
59094F984801j17309j43606j60537j69218j71768j69862j64488j56993j49152
59085E581868j42032j35877j31284j29169j29480j31224j34006j38237j43618
59076D366941j48852j53142j56619j59015j59406j57637j54616j50709j45314
59067B981631j38454j31324j24623j17701j10015j02117r4628q7343q0001p2881
59057A922544o6154n9772n4195n0092m7037m3838m0346l7578l5837l4217l2266
59046A421212l0516k8951k6705k3714k1032j8826j5817j1468p102l969j774Q4
59034A231422J279J601J864K808M274O159Q820J1839J3805J4221J4191J4444J4136
$$ y = [5912711, 6150582, 6380533, 6593827, 6780510, 6931151, 7038340, 7097232, 7106091, 7066854, 6984801, 6867492, 6723886, 6563349, 6394131, 6222363, 6052501, 5888013, 5731020, 5581868, 5439836, 5303959, 5172675, 5043506, 4914026, 4782802, 4648796, 4510559, 4366941, 4218089, 4064947, 3908328, 3749313, 3589907, 3432270, 3277654, 3126945, 2981631, 2843177, 2711853, 2587230, 2469529, 2359514, 2257397, 2162769, 2075426, 1995425, 1922544, 1856390, 1796618, 1742423, 1692331, 1645294, 1601456, 1561110, 1523532, 1487695, 1453478, 1421212, 1390696, 1361745, 1335040, 1311326, 1290294, 1271468, 1255651, 1244183, 1237081, 1233112, 1231338, 1231422, 1232701, 1234302, 1236166, 1238974, 1243248, 1249407, 1258227, 1270066, 1283871, 1298092, 1312283, 1326727, 1340863]
59021A340863J2467J0080P763N194K078p25k405l373m166m244k962p61J634M292
59007A365735P364J0162J1921J2706J2836J2079J0178P396M068L62l138n614p117
58994A438938q461r787j0358r983r253q111n751k409L34J708K751M487O541Q227
58980A398873R582J0657J1162J1432J2297J3557J4131J4196J5329J7951K0498
58969A549665K1889K2903K4257K5340K5863K6849K8740L0381L1043L1666L2900
58958A851496L3801L3762L3726L4207L4014L2661L2077L4030L7484M0424M2863
58947B240545M6110N0377N5055O0263O6295P2487P8229Q4231R1327R9049J06764
58936C050732J15012J24276J33739J42782J52513J64226J77600J92018K08349
$$ y = [1340863, 1353330, 1363410, 1371173, 1376367, 1378445, 1377720, 1375315, 1371942, 1367776, 1363532, 1360570, 1359809, 1361443, 1365735, 1373099, 1383261, 1395182, 1407888, 1420724, 1432803, 1442981, 1450377, 1454445, 1454807, 1451669, 1446055, 1438938, 1430477, 1420690, 1410332, 1400349, 1391096, 1382985, 1377234, 1374825, 1375159, 1376867, 1379618, 1384105, 1390646, 1398873, 1408455, 1419112, 1430274, 1441706, 1454003, 1467560, 1481691, 1495887, 1511216, 1529167, 1549665, 1571554, 1594457, 1618714, 1644054, 1669917, 1696766, 1725506, 1755887, 1786930, 1818596, 1851496, 1885297, 1919059, 1952785, 1986992, 2021006, 2053667, 2085744, 2119774, 2157258, 2197682, 2240545, 2286655, 2337032, 2392087, 2452350, 2518645, 2591132, 2669361, 2753592, 2844919, 2943968, 3050732, 3165744, 3290020, 3423759, 3566541, 3719054, 3883280, 4060880, 4252898, 4461247]
58927D461247K27668K49326K72224K96996L25064L56455L90356M26976M67044
58918G473356N10098N55034O01606O49672O97444P41929P80463Q10161Q26447
58909A3646210Q23771P97714P45537O65614N57946M25209K72617J07341o1578
58900A7980381k24254l72533n01296o07161o87677p42795p75323p88439p83981
58891A2496922p64300p33785o96743o55030o09562n62656n16949m73224m31260
58882G053413l91790l55797l22900k92372k64838k41220k20969k02955j87138
58873D573434j73671j61481j49538j38370j28525j18752j07744r6593q7380q0216
58863C331164p3703o7441o1895n6673n1024m5466m0913l6835l2191k7438k3630
$$ y = [4461247, 4688915, 4938241, 5210465, 5507461, 5832525, 6188980, 6579336, 7006312, 7473356, 7983454, 8538488, 9140094, 9789766, 10487210, 11229139, 12009602, 12819763, 13646210, 14469981, 15267695, 16013232, 16678846, 17236792, 17662001, 17934618, 18041959, 17980381, 17756127, 17383594, 16882298, 16275137, 15587460, 14844665, 14069342, 13280903, 12496922, 11732622, 10998837, 10302094, 9647064, 9037502, 8474846, 7957897, 7484673, 7053413, 6661623, 6305826, 5982926, 5690554, 5425716, 5184496, 4963527, 4760572, 4573434, 4399763, 4238282, 4088744, 3950374, 3821849, 3703097, 3595353, 3498760, 3411380, 3331164, 3257461, 3190020, 3128125, 3071452, 3020428, 2974962, 2934049, 2897214, 2865023, 2837585, 2813955]
58852B813955k0242j5856j0439n048M4N203J0165J4795K0201K7186L4454M0404
58840B914822M5844N2729O0997O8946P6127Q3605R1784J00184J08971J18655J28629
58829C851293J38039J47609J58703J71199J84364J99155K17349K38868K62233
58820E568812K87298L15372L46824L80884M17585M57807N01384N47073N94097
58811I417136O41750O87617P28052P60068P80909P86158P70503P30302O63835
58802A5966330N69886M48686L04474J45179k0492j84333l38030m74030n87498
58793A5830172o76138p38743p75805p90831p88630p72305p43729p06217o64203
58784I173571o20404n75459n30254m86483m45041m06030l70141l38119l09105
$$ y = [2813955, 2793713, 2777857, 2767418, 2762370, 2762414, 2767617, 2777782, 2792577, 2812778, 2839964, 2874418, 2914822, 2960666, 3013395, 3074392, 3143338, 3219465, 3303070, 3394854, 3495038, 3604009, 3722664, 3851293, 3989332, 4136941, 4295644, 4466843, 4651207, 4850362, 5067711, 5306579, 5568812, 5856110, 6171482, 6518306, 6899190, 7316775, 7774582, 8275966, 8823039, 9417136, 10058886, 10746503, 11474555, 12234623, 13015532, 13801690, 14572193, 15302495, 15966330, 16536216, 16984902, 17289376, 17434555, 17414063, 17229730, 16891700, 16417670, 15830172, 15154034, 14415291, 13639486, 12848655, 12060025, 11287720, 10543991, 9837774, 9173571, 8553167, 7977708, 7447454, 6960971, 6515930, 6109900, 5739759, 5401640, 5092535]
58775E092535k81706k56455k35064k17438k01694j87025j74282j63639j53878
58766C221354j44165j34756j25790j17075j08798j00966r2633q3341p4546o7655
58756B171629o1630n4726m7591m2004l7525l2335k6732k2673k0147j7216j3558
58745A795492j0862r558q208o391n335n298n187n201p043j0936j5061j8440k1812
58732A666160k5178k7122k7173k6509k5723k4303k2583k1849k2084k2054k1903
58721A399679k3086k5401k6819k6714k6657k7427k7925k7623k7390k7215k5744
58710A107678k2894k0378j8894j7238j4948j3209j2362j1083r049p875q350r051
58698I42347q755q064p771p632p637q351r357r376q530q241q483p525m980k515
$$ y = [5092535, 4810829, 4554374, 4319310, 4101872, 3900178, 3713153, 3538871, 3375232, 3221354, 3077189, 2942433, 2816643, 2699568, 2590770, 2489804, 2397171, 2313830, 2239284, 2171629, 2109999, 2055273, 2007682, 1965678, 1928153, 1895818, 1869086, 1846413, 1826266, 1809050, 1795492, 1784630, 1775072, 1766864, 1760473, 1755138, 1749840, 1744653, 1739452, 1732409, 1721473, 1706412, 1687972, 1666160, 1640982, 1613860, 1586687, 1560178, 1534455, 1510152, 1487569, 1465720, 1443636, 1421582, 1399679, 1376593, 1351192, 1324373, 1297659, 1271002, 1243575, 1215650, 1188027, 1160637, 1133422, 1107678, 1084784, 1064406, 1045512, 1028274, 1013326, 1000117, 987755, 976672, 967623, 959748, 951398, 942347, 933592, 925528, 917757, 910125, 902488, 894137, 884780, 875404, 866874, 858633, 850150, 842625, 837645, 835130]
58684H35130r84O09K485L160K041M81p36k456m817o312o196n513m840l345j017
58669H07690O33J046J415K206K340J745K013L512M360L465J981P33j210m054o065
58654H21810o278o047o476o604n475l789k140J46L097N181N661N813O729P993
58640H19621R536J2424J6659K0398K2612K4361K6526K8585L0579L3758L8183M2226
58628A125468M5531M9882N5985O2090O7219P3077Q1312R1403J02680J15837J31032
58617B001516J47046J63685J82491K03477K23749K40692K53806K61983K61874
58608C940319K50803K28697J95670J50803R5450L5062k4476q0029j29236j68471
58598D494592j95359k11130k18321k18133k11817k02082j91002j78603j65212
$$ y = [835130, 834146, 834755, 837240, 840400, 842441, 842922, 842186, 839730, 834913, 828601, 822405, 816892, 812052, 808707, 807690, 808323, 809369, 810784, 812990, 815330, 817075, 819088, 822600, 826960, 830425, 832406, 833139, 831929, 827875, 821810, 815532, 809485, 803009, 796405, 790930, 787141, 785001, 785147, 788244, 793425, 799086, 804899, 811628, 819621, 829157, 841581, 858240, 878638, 901250, 925611, 952137, 980722, 1011301, 1045059, 1083242, 1125468, 1170999, 1220881, 1276866, 1338956, 1406175, 1479252, 1560564, 1651967, 1754647, 1870484, 2001516, 2148562, 2312247, 2494738, 2698215, 2921964, 3162656, 3416462, 3678445, 3940319, 4191122, 4419819, 4615489, 4766292, 4861742, 4896804, 4872328, 4792299, 4663063, 4494592, 4299233, 4088103, 3869782, 3651649, 3439832, 3237750, 3046748, 2868145, 2702933]
58589B702933j52766j42044j31166j18891j06819r6421q6476p5670o5146n6226
58579A671308m8000l9502l1937k6555k2507j8874j6464j5574j4371j1632q659
58568A417233o459l795j66K137J453m94j849l874q283j3950j9164k4586l0974
58555A307229l6344l8504l8251l7221l4855l0434k5829k3064k1149j8333j5437
58544I87808j3844j2297r055n327l308k503j228j64j056l249m690n285o343p852
58530I11607q962j0067j1851j3505j4161j4745j6163j7324j7083j6371j6224j5753
58518G39398j4314j3397j3877j3766j1457q786p904p541n608l233k611k897j815
58505F32192K66J310J230J353J666J696K540N001P355P880P902R373J1314J1833
$$ y = [2702933, 2550167, 2408123, 2276957, 2158066, 2051247, 1954826, 1868350, 1792680, 1727534, 1671308, 1623308, 1583806, 1551869, 1525314, 1502807, 1483933, 1467469, 1451895, 1437524, 1425892, 1417233, 1410774, 1406979, 1406813, 1408950, 1410403, 1409909, 1408060, 1404186, 1395903, 1381953, 1362789, 1338203, 1307229, 1270885, 1232381, 1194130, 1156909, 1122054, 1091620, 1065791, 1042727, 1021578, 1003245, 987808, 973964, 961667, 952612, 947285, 943977, 941474, 940246, 940082, 939026, 935777, 931087, 925802, 919459, 911607, 902645, 892578, 880727, 867222, 853061, 838316, 822153, 804829, 787746, 771375, 755151, 739398, 725084, 711687, 697810, 684044, 672587, 663801, 655897, 648356, 642748, 639515, 636904, 634007, 632192, 632458, 633768, 634998, 636351, 638017, 639713, 642253, 647254, 654609, 662489, 670391, 679764, 691078, 702911]
58491G02911J1732J2804J4295J4462J3925J4093J3975J2030R547Q656Q520P000
58479H43950M636L454L221K347J190J089J300J58j910l541n197p810j0298j1466
58465H21123j2639j5340j8120j8868j8273j7854j6626j3356r905q646q392o664
58453F56440m042k597j913n78L22p80k267j625L06J253J731L458N528O296P095
58438F68627R844J2971J3965J3885J4920J5582J3132Q881O101M494J563k128m090
58425G77747m666n662n918l277N12K131K500M883Q662J0389R978J0337J1707J1799
58411H31122J0754J0707J1148R872P773P528Q386P395M868L441K674j6m027o538
58397I05087p904j0629j3934j4896j4040j4188j4651j2531q814p182p409o132
$$ y = [702911, 714643, 727447, 741742, 756204, 770129, 784222, 798197, 810227, 819774, 828430, 836950, 843950, 848586, 852040, 855261, 857608, 858798, 859887, 861187, 861345, 859435, 855894, 850697, 842887, 832589, 821123, 808484, 793144, 775024, 756156, 737883, 720029, 703403, 690047, 680142, 671496, 663104, 656440, 652398, 649801, 647888, 647310, 647632, 646852, 644585, 642960, 643266, 644519, 646250, 649708, 655236, 661532, 668627, 678471, 691442, 705407, 719292, 734212, 749794, 762926, 771807, 777908, 782402, 783965, 781837, 777747, 773081, 767419, 761501, 758224, 758736, 760867, 763367, 768250, 776912, 787301, 797279, 807616, 819323, 831122, 841876, 852583, 863731, 873603, 881376, 888904, 897290, 904685, 909553, 912994, 915668, 915652, 911625, 905087, 897183, 886554, 872620, 857724, 843684, 829496, 814845, 802314, 793500, 786318, 778909, 772777]
58385G72777l533k968m331m159k220j724k955k801p29Q22J975N285R963J2284
58371G77686J1982J2324J3862J3985J2647J2445J3048J1696R153Q931J0624J0384
58359I18767Q036P294Q770R352Q711R798J2592J3810J3140J3334J4139J2677R790
58346A060210R029R404O431N07l144l231l620n352n119k416o23j77J993N510O581
58331A075983N583O873J0461J1862J0827J1904J5459J6725J4925J4707J7078J7689
58319A230076J5749J5863J9117K1055K0450K1364K4486K5209K2551K1169K2216
58308A459305K0977J6038J1977J0589Q289M542L876P032R102Q810J0449J4437
58296A585423J5641J3519J3997J8533K1406K0631K1198K4567K5573K3166K3372
$$ y = [772777, 769244, 766276, 761945, 757786, 755566, 753842, 750887, 748086, 747357, 748179, 750154, 755439, 765402, 777686, 789668, 801992, 815854, 829839, 842486, 854931, 867979, 879675, 888828, 897759, 908383, 918767, 926803, 934097, 942867, 952219, 960930, 970728, 983320, 997130, 1010270, 1023604, 1037743, 1050420, 1060210, 1069239, 1078643, 1085074, 1085581, 1082437, 1079206, 1075586, 1070234, 1065115, 1062699, 1062076, 1061899, 1063892, 1069402, 1075983, 1081566, 1088439, 1098900, 1110762, 1121589, 1133493, 1148952, 1165677, 1180602, 1195309, 1212387, 1230076, 1245825, 1261688, 1280805, 1301860, 1322310, 1343674, 1368160, 1393369, 1415920, 1437089, 1459305, 1480282, 1496320, 1508297, 1518886, 1527175, 1531717, 1535593, 1542625, 1551727, 1560537, 1570986, 1585423, 1601064, 1614583, 1628580, 1647113, 1668519, 1689150, 1710348, 1734915, 1760488, 1783654, 1807026]
58285A807026K7967L1009L0409L1913L7623M1756M2177M4735N1537N6277N6140
58274B258569N6977O1565O4087O1543N9220N9552N7034M9636M3759M2513M0715
58263B855170L6648L6551M2085M5910M5238M6940N3643N8263N8144O0683O8713
58252C407988P4603P5351P8770Q8012R5124R7024J01910J12451J19226J18862
58242D369321J21543J31937J40397J42264J47386J60538J71365J74633J81003
58233E740387J96248K09769K15920K26081K46432K65190K75831K90968L18059
58224G984885L44111L60625L80477M12917M45907M71498N03723N51941O02300
58215A2058384O46032O98897P70986Q46326R15953J000488J114395J240511J367935
$$ y = [1807026, 1834993, 1866002, 1896411, 1928324, 1965947, 2007703, 2049880, 2094615, 2146152, 2202429, 2258569, 2315546, 2377111, 2441198, 2502741, 2561961, 2621513, 2678547, 2728183, 2771942, 2814455, 2855170, 2891818, 2928369, 2970454, 3016364, 3061602, 3108542, 3162185, 3220448, 3278592, 3339275, 3407988, 3482591, 3557942, 3636712, 3724724, 3819848, 3916872, 4018782, 4131233, 4250459, 4369321, 4490864, 4622801, 4763198, 4905462, 5052848, 5213386, 5384751, 5559384, 5740387, 5936635, 6146404, 6362324, 6588405, 6834837, 7100027, 7375858, 7666826, 7984885, 8328996, 8689621, 9070098, 9483015, 9928922, 10400420, 10904143, 11456084, 12058384, 12704416, 13403313, 14174299, 15020625, 15936578, 16937066, 18051461, 19291972, 20659907]
58206B0659907J520496J717496J944097K194480K504177K902740L379043L935961
58198D0758397M631020N516367O595174P895676R529302J1614994J4229162J7523970
58190A18294062K1800498K7292180L3833310M0695632M6480221M8963268M5466035
58183C82825206L4321415J6621531l617942k1519233l3925368m0325975m1901897
58176B92477737m0205888l6589764l2146016k7626175k3383324j9538218j6178415
58169I6809937j3353168j1000047r011940p341976n969906m821794l807115k896077
58161C8607914k083789j309529m84802M19230J369742K314042L125982L520905
58153D5479695L151389J887559L072j949794l465772m325321m593395m460665
$$ y = [20659907, 22180403, 23897899, 25841996, 28036476, 30540653, 33443393, 36822436, 40758397, 45389417, 50905784, 57500958, 65396634, 74925936, 86540930, 100770092, 118294062, 140094560, 167386740, 201220050, 241915682, 288395903, 337359171, 382825206, 417146621, 433768152, 430150210, 408630977, 374705609, 334379634, 292477737, 252271849, 215682085, 183536069, 155909894, 132526570, 112988352, 96809937, 83456769, 72456722, 63444782, 56102806, 50132900, 45311106, 41503991, 38607914, 36524125, 35214596, 34729794, 35149024, 36518766, 38832808, 41958790, 45479695, 48631084, 50518643, 50521715, 48571921, 45106149, 40780828, 36187433, 31726768]
58145C1726768m100297l628149l126326k654644k238951j876417j563463j306178
58137A1232343j102267r33911p87703o65902n70072m90238m19760l64990l29472
58128E568028l02935k76659k55880k45794k38442k24994k09021j96125j81975
58119C436203j61970j41986j28205j16167j00666q6873q1065p9539p6957p6516
58109B386259q1615q6294q4271p9273p6668p3250o5026n6864n4245n3053m7407
58098A628293m0342l7151l5277l0430k5889k6211k8102k6862k5500k8301l1592
58087A292636l0072k6564k6386k7702k6293k4446k6214k8984k8328k6348k6893
58076I94406k7525k4500k0767k0702k1659j9091j5400j5285j6722j4970j1474
$$ y = [31726768, 27626471, 23998322, 20871996, 18217352, 15978401, 14101984, 12538521, 11232343, 10130076, 9196165, 8408462, 7742560, 7172488, 6682250, 6262490, 5897500, 5568028, 5265093, 4988434, 4732554, 4486760, 4248318, 4023324, 3814303, 3618178, 3436203, 3274233, 3132247, 3004042, 2887875, 2787209, 2700336, 2619271, 2539732, 2462775, 2386259, 2304644, 2218350, 2134079, 2054806, 1978138, 1904888, 1839862, 1782998, 1728753, 1675700, 1628293, 1587951, 1550800, 1515523, 1485093, 1459204, 1432993, 1404891, 1378029, 1352529, 1324228, 1292636, 1262564, 1236000, 1209614, 1181912, 1155619, 1131173, 1104959, 1075975, 1047647, 1021299, 994406, 966881, 942381, 921614, 900912, 879253, 860162, 844762, 829477, 812755, 797785, 786311]
58065G86311j0539j0976r137o625p030q428o915m312m732o781o602n546p263j0190
58051F81235j0357q845r263j0497r113o321n558n698l588q32j161l293l168j189
58037F02352o37j054K93K431K513J639K608L952K428n24r74O65J010J03M79J646
58021F18930J317M21J279K551J527m74n12L28o99k209j146J000N14j887k685k096
58005F16159k943m641m358k779k708l320j763Q33R66q38j267p08k372n769p339
57990E77153o994q032j0703j1763j0374q966q129n982k740q23l40Q05K461K537
57976E08110J467J652K897K989K309L052M408L557R73j94K72l11k142k707j844
57961E24488k032l510l965l269l751n566o415o002o236o931n997l979l628m779
$$ y = [786311, 775772, 764796, 755659, 749034, 742004, 733576, 726661, 722349, 717617, 710836, 704234, 698688, 691425, 681235, 670878, 662033, 652770, 642273, 633160, 626839, 621281, 615583, 611995, 611163, 610002, 606709, 603541, 602352, 601715, 600661, 600954, 603385, 605898, 607537, 610145, 614097, 616525, 616001, 615027, 615692, 616702, 616805, 617284, 618930, 620247, 620668, 621947, 624498, 626025, 625551, 625039, 625367, 624668, 622459, 621313, 622313, 622827, 620940, 618255, 616159, 613216, 608575, 604217, 601438, 598730, 595410, 593647, 594480, 595446, 594608, 593341, 592633, 590261, 584492, 577153, 570159, 562127, 551424, 539661, 529287, 520321, 512192, 506210, 503470, 502647, 502307, 503112, 505573, 508110, 509577, 511229, 514126, 517115, 519424, 522476, 526884, 530441, 531414, 531220, 531492, 531181, 529039, 526332, 524488, 522456, 518946, 514981, 511712, 507961, 502395, 495980, 489978, 483742, 476811, 470814, 466835, 463207, 458428]
57947D58428m339j766K09O94J703L599M115K805K029K653K862K010J480J179o66
57932D76995l613n070m874n626p890r260r027r396j1076j1825j0536q903p916
57919C71983o446m353l181k839j252J675L466L441L880N853P593Q121Q841J0265
57905D07047J0770R884R432J0086J0051Q400O614N703M832L747L410L410J972
57892D95358o86k284k476l435n680o997o510o173o978p297o348n749o238o189
57878D22318m875l863l814l165j450n41j046q59J118L020L506L971N466O615O444
57863D32845O327P132P344N986M660M706M915M016K893K500K059J058N75R28N05
57848D88449j299k624k318k009l093m202l745k616k343k686k906l422m362m560
$$ y = [458428, 454089, 452323, 452532, 453226, 454929, 458528, 462643, 465448, 467477, 470130, 472992, 475002, 476482, 477661, 476995, 473382, 468312, 463438, 457812, 449922, 440662, 431635, 422239, 411163, 399338, 388802, 379899, 371983, 365537, 361184, 358003, 355164, 353912, 355587, 359053, 362494, 366374, 372227, 379820, 387941, 396782, 407047, 417817, 427701, 437133, 447219, 457270, 465670, 472284, 477987, 482819, 486566, 489976, 493386, 495358, 494672, 492388, 489912, 486477, 480797, 473800, 467290, 461117, 454139, 446842, 440494, 434745, 428507, 422318, 417443, 413580, 409766, 406601, 405151, 404610, 403564, 402705, 403823, 406843, 410349, 414320, 419786, 426401, 432845, 439172, 446304, 453648, 459634, 464294, 469000, 473915, 477931, 480824, 483324, 485383, 486441, 487016, 487944, 488449, 487150, 484526, 482208, 480199, 477106, 472904, 469159, 466543, 464200, 461514, 458608, 455186, 450824, 446264]
57834D46264l703l310m062m372l315k562l551n004n291n095n768p014q089r269
57820C75859j0403j0031p849n974n894o310n773n140n307m943k927r34r16j791
57806C01667j368O5P77P92J370K326K588K648L961O440Q589R745J0232R827P868
57791C67527M684J510p39j690j250%R74J474K297L390L401J967O46M58K83r30
57775C84002k212k459k504l501m740n000m675m668m474l245j664q63m90L33J163
57760C45003J170R28J559K862L972N022O467P553P211N867M795M217L497K644
57746D02767K223K240K304K423K690K845K927L507M431M469L143J788J744K668
57732D42169L664M782O238P384P801Q167Q906R183Q475P804Q076Q578Q499Q594
$$ y = [446264, 442561, 439251, 435189, 430817, 427502, 424940, 421389, 416385, 411094, 405999, 400231, 393217, 385128, 375859, 365456, 355425, 347576, 341602, 335708, 329398, 323625, 318485, 313178, 308235, 305308, 304374, 303458, 301667, 300299, 300364, 301141, 301933, 303303, 305629, 308217, 310865, 314826, 321266, 329855, 339600, 349832, 359659, 367527, 372211, 373721, 372982, 371292, 370042, 370042, 371016, 372490, 374787, 378177, 381578, 383545, 384191, 384649, 384932, 384002, 381790, 379331, 376827, 373326, 368586, 363586, 358911, 354243, 349769, 346524, 344860, 343997, 343507, 343840, 345003, 346173, 347101, 348660, 351522, 355494, 360516, 366983, 374536, 381747, 387614, 392409, 396626, 400123, 402767, 404990, 407230, 409534, 411957, 414647, 417492, 420419, 423926, 428357, 432826, 435969, 437757, 439501, 442169, 445833, 450615, 456853, 464237, 472038, 480205, 489111, 498294, 506769, 514573, 522649, 531227, 539726, 548320]
57718E48320R712J1035J1379J1120J1232J1577J1689J2153J3542J5128J6183J7413
57706G00483J9568K1801K3210K4725K7621L1264L4302L7063M0854M5642N0407
57695A056940N5052O0161O5616P1301P8424Q8298J00407J13397J27306J43086
57685A959988J60594J78887J97751K17084K35251K49730K58754K60669K52636
57676C971344K32228K00100J59463J13717O6547K3609q832k7752l4937l5635l7588
57665D622264n0198q0528j27671j81826k29841k61997k75019k71260k56017k34396
57655B653511k09542j83303j57546j33824j12532r3615p7618o4857n4240m4295
57645A522139l4959k6979k0092j3232o293j50M866R395J4164J9658K6291L3850
$$ y = [548320, 558032, 569067, 580446, 591566, 602798, 614375, 626064, 638217, 651759, 666887, 683070, 700483, 720051, 741852, 765062, 789787, 817408, 848672, 882974, 920037, 960891, 1006533, 1056940, 1111992, 1172153, 1237769, 1309070, 1387494, 1475792, 1576199, 1689596, 1816902, 1959988, 2120582, 2299469, 2497220, 2714304, 2949555, 3199285, 3458039, 3718708, 3971344, 4203572, 4403672, 4563135, 4676852, 4743399, 4767008, 4758176, 4730424, 4695487, 4659852, 4622264, 4572066, 4491538, 4363867, 4182041, 3952200, 3690203, 3415184, 3143924, 2887907, 2653511, 2443969, 2260666, 2103120, 1969296, 1856764, 1763149, 1685531, 1620674, 1566434, 1522139, 1487180, 1460201, 1440109, 1426877, 1420584, 1420434, 1425300, 1434695, 1448859, 1468517, 1494808, 1528658]
57633A528658M1380M8608N6734O6642P7449Q8141R9597J13133J28014J42487J56559
57622B547402J71447J86553J99071K06610K08063K01941J85951J58923J21744
57613D187705P6267K4885k8640p9563j24054j59959j85995k01765k08683k09296
57603C090902k05283j97041j85221j71398j57038j42852j29291j16650j04747
57594A681381r3456q3370p5061o7967o1107n4491m8715m3603l8609l4062l0592
57583A050348k7708k4494k1396j9686j9174j8160j5783j2973j0887r703r142q932
57571H52310q547p475n919m389k858j169K13Q86J479K715M127M968N772P514R746
57556H59373J1179J1714J2236J2886J3258J3854J5487J7569J8837J9597K1315
$$ y = [1528658, 1570038, 1618646, 1675380, 1742022, 1819471, 1907612, 2007209, 2120342, 2248356, 2390843, 2547402, 2718849, 2905402, 3104473, 3311083, 3519146, 3721087, 3907038, 4065961, 4187705, 4263972, 4288857, 4260217, 4180654, 4056600, 3896641, 3710646, 3508881, 3300198, 3090902, 2885619, 2688578, 2503357, 2331959, 2174921, 2032069, 1902778, 1786128, 1681381, 1587925, 1504555, 1429494, 1361527, 1300420, 1245929, 1197214, 1153611, 1115002, 1080940, 1050348, 1022640, 998146, 976750, 957064, 937890, 919730, 903947, 890974, 880087, 870384, 861242, 852310, 843763, 836288, 830369, 825980, 823122, 821953, 822166, 823052, 824531, 827246, 831373, 836341, 842113, 849627, 859373, 870552, 882266, 894502, 907388, 920646, 934500, 949987, 967556, 986393, 1005990, 1027305]
57545A027305K4168K6932K9220L1873L5153L8489M2121M6946N2708N8294O3921
57534A477130P0999P9681Q8734R8088J09184J22190J35089J46300J56155J64774
57524B648324J70270J70108J62721J47118J22612R0022N1925J1018l0450o9402
57514C474266j02052j26312j42739j52495j55845j53329j46720j37690j26942
57505B230142j15287j04078r3749q3354p2512o2441n4146m6997m0067l3567k7977
57494A495967k2974j8165j3869j0178o393k189J753M942P842J0745J3187J5164
57482A475832J7710K1418K5664L0038L5193M1404M7687N3353N9278O6541P5035
57471A949153Q4337R4759J06471J18635J30390J41619J51809J59241J62257J60062
$$ y = [1027305, 1051473, 1078405, 1107625, 1139498, 1174651, 1213140, 1255261, 1302207, 1354915, 1413209, 1477130, 1548129, 1627810, 1716544, 1814632, 1923816, 2046006, 2181095, 2327395, 2483550, 2648324, 2818594, 2988702, 3151423, 3298541, 3421153, 3511175, 3563100, 3574118, 3543668, 3474266, 3372214, 3245902, 3103163, 2950668, 2794823, 2641494, 2494774, 2357084, 2230142, 2114855, 2010777, 1917028, 1833674, 1761162, 1698721, 1644575, 1597578, 1557511, 1523944, 1495967, 1472993, 1454828, 1440959, 1430781, 1424388, 1422199, 1423952, 1428894, 1436736, 1447481, 1460668, 1475832, 1493542, 1514960, 1540624, 1570662, 1605855, 1647259, 1694946, 1748299, 1807577, 1874118, 1949153, 2033490, 2128249, 2234720, 2353355, 2483745, 2625364, 2777173, 2936414, 3098671, 3258733]
57461C258733J51421J34054J06818P1556L1681j0045n1225q8756j19807j43281
57451C341149j59119j67103j67589j62534j54252j43755j31496j18804j07086
57442B029411r6273q5625p5548o7086o0027n3107m6016l9737l4764l0321k5620
57431A415287k0941j7114j4570j3003j1587r594p150n120l905k903j567l53J11
57418A307591J11L16O68P27O79J072J803K297K550L214M581O146P262P762P880
57403A354659P848P702P469P539Q457J0081J1272J1198J0570J0666J1423J1687
57391A470571J1258J1183J1897J2557J2697J3032J3960J4722J4787J4722J4803
57380A616189J4279J3023J2462J3517J4882J4916J4216J4603J6267J7614J7646
$$ y = [3258733, 3410154, 3544208, 3651026, 3722582, 3754263, 3744218, 3692993, 3604237, 3484430, 3341149, 3182030, 3014927, 2847338, 2684804, 2530552, 2386797, 2255301, 2136497, 2029411, 1933138, 1847513, 1771965, 1704879, 1644852, 1591745, 1545729, 1505992, 1471228, 1440907, 1415287, 1394346, 1377232, 1362662, 1349659, 1338072, 1328478, 1321328, 1316208, 1312303, 1309400, 1307833, 1307480, 1307591, 1307702, 1308018, 1308686, 1309413, 1310092, 1311164, 1312967, 1315264, 1317814, 1321028, 1325609, 1331755, 1339017, 1346779, 1354659, 1362507, 1370209, 1377678, 1385217, 1393674, 1403755, 1415027, 1426225, 1436795, 1447461, 1458884, 1470571, 1481829, 1493012, 1504909, 1517466, 1530163, 1543195, 1557155, 1571877, 1586664, 1601386, 1616189, 1630468, 1643491, 1655953, 1669470, 1684352, 1699268, 1713484, 1728087, 1744354, 1761968, 1779614]
57369A779614J6995J6677J7005J7716J8310J8336J7895J7603J7599J7303J6651
57358A971704J6635J7757J8863J8704J7830J7697J8451J8956J8682J8237J8229
57347B171745J8634J9291K0081K0720K1078K1520K2323K3117K3497K3721K4104
57336B409831K4353K4215K4252K5032K6050K6401K6136K5998K6209K6393K6407
57325B691277K6372K6139K5624K5324K5795K6757K7464K7676K7683K7677K7730
57314B985518K8034K8597K9042K9167K9261K9491K9596K9608L0170L1498L2861
57303C312843L3661L4225L4933L5507L5888L6814L8549M0135M0856M1547M3248
57292C728206M5452M6959M7757M8705N0021N1259N2368N3598N4841N6021N7560
$$ y = [1779614, 1796609, 1813286, 1830291, 1848007, 1866317, 1884653, 1902548, 1920151, 1937750, 1955053, 1971704, 1988339, 2006096, 2024959, 2043663, 2061493, 2079190, 2097641, 2116597, 2135279, 2153516, 2171745, 2190379, 2209670, 2229751, 2250471, 2271549, 2293069, 2315392, 2338509, 2362006, 2385727, 2409831, 2434184, 2458399, 2482651, 2507683, 2533733, 2560134, 2586270, 2612268, 2638477, 2664870, 2691277, 2717649, 2743788, 2769412, 2794736, 2820531, 2847288, 2874752, 2902428, 2930111, 2957788, 2985518, 3013552, 3042149, 3071191, 3100358, 3129619, 3159110, 3188706, 3218314, 3248484, 3279982, 3312843, 3346504, 3380729, 3415662, 3451169, 3487057, 3523871, 3562420, 3602555, 3643411, 3684958, 3728206, 3773658, 3820617, 3868374, 3917079, 3967100, 4018359, 4070727, 4124325, 4179166, 4235187, 4292747]
57281D292747N9479O0785O0784O0224N9974N9390N7336N3996N0254M6021M0635
57270D901625L4387K8079K1721J5123R309N648L945L021K781M046O586R066J0988
57257E056325J3099J5799J8561K1070K3609K6182K8423L0378L2268L3609L3726
57246E333049L3065L2738L2918L2846L2422L2482L3467L4871L6051L6645L6395
57235E706949L5532L5065L5701L6795L7421L7863L8945M0408M1363M1890M2746
57224F130678M3899M4830M5783M7177M8298M8227M7615M7740M8250M7798M6557
57213F646852M5933M5928M5089M3149M1467M0480L8986L6497L4139L2514L0658
57202G081692K8064K5852K4946K4655K4080K3429K3085K2712K2209K2181K2642
$$ y = [4292747, 4352226, 4413011, 4473795, 4534019, 4593993, 4653383, 4710719, 4764715, 4814969, 4860990, 4901625, 4936012, 4964091, 4985812, 5000935, 5010244, 5015892, 5019837, 5022858, 5025639, 5029685, 5036271, 5045337, 5056325, 5069424, 5085223, 5103784, 5124854, 5148463, 5174645, 5203068, 5233446, 5265714, 5299323, 5333049, 5366114, 5398852, 5431770, 5464616, 5497038, 5529520, 5562987, 5597858, 5633909, 5670554, 5706949, 5742481, 5777546, 5813247, 5850042, 5887463, 5925326, 5964271, 6004679, 6046042, 6087932, 6130678, 6174577, 6219407, 6265190, 6312367, 6360665, 6408892, 6456507, 6504247, 6552497, 6600295, 6646852, 6692785, 6738713, 6783802, 6826951, 6868418, 6908898, 6947884, 6984381, 7018520, 7051034, 7081692, 7109756, 7135608, 7160554, 7185209, 7209289, 7232718, 7255803, 7278515, 7300724, 7322905, 7345547]
57191G345547K2525K1301J9779J8560J7032J4830J2954J2328J2380J2134J1770
57180G521140J2018J2824J3709J4767J6380J8297J9854K0757K1109K1106K1089
57169G713050K1468K2215K2820K2866K2148K0302J7032J2768Q337M019l57m567
57157G882101q194j1632j5737k0520k5214k9663l4424l9447m3876m7264m9764
57146G556366n1036n0317m7833m4850m2018l8821l4885l0638k6517k2765k0250
57135G146436k0165k2639k6735l1966l8513m5908n2948n9035o4201o7599o7656
57124F649071o4142n8566n2108m4723l6794l0144k6436k5627k6518k7869k8552
57113F227592k7718k5238k1294j5549p626J840J1952K3344L8119N8373Q5925J22898
$$ y = [7345547, 7368072, 7389373, 7409152, 7427712, 7444744, 7459574, 7472528, 7484856, 7497236, 7509370, 7521140, 7533158, 7545982, 7559691, 7574458, 7590838, 7609135, 7628989, 7649746, 7670855, 7691961, 7713050, 7734518, 7756733, 7779553, 7802419, 7824567, 7844869, 7861901, 7874669, 7883006, 7887025, 7886668, 7882101, 7873907, 7862275, 7846538, 7826018, 7800804, 7771141, 7736717, 7697270, 7653394, 7606130, 7556366, 7505330, 7455013, 7407180, 7362330, 7320312, 7281491, 7246606, 7215968, 7189451, 7166686, 7146436, 7126271, 7103632, 7076897, 7044931, 7006418, 6960510, 6907562, 6848527, 6784326, 6716727, 6649071, 6584929, 6526363, 6474255, 6429532, 6392738, 6362594, 6336158, 6310531, 6284013, 6256144, 6227592, 6199874, 6174636, 6153342, 6137793, 6130167, 6132007, 6143959, 6167303, 6205422, 6263795, 6349720, 6472618]
57101F472618J70988K30688L02951L91317N00990O36773Q03420J006316J248776
57092A1764837J529194J842923K185340K549798K923546L288290L622669L900724
57084C3607321M091381M166288M108158L909006L568349L106186K574284K033309
57076F1164282J506107R62832L63139k93130r65289j611060k209516k747565l202672
57067E2967128l548438l770045l868398l854795l746988l566681l334807l068365
57059B4208611k781911k489196k201657j927447j673076j443807j241730j065802
57051I383985r14644p87276o80946n91264n15328m52329m00537l56418l17646
57042D367597k84363k56562k32609k11283j92872j77179j62736j48946j36799
$$ y = [6472618, 6643606, 6874294, 7177245, 7568562, 8069552, 8706325, 9509745, 10516061, 11764837, 13294031, 15136954, 17322294, 19872092, 22795638, 26083928, 29706597, 33607321, 37698702, 41864990, 45973148, 49882154, 53450503, 56556689, 59130973, 61164282, 62670389, 63633221, 63996360, 63703230, 62737941, 61126881, 58917365, 56169800, 52967128, 49418690, 45648645, 41780247, 37925452, 34178464, 30611783, 27276976, 24208611, 21426700, 18937504, 16735847, 14808400, 13135324, 11691517, 10449787, 9383985, 8469341, 7682065, 7001119, 6409855, 5894527, 5442198, 5041661, 4685243, 4367597, 4083234, 3826672, 3594063, 3382780, 3189908, 3012729, 2849993, 2701047, 2564248]
57033B564248j26439j16273j05626r6076q8842q2793p6409o9927o4217n9096n4109
57022A624441m9626m5986m2638l9054l5436l1907k8172k4441k1270j8089j3472
57011A274350p257o87N982J4059K4028L4907M7032O3236Q5811J14101J46210J79969
56999A981741K08823K18528J93182J27942L5819n8773j33917j79936j99094j98816
56989A995499j85937j65571j42095j18772r6722p5908n7199m2446l2729k7905
56979A050215k7695l1654l7915m3517m6586m7152m5773m2704l8600l4426l0158
56968F24035k4846j8384j2011o588j657L339Q229J2948J8060K3800K9666L5150
56956F91741L9661M1306L7381K6987J2365k941j6305k6235l1899l3475l2173k9215
$$ y = [2564248, 2437809, 2321536, 2215910, 2119834, 2030992, 1948199, 1871790, 1801863, 1737646, 1678550, 1624441, 1574815, 1528829, 1486191, 1447137, 1411701, 1379794, 1351622, 1327181, 1305911, 1287822, 1274350, 1267093, 1266406, 1272388, 1286447, 1310475, 1345382, 1392414, 1455650, 1541461, 1655562, 1801772, 1981741, 2190564, 2409092, 2602274, 2730216, 2766035, 2707262, 2573345, 2393409, 2194315, 1995499, 1809562, 1643991, 1501896, 1383124, 1286402, 1210494, 1153295, 1110849, 1078120, 1050215, 1022520, 990866, 952951, 909434, 862848, 815696, 769923, 727219, 688619, 654193, 624035, 599189, 580805, 568794, 562206, 560549, 563888, 572117, 585065, 603125, 626925, 656591, 691741, 731402, 772708, 810089, 837076, 849441, 846500, 830195, 803960, 772061, 738586, 706413, 677198]
56944F77198k5220k0699j6295j2254q448m920j645K091O960J2498J7948K3902
56932F51116L1410L9522M5380M6754M2830L2763J6048m826k4351l7957m4938m7035
56920G46716m5971m3104l9565l5398k9825k3252j7700j4358j2248j0114q117o645
56908D60419n108l222k079k502l381l086j674m71j46k80j92O38K381M349N427
56893D51073N479N577O507Q119J0457J4114J8938K3609K6987K8484K6742J9907
56881F45993Q287m796j5928k3931k8637k9346k6158k1146j6412j1926o739j210
56869D68051L611P828J2391J7544K3024K9160L6644M5668N6179O7972P9332Q6262
56857I33666Q4359P1261M7492J6440j5655m1661n7596o4354o4802o0514n2371
$$ y = [677198, 651978, 631279, 614984, 602730, 594282, 589362, 587717, 589808, 596768, 609266, 627214, 651116, 682526, 722048, 767428, 814182, 857012, 889775, 905823, 900997, 876646, 838689, 793751, 746716, 700745, 657641, 618076, 582678, 552853, 529601, 511901, 497543, 485295, 475181, 467064, 460419, 455311, 452089, 450010, 447508, 444127, 441041, 439367, 438896, 438750, 438470, 438278, 438916, 441297, 445646, 451073, 456552, 462129, 468636, 476755, 487212, 501326, 520264, 543873, 570860, 599344, 626086, 645993, 654280, 649484, 633556, 609625, 580988, 551642, 525484, 504338, 487926, 476000, 469261, 468051, 471662, 479490, 491881, 509425, 532449, 561609, 598253, 643921, 700100, 768072, 847404, 933666, 1018025, 1089286, 1136778, 1153218, 1137563, 1095902, 1038306, 973952, 909150, 848636, 796265]
56846G96265m2410l2826k3878j4529m596N287J5175K5824L7745N1480O8119Q7959
56834I69615J08982J27530J39397J39341J21461Q3381L0560k5163p2012j03402
56824A519690j18596j20806j14741j04145r0780p5715o0669m7083l4721k2614
56814G29820j0817J47J1019K3378L7688N3110O8939Q4443R6884J00967R1277O5660
56802A352515K7243j6032n4579q1651r5698r8900r4492q5642p5212o4785n4262
56791F58505m3397l3067k4225j6460q784j057O544J4662K3973L3809M2691M9441
56779G02635N2468M8936L6632J6772o285k7842m4602n4644n7798n6048n2124m7344
56767E10756m1673l5344k9280k4026j9474j5583j2506j0174q549p887p961p636
$$ y = [796265, 753855, 721029, 697151, 682622, 678026, 683313, 698488, 724312, 762057, 813537, 881656, 969615, 1078597, 1206127, 1345524, 1484865, 1606326, 1689707, 1720267, 1695104, 1623092, 1519690, 1401094, 1280288, 1165547, 1061402, 970622, 894907, 834238, 787155, 752434, 729820, 719003, 719150, 730169, 753547, 791235, 844345, 913284, 997727, 1094611, 1195578, 1286855, 1352515, 1379758, 1363726, 1309147, 1227496, 1131798, 1032898, 938406, 852764, 777552, 712767, 658505, 615108, 582041, 557816, 541356, 532572, 531515, 538059, 552721, 576694, 610503, 653194, 702635, 755103, 804039, 840671, 857443, 851158, 823316, 778714, 724070, 666272, 610224, 558100, 510756, 469083, 433739, 404459, 380433, 360959, 345376, 332870, 322696, 314147, 306260, 298299, 290663]
56755B90663o153m260l104k622k062j423j214j337j388j475j720j606r44p24j728
56740B58903l051l351k836k595k700k550k409k921l516l045j710q57j052j730
56726B24580k401k878k682j635o34n21o90k09M33J93n62p53o90j575l233m215
56710B02528l943l031j789k56O36j13j621j999j064l28l47j44O06R39N30K93O15
56693A91512P80O75J222K542L309K707J543Q02M03m0m30p13j057j121k93J121
56677B02962K122K574L250M194M477L900L413L477L458L108L118L602L436J966
56663B49057J76o34m28RK07J00l21q09r88r32j056j273j031l10K25J98j07m47
56645B41636q70j226j229j087j279j776k145k319k496k503k148j845k014k162
$$ y = [290663, 284510, 280250, 277146, 274524, 272462, 271039, 269825, 268488, 267100, 265625, 263905, 262299, 261355, 260631, 258903, 255852, 252501, 249665, 247070, 244370, 241820, 239411, 236490, 232974, 229929, 228219, 227362, 226310, 224580, 222179, 219301, 216619, 214984, 214350, 213829, 213139, 212930, 213363, 213556, 212994, 212241, 211551, 209976, 206743, 202528, 198585, 195554, 193765, 193509, 194145, 194032, 192411, 190412, 189348, 189020, 188673, 188529, 189135, 190074, 190604, 190897, 191512, 192292, 192967, 194189, 196731, 200040, 202747, 204290, 205092, 205495, 205455, 205025, 204312, 203255, 202134, 201841, 202962, 205084, 207658, 210908, 215102, 219579, 223479, 226892, 230369, 233827, 236935, 240053, 243655, 247091, 249057, 249233, 248599, 248171, 248180, 248387, 248487, 248166, 247357, 246369, 245437, 244381, 243108, 242077, 241767, 241992, 242190, 242083, 241636, 240766, 239540, 238311, 237224, 235945, 234169, 232024, 229705, 227209, 224706, 222558, 220713, 218699, 216537]
56631B16537j580n93q6j92m19o87j075j097m41R7k94r43p61p1J49J82R22J822
56613B11470J517K60l43P8K83k43o08l72k70p19j155j215j099p30J02P98O39J52
56595B08545K83N86K9p93m18Q38J292P96Q16J513J382J76l73N00J338J007L44
56578B17861L06N34O69J183J984J958R08K43Q81K008K713L163L457L017K020J707
56562B44612K481L220L241L318L991M522M401M306M688M827M175L273K626K030
56548B95711J557J774K376K130P30o67j309j652j936j677j093j272k422l481l997
56533B84772m584n146m590k896j581j427j600j605k113l250l958l838l641l438
56519B41105k357p22k00j063j590j000o64j397j974j452p36n89k88M44M55n90
$$ y = [216537, 214957, 214364, 214278, 214086, 213667, 212980, 211905, 210808, 210367, 210464, 210170, 209227, 208466, 208395, 208544, 208726, 209648, 211470, 212987, 213247, 212904, 212982, 213265, 213022, 212414, 212042, 211772, 211053, 209898, 208683, 207584, 206854, 206956, 207754, 208393, 208545, 208828, 209414, 209443, 208650, 208232, 209070, 210362, 211158, 211974, 213487, 214869, 215045, 214672, 215172, 216510, 217517, 217861, 218167, 218701, 219370, 220553, 222537, 224495, 225403, 225646, 226527, 228535, 231248, 234411, 237868, 240885, 242905, 244612, 247093, 250313, 253554, 256872, 260863, 265385, 269786, 274092, 278780, 283607, 287782, 291055, 293681, 295711, 297268, 299042, 301418, 303548, 304278, 303611, 302302, 300650, 298714, 297037, 295944, 294672, 292250, 288769, 284772, 280188, 275042, 270452, 267556, 265975, 264548, 262948, 261343, 259230, 255980, 252022, 248184, 244543, 241105, 238748, 238026, 237826, 236763, 235173, 234173, 233509, 232112, 230138, 228686, 227950, 227361, 227073, 227517, 227972, 227382]
56503B27382j094j01J131J420J464J958K026J088K59L73N23nk44N12J243J125
56487B39060R51J268J155L16K11J489K474J915J129J593K463K415K021K249K383
56472B63092J510M58L67Q49J211J888L030L544L074L037M004M276K823J416J677
56457B96256K330J716Q96J535K631K152N04m04l04k40k60J53M12j38n79J50J238
56440C08048J447J302J793K238J583N39L36N19O3n71n39m94j318k238k248k067
56424C08393k679l266k744j948k155k771k624k203k493k941k750k769l880m923
56410B68247m500l490l490m143m217l972m095l869k602j438j383j237J89J557
56396B31557J331P87J779L237L043J806J635K375K411K030K621L502K833J038
$$ y = [227382, 226288, 226187, 227318, 228738, 230202, 232160, 234186, 235274, 235533, 235906, 236429, 236424, 236180, 236692, 237935, 239060, 240011, 241279, 242434, 242750, 242961, 244450, 246924, 248839, 249968, 251561, 254024, 256439, 258460, 260709, 263092, 264602, 265060, 265427, 266276, 267487, 269375, 272405, 275949, 279023, 282060, 286064, 290340, 293163, 294579, 296256, 298586, 300302, 301198, 302733, 305364, 307516, 308020, 307616, 307312, 307072, 306812, 306965, 307377, 307239, 306660, 306810, 308048, 309495, 310797, 312590, 314828, 316411, 316950, 317286, 317805, 317868, 317297, 316758, 316264, 314946, 312708, 310460, 308393, 305714, 302448, 299704, 297756, 295601, 292830, 290206, 288003, 285510, 282569, 279819, 277050, 273170, 268247, 263747, 260257, 256767, 252624, 248407, 244435, 240340, 236471, 233869, 232431, 231048, 229811, 230000, 231557, 232888, 233675, 235454, 238691, 241734, 243540, 245175, 247550, 249961, 251991, 254612, 258114, 260947, 261985]
56382B61985J55M16M22P5L94R84O02k33J09J628L103M421N978O756N722M302M510
56365C01329N614N452M157L525L531K722J377J126J771J617O17L82J267K138K623
56350C39248L156L328K670K366L597N091M850L367K467K138J385R90K145L558
56336C80356L201K026K397L908M295L655L957N032M915L864M162O053P465P717
56322D43003Q122Q941R129Q948R608J0500R996Q729Q724R631R254P416N874M769
56308E62644K716J69j008j088j959l320l144j732j475k520k602j291n58q89o06
56293E43337O56J408J615K893N117O357O475P233Q727R267Q987R912J2181J3853
56279F38018J4658J6274J8697K0101K0529K1982K4621K6697K8410L1852L6844
$$ y = [261985, 262140, 262556, 262978, 263053, 263447, 264431, 265033, 264800, 264909, 266537, 269640, 274061, 280039, 286795, 292517, 296819, 301329, 306943, 312395, 316552, 320077, 323608, 326330, 327707, 328833, 330604, 332221, 332838, 333220, 334487, 336625, 339248, 342404, 345732, 348402, 350768, 354365, 359456, 364306, 367673, 370140, 372278, 373663, 374653, 376798, 380356, 383557, 385583, 387980, 391888, 396183, 399838, 403795, 408827, 413742, 417606, 421768, 427821, 435286, 443003, 451125, 460066, 469195, 478143, 487751, 498251, 508247, 516976, 525700, 535331, 544585, 552001, 557875, 562644, 565360, 565529, 564521, 563433, 561474, 558154, 555010, 553278, 551803, 549283, 546681, 545390, 544832, 543943, 543337, 543993, 545401, 547016, 549909, 555026, 561383, 567858, 575091, 583818, 593085, 602072, 611984, 624165, 638018, 652676, 668950, 687647, 707748, 728277, 750259, 774880, 801577, 829987, 861839, 898683]
56268H98683M0863M3505M7119N2529N8112O3521P0342P8608Q6629R4684J04908
56257A639503J17079J28662J39271J50821J62867J72331J78396J83113J86472
56248C058515J85472J78931J68656J54904J35495J10599Q3874N7474L0353K713
56238D166986k2379m3183o0756p5115q4356q8954r2333r5772r7119r5903r4995
56227C316121r5737r6155r5721r7047j00947j04441j05774j06989j09342j10671
56217B293297j09525j07767j06719j04697j00559r5877r1588q6307p9685p3665
56207A336908o8689o2691n5374m9353m5544m1622l6618l2622l0348k7522k3348
56196H63177k0061j8407j6281j3393j2316j3206j2608r454p024o931o392l795
$$ y = [898683, 939546, 983051, 1030170, 1082699, 1140811, 1204332, 1274674, 1353282, 1439911, 1534595, 1639503, 1756582, 1885244, 2024515, 2175336, 2338203, 2510534, 2688930, 2872043, 3058515, 3243987, 3422918, 3591574, 3746478, 3881973, 3992572, 4076446, 4133920, 4164273, 4166986, 4144607, 4101424, 4040668, 3965553, 3881197, 3792243, 3699910, 3604138, 3507019, 3411116, 3316121, 3220384, 3124229, 3028508, 2931461, 2830514, 2726073, 2620299, 2513310, 2403968, 2293297, 2183772, 2076005, 1969286, 1864589, 1764030, 1668153, 1576565, 1490258, 1410573, 1336908, 1268219, 1205528, 1150154, 1100801, 1055257, 1013635, 977017, 944395, 914047, 886525, 863177, 843116, 824709, 808428, 795035, 782719, 769513, 756905, 747451, 740427, 733496, 727104, 723309]
56184G23309j596j220l79J951L191K478K990O090Q504Q240P998R684J0960J0436
56170G92636J0850J3544J5206J3753J2202J2939J3383J1261R146R542J0209Q586
56158I33257O323N444M460K117N89J265J811R37J324M352O976P535R384J4725
56144A000499K0188K2861K5482L1169L8070M3938N1124O2276P5792Q9991J06749
56133A568139J26151J42380J49970J49749J44216J32284J13908R4973Q1740P4079
56123B777589O8788O5076O1952N4888M0766K2582M944j1066k4795l3175l5942
56112B991607l8866m7029n9326p3467r0519j09618j24232j29534j28328j24583
56102B066105j16784j03201q7816p4828o2742m9735l9305l4402l1547k7052k3422
$$ y = [723309, 721713, 720493, 720114, 722065, 725256, 727734, 730724, 736814, 745318, 753558, 761556, 771240, 782200, 792636, 803486, 817030, 832236, 845989, 858191, 871130, 884513, 895774, 904920, 914462, 924671, 933257, 939580, 945024, 949484, 951601, 952190, 953455, 955266, 956203, 957527, 961879, 968855, 976390, 985774, 1000499, 1020687, 1043548, 1069030, 1100199, 1138269, 1182207, 1233331, 1295607, 1371399, 1461390, 1568139, 1694290, 1836670, 1986640, 2136389, 2280605, 2412889, 2526797, 2621770, 2703510, 2777589, 2846377, 2911453, 2973405, 3028293, 3069059, 3091641, 3096585, 3085519, 3060724, 3027549, 2991607, 2952741, 2905712, 2846386, 2772919, 2682400, 2572782, 2448550, 2319016, 2190688, 2066105, 1949321, 1846120, 1758304, 1683476, 1620734, 1570999, 1531694, 1497292, 1465745, 1438693, 1415271]
56091A415271k3380k3449k0084j6452j6223j6406j3179r184p906o677k450J298
56079A261179R49J07L008O366N712M005N861Q871Q848Q163J0488J2937J1806J0468
56065A358768J3116J6385J5753J4402J6810J9676J8406J6491J8838K1868K0245
56054A550758J7468J9409K3091K2514K0158K1837K5402K5410K3970K6106K9384
56043A805507K8950K7763L0993L5507L5850L5228L9259M4390M4122M1301M2500
56032B211370M5683M5290M3972M7129N1514N1472N0557N4606N9566N9054N7392
56021B777605O1752O8109O8938O7876P2256P8022P7317P4189P7146Q2882Q3338
56010C589430Q2051Q7046R4554R6738R8270J07583J19103J22552J22507J29696
$$ y = [1415271, 1391891, 1368442, 1348358, 1331906, 1315683, 1299277, 1286098, 1276914, 1269008, 1262331, 1259881, 1261179, 1262128, 1262235, 1265243, 1271609, 1277321, 1281326, 1287187, 1296058, 1304906, 1313069, 1323557, 1336494, 1348300, 1358768, 1371884, 1388269, 1404022, 1418424, 1435234, 1454910, 1473316, 1489807, 1508645, 1530513, 1550758, 1568226, 1587635, 1610726, 1633240, 1653398, 1675235, 1700637, 1726047, 1750017, 1776123, 1805507, 1834457, 1862220, 1893213, 1928720, 1964570, 1999798, 2039057, 2083447, 2127569, 2168870, 2211370, 2257053, 2302343, 2346315, 2393444, 2444958, 2496430, 2546987, 2601593, 2661159, 2720213, 2777605, 2839357, 2907466, 2976404, 3044280, 3116536, 3194558, 3271875, 3346064, 3423210, 3506092, 3589430, 3671481, 3758527, 3853081, 3949819, 4048089, 4155672, 4274775, 4397327, 4519834, 4649530]
56000D649530J40520J45027J47459J58101J72331J79331J83854J97130K14022
55991F187305K22499K27848K43170K63884K76967K87357L08581L35473L53887
55982H706971L69220L96400M30246M56213M81509N23423N76021O22239O69158
55973A3231400P35286Q13414Q85072R61120J066160J193722J321965J462505J645066
55964B3315710J866056K106156K387021K752333L205542L731460M366787N178075
55956D8909140O185679P393756Q882948J0782651J3177073J6165592K0003577
55949A31500416K5007124L1223354L8193006M4839512M9256818M8731012M0813630
55942D09564872K5267252N117960j4651551k9862375l8923283m2484597m2057299
$$ y = [4649530, 4790050, 4935077, 5082536, 5240637, 5412968, 5592299, 5776153, 5973283, 6187305, 6409804, 6637652, 6880822, 7144706, 7421673, 7709030, 8017611, 8353084, 8706971, 9076191, 9472591, 9902837, 10359050, 10840559, 11363982, 11940003, 12562242, 13231400, 13966686, 14780100, 15665172, 16626292, 17692452, 18886174, 20208139, 21670644, 23315710, 25181766, 27287922, 29674943, 32427276, 35632818, 39364278, 43731065, 48909140, 55094819, 62488575, 71371523, 82154174, 95331247, 111496839, 131500416, 156507540, 187730894, 225923900, 270763412, 320020230, 368751242, 409564872, 434832124, 439950084, 425298533, 395436158, 356512875, 314028278, 271970979]
55935B71970979l9111526l4879653l0287942k5852508k1770886j8148071j5066412
55928H6853981j2509590j0378958q605828p168160o013880n058918m259929l615916
55920B9242802l101590k664930k286785j981595j740550j528601j335564j178849
55912A3424338j056198r42596q33332p46201o80884o16724n50804m99869m64238
55903G033492m25876l82531l49775l28662l03777k73889k53510k43321k28548
55894D243603k07499j93425j87203j75540j57292j45303j40866j31792j17127
55885B787556j09066j08729j03818r2281q5326q4922q0559p0618o5466o6772o4460
55874A855539n6770n3296n5500n3659m5976m1869m3387m1683l4936l1953l4721
$$ y = [271970979, 232859453, 197979800, 167691858, 141839350, 120068464, 101920393, 86853981, 74344391, 63965433, 55359605, 48191445, 42177565, 37118647, 32858718, 29242802, 26141212, 23476282, 21189497, 19207902, 17467352, 15938751, 14603187, 13424338, 12368140, 11425544, 10592212, 9846011, 9165127, 8548403, 7997599, 7497730, 7033492, 6607616, 6225085, 5875310, 5546648, 5242871, 4968982, 4715472, 4472151, 4243603, 4036104, 3842679, 3655476, 3479936, 3322644, 3177341, 3036475, 2904683, 2787556, 2678490, 2569761, 2465943, 2373662, 2288336, 2203414, 2122855, 2052237, 1986771, 1919999, 1855539, 1798769, 1745473, 1689973, 1636314, 1590338, 1548469, 1505082, 1463399, 1428463, 1396510, 1361789]
55863A361789l4590k9067k5820k6639k3708j5251r408r146q317n897r104j8769
55851A146073k5982k6965k7708l0655l0355k5667k2957k3649k1336j4563j0112
55840H86124j0338r519n877n098q698j0757r394j0038j4146j6131j4554j5075
55828G56499j9109k0672j7778j6066j7866j8357j5832j5225j7961j8662j5473
55817E63498j3608j5174j5272j1745r181r713r138n640l250l346j690K826N382
55804D73949M314M224O908Q021N889M887O659O622K563j557l613o830j2049j4779
55790D85208j3377j2248j3612j3908j1474r921j0666r996o738n013o158n710j774
55777C64613J279P71l80q30m015j0540j5133j5024j4109j5131j5031j1881r052
$$ y = [1361789, 1327199, 1298132, 1272312, 1245673, 1221965, 1206714, 1197306, 1188160, 1179843, 1173946, 1164842, 1146073, 1120091, 1093126, 1065418, 1034763, 1004408, 978741, 955784, 932135, 910799, 896236, 886124, 875786, 866267, 860390, 855292, 846594, 835837, 826443, 816405, 802259, 786128, 771574, 756499, 737390, 716718, 698940, 682874, 665008, 646651, 630819, 615594, 597633, 578971, 563498, 549890, 534716, 519444, 507699, 498518, 488805, 479667, 474027, 470777, 467431, 465741, 468567, 473949, 478263, 482487, 489395, 497416, 503305, 508192, 514851, 521473, 524036, 522479, 518866, 512036, 499987, 485208, 471831, 459583, 445971, 432063, 420589, 410668, 400002, 390006, 383268, 378255, 372097, 366387, 364613, 365892, 366663, 366283, 365453, 361438, 350898, 335765, 320741, 306632, 291501, 276470, 264589, 255537]
55764B55537q589p474m288k678m340n444l855k955m503m729j625P98j75j188L77
55749B04869J421m86k288j657j753m964p865p261n681o032o311m333k515l150
55735A51994l815k051O3K95M98K334L395J709m63j132k218m988o667n401l866
55720A29687m226m392k949k589m658n516k647N64O51k52R19K586K356K010L794
55705A15338N794N698N313O727P813O088L418K465K082M63o94M95K093J882J483
55690A66458K863M200L396K274L053L966K578K48p54j367k895l372j017J772K048
55675A83451R66R23J126N2p94K05J156K4j241j21J803J831R86J558K472J414o20
55658A95191j157n16l55q2J494L081L073K692L418L726J844o82j786k752n543
$$ y = [255537, 246948, 239474, 235186, 232508, 228168, 222724, 218869, 215914, 211411, 206682, 205057, 205855, 205680, 204492, 204869, 206290, 205804, 203516, 201859, 200106, 195142, 187277, 180016, 174335, 168303, 161992, 157659, 155144, 151994, 148179, 146128, 146191, 146486, 146984, 149318, 152713, 154422, 153959, 152827, 150609, 145621, 138954, 133553, 129687, 125461, 121069, 118120, 115531, 110873, 105357, 102710, 103274, 103925, 103673, 104592, 107178, 109534, 111544, 115338, 121132, 126830, 132143, 138870, 146683, 152771, 156189, 158654, 160736, 161199, 160505, 161000, 163093, 164975, 166458, 169321, 173521, 176917, 179191, 182244, 186210, 188788, 189036, 188282, 186915, 184020, 180648, 179631, 181403, 183451, 184417, 185340, 186466, 186518, 185724, 185929, 187085, 187109, 185868, 185747, 187550, 189381, 190367, 191925, 194397, 195811, 195191, 194034, 193518, 193163, 193081, 194575, 197656, 200729, 203421, 206839, 210565, 212409, 211727, 209941, 207189, 201646]
55643B01646q653r502q746q531q598p732o869p190p331o005n018o204p713p057
55629I6497n370m896m777l361k195l424n318m795k580j627k072j886j047r70j136
55614E1043k10P43n1j454j183J43L34l14Q8J212J189J06n44q09j547j947q70N64
55596D6493O85K07N54R13o7j247q80J24k5o42j77N88J79m17L34J251N00q06n87
55577D6980L60J32m40M63J705R94p27o82J118K522L351M901O437O140M786M589
55561H2629N103M037J461n13j630l349n343n809m922m582m995m771l935l757l970
55546D5654l284k080j666j570n50O56O27K33J048J949R06q97n60J649K854K456
55530D7425K541L653M012L079K303K137J594Q37J096J954J749N95R9K63k40j011
$$ y = [201646, 192993, 183491, 174745, 166214, 157616, 149884, 143015, 135825, 128494, 122489, 117471, 111267, 103554, 96497, 91127, 86231, 81454, 78093, 75898, 72474, 67156, 62361, 59781, 58154, 56082, 54196, 53149, 52179, 51043, 50833, 51576, 51525, 50071, 48888, 49031, 49365, 49051, 49139, 50351, 51540, 51646, 51102, 50293, 48746, 46799, 45929, 46493, 47178, 47385, 47939, 48852, 48785, 47538, 46658, 46782, 46757, 46115, 45938, 46526, 46705, 46288, 46622, 47873, 48373, 47567, 46980, 47340, 47472, 47032, 47495, 49200, 50194, 49467, 48785, 49903, 52425, 55776, 60677, 67114, 73254, 78040, 82629, 87732, 91769, 93230, 92717, 91087, 87738, 82395, 76586, 71664, 67082, 62087, 57316, 53381, 49624, 45654, 42370, 40290, 38624, 37054, 36504, 37160, 37787, 38020, 39068, 41017, 41923, 41026, 40466, 42115, 44969, 47425, 49966, 53619, 57631, 60710, 63013, 65150, 66744, 67581, 68677, 70631, 72380, 72975, 73074, 73337, 73097, 72086]
55514G2086l64J322J829O35p08j616k841m010l904l081l277m277m275l215k730
55499D1574k975k579j611j501k082j807q46q58j661j290M73J680J529J158R98
55484C0202K37q87j118p04j152k404k932k672l011l926l930k925k311B47a250
55468a600j29o10l80K15m04j707j562p0M59l95n73N48J094K69l60J4Q7p96j341
55449g241q16k11o5L93J202J221L79KM12M98M6L5L62j34j164j136j01K41k93o9
55429f439J108J484N72L6O16J090f75A29R63J96A14a135J69A55Q78Q49J455J208
55411D545j20n80N55J434R88O17J287J691Q66n8j96m38j178j093L19J382R76L12
55393A1309N07O77O3k06P67J802J597P73L81Q3o80j262j001m55k94k52j19l19
$$ y = [72086, 71722, 73044, 74873, 75508, 74800, 73184, 70343, 66333, 62429, 59348, 56071, 51794, 47519, 44304, 41574, 38599, 36020, 34409, 32908, 30826, 29019, 28173, 27315, 25654, 24364, 24837, 26517, 28046, 29204, 30202, 30439, 29552, 28434, 27730, 26578, 24174, 21242, 18570, 15559, 11633, 7703, 4778, 2467, 247, -1250, -1600, -1729, -2339, -2719, -2504, -2908, -4615, -6177, -6247, -5788, -6183, -6756, -6208, -5114, -4845, -5205, -5191, -5104, -5900, -7241, -8057, -8268, -8333, -7940, -6738, -5517, -5138, -5136, -4724, -4226, -4180, -4145, -3783, -3917, -5081, -6217, -6318, -6077, -6370, -6439, -5331, -3847, -3275, -3239, -2623, -1533, -675, 129, 1092, 1288, 114, -1135, -966, 155, 1033, 1882, 3337, 4545, 4425, 3845, 4400, 5834, 6822, 7439, 8726, 10417, 11283, 11225, 11029, 10591, 9413, 8320, 8639, 10021, 10997, 11309, 11816, 12493, 12556, 12350, 13117, 14919, 16516, 17289, 17670, 17753, 17073, 15811, 14810, 14355, 14061, 13809, 13690, 13371]
55375A3371q05q31m52n93j155r57j4J72p57j342r18o53j177j450r02n15B20f14
55356h40R7k5a86A792K417J177j91n51p88j574C65i05q22j198j141J02J192R99
55338a773N08c75A125J308O09j9p78G43e32k55M7o75p72M04f49K65q37p32j27
55319b080J1L54b68A798J269K06J51M68K50J13O30P94j22q54j86R29J077O93Q08
55300H024J019N43q2r5M9j37O6J026J520O25o08r57r08j181j102j94L09n04j300
55281F113o19N91O39j24l35j53n42j149j020n22m96m18N37J512J051m63j378j144
55263B080m21M64J429J657M99j134j783j393D99a00k75k02o06p93j94M73M04J64
55245a129e29F65J041N98R53J862K181J669J058P17M61K89K48N1l54m85k91n11
$$ y = [13371, 12566, 11735, 11283, 10690, 9535, 8578, 8564, 8736, 7979, 6637, 5719, 5066, 3889, 2439, 1537, 1022, 220, -614, -840, -743, -768, -186, 1792, 4209, 5386, 5195, 4644, 3856, 2282, 365, -905, -1727, -2925, -4066, -3964, -2772, -1773, -1265, -375, 1125, 2433, 3042, 3023, 2245, 743, -532, -787, -740, -1415, -2187, -1783, -649, -384, -1221, -1953, -2080, -2069, -1715, -268, 1798, 3067, 3273, 3424, 3892, 4142, 4255, 4885, 5679, 5557, 4703, 4517, 5446, 6523, 7216, 8024, 9043, 9586, 9504, 9409, 9458, 9321, 9387, 10413, 11933, 12558, 11950, 10993, 10085, 8904, 7802, 7608, 7917, 7413, 6113, 5494, 6085, 6724, 6600, 6265, 6112, 5570, 4421, 3401, 2879, 2383, 1965, 2502, 4014, 5065, 4602, 3224, 2080, 1659, 2123, 3552, 5209, 5708, 4574, 2791, 1398, 499, -100, -375, -577, -1183, -1976, -2170, -1697, -1293, -1129, -529, 665, 1706, 2304, 3257, 5119, 7300, 8969, 10027, 10744, 11205, 11494, 11742, 11793, 11439, 10954, 10663, 10152]
55227A0152j292j631r70k01j04r9M04P73M88L26R20J429J015L31K22K83P6L78
55209A2500J595K367J501M2l52N2pm69m82k72n41q21k41P37J046P95P53P91M45
55190A9439K29P63J386J143M32Q6k92j341k204j522L75J941K469K222J245l70
55174B6001j700j981j786j853j599l03J163J427P13J57j03n35p65k93R5o05j801
55157A6232k218j946j843j649n36J026J793J681J506J314O15k60o44q78j526j952
55141A0715j311k52P5nM58R27J90j233j580n09O83J236J502J540R94L18M50J282
55123A5480J880K014K061J827R93K83N69J253J096K98L0L35K13n19j123j348j383
55106B3959q62M72J546J200J38j23L15K44k29O3R29R66Q0k45N87J485J571J209
$$ y = [10152, 8860, 7229, 6259, 6058, 5954, 5855, 6259, 7032, 7520, 7846, 8766, 10195, 11210, 11541, 11763, 12046, 12122, 12500, 14095, 16462, 17963, 18005, 17653, 17705, 17698, 17229, 16747, 16475, 15934, 15113, 14872, 15609, 16655, 17450, 18203, 18994, 19439, 19668, 20431, 21817, 22960, 23392, 23478, 23186, 21845, 19641, 18119, 18494, 20435, 22904, 25126, 26371, 26001, 24301, 22320, 20534, 18681, 17082, 16779, 17942, 19369, 20082, 20239, 20136, 19601, 18836, 18543, 18638, 18033, 16232, 14014, 12068, 10225, 8576, 8040, 9066, 10859, 12540, 14046, 15360, 15975, 15715, 15071, 14193, 12667, 10715, 9404, 9152, 9227, 9222, 9680, 10607, 10797, 9564, 7984, 7475, 8158, 9394, 10896, 12436, 13430, 13748, 14198, 15480, 17360, 19374, 21435, 23262, 24255, 24538, 25107, 26360, 27456, 27754, 27784, 28119, 28332, 27813, 26690, 25342, 23959, 23097, 23569, 25115, 26315, 26453, 26330, 26645, 26889, 26660, 26723, 27652, 28618, 28698, 28453, 29040, 30525, 32096, 33305]
55088C3305Q40M37K11M51O29R5n54k43P15J145J006J109J227M63p30r21r1M18
55070C9512L20O52J503J557L92p55r89q25q06p32o06q71j261r25J02R49J506K350
55052D1073L127K768J484O94P27M83l69p78m42n35j541k215j616o23m08p18o12
55035D0499R2R53J572J594Q73j7k92j52m57j170j341p11p2J90N92J367J984K193
55017D7697K264K092J230P2l29K21Q77J209J570J875J430K63o86r68j062j271
55001E6484j339j330j649k088k072j776j802j865j249l81l60r63q24K66R87O19
54985D0658q5l82l51OQ55J517J091K05L70J457J770R64P04J811K833K467J492
54968E7382J193J465J620J667J746J508J000J019J862K753L181L629M412N073
$$ y = [33305, 34145, 34582, 34793, 35244, 35873, 35968, 35414, 35171, 35886, 37031, 38037, 39146, 40373, 40836, 40106, 39185, 39094, 39512, 39832, 40484, 41987, 43544, 43936, 43181, 42192, 41367, 40561, 39829, 39223, 38352, 37091, 36166, 36268, 37217, 38723, 41073, 44200, 46968, 48452, 49146, 49873, 50356, 49987, 49209, 48767, 48232, 46691, 44476, 42860, 42237, 41829, 41111, 40499, 40591, 41544, 43116, 44710, 45583, 45566, 45274, 45122, 44665, 43495, 42154, 41443, 41371, 41561, 42153, 43520, 45504, 47697, 49961, 52053, 53283, 53355, 53026, 53247, 54124, 55333, 56903, 58778, 60208, 60471, 59785, 58817, 57755, 56484, 55145, 53815, 52166, 50078, 48006, 46230, 44428, 42563, 41314, 40933, 40573, 39610, 38786, 39052, 40039, 40658, 40573, 40191, 39840, 39846, 40701, 42218, 43309, 43514, 43884, 45341, 47111, 48075, 48779, 50590, 53423, 55890, 57382, 58575, 60040, 61660, 63327, 65073, 66581, 67581, 68600, 70462, 73215, 76396, 80025, 84437, 89510]
54954H9510N489O291P615Q701R342J0369J2107J3670J4387J4560J4184J2450R166
54941B27841N358J704k175o226r347j1084j2459j4059j4813j3768j1805j0393
54929A28774r641q801p672o515n353m302l773l636l032j718o83o69j021p38K22
54914G1442J343K412L320L868M305N260O771Q203R431J0959J2608J3462J3390
54901A66774J3279J3191J1839Q571M424M17l741q275j2067j3944j4199j3878j3360
54888A39031j2518j1357r805p716n648m685m938n309n117m787m479l520j804l93
54874E6955N6J11J47l68j431j879j168l55l29m66r4J81k79q41p59m97p04j009
54856D7271q94o95p17m71K51O92M08K8j12o96j784k042q56K92J3q54p24K94J008
$$ y = [89510, 94999, 101290, 108905, 117606, 126948, 137317, 149424, 163094, 177481, 192041, 206225, 218675, 227841, 233199, 234903, 232728, 226502, 217155, 206071, 193612, 179553, 164740, 150972, 139167, 128774, 119133, 110332, 102660, 96145, 90792, 86490, 82717, 79081, 76049, 74331, 73648, 72979, 71958, 71220, 71442, 72785, 75197, 78517, 82385, 86690, 91950, 98721, 106924, 116355, 127314, 139922, 153384, 166774, 180053, 193244, 205083, 213654, 218078, 218495, 214754, 206479, 194412, 180468, 166269, 152391, 139031, 126513, 115156, 105351, 97635, 91987, 87302, 82364, 77055, 71938, 67151, 62672, 59152, 57348, 56955, 57011, 57122, 57269, 56901, 55470, 53591, 52423, 52068, 51739, 51273, 51179, 51360, 51081, 50240, 49481, 48984, 48280, 47271, 46377, 45682, 44965, 44494, 44745, 45437, 45845, 45873, 45761, 45065, 43281, 41239, 40383, 40675, 40688, 39834, 39110, 39404, 40412]
54837D0412J058P51Pj034j396o59P9j2N1J262K580K404J134L04Q3m26j085r36
54819D4577n8N45O30P01O65R0n07j73R16J759K132K496K720K297J641J701K485
54802F4617L167L542M146N097O071P186Q800J0586J1929J3036J4554J6247J7075
54789A86053J6425J4358J1000O689K385j095m062p197j0204j2090j2537j2056
54777A77669j1126j0024r134q501p508n739l803k482j717j211j297k102k638j941
54763A08446n26M31R05J695K876L877M721N949P542R087J0743J2899J5171J6765
54749B00581J7660J8399J9075J9336J8971J7538J4019Q022Q34n762j1252j5878
54737C01543j9183k0446k0153j9501j8730j7273j5242j3361j1681r741p903p070
$$ y = [40412, 41470, 42221, 42228, 41194, 39798, 39139, 39218, 39206, 39257, 40519, 43099, 45503, 46637, 46941, 47024, 46598, 45513, 44577, 44519, 45064, 45694, 46395, 47060, 47150, 46643, 46470, 47386, 49145, 51277, 53773, 56493, 58790, 60431, 62132, 64617, 67784, 71326, 75472, 80569, 86640, 93826, 102626, 113212, 125141, 138177, 152731, 168978, 186053, 202478, 216836, 227836, 234525, 236910, 235815, 231753, 224556, 214352, 202262, 189725, 177669, 166543, 156519, 147385, 138884, 131376, 125637, 121834, 119352, 117635, 116424, 115127, 113025, 110387, 108446, 107920, 108351, 109256, 110951, 113827, 117704, 122425, 128374, 135916, 145003, 155746, 168645, 183816, 200581, 218241, 236640, 255715, 275051, 294022, 311560, 325579, 333601, 334435, 328673, 317421, 301543, 282360, 261914, 241761, 222260, 203530, 186257, 171015, 157654, 145973, 136232, 128329, 121259]
54725A21259p094o737n432l900k974k791l163l735l749k724j350q35j320j756
54711G3699j384m84K68N14L44K25O19J229J142J76o32n10q3j47k88K06R35J154
54693G6983J110J298J193K18p24l46R09J445Q70J89l8j25o2M75J019P47j5j17
54675H5029O22J312J580J916K522L091L691M509M978M503L761L866M481M368L587
54660A33816L467M335N056M950M517M100L343K311J633J313Q49O23J518L056L639
54645A78526L004K728L849N653P407R530J2177J4142J4315J3104J1576J0117Q561
54632B94689O674L901l46n551j0165j3303j5404j6793j6855j5332j3315j2005
54620A86195j1296j0405r182q036p087o116m997l754k494j514r75m39O87K173
$$ y = [121259, 114165, 107428, 101996, 98096, 95122, 92331, 89168, 85433, 81684, 78960, 77610, 76775, 75455, 73699, 72315, 71831, 72099, 72613, 72957, 73182, 73801, 75030, 76172, 76348, 75716, 75206, 75123, 74976, 74688, 74894, 75829, 76983, 78093, 79391, 80584, 80802, 80078, 79732, 80641, 82086, 82956, 83145, 83107, 82982, 82920, 83395, 84414, 85161, 85146, 85029, 85651, 86963, 88543, 90459, 92981, 96072, 99763, 104272, 109250, 113753, 117514, 121380, 125861, 130229, 133816, 137283, 141618, 146674, 151624, 156141, 160241, 163584, 165895, 167528, 168841, 169690, 170313, 171831, 174887, 178526, 181530, 184258, 188107, 193760, 201167, 210697, 222874, 237016, 251331, 264435, 276011, 286128, 294689, 301363, 305264, 304918, 299367, 289202, 275899, 260495, 243702, 226847, 211515, 198200, 186195, 174899, 164494, 155312, 147276, 140189, 134073, 129076, 125322, 122828, 121314, 120339, 119900, 120587, 122760]
54606A22760L152L287L043K766K358J880J577J212K57j122k163k551k620k509
54592A31327k222k298l292m599n012m553m399m918n120m374l267k399j650j046
54578H2178j054j503j493q98p26j383j871j399n78k48k07P2L87L30N1j96n35r50
54560F9977j030p07n03n54k66N84J257J079L03m63q38m65P26J748J246m89j382
54543G0223j85J870K822K369J659J582K164L012L582L523L289L750M890N736N920
54528A16206O235P085P549O780N271L855K441N82j462l205m712o115p005p148
54514A26357p042p049o725n779m862m525m282l579k851k625k346j277R9P72P57
54499G5043P95R71P92L10N2j2l00o02l12M05O58J10n65o68k16L28N90M59J97K78
$$ y = [122760, 125912, 129199, 132242, 135008, 137366, 139246, 140823, 142035, 142292, 141170, 139007, 136456, 133836, 131327, 129105, 126807, 123515, 118916, 113904, 109351, 104952, 100034, 94914, 90540, 87273, 84874, 83224, 82178, 81124, 79621, 78128, 77230, 76504, 75121, 73250, 71851, 71273, 71025, 70818, 70890, 71277, 71607, 71658, 71462, 70927, 69977, 68947, 68240, 67737, 67183, 66917, 67501, 68758, 69837, 70140, 69677, 68839, 68374, 69100, 70848, 72094, 71605, 70223, 70038, 71908, 74730, 77099, 78758, 80340, 82504, 85516, 89098, 92621, 95910, 99660, 104550, 110286, 116206, 122441, 129526, 137075, 143855, 149126, 152981, 155422, 156004, 154542, 151337, 146625, 140510, 133505, 126357, 119315, 112266, 105541, 99762, 94900, 90375, 86093, 82514, 79663, 77038, 74692, 73415, 73514, 74286, 75043, 75838, 76809, 77601, 77911, 77963, 77951, 77651, 77049, 76737, 77142, 77800, 77910, 77345, 76677, 76461, 76789, 77379, 77838, 78035, 78313]
54479G8313Q21J308J313J159J448K134K644K640K218J527P83M26P05J223J337
54464I9999J000P47R08J171R33o2j368k059j605n56n0m92j193j399j167r10p37
54447I3160o20p22j117j525j734j889k070j946j308n26q2M4J07O4k83q45j269
54430G7439j263p32J54Q88R39L41l16n61l65J14O50P73J90m90j42J420L013L403
54412H5455K563J381O20N27R58J490J742J753J798J865J788J807K306L042L359
54397A12454L251L392L995M572M906N382O058O267N609M472L303K081Q37j23q67
54382A65589j879l160m094m428m519m360l488k219j770k591l608l794l462l287
54368A18930l102k541k004k033k409k575k401j952j206n16n07j001r97k22L06
$$ y = [78313, 79134, 80442, 81755, 82914, 84362, 86496, 89140, 91780, 93998, 95525, 96308, 96734, 97439, 98662, 99999, 100999, 101746, 102654, 103825, 104758, 104696, 103328, 101269, 99664, 99108, 99058, 98566, 97373, 95974, 94807, 93897, 93160, 92540, 91818, 90701, 89176, 87442, 85553, 83483, 81537, 80229, 79703, 79621, 79665, 79772, 79836, 79553, 78708, 77439, 76176, 75444, 75598, 76486, 77425, 77766, 77450, 76889, 76524, 76638, 77288, 78061, 78251, 77761, 77619, 79039, 82052, 85455, 88018, 89399, 90019, 90546, 91504, 92994, 94736, 96489, 98287, 100152, 101940, 103747, 106053, 109095, 112454, 115705, 119097, 123092, 127664, 132570, 137952, 144010, 150277, 155886, 160358, 163661, 165742, 166579, 166456, 165589, 163710, 160550, 156456, 152028, 147509, 143149, 139661, 137442, 135672, 133081, 129473, 125679, 122217, 118930, 115828, 113287, 111283, 109250, 106841, 104266, 101865, 99913, 98707, 98191, 97684, 96683, 95686, 95464, 95770]
54353I5770qk75L58J231J350J002J049J411J541J609K069K640K902L284M279N239
54337A25451N261M757M825N323M980L380J629Q82J103J368P88q93l008m462m861
54322A46523m889n172n365m968m335m064m000l705l400l531l842l769l348k996
54308H9139k773k678l070l900m153l064j428o30q17j120j157j178j021k83O29
54293F2496P63J7p43r60q36n39JN62O81M01J97J91R3j64l91o08q95r72o18j86
54273E8490l2K60J221K338K525J604M07l99p67o91j58L84M04J37K85Q61J156Q48
54255F8873L66J23R0J58K96L39J54QJ82M10K54j69l73k33O5M67Q94R48M89Q4K11
54234G3636M17Q5m51n19l60p08j355j293k84P51R93N03k90j044j373j045l76J07
$$ y = [95770, 95762, 95487, 95845, 97076, 98426, 99428, 100477, 101888, 103429, 105038, 107107, 109747, 112649, 115933, 120212, 125451, 130712, 135469, 140294, 145617, 150597, 153977, 155606, 156488, 157591, 158959, 159747, 158854, 155846, 151384, 146523, 141634, 136462, 131097, 126129, 121794, 117730, 113730, 110025, 106625, 103094, 99252, 95483, 92135, 89139, 86366, 83688, 80618, 76718, 72565, 69501, 68073, 67443, 66626, 65506, 64349, 63171, 62150, 61867, 62496, 63259, 63276, 62533, 61573, 60737, 60198, 60199, 60761, 61442, 61843, 62040, 62231, 62324, 62160, 61769, 61161, 60266, 59294, 58676, 58490, 58458, 58718, 59939, 62277, 64802, 66406, 66813, 66414, 65647, 64956, 64798, 65182, 65586, 65723, 66008, 66869, 68025, 68873, 69239, 69362, 69452, 69610, 69906, 70245, 70399, 70407, 70589, 70999, 71253, 71084, 70711, 70478, 70543, 71010, 71904, 72852, 73341, 73425, 73636, 74053, 74138, 73687, 73168, 72808, 72100, 70745, 69452, 69168, 69919, 70912, 71415, 71125, 70081, 68708, 67663, 67287, 67394]
54216F7394L12L64Q4n91j027o55K5J10k78k52L54Q64R62R60Q70L51l63n15n7J66
54196F9078l39j095j473j386j049o77n91r34j291j158p05m27k62J75O84P25L72
54179E9647J34m3n76j218j223o08j29l4K26Q31J225J078P05L35j82p19q09m30
54161E8210p0R1L23O04N75K80J42J80N1q9K73R45J098M96k68p87j164j244o44
54142E9002K76N64L0n22n89m52k41L23R59Q41l3n96l58j01m29p97o93o59j202
54123E5323j683j273l27J89J14NK5j88p17j129j045n09J00L49J63L4M55J101J092
54104E2079K45o05p44l78j9K70O45J007J202J252J081N00k44m69OM26N6q60j484
54085E3966j384p82q9L73M35J74j35k77k34o3J60L38M22M02J01o37j345j078L04
$$ y = [67394, 67706, 68070, 68154, 67563, 66536, 65881, 65906, 66016, 65738, 65486, 65840, 66704, 67666, 68626, 69496, 69847, 69484, 68969, 68912, 69078, 68739, 67644, 66171, 64785, 63736, 63059, 62468, 61534, 60243, 59085, 58380, 57953, 57691, 57866, 58550, 59275, 59647, 59781, 59738, 59162, 57944, 56721, 56113, 55984, 55950, 56176, 57007, 58232, 59310, 60015, 60350, 60168, 59449, 58640, 58210, 58140, 58231, 58554, 59158, 59733, 60013, 60155, 60335, 60386, 60297, 60570, 61515, 62613, 63109, 62841, 62054, 60890, 59646, 59002, 59278, 59842, 59872, 59350, 58761, 58309, 58068, 58391, 59350, 60191, 60158, 59562, 59204, 59103, 58674, 57877, 57184, 56525, 55323, 53640, 52367, 52040, 52229, 52343, 52348, 52373, 52185, 51468, 50339, 49294, 48785, 48885, 49234, 49397, 49431, 49886, 50987, 52079, 52324, 51719, 50975, 50597, 50578, 50848, 51493, 52500, 53702, 54954, 56035, 56535, 56291, 55822, 55828, 56254, 56310, 55450, 53966, 52582, 51800, 51711, 52084, 52519, 52693, 52558, 52281, 52047, 51984, 52144, 52482, 52904, 53306, 53407, 52770, 51425, 50347, 50651]
54066E0651J574J595Q36N47Q50Q45K88QM84J239J733J952J889J422Q31N80N05
54049F7829J15k86J70J448K422K433J986J723J620J536J564J631J601J899L026
54034I0717M449N103N066N420O314O643O028N565N983O464O116N327M803M470
54020A68468M136M160M546M486L671L032L179L209K093L81o63q81j031j478k087
54005A95221k840l595l798l354l148l797m633m794m556m563m433l498k289j962
53991A43961k549l036k971k808k784k562k082j731j653j581j408j213q36j43M50
53976A17054M57J29N8J72m5m69l87L03Q66Q58P40J088J770K239K207J743J027
53959A29810K98p9K06J034J713J472L22p93j036p56q81j415j386l92P02J093J167
$$ y = [50651, 52225, 53820, 54656, 55203, 56053, 56898, 57186, 57194, 57678, 58917, 60650, 62602, 64491, 65913, 66744, 67324, 67829, 67944, 67658, 67828, 69276, 71698, 74131, 76117, 77840, 79460, 80996, 82560, 84191, 85792, 87691, 90717, 95166, 100269, 105335, 110755, 117069, 123712, 129740, 135305, 141288, 147752, 153868, 159195, 163998, 168468, 172604, 176764, 181310, 185796, 189467, 192499, 195678, 198887, 200980, 201361, 200698, 199817, 198786, 197308, 195221, 192381, 188786, 184988, 181634, 178486, 174689, 170056, 165262, 160706, 156143, 151710, 148212, 145923, 143961, 141412, 138376, 135405, 132597, 129813, 127251, 125169, 123438, 121785, 120204, 118796, 117583, 116747, 116604, 117054, 117511, 117640, 117698, 117870, 117825, 117356, 116969, 117272, 118138, 118996, 119736, 120824, 122594, 124833, 127040, 128783, 129810, 130108, 130029, 130235, 131269, 132982, 134454, 134776, 133983, 132947, 132191, 131310, 129895, 128509, 128117, 128819, 129912, 131079]
53942A31079J687K596L398M097M952N692N815N394M865M274L331K068Q01m25j742
53927A77882k917l363k797j526j62P90J219J485J990K643L016L068L199L465L454
53912A91446L163L312M320N542O105N987N846O137O762P221O826N288L259J790
53898B63004J068M12l37n18q9j68j395k787l219l079l401m066m224l917m028m796
53882B28460n550n867o004o153o135n903n684n542n365n167m968m511l620k704
53868A55287k349k614l072l388l425l148k818k935l546l941l501k447j415p82
53854A15906o96j196j821j835j361j438k340k731j500L83J037J78p63p27n1M44
53838A01489L64k74j100j440r66k53l6j94q2M19Q47R18N92k09j295j888j453m62
$$ y = [131079, 132766, 135362, 138760, 142857, 147809, 153501, 159316, 164710, 169575, 173849, 177180, 179248, 180049, 179624, 177882, 174965, 171602, 168805, 167279, 167117, 167907, 169126, 170611, 172601, 175244, 178260, 181328, 184527, 187992, 191446, 194609, 197921, 202241, 207783, 213888, 219875, 225721, 231858, 238620, 245841, 252667, 257955, 261214, 263004, 264072, 264484, 264147, 263629, 263540, 263372, 261977, 259190, 255971, 252892, 249491, 245425, 241201, 237284, 233256, 228460, 222910, 217043, 211039, 204886, 198751, 192848, 187164, 181622, 176257, 171090, 166122, 161611, 157991, 155287, 152938, 150324, 147252, 143864, 140439, 137291, 134473, 131538, 127992, 124051, 120550, 118103, 116688, 115906, 115210, 114014, 112193, 110358, 108997, 107559, 105219, 102488, 100988, 101371, 102408, 102586, 101823, 101096, 101045, 101489, 101853, 101579, 100479, 99039, 98073, 97820, 97784, 97590, 97508, 97927, 98774, 99692, 100284, 100075, 98780, 96892, 95439, 94977]
53820I4977K29N07P38R08Q76R85J470J713J101J91l2K94L52K46Q81K263L350L576
53802A14625L398L195K839K564K990L955M392L853L220L411M210M814M865M475
53788A66806L815L145K787K763K785K741K750K713K349J731J288J116Q57L21k45
53773A97722o04p90r15j075j490k252l012l324l218l042k960k967l149l363l018
53758A62543j884p84p47j596k236k201k020k178k457k411j799o08P82J594J465
53743A45463J093J334J923J943J316Q30Q08P68L69k57j133k334l260l082k070
53728A43711j396j396j181k28O88P36J86k38l63l49j12M33R92J269J304J158P50
53711A45964K48J26N16J003J246J394J683K159K863L798M522M428L549K625K171
$$ y = [94977, 95206, 95713, 96451, 97359, 98235, 99220, 100690, 102403, 103504, 103695, 103663, 103957, 104309, 104555, 105436, 107699, 111049, 114625, 118023, 121218, 124057, 126621, 129611, 133566, 137958, 141811, 145031, 148442, 152652, 157466, 162331, 166806, 170621, 173766, 176553, 179316, 182101, 184842, 187592, 190305, 192654, 194385, 195673, 196789, 197646, 197967, 197722, 197118, 196328, 195413, 194338, 192848, 190596, 187584, 184260, 181042, 178000, 175040, 172073, 168924, 165561, 162543, 160659, 159875, 159128, 157532, 155296, 153095, 151075, 148897, 146440, 144029, 142230, 141622, 142404, 143998, 145463, 146556, 147890, 149813, 151756, 153072, 153902, 154710, 155478, 155847, 155590, 154457, 152123, 148863, 145781, 143711, 142315, 140919, 139738, 139510, 140198, 140934, 141120, 140882, 140519, 140170, 140058, 140491, 141483, 142752, 144056, 145214, 145964, 146212, 146338, 146854, 147857, 149103, 150497, 152180, 154339, 157202, 161000, 165522, 169950, 173499, 176124, 178295]
53696A78295K152K538L478M657N258M981M556M813N733O640O927O335N045L775
53682B45183L341L802M366M332L778L135K534J810R38J64j91q0K4m92j468j881
53666B69295j145j24r0j011j707j538j052r49j267j737k156k240j809j274j297
53651B49899j852k202j895j195n55k28l34p23q84o49o53j363k032j654o31k68
53635B32781p56j061q09p32r87o15P34J920J963J359J006Q98P64R80J787K467
53619B41699K320J863K061K869L440L481L468L796M372M982N441N512N165M816
53605B95285M964N629O337O523O037N404N517O559P484P197O088N570O171P056
53591C81821P474P517P274O467N405N179O145P219P356O825O321N718M730L947
$$ y = [178295, 180447, 182985, 186463, 191120, 196378, 201359, 205915, 210728, 216461, 223101, 230028, 236363, 241408, 245183, 248524, 252326, 256692, 261024, 264802, 267937, 270471, 272281, 273219, 273383, 273192, 273112, 273136, 272644, 271176, 269295, 268150, 268026, 267936, 266925, 265218, 263680, 262628, 261679, 260412, 258675, 256519, 254279, 252470, 251196, 249899, 248047, 245845, 243950, 242755, 242200, 241972, 241638, 240915, 240031, 239382, 238729, 237366, 235334, 233680, 233049, 232781, 232025, 230964, 230155, 229423, 228436, 227821, 228555, 230475, 232438, 233797, 234803, 235701, 236465, 237445, 239232, 241699, 244019, 245882, 247943, 250812, 254252, 257733, 261201, 264997, 269369, 274351, 279792, 285304, 290469, 295285, 300249, 305878, 312215, 318738, 324775, 330179, 335696, 342255, 349739, 356936, 363024, 368594, 374765, 381821, 389295, 396812, 404086, 410553, 415958, 421137, 427282, 434501, 441857, 448682, 455003, 460721, 465451, 469398]
53577D69398M099M701M541L295J865J179J365J963K416K420K124J859J589J007
53563E03821L40L51J239K101K005J029j20r21j067m01N85Q82J76o69q85q88j350
53546E06228j933j865j299j057j298j371r13k78J43L41L84L18L33O61J165J456
53530E01015J429J451J978L149M628N788O226O182O197O442O721P140Q126R707
53516E76179J1350J2729J4096J5645J7075J8049J8554J8647J8439J8494J9538
53505G58795K1483K3464K5056K6593K8085K8851K8790K8972L0264L2133L3647
53494A066133L4789L5963L6867L6916L6324L5869L5828L5868L5724L5343L4735
53483A460359L4151L4065L4532L5067L5620L6791L8535L9513L8673L6729L4957
$$ y = [469398, 473497, 478198, 482739, 486034, 487899, 489078, 490443, 492406, 494822, 497242, 499366, 501225, 502814, 503821, 504161, 504512, 505751, 507852, 509857, 510886, 510766, 509845, 508778, 508377, 508962, 509844, 510020, 509351, 508466, 507578, 506228, 504295, 502430, 501131, 500074, 498776, 497405, 496492, 496214, 496357, 496698, 497082, 497400, 497733, 498394, 499559, 501015, 502444, 503895, 505873, 509022, 513650, 519438, 525664, 531846, 538043, 544485, 551206, 558346, 566472, 576179, 587529, 600258, 614354, 629999, 647074, 665123, 683677, 702324, 720763, 739257, 758795, 780278, 803742, 828798, 855391, 883476, 912327, 941117, 970089, 1000353, 1032486, 1066133, 1100922, 1136885, 1173752, 1210668, 1246992, 1282861, 1318689, 1354557, 1390281, 1425624, 1460359, 1494510, 1528575, 1563107, 1598174, 1633794, 1670585, 1709120, 1748633, 1787306, 1824035, 1858992]
53472A858992L3261L0673K7363K4692K3316K2479K1356K0049J8915J7776J6222
53461B115094J4239J2306J1069J0858J1082J0362P747L735l75l913p085j0069
53449B175050j2629j4697j6686j9021k1683k4352k6765k8909l0933l2820l4165
53438A912390l4618l4581l4884l5659l6190l6165l6323l7219l8120l7902l6564
53427A514165l4943l3317l1202k8497k5938k4241k3256k2219k0537j8278j5903
53416A235834j3564j0856p489m034j310Q25L261O225R094J1722J4751J8183K0893
53403A283535K2277K3197K4514K5868K6928K8640L1812L5455L7996L9455M0998
53392A620675M2912M4676M6607M9667N3686N7278N9701O1562O3486O5386O7285
$$ y = [1858992, 1892253, 1922926, 1950289, 1974981, 1998297, 2020776, 2042132, 2062181, 2081096, 2098872, 2115094, 2129333, 2141639, 2152708, 2163566, 2174648, 2185010, 2192757, 2196492, 2196117, 2192204, 2185119, 2175050, 2162421, 2147724, 2131038, 2112017, 2090334, 2065982, 2039217, 2010308, 1979375, 1946555, 1912390, 1877772, 1843191, 1808307, 1772648, 1736458, 1700293, 1663970, 1626751, 1588631, 1550729, 1514165, 1479222, 1445905, 1414703, 1386206, 1360268, 1336027, 1312771, 1290552, 1270015, 1251737, 1235834, 1222270, 1211414, 1203925, 1199891, 1198581, 1199406, 1202667, 1208892, 1217986, 1229708, 1244459, 1262642, 1283535, 1305812, 1329009, 1353523, 1379391, 1406319, 1434959, 1466771, 1502226, 1540222, 1579677, 1620675, 1663587, 1708263, 1754870, 1804537, 1858223, 1915501, 1975202, 2036764, 2100250, 2165636, 2232921]
53381B232921O9668P2704P5929P8959Q1732Q3865Q4743Q4462Q3839Q3356Q2782
53370C114960Q1887Q0752P9140P6453P2520O7826O2756N7288N1597M6337M2000
53359C833516L8426L4996L1019K6033K0147J4042Q188K297l967j0211j5896k1422
53347C957168k7881l5906m5336n5677o6063p5119q1756q6005q8452q9227q8421
53336C217325q6958q5884q5092q3839q2233q0985p9961p8414p6576p5462p4942
53325B326979p3541p0614o7306o4719o2397n9349n5516n1445m7369m3369l9736
53314A691618l6517l3266k9862k6909k4761k2806k0286j7324j4549j2164r872
53303A443302p428m787k098J95J612K281K857L624M216M471M920N970P251Q196
$$ y = [2232921, 2302589, 2375293, 2451222, 2530181, 2611913, 2695778, 2780521, 2864983, 2948822, 3032178, 3114960, 3196847, 3277599, 3356739, 3433192, 3505712, 3573538, 3636294, 3693582, 3745179, 3791516, 3833516, 3871942, 3906938, 3937957, 3963990, 3984137, 3998179, 4006367, 4008664, 4004697, 3994486, 3978590, 3957168, 3929287, 3893381, 3848045, 3792368, 3726305, 3651186, 3569430, 3483425, 3394973, 3305746, 3217325, 3130367, 3044483, 2959391, 2875552, 2793319, 2712334, 2632373, 2553959, 2477383, 2401921, 2326979, 2253438, 2182824, 2115518, 2050799, 1988402, 1929053, 1873537, 1822092, 1774723, 1731354, 1691618, 1655101, 1621835, 1591973, 1565064, 1540303, 1517497, 1497211, 1479887, 1465338, 1453174, 1443302, 1435874, 1431087, 1428989, 1429184, 1430796, 1433077, 1435934, 1439558, 1443774, 1448245, 1453165, 1459135, 1466386, 1474582]
53289A474582Q935J0073J1884J4136J6464J8703K1024K3863K7421L1157L4186
53278A692428L6208L7600L8566L8821L8321L7690L7555L7808L7847L7195L5751
53267B105790L3764L1659K9571K7098K3988K0982J9192J8604J7948J6274J3866
53256B358736J1284Q383M830R16k916o853j1238j5689j9423k2375k5337k8907
53244B251411l2802l6413l9503m2154m4271m5634m6359m6923m7493m7540m6541
53233A775778m4879m3447m2385m0950l8763l6526l5064l4354l4033l4177l4810
53222A356390l5227l4713l3569l2604l1901l0950k9680k8404k6960k4890k2440
53211A025052k0432j9106j8024j7131j6978j7720j8704j9279j9345j9017j8398
$$ y = [1474582, 1483517, 1493590, 1505474, 1519610, 1536074, 1554777, 1575801, 1599664, 1627085, 1658242, 1692428, 1728636, 1766236, 1804802, 1843623, 1881944, 1919634, 1957189, 1994997, 2032844, 2070039, 2105790, 2139554, 2171213, 2200784, 2227882, 2251870, 2272852, 2292044, 2310648, 2328596, 2344870, 2358736, 2370020, 2378403, 2383233, 2384149, 2381233, 2374380, 2363142, 2347453, 2328030, 2305655, 2280318, 2251411, 2218609, 2182196, 2142693, 2100539, 2056268, 2010634, 1964275, 1917352, 1869859, 1822319, 1775778, 1730899, 1687452, 1645067, 1604117, 1565354, 1528828, 1493764, 1459410, 1425377, 1391200, 1356390, 1321163, 1286450, 1252881, 1220277, 1188376, 1157426, 1127746, 1099342, 1072382, 1047492, 1025052, 1004620, 985514, 967490, 950359, 933381, 915661, 896957, 877678, 858333, 839316, 820918]
53200H20918j7794j7518j7362j6878j6138j5599j5347j5109j4895j4925j5079
53189F44274j5156j5425j6076j6478j5969j5073j4769j4844j4341j3497j3627
53178D79019j4852j5607j4821j3161j1602j0193q922q425q910r440r189q483p856
53165C37558p102o046n297n327n585n403n006m816m529l876l494l975m611m263
53151B68228l153k681l484m562m517l137j541r26j311j648j305j082j956l284
53137B33641l378k003q94j349k569l134k872k323j390J98J740K184J597R93R32
53122B21373J137J319J519J724J834J987K407L034L629M065M235L977L435L025
53108B58700K809K330J361K63o92j721k834l468l382l205l567m246m739n104n532
$$ y = [820918, 803124, 785606, 768244, 751366, 735228, 719629, 704282, 689173, 674278, 659353, 644274, 629118, 613693, 597617, 581139, 565170, 550097, 535328, 520484, 506143, 492646, 479019, 464167, 448560, 433739, 420578, 408976, 398783, 389861, 381436, 372526, 363086, 353897, 345414, 337558, 330456, 324410, 319113, 313786, 308201, 302798, 297792, 292976, 288447, 284571, 281077, 277102, 272491, 268228, 265075, 262394, 258910, 254348, 249831, 246694, 245153, 244227, 242916, 241268, 239963, 238881, 236925, 233641, 230263, 228260, 227366, 226017, 223448, 220314, 217442, 215119, 213729, 213927, 215667, 217851, 219448, 220441, 221373, 222510, 223829, 225348, 227072, 228906, 230893, 233300, 236334, 239963, 244028, 248263, 252240, 255675, 258700, 261509, 263839, 265200, 265463, 264771, 263050, 260216, 256748, 253366, 250161, 246594, 242348, 237609, 232505, 226973]
53093B26973n784n703n705o048o126n288l970l172l138l258l001k360j611j181
53079A70628j479k348l054l148k945k811k592k187j964k026j784r09q0Kk84j12
53063A42907N38J078J251J117N95k11o87n20l65q99j701j892j453r64n50o2J01
53046A38283n31j393j380m29L52K06m32p03l23K57L09m81j419j344j57P49K46
53029A31810r79j466j003n56n74n71k44P1R9m5k53m20j78N78J117O99k30n85k08
53010A27062R6O5L55J226J906J677P97j8m51n63m99m71o56q76p33k09K86M26K74
52991A29694P0Q8M68R29Q70J90l66j64M19O86P59J186J762J733J075O57J073K000
52973A43129K803L132K991K849L468M947O186O123N300N167N985O516N880M623
$$ y = [226973, 221189, 215486, 209781, 203733, 197607, 192319, 188349, 185177, 182039, 178781, 175780, 173420, 171809, 170628, 169149, 166801, 163747, 160599, 157654, 154843, 152251, 150064, 148100, 146074, 144290, 143381, 143301, 143303, 143019, 142907, 143445, 144523, 145774, 146891, 147486, 147275, 146588, 146068, 145703, 144804, 143103, 141211, 139758, 138794, 138244, 138182, 138283, 137752, 136359, 134979, 134550, 134902, 135108, 134676, 133973, 133650, 133907, 134216, 133735, 132316, 130972, 130815, 131564, 131810, 130831, 129365, 128362, 127806, 127232, 126661, 126417, 126488, 126587, 126542, 126289, 125869, 125691, 126269, 127386, 128085, 127855, 127270, 127062, 127158, 127223, 127578, 128804, 130710, 132387, 133184, 133166, 132715, 132152, 131653, 131182, 130526, 129650, 128917, 128708, 128994, 129420, 129694, 129764, 129852, 130320, 131249, 132119, 132309, 131943, 131779, 132198, 132884, 133643, 134829, 136591, 138324, 139399, 140056, 141129, 143129, 145932, 149064, 152055, 154904, 158372, 163319, 169505, 175628, 180928, 186095, 192080, 198596, 204476, 209099]
52959B09099L636L003K309J378J92j186k324k673k378k192k389k435k071j904
52945B00065k434l079k890j859r22q35j539k501l230l414k864j642l07K59l50
52930A72458j383j540n01O19P22N2m34m92n84p50m74L35J030J116P74M02J34m7
52912A71437j61k80m62o54r30j534k311k473j521q3Q38J140J376J540J112K02
52896A67236l68l30l90j064j869j971j160J39J312J833J550Q88M55M29N96Q30
52880A68116J049R13K12n27m93L47J178J355R68M53J44K04M28K55n30j251j126
52863A71695l67J76K19J61K04J72J32L88Q76J218J336J394J327J125J311K286
52847A83653L456L917L788L828M044L858L474L723M501M734M076L365L128K794
$$ y = [209099, 212735, 215738, 218047, 219425, 219617, 218431, 216107, 213434, 211056, 208864, 206475, 204040, 201969, 200065, 197631, 194552, 191662, 189803, 188881, 188046, 186507, 184006, 180776, 177362, 174498, 172856, 172549, 172808, 172458, 171075, 169535, 169034, 169653, 170375, 170427, 169993, 169501, 168917, 168167, 167693, 168028, 169058, 170174, 170948, 171350, 171484, 171437, 171276, 170996, 170534, 169880, 168950, 167416, 165105, 162632, 161111, 161028, 161866, 163006, 164382, 165922, 167034, 167236, 166868, 166538, 166148, 165084, 163215, 161244, 160084, 160223, 161535, 163368, 164918, 165806, 166261, 166690, 167286, 168116, 169165, 170078, 170290, 169763, 169270, 169617, 170795, 172150, 173118, 173571, 173715, 173919, 174347, 174602, 174072, 172821, 171695, 171328, 171504, 171723, 171884, 172088, 172260, 172392, 172780, 173656, 174874, 176210, 177604, 178931, 180056, 181367, 183653, 187109, 191026, 194814, 198642, 202686, 206544, 210018, 213741, 218242, 222976, 227052, 230417, 233545, 236339]
52833B36339J857O24n77j828k897l249l154l631m795n435m798l719l224l124k768
52818A95621k263k103k309k696l314l985m043l220k157j563j475j771k492l199
52804A59031k978j780q76j162j888j887j274r81j243j531j560j416j091o17l93
52789A38354p14j291j710j916j868j393q39j048k037k596j972j066j014j375r72
52774A16543J10O72K41n03r77j271j429j247p92l90l7L83M30m59j870k573k050
52757A04781j147r38j505k090k064j560j236j490j894j669q00k00m47r51q94m57
52741H5439m24r44j473j638j494j076m17J62L88N03P37O24l99j877k696k515k016
52724G0884j661j029K54J699K461K312J744J329J175R07J76p40j051m16N07Q51
$$ y = [236339, 238196, 238820, 238243, 236415, 233518, 230269, 227115, 223484, 218689, 213254, 208456, 204737, 201513, 198389, 195621, 193358, 191255, 188946, 186250, 182936, 178951, 174908, 171688, 169531, 167968, 166493, 164722, 162230, 159031, 156053, 154273, 153397, 152235, 150347, 148460, 147186, 146205, 144962, 143431, 141871, 140455, 139364, 138747, 138354, 137640, 136349, 134639, 132723, 130855, 129462, 128623, 127575, 125538, 122942, 120970, 119904, 118890, 117515, 116543, 116653, 117325, 117566, 117063, 116086, 114815, 113386, 112139, 111347, 110957, 110920, 111303, 111733, 111274, 109404, 106831, 104781, 103634, 102696, 101191, 99101, 97037, 95477, 94241, 92751, 90857, 89188, 88388, 88188, 87741, 86790, 85896, 85439, 85015, 84071, 82598, 80960, 79466, 78390, 77973, 78135, 78523, 79026, 79763, 80387, 79988, 78111, 75415, 72900, 70884, 69223, 68194, 68448, 70147, 72608, 74920, 76664, 77993, 79168, 80075, 80251, 79511, 78460, 78044, 78551, 79402]
52708G9402O29N05P33R86J110J350J724J891J772J769K103K443K472K422K694
52693A04005L246L676L773L655L410K869J772J62j499k585k766k212j447j009
52679A15050j175j716k043j776j223j041j416j936k206k212k016j596j216j376
52665I2102k105k739k730k277j832j447j036q23r37r87o16k08l93j002j254r25
52649G0791o63r69j415j213l08N11N53J8k61J64Q54J120Q79N12J47k62l68L16
52631G0406J405J766J025J46P6N11O88O51Q08Q22J2j298j884j272l72k44p80j077
52613G1389o80n0J37j49k42L73J345J819J461P49K38k4j90k77l15l99l77NM57
52594G5270L25k55j93J010K267K304J371P13Q08J050R75P56N32J51l15m58o8O82
$$ y = [79402, 80031, 80536, 81269, 82255, 83365, 84715, 86439, 88330, 90102, 91871, 93974, 96417, 98889, 101311, 104005, 107251, 110927, 114700, 118355, 121765, 124634, 126406, 126568, 125069, 122484, 119718, 117506, 116059, 115050, 113875, 112159, 110116, 108340, 107117, 106076, 104660, 102724, 100518, 98306, 96290, 94694, 93478, 92102, 89997, 87258, 84528, 82251, 80419, 78972, 77936, 77113, 76176, 75189, 74573, 74365, 73972, 72970, 71716, 70791, 70128, 69159, 67744, 66531, 66223, 66734, 67287, 67305, 67044, 67208, 68062, 69182, 70061, 70573, 70720, 70458, 70090, 70406, 71811, 73577, 74602, 74748, 74824, 75335, 76023, 76674, 77482, 78304, 78316, 77018, 75134, 73862, 73490, 73246, 72466, 71389, 70709, 70659, 70796, 70647, 70405, 70778, 72123, 73942, 75403, 76152, 76390, 76366, 76176, 75899, 75584, 75185, 74808, 74813, 75270, 75595, 75340, 75147, 76157, 78424, 80728, 82099, 82812, 83620, 84670, 85645, 86401, 86933, 87084, 86769, 86311, 86243, 86925]
52576H6925J538K159K057J163K93L46J074J420R80M57N32J042J478J672J683J544
52560A06363J357J285J289J169J020J205J752K152J954J309P21M88N15O14Q17
52545A24010J346K186K769K391J082k40p54n73l39k86j25L56R38J155O96k35r04
52528A33473p52j96j80p86r75j30J001J432J291J232J198P55J73K9Q1l96j275
52511A35975j657j235n62LO23J124Q94p3r34j161j170j466j882k033j846j307
52495A23293k66J006J668J221K46k36J29Q41J242J168R54R63J106R57M85L49R98
52478A36124J827J842J020L09K88N83O75N72M81M41N18P86Q89K57r80j819j518
52461A42295m23N58R59R14P36O91R16J299J560J572J389R92L73j29n8M54O73K32
$$ y = [86925, 88463, 90622, 92679, 93842, 94135, 94481, 95555, 96975, 97955, 98412, 98944, 99986, 101464, 103136, 104819, 106363, 107720, 109005, 110294, 111463, 112483, 113688, 115440, 117592, 119546, 120855, 121576, 122064, 122579, 123193, 124010, 125356, 127542, 130311, 132702, 133784, 133544, 132790, 132217, 131878, 131592, 131467, 131823, 132761, 133916, 134612, 134377, 133473, 132721, 132525, 132345, 131559, 130584, 130454, 131455, 132887, 134178, 135410, 136608, 137363, 137536, 137565, 137646, 137250, 135975, 134318, 133083, 132521, 132524, 133147, 134271, 135165, 135092, 134158, 132997, 131827, 130361, 128479, 126446, 124600, 123293, 123027, 124033, 125701, 126922, 127168, 126932, 127061, 127902, 129144, 130312, 131266, 132229, 133335, 134292, 134777, 135126, 136124, 137951, 139793, 140813, 141122, 141410, 141993, 142668, 143240, 143721, 144162, 144680, 145466, 146355, 146612, 145632, 143813, 142295, 141872, 142430, 143389, 144303, 145039, 145730, 146646, 147945, 149505, 151077, 152466, 153458, 153831, 153702, 153644, 154098, 154771, 155003]
52443A55003l63m01J51P96J228J522J774J830J440O32j62m35k07j22p11j696k234
52426A58045j881j000l10k58p35j226j356j337j642k167k223j585r86j076j527
52411A38736j707j625j481q94L50J320Q94n11j364j088n10k54J5N62J026J228
52395A34697J448J469O07q47j422m50P67P01l97j143r64k98M86J353K033K170
52379A40210J928J712J442Q22J20k4M99J142J491J601J626J609J685K071K722
52364A60656L311L542L298K625J862J607K120K837K915K290J784K042K723L030
52350A96642K780K553K777L088K891K249J790J747J676J312J135J599K286K437
52336B26962K031J731J882K224K456K494K226J673J328J669K326K421J800J199
$$ y = [155003, 154640, 154239, 154390, 155186, 156414, 157936, 159710, 161540, 162980, 163612, 163450, 163015, 162808, 162686, 161975, 160279, 158045, 156164, 155164, 154854, 154596, 153861, 152635, 151279, 149942, 148300, 146133, 143910, 142325, 141339, 140263, 138736, 137029, 135404, 133923, 133029, 133379, 134699, 135593, 135082, 133718, 132630, 132120, 131866, 131881, 132443, 133469, 134697, 136145, 137614, 138221, 137374, 135952, 135502, 136269, 136970, 136573, 135430, 134466, 134168, 134654, 136007, 138040, 140210, 142138, 143850, 145292, 146114, 146234, 146210, 146709, 147851, 149342, 150943, 152569, 154178, 155863, 157934, 160656, 163967, 167509, 170807, 173432, 175294, 176901, 179021, 181858, 184773, 187063, 188847, 190889, 193612, 196642, 199422, 201975, 204752, 207840, 210731, 212980, 214770, 216517, 218193, 219505, 220640, 222239, 224525, 226962, 228993, 230724, 232606, 234830, 237286, 239780, 242006, 243679, 245007, 246676, 249002, 251423, 253223, 254422]
52322B54422J189J620K257L091L840L864L028K034J622J976L035M661O282P122
52308C00043P156P130P362P347O958P083Q370J0122J1189J1397J1347J1337J1378
52295D18219J1781J2865J4268J5317J5903J6365J6705J6657J6369J6356J6728
52284E87533J7077J7167J7158J7090J6663J5690J4465J3454J2840J2383J1745
52273G53265J0887J0131R688R179P978O008L872K094O93m14j175j755k507l315
52259H04629l510k897k256k293k647k575k170k122k462k379j272N82K496M020
52245G85144M988N414N515N719O426P730R279J0465J0987J1222J1689J2248J2259
52232H99085J1593J0822J0257R546Q530P760P530P163N959M342L250K785K324
$$ y = [254422, 255611, 257231, 259488, 262579, 266419, 270283, 273311, 275345, 276967, 278943, 281978, 286639, 292921, 300043, 307199, 314329, 321691, 329038, 335996, 343079, 351449, 361571, 372760, 384157, 395504, 406841, 418219, 430000, 442865, 457133, 472450, 488353, 504718, 521423, 538080, 554449, 570805, 587533, 604610, 621777, 638935, 656025, 672688, 688378, 702843, 716297, 729137, 741520, 753265, 764152, 774283, 783971, 793150, 801128, 807136, 811008, 813102, 813795, 813381, 812206, 810451, 807944, 804629, 801119, 798222, 795966, 793673, 791026, 788451, 786281, 784159, 781697, 779318, 778046, 778628, 781124, 785144, 790132, 795546, 801061, 806780, 813206, 820936, 830215, 840680, 851667, 862889, 874578, 886826, 899085, 910678, 921500, 931757, 941303, 949833, 957593, 965123, 972286, 978245, 982587, 985837, 988622, 990946]
52219I90946J660J049L37j030k987m695n660o312p192q147q701q833q994r488
52205I21953j0150j0570j0569j0377j0284j0116r375q031o791o285o265o057n452
52192H11631m659l687k430j284r20j304j594j252p03n54o23k54N94J128O41o47
52176G94083j854k321k122j739j516j494j615j832j982j827j299p04n10r15j643
52161G70710k155k144j844j679j623j252n74l28j054k222k830k668k343k236k219
52146G43539k325k866l701m157l973l674l653l574l085k554k552l014l365l201
52132F97845k536j747j448k015l025l605l516l322l368l331l088l097l390l108
52118F57249j779l38K5n32r34p24k00N80J858L351M329M600M654M855N231O032
$$ y = [990946, 992606, 993655, 993992, 992962, 989975, 985280, 979620, 973308, 966116, 957969, 949268, 940435, 931441, 921953, 911803, 901233, 890664, 880287, 870003, 859887, 850512, 842481, 835690, 829405, 823140, 817083, 811631, 806972, 803285, 800855, 799571, 798651, 797347, 795753, 794501, 793798, 793244, 792621, 792367, 792961, 794089, 794730, 794083, 792229, 789908, 787786, 786047, 784531, 783037, 781422, 779590, 777608, 775781, 774482, 773778, 773268, 772353, 770710, 768555, 766411, 764567, 762888, 761265, 760013, 759439, 759111, 758057, 755835, 753005, 750337, 747994, 745758, 743539, 741214, 738348, 734647, 730490, 726517, 722843, 719190, 715616, 712531, 709977, 707425, 704411, 701046, 697845, 695309, 693562, 692114, 690099, 687074, 683469, 679953, 676631, 673263, 669932, 666844, 663747, 660357, 657249, 655470, 655132, 655157, 654625, 653691, 652967, 652767, 653347, 655205, 658556, 662885, 667485, 672139, 676994, 682225, 688257]
52102F88257P582R468J0669J0826J0770J1489J2999J4606J5816J6635J7244J7741
52090H44102J8211J8752J9360J9811J9716J8794J7144J5205J3449J2169J1415
52079A028128J0926J0213R024P650O428N054K976M19j581k404k544k904l850n136
52065A062399o291o849o808o918p894r256r677q759p545o947o604n821m689l594
52051I64747k481j350p40q54q84q1J148K038K731L750M799N169M970M952N279
52036I93193N452N239M943M839M995N369N595N140M190L710L923L604J816m24
52022A051584j441j216j149k029l521n283p140q433q608q364q893j0132j1043
52009I74332j1422j2008j2855j3217j3123j3552j4719j5678j5913j6007j6313
$$ y = [688257, 695839, 705307, 715976, 726802, 737572, 749061, 762060, 776666, 792482, 809117, 826361, 844102, 862313, 881065, 900425, 920236, 939952, 958746, 975890, 991095, 1004544, 1016713, 1028128, 1039054, 1049267, 1058291, 1065941, 1072369, 1077423, 1080399, 1080818, 1079237, 1076833, 1074289, 1071385, 1067535, 1062399, 1056108, 1049259, 1042451, 1035533, 1027639, 1018383, 1008706, 999947, 992402, 985455, 978851, 973030, 968341, 964747, 962266, 960916, 960176, 959322, 958438, 958357, 959505, 961543, 964274, 968024, 972823, 977992, 982962, 987914, 993193, 998645, 1003884, 1008827, 1013666, 1018661, 1024030, 1029625, 1034765, 1038955, 1042665, 1046588, 1050192, 1052008, 1051584, 1050143, 1048927, 1047778, 1045749, 1042228, 1036945, 1029805, 1021372, 1012764, 1004400, 995507, 985375, 974332, 962910, 950902, 938047, 924830, 911707, 898155, 883436, 867758, 851845, 835838, 819525]
51998H19525j6339j5941j5846j6308j6542j6067j5564j5685j6128j6494j7041
51987F41570j7814j8036j7196j5971j5308j5263j5375j5481j5434j4794j3509
51976D67389j2353j1921j1812j1413j0894j0675j0484r735q511p429o831o586
51964C48745o440o119n444m678m413m704m813m171l164k524k438k675l114l613
51950B90435l797l469k952k613k336j892j424j208j204j213j168r68m27L46Q42
51935B66952P07J08o83j612k531l039k898k316j588q92n48r57j944k746k844k430
51919B40739j853j219p11p08j170j472j201o78m32n75r36j329j505j348j166j232
51903B23204j090j64R76J043n8r28o85j11j49m93m89l52m61l47M34J164Q74j41
$$ y = [819525, 803186, 787245, 771399, 755091, 738549, 722482, 706918, 691233, 675105, 658611, 641570, 623756, 605720, 588524, 572553, 557245, 541982, 526607, 511126, 495692, 480898, 467389, 455036, 443115, 431303, 419890, 408996, 398321, 387837, 378102, 369591, 362162, 355331, 348745, 342305, 336186, 330742, 326064, 321651, 316947, 312134, 307963, 304799, 302275, 299837, 297162, 294048, 290435, 286638, 283169, 280217, 277604, 275268, 273376, 271952, 270744, 269540, 268327, 267159, 266191, 265764, 266110, 266952, 267659, 267767, 267084, 265472, 262941, 259902, 257004, 254688, 253100, 252208, 251660, 250703, 248759, 246013, 243169, 240739, 238886, 237667, 236956, 236248, 235078, 233606, 232405, 231727, 231295, 230720, 229784, 228455, 226950, 225602, 224436, 223204, 222114, 221950, 222926, 223969, 223911, 222983, 222298, 222187, 222038, 221545, 221056, 220704, 220243, 219896, 220330, 221494, 222368, 222227]
51885B22227p90p60n34l09M6J91l45j175j359o80K17Q76J340J541J289Q51Q24
51868B23450J315J864K183K271J995J301P50J007J797K164J861J672K147K767
51854B48544K802K376K240K725L354L400K659J673J188J335J515J168M16k99q16
51839B74280j215j462j581j830k247k312j628o91l42n66n13K49J139J395R87N40
51823B64203O12J178J707J714J319J077J177J189Q26M70N14O33K80l34n68l67
51807B75630k96n73q28q33q11q90q90q36j076j651k011j714j072p41q26o78L85
51790B60289K196L641L621K160L41q94j532j853j668p98J19K01m20p07k51J47
51774B64592k74j079j272o54j0q2p60j376j455j156r91j238j649j747j317m79
$$ y = [222227, 221437, 220677, 220143, 219834, 219880, 220071, 219726, 218551, 217192, 216512, 216729, 217605, 218945, 220486, 221775, 222626, 223450, 224765, 226629, 228812, 231083, 233078, 234379, 235129, 236136, 237933, 240097, 241958, 243630, 245777, 248544, 251346, 253722, 255962, 258687, 262041, 265441, 268100, 269773, 270961, 272296, 273811, 274979, 275395, 275096, 274280, 273065, 271603, 270022, 268192, 265945, 263633, 262005, 261314, 260972, 260406, 259893, 260142, 261281, 262676, 263663, 264203, 264815, 265993, 267700, 269414, 270733, 271810, 272987, 274176, 275002, 275472, 275986, 276619, 276899, 276565, 275997, 275630, 275334, 274761, 273933, 273100, 272289, 271399, 270509, 269673, 268597, 266946, 264935, 263221, 262149, 261408, 260582, 259904, 260289, 262485, 266126, 269747, 271907, 272248, 271354, 269822, 267969, 266301, 265503, 265622, 265823, 265403, 264696, 264445, 264592, 264318, 263239, 261967, 261313, 261303, 261221, 260461, 259085, 257630, 256474, 255483, 254245, 252596, 250849, 249532, 249053]
51758B49053N29J438J903J796J536J827K784L585L312K080R99R06J403J437N57
51743B75145p57j942k875l485l468k853k275k111j782o92N41P74O4l82m9K56p4
51726B54035m41k07J49j41q63j255j253j448k070k783l296l607l766l798l695
51711B25561l268k338j297r35j412j985k105k068k142j929j240p45q90r81l40
51696B01886L31P0n57j77J111J768J167M49P15J674K517L100L630M020M207M465
51680B30376M990N517N709N423M539L108J877J792K740L468L263K891L354M359
51666B83406M757M105L018K120J392N23o47k151l969n833p261p939p974p624o930
51651B48993n837m611l874l983m505m600l890k712j567p09k97m98j155j712j729
$$ y = [249053, 249582, 251020, 252923, 254719, 256255, 258082, 260866, 264451, 267763, 269843, 270842, 271748, 273151, 274588, 275145, 274388, 272446, 269571, 266086, 262618, 259765, 257490, 255379, 253597, 252905, 253446, 254220, 254284, 253902, 253853, 254109, 254035, 253594, 253387, 253536, 253395, 252532, 251277, 250024, 248576, 246506, 243723, 240427, 236820, 233054, 229256, 225561, 222293, 219955, 218658, 217723, 216311, 214326, 212221, 210153, 208011, 206082, 204842, 204097, 203207, 202226, 201886, 202217, 202287, 201730, 201553, 202664, 204432, 205599, 206048, 206763, 208437, 210954, 214054, 217684, 221704, 225911, 230376, 235366, 240883, 246592, 252015, 256554, 259662, 261539, 263331, 266071, 269539, 272802, 275693, 279047, 283406, 288163, 292268, 295286, 297406, 298798, 299321, 298674, 296523, 292554, 286721, 279460, 271521, 263547, 255923, 248993, 243156, 238545, 234671, 230688, 226183, 221583, 217693, 214981, 213414, 212705, 212408, 211910, 210755, 209043, 207314]
51636B07314j315r31r64j536k348k718k253j480j228j317p53N53J257L73j291
51621A91363k303k372k095j611o29O07J495J990K416K639K288J574J029O84L33
51606A97408L06R46J642J434N02j1M20J306K208L121L800L870L672L927M408M157
51590B33116L154K677L617N421P095Q247Q799Q707Q397Q611R284R389Q322O637
51576C31473N003L302J318n29j741k403k831l133l512m300n261n588m925l815
51562C03058k722j471j6J118J743K503L818N093N664N814O165O691P124P577Q049
51547C60208P888O670N147M352M122L419J857J31j001j385j242q58n64n61p90
51532C87393j108j343j029L45K388L725L431K110R69L16l04j003j475j850k688
$$ y = [207314, 205999, 205068, 204104, 202568, 200220, 197502, 195249, 193769, 192541, 191224, 190471, 191024, 192281, 192654, 191363, 189060, 186688, 184593, 182982, 182353, 182960, 184455, 186445, 188861, 191500, 193788, 195362, 196391, 197075, 197408, 197714, 198660, 200302, 201736, 202238, 202227, 202647, 203953, 206161, 209282, 213082, 216952, 220624, 224551, 228959, 233116, 236270, 238947, 242564, 247985, 255080, 263327, 272126, 280833, 289230, 297841, 307125, 316514, 324836, 331473, 336476, 339778, 341096, 340567, 338826, 336423, 333592, 330459, 326947, 322647, 317386, 311798, 306873, 303058, 300336, 298865, 298849, 299967, 301710, 304213, 308031, 313124, 318788, 324602, 330767, 337458, 344582, 352159, 360208, 368096, 374766, 379913, 384265, 388387, 391806, 393663, 393794, 392793, 391408, 390166, 389308, 388744, 388183, 387393, 386285, 384942, 383913, 384258, 386646, 390371, 393802, 395912, 396881, 397197, 396893, 395890, 394415, 392565, 389877]
51517C89877m110n545o380o432n854n095m781n165n751n959n908o033o142n547
51503C11175m164k826k381k849l604m082m188m226m386m315l453j942q03p77j399
51488B65780j631j169n35j29Q1J03j83n38l92M19J322J692J558J424J610K005
51472B71417K403K876L685M841N934O558O785P010P356P622P699P697P641P460
51458C56984P269P150O635N097K825R34k5o75j636k497k559j897j056k66L91N84
51442C77258K81J52O23R73K37j374k872m014n334o851p800p824p504p463p701
51427C20787q025q433q784q677p964o953n903m829l808l013k268j198j6M54j39
51412B51231r48p63P00K649M137M866N196N616O244O855P295P679Q034P960O981
$$ y = [389877, 385767, 380222, 373842, 367410, 361556, 356461, 351680, 346515, 340764, 334805, 328897, 322864, 316722, 311175, 307011, 304185, 301804, 298955, 295351, 291269, 287081, 282855, 278469, 274154, 270701, 268759, 267956, 267179, 265780, 264149, 262980, 262445, 262316, 262397, 262500, 262317, 261779, 261387, 261806, 263128, 264820, 266378, 267802, 269412, 271417, 273820, 276696, 280381, 285222, 291156, 297714, 304499, 311509, 318865, 326487, 334186, 341883, 349524, 356984, 364253, 371403, 378038, 383135, 385960, 386894, 386869, 386194, 384558, 382061, 379502, 377605, 376549, 376283, 376674, 377258, 377539, 377691, 378314, 379287, 379524, 378150, 375278, 371264, 365930, 359079, 351279, 343455, 335951, 328488, 320787, 312762, 304329, 295545, 286868, 278904, 271951, 266048, 261219, 257411, 254398, 252130, 250932, 250916, 251370, 251231, 250283, 249520, 250220, 252869, 257006, 261872, 267068, 272684, 278928, 285783, 293078, 300757, 308791, 316751, 323732]
51397C23732N075K616k7k531m585o174p705r381j0639j0766r953r141q900r013
51383B42608r114r099q830q124p224o630o325n709m631l799l746l982l695k930
51369A58770k459k658l126l333l169k743k044j089j70K72J06l43o51p55q53r86
51353A34769q94m85q5J7L2L41Q14R15M44j34k64J51Q29J465J897K109K205K253
51335A46379K153J824J465J450J910K620L258L641L740L739M043M974O358P621
51321A95175Q324Q374P897P037O032N177M622M272L860L012J423q16l073m655
51307B46661n437n828o258o829p424p885p998p608o753n668m656m056m074m424
51293A61763m418l721k834k399k339k060j433r10p07n05q0L03L50J27k27p70j419
$$ y = [323732, 328807, 331423, 331396, 328865, 324280, 318106, 310401, 301020, 290381, 279615, 269662, 260521, 251621, 242608, 233494, 224395, 215565, 207441, 200217, 193587, 187262, 181553, 176922, 173123, 169377, 165395, 161700, 158770, 156311, 153653, 150527, 147194, 144025, 141282, 139238, 138149, 137979, 138251, 138357, 138014, 137363, 136608, 135755, 134769, 133875, 133390, 133305, 133322, 133354, 133695, 134509, 135424, 135868, 135734, 135470, 135621, 136450, 137915, 139812, 141921, 144126, 146379, 148532, 150356, 151821, 153271, 155181, 157801, 161059, 164700, 168440, 172179, 176222, 181196, 187554, 195175, 203499, 211873, 219770, 226807, 232839, 238016, 242638, 246910, 250770, 253782, 255205, 254389, 251316, 246661, 241224, 235396, 229138, 222309, 214885, 207000, 199002, 191394, 184641, 178973, 174317, 170261, 166187, 161763, 157345, 153624, 150790, 148391, 146052, 143992, 142559, 141649, 140942, 140437, 140357, 140660, 141010, 141137, 140910, 140140, 138721]
51276A38721j755j501r55n66l35LL92M30l6o20q35o32l18l8M45J309K169K346
51258A38224J673P86L51K98R9m02q65j069j151j259j386j622k134k736k869k233
51242A23705j205m24j41j56j65k9J78K06j11n36o19k32K48M81O02Q77J157J039
51224A24875M65j14k52K4K92J82l23q84j017m76M72J154J086M86J07M27J117J447
51206A29068J152O33M00O09J136J761K101J785R13J44m7J03N8k80n70n75l93k46
51188A37752l30p01j062q97j18O67Q65O25M06K01k34n52p9J069J900J826J361
51171A42699J221J320J147O50J79j69o96j537k344k618k238j622j375j607j780
51156A31230j385p44o91j399k053j908j251q94j019j052n70J69O95R07R80R43
$$ y = [138721, 136966, 135465, 134510, 133944, 133609, 133612, 134004, 134434, 134398, 133778, 132943, 132311, 131993, 131955, 132400, 133709, 135878, 138224, 139897, 140683, 141034, 141332, 141431, 141029, 140164, 139095, 137944, 136685, 135299, 133677, 131543, 128807, 125938, 123705, 122500, 122076, 121935, 121779, 121614, 121585, 121763, 121969, 121858, 121322, 120703, 120471, 120719, 121200, 121802, 122679, 123836, 124875, 125340, 125226, 124974, 124998, 125290, 125472, 125149, 124265, 123248, 122772, 123244, 124398, 125484, 125970, 126077, 126504, 127621, 129068, 130220, 130853, 131253, 131862, 132998, 134759, 136860, 138645, 139558, 139702, 139655, 139758, 139816, 139536, 138966, 138391, 137998, 137752, 137422, 136721, 135659, 134762, 134644, 135311, 136176, 136801, 137207, 137408, 137174, 136622, 136543, 137612, 139512, 141338, 142699, 143920, 145240, 146387, 147037, 147216, 147047, 146351, 144814, 142470, 139852, 137614, 135992, 134617, 133010, 131230, 129845, 129101, 128410, 127011, 124958, 123050, 121799, 120905, 119886, 118834, 118264, 118433, 119128, 120035, 121015, 121958]
51140A21958O54J66q1L48J399K595L539M163M370L815K349N21p95j230j091q08
51124A41872o05o73j144j736j886j494j127j252j535j396r11o95r83j309j226
51109A23900q76o94p64p70m37J45O54Q19N74R4k42p0N68J148J199R57J141J968
51091A29314K712K544J639R53R83J172P38k87j120j185p03k75j73j84q4K8j1k
51073A36059M12J125J503J194O95P24J260J580J225N36J57L33P97J147J175R59
51057A50881P69Q31J150J537J769J713J446J343J777K543K785J915M43n00m39
51042A69963L5J55j30l68l36k30k09j06K97Q22Q83R0j161j928j704r17l00N8O78
51023A65592J755K660K548J336r6p17l26L74O99P81J176J852K161J845J410J241
$$ y = [121958, 122612, 122778, 122697, 123045, 124444, 127039, 130578, 134741, 139111, 142926, 145275, 145796, 145001, 143771, 142680, 141872, 141267, 140594, 139450, 137714, 135828, 134334, 133207, 131955, 130420, 129024, 128113, 127418, 126435, 125126, 123900, 123024, 122330, 121566, 120796, 120359, 120504, 121158, 121977, 122551, 122645, 122403, 122333, 122901, 124049, 125248, 126205, 127346, 129314, 132026, 134570, 136209, 137162, 138145, 139317, 140055, 139768, 138648, 137463, 136760, 136485, 136312, 136128, 136044, 136072, 136061, 136059, 136471, 137596, 139099, 140293, 140988, 141712, 142972, 144552, 145777, 146313, 146470, 146803, 147600, 148747, 149922, 150881, 151650, 152481, 153631, 155168, 156937, 158650, 160096, 161439, 163216, 165759, 168544, 170459, 170902, 170402, 169963, 169998, 170153, 170023, 169655, 169319, 169089, 168880, 168774, 169071, 169893, 170776, 170866, 169705, 167777, 166073, 165156, 164856, 164914, 165592, 167347, 170007, 172555, 173891, 173795, 173078, 172752, 173126, 173825, 174606, 175782, 177634, 179795, 181640, 183050, 184291]
51007A84291J059P59J039K374L839M010K882J941K180L045L506L402L240L358
50993B20925L781M487N280N733N657N434N601O225O959P584Q246R148J0243J1162
50979C16465J1584J1731J2332J3855J5928J7834J9470K1371K3876K6764K9747
50968E20957L2775L5816L8787M1885M5407M9068N2026N3883N5226N6695N7977
50957A040502N8140N6679N3783M9695M4408L8059L1252K4722J8783J3247P918
50946A437188K976j280m937q326j1230j2714j2174j0287q429p332o794o499o518
50933A343644p021q121j0045j2950j6500k0185k4036k8443l3179l7351m0518m3150
50921A062145m5621m7406m7756m6687m4870m2801m0541l7928l4810l1294k7966
$$ y = [184291, 185350, 186109, 187148, 189522, 193361, 197371, 200253, 202194, 204374, 207419, 210925, 214327, 217567, 220925, 224706, 229193, 234473, 240206, 245863, 251297, 256898, 263123, 270082, 277666, 285912, 295060, 305303, 316465, 328049, 339780, 352112, 365967, 381895, 399729, 419199, 440570, 464446, 491210, 520957, 553732, 589548, 628335, 670220, 715627, 764695, 816721, 870604, 925830, 982525, 1040502, 1098642, 1155321, 1209104, 1258799, 1303207, 1341266, 1372518, 1397240, 1416023, 1429270, 1437188, 1440164, 1438884, 1433947, 1425621, 1414391, 1401677, 1389503, 1379216, 1370787, 1363455, 1356661, 1350162, 1343644, 1336623, 1328502, 1318457, 1305507, 1289007, 1268822, 1244786, 1216343, 1183164, 1145813, 1105295, 1062145, 1016524, 969118, 921362, 874675, 829805, 787004, 746463, 708535, 673725, 642431, 614465]
50910F14465k5484k3739k1826j9117j6015j3357j1508j0256r208p945o200m205
50898D45605k585j683j287j135j180j175n94N79J588J842J696J826K286K697K931
50883D51411L055K937K529K253K506L092L690M611O270Q114Q976Q651Q309Q979
50869E25383J0249J0993J0987J1240J2713J5225J7867K0151K2344K4754K7272
50858G09178K9834L2891L6930M1858M7359N3576O0702O8179P5220Q2076Q9787
50847A327590R8464J06824J13826J19758J25153J29580J32165J32453J29968J23772
50837B539553J13514J00371Q5837P0130N2807L4611J7393K239j1126k2919l2307
50826B950103l8182m0213l8806l4694k8780k1894j4461o937o33K580J710k697
$$ y = [614465, 588981, 565242, 543416, 524299, 508284, 494927, 483419, 473163, 463955, 456010, 449810, 445605, 443020, 441337, 440050, 438915, 437735, 436560, 435966, 436545, 438133, 439975, 441671, 443497, 445783, 448480, 451411, 454466, 457403, 459932, 462185, 464691, 467783, 471473, 476084, 482354, 490468, 499444, 508095, 516404, 525383, 535632, 546625, 557612, 568852, 581565, 596790, 614657, 634808, 657152, 681906, 709178, 739012, 771903, 808833, 850691, 898050, 951626, 1012328, 1080507, 1155727, 1237803, 1327590, 1426054, 1532878, 1646704, 1766462, 1891615, 2021195, 2153360, 2285813, 2415781, 2539553, 2653067, 2753438, 2839275, 2909405, 2962212, 2996823, 3014216, 3016455, 3005329, 2982410, 2950103, 2911921, 2871708, 2832902, 2798208, 2769428, 2747534, 2733073, 2726136, 2725503, 2728083, 2729793, 2727096]
50814B727096r568j8421k9164m1201n3438o5023p5710q5410r3739j00204j04659
50803B050559j07216j07555j04818r8621r0039q0924p2193o3450n4277m4959l5657
50792A190850k5907j5732o254J726R051J6963K5137L2207L7803M2549M6208M7420
50780A402021M5647M1917L7227L1404K4249J6675R811L805j683o525j0540j4276
50768A579732j8484k3101k7561l1632l5340l8344m0295m1554m2682m3354m2617
50757A194768m0268l7141l3859l0163k5792k1206j6960j2838q387l958n04J668
50745I65360L337N461Q290J1548J4992J8451K1650K4570K7803L2152L7773M4109
50733A215496N0650N7380O4378P1344P7761Q3121Q6860Q8404Q7609Q4925Q0850
$$ y = [2727096, 2717528, 2699107, 2669943, 2628742, 2575304, 2510281, 2434571, 2349161, 2255422, 2155218, 2050559, 1943343, 1835788, 1730970, 1632349, 1542310, 1461386, 1389193, 1325743, 1271466, 1226507, 1190850, 1164943, 1149211, 1142957, 1144683, 1153734, 1170697, 1195834, 1228041, 1265844, 1308393, 1354601, 1402021, 1447668, 1489585, 1526812, 1558216, 1582465, 1599140, 1608951, 1612756, 1611073, 1604548, 1594008, 1579732, 1561248, 1538147, 1510586, 1478954, 1443614, 1405270, 1364975, 1323421, 1280739, 1237385, 1194768, 1154500, 1117359, 1083500, 1053337, 1027545, 1006339, 989379, 976541, 968154, 964196, 963692, 965360, 968697, 974158, 982448, 993996, 1008988, 1027439, 1049089, 1073659, 1101462, 1133614, 1171387, 1215496, 1266146, 1323526, 1387904, 1459248, 1537009, 1620130, 1706990, 1795394, 1883003, 1967928, 2048778]
50722B048778P5361O8166N9203M8624L6547K3204R122n152j9236l2360m2997m9725
50710B219535n2416n2098m9591m4962l8342l0632k2997j6047r900m756j095N96
50698A897295k5l119q575j5907k4375l3178m1549m8800n4409n8033n9454n8580
50686A491291n5598n1030m5526l9572l3320k6664j9544j2074m369L671J2243K1326
50674A240834L0756M0579N0948O1634P2057Q1993R1823J01636J10360J16207J17976
50663B116803J15667J09983J01662R1175P8917O5598N2503M1053L1819K4129J6865
50652B846174R417J765n965j3589k0757k7195l2943l8082m2409m5642m7688m8431
50640B534655m7515m4730m0352l4726k7869k0008j2169n601p20K854N338O392
$$ y = [2048778, 2124139, 2192305, 2251508, 2300132, 2336679, 2359883, 2369005, 2363853, 2344617, 2312257, 2269260, 2219535, 2167119, 2115021, 2065430, 2020468, 1982126, 1951494, 1928497, 1912450, 1902550, 1897794, 1896699, 1897295, 1897270, 1894151, 1885576, 1869669, 1845294, 1812116, 1770567, 1721767, 1667358, 1609325, 1549871, 1491291, 1435693, 1384663, 1339137, 1299565, 1266245, 1239581, 1220037, 1207963, 1203594, 1207265, 1219508, 1240834, 1271590, 1312169, 1363117, 1424751, 1496808, 1578801, 1670624, 1772260, 1882620, 1998827, 2116803, 2232470, 2342453, 2444115, 2535290, 2614207, 2679805, 2732308, 2773361, 2805180, 2829309, 2846174, 2855591, 2857356, 2851391, 2837802, 2817045, 2789850, 2756907, 2718825, 2676416, 2630774, 2583086, 2534655, 2487140, 2442410, 2402058, 2367332, 2339463, 2319455, 2307286, 2301685, 2300965, 2303819, 2309157, 2315549]
50628B315549N646L159o05m835q587j1416j3728j6016j7899j8403j7074j4268
50616B201523j0487o001j071M037R254J4360J8560K0893K1149J9888J7662J4757
50604B324524J1507Q077L878k022r728j8344k7098l6041m5405n4862o3664p1164
50592B019658p6923q0656q2227q1603p8988p5137p1159o7435o3191n7784n1957
50581A232598m6937m2720l8388l3811k9684k5905k1536j6666j2774j0461q315
50570I45401m920q00K714N527Q408J1417J4066J6582J9708K3454K7157L0631L4277
50557A133622L8183M2119M6354N1562N7835O4606P1496P8404Q4782Q9749R3152
50546A851864R5521R6640R5193R0376Q3137P5092O6850N8363N0442M4720M1866
$$ y = [2315549, 2321195, 2324354, 2323749, 2318914, 2310327, 2298911, 2285183, 2269167, 2251268, 2232865, 2215791, 2201523, 2191036, 2185035, 2183964, 2188001, 2197255, 2211615, 2230175, 2251068, 2272217, 2292105, 2309767, 2324524, 2336031, 2344108, 2347986, 2345964, 2336236, 2317892, 2290794, 2254753, 2209348, 2154486, 2090822, 2019658, 1942735, 1862079, 1779852, 1698249, 1619261, 1544124, 1472965, 1405530, 1342339, 1284555, 1232598, 1185661, 1142941, 1104553, 1070742, 1041058, 1015153, 993617, 976951, 964177, 953716, 945401, 940481, 939681, 942395, 947922, 956330, 967747, 981813, 998395, 1018103, 1041557, 1068714, 1099345, 1133622, 1171805, 1213924, 1260278, 1311840, 1369675, 1434281, 1505777, 1584181, 1668963, 1758712, 1851864, 1947385, 2044025, 2139218, 2229594, 2312731, 2387823, 2454673, 2513036, 2563478, 2608198, 2650064]
50535B650064M0694L9498L7720L5764L3750L1230K8111K5112K3093K2420K3202
50524B990658K5626K9617L4538L9696M4916N0133N4641N7330N7666N5831N1966
50513C492618M5769L7030K6121J3687J53j4301k9490m4985n9961p3382q4579r3520
50501C215160j00135j03635j03054r8333r0241p9352o5860n0492l4705j9667n653
50490B464033P325J8873K8506L5889M0428M1229L7843L0533J9510M529j4197l5130
50478B679371n6011p5009r0956j03099j11276j15967j17646j16259j11832j05314
50468A676002r8158r1204q4323p7066o9315o1458n4166m7890m2347l6835l1144
50457I82096k5769k1083j6821j2718r044o047l387p10J727L642N461P797J0458
$$ y = [2650064, 2690758, 2730256, 2767976, 2803740, 2837490, 2868720, 2896831, 2921943, 2945036, 2967456, 2990658, 3016284, 3045901, 3080439, 3120135, 3165051, 3215184, 3269825, 3327155, 3384821, 3440652, 3492618, 3538387, 3575417, 3601538, 3615225, 3615378, 3601077, 3571587, 3526602, 3466641, 3393259, 3308680, 3215160, 3115025, 3011390, 2908336, 2810003, 2719762, 2640410, 2574550, 2524058, 2489353, 2469686, 2464033, 2471358, 2490231, 2518737, 2554626, 2595054, 2636283, 2674126, 2704659, 2724169, 2728698, 2714501, 2679371, 2623360, 2548351, 2457395, 2354296, 2243020, 2127053, 2009407, 1893148, 1781316, 1676002, 1577844, 1486640, 1402317, 1325251, 1255936, 1194478, 1140312, 1092422, 1050075, 1013240, 982096, 956327, 935244, 918423, 905705, 896661, 890614, 887227, 886517, 888244, 891886, 897347, 905144, 915602]
50444I15602J2801J4744J6767J8957K0865K2249K3374K4505K5663K6958K8557
50433A151042L0262L1551L2189L2395L2385L2112L1651L1367L1569L2123L2585
50422A501231L2585L2014L1011K9782K8435K7088K6080K5853K6536K7882K9627
50411A818124L1553L3156L3912L4090L4768L6422L8046L8238L6809L4651L2262
50400B202031K9178K4854J9397J3225O525p25q488j6677k5279l4388m4039n3931
50388B111683o3283p1218p7357q1687q3851q3080p9232p3333o6615n9345n1166
50377A321516m2171l2997k4050j5309o823J181Q614J5333K0636K3449K3190K0110
50365A312679J4859Q064K78q064j6628k4868l1809l6621l9368m0830m1598m1632
$$ y = [915602, 928403, 943147, 959914, 978871, 999736, 1021985, 1045359, 1069864, 1095527, 1122485, 1151042, 1181304, 1212855, 1245044, 1277439, 1309824, 1341936, 1373587, 1404954, 1436523, 1468646, 1501231, 1533816, 1565830, 1596841, 1626623, 1655058, 1682146, 1708226, 1734079, 1760615, 1788497, 1818124, 1849677, 1882833, 1916745, 1950835, 1985603, 2022025, 2060071, 2098309, 2135118, 2169769, 2202031, 2231209, 2256063, 2275460, 2288685, 2295210, 2294485, 2285997, 2269320, 2244041, 2209653, 2165614, 2111683, 2048400, 1977182, 1899825, 1818138, 1734287, 1651207, 1571975, 1498642, 1432027, 1372682, 1321516, 1279345, 1246348, 1222298, 1206989, 1200166, 1201347, 1209961, 1225294, 1245930, 1269379, 1292569, 1312679, 1327538, 1335602, 1335880, 1327816, 1311188, 1286320, 1254511, 1217890, 1178522, 1137692, 1096094, 1054462]
50353A054462m0711l8918l6718l4660l2999l1384k9182k6249k3145k0410j7959
50342G22127j5592j3614j2373j1487j0195q312o347m712l355k122q71P20K913
50329F36780N369P265Q154Q475R117J0613J2599J4051J4330J4043J4401J5595
50317G70792J6553J6670J6865J8115J9765K0457K0198K0250K1089K1795K1583
50306I84132K0786K0060J9506J9002J8548J7905J6541J4252J1391Q303N079J914
50294A157419q64l194n219o835p970r200j1205j3669j5637j6997j8602k0724k2563
50281A004740k3565k4220k4936k5303k5016k4615k4459k3904k2391k0566j9418
50270G46347j8849j8031j6691j5129j3449j1681j0281r565q916p500n542l955
$$ y = [1054462, 1013751, 974833, 938115, 903455, 870456, 839072, 809890, 783641, 760496, 740086, 722127, 706535, 692921, 680548, 669061, 658866, 650554, 644207, 639495, 636140, 634018, 633147, 633867, 636780, 642149, 649414, 657568, 666043, 675160, 685773, 698372, 712423, 726753, 740796, 755197, 770792, 787345, 804015, 820880, 838995, 858760, 879217, 899415, 919665, 940754, 962549, 984132, 1004918, 1024978, 1044484, 1063486, 1082034, 1099939, 1116480, 1130732, 1142123, 1150426, 1155505, 1157419, 1156555, 1153361, 1148142, 1141307, 1133337, 1124137, 1112932, 1099263, 1083626, 1066629, 1048027, 1027303, 1004740, 981175, 956955, 932019, 906716, 881700, 857085, 832626, 808722, 786331, 765765, 746347, 727498, 709467, 692776, 677647, 664198, 652517, 642236, 632671, 623755, 616255, 610713, 606758]
50258F06758k868j562J38J422J730J529J529J772J914J891J892K016K179K157
50244F22497J639O03m53j033j367k068l080l633l478l398m119n230n764n414m729
50229E80973m315m355m695m953m687l896l154k860k577j660l08O48R36J065J366
50214E47528J588J730K359L658M805M950M264L384K399J183K43J77M88M2j269
50199E77529k411k865l347m455n612o047n929n882n916n691n248m826m333l698
50185E11269l388l809m531m852m813m950n272n327n064m800m413l505k359j795
50171D52391j949j905r97L00J105J220J041P66K13p21j767k508k829l116l825
50156D37419m801n330n153m964n423n961n370l443j311j31p5o41j248j375p88
$$ y = [606758, 603890, 602328, 602466, 603888, 605618, 607147, 608676, 610448, 612362, 614253, 616145, 618161, 620340, 622497, 624136, 624739, 624286, 623253, 621886, 619818, 616738, 613105, 609627, 606229, 602110, 596880, 591116, 585702, 580973, 576658, 572303, 567608, 562655, 557968, 554072, 550918, 548058, 545481, 543821, 543513, 544161, 545097, 546162, 547528, 549116, 550846, 553205, 556863, 561668, 566618, 570882, 574266, 576665, 577848, 578091, 578268, 578756, 578798, 577529, 575118, 572253, 568906, 564451, 558839, 552792, 546863, 540981, 535065, 529374, 524126, 519300, 514967, 511269, 507881, 504072, 499541, 494689, 489876, 484926, 479654, 474327, 469263, 464463, 460050, 456545, 454186, 452391, 450442, 448537, 447540, 447840, 448945, 450165, 451206, 451972, 452185, 451464, 449697, 447189, 444360, 441244, 437419, 432618, 427288, 422135, 417171, 411748, 405787, 400417, 396974, 395663, 395532, 395457, 394816, 393568, 392193, 391405]
50141C91405M7L18j41o49o09j93J28K41L09M37P01J190J830K418K886L316L692
50124D07326L957M279M817N319N443N427N848O739P521P823P793P553P061O517
50110D93423O238N982N163L881K936K625K365J823J506J765K062J854J479J463
50096E34565J607J499J414J868K684L236L390L480L661L869M223M827N371N573
50082E81267N770O440P329P756P709P893Q584R245R461R662J0435J1617J2535
50069F95703J3030J3633J4691J5703J5864J5147J4436J4551J5401J6293J6766
50058H61218J6856J6874J7193J8058J9187J9776J9431J8848J9052K0137K1388
50047A068018K2514K3943K5957K8411L1392L5344M0281M5784N2003N9751O9164
$$ y = [391405, 391452, 391770, 391629, 390980, 390371, 390178, 390306, 390547, 390856, 391293, 391994, 393184, 395014, 397432, 400318, 403634, 407326, 411283, 415562, 420379, 425698, 431141, 436568, 442416, 449155, 456676, 464499, 472292, 479845, 486906, 493423, 499661, 505643, 510806, 514687, 517623, 520248, 522613, 524436, 525942, 527707, 529769, 531623, 533102, 534565, 536172, 537671, 539085, 540953, 543637, 546873, 550263, 553743, 557404, 561273, 565496, 570323, 575694, 581267, 587037, 593477, 600806, 608562, 616271, 624164, 632748, 641993, 651454, 661116, 671551, 683168, 695703, 708733, 722366, 737057, 752760, 768624, 783771, 798207, 812758, 828159, 844452, 861218, 878074, 894948, 912141, 930199, 949386, 969162, 988593, 1007441, 1026493, 1046630, 1068018, 1090532, 1114475, 1140432, 1168843, 1200235, 1235579, 1275860, 1321644, 1373647, 1433398, 1502562]
50036A502562P8965Q7579R4186R8175R8467R4105Q5107P2150N6070L8339K1375
50025B327080P503k148p327p909m416J206O353R233R068N150l318j6346l2672
50012B291457n0199o6730q0584r1070r8194j01821j01563r7774r1901q5185p7725
50001A348711o9550o1876n6103n2009m8166m3915l9787l6080l2341k8512k5388
49990H54984k3432k2075k0671j9359j8434j7550j6202j4568j3277j2547j1941
49979F64928j0919r358p652o344n544m747l561k387j912k011j812r82k19j31k97
49964F07052R3J091K037K509K610K530K382K494L267M500N274M949M065L825M708
49949F53386O032O986P602Q376R335J0130J0794J1728J2926J3952J4819J6179
$$ y = [1502562, 1581527, 1669106, 1763292, 1861467, 1959934, 2054039, 2139146, 2211296, 2267366, 2305705, 2327080, 2334583, 2332435, 2325108, 2317199, 2312783, 2313989, 2320342, 2329575, 2338643, 2343793, 2340475, 2324129, 2291457, 2241258, 2174528, 2093944, 2002874, 1904680, 1802859, 1701296, 1603522, 1511621, 1426436, 1348711, 1279161, 1217285, 1161182, 1109173, 1061007, 1017092, 977305, 941225, 908884, 880372, 854984, 831552, 809477, 788806, 769447, 751013, 733463, 717261, 702693, 689416, 676869, 664928, 654009, 644651, 636999, 630655, 625111, 620364, 616803, 614416, 612504, 610493, 608681, 607699, 607480, 607349, 607052, 607145, 608236, 610273, 612782, 615392, 617922, 620304, 622798, 626065, 630565, 635839, 640788, 644853, 648678, 653386, 659418, 666404, 674006, 682382, 691717, 701847, 712641, 724369, 737295, 751247, 766066, 782245]
49937G82245J8276K0381K1761K2723K4130K6295K8931L1887L5387L9693M5045
49926A096754N1761O0010O9672Q0707R3421J07795J22879J37279J49977J60168
49916B130423J66456J67009J60657J47709J29936J10155R1443P5899O3974N5258
49906C298919M9705M7573M8302M9996N0047M5979L5984J9480k539k7917n4218
49895C561311p9252j01173j18753j31637j40125j44793j46420j45861j43620j39795
49885B269882j34758j29339j23887j17731j10331j02435r5170q8380q1002p2934
49875A213915o5384n9185n3837m8572m3407l8669l4268l0017k6152k3044k0733
49864G70647j9088j8066j7468j6840j5946j5076j4576j4349j4051j3542j2892
$$ y = [782245, 800521, 820902, 842663, 865386, 889516, 915811, 944742, 976629, 1012016, 1051709, 1096754, 1148515, 1208525, 1278197, 1358904, 1452325, 1560120, 1682999, 1820278, 1970255, 2130423, 2296879, 2463888, 2624545, 2772254, 2902190, 3012345, 3103788, 3179687, 3243661, 3298919, 3348624, 3396197, 3444499, 3494495, 3544542, 3590521, 3626505, 3645985, 3643446, 3615529, 3561311, 3482059, 3380886, 3262133, 3130496, 2990371, 2845578, 2699158, 2553297, 2409677, 2269882, 2135124, 2005785, 1881898, 1764167, 1653836, 1551401, 1456231, 1367851, 1286849, 1213915, 1148531, 1089346, 1035509, 986937, 943530, 904861, 870593, 840576, 814424, 791380, 770647, 751559, 733493, 716025, 699185, 683239, 668163, 653587, 639238, 625187, 611645, 598753]
49853E98753j2121j1187j0147r172q438q014p763p412o761n798m610l458k861
49840E01011l146l760l604k431j269j012j204r61m47l86o07k14R03J854K157K299
49824D89183K733L205L422L593M019M768N908P423Q803R519R960J1107J3087J4986
49810E91716J6338J7896K0498K4040K8035L2389L7092M1974M7356N4310O3487
49799I75131P4124Q4846R5047J04831J13836J20638J23204J19742J09563R3630
49789B014592P4186N3615L3850J6724M054l093m887k308L236R686J4472J5405
49777B229532J1220J146j5194l6816o0860q3710j02575j16015j23653j26020j24154
49766A452901j18767j10208r9452q8431p8623o9813o0990n2170m4476l8660l4305
$$ y = [598753, 586632, 575445, 565298, 556126, 547688, 539674, 531911, 524499, 517738, 511940, 507330, 503872, 501011, 497865, 494105, 490501, 488070, 486801, 485789, 484585, 483624, 483177, 482791, 482184, 481970, 482873, 484727, 486884, 489183, 491916, 495121, 498543, 502136, 506155, 510923, 516831, 524254, 533057, 542576, 552536, 563643, 576730, 591716, 608054, 625950, 646448, 670488, 698523, 730912, 768004, 809978, 857334, 911644, 975131, 1049255, 1134101, 1229148, 1333979, 1447815, 1568453, 1691657, 1811399, 1920962, 2014592, 2088778, 2142393, 2176243, 2192967, 2197021, 2193928, 2189041, 2186733, 2189969, 2199655, 2214127, 2229532, 2240752, 2241898, 2226704, 2189888, 2129028, 2045318, 1942743, 1826728, 1703075, 1577055, 1452901, 1334134, 1223926, 1124474, 1036043, 957420, 887607, 826617, 774447, 729971, 691311, 657006]
49755F57006l0518k6780k3097j9711j6842j4401j2078r845q138p169o466n418
49743D76543m120l152k721k495k190j891j700j473r92l09J91J07m76r54q56m90
49727D53022m91r41j365j550j658j582r93k37k75j260k102j960j319r46o36P3
49711D35780O59L03o18r32m18Oj67l40L9O23Q42P77Q43J043J059Q66Q79J488K570
49692D45302L494L646K978K011J265R64J262K312L813M868M759L726K667K194
49678D85261K183K107J569P30K54N97J261J261M75r3K73R86J100O04J83J84N41
49661D99476J229K072K466K044J333J021R56N88P2j8K31K08j50m09o34j296k158
49644E07031k310j548p77o89r19q93o82n77l68L40J483K519K847K183Q87r0j14
$$ y = [657006, 626488, 599708, 576611, 556900, 540058, 525657, 513579, 503734, 495596, 488427, 481961, 476543, 472423, 469271, 466550, 464055, 461865, 459974, 458274, 456801, 455809, 455500, 455691, 455798, 455322, 454368, 453512, 453022, 452531, 451590, 450225, 448675, 447017, 445435, 444442, 444205, 443930, 442670, 440568, 438608, 437289, 436343, 435707, 435780, 436439, 436742, 436124, 435192, 434774, 434780, 434613, 434273, 434312, 434935, 435777, 436554, 437397, 438440, 439499, 440365, 441244, 442732, 445302, 448796, 452442, 455420, 457431, 458696, 459660, 460922, 463234, 467047, 471915, 476674, 480400, 483067, 485261, 487444, 489551, 491120, 491850, 492104, 492701, 493962, 495223, 495698, 495605, 495878, 496864, 497964, 498568, 498751, 498935, 499476, 500705, 502777, 505243, 507287, 508620, 509641, 510597, 511185, 511257, 511239, 511470, 511678, 511528, 511119, 510485, 509189, 507031, 504721, 503173, 502396, 501707, 500788, 499895, 499213, 498636, 498268, 498608, 500091, 502610, 505457, 507640, 508527, 508437, 508323]
$$ [...]
##END NTUPLES=NMR SPECTRUM
##END=
