
##TITLE=AC1069_TOPL02_5906258_YoTkPcJFFM
##JCAMPDX= 6.0         $$ Bruker NMR JCAMP-DX V2.0
##DATA TYPE= NMR SPECTRUM
##DATA CLASS= NTUPLES
##ORIGIN= BRUKER
##OWNER= Administrator
$$ 1.72 TOPSPIN		Version 2.1
$$ 2012-04-10 10:09:40.875 -0500  Administrator@TOPSPIN
$$ Compression mode = diff/dup
##.OBSERVE FREQUENCY= 400.13188235
##.OBSERVE NUCLEUS= ^1H
##.ACQUISITION MODE= SIMULTANEOUS (DQD)
##.ACQUISITION SCHEME= undefined
##.AVERAGES= 64
##.DIGITISER RES= 22
##SPECTROMETER/DATA SYSTEM= spect
##.PULSE SEQUENCE= noesygpps1d.comp
##.SOLVENT NAME= COFFEE_meoh
##.SHIFT REFERENCE= INTERNAL, COFFEE_meoh, 1, 14.96877
##AUDIT TRAIL= $$ (NUMBER, WHEN, WHO, WHERE, PROCESS, VERSION, WHAT)
$$ ##TITLE= Audit trail, TOPSPIN		Version 2.1
$$ ##JCAMPDX= 5.01
$$ ##ORIGIN= Bruker BioSpin GmbH
$$ ##OWNER= Administrator
$$ $$ C:\Bruker\TOPSPIN/data/COFFEE/nmr/AC1069_TOPL02_5906258_YoTkPcJFFM/12/pdata/1/auditp.txt
$$ ##AUDIT TRAIL=  $$ (NUMBER, WHEN, WHO, WHERE, PROCESS, VERSION, WHAT)
(   1,<2012-04-04 10:47:10.453 -0500>,<Administrator>,<TOPSPIN>,<go>,<TOPSPIN 2.1>,
      <created by zg
	started at 2012-04-04 10:35:38.765 -0500,
	POWCHK enabled, PULCHK disabled,
       configuration hash MD5:
       1A 1E CE 29 27 FD 77 03 67 4E F0 E3 C4 B2 CB 90
       data hash MD5: 64K
       F5 10 E4 60 E4 CF E9 ED 8E 3E BD FA 15 A1 A1 C5>)
(   2,<2012-04-04 10:47:13.250 -0500>,<Administrator>,<TOPSPIN>,<proc1d>,<TOPSPIN 2.1>,
      <Start of raw data processing
       efp LB = 0.3 FT_mod = 6 PKNL = 1 PHC0 = 0 PHC1 = 0 SI = 128K 
       data hash MD5: 128K
       E5 BA 55 07 78 1F 96 81 03 86 D5 F7 45 5A E1 72>)
(   3,<2012-04-04 10:47:14.484 -0500>,<Administrator>,<TOPSPIN>,<proc1d>,<TOPSPIN 2.1>,
      <pk PHC0 = 34.33228 PHC1 = 0 
       data hash MD5: 128K
       6B 67 7D D7 35 1F 38 39 56 5B FD A1 A3 F1 65 E0>)
(   4,<2012-04-04 10:47:14.718 -0500>,<Administrator>,<TOPSPIN>,<proc1d>,<TOPSPIN 2.1>,
      <abs ABSG = 1 
       data hash MD5: 128K
       4A 3B C3 CC 30 51 B8 76 AE 49 1C 9A DB 0A 6E B8>)
(   5,<2012-04-04 10:47:14.796 -0500>,<Administrator>,<TOPSPIN>,<proc1d>,<TOPSPIN 2.1>,
      <abs ABSG = 2 
       data hash MD5: 128K
       0E 36 88 62 6E 20 5B 07 09 4B 55 60 26 0F 2E 92>)
(   6,<2012-04-04 10:47:14.906 -0500>,<Administrator>,<TOPSPIN>,<proc1d>,<TOPSPIN 2.1>,
      <abs ABSG = 3 
       data hash MD5: 128K
       A9 F6 93 B8 D5 D2 AB 2C 43 ED E2 E0 57 D3 CD 0D>)
(   7,<2012-04-04 10:47:15.109 -0500>,<Administrator>,<TOPSPIN>,<proc1d>,<TOPSPIN 2.1>,
      <abs ABSG = 4 
       data hash MD5: 128K
       51 8D 2A A5 6A 79 B1 A9 29 56 1F 31 C8 36 08 5C>)
(   8,<2012-04-04 10:47:15.156 -0500>,<Administrator>,<TOPSPIN>,<proc1d>,<TOPSPIN 2.1>,
      <abs ABSG = 5 
       data hash MD5: 128K
       8F 4C 16 B4 5D 04 5C CE 64 9B BE 08 30 45 14 04>)
(   9,<2012-04-04 10:47:15.406 -0500>,<Administrator>,<TOPSPIN>,<audit>,<TOPSPIN 2.1>,
      <user comment:
       ICON-NMR User ID: COFFEE
       data hash MD5: 128K
$$ [...]
##$TP07= 0
##$TPNAME0= <>
##$TPNAME1= <>
##$TPNAME2= <>
##$TPNAME3= <>
##$TPNAME4= <>
##$TPNAME5= <>
##$TPNAME6= <>
##$TPNAME7= <>
##$TPOAL= (0..7)
0.5 0.5 0.5 0.5 0.5 0.5 0.5 0.5
##$TPOFFS= (0..7)
0 0 0 0 0 0 0 0
##$TUNHIN= 0
##$TUNHOUT= 0
##$TUNXOUT= 0
##$USERA1= <user>
##$USERA2= <user>
##$USERA3= <user>
##$USERA4= <user>
##$USERA5= <user>
##$V9= 5
##$VALIST= <valist>
##$VCLIST= <CCCCCCCCCCCCCCC>
##$VD= 0
##$VDLIST= <DDDDDDDDDDDDDDD>
##$VPLIST= <PPPPPPPPPPPPPPP>
##$VTLIST= <TTTTTTTTTTTTTTT>
##$WBST= 2048
##$WBSW= 25
##$XGAIN= (0..3)
0 0 0 0
##$XL= 0
##$YL= 0
##$YMAX_a= 13884882
##$YMIN_a= -13004176
##$ZGOPTNS= <>
##$ZL1= 120
##$ZL2= 120
##$ZL3= 120
##$ZL4= 120
##$ABSF1= 14.96877
##$ABSF2= -5.58376
##$ABSG= 5
##$ABSL= 3
##$ALPHA= 0
##$AQORDER= 0
##$ASSFAC= 0
##$ASSFACI= 0
##$ASSFACX= 0
##$ASSWID= 0
##$AUNMP= <proc_prof1d_extract.lims>
##$AXLEFT= 0
##$AXNAME= <>
##$AXNUC= <1H>
##$AXRIGHT= 0
##$AXTYPE= 0
##$AXUNIT= <>
##$AZFE= 0.1
##$AZFW= 0.1
##$BCFW= 0
##$BC_mod= 0
##$BYTORDP= 0
##$COROFFS= 0
##$CY= 15
##$DATMOD= 1
##$DC= 0
##$DFILT= <>
##$DTYPP= 0
##$F1P= 0
##$F2P= 0
##$FCOR= 0.5
##$FTSIZE= 131072
##$FT_mod= 6
##$GAMMA= 0
##$GB= 0
##$INTBC= 1
##$INTSCL= 1
##$ISEN= 128
##$LB= 0.3
##$LEV0= 0
##$LPBIN= 0
##$MAXI= 10000
##$MC2= 0
##$MEAN= 0
##$ME_mod= 0
##$MI= 0
##$NCOEF= 0
##$NC_proc= -1
##$NLEV= 6
##$NOISF1= 0
##$NOISF2= 0
##$NSP= 0
##$NTH_PI= 0
##$NZP= 0
##$OFFSET= 14.96877
##$PC= 1
##$PHC0= 34.33228
##$PHC1= 0
##$PH_mod= 1
##$PKNL= yes
##$PPARMOD= 0
##$PPDIAG= 0
##$PPIPTYP= 0
##$PPMPNUM= 2147483647
##$PPRESOL= 1
##$PSCAL= 4
##$PSIGN= 0
##$PYNMP= <proc.py>
##$REVERSE= no
##$SF= 400.130004737121
##$SI= 131072
##$SIGF1= 0
##$SIGF2= 0
##$SINO= 400
##$SIOLD= 131072
##$SPECTYP= <>
##$SREGLST= <1H.CDCl3>
##$SSB= 0
##$STSI= 131072
##$STSR= 0
##$SW_p= 8223.68421052632
##$SYMM= 0
##$S_DEV= 0
##$TDeff= 65536
##$TDoff= 0
##$TI= <>
##$TILT= no
##$TM1= 0
##$TM2= 0
##$TOPLEV= 0
##$USERP1= <user>
##$USERP2= <user>
##$USERP3= <user>
##$USERP4= <user>
##$USERP5= <user>
##$WDW= 1
##$XDIM= 131072
##$YMAX_p= 126665951
##$YMIN_p= -558305045
##$CURPLOT= <Network HP LaserJet P1505>
##$CURPRIN= <$Network HP LaserJet P1505>
##$DFORMAT= <normdp>
##$LAYOUT= <+/1D_H.xwp>
##$LFORMAT= <normlp>
##$PFORMAT= <normpl>
##$SURQMSG= 1
$$ End of Bruker specific parameters
$$ ---------------------------------
##NTUPLES= NMR SPECTRUM
##VAR_NAME=  FREQUENCY,     SPECTRUM/REAL,   SPECTRUM/IMAG
##SYMBOL=    X,             R,               I
##VAR_TYPE=  INDEPENDENT,   DEPENDENT,       DEPENDENT
##VAR_FORM=  AFFN,          ASDF,            ASDF
##VAR_DIM=   131072,        131072,          131072
##UNITS=     HZ,            ARBITRARY UNITS, ARBITRARY UNITS
##FACTOR=    0.0627417313425165, 1,          1
##FIRST=     8223.62146879498, -1271,        -29305
##LAST=      0,             -564,            -29553
##MIN=       0,             -558305045,      0
##MAX=       8223.62146879498, 126665951,    0
$$ Real data points
##PAGE= N=1
##DATA TABLE= (X++(R..R)), XYDATA
$$ [...]
62172E03308j4523j3419j1931j0411r041p994p433p129o536n531m576m007l599
62159C97178l095k615k292j984j605j317j139q04k61J56L16N72J149J781K216
62144C88256K671L383M195M889N589O428P253P977Q827R852J0635J0872J0897
62131D81724J1223J1858J2508J3077J3572J3735J3302J2394J1344J0236Q953P516
62119F21442O096M762L437K071P24l40o77l8J233K500L527M569N751O884P918
62104F69859R019R985J0187R410Q206P174O294N250L933K378O70q28j677j992
62090G37868k370k943l191k960k927l525m139l975l158k279j425l75O29J133J245
62075G07608J470J984K635L448M514N555O204O598P169P996Q831R591J0395J1237
$$ y = [503308, 488785, 475366, 463435, 453024, 443983, 435989, 428556, 421427, 414891, 409360, 404784, 400777, 397178, 394083, 391468, 389176, 387192, 385587, 384270, 383131, 382327, 382066, 382222, 382538, 383110, 384259, 386040, 388256, 390927, 394310, 398505, 403394, 408983, 415411, 422664, 430641, 439468, 449320, 459955, 470827, 481724, 492947, 504805, 517313, 530390, 543962, 557697, 570999, 583393, 594737, 604973, 613926, 621442, 627538, 632300, 635737, 637808, 638532, 638192, 637515, 637477, 638710, 641210, 644737, 649306, 655057, 661941, 669859, 678878, 688863, 699050, 708460, 716666, 723840, 730134, 735384, 739317, 741695, 742365, 741537, 739860, 737868, 735498, 732555, 729364, 726404, 723477, 719952, 715813, 711838, 708680, 706401, 704976, 704601, 705230, 706363, 707608, 709078, 711062, 713697, 717145, 721659, 727214, 733418, 740016, 747185, 755181, 764012, 773603, 783998, 795235]
62061G95235J2085J3089J4276J5236J5580J5528J5614J5983J6393J6694J6838
62050I62551J6680J6219J5865J5994J6428J6753J6949J7234J7593J7868J8162
62039A148296J8606J8989J9126J9255J9673K0208K0579K1004K1831K2868K3740
62028A374175K4654K6053K7672K8715K8957K8928K8932K8755K8403K8405K9013
62017A682662K9725K9939K9646K9133K8457K7565K6671K6150K6104K6239K6119
62006A988410K5474K4351K3000K1632K0328J9143J8076J6852J5103J2911J0871
61995B196151R337P954O251M313K472O77j305l347n136o732q379r971j1162j1884
61981B169239j2318j2465j2250j1824j1367j0781j0017r431r252q989q027o628
$$ y = [795235, 807320, 820409, 834685, 849921, 865501, 881029, 896643, 912626, 929019, 945713, 962551, 979231, 995450, 1011315, 1027309, 1043737, 1060490, 1077439, 1094673, 1112266, 1130134, 1148296, 1166902, 1185891, 1205017, 1224272, 1243945, 1264153, 1284732, 1305736, 1327567, 1350435, 1374175, 1398829, 1424882, 1452554, 1481269, 1510226, 1539154, 1568086, 1596841, 1625244, 1653649, 1682662, 1712387, 1742326, 1771972, 1801105, 1829562, 1857127, 1883798, 1909948, 1936052, 1962291, 1988410, 2013884, 2038235, 2061235, 2082867, 2103195, 2122338, 2140414, 2157266, 2172369, 2185280, 2196151, 2205488, 2213442, 2219693, 2224006, 2226478, 2227155, 2225850, 2222503, 2217367, 2210635, 2202256, 2192285, 2181123, 2169239, 2156921, 2144456, 2132206, 2120382, 2109015, 2098234, 2088217, 2078786, 2069534, 2060545, 2052518, 2045890]
61969B045890n621n244n056m868m948n225n119m370l366k459j553n77K65R36J734
61954B000419K774L793M621N415O263P027P717Q491R166R316Q977Q747Q907Q970
61940B100603Q357P012N046K305j275n350r526j3765j8066k2091k5457k8090l0053
61927A969650l1248l1619l1396l0882l0178k9358k8572k7824k6873k5636k4401
61916A651663k3417k2519k1406k0088j8758j7482j6249j5144j4203j3238j2047
61905A457112j0731r536q545p652o726n653m325k828j454l98M72J395K433L575
61891A407139M919O531Q256R903J1601J3631J5922J7942J9270K0086K0910K1957
61879A578067K2915K3479K3794K4191K4595K4598K4089K3496K3176K2923K2377
$$ y = [2045890, 2040269, 2035025, 2029969, 2025101, 2020153, 2014928, 2009809, 2005439, 2002073, 1999614, 1998061, 1997484, 1997749, 1998685, 2000419, 2003193, 2006986, 2011607, 2017022, 2023285, 2030312, 2038029, 2046520, 2055686, 2065002, 2073979, 2082726, 2091633, 2100603, 2108960, 2115972, 2121018, 2123323, 2122048, 2116698, 2107172, 2093407, 2075341, 2053250, 2027793, 1999703, 1969650, 1938402, 1906783, 1875387, 1844505, 1814327, 1784969, 1756397, 1728573, 1701700, 1676064, 1651663, 1628246, 1605727, 1584321, 1564233, 1545475, 1527993, 1511744, 1496600, 1482397, 1469159, 1457112, 1446381, 1436845, 1428300, 1420648, 1413922, 1408269, 1403944, 1401116, 1399662, 1399264, 1399736, 1401131, 1403564, 1407139, 1412058, 1418589, 1426845, 1436748, 1448349, 1461980, 1477902, 1495844, 1515114, 1535200, 1556110, 1578067, 1600982, 1624461, 1648255, 1672446, 1697041, 1721639, 1745728, 1769224, 1792400, 1815323, 1837700]
61868A837700K1621K1071K0946K1249K2089K3673K6034K9121L3127L8304M4500
61857B139435N1264N8448O6342P5120Q4541R4307J04418J15071J26400J38461
61847C053807J51228J64570J78396J92821K07960K23390K37990K50252K58505
61838D918919K60665K53993K35380K02212J53616R1599K1235n0687j17763j75450
61828E793719k21325k54673k76001k86575k88084k82508k71941k58159k42310
61819C412143k25136k07375j89786j72897j57009j42336j28889j16365j04460
61810A967890r3234q2934p3565o4920n6865m9347m2223l5439k9158k3436j7922
61799A398847j2240o501j076L905Q379J2021J4638J6712J8831K0738K1591K1124
$$ y = [1837700, 1859321, 1880392, 1901338, 1922587, 1944676, 1968349, 1994383, 2023504, 2056631, 2094935, 2139435, 2190699, 2249147, 2315489, 2390609, 2475150, 2569457, 2673875, 2788946, 2915346, 3053807, 3205035, 3369605, 3548001, 3740822, 3948782, 4172172, 4410162, 4660414, 4918919, 5179584, 5433577, 5668957, 5871169, 6024785, 6116384, 6137619, 6086932, 5969169, 5793719, 5572394, 5317721, 5041720, 4755145, 4467061, 4184553, 3912612, 3654453, 3412143, 3187007, 2979632, 2789846, 2616949, 2459940, 2317604, 2188715, 2072350, 1967890, 1874656, 1791722, 1718157, 1653237, 1596372, 1547025, 1504802, 1469363, 1440205, 1416769, 1398847, 1386607, 1380106, 1379030, 1382935, 1391314, 1403335, 1417973, 1434685, 1453516, 1474254, 1495845, 1516969]
61787A516969J9799J7852J4974J1158P074L311j28l217n454o430o360n593m128
61774A559827k006K17J969L332M690N896O250N250K974k21m052q274j2590j6635
61760A546627k0054k2597k4231k5057k5173k4637k3523k1865j9612j6799j3646
61749A309433j0265o411j861L040P621J1647J5460J9371K3318K7207L1132L5178
61737A464870L9307M3603M8281N3338N8534O3786O9350P5452Q2119Q9432R7624
61726B185696J06846J17073J28363J40886J54769J70207J87711K07780K30339
61717C629670K54839K81012L09016L38847L70013M01810M33301M62729M87342
61708F968579N03801N08260M95914M61385M00599L12894K01987P5747n5019j78899
$$ y = [1516969, 1536768, 1554620, 1569594, 1580752, 1587826, 1591137, 1591009, 1587792, 1582338, 1575908, 1569548, 1563955, 1559827, 1557821, 1558038, 1560007, 1563339, 1568029, 1573925, 1580175, 1585425, 1588399, 1588178, 1584126, 1575852, 1563262, 1546627, 1526573, 1503976, 1479745, 1454688, 1429515, 1404878, 1381355, 1359490, 1339878, 1323079, 1309433, 1299168, 1292757, 1290896, 1293936, 1301557, 1313204, 1328664, 1348035, 1371353, 1398560, 1429692, 1464870, 1504177, 1547780, 1596061, 1649399, 1707933, 1771719, 1841069, 1916521, 1998640, 2088072, 2185696, 2292542, 2409615, 2537978, 2678864, 2833633, 3003840, 3191551, 3399331, 3629670, 3884509, 4165521, 4474537, 4813384, 5183397, 5585207, 6018508, 6481237, 6968579, 7472380, 7980640, 8476554, 8937939, 9338538, 9651432, 9853419, 9929166, 9874147, 9695248]
61698I695248k86732l73213m36586m77529m98436n02806m94376m76511m52216
61689E696843m24149l94320l64044l34283l05792k78879k53542k29927k08297
61680B903610j88525j70244j53547j38814j25761j13438j01482r0604q1359p3254
61670A666582o5668n8914n3634m9647m6270m3344m1161l9619l8238l6906l5897
61659A157284l5169l4305l3148l1891l0566k8905k6833k4661k2743k1193j9975
61648H47895j8981j8013j6957j5926j5066j4348j3734j3372j3308j3190j2624
61637F82376j1678j0797j0278j0058r908r614r075q455q061p937p745p239o583
61624E64948o045n584n042m467l967l456k831k258j967j912j900j865j817j684
$$ y = [9695248, 9408516, 9035303, 8598717, 8121188, 7622752, 7119946, 6625570, 6149059, 5696843, 5272694, 4878374, 4514330, 4180047, 3874255, 3595376, 3341834, 3111907, 2903610, 2715085, 2544841, 2391294, 2252480, 2126719, 2013281, 1911799, 1821195, 1739836, 1666582, 1600914, 1542000, 1488366, 1438719, 1392449, 1349105, 1307944, 1268325, 1230087, 1193181, 1157284, 1122115, 1087810, 1054662, 1022771, 992205, 963300, 936467, 911806, 889063, 867870, 847895, 828914, 810901, 793944, 778018, 762952, 748604, 734870, 721498, 708190, 695000, 682376, 670698, 659901, 649623, 639565, 629657, 620043, 610968, 602513, 594452, 586515, 578770, 571531, 564948, 558903, 553319, 548277, 543810, 539843, 536387, 533556, 531298, 529331, 527419, 525519, 523654, 521837, 520153]
61610E20153j438j194j026q34o04n34p71j201j686k195k592k627k296j912j595
61595D97648j095l56K88O44J038J710K349K559K460K380K347K264K251K342K238
61580E21067J821J579J977K770L437L960M654N532O384P195P900Q040P286O036
61566E89638M854L558J624p91k957m614o142p630q616q850q638q320p971p760
61552E27385p960q406q502p994p245o623o114n685n467n371n008m325l835l876
61538D40974m071l902l462l189l103k824k191j463q47k19N70J354J870K181K656
61523D24334L494M472N274N945O746P681Q439Q890R275R827J0458J1030J1641
61510E27506J2361J2996J3333J3514J3794J4125J4257J4166J4079J4090J3935
$$ y = [520153, 518715, 517521, 516495, 515661, 515057, 514523, 513752, 512551, 510865, 508670, 506078, 503451, 501155, 499243, 497648, 496553, 496197, 496485, 497129, 498167, 499877, 502226, 504785, 507245, 509625, 511972, 514236, 516487, 518829, 521067, 522888, 524467, 526444, 529214, 532651, 536611, 541265, 546797, 553181, 560376, 568276, 576316, 583602, 589638, 594492, 598050, 599674, 598883, 595926, 591312, 585170, 577540, 568924, 560074, 551436, 543116, 535145, 527385, 519425, 511019, 502517, 494523, 487278, 480655, 474541, 468856, 463389, 458018, 453010, 448685, 444850, 440974, 436903, 433001, 429539, 426350, 423247, 420423, 418232, 416769, 415922, 415703, 416273, 417627, 419497, 421678, 424334, 427828, 432300, 437574, 443519, 450265, 457946, 466385, 475275, 484550, 494377, 504835, 515865, 527506, 539867, 552863, 566196, 579710, 593504, 607629, 621886, 636052, 650131, 664221, 678156]
61499F78156J3298J2142J0848R922R548R446R262Q995Q754Q346P511O482N716
61486G98426N019L655J473p61k430l808n279o523p059p029o822o375n517m581
61472G52389l959l407k468j263j64R95K597M436N977P309R039J1287J3573J5658
61458H11999J7836K0300K2912K5684K8882L2545L6416M0423M4777M9489N4325
61447A185588N9230O4426P0027P5961Q2157Q8386R3991R8269J00957J01928J00515
61436B121435R5791Q7396P5628O0857M3588K4996O653j0421k5882l9292m9972
61425B390777n7722o2979o6138o7271o6641o4839o2206n8674n4345m9627m4662
61414A735673l9172l3159k7176k1732j6802j2198p901l828K99M559Q640J2194
$$ y = [678156, 691454, 703596, 714444, 724366, 733914, 743360, 752622, 761617, 770371, 778717, 786228, 792710, 798426, 803445, 807100, 808573, 807812, 805382, 801574, 796295, 789772, 782713, 775684, 768862, 762487, 756970, 752389, 748430, 745023, 742555, 741292, 741128, 742123, 744720, 749156, 755133, 762442, 771481, 782768, 796341, 811999, 829835, 850135, 873047, 898731, 927613, 960158, 996574, 1036997, 1081774, 1131263, 1185588, 1244818, 1309244, 1379271, 1455232, 1537389, 1625775, 1719766, 1818035, 1918992, 2020920, 2121435, 2217226, 2304622, 2380250, 2441107, 2484695, 2509691, 2516344, 2505923, 2480041, 2440749, 2390777, 2333055, 2270076, 2203938, 2136667, 2070026, 2005187, 1942981, 1884307, 1829962, 1780335, 1735673, 1696501, 1663342, 1636166, 1614434, 1597632, 1585434, 1577533, 1573705, 1574004, 1578563, 1587203, 1599397]
61402A599397J5082J7263J8767J9870K0863K1616K1790K1469K1125K0963K0823
61391A819028K0704K0836K1164K1388K1590K2141K2947K3385K3148K2568K1948
61380B060847K1260K0609K0258J9930J8840J6721J4136J1480Q403M663P49k860
61368B215036o413j0276j4087j7166j9344k0816k1552k1463k0868k0191j9419
61357B023441j8230j6489j4267j1639q814o208m020j974J99K280L888M932N454
61344A958553N296M417L218K167J314N21n3l6P16K108M088O635R690J3297J7708
61329B029639K3056K9167L5797M2871N0254N7664O5023P2598Q0469Q8135R4939
61318B669612J00602J04997J07659J07856J04995R8732Q8883P5551N9316M1161
$$ y = [1599397, 1614479, 1631742, 1650509, 1670379, 1691242, 1712858, 1734648, 1756117, 1777242, 1798205, 1819028, 1839732, 1860568, 1881732, 1903120, 1924710, 1946851, 1969798, 1993183, 2016331, 2038899, 2060847, 2082107, 2102716, 2122974, 2142904, 2161744, 2178465, 2192601, 2204081, 2212484, 2217147, 2217896, 2215036, 2208623, 2198347, 2184260, 2167094, 2147750, 2126934, 2105382, 2083919, 2063051, 2042860, 2023441, 2005211, 1988722, 1974455, 1962816, 1954002, 1947794, 1943774, 1941800, 1941999, 1944279, 1948167, 1953099, 1958553, 1963849, 1968266, 1971484, 1973651, 1974965, 1975486, 1975433, 1975397, 1976113, 1978221, 1982309, 1988944, 1998634, 2011931, 2029639, 2052695, 2081862, 2117659, 2160530, 2210784, 2268448, 2333471, 2406069, 2486538, 2574673, 2669612, 2770214, 2875211, 2982870, 3090726, 3195721, 3294453, 3383336, 3458887, 3518203, 3559364]
61308C559364K2273L868j3262k9073m3815n7166o8317p7044q4055q9964r4494
61297C028315r7131r8033r7711r6249r3503q9810q5865q2040p8265p4436p0462
61286B064810o6095o1196n6107n1295m6754m2090l7125l2018k6941k1984j7296
61275A605909j2893q502m007J30L277N462P293R153J0863J2152J3002J3474J3549
61262A668862J3310J2964J2599J2129J1481J0689R772Q729P714O956O518O256
61250A787979O019N721N202M203K552L13k255m845p254r477j1620j3690j5564
61237A747284j7160j8535j9775k0881k1787k2397k2623k2511k2212k1659k0473
61226A517271j8466j6109j4038j2226j0173p871n861m278k554m22J485K528L001
$$ y = [3559364, 3581637, 3585505, 3572243, 3543170, 3499355, 3442189, 3373872, 3296828, 3212773, 3122809, 3028315, 2931184, 2833151, 2735440, 2639191, 2545688, 2455878, 2370013, 2287973, 2209708, 2135272, 2064810, 1998715, 1937519, 1881412, 1830117, 1783363, 1741273, 1704148, 1672130, 1645189, 1623205, 1605909, 1593016, 1584514, 1580507, 1580637, 1583914, 1589376, 1596669, 1605822, 1616685, 1628837, 1641839, 1655313, 1668862, 1682172, 1695136, 1707735, 1719864, 1731345, 1742034, 1751806, 1760535, 1768249, 1775205, 1781723, 1787979, 1793998, 1799719, 1804921, 1809124, 1811676, 1811989, 1809734, 1804889, 1797635, 1788158, 1776538, 1762848, 1747284, 1730124, 1711589, 1691814, 1670933, 1649146, 1626749, 1604126, 1581615, 1559403, 1537744, 1517271, 1498805, 1482696, 1468658, 1456432, 1446259, 1438388, 1432527, 1428249, 1425695, 1425273, 1426758, 1429286, 1432287]
61213A432287L563M221M508M395M323M471M592M560M528M514M220L423K288J252
61199A487145P65J123K383M431P172J0558J4351J8155K1844K5665K9703L3532
61187A656827L6568L8555L9418L8904L6613L2199K5311J5673L618r641k2606l4313
61175A857126m4378n2558n8620o2463o4151o3911o2264n9881n7134n3978n0432
61164A227356m6837m3388l9877l6195l2722k9776k7076k4165k1101j8287j5854
61153H92078j3690j1794j0165q536o734n048l809k785j530o7J223K267L276M214
61139H38900M850N264N713O027N655M438K853J460M39k82q54j505k402l479m576
61124H62501n708o906p972q751r465j0432j1592j2682j3653j4504j4909j4633
$$ y = [1432287, 1435850, 1440071, 1444579, 1448974, 1453297, 1457768, 1462360, 1466920, 1471448, 1475962, 1480182, 1483605, 1485893, 1487145, 1487910, 1489033, 1491416, 1495847, 1503019, 1513577, 1527928, 1546083, 1567927, 1593592, 1623295, 1656827, 1693395, 1731950, 1771368, 1810272, 1846885, 1879084, 1904395, 1920068, 1923686, 1914045, 1891439, 1857126, 1812748, 1760190, 1701570, 1639107, 1574956, 1511045, 1448781, 1388900, 1331766, 1277788, 1227356, 1180519, 1137131, 1097254, 1061059, 1028337, 998561, 971485, 947320, 926219, 907932, 892078, 878388, 866594, 856429, 847893, 841159, 836111, 832302, 829517, 827987, 827920, 829143, 831410, 834686, 838900, 843750, 849014, 854727, 860754, 866409, 870847, 873700, 875160, 875599, 875317, 874463, 872958, 870556, 867077, 862501, 856793, 849887, 841915, 833164, 823699, 813267, 801675, 788993, 775340, 760836, 745927, 731294]
61112G31294j4122j4064j4414j4485j4091j3831j4107j4499j4433j3951j3436
61101E75861j2997j2528j2060j1640j1068j0145r088q378q232q353q328q059p829
61088D47156p958q418q804q713q064p052n935m897m063l432k920k453j943j205
61074C71299j31R82J608J624J510J696K080K384K684L209L914M532M873M855M472
61059D11591M012L945M297M503M235L918M012M227M045L551L096K503J400J09
61045D59444o87j057j729k874l836m174m228m394m627m856n238n674n684n186
61031D05200m807n083n761o247o344o176n813n325m916m671m378l878l339k961
61017C35501k644k217j721j276q21k57L05O55P25O20N04M95N29M14J24j4K31N53
$$ y = [731294, 717172, 703108, 688694, 674209, 660118, 646287, 632180, 617681, 603248, 589297, 575861, 562864, 550336, 538276, 526636, 515568, 505423, 496335, 487957, 479725, 471372, 463044, 454985, 447156, 439198, 430780, 421976, 413263, 405199, 398147, 392212, 387315, 383252, 379820, 376900, 374447, 372504, 371299, 371168, 372150, 373758, 375382, 376892, 378588, 380668, 383052, 385736, 388945, 392859, 397391, 402264, 407119, 411591, 415603, 419548, 423845, 428348, 432583, 436501, 440513, 444740, 448785, 452336, 455432, 457935, 459335, 459444, 458757, 457700, 455971, 453097, 449261, 445087, 440859, 436465, 431838, 426982, 421744, 416070, 410386, 405200, 400393, 395310, 389549, 383302, 376958, 370782, 364969, 359644, 354728, 350057, 345679, 341801, 338462, 335501, 332857, 330640, 328919, 327643, 326822, 326565, 326870, 327525, 328250, 328870, 329374, 329869, 330398, 330812, 330936, 330922, 331153, 331706]
60999C31706N19K89M29R98J446J475J433J653J969K158K341K641K909L155L769
60984C58890M892N943O304O177O271O855P547P942Q008P938P908Q013Q201Q299
60970D59188Q205Q006P770P496P348P637Q343Q935R004Q755Q643Q764R028R598
60956E76720J0657J1914J2904J3723J4939J6731J8617K0181K1582K3216K5208
60945G66392K7456K9869L2361L4856L7462M0442M3828M7342N0796N4306N7930
60934A223040O1438O4686O7971P1674P5851Q0484Q5882R2328R9579J07177J15198
60923B145308J24178J34514J46646J61706J81189K05811K35458K70193L10191
60914C915194L54756M03059M56441N18162N90050O72023P65949Q73329R79585
$$ y = [331706, 332225, 332514, 332943, 333941, 335387, 336862, 338295, 339948, 341917, 344075, 346416, 349057, 351966, 355121, 358890, 363782, 369725, 376029, 382206, 388477, 395332, 402879, 410821, 418829, 426767, 434675, 442688, 450889, 459188, 467393, 475399, 483169, 490665, 498013, 505650, 513993, 522928, 531932, 540687, 549330, 558094, 567122, 576720, 587377, 599291, 612195, 625918, 640857, 657588, 676205, 696386, 717968, 741184, 766392, 793848, 823717, 856078, 890934, 928396, 968838, 1012666, 1060008, 1110804, 1165110, 1223040, 1284478, 1349164, 1417135, 1488809, 1564660, 1645144, 1731026, 1823354, 1922933, 2030110, 2145308, 2269486, 2404000, 2550646, 2712352, 2893541, 3099352, 3334810, 3605003, 3915194, 4269950, 4673009, 5129450, 5647612, 6237662, 6909685, 7675634, 8548963, 9528548]
60905I528548J040944J000799Q34107N78484L14943J14044J015l3229m813O5418
60895A3440260J33463J33990J9058k01654m63764o92688q46158r21493r36079
60886I664935r09033q56074p89857p18644o46010n73981n05611m43782l89276
60877C832667l41477l00126k65099k35401k09663j87265j68010j51226j36146
60868A838254j22737j11223j01142r1772q3157p5700o9125o2780n6806n1983m8402
60857I63427m5258m2019l8991l6506l4361l2260l0183k8114k5900k3595k1484
60846F04756j9666j7969j6357j5005j3938j2942j1900j0819r651q377p217o333
60834D54582n529m598l760l304l034k610k239k362k874l267l442l757m332m973
$$ y = [9528548, 10569492, 11570291, 12404398, 12982882, 13297825, 13411869, 13412884, 13379655, 13374842, 13440260, 13573723, 13707713, 13726771, 13525117, 13061353, 12368665, 11522507, 10601014, 9664935, 8755902, 7899828, 7109971, 6391327, 5745317, 5171336, 4665725, 4221943, 3832667, 3491190, 3191064, 2925965, 2690564, 2480901, 2293636, 2125626, 1974400, 1838254, 1715517, 1604294, 1503152, 1411380, 1328223, 1252523, 1183398, 1120618, 1063812, 1011829, 963427, 918169, 876150, 837159, 800653, 766292, 734032, 703849, 675735, 649835, 626240, 604756, 585090, 567121, 550764, 535759, 521821, 508879, 496979, 486160, 476509, 468132, 460915, 454582, 449053, 444455, 440695, 437391, 434357, 431747, 429508, 427146, 424272, 421005, 417563, 413806, 409474, 404501]
60820D04501n671o508p207p391p222p099o888o220n415n160n298m962l998l298
60806C22164l371l560l091k114j204m61L05J049J611K023K375K702L165L917M660
60791C30170M910M810N055N870O688P115P465Q015Q416Q335Q028P851P684P318
60777D27730O919O584N933M671L212K194J646J117M26j54l33r6K65K41n51j898
60761D57906l106l801m279m924n648o180o540o886p123p039o663o225n858n455
60747C78179m799l791k678j930j679j477q96j66K19L55P68J550K280K769L219
60732C71923L608L639L360L165L063K676K107K017K607L215L231K792K266J783
60718D11452J478J580J882J878J668K052L279M508M904M662M411M280M083L825
$$ y = [404501, 398830, 392322, 385115, 377724, 370502, 363403, 356515, 350295, 344880, 339720, 334422, 329460, 325462, 322164, 318793, 315233, 312142, 310028, 308824, 308363, 308668, 309717, 311328, 313351, 315726, 318428, 321593, 325510, 330170, 335080, 339890, 344945, 350815, 357503, 364618, 372083, 380098, 388514, 396849, 404877, 412728, 420412, 427730, 434649, 441233, 447166, 451837, 455049, 457243, 458889, 460006, 460432, 460278, 459945, 459849, 460114, 460355, 459804, 457906, 454800, 450999, 446720, 441796, 436148, 429968, 423428, 416542, 409419, 402380, 395717, 389492, 383634, 378179, 373380, 369589, 366911, 364981, 363302, 361825, 360929, 360763, 360982, 361337, 362105, 363655, 365935, 368704, 371923, 375531, 379170, 382530, 385695, 388758, 391434, 393541, 395558, 398165, 401380, 404611, 407403, 409669, 411452, 412930, 414510, 416392, 418270, 419938, 421990, 425269, 429777, 434681, 439343, 443754, 448034, 452117, 455942]
60704D55942L528K978K184J586J471J607J764J970J980J247j44j229j394j181
60690D72309j248j311q36j69o9n87j153j517j844k205k549k950l383l506l154
60675D45828k720k624k766k905l112l425l559l454l574m129m548m346l902l767
60661C96997l711l223k471j962j652j160n51j50Q7L47M23J15j62N6M81N21K67
60644C84252J88K10j07o58r48j038j482k359l123l482l706m047m433m758n012
60629C49497n098m965m828m844m766m378l954l815l710l238k620k355k312j880
60615B96734r51k4N61R20J173J315J477J809K158K302K344K470K491K161J730
60600C18670J641J867K083K242K465K596K451K303K498K873L119L406M008M585
$$ y = [455942, 459470, 462448, 464632, 466218, 467689, 469296, 471060, 473030, 475010, 476257, 476113, 474884, 473490, 472309, 471061, 469750, 468914, 468745, 468676, 468089, 466936, 465419, 463575, 461370, 458821, 455871, 452488, 448982, 445828, 443108, 440484, 437718, 434813, 431701, 428276, 424717, 421263, 417689, 413560, 409012, 404666, 400764, 396997, 393286, 390063, 387592, 385630, 383978, 382818, 382267, 382117, 382204, 382551, 382974, 383089, 382927, 382983, 383464, 383985, 384252, 384440, 384650, 384543, 383885, 382937, 381899, 380417, 378058, 374935, 371453, 367747, 363700, 359267, 354509, 349497, 344399, 339434, 334606, 329762, 324996, 320618, 316664, 312849, 309139, 305901, 303281, 300926, 298614, 296734, 295783, 295759, 296320, 297240, 298413, 299728, 301205, 303014, 305172, 307474, 309818, 312288, 314779, 316940, 318670, 320311, 322178, 324261, 326503, 328968, 331564, 334015, 336318, 338816, 341689, 344808, 348214, 352222, 356807]
60586C56807M621M327M330M660M821M710M680M775M710M585M806N272N352M779
60572D23235L963L309K821K375J907J288N01j96p27j506k780l956m331m172m312
60557D17419m908n416n640n855o004n700n039m537m201l504k331j191m03J57N07
60542C63354N60O58J285K213K779K947L242L590L304K390J784K026K585K812K753
60527C98282K564K116J527J355J712J965J664J132P39K80m53j165j595k008k683
60512D05432l433m039m612n191n432n172m742m421m076l656l493l701l792l344
60498C46328k628k119j804j367p19M4Q49J517J761J665J806K539L491M104M345
60483C59812M566M954N494O230P244Q452R687J0884J2096J3411J4827J6118J6875
$$ y = [356807, 361428, 365755, 370085, 374745, 379566, 384276, 388956, 393731, 398441, 403026, 407832, 413104, 418456, 423235, 427198, 430507, 433328, 435703, 437610, 438898, 439399, 439203, 438476, 436970, 434190, 430234, 425903, 421731, 417419, 412511, 407095, 401455, 395600, 389596, 383896, 378857, 374320, 370119, 366615, 364284, 363093, 362690, 362847, 363354, 363914, 364572, 365857, 368070, 370849, 373796, 377038, 380628, 383932, 386322, 388106, 390132, 392717, 395529, 398282, 400846, 402962, 404489, 405844, 407556, 409521, 411185, 412317, 413056, 413336, 412883, 411718, 410123, 408115, 405432, 401999, 397960, 393348, 388157, 382725, 377553, 372811, 368390, 364314, 360658, 357165, 353464, 349672, 346328, 343700, 341581, 339777, 338410, 337691, 337735, 338584, 340101, 341862, 343527, 345333, 347872, 351363, 355467, 359812, 364378, 369332, 374826, 381056, 388300, 396752, 406439, 417323, 429419, 442830, 457657, 473775, 490650]
60470D90650J6883J6287J5162J3176J0088O339K691n18l236n084n695n449n108
60457E46186m749l842k333q06N42K151M077N648O430O831P345P920Q425R067R925
60442F02817J0717J1406J2499J4345J6663J9067K1609K4475K7718L1492L6046
60431H28854M1196M6419N1661N7453O3959P0607P7036Q3719R1191R9248J07397
60420A618740J15406J22833J28325J29889J25569J13797R3786O6193L3135k740
60410B544933l8816p2184r9768j19591j31577j36833j36568j32075j24970j16682
60400A435869j07908r8910r0054q1655p3785o6572o0255n4698m9351m4021l9200
60389F69460l5219l1708k8270k5104k2461k0115j7900j6196j5250j4485j3203
$$ y = [490650, 507533, 523820, 538982, 552158, 562246, 568585, 571276, 570758, 567522, 562438, 556743, 551294, 546186, 541437, 537595, 535262, 534456, 534998, 537149, 541226, 546874, 553304, 560135, 567480, 575400, 583825, 592892, 602817, 613534, 624940, 637439, 651784, 668447, 687514, 709123, 733598, 761316, 792808, 828854, 870050, 916469, 968130, 1025583, 1089542, 1160149, 1237185, 1320904, 1412095, 1511343, 1618740, 1734146, 1856979, 1985304, 2115193, 2240762, 2354559, 2448345, 2514538, 2547673, 2544933, 2506117, 2433933, 2334165, 2214574, 2082997, 1946164, 1809596, 1677521, 1552551, 1435869, 1327961, 1229051, 1138997, 1057342, 983557, 916985, 856730, 802032, 752681, 708660, 669460, 634241, 602533, 574263, 549159, 526698, 506583, 488683, 472487, 457237, 442752, 429549]
60378D29549j1621j0513j0067r741r077q125p189o553o295o092n460m421l567
60365C30828l226k973k367j666j352j414j554j707j875j809j367q58n78l23J87
60350C07946P18Q85Q06Q48J005J014Q67P71P72Q16R85J319J596J625J554J599
60334C25126J699J724J713J702J603J480J557J738J553R04L07J16rm56j014j316
60318C38427j430j540j495j188r15q73p25k26K34K22OQ0L76N52O68R66J228J119
60300C35486Q66R72J396J673J712J920K485L080L278K980K444K126K335K865L175
60285C68793L119L131L517M006M250M313M304M042L493L014K770K371J598Q98
60271D13619P29Q40Q45R45J469K143K508K696L091L545L623L291K758J903N72
$$ y = [429549, 417928, 407415, 397348, 387607, 378530, 370405, 363216, 356663, 350368, 344276, 338816, 334395, 330828, 327602, 324629, 322262, 320596, 319244, 317830, 316276, 314569, 312694, 310885, 309518, 308660, 308082, 307759, 307946, 308664, 309549, 310355, 311203, 312208, 313222, 314089, 314860, 315632, 316448, 317433, 318752, 320348, 321973, 323527, 325126, 326825, 328549, 330262, 331964, 333567, 335047, 336604, 338342, 339895, 340799, 341106, 341222, 341213, 340757, 339743, 338427, 336997, 335457, 333962, 332774, 331859, 330986, 330261, 330035, 330269, 330491, 330497, 330577, 330953, 331505, 332173, 333139, 334367, 335486, 336352, 337324, 338720, 340393, 342105, 344025, 346510, 349590, 352868, 355848, 358292, 360418, 362753, 365618, 368793, 371912, 375043, 378560, 382566, 386816, 391129, 395433, 399475, 402968, 405982, 408752, 411123, 412721, 413619, 414348, 415188, 416033, 416978, 418447, 420590, 423098, 425794, 428885, 432430, 436053, 439344, 442102, 444005, 444577]
60256D44577q52j837k445l062l626l762l511l280l181k973k550k007j403q56o63
60241D08569q75j069r01n69k70K57J161J948K232K505L347M290M368L523K629
60226D31145K252K228K327K500K550K255J905K055K698L262L434L483L794M447
60212D70335N242N830O012O158O966Q486R917J0742J1460J2597J3759J4453J5136
60199E97093J6446J8000J9067J9981K1670K4066K6280K8175L0468L3265L5797
60188H70308L7792L9930M2594M5224M7288M8996N0576N1697N2019N1622N0537
60177A388583M8528M5605M2181L8414L4041K9045K3871J8685J3145P214J604l027
60165A687889o801j0129j2953j4811j5369j4656j2926j0545p786m662j135K614
$$ y = [444577, 443725, 441888, 439443, 436381, 432755, 428993, 425482, 422202, 419021, 416048, 413498, 411491, 410088, 409232, 408569, 407694, 406625, 405724, 405155, 404885, 405142, 406303, 408251, 410483, 412988, 416335, 420625, 424993, 428516, 431145, 433397, 435625, 437952, 440452, 443002, 445257, 447162, 449217, 451915, 455177, 458611, 462094, 465888, 470335, 475577, 481407, 487419, 493577, 500543, 509029, 518946, 529688, 541148, 553745, 567504, 581957, 597093, 613539, 631539, 650606, 670587, 692257, 716323, 742603, 770778, 801246, 834511, 870308, 908100, 948030, 990624, 1035848, 1083136, 1132132, 1182708, 1234405, 1286424, 1338046, 1388583, 1437111, 1482716, 1524897, 1563311, 1597352, 1626397, 1650268, 1668953, 1682098, 1689312, 1690916, 1687889, 1681088, 1670959, 1658006, 1643195, 1627826, 1613170, 1600244, 1589699, 1581913, 1577251, 1576116, 1578730]
60153A578730O407J0424J4961J9924K4939K9850L4664L9162M3036M6278M8937
60142A897312N0592N0687M9259M6765M3322L8738L3178K7173K0933J4291P277
60131B279527J52o984j4016k0376k5420k9214l2268l4520l5372l4630l2691k9792
60119A984396k5827k1005j5851j0517m798J068O460J1341J6372K1792K6895L0914
60107B021240L3769L5657L6537L6324L5117L2903K9560K5285K0640J5994J1376
60096B334402O933L039r2k444l806l868k711n92K638P301J3102J9319K5777L2875
60082B431873M0660M8641N6669O5161P4240Q3427R2469J01716J11376J21068J30327
60071C357627J38968J46673J52865J57225J59710J59942J57239J51450J43080
$$ y = [1578730, 1585137, 1595561, 1610522, 1630446, 1655385, 1685235, 1719899, 1759061, 1802097, 1848375, 1897312, 1947904, 1998591, 2047850, 2094615, 2137937, 2176675, 2209853, 2237026, 2257959, 2272250, 2279527, 2279679, 2272695, 2258679, 2238303, 2212883, 2183669, 2151401, 2116881, 2081509, 2046879, 2014188, 1984396, 1958569, 1937564, 1921713, 1911196, 1906398, 1907466, 1913926, 1925267, 1941639, 1963431, 1990326, 2021240, 2055009, 2090666, 2127203, 2163527, 2198644, 2231547, 2261107, 2286392, 2307032, 2323026, 2334402, 2341335, 2344374, 2344282, 2341838, 2338032, 2334164, 2331453, 2330861, 2333499, 2340800, 2353902, 2373221, 2398998, 2431873, 2472533, 2521174, 2577843, 2643004, 2717244, 2800671, 2893140, 2994856, 3106232, 3227300, 3357627, 3496595, 3643268, 3796133, 3953358, 4113068, 4273010, 4430249, 4581699, 4724779]
60062D724779J32363J18934J02721Q4424O4836M4293K3082J686j9698m1172o2321
60051E173927q1975r9117j13417j24626j32161j35775j35984j33399j28110j20105
60041C969258j09774r7666q4243p0174n6273m2785k9265j5519k167J0017K0741
60030C492150K9835L6830M1314M3256M2618L9170L2986K4767J5297N017n678j6199
60018C781363k6155l5524m4216n1913n8542o4376o9461p3409p5992p7377p7660
60007C126738p6713p4652p1816o8138o3259n7425n1465m5641l9328l2184k4772
59996B521345j7589j0347k796M523J1028J6945K2729K8203L2939L6978M0446M2859
59984B727263M3434M1865L8346L3130K6572J9210J1371K973n956j4975k3695l2105
$$ y = [4724779, 4857142, 4976076, 5078797, 5163221, 5228057, 5272350, 5295432, 5297118, 5277420, 5236248, 5173927, 5091952, 4992835, 4879418, 4754792, 4622631, 4486856, 4350872, 4217473, 4089363, 3969258, 3859484, 3761818, 3677575, 3607401, 3551128, 3508343, 3479078, 3463559, 3461392, 3471409, 3492150, 3521985, 3558815, 3600129, 3643385, 3686003, 3725173, 3758159, 3782926, 3798223, 3803240, 3797562, 3781363, 3755208, 3719684, 3675468, 3623555, 3565013, 3500637, 3431176, 3357767, 3281775, 3204398, 3126738, 3050025, 2975373, 2903557, 2835419, 2772160, 2714735, 2663270, 2617629, 2578301, 2546117, 2521345, 2503756, 2493409, 2490613, 2495136, 2506164, 2523109, 2545838, 2574041, 2606980, 2643958, 2684404, 2727263, 2770697, 2812562, 2850908, 2884038, 2910610, 2929820, 2941191, 2944164, 2938208, 2923233, 2899538, 2867433]
59972B867433m0031m6809n1892n5365n7476n8118n7209n5097n2106m8125m3067
59961B302138l7282l1131k4565j7569j0543l801K954J0163J7796K5571L3385M1129
59949B308245M8471N5199O1382O6882P1153P3828P5017P4590P1766O6010N7919
59938C030462M8726L9169K9274J8883P954l365j4640k5307l5089m3875n1081n5791
59926B945320n7785n7835n6659n4194n0265m5253l9600l3211k5954j8190j0326
59915B496048k296N940J3876K0983K7335L3212L8449M2645M5644M7457M8066M7645
59903B865004M6555M4810M2055L8332L4275L0256K6013K1522J7477J4406J2056
59892C192761J0206R420J0308J2728J6328K1365K8231L6725M6402N7172O8960
$$ y = [2867433, 2827402, 2780593, 2728701, 2673336, 2615860, 2557742, 2500533, 2445436, 2393330, 2345205, 2302138, 2264856, 2233725, 2209160, 2191591, 2181048, 2177247, 2180201, 2190364, 2208160, 2233731, 2267116, 2308245, 2356716, 2411915, 2473297, 2540179, 2611332, 2685160, 2760177, 2834767, 2906533, 2972543, 3030462, 3079188, 3118357, 3147631, 3166514, 3174468, 3171103, 3156463, 3131156, 3096067, 3052192, 3001111, 2945320, 2887535, 2829700, 2773041, 2718847, 2668582, 2623329, 2583729, 2550518, 2524564, 2506374, 2496048, 2493752, 2499692, 2513568, 2534551, 2561886, 2595098, 2633547, 2676192, 2721836, 2769293, 2817359, 2865004, 2911559, 2956369, 2998424, 3036756, 3071031, 3101287, 3127300, 3148822, 3166299, 3180705, 3192761, 3202967, 3212387, 3222695, 3235423, 3251751, 3273116, 3301347, 3338072, 3384474, 3441646, 3510606]
59881C510606Q1338R4096J07593J21857J35939J48788J60174J69995J77267J80595
59871D888248J79185J72581J59989J40760J15300Q4773N0379J3597k3326n8095
59861E723391q9305j16109j37476j52651j61994j66503j66776j63171j56515j47758
59851D265133j37201j24821j11137r6983q2643o8023n3362l9071k5093j1166K510
59840C518143J5500K7692L9003M8860N6698O2539O6304O7038O3638N6065M4987
59829D066467L0634J2987p161k8341m9461o9849q8478j04156j16471j25746j32094
59818C388331j35304j35546j33392j29168j23018j15517j07478r9243r0784q2374
59808B236507p4413o6807n9281n2181m6173m1326l7245l3948l1762l0455k9315
$$ y = [3510606, 3591944, 3686040, 3793633, 3915490, 4051429, 4200217, 4360391, 4530386, 4707653, 4888248, 5067433, 5240014, 5400003, 5540763, 5656063, 5740836, 5791215, 5804812, 5781486, 5723391, 5634086, 5517977, 5380501, 5227850, 5065856, 4899353, 4732577, 4569406, 4412891, 4265133, 4127932, 4003111, 3891974, 3794991, 3712348, 3644325, 3590963, 3551892, 3526799, 3515633, 3518143, 3533643, 3561335, 3600338, 3649198, 3705896, 3768435, 3834739, 3901777, 3965415, 4021480, 4066467, 4097101, 4110088, 4102927, 4074586, 4025125, 3955276, 3866798, 3762642, 3646171, 3520425, 3388331, 3253027, 3117481, 2984089, 2854921, 2731903, 2616386, 2508908, 2409665, 2318881, 2236507, 2162094, 2095287, 2036006, 1983825, 1937652, 1896326, 1859081, 1825133, 1793371, 1762916, 1733601]
59797A733601k8156k7418k7245k7118k6514k5231k3176k0382j7234j4123j1063
59786A485941q069n679m405m040m188n128p259j0039j2398j4044j5454j6694j7279
59773A361265j7079j6426j5319j3401j0812q145n562k737L58L365O282R417J2645
59760A303851J5555J8300K1400K4730K7539K9538L1071L2127L2174L1097K9453
59749A596835K7580K5307K2696K0247J8090J5733J2906R996P450N460M340M502
59737A771142N837P783J0196J3580J8225K3787K9861L6396M3463N1061N9334O8457
59725B139122P8283Q8525R9216J10466J21891J32850J42932J51503J56882J56707
59715C378377J49016J32520J06575P2317L3630m235l7417o4237q3930r6056j01351
$$ y = [1733601, 1705445, 1678027, 1650782, 1623664, 1597150, 1571919, 1548743, 1528361, 1511127, 1497004, 1485941, 1477872, 1472193, 1467788, 1463748, 1459560, 1454432, 1447173, 1437134, 1424736, 1410692, 1395238, 1378544, 1361265, 1344186, 1327760, 1312441, 1299040, 1288228, 1280083, 1274521, 1271784, 1272142, 1275507, 1281789, 1291206, 1303851, 1319406, 1337706, 1359106, 1383836, 1411375, 1440913, 1471984, 1504111, 1536285, 1567382, 1596835, 1624415, 1649722, 1672418, 1692665, 1710755, 1726488, 1739394, 1749390, 1756840, 1762300, 1766640, 1771142, 1776979, 1784762, 1794958, 1808538, 1826763, 1850550, 1880411, 1916807, 1960270, 2011331, 2070665, 2139122, 2217405, 2305930, 2405146, 2515612, 2637503, 2770353, 2913285, 3064788, 3221670, 3378377, 3527393, 3659913, 3766488, 3838805, 3872435, 3868200, 3830783, 3766546, 3682616, 3586560, 3485209]
59704C485209j01678r8586r2727q4778p5791o6314n6266m5990l6395k7665j8973
59693B780046r834p62P844J6358K4975L3191M0871M8779N7395O6092P4307Q2622
59681C221884R1892J01970J12193J22545J33568J45515J58248J71626J85453J99370
59671D644264K13295K27458K41666K55036K66862K77072K85339K90372K90882
59662F992246K86876K79337K69050K56485K42639K29330K18518K11603K09187
59653I195271K11214K17334K27199K40229K55158K70263K84060K95412L02817
59644A1498957L04290K98140K83571K60409K28977J90529J47279J01717N6212
59635A3370081J3392k3864n3361p4254q6618r0748q7047p6109n8602l5312p390
$$ y = [3485209, 3383531, 3284945, 3192218, 3107440, 3031649, 2965335, 2909069, 2863079, 2826684, 2799019, 2780046, 2770212, 2769450, 2777294, 2793652, 2818627, 2851818, 2892689, 2941468, 2998863, 3064955, 3139262, 3221884, 3313776, 3415746, 3527939, 3650484, 3784052, 3929567, 4087815, 4259441, 4444894, 4644264, 4857559, 5085017, 5326683, 5581719, 5848581, 6125653, 6410992, 6701364, 6992246, 7279122, 7558459, 7827509, 8083994, 8326633, 8555963, 8774481, 8986084, 9195271, 9406485, 9623819, 9851018, 10091247, 10346405, 10616668, 10900728, 11196140, 11498957, 11803247, 12101387, 12384958, 12645367, 12874344, 13064873, 13212152, 13313869, 13370081, 13383473, 13359609, 13306248, 13231994, 13145376, 13054628, 12967581, 12891472, 12832870, 12797558, 12790168]
59624A2790168K3947N8062R4763J33560J73556K14135K54976K95060L32290L64296
59614A4734813L89016M04135M06619L93197L61117L08511K35118J43402L8752
59605A7414680p1831j81184k82581l70157m39827m89902n20813n34425n33498
59596A3990462n21055m99972m73388m45297m20122m01463l91547l91233l99394
59587A0046991m12255m24622m32546m34574m30690m21195m06932l89377l69676
59578F325124l48144l25168l01847k79282k57775k37247k17859j99796j82994
59569C975012j67438j53240j40113j27398j14971j03494r3453q4475p6017o8078
59559B846335o0919n4616m9260m5033m1791l9140l7184l6531l7310l8869m0681
$$ y = [12790168, 12814115, 12872177, 12966940, 13100500, 13274056, 13488191, 13743167, 14038227, 14370517, 14734813, 15123829, 15527964, 15934583, 16327780, 16688897, 16997408, 17232526, 17375928, 17414680, 17342849, 17161665, 16879084, 16508927, 16069100, 15579198, 15058385, 14523960, 13990462, 13469407, 12969435, 12496047, 12050750, 11630628, 11229165, 10837618, 10446385, 10046991, 9634736, 9210114, 8777568, 8342994, 7912304, 7491109, 7084177, 6694800, 6325124, 5976980, 5651812, 5349965, 5070683, 4812908, 4575661, 4357802, 4158006, 3975012, 3807574, 3654334, 3514221, 3386823, 3271852, 3168358, 3074905, 2990430, 2914413, 2846335, 2785416, 2730800, 2681540, 2636507, 2594716, 2555576, 2518392, 2481861, 2444551, 2405682, 2365001]
59548B365001m2808m5145m6998m7888m8094m7955m7295m5899m3970m1688l8999
59537A868262l6094l3408l0812k7558k3404j9048j5068j1266p477m106j352J319
59525A659988M250O967Q996J0634J2234J3482J4016J4137J4304J4461J4504J4759
59513A802732J5490J6521J7833J9888K2825K6035K9108L2441L6416M0678M4867
59502B104834M9336N4500O0140O5973P2226P9040Q6029R2957J00164J07712J14970
59491B987881J21641J28242J34857J40376J43927J46112J47776J48369J46757
59482D245938J43014J38201J32801J26621J19907J13371J07249J01198R4993Q8620
59472E411913Q1965P5207O9164O4460O0617N6668N2193M6966M0061L0273J7240
$$ y = [2365001, 2322193, 2277048, 2230050, 2182162, 2134068, 2086113, 2038818, 1992919, 1948949, 1907261, 1868262, 1832168, 1798760, 1767948, 1740390, 1716986, 1697938, 1682870, 1671604, 1664127, 1660021, 1658669, 1659988, 1664238, 1671205, 1680201, 1690835, 1703069, 1716551, 1730567, 1744704, 1759008, 1773469, 1787973, 1802732, 1818222, 1834743, 1852576, 1872464, 1895289, 1921324, 1950432, 1982873, 2019289, 2059967, 2104834, 2154170, 2208670, 2268810, 2334783, 2407009, 2486049, 2572078, 2665035, 2765199, 2872911, 2987881, 3109522, 3237764, 3372621, 3512997, 3656924, 3803036, 3950812, 4099181, 4245938, 4388952, 4527153, 4659954, 4786575, 4906482, 5019853, 5127102, 5228300, 5323293, 5411913, 5493878, 5569085, 5638249, 5702709, 5763326, 5819994, 5872187, 5919153, 5959214, 5989487, 6006727]
59461F006727J273j7508l9018o2381q6168j09335j31240j51006j67690j80908
59451E062746j90600j96481j98426j97179j93839j88794j81827j73052j63072
59442C379476j52386j41290j30186j19392j08786r8172q7775p7875o8348n9135
59432B336131n0720m3459l6815k9986k2946j6220r888l616K662Q788J4895K1254
59420B170080K7785L4326M1099M8342N5814O3196P0627P8295Q5887R2985R9569
59409B868005J05466J09798J11640J10813J07362J00781R0498P6701N9946M0466
59399C781476J8625m335k6929m8439o8589q6588j01386j12637j20607j25494j27483
59388B977614j27146j25026j21162j15668j09321j02855r6193q9096q2018p5499
$$ y = [6006727, 6008000, 5990492, 5951474, 5889093, 5802925, 5693590, 5562350, 5411344, 5243654, 5062746, 4872146, 4675665, 4477239, 4280060, 4086221, 3897427, 3715600, 3542548, 3379476, 3227090, 3085800, 2955614, 2836222, 2727436, 2629264, 2541489, 2463614, 2395266, 2336131, 2285411, 2241952, 2205137, 2175151, 2152205, 2135985, 2126097, 2122481, 2125143, 2133931, 2148826, 2170080, 2197865, 2232191, 2273290, 2321632, 2377446, 2440642, 2511269, 2589564, 2675451, 2768436, 2868005, 2973471, 3083269, 3194909, 3305722, 3413084, 3513865, 3604363, 3681064, 3741010, 3781476, 3800101, 3795766, 3768837, 3720398, 3651809, 3565221, 3463835, 3351198, 3230591, 3105097, 2977614, 2850468, 2725442, 2604280, 2488612, 2379291, 2276436, 2180243, 2091147, 2009129, 1933630]
59378A933630o9213o2642n6155n0441m5285l9960l4494k9534k5252k1335j7751
59367A481568j4592j1410p707l826m29K524N464Q152J0043J1382J2936J4888J6898
59354A525891J8978K1399K4009K6576K9345L2298L4387L4697L4091L4512L6873
59343A853056M0736M5654N1527N7947O4536P1805Q0395Q9556R7766J04889J12397
59332B670264J21434J31913J43601J56735J71224J86300K01353K16069K29642
59323D228535K40735K48408K52263K51661K45943K35443K21339K04429J85045
59314F313801J64119J43154J22937J03362Q4534O6913N0219L3347J5672k570k1364
59303G074124m1236o2206q3350j03698j22538j38693j50535j57247j59229j57132
$$ y = [1933630, 1864417, 1801775, 1745620, 1695179, 1649894, 1609934, 1575440, 1545906, 1520654, 1499319, 1481568, 1466976, 1455566, 1447859, 1444033, 1443604, 1446128, 1451592, 1459744, 1469787, 1481169, 1494105, 1508993, 1525891, 1544869, 1566268, 1590277, 1616853, 1646198, 1678496, 1712883, 1747580, 1781671, 1816183, 1853056, 1893792, 1939446, 1990973, 2048920, 2113456, 2185261, 2265656, 2355212, 2452978, 2557867, 2670264, 2791698, 2923611, 3067212, 3223947, 3395171, 3581471, 3782824, 3998893, 4228535, 4469270, 4717678, 4969941, 5221602, 5467545, 5702988, 5924327, 6128756, 6313801, 6477920, 6621074, 6744011, 6847373, 6931907, 6998820, 7049039, 7082386, 7098058, 7095488, 7074124, 7032888, 6970682, 6887332, 6783634, 6661096, 6522403, 6371868, 6214621, 6055392, 5898260]
59293E898260j51368j42789j32861j22872j13679j06347j02018j00951j02534
59284D822841j06343j12223j19297j26030j31581j36038j39166j40055j38321
59275C673787j34604j29490j22954j15230j07144r9073r0601q1627p2919o4978
59265B655167n7259m9135m0861l3042k5815j9055j2780o900j123M559R758J4293
59253B437807J8276K1551K3657K4538K4588K3897K2191J9511J6164J1952O422
59242B650554M3n843j0480j4207j7385j9706k0917k1258k0828j9347j6859j3821
59230B469946j0261n663M3O215J2451J9007K5927L2746L9267M5792N2292N8209
59218B745971O3391O8255P2745P5998P7345P6807P4370O9776O3345N6013M8127
$$ y = [5898260, 5746892, 5604103, 5471242, 5348370, 5234691, 5128344, 5026326, 4925375, 4822841, 4716498, 4604275, 4484978, 4358948, 4227367, 4091329, 3952163, 3812108, 3673787, 3539183, 3409693, 3286739, 3171509, 3064365, 2965292, 2874691, 2793064, 2720145, 2655167, 2597908, 2548773, 2507912, 2474870, 2449055, 2430000, 2417220, 2410320, 2409197, 2413756, 2423514, 2437807, 2456083, 2477634, 2501291, 2525829, 2550417, 2574314, 2596505, 2616016, 2632180, 2644132, 2650554, 2650597, 2644754, 2634274, 2620067, 2602682, 2582976, 2562059, 2540801, 2519973, 2500626, 2483767, 2469946, 2459685, 2454022, 2454065, 2460280, 2472731, 2491738, 2517665, 2550411, 2589678, 2635470, 2687762, 2745971, 2809362, 2877617, 2950362, 3026360, 3103705, 3180512, 3254882, 3324658, 3388003, 3444016, 3492143]
59207C492143L9168K9102J9071J0213K557m513j1392j8218k4809l0371l4031l6053
59195C432867l7678l9548m1156m2017m2395m2460m1796m0205l8078l5532l2066
59184B999936k7433k1972j5739q219P42J0624K1152L2535M4643N6952O9613Q3329
59172C246163R7834J11654J23825J34468J43192J48319J48495J43823J34537J19826
59162D552136R9026P3042M3530J1522k2253n6372q8996j18605j43888j63696j77752
59151D007694j86743j91188j91035j86837j80194j72312j63050j52161j40499
59142B443675j29145j18233j07518r7337q8119p9640p1582o4153n7487n1215m5273
59131A533973m0294l6502l3100k9508k6215k3609k0995j7759j4589j2381j0733
$$ y = [3492143, 3531311, 3560413, 3579484, 3589697, 3592254, 3587741, 3576349, 3558131, 3533322, 3502951, 3468920, 3432867, 3395189, 3355641, 3314485, 3272468, 3230073, 3187613, 3145817, 3105612, 3067534, 3032002, 2999936, 2972503, 2950531, 2934792, 2926573, 2927315, 2937939, 2959091, 2991626, 3036269, 3093221, 3162834, 3246163, 3343997, 3455651, 3579476, 3713944, 3857136, 4005455, 4153950, 4297773, 4432310, 4552136, 4651162, 4724204, 4767734, 4779256, 4757003, 4700631, 4611635, 4493030, 4349142, 4185446, 4007694, 3820951, 3629763, 3438728, 3251891, 3071697, 2899385, 2736335, 2584174, 2443675, 2314530, 2196297, 2088779, 1991442, 1903323, 1823683, 1752101, 1687948, 1630461, 1579246, 1533973, 1493679, 1457177, 1424077, 1394569, 1368354, 1344745, 1323750, 1305991, 1291402, 1279021, 1268288]
59120A268288q676o216l997k018K62K893N518Q097J0676J2901J4562J6195J8383
59107A336868K0927K3404K5930K8632L1074L2978L4966L7636M0453M2516M3835
59096A699219M5024M6087M6501M6105M4982M2860L9404L4892K9848K4362J8386
59085B117670J2313O645J407l532p914j1430j4114j5909j6367j5356j3459j1172
59073B028782q223m328J20M688R672J5494K1857K8168L4293M0412M6652N3303
59061B270890O0790O8949P6989Q4544R2008R9438J06081J11478J16023J19801
59051C206991J21923J21575J18664J12698J02352Q7094O8207M7216K4493M65k3004
59040C988674m3876o1727p7045q9641r9118j06099j11574j15588j17867j19053
$$ y = [1268288, 1259612, 1253396, 1249399, 1247381, 1247643, 1250536, 1256054, 1264151, 1274827, 1287728, 1302290, 1318485, 1336868, 1357795, 1381199, 1407129, 1435761, 1466835, 1499813, 1534779, 1572415, 1612868, 1655384, 1699219, 1744243, 1790330, 1836831, 1882936, 1927918, 1970778, 2010182, 2045074, 2074922, 2099284, 2117670, 2129983, 2136628, 2138035, 2134503, 2126589, 2115159, 2101045, 2085136, 2068769, 2053413, 2039954, 2028782, 2020559, 2016231, 2016351, 2021039, 2030711, 2046205, 2068062, 2096230, 2130523, 2170935, 2217587, 2270890, 2331680, 2400629, 2477618, 2562162, 2654170, 2753608, 2859689, 2971167, 3087190, 3206991, 3328914, 3450489, 3569153, 3681851, 3784203, 3871297, 3939504, 3986720, 4011213, 4011678, 3988674, 3944798, 3883071, 3806026, 3716385, 3617267, 3511168, 3399594, 3284006, 3166139, 3047086]
59030C047086j20038j20577j19929j18251j16177j13491j09602j04836r9994r5024
59020A929167q9440q3572p8185p3212o8115o3121n8850n5021n0855m6496m2766
59009A219534l9741l6746l3598l0683k7983k5094k2110j9476j7195j5061j3406
58998I38441j2640j2373j1946j1492j1541j1939j2158j2275j2590j2689j1941
58987H04857j0576r170p547n283k883j259m31J50L40m03j785k916l560l990l958
58972G51586l023j551k36J099L006N098O459P087P595P804O997N368L870K722
58958H03881J392%o74n44l02r4N85J711K665L346M222N177N524N248N006M817
58942H41960L965K318O15p59k149l587m426m359l880l484l152k741k194j322p5
$$ y = [3047086, 2927048, 2806471, 2686542, 2568291, 2452114, 2338623, 2229021, 2124185, 2024191, 1929167, 1839727, 1756155, 1677970, 1604758, 1536643, 1473522, 1414672, 1359651, 1308796, 1262300, 1219534, 1179793, 1143047, 1109449, 1078766, 1050783, 1025689, 1003579, 984103, 966908, 951847, 938441, 925801, 913428, 901482, 889990, 878449, 866510, 854352, 842077, 829487, 816798, 804857, 794281, 785111, 777564, 772281, 769398, 768139, 767708, 767858, 768198, 767795, 766010, 763094, 759534, 755544, 751586, 748563, 747012, 746776, 747875, 750881, 755979, 762438, 769525, 777120, 784924, 791921, 797289, 801159, 803881, 805273, 805273, 804599, 804055, 803753, 803659, 804244, 805955, 808620, 811966, 816188, 821365, 826889, 832137, 837143, 841960, 845925, 848243, 848858, 848099, 845950, 842363, 837937, 833578, 829698, 826214, 823062, 820321, 818127, 816805, 816730]
58927H16730J093J794K467L731N325O569P560Q860J0302J1231J1763J2666J4072
58914I14163J5373J6319J7223J8146J8910J9796K1213K2805K3898K4667K5823
58903A138336K7291K8360K8933K9537L0226L0611L0913L1767L3092L4198L5035
58892A478299L6185L7807L9579M1656M4482M7844N1197N4822N9436O4828P0068
58881B026203P5026Q0393Q6316R2224R8002J04201J11059J18450J26672J36171
58871C054717J46630J57533J69316J82734J97315K11989K26969K43375K60979
58862D851557K78030K93492L07783L20949L31566L37947L39043L33673L20157
58853G714197K97285K64854K23060J72509J15018N3360r959p2733j32061j84749
$$ y = [816730, 817823, 819617, 822084, 825815, 831140, 837709, 845269, 854129, 864431, 875662, 887425, 900091, 914163, 929536, 945855, 963078, 981224, 1000134, 1019930, 1041143, 1063948, 1087846, 1112513, 1138336, 1165627, 1193987, 1222920, 1252457, 1282683, 1313294, 1344207, 1375974, 1409066, 1443264, 1478299, 1514484, 1552291, 1591870, 1633526, 1678008, 1725852, 1777049, 1831871, 1891307, 1956135, 2026203, 2101229, 2181622, 2267938, 2360162, 2458164, 2562365, 2673424, 2791874, 2918546, 3054717, 3201347, 3358880, 3528196, 3710930, 3908245, 4120234, 4347203, 4590578, 4851557, 5129587, 5423079, 5730862, 6051811, 6383377, 6721324, 7060367, 7394040, 7714197, 8011482, 8276336, 8499396, 8671905, 8786923, 8840283, 8830324, 8757591, 8625530, 8440781]
58843H440781k29015k64737k92000l10655l21355l25619l24550l18592l08681
58834E745577k96351k82537k67336k51182k34997k19127k03299j87754j73257
58825C629737j59987j47596j36316j26680j18220j09855j01643r4641q8967q3497
58815B462335p7613p1778o6220o0601n5218n0921m7592m4164m0459l7381l5051
58804A875337l2396k9000k5731k3011k0062j6459j2955j0067p269m104q80K340
58792A695743O062J0197J3864J6833J9968K3739K7582L1125L4791L8818M2900
58781A961622M7114N1889N6899O1347O5569P0774P7006Q3031Q8567R4783J02156
58770B760757J09737J17164J25561J35588J46315J56972J68243J80924J94710
$$ y = [8440781, 8211766, 7947029, 7655029, 7344374, 7023019, 6697400, 6372850, 6054258, 5745577, 5449226, 5166689, 4899353, 4648171, 4413174, 4194047, 3990748, 3802994, 3629737, 3469750, 3322154, 3185838, 3059158, 2940938, 2831083, 2729440, 2634799, 2545832, 2462335, 2384722, 2312944, 2246724, 2186123, 2130905, 2079984, 2032392, 1988228, 1947769, 1910388, 1875337, 1842941, 1813941, 1788210, 1765199, 1745137, 1728678, 1715723, 1705656, 1698387, 1694283, 1693403, 1695743, 1701805, 1712002, 1725866, 1742699, 1762667, 1786406, 1813988, 1845113, 1879904, 1918722, 1961622, 2008736, 2060625, 2117524, 2178871, 2244440, 2315214, 2392220, 2475251, 2563818, 2658601, 2760757, 2870494, 2987658, 3113219, 3248807, 3395122, 3552094, 3720337, 3901261, 4095971]
58761D095971K09199K24670K41032K57268K72726K87620L01509L12598L19213
58752F521806L20721L16338L04502K84057K54817K16495J68777J13091N2787r107
58742H544284p0808j30053j83444k28613k65371k93960l13863l25298l30079l29779
58732F073016l24600l15047l03028k90099k76132k60899k45444k30611k15807
58723C611349k00519j85744j72585j60673j49239j38536j28975j20096j11453
58714B243529j03466r6348q9476q2741p7141p2997o9076o4528o0182n6773n3442
58703A417359m9344m5232m2006l9069l5560l1887k8720k5637k2190j9046j6746
58692A061922j4545j1797r212p405n572k984m67J090K343M024N184M520K310n48
$$ y = [4095971, 4305170, 4529840, 4770872, 5028140, 5300866, 5588486, 5889995, 6202593, 6521806, 6842527, 7158865, 7463367, 7747424, 8002241, 8218736, 8387513, 8500604, 8553391, 8544284, 8473476, 8343423, 8159979, 7931366, 7665995, 7372035, 7058172, 6732874, 6402795, 6073016, 5748416, 5433369, 5130341, 4840242, 4564110, 4303211, 4057767, 3827156, 3611349, 3410830, 3225086, 3052501, 2891828, 2742589, 2604053, 2475078, 2354982, 2243529, 2140063, 2043715, 1954239, 1871498, 1794357, 1721360, 1652284, 1587756, 1527574, 1470801, 1417359, 1368015, 1322783, 1280777, 1241708, 1206148, 1174261, 1145541, 1119904, 1097714, 1078668, 1061922, 1047377, 1035580, 1026368, 1018963, 1013391, 1010407, 1009940, 1011030, 1013373, 1017397, 1022581, 1027101, 1029411, 1028863]
58678A028863m253r161j4211j8019k0667k2863k4286k4333k3628k3170k2835k2067
58666G99370k1257k0973k0725j9906j9086j8939j8835j7920j6678j6006j5585
58655E93460j4639j3387j2409j1454j0252r470r491r337q214p019o772o720n682
58642D68614m244l727l943l776l268l293l784m039m233m969n849o048n831n984
58628D05626o308o052n342m789m286l446k662k364j929o34J020K151K975M120
58614C78080N317O007O527P312P835P499O833O512O151N313M680M914N323N040
58600D63343M416L963L093J377j17l10J80L68O39J619K603K928L560N504P801
58585E00967R109R996J1668J3569J4479J4924J6258J8272J9888K1400K3786K6583
$$ y = [1028863, 1024610, 1015449, 1001238, 983219, 962552, 939689, 915403, 891070, 867442, 844272, 821437, 799370, 778113, 757140, 736415, 716509, 697423, 678484, 659649, 641729, 625051, 609045, 593460, 578821, 565434, 553025, 541571, 531319, 521849, 512358, 503021, 494807, 487788, 481016, 474296, 468614, 464370, 460643, 456700, 452924, 449656, 446363, 442579, 438540, 434307, 429338, 423489, 417441, 411610, 405626, 399318, 393266, 387924, 383135, 378849, 375403, 372741, 370377, 368448, 367814, 368834, 370985, 373960, 378080, 383397, 389404, 395931, 403243, 411078, 418577, 425410, 431922, 438073, 443386, 448066, 452980, 458303, 463343, 467759, 471722, 474815, 476192, 476075, 475765, 475945, 476313, 476952, 478571, 481174, 484102, 487662, 493166, 500967, 510076, 520072, 531740, 545309, 559788, 574712, 590970, 609242, 629130, 650530, 674316, 700899]
58573G00899K8697L0540L3274L6615L9556M2540M6690N1615N6169O0669O6142
58562A193406P2058P7177Q1950Q7677R3763R8245J00555J01357R9955R4451Q4297
58551B184891P0523N3553L3168J0547j1868l2631n1468o7416p8985q6222r0604
58540A933488r2813r2435q9690q5652q0761p4893o8702o3200n8269n3157m8104
58529A125812m3764l9612l4748k9747k5765k2459j8745j5013j2523j1064r432
58518H62940p619o442n532l901j971p82L12K744O060Q501R864J1322J2741J2688
58504I00925J0851Q042M040k100r723j6963k3205k8910l3359l5174l4834l4112
58492G05478l3211l0987k7755k5177k3449k1303j8762j7147j6341j4839j2657
$$ y = [700899, 729596, 760136, 793410, 830025, 869581, 912121, 958811, 1010426, 1066595, 1127264, 1193406, 1265464, 1342641, 1424591, 1512268, 1606031, 1704276, 1804831, 1906188, 2006143, 2100594, 2184891, 2255414, 2308967, 2342135, 2352682, 2340814, 2308183, 2256715, 2189299, 2110314, 2024092, 1933488, 1840675, 1748240, 1658550, 1572898, 1492137, 1417244, 1348542, 1285342, 1227073, 1173916, 1125812, 1082048, 1042436, 1007688, 977941, 952176, 929717, 910972, 895959, 883436, 872372, 862940, 855321, 848879, 843347, 839446, 837475, 836693, 837005, 839749, 845809, 854310, 864174, 875496, 888237, 900925, 911776, 919818, 923858, 921758, 912035, 895072, 871867, 842957, 809598, 774424, 739590, 705478, 672267, 641280, 613525, 588348, 564899, 543596, 524834, 507687, 491346, 476507, 463850]
58481D63850j1366j1103j0285q610p563p552p213o083n334n348n045m193l950
58468C70205m548m801m342m112m247l793k829k549k933k662j626j099j203o13
58454C28848Q97K055K473L067L855L864L415L931N230N621M896M588N064N077
58440C82881M619N250P163Q695R301J0222J1691J2285J1729J1500J1869J1176
58428D98381Q848O422M745K802Q6k434m532p266j0576j2859j3678j4359j5304
58415D40276j5364j4402j3786j3716j2848j1170j0304j0323r341p019n420n391
58403C11192n196l813k557k293j920q72k98n39k02J123J945J717J867K919L418
58388C06491K841K705L680M408M353M862O315P107O684O611P434P445N860M221
$$ y = [463850, 452484, 441381, 431096, 422486, 414923, 407371, 400158, 394075, 388741, 383393, 378348, 374155, 370205, 365657, 360856, 356514, 352402, 348155, 344362, 341533, 338984, 336051, 333389, 331763, 330664, 329461, 328848, 329745, 331800, 334273, 337340, 341195, 345059, 348474, 352405, 357635, 363256, 368152, 372740, 377804, 382881, 387500, 392750, 399913, 408608, 417909, 428131, 439822, 452107, 463836, 475336, 487205, 498381, 507229, 513651, 518396, 521198, 521284, 518850, 514318, 507052, 496476, 483617, 469939, 455580, 440276, 424912, 410510, 396724, 383008, 370160, 358990, 348686, 338363, 329022, 322003, 316583, 311192, 305996, 302183, 299626, 297333, 295413, 294541, 294243, 293704, 293502, 294625, 296570, 298287, 300154, 303073, 306491, 309332, 312037, 315717, 320125, 324478, 329340, 335655, 342762, 349446, 356057, 363491, 370936, 376796, 381017]
58374C81017L287J595j498m272n638o740q202q710p780o994p041o472m754l556
58360C14242l575l157j532l27l13J77J990L481L735M312O081P407P314P300Q261
58345C55396Q566P089N124L654J661j204l299l995m813o173o281m834m195n231
58331C41465n592m058k798l237l486k187j160j699j906l39J181J047P63J720K423
58316C22137J611Q97J608K221J519J135K349L556L389L184L895L985K792K503
58302C56781M202N540M908M258N192O042N546N577P260Q286P124N985O486O365
58288D39552L798R91L2q35l195m794l672k127k624l482k445r30q23o65J084K591
58272D22456K270K163L891N134M011L034M585O482O265N821P337Q765P934P199
$$ y = [381017, 384304, 385899, 384401, 380129, 374491, 367751, 359549, 350839, 343059, 336065, 329024, 322552, 317798, 314242, 310667, 307510, 305978, 305651, 305338, 305515, 307505, 310986, 314721, 319033, 325114, 332521, 339835, 347135, 355396, 363962, 371051, 376175, 379829, 381490, 380286, 376987, 372992, 368179, 362006, 355725, 350891, 346696, 341465, 335873, 331815, 329017, 325780, 322294, 320107, 318947, 317248, 315342, 315003, 316184, 317231, 317994, 319714, 322137, 323748, 324645, 326253, 328474, 329993, 331128, 333477, 337033, 340422, 343606, 347501, 351486, 354278, 356781, 360983, 366523, 371431, 375689, 380881, 386923, 392469, 398046, 405306, 413592, 420716, 426701, 433187, 439552, 443350, 444341, 444373, 443538, 440343, 435549, 431877, 429750, 427126, 423644, 421199, 420269, 419446, 418781, 419865, 422456, 424726, 426889, 430780, 435914, 439925, 442959, 447544, 454026, 460291, 466112, 473449, 482214, 490148, 497347]
58258D97347R149J1591J1658J1038J2212J3307J1725R255Q480P793M996K165J885
58245F12601K323J086J43J801L763L444L141N522Q094P825P051R023J1676J1814
58231F89307J1321J3127J5178J4681J4119J6660J9749J9880J9511K2419K6424
58220H82376K7704K8182L1415L5286L6061L5620L7278L8525L5434L0178K6623
58209A244682K2850J5902R392Q111R409Q342O948R707J4347J6267J7638K2857
58197A406452K9225L1747L2856L7623M3696M5956M6782N1353N7240N9189N9812
58186A901931O4576P0729P2497P2763P7854Q5365Q9125R1702R9503J10113J17279
58175B853437J23697J35571J49349J57652J63512J74472J87765J96174K03137
$$ y = [497347, 506496, 518087, 529745, 540783, 552995, 566302, 578027, 587282, 595762, 603555, 608551, 610716, 612601, 614924, 616010, 616153, 617954, 621717, 625161, 628302, 633824, 641918, 649743, 656794, 665817, 677493, 689307, 700628, 713755, 728933, 743614, 757733, 774393, 794142, 814022, 833533, 855952, 882376, 910080, 938262, 969677, 1004963, 1041024, 1076644, 1113922, 1152447, 1187881, 1218059, 1244682, 1267532, 1283434, 1292826, 1300937, 1310346, 1318688, 1325636, 1335343, 1349690, 1365957, 1383595, 1406452, 1435677, 1467424, 1500280, 1537903, 1581599, 1627555, 1674337, 1725690, 1782930, 1842119, 1901931, 1966507, 2037236, 2109733, 2182496, 2260350, 2345715, 2434840, 2526542, 2626045, 2736158, 2853437, 2977134, 3112705, 3262054, 3419706, 3583218, 3757690, 3945455, 4141629, 4344766]
58166D344766K16351K32000K41802K49956K65602K84588K97300L08621L30223
58157F771209L58926L83462M06674M38998M76191N07113N37332N79905O29261
58148A1089071O71319P12959P72440Q47491R24471J011773J129706J274963J433341
58139A9867534J619930J864852K168164K515322K924938L424912L994140M592904
58131D2972696N233302N942580O700619P552324Q731379J0372320J1928201J2118635
58123A11552056R846125N267770j81847m863222p944956r489556r924051r650503
58115H4611816q990185q185670p353886o516767n703382m972527m348986l808537
58107C4731876l332576k925926k579277k263799j970048j712403j490206j280929
$$ y = [4344766, 4561117, 4793117, 5034919, 5284875, 5550477, 5835065, 6132365, 6440986, 6771209, 7130135, 7513597, 7920271, 8359269, 8835460, 9342573, 9879905, 10459810, 11089071, 11760390, 12473349, 13245789, 14093280, 15017751, 16029524, 17159230, 18434193, 19867534, 21487464, 23352316, 25520480, 28035802, 30960740, 34385652, 38379792, 42972696, 48205998, 54148578, 60849197, 68401521, 77132900, 87505220, 99433421, 111552056, 121398181, 126665951, 126484104, 121620882, 113675926, 104186370, 94262319, 84611816, 75621631, 67435961, 60082075, 53565308, 47861926, 42889399, 38540413, 34731876, 31399300, 28473374, 25894097, 23630298, 21660250, 19947847, 18457641, 17176712]
58099A7176712j076501q92191p33190n83472m35072k99460j80552o1922O9526
58090A2983878K11523L69179N61965P79904R41146R22665O53638J85157l32706
58081A7276349p49202j000120j112463j142126j122920j069276r97277r21554
58073I161411q42776p56620o70038n94927n31529m72247m17195l72227l35485
58064D168367k99672k65111k37733k16324j94184j71716j55346j45181j35157
58055B347943j24285j16674j11356j02997r2250q4913q1170p5624o7747o2376
58045A428551n9958n6050n0550m8047m8572m7064m2585l9394l8422l6170l2583
58034I29156l1691l3678l4317l2960l3300l5519l5531l2824l1458l2264l1481
$$ y = [17176712, 16100211, 15208020, 14474830, 13891358, 13456286, 13156826, 12976274, 12914352, 12983878, 13195401, 13564580, 14126545, 14906449, 15847595, 16770260, 17423898, 17609055, 17276349, 16527147, 15527027, 14414564, 13272438, 12149518, 11080242, 10082965, 9161411, 8318635, 7562015, 6891977, 6297050, 5765521, 5293274, 4876079, 4503852, 4168367, 3868695, 3603584, 3365851, 3149527, 2955343, 2783627, 2628281, 2483100, 2347943, 2223658, 2106984, 1995628, 1892631, 1800381, 1715468, 1634298, 1558674, 1490927, 1428551, 1368593, 1312543, 1261993, 1213946, 1165374, 1118310, 1075725, 1036331, 997909, 961739, 929156, 897465, 863787, 829470, 796510, 763210, 727691, 692160, 659336, 627878, 595614, 564133]
58023E64133k8253k6145k6043k4605k1163j9234j9709j9132j6319j4304j4211
58012C35015j3330j0872r664j0508j0551q837q000q882q875p114o131o813o742
57999B18696n053m065m704m977m234m363n574n577m038l416m317m499l388l079
57985A57412l972l955k757k599l630l364j516p32j528j282O54J601O10J71J394
57970A36507K033R33R5O30Q29o4k04J116J937J434J423K603L113K289K125L423
57954A60222M224L606L373M390M946M262M053M985N225M097L586M507M747L108
57940B19331J379Q00j32k390m321m840n510p451r176r472r504j0130r977q199
57926A40408o398n800n213l584k065j683j468o45k13o54n90O11J400P86R6L46
$$ y = [564133, 535880, 509735, 483692, 459087, 437924, 418690, 398981, 379849, 363530, 349226, 335015, 321685, 310813, 301149, 290641, 280090, 271253, 263253, 254371, 245496, 238382, 232251, 225438, 218696, 213643, 209578, 204874, 199897, 195663, 191300, 185726, 180149, 176111, 172695, 168378, 163879, 160491, 157412, 153440, 149485, 146728, 144129, 140499, 137135, 135619, 134887, 133359, 132077, 132731, 134332, 134942, 135113, 136507, 138540, 139473, 139568, 140198, 141027, 140963, 140759, 141875, 143812, 145246, 146669, 149272, 152385, 154674, 156799, 160222, 164446, 168052, 171425, 175815, 180761, 185023, 189076, 194061, 199286, 203383, 206969, 211476, 216223, 219331, 220710, 221510, 221378, 218988, 214667, 209827, 204317, 196866, 187690, 178218, 168714, 158584, 148607, 140408, 134010, 128210, 122997, 119413, 117348, 115665, 114197, 113552, 113339, 112685, 112095, 112706, 114106, 114892, 114988, 115334]
57910A15334M96j19k04R12J668J045M48R86J372M60n18k92J39m52j262j231j120
57893A17662j840k581k455k238k750l215k900k555k718k411j116j96o98j611j842
57878H6536k050k925l554l202k907l549m103l566k850l084l588l328k804k848
57864D2178l001k657k379k573k391j359n60p93j129p01k49m51m52M37J281J299
57848B6500J361K191K814K485K358L455M658M604L998M084M376L857L080K982
57834G2803K963K059R20O62Q66N50N5J68L69k01j024j197j151j694k293j998j219
57817G0638r32j004q48p98j312j713j309p66q77r81k15P07O09j49m79m39o45p34
57799E8753j55L79o0q59q68m03n30j116j221q59o44l63M20R93M16o51p69J14Q66
$$ y = [115334, 115830, 115711, 115507, 116419, 118087, 119132, 119580, 120566, 121938, 122398, 121880, 121588, 121727, 121275, 120013, 118782, 117662, 115822, 113241, 110786, 108548, 105798, 102583, 99683, 97128, 94410, 91999, 90883, 90687, 89989, 88378, 86536, 84486, 81561, 78007, 74805, 71898, 68349, 64246, 60680, 57830, 54746, 51158, 47830, 45026, 42178, 39177, 36520, 34141, 31568, 29177, 27818, 27258, 26465, 25336, 24635, 24386, 23935, 23483, 23920, 25201, 26500, 27861, 30052, 32866, 35351, 37709, 41164, 45822, 50426, 54424, 58508, 62884, 66741, 69821, 72803, 75766, 77825, 78745, 79407, 80273, 80823, 80878, 81046, 81415, 81214, 80190, 78993, 77842, 76148, 73855, 71857, 70638, 69706, 68702, 67854, 67056, 65744, 64031, 62722, 61956, 61079, 60098, 59883, 60590, 61199, 61050, 60571, 60132, 59487, 58753, 58598, 58977, 58917, 58058, 57190, 56787, 56257, 55141, 53920, 53061, 52417, 52054, 52474, 53467, 53883, 53232, 52463, 52577, 53443]
57780E3443J088J243J301Q26J10k09l26p98j321j337j309j987k900l061k688k737
57764C9338l191l296l171l578m336m467l823l242l159l284C20c418l657k843j861
57749a1779j551j760j784j598j591j533j024m83m92n99l4Q29J047P22P69J334
57733a9527J803K088K596L156L236L015e87B511K492J368M38k18r57j501j326
57718B807q43r30d54j686j391j214j306j301j248j452j591j151m47j45q6K87P25
57701a2460O52M24P92J438J458R37O92O96L23j14L03J340a759d89C12Q08Q26Q52
57683B798J508K623L162K896K777L271L729L744L830M240M448M269M283M706M955
57668E7239M779M732N066N299N286N607O431P131P490Q145R306J0156J0205J0196
$$ y = [53443, 54531, 55774, 57075, 57901, 58011, 57802, 57476, 56678, 55357, 54020, 52711, 50724, 47824, 44763, 42075, 39338, 36147, 32851, 29680, 26102, 21766, 17299, 13476, 10234, 7075, 3791, 320, -3418, -7075, -9918, -11779, -13330, -15090, -16874, -18472, -20063, -21596, -22620, -23103, -23595, -24194, -24228, -23399, -22352, -21630, -20861, -19527, -17724, -15636, -13040, -9884, -6648, -3633, -587, 2511, 5003, 6371, 6809, 6591, 5634, 4133, 2807, 1964, 1034, -454, -2140, -3531, -4745, -6051, -7352, -8600, -10052, -11643, -12794, -13241, -13386, -13472, -13185, -12460, -11808, -11384, -10592, -9154, -7696, -6759, -6067, -5371, -5048, -5162, -4859, -3519, -1759, -489, 312, 1120, 1946, 2798, 4306, 6929, 10091, 12987, 15764, 19035, 22764, 26508, 30338, 34578, 39026, 43295, 47578, 52284, 57239, 62018, 66750, 71816, 77115, 82401, 88008, 94439, 101570, 109060, 117205, 126511, 136667, 146872, 157068]
57654A57068J0921J2036J2799J3251J3886J4806J5871J7148J8632K0040K1318
57643C27776K2848K4840K7078K9522L2496L5917L9168M2099M5458M9795N4635
57632G31632N9267O3680O8208P2752P6929Q0447Q2839Q3158Q0532P4725O5903
57621A540072N4223L9986K4031P606p889k1157l1414l8689m3353m5401m4685m1629
57609A391701l7044l1341k4951j9565j7872k1417k9211l8669m7293n3345n6023
57598A014970n5721n3613n0504m6457m1629l6679l2000k7328k2575j8308j4903
57587F15253j1836q491n005j780J301M556P859J0983J4198J7911K1992K6026K9960
57574G22927L4019L8275M2684M7324N2094N6474N9972O2605O4533O5405O4449
$$ y = [157068, 167989, 180025, 192824, 206075, 219961, 234767, 250638, 267786, 286418, 306458, 327776, 350624, 375464, 402542, 432064, 464560, 500477, 539645, 581744, 627202, 676997, 731632, 790899, 854579, 922787, 995539, 1072468, 1152915, 1235754, 1318912, 1399444, 1474169, 1540072, 1594295, 1634281, 1658312, 1665918, 1658029, 1636872, 1605458, 1566769, 1523416, 1478015, 1433330, 1391701, 1354657, 1323316, 1298365, 1278800, 1260928, 1239511, 1210300, 1171631, 1124338, 1070993, 1014970, 959249, 905636, 855132, 808675, 767046, 730367, 698367, 671039, 648464, 630156, 615253, 603417, 594926, 589921, 588141, 589442, 593998, 601857, 612840, 627038, 644949, 666941, 692967, 722927, 756946, 795221, 837905, 885229, 937323, 993797, 1053769, 1116374, 1180907, 1246312, 1310761]
57563A310761O1011N4730M5439L3285J8865L078j3044k8275m1476n2125o0355
57552A331894o6275o9763p1044p0896o9895o7932o4843o1089n7299n3600m9813
57541F29445m6016m2433l9076l5944l3230l0952k8683k6111k3595k1629k0074
57530B81702j8379j6439j4659j3349j2453j1815j1233j0406r210p967p117o671
57518A42004o302n828n297m726m101l499k969k370j672j132r21p68l89KK1j56
57502A01897O2R27K067L025L687M221M906N974P339Q572R397J0118J1214J2695
57488A86101J4174J5500J6879J8463K0237K2275K4708K7431L0225L3129L6315
57477D45437L9656M2815M5754M8666N1374N3298N4112N3875N2329M8607M2017
$$ y = [1310761, 1371772, 1426502, 1471941, 1505226, 1524091, 1527169, 1514125, 1485850, 1444374, 1392249, 1331894, 1265619, 1195856, 1124812, 1053916, 984021, 916089, 851246, 790157, 732858, 679258, 629445, 583429, 540996, 501920, 465976, 432746, 401794, 373111, 347000, 323405, 301776, 281702, 263323, 246884, 232225, 218876, 206423, 194608, 183375, 172969, 163759, 155792, 148675, 142004, 135702, 129874, 124577, 119851, 115750, 112251, 109282, 106912, 105240, 104108, 103187, 102419, 102030, 102032, 102053, 101897, 101959, 102886, 104953, 107978, 111665, 115886, 120792, 126766, 134105, 142677, 152074, 162192, 173406, 186101, 200275, 215775, 232654, 251117, 271354, 293629, 318337, 345768, 375993, 409122, 445437, 485093, 527908, 573662, 622328, 673702, 727000, 781112, 834987, 887316, 935923, 977940]
57466I77940L2817K1921J0142k003j3991k5188l4953m2686m7994n1015n2357n2492
57454G20141n1394m9029m5905m2796m0008l7251l4211l0935k7638k4424k1325
57443C15225j8445j5983j4062j2536j0973r001o760m801l423k324j115J00R96
57430B16898J746K947M803O822Q514J0040J1853J4007J6156J8173K0334K2878
57418C55171K5687K8577L1624L4984L8485M1661M4165M5930M6853M6549M4538
57407G84224M0513L4268K5616J4727K457j0001k1819l2648m2064m9354n4069n6468
57395F35382n7212n6823n5604n3798n1516m8687m5395m2045l8975l6112l3283
57384A15932l0612k8227k5895G837a3105j9235j8201j7226j5981j4765j3889j3219
$$ y = [977940, 1010757, 1032678, 1042820, 1040817, 1026826, 1001638, 966685, 923999, 876005, 824990, 772633, 720141, 668747, 619718, 573813, 531017, 491009, 453758, 419547, 388612, 360974, 336550, 315225, 296780, 280797, 266735, 254199, 243226, 234225, 227465, 222664, 219241, 216917, 215802, 215902, 216898, 218644, 221591, 226394, 233216, 241730, 251770, 263623, 277630, 293786, 311959, 332293, 355171, 380858, 409435, 441059, 476043, 514528, 556189, 600354, 646284, 693137, 739686, 784224, 824737, 859005, 884621, 899348, 901805, 891804, 869985, 837337, 795273, 745919, 691850, 635382, 578170, 521347, 465743, 411945, 360429, 311742, 266347, 224302, 185327, 149215, 115932, 85320, 57093, 31198, 7837, -13105, -32340, -50541, -67767, -83748, -98513, -112402, -125621]
57372a25621j2505j1749j1006j0229r506r131r171r300r210q952q652q210p528
57359b50770o803o332o119n925n582n141m791m692m764m679m174l368k577j909
57345c17626j339j015j087j286j155p51n38o37o84n56o15j020j384j418j397j626
57329c34134j966k156k189k055j611j017p89j099j474j527j452j493j440j137
57315c55539r38j072j174r44p66j062j479j455j170j247j800k486l190l999m722
57300c83043n087n268n586n925o004o007o364o985p383p341p000o445n749n197
57286d69384m987m887m662m541m750m882m428l644l227l358l630l763l701l311
57272e27155k581j966j870j982j729j180q54q23p42n67o21r89j467j911k156j855
$$ y = [-125621, -138126, -149875, -160881, -171110, -180616, -189747, -198918, -208218, -217428, -226380, -235032, -243242, -250770, -257573, -263905, -270024, -275949, -281531, -286672, -291463, -296155, -300919, -305598, -309772, -313140, -315717, -317626, -318965, -319980, -321067, -322353, -323508, -324259, -324797, -325434, -326118, -326674, -327289, -328309, -329693, -331111, -332508, -334134, -336100, -338256, -340445, -342500, -344111, -345128, -345917, -347016, -348490, -350017, -351469, -352962, -354402, -355539, -356477, -357549, -358723, -359667, -360433, -361495, -362974, -364429, -365599, -366846, -368646, -371132, -374322, -378321, -383043, -388130, -393398, -398984, -404909, -410913, -416920, -423284, -430269, -437652, -444993, -451993, -458438, -464187, -469384, -474371, -479258, -483920, -488461, -493211, -498093, -502521, -506165, -509392, -512750, -516380, -520143, -523844, -527155, -529736, -531702, -533572, -535554, -537283, -538463, -539317, -540140, -540882, -541449, -542070, -543059, -544526, -546437, -548593, -550448]
57256e50448j001k62j86l90j89L29O15O78R43J355J512J458J532J608J303P98
57240e40345N76N81M02J42L20R54J586K021K391K696K959L535M516N285N348N180
57224e01853N387N647N443N217N582N958N346M031L108K625J613j85k112m015
57210d58208o423r230j1540j2964j3892j4464j4503j4424j4903j5651j5756j5193
57198f17151j4700j4263j3130j1365r926r106q265p251o631o412n903n059m645
57185g33807m812m818m322l741l157k145q05K53R86J795K431K380K042K099J909
57170g43712K47k575n039o773q689j0801j1942j1841j1501j1248j0331q700p343
57157h50248o480n327l900l200l328l319l066l453m344m557m088m260n368o321
$$ y = [-550448, -551449, -551711, -551897, -552287, -552476, -552147, -551532, -550854, -549911, -548556, -547044, -545586, -544054, -542446, -541143, -540345, -539769, -539188, -538786, -538644, -538324, -537370, -535784, -533763, -531372, -528676, -525717, -522182, -517666, -512381, -507033, -501853, -496466, -490819, -485376, -480159, -474577, -468619, -463273, -459242, -456134, -453509, -451896, -452081, -454193, -458208, -464631, -473861, -485401, -498365, -512257, -526721, -541224, -555648, -570551, -586202, -601958, -617151, -631851, -646114, -659244, -670609, -680535, -689641, -697906, -705157, -711788, -718200, -724103, -729162, -733807, -738619, -743437, -747759, -751500, -754657, -756802, -757607, -757354, -756368, -754573, -752142, -749762, -747720, -745621, -743712, -743465, -746040, -751079, -757852, -766541, -777342, -789284, -801125, -812626, -823874, -834205, -842905, -850248, -856728, -862055, -865955, -869155, -872483, -875802, -878868, -882321, -886665, -891222, -895310, -899570, -904938, -911259]
57143i11259o920q189j0106j1346j1738j2546j3941j4570j4191j4136j4694j4602
57131a058238j3722j3535j4350j4845j4976j6351j8940k0482k0187j9945k0766
57120a246337k1224k0703k0861k2362k3353k2915k2897k4541k6252k6651k6874
57109a504970k7959k8804k8724k9249l1429l3986l5943l8313m1490m3866m4794
57098a889527m6009m8386n0432n1651n4072n8541o2973o6277p0546p7243q4812
57087b560469r2100j00490j10427j19714j27545j36328j47193j57802j66991j77111
57077c896170j89237k00721k10369k21231k35173k49698k63280k78660k97365
57068f041904l16358l33908l53317l76929m02283m28369m59657m99209n43862
$$ y = [-911259, -918179, -926368, -936474, -947820, -959558, -972104, -986045, -1000615, -1014806, -1028942, -1043636, -1058238, -1071960, -1085495, -1099845, -1114690, -1129666, -1146017, -1164957, -1185439, -1205626, -1225571, -1246337, -1267561, -1288264, -1309125, -1331487, -1354840, -1377755, -1400652, -1425193, -1451445, -1478096, -1504970, -1532929, -1561733, -1590457, -1619706, -1651135, -1685121, -1721064, -1759377, -1800867, -1844733, -1889527, -1935536, -1983922, -2034354, -2086005, -2140077, -2198618, -2261591, -2327868, -2398414, -2475657, -2560469, -2652569, -2753059, -2863486, -2983200, -3110745, -3247073, -3394266, -3552068, -3719059, -3896170, -4085407, -4286128, -4496497, -4717728, -4952901, -5202599, -5465879, -5744539, -6041904, -6358262, -6692170, -7045487, -7422416, -7824699, -8253068, -8712725, -9211934, -9755796]
57059i755796n91057o44121p05857p73763q47142r31925j032536j146245j271565
57050a7700007j414471j579928j765918j973102k211391k489342k807049l168262
57042c5109470l589362m087178m669395n347439o146792p093651q204578r500067
57034h3747932j1010653j2753913j4720986j6897425j9272364k1809937k4441351
57027b04654561k7101753k9724670l2167871l4223858l5783645l6884300l7375840
57020d37916498l6512909l3139104k6560753j7295228o880553L059481J1566692
57013e43678872J8384641K3593760K7367845K9939372L1567437L2447955L2678547
57006c47699315L2310624L1401181L0019214K8243606K6170672K3908567K1559328
$$ y = [-9755796, -10346853, -10990974, -11696831, -12470594, -13317736, -14249661, -15282197, -16428442, -17700007, -19114478, -20694406, -22460324, -24433426, -26644817, -29134159, -31941208, -35109470, -38698832, -42786010, -47455405, -52802844, -58949636, -66043287, -74247865, -83747932, -94758585, -107512498, -122233484, -139130909, -158403273, -180213210, -204654561, -231756314, -261480984, -293648855, -327872713, -363656358, -400540658, -437916498, -474429407, -507568511, -534129264, -551424492, -558305045, -555245564, -543678872, -525294231, -501700471, -474332626, -444393254, -412825817, -380377862, -347699315, -315388691, -283987510, -253968296, -225724690, -199554018, -175645451, -154086123]
56999a54086123J9213616J6954000J4845241J2921094J1190861R656068Q313178
56992f0992065P148428O143933N287028M565409L958519L443738L007240K640309
56984b4797461K329688K060831J826904J625994J452641J299985J166633J053390
56976a1981395R55968Q68201P89433P21699O62499O07343N56719N13665M76807
56967e829061M42221M09974L82508L58583L34820L11426K90698K71779K52279
56958b774773K33236K17123K02768J87452J72140J59542J48694J36627J23814
56949a193377J12915J03581R3373Q2493P2860O3795N3174M1781L2066K3810J5152
56938d98377O628M3n359j1414j7154k0594k2885k6204k8802k6823k0329j3111
$$ y = [-154086123, -134872507, -117918507, -103073266, -90152172, -78961311, -69305243, -60992065, -53843637, -47699704, -42412676, -37847267, -33888748, -30445010, -27437770, -24797461, -22467773, -20406942, -18580038, -16954044, -15501403, -14201418, -13034785, -11981395, -11025427, -10157226, -9367793, -8646094, -7983595, -7376252, -6819533, -6305868, -5829061, -5386840, -4976866, -4594358, -4235775, -3900955, -3589529, -3298831, -3027052, -2774773, -2541537, -2324414, -2121646, -1934194, -1762054, -1602512, -1453818, -1317191, -1193377, -1080462, -976881, -883508, -801015, -728155, -664360, -611186, -569405, -537339, -513529, -498377, -491749, -491706, -497065, -508479, -525633, -546227, -569112, -595316, -624118, -650941, -671270, -684381]
56926f84381p256k148J854L258K830L115M539N442N591O226P070O805O098O730
56912f34227Q127Q254P434P842R533J0508J0399J0701J1511J1457J0746J0971
56900e16744J1965J2007J1101J0905J1495J1332J0387J0193J0769J0560R527R294
56888c87209J0098J0511J0264J0570J1468J1695J1304J1696J2829J3193J2618
56877b60963J2526J3187J3396J2996J3080J3624J3496J2871J2989J3410J2371
56866a17017R943Q055P146N709L524K338K729L077K465J955K194K250J740J710
56852f2182K540L104K883K807L271L399K969L070M064M870M938N053N573N817
56838g824b074D270P638Q370Q196Q301R231R996J0020J0094J0718J1278J1473
$$ y = [-684381, -691637, -693785, -691931, -688673, -685843, -682728, -678189, -672747, -667156, -660930, -653860, -647055, -640957, -634227, -626100, -617846, -610412, -602570, -593037, -582529, -572130, -561429, -549918, -538461, -527715, -516744, -504779, -492772, -481671, -470766, -459271, -447939, -437552, -427359, -416590, -406030, -396503, -387209, -377111, -366600, -356336, -345766, -334298, -322603, -311299, -299603, -286774, -273581, -260963, -248437, -235250, -221854, -208858, -195778, -182154, -168658, -155787, -142798, -129388, -117017, -107074, -99019, -91873, -86164, -82640, -80302, -77573, -74496, -72031, -70076, -67882, -65632, -63892, -62182, -59642, -56538, -53655, -50848, -47577, -44178, -41209, -38139, -34075, -29205, -24267, -19214, -13641, -7824, -2074, 4270, 11908, 20278, 28474, 36775, 46006, 56002, 66022, 76116, 86834, 98112, 109585]
56825A09585J1826J2133J1217Q787N885L040j59l259m758m422l828l896l778k878
56811A35495k034j750j223k4R18J061J312K404L727M710N792P216Q214Q315Q025
56796A82158P472N804K813k96k495l982m967m904l679k225j141K6J516K744L566
56781A82410M738O485Q034R108J0426J2145J3422J4100J5160J6667J6952J4744
56769C24391J0682N916Q01m195p882r774j0779j1586j1646j0565r042p590n752
56756B52979l467j713r09r6J336K675L475M586O502Q242Q932Q981Q516O315J756
56741C08110l598p756j0507j2560j3827j3979j3599j3280j2503j0716q603p032
56729A80150n669l847j864k46J298L068M483N210O121P902R616R855Q501O204
$$ y = [109585, 121411, 133544, 144761, 153548, 159433, 162473, 162314, 159055, 154297, 149875, 146047, 142151, 138373, 135495, 133461, 131711, 130488, 130464, 131382, 132443, 133755, 136159, 139886, 144596, 150388, 157604, 165818, 174133, 182158, 189630, 195434, 198247, 197951, 195456, 191474, 186507, 181603, 177924, 175699, 174558, 174584, 176100, 178844, 182410, 187148, 193633, 201667, 210775, 221201, 233346, 246768, 260868, 276028, 292695, 309647, 324391, 335073, 340989, 341790, 337595, 329713, 319939, 309160, 297574, 285928, 275363, 266321, 258731, 252979, 249512, 247799, 246890, 246794, 248130, 250805, 254280, 258866, 265368, 273610, 282542, 291523, 300039, 306354, 308110, 304512, 296756, 286249, 273689, 259862, 245883, 232284, 219004, 206501, 195785, 187182, 180150, 174481, 170634, 168770, 168524, 169822, 172890, 177373, 182583, 188704, 196606, 206222, 216077, 224578, 230782]
56715B30782L187k54l066m552n361o211o598n984n148n007n033m322l309k974
56701A76150l105k823k180j805j575j006m21m30p49p22m79l60L1J039J845J520
56685A64930N35J3J2j22l29j07K62J35k50k14J22J92J06K77L76j07p51p80l72
56666A63928k32l28j56J57J37q5j65l66r85j533j510j355j555j574q68j65m15
56649A52930j146j275q78p51q34o15m59r61j479r92P0M52J74L27J057J474J387
56632A48481J455J726J587J131J097J487J691J798K298K684K008O96J17L30Q2
56617A68668r19j490j101p35j153j820k112k203k179j589m45M28N47L22J62M0
56601A54421J27P86J702K123K107K410L030L131K560K139K192K084J607J419J698
$$ y = [230782, 233969, 233715, 230649, 226097, 220736, 214525, 207927, 201943, 196795, 191788, 186755, 182433, 179124, 176150, 173045, 170222, 168042, 166237, 164662, 163656, 163235, 162805, 162056, 161334, 160855, 160495, 160526, 161565, 163410, 164930, 165465, 165478, 165490, 165368, 165039, 164932, 165194, 165329, 165079, 164865, 164987, 165179, 165285, 165562, 165938, 165831, 165080, 164300, 163928, 163696, 163368, 163212, 163369, 163506, 163421, 163256, 162890, 161905, 160372, 158862, 157507, 155952, 154378, 153510, 153345, 152930, 151784, 150509, 149631, 148880, 148046, 147431, 146972, 146011, 144532, 143540, 143610, 144062, 144236, 144563, 145620, 147094, 148481, 149936, 151662, 153249, 154380, 155477, 156964, 158655, 160453, 162751, 165435, 167443, 168139, 168256, 168586, 168668, 167749, 166259, 165158, 164423, 163270, 161450, 159338, 157135, 154956, 153367, 152922, 153350, 153897, 154219, 154381, 154421, 154548, 155334, 157036, 159159, 161266, 163676, 166706, 169837, 172397, 174536, 176728, 178812, 180419, 181838, 183536]
56586A83536J620P37l41j137j991l077l828l961m080m612n130n257n279n388n182
56571A36630m454l654l119k600j945j426j063m38M69J137J482K036K889L400L309
56556A32653L190L375L398K890K203J661J114N49K89K69m8o89j038r63j057j460
56540A46336j508r72n98q72j255j204j011r96q17k16L42M10K43K22K42J83K60
56523A38789N04N40K74J35K95M27M55P04J087J036N69M77J045J524J365R48P78
56506A50952P79R17J471K297K654K322J938J885J754J378J304J734K004J718J367
56491A76474J318J180P44N10O52N04k53r36j011r36j143j253j001q82j131j134
56475A71702n88k13m84p71n86n46j143j614j211n75o59j160j185p85n98o44n26
$$ y = [183536, 185156, 185893, 185552, 184415, 182424, 179347, 175519, 171558, 167478, 162866, 157736, 152479, 147200, 141812, 136630, 132176, 128522, 125403, 122803, 120858, 119432, 118369, 117931, 118400, 119537, 121019, 123055, 125944, 129344, 132653, 135843, 139218, 142616, 145506, 147709, 149370, 150484, 151033, 151322, 151591, 151543, 150854, 149816, 148853, 147796, 146336, 144828, 143856, 143258, 142386, 141131, 139927, 138916, 137920, 137103, 136887, 137229, 137639, 137882, 138104, 138346, 138529, 138789, 139293, 139833, 140107, 140242, 140537, 140964, 141419, 142123, 143210, 144246, 144815, 145292, 146337, 147861, 149226, 150174, 150952, 151731, 152648, 154119, 156416, 159070, 161392, 163330, 165215, 166969, 168347, 169651, 171385, 173389, 175107, 176474, 177792, 178972, 179716, 180226, 180878, 181382, 181129, 180193, 179182, 178246, 177103, 175850, 174849, 173967, 172836, 171702, 171114, 170901, 170417, 169646, 169060, 168514, 167371, 165757, 164546, 163971, 163312, 162152, 160967, 160182, 159584, 158940, 158414]
56458A58414l42l88m95n17q20j491j778j212n24n08p56n21p2o7l19k86j68m00
56440A47750o32l30J85L27L31O87J066R01N15N72R05R36P86R06J059P61L17L66
56422A57408P79R51Q44P82P02M91N57J148J669J582J396J745K128J743R17N37
56406A75379O20O41P43J334J950J809J141P54O24J53n19p10m30k59k70j82k34
56389A82544p55j201q63j67o3m54n00j61j08l31j70L58N59K56j20n15j167j720
56371A75422j593j044p90p67m48n5k44p47o78o7K11q5l46l26l57m33k60p8l33
56352A66982o77m72m0j93p38q21m95n59j001j014n48m06p68j027j053j281j544
56335A54345j172l39R2O0L30R81J328J316J563J992J890J394J443K025K049J234
$$ y = [158414, 158072, 157684, 157189, 156672, 155852, 154361, 152583, 151371, 150847, 150339, 149583, 149062, 148990, 148923, 148604, 148318, 148150, 147750, 147118, 146788, 146973, 147300, 147631, 148318, 149384, 150285, 150800, 151372, 152277, 153213, 153999, 154905, 155964, 156725, 157042, 157408, 158187, 159138, 159982, 160764, 161466, 161957, 162514, 163662, 165331, 166913, 168309, 170054, 172182, 173925, 174842, 175379, 175999, 176640, 177383, 178717, 180667, 182476, 183617, 184371, 184995, 185148, 184629, 183919, 183489, 183230, 182960, 182778, 182544, 181789, 180588, 179725, 179558, 179495, 179041, 178541, 178380, 178272, 177941, 177771, 178129, 178688, 178944, 178824, 178309, 177142, 175422, 173829, 172785, 171995, 171228, 170780, 170725, 170481, 169734, 169056, 168989, 169200, 169115, 168769, 168443, 168086, 167653, 167393, 167315, 166982, 166305, 165833, 165793, 165600, 164862, 164041, 163546, 162987, 161986, 160972, 160424, 160018, 159250, 158223, 157170, 155889, 154345, 153173, 152834, 152926, 152986, 153316, 154297, 155625, 156941, 158504, 160496, 162386, 163780, 165223, 167248, 169297, 170531]
56319A70531N96P55J142J274J412J624J427Q28M88N30L58j11k43Q1K68J89L30
56302A81479N93L07m54q25o14m60m19J33J064J400R86P11R04R53P68J080J933
56285A89539K392K162J974K083J895J431J562K350K775K504K397K764K788K202
56271B20818J913K328K657K447K340K639K736K492K655L307L471K888K577K968
56257B58236L115K452J722J439J057L92K40P78J011N57L44P63Q62K24j35L57P99
56240B74213O68Q43J800K498K302K241L125M079M209M133M558M939M851N127O302
56225C25888P370P512P534Q268R036R138R394J0665J2198J2989J3496J4548J5738
56212D63774J6403J7064J8476K0332K2146K4266K6841K9059L0665L2804L6162
$$ y = [170531, 171127, 171882, 173024, 174298, 175710, 177334, 178761, 179589, 180077, 180607, 180965, 180854, 180611, 180692, 180960, 181149, 181479, 182072, 182379, 181925, 181100, 180486, 180026, 179607, 179740, 180804, 182204, 183190, 183901, 184805, 185758, 186526, 187606, 189539, 191931, 194093, 196067, 198150, 200045, 201476, 203038, 205388, 208163, 210667, 213064, 215828, 218616, 220818, 222731, 225059, 227716, 230163, 232503, 235142, 237878, 240370, 243025, 246332, 249803, 252691, 255268, 258236, 261351, 263803, 265525, 266964, 268021, 268413, 268653, 269431, 270442, 270999, 271343, 272106, 272968, 273192, 273057, 273414, 274213, 274881, 275724, 277524, 280022, 282324, 284565, 287690, 291769, 295978, 300111, 304669, 309608, 314459, 319586, 325888, 333258, 340770, 348304, 356572, 365608, 374746, 384140, 394805, 407003, 419992, 433488, 448036, 463774, 480177, 497241, 515717, 536049, 558195, 582461, 609302, 638361, 669026, 701830, 737992]
56201G37992L9673M2370M5015M8522N2198N5102N7651O0379O2467O3112O2903
56190A327384O2380O0605N6762N1661M6157L9540L1249K2612J4992P697l40q228
56178A712471j4429j9155k3422k6964k9114l0628l2565l4426l5278l5635l6340
56167A394515l6788l6258l5839l6927l8849m0055m0613m1439m2124m1710m0702
56156I63211m0197l9832l8621l6949l5749l4570l2517l0164k8538k7119k4917
56145E94038k2558k1171k0205j8452j6337j4987j3967j2191j0216r313r087q205
56133D17349o784n875n319m344l423l358l357k235o80j14j59M27J284J272Q72
56118C85556J290K004J744J079J466K512K712K232K363K906K671J986K059K489
$$ y = [737992, 777665, 820035, 865050, 913572, 965770, 1020872, 1078523, 1138902, 1201369, 1264481, 1327384, 1389764, 1450369, 1507131, 1558792, 1604949, 1644489, 1675738, 1698350, 1713342, 1721039, 1720699, 1712471, 1698042, 1678887, 1655465, 1628501, 1599387, 1568759, 1536194, 1501768, 1466490, 1430855, 1394515, 1357727, 1321469, 1285630, 1248703, 1209854, 1169799, 1129186, 1087747, 1045623, 1003913, 963211, 923014, 883182, 844561, 807612, 771863, 737293, 704776, 674612, 646074, 618955, 594038, 571480, 550309, 530104, 511652, 495315, 480328, 466361, 454170, 443954, 434641, 425554, 417349, 410565, 404690, 399371, 395027, 391604, 388246, 384889, 382654, 381974, 381860, 381701, 382128, 383412, 384684, 385556, 386846, 388850, 390594, 391673, 393139, 395651, 398363, 400595, 402958, 405864, 408535, 410521, 412580, 415069]
56104D15069J980R66R27J655J752J281J392J895J763J383J819K519K316J917K785
56089D41419M360N121N498O953R012J0229J1159J3311J6000J7495J8493K1045
56077E80095K4743K7411K9013L1344L4298L5995L6294L6646L6742L4868L1474
56066I38923K8869K7477K5729K3472K1955K0573J7222J1948O805K264k827p900
56054A114510j1010j2483j4632j7860k0566k2766k6074l0119l2725l3633l4403
56043H58239l4795l3198l0413k8935k8555k6798k3641k1498k0521j8451j5279
56032E76155j3515j3390j2402j0084q680q531p394n030l835m197l794k205j667
56019D81431k445k126l58M23j97K18K093K953K306K564M140M587L595L857N833
$$ y = [415069, 417049, 418015, 418942, 420597, 422349, 423630, 425022, 426917, 428680, 430063, 431882, 434401, 436717, 438634, 441419, 445779, 450900, 456398, 463351, 472363, 482592, 493751, 507062, 523062, 540557, 559050, 580095, 604838, 632249, 661262, 692606, 726904, 762899, 799193, 835839, 872581, 907449, 938923, 967792, 995269, 1020998, 1044470, 1066425, 1086998, 1104220, 1116168, 1122973, 1125237, 1122410, 1114510, 1103500, 1091017, 1076385, 1058525, 1037959, 1015193, 989119, 959000, 926275, 892642, 858239, 823444, 790246, 759833, 730898, 702343, 675545, 651904, 630406, 609885, 591434, 576155, 562640, 549250, 536848, 526764, 518084, 509553, 502159, 497129, 493294, 489097, 485303, 483098, 481431, 478986, 476860, 476502, 476925, 476728, 476946, 479039, 481992, 484298, 486862, 491002, 495589, 499184, 503041, 508874]
56004E08874O736N840N712O977P116N703N513P114P703O672O828Q715R345Q046
55990F06894P860R564J0109Q708Q465J0269J1080J0091J0388J2570J3180J1521
55978G30699J1512J4425J6432J5831J5996J8548K0290J9729J9913K1949K2564
55967I27888K0948K1056K4158K6258K5826K6756L0498L2946L2482L3290L7128
55956A239234L9805L9573M0807M5371M8738M8844N0292N5310N9294N9933O1816
55945A789017O7104P0834P0652P1913P7676Q3150Q5619R0038R8974J07183J12239
55934B724399J20010J33052J44571J50687J57553J69080J79332J84754J91852
55925D155290K04518K16203K23153K32472K48156K62841K72988K87808L12777
$$ y = [508874, 515610, 521450, 527162, 534139, 541255, 546958, 552471, 559585, 567288, 573960, 580788, 589503, 598848, 606894, 614754, 624318, 634427, 643135, 651600, 661869, 672949, 683040, 693428, 705998, 719178, 730699, 742211, 756636, 773068, 788899, 804895, 823443, 843733, 863462, 883375, 905324, 927888, 948836, 969892, 994050, 1020308, 1046134, 1072890, 1103388, 1136334, 1168816, 1202106, 1239234, 1279039, 1318612, 1359419, 1404790, 1453528, 1502372, 1552664, 1607974, 1667268, 1727201, 1789017, 1856121, 1926955, 1997607, 2069520, 2147196, 2230346, 2315965, 2406003, 2504977, 2612160, 2724399, 2844409, 2977461, 3122032, 3272719, 3430272, 3599352, 3778684, 3963438, 4155290, 4359808, 4576011, 4799164, 5031636, 5279792, 5542633, 5815621, 6103429, 6416206]
55916F416206L39213L61144L86734M21329M56044M85805N20905N67015O12857
55907A0567252O52757P01115P68247Q43767R21724J018411J145633J292556J456207
55898A9367669J660785J921697K222718K556836K952094L425300L957810M559559
55890D2624468N301256O230535P329146Q617153J0148560J1671359J2333764J1066998
55882A15323239P511739K510532k445140o229717q549156r651325r883826r543125
55874G9043221q886370q091518p228721o333562n474908m718562m074843l525308
55866C0709429l066573k694724k380944k098256j849359j642076j461453j290746
55858A4225298j137373j013867r12245q18886p36820o72497o16720n58381n02838
$$ y = [6416206, 6755419, 7116563, 7503297, 7924626, 8380670, 8866475, 9387380, 9954395, 10567252, 11220009, 11921124, 12689371, 13533138, 14454862, 15473273, 16618906, 17911462, 19367669, 21028454, 22950151, 25172869, 27729705, 30681799, 34107099, 38064909, 42624468, 47925724, 54156259, 61485405, 70102558, 80251118, 91922477, 104256241, 115323239, 122834978, 125345510, 122900370, 116670653, 108121497, 98470172, 88586346, 79043221, 70156851, 62065333, 54836612, 48503050, 43028142, 38309580, 34234737, 30709429, 27642856, 24948132, 22567188, 20468932, 18619573, 16977497, 15516044, 14225298, 13087925, 12074058, 11161813, 10342927, 9606107, 8933610, 8316890, 7758509, 7255671]
55849G255671m58922m21141l81343l44989l19710k99673k76567k54827k41316
55840D257183k30639k14874j97955j86783j77469j63548j49034j40464j34214
55831B662203j23946j12958j07289j03878r7012q9613q6987q5929q0765p4047
55821A699779p0946o8962o3276n6595n3831n2462m7738m2252m0905m1350l8695
55810A122767l4992l4944l6536l4898l1453l0649l1351k9750k7205k7224k8087
55799G75678k6178k3299k3123k3797k1371j7349j5558j4756j1517p384o028o190
55787E79128m482k469l981p898j0285j1309j3590j6042j5837j4261j4451j5412
55775D49111j4246j2159j2250j3471j2648j0509r910j0167q755o679o567p352
$$ y = [7255671, 6796749, 6375608, 5994265, 5649276, 5329566, 5029893, 4753326, 4498499, 4257183, 4026544, 3811670, 3613715, 3426932, 3249463, 3085915, 2936881, 2796417, 2662203, 2538257, 2425299, 2318010, 2214132, 2117120, 2027507, 1940520, 1854591, 1773826, 1699779, 1628833, 1559871, 1496595, 1440000, 1386169, 1333707, 1285969, 1243717, 1202812, 1161462, 1122767, 1087775, 1052831, 1016295, 981397, 949944, 919295, 887944, 858194, 830989, 803765, 775678, 749500, 726201, 703078, 679281, 657910, 640561, 625003, 610247, 598730, 591346, 585318, 579128, 574646, 572177, 568196, 560298, 550013, 538704, 525114, 509072, 493235, 478974, 464523, 449111, 434865, 422706, 410456, 396985, 384337, 373828, 363918, 353751, 344996, 338317, 331750, 324398]
55763C24398o286m372m361n324m602l112l380m206k812m21k14j460j098M23L90
55748B83563p07l09R69N31j019j105l36j267l209l380k164k219l398l465k860
55733B59625l767n430n331m103m415n798n516l820l421m386m340l242l197l987
55719A98872l405j763j423k233j877m89n27k119k989k795l334m549m514l393l284
55704A60178m186m062k869k593l317l145k082k084l192l362k263j706k153k288
55690A20876k005k421l107k588j372j173j500n93Q32N04j173j629o32l95j336
55675A02288j593q17n84r76m35P91Q01k61l07O97O18p74j367o71n54j487j686
55658I3683o33N2j57J22J144J442Q25P79J454J369N54O92J764J890R30Q62K066
$$ y = [324398, 318112, 313740, 309379, 304055, 299453, 296341, 292961, 288755, 285943, 285522, 285308, 283848, 282750, 283173, 283563, 282856, 282547, 283516, 284047, 283028, 281923, 281587, 280320, 277111, 273731, 271567, 269348, 265950, 262485, 259625, 255858, 250428, 245097, 240994, 236579, 230781, 225265, 221445, 218024, 213638, 209298, 206056, 202859, 198872, 195467, 193704, 192281, 190048, 188171, 187682, 187155, 185036, 182047, 179252, 175918, 171369, 166855, 163462, 160178, 155992, 151930, 149061, 146468, 143151, 140006, 137924, 135840, 132648, 129286, 127023, 125317, 123164, 120876, 118871, 116450, 113343, 110755, 109383, 108210, 106710, 106117, 106949, 107453, 106280, 104651, 104019, 103624, 102288, 100695, 99878, 99294, 98318, 97883, 98674, 99475, 99214, 98907, 99604, 100222, 99448, 98081, 97410, 96856, 95369, 93683, 93050, 93102, 92945, 93067, 94211, 95653, 96478, 97257, 98711, 100080, 100634, 101326, 103090, 104980, 105910, 106772, 108838]
55641A08838K616J916J646K324K316J165N91J193J300J30q74q83r76j614j648
55626A18040p95l61o75m50N07P82K25M90J877K517J634P95R88J181P89P96J431
55609A29771J412N01J74Q33J014K71J35J167J820J297Q70J213J097o9j011j068
55593A39427j383k386k648j598q80j614k637k819k885l566m059l740l366l401
55579A02445l038k048j564k030k351k018j958k382k099r32m91j404k109j590j037
55564G5394j429j796j242o45q52j177r73q78j222j122l06O4m89q04l06j30q80
55547F1207j390r44n88j001j152m19M1n03q84k12M77J92k56K9L60P1r5M11P08
55528E6052K27q7L18L92m20q56r8N74M5o02q5P74O35m2j04K47K40R8K55K32k28
$$ y = [108838, 111454, 113370, 115016, 117340, 119656, 120821, 121412, 122605, 123905, 124035, 123161, 122278, 121302, 119688, 118040, 117245, 116884, 116209, 115759, 116266, 117048, 117273, 117763, 119640, 122157, 123791, 124586, 125574, 126755, 127544, 128340, 129771, 131183, 131684, 131858, 132691, 133705, 133976, 134111, 135278, 137098, 138395, 139265, 140478, 141575, 141506, 140495, 139427, 138044, 135658, 133010, 131412, 130532, 128918, 126281, 123462, 120577, 117011, 112952, 109212, 105846, 102445, 99407, 97359, 95795, 93765, 91414, 89396, 87438, 85056, 82957, 82025, 81534, 80130, 78021, 76431, 75394, 73965, 72169, 70927, 70282, 69430, 68253, 67280, 66402, 65180, 64058, 63752, 63816, 63327, 62523, 62217, 62087, 61207, 59817, 58873, 58285, 57284, 56132, 55713, 55754, 55251, 54367, 54155, 54632, 54824, 54568, 54597, 54957, 55028, 54933, 55344, 56052, 56279, 56192, 56510, 56902, 56482, 55626, 55528, 56102, 56147, 55545, 55460, 56234, 56869, 56827, 56723, 56970, 57210, 57308, 57563, 57795, 57567]
55507E7567k72N53J189Q59M52Q18J188P52K24L54M26k46q21n09j85p50j369r70
55489E9260j90j31m22k23P2k21n21l8O71P80P22J188J605J204N79P18J364J698
55471F8115J697J614J096M4p14p38q16j421j690j090o73j310k124k099j826k146
55455E5919k461j969j311j330j510j154q58j217j392o08J77j69r42q65k18P9L13
55438D0484J099J736J273L42J05K98O0k74M3M83J15o56q80q01j117j416j006m65
55420C9423o69j152j030p00r52j293r02l19m27p06k37L95J84k86J29R23Q22J66
55402C3369K73J002J085M73K87O92P79L80J71J64j97o66n66j99l37o50l00K99
55384C6059J15n38m84K45N47K69K43M88K30m28n23j2J63k35m60k80k29l83k58
$$ y = [57567, 57295, 57848, 59037, 59896, 60348, 61166, 62354, 63106, 63330, 63684, 64110, 63864, 63043, 62534, 62349, 61599, 60230, 59260, 59070, 58939, 58517, 58294, 58366, 58145, 57624, 57586, 58257, 59037, 59759, 60947, 62552, 63756, 64335, 65053, 66417, 68115, 69812, 71426, 72522, 72566, 71852, 71114, 70298, 68877, 67187, 66097, 65424, 64114, 61990, 59891, 58065, 55919, 53458, 51489, 50178, 48848, 47338, 46184, 45326, 44109, 42717, 42109, 42286, 42117, 41175, 40310, 40092, 40171, 40484, 41583, 43319, 44592, 44934, 45039, 45337, 45397, 45123, 45166, 45649, 45764, 45108, 44228, 43427, 42310, 40894, 39888, 39423, 38754, 37602, 36572, 35872, 34920, 33627, 32725, 32406, 31979, 31273, 31036, 31431, 31615, 31329, 31458, 32381, 33203, 33369, 33642, 34644, 35729, 36202, 36489, 37181, 37960, 38340, 38511, 38675, 38478, 37812, 37246, 37047, 36710, 36060, 35760, 36059, 36174, 35636, 35152, 35397, 35944, 36213, 36456, 36944, 37174, 36746, 36223, 36211, 36374, 36139, 35679, 35399, 35170, 34787, 34529]
55365C4529M6j8k43Q1Q09J131R67R00Q90M45j66j88K57M16K72M10P33O49K93K64
55345D2477L87O3m47m21o8j65n86n77k62l87q23p38j03K98K30Q6j16n60p82l38
55325C7168J12k93r99r02k69k51p62o45K67R43R28O88L24m63j178r78k43j14n43
55306C2790m03M50R27O26L46N00N48K68J32K03l8n67p90o72o42n63l4M47J40m08
55286C3260r1P24O18m22r26m06J7k60l97J48O92O85N66O45N04Ml38l55m37n43
55266C3688k21K63J30m33m53R9L12J12L58R90Q58j95q53m86m4j96k73J72L77j78
55246C4027p33o11l17m22n05j08L58M13L24L88L39P8kJ33n1n59o57j66J53j3K7
55225C2096N77Q74M49j8Q3K90P6k04j18K8j00j49J74M25J45l90p22q28p72m35
$$ y = [34529, 34575, 34557, 34314, 34395, 35204, 36335, 37302, 38202, 39092, 39537, 39371, 39183, 39440, 39856, 40128, 40538, 41271, 41920, 42213, 42477, 42864, 42927, 42480, 42059, 41991, 41826, 41240, 40663, 40401, 40014, 39191, 38453, 38350, 38648, 38878, 38964, 38848, 38288, 37506, 37168, 37280, 36987, 35988, 35086, 34817, 34566, 33804, 33159, 33426, 34369, 35297, 35985, 36309, 35846, 34668, 33690, 33447, 33333, 32790, 32387, 32837, 33764, 34390, 34736, 35236, 35784, 36052, 36184, 36387, 36349, 35782, 34992, 34320, 33678, 33115, 33081, 33528, 33668, 33260, 33169, 33893, 34511, 34089, 33163, 32757, 32774, 32514, 32117, 32265, 32957, 33642, 34208, 34853, 35357, 35361, 35023, 34668, 34231, 33688, 33467, 33730, 33860, 33427, 32974, 33073, 33385, 33497, 33855, 34845, 35703, 35508, 34655, 34169, 34125, 33929, 33656, 33828, 34205, 34027, 33294, 32683, 32366, 31944, 31439, 31331, 31689, 32102, 32426, 32814, 33153, 33231, 33229, 33362, 33311, 32752, 32095, 31929, 32082, 32069, 32096, 32673, 33547, 33996, 33978, 34061, 34351, 34427, 34223, 34105, 34133, 34033, 33884, 34058, 34483, 34628, 34238, 33516, 32688, 31916, 31481]
55205C1481J3Q9k00k89l2Q3p9l8L37N54M37M01N09K72l28o39m82m23o10m73J33
55184C0716N33M30L38M82L78o1k22L2K0m77p19l62l7q9P1P09J105P58K37Q5j9
55163C3908l48m57j03J61mj19O8J4m69n89J00P85O79K17J27K13l8m34n36m74n29
55142C2172n36l52k96n00n28j66J39J43K49O30P37L16rK46O18N70L11K18J63M4
55122C4169J81N87O78J79m01o81r12j170r78k84J92R8j8J79K04j62l00Q3K83j47
55102C1780n49l10J26J94J63L41L28r5k60L02R56R47N05J77p8l57k76K63O08L93
55082C5158J74L06K41l01n50J2O26M79j8j65j67l64k70M74J113Q87L28K73M76
55063C8712L10P2L11N94K06n27q09p28q08q48l90J88K01j22p0L09M65M23N48O56
$$ y = [31481, 31494, 31583, 31383, 31094, 31062, 31145, 31066, 31028, 31365, 31919, 32356, 32757, 33266, 33538, 33210, 32571, 32089, 31666, 31056, 30583, 30716, 31249, 31679, 32017, 32499, 32877, 32816, 32594, 32626, 32646, 32169, 31450, 31088, 31051, 30962, 31033, 31742, 32847, 33605, 33842, 33927, 33908, 33560, 33103, 33000, 33161, 33157, 33038, 33106, 33120, 32651, 32062, 32162, 32947, 33626, 33843, 33970, 34183, 34145, 33711, 33175, 32701, 32172, 31636, 31284, 30988, 30488, 29960, 29794, 29933, 30076, 30325, 30955, 31692, 32008, 31999, 32245, 32863, 33433, 33744, 33962, 34125, 34169, 34350, 34937, 35615, 35794, 35393, 34712, 33800, 32630, 31652, 31368, 31560, 31658, 31640, 31819, 32023, 31861, 31561, 31644, 31927, 31780, 31231, 30921, 31047, 31241, 31404, 31745, 32073, 31978, 31718, 32020, 32976, 33923, 34428, 34605, 34527, 34170, 33894, 34157, 34765, 35158, 35332, 35638, 35879, 35578, 35028, 35040, 35666, 36145, 36127, 35962, 35795, 35431, 35161, 35635, 36748, 37635, 37963, 38236, 38712, 39022, 39094, 39405, 39999, 40205, 39678, 38869, 38141, 37333, 36485, 36095, 36283, 36484, 36362, 36292, 36601, 37066, 37489, 38037, 38693]
55043C8693L69k4k3J66Q6n1K08O09O68N62P11R16P94N49N09M13M3j23K45N28J48
55022D5996l31j50L20L41J44L28N66K32k69j49K72J26l94l66J80L73P7M2M77P62
55002D8577O12L76K21j4j80n2n4p54j724j964j371p51m99k80M4J76J40L35P13
54983D3551P64L74l0k20l44m65n04n64p20p14m16k24l90m14J41P73Q07N31O40
54964D2576R88R38N57L95M24K30m6K3J72j55p11p57l37j54l46m05j82j5RP0J4
54943D3288l26n24j36L61K31l20n12l21k51k01K78Q74Q45L35J33K82J71j69q7
54924D3951L93N73L79M63R25J127Q98P57Q25O45K41J83N21O76N63P56J336J684
54906E6896J582J489J569J492J355J720K504K932K794K774L231L694L836L955
$$ y = [38693, 39062, 39038, 39015, 39181, 39267, 39216, 39424, 40033, 40701, 41263, 41974, 42890, 43684, 44233, 44742, 45155, 45198, 45075, 45320, 45848, 45996, 45665, 45515, 45835, 46176, 46320, 46648, 47214, 47446, 47177, 47028, 47300, 47426, 47032, 46666, 46846, 47219, 47296, 47338, 47815, 48577, 49189, 49565, 49786, 49772, 49592, 49540, 49486, 48732, 47008, 45044, 43673, 42922, 42423, 42143, 42187, 42363, 42503, 42838, 43551, 44315, 44689, 44659, 44439, 44095, 43630, 43126, 42562, 41842, 41128, 40712, 40488, 40098, 39684, 39825, 40598, 41405, 41936, 42576, 43564, 44502, 45059, 45454, 45878, 46108, 46062, 46085, 46257, 46102, 45391, 44634, 44297, 44143, 43797, 43392, 43210, 43195, 43204, 43274, 43288, 42962, 42438, 42302, 42663, 42894, 42574, 42062, 41741, 41490, 41289, 41567, 42441, 43286, 43621, 43754, 44036, 44207, 44038, 43951, 44344, 44917, 45296, 45759, 46684, 47811, 48709, 49466, 50291, 50936, 51177, 51360, 51881, 52557, 53120, 53876, 55212, 56896, 58478, 59967, 61536, 63028, 64383, 66103, 68607, 71539, 74333, 77107, 80338, 84032, 87868, 91823]
54892I1823M191M203L979L983M206L995L100K033J074j31j679k955l550l803m081
54877A06388m255m190m084l998l739l392l326l479l332k747k138j720j287q36
54863F3865o06m49M9P49J112J149J351J666J574J254J523K466L194L289L399L984
54847H9569M539M511M094L592K839J741O11m36j647k894l564l546l485l716l792
54832H8416l458l212l416l654l499l169k909k481j773j257j222j235q36l06j70
54817E5819m64q62j138j160q40m41m09p36r45q48p56q04p21m15j63o9L8N2l02
54798D4836p78p71l48j82l93l57R5L04pk01J43N10M09K02L17M70L18J29K24L43
54778D5263J98O4K32M46M13L80O02P81N73J88j6j10l13n22n18l16M1N82J095J165
$$ y = [91823, 96014, 100217, 104196, 108179, 112385, 116380, 119480, 121513, 122587, 122456, 120777, 117822, 114272, 110469, 106388, 102133, 97943, 93859, 89861, 86122, 82730, 79404, 75925, 72593, 69846, 67708, 65988, 64701, 63865, 63259, 62810, 62859, 63608, 64720, 65869, 67220, 68886, 70460, 71714, 73237, 75703, 78897, 82186, 85585, 89569, 94108, 98619, 102713, 106305, 109144, 110885, 111496, 111060, 109413, 106519, 102955, 99409, 95924, 92208, 88416, 84958, 81746, 78330, 74676, 71177, 68008, 65099, 62618, 60845, 59588, 58366, 57131, 56295, 55989, 55819, 55355, 54493, 53355, 52195, 51355, 50914, 50505, 49769, 48824, 47976, 47220, 46416, 45695, 45280, 45117, 45048, 45086, 45138, 44836, 44058, 43287, 42939, 42757, 42364, 42007, 42102, 42406, 42399, 42198, 42341, 42851, 43260, 43462, 43779, 44249, 44567, 44696, 44920, 45263, 45461, 45525, 45757, 46203, 46616, 46996, 47598, 48379, 48952, 49140, 49124, 49014, 48701, 48179, 47661, 47345, 47386, 47968, 49063, 50228]
54758E0228Q16N75O58O81L94J49K90O71J075J567K100K375K376K494K853L068
54742G2370K952K853L033L353L754M439N230N504N067M437L971L377K390J242
54728A23972Q9j239k576l285l206l029l249l478l300l019l029l049k615j834j152
54713H6001p68o67p59p21j83O47J144J224J455K017K388K360K507L198L980M443
54697A08266M887N582O135O161N910N692N297M518L612K710J478k01j811k965
54683A55271l952n053o009o589o953p081o570n487m610m315m074l520l088l043
54669H4927k871k270j876k133k393j995j387j292j483j328r00o28m36r7J44Q0
54653F4062J22N33P62L61j47j20N9k42p37p39l49r4J37O93J174R27K22q7J35K79
$$ y = [50228, 51044, 51619, 52277, 52958, 53352, 53501, 53791, 54462, 55537, 57104, 59204, 61579, 63955, 66449, 69302, 72370, 75322, 78175, 81208, 84561, 88315, 92754, 97984, 103488, 108555, 112992, 116963, 120340, 122730, 123972, 124061, 122822, 120246, 116961, 113755, 110726, 107477, 103999, 100699, 97680, 94651, 91602, 88987, 87153, 86001, 85233, 84566, 83807, 83086, 82903, 83550, 84694, 85918, 87373, 89390, 91778, 94138, 96645, 99843, 103823, 108266, 113153, 118735, 124870, 131031, 136941, 142633, 147930, 152448, 156060, 158770, 160248, 160047, 158236, 155271, 151319, 146266, 140257, 133668, 126715, 119634, 113064, 107577, 102967, 98652, 94578, 91058, 87970, 84927, 82056, 79786, 77910, 75777, 73384, 71389, 70002, 68710, 67227, 65899, 64999, 64371, 63935, 63838, 63982, 64062, 64184, 64717, 65479, 65840, 65693, 65573, 65632, 65390, 64653, 63914, 63565, 63471, 63608, 64301, 65475, 66402, 66624, 66537, 66672, 66951]
54633F6951O7j99k76j34L26R98J307Q76J48k56l95n45m73O6O08O13M20O33J061
54614G1796J111Q66Q39R96R85R92J448K132K464K441K474K525K330K138K358K754
54598A00649K817K674K736K800K450K031K218K839L158L108L228L553L625L547
54584A41433L858M399M279L170J649J84j320k822l902m464m907n423n738n704
54570A24692n509n234m752m162l732l407k912k314j957j855j718j479j307j186
54556H3168j029r83j116j072n60M8K94L78O58P80K22n66n86K69J076J185P86K58
54538H3210k26m30k43j12o04j486j987j897j681j605j496j348j396j547j489j317
54522F4346j337j409j152p39o79r09q79n01k20k00j77j03j27p5K99O52M56p0l17
$$ y = [66951, 67018, 66819, 66543, 66409, 66735, 67733, 69040, 69916, 70064, 69808, 69413, 68868, 68395, 68461, 69069, 69682, 70102, 70735, 71796, 72907, 73773, 74612, 75608, 76593, 77585, 79033, 81165, 83629, 86070, 88544, 91069, 93399, 95537, 97895, 100649, 103466, 106140, 108876, 111676, 114126, 116157, 118375, 121214, 124372, 127480, 130708, 134261, 137886, 141433, 145291, 149690, 153969, 157139, 158788, 158972, 157652, 154830, 150928, 146464, 141557, 136134, 130396, 124692, 119183, 113949, 109197, 105035, 101303, 97896, 94984, 92670, 90713, 88858, 87140, 85661, 84354, 83168, 82139, 81156, 80040, 78968, 78408, 78456, 78750, 79128, 79786, 80566, 80788, 80222, 79636, 79905, 80981, 82166, 82952, 83210, 82984, 82554, 82311, 82199, 81595, 80109, 78122, 76225, 74544, 72939, 71443, 70095, 68699, 67152, 65663, 64346, 63009, 61600, 60448, 59709, 59030, 58121, 57242, 56741, 56521, 56321, 56144, 56041, 55914, 55839, 56138, 56790, 57246, 57176, 56859]
54503E6859l77p94j333j161k31N39O61N55N40L70O5J25O10Q97P02M93O14Q45J065
54484F1044J500K032K101J667J363J468J528J360J469K030K334J871J170R56J066
54469H4959Q61J99n60j178j677k128k559k892k878k400j864j747j869j662j179
54454F1426j032j337j500j242r48q17n04P3L50L6l85m17k77l45n17n65n65n86
54436E0848l97J08O01P66O79N45M34M53O63P68M09j44k12L23Q53R89R26Q10M75
54417E9897K9q5J24J43j06r4L15N66M61N38R95J098L50n74p84l57N4K17K31J7
54397F3035m42p51o21l68l73m89m22k85k75k37l8O6r4k08k3J69K5k83m53n52o75
54376E6706n64q6L28K92M3J3J23Q0p8j67k43l19j01N17J074J119Q47O23L92J3
$$ y = [56859, 56482, 55688, 54355, 53194, 52963, 53502, 54163, 54718, 55258, 55628, 55693, 55818, 56428, 57325, 58027, 58520, 59134, 59979, 61044, 62544, 64576, 66677, 68344, 69707, 71175, 72703, 74063, 75532, 77562, 79896, 81767, 82937, 83893, 84959, 85820, 86019, 85459, 84281, 82604, 80476, 77917, 75025, 72147, 69747, 67883, 66136, 64267, 62605, 61426, 60394, 59057, 57557, 56315, 55367, 54550, 54046, 54119, 54469, 54505, 54120, 53703, 53426, 53081, 52564, 51999, 51434, 50848, 50451, 50559, 51160, 51926, 52605, 53150, 53584, 54037, 54700, 55468, 55877, 55733, 55521, 55844, 56697, 57686, 58612, 59422, 59897, 59926, 59841, 59965, 60108, 60002, 59908, 60223, 60789, 61250, 61788, 62783, 63881, 64231, 63657, 62873, 62516, 62570, 62787, 63018, 63035, 62593, 61842, 61221, 60853, 60480, 59991, 59569, 59284, 59009, 58772, 58734, 58800, 58706, 58498, 58475, 58644, 58669, 58386, 57933, 57381, 56706, 56142, 56056, 56384, 56676, 56719, 56732, 56855, 56935, 56857, 56690, 56447, 56128, 56027, 56544, 57618, 58737, 59584, 60207, 60599, 60612]
54356F0612k03O9N30O84N71N31N33L57J67L19P39J089J327J597J743J497J037
54339G3199Q03Q69R83J089J305J494J359R97Q40R77J013O84K42M5R0P2j96n89
54321H5276q10p40n94p19j179j662j852j711j400j094r13q53p60n57m72p65j259
54304F7936j438j081m74L8L35L98K23j7r1OJ47L89P94J053P88K29JK52N92Q59
54284G0939J268J683J600J028O88R74J397J430J271J324J511J531J354J052N38
54269H9588j39o82r70j171j280j096q49j105j836k254j972j568j580j732j620
54254F9734j472j589j702j516j312j381j422j146r07j088j369j292j025r34q64
54239E0715n81l85n67p46m90j62l28p20o64j96R2O8P5J34k0k62k47p2j18k72j73
$$ y = [60612, 60409, 60478, 61008, 61692, 62263, 62794, 63327, 63684, 63851, 64170, 64909, 65998, 67325, 68922, 70665, 72162, 73199, 74002, 74871, 75854, 76943, 78248, 79742, 81101, 82098, 82938, 83915, 84928, 85612, 85854, 85899, 85989, 86061, 85865, 85276, 84466, 83726, 83132, 82413, 81234, 79572, 77720, 76009, 74609, 73515, 72602, 71749, 70989, 70432, 69960, 69195, 67936, 66498, 65417, 64943, 64981, 65316, 65714, 65937, 65920, 65829, 65835, 65982, 66371, 67165, 68218, 69006, 69235, 69236, 69488, 70080, 70939, 72207, 73890, 75490, 76518, 77206, 78180, 79577, 81007, 82278, 83602, 85113, 86644, 87998, 89050, 89588, 89449, 88767, 87797, 86626, 85346, 84250, 83401, 82296, 80460, 78206, 76234, 74666, 73086, 71354, 69734, 68262, 66673, 64971, 63455, 62143, 60762, 59340, 58194, 57287, 56199, 54830, 53538, 52513, 51579, 50715, 50134, 49749, 49182, 48436, 47946, 47784, 47456, 46736, 46072, 45876, 45968, 46036, 46111, 46245, 46225, 45963, 45716, 45644, 45526, 45254, 45081]
54218D5081L0q8l51j84L42N17J56j21P7L72L41J71K14M06M67L45J97J54K91N73
54198D8990P59O35L23J67K49L24J88o3k30k28j29j09k81n06m88j71J87L87M58
54179E0462L59n7n95p27l22Q6J20J09M32P70O29J63j13j45k83o04q51q85p44m14
54159D7390k0O6k66m98j76L35L73kj35K12O00O35L64J3k39k39J8K31J23k23n66
54138D7996q40r57o96j29K15L9k42j82n1k89o55n95j86M0j2k0L4j06l48l69k22
54117D2425k02k25J2L78M60K77K11K53P9k67m05l23l58m99l62O7L65L41K18R0
54097D2535j61m18l89j46p4j85q6L58Q21J023R40N16k47r39j042o40l09k82k86
54078D0989j68q4n7Q2K54K01LNJ97K77K65M44O94N64M6l56m02l48l24j36J91L27
$$ y = [45081, 45111, 45023, 44672, 44488, 44830, 45347, 45503, 45382, 45459, 45831, 46172, 46343, 46557, 46963, 47430, 47775, 47972, 48126, 48417, 48990, 49749, 50384, 50707, 50874, 51123, 51447, 51635, 51572, 51342, 51114, 50985, 50876, 50595, 50089, 49601, 49430, 49617, 50004, 50462, 50821, 50764, 50169, 49442, 49120, 49206, 49326, 49435, 49867, 50637, 51266, 51429, 51316, 51171, 50888, 50284, 49433, 48548, 47804, 47390, 47370, 47436, 47170, 46672, 46496, 46831, 47204, 47202, 47067, 47279, 47879, 48514, 48878, 48891, 48652, 48413, 48431, 48662, 48785, 48562, 47996, 47156, 46199, 45503, 45374, 45589, 45628, 45386, 45204, 45153, 44864, 44209, 43614, 43428, 43468, 43456, 43436, 43470, 43364, 43016, 42647, 42425, 42223, 41998, 42010, 42388, 42848, 43125, 43336, 43589, 43668, 43401, 42996, 42673, 42315, 41816, 41454, 41521, 41886, 42227, 42445, 42535, 42374, 41956, 41567, 41421, 41347, 41162, 41076, 41434, 42255, 43278, 44218, 44734, 44487, 43548, 42506, 41866, 41557, 41275, 40989, 40821, 40737, 40680, 40762, 41016, 41217, 41220, 41225, 41422, 41699, 41964, 42408, 43102, 43666, 43712, 43356, 42954, 42606, 42282, 42146, 42337, 42664]
54056D2664K23K06L12J81k63n77m78j77Q4K80L13N3k28r3K88L05o4j33L04N11
54036D3711m4q40j103q88p62q72q61m81J90Q85J198P88j57q88q65l11J90L61K95
54017C9546J33jL1K41M50N23N00M64M42M60M31J37m41q18m78M23J184J415J277
53998D5919R44L90k42n83m94j60L09Q86J277J106N81L47N36O00K56jK82Q41J180
53979E3974J312J494J676J624J366J185J291J684K137K318K094J815J892K164
53965G8026K107J681J434J611J813J720J579J692J880J844J662J564J509J304
53951A01426Q60J89n69j023q14j68J84j37p87j260j451j466j350j215j258j408
53935H9753j380j170j124j336j476j370j255j228r91m35L7O2j84l77n01o16n75
$$ y = [42664, 42887, 43093, 43405, 43586, 43323, 42746, 42268, 42091, 42175, 42455, 42768, 42821, 42593, 42500, 42788, 43093, 43029, 42896, 43200, 43711, 43667, 42827, 41724, 40836, 40074, 39202, 38341, 37860, 38050, 38935, 40133, 40921, 40764, 39876, 39011, 38700, 38890, 39251, 39546, 39679, 39678, 39709, 39950, 40400, 40923, 41423, 41887, 42329, 42789, 43220, 43357, 42916, 42098, 41620, 42043, 43227, 44642, 45919, 46863, 47253, 47011, 46428, 45934, 45774, 46083, 46969, 48246, 49352, 49933, 50280, 50816, 51416, 51672, 51671, 51953, 52794, 53974, 55286, 56780, 58456, 60080, 61446, 62631, 63922, 65606, 67743, 70061, 72155, 73970, 75862, 78026, 80133, 81814, 83248, 84859, 86672, 88392, 89971, 91663, 93543, 95387, 97049, 98613, 100122, 101426, 102286, 102475, 101906, 100883, 100069, 99901, 100085, 99948, 99161, 97901, 96450, 94984, 93634, 92419, 91161, 89753, 88373, 87203, 86079, 84743, 83267, 81897, 80642, 79414, 78423, 77988, 78025, 78087, 77903, 77526, 77025, 76409, 75834]
53918G5834l33j63k28k98j57O9J90K68L76L96L24L15L39J66q7K6M82O28J43l85
53898G7905l18J24L24K13J52K22K36J89K10K34J61J61L89O20N96N14P88J396J918
53879H6034K085J940J578J105P68P95J084J277J122O68J72q0k9L6k14o65q35n29
53861I6312p3J87L10N03P78J049J328J600J814K032K374K692K686K369K051J857
53845A19869J645J496J666K018K063J799J805K262K536K122J366P96L30l05q83
53830A40585j054r67r90j097j091j092j360j827k283k692k959k786k197j835k139
53815A14216k614k543k036j775j875j800j358j058j362k039k525k528k175j782
53801H6746j535j376j156r26r05j102j262j259j208j108q10m80n74j066j229o52
$$ y = [75834, 75501, 75338, 75110, 74812, 74655, 74724, 74914, 75182, 75558, 75954, 76278, 76593, 76932, 77098, 77011, 77037, 77519, 78147, 78290, 77905, 77587, 77711, 78035, 78248, 78400, 78622, 78858, 79047, 79257, 79491, 79652, 79813, 80202, 80822, 81418, 81932, 82720, 84116, 86034, 88119, 90059, 91637, 92742, 93510, 94305, 95389, 96666, 97788, 98456, 98628, 98548, 98519, 98555, 98341, 97676, 96841, 96312, 96239, 96426, 96736, 97239, 98017, 99066, 100394, 101994, 103808, 105840, 108214, 110906, 113592, 115961, 118012, 119869, 121514, 123010, 124676, 126694, 128757, 130556, 132361, 134623, 137159, 139281, 140647, 141443, 141773, 141468, 140585, 139531, 138564, 137574, 136477, 135386, 134294, 132934, 131107, 128824, 126132, 123173, 120387, 118190, 116355, 114216, 111602, 109059, 107023, 105248, 103373, 101573, 100215, 99157, 97795, 95756, 93231, 90703, 88528, 86746, 85211, 83835, 82679, 81753, 80848, 79746, 78484, 77225, 76017, 74909, 74099, 73619, 73045, 71979, 70750, 70098]
53785G0098N8J08l78o81n72m81o69r17r78q75p00m72k23JJ92K77J63l6j8K42L94
53764F4533K52R1J60K87K56J85K13K01O7N2K78M25K83J64L51N73M89L34N01Q54
53744G0549J000R87J109J354J513J598J663J479R64N91Q54J549K124K462K727
53729I2523K734K213J468J114J256J487J581J576J384R05M66M91Q15Q98O39L82
53713A11932K46K9k53l41k79l75o37q11r14j195j559j580j169p28n88p44j073
53696I9961j391j337o94J66O13N02J66j78m79n37k35J4l24j043j401j207r90j049
53678I0557j059q01n93p01q69p58m35j07J75L60K90nk31k22j25n4R2L62N76O24
53658H7076O12O12N52M58M80O08O34M95M14N75R26J314J608J694J608J617J863
$$ y = [70098, 70156, 70264, 69886, 69205, 68633, 68152, 67483, 66566, 65588, 64713, 64013, 63541, 63318, 63319, 63511, 63788, 63951, 63915, 63897, 64139, 64533, 64785, 64876, 65036, 65323, 65579, 65764, 65977, 66178, 66245, 66297, 66575, 67000, 67283, 67447, 67798, 68371, 68860, 69194, 69695, 70549, 71549, 72536, 73645, 74999, 76512, 78110, 79773, 81252, 82216, 82807, 83661, 85210, 87334, 89796, 92523, 95257, 97470, 98938, 100052, 101308, 102795, 104376, 105952, 107336, 108241, 108707, 109198, 110013, 110911, 111550, 111932, 112178, 112207, 111954, 111613, 111334, 110959, 110322, 109511, 108597, 107402, 105843, 104263, 103094, 102366, 101778, 101034, 99961, 98570, 97233, 96539, 96705, 97318, 97820, 97986, 97808, 97329, 96792, 96557, 96571, 96247, 95204, 93803, 92596, 91606, 90557, 89498, 88697, 88104, 87403, 86534, 85776, 85341, 85234, 85409, 85769, 86059, 86054, 85823, 85601, 85476, 85422, 85514, 85876, 86452, 87076, 87688, 88300, 88852, 89310, 89790, 90398, 91032, 91527, 91941, 92516, 93442, 94756, 96364, 98058, 99666, 101283, 103146]
53641A03146K047J817J383J330J766K205K307K320K550K859K904K606K163J781
53627A33184J573J541J558J461J305J324J630K032K269K230K018J836J786J747
53613A57494J542J240J085J083R72P11O32Q86J092Q91M89K96L14K85K06K18K44
53596A69680J64J03J81J88o3l68m78m98n67m78j79j34o25j092r15m40m38q47r31
53577A62263n08p0J55L77N08J78m52p23m61q8K06O25J014Q77L64K77Q54J361J261
53558A68018R43R19J066J144J374J923K398K415K193K198K479K786K991L085L075
53543A99007L146L527M032M149L824L640M000M522M616M231L720L380L326L535
53529B52655L756L700L540L737M289M560M132L398L009L125L464L787M000M042
$$ y = [103146, 105193, 107010, 108393, 109723, 111489, 113694, 116001, 118321, 120871, 123730, 126634, 129240, 131403, 133184, 134757, 136298, 137856, 139317, 140622, 141946, 143576, 145608, 147877, 150107, 152125, 153961, 155747, 157494, 159036, 160276, 161361, 162444, 163416, 164127, 164759, 165645, 166737, 167628, 168117, 168413, 168727, 169012, 169218, 169436, 169680, 169844, 169947, 170128, 170316, 170253, 169885, 169407, 168909, 168342, 167864, 167685, 167551, 166926, 165834, 164919, 164479, 164041, 163194, 162263, 161755, 161685, 161840, 162217, 162725, 162903, 162451, 161728, 161267, 161179, 161385, 162010, 163024, 163901, 164265, 164542, 165396, 166757, 168018, 168961, 169880, 170946, 172090, 173464, 175387, 177785, 180200, 182393, 184591, 187070, 189856, 192847, 195932, 199007, 202153, 205680, 209712, 213861, 217685, 221325, 225325, 229847, 234463, 238694, 242414, 245794, 249120, 252655, 256411, 260111, 263651, 267388, 271677, 276237, 280369, 283767, 286776, 289901, 293365, 297152, 301152, 305194]
53515C05194L894L586L106K500K020J892J963J933J830J830J747J256N72K13J72
53500C33708n1n39p92o05l84m50o71r32j302j565j360r34r91j526j697j148n71
53483C18190n74p69n95k02L2J86L85L45l1j87K96R93J326J450J793K229K422K538
53465C29827K907L362L582L746M156M579M618M509M829N596O333O858P391Q000
53451D00293Q516Q927R342R693R940J0408J1382J2522J3211J3411J3703J4433
53439E35781J5300J5844J5966J5958J6187J6800J7560J8073J8262J8436J8812
53428G22979J9256J9608J9907K0124K0092J9898J9951K0392K0831K1026K1238
53417I45302K1667K1998K2001K2008K2271K2303K1555K0344J9421J8856J8070
$$ y = [305194, 309088, 312674, 315780, 318280, 320300, 322192, 324155, 326088, 327918, 329748, 331495, 332751, 333323, 333536, 333708, 333657, 333118, 332326, 331721, 331337, 330887, 330216, 329284, 327982, 326417, 325057, 324123, 323132, 321606, 319909, 318761, 318190, 317616, 316847, 316252, 316050, 316082, 316268, 316653, 316998, 316967, 316780, 317076, 318069, 319395, 320845, 322638, 324867, 327289, 329827, 332734, 336096, 339678, 343424, 347580, 352159, 356777, 361286, 366115, 371711, 378044, 384902, 392293, 400293, 408809, 417736, 427078, 436771, 446711, 457119, 468501, 481023, 494234, 507645, 521348, 535781, 551081, 566925, 582891, 598849, 615036, 631836, 649396, 667469, 685731, 704167, 722979, 742235, 761843, 781750, 801874, 821966, 841864, 861815, 882207, 903038, 924064, 945302, 966969, 988967, 1010968, 1032976, 1055247, 1077550, 1099105, 1119449, 1138870, 1157726, 1175796]
53406A175796J6820J5505J4480J3654J2816J1923J1064J0418J0164J0190J0067
53395A312897R537Q808Q130P337O181M752L240J597j80j766k978m189n820p679
53381A339867r297j0671j2104j3598j4930j6104j7216j8111j8663j9152j9843
53370A170178k0444k0539k0326k0335k0587k0684k0476k0108j9533j8632j7665
53359I50849j6932j6160j4841j3115j1616j0467r156p427n603l924k204l20J487
53346H40571L045M512O042P614R270J1063J2781J4097J5117J6319J7847J9297
53334I77575K0334K1110K1895K2749K3701K4966K6654K8519L0177L1474L2595
53323A261749L3886L5607L7682L9745M1546M3183M4810M6294M7416M8183M8724
$$ y = [1175796, 1192616, 1208121, 1222601, 1236255, 1249071, 1260994, 1272058, 1282476, 1292640, 1302830, 1312897, 1322434, 1331242, 1339372, 1346709, 1352890, 1357642, 1360882, 1362479, 1362299, 1360533, 1357555, 1353366, 1347546, 1339867, 1330570, 1319899, 1307795, 1294197, 1279267, 1263163, 1245947, 1227836, 1209173, 1190021, 1170178, 1149734, 1129195, 1108869, 1088534, 1067947, 1047263, 1026787, 1006679, 987146, 968514, 950849, 933917, 917757, 902916, 889801, 878185, 867718, 858562, 851135, 845532, 841608, 839404, 839084, 840571, 843616, 848128, 854170, 861784, 871054, 882117, 894898, 908995, 924112, 940431, 958278, 977575, 997909, 1019019, 1040914, 1063663, 1087364, 1112330, 1138984, 1167503, 1197680, 1229154, 1261749, 1295635, 1331242, 1368924, 1408669, 1450215, 1493398, 1538208, 1584502, 1631918, 1680101, 1728825]
53312A728825M9054M9248M9566N0042N0215M9687M8740M7899M7048M5563M3225
53301B259112M0512L7952L5712L3804L2264L0923K9423K7568K5387K2942K0197
53290B595796J7138J3712R823N628J537k419o982j2909j9975k7139l3536l8870
53278B501804m3031m5995m8058m9612n0728n1348n1766n2331n2834n2815n2426
53267A950860n2241n2291n1987n1148n0305m9808m9251m8137m6504m4621m2573
53256A411994m0463l8554l6866l4988l2641l0064k7620k5336k3117k1082j9381
53245A081882j7849j6193j4352j2506j0826r340p918o371m728l340k513k050j538
53232I72358r25m39J9Q61K116L252L897M385N290O745Q446J0049J1460J2841J4489
$$ y = [1728825, 1777879, 1827127, 1876693, 1926735, 1976950, 2026637, 2075377, 2123276, 2170324, 2215887, 2259112, 2299624, 2337576, 2373288, 2407092, 2439356, 2470279, 2499702, 2527270, 2552657, 2575599, 2595796, 2612934, 2626646, 2636469, 2642097, 2643634, 2641215, 2634233, 2621324, 2601349, 2574210, 2540674, 2501804, 2458773, 2412778, 2364720, 2315108, 2264380, 2213032, 2161266, 2108935, 2056101, 2003286, 1950860, 1898619, 1846328, 1794341, 1743193, 1692888, 1643080, 1593829, 1545692, 1499188, 1454567, 1411994, 1371531, 1332977, 1296111, 1261123, 1228482, 1198418, 1170798, 1145462, 1122345, 1101263, 1081882, 1064033, 1047840, 1033488, 1020982, 1010156, 1000816, 992898, 986527, 981799, 978459, 975946, 973896, 972358, 971433, 970994, 971013, 971874, 973990, 977242, 981139, 985524, 990814, 997559, 1006005, 1016054, 1027514, 1040355, 1054844]
53217A054844J6473J8384J9662K0225K0492K0772K1013K1125K1230K1431K1683
53206A277334K1950K2176K2090K1386K0234J9246J8740J8387J7749J6832J5910
53195A492034J5055J4020J2515J0444P980N419K902L02k443n119p583j0149j3229
53182A522148j6675j9884k2494k4604k6313k7582k8582k9687l0923l1823l1969
53171A231612l1441l0619k9838k9298k9029k8812k8398k7875k7574k7653k7991
53160I13084k8422k8774k8758k8253k7588k7145k6744k5869k4454k2942k1623
53149F22512k0422j9314j8444j7708j6800j5719j4759j3938j2992j2011j1438
53138D48967j1346j1269j0949j0636j0502j0303r904r575r459r262q771q243p946
$$ y = [1054844, 1071317, 1089701, 1109363, 1129588, 1150080, 1170852, 1191865, 1212990, 1234220, 1255651, 1277334, 1299284, 1321460, 1343550, 1364936, 1385170, 1404416, 1423156, 1441543, 1459292, 1476124, 1492034, 1507089, 1521109, 1533624, 1544068, 1552048, 1557467, 1560369, 1560671, 1558228, 1553109, 1545526, 1535377, 1522148, 1505473, 1485589, 1463095, 1438491, 1412178, 1384596, 1356014, 1326327, 1295404, 1263581, 1231612, 1200171, 1169552, 1139714, 1110416, 1081387, 1052575, 1024177, 996302, 968728, 941075, 913084, 884662, 855888, 827130, 798877, 771289, 744144, 717400, 691531, 667077, 644135, 622512, 602090, 582776, 564332, 546624, 529824, 514105, 499346, 485408, 472416, 460405, 448967, 437621, 426352, 415403, 404767, 394265, 383962, 374058, 364483, 355024, 345762, 336991, 328748, 320802]
53125C20802p815p763p910q216q304p957p416o993o740o686o874o982o483n438
53111B19225m610m498m776n000n185n306m948l984l058k778k881k791k545k516
53097A64349k582k362j982j895k076k027j549r16l67R2L72L27Q5q4j98m53p23
53080A48011o05l3N71Q10P01N01M04M50M94L14j09m69n21m65o69j079j275j067
53062A45964p65p91j206j706j944j802j483j280j278j287j174j051j077j196j254
53047A26670j246j305j503j744j851j688j353j150j258j437j305q83n54n20o01
53032A08272o82r16j359j689j633j321j102j133j337j515j413r37l92k33m51n79
53016I1580l98k26l20m87m94m80n82o21m44k81l31m04l14k91n80q95p84k66K73
$$ y = [320802, 312987, 305224, 297314, 289098, 280794, 272837, 265421, 258428, 251688, 245002, 238128, 231146, 224663, 219225, 214615, 210117, 205341, 200341, 195156, 189850, 184902, 180918, 177860, 175082, 172201, 169410, 166865, 164349, 161767, 159405, 157423, 155528, 153452, 151425, 149876, 148960, 148593, 148685, 149057, 149384, 149469, 149385, 149187, 148734, 148011, 147406, 147373, 147944, 148754, 149455, 149956, 150360, 150810, 151304, 151618, 151509, 151040, 150519, 150054, 149385, 148306, 147031, 145964, 145199, 144408, 143202, 141496, 139552, 137750, 136267, 134987, 133709, 132422, 131248, 130197, 129120, 127924, 126670, 125424, 124119, 122616, 120872, 119021, 117333, 115980, 114830, 113572, 112135, 110830, 109947, 109393, 108873, 108272, 107590, 106674, 105315, 103626, 101993, 100672, 99570, 98437, 97100, 95585, 94172, 93235, 92843, 92610, 92159, 91580, 91182, 90956, 90636, 90149, 89655, 89175, 88593, 87972, 87528, 87247, 86916, 86512, 86198, 85907, 85327, 84432, 83648, 83382, 83655]
52997H3655O39Q49Q19N07J87J91L73L04j44o51r03q16m34P4M28M73L72L43L34
52978H6600J87j4m3J32L20L36O8m85j039j161p90l81k88l30k38k06n21r48r84
52959H0215n91k13j21k08l37m78m99k16K82O62P23N74M45M46M97L74n8n23n36
52940H0438l9M46N32M77O92J089J313J358J427J466J337J242J464J799J806J497
52924I8344J253J126P97K84M3K57M93K79l19q94j161j066p34m42m55p11r08q89
52906I5297q05q21r07r35q42o17l77l31n51p75p01l82j27k0J26L67M90L60J51
52887H8600J48M42Q99J240J180O45o5n01m54r0K64L43Q6l16n67n32l59k26j46
52868I0591j23k25m18m76l14j77k65l94k74L6K39K71L53O06Q60Q54M89o4m49m17
$$ y = [83655, 84294, 85143, 85962, 86469, 86656, 86847, 87220, 87524, 87380, 86729, 85826, 85010, 84576, 84650, 85078, 85551, 85923, 86266, 86600, 86787, 86773, 86730, 86862, 87182, 87518, 87586, 87101, 86062, 84901, 84111, 83730, 83442, 83112, 82874, 82668, 82147, 81199, 80215, 79624, 79411, 79290, 79082, 78745, 78267, 77768, 77552, 77834, 78496, 79219, 79793, 80238, 80684, 81181, 81555, 81497, 80974, 80438, 80399, 80845, 81377, 81854, 82546, 83635, 84948, 86306, 87733, 89199, 90536, 91778, 93242, 95041, 96847, 98344, 99597, 100723, 101520, 101804, 101847, 102104, 102597, 102876, 102557, 101663, 100502, 99436, 98702, 98260, 97805, 97094, 96186, 95297, 94492, 93671, 92764, 91829, 90987, 90370, 89993, 89662, 89111, 88336, 87635, 87253, 87126, 87106, 87232, 87599, 88089, 88449, 88600, 88748, 89190, 90089, 91329, 92509, 93154, 93089, 92588, 92134, 92044, 92308, 92651, 92737, 92421, 91854, 91322, 90963, 90737, 90591, 90468, 90243, 89825, 89349, 89035, 88858, 88593, 88199, 87925, 87961, 88200, 88471, 88824, 89430, 90290, 91144, 91633, 91569, 91120, 90703]
52848I0703j47m7k33l93k93l5K24N30Q51R76Q95R19J085R43K84l19k27L93Q58
52829I6967Q81O92N05L68L28K96L0l98m20K08P90N98K8N6P66J279J129Q56J033
52810A05992J491J751J648J291Q64O63R43J497J784J534R76M53J80K46M94M36
52794A22243j99r67j207r85r02j099j118q07n66o12o55n21m59n42m40o6J18j51
52776A11065m44l13j9j54p98j474j704j367o88j30m8l37o00o93q11j003j052r10
52758I8520q29q77q13n85m83o23p09n69m56n60o65n56m30m99o42o90p53r39j077
52739H5765j052j031j086r43m82q0r6k99l01k20m35q65j004o45j21J39K7l12o34
52720G6325p42o31m90m46m31l74l48l47k20J4L4l20p09p29n14m90p00p59m75j31
$$ y = [90703, 90556, 90509, 90276, 89883, 89590, 89555, 89779, 90309, 91160, 92136, 93031, 93950, 95035, 95978, 96262, 95943, 95716, 96109, 96967, 97848, 98540, 99045, 99413, 99741, 100037, 100067, 99669, 99249, 99457, 100247, 100845, 100873, 100929, 101695, 102974, 104103, 104959, 105992, 107483, 109234, 110882, 112173, 113037, 113700, 114643, 116140, 117924, 119458, 120434, 120887, 121067, 121313, 121807, 122243, 122044, 121077, 119870, 118885, 117983, 116884, 115766, 114959, 114393, 113781, 113126, 112605, 112146, 111604, 111164, 111098, 111216, 111065, 110621, 110308, 110289, 110135, 109337, 107863, 106159, 104792, 104104, 103974, 103926, 103589, 102989, 102296, 101485, 100482, 99430, 98520, 97691, 96814, 96001, 95416, 94933, 94310, 93601, 93032, 92576, 92016, 91351, 90795, 90365, 89866, 89224, 88534, 87781, 86842, 85765, 84713, 83682, 82596, 81653, 81171, 81091, 80995, 80696, 80395, 80175, 79740, 78875, 77871, 77226, 77105, 77244, 77271, 76959, 76325, 75583, 74952, 74462, 74016, 73585, 73211, 72863, 72516, 72296, 72310, 72344, 72024, 71315, 70586, 70072, 69582, 68882, 68123, 67648, 67517]
52700F7517n8k30m01m36l87l64m52o43q50r48r06q25q33q98q57o11l09k02k85
52681E7022k91j06L8n0j58J9L33L77P6j96j36J89N61Q42R40Q58P63P86Q09O70
52661F3346N12N93Q26Q82P28O39P08P49O70N41L06j30n42n98m83p07j293j696
52643F5051j666j545j559j443j103r29j083j106o78k46l45p55r09p53o13n16k61
52626D9541L7O3j30k32k40m25p46q39n62k32j61l17n08o66p79p50m76l1K97K32
52606D3076j72n17n15l71m52o88o61k86N1J09J08K47L63L08K67L72M25K82J38
52587D2084J27J7l17m68m1O66R95P98M77L23K57J80J80K99M25M20K49k5k60l44
52567D6042l48m14m39j75K91N39M16K61L23L68J94N7K41N35N90M50L33J68j45
$$ y = [67517, 67459, 67229, 66828, 66392, 66005, 65641, 65189, 64546, 63696, 62748, 61842, 61017, 60184, 59286, 58429, 57818, 57509, 57307, 57022, 56731, 56625, 56663, 56613, 56455, 56474, 56807, 57184, 57260, 57064, 56928, 57117, 57678, 58520, 59460, 60318, 61081, 61867, 62676, 63346, 63858, 64451, 65277, 66159, 66887, 67526, 68234, 68983, 69653, 70194, 70500, 70370, 69828, 69230, 68747, 68040, 66747, 65051, 63385, 61840, 60281, 58838, 57735, 56806, 55723, 54617, 53939, 53693, 53348, 52593, 51684, 50931, 50318, 49802, 49541, 49578, 49641, 49511, 49279, 49039, 48614, 47868, 47029, 46467, 46235, 46074, 45757, 45249, 44583, 43804, 43054, 42578, 42547, 42844, 43076, 42904, 42387, 41872, 41501, 41049, 40361, 39700, 39414, 39465, 39574, 39682, 39929, 40292, 40600, 40867, 41239, 41664, 41946, 42084, 42211, 42228, 41911, 41443, 41402, 42068, 43063, 43861, 44338, 44661, 44918, 45098, 45278, 45577, 46002, 46422, 46671, 46646, 46386, 46042, 45694, 45280, 44841, 44666, 44957, 45496, 45912, 46173, 46496, 46864, 47058, 47115, 47356, 47891, 48481, 48931, 49264, 49432, 49287]
52548D9287l50j57K35M24M25N00O26N72L92K85K28J20J44M97Q87Q67N41M00N40
52529E6463N75L44J24J19K06K53K95L12K38J83L18N98Q70J171J496J454O98l24
52511F5393o62J4J041J633J588J081L31k84l12K47P90Q28N46M40N88O56M28O6
52493G4412j19j5J79J62q0k04O3M92O09L08n2j54m4O9M8j76n32p19m75j2J61r9
52471G3822l77l04l7P6K0N4K86N69P19O81N04K82J03Lo5j40j96j22J73N90Q12
52450G7453N91J42m0J92M53L95J88J89L64M46M35N30O92P01N89N98P42P94O77
52431H6131N34L58M1k07N6Q17J411J233M16l68o28l52J48N24N96M06R5k59o02
52412I0350p93p64o62o76p43p02o10o40p50p51o57o33o44n48m58n99q03o41j66
$$ y = [49287, 48937, 48780, 49015, 49439, 49864, 50364, 50990, 51562, 51954, 52239, 52467, 52587, 52731, 53228, 54115, 54982, 55523, 55923, 56463, 57038, 57382, 57506, 57625, 57831, 58084, 58379, 58691, 58929, 59112, 59430, 60028, 60898, 62069, 63565, 65019, 65717, 65393, 64731, 64745, 65786, 67419, 69007, 70088, 70419, 70135, 69823, 70070, 70860, 71688, 72234, 72674, 73262, 73918, 74346, 74412, 74293, 74278, 74457, 74619, 74539, 74335, 74398, 74890, 75499, 75807, 75755, 75601, 75557, 75626, 75674, 75498, 74966, 74247, 73772, 73760, 73921, 73822, 73445, 73141, 73104, 73180, 73200, 73254, 73540, 74109, 74828, 75509, 76013, 76295, 76398, 76401, 76336, 76196, 76000, 75878, 76051, 76641, 77453, 78044, 78186, 78146, 78338, 78791, 79186, 79374, 79563, 79927, 80373, 80808, 81338, 82030, 82731, 83320, 83918, 84660, 85454, 86131, 86665, 87023, 87064, 86857, 86913, 87730, 89141, 90374, 90790, 90422, 89794, 89442, 89590, 90114, 90710, 91116, 91211, 90952, 90350, 89557, 88793, 88131, 87455, 86712, 86010, 85400, 84760, 84010, 83259, 82602, 81969, 81325, 80777, 80319, 79720, 78917, 78276, 78110]
52393G8110J2l87q68q89o23n58o89o15k44N8L1j35j51k8K1o3j37n6J24K62L27
52372G3502L56K84l9n14p18l65K59N84M30J35N2J52K04J21Ml6J3M3l7j20LK77
52350G4590L21m3l92j88M79J005J078R15P38M75J00j22PL43O20P42P16N68M60
52331H2412O27J044J362J338J132J006J002J032J102J231J315J281J198J099Q80
52316I9061N11K07J74L35M67N02M97M81M94O84J132J609J758J517J167R73R30
52299A12499R27R93J204J475J584J432J171R70Q21O88P32J128J685J930J710J406
52283A32355J377J489J397J124J008J196J492J655J615J451J348J508J868K058
52269A52941J849J522J491J687J688J361R98Q39Q58J041J433J884K097K012J858
$$ y = [78110, 78122, 77735, 76867, 75978, 75355, 74797, 74108, 73493, 73249, 73307, 73338, 73203, 73052, 73024, 73045, 72982, 72845, 72789, 72913, 73175, 73502, 73858, 74142, 74103, 73589, 72871, 72506, 72765, 73349, 73779, 73914, 73966, 74118, 74322, 74443, 74447, 74411, 74424, 74467, 74430, 74310, 74313, 74590, 74911, 74868, 74476, 74288, 74767, 75772, 76850, 77765, 78503, 78978, 79078, 78956, 78963, 79306, 79926, 80668, 81384, 81952, 82412, 83039, 84083, 85445, 86783, 87915, 88921, 89923, 90955, 92057, 93288, 94603, 95884, 97082, 98181, 99061, 99572, 99779, 99953, 100288, 100755, 101257, 101754, 102235, 102729, 103413, 104545, 106154, 107912, 109429, 110596, 111569, 112499, 113426, 114419, 115623, 117098, 118682, 120114, 121285, 122255, 123076, 123764, 124496, 125624, 127309, 129239, 130949, 132355, 133732, 135221, 136618, 137742, 138750, 139946, 141438, 143093, 144708, 146159, 147507, 149015, 150883, 152941, 154790, 156312, 157803, 159490, 161178, 162539, 163537, 164376, 165234, 166275, 167708, 169592, 171689, 173701, 175559]
52254A75559J716J420R71O77P74J177J744K440L123L454L332L077L057L321L762
52239B09604M329M904N210N156N049N199N496N595N467N441N737O212O583O736
52225B86718O747O699O634O652O911P423P871P876P503P234P349P514P267O689
52211C87087O273O235O318O230N927N471M923M425M101L833L409K858K388J985
52197D51463J433P61K94K14L19L40K27O4r0j40mK36L79L47K24J01R3L93J043J736
52177D59433K143K340K601K902L036L084L376L977M657N301N901O220O001N471
52163E16443N075M818M436M168M543N366N713N214M528M208L905L192K393J972
52149E75974J658R18j58j010j399j501j499j602k139l156m119m496m400m268m210
$$ y = [175559, 177275, 178695, 179666, 180343, 181117, 182294, 184038, 186478, 189601, 193055, 196387, 199464, 202521, 205842, 209604, 213933, 218837, 224047, 229203, 234252, 239451, 244947, 250542, 256009, 261450, 267187, 273399, 279982, 286718, 293465, 300164, 306798, 313450, 320361, 327784, 335655, 343531, 351034, 358268, 365617, 373131, 380398, 387087, 393360, 399595, 405913, 412143, 418070, 423541, 428464, 432889, 436990, 440823, 444232, 447090, 449478, 451463, 452896, 453657, 453951, 454165, 454484, 454824, 455051, 455115, 455025, 454885, 454881, 455117, 455496, 455843, 456067, 456168, 456261, 456654, 457697, 459433, 461576, 463916, 466517, 469419, 472455, 475539, 478915, 482892, 487549, 492850, 498751, 504971, 510972, 516443, 521518, 526336, 530772, 534940, 539483, 544849, 550562, 555776, 560304, 564512, 568417, 571609, 574002, 575974, 577632, 578550, 578392, 577382, 575983, 574482, 572983, 571381, 569242, 566086, 561967, 557471, 553071, 548803, 544593]
52134E44593m127m144m355m437m032l387l031l034l057l033l147l302l114k579
52120D95814k164k164k358k365k089j682j365j274j339j314j120r76j010r71o38
52105D72985k90l48p34j017j077j163j366j470j347j152j008q74p62q03j019j273
52089D57282j486j676j809j805j707j642j627j578j524j561j662j713j718j849
52075D33925k213k723l106l052k484j768j435j588j808j774j712j931k320k573
52061D03438k665k718k631k258j770j451j261r63o08m59n48o26n31k44K10O85
52045C85600Q29N75M52R80J882K443K593K980L967N042N531N341M869M535M672
52030D32291N482O765P923Q488Q560Q520Q546Q569Q536Q544Q692Q936R093R004
$$ y = [544593, 540466, 536322, 531967, 527530, 523498, 520111, 517080, 514046, 510989, 507956, 504809, 501507, 498393, 495814, 493650, 491486, 489128, 486763, 484674, 482992, 481627, 480353, 479014, 477700, 476580, 475604, 474594, 473623, 472985, 472695, 472347, 471613, 470596, 469519, 468356, 466990, 465520, 464173, 463021, 462013, 461139, 460377, 459574, 458555, 457282, 455796, 454120, 452311, 450506, 448799, 447157, 445530, 443952, 442428, 440867, 439205, 437492, 435774, 433925, 431712, 428989, 425883, 422831, 420347, 418579, 417144, 415556, 413748, 411974, 410262, 408331, 406011, 403438, 400773, 398055, 395424, 393166, 391396, 389945, 388684, 387721, 387113, 386654, 386106, 385480, 384949, 384705, 384915, 385600, 386429, 387004, 387456, 388436, 390318, 392761, 395354, 398334, 402301, 407343, 412874, 418215, 423084, 427619, 432291, 437773, 444538, 452461, 460949, 469509, 478029, 486575, 495144, 503680, 512224, 520916, 529852, 538945, 547949]
52016E47949Q726Q490Q347Q029P315O417N756N392M998M357L619K993K443J803
52002F26634J060M09O4lj62q32j957k944l260k972k566k381k449k697k985l101
51986E99858k978k792k657k380j863j441j441j577j287n51J23M85P81J135J331
51971E84746J301J356J680K019K138K186K349K494K419K224K133K086J828J244
51957F12203M69k45o39n85l39m84j324k443l076k978k716l021l979n031n646n847
51941E74319o004o354o879p560q386r187r731j0053j0369j0634j0546j0171j0061
51928D58384j0485j0956j0941j0616j0476j0481j0229r753r496r568r638r541
51916C36204r445r381r106q611q245q149p995p482o715n936n253m752m536m492
$$ y = [547949, 556675, 565165, 573512, 581541, 588856, 595273, 601029, 606421, 611419, 615776, 619395, 622388, 624831, 626634, 627694, 628103, 628167, 628164, 628002, 627170, 625213, 622269, 619009, 616037, 613471, 611090, 608641, 605944, 602959, 599858, 596880, 594088, 591431, 589051, 587188, 585747, 584306, 582729, 581442, 580891, 581014, 581499, 582280, 583415, 584746, 586047, 587403, 589083, 591102, 593240, 595426, 597775, 600269, 602688, 604912, 607045, 609131, 610959, 612203, 612672, 612427, 611788, 611203, 610864, 610380, 609056, 606613, 603537, 600559, 597843, 594822, 590843, 585812, 580166, 574319, 568315, 561961, 555082, 547522, 539136, 529949, 520218, 510165, 499796, 489162, 478616, 468445, 458384, 447899, 436943, 426002, 415386, 404910, 394429, 384200, 374447, 364951, 355383, 345745, 336204, 326759, 317378, 308272, 299661, 291416, 283267, 275272, 267790, 261075, 255139, 249886, 245134, 240598, 236106]
51902B36106m331m033l904m017l997l535k885k517k520k560k318j852j523j690
51888A94424k288k773k642j996j418j280j426j518j420j214j063j106j302j444
51874A71534j480j649k024k200j848j368j412j873k019j647j358j527j756j606
51860A47767j292j188j209j105r42q73p68n14l13l49m03k55j56m33q88j054q77
51843A35148p04o50n07k16k4o8j54r2j1j59n34q48q40n56k75j72j66j15o1n5L0
51822A28971K76M25J96j74j52K83N71M02J13O5J08J5m1J22K64J11r2O7M89P20
51802A32739O73O68Q50R75Q64O35M90M78O08Q86J173J204Q94M54J66P7qk90o99
51783A42837r25p34k63J33K68K52K10J42O9P4J49J73J79L22N60O22M82M59P23
$$ y = [236106, 231775, 227742, 223838, 219821, 215824, 212289, 209404, 206887, 204367, 201807, 199489, 197637, 196114, 194424, 192136, 189363, 186721, 184725, 183307, 182027, 180601, 179083, 177663, 176449, 175386, 174280, 172978, 171534, 170054, 168405, 166381, 164181, 162333, 160965, 159553, 157680, 155661, 154014, 152656, 151129, 149373, 147767, 146475, 145287, 144078, 142973, 142031, 141158, 140390, 139876, 139563, 139214, 138811, 138556, 138400, 137967, 137079, 136025, 135148, 134444, 133794, 133287, 133071, 133047, 132979, 132825, 132733, 132722, 132563, 132029, 131181, 130341, 129785, 129510, 129338, 129172, 129057, 128996, 128941, 128971, 129247, 129672, 129868, 129694, 129542, 129825, 130396, 130798, 130911, 130976, 131084, 131099, 131058, 131180, 131444, 131555, 131463, 131530, 132019, 132739, 133412, 134080, 134930, 135905, 136769, 137404, 137894, 138372, 138980, 139866, 141039, 142243, 143137, 143591, 143757, 143834, 143826, 143536, 142837, 141912, 141178, 140915, 141048, 141316, 141568, 141778, 141920, 141989, 142063, 142212, 142385, 142564, 142886, 143446, 144068, 144550, 145009, 145732]
51764A45732R63P99K69l34q08j027q58m28j66k95m83l42j5P7j24l56n18o95p86
51745A40605n96k57k07n81j014j106q48n05l17l64n63p04n75j84K22L75J90j24
51727A33447j88J88O91P74L50q7j44m0j50l74m05l47n68j006j176q87m79k48l7
51708A29314L98R61J358J439J242Q70N08L23K76J24k43o21p89q32r90j345j740
51691A30253j969j901j529r97n71m20m77n19m65m37n48o74n58j71K01K34n1l30
51673A19071l53j61N0J22j9l32o04o06l68j92k87n19o68p45q77j058j160j156
51655A10138j113j016p74m21j53r5j82k81l36l68l77l74m28n68o26k93M93J290
51637A04516J479R72L67K83O63R51Q16M30J34J53N69J289J989K354K412K418K467
$$ y = [145732, 146695, 147494, 147763, 147429, 146621, 145594, 144736, 144308, 144142, 143847, 143364, 143022, 143007, 143084, 142960, 142604, 142086, 141391, 140605, 140009, 139752, 139545, 138964, 137950, 136844, 135996, 135491, 135174, 134810, 134247, 133543, 132968, 132784, 133006, 133381, 133571, 133447, 133259, 133447, 134138, 134912, 135262, 135175, 135031, 134991, 134841, 134467, 134062, 133715, 133147, 132141, 130965, 130078, 129599, 129351, 129314, 129712, 130673, 132031, 133470, 134712, 135582, 136090, 136413, 136689, 136813, 136570, 135949, 135160, 134328, 133338, 131993, 130253, 128284, 126383, 124854, 123857, 123286, 122866, 122389, 121870, 121405, 120968, 120420, 119746, 119188, 119017, 119218, 119452, 119401, 119071, 118718, 118557, 118607, 118729, 118710, 118378, 117774, 117168, 116800, 116608, 116321, 115802, 115134, 114389, 113512, 112454, 111294, 110138, 109025, 108009, 107235, 106814, 106661, 106566, 106384, 106103, 105767, 105399, 105022, 104648, 104220, 103652, 103026, 102733, 103226, 104516, 105995, 106967, 107334, 107617, 108280, 109231, 110047, 110477, 110611, 110764, 111333, 112622, 114611, 116965, 119377, 121795, 124262]
51620A24262K494K582K873L163L000K313J558J097P76L29k00o55j078j517j831
51605A39166j884j790j691j564j422j440j642j744j554j314j325j498j568j563
51591A17167j751k176k531k448j771p18J42K99j48n86o09m08k43j7L57N88M09
51574A05556N9p7n7j69l56l36j10Q3J88L09L59J96PR2L42M02K88L80P68J056R53
51553A09933O73N77P12Q42P55M72K40L65Q78J412J577J381J148J070J065J030
51537A24130J006J124J483K024K485K607K443K333K438K624K813L082L274L010
51523A56876K306J729J551J313O82J81L70Q21P25J50j49j4J0k09j45M00Q97R85
51505A68479R97J258J513J444J222J178J341J620K002K351K371K065J849J938
$$ y = [124262, 126756, 129338, 132211, 135374, 138374, 140687, 142245, 143342, 144118, 144447, 144247, 143592, 142514, 140997, 139166, 137282, 135492, 133801, 132237, 130815, 129375, 127733, 125989, 124435, 123121, 121796, 120298, 118730, 117167, 115416, 113240, 110709, 108261, 106490, 105772, 105914, 106213, 106065, 105479, 104870, 104462, 104219, 104202, 104559, 105147, 105556, 105615, 105538, 105481, 105312, 104956, 104620, 104510, 104593, 104781, 105090, 105449, 105645, 105652, 105744, 106086, 106488, 106776, 107156, 107924, 108980, 109933, 110606, 111183, 111895, 112737, 113492, 113964, 114204, 114569, 115447, 116859, 118436, 119817, 120965, 122035, 123100, 124130, 125136, 126260, 127743, 129767, 132252, 134859, 137302, 139635, 142073, 144697, 147510, 150592, 153866, 156876, 159182, 160911, 162462, 163775, 164457, 164638, 165008, 165829, 166554, 166704, 166555, 166541, 166551, 166342, 166197, 166597, 167494, 168479, 169476, 170734, 172247, 173691, 174913, 176091, 177432, 179052, 181054, 183405, 185776, 187841, 189690, 191628]
51491A91628K035J823J383Q85L02l38p80r48j127j440j563j261q79q64j146j390
51475A86320j579j910k298k450k348k254k270k244k118k072k217k398k347j977
51461A55838j450j046q92q64p71o57p10r51j147j125j001r59j020j095j166j257
51445A39727j392j580j794j868j629j084m35R3L64L06mk88k91p2J34K53L66M76
51427A31282N03M83M62L34N2j02J99Q11J287J451J453J350J137J079J487K109
51411A45377K368K246K349K938L519L618L368L057K678K253K052K083J927J427
51397A81260J045J084J045L75o40j291j463j623j952k210k280k348k537k759k910
51382A62796k872k479j822j413j643k203k461k266j970j798j642j412j118o71
$$ y = [191628, 193663, 195486, 196869, 197754, 198056, 197718, 196938, 195990, 194863, 193423, 191860, 190599, 189720, 188856, 187710, 186320, 184741, 182831, 180533, 178083, 175735, 173481, 171211, 168967, 166849, 164777, 162560, 160162, 157815, 155838, 154388, 153342, 152450, 151586, 150815, 150158, 149448, 148497, 147350, 146225, 145224, 144265, 143245, 142150, 140984, 139727, 138335, 136755, 134961, 133093, 131464, 130380, 129945, 130038, 130402, 130708, 130704, 130416, 130125, 130053, 130187, 130440, 130806, 131282, 131785, 132268, 132730, 133064, 133116, 133014, 133213, 134024, 135311, 136762, 138215, 139565, 140702, 141781, 143268, 145377, 147745, 149991, 152340, 155278, 158797, 162415, 165783, 168840, 171518, 173771, 175823, 177906, 179833, 181260, 182305, 183389, 184434, 184809, 184169, 182878, 181415, 179792, 177840, 175630, 173350, 171002, 168465, 165706, 162796, 159924, 157445, 155623, 154210, 152567, 150364, 147903, 145637, 143667, 141869, 140227, 138815, 137697, 137026]
51368A37026n3L72J84l79n70r9N25P56O99P34Q74Q10M52nm15q57j389j861k093
51349A34711k103k056k022j956j903k065k448k687k458j947j636j648j718j762
51335A06302j967k280k287j841j341j117r69o98o24j044j587j603j090o10m77
51320H6767n16n89p91j110j297j205r13n15r3J28n4m67p13o55m90l77l05k83l34
51301G6188l22r6J83K17O7M8K32L63L41L23L92M84O60J031J384J373J147J243
51283H5258J735K018J736J349J399J716J817J716J781K016K027J652J128O87L49
51268A08384J34P8M9j93o47j035j175j155j172j360j780k324k690k634k306k082
51252H8092k063j975j661j319j159j100r57p57o28n76n04m18m13n43q12j170j417
$$ y = [137026, 136973, 137345, 137529, 137150, 136580, 136481, 137006, 137762, 138461, 139195, 140069, 140879, 141331, 141326, 140911, 140054, 138665, 136804, 134711, 132608, 130552, 128530, 126574, 124671, 122606, 120158, 117471, 115013, 113066, 111430, 109782, 108064, 106302, 104335, 102055, 99768, 97927, 96586, 95469, 94500, 93802, 93178, 92134, 90547, 88944, 87854, 87244, 86767, 86251, 85662, 84871, 83761, 82464, 81259, 80346, 79831, 79738, 79866, 79812, 79345, 78632, 77977, 77487, 77110, 76805, 76522, 76188, 75866, 75770, 75953, 76170, 76237, 76285, 76517, 76880, 77221, 77544, 77936, 78420, 79080, 80111, 81495, 82868, 84015, 85258, 86993, 89011, 90747, 92096, 93495, 95211, 97028, 98744, 100525, 102541, 104568, 106220, 107348, 108035, 108384, 108518, 108596, 108645, 108452, 107805, 106770, 105595, 104440, 103268, 101908, 100128, 97804, 95114, 92480, 90174, 88092, 86029, 84054, 82393, 81074, 79915, 78815, 77858, 77101, 76473, 75897, 75393, 74975, 74562, 74019, 73207, 72037, 70620]
51235G0620j277p71l13k09k49o1K45K37p2j63K06N88N36K47J74K55J23j60j07
51216F9849L90P87O50K68K43O36Q82M87m23j294j696j602j260q84n92m87n91o92
51198F4671m86L0M66N02K87J21j2l38q09j076r57o19k49J05L83M00R9l16n73n32
51178F1097k27J61L68L18L01N99J036J129P43K21j15k72k93q6K86M61J91k91n10
51159F5117k41L38Q51J008Q35O31O15O36N22M75P31J002P66J44j78K7K47J70J70
51140G3866N18P99O47M59P09J073R45M45J84K68K85J76L12P33J004Q91O62N11
51122H4487K77j63o05q46q73p28m49k39k96m31k65J32J94l32r60j082p25m48o02
51103G6046r83j143q57l12J69M94Q20J144J177P69K79J82M38O10N00L16K41K26
$$ y = [70620, 69343, 68572, 68259, 68050, 67801, 67740, 67985, 68222, 68150, 67987, 68193, 68781, 69317, 69564, 69738, 69993, 70116, 69956, 69849, 70239, 71026, 71676, 71944, 72187, 72823, 73705, 74192, 73769, 72475, 70779, 69177, 67917, 67033, 66441, 65954, 65363, 64671, 64185, 64215, 64681, 65183, 65470, 65591, 65579, 65241, 64432, 63356, 62399, 61780, 61531, 61636, 62019, 62419, 62518, 62202, 61629, 61097, 60870, 61031, 61399, 61717, 62018, 62617, 63653, 64782, 65525, 65746, 65631, 65359, 65066, 64980, 65266, 65727, 65918, 65627, 65117, 64876, 65214, 66065, 67073, 67908, 68539, 69154, 69790, 70312, 70787, 71518, 72520, 73286, 73430, 73252, 73279, 73526, 73696, 73866, 74384, 75183, 75830, 76289, 76998, 78071, 79016, 79461, 79645, 79913, 80198, 80374, 80686, 81419, 82423, 83314, 83976, 84487, 84764, 84601, 83996, 83150, 82277, 81549, 81100, 80861, 80565, 80134, 79869, 80001, 80195, 79863, 78903, 77821, 77096, 76648, 76046, 75063, 73920, 73063, 72751, 72920, 73414, 74234, 75378, 76555, 77324, 77603, 77785, 78223, 78833, 79333, 79649, 79890, 80116]
51085H0116K43L52M27J85m32j071j381j346j160r43p30n64m99n67p45q98q18n11
51067F9658l00m38p13p19m40k50l63n90o71n46k78Q0M13N89O09N43L61M8j89j10
51047F6694J64K57P8m8J70O65J142J321J002K75l81m33J23P80J120J172J129J045
51029G6275R07P04M01L6j30J16N10N54K29N9L45P65R26R38J111J369J363J028
51011H7506P08P52J144J561J677J433J041P27N11L52L09L92L51j9m53m79j21O1
50993I7453k86q70j195j083o46r7K65J70k75o24o25m65l61k62j11m4o7P0M03N17
50973I1867J54k71k01K28L84Q1k15j22J89L98N01O71Q87R73Q89P24N21K78J22
50954I8058K95Q28J404J661J599J457J338J163J032J246J779K161K101J978K259
$$ y = [80116, 80359, 80711, 81138, 81323, 80891, 79820, 78439, 77093, 75933, 74990, 74260, 73696, 73197, 72630, 71885, 70987, 70169, 69658, 69358, 68920, 68207, 67488, 67048, 66798, 66435, 65845, 65174, 64628, 64350, 64430, 64843, 65432, 66041, 66584, 66945, 66993, 66804, 66694, 66858, 67115, 67193, 67145, 67315, 67980, 69122, 70443, 71445, 71720, 71339, 70906, 71029, 71809, 72929, 74101, 75230, 76275, 77182, 77886, 78287, 78323, 78193, 78309, 78819, 79373, 79602, 79661, 80006, 80771, 81697, 82635, 83746, 85115, 86478, 87506, 88214, 88966, 90110, 91671, 93348, 94781, 95822, 96549, 97060, 97412, 97721, 98113, 98464, 98445, 97992, 97513, 97392, 97453, 97167, 96297, 95102, 94019, 93373, 93276, 93541, 93711, 93436, 92812, 92187, 91722, 91361, 91099, 90988, 90944, 90877, 90947, 91350, 91867, 92021, 91750, 91549, 91777, 92161, 92242, 92027, 91905, 92094, 92492, 92993, 93664, 94551, 95524, 96413, 97137, 97658, 97936, 98058, 98353, 99181, 100585, 102246, 103845, 105302, 106640, 107803, 108835, 110081, 111860, 114021, 116122, 118100, 120359]
50939A20359K772L006K918K912L068L053K774K569K628K802L082L679M452M835
50925A64909M665M524M914N595O117O517O984P325P318P319P870Q923R971J0816
50911B63767J1680J2629J3479J4269J5342J6882J8652K0288K1565K2429K3057
50900D54039K3824K4916K5973K6448K6277K5870K5430K4687K3352K1488J9297
50889G21601J6838J4171J1571R373P623O009M134J923k83k035l242m190n027n456
50875G73010n185m478l991m114m760n780p153q758j0269j1443j2403j3434j4649
50862F66593j5953j7272j8625k0010k1267k2107k2329k2021k1437k0732j9847
50851D44993j8735j7517j6284j4962j3524j2217j1295j0614r721q446p100o045
$$ y = [120359, 123131, 126137, 129055, 131967, 135035, 138088, 140862, 143431, 146059, 148861, 151943, 155622, 160074, 164909, 169574, 174098, 179012, 184607, 190724, 197241, 204225, 211550, 218868, 226187, 234057, 242980, 252951, 263767, 275447, 288076, 301555, 315824, 331166, 348048, 366700, 386988, 408553, 430982, 454039, 477863, 502779, 528752, 555200, 581477, 607347, 632777, 657464, 680816, 702304, 721601, 738439, 752610, 764181, 773554, 781177, 787186, 791320, 793243, 792960, 790925, 787683, 783493, 778466, 773010, 767825, 763347, 759356, 755242, 750482, 744702, 737549, 728791, 718522, 707079, 694676, 681242, 666593, 650640, 633368, 614743, 594733, 573466, 551359, 529030, 507009, 485572, 464840, 444993, 426258, 408741, 392457, 377495, 363971, 351754, 340459, 329845, 320124, 311678, 304578, 298533]
50839B98533n277m528l700k948k434k092j734j297q55m23R9P11J191J365J404
50824B78015J626K030K279K177J916J802J975K484L350M356N085N379N558N982
50810C24014O572P029P333P737Q346R041R739J0516J1449J2533J3721J4963J6202
50797D59195J7469J8878K0481K2257K4285K6711K9431L2097L4628L7408M0678
50786G63518M4032M6913M9351N1774N4183N6105N7258N7789N7747N6815N4752
50775A350237N1666M7695M2779L6989L0745K4444J8125J1778N784O45l493o814
50763A610580r361j0935j1474j1249j0589r617q392p159o316o194o985q820j1713
50750A491776j5415j9437k3379k7187l1009l4845l8423m1377m3425m4441m4482
$$ y = [298533, 293256, 288728, 285028, 282080, 279646, 277554, 275820, 274523, 273668, 273245, 273344, 274055, 275246, 276611, 278015, 279641, 281671, 283950, 286127, 288043, 289845, 291820, 294304, 297654, 302010, 307095, 312474, 318032, 324014, 330586, 337615, 344948, 352685, 361031, 370072, 379811, 390327, 401776, 414309, 428030, 442993, 459195, 476664, 495542, 516023, 538280, 562565, 589276, 618707, 650804, 685432, 722840, 763518, 807550, 854463, 903814, 955588, 1009771, 1065876, 1123134, 1180923, 1238670, 1295485, 1350237, 1401903, 1449598, 1492377, 1529366, 1560111, 1584555, 1602680, 1614458, 1620242, 1620887, 1617394, 1610580, 1601219, 1590284, 1578810, 1567561, 1556972, 1547355, 1538963, 1531804, 1525488, 1519294, 1512309, 1503489, 1491776, 1476361, 1456924, 1433545, 1406358, 1375349, 1340504, 1302081, 1260704, 1217279, 1172838, 1128356]
50739A128356m3765m2461m0516l7787l4380l0648k6872k3048j9095j5020j0827
50728H03937o482k094K097O041R957J3925J7579K0470K2551K4032K4888K4830
50716I61731K3721K1746J9119J5864J1966P577L044j252n115q623j1945j5011
50704A022822j7504j9268k0564k1798k3102k4342k5365k6003k6060k5482k4514
50693G68820k3429k2159k0463j8325j5980j3578j1119q685o455m464k532n08J632
50680F22755L862O102Q143R862J1518J3605J6300J9248K1959K4289K6413K8557
50668H12613L0817L3161L5412L7329L8710L9427L9362L8392L6485L3725L0261
50657A205694K6251K1810J6935J1592N971N87m054p875j1113j3846j5809j6719
$$ y = [1128356, 1084591, 1042130, 1001614, 963827, 929447, 898799, 871927, 848879, 829784, 814764, 803937, 797455, 795361, 797458, 803499, 813456, 827381, 844960, 865430, 887981, 912013, 936901, 961731, 985452, 1007198, 1026317, 1042181, 1054147, 1061724, 1064768, 1063516, 1058401, 1049778, 1037833, 1022822, 1005318, 986050, 965486, 943688, 920586, 896244, 870879, 844876, 818816, 793334, 768820, 745391, 723232, 702769, 684444, 668464, 654886, 643767, 635082, 628627, 624163, 621631, 621123, 622755, 626617, 632719, 640862, 650724, 662242, 675847, 692147, 711395, 733354, 757643, 784056, 812613, 843430, 876591, 912003, 949332, 988042, 1027469, 1066831, 1105223, 1141708, 1175433, 1205694, 1231945, 1253755, 1270690, 1282282, 1288253, 1288840, 1284786, 1276911, 1265798, 1251952, 1236143, 1219424]
50645A219424j6621j5798j4449j2636j0539q611p299o590o071n561n520o545q555
50632A094629j0856j2984j5069j7276j9316k0735k1367k1188k0102j8200j5903
50621I01633j3488j0748p463l936n80K784O630J0900J5066J9008K3254K8214L3639
50608A004913L9030M4083M8684N2773N6399N9523O1681O2193O0885N8205N4493
50597A602862M9540M3148L5742K8078K0553J3133N817j158p531j3171j8083k2422
50585A736508k6417l0141l3395l5884l7449l8063l7756l6668l5016l2892l0218
50574A362609k7013k3561k0209j7027j3885j0784q032n987m745m031l463k903
50562A220969k527k559k961l504m004m335m304l738k767j774r84j80J028K728
$$ y = [1219424, 1202803, 1187005, 1172556, 1159920, 1149381, 1140770, 1133471, 1126881, 1120810, 1115249, 1109729, 1103184, 1094629, 1083773, 1070789, 1055720, 1038444, 1019128, 998393, 977026, 955838, 935736, 917536, 901633, 888145, 877397, 869934, 865998, 865418, 868202, 874832, 885732, 900798, 919806, 943060, 971274, 1004913, 1043943, 1088026, 1136710, 1189483, 1245882, 1305405, 1367086, 1429279, 1490164, 1548369, 1602862, 1652402, 1695550, 1731292, 1759370, 1779923, 1793056, 1798873, 1797715, 1790184, 1777013, 1758930, 1736508, 1710091, 1679950, 1646555, 1610671, 1573222, 1535159, 1497403, 1460735, 1425719, 1392827, 1362609, 1335596, 1312035, 1291826, 1274799, 1260914, 1250130, 1242098, 1236111, 1231366, 1227335, 1223872, 1220969, 1218442, 1215883, 1212922, 1209418, 1205414, 1201079, 1196775, 1193037, 1190270, 1188496, 1187512, 1187332, 1188360, 1191088]
50548A191088M564O013O770O861O429N537M196K535O92j421l966o811r600j2302
50534A200585j5278j8663k1984k4786k7180k9441l1342l2464l2885l2948l2538
50523I01076l1259k9271k7295k5693k4174k2505k0866j9307j7483j5256j3038
50512F54929j1144r305p200n038l160j423N53K706M625O175P670R428J1438J3448
50498F73702J5209J6728J8361K0489K3008K5372K7270K8988L0921L3111L5476
50487I48635L8099M0942M3572M5592M7060M8046M8064M6510M3496L9680L5380
50476A425076L0479K5195K0325J6455J3431J0814Q496O532M823L304K172J531
50464A568633J046L73j85J05J491L488N560P682R974J2174J3822J4780J5226J5127
$$ y = [1191088, 1195652, 1201665, 1208435, 1215296, 1221725, 1227262, 1231458, 1233993, 1234685, 1233264, 1229298, 1222487, 1212887, 1200585, 1185307, 1166644, 1144660, 1119874, 1092694, 1063253, 1031911, 999447, 966562, 933614, 901076, 869817, 840546, 813251, 787558, 763384, 740879, 720013, 700706, 683223, 667967, 654929, 643785, 634480, 627280, 622242, 619082, 617659, 618212, 620918, 625543, 631718, 639388, 648816, 660254, 673702, 688911, 705639, 724000, 744489, 767497, 792869, 820139, 849127, 880048, 913159, 948635, 986734, 1027676, 1071248, 1116840, 1163900, 1211946, 1260010, 1306520, 1350016, 1389696, 1425076, 1455555, 1480750, 1501075, 1517530, 1530961, 1541775, 1550271, 1556803, 1561626, 1564930, 1567102, 1568633, 1569679, 1570052, 1569867, 1569972, 1571463, 1574951, 1580511, 1588193, 1598167, 1610341, 1624163, 1638943, 1654169, 1669296]
50450A669296J4135J2023Q947N229J082l304p690j1941j6140k0341k4401k8086
50438A598809l1197l3394l4256l3700l2153l0005k7096k3094j8232j3274q812
50427A313596m942j635R70K758L781M112L714K458R9l643q745j4616k0508k6077
50413A251322l1241l5678l8938m1081m2613m3701m3902m2913m1125l9163l7234
50402H13733l5190l2939l0505k7919k5255k2627k0018j7354j4816j2758j1238
50391E63114r926q561p145n585l666j559J31J178K105L394M743N627O172O950
$$ y = [1669296, 1683431, 1695454, 1704401, 1709630, 1710712, 1707408, 1699718, 1687777, 1671637, 1651296, 1626895, 1598809, 1567612, 1534218, 1499962, 1466262, 1434109, 1404104, 1377008, 1353914, 1335682, 1322408, 1313596, 1308654, 1307019, 1307989, 1310747, 1314528, 1318640, 1322354, 1324812, 1324911, 1321268, 1312523, 1297907, 1277399, 1251322, 1220081, 1184403, 1145465, 1104384, 1061771, 1018070, 974168, 931255, 890130, 850967, 813733, 778543, 745604, 715099, 687180, 661925, 639298, 619280, 601926, 587110, 574352, 563114, 553188, 544627, 537482, 531897, 528231, 526672, 526803, 527981, 530086, 533480, 538223, 543850, 550022, 556972]
$$ [...]
##END NTUPLES=NMR SPECTRUM
##END=
