
##TITLE=AC1076_TOSA01_5835558_o7BCo1VUUa
##JCAMPDX= 6.0         $$ Bruker NMR JCAMP-DX V2.0
##DATA TYPE= NMR SPECTRUM
##DATA CLASS= NTUPLES
##ORIGIN= BRUKER
##OWNER= Administrator
$$ 1.72 TOPSPIN		Version 2.1
$$ 2012-04-16 19:10:06.375 -0500  Administrator@TOPSPIN
$$ Compression mode = diff/dup
##.OBSERVE FREQUENCY= 400.13188235
##.OBSERVE NUCLEUS= ^1H
##.ACQUISITION MODE= SIMULTANEOUS (DQD)
##.ACQUISITION SCHEME= undefined
##.AVERAGES= 8
##.DIGITISER RES= 22
##SPECTROMETER/DATA SYSTEM= spect
##.PULSE SEQUENCE= zg30
##.SOLVENT NAME= COFFEE_meoh
##.SHIFT REFERENCE= INTERNAL, COFFEE_meoh, 1, 14.98061
##AUDIT TRAIL= $$ (NUMBER, WHEN, WHO, WHERE, PROCESS, VERSION, WHAT)
$$ ##TITLE= Audit trail, TOPSPIN		Version 2.1
$$ ##JCAMPDX= 5.01
$$ ##ORIGIN= Bruker BioSpin GmbH
$$ ##OWNER= Administrator
$$ $$ C:\Bruker\TOPSPIN/data/COFFEE/nmr/AC1076_TOSA01_5835558_o7BCo1VUUa/20/pdata/1/auditp.txt
$$ ##AUDIT TRAIL=  $$ (NUMBER, WHEN, WHO, WHERE, PROCESS, VERSION, WHAT)
(   1,<2012-04-15 11:26:02.250 -0500>,<Administrator>,<TOPSPIN>,<go>,<TOPSPIN 2.1>,
      <created by zg
	started at 2012-04-15 11:24:55.781 -0500,
	POWCHK enabled, PULCHK disabled,
       configuration hash MD5:
       1A 1E CE 29 27 FD 77 03 67 4E F0 E3 C4 B2 CB 90
       data hash MD5: 64K
       4B 39 94 BF F1 0B E8 27 DD A1 7E D7 A3 62 50 D6>)
(   2,<2012-04-15 11:26:05.078 -0500>,<Administrator>,<TOPSPIN>,<proc1d>,<TOPSPIN 2.1>,
      <Start of raw data processing
       efp LB = 0 FT_mod = 6 PKNL = 1 PHC0 = 0 PHC1 = 0 SI = 32K 
       data hash MD5: 32K
       D5 91 5E 40 20 A3 64 62 F3 09 96 39 07 B4 28 4B>)
(   3,<2012-04-15 11:26:05.421 -0500>,<Administrator>,<TOPSPIN>,<proc1d>,<TOPSPIN 2.1>,
      <pk PHC0 = 213.7115 PHC1 = 0 
       data hash MD5: 32K
       E8 56 4D 9A 31 8D ED 64 9A 08 5B D3 E1 46 3B B4>)
(   4,<2012-04-15 11:26:05.484 -0500>,<Administrator>,<TOPSPIN>,<proc1d>,<TOPSPIN 2.1>,
      <abs ABSG = 1 
       data hash MD5: 32K
       78 B1 57 2B F5 D0 15 D6 D1 F8 57 68 52 5C 93 D8>)
(   5,<2012-04-15 11:26:05.515 -0500>,<Administrator>,<TOPSPIN>,<proc1d>,<TOPSPIN 2.1>,
      <abs ABSG = 2 
       data hash MD5: 32K
       C7 9E C6 16 7F 81 E2 05 A4 ED 12 34 FE 85 25 03>)
(   6,<2012-04-15 11:26:05.546 -0500>,<Administrator>,<TOPSPIN>,<proc1d>,<TOPSPIN 2.1>,
      <abs ABSG = 3 
       data hash MD5: 32K
       3C 96 AC 10 62 42 D6 06 41 25 20 20 DB 91 42 9B>)
(   7,<2012-04-15 11:26:05.578 -0500>,<Administrator>,<TOPSPIN>,<proc1d>,<TOPSPIN 2.1>,
      <abs ABSG = 4 
       data hash MD5: 32K
       35 CB 2A 5A 9D 41 C4 2C 96 41 2D 28 44 95 77 B4>)
(   8,<2012-04-15 11:26:05.609 -0500>,<Administrator>,<TOPSPIN>,<proc1d>,<TOPSPIN 2.1>,
      <abs ABSG = 5 
       data hash MD5: 32K
       8E 7F 67 AF AA 60 57 13 82 57 5C E1 75 E7 4F C6>)
(   9,<2012-04-15 11:26:09.281 -0500>,<Administrator>,<TOPSPIN>,<audit>,<TOPSPIN 2.1>,
      <user comment:
       ICON-NMR User ID: COFFEE
       data hash MD5: 32K
       8E 7F 67 AF AA 60 57 13 82 57 5C E1 75 E7 4F C6>)
$$ ##END=
$$ 
$$ [...]
##$TP= (0..7)
150 150 150 150 150 150 150 150
##$TP07= 0
##$TPNAME0= <>
##$TPNAME1= <>
##$TPNAME2= <>
##$TPNAME3= <>
##$TPNAME4= <>
##$TPNAME5= <>
##$TPNAME6= <>
##$TPNAME7= <>
##$TPOAL= (0..7)
0.5 0.5 0.5 0.5 0.5 0.5 0.5 0.5
##$TPOFFS= (0..7)
0 0 0 0 0 0 0 0
##$TUNHIN= 0
##$TUNHOUT= 0
##$TUNXOUT= 0
##$USERA1= <user>
##$USERA2= <user>
##$USERA3= <user>
##$USERA4= <user>
##$USERA5= <user>
##$V9= 5
##$VALIST= <valist>
##$VCLIST= <CCCCCCCCCCCCCCC>
##$VD= 0
##$VDLIST= <DDDDDDDDDDDDDDD>
##$VPLIST= <PPPPPPPPPPPPPPP>
##$VTLIST= <TTTTTTTTTTTTTTT>
##$WBST= 2048
##$WBSW= 25
##$XGAIN= (0..3)
0 0 0 0
##$XL= 0
##$YL= 0
##$YMAX_a= 501672
##$YMIN_a= -603552
##$ZGOPTNS= <>
##$ZL1= 120
##$ZL2= 120
##$ZL3= 120
##$ZL4= 120
##$ABSF1= 14.98061
##$ABSF2= -5.57192
##$ABSG= 5
##$ABSL= 3
##$ALPHA= 0
##$AQORDER= 0
##$ASSFAC= 0
##$ASSFACI= 0
##$ASSFACX= 0
##$ASSWID= 0
##$AUNMP= <proc_prof1d_extract_pilot.lims>
##$AXLEFT= 0
##$AXNAME= <>
##$AXNUC= <1H>
##$AXRIGHT= 0
##$AXTYPE= 0
##$AXUNIT= <>
##$AZFE= 0.1
##$AZFW= 0.1
##$BCFW= 0
##$BC_mod= 0
##$BYTORDP= 0
##$COROFFS= 0
##$CY= 15
##$DATMOD= 1
##$DC= 0
##$DFILT= <>
##$DTYPP= 0
##$F1P= 0
##$F2P= 0
##$FCOR= 0.5
##$FTSIZE= 32768
##$FT_mod= 6
##$GAMMA= 0
##$GB= 0
##$INTBC= 1
##$INTSCL= 1
##$ISEN= 128
##$LB= 0
##$LEV0= 0
##$LPBIN= 0
##$MAXI= 10000
##$MC2= 0
##$MEAN= 0
##$ME_mod= 0
##$MI= 0
##$NCOEF= 0
##$NC_proc= -8
##$NLEV= 6
##$NOISF1= 0
##$NOISF2= 0
##$NSP= 0
##$NTH_PI= 0
##$NZP= 0
##$OFFSET= 14.98061
##$PC= 1
##$PHC0= 213.7115
##$PHC1= 0
##$PH_mod= 1
##$PKNL= yes
##$PPARMOD= 0
##$PPDIAG= 0
##$PPIPTYP= 0
##$PPMPNUM= 2147483647
##$PPRESOL= 1
##$PSCAL= 4
##$PSIGN= 0
##$PYNMP= <proc.py>
##$REVERSE= no
##$SF= 400.13
##$SI= 32768
##$SIGF1= 0
##$SIGF2= 0
##$SINO= 400
##$SIOLD= 32768
##$SPECTYP= <>
##$SREGLST= <1H.CDCl3>
##$SSB= 0
##$STSI= 32768
##$STSR= 0
##$SW_p= 8223.68421052632
##$SYMM= 0
##$S_DEV= 0
##$TDeff= 65536
##$TDoff= 0
##$TI= <>
##$TILT= no
##$TM1= 0
##$TM2= 0
##$TOPLEV= 0
##$USERP1= <user>
##$USERP2= <user>
##$USERP3= <user>
##$USERP4= <user>
##$USERP5= <user>
##$WDW= 1
##$XDIM= 32768
##$YMAX_p= 477641594
##$YMIN_p= -771603
##$CURPLOT= <Network HP LaserJet P1505>
##$CURPRIN= <$Network HP LaserJet P1505>
##$DFORMAT= <normdp>
##$LAYOUT= <+/1D_H.xwp>
##$LFORMAT= <normlp>
##$PFORMAT= <normpl>
##$SURQMSG= 1
$$ End of Bruker specific parameters
$$ ---------------------------------
##NTUPLES= NMR SPECTRUM
##VAR_NAME=  FREQUENCY,     SPECTRUM/REAL,   SPECTRUM/IMAG
##SYMBOL=    X,             R,               I
##VAR_TYPE=  INDEPENDENT,   DEPENDENT,       DEPENDENT
##VAR_FORM=  AFFN,          ASDF,            ASDF
##VAR_DIM=   32768,         32768,           32768
##UNITS=     HZ,            ARBITRARY UNITS, ARBITRARY UNITS
##FACTOR=    0.250966925370066, 1,           1
##FIRST=     8223.43324360095, -607,         -260192
##LAST=      0,             -95999,          95551
##MIN=       0,             -771603,         0
##MAX=       8223.43324360095, 477641594,    0
$$ Real data points
##PAGE= N=1
##DATA TABLE= (X++(R..R)), XYDATA
$$ [...]
19471c03978N9167M3007A11a12774l00340a1644B7835i2010j10859k4398a0211
19459B8761J31460E3645a45895j02705a16832j7044K8385j77985h9218j31300
19449b20518R4758j46341A5006e4219b5736A98740a71698e4051B43293A1295a27593
19437A65900F9375c85191N0043k46656a84051A51433a07451F13c18799K1143B55715
19425h6171L4720l9347m8064q019k53843A09535c61181J11148j67969h8639A55177
19413e3489q4041o1142G6515B1505L14k8a53501A8236d1244k29110F6067c36170
19400a38785j9049j70835A51183a73278q0610J08760C17006a85537j50166a22029
19389c96942f312r4519k7473j309A1837e6814a9825G6521c08381d7633E08O9961
$$ plain form
19471 -303978 -244811 -201804 111 -112774 -413114 -11644 27835 -92010 -202869 -227267 -10211
19459 28761 160221 53645 -145895 -248600 -116832 -133876 -105491 -283476 -89218 -220518
19449 -220518 -125760 -272101 15006 -54219 -25736 198740 -171698 -54051 243293 11295 -127593
19437 165900 69375 -385191 -335148 -581804 -184051 151433 -107451 613 -318799 -297656 255715
19425 -86171 -51451 -90798 -138862 -146881 -400724 109535 -361181 -250033 -418002 -88639 155177
19413 -53489 -137530 -198672 76515 21505 21819 21791 -153501 18236 -41244 -270354 66067 -336170
19400 -138785 -157834 -328669 151183 -173278 -253888 -145128 317006 -185537 -335703 -122029
19389 -396942 -6312 -100831 -128304 -129613 11837 -56814 -19825 76521 -308381 -47633 508 70469
19377G0469c10266J42508C04794c15759A20685c590F9281a52313H4171c62457
19366a92446L8485j08741C9513i1995d5659k97674h2291j04120A48688i771C8612
19354e7423o1985A61730b10792R946A99793J21937d67494c9775o7201k31245A9977
19342b34247O6838H902K8986h5196k96024j43310F1834J29461a92045J005f2185
19330A00721b41056R7918I1238i20k79082B076f27528a23833l6992b928j45938
19319a48866C6852J09884d6513j8901k7374B17437d43067a39204E5339P0222j2294
19308A13267h6696j05076B55917a97721K4258B8465L222K4620a59376j87684P0774
19297b76286c8589A1591K90542A28260a43995r290K8465c3875B65550d7333o544
$$ plain form
19377 70469 -310266 -167758 304794 -315759 120685 -3590 69281 -152313 84171 -362457
19366 -192446 -153961 -262702 39513 -91995 -45659 -343333 -82291 -186411 148688 -9771 38612
19354 -57423 -119408 161730 -210792 -200846 199793 321730 -467494 -39775 -106976 -338221 19977
19342 -234247 -167409 8902 37888 -85196 -381220 -524530 61834 191295 -192045 -191040 -62185
19330 100721 -241056 -143138 91238 -920 -280002 2076 -627528 -123833 -160825 -2928 -148866
19319 -148866 36852 146736 -46513 -65414 -92788 217437 -443067 -139204 55339 125561 113267
19308 113267 -86696 -191772 255917 -197721 -173463 28465 31687 56307 -159376 -347060 -276286
19297 -276286 -38589 11591 302133 128260 -143995 -153285 -124820 -33875 265550 -47333 -53877
19286e3877A60440c18176a3980A52463g5935p8259l13271K28551E1910A9657c77077
19274A57713f3863R289j54872D8696E616L04078A36757b4067A9838e4334m51281
19263e05615B7750i3812k50931a63526D12536c11348B1678b75810B4954b59463
19252a98765A27360m209K39126j09756A06381a94147A39018b07971g8542J8802
19242e9740H9698b92275q933E2822i7115l6363A17726a64991A62469a60830J978
19231a58852q2013A44194m1175f2156A4926f2120A67162c13252j51651B5412R0598
19220A16010A2047a54134n087H503b0881k59338I6285a27402n7836h6423k28359
19209c14782f8562j8974H759b74492J731b9332j145B085b9105k79876I9d017j10094
$$ plain form
19286 -53877 160440 -318176 -13980 152463 -75935 -154194 -467465 -238914 51910 19657 -377077
19274 157713 -63863 -54574 -209446 48696 5616 309694 136757 -24067 19838 -54334 -505615
19263 -505615 27750 -93812 -344743 -163526 412536 -311348 21678 -275810 24954 -259463
19252 -198765 127360 123151 362277 252521 106381 -194147 139018 -207971 -78542 -59740
19242 -59740 89698 -292275 -301208 52822 -97115 -133478 117726 -164991 162469 -160830 -158852
19231 -158852 -240865 144194 103019 -62156 14926 -62120 167162 -313252 -464903 25412 116010
19220 116010 12047 -154134 -159221 8503 -20881 -280219 96285 -127402 -185238 -86423 -314782
19209 -314782 -68562 -87536 8759 -274492 -272761 -29332 -30477 2085 -29105 -308981 99 -4017 -114111
19196a14111C14340a71180M4434m9997A30258g8981E9509a01830L7916j19846
19186a83760P6117k4728A26797c40193e0995j45082M8564L5125m7307k95348a22673
19174b72375A77832J1280h8959J7841G5511e08120b20161e1005d67m18284A97558
19162D5326d4103C4J3110M1126a87060j10327A05975h2987c0453C36416B6472
19150i5949B4783a30154l14882R8275C2195k443a41522k04845a71154A1330c15275
19138b5062j33649c6550j03771k13091c4942l49684a37130l263b9815k8650A18784
19126c23315N8309A70421i0509j53354l3653k44296B03446c44023a23833A7042
19115E7923a78054n6766C49365A53494b6089j13775N7396j3469j48064L7759A6971
$$ plain form
19196 -114111 314340 -171180 -126746 -176743 130258 -78981 59509 -101830 -63914 -183760
19186 -183760 -107643 -132371 126797 -340193 -50995 -196077 -147513 -112388 -159695 -455043 -122673
19174 -272375 177832 189112 -88959 -71118 75511 -508120 -220161 -51005 -467 -418751 197558
19162 45326 -44103 34 13144 54270 -187060 -297387 105975 -82987 -30453 336416 26472
19150 -95949 24783 -130154 -445036 -346761 32195 29752 -141522 -346367 -171154 11330 -315275
19138 -25062 -158711 -36550 -140321 -353412 -34942 -384626 -137130 -140393 -29815 -58465 118784
19126 -323315 -265006 170421 -90509 -243863 -277516 -521812 203446 -344023 -123833 17042
19115 57923 -178054 -234820 349365 153494 -26089 -139864 -82468 -95937 -244001 -206242 16971
19103A17671a6059A65348M3013H3801D1137c5053C0169a12353L7452B31006A5494
19091h5087k4344j29095g0725E7351J39652b47057G3977c04216J41836O4166c0938
19079I1136b083j82924C15546b28660k53759b36827A66147a84623l9781B61282
19068H7995L2894J05866a60714e4161j49325d4356r7049M8249f117F9829B4147
19056C090M1969J7757J85026D9241L3178h3046E5934b35817R6619A94373a9866
19044A0380b20485P0672o3184D1715b42310j44605p5192E0793g0387a5483E0513
19032a51118k7776K4714G0616k1855a17029c2144B06809b66872H1805b70474e071
19020A30951g2203I7422e9591m4516P590E7124b530B15060H6397c43125A1151
$$ plain form
19103 117671 -16059 165348 208361 83801 41137 -35053 30169 -112353 -74901 231006 15494
19091 -85087 -109431 -238526 -70725 57351 197003 -247057 73977 -304216 -162380 -98214 -30938
19079 91136 -2083 -185007 315546 -228660 -482419 -236827 166147 -184623 -224404 261282
19068 87995 120889 226755 -160714 -54161 -203486 -44356 -141405 -93156 -6117 69829 24147
19056 3090 45059 62816 247842 49241 82419 -83046 55934 -235817 -139198 194373 -19866
19044 10380 -220485 -149813 -212997 41715 -242310 -386915 -462107 50793 -70387 -15483 50513
19032 -151118 -178894 -154180 70616 48761 -117029 -32144 206809 -266872 81805 -270474 -5071
19020 130951 -72203 97422 -59591 -104107 -96517 57124 -2530 215060 86397 -343125 11151
19008h8262j9584A54811G988K51982a63800A5887Q6967D2503J78411c58240a46659
18996B7605b0821C2260a42120h205A11885a09267B720M5013b95440b4012k23005
18985b47017Q4905H1762a00662d6791k71093J33645M6308H8778a59817B3211J42438
18974A65649J71339A31973f0881r7444j46997J44739d7449E00077i000j87125
18964a96125A03346B5459R1150a81671G2257K67876K51541A53798N20178B23482
18953E00270a68553G9473L83633e3967j03584B6115a40211N3136A29683b24258
18942a91573B67261j02580b53284B36168b24598d0742j54863f4231j38007R1079
18932a11159k32706H291a95022f9643q9022A40522h3122B78146f8397b1878k87985
$$ plain form
19008 -88262 -107846 154811 7988 259970 -163800 15887 102854 42503 220914 -358240 -146659
18996 27605 -20821 32260 -142120 -8205 111885 -109267 2720 47733 -295440 -24012 -247017
18985 -247017 -162112 81762 -100662 -46791 -317884 -184239 -137931 88778 -159817 23211 165649
18974 165649 336988 131973 -60881 -158325 -305322 -160583 -47449 500077 -9000 -196125
18964 -196125 103346 25459 116609 -181671 72257 340133 591674 153798 673976 223482
18953 500270 -168553 79473 463106 -53967 -157551 26115 -140211 -87075 129683 -224258
18942 -191573 267261 164681 -253284 236168 -224598 -40742 -195605 -64231 -202238 -111159
18932 -111159 -343865 8291 -195022 -69643 -158665 140522 -83122 278146 -68397 -21878 -309863
18921c09863J27199j15453C45821d1553H8958c18471C23026A09468b06673B70214
18910i354G6041c86935J44970R887j74475A1591K71061a94992H1J67883a7704
18898B9238g1581A559K65421l1185P076J75800q8957J73289b01403A50700O8690
18887B19390b48418E0667J35470a954l13549C11099d6867j57670a9695k3732l69485
18876d12912a07399C21139j15754b8218D8652h9112b8275A05763g7494A6219J5028
18865C1247a34471k06450b1320C3274c43081N893A56026J6214b96311a16872e2625
18853c17518F0452d5724j56277A18207J02395H7259B2768e68303J36989a46341
18842D6760b95576b6680r8734I5638a93646d7445j56340m750E4L22143a55756
$$ plain form
18921 -309863 -182664 -298117 345821 -41553 88958 -318471 323026 109468 -206673 270214
18910 -9354 76041 -386935 -241965 -232078 -406553 11591 282652 -194992 81 167964 -17704
18898 29238 -71581 1559 266980 235795 242871 418671 329714 503003 -201403 150700 219390
18887 219390 -248418 50667 186137 -1954 -315503 311099 -46867 -204537 -19695 -43427 -412912
18876 -412912 -107399 321139 205385 -28218 48652 -89112 -28275 105763 -77494 16219 31247
18865 31247 -134471 -340921 -21320 33274 -343081 -337188 156026 172240 -296311 -116872 -52625
18853 -317518 60452 -45724 -202001 118207 220602 87259 22768 -568303 -431314 -146341
18842 46760 -295576 -26680 -125414 95638 -193646 -47445 -203785 -208535 54 322197 -155756
18830a4786o3287J2875k95408C34791a28023K7693j51876A24873E1946b52335
18819a99433O261A60854a1044b143j49828a1059r3550n9694d2949k75619i6080
18807a8777f687p3719B33256L9603E19O9450M5140d966A4660c00895E6527M6305
18795A02832J1393J96100a70025b6375j45326c9845k16937f4719C9582L4170a14566
18783d3916q5484A37931b35113j99837b12536L0171G8894k0971J51393c96306
18772a97911p8632I6838Q8990b48923c9321l77833j37715B06895b66929a16350
18761E4e3713B30580b54700J10159k13746a75584h6983m3452C83466b74070k73263
18750e47333b51703c5289j15750H1234N1830N3696m7082c3276A58030f9400I9999
$$ plain form
18830 -14786 -78073 -65198 -360606 334791 -128023 -100330 -252206 124873 51946 -252335
18819 -199433 -193172 160854 -11044 -2143 -151971 -11059 -104609 -164303 -42949 -318568 -96080
18807 -18777 -6687 -80406 233256 272859 519 69969 115109 -4966 14660 -300895 56527 102832
18795 102832 114225 310325 -170025 -26375 -171701 -39845 -256782 -64719 39582 73752 -114566
18783 -43916 -129400 137931 -235113 -434950 -212536 -182365 78894 57923 209316 -396306
18772 -197911 -276543 96838 185828 -248923 -39321 -417154 -554869 206895 -266929 -116350
18761 54 -53713 230580 -254700 -144541 -358287 -175584 -86983 -130435 383466 -274070 -547333
18750 -547333 -251703 -35289 -151039 81234 133064 186760 139678 -33276 158030 -69400 99999
18738H1969J33452d29915b4448C17934c0946A31807a62828E0182g1057n8981C80102
18726a59228m2786i6300M293j81373M9648L341k13196B5768f4015g252E4127d04056
18713a88078F991d6003J0818k15416j21746a84062p744G329a99121e6591d024
18701A66280g7238j28192c618j69632j6238j13270a18841L1169o8469m6625A04341
18689a42846l55446a53752B09197e880I4703J02458a59554L0170j74985B24226
18678G9606d2964A98189k4446b512n2211j84858k7442c9617p9025C95634I3148
18666c99296A54992G6516a67950A29279l6779a53588o8861N5284G0244b3324p5751
18655i9075k38098p494G4776i7972k18362J31527G8219a0283n0771r5067j47047
$$ plain form
18738 81969 215421 -429915 -24448 317934 -30946 131807 -162828 50182 -71057 -130038 380102
18726 -159228 -202014 -96300 -92007 -273380 -223732 -220391 -433587 25768 -64015 -7252 54127 -404056
18713 -188078 6991 -46003 -35185 -250601 -372347 -184062 -191806 7329 -199121 -56591 -4024
18701 166280 -77238 -205430 -3618 -173250 -189488 -302758 -118841 -87672 -156141 -202766 104341
18689 -142846 -498292 -153752 209197 -5880 94703 197161 -159554 -129384 -304369 224226
18678 79606 -42964 198189 173743 -2512 -54723 -239581 -267023 -39617 -118642 395634 93148
18666 -399296 154992 76516 -167950 129279 92500 -153588 -222449 -167165 70244 -23324 -99075
18655 -99075 -337173 -344667 74776 -97972 -316334 -184807 78219 -10283 -61054 -156121 -303168
18644c03168B17997b96433a29570k38268k279J66273B75537e02085A6077J45062
18634A61139O3090J5922a93590C24717A40103a01392a052j84871A515b8890p2532
18623a01422k08432J23485D6111d34871a0187C68629A8067b06879l26393g0760
18612h0434j95940i0579r8876L453F5766a64465b9312r4771C19420a35012A63415
18600c5281A62672a97242A31775E2919L1421N7308a51426L5320A62670a74046
18589a7071A05036J12231F7051A0262i913l8825j04631B5636K3713J976b6398
18577C1257J42417a21272A35234d5143B48981A9526b52851A13011a11275G6416
18566b18217f0267J016p3043M8887G9627b45664r740A70595B188c94170A08798
$$ plain form
18644 -303168 217997 -296433 -129570 -367838 -370117 -203844 275537 -502085 16077 161139
18634 161139 224229 240151 -193590 324717 140103 -101392 -1052 -185923 1515 -28890 -101422
18623 -101422 -309854 -186369 46111 -434871 -10187 368629 18067 -206879 -533272 -70760
18612 -80434 -276374 -90579 -189455 -186002 65766 -164465 -29312 -124083 319420 -135012 163415
18600 -35281 162672 -197242 131775 52919 84340 141648 -151426 -116106 162670 -174046
18589 -17071 105036 217267 67051 10262 -9913 -48738 -153369 25636 49349 51325 -26398
18577 31257 173674 -121272 135234 -45143 248981 19526 -252851 113011 -111275 76416
18566 -218217 -60267 -59251 -132294 -83407 79627 -245664 -255404 170595 2188 -394170 108798
18554d65629a07085I3081r153a37822m8953C62092B2272b64914J15761E3526B3836
18542E2947M3626C2815R4837J4270B4927f2145E4300b19024R9244H4773a41540
18530B61598A7027J1103a74035c8633E2728a40079A28842P1639G6043h5035B60565
18518G9096a77508j14714h655k43336H7087j2157B1792a63631J9131j89255O1219
18507b72536E6528d5637o0348I6456O2248a67939A38696k6075a82680B75167i3012
18495e60650H6500b8425j05062d8916A76156a08441L9144j66995J4448R5515A04464
18483c2506B70307a89446C23225a62674A51702e5075l1130j0279a5548H6902g3376
18471A34338k9352e2840a4017C1622P0299C9275a0710k48106i9215a1674B58895
$$ plain form
18554 -465629 -107085 93081 83928 -137822 -186775 362092 22272 -264914 -149153 53526 23836
18542 52947 96573 32815 127652 141922 24927 -62145 54300 -219024 -119780 84773 -141540
18530 261598 17027 28130 -174035 -38633 52728 -140079 128842 200481 76043 -85035 260565
18518 79096 -177508 -292222 -8655 -251991 87087 74930 21792 -163631 -144500 -333755 -272536
18507 -272536 56528 -45637 -105985 96456 158704 -167939 138696 112621 -182680 275167 -93012
18495 -560650 86500 -28425 -133487 -48916 176156 -108441 -69297 -236292 -221844 -126329 104464
18483 -32506 270307 -189446 323225 -162674 151702 -55075 -86205 -96484 -15548 86902 -73376
18471 134338 104986 -52840 -14017 31622 101921 39275 -10710 -258816 -99215 -11674 258895
18459B52296A25604k724k9748a04670o4134A92916a47760G3885J37442a40041
18448b95233I3025h0653j06045k36135A40340b04184C00269b01193A06005g88
18437H9774f0203j70563o6035j7962b1913o2450R515B68814c36957a24363M5026
18426g9337m7287A06594g3706j1013m15628a31944j8245B0362a63657B82535d0582
18414B5564L15962d27277J96202c7495A13a27094r6373D1766h4891A5281b54712
18402b60094L5113c5675m1105A03657a66323H1941K45321d44165A77922o2395
18392A15527a55236l1391r8105a35405B3605b08860N5972A23475g3471q486B25605
18380B3506f0384B24529p1824J29073b64934j17026G727K10215a13742C02969
$$ plain form
18459 252296 125604 122880 93132 -104670 -168804 192916 -147760 73885 211327 -140041
18448 -295233 93025 -80653 -186698 -422833 140340 -204184 300269 -201193 106005 -788
18437 89774 -60203 -230766 -296801 -314763 -21913 -84363 -74848 268814 -336957 -124363 -79337
18426 -79337 -126624 106594 -73706 -84719 -500347 -131944 -150189 20362 -163657 282535 -40582
18414 25564 341526 -427277 -231075 -37495 113 -127094 -223467 41766 -84891 15281 -254712
18402 -260094 -224981 -35675 -76780 103657 -166323 81941 327262 -444165 177922 115527
18392 115527 -155236 -186627 -284732 -135405 23605 -208860 -152888 123475 -73471 -81957 225605
18380 23506 -60384 224529 152705 281778 -264934 -381960 7727 217942 -113742 302969
18369d940A88434b20779C1L04158C0766J41769L3994a53575D1618c17913f3139
18357A07361a05678C08537f0037D0803a06818B0659a77584j37365d0215q4228
18347a24443b9346q892C10383A36790A8327a88048R3359H781b53603F40016k79782
18336C60234a56100B59402R8815a54754r6172b8303H5611i2699A00714F0i2780
18324a6271q2242a7774j36275j14963B52307A04120c0733q388j9885G0670c30261
18312E1160b83880A29094N0861a99402A25643C776a12273j01259j6322D5754a18880
18300i8894A08695a9901k71210a15438m6117A15576l906a50445J3002A1830a12121
18288a34966n9287A85270A4997b40411A34437J33620l5111a4669m10721E8727
$$ plain form
18369 -4940 188434 -220779 31 304189 30766 172535 206529 -153575 41618 -317913 -63139
18357 107361 -105678 308537 -60037 40803 -106818 20659 -177584 -314949 -40215 -124443
18347 -124443 -29346 -38238 310383 136790 18327 -188048 -94689 8781 -253603 640016 360234
18336 360234 -156100 259402 358217 -154754 -250926 -28303 85611 -92699 100714 60 -92780
18324 -16271 -98513 -17774 -154049 -269012 252307 104120 -30733 -39121 -59006 70670 -330261
18312 51160 -283880 129094 179955 -199402 125643 3776 -112273 -213532 -229854 45754 -118880
18300 -98894 108695 -19901 -291111 -115438 -161555 115576 111670 -150445 -137443 11830 -112121
18288 -134966 -194253 185270 14997 -240411 134437 268057 232946 -14669 -425390 58727
18277I4000a43605A09718M6276a71558o351O7432B63503e7487A78189J28231c7199
18265g7546b5689I6815b04464Q5710r081e4385C42197R2449c42140A0505b87567
18253B53540d19719J62680a9602C5908J51629K82249a28156k2996C0120Q3493
18243A13613R7688A04697J56558a27469B764b31351g4916l14266a02178k19496
18233c21674j13827a83711Q6150E2180O8035c53868b7732B0212L563e2406J6216
18222c6190r0964l74294a75000d348D2269L25826A7805b68958b502j57820A63035
18210d89319D7311b43217a7914N066n27098b08681P0038q2619r9188a37904n5651
18199a93555c1093A68371l5689m2056Q8853E5910c29375C12120a52778a3969E6573
$$ plain form
18277 94000 -143605 109718 155994 -171558 -177909 -110477 263503 -57487 178189 306420 -37199
18265 -77546 -25689 96815 -204464 -118754 -127835 -54385 342197 434646 -342140 10505 -287567
18253 253540 -419719 -257039 -19602 35908 187537 469786 -128156 -151152 30120 113613
18243 113613 211301 104697 261255 -127469 2764 -231351 -74916 -389182 -102178 -321674
18233 -321674 -435501 -183711 -97561 52180 120215 -353868 -27732 20212 23775 -52406 -36190
18222 -36190 -127154 -501448 -175000 -4348 42269 368095 17805 -268958 -2502 -160322 163035
18210 -489319 47311 -243217 -17914 -12848 -539946 -208681 -138643 -221262 -320450 -137904 -193555
18199 -193555 -31093 168371 132682 90626 179479 55910 -329375 312120 -152778 -13969 56573
18187a59263B5489b33854c5310B00116c36816a10733r8992h2104D6985M7435b90230
18175c433A93763i0976C9049i4590A1285J78766P2116A24495J05106F0024a70775
18163c3730E3991K3355b48634H3108b47747m3939A93338o1552n5314A4446b33429
18151a17182C1095K54333b64412o2022C5550R9560i8460C9068Q3784K83662a60294
18139E7002a68767J0433r6529N5710A30184B7932R306a18279B65310a04281j85920
18128b90201A21805l6042c0919k04556L4873i4514m01187c8452j6408H0823c486
18116a99634C6493J30270e0065B41663O1751E5476K20919a62770b0905D97452
18105B03234d07624A28786L8110h0350n5307n7948A21881a37843l73339A29781
$$ plain form
18187 -159263 25489 -233854 -35310 200116 -336816 -110733 -209725 -82104 46985 94420 -290230
18175 -3433 193763 -90976 39049 -94590 11285 190051 262167 124495 229601 60024 -170775
18163 -33730 53991 77346 -248634 83108 -247747 -291686 193338 131786 76472 14446 -233429
18151 -117182 31095 285428 -264412 -326434 35550 135110 -98460 39068 122852 406514 -160294
18139 57002 -168767 -158334 -254863 -199153 130184 27932 37238 -118279 265310 -104281 -290201
18128 -290201 121805 85763 -30919 -235475 -200602 -94514 -495701 -38452 -54860 80823 -3486
18116 -199634 36493 166763 -50065 241663 303414 55476 276395 -162770 -20905 497452
18105 203234 -407624 128786 166896 -80350 -135657 -193605 121881 -137843 -511182 129781
18094B55918G7519i0898D6803J28309g9016j20869P1412B733b13534h4092j95486
18083b79578A4883f3121j71987g9154c4456l96585B11311q8109F84O4393a63360
18071a48025A69978a33170e3513J7937A74084J60108H6934J19807d8919I500J90691
18060B00191k5786d5096k29656B45433a86152F097b29087F9270J6400i2372j7388
18049a09760l2994I0297a74096o617Q1970j20813A69491D0044b69855Q8495B59477
18037H1363N1187g1320E2070P9850B0140J47174c23178A53600a58436J7494j24942
18026b65884G099R2659M4403a92120B05118a19468c7790C89743b17837C9560a46957
18014C98650j34691a05027C9149g9773I1293a94045A24492a24730l2768e412q8233
$$ plain form
18094 255918 77519 -90898 46803 175112 -79016 -199885 -128473 2733 -213534 -84092 -279578
18083 -279578 14883 -63121 -235108 -79154 -34456 -431041 211311 123202 684 65077 -163360
18071 -148025 169978 -133170 -53513 -35576 174084 334192 86934 206741 -48919 9500 200191
18060 200191 174405 -45096 -274752 245433 -186152 6097 -229087 69270 85670 -92372 -109760
18049 -109760 -142754 90297 -174096 -180713 -98743 -219556 169491 40044 -269855 -181360 259477
18037 81363 132550 -71320 52070 131920 20140 167314 -323178 153600 -158436 -140942 -265884
18026 -265884 7099 99758 144161 -192120 205118 -119468 -37790 389743 -217837 39560 -146957
18014 398650 263959 -105027 39149 -79773 91293 -194045 124492 -124730 -157498 -5412 -93645
18003i3645K9303K9944j80612j60877B09957I3560C8376K91285A08612Q2572R5060
17992B86244c23550A07042b13495A66856N388a39971l4411A86227J0110J6763
17982B13100a7226r6693B50176a23489d0430B9275K3058d4115J1774n8930B090
17970c19924B00691G1877j9031b9756D4885a19801f160k24917j5062D9653a90338
17958A23799L8919A4136f2531j94272a10184B9939b58402i6712L9700A46079F5099
17946G914c37906J33220R2569G154L10801a19399o0906C56177A28589J24508a09135
17934f9864K0237q8998j48499Q554c525q8840h384n0467p8328e3355A94858Q9345
17922B84203a78190m1734J08651B79029b53583o9407C72864b11031J04865j53095
$$ plain form
18003 -93645 -64342 -34398 -215010 -375887 209957 93560 38376 329661 108612 191184 286244
17992 286244 -323550 107042 -213495 166856 172244 -139971 -174382 186227 196337 213100
17982 213100 -17226 -113919 250176 -123489 -40430 29275 52333 -44115 -32341 -91271 2090
17970 -319924 200691 71877 52846 -29756 44885 -119801 -6160 -231077 -246139 49653 -190338
17958 123799 162718 14136 -62531 -256803 -110184 29939 -258402 -96712 -57012 146079 65099
17946 7914 -337906 -204686 -112117 7154 317955 -119399 -180305 356177 128589 253097 -109135
17934 -69864 -49627 -138625 -287124 -278570 -3525 -92365 -8384 -58851 -137179 -53355 194858 284203
17922 284203 -178190 -219924 -111273 279029 -253583 -322990 372864 -211031 -106166 -259261
17912b59261N9435B26347B7601J6982R6548c3625j02044k30241a46655L2974A1204
17900B06611f4618A09657b94977C58309h9610m3429D9576J386B4660b7237q4512
17889a11749a883j11415n1876O0691A35100L74364A07246A2780J36734m9438K54377
17878C54453n6317b33790e4671e267A08456c2668j51941A71557k2108J83970q0244
17867B53175g144j0732k7586k7605p3852K0250N6482j82626A79013a5040k22881
17856b37921i9713C39157A41517p539c6310D944J52549Q5188B4093a94634j34060
17845c28694A03700J01789o1014j1946Q52c73882i6973C5454h9670K4224B85317
17833A79095E3855b23640A11479J54749b1239j26817H1474L01321F582P2341j2399
$$ plain form
17912 -259261 -199826 226347 27601 44583 141131 -33625 -135669 -365910 -146655 -113681 11204
17900 206611 -64618 109657 -294977 358309 -89610 -133039 49576 50962 24660 -27237 -111749
17889 -111749 -1883 -113298 -165174 -104483 135100 509464 107246 12780 149514 100076 354453
17878 354453 298136 -233790 -54671 -5267 108456 -32668 -184609 171557 149449 333419 253175
17867 253175 -7144 -17876 -45462 -73067 -146919 -126669 -70187 -252813 179013 -15040 -237921
17856 -237921 -99713 339157 141517 133978 -36310 4944 157493 242681 24093 -194634 -328694
17845 -328694 103700 205489 144475 132529 133381 -373882 -96973 35454 -89670 -65446 285317
17833 179095 53855 -223640 111479 266228 -21239 -148056 81474 382795 6582 78923 66524
17822F6524Q0660R9439g1484a020k766A46577a98890A0140K4225c51125k2646
17811c73771A61197n1562N3300i0671D1539i4874A42493l3091B3297o284Q0065
17800I7078h1132I0471h017I9243a49486D4601K54615e7696l7383A07248J74072
17789B81320a70694f7187B54041F555M49782D4187K27587a4019k45829J4142h0378
17777B54458a51934E6576B3975R3410e7498A68864G7863K40884A04431B0340O02892
17766F23232A7158b254B46050r5937J20127E5893i9102B64851a15490m0083q3149
17755b38722e4898A68796O5907c18155B68109D2326J41163R7127c4508C945b13168
17743C06471a5640C11511C2853a49758k103a0759C24320A42957R3717J74096c35510
$$ plain form
17822 66524 147184 246623 -71484 -1020 -3786 146577 -198890 10140 34365 -351125 -373771
17811 -373771 161197 109635 162935 -90671 41539 -94874 142493 109402 23297 17013 97078
17800 97078 -81132 90471 -8017 99243 -149486 44601 299216 -57696 -95079 107248 281320
17789 281320 -170694 -67187 254041 6555 456337 44187 271774 -14019 -259848 -245706 -80378
17777 254458 -151934 56576 23975 117385 -57498 168864 77863 318747 104431 20340 623232
17766 623232 17158 -2254 246050 150113 270240 55893 -99102 264851 -115490 -155573 -238722
17755 -238722 -54898 168796 234703 -318155 268109 42326 183489 280616 -34508 3945 -213168
17743 306471 -15640 311511 32853 -149758 -151861 -10759 324320 142957 236674 410770 -335510
17731A46719B9279K6405g7744I6496a87644B91815A20437b30198B97130k0019
17721B77111A19087c449o0116F6868J44034d2581A1878J43765N2503h1944I7733
17709A81363l5372L7917F9656b60593C33873A39036J26575e3148B40526f7020
17698A8976i8464l69236a41637C95091j57899L505N6632C7877c23692A61726p6539
17687H5187c4834B66848A00043f2029j02803C71855b74118A46783L25260I4944
17676A54967O7326R4615j28657G8153c4976C13245J56985H2338k8971c8417I0056
17664B15061b26355E07751G9401e1805A53972c29207b7348r5737A24951L0030
17654A54981i907F031O9548N0255D3043N2780K1958f6983A45933e6231B1335b7339
$$ plain form
17731 146719 29279 55684 -77744 96496 -187644 291815 120437 -230198 297130 277111
17721 277111 119087 -3449 -63565 66868 210902 -42581 11878 155643 208146 -81944 97733
17709 181363 145991 183908 69656 -260593 333873 139036 265611 -53148 240526 -67020
17698 18976 -98464 -467700 -141637 395091 237192 240697 297329 37877 -323692 161726 85187
17687 85187 -34834 266848 100043 -62029 -164832 371855 -274118 146783 472043 94944
17676 154967 222293 316908 188251 78153 -34976 313245 470230 82338 53367 -38417 90056
17664 215061 -226355 507751 79401 -51805 153972 -329207 -27348 -123085 124951 154981
17654 154981 -9907 6031 75579 125834 43043 95823 117781 -66983 145933 -56231 21335 -27339
17641A83992a3391j21867e933A57088d86390a14908L1571r7034j24223A71712
17630H6527K16516r6084g2471I5276g9704A54483C4030L03389J10935A21796J25172
17619B46968B1213c03333A39327B9219J67418C0419K35146m6963F6506a15365
17608i9781A25803A8841L07675M1816j41441K43814D8289k3064K33258d5322n98923
17597f44245D25216j80162M1454O6668b70637A59479J07300F4009c2795B54708
17586A20214L330k2858m3201d4341C82784j37861F1594K37245b17398a0397j9983
17575c0380G2579b383B06300G8126a48121I3666B8068J11400k0186E1210M2735
17564I3945Q8047j07j8377d2706A33598A1201K72829q1141c7477n6326B56983
$$ plain form
17641 183992 -13391 -135258 -5933 157088 -486390 -114908 -83337 -180371 -304594 171712
17630 86527 303043 206959 -72471 95276 -79704 154483 34030 337419 448354 121796 246968
17619 246968 21213 -303333 139327 29219 196637 30419 265565 218602 66506 -115365
17608 -99781 125803 18841 326516 368332 226891 470705 48289 25225 258483 -45322 -644245
17597 -644245 425216 245054 286508 353176 -270637 159479 266779 64009 -32795 254708
17586 120214 123544 100686 57485 -44341 382784 244923 61594 298839 -217398 -10397 -30380
17575 -30380 72579 -2383 206300 78126 -148121 93666 28068 139468 119282 51210 93945
17564 93945 181992 181885 163508 -42706 133598 11201 284030 202889 -37477 -93803 256983
17552B93770N4618A25974J09226l1628E1894K99770b06959C85961L1413f668o8288
17541g4956A60468a32478C63971K2550J5638c9537B67842O7561j51964M6400J03069
17530C32908J01023m3508K22773A95212K49361a0149H8836J68394E5607J58422
17520B14029l1125E7481b888F24153I2725K06073L758l8040K93757J06412K47675
17509I12360k4252n9532j32860r2066C00348J78522O4510A71844K04986n5775
17499C21055K43152r1191K72078p3821K49238N8189l65449J70471J96198B97013
17488D55139k26563J24201J99580k69339J29622j03396K6837J29635a87366H6919
17477A74271K50040A67422L33623f1823B45599l7440K10959B1146J56289o7763
$$ plain form
17552 293770 348388 125974 235200 203572 51894 351664 -206959 385961 417374 -6668 -74956
17541 -74956 160468 -132478 363971 386521 402159 -39537 267842 335403 183439 229839 332908
17530 332908 433931 390423 613196 195212 444573 -10149 88836 257230 55607 214029
17520 214029 182904 57481 -2888 624153 92725 298798 302556 264516 558273 664685 912360
17509 912360 888108 828576 695716 603650 300348 478870 543380 171844 376830 321055
17499 321055 564207 473016 745094 671273 920511 978700 613251 783722 979920 297013
17488 455139 228576 352777 552357 283018 412640 309244 336081 465716 -187366 86919
17477 174271 424311 167422 501045 -61823 245599 208159 419118 21146 177435 109672
17467A09672M25788A33602L13730K07341l11632A00147K83431K12929k85708F4576
17456A71400K96852j84334K08590j69404Q083J8109l8173A30286K5028n7272L89335
17445D87377a4128A31059K87943A46827p618k8806R0273K34266j14140m622N9060
17434C75240m0003R5626J42335j04040K784L18785A47052K71976J33428j59996
17424C92460J28504J34504A37378M81958k10450j49563K03528j63954L24963k72757
17414C51103A0739L25138M49246A80140K69670O1836j34051J46071B42493A01155
17403d5661B94517j6771M39929B00355J74376J11043j58390J38149k26182J51547
17393C90898j167J1493P2818j92974F6561P0693M46096k62412a9435D26496j97588
$$ plain form
17467 109672 535460 133602 447332 654673 343041 100147 383578 596507 310799 64576
17456 171400 468252 283918 492508 323104 331187 349296 311123 130286 155314 98042 487377
17445 487377 -14128 131059 419002 146827 139209 110403 200676 434942 320802 316180 375240
17434 375240 335237 430863 573198 469158 471942 790727 147052 419028 552456 392460
17424 392460 520964 655468 137378 619336 408886 259323 462851 298897 623860 351103
17414 351103 10739 335877 785123 180140 449810 511646 377595 523666 242493 101155
17403 -45661 294517 277746 717675 200355 374731 485774 327384 465533 239351 390898
17393 390898 389731 401224 474042 281068 66561 137254 583350 320938 -19435 426496 228908
17382B28908J53297A32583K2829K62022I752K65414i4187A47023J22741O9786
17372C39550h2881B58047A27349L64202A96951M63401k39398j04772L15877B58320
17361B83889j8293M7685j35102J15655N6486j26753J40015j03005K62487B33960
17350B16770K01533H3016K5609a51387I2601K58502B149M2299L26460K88522B79019
17338F4618L14851j74171R7238j46268J72970j0690N873j06557a95605g7231C22757
17326B76100R8358j71517K17771j9080L4997J09386I0258K80212E9177E735L231
17315H966K73926j33659R9173N2558m803P1620A27382g6806C37762J64368j66813
17304C35317J71638a21440B47817D7833O4124M6542K33303A57393p0617R7437
$$ plain form
17382 228908 382205 132583 155412 417434 9752 275166 -94187 147023 269764 339550
17372 339550 -82881 258047 127349 491551 196951 660352 420954 316182 632059 258320
17361 283889 265596 313281 178179 293834 350320 223567 363582 260577 523064 233960
17350 216770 418303 83016 108625 -151387 92601 351103 2149 44448 370908 659430 279019
17338 64618 379469 205298 302536 156268 329238 318548 324421 217864 -195605 -77231 322757
17326 276100 374458 202941 420712 401632 436629 546015 90258 370470 59177 5735 8966
17315 8966 282892 149233 248406 300964 296161 367781 127382 -76806 337762 502130 335317
17304 335317 506955 -121440 247817 47833 111957 158499 391802 157393 86776 184213
17294A84213K02786j51890A17214J16747j01060K88438a09602C42781A9600L82114
17284D01714P6793k04000j12221K17575l2415j01842N5247L37504k42613K73084
17274F68826I7180L20470o5651K61L22896k59536q6417j12239L2000G610K98113
17263C05723J6547J66655A85368K40900R319A62849L24961B06225O074K19955
17253D32254m4686j20853J8590P3225A16013J15743R5419N6102j36936K316k6454
17242B22203n2808J59913A6135M28420k8419m1902P8240B2432L84887j80825F0737
17230F34875l00106L9848K06926j38641j76165O9052m714o6607n1567K08396m4367
17219C76930P3775A15903L84207A78430R6137K87239G5862K94832L77585l55951
$$ plain form
17294 184213 386999 235109 117214 233961 132901 421339 -109602 342781 19600 401714
17284 401714 478507 274507 162286 379861 347446 245604 300851 638355 395742 668826
17274 668826 97180 417650 351999 352260 675156 415620 329203 216964 248964 7610 305723
17263 305723 322270 488925 185368 426268 435587 162849 487810 206225 212299 432254
17253 432254 387568 266715 285305 358530 116013 231756 327175 383277 246341 248657 222203
17242 222203 169395 329308 16135 444555 416136 374234 452474 22432 407319 226494 60737
17230 634875 334769 374617 581543 442902 266737 335789 331075 264468 212901 421297 376930
17219 376930 450705 115903 500110 178430 274567 561806 75862 370694 748279 392328
17209C92328p0998L552K77750b25743D54076q3535A71721k9200L08810P7228k50829
17198B77730J00104J30637j62297J53391j69981K01163j5120A66842M80271A88998
17187F60427j21867j14846M6750A46977M56278k65168J74662A90430O6558j01075
17177A55913J69054K44128k22149M0592J17995o506j60192j16121K59166j81525
17167C00355j39703K98930o9555j15621J39722j22353K63308n7347A53355l5347
17157A18008J61428M74074l54481k4163l5209M84141C96608j29247A24996J83278
17147C08274K17812j04044N9389j49725r4983N53520Q51C34673R6404j07498J22134
17136D45713p4049j07313M49285j94358J12892k17769J23662m207n8520A49439
$$ plain form
17209 392328 321330 324882 602632 -225743 454076 370541 171721 142521 451331 528559 277730
17198 277730 377834 508471 346174 499565 329584 530747 515627 166842 647113 188998
17187 660427 538560 423714 470464 146977 603255 338087 512749 190430 256988 155913
17177 155913 324967 569095 346946 387538 505533 499027 338835 222714 481880 300355
17167 300355 160652 459582 390027 274406 414128 291775 555083 497736 153355 118008
17157 118008 279436 753510 399029 374866 339657 823798 396608 267361 124996 308274
17147 308274 526086 422042 481431 331706 236723 790243 791094 334673 431077 323579 445713
17136 445713 371664 264351 713636 519278 632170 414401 538063 533856 475336 149439
17125G29847k04766K28155k25927Q4028L9719B38202L99401r3242J56062j77026
17115E23397L01336B83074M01985k0968k39848j00223M78424r4927k23157J36498
17105F20858n061j24777M44409j21636l06944J22103k4136k459p247j54211J86064
17094F26963m9524r5426J46298j15117R1202K83155l52216j57476K73330k79451
17084C71738O1625j022M99268j35209j4112j64766k34791Q2783N57893m53237
17074E70170J22539j33724J08205Q166l1231j55641L41242k78789J32336O0302
17064G43575k56343J16315J89250j74800J42128j46320J62779o4201L02253l35962
17054F78674o0655J7398O5789j27655J48849O986J77124k21667k78273N42752
$$ plain form
17125 729847 525081 753236 527309 611337 651056 238202 637603 544361 700423 523397
17115 523397 824733 283074 685059 664091 424243 324020 802444 707517 484360 620858
17105 620858 615797 491020 935429 813793 506849 628952 604816 602357 595110 440899 626963
17094 626963 577439 482013 628311 513194 604396 887551 535335 377859 651189 371738
17084 371738 433363 432341 931609 796400 782288 617522 382731 465514 1023407 570170
17074 570170 692709 558985 667190 675356 644125 488484 829726 550937 683273 743575
17064 743575 487232 603547 792797 617997 760125 613805 776584 712383 1014636 678674
17054 678674 618019 635417 701206 573551 722400 729386 906510 684843 406570 949322
17044I49322j58950j055j39147J40515j20267L98220k68591K01891k53448K71395
17034A019885M709k73360N6323K24908j3317k71434M05886j71099j37480j78444
17024F66577O3862K30713j18540q5157M20739m01415L33995j57956j01499K45704
17014A097023p3571j87348J54451j4765K6709Q0106j3231K7620q5793l63803M93074
17003A140472P983p661j38463M6168K00322k35109P4277k67264M32204q8827j2444
16992A151658m09245M70172n03363K66091R133k8505L03711J82434J37486k59362
16982A320210M1739k38436K02757j51909R7732k34689P8889K03047m5819K46940
16972A520461k40835n2686K087L41535m14652j4882J04857J8392L62661l54927
$$ plain form
17044 949322 790372 789317 650170 790685 670418 1068638 800047 1001938 748490 1019885
17034 1019885 1024594 751234 807557 1032465 1019148 747714 1153600 982501 845021 666577
17024 666577 730439 961152 842612 757455 1178194 776779 1110774 952818 851319 1097023
17014 1097023 1023452 836104 990555 975790 1002499 1082605 1069374 1096994 1011201 647398 1140472
17003 1140472 1148455 1140794 1002331 1048499 1248821 1013712 1087989 820725 1252929 1164102 1151658
16992 1151658 742413 1212585 709222 975313 984446 955941 1259652 1442086 1579572 1320210
16982 1320210 1361949 1123513 1326270 1174361 1272093 1037404 1116293 1319340 1273521 1520461
16972 1520461 1279626 1226940 1229027 1570562 1155910 1141028 1245885 1264277 1626938 1272011
16962A272011J37807k9379J48824k63223J87973K14581J47702n36059K85600k28140
16952A337697J24910J99362Q3442Q3825l40929J07084L2419K02246l72846K2157
16942A479367o4593J21356J61773k2729j96J47171l03488q8527L08427j99015
16932A539546M01006k21344l7874J61205J72005j90421J68107j69948j54255K82411
16922A950438N9146o9379O4721L1495l2340L2792O457N3443P571m0964K02771
16911B266151r6430j11117Q7874J79765j51620R5843K7050O2022k14654J04414
16901B249298J2290J30103j12208m025J62940k37065K68118O5917R9338m34500
16891B200206M24697l02092O00302J29525j14466p9153l44809K14997j46269N35871
$$ plain form
16962 1272011 1409818 1380439 1529263 1266040 1454013 1668594 1816296 1280237 1565837 1337697
16952 1337697 1462607 1661969 1745411 1829236 1488307 1595391 1627810 1830056 1457210 1479367
16942 1479367 1414774 1536130 1697903 1675174 1674978 1822149 1518661 1430134 1738561 1539546
16932 1539546 1940552 1719208 1681334 1842539 2014544 1824123 1992230 1822282 1668027 1950438
16922 1950438 2009584 1940205 2004926 2036421 2004081 2036873 2043330 2096773 2104344 2063380 2266151
16911 2266151 2169721 2058604 2146478 2326243 2174623 2270466 2297516 2359538 2144884 2249298
16901 2249298 2261588 2391691 2279483 2275458 2438398 2201333 2469451 2535368 2634706 2200206
16891 2200206 2624903 2322811 2923113 3052638 2938172 2859019 2514210 2729207 2582938 3118809
16881C118809m02590K58792l11354L57799K35696k66632q0176o662J61243n8529
16871C006396j71491M86167q9817K80495j16566J1759L33562j29913l14881K51186
16861C546897l0439L25153p1427j08600J76693k50989N66544j17787L28746m12692
16851C952099M8450L07716j07822N2662K86945j80741m7464K19924J67672J84343
16841D883784j15226J64167k71202L33136L34991J03825J2604m59925L86495k15794
16831E156855L93761q5443J96752J96898K70380j07245m78145N30577j9664J24412
16821F179138M8709L69511J44327j87069J86463M16066j95293M46966j57708L68213
16811G619323k7263j69952K31629M48716p7421K69065L88370l9181O43367k6552
$$ plain form
16881 3118809 2716219 2975011 2663657 3021456 3257152 2990520 2910344 2903682 3064925 3006396
16871 3006396 2834905 3321072 3231255 3511750 3395184 3406943 3740505 3610592 3295711 3546897
16861 3546897 3516458 3841611 3770184 3661584 3838277 3587288 4153832 4036045 4364791 3952099
16851 3952099 4000549 4308265 4200443 4253105 4540050 4359309 4311845 4531769 4699441 4883784
16841 4883784 4768558 4932725 4661523 4994659 5329650 5433475 5446079 4986154 5372649 5156855
16831 5156855 5550616 5465173 5661925 5858823 6129203 6021958 5543813 6074390 6054726 6179138
16821 6179138 6227847 6597358 6741685 6554616 6741079 7157145 6961852 7408818 7251110 7619323
16811 7619323 7592060 7422108 7653737 8102453 8025032 8294097 8682467 8643286 9286653 9260101
16801I260101r3518Q5798k9862M38499K04727L20829L7869O05192j57488J91306
16791A0863453M31475J35125J46982K99615L54876K49735N9780N53978N9673P56869
16781A3911561K87557K0265Q91400J21458M42771L18611L69878M13902O10293
16772A7387696L22225K06910L61208P76344N15407M73465Q66476M09550L96446
16763B1715727Q19407N14395Q53207Q72404N69168Q51300P60651Q13187J187239
16754B8956685R39364P84309O64650J000992J128112J770969P48491J221585J408458
16745C8623615J708809R93148J736239J651588J802145J301500J743124J851275
16737E1411443J955605J914798K025567K541285J673219K548671K415261K272800
$$ plain form
16801 9260101 9166583 9252381 9222519 9661018 9865745 10186574 10224443 10829635 10672147 10863453
16791 10863453 11294928 11430053 11577035 11876650 12231526 12481261 12541041 13095019 13154692 13911561
16781 13911561 14199118 14219383 15110783 15232241 15675012 15993623 16363501 16777403 17387696
16772 17387696 17709921 17916831 18278039 19054383 19569790 20043255 20909731 21319281 21715727
16763 21715727 22535134 23049529 23902736 24775140 25344308 26195608 26956259 27769446 28956685
16754 28956685 29896049 30680358 31345008 32346000 33474112 35245081 35993572 37215157 38623615
16745 38623615 40332424 41325572 43061811 44713399 46515544 47817044 49560168 51411443
16737 51411443 53367048 55281846 57307413 59848698 61521917 64070588 66485849 68758649
16729F8758649K428061K631358K722800K804203K392928K955003K655036K852439
16721I0200477K905122K815803K544582K777885K291192K442382K502470K344546
16713A10824459J680193J810392J867629P47889J267601M12783M56873p3472j86867
16704A18807480m79570j212191j198984j257197k349293j483805k290979k292909
16696A06242552k714738j954510k543438l186295k501446l159603k436251k901240
16688H4845031l366186k483574k880918k541227k530591k689403k656003k032415
16680F3664714k427753k364597k031067k388252j869914j806704j921984j530536
16672D7323907k028881j594587j784326j032523j688428j420434j591346j284213
$$ plain form
16729 68758649 71186710 73818068 76540868 79345071 81737999 84693002 87348038 90200477
16721 90200477 93105599 95921402 98465984 101243869 103535061 105977443 108479913 110824459
16713 110824459 112504652 114315044 116182673 116930562 118198163 118610946 119067819 118994347 118807480
16704 118807480 118327910 117115719 115916735 114659538 112310245 110826440 108535461 106242552
16696 106242552 103527814 101573304 99029866 95843571 93342125 90182522 87746271 84845031
16688 84845031 81478845 78995271 76114353 73573126 71042535 68353132 65697129 63664714
16680 63664714 61236961 58872364 56841297 54453045 52583131 50776427 48854443 47323907
16672 47323907 45295026 43700439 41916113 40883590 39195162 37774728 36183382 34899169
16664C4899169j049429n91104r45453j604355j248376p59114p68010p59982r52122
16655B6221224j072921n54357m94994j202756o27255j94989r68091l84400q82068
16646A9839393p71627m24726k93604m28091q43037j33353p33671k42454k2955
16637A5945875q09420k99256j58293n32191k58087n31430k17120m72906m55281
16628A2211891J99107l01302o33418j40344l85026Q6807l93956m70237M2266q8812
16618A0126976k15420k46248o07057J03876K70933m28564n4344m57398j55705
16609H337049l30061j76619l63664K81639m65762o005r4575p6609n71353M15343
16599F949383j08448r2151k03754r5709j15776j09050l6526k07053l53520K35013
$$ plain form
16664 34899169 33849740 33258636 32313183 30708828 29460452 28701338 27933328 27173346 26221224
16655 26221224 25148303 24593946 24098952 22896196 22268941 22073952 21105861 20721461 19839393
16646 19839393 19067766 18643040 18349436 17921345 17078308 16944955 16211284 15968830 15945875
16637 15945875 15136455 14837199 14678906 14146715 13888628 13357198 13140078 12667172 12211891
16628 12211891 12410998 12109696 11476278 11335934 10950908 11037715 10643759 10173522 10215788 10126976
16618 10126976 9911556 9665308 9058251 9162127 9433060 9004496 8950152 8492754 8337049
16609 8337049 8006988 7830369 7466705 7748344 7282582 7276577 7182002 7105393 6534040 6949383
16599 6949383 6840935 6748784 6545030 6449321 6333545 6224495 6187969 5980916 5627396 5862409
16589E862409j19465k38749j80857K02966j02603l28191k35578L37620l58756
16580D838796k4288j91387J42794k14132L93681m42112J99281j94142j268j71147
16570D336076N8531m51994j57975K05053q9801J33124J7470l43336mJ92478k19608
16559C680014l39469M41008k96140p8897m04216K16176J83549K72023o05683J93151
16549C261516l8567j86434j59454J47783K44820p16287K33561J40536k29481J21345
16539B819338j60260J55497j46989k9000k77427L77315J39958m81779j5739K0128
16529B401042j65389K51139J05289m20898P2501l3055q5876J73906N4409j74068
16519B179000j39944L57143m7368n98394N16159n20757L46272k6285k25741L77505
$$ plain form
16589 5862409 5742944 5504195 5323338 5526304 5423701 5095510 4859932 5197552 4838796
16580 4838796 4814508 4623121 4765915 4551783 4945464 4503352 4702633 4508491 4507223 4336076
16570 4336076 4394607 3942613 3784638 3989691 3899890 4033014 4050484 3707148 3707144 3899622 3680014
16559 3680014 3340545 3781553 3485413 3406516 3002300 3218476 3402025 3674048 3068365 3261516
16549 3261516 3222949 3036515 2877061 3024844 3269664 2553377 2786938 2927474 2697993 2819338
16539 2819338 2659078 2814575 2667586 2638586 2361159 2738474 2878432 2396653 2380914 2401042
16529 2401042 2235653 2486792 2592081 2171183 2243684 2210629 2124753 2298659 2353068 2179000
16519 2179000 2039056 2396199 2348831 1750437 2266596 1745839 2092111 2065826 1840085 2217590
16509B217590j54045p7433k68416n6003j02608L09790N5570M4463j56991M0901
16499A852818k26378K60098k76599L89085j60982j02816J56325k07849p5975O4506
16489A672233j1767k8306o0294J85196l46352q395J14784m1889j55287J45715
16479A465638k20827M30981l43393N01K19374k39641j20450j84260L92618k11799
16469A188742j13119K01499J40009k39502J12681O7391n7804J09872q9451N6728
16459A377046m65059L35890K1636p7107p3417n9466O6399J86774l58317j42379
16449H12000M07886O3116j32145K80633l11899K86249n59782P9718J71421K523
16439A099720p4537J1524m1196p4093K90840l70164J3517j33645P3486J64034
$$ plain form
16509 2217590 2063545 1986112 1717696 1661693 1559085 1868875 1924445 1968908 1811917 1852818
16499 1852818 1626440 1886538 1609939 1999024 1838042 1735226 1891551 1683702 1607727 1672233
16489 1672233 1660466 1632160 1571866 1757062 1410710 1402315 1517099 1475210 1319923 1465638
16479 1465638 1244811 1675792 1332399 1332900 1552274 1312633 1192183 1007923 1400541 1188742
16469 1188742 1075623 1277122 1417131 1177629 1290310 1357701 1299897 1409769 1320318 1377046
16459 1377046 911987 1247877 1269513 1192406 1118989 1059523 1125922 1312696 954379 812000
16449 812000 1219886 1283002 1150857 1431490 1119591 1405840 846058 925776 1097197 1099720
16439 1099720 1025183 1036707 995511 921418 1212258 842094 855611 721966 795452 959486
16429I59486j05267Q7581j7469l3399r0293k1830J80728Q1844n9893l2596j11386
16418H37506K68457k34024l8296J95699n13151L88575K1170k19061k14296K62730
16408G55309J12841j6648L48067k05362l59375J23190k33116L81267j39213j48017
16398F18943J07535J13663j20025K7386K8202r7723j00349J38844k55700L29962
16388G90738k48911J50427j74899L30989k81523L71716o9235j80011K32644j35221
16378G86714j08001j22133l1871j36104M10644k04596M76539l83308l14538P4179
16368D47525K02574K35479D38670K84343j72163J98859l60708J46306N3361j57648
16358D31020L25441j31606B88282L34532k52163K50449J20989C42004O5918o1359
$$ plain form
16429 959486 854219 941800 924331 890932 800639 778809 959537 1041381 981488 948892 837506
16418 837506 1105963 871939 833643 1029342 516191 904766 925936 706875 492579 755309
16408 755309 868150 851502 1199569 994207 634832 758022 524906 906173 766960 618943
16398 618943 726478 840141 720116 747502 775704 677981 577632 716476 460776 790738
16388 790738 541827 692254 517355 848344 566821 938537 869302 689291 921935 786714
16378 786714 678713 556580 524709 388605 799249 594653 1071192 687884 373346 447525
16368 447525 650099 885578 438670 723013 550850 749709 389001 535307 588668 431020
16358 431020 756461 624855 288282 622814 370651 621100 742089 342004 407922 346563
16348C46563K08853R9169q304k01189k08005K7845L38858k4960j29647q1343j43416
16337B24424N08109J29186D09492J58929j37952N843k862A57764L92321J01657
16327F51742C01339m1228J27319l4541R3553L27906C37882J91103k05835J59108
16317D82258N7095K4233j40061K9425B09437K3324J76446J88066B70960N45125
16307H16085C57868p5891L03516k08440J5739K5814m657J3090j07890J04347A43564
16295E29061B27997P2290K71909B71574J0162r7839m4388J33984J58133j15620
16285C16006B7290L23686j16505R6374E5143J85081r2755L76639q0483o1402j11154
16274B71069L1633J06426j65698M4919N412J52314A24962J24791R9205e7561B51652
$$ plain form
16348 346563 555416 654585 646281 445092 237087 264932 603790 578830 449183 367840 224424
16337 224424 732533 861719 409492 568421 430469 436312 433450 157764 550085 651742
16327 651742 301339 260111 387430 352889 446442 774348 337882 528985 323150 482258
16317 482258 539353 563586 423525 452950 209437 232761 409207 597273 270960 816085
16307 816085 357868 281977 585493 377053 392792 418606 413949 427039 319149 423496 143564
16295 529061 227997 300287 572196 271574 281736 183897 139509 273493 431626 316006
16285 316006 27290 350976 234471 330845 55143 240224 147469 524108 443625 382223 271069
16274 271069 302702 409128 243430 288349 293761 446075 124962 249753 348958 -57561 251652
16262D76976O2244K5737k38685J7324O6066A18738K58460N632j39027K39351B14463
16250C02215j09558N91914K8625A80732J53724H4440J33628K7712K8678L1513
16240C05971j06947n7310J74963J16396G9332a86893C32597j23424b6682B20782
16229B43654m0133K05621K87793A77676N0300J97525j74318K50445B26832n4051
16219A72781L7438m9863j984P5865q75J47138A84351b896A71689p1398J80862
16208B81153b8055B55552b28002F6847K78545I8170L60357A76964J19296r643
16198B86617K9288F0012J01374L9505O3371j06241K61809q5350j24428B1195J97327
16187B18522j02948l4204K31088h1275B81571h1635B48864K4648A33649B4823
$$ plain form
16262 476976 539220 564957 326272 343596 409662 118738 377198 382830 243803 483154 214463
16250 302215 192657 784571 813196 180732 334456 84440 218068 245780 274458 305971
16240 305971 199024 141714 316677 433073 79332 -186893 332597 209173 -26682 220782
16229 243654 203521 409142 696935 177676 227976 425501 251183 501628 226832 172781
16219 172781 210219 160356 158372 234237 233362 380500 184351 -2896 171689 100291 281153
16208 281153 -28055 255552 -228002 66847 345392 98170 458527 176964 296260 286617
16198 286617 315905 60012 161386 200891 264262 158021 419830 334480 210052 21195 218522
16187 218522 115574 81370 312458 -81275 281571 -81635 248864 273512 133649 24823
16176e43080B52521H5699K41386m3937B4803J80776r10M61474B11568A7515h5720
16164a66761A46588i2453A09226J41761C6277J19533a060B05846b44554A60624
16153E35605B60093I5962L28326C8720L4803l2126a94313I3502Q0688H1761I143
16141A59346R1010M0707a41138A05660C5935Q2432C1722N382a69703n4269B3329
16129A47795K10876j9059r8548l4273A02057k5235e8175I7055C0878r703M84266
16118E05441h5495A65771E8152a0767j07653C26575A03891b9045A93720m6697
16108A47023k4369g5946B88017a3508m0149A60316F8359N0379j6928M7156J10409
16097B59375l0485m6320i1358A31083B4757h4179l29231B25560J17224b2131G3885
$$ plain form
16176 -543080 252521 85699 327085 283148 24803 205579 204669 666143 211568 17515 -85720
16164 -166761 146588 -92453 109226 250987 36277 155810 -1060 205846 -244554 160624
16153 535605 260093 95962 424288 38720 73523 41397 -194313 93502 174190 81761 9143
16141 159346 250356 291063 -141138 105660 35935 118367 31722 37104 -169703 -223972 23329
16129 147795 358671 339612 241064 206791 102057 76822 -58175 97055 30878 21175 505441
16118 505441 -85495 165771 58152 -10767 -118420 326575 103891 -29045 193720 147023
16108 147023 122654 -75946 288017 -13508 -53657 160316 68359 118738 101810 148966 259375
16097 259375 228890 182570 -91358 131083 24757 -84179 -413410 225560 342784 -22131 73885
16085A55091n2764C7300P3664P5908c35154B74975I6748c8730B66434q5687p1930
16074A08817N719J08682K359a10064B39230E1018J23125D6347r020C473K32295
16063B35768b7071m9865A92632d52686h4036D26342B10163r4312L7307a2793l4430
16052d7223A06758A7700L27551A59523a02956A93904f3367B30121k0669P4877
16042B84329b97507A73345p0414B4705b66602A48898k7727J24562L0669B0784
16031B19470I6552a23130c6184j12708a8495F0442K31782b7421A83045o5708c6745
16019F7704K54606b71864A77687H8678K85912b11506d244B573b31560h176A30063
16007a43509D1809K45175J41776a11476a9161r859A80794F6181a31231G4838a07430
$$ plain form
16085 155091 102327 37300 110964 186872 -335154 274975 96748 -38730 266434 180747 108817
16074 108817 114536 223218 225577 -110064 239230 51018 174143 46347 37327 3473 235768
16063 235768 -27071 -76936 192632 -452686 -84036 426342 210163 115851 153158 -12793 -47223
16052 -47223 106758 17700 345251 159523 -102956 193904 -63367 230121 209452 284329
16042 284329 -297507 173345 102931 24705 -266602 148898 121171 245733 276402 20784
16031 219470 96552 -123130 -36184 -148892 -18495 60442 292224 -27421 183045 117337 -36745
16019 67704 322310 -271864 177687 88678 374590 -211506 -4244 2573 -231560 -8176 130063
16007 -143509 41809 286984 428760 -111476 -19161 -29020 180794 66181 -131231 74838 -107430
15995G7647c54231A37348F4873i5184p0085d10B32069R9910c04824K7844a02374
15983g5222A31643a82814A96027i6395c9194B29426b2307E6708J95388k0154J37567
15972C69509J80471J94010J06425p4968L35776B56674L3639J52957A54208f5419
15961b2918k38882C71902b00655B11619a79633A27527R0036J70205a27623B18978
15950a05444G361J7601J16354j4640F2482K1269N4619f5904A25172a87006d6137
15938a96350b9469C20543a66622A19213E5713b15773A64427f7928A61924c61722
15927E0273a15940j00049A05198L04879h7361j1405H6254c38888B4619b37435
15916b14968B8267J57424n4959n2835b9822k22995B21103A04063c54990Q0742
$$ plain form
15995 77647 -354231 137348 64873 -95184 -165269 -410 232069 331979 -304824 -276980 -102374
15983 -75222 131643 -182814 196027 -96395 -39194 229426 -22307 56708 252096 231942 369509
15972 369509 549980 743990 850415 775447 1111223 256674 290313 443270 154208 -65419
15961 -22918 -261800 371902 -200655 211619 -179633 127527 217563 387768 -127623 218978
15950 -105444 7361 24962 141316 126676 62482 83751 138370 -65904 125172 -187006 -46137
15938 -196350 -29469 320543 -166622 119213 55713 -215773 164427 -67928 161924 -361722
15927 50273 -115940 -215989 105198 410077 -87361 -98766 86254 -338888 24619 -237435
15916 -214968 28267 185691 130732 77897 -29822 -252817 221103 104063 -354990 -274248
15906b74248G6683O5835C909a8128r7083e850l640C2667d20796A3487a34269N0951
15894h3318j3719C82358K1597B2549K91524j00709b433B70683A25236c8432j62214
15883b00646i7015B8888b38056C09952f4488l356p7108q6266g4757o283r90b0774
15870b89626a33325C0260a06864p8516e91A96908b98107N7631D14966a26632M3770
15859h2862l8844G8643J33664c54493a306r3640j25508C14758a17092c8472H6196
15847G1541N2841j2833i6264l32141h674A49921B6602c08101C8425a3222j15762
15836a28984a5147j09607I0855J14136f2462j66595o0417R5205a3660j46888B40344
15824E9900K06862D7334R4648a43047j7272A24760h1339I8116g7152B14073e4638
$$ plain form
15906 -274248 76683 142518 3909 -18128 -115211 -5850 -9490 32667 -420796 13487 -134269 -83318
15894 -83318 -97037 382358 403955 22549 314073 213364 -2433 270683 125236 -38432 -200646
15883 -200646 -97015 28888 -238056 309952 -64488 -67844 -144952 -231218 -74757 -81040 -82030 -20774
15870 -289626 -133325 30260 -106864 -185380 -591 196908 -298107 -240476 414966 -126632 -82862
15859 -82862 -121706 78643 212307 -354493 -1306 -94946 -220454 314758 -117092 -38472 86196
15847 71541 124382 111549 -96264 -428405 -8674 149921 26602 -308101 38425 -13222 -128984
15836 -128984 -15147 -124754 90855 204991 -62462 -229057 -289474 -194269 -13660 -160548 240344
15824 59900 266762 47334 141982 -143047 -160319 124760 -81339 98116 -77152 214073 -54638
15812C19536A09868a51060A64199b98861a39110F1289a10218A47510e3651j23803
15802a77454n8900i0093B8783M4730a0742k99656a16737F3854O7J95148E7390
15790I0185C9948J99856C8109a40193L204d9613o177p5733A28843K88884j53958
15779B63769a75813f5795p3734B96566a44383B90050a28450c2713B27225H3348
15768a76803f9617j29347d8981A3739N4994M2886C1248L9071e4870K4650m0065
15757g0285A00642M3527D4544b06154I2711i6811A21317b25186B91754A35315
15746a59045A10801f1957m04253B64275D847g930H4500K04106a89791d3517C59897
15734a15541L3506F2429h8047B12484i4710A82533a45826A4574J38543a11470
$$ plain form
15812 319536 109868 -151060 164199 -298861 -139110 61289 -110218 147510 -53651 -177454
15802 -177454 -236354 -90093 28783 73513 -10742 -310398 -116737 63854 63921 259069 57390
15790 90185 39948 239804 38109 -140193 -136989 -49613 -55790 -131523 128843 417727 263769
15779 263769 -175813 -65795 -139529 296566 -144383 290050 -128450 -32713 227225 83348
15768 -176803 -69617 -198964 -48981 13739 68733 111619 31248 70319 -54870 -30220 -70285
15757 -70285 100642 144169 44544 -206154 92711 -96811 121317 -225186 291754 135315
15746 -159045 110801 -61957 -466210 264275 4847 -7930 84500 288606 -189791 -43517 359897
15734 -115541 -82035 62429 -88047 212484 -94710 182533 -145826 14574 153117 -111470
15723b04599D87705k05315d7736a3349A59532B3380M00966A64549C6970h5839
15712A19928C1590L2889J95260i8358a5809d078n0876j36648A95011a84859H3665
15700C04428H9131c82487H0924g0152j2518o6220c226D0962c04539b6095G8520
15688I1914g4411A4326b84707F5426a54365O7296q9997H1572J48158c93702A18599
15676e7124J2824k4454B80693b66194P8214f3328J8660A50947o1641D3681f6073
15664a03589N0923n09B64121A22445e2276k22042A50886a3251A60649b17563A23821
15652a01275B18678c6272j01717q2668e2933I8855a65716a0292L769A16704c47284
15640A92583b43065A89499b66107A97250c1622k09206o8461A69331e4739B05319
$$ plain form
15723 -204599 487705 282390 -47736 -13349 159532 23380 424346 164549 36970 -85839
15712 119928 31590 64479 259739 -98358 -15809 -4078 -54954 -191602 195011 -184859 83665
15700 304428 89131 -382487 80924 -70152 -82670 -148890 -3226 40962 -304539 -26095 78520
15688 91914 -74411 14326 -284707 65426 -154365 -87069 -177066 81572 229730 -393702 118599
15676 -57124 -44300 -68754 280693 -266194 -187980 -63328 -44668 150947 89306 43681 -66073
15664 -103589 -52666 -53175 264121 122445 -52276 -274318 150886 -13251 160649 -217563 123821
15652 -101275 218678 -36272 -137989 -220657 -52933 98855 -165716 -10292 -6523 116704 -347284
15640 192583 -243065 189499 -266107 197250 -31622 -240828 -309289 169331 -54739 205319
15629b29055D87001D0997P9022R193b7481k46939g848j29539d1849A73511b36603
15617b96156A01185a6901H5569R4907d8724R852k30650a09277M2566A40065N8156
15606A98221b34901a6226p320k33647O0439C71778A27274a64850A26280e6622
15595e3417j42161B04258n3875C1326J22728K0179G2295O378b30790b9731K664
15584b7067C06267b84675J21864C1071K16260D4655g0734j47589c7822A117h2369
15572a00001J9324A68679b22466B92208f2954A52033a56048K7095b9746j92218
15562b21964n6545E7868K01847c205r2389B9067a16458d8822J895D2564L9460
15551H2024b82981i3093J6507Q54J1671L0823I2628a05802A64580a90923r24A07355
$$ plain form
15629 -229055 487001 40997 120019 129212 -27481 -274420 -7848 -137387 -41849 173511 -236603
15617 -296156 101185 -16901 85569 180476 -48724 -38872 -269522 -109277 -66711 140065 198221
15606 198221 -234901 -16226 -23546 -257193 -196754 371778 127274 -164850 126280 -56622
15595 -53417 -195578 204258 150383 31326 154054 174233 72295 78673 -230790 -29731 -27067
15584 -27067 306267 -284675 -162811 31071 247331 44655 -70734 -218323 -37822 1117 -82369
15572 -100001 -80677 168679 -222466 292208 -62954 152033 -156048 -128953 -29746 -221964
15562 -221964 -278509 57868 259715 -3205 -95594 29067 -116458 -48822 -46927 42564 82024
15551 82024 -282981 -93093 -76586 -75732 -64061 -33238 92628 -105802 164580 -190923 -191847 107355
15538F1063h5302j19095A3661J79358r1869a31749B24715h9749b1588C62747F4693
15526B02975J65200j48453A7949M7674e2129B4126P6178J09286a60113C3710a70330
15514a89106g7059K2912A57332n7083a45071b1936k10845b5320G0939a6332H3367
15502B1971L4066e6588j94024C32541a01633C83158G5499J29966j01498R1851
15492A95818J8338L0987H1257J60772q7139q323a82739D7540J17920A8631K32264
15481B50895E0808a09272K5273K4100A10013l8854K27721k7692g7839B5532J88998
15470B14530a74338C53675E6517L00983m1071k751r5620Q6374K95014j30760m8501
15459D20185n2966L95417l17701H3064K26788B8853L44107A50395B5177L52312
$$ plain form
15538 61063 -85302 -204397 13661 193019 101150 -131749 224715 -89749 -21588 362747 64693
15526 202975 368175 219722 17949 65623 -52129 24126 100304 209590 -160113 33710 -170330
15514 -189106 -77059 -54147 157332 100249 -145071 -21936 -232781 -25320 70939 -16332 83367
15502 21971 56037 -56588 -250612 332541 -101633 383158 75499 205465 103967 195818
15492 195818 214156 245143 81257 242029 154890 146567 -182739 47540 165460 18631 250895
15481 250895 50808 -109272 -83999 -59899 110013 71159 298880 271188 -77839 25532 214530
15470 214530 -174338 353675 56517 357500 316429 313678 218058 304432 599446 468686 420185
15459 420185 367219 762636 444935 83064 309852 28853 372960 150395 25177 377489
15449C77489A75787H4547K56879p3488a92644A40758C5623a46826d1407B00973
15438B07060G796J80726d5899A08318K28179F408g3366C16837M75452l30668k30372
15427B31249M84237J18827M0266l0810l28711K6453j01562A29373j278J40708
15417B68803J91173r7086E5275K11552b68210A7875K11148b2036A0615R8985i5047
15405A8667b28100e5198A13287g7611b3549B09408a41469B8075j3830a44749C6404
15393a17930K3666j86180R9883g4816K5591B47836r8426b57686H3116K2380b05038
15381i4319G9683O876M1030B6343a28390L3028H651J28061D8707J60333h8035
15369c48669a28319A96899b48865A44356B5572K44927J46241B7790a47586B19267
$$ plain form
15449 377489 175787 84547 341426 267938 -192644 140758 35623 -146826 -41407 200973
15438 207060 7796 188522 -45899 108318 336497 6408 -73366 316837 792289 461621 231249
15427 231249 715486 834313 874579 843769 515058 541511 439949 129373 128095 268803
15417 268803 459976 362890 55275 266827 -268210 17875 229023 -22036 10615 109600 -95047
15405 18667 -228100 -55198 113287 -77611 -23549 209408 -141469 28075 14245 -144749 36404
15393 -117930 -94264 -280444 -180561 -74816 -49225 247836 149410 -257686 83116 105496 -205038
15381 -94319 79683 86559 127589 26343 -128390 -95362 8651 136712 48707 209040 -88035
15369 -348669 -128319 196899 -248865 144356 25572 270499 416740 27790 -147586 219267
15358D33251N4771j32981J72177A3256J73496c2196A38563L50559e770j19788
15348a25558A3377n047J42237m0665a26458E03220A37020o3905L40468A83194
15337B59720j19815L19229j93280A0071J47820o4944K63590P3144q8715k4055
15327C16911I7357M04678E0856J30826M3600l3918a56111A4980Q2683b1654C04396
15315C1719b53316O0645B67848F5900R0321J49691e7058A97305a7767A24515A0068
15303A64299C9457g7337E9114J48199J48310a653j11856C7753J28645G1160d3312
15291i9018B55471B6528M17207j34156r9457o316E320L10043o8108J05674e5201
15279a1243C2824K22564a6137A06717a42757B62845a46322A42420e0532j94135
$$ plain form
15358 433251 488022 355041 527218 13256 186752 -32196 138563 489122 -5770 -125558
15348 -125558 13377 8330 150567 109902 -126458 503220 137020 73115 413583 183194
15337 259720 139905 459134 265854 10071 157891 92947 356537 429681 340966 316911
15327 316911 97357 502035 50856 181682 225282 191364 -156111 14980 97663 -21654 304396
15315 31719 -253316 -192671 267848 65900 156221 305912 -57058 197305 -17767 124515 10068
15303 164299 39457 -77337 59114 207313 355623 -1653 -113509 37753 166398 71160 -43312
15291 -99018 255471 26528 443735 309579 210122 203806 5320 315363 247255 352929 -55201
15279 -11243 32824 255388 -16137 106717 -142757 262845 -146322 142420 -50532 -244667
15269b44667L4590b4463C6543L9795L0089K31791A06129l0620l1499c32579f3590
15257f2373B70282j08453a00528J2775E9872f4512j37833e0382A36063b82749
15246A09113a32378A04906l6952O6052d26884B30631a43305d4617A9517J89101
15236B08618A2003g9538B04316C9645M4987Q1915M86489k80609N36170N28466
15226A437063j70219K42161n29487m07159k60257O7539j00462L2615E7533K87059
15216C44592f0642B92874a13790c1545k00205A41566E046K15211h4725I9015K02871
15205C01886F2873J04359G1494A3348K09987J27663j70496q5501h7715A49988
15194G9379R7930d6292B98059I0515k6352J22595c75775a77822C04765E9772K68186
$$ plain form
15269 -244667 -210077 -24463 36543 76338 106427 338218 106129 75509 44010 -332579 -63590
15257 -62373 270282 161829 -100528 -87753 59872 -64512 -202345 -50382 136063 -282749
15246 109113 -132378 104906 67954 134006 -426884 230631 -143305 -44617 19517 208618
15236 208618 12003 -79538 204316 39645 84632 166547 653036 372427 908597 1437063
15226 1437063 1266844 1509005 979518 572359 312102 379641 279179 311794 57533 344592
15216 344592 -60642 292874 -113790 -31545 -231750 141566 5046 220257 -84725 99015 301886
15205 301886 62873 167232 71494 13348 223335 350998 180502 95001 -87715 149988
15194 79379 177309 -46292 298059 90515 64163 186758 -375775 -177822 304765 59772 327958
15183C27958E3879R1993b54991A13427J81108g1042k22j84837P4326H3117b51971
15171D4030b32453B68438j05783b298D1897J43778m1700c95022B17978g895p0366
15160g8261E3355J88516a48491A42447M8007p5585g7475p0267A66048e8786q8231
15149a47017A65303e7438A93010K3990c1447H8263B4721g1644B850b1677A77141
15137B43103f6764j29786B46660R459D9560J44567f5245k5887K1068B94014c75716
15125C02129m8106p1916n0011N6178C6449J31339d8534p6917b5480e390r5017
15114a00407j31012I2687K50708D6488M73513F1425K9414J94649q1606d0248B90911
15102B02755L03153A95348K7800n7264d582C3743J43199a10462F0134f867j68219
$$ plain form
15183 327958 53879 145872 -254991 113427 294535 -71042 -71264 -256101 -181775 83117 -251971
15171 44030 -232453 268438 162655 -2298 41897 185675 143975 -395022 217978 -7895 -78261
15160 -78261 53355 241871 -148491 142447 190454 114869 -77475 -147742 166048 -58786 -147017
15149 -147017 165303 -57438 193010 217000 -31447 88263 24721 -71644 2850 -21677 177141
15137 243103 -66764 -196550 246660 256119 49560 194127 -65245 -91132 -70064 294014 -375716
15125 302129 254023 182107 132096 188274 36449 167788 -48534 -125451 -25480 -5390 -100407
15114 -100407 -231419 92687 343395 46488 520001 61425 90839 285488 203882 -40248 290911
15102 202755 505908 195348 223148 165884 -4582 33743 176942 -110462 60134 -6867 -175086
15091a75086F4656b79192a13837A96861M02524A66087J60360B4111M85448A3515
15080A93070J36232A47215N1367a95975E8241R6582b32195A87557P4408e1303
15069A49408a8347k12688A83145l9937E8071K14055a75051E4094A610L58353j23547
15058B36416k8458J12959b02056A28921k1658m6538L1636J17997a89664B42629
15047B62695J86741N1301H4563m1661L1434K60294o2083k9992J00175j37817Q3832
15036B88745K5403R0737j64127L0202K5342J30928q9081p1379k2808K46888k42360
15025B48490H5086O5028M78810A50666J62616J63628A72755D4378M97498j49249
15015C92627K1310J64362J78812m7975C00921K37712j24674j6194J05337j13449
$$ plain form
15091 -175086 64656 -279192 -113837 196861 599385 166087 326447 24111 509559 13515
15080 193070 329302 147215 198582 -195975 58241 154823 -232195 187557 261965 -51303
15069 149408 -18347 -231035 183145 143208 58071 272126 -175051 54094 1610 359963 236416
15058 236416 207958 320917 -202056 128921 107263 60725 92361 210358 -189664 242629
15047 262695 449436 500737 84563 42902 74336 334630 272547 242555 342730 204913 288745
15036 288745 314148 404885 240758 270960 296302 427230 338149 266770 243962 490850 248490
15025 248490 85086 150114 628924 150666 313282 476910 172755 44378 541876 392627
15015 392627 413937 578299 757111 709136 300921 538633 413959 397765 503102 389653
15005C89653Q8920j80176J31833A51672Q9100r6083K04813J4823L3759K70255
14995F68339j29951p8158K04916l30322J66351j89408j26911M25157C01039n111
14985B95928J07872A38712L24825L22733A74631K25088j58225L59604B12460L36628
14975E49088j51470K46677j99351m9927Q1948p0763K14001K48309J3041Q1391
14965I62944j70213J03007l31203B77331K33648m0739M9415p0987K21184L02341
14955I72193l31411I9069J45793P7325J18406k9576r0877J02514M2921A09182
14944C39748O9336j86025J26814E7866J90007q1989r492J30747O5860J59627I7236
14932G10534j95925J0977A41216N16183J02582C73479M0214q1744J54232k6904
$$ plain form
15005 389653 478573 298397 430230 151672 240772 144689 349502 364325 398084 668339
14995 668339 538388 460230 665146 334824 501175 311767 184856 610013 301039 295928
14985 295928 403800 138712 463537 786270 174631 399719 241494 601098 212460 549088
14975 549088 397618 644295 444944 395017 476965 406202 620203 868512 881553 962944
14965 962944 792731 895738 564535 277331 510979 470240 519655 448668 669852 972193
14955 972193 640782 99069 244862 322187 440593 411017 320140 422654 465575 109182
14944 339748 409084 223059 349873 57866 247873 165884 156392 287139 352999 512626 97236
14932 710534 514609 525586 141216 657399 759981 373479 413693 331949 486181 459277
14922D59277K24202C37979K08691K98645R29j63595M83441R5312k61425K71912
14912A271889o5233o7186K96742L32667m64028L35807j58825J85105l4934R567
14902A641571J08239M05289m13091n4458o31596K26872m53860k35005l1982k40990
14892C20989K62392J0202j98571J96326k44262J43686j47594L26272j55531J9413
14882E33322A55699L87672j02239N11182k48501k63252J30868j85885K70883B21828
14871H12794C60659N39179m1287j00778J32828k25699Q8084J16094R1364j61926
14861G98518k50090j11408J92600l4113k22005j16419P5922M60974l21441N8611
14851E31149k47661M11421J95614j62857O3801k56073B32256b568F92463C05532
$$ plain form
14922 459277 683479 337979 546670 845315 846244 682649 1166090 1261402 999977 1271889
14912 1271889 1206656 1139470 1436212 1768879 1304851 1640658 1481833 1666938 1632004 1641571
14902 1641571 1749810 2155099 1742008 1687550 1055954 1282826 828966 593961 561979 320989
14892 320989 583381 593583 395012 591338 347076 490762 343168 669440 513909 533322
14882 533322 155699 543371 441132 952314 703813 440561 571429 385544 656427 221828
14871 812794 360659 899838 858551 757773 890601 664902 752986 869080 960444 798518
14861 798518 548428 437020 629620 595507 373502 257083 333005 793979 472538 531149
14851 531149 283488 694909 890523 727666 791467 535394 232256 -2568 692463 305532
14840C31633L09537A24310M5887L13667Q0586B43683K19137Q9939n9168j50484
14830C43107K37801J50975J79615N0723j6479L02044F04393L20007J04668l87151
14820F41917j51792K97326L0061C09445M09842k29373O5785O0600m7158K7582
14810E96723J93915A40483L55704k25919N33745k76406N0550m7158K45616o7056
14800G09559C53920M89037C47809K80447J03468k17619J22481J65582L2739k59137
14790E75770M77831m26506K94033j74899L9008O1671k87753J24020j94439R555
14780D98291j23515J22299J27370o1060j27111k4550M12258l77916L02351C18281
14769D45628N7369K22886O7732k62086Q7818L68520k67602J40553J96205j20004
$$ plain form
14840 331633 641170 124310 170197 483864 564450 243683 462820 552759 493591 343107
14830 343107 580908 731883 911498 962221 945742 1247786 604393 924400 1029068 641917
14820 641917 490125 787451 817512 309445 719287 489914 555699 616299 569141 596723
14810 596723 790638 140483 496187 270268 804013 527607 578157 530999 776615 709559
14800 709559 353920 842957 347809 628256 731724 514105 636586 802168 834907 575770
14790 575770 1053601 627095 921128 746229 785237 846908 559155 683175 488736 498291
14780 498291 374776 497075 624445 563385 436274 411724 823982 446066 748417 318281
14769 445628 502997 725883 793615 531529 619347 987867 720265 860818 1057023 937019
14759I37019l17913o3085J14754o8113J53795q7507l0029K6814l6517K91866k78764
14748F42320j10559J29305j56843B37482N56709C76075l3739K32111p3119J33784
14738F35112O2770m41l6792k74735K40816k88677J53707J62072k31418Q7235L01636
14727H11285j94468K70611Q0025N1969D04324O83051l61925N1254k53434M17019
14717I40289j86116K03545K75698o0389K648J85463O05763l57094P8586m85682
14707A202711j79349m38524J03324o4592M77423l22733l04820L84694k46052L14113
14697I26195j96671j25431J10156J73179K10422O897k16032L82921j41816N311
14687A135131K86361L15791q5057M6776n33843P4231k96607J33225Q5229l5829
$$ plain form
14759 937019 619106 556021 670775 602662 756457 668950 638921 665735 629218 921084 642320
14748 642320 531761 661066 504223 237482 794191 376075 342336 574447 501328 635112
14738 635112 697882 697441 660649 385914 626730 338053 491760 653832 422414 509649 811285
14727 811285 616817 887428 967453 1019422 404324 1087375 725450 776704 523270 940289
14717 940289 754173 957718 1233416 1173027 1175675 1361138 1966901 1609807 1688393 1202711
14707 1202711 1023362 584838 688162 623570 1100993 778260 473440 858134 612082 926195
14697 926195 729524 604093 714249 887428 1097850 1104747 888715 1271636 1129820 1135131
14687 1135131 1421492 1737283 1652226 1699002 1165159 1239390 942783 1076008 1161237 1125408
14677A125408L9219l13219J56704n7396j87704O3848J86723r2895k02798L49252
14667A067142J30474o7108l47620k71169L74231O2663m20795M02504J01145q7901
14657I43566k00240k32324N40011l12375Q7089Q4996k28925N04819j18717l09645
14647G58255j0108J34076n8431K39997k5031j60889R1002l2415K76807p9796N2093
14636A185560l73255M25486p1524k62238J4580M46920k02658l4535k22239O6857
14626I72954L43238l42943o356k0255K18409j52028r965j040J99094j91700q3524
14615I25884o6327M99037m59481K35610P0301K3035N9798j08487j23855K32160
14605A287675j87738l538P2806K23701j0483k03922R2586K25804j17880j1403
$$ plain form
14677 1125408 1164627 851408 1008112 950716 763012 826860 1013583 920688 717890 1067142
14667 1067142 1197616 1130508 782888 511719 885950 948613 527818 930322 1031467 943566
14657 943566 743326 511002 1051013 738638 825727 910723 681798 1186617 1067900 758255
14647 758255 748147 882223 823792 1063789 1038758 877869 968871 936456 1213263 1133467 1185560
14636 1185560 812305 1237791 1166267 904029 918609 1365529 1162871 1128336 906097 972954
14626 972954 1316192 973249 966893 946638 1165047 1013019 1003054 1002014 1201108 1009408 925884
14615 925884 859557 1358594 899113 1134723 1205024 1228059 1287857 1179370 1055515 1287675
14605 1287675 1099937 1096399 1169205 1392906 1382423 1178501 1271087 1496891 1379011 1367608
14595A367608J19975m92270L61564J84291k41397J74956q5699j6212p507m9199
14585A316110K46044k75994l7169K86922j45121J75265J47737k78174r8863K09659
14575A546416K11677l19530J86801K89783j94285k4990p4249l17355M49376O2874
14565A816518j93634j7102J64676p8255L0619m856J51763J31159j30222K25304
14555B095970K59894l66122N1783M31622k14015j41218O9733L30726l08106J72804
14545B383071M70847k29942j41988K56065M44709L57554J57032K02627Q37484
14536D737459N88996J482236K501353L808667O470975J0632865J354723j4376015
14528A7201259o898541m257117j744070o32984J04393M93567l8888j130220n48687
$$ plain form
14595 1367608 1487583 995313 1356877 1541168 1299771 1474727 1389028 1372816 1365309 1316110
14585 1316110 1562154 1286160 1248991 1535913 1390792 1566057 1713794 1435620 1336757 1546416
14575 1546416 1758093 1438563 1625364 1915147 1720862 1695872 1621623 1304268 1753644 1816518
14565 1816518 1622884 1605782 1770458 1692203 1722822 1717966 1869729 2000888 1870666 2095970
14555 2095970 2355864 1989742 2041525 2473147 2259132 2117914 2187647 2518373 2210267 2383071
14545 2383071 2853918 2623976 2481988 2738053 3182762 3540316 3697348 3899975 4737459
14536 4737459 5326455 6808691 9310044 13118711 19589686 30222551 31577274 17201259
14528 17201259 10302718 6045601 4301531 3668547 3772940 4266507 4227619 3097399 2548712
14519B548712m27437R5046j09576j22709l6311n2864J92061m9992k86037K94889
14509B045782K4648N397n4697J89039k76254J82892j13704M29746o6229l87168
14499A979452L77246K0304K02691j46985P6996k86405K26697L16703m76053L47808
14489B638454j97126M07937j78307L91989l72667K97454m10349L71002k74702
14480B673685J13883j09100K2192J58465M09258l04296K58487l24174J06243J79359
14470C184002M3301J71932j18339K08102j94484j75j28303K58582L14339j21033
14460C617924j03740K25269j70794l47592N71586l31346J69966J87897L73416
14451D192586k73426M65076l00488m2336J12651P3745o5985k5154J48442J76642
$$ plain form
14519 2548712 2121275 2216321 2106745 1984036 1947725 1894861 2086922 2036930 1750893 2045782
14509 2045782 2070430 2075827 2021130 2210169 1933915 2116807 2003103 2432849 2366620 1979452
14499 1979452 2356698 2377002 2579693 2432708 2509704 2223299 2449996 2766699 2290646 2638454
14489 2638454 2441328 2849265 2670958 3062947 2690280 2987734 2577385 2948387 2673685
14480 2673685 2787568 2678468 2700660 2859125 3268383 2964087 3222574 2898400 3004643 3184002
14470 3184002 3227303 3399235 3280896 3488998 3294514 3294339 3166036 3424618 3738957 3617924
14460 3617924 3514184 3739453 3568659 3221067 3792653 3461307 3631273 3819170 4192586
14451 4192586 3919160 4384236 4083748 4041412 4154063 4227808 4161823 4136669 4285111 4461753
14441D461753j15748K93415o8281o2212K57283m48971M5684L77881n6036K38698
14431D923466P8229J17896P8901p6028N7641n3648o0220L58618j59905M50632
14421E715582q1j59528K22334K04417M1165k79903O02684k23590L29481k64261
14411F188300K87263J4598J14197L41531l40103N25389J33619j24503L53397J00210
14401G593898L4818r8890r6216P1648O03876o4418l5887j30135N88406k92K57714
14390H724522J16381O23779j39685p213m03103O36293q019K06383J61655J75393
14380A0086386O9689j7450L92883k45310M37519J69919K14557J42568J5502M01389
14370A1667652L98307K2302K16282O97760q3055N39489k4057L90854J87852j37053
$$ plain form
14441 4461753 4346005 4639420 4571139 4508927 4766210 4317239 4362923 4740804 4684768 4923466
14431 4923466 5001695 5119591 5198492 5122464 5180105 5126457 5066237 5424855 5264950 5715582
14421 5715582 5715501 5555973 5778307 5982724 6023889 5743986 6346670 6123080 6452561 6188300
14411 6188300 6475563 6490161 6604358 6945889 6605786 7131175 7264794 7140291 7493688 7593898
14401 7593898 7628716 7529826 7433610 7505258 8109134 8044716 8008829 7878694 8467100 8466808 8724522
14390 8724522 8840903 9464682 9324997 9317784 8914681 9550974 9542955 9749338 9910993 10086386
14380 10086386 10156075 10138625 10531508 10286198 10723717 10893636 11108193 11250761 11266263 11667652
14370 11667652 12065959 12088261 12304543 13002303 12919248 13458737 13434680 13825534 14013386 13876333
14360A3876333K92343O05330p9610L57740K91823N34283N74115o2129M61944M60784
14350A7312956L09548M30008K71973O86158K72501j73569N78340M70696L81149
14341B0539760P95025N08399K61309P62818N29225O92280L87341O57423N83106
14332B5716686O05877P79947Q59672O59489P24017Q44397O77684P87790J402423
14323C3057982P88850N39747J014588J426514R63601J289856J080367J283295
14315D1444800J523692J562492J131614J414750J738115J770982J888600J811899
14307E4286944J706750J854654K253412K710985K384084K470939K609784K887243
14299G3164795L239977K646060L568234L979487L410170M052651M060286M717958
$$ plain form
14360 13876333 14168676 14774006 14694396 15052136 15343959 15878242 16452357 16390228 16852172 17312956
14350 17312956 17622504 18052512 18324485 19010643 19283144 19109575 19687915 20158611 20539760
14341 20539760 21334785 21843184 22104493 22867311 23396536 24088816 24476157 25133580 25716686
14332 25716686 26322563 27102510 27962182 28621671 29345688 30190085 30867769 31655559 33057982
14323 33057982 33846832 34386579 35401167 36827681 37791282 39081138 40161505 41444800
14315 41444800 42968492 44530984 45662598 47077348 48815463 50586445 52475045 54286944
14307 54286944 55993694 57848348 60101760 62812745 65196829 67667768 70277552 73164795
14299 73164795 76404772 79050832 82619066 86598553 90008723 94061374 98121660 102839618
14291A02839618M606155N327206N705886N828802O571373O745168P444840P253622
14283A52322670Q039145Q962802R069586R999818J0546126J1061770J1895985
14276B21897902J2674262J3263771J4113715J4169504J5372139J5368684J5657596
14269C22517573J6271285J6407665J6284310J6267262J4964582J4104358J3203329
14262D30020364J2290562J1593959J0440455N805267K018437J752683J565592
14255D75487319K154275j526864r591407o955254p898706j3603566j4615164j4475092
14247D08975541j5140443j6085674j6189631j5935154j5856852j5752635j5387552
14240B98627600j4770815j4217085j3704826j2763961j2321608j3332984j2349673
$$ plain form
14291 102839618 107445773 112772979 118478865 124307667 130879040 137624208 145069048 152322670
14283 152322670 160361815 169324617 178394203 188394021 198940147 210001917 221897902
14276 221897902 234572164 247835935 261949650 276119154 291491293 306859977 322517573
14269 322517573 338788858 355196523 371480833 387748095 402712677 416817035 430020364
14262 430020364 442310926 453904885 464345340 470150607 472169044 473921727 475487319
14255 475487319 477641594 476114730 466523323 459568069 451669363 438065797 423450633 408975541
14247 408975541 393835098 377749424 361559793 345624639 329767787 314015152 298627600
14240 298627600 283856785 269639700 255934874 243170913 230849305 217516321 205166648
14233B05166648j0558055j0769349j0043380r410357q319422p990701p830624
14226A40244760o566256p015294o110424n605990n126910n058704m949785m249254
14218I5562143m252834l955907l371399l458878l564907l005143k931088k752216
14210F8269771k796233k386775k256516k496220j929083j872420k080214j258049
14202E1194261j979653j536181j666079j252757j276707j689614j386119j091969
14194C9315182q93128j130396p28232j218386j220034j023113q89222o21851q81344
14185C0709476k82897j132952j169869o02746o37077o73959m01408o84863j097187
14176B4026518l10866q13470l52586p67747l39474o92696j81029n60522o81561
$$ plain form
14233 205166648 194608593 183839244 173795864 164385507 156066085 148075384 140244760
14226 140244760 133678504 126663210 120552786 114946796 109819886 104761182 99811397 95562143
14218 95562143 91309309 87353402 83982003 80523125 76958218 73953075 71021987 68269771
14210 68269771 65473538 63086763 60830247 58334027 56404944 54532524 52452310 51194261
14202 51194261 49214608 47678427 46012348 44759591 43482884 41793270 40407151 39315182
14194 39315182 38422054 37291658 36563426 35345040 34125006 33101893 32212671 31590820 30709476
14185 30709476 30426579 29293627 28123758 27521012 26883935 26209976 25808568 25123705 24026518
14176 24026518 23715652 22902182 22549596 21781849 21442375 20749679 20568650 20008128 19326567
14167A9326567P3796n10921l26361o44724o68210J10963l19690o36085k59213
14158A6146122n8347l76560m87227j02619l60994k98151l93413l56086P8904n88732
14148A3202897j24193j05519r7680m14104l43375r8544k18655j94202l57755k24678
14138A1024192K78320l85783r9209o32433k54003J68746K3901n42892J29452J34009
14128I844300n58071n50963m0242L39629l53323o4088j53010n1132K00897n05582
14118H108415p8985p5370j22157l69345K10014j54561m90322R3046j27076J89630
14108G183289L74458n97028L341j37844K0217k40457k07248j25979k97384J36662
14098F112027j94108J21530j5390J8227m07725L67813j10490K12172n54876j66994
$$ plain form
14167 19326567 19400363 18889442 18563081 17918357 17250147 17361110 17041420 16405335 16146122
14158 16146122 16087775 15711215 15223988 15121369 14760375 14462224 14068811 13712725 13791629 13202897
14148 13202897 13078704 12973185 12875505 12461401 12118026 12019482 11800827 11606625 11248870 11024192
14138 11024192 11302512 10916729 10817520 10185087 9931084 10099830 10123731 9580839 9710291 9844300
14128 9844300 9286229 8735266 8695024 9034653 8681330 8617242 8464232 8413100 8613997 8108415
14118 8108415 8029430 7954060 7831903 7462558 7672572 7518011 7027689 7120735 6993659 7183289
14108 7183289 7557747 6960719 6964060 6826216 6846433 6605976 6398728 6272749 5975365 6112027
14098 6112027 5917919 6039449 6024059 6042286 5634561 6002374 5891884 6104056 5549180 5382186
14088E382186m23511J55444K47400j03801k7935m89799K72134j81378k970m2146
14078D785624j22221l7705O2385j43571p6801K21254q5694k45222J68135m74020
14068D052164L1101M10320l6868m9796k69459k47219M64209l86716r7246j02713
14058C767777L52613o73270N50317q9824l17396J44752j74325k23011M53794L4610
14048C826037k84837k0979K17954m85162J76430o4998j97565O8705K23836l60182
14038C099239K50719m45891M51419j70032M5362m48723J10707j43901Q4846R0394
14028B924139m51383O8651j86067L82061n1606n8834P0050j14062O453K59337
14018B848739k28591k2513L05489m03391L85401n02601k06003M17093j14525k64447
$$ plain form
14088 5382186 4958675 5114119 5361519 5257718 5229783 4739984 5012118 4830740 4827770 4785624
14078 4785624 4663403 4625698 4688083 4544512 4467711 4688965 4603271 4358049 4526184 4052164
14068 4052164 4083265 4493585 4456717 4406921 4137462 3890243 4354452 3967736 3870490 3767777
14058 3767777 4120390 3447120 3997437 3907613 3590217 3734969 3560644 3337633 3791427 3826037
14048 3826037 3541200 3520221 3738175 3253013 3429443 3364445 3166880 3235585 3459421 3099239
14038 3099239 3349958 2904067 3355486 3185454 3230816 2782093 2892800 2748899 2833745 2924139
14028 2924139 2472756 2541407 2355340 2737401 2685795 2626961 2697011 2582949 2589402 2848739
14018 2848739 2620148 2597635 2903124 2499733 2885134 2382533 2176530 2593623 2479098 2214651
14008B214651J29624K23892j66813k58222O3588K6459r3740J73468n2198k19404
13998B041305J86278l71516k06979L33742J50575q3220k11781L1299j05040L12606
13988B077269k9790j20166j96200j52998L63433m3038l3155K7399K95884N8448
13978B247086R6382N25475O2843J353022J821885K901607N571775J0474191Q809953
13969C3864219j2664145p613098n066078k036460j467754p09950m86075l65043
13961C455616n98345j54114j57486K77501m39242k5392J25807q7676n69727L41883
13951B168825P4501l05827j06729m4786N80424m63012Q6241r4159M1565L7081
13941A974124l55375j82530L93498o7299l65072M14006M2771N5503l04701k26302
$$ plain form
14008 2214651 2344275 2568167 2401354 2143132 2206720 2233179 2139439 2312907 2260709 2041305
13998 2041305 2227583 1856067 1649088 1982830 2133405 2050185 1838404 1869703 1764663 2077269
13988 2077269 2047479 1927313 1731113 1578115 1941548 1898510 1865355 1892754 2188638 2247086
13978 2247086 2343468 2868943 2931786 4284808 6106693 9008300 14580075 25054266 33864219
13969 33864219 21200074 13586976 8520898 6484438 5016684 4306734 3820659 3455616
13961 3455616 2857271 2703157 2545671 2823172 2383930 2358538 2484345 2396669 1826942 2168825
13951 2168825 2243326 1937499 1830770 1785984 2366408 1903396 1989637 1895478 1937043 1974124
13941 1974124 1618749 1436219 1829717 1762418 1397346 1811352 1854123 1909626 1604925 1378623
13931A378623L11593j95648O4301o7278J97252l64173J49576j67036J39283K42298
13921A688791k27929k30141J42843N6349m5433r4139K96538k7727j49458l60371
13911A049323J12773J07186K70884k71530L06910k29990R3060k18082K57647m56267
13901A021914K85382j90876M93j9857J87742K05518j87254j67595j09434j52078
13891H73955K67841O3423O8010k98978J75290k74666K37141M7554k46537J44234
13881A057267K40995j98097J02000l14829O92693p36296L02811J20801p0043l65088
13871H32214K94678r7331J0590l2415N40635n65204L1274k15640O59013n19516
13861I38298L58J48416R7730j2108m32548K58151j52662o6898J75445J18132k18252
$$ plain form
13931 1378623 1690216 1494568 1558869 1491591 1688843 1324670 1474246 1307210 1446493 1688791
13921 1688791 1460862 1230721 1373564 1429913 1384480 1290341 1586879 1559152 1409694 1049323
13911 1049323 1162096 1269282 1540166 1268636 1575546 1345556 1438616 1220534 1478181 1021914
13901 1021914 1307296 1116420 1116913 1097056 1284798 1490316 1303062 1135467 1026033 873955
13891 873955 1141796 1205219 1273229 974251 1149541 874875 1112016 1159570 913033 1057267
13881 1057267 1298262 1100165 1202165 887336 1580029 843733 1146544 1267345 1197302 832214
13871 832214 1126892 1029561 1040151 1007736 1548371 983167 1014441 798801 1457814 938298
13861 938298 938656 1087072 1184802 1172694 740146 998297 845635 778737 954182 1072314 854062
13850H54062n104K28610j47921k13400N61980m16142j74531J84144k7556J00915
13840I45057N5728l38140O06525n41800N6770J96250k49607L17219l33588k3612
13830F90802J31480j95849J91318R5884M5296J08510k27567j83535J85729j38274
13820G03794j42590L58179k27879j79164K13737L97980l12882P0071j02880l54481
13810D23885J59613J96281L6868L01222n11373K57544O8372l73992J66825L622
13800G28867J28821q3986j89986j03537Q1381K89380l48077K76300J89556k39830
13790G28889j24298j30950J84217J26106k08740J7728J99787j6369j43258J38251
13780G71363k13226m6053J46826r9844K56956j41403j5321J4034j53494O5877
$$ plain form
13850 854062 848958 1077568 929647 716247 1278227 862085 687554 871698 844142 945057
13840 945057 1000785 662645 1269170 727370 784140 980390 730783 1048002 714414 690802
13830 690802 822282 626433 817751 913635 958931 1067441 839874 656339 842068 703794
13820 703794 561204 919383 691504 512340 726077 1124057 811175 881246 778366 423885
13810 423885 583498 779779 816647 1117869 606496 864040 932412 558420 725245 728867
13800 728867 857688 773702 583716 480179 561560 850940 502863 779163 968719 728889
13790 728889 604591 473641 657858 783964 575224 592952 792739 776370 633112 771363
13780 771363 558137 512084 658910 559066 816022 674619 659298 673332 519838 585715
13770E85715m592n8261L57647k0775l2422j89657k93833M19065o1713J4936l09357
13759D06753M3814k16086J08749j11892N26342m4218p0189j70289m5344J35245
13749E62885J55234K20591l23843j78458j29469L34945o9648j8936o6505Q405
13739D95201n2255L19600I5213N38768k15545L42044l65293j39668j7180M69905
13729G08244B94932M31524q2986j44993j3770K90681j1195B81945J99968B09534
13718D25123k6193n5550J67071k3543q3478J49373J17009C29107L98524k87552
13708D40079k17072M39853J2090M0478B63141K59476q9618K0862M7021K53767
13698G54649A88038M27376j08078k26474J69115j91774K29767p146j26766k4962
$$ plain form
13770 585715 581123 522862 880509 859734 827312 637655 343822 762887 701174 716110 406753
13759 406753 450567 234481 343230 231338 757680 713462 643273 472984 427640 562885
13749 562885 718119 938710 614867 436409 306940 641885 572237 553301 486796 495201
13739 495201 442946 762546 95213 633981 418436 760480 395187 255519 238339 708244
13729 708244 294932 726456 643470 498477 484707 775388 764193 281945 481913 209534
13718 425123 398930 343380 510451 486908 403430 552803 669812 329107 727631 440079
13708 440079 223007 662860 674950 715428 263141 522617 432999 453861 500882 754649
13698 754649 188038 615414 507336 280862 449977 258203 487970 480824 354058 329096
13688C29096n8583L61917n2818A23007L54881n0635B2870O70989l36764P9154
13678D36249j39364J84925fD63343n2809A41029e6158A88767J92132J32276B28176
13666G66335l80304q3620G3840M00908Q753r2860j93526F7644L85242m7421k3995
13655C81470K69110C24506r4973j5026D2033K40514f3063E75241N2101m4543k17028
13644C65771j04500J90198k07367E3518O42397A89020A3322N59773J969A52043
13633B75963j1491p056K34495j80872B2738L09831Q9075o8379L09766k72893n6770
13622C33368A28902N7136C0851K41937l7867q909K69009o9589P3022e2563F27388
13610A12600K21745M3896j31290N5299A25134L7635C8771J81146J40851A22207
$$ plain form
13688 329096 270513 632430 579612 123007 477888 427253 22870 693859 357095 436249
13678 436249 296885 481810 -6 463343 410534 141029 -56158 188767 380899 513175 228176
13666 766335 386031 302411 73840 474748 483501 390641 197115 67644 452886 405465 381470
13655 381470 650580 324506 229533 214507 42033 282547 -63063 575241 627342 582799 365771
13644 365771 261271 451469 244102 53518 695915 189020 13322 573095 575064 152043
13633 275963 264472 257416 491911 311039 22738 332569 421644 353265 663031 390138 333368
13622 333368 128902 186038 30851 272788 234921 226012 495021 425432 498454 -52563 627388
13610 112600 334345 378241 246951 302250 125134 162769 38771 219917 360768 122207
13599D61939G4279L83839o6968Q9548K44692B06021J24081g8307H7751K73465
13589C61216p5668j01825L8078N3230J17167j42964K49838n2488o6950Q4199L4378
13578D98211p1000h1054B06324a49617B69384P1606A66863O927R9765L76932k10701
13567D39786j87329L02225B27250j07945Q8037K6856O0104l7264l111f3913B06087
13555F6531J90290n3961F7313L37125A86011R133K08921A55282J67607j60045
13545A62844M55634B40179K11386k01401J10063A4917J26022R135L9036L4407
13535B23517J4585K95406j22876j25950j12684J15996A08641O2164K5764K43651
13525D40220k10242c9157C76336A71634N0180j1399k5999F2004J56480o2085a65581
$$ plain form
13599 461939 74279 458118 391150 480698 725390 206021 330102 -78307 87751 361216
13589 361216 285548 183723 221801 275031 392198 249234 499072 446584 379634 463833 498211
13578 498211 427211 -81054 206324 -149617 269384 340990 166863 173790 273555 650487 439786
13567 439786 252457 554682 227250 119305 207342 234198 294302 257038 253927 -63913 206087
13555 66531 256821 202860 67313 404438 186011 195144 404065 155282 322889 162844
13545 162844 618478 240179 451565 250164 360227 14917 140939 150074 189110 223517
13535 223517 238102 533508 410632 284682 171998 287994 108641 170805 196569 440220
13525 440220 229978 -39157 376336 171634 221814 210415 184416 62004 218484 156399 -165581
13513B80446J58462j80136K3586J88221A57663L1213J65366h870A48766Q3006
13503B31772L9159J9186A3433K07518K00187E8814M1329K29685G1969R3165e5638
13491B99400A06884K04487d1123B10933L1085J00253A07305J73667J21933A71585
13480A89615A191J51205J77400d8393A14410J66524K3918H5346L58500B18278
13469B73240j04356K44331O0022R7318j53605j92042K09781j93408r8100k814
13459A40367P5588N7934B2592a09620F3856K74683H3267k0906c55266a03884B35462
13447a2663I4756K57742I1094J71523o0465a87587B06779J88669A06290K05719
13437C12009M9082A3078J30919K26943A46912J14751p3704H8987B1397K23189
$$ plain form
13513 280446 438908 258772 282358 470579 157663 188876 354242 -8870 148766 231772
13503 231772 270931 290117 13433 220951 421138 58814 100143 329828 71969 165134 -55638
13491 299400 106884 311371 -41123 210933 242018 342271 107305 280972 402905 171585
13480 189615 1191 152396 329796 -48393 114410 280934 304852 85346 443846 218278
13469 273240 168884 413215 473237 570555 416950 224908 434689 241281 143181 140367
13459 140367 215955 273889 22592 -109620 63856 338539 83267 62361 -355266 -103884 235462
13447 -12663 94756 352498 91094 262617 202152 -187587 206779 395448 106290 312009
13437 312009 361091 13078 143997 370940 146912 261663 187959 88987 21397 244586
13427B44586J29089A74811K53420A06292P4735b01469B37506F9229J43031g1198
13416B91165A33983g2935J8990H1726o759Q5417F9951P8716B7103L88322j67830
13405B47595N5708F4675J78685J31222F8240a68311E00143B24225b7089A98509
13394B77127J16385r8573J59121A46646K24669A82187N0644b5075F15169A73896
13383A92739I0678M84142A07770L80038C222d4071C1895K45384a6712F6759f9155
13371A94079d0577k77174B94405i3319A0262O1047d0575k34665G5621J36411D0136
13359B86658G0279g1829B50277M5033g6635B01012K3595O4306A39629E7247K44126
13348C01373D0647i012j92967B44550j6483i9588A21311J57635j22692J85066
$$ plain form
13427 244586 373675 174811 428231 106292 181027 -201469 237506 69229 212260 -71198
13416 291165 133983 -72935 -53945 81726 74967 160384 69951 148667 27103 415425 247595
13405 247595 303303 64675 243360 374582 68240 -168311 500143 224225 -27089 198509
13394 277127 393512 294939 454060 146646 371315 182187 232831 -25075 615169 173896
13383 192739 90678 574820 107770 487808 3222 -44071 31895 277279 -16712 66759 -69155
13371 194079 -40577 -317751 294405 -93319 10262 71309 -40575 -275240 75621 212032 40136
13359 286658 70279 -71829 250277 295310 -76635 201012 224607 288913 139629 57247 301373
13348 301373 40647 -9012 -201979 244550 228067 -99588 121311 278946 156254 341320
13338C41320g1533A64936A2619L83405c40687B13312L03396A93300O9857A07808
13327A63867K13227G2441L12170E3166J90858K10881A30662L9459J94700I4832
13316B29042o254c36A94850Q280P7222d5829B37422q0967J12547p2926K14706
13305D10782a69309A68503N3466j01070K78436A30179R5513P2009B3185J63686
13295A86871J65921A56366R6976j15813J6535J5516H2703C8371P6028K25420G2662
13283A40871A1125K39303A00702a48687b3820a606A08680d0342D97396A51027
13272B6362b48813c6712B4943J46538a38366B50174P1368A1062h4811c0410B18113
13260e3779D1012J75084a99975D6823a27385D9931h7460A53503O4315E8359L4791
$$ plain form
13338 341320 -71533 164936 12619 396024 -340687 213312 516708 193300 263157 107808
13327 163867 377094 72441 384611 53166 244024 454905 130662 170121 364821 94832
13316 229042 222788 -336 194850 203130 280352 -45829 237422 156455 269002 196076 410782
13305 410782 -169309 168503 221969 120899 399335 130179 225692 297701 23185 186871
13295 186871 352792 156366 253342 137529 154064 169580 82703 38371 114399 339819 72662
13283 140871 11125 250428 100702 -148687 -23820 -1606 108680 -40342 497396 151027
13272 26362 -248813 -36712 24943 171481 -138366 250174 321542 11062 -84811 -30410 218113
13260 -53779 41012 216096 -199975 46823 -127385 49931 -87460 153503 217818 58359 93150
13249I3150M4933K05193C3288a54809r1345A33392D9139a06903d640B64508A0346
13237C5086D067d2372B64162j08661k9179J32945l163G559b04104B99646I725
13225C75830a15193A81436n457i9263A68920J91633A00308J59795a91578B12915
13214a50732A08401Q7500c1281A04182b47954D73853b40436H7441a33730D6087
13203A3901L8156P196a93550h766p1323B6068K06483A01071m9518O7955K4280
13192A43788Q0635k4808N8931l6167j10749c6959o1770c8171l02244A18004c66600
13180a2942k00655I0758a85590P2004A34706a80302b5688A94357e7643j3843o3151
13169a34637A08221a02499H2002P2697J11099I0355J64323D0087J37613O0683
$$ plain form
13249 93150 138083 343276 33288 -154809 -246154 133392 49139 -106903 -4640 264508 10346
13237 35086 4067 -42372 264162 155501 126322 259267 256104 7559 -204104 299646 9725
13225 375830 -115193 181436 175979 -99263 168920 360553 100308 260103 -191578 212915
13214 -150732 108401 195901 -31281 104182 -247954 473853 -240436 87441 -133730 46087
13203 13901 52057 59253 -193550 -8766 -80089 26068 232551 101071 51553 119508 143788
13192 143788 224423 199615 258546 222379 111630 -36959 -98729 -38171 -340415 118004 -366600
13180 -12942 -213597 90758 -185590 -113586 134706 -180302 -25688 194357 -57643 -71486 -134637
13169 -134637 108221 -102499 82002 154699 265798 90355 254678 40087 177700 238383
13159B38383f0976q8495B19103q4440M7253C5064b30428h9295d0196A03818a41238
13147A10707P9188b34657A82751o2004j129k0048a722r183C7551J21565p3293
13136H5823c2113B35300p2775G7278b78242A90919l1096K4500a54599j98354B62307
13124a59216D1935a94217B76233j2738h0244G2690B9444h2645G6721f9100l4971
13113a04071f025B30129c1954m1431K9975l28922D1069g0513c177C65806j77356
13102A88450h8656F322P4381O1170J69963a59455E7983J07015i3776H2167J25620
13091B07787l3396l4445f6999F2420a68168G8793a69587A17097L15320e9200B2849
13079g9345k55784F0227J58680m8314c4405o4744A23043N7473M7737f3545D362
$$ plain form
13159 238383 -60976 -149471 219103 134663 181916 35064 -230428 -89295 -40196 103818 -141238
13147 110707 189895 -234657 182751 120747 119618 99570 -1722 -10905 37551 159116 85823
13136 85823 -32113 235300 162525 77278 -278242 190919 159823 184323 -154599 -352953 262307
13124 -159216 41935 -194217 276233 263495 -80244 72690 29444 -82645 76721 -69100 -104071
13113 -104071 -6025 230129 -31954 -73385 -43410 -372332 41069 -70513 -3177 365806 188450
13102 188450 -88656 6322 80703 141873 311836 -159455 57983 164998 -93776 82167 207787
13091 207787 174391 139946 -66999 62420 -168168 78793 -169587 117097 432417 -59200 22849
13079 -79345 -335129 60227 218907 170593 -34405 -99149 123043 180516 228253 -63545 4362
13067A32464a96497M194B20181c6430n5094b6670G512L7477K54094h5448H1968
13055H2551L12899d5831a554r1660k9909K9577A87953r1751a10669D3333R8241
13044A41574A9483a3995H8468K52160e6673B29973q7171b22635h5299B20282a98949
13032B1885K9410a85335Q6000C5840Q1699R2869i6803J6698n6101B60762a21386
13020C96061D961e0610A04455Q5366a17681B9706P0564g5090A51002m2559D6419
13008A94568J6481c30107g2909C9108J13350C0819e0279J3401q4206F5819Q2437
12997A48256E5964c8563J8284D28613B9947b04493C50762a77515A43583o814m3212
12986I3557O711O2643h2996C2818O472J40121p2740P1543K64141k16187c35677
$$ plain form
13067 132464 -196497 -192303 220181 -36430 -91524 -26670 7512 44989 299083 -85448 81968
13055 82551 395450 -45831 -1554 -93214 -123123 -93546 187953 96202 -110669 43333 141574
13044 141574 19483 -13995 88468 340628 -56673 229973 142802 -222635 -85299 220282 -198949
13032 21885 51295 -185335 -99335 35840 117539 210408 -96803 -80105 -136206 260762 -121386
13020 396061 4961 -50610 104455 189821 -117681 29706 100270 -75090 151002 108443 46419
13008 194568 211049 -330107 -72909 39108 152458 30819 -50279 -36878 -121084 65819 148256
12997 148256 55964 -38563 -20279 428613 29947 -204493 350762 -177515 143583 136769 93557
12986 93557 100268 162911 -82996 32818 39290 179411 106671 178214 442355 226168 -335677
12974C3917c2555D2668b91740a08530J9073c6902j42143C68006n0748j16440I6832
12962A87409a65484m3572D432a74710j42244a2815C5301P2601b23574P3548A95713
12950B23420a32086O2117G7105M9090c1059k91017B02194c36264a8985H4207a45096
12938b3237k54559P6184c4000E2118b02354h0157l09841G9251N4904F597J63600
12927A70197C0419R1468n2922J55879b44750B39129e63253e4630G9075a04423
12916B02063a72598B1139M3942e8524C32211r0705f0034A28426K16763h2970C1303
12904a76918Q1460m2535k3205e5462R10l85349J87303I209b94253A49122K7627
12893A76749A54O8865J45656a62238j13014C7403e9682n048k41379E9474f8979
$$ plain form
12974 33917 -32555 42668 -291740 -108530 -89457 -36902 -179045 368006 317258 200818 96832
12962 187409 -165484 -209056 4432 -174710 -316954 -12815 35301 107902 -223574 -150026 195713
12950 223420 -132086 -69969 77105 126195 -31059 -322076 202194 -336264 -18985 84207 -145096
12938 -23237 -277796 -201612 -34000 52118 -202354 -80157 -389998 79251 134155 6597 170197
12927 170197 30419 121887 68965 224844 -244750 239129 -563253 -54630 79075 -104423
12916 202063 -172598 21139 65081 -58524 332211 241506 -60034 128426 345189 -82970 31303
12904 -176918 -95458 -137993 -161198 -55462 -54552 -439901 -252598 9209 -294253 149122 176749
12893 176749 154 69019 214675 -162238 -275252 37403 -59682 -64730 -306109 59474 -68979
12881B30776C1714a63588C8470a38343A86320n1645D5136J18614a7626k5400C43170
12869a85372f6372l35384d2207j20980B90851c2472H9033e1405A50678K34437
12859C85115j27364a20608B79909a71158B10578C3423f4432a459B46243j00534
12849A45709a96907E7697A2749O7065R3453l558b22366B0794a54678g4686k07633
12838b82319e2330B4597d3250j37635k12163H7433f1034a4513A07651n1578a61371
12826D9259b46236H8187l9502l760M9953i8025l15696A25140f9046j20779n2055
12815b41880C1364h3324A37973E758Q8286a93702Q3346B41085d8652m1221B9949
12803C46177a63462M7515M9752j08098K6847O6099a3477m04930D9185b36366k2028
$$ plain form
12881 230776 31714 -163588 38470 -138343 186320 134675 45136 163750 -17626 -43026 343170
12869 -185372 -66372 -401756 -42207 -163187 290851 -32472 89033 -51405 150678 385115
12859 385115 257751 -120608 279909 -171158 210578 33423 -64432 -1459 246243 145709
12849 145709 -196907 57697 12749 79814 173267 169709 -222366 20794 -154678 -74686 -282319
12838 -282319 -52330 24597 -43250 -180885 -393048 87433 -61034 -14513 107651 56073 -161371
12826 49259 -246236 88187 48685 44925 94878 -98025 -413721 125140 -69046 -189825 -241880
12815 -241880 31364 -83324 137973 5758 94044 -193702 -110356 241085 -48652 -89873 29949
12803 346177 -163462 -115947 -66195 -174293 -147446 -81347 -13477 -418407 49185 -236366 -258394
12792b58394M7161p634d162E8355b01033A88358a7460C32282D299c26841A61263
12780c28015C7538d5823l2612l93101D2632i3690b6858n4411H9464a79265B05191
12768A36132J69699q9070f3329j48823i3352j24644C18868a94733C35256b02972
12757B72899D6171a93986e5930j19317M0560B06941a60176A05073J89035m4443
12747B49665r8322c68483F1115K47940a55974N4009B95642j15341a64530G966
12736B60759H9381e1776B45816F4326a15526A07326d9463l770o7721e1919I2746
12724a4972A85391b3092C2800Q0011O9465N3271E2403g9720E8374g7968A46325
12712a37955D1089J15332d2590n2871G1846b24158n8193A31649a22337J6287b1170
$$ plain form
12792 -258394 -211233 -218867 -4162 58355 -201033 188358 -17460 332282 4299 -326841 161263
12780 -328015 37538 -45823 -78435 -471536 42632 -93690 -26858 -81269 89464 -179265 205191
12768 136132 305831 216761 -63329 -212152 -93352 -217996 318868 -194733 335256 -202972
12757 272899 46171 -193986 -55930 -175247 -134687 206941 -160176 105073 294108 249665
12747 249665 151343 -368483 61115 309055 -155974 -101965 295642 180301 -164530 7966
12736 260759 89381 -51776 245816 64326 -115526 107326 -49463 -53233 -120954 -51919 92746
12724 -14972 185391 -23092 32800 112811 182276 235547 52403 -79720 58374 -77968 146325
12712 -137955 41089 156421 -42590 -95461 71846 -224158 -282351 131649 -122337 -106050 -21170
12700A72707B2039J19005E362K43318b46572A6202A794g3968a3854B08556P1772
12689B80328j02163c06262B33734L24202A03733a57530g2762a289B26929F9528
12678a13203B98017B9843g2296A18187a68746q5787f28j1611j14480A79880K3578
12667B03458M7594j04684c78234a48163c4008A58431O875E4890a88427B68668
12656B13272b97312B9994L0927K39299c4668A85867H4012a58012b4496C7976a00444
12644A24752b12538E7801c8764B73879o5725J5413i7756A71890a41930c4554H5969
12632h250A98212K6294g7725B0274K9720b02445L6536j22391A41461Q1394a41737
12620I1908c4838r1486B01636I3777K20190D020L31378J95450B53465M9749a01586
$$ plain form
12700 172707 22039 141044 5362 248680 -246572 16202 1794 -73968 -13854 208556 280328
12689 280328 178165 -306262 233734 557936 103733 -157530 -72762 -1289 226929 69528
12678 -113203 298017 29843 -72296 118187 -168746 -254533 -628 -12239 -126719 179880 203458
12667 203458 251052 146368 -378234 -148163 -34008 158431 165306 54890 -188427 268668
12656 213272 -297312 29994 60921 300220 -34668 185867 84012 -158012 -24496 37976 -100444
12644 124752 -212538 57801 -38764 273879 208154 223567 -97756 171890 -141930 -34554 85969
12632 -8250 198212 224506 -77725 20274 49994 -202445 -165909 -288300 141461 222855 -141737
12620 91908 -34838 -126324 201636 93777 313967 4020 335398 530848 253465 303214 -101586
12608b88287A19938b69606i8491A58431E7215g1060k9368q3766j07684B6453K28120
12597B54573d07624C1456i9769A96869O1984A04334D8629b2159B10130a42614
12586G0646J65169C8312L5938K88166A55226c7008A50799i322A69116j8056b18903
12574b15681J07440j90956c4788F1651c22038H6574I029J68401C4101a89683d2154
12562a37586H7862d2414a8989E8989b13841O9558e4214k09498h7546n4798G2755
12550a95242A12830e7346b8383E200a51578J9031d1522p2511A18447j4993l2508
12539G0946n213d8326l11586A00901l4206B2860O5651f8991A789b84363G7799
12527D5385c45879B9184f1811j04315o2832A71810b35691c2201B7956A2691a44033
$$ plain form
12608 -288287 119938 -269606 -98491 158431 57215 -71060 -100428 -184194 -291878 26453 254573
12597 254573 -407624 31456 -99769 196869 258853 104334 48629 -22159 210130 -142614
12586 70646 235815 38312 74250 362416 155226 -37008 150799 -9322 169116 151060 -218903
12574 -215681 -108241 -299197 -34788 61651 -322038 86574 9029 177430 34101 -189683 -42154
12562 -137586 87862 -42414 -18989 58989 -213841 -144283 -54214 -263712 -87546 -142344 72755
12550 -195242 112830 -57346 -28383 5200 -151578 -132547 -41522 -114033 118447 103454 70946
12539 70946 65733 -48326 -359912 100901 66695 22860 88511 -68991 1789 -284363 77799
12527 45385 -345879 29184 -61811 -166126 -228958 171810 -235691 -32201 27956 12691 -144033
12515b98111b9899l149a5404k75449A67691p8563J3662e9199j01435I435e6687
12503a08415M7341B00483b4790j33437C27977A33210l1876h7040j0273D31578
12492A54755L7302q8709a37567A98381i6971q9775R2145l7041j88915E9531a44413
12480G7841m957K63716k7950C2198h4537B64808b25210B22936p3094c3834B77332
12468H9368c0779C71205o2127n8106p8424c3777A93466a09432a7268A58202l0010
12457A28192L30614A04943B2862a9670D8389J4010a78424r9466A52726g1302A0335
12445b4762l21123C9390h3406C48991I7695a55529d4551k00672B23392i3060C4431
12433g8503q351C78877B7533c92101E6839d64612a69867B1137c18116a57132k0166
$$ plain form
12515 -298111 -29899 -33048 -15404 -290853 167691 89128 102790 -59199 -160634 9435 -56687
12503 -108415 -61074 200483 -24790 -158227 327977 133210 101334 -87040 -97313 431578
12492 154755 192057 103348 -137567 198381 -96971 -186746 -94601 -131642 -320557 59531 -144413
12480 77841 72884 336600 308650 32198 -84537 264808 -225210 222936 149842 -33834 277332
12468 89368 -30779 371205 309078 250972 172548 -33777 193466 -109432 -17268 158202 128192
12457 128192 458806 104943 22862 -19670 48389 62399 -178424 -277890 152726 -71302 10335
12445 -24762 -345885 39390 -83406 348991 97695 -155529 -44551 -245223 223392 -93060 34431
12433 -78503 -86854 378877 27533 -392101 56839 -464612 -169867 21137 -318116 -157132 -177298
12422a77298e8354I4087K9390i8010j49452Q5708B60687a80775N8505D70680b5877
12410d9113o2514d4375j51762L8984A90354e925j16888n0265G2922J88137b288
12398g8508j8493j34136A73531b21349L0417N8925j8228C6835i6428g663j3880
12387b1543B96316d8147B23411b41126B22673E1825a46465j2721m223k2459f2500
12375d1973A36772a00108C77708D1833Q0564E2409g2475C23342A06844m7214L9532
12364I9162B0865N9872j6001J79972J48953O2321a6462o0018q9778m0539H673
12352f1993A01024D8390a14751D6326h9906A57964K65161g4496A1667b06541A79788
12340f3114B71807d1734l3320D6446b0606k02160a7622B16632a69965e384G135
$$ plain form
12422 -177298 -58354 94087 123477 -98010 -247462 -161754 260687 -180775 -122270 470680 -25877
12410 -49113 -111627 -44375 -196137 -157153 190354 -5925 -122813 -173078 72922 261059 -2288
12398 -78508 -97001 -231137 173531 -221349 -190932 -132007 -150235 36835 -96428 -7663 -21543
12387 -21543 296316 -48147 223411 -241126 222673 51825 -146465 -159186 -163409 -185868 -62500
12375 -41973 136772 -100108 377708 41833 122397 52409 -72475 323342 106844 59630 99162
12364 99162 20865 80737 64736 244708 393661 455982 -16462 -76480 -166258 -206797 8673
12352 -61993 101024 48390 -114751 46326 -89906 157964 423125 -74496 11667 -206541 179788
12340 -63114 271807 -41734 -75054 46446 -20606 -222766 -17622 216632 -169965 -5384 7135
12328A9835a5202m2060k36267F4649R3459h9254C28103h1788B06654I7689B2164
12316a00031A16920K37875A6753L6791a45734B78846J3045j0113r6716J542c308
12304B95948d892B29385j01846K62803n3649b3527G5080n205Q6573J58763a22048
12292I3598J10429O4795a03475m1999B1803f3074h809C202K10709a01436B70370
12280a57905c9507j63493A58637J81669I4349M1739M4949d6445A01000a12788
12269G9846J46413N7304a58742B32189J63762g2255C32395C6442K73440c21691
12258c12127A88396F324a15885C13252l3190b7481F1947a04040C72008a24358
12247D11855F8210K47838j37589c4104A04876K01244n4894b46451c8138G1494
$$ plain form
12328 19835 -15202 -57262 -293529 64649 158108 -89254 328103 -81788 206654 97689 22164
12316 -100031 116920 354795 16753 53544 -145734 278846 291891 281778 185062 186604 -3308
12304 295948 -4892 229385 127539 390342 336693 -23527 75080 69875 156448 315211 -122048
12292 93598 204027 268822 -103475 -145474 21803 -63074 -8809 3202 213911 -101436 270370
12280 -157905 -39507 -203000 158637 340306 94349 136088 181037 -46445 101000 -112788
12269 79846 226259 283563 -158742 232189 395951 -72255 332395 36442 309882 -321691
12258 -312127 188396 6324 -115885 313252 280062 -27481 61947 -104040 372008 -124358
12247 411855 68210 316048 178459 -34104 104876 306120 251226 -246451 -38138 71494
12236F4026a64604g792B72418c25708F7643e5863B10635p3055K95895a00009C04567
12224e6317p2512A10662N323K16464A57953b3827j03524f1621C66151G3416g688
12212A73375e0381B12297J19273b0342G3138K30609C135h7963E27925A69715K87240
12201D56955P5919A11757K36937j71113J46266A00560K76089h9823A76036D8247
12190A20371J835M4849a06591n7888A24659g0936G5691N66711A65247E5645L5191
12179I0836L1774B4815L3695M91024A61776J27404k9910A01627J58992m1806K21634
12168D40447B06278L079a4655A37777a0435n2570F0536b7736C62238p7796J1129
12157B95571J4743L18757B52887J90932j59358p3132k8206K51330l1056j78646
$$ plain form
12236 64026 -164604 -7792 272418 -325708 67643 -55863 210635 137580 433475 -100009 304567
12224 -56317 -128829 110662 115985 332449 157953 -23827 -127351 -61621 366151 73416 -7688
12212 173375 -50381 212297 331570 -20342 73138 303747 3135 -87963 527925 169715 456955
12201 456955 532874 111757 348694 177581 323847 100560 376649 -89823 176036 48247
12190 120371 122206 167055 -106591 -164479 124659 -70936 75691 642402 165247 55645 90836
12179 90836 122610 24815 58510 549534 161776 289180 259270 101627 260619 218813 440447
12168 440447 206278 209357 -14655 137777 -10435 -63005 60536 -27736 362238 284442 295571
12157 295571 310314 629071 252887 443819 284461 211329 183123 434453 403397 224751
12147B24751d2002D25976I1435L08806A07519J49602o8772p4897j4916Q6860b0684
12135g5762A75945B9177i2038C791b2685A63676f1449l7969A56316h6873b3086
12123B99684o7002b63152A49157d8118B74722b24636A38186a32156F9670K25745
12113B95415p9513a87040o3890C60657A45982o3092J10757A0073b3999p570D08223
12101C34764p7168F2456M4456M6807P9328F3209K19437b08735B49716b31844B44425
12089E114K04521k747r3296n5216R3050D3055Q5923j339j7860e3417I5633K90027
12077C85660a0229A9999C865g8513C7941L64497g65D33681k1168j13904j6498
12066B82111J07245j7470a93966A01965a2482E0311J71247A10775K7167D3912
$$ plain form
12147 224751 -42002 425976 91435 400241 107519 257121 188349 113452 98536 185396 -20684
12135 -75762 175945 29177 -92038 3791 -22685 163676 -61449 -99418 156316 -86873 -23086
12123 299684 232682 -263152 149157 -48118 274722 -224636 138186 -132156 69670 295415
12113 295415 215902 -187040 -250930 360657 145982 82890 193647 10073 -23999 -31569 408223
12101 334764 257596 62456 106912 153719 233047 63209 282646 -208735 249716 -231844 244425
12089 5114 209635 206888 113592 58376 151426 43055 128978 127639 109779 -53417 95633 385660
12077 385660 -10229 19999 3865 -78513 37941 402438 -765 433681 412513 298609 282111
12066 282111 389356 371886 -193966 101965 -12482 50311 221558 110775 137942 43912
12055A07206b11523B26753l1538b01033B35598h8579E16215C7982K84081a37149
12044A31901a20827R19C16336c47261A83349k473i7858F9350A7719J11721a66349
12032B99512b24403j69895a42523A23589a14532N0944b7465A26083a40682G0305
12021b10335h3974D3563g4624j76074A56018a63938A30363c37457J56401H7787
12010C79219A47722b62928A15341a35480k6023j770m8070c6624A52324b14132
11999G5603A3826L16709A47728R9897a6363A79561J19673a95539C74670I7848
11988f6163b2310j35501A22470D4071f3756a8341j13396E7021j7011a98200e8858
11976c8327j72775R88j62681F6626K84031a2756A39722a11200F5974a84952n0138
$$ plain form
12055 107206 -211523 226753 195215 -201033 235598 -88579 516215 37982 322063 -137149
12044 131901 -120827 -119908 316336 -347261 183349 180876 -97858 69350 17719 129440 -166349
12032 299512 -224403 -394298 -142523 123589 -114532 -63588 -27465 126083 -140682 70305
12021 -210335 -83974 43563 -74624 -250698 156018 -163938 130363 -337457 -181056 87787
12010 379219 147722 -262928 115341 -135480 -161503 -163273 -211343 -36624 152324 -214132
11999 75603 13826 330535 147728 247625 -16363 179561 299234 -195539 374670 97848
11988 -66163 -22310 -157811 122470 44071 -63756 -18341 -131737 57021 40010 -198200 -58858
11976 -38327 -211102 -210114 -372795 66626 350657 -12756 139722 -111200 65974 -184952 -235090
11965b35090b2450A55561a53106m2851G3402a27147H1237c54892A33394M189P5281
11954B12864a69363b0711j30406E0544K69133j02267h0653m5783A66106j1444
11944A54662D5636K13955H3555A629b56703i0674M1542C43355a66570K5710j44325
11933b85185j21435e4255l20283C4387b20840l3546A13006l2225a66166I8632
11922E7180K45027b37912a07707j63156i5967J4632m9845B48952B9658b75204
11911c85779C30264a51784H9287a23110j30350H9833L5531J9617b14208D8792
11900A37241r12i290A4399c72685B67517d5598j78439B44969C8130b15219M5268
11889a69951A63922b29871A11693j1562b31485a12764A17495G844b28576K334
$$ plain form
11965 -235090 -22450 155561 -153106 -195957 73402 -127147 81237 -354892 133394 137583 212864
11954 212864 -169363 -20711 -151117 50544 319677 217410 -80653 -126436 166106 154662
11944 154662 45636 259591 83555 1629 -256703 -90674 -49132 343355 -166570 -140860 -285185
11933 -285185 -406620 -54255 -374538 34387 -220840 -254386 113006 80781 -166166 98632
11922 57180 302207 -237912 -107707 -270863 -95967 -81335 -131180 248952 29658 -275204
11911 -385779 330264 -151784 89287 -123110 -253460 89833 125364 144981 -214208 48792
11900 137241 136329 -9290 14399 -372685 267517 -45598 -224037 244969 38130 -215219 -169951
11889 -169951 163922 -229871 111693 100131 -231485 -112764 117495 7844 -228576 -226242
11879b26242A34681c1506k4283k34696B47919N023g5023A89948a77088N0726E5028
11867C2042b8680j77650D8998j0662J34933a48722O788g0306B7165i3867A07422
11855a78811f2928B67399L3197e42956F3844a46982p6263f5850k586C03107h9263
11843g4488A07004g1573A61172b36282e6328n1295c271H9096L5745f8088l0476
11832i8564k97205c6114j35548J4140A40822b493k09621A78939l6172b80668D7399
11820d7390E5047a46386a5338l47904d9384B563J20053b77204B39690h1185B06976
11808a33386B5046J6296A3777J88184b34006A48396j5455a20861M0013c39B7071
11796E4862J22837a59322L2658N2895F8168a48440A01277b94976E4260L45021
$$ plain form
11879 -226242 134681 -31506 -55789 -290485 247919 252942 -75023 189948 -177088 -126362 55028
11867 32042 -28680 -206330 48998 38336 173269 -148722 -141934 -70306 27165 -93867 107422
11855 -178811 -62928 267399 300596 -542956 63844 -146982 -223245 -65850 -68436 303107 -89263
11843 -74488 107004 -71573 161172 -236282 -56328 -107623 -3271 89096 124841 -68088 -98564
11832 -98564 -395769 -36114 -171662 -157522 140822 -2493 -212114 178939 142767 -280668 47399
11820 -47390 55047 -146386 -15338 -363242 -49384 2563 122616 -277204 239690 -81185 206976
11808 -133386 25046 41342 13777 201961 -234006 148396 132941 -120861 -80848 -339 27071
11796 54862 177699 -159322 -126664 -73769 68168 -148440 101277 -294976 54260 399281
11786C99281b2154l6379j02951f022q6130G7538b76937g2507k1359G3993a67507
11774E34515a16733j39234N9778F5987a08915I1710I882d04501J07199p8616B98701
11762a8581E5954c58817a5881C63136B5047a84941F9084b93251b964j95854A29716
11750A91326J4042a9891j76023A2160L02162J739b22029B3372b09810a0424j7782
11739b8206p5962o6605k4304B34977A7837b88343B14689e8251k58243B38013b03024
11727I4752c35042L4664M0999B9952d2218B59935r3909b47294E5540J01134a75384
11715a20896j0665A674e5433C2799e15330A95332l3539a5687G8684Q0512b26864
11703A75009d2597D2923b31034D0288b36482B07434E7378g7571a0950B16093d6599
$$ plain form
11786 399281 -22154 -58533 -161484 -6022 -92152 77538 -276937 -72507 -93866 73993 -167507
11774 534515 -116733 -255967 -196189 65987 -108915 91710 9882 -404501 -297302 -375918 298701
11762 -18581 55954 -358817 -15881 363136 25047 -184941 69084 -293251 -2964 -198818 129716
11750 191326 205368 -19891 -195914 12160 314322 316061 -222029 23372 -209810 -10424 -28206
11739 -28206 -104168 -170773 -195077 234977 17837 -288343 214689 -58251 -316494 238013 -203024
11727 94752 -335042 -300378 -259379 29952 -42218 259935 166026 -247294 55540 156674 -175384
11715 -120896 -131561 1674 -55433 32799 -515330 195332 161793 -15687 78684 159196 -226864
11703 175009 -42597 42923 -231034 40288 -236482 207434 57378 -77571 -10950 216093 -46599
11691a10375C1767a00966J7626k73095A60380K7160a85714b8335l0563r8545k9579
11680a87022a5553m3362j01798B0195a88229N4588B61067B7474J38431c14776
11669G0200b23157B43624Q4199B5812a79302l1959b5121j177A2244N1365K23038
11658B86647a6633B70662C4512f7514j12078p5696I7816J28059b01082Q2486j15021
11647b33617B70462e9005C57981a48120k37302a26157A58208d18289B12884c69391
11636H9466b77868G8873a6790A22368f2498C33791a01287I9696Q4526a11864j45824
11625b57688R4365B15787a91032j196C88490b21011L7472A06492A643J8465J01726
11614A21834f0512I7744P4887F8369a60026D23794I2978k3673O3564M3819c66949
$$ plain form
11691 -110375 31767 -100966 -83340 -356435 160380 187540 -185714 -28335 -58898 -157443 -187022
11680 -187022 -15553 -58915 -160713 20195 -188229 -133641 261067 27474 165905 -314776
11669 70200 -223157 243624 327823 25812 -179302 -211261 -25121 -26298 12244 63609 286647
11658 286647 -16633 270662 34512 -67514 -179592 -255288 97816 225875 -201082 -118596 -233617
11647 -233617 270462 -59005 357981 -148120 -385422 -126157 158208 -418289 212884 -369391
11636 89466 -277868 78873 -16790 122368 -62498 333791 -101287 99696 184222 -111864 -257688
11625 -257688 -163323 215787 -191032 -192228 388490 -221011 -183539 106492 1643 20108 121834
11614 121834 -60512 97744 172631 68369 -160026 423794 92978 69305 132869 176688 -366949
11602h9092B09799J8955d24A2587b45601I258J45601a99574j8344J00851a8334
11590a96674o8005A4006a16670G1995b38236E2798e243j65562e7678F9106a06144
11578f1521j43749C32490e835j288k43962P4410K7500J6470H3514J21855B7456
11566b7143H2484f5525K6077p0900k1042A02006a24454a4549A19945a55447O4882
11555i0565M5072A41587E6169Q0761c10574A09864b54589m8945E28810a55056
11544B79503l5456K1433O7622c07345J51586A39988n5165C7301R5024L1392E2108
11532C70044F5936d17788d6492j0905o1190N0282D3214d5128j49913c5052j88378
11521b23430E7474P6576e6689A67140R3035G6469J06598K6516l9511n5982m0585
$$ plain form
11602 -89092 209799 228754 -424 12587 -245601 9258 154859 -199574 -217918 -117067 -18334
11590 -196674 -264679 14006 -116670 71995 -238236 52798 -5243 -170805 -57678 69106 -106144
11578 -61521 -205270 332490 -5835 -7123 -251085 -176675 -149175 -132705 83514 205369 27456
11566 -27143 82484 -65525 -39448 -110348 -131390 102006 -124454 -14549 119945 -155447 -90565
11555 -90565 -45493 141587 56169 136930 -310574 109864 -254589 -303534 528810 -155056
11544 279503 244047 265480 333102 -307345 -155759 139988 84823 37301 132325 163717 52108
11532 370044 65936 -417788 -46492 -57397 -118587 -68305 43214 -45128 -195041 -35052 -223430
11521 -223430 57474 134050 -56689 167140 260175 76469 183067 209583 170072 114090 73505
11510G3505J19448E3350c2361k93983A24094D6882K5891D532R9299Q7958J17265
11499C09054a05762C7116Q3687K28745j09721J04872i0974C69835A79069a87077
11488e085j16759A47910J37095n9022p3067d2925A30172K446N0400A9485R9637
11477A19122J96640j4696h8076A25910K17462A40685g1557F1512P4790o3496b4787
11465I1328L42178A19956c1859B60090j17453A1020K21576E6660f9959o9565B36846
11453A1671i2361B87444N6948J20332A69366O2724A4449L53768a49126A30567
11442A81287M4056I6332g3872B03409I50J56755E8305N2925P2379o1097j0441
11431A12071J187P3318r648q1082a30752J426H5838J02719o9812M8727e5013E3416
$$ plain form
11510 73505 192953 53350 -32361 -326344 124094 46882 72773 4532 103831 191789 309054
11499 309054 -105762 37116 120803 349548 239827 344699 -90974 369835 179069 -187077
11488 -5085 -121844 147910 285005 225983 152916 -42925 130172 132618 183018 19485 119122
11477 119122 315762 301066 -88076 125910 343372 140685 -71557 61512 136302 72806 -24787
11465 91328 433506 119956 -31859 260090 142637 11020 232596 56660 -69959 -139524 236846
11453 11671 -92361 287444 344392 464724 169366 232090 14449 368217 -149126 130567
11442 181287 225343 96332 -73872 203409 950 157705 58305 111230 183609 122512 112071
11431 112071 113258 186576 176928 95846 -130752 -129326 85838 188557 118745 167472 -55013 53416
11418b18146B74408o6958a43105A09928a72105E2124e5737j27153f2085j58277
11408b20362A90973A9000a12260C7680a14664Q562R926d5062n5859I9904e9990
11396d3554D9778a87578k7390j79185B14153c4479A22537E9406K84345I4318R5183
11385A89501a38811b3760b155A85813b4305G4354b58917R1520H00f9441c235A78776
11372B26142b7103l1014B91847f2624A1629J8380J32430c8061A23176a18144r4054
11361b12198F3654a16417r193B2805i2536E3147b00280C68602H9486c58457e738
11349H1395a43665D313c6470F705L48517a74462c0105C21231b6476C01449o287
11338B95162a93383L951N0491d7865q3879A2143a16365N2556C8745b47061h8601
$$ plain form
11418 -218146 274408 207450 -143105 109928 -172105 52124 -55737 -182890 -62085 -220362
11408 -220362 190973 19000 -112260 37680 -114664 -106102 -96176 -45062 -100921 99904 -59990
11396 -43554 49778 -187578 -214968 -394153 214153 -34479 122537 59406 343751 94318 189501
11385 189501 -138811 -23760 -2155 185813 -24305 74354 -258917 -167397 800 -69441 -3235 178776
11372 226142 -27103 -58117 291847 -62624 11629 30009 162439 -38061 123176 -118144 -212198
11361 -212198 63654 -116417 -125610 22805 -92536 53147 -200280 368602 89486 -358457 -5738
11349 81395 -143665 4313 -36470 6705 355222 -174462 -30105 321231 -26476 301449 295162
11338 295162 -193383 -189432 -138941 -47865 -131744 12143 -116365 -63809 38745 -247061 -88601
11326a91013A19664f6499F378b6942A11639B4060g1332k18393a44470k01632g2071
11314a04273A75080a19971c2668C9212L68223A2250b82892q0042c7648A41919
11303H5114b12758N6316P6707A57611b50577h3825b7503l36293a03757D5612a67929
11291C36180a32190b5124A3865d8154A22729h2345j44945K5985b6938j72904c2377
11279f5741m4465A6485e1167o3322Q541j83436c8600m7334p0182n1046c0652j91403
11267b22055Q0023A04524a40479c592p2727j64333M0069K0067r8184O825b0763
11255a76862B48112f3594j06195r952g5918j59735A36182a95442J6087b2096r1039
11244a13135l07172J85829A56695c7032A56756M4014g1598k7272n433G4996c94542
$$ plain form
11326 -191013 119664 -66499 6378 -26942 111639 24060 -71332 -289725 -144470 -346102 -72071
11314 -104273 175080 -119971 -32668 39212 407435 12250 -282892 -362934 -37648 141919
11303 85114 -212758 -156442 -79735 157611 -250577 -83825 -27503 -363796 -103757 45612 -167929
11291 336180 -132190 -25124 13865 -48154 122729 -82345 -227290 -201305 -26938 -199842 -32377
11279 -65741 -110206 16485 -51167 -114489 -105948 -289384 -38600 -85934 -156116 -207162 -30652 -222055
11267 -222055 -142032 104524 -140479 -3592 -76319 -240652 -200583 -180516 -278700 -271875 -20763
11255 -176862 248112 -63594 -169789 -179741 -75918 -235653 136182 -195442 -179355 -22096 -113135
11244 -113135 -420307 -234478 156695 -37032 156756 200770 -71598 -98870 -104303 74996 -394542
11232d1580k36646B2668J072g6988A38110a42577o2292C0137J89169a49446G1924
11220f734l19287J35885j20052G6089J9432a09203G5351b3179F1961a34997q3729
11209b18726A05093b65127d5455C2125b19755P0241e8209l1749l8495A43437c13015
11197a83662k43656a2226p4088K9191A71789g7662j38494N1228E9810c4996n8428
11186i3424J7383r0669H3322K28548i7956B757Q7862j8110c021k74484A11549
11174c20259g0175k37834a24827E7977a22939j56696a5892D959c17000i428j93116
11163b02544A68325b51849C4144a50880g3067E6903a33946A64722f5742a9820
11152b33772H9210c15063A56308c7429j23030L4212F9951d1805g518k00155d0029
$$ plain form
11232 -41580 -278226 22668 23740 -76988 138110 -142577 -204869 30137 219306 -149446 71924
11220 -6734 -326021 -190136 -310188 76089 95521 -109203 75351 -23179 61961 -134997 -218726
11209 -218726 105093 -265127 -45455 32125 -219755 -149514 -58209 -89958 -128453 143437 -313015
11197 -183662 -427318 -12226 -86314 -57123 171789 -77662 -216156 -164928 59810 -34996 -93424
11186 -93424 -76041 -166710 83322 311870 -97956 2757 90619 72509 -3021 -277505 111549
11174 -320259 -70175 -308009 -124827 57977 -122939 -279635 -15892 4959 -317000 -9428 -202544
11163 -202544 168325 -251849 34144 -150880 -73067 56903 -133946 164722 -65742 -19820
11152 -233772 89210 -315063 156308 -37429 -160459 -126247 69951 -41805 -7518 -207673 -40029
11140D9919a949j38316j85349e616o4701j00943E4109K02760a73167B87988g6786
11128A87823d6515A60708a73965j57337D41182C3321M0971b46630B37557A00963
11117B1268a67790A25574c8017A34733J8342d73725B53366o9223a3950C07752
11106d6700H6970a26436I3637J05789c1368F7874b14283B1804K71281k6104B9833
11094I1575g6422B0692K2895O8635Q4006G5403f7846D25265K47782B07755A7107
11082D13210A70078E1994L50832j85735l9893R9536p9371K30990j87179p8962
11072A62212o3092J36375Q4152J79022N3833k22248R5564j71102B0864K50474
11062B71338H5322P2884o0074M9375K7101L8594L9263o8421N6730M1824K6325
$$ plain form
11140 49919 -1949 -140265 -325614 -5616 -70317 -171260 54109 256869 -173167 287988 -76786
11128 187823 -46515 160708 -173965 -331302 441182 33321 74292 -246630 237557 100963
11117 21268 -167790 125574 -38017 134733 153075 -473725 253366 184143 -13950 307752
11106 -46700 86970 -126436 93637 199426 -31368 67874 -214283 21804 293085 266981 29833
11094 91575 -76422 20692 43587 112222 196228 75403 -67846 425265 673047 207755 17107
11082 413210 170078 51994 402826 217091 177198 276734 197363 428353 241174 162212
11072 162212 99120 235495 319647 498669 552502 330254 425818 254716 20864 271338
11062 271338 85322 158206 98132 147507 174608 213202 252465 184044 240774 282598 308923
11051C08923J0407j137A55969N5659K28255A85396J49545m4687k4794K05413J66883
11040F37756k6256j43125m7263L42780m5823L9661M54819l87978l4938O4285o9558
11029G84360K59462k77646M87890m56072P8422M2158K16500j68354j27840K45523
11019A084403N544k1815K7743o9352K88606l93345q4821L2080P2819j81233J07742
11008H68371K30888R195k94177L20511k58104M9991Q171j64522J94894k98626
10998F66592j75457K30330k68851N66136j40642J88256k90962L1742j28004J72498
10988H51638k59607J69483K4642l11418K54453L67318D52239Q9284M02523k68877
10978F75169K60374j1091Q3436j56673N7074J29915C98735M72390J02861J0440
$$ plain form
11051 308923 319330 318193 155969 211628 439883 185396 334941 290254 265460 470873 637756
11040 637756 611500 468375 421112 763892 718069 757730 1212549 824571 789633 853918 784360
11029 784360 1043822 766176 1254066 797994 876416 918574 1135074 966720 838880 1084403
11019 1084403 1089947 1068132 1095875 1026523 1315129 921784 836963 869043 941862 760629 868371
11008 868371 1099259 1108454 814277 1134788 876684 926675 934846 770324 965218 666592
10998 666592 491135 721465 452614 1018750 878108 1066364 775402 807144 679140 851638
10988 851638 592031 761514 786156 474738 729191 1096509 452239 541523 944046 675169
10978 675169 935543 924452 1007888 851215 908289 1038204 398735 871125 973986 984426
10968I84426k89512L24537l4320J69723L4242j10579J76221o2227M89546K52749
10958A934806k85618K44387N17042L57705j02283J88726M89712K07323K42943
10949C794743m48204k22687j50049n08701J05380n91803J6859N1265o1564n55277
10939A429962K36607n3074k38760k17991K21450l6596j08148k09727j92722j11481
10929G19520l29057r605J30190H6601L59558k04209I6813K28522l8732j31990
10919A54613k2878R5035I0947N0371b79512A29011n0983e124l8571G2359c7677
10907F7845c990C2030J23933g5286A15508h5823A96833o6825J26975e9624B00440
10895a8444j86835F0363b217E2442J43292F0279J7578D373b03585g8864A32828
$$ plain form
10968 984426 694914 1019451 985131 1154854 1189096 1078517 1254738 1192511 1682057 1934806
10958 1934806 1649188 1893575 2410617 2768322 2666039 2854765 3344477 3551800 3794743
10949 3794743 3346539 3123852 2973803 2465102 2570482 1978679 1995538 2046803 1985239 1429962
10939 1429962 1666569 1613495 1374735 1156744 1378194 1341598 1233450 1023723 831001 719520
10929 719520 390463 380858 511048 86601 446159 241950 96813 325335 286603 154613
10919 154613 131735 226770 90947 141318 -279512 129011 78028 -5124 -43695 72359 -37677
10907 67845 -3990 32030 155963 -75286 115508 -85823 196833 130008 256983 -59624 200440
10895 -18444 -205279 60363 -2217 52442 195734 60279 77857 4373 -203585 -78864 132828
10883a07842j14553A34675c26658J8888A70116a1601l6430b1716j36821E9217
10872H0960a26500k28332C54223c09229f4289l8535M5198F676K03037a89629g2974
10860A95987E7136K32554F7761c12516j1289A49381F17b900o676j45822A70364
10848B70456j21277a83372C26456i4941B62a5736n1502m5605j03308Q8749n2951
10837a80353D24621c4201l52859i5694G296M2396M2736a7423A57976Q0231b7038
10825c38560A50813a61796j37184G7623a25139A03273k8733a67727M3180d6632
10814a59299A77383c76327A33558e7234l396A31504e0051A61453G9764a44567
10803c66952j59532a18911m8581B3384Q7775O2100B391E25P011a84481B68002
$$ plain form
10883 -107842 -222395 134675 -326658 -307770 170116 -11601 -48031 -21716 -158537 59217
10872 80960 -126500 -354832 354223 -309229 -64289 -102824 -57626 6676 209713 -189629 -72974
10860 195987 57136 289690 67761 -312516 -323805 149381 617 -2900 -9576 -155398 170364
10848 270456 149179 -183372 326456 -94941 262 -15736 -67238 -112843 -216151 -127402 -180353
10837 -180353 424621 -34201 -387060 -95694 7296 49692 92428 -17423 157976 238207 -27038
10825 -338560 150813 -161796 -298980 77623 -125139 103273 74540 -167727 -124547 -46632
10814 -159299 177383 -376327 133558 -57234 -60630 131504 -50051 161453 79764 -144567
10803 -366952 -526484 -118911 -167492 23384 111159 173259 2391 525 7536 -184481 268002
10791E815b0996j89110j52386A32661b10443e2908a8035j86956J6524B21889b03381
10779f0302B363b50872Q6694n5426L0829G9719c17728P6942D616a67943A33236
10767C01517A37052C5783A5323Q3437j6049d67345J11636C6964P5125P1300C7521
10755I662b80513A30006J7134c36925k16355c0004J2516j91788j8775D38225h5709
10743b87998J37782A40022d52568J47740d183j85111D6185d22755b9236C1765
10732a56589I7960L2362b69493e2194j16803o0762B9052K1432a60204j07816D1266
10720F6219i9062M7166l2954B59861q8143c13746a10625M6813b819r3589d2165
10708a80971M9750H9986D1913K97461I8961J02547a41643A27418c7670A88955
$$ plain form
10791 5815 -20996 -210106 -362492 132661 -210443 -52908 -18035 -204991 -188467 221889 -203381
10779 -60302 2363 -250872 -164178 -219604 -188775 79719 -317728 -240786 4616 -167943 133236
10767 301517 137052 35783 15323 98760 82711 -467345 -355709 36964 112089 183389 37521
10755 9662 -280513 130006 147140 -336925 -553280 -30004 -17488 -209276 -228051 438225 -85709
10743 -287998 -150216 140022 -452568 -304828 -4183 -189294 46185 -422755 -29236 31765
10732 -156589 97960 130322 -269493 -52194 -168997 -229759 29052 50484 -160204 -268020 41266
10720 66219 -99062 -51896 -84850 259861 171718 -313746 -110625 -63812 -2819 -96408 -42165
10708 -180971 -131221 89986 41913 339374 98961 201508 -141643 127418 -37670 188955
10697g0035G8555J11743C2745a68365h708B61086b30645j71817a05671l446N1913
10686e7204b3801G7837D629a65232A12948c686G2368b19418k6285Q297A38012
10674B24066H8111e611k6347r5116M2512B4014a03498A41720c25281j05927C6337
10662H3576b62650C8025e9466J7263C2965c92394b843A12119a55964d9797B6794
10650a14578l56220b22363J2976i7434H451L6989j2903a66836C38246I9855a46676
10638d9137B705f5685k9706A36917J7116D9046D228a16139K7273m9369N0586L9697
10626d7952A46360Q493n6217b99134h0698p193m7577e0731j1465j29263k19669
10615d11128F9309b34580B58518a70753A38887g274m4618L270l7197J7794A15506
$$ plain form
10697 -70035 78555 190298 32745 -168365 -8708 261086 -230645 -402462 -105671 -109117 -57204
10686 -57204 -23801 77837 4629 -165232 112948 -3686 72368 -219418 -245703 -237406 138012
10674 224066 88111 -5611 -31958 -127074 -84562 24014 -103498 141720 -325281 -431208 36337
10662 83576 -262650 38025 -59466 -42203 32965 -392394 -2843 112119 -155964 -49797 26794
10650 -114578 -470798 -222363 -209387 -97434 8451 45440 32537 -166836 338246 99855 -146676
10638 -49137 2705 -65685 -95391 136917 154033 49046 4228 -116139 -88866 -138235 -87649 -47952
10626 -47952 146360 154853 98636 -299134 -80698 -87891 -135468 -50731 -62196 -191459 -411128
10615 -411128 69309 -234580 258518 -170753 138887 -7274 -51892 -48622 -85819 -68025 115506
10603a07496A08198h893j95844D8086A8617b59219q4083M7720D6755d7013a2497
10591c36947d0329j89611P2505d1626F161a24777c5387P971n94182b45584O5206
10580a80378B40128a46015A07012c01828i7338c9063A23828P8902r1453C2058
10569b73071h8783L7475I4102a70217M6029K300l49L6704H6407j2690a12576j04050
10557b16626A30551C124g6465j30708M4770n0658A91155m4081c9503A4893L7290
10546E2183f1966k3306k08066Q6789g4903I2628a08331A11385b04129e56k7177
10535b7733o5142E2522O2015R1391G7513c4253F749O8293d1605A72470J1441b73905
10522E2060b5277j98336I7320l9145n502a50002B2004b59823j16535J07625G9062
$$ plain form
10603 -107496 108198 -8893 -204737 48086 18617 -259219 -343302 -295582 46755 -47013 -12497
10591 -336947 -40329 -229940 -157435 -41626 6161 -124777 -35387 -27416 -621598 -245584 -180378
10580 -180378 240128 -146015 107012 -301828 -97338 -39063 123828 202730 111277 32058
10569 -273071 -88783 -51308 94102 -170217 -124188 -121888 -122237 -85533 86407 73717 -112576 -216626
10557 -216626 130551 3124 -76465 -207173 -162403 -213061 191155 147074 -39503 14893 52183
10546 52183 -61966 -85272 -293338 -206549 -74903 92628 -108331 111385 -204129 -556 -27733
10535 -27733 -92875 52522 114537 205928 77513 -34253 6749 75042 -41605 172470 183911 -273905
10522 52060 -25277 -223613 97320 58175 52673 -150002 22004 -259823 -376358 -268733 79062
10510A49694o1278b13763R9269A83554C0421b48453j38969G6735b84429G9212
10499f3561A8982J4785i6930d4225p375A03746b75247a00376F0458N2867p672
10488A05653a44469A67300i8792B59982b15283L4495m6424j10747a55859o4644
10478b20503c1350a0255j57218A40918i7351B26415c7514l9127p7834A07852P5446
10467A83298f0225l29741R7989a01665H7977O4633D1625P8878L5468f0099F38081
10455A80494m8353C3308O97644b13066A86495B6557f9203l20727A61787d4726
10444b00234e5131k1084k29261E0701b56362B71274E9020M8790h8786a4512j70387
10433a84899G8988j4588a58491g6692C4013b62161L6788E6113b16363H8893a77005
$$ plain form
10510 149694 88416 -213763 -114494 183554 30421 -248453 -387422 76735 -284429 79212
10499 -63561 18982 33767 -96930 -44225 -51600 103746 -275247 -100376 60458 113325 105653
10488 105653 -144469 167300 -98792 259982 -215283 -180788 -227212 -337959 -155859 -220503
10478 -220503 -31350 -10255 -167473 140918 -97351 226415 -37514 -76641 -154475 107852 183298
10467 183298 -60225 -389966 -291977 -101665 87977 152610 41625 120503 155971 -60099 638081
10455 180494 132141 33308 730952 -213066 186495 26557 -69203 -389930 161787 -44726
10444 -200234 -55131 -76215 -305476 50701 -256362 271274 59020 107810 -88786 -14512 -184899
10433 -184899 78988 64400 -158491 -76692 34013 -262161 -225373 56113 -216363 88893 -177005
10421A43906a17719q589K189j94308B4406e1821D19308A0191f6317j31914l159
10410b01390o6236A08809d3636B0969L82921a69911q777c5535m3368k93457L4715
10399c37645A34008B2986i5833j20063P2100G4203J7532K75801c02606A49998
10388a38632B00048p8017m3837K1007a30700J2965m564B21740a28746A7033J54094
10377A71127e4881B82891a8236A51961n5193J80756c5899A14591K83373b0709
10366A01470A0196R6004k1440K56919r1462n2475L7459b0655G14489l09943A14210
10354D36083q6667j67051p2099L54776j93642K15085K58377k87207J03525r4561
10344D66619j48162A02180K33048f4471A44060l4985r318K15064I0783J20851
$$ plain form
10421 143906 -117719 -126308 -124119 -318427 24406 -51821 419308 10191 -66317 -198231 -201390
10410 -201390 -267626 108809 -43636 20969 403890 -169911 -178688 -35535 -78903 -372360 -337645
10399 -337645 134008 22986 -95833 -215896 -143796 74203 91735 367536 -302606 149998
10388 -138632 200048 122031 78194 99201 -130700 -117735 -122299 221740 -128746 17033 171127
10377 171127 -54881 282891 -18236 151961 96768 277524 -35899 114591 397964 -20709
10366 101470 10196 106200 84760 341679 250217 197742 235201 -20655 714489 404546 114210
10354 436083 349416 182365 110266 465042 271400 486485 744862 457655 561180 466619
10344 466619 318457 102180 335228 -64471 144060 109075 99757 314821 90783 211634
10334B11634R2127K71709k59484L644P7595M7524j31744A29158J83051J19245
10324D31454K09670A95554K27809D561J39997J46991K08337B43382K6258j21137
10314A48503J3290c5022A82858j3505R3020m7424J58182M913A62196l2936a6858
10302C47478B3517J68983l2095M2961m7286L4956a45752g347m3786D7720J85109
10291B32829a82561B57417c79898B58179A8258a25761F9007M0251a15579p8600
10281a94179m3903B78841i8913F4723e036B47881e1450A34641a0657E7391a24986
10269B20196H0729d1789A07449d7271m77195K35750A4647e9898a431r3660k6619
10258a21710l4959J9347q0375b4168j23172E2456b99354A04522b89560A69370
$$ plain form
10334 211634 303761 575470 315986 319630 397225 444749 313005 129158 312209 431454
10324 431454 641124 195554 423363 4561 144558 291549 499886 243382 269640 148503
10314 148503 161793 -35022 182858 169353 262373 214949 373131 378044 162196 129260 -16858
10302 347478 23517 192500 160405 203366 156080 191036 -145752 -7347 -51133 47720 232829
10291 232829 -182561 257417 -379898 258179 18258 -125761 69007 109258 -115579 -194179
10281 -194179 -238082 278841 -98913 64723 -5036 247881 -51450 134641 -10657 57391 -124986
10269 220196 80729 -41789 107449 -47271 -524466 -288716 14647 -59898 -1431 -95091 -121710
10258 -121710 -156669 -137322 -217697 -24168 -147340 52456 -299354 104522 -289560 169370
10247a76851I0698D231d607n06230I2395J09151f0725b3758J1336G8535b32313
10235b0015E67671b22635B00598F9195o75K0815i1741A37310b14832B1552c92671
10223B80429a36438A00305D3849a46204f6852A60301E3677J4358b10375Q982O595
10212a94798C9743g9877C35432A0067i3662A14668h9968j29673H0922i3574b5178
10200I9190o253b21893j36256J70154N1558B2505a89036G8962e9461b6626E5079
10188D3881a51887b0323j52605A6819a09652L1453F8021N0643l1569j6367L1488
10177A02216K08539a59352e4753q884n4195p2721K993d8547a3189j02973n32625
10166f48787E0585c100j22997A0137h7766j43853L1543L7927b2054q6122q3582
$$ plain form
10247 -176851 90698 4231 -4607 -510837 92395 201546 -60725 -23758 -12422 78535 -232313
10235 -20015 567671 -222635 200598 69195 68520 89335 -91741 137310 -214832 21552 -392671
10223 280429 -136438 100305 43849 -146204 -66852 160301 53677 68035 -210375 -201393 -194798
10212 -194798 39743 -79877 335432 10067 -93662 114668 -89968 -219641 80922 -93574 -25178
10200 99190 92937 -221893 -358149 -187995 -136437 22505 -189036 78962 -59461 -26626 55079
10188 43881 -151887 -20323 -172928 16819 -109652 -78199 68021 118664 87095 70728 102216
10177 102216 310755 -159352 -54753 -63637 -117832 -190553 -187560 -48547 -13189 -116162 -648787
10166 -648787 50585 -3100 -126097 10137 -87766 -231619 -200076 -162149 -22054 -108176 -191758
10155a91758o4025j08982A99896b68282f2394K1253l56286a00094j39959P7552
10145a62501M2547j907l4221j06811C1508M1918a61595B7842b19402M2580r2756
10134b69578h566k714A03894J24590C6480J47063a42533O2355l19818A28953d0974
10122a72374k17533e9985C6661J71972a24580A0637a74299L5688j36734B43219
10111e0587k22485C1975a39290A12829c31120A54442b58412A95004b37201I2721
10100a48492I2203K05825b47497Q8929A12679D6874g2409H3115a06510L1324k39258
10089c14444A88421K47704A5400a04417G2831a08094A70729a21968j70529D6298
10078A01124c03358p2852C7152o535h0940l0070a3477E2077k3403I17b99432a9718
$$ plain form
10155 -191758 -255783 -364765 199896 -268282 -62394 -41141 -397427 -100094 -240053 -162501
10145 -162501 -119954 -121861 -156082 -262893 31508 73426 -161595 27842 -219402 -176822 -269578
10134 -269578 -8566 -11280 103894 228484 36480 183543 -142533 -80178 -399996 128953 -40974
10122 -172374 -389907 -59985 36661 208633 -124580 10637 -174299 -138611 -275345 243219
10111 -50587 -273072 31975 -139290 112829 -331120 154442 -258412 195004 -237201 92721
10100 -148492 92203 298028 -247497 -158568 112679 46874 -72409 83115 -106510 -75186 -314444
10089 -314444 188421 436125 15400 -104417 72831 -108094 170729 -121968 -292497 46298
10078 101124 -303358 -376210 37152 30617 -80940 -111010 -13477 52077 28674 917 -299432 -19718
10065b8667k194A44456a92980k13305G7808e7262A7386b34238i9696F7808P0360
10054A38168a27327o969r3272a042l33869i1918E4886a13411j29122I3367R5390
10043A88757c27563A43762E4376K04589a84996A48065h1665B11138f6503k42977
10033c09480D8849b84890A07710a06655A54968D0358M79234c591m38850C11555
10022E3362f86l12949c5291A93890b77061c6308j88174A33225c63241R3217C15460
10010b04827n0681I4029C3994g7801j08856A5480e3740j4808o0509r7811e2604
9998H9740g1541E7024B4422O6706R8275l8843i9993C18280a43047O780n4634N4276
9986a36625A79787a30912H8638o148c46303C90427A50659b49317a1769m9536F5060
$$ plain form
10065 -28667 -30861 144456 -192980 -406285 77808 -57262 17386 -234238 -99696 67808 138168
10054 138168 -127327 -134296 -227568 -1042 -334911 -91918 54886 -113411 -242533 93367 188757
10043 188757 -327563 143762 54376 258965 -184996 148065 -81665 211138 -66503 -309480
10033 -309480 48849 -284890 107710 -106655 154968 40358 519592 -3591 -442441 311555
10022 53362 -686 -313635 -35291 193890 -277061 -36308 -224482 133225 -363241 -270024 315460
10010 -204827 -255508 94029 33994 -77801 -186657 15480 -53740 -68548 -129057 -226868 -52604
9998 89740 -71541 57024 24422 91128 189403 150560 -99993 318280 -143047 -136267 -190901 -136625
9986 -136625 179787 -130912 88638 82490 -346303 390427 150659 -249317 -11769 -61305 65060
9974b54231K9051B05302b39312G6895h5880P306a0232J846n1523r2622A75901
9962i9176j27199A9828b56001O0040P9429b7635m4645A2335d2195o6331M1192
9951f7334r4823d0400o1188d4259j35449r5477B13960b26009h4018F5623c36096
9939f4057b4985l8041j28191h1024j83812a01121j05762c3988j30593L3402e7803
9927B42488B1057b29804k2902A31321a00391j7822e768j43529A22843C0602e8962
9915a01178F828b73083A2904a45556A09898b18079A27501a33371k4160N9868K4662
9904g3001b1505j21311D6221d8095F2989a66785J351n7839B00841a13984a902
9892a39551I5289a60793B84429a43174B854e2066j22937k22723h0946A07679i5932
$$ plain form
9974 -254231 -225180 205302 -239312 76895 -85880 -78574 -10232 -8386 -59909 -152531 175901
9962 -99176 -226375 19828 -256001 -195961 -116532 -27635 -72280 12335 -42195 -108526 -67334
9951 -67334 -162157 -40400 -101588 -44259 -179708 -275185 213960 -226009 -84018 65623 -336096
9939 -64057 -24985 -63026 -191217 -81024 -264836 -101121 -206883 -33988 -164581 -131179 -57803
9927 242488 21057 -229804 -252706 131321 -100391 -118213 -5768 -149297 122843 30602 -58962
9915 -101178 6828 -273083 12904 -145556 109898 -218079 127501 -133371 -157531 -97663 -73001
9904 -73001 -21505 -142816 46221 -48095 62989 -166785 -165434 -223273 200841 -113984 -1902
9892 -139551 95289 -160793 284429 -143174 2854 -52066 -175003 -397726 -80946 107679 -95932
9880C7880a9785j56343B17142c25260a59919d5141I35J8907J28384m5062P5223
9869A78387A240M3938b07331j23651P294A7574J11199a73231A73a03503H9916
9857A8443a6172k18564A02815a73456A2369e8808j70498j13525g537l19536a63015
9845a68349a8256j06024F8528h8792j64761C30169b61957j51854A65814c89284
9834E6305A392i6451K179I6928d7468l7812m6157L383L9025D3487c77298E3893
9821f2531l38374J68221a8550l97316A74035G4506b66868E4976a60791k9482E0287
9809a11870G6461a24987C2044J50285b40109D9446J34176p4899a23215l13416
9799d36631i4857L1671j28150a1298l3943j94631H5161a12987j40060B03335a22154
$$ plain form
9880 37880 -19785 -176128 217142 -325260 -159919 -45141 935 19842 148226 103164 178387
9869 178387 1240 45178 -207331 -330982 -323688 17574 128773 -173231 173 -103503 89916
9857 18443 -16172 -234736 102815 -173456 12369 -58808 -229306 -342831 -7537 -327073 -163015
9845 -168349 -18256 -124280 68528 -88792 -253553 330169 -261957 -413811 165814 -389284
9834 56305 1392 -96451 -94272 96928 -47468 -85280 -131437 -128054 -89029 43487 -377298 53893
9821 -62531 -400905 -232684 -18550 -415866 174035 74506 -266868 54976 -160791 -190273 50287
9809 -111870 76461 -124987 32044 182329 -240109 49446 183622 108723 -123215 -436631
9799 -436631 -94857 -63186 -191336 -11298 -45241 -239872 85161 -112987 -253047 203335 -122154
9787A54134c50140I5038a75981D8884P3365e0821p3165E0355b92816j15021A35086
9775a52001B36641k3503B822N0065b87993A47530b38451e1748A17088a00876j49650
9764b50526A30318K30645a3247F7587k6035a93679I7022a89665o2170A20386l2994
9753H7392e6899A30283E2275J32302F8490i7345l44937H9592J27695f6528j0328
9742g6856A74011c26796C19404I1650c7515B02024a87735c6298H4421A2610N3898
9731F6508a27280n8702A57494b77042k72813C28082C8296A2452M500c23483h9186
9719a03399D0309a33263B59060j13222A3959a86150h8853l3020j528a7732l5924
9708e3656l7702a9391j07830j26533j4753a0802A41576a60274j59183d5663o9655
$$ plain form
9787 154134 -350140 95038 -175981 48884 122249 -50821 -123986 50355 -292816 -407837 135086
9775 -152001 236641 213138 2822 52887 -287993 147530 -238451 -51748 117088 -100876 -250526
9764 -250526 130318 360963 -13247 67587 41552 -193679 97022 -189665 -251835 120386 87392
9753 87392 -56899 130283 52275 184577 68490 -97345 -442282 89592 217287 -66528 -76856
9742 -76856 174011 -326796 319404 91650 -37515 202024 -187735 -36298 84421 12610 66508
9731 66508 -127280 -185982 157494 -277042 -549855 328082 38296 12452 16952 -323483 -89186
9719 -103399 40309 -133263 259060 145838 13959 -186150 -88853 -121873 -123401 -17732 -53656
9708 -53656 -91358 -19391 -127221 -253754 -268507 -10802 141576 -160274 -319457 -45663 -115318
9697a15318k9624Q12r2896b7302k7725A12329a1414k96025h1774m4596A85224
9685h9312r289B16558a87834j11613a37458o21276G8495P0059i0544H1844b36791
9673g3051J5912j73048h3626A12165c48903a23286j6402K1542H1584a52724l1425
9662a84149B55671C6604d60216F0892L2532C0658a45439A73397a61827j41173
9652c03000a16643j57911F6164a28053e3485n3157M9994l9912j15870m5463C1828
9640c44150b9705A22022a60507A38960R3470a36022J3756K3824C4619R2778b85613
9628a07208r3493O4900j29051e2766F272i5671A64869O8580a82931b7798C3818
9616H6564b17063O0820H0551J15411b45023c9996j27516C05903d50902J22767
$$ plain form
9697 -115318 -144942 -144130 -237026 -27302 -55027 112329 -11414 -307439 -81774 -126370 185224
9685 -89312 -98601 216558 -187834 -299447 -137458 -758734 78495 148554 -90544 81844 -236791
9673 -73051 -57139 -230187 -83626 112165 -348903 -123286 -139688 -118146 81584 -152724 -184149
9662 -184149 255671 36604 -460216 60892 93424 30658 -145439 173397 -161827 -303000
9652 -303000 -116643 -274554 66164 -128053 -53485 -106642 -56648 -96560 -212430 -257893 31828
9640 -344150 -29705 122022 -160507 138960 232430 -136022 -122266 -98442 34619 127397 -285613
9628 -107208 -200701 -135801 -264852 -52766 6272 -95671 164869 233449 -182931 -27798 33818
9616 86564 -217063 -156243 80551 195962 -245023 -39996 -167512 305903 -450902 -328135
9606c28135e8046j47872D0347J87030A03813a53706j5330q0802E9216L2154a37973
9594H8007c4729A62389b0265A33869o1933b22344j37845a09232k8914D2475E936
9582c36353c0093j71797k0138h8658o0682A23627f7104G9073b26034C983a53263
9570g0485k40497a41306F16341c1950C5677b4734r7213N3857l5902A02543a631
9558e7423j17584B04851D5641I958Q109J59895g7550l5107l167I4278b57749J02238
9546a55511j15429N7847o9735J4080A09672l9505b27237b4966j42968A22988M1790
9535A64778a49287j10209A38034d9839A2790P0108g2208j50293h4408k59652e4983
9523c66921J29125A09515a59082E125b64168F170N3338A7640G789K99294C4821
$$ plain form
9606 -328135 -58046 -205918 40347 227377 103813 -153706 -169036 -249838 59216 91370 -137973
9594 88007 -34729 162389 -20265 133869 71936 -222344 -360189 -109232 -138146 42475 5936
9582 -336353 -30093 -201890 -222028 -88658 -149340 123627 -67104 79073 -226034 3983 -153263
9570 -70485 -310982 -141306 616341 -31950 35677 -24734 -121947 -68090 -103992 102543 -1631
9558 -57423 -175007 204851 45641 9958 18067 177962 -77550 -112657 -115824 94278 -257749 -155511
9546 -155511 -270940 -213093 -282828 -268748 109672 70167 -227237 -24966 -167934 122988 164778
9535 164778 -149287 -259496 138034 -49839 12790 82898 -72208 -222501 -84408 -344060 -54983
9523 -366921 -237796 109515 -159082 5125 -264168 6170 59508 17640 7789 307083 34821
9511f2138A37124B531b70397G3756a63004O5202j52685A66537a18818G1454J1360
9500H2814a54815m630O2877B9010b55369O8700B3219a18288A4863K6429f8572
9488c18340J55561H5631a29123A29190M1086b53252j05897a40562M1568r0310
9478a89304A43345A5560a22838A39648B954K7024b02868A82470g1671b9234m28075
9467d57309h3904I4789j555d302A60176h9885k34512B6238h2028H5631c11173
9455a29204j63754d9608k73A75212a22326G6235b05003d4487A15021O0251b08560
9443F8869c26007b5797a0869G2388c4923p4726j102r3861E8328N8241a00065k21152
9431c21217e953n7966p9824L1059G6071L9397b90428j33759a734k80604A82189
$$ plain form
9511 -62138 137124 2531 -270397 73756 -163004 -97802 -250487 166537 -118818 71454 82814
9500 82814 -154815 -159445 -96568 29010 -255369 -186669 23219 -118288 14863 41292 -68572
9488 -318340 -162779 85631 -129123 129190 170276 -253252 -359149 -140562 -98994 -189304
9478 -189304 143345 15560 -122838 139648 2954 29978 -202868 182470 -71671 -29234 -457309
9467 -457309 -83904 94789 93234 -4302 160176 -89885 -324397 26238 -82028 85631 -311173
9455 -129204 -292958 -49608 -49881 175212 -122326 76235 -205003 -44487 115021 175272 -208560
9443 68869 -326007 -25797 -10869 72388 -34923 -109649 -110751 -204612 58328 116569 -100065 -321217
9431 -321217 -5953 -63919 -143743 -112684 76071 115468 -290428 -424187 -1734 -282338 182189
9419B0506a00463l59006J95328j39546j2095d0768j83611O09G676a8494B52037
9407b79171A59637a3511B3024b21135D1682a68383l2532K2394l89678b2224l5997
9396e8221m8152A20173P958g6538n096q98G524i5065k24495F2858a3414k97166
9384c10580A16805K5987b19263I9463a11445J4474B81454c61313e1677B05182
9373f4992b3568C12348A33946b02157a98j73278J5926f6896C243Q228N3232d5021
9360b18069B960d96193J11336J31031B76691D0626b05427i7836j0224A0051h7750
9348D5794i6660r3210A74957a8070d062j10467j22626K1304D5146f9023B12504
9336A6987h7459K2228l2875a7283A8684d46827D078b91015i6657m9507D4821K63897
$$ plain form
9419 20506 -100463 -459469 -264141 -403687 -415782 -40768 -224379 -223770 7676 -18494 252037
9407 -279171 159637 -13511 23024 -221135 41682 -168383 -200915 -178521 -568199 -22224 -58221
9396 -58221 -106373 120173 128131 -76538 -81634 -82532 7524 -95065 -319560 62858 -13414 -310580
9384 -310580 116805 142792 -219263 99463 -111445 -96971 281454 -361313 -51677 205182
9373 -64992 -23568 312348 133946 -202157 -198 -173476 -157550 -66896 3243 11471 64703 -45021
9360 -218069 2960 -496193 -384857 -253826 276691 40626 -205427 -97836 -108060 10051 -87750
9348 45794 -96660 -189870 174957 -18070 -4062 -114529 -237155 -215851 45146 -69023 212504
9336 16987 -87459 -65231 -98106 -17283 18684 -446827 4078 -291015 -96657 -146164 44821 308718
9324C08718l5620b72636j98757B25226i5486C2753d1530B07272b15127A8960h3255
9312d51046i8742L5126j66722j4903A32736b98952J08722L2636A71914K06321
9302C78235E6212a66029C78409C4670d9295A20866l1825a7389j44088d1405n5429
9291i6834k11529J42150e902p3965I470e34589A24202E8435o732e4805a4304q0567
9279i4871C68312a7803l13200J12592e8075k7264o9961B66929e03388M5474K00226
9268b57688E33610c009p1456a2367B0842O091e94641a94443O4307j53123c0261
9256d9102j68919d7856A02301A7119O9291c9284k49834J04120n7480J13705j83283
9245c12056J8692a09874k29504a60206I5574a49630E6431N5131N1782c307B5072
$$ plain form
9324 308718 273098 -272636 -471393 225226 -95486 32753 -41530 207272 -215127 18960 -83255
9312 -451046 -98742 -63616 -230338 -245241 132736 -298952 -190230 -157594 171914 378235
9302 378235 56212 -166029 378409 34670 -49295 120866 89041 -17389 -161477 -41405 -96834
9291 -96834 -308363 -166213 -5902 -79867 9470 -534589 124202 58435 51703 -54805 -14304 -94871
9279 -94871 368312 -17803 -331003 -218411 -58075 -85339 -155300 266929 -503388 -457914 -257688
9268 -257688 533610 -3009 -74465 -12367 20842 26933 -594641 -194443 -130136 -283259 -30261
9256 -49102 -218021 -47856 102301 17119 86410 -39284 -289118 -184998 -242478 -128773 -312056
9245 -312056 -293364 -109874 -339378 -160206 95574 -149630 56431 111562 163344 -3307 25072
9233c68006e8070a4205j57284A35837J23506D1679K7177N1186b60556J27121B20009
9221B5345H466L0012L1655a63070e1887N854q7011B76332a30773j96215a44080
9209c01834J06854j96012J36595d199k89895g0101A27171b9900m086A8185L4823
9198E3008b4617j69202c9884j98232j92624a23904a900A41143m0032D4819K4324
9187F9143a17748A99665a56889A83932e722l48963R3081K4602j93500I523e7044
9175A3266b87180k25347a61828a0434n2213A36029a75705B31882a75641P6441
9165i9200M3985F928K3353K52419a37022A50225i198A57276b58418B48650k5321
9154B23329g0891j61015P8024k423P5565j89802g2037c5446C7272d9588L561m6660
$$ plain form
9233 -368006 -58070 -14205 -171489 135837 259343 41679 68856 120042 -260556 -133435 220009
9221 25345 8466 38478 70133 -163070 -51887 -46033 -133044 276332 -130773 -326988 -144080
9209 -301834 -194980 -390992 -254397 -4199 -294094 -70101 127171 -29900 -33986 18185 53008
9198 53008 -24617 -193819 -39884 -238116 -430740 -123904 -1900 141143 101111 44819 69143
9187 69143 -117748 199665 -156889 183932 -5722 -354685 -261604 -237002 -430502 9523 -57044
9175 13266 -287180 -512527 -161828 -10434 -62647 136029 -175705 231882 -175641 -99200
9165 -99200 -55215 6928 30281 282700 -137022 150225 -9198 157276 -258418 248650 223329
9154 223329 -70891 -231906 -153882 -156305 -80740 -270542 -72037 -35446 37272 -49588 -46027 -92687
9142i2687L9662j90504J21142A67761m2268b99357F0274a09309a7842k77563F2882
9130A44010b75385c7782j38922m4369O9167d8504B33681a6058o3734p5404e2813
9118C28264d71332F0010J41197n1601c0570H3391J022b49430a05614K9007l85477
9107d62084J84437A29769m4991B7377b53308j20777i9884J108b6366A15522a61899
9095B53265h9131e190l05288J23373B40760c756o4048E9848b08172m9713J06855
9084a51030B44242c32601e6515B771O7833J47660c168j84058C7947b45614A43131
9072B02254J55328j54486o1369f015q8871r8262f3630j94927e0225A7675P1424
9061H9099Q2539c0454k71920G0190c54441I8276a64341j22060I4117D5993L76466
$$ plain form
9142 -92687 -53025 -243529 -122387 167761 125493 -299357 60274 -109309 -17842 -295405 62882
9130 144010 -275385 -37782 -176704 -221073 -151906 -48504 233681 -16058 -79792 -155196 -52813
9118 328264 -471332 60010 201207 149606 -30570 83391 84413 -249430 -105614 -76607 -462084
9107 -462084 -277647 129769 84778 27377 -253308 -374085 -99884 -98776 -26366 115522 -161899
9095 253265 -89131 -5190 -310478 -187105 240760 -3756 -67804 59848 -208172 -257885 -151030
9084 -151030 244242 -332601 -56515 2771 70604 218264 -3168 -187226 37947 -245614 143131
9072 202254 357582 203096 141727 -6015 -94886 -193148 -63630 -258557 -50225 17675 89099
9061 89099 171638 -30454 -302374 70190 -354441 98276 -164341 -286401 94117 45993 422459
9050D22459b97813j3391K0504B3604a11724l5872a858m5788m2785H7421b50402
9038b5617A60832a00530k9672k58997a39871A01326b80175b8886l22290a13544
9027A90442d8560j66502C5717c79068A08101b08344A60682b42431H922a14287
9016D6938j5645K1893R4446a20045j13379B48417e13m34093a94243G79K04634
9005B05413a37981A44547b33879G0703p918f813D8183P115b37969o0504J22639
8994a75834B73734A9290J8033a76147H6934P7667c35974Q3667E4769f7419J090
8983f6329l5428k5861I6647k4886J8210c8022A68301a41054H5872k1548i2703
8971e8090O710J1493J9388B8648f0728B88397b09971A34273m0879c3497A24434
$$ plain form
9050 422459 -297813 -311204 -290700 23604 -111724 -147596 -1858 -47646 -90431 87421 -250402
9038 -25617 160832 -100530 -130202 -389199 -139871 101326 -280175 -28886 -351176 -113544
9027 190442 -48560 -215062 35717 -379068 108101 -208344 160682 -242431 8922 -114287
9016 46938 31293 53186 147632 -120045 -233424 248417 -513 -434606 -194243 779 205413
9005 205413 -137981 144547 -233879 70703 62785 -6813 48183 55298 -237969 -298473 -175834
8994 -175834 273734 19290 37323 -176147 86934 164601 -335974 -252307 54769 -67419 -66329
8983 -66329 -101757 -127618 96647 71761 89971 -38022 168301 -141054 85872 64324 -92703
8971 -58090 -51380 -39887 -20499 28648 -60728 288397 -209971 134273 93394 -33497 124434
8959a01179B14896E3303O4295g5925k2647j08397g6844a523j4442j96959h6975
8947A15171C4035b45049E4378b32861B58402a10704j68305C68693a93743G6322
8936a47620f0206D0501A7845Q8798a57978f1534j61727O4495P7205M0682j4559
8925e5438k76112c2219L874A53179K8632B0413L6163c26668B65275K4947a12043
8913a88417O7521D8174J95014C404a43594C60258J8718M15506L57472J206402
8903B358356K255159n33113A846974H97470C25412j14471g2809B60101a04074
8893e6583B61366q1118P0201p4519a2030B0594a15546H4051a60059A08213B2804
8881I5560P727e57262A25023i7656C59279a89424C30725n8120I9949a52065l03234
$$ plain form
8959 -101179 214896 53303 117598 -75925 -98572 -206969 -76844 -1523 -15965 -212924 -86975
8947 115171 34035 -245049 54378 -232861 258402 -110704 -279009 368693 -193743 76322
8936 -147620 -60206 40501 17845 106643 -157978 -61534 -223261 -158766 -81561 -40879 -55438
8925 -55438 -331550 -32219 -28345 153179 181811 20413 56576 -326668 265275 290222 -112043
8913 -188417 -120896 48174 243188 3404 -143594 360258 378976 794482 1151954 2358356
8903 2358356 4613515 4080402 1846974 897470 325412 210941 -72809 260101 -104074
8893 -56583 261366 180248 250449 175930 -12030 20594 -115546 84051 -160059 108213 22804
8881 95560 103287 -557262 125023 -97656 359279 -189424 330725 272605 99949 -152065 -455299
8870d55299Q5507A2413a9274H257b25219A64095d1516o1337L3958j6064j5176
8859a00135F6464a47978G8516b81463J1337A45895e33589d7058H0348a89042Q4398
8848a04644E4665O812a12156A90108c77760d4018D0178K24496b0556q6435e066
8836c19861P6306A40025a39827C33339E8168N6797b45666A152b50890L1279e405
$$ plain form
8870 -455299 -369792 12413 -19274 8257 -225219 164095 -41516 -102853 -68895 -84959 -100135
8859 -100135 66464 -147978 78516 -281463 -270126 145895 -533589 -47058 80348 -189042 -104644
8848 -104644 54665 61477 -112156 190108 -377760 -44018 40178 264674 -20556 -106991 -5066
8836 -319861 -243555 140025 -139827 333339 58168 114965 -245666 1152 -250890 -219611 -5405
$$ [...]
##END NTUPLES=NMR SPECTRUM
##END=
