
##TITLE=AC1076_TOSA01_5868082_CwQ18kB4vy
##JCAMPDX= 6.0         $$ Bruker NMR JCAMP-DX V2.0
##DATA TYPE= NMR SPECTRUM
##DATA CLASS= NTUPLES
##ORIGIN= BRUKER
##OWNER= Administrator
$$ 1.72 TOPSPIN		Version 2.1
$$ 2012-03-31 03:49:34.000 -0500  Administrator@TOPSPIN
$$ Compression mode = diff/dup
##.OBSERVE FREQUENCY= 400.13188235
##.OBSERVE NUCLEUS= ^1H
##.ACQUISITION MODE= SIMULTANEOUS (DQD)
##.ACQUISITION SCHEME= undefined
##.AVERAGES= 64
##.DIGITISER RES= 22
##SPECTROMETER/DATA SYSTEM= spect
##.PULSE SEQUENCE= noesygpps1d.comp
##.SOLVENT NAME= COFFEE_meoh
##.SHIFT REFERENCE= INTERNAL, COFFEE_meoh, 1, 14.96676
##AUDIT TRAIL= $$ (NUMBER, WHEN, WHO, WHERE, PROCESS, VERSION, WHAT)
$$ ##TITLE= Audit trail, TOPSPIN		Version 2.1
$$ ##JCAMPDX= 5.01
$$ ##ORIGIN= Bruker BioSpin GmbH
$$ ##OWNER= Administrator
$$ $$ C:\Bruker\TOPSPIN/data/COFFEE/nmr/AC1076_TOSA01_5868082_CwQ18kB4vy/12/pdata/1/auditp.txt
$$ ##AUDIT TRAIL=  $$ (NUMBER, WHEN, WHO, WHERE, PROCESS, VERSION, WHAT)
(   1,<2012-03-31 03:49:29.328 -0500>,<Administrator>,<TOPSPIN>,<go>,<TOPSPIN 2.1>,
      <created by zg
	started at 2012-03-31 03:37:57.687 -0500,
	POWCHK enabled, PULCHK disabled,
       configuration hash MD5:
       1A 1E CE 29 27 FD 77 03 67 4E F0 E3 C4 B2 CB 90
       data hash MD5: 64K
       3C 29 78 54 EB F5 D5 BE 59 7A FD D9 09 8C B6 D2>)
(   2,<2012-03-31 03:49:32.015 -0500>,<Administrator>,<TOPSPIN>,<proc1d>,<TOPSPIN 2.1>,
      <Start of raw data processing
       efp LB = 0.3 FT_mod = 6 PKNL = 1 PHC0 = 0 PHC1 = 0 SI = 128K 
       data hash MD5: 128K
       8B E9 52 24 81 22 D6 16 67 DA 35 05 B0 E0 F1 87>)
(   3,<2012-03-31 03:49:33.250 -0500>,<Administrator>,<TOPSPIN>,<proc1d>,<TOPSPIN 2.1>,
      <pk PHC0 = 34.24988 PHC1 = 0 
       data hash MD5: 128K
       BB 5A 87 EB B9 FD 57 06 C6 5C 71 D9 EA B7 71 31>)
(   4,<2012-03-31 03:49:33.484 -0500>,<Administrator>,<TOPSPIN>,<proc1d>,<TOPSPIN 2.1>,
      <abs ABSG = 1 
       data hash MD5: 128K
       7D 4B 03 6A 4D 3D 13 F3 8C D0 51 25 24 DB BF 05>)
(   5,<2012-03-31 03:49:33.562 -0500>,<Administrator>,<TOPSPIN>,<proc1d>,<TOPSPIN 2.1>,
      <abs ABSG = 2 
       data hash MD5: 128K
       89 6A AD AA 8A 9E 13 18 B5 F5 51 20 8B AF 18 4E>)
(   6,<2012-03-31 03:49:33.671 -0500>,<Administrator>,<TOPSPIN>,<proc1d>,<TOPSPIN 2.1>,
      <abs ABSG = 3 
       data hash MD5: 128K
       90 2A 58 29 B8 0E AC 79 47 2D 9E AA C0 E5 4F 91>)
(   7,<2012-03-31 03:49:33.843 -0500>,<Administrator>,<TOPSPIN>,<proc1d>,<TOPSPIN 2.1>,
      <abs ABSG = 4 
       data hash MD5: 128K
       73 BC BC 89 C5 15 A2 90 93 5D 1E 6C ED EC 9D 22>)
(   8,<2012-03-31 03:49:33.906 -0500>,<Administrator>,<TOPSPIN>,<proc1d>,<TOPSPIN 2.1>,
      <abs ABSG = 5 
       data hash MD5: 128K
       9C 65 0B CB 5E DC 0A 8C EB 22 6F 96 1A 40 B8 10>)
$$ ##END=
$$ 
$$ $$ hash MD5
$$ $$ B1 08 67 A5 CA D0 A9 33 12 99 FC 03 06 00 0E D2
##$RELAX= 
##$RELAX= 
##$RELAX= 
##$RELAX= 
##$RELAX= 
##$RELAX= 
##$RELAX= 
##$RELAX= 
$$ Bruker specific parameters
$$ [...]
##$TP07= 0
##$TPNAME0= <>
##$TPNAME1= <>
##$TPNAME2= <>
##$TPNAME3= <>
##$TPNAME4= <>
##$TPNAME5= <>
##$TPNAME6= <>
##$TPNAME7= <>
##$TPOAL= (0..7)
0.5 0.5 0.5 0.5 0.5 0.5 0.5 0.5
##$TPOFFS= (0..7)
0 0 0 0 0 0 0 0
##$TUNHIN= 0
##$TUNHOUT= 0
##$TUNXOUT= 0
##$USERA1= <user>
##$USERA2= <user>
##$USERA3= <user>
##$USERA4= <user>
##$USERA5= <user>
##$V9= 5
##$VALIST= <valist>
##$VCLIST= <CCCCCCCCCCCCCCC>
##$VD= 0
##$VDLIST= <DDDDDDDDDDDDDDD>
##$VPLIST= <PPPPPPPPPPPPPPP>
##$VTLIST= <TTTTTTTTTTTTTTT>
##$WBST= 2048
##$WBSW= 25
##$XGAIN= (0..3)
0 0 0 0
##$XL= 0
##$YL= 0
##$YMAX_a= 10115153
##$YMIN_a= -5398745
##$ZGOPTNS= <>
##$ZL1= 120
##$ZL2= 120
##$ZL3= 120
##$ZL4= 120
##$ABSF1= 14.96676
##$ABSF2= -5.585771
##$ABSG= 5
##$ABSL= 3
##$ALPHA= 0
##$AQORDER= 0
##$ASSFAC= 0
##$ASSFACI= 0
##$ASSFACX= 0
##$ASSWID= 0
##$AUNMP= <proc_prof1d_extract.lims>
##$AXLEFT= 0
##$AXNAME= <>
##$AXNUC= <1H>
##$AXRIGHT= 0
##$AXTYPE= 0
##$AXUNIT= <>
##$AZFE= 0.1
##$AZFW= 0.1
##$BCFW= 0
##$BC_mod= 0
##$BYTORDP= 0
##$COROFFS= 0
##$CY= 15
##$DATMOD= 1
##$DC= 0
##$DFILT= <>
##$DTYPP= 0
##$F1P= 0
##$F2P= 0
##$FCOR= 0.5
##$FTSIZE= 131072
##$FT_mod= 6
##$GAMMA= 0
##$GB= 0
##$INTBC= 1
##$INTSCL= 1
##$ISEN= 128
##$LB= 0.3
##$LEV0= 0
##$LPBIN= 0
##$MAXI= 10000
##$MC2= 0
##$MEAN= 0
##$ME_mod= 0
##$MI= 0
##$NCOEF= 0
##$NC_proc= -3
##$NLEV= 6
##$NOISF1= 0
##$NOISF2= 0
##$NSP= 0
##$NTH_PI= 0
##$NZP= 0
##$OFFSET= 14.96676
##$PC= 1
##$PHC0= 34.24988
##$PHC1= 0
##$PH_mod= 1
##$PKNL= yes
##$PPARMOD= 0
##$PPDIAG= 0
##$PPIPTYP= 0
##$PPMPNUM= 2147483647
##$PPRESOL= 1
##$PSCAL= 4
##$PSIGN= 0
##$PYNMP= <proc.py>
##$REVERSE= no
##$SF= 400.130005540509
##$SI= 131072
##$SIGF1= 0
##$SIGF2= 0
##$SINO= 400
##$SIOLD= 131072
##$SPECTYP= <>
##$SREGLST= <1H.CDCl3>
##$SSB= 0
##$STSI= 131072
##$STSR= 0
##$SW_p= 8223.68421052632
##$SYMM= 0
##$S_DEV= 0
##$TDeff= 65536
##$TDoff= 0
##$TI= <>
##$TILT= no
##$TM1= 0
##$TM2= 0
##$TOPLEV= 0
##$USERP1= <user>
##$USERP2= <user>
##$USERP3= <user>
##$USERP4= <user>
##$USERP5= <user>
##$WDW= 1
##$XDIM= 131072
##$YMAX_p= 367255188
##$YMIN_p= -140391316
##$CURPLOT= <Network HP LaserJet P1505>
##$CURPRIN= <$Network HP LaserJet P1505>
##$DFORMAT= <normdp>
##$LAYOUT= <+/1D_H.xwp>
##$LFORMAT= <normlp>
##$PFORMAT= <normpl>
##$SURQMSG= 1
$$ End of Bruker specific parameters
$$ ---------------------------------
##NTUPLES= NMR SPECTRUM
##VAR_NAME=  FREQUENCY,     SPECTRUM/REAL,   SPECTRUM/IMAG
##SYMBOL=    X,             R,               I
##VAR_TYPE=  INDEPENDENT,   DEPENDENT,       DEPENDENT
##VAR_FORM=  AFFN,          ASDF,            ASDF
##VAR_DIM=   131072,        131072,          131072
##UNITS=     HZ,            ARBITRARY UNITS, ARBITRARY UNITS
##FACTOR=    0.0627417313425165, 1,          1
##FIRST=     8223.62146879498, -2523,        -93725
##LAST=      0,             -1723,           -94451
##MIN=       0,             -140391316,      0
##MAX=       8223.62146879498, 367255188,    0
$$ Real data points
##PAGE= N=1
##DATA TABLE= (X++(R..R)), XYDATA
$$ [...]
61458D18188K044J516N55l89j448k597l098k401j072r0L48N43M39j9r6R34K363
$$ 418188 420232 421748 422303 421914 420466 417869 414771 412370 411298 411208 411556 412099 412538 412519 412423 413357 415720
61441D15720K625J389rm51k80l23o45q25p88p30o93n85l30K62J341K546L148K918
$$ 415720 418345 419734 419725 419274 418994 418671 418026 417201 416413 415683 414990 414405 414075 414337 415678 418224 421372 424290
61423D24290K456K387K618K628K231J737J463J226M51j025k255j947j44J542J943
$$ 424290 426746 429133 431751 434379 436610 438347 439810 441036 441487 440462 438207 436260 436116 437658 439601
61408D39601J734J899J705j29k731l484j549R08J718J420J823L145L958L305J567
$$ 439601 441335 443234 444939 444810 442079 438595 437046 437954 439672 441092 442915 446060 450018 453323 454890
61393D54890l92j867k310j581k24J057J976K327J671J51r09k43J674L109L187
$$ 454890 454498 452631 450321 448740 448516 449573 451549 453876 455547 455698 454789 454546 456220 459329 462516
61378D62516K607K166J601M77n81m16J057K536K846K261J872J958J765R92N91
$$ 462516 465123 467289 468890 469367 468786 468370 469427 471963 474809 477070 478942 480900 482665 483657 484248
61363D84248J410K570K287K00k083k963k437j382j75J266K608L078K270O51p48
$$ 484248 485658 488228 490515 490715 488632 485669 483232 481850 481675 482941 485549 488627 490897 491548 490800
61348D90800j182r19j056k091k941k082L81K687L444K763J268o55k265k500j495
$$ 490800 489618 488699 487643 485552 482611 480529 480910 483597 487041 489804 491072 490417 488152 485652 484157
61333D84157q39j383j832p39J056J477J31j363j706j143m39J01L98M65P75J895
$$ 484157 483318 481935 480103 479364 480420 481897 482028 480665 478959 477816 477377 477478 477876 478341 479116 481011
61317D81011L535M609M430L305K097J693K626M406N445M562K531J240J413K077
$$ 481011 484546 489155 493585 496890 498987 500680 503306 507712 513157 517719 520250 521490 522903 524980
61303E24980K288K271K570L053L276L196L054K924K769K697K999L953N372O264
$$ 524980 527268 529539 532109 535162 538438 541634 544688 547612 550381 553078 556077 560030 565402 571666
61289E71666N648M217M263O838R605R118N119J057J05K024M359N315M721L298
$$ 571666 577314 581531 585794 592632 602237 611355 616474 617531 617636 619660 624019 629334 634055 637353
61275F37353J992J488J668J843J711J533J381J073R02J378K020J693M94q3N35
$$ 637353 639345 640833 642501 644344 646055 647588 648969 650042 650944 652322 654342 656035 656529 656446 656981
61260F56981J014M58K19J806M128M710L200J784K137L539M440M616N083O586Q746
$$ 656981 657995 658453 658672 660478 664606 669316 672516 674300 676437 679976 684416 689032 694115 700701 709447
61245G09447J0454J0931J0474R993R667Q660O676M951M715N270M848L140J491
$$ 709447 719901 730832 741306 751299 760966 769626 776302 781253 785968 791238 796086 799226 800717
61232H00717N72n12k316l742l714l038l321m545n079m088k735k691m129n568n316
$$ 800717 801289 800777 798461 794719 791005 787967 784646 780101 775022 770934 768199 765508 761379 755811 750495
61217G50495k978N5J473N4k906m673l995k354j777k084j453O77K769L501L439
$$ 750495 747517 747572 749045 749099 746193 741520 737525 735171 733394 731310 729857 730534 733303 736804 740243
61202G40243L610L796L533L732N379P213O720L697R05N07J528J862J294J125J785
$$ 740243 743853 747649 751182 754914 760293 767506 774226 777923 778828 779335 780863 782725 784019 785144 786929
61187G86929K477K807L276M102M683M427L423K164J138N73K51k39o82k29J161
$$ 786929 789406 792213 795489 799591 804274 808701 812124 814288 815426 815999 816250 816011 815329 815100 816261
61172H16261J968Q86j124j828o19Q97J347J255J771K944M103N026N803O089N503
$$ 816261 818229 819115 817991 816163 815544 816441 817788 819043 820814 823758 827861 832887 838690 844779 850282
61157H50282M585M497N705P495Q872R476R485Q983P863O313N139N247O617Q020
$$ 850282 854867 859364 865069 872564 881436 890912 900397 909380 917243 923556 928695 933942 940559 948579
61143I48579Q179P238O609P249Q464Q825P965O964P003Q111R375R988R713Q681
$$ 948579 956758 963996 970605 977854 986318 995143 1003108 1010072 1017075 1025186 1034561 1044549 1054262 1062943
61129A062943P168N632M487L791L364L235L476L530K465K78j698k384k339k721
$$ 1062943 1070111 1075743 1080230 1084021 1087385 1090620 1094096 1097626 1100091 1100369 1098671 1096287 1093948 1091227
61115A091227l496l827l907m816o473p357o824o224o819p849p883p058o691p214
$$ 1091227 1087731 1083904 1079997 1075181 1068708 1061351 1054527 1048303 1041484 1033635 1025752 1018694 1012003 1004789
61101A004789p892q175q168p924p398o989p180p676p726p143o331n553n025n337
$$ 1004789 996897 988722 980554 972630 965232 958243 951063 943387 935661 928518 922187 916634 911609 906272
61087I06272o750q289q659p981p563p960q378q051p104n822m133k190o15K19N74
$$ 906272 899522 891233 882574 874593 867030 859070 850692 842641 835537 829715 825582 823392 822777 822996 823570
61072H23570Q16J134J780K827L742M036M271N447P394Q880R461J0014J1210J2644
$$ 823570 824386 825520 827300 830127 833869 837905 842176 847623 855017 863897 873358 883372 894582 907226
61058I07226J3908J5367J7250J9017K0258K1288K2214K2344K1265J9771J9057
$$ 907226 921134 936501 953751 972768 993026 1014314 1036528 1058872 1080137 1099908 1118965
61047A118965J9558K1090K3274K5203K5507K3621K0433J7067J3700J0205P166
$$ 1118965 1138523 1159613 1182887 1208090 1233597 1257218 1277651 1294718 1308418 1318623 1325789
61036A325789N346M494L539J818l85k351l630m531n893p905r420r364q725r649
$$ 1325789 1331135 1335629 1339168 1340986 1340601 1338250 1334620 1330089 1324196 1316291 1306871 1297507 1288782 1279133
61022A279133j2260j4050j3250j1304j0696j1605j2152j1049q573n567k919j613
$$ 1279133 1266873 1252823 1239573 1228269 1217573 1205968 1193816 1182767 1174194 1168627 1165708 1164095
61010A164095j833k208j081J587M438O461P721Q802J0444J3234J6830J9981K2120
$$ 1164095 1162262 1160054 1158973 1160560 1164998 1171459 1179180 1187982 1198426 1211660 1228490 1248471 1270591
60997A270591K4124K6728K9192L0853L2818L6437M0957M4544M7095N0134N4278
$$ 1270591 1294715 1321443 1350635 1381488 1414306 1450743 1491700 1536244 1583339 1633473 1687751
60986A687751N8821O3627O9313P5455Q0682Q4948Q9833R6028J02208J07114J11356
$$ 1687751 1746572 1810199 1879512 1954967 2035649 2120597 2210430 2306458 2408666 2515780 2627136
60975B627136J16451J23254J31825J41686J51928J61999J72623J84795J98190
$$ 2627136 2743587 2866841 2998666 3140352 3292280 3454279 3626902 3811697 4009887
60966D009887K12075K27392K45855K67075K88981L11416L36748L66444M00031
$$ 4009887 4221962 4449354 4695209 4962284 5251265 5562681 5899429 6265873 6665904
60957F665904M38331M84280N38711N98779O63357P37058Q25803R32037J058506
$$ 6665904 7104235 7588515 8127226 8726005 9389362 10126420 10952223 11884260 12942766
60948A2942766J210390J379677J522315J563011J441504J164463Q11178M84941
$$ 12942766 14153156 15532833 17055148 18618159 20059663 21224126 22035304 22520245
60940B2520245K56161J44721J38916K10906L08652L50863K57589L170l59678p32407
$$ 22520245 22776406 22921127 23060043 23270949 23579601 23930464 24188053 24191223 23831545 23099138
60930B3099138j030431j218859j306535j321042j290515j236839j173581j106527
$$ 23099138 22068707 20849848 19543313 18222271 16931756 15694917 14521336 13414809
60922A3414809j037309r66888q95981q24435p52252o80975o13070n50449m93962
$$ 13414809 12377500 11410612 10514631 9690196 8937944 8256969 7643899 7093450 6599488
60913F599488m43614l98653l58200l22219k91220k64734k41122k19309j99750
$$ 6599488 6155874 5757221 5399021 5076802 4785582 4520848 4279726 4060417 3860667
60904C860667j83018j68553j55512j43937j34160j25777j18206j11592j06220
$$ 3860667 3677649 3509096 3353584 3209647 3075487 2949710 2831504 2719912 2613692
60895B613692j01432r6096q9938q3565p7448p1627o6363o2156n8968n5942n2200
$$ 2613692 2512260 2416164 2326226 2242661 2165213 2093586 2027223 1965067 1906099 1850157 1797957
60884A797957m7767m3723m1400m1127m1565m0645l7574l3621l0742k9712k9949
$$ 1797957 1750190 1706467 1665067 1623940 1582375 1541730 1504156 1470535 1439793 1410081 1380132
60873A380132l0605l1175l1277l0610k9240k7561k5901k4429k3361k2776k2197
$$ 1380132 1349527 1318352 1287075 1256465 1227225 1199664 1173763 1149334 1125973 1103197 1081000
60862A081000k0840j8627j6622j6040j6748j7205j6147j4094j2703j2630j2671
$$ 1081000 1060160 1041533 1024911 1008871 992123 974918 958771 944677 931974 919344 906673
60851I06673j1359q870o793o219o743p196o800n544l988k777k069j388l81N48
$$ 906673 895314 886444 879651 873432 866689 859493 852693 847149 843161 840384 838315 836927 836546 837094
60837H37094Q40P40R16J237Q14o41k221k904k606k088k242l542n594p323q157
$$ 837094 837934 838674 839590 840827 841641 841000 838779 835875 833269 831181 828939 825397 819803 812480 804323
60822H04323q798r961j0804j0012q236p672q843r687q602o661n550n071m282l737
$$ 804323 795525 785564 774760 764748 756512 748840 739997 730310 721708 715047 709497 704426 700144 696407
60808F96407m518n862n896m429l093k827l013l142l587m276m311l433k664k761
$$ 696407 691889 686027 680131 675702 672609 669782 666769 663627 660040 655764 651453 648020 645356 642595
60794F42595l140k965k392k028j920j632r62j76J42m08j221p73J472L563K964
$$ 642595 639455 636490 634098 632070 630150 628518 627556 627380 627522 627114 625893 625120 626592 630155 633119
60779F33119L2k015j102J271K394J658L36o74j446j981k026j691j242n65L53P90
$$ 633119 633151 631136 630034 631305 633699 635357 635693 635019 633573 631592 629566 627875 626633 626068 626421 627211
60763F27211Nj689l327m339m528l615j847o28j212k906l710k806j338o80r99j834
$$ 627211 627216 625527 622200 617861 613333 609718 607871 607243 606031 603125 599415 596609 595271 594591 593592 591758
60747E91758k928l925m161l478k792l205m757o454p296o994n953m822m022l496
$$ 591758 588830 584905 580744 577266 574474 571269 566512 560058 552762 545768 539815 534993 530971 527475
60733E27475l024k688k830l534m392m766m160k540o43L53o2j091j619j556j497
$$ 527475 524451 521763 518933 515399 511007 506241 502081 499541 498898 499251 499189 498098 496479 494923 493426
60718D93426j368n26P34J072L6r86n69Q96K144L051M321N616N561L881K090J473
$$ 493426 492058 491532 492266 493338 493374 492388 491819 492715 494859 497910 502231 507847 513408 517289 519379 520852
60702E20852J494J094O65J441L328M588L859J626n48j477r10M99J355N29j317
$$ 520852 522346 523440 524105 525546 528874 533462 537321 538947 538399 536922 536012 536511 537866 538395 537078
60687E37078j981l63J819K028J43j680k153k226k993l940m129l883l991m207l768
$$ 537078 535097 534734 536553 538581 538724 537044 534891 532665 529672 525732 521603 517720 513729 509522 505754
60672E05754k871k434k731l413m457n963p298p680p358p055o478m873k855j891
$$ 505754 502883 500449 497718 494305 489848 483885 476587 468907 461549 454494 448016 443143 440288 438397
60658D38397j749m94K212L880K652L26j02J318J997J026L23J165J986R75q60j111
$$ 438397 436648 436154 438366 442246 444898 445224 445122 446440 448437 449463 449786 450951 452937 453912 453052 451941
60642D51941M23J520R66K21J013K736L694L895M709N918N324K189q33q42J409
$$ 451941 452364 453884 454850 455071 456084 458820 462514 466409 471118 477036 482360 484549 483716 482874 484283
60627D84283K856K571K467L562M259L282K025K314L558L983L553L554M062L885
$$ 484283 487139 489710 492177 495739 499998 503280 505305 507619 511177 515160 518713 522267 526329 530214
60613E30214K762J644P73o55k601l764l568l102l328l719l507l100l163l188k178
$$ 530214 532976 534620 535393 534738 532137 528373 524805 521703 518375 514656 511149 508049 504886 501698 499520
60598D99520l23J013Q53n38k113k777j920N6J811K186J312M30O06J748K686K187
$$ 499520 499197 500210 501063 500525 498412 495635 493715 493771 495582 497768 499080 499510 500116 501864 504550 506737
60582E06737K42j653j911n82P55Q60j01j396k632l445l252k174j459k052l205
$$ 506737 506979 505326 503415 502833 503588 504448 504347 502951 500319 496874 493622 491448 489989 487937 484732
60567D84732l428k476j389q17l05O47J680J989J168m29j780j798m15J096J513
$$ 484732 481304 478828 477439 476622 476317 476964 478644 480633 481801 481372 479592 477794 477379 478475 479988
60552D79988J105R94J302J027j60j185j022qR37J567K179K820L318L708L988L813
$$ 479988 481093 482087 483389 484416 484256 483071 482049 482041 482978 484545 486724 489544 492862 496570 500558 504371
60536E04371K973J886J108P28P16J295K293K604J392m53j098r1J106J202O81P40
$$ 504371 507344 509230 510338 511066 511782 513077 515370 517974 519366 518913 517815 517724 518830 520032 520713 521453
60520E21453J504K167K469L081M441N923O549O226N929O697Q562J0608J1906J2192
$$ 521453 522957 525124 527593 530674 535115 541038 547587 553813 559742 566439 575001 585609 597515 609707
60506F09707J1612J0256Q330O455N193M292K932Q08j479l126l758l251j641N16
$$ 609707 621319 631575 639905 646360 651553 655845 658777 659585 658106 654980 651222 647971 646330 646846
60492F46846K251K999K990K744K822M070P102J0953J3299J2921J1291J0755J1795
$$ 646846 649097 652096 655086 657830 660652 664722 671824 682777 696076 708997 720288 731043 742838
60479G42838J3035J3338J2592J0931Q623O597N694N262L782R70j837l487l874
$$ 742838 755873 769211 781803 792734 801357 807954 813648 818910 822692 823662 821825 818338 814464
60466H14464l118j450r5n06k178k988k320j890k485k044J244N730Q407Q916R239
$$ 814464 811346 809896 809801 809295 807117 804129 801809 799919 797434 795390 796634 802364 810771 819687 828926
60451H28926J0231J1001J1268J1997J3568J5439J7780K1367K5598K8605K9836
$$ 828926 839157 850158 861426 873423 886991 902430 920210 941577 967175 995780 1025616
60440A025616L0788L2550L4435L5610L6244L6188L4281L0157K5148K0155J4059
$$ 1025616 1056404 1088954 1123389 1158999 1195243 1231431 1265712 1295869 1321017 1341172 1355231
60429A355231N693l938j2968k1159k9169l6139m0128m0861m0275l9957l9506l7878
$$ 1355231 1360924 1356986 1344018 1322859 1293690 1257551 1217423 1176562 1136287 1096330 1056824 1018946
60417A018946l5290l2965l1692l1205l0631k9185k6677k3690k1254k0035j9700
$$ 1018946 983656 950691 918999 887794 857163 827978 801301 777611 756357 736322 716622
60406G16622j9080j7206j4289j1512r582p976o061m438m233n314o367o636o462
$$ 716622 697542 680336 666047 654535 644953 636977 630916 626478 622245 616931 610564 603928 597466
60393E97466o140n556n145n662o643o606n325m314m406m567m084m020n079n880
$$ 597466 591326 585770 580625 574963 568320 561714 556389 552075 547669 543102 539018 534998 529919 524039
60379E24039n097l667k982k484j317p56k133l619k441L72J111p27j564M39K441
$$ 524039 518942 515275 512293 509809 508492 507736 505603 501984 499543 499915 501026 500299 498735 499174 501615
60364E01615J512j073k511k705l083l192j600Q57J810J001N46J468K319J878J051
$$ 501615 503127 502054 499543 496838 493755 490563 488963 489820 491630 492631 493177 494645 496964 498842 499893
60349D99893J157J769J635Q89R70K422L849L618K056J087J583K083R45r69j217
$$ 499893 501050 502819 504454 505343 506313 508735 512584 516202 518258 519345 520928 523011 523956 522987 521770
60334E21770Q20L032L485K625J801J133K25k09Q18K673L633L239K685K823L123
$$ 521770 522590 525622 529107 531732 533533 534666 534891 534682 535500 538173 541806 545045 547730 550553 553676
60319E53676K877K341K151K385K702K858K756K339J833J709K134K629K478J482
$$ 553676 556553 558894 561045 563430 566132 568990 571746 574085 575918 577627 579761 582390 584868 586350
60305E86350K31l14L97K023L637M518M563M104L609L463L686L909M027M500N450
$$ 586350 586581 586267 586664 588687 592324 596842 601405 605509 609118 612581 616267 620176 624203 628703 634153
60290F34153N906M996L581L148L118J208k842n909n299k346l99m49q36n26l32
$$ 634153 640059 645055 648636 651784 654902 656110 653268 647359 642060 639714 639315 638866 638030 637504 637172
60275F37172q69j392j249r37j143j778k406k731k475j608p53m68l03M13J155R52
$$ 637172 636303 634911 633662 632725 631582 629804 627398 624667 622192 620584 619831 619363 619060 619473 620628 621580
60259F21580L84J090L088M360L786K868L517N502P114P447O921O384O643Q150
$$ 621580 621964 623054 626142 630502 634288 637156 640673 646175 653289 660736 667657 674041 680684 688834
60245F88834J0209J1000R306N859K420kj533k790m456o795r000r672q613p353
$$ 688834 699043 710043 719349 725208 727628 727626 726093 723303 718847 712052 703052 693380 684767 677414
60231F77414p177p430o650m757l052k533l086m011m536m178l299k893l229l332
$$ 677414 670237 662807 656157 651400 648348 645815 642729 638718 634182 630004 626705 623812 620583 617251
60217F17251k482j389r76r31o19n72j552k658k220l83Q33K07j439k832l600l655
$$ 617251 614769 613380 612404 611473 610854 610282 608730 606072 603852 603469 604302 604509 603070 600238 596638 592983
60201E92983k643p13J163K152K069P98j699m484n908n293l419j158J208K982K993
$$ 592983 590340 589627 590790 592942 595011 595809 594110 589626 583718 578425 575006 573848 575056 578038 581031
60186E81031J414K92R77K168J813J53o18O58K793L859L070J147l39j32J527K986
$$ 581031 582445 582737 583714 585882 587695 587848 587230 587888 590681 594540 597610 598757 598418 598286 599813 602799
60170F02799K974J942J069N89O8k47K97J328J604P82K5N28K207M095N271N296
$$ 602799 605773 607715 608784 609373 609441 609194 609491 610819 612423 613205 613230 613758 615965 620060 625331 630627
60154F30627M477L845M228N233N774N569N348N569N882O027O257O535O271N335
$$ 630627 635104 638949 643177 648410 654184 659753 665101 670670 676552 682579 688836 695371 701642 706977
60140G06977M558M675N380N925O090O131O256O611P174P397O577M923L556L048
$$ 706977 711535 716210 721590 727515 733605 739736 745992 752603 759777 767174 773751 778674 782230 785278
60126G85278K685J738O02Nj64m85j112j980l221m554m949l950k768k924m172m951
$$ 785278 787963 789701 790303 790308 790144 789659 788547 786567 783346 778792 773843 769893 767125 764201 760029 755078
60110G55078m578l804l372l281l488m105m698m575m013m114m949m960k912K43
$$ 755078 750500 746696 743324 740043 736555 732450 727752 723177 719164 715050 710101 705141 702229 702472
60096G02472K210J681n44k446k561j238l08j067k636k944j248J100K474K621K309
$$ 702472 704682 706363 705819 703373 700812 699574 699266 698199 695563 692619 691371 692471 694945 697566 699875
60081F99875K282K983M377N604N558M283L092K874L201L544M213N377O173N812
$$ 699875 702157 705140 709517 715121 720679 724962 728054 730928 734129 737673 741886 747263 753436 759248
60067G59248M838M186L748K956K212K468L636M570M537L764K757K000K030K852
$$ 759248 764086 768272 772020 774976 777188 779656 783292 787862 792399 796163 798920 800920 802950 805802
60053H05802L452K931J965J997L085L736K917J222j91p83n66J75Q88J242J599
$$ 805802 809254 812185 814150 816147 819232 822968 825885 827107 826916 826133 825567 825742 826630 827872 829471
60038H29471K149J813n37l700m785k856m13j98j850l011k646j804j665k385l627
$$ 829471 831620 833433 832896 829196 824411 821555 821142 820944 819094 816083 813437 811633 809968 807583 803956
60023H03956m925n509m766l091j551p56n93q79j474j940j930j837k316l226l864
$$ 803956 799031 793522 788756 785665 784114 783358 782765 781886 780412 778472 776542 774705 772389 769163 765299
60008G65299m247n136o643p710p473o357n372m829m319l684l370l900n213o526
$$ 765299 761052 755916 749273 741563 734090 727733 722361 717532 713213 709529 706159 702259 697046 690520
59994F90520o845n766l889k206j151n01j01j64o58r99o40L17J433K552L784M934
$$ 690520 683675 677909 674020 671814 670663 670162 670061 669897 669239 668240 667600 667917 669350 671902 675686 680620
59978F80620N395M698L122J700J369J970K331J715R03J153K269K683J704N90O47
$$ 680620 686015 690713 693835 695535 696904 698874 701205 702920 703823 704976 707245 709928 711632 712222 712869
59963G12869J210O25j260k937l533l961n404p578r118r098p744o129n513o364
$$ 712869 714079 714704 713444 710507 706974 703013 697609 690031 680913 671815 664071 657942 652429 646065
59949F46065p626p603o066m762n043n787m906k590j412k878n245n681l656j112
$$ 646065 638439 630836 624770 620008 614965 609178 604272 601682 600270 597392 592147 586466 582810 581698
59935E81698K08K96n7n76j265j761j632j043n12j02O04J710K778L492M057M613
$$ 581698 581906 582202 582145 581569 580304 578543 576911 575868 575356 575254 575858 577568 580346 583838 587895 592508
59919E92508M816M510M328M786N077L836J192j130k162k815l887m286k742l03
$$ 592508 597324 601834 606162 610948 616025 619861 621053 619923 617761 614946 611059 606773 604031 603728
59905F03728P62J39m51k71n62j937k955k380j076l31J59J108J740J044j04p5R19
$$ 603728 604490 604629 604178 603907 603345 601408 598453 596073 594997 594666 594825 595933 597673 598717 598613 598538 599457
59888E99457J287P42L68K55p23k539l537k847j301N21L128O105P337N723L032
$$ 599457 600744 601486 601854 602109 601386 598847 595310 592463 591162 591683 594811 600916 608253 613976 617008
59873F17008J584J377J071N07M65Q13R03J219K810N233O725O449N175L851K860
$$ 617008 618592 619969 621040 621547 622012 622825 623728 624947 627757 632990 639715 646164 651339 655190 658050
59858F58050K526K910L022J694n27j738j167R5J020J806K520K251O68q08o13R58
$$ 658050 660576 663486 666508 668202 667675 665937 664770 664865 665885 667691 670211 672462 673130 672322 671709 672667
59842F72667K354K770K522K097J881K335L389L950L098J541R27J755K928L353
$$ 672667 675021 677791 680313 682410 684291 686626 690015 693965 697063 698604 699531 701286 704214 707567
59828G07567L161L184L974N492P124P963P666P093P335Q060P763N870L686K678
$$ 707567 710728 713912 717886 723378 730502 738465 746131 753224 760559 768619 776382 782252 785938 788616
59814G88616K700K675K363K366K819L085K845K500K374K187J659R57K92l79r02
$$ 788616 791316 793991 796354 798720 801539 804624 807469 809969 812343 814530 816189 817146 817438 817059 816157
59799H16157p05M96K114L263L622L420K897K221J672J397J145N63m34j841l644
$$ 816157 815452 815948 818062 821325 824947 828367 831264 833485 835157 836554 837699 838262 837828 835987 832343
59784H32343n333n896n125m432n254o904p270n714l902l359l607l612l686m495
$$ 832343 827010 821114 815989 811557 806303 799399 792129 786415 782513 779154 775547 771935 768249 763754
59770G63754n083l771r79O31n69k964l701k118k20mj281k395k427k107k669m269
$$ 763754 758671 754900 753921 754552 753983 751019 747318 745200 744980 744976 743695 741300 738873 736766 734097 729828
59754G29828n843o227n149l271j710j414k413l537l457k199j082r54j240j225
$$ 729828 723985 717758 712609 709338 707628 706214 703801 700264 696807 694608 693526 692572 691332 690107
59740F90107j383k505m080m712l968k767j960j460r88o81o40o08m81m92o36n45
$$ 690107 688724 686219 682139 677427 673459 670692 668732 667272 666284 665603 664963 664355 663874 663382 662746 662201
59724F62201k36l18j040j780j888j502r31J38K108M421N807N520L850J604l54
$$ 662201 661965 661647 660607 658827 656939 655437 654506 654644 656752 661173 666980 672500 676350 677954 677600
59709F77600j165k91J887M032M701L379Q77j103j083R58L361M216L201J852J889
$$ 677600 676435 676144 678031 682063 686764 690143 691020 689917 688834 689792 693153 697369 700570 702422 704311
59694G04311L470N289O177O173N957N768N314M636M386N092O536Q063R090R083
$$ 704311 707781 713070 719247 725420 731377 737145 742459 747095 751481 756573 763109 771172 780262 789345
59680G89345P747N792M874N839P340P250N419L802L686M077L487K123J143O16
$$ 789345 797092 802884 807758 813597 820937 828187 833606 837408 841094 845171 848658 850781 851924 852540
59666H52540k74j311j137N38J973J503k04j133p28n61j954m076n091m581l767
$$ 852540 852266 850955 849818 850356 852329 853832 853628 852495 851767 851206 849252 845176 840085 835504 831737
59651H31737l590l630l272k826k837k981k547j619q69m93k10j42o36j207p71P65
$$ 831737 828147 824517 821245 818419 815582 812601 810054 808435 807566 807073 806863 806721 806085 804878 804107 804872
59635H04872K172K489K038J409N89k42q2J582L483L821K422O38o43j679k615k814
$$ 804872 807044 809533 811571 812980 813569 813327 813245 814827 818310 822131 824553 825191 824548 822869 820254 817440
59619H17440j901o56k24r26k171l194l547l243k787k881l712m655m902m340l585
$$ 817440 815539 814883 814659 813733 811562 808368 804821 801578 798791 795910 792198 787543 782641 778301 774716
59604G74716l166l006k761k466k408k473k189j583j347j576j036J190L772M312
$$ 774716 771550 768544 765783 763317 760909 758436 756247 754664 753317 751741 750705 751895 755667 759979
59590G59979K557Q97J011J657R20o85j127m0R65Q89L57j93j421l444m820m364
$$ 759979 762536 763433 764444 766101 767021 766336 765209 765169 766134 767023 767380 767187 765766 762322 757502 753138
59574G53138l066k869m060m991m371k832j901k105k602k454j748j272j449k021
$$ 753138 750072 747203 743143 738152 733781 730949 729048 726943 724341 721887 720139 718867 717418 715397
59560G15397k667l316l771l722l454l786m779n239m289k684j617r47Q8R37K72
$$ 715397 712730 709414 705643 701921 698467 694681 689902 684663 680374 677690 676073 675126 675214 676151 676423
59545F76423j668l001k801k104j835j406k74O62N41J18M61J059P65n9QJ172K189
$$ 676423 674755 671754 668953 666849 665014 663608 663334 663996 664537 664655 665116 666175 666940 666881 666889 668061 670250
59528F70250K425K563K952K622P14j915l358k689r17R1n72k104l049k916k345
$$ 670250 672675 675238 678190 680812 681526 679611 676253 673564 672647 672738 672166 670062 667013 664097 661752
59513F61752j774q44M83J208N78o17j142j078j335j859j796j261j261j763j392
$$ 661752 659978 659134 659617 660825 661403 660786 659644 658566 657231 655372 653576 652315 651054 649291 647899
59498F47899L38K063K547K349K523K844K547J888J664J855K060K733M482O398
$$ 647899 648237 650300 652847 655196 657719 660563 663110 664998 666662 668517 670577 673310 677792 684190
59484F84190O772N645N095O472Q765J0515J2076J4587J7359J7845J4426Q332K481
$$ 684190 690962 696607 701702 708174 716939 727454 739530 754117 771476 789321 803747 812079 814560
59471H14560r87j982j936k463m131o111p061o403m655k697j162n63j226k628l351
$$ 814560 813573 811591 809655 807192 803061 796950 789889 783486 778831 776134 774972 774409 773183 770555 767204
59456G67204k461q42l52j599l170l406k364j567k035l148l498k595j489j631l215
$$ 767204 764743 763901 763549 761950 758780 755374 753010 751443 749408 746260 742762 740167 738678 737047 733832
59441G33832m820m987l874k859k559k128q37M00k4k183m208m314k593n75N72R65
$$ 733832 729012 724025 720151 717292 714733 712605 711768 712168 712144 709961 705753 701439 698846 698271 698843 699808
59425F99808J365K060K588K499K153K476L832N380N868N070M182M677O720Q727
$$ 699808 701173 703233 705821 708320 710473 712949 716781 722161 728029 733099 737281 741958 748678 757405
59411G57405Q666O038K480J70k39L05Q84J436J880J626O93K90J271K750L327L174
$$ 757405 766071 772109 774589 774759 774520 774825 775709 777145 779025 780651 781344 781634 782905 785655 788982 792156
59395G92156L580M676N141M281L038K580K979L734M597N332N589N448N314M954
$$ 792156 795736 800412 805553 809834 812872 815452 818431 822165 826762 832094 837683 843131 848445 853399
59381H53399L629J578K03J39K42n81j661j802j298j348k092k633k608k444k176
$$ 853399 857028 858606 858809 858948 859190 858609 856948 855146 853848 852500 850408 847775 845167 842723 840547
59366H40547j336j1J083J741K522L818N509P491R735J1812J3302J4665J6804J9749
$$ 840547 839211 839200 840283 842024 844546 848364 853873 861364 871099 882911 896213 910878 927682 947431
59352I47431K2722K5254K7037K6747K2697J5163O827J90m388p432q513o890l124
$$ 947431 970153 995407 1022444 1049191 1071888 1087051 1093878 1094068 1089680 1082248 1073735 1066845 1063721
59339A063721J072M221N461M154K67n040j0136j4212j7287j9216j9551j8327j6349
$$ 1063721 1064793 1069014 1074475 1078629 1078896 1073856 1063720 1049508 1032221 1013005 993454 975127 958778
59326I58778j4600j3703j3736j4070j3584j1643q781o129m413l773m047m609m377
$$ 958778 944178 930475 916739 902669 889085 877442 868661 862532 858119 854346 850299 845690 841313
59313H41313k826p85N61J262K352M204O081P339Q057Q199P282N413L799L397L658
$$ 841313 838487 837702 838263 839525 841877 846081 852162 859501 867558 875757 883039 888452 892251 895648 899306
59298H99306L531L331M458P124R460R561P884O597O670O766N502L939M517P803
$$ 899306 902837 906168 910626 917750 927210 936771 944655 951252 957922 964688 970190 974129 978646 986449
59284I86449J1558J3335J2909J1557J0059Q487P189O660O561N935M481K757J246
$$ 986449 998007 1011342 1024251 1035808 1045867 1054354 1061543 1068203 1074764 1080699 1085180 1087937 1089183
59271A089183J25j79O12J412L17k948o157p113o345o167p394q275o976m074j821
$$ 1089183 1089308 1089129 1089741 1091153 1091470 1088522 1082365 1075252 1068907 1062740 1055346 1047071 1040095 1036021 1034200
59256A034200j368j636j072L12J318J559J933K933L502K310n51m040p683j1464
$$ 1034200 1032832 1031196 1030124 1030436 1031754 1033313 1035246 1038179 1041681 1043991 1043440 1039400 1031717 1020253
59242A020253j4525j5494j4329j2662j1854j1646j1200j0452r834r405r022q786
$$ 1020253 1005728 990234 975905 963243 951389 939743 928543 918091 908257 898852 889830 881044
59230H81044q772q730q551q433q211p278n711m616m635m845m033k336o47Q98K587
$$ 881044 872272 863542 854991 846558 838347 831069 825358 820742 816107 811262 807229 804893 804246 805144 807731
59215H07731L811L540K057Q34P08J250K150L765N954P584P951P726P762P747O896
$$ 807731 811542 815082 817139 817973 818681 819931 822081 825846 831800 839384 847335 855061 862823 870570 877466
59200H77466N376M157L710L573L075J936K97j361k385k535k305k458l251m241
$$ 877466 882842 886999 890709 894282 897357 899293 899590 898229 895844 893309 891004 888546 885295 881054
59186H81054m703m110k551j031q65k289l839l639j383J362K798K544J634J249
$$ 881054 876351 872241 869690 868659 867794 865505 861666 858027 856644 858006 860804 863348 864982 866231
59172H66231J662K214K205J721J593K434L836M568L670J309j318k920l103k528
$$ 866231 867893 870107 872312 874033 875626 878060 881896 886464 890134 891443 890125 887205 884102 881574
59158H81574k063j932j869j915k520l773n033n634n529m905l668j908m97m30j570
$$ 881574 879511 877579 875710 873795 871275 867502 862469 856835 851306 846401 842733 840825 840328 839898 838328
59143H38328k667k739j896p36M69J618K308J994N56j453l013l132j603O00K096
$$ 838328 835661 832922 831026 830290 830759 832377 834685 836679 837235 835782 832769 829637 828034 828634 830730
59128H30730K438K253J900Q17j238l013k867q30J435K682L089L192K921K289K021
$$ 830730 833168 835421 837321 838138 836900 833887 831020 830190 831625 834307 837396 840588 843509 845798 847819
59113H47819K722L877M504M386M102M215N031O664Q483Q974P165M181K327K572
$$ 847819 850541 854418 858922 863308 867410 871625 876656 883320 891803 900777 907942 912123 914450 917022
59099I17022L762M387M077L130J692M3j183j752k190k920l650m209n182o962q857
$$ 917022 920784 925171 929248 932378 934070 934113 932930 931178 928988 926068 922418 918209 913027 906065 897208
59084H97208r953j0249j0050r052p208n818o121p093o501m355l354n123p629p787
$$ 897208 887255 877006 866956 857904 850696 844878 838757 831664 825163 820808 817454 812331 804702 796915
59070G96915n425l138k681l160k873j621o54r58k076k443q78K076M481N014M352
$$ 796915 791490 788352 785671 782511 779638 778017 777363 776405 774329 771886 771008 773084 777565 782579 786931
59055G86931M089M638N018M589M013M145M823N335N565N947O466O412N295L636
$$ 786931 791020 795658 800676 805265 809278 813423 818246 823581 829146 835093 841559 847971 853266 856902
59041H56902K489K251K270J804J243J815L773N455M862K069q03k011j775j104
$$ 856902 859391 861642 863912 865716 866959 868774 872547 878002 882864 884933 884130 882119 880344 879240
59027H79240k41Q48J252p4k359l347k107n67j227l993o250o005m098k910l508
$$ 879240 878999 879847 881099 881025 878666 875319 873212 872645 871418 867425 861175 855170 851072 848162 844654
59012H44654m690m857m184m286n812p262o876n134m217n005n879n032k901j331
$$ 844654 839964 835107 830923 826637 820825 813563 806687 801553 797336 792331 786452 781420 778519 777188
58998G77188j050j179r05m83n44j333k711m169m801m094k712j689q62Q10L187
$$ 777188 776138 774959 774054 773571 773027 771694 768983 764814 760013 755919 753207 751518 750656 751466 754653
58983G54653M409L086J02k399l138k285p40N09R67J287K619M700N605M265K322
$$ 754653 759062 762148 762250 759851 756713 754428 753688 754197 755164 756451 759070 763770 769375 773640 775962
58968G75962K175L846N314N495N173N050M699M026M197O080Q708J0225R961Q801
$$ 775962 778137 781983 787297 792792 797965 803015 807714 811740 815937 822017 830725 840950 850911 859712
58954H59712P946P881Q355Q772Q598P600N858L723J967J492K300L083K529R10
$$ 859712 867658 875539 883894 892666 901264 908864 914722 918445 920412 921904 924204 927287 929816 930726
58940I30726m27q66p60j12J528L602M512L697K432J796J201J9n83R04L805N843
$$ 930726 930299 929433 928673 928561 930089 933691 938203 941900 944332 946128 947329 947348 946765 947669 951474 957317
58924I57317N902M838L738K967K886L972N690O554N921M752M156M155M479N471
$$ 957317 963219 968057 971795 974762 977648 981620 987310 993864 999785 1004537 1008693 1012848 1017327 1022798
58910A022798P287Q975R485R156R156R694R993R896J0334J1651J2614J1881R888
$$ 1022798 1030085 1039060 1048545 1057701 1066857 1076551 1086544 1096440 1106774 1118425 1131039 1142920 1152808
58897A152808Q290P788P443O211M266K382P10j167l360n485p223q539r351r549
$$ 1152808 1161098 1168886 1176329 1182540 1186806 1189188 1189898 1188731 1185371 1179886 1172663 1164124 1154773 1145224
58883A145224r420r513r937j0185r856r171q592q237p943p582p042o160n134m749
$$ 1145224 1135804 1126291 1116354 1106169 1096313 1087142 1078550 1070313 1062370 1054788 1047746 1041586 1036452 1031703
58869A031703n653p219p685n860k652l30r5q25o65N27J211N41l88j78J059K355
$$ 1031703 1026050 1018831 1011146 1005286 1002634 1002304 1002209 1001384 1000719 1001246 1002457 1002998 1002610 1002432 1003491 1005846
58853A005846L462M558N030M048K257J425K236L699M885N863O682O883O716P371
$$ 1005846 1009308 1013866 1018896 1022944 1025201 1026626 1028862 1032561 1037446 1043309 1049991 1056874 1063590 1070961
58839A070961R139J0614J0727J0385J0956J2144J2728J2419J1642J0285Q288O822
$$ 1070961 1080100 1090714 1101441 1111826 1122782 1134926 1147654 1160073 1171715 1182000 1190288 1197110
58827A197110P187Q796R799R563R067Q985Q995Q968R162R018P373M384J772N83
$$ 1197110 1204297 1213093 1222892 1232455 1241522 1250507 1259502 1268470 1277632 1286650 1294023 1298407 1300179 1300762
58813A300762j8j087k415l414m268n238n941o274p089q896j0652j1037j0303r725
$$ 1300762 1300744 1299657 1297242 1293828 1289560 1284322 1278381 1272107 1265018 1256122 1245470 1234433 1224130 1214405
58799A214405r642r251q158p038o751p610r374j1264j2055j1156r618r215j0241
$$ 1214405 1204763 1195512 1187354 1180316 1173565 1165955 1156581 1145317 1133262 1122106 1112488 1103273 1093032
58786A093032j1048j0206q385p448q053r052r255q953r108r604r343q143p396
$$ 1093032 1081984 1071778 1063393 1055945 1047892 1038840 1029585 1020632 1011524 1001920 992577 984434 977038
58773I77038q171r476r556q348p272o741n591l437j924k451l888m031k582j134
$$ 977038 968867 959391 949835 941487 934215 927474 921883 918446 916522 914071 910183 906152 903570 902436
58759I02436m65L33J889L196L112K137J679K035K183J481P09R80K159K989K631
$$ 902436 901971 902304 904193 907389 910501 912638 914317 916352 918535 920016 920725 921705 923864 926853 929484
58744I29484J473L03p15j705k359k423k516l378m287l694j823j171l384o768q302
$$ 929484 930957 931260 930545 928840 926481 924058 921542 918164 913877 910183 908360 907189 903805 897037 888735
58729H88735p415o108n804n873n487n051n058m821l524j735p79r12j030k52Q11
$$ 888735 881320 875212 869408 863535 858048 852997 847939 843118 839594 837859 837080 836168 835138 834886 835697
58714H35697O61j256l529m028k451r62j453k783k224M74K372J294j358k921l039
$$ 835697 836358 835102 831573 827545 825094 824132 822679 819896 817672 818146 820518 821812 820454 817533 814494
58699H14494l119l466l218k592k840l848l907k346n42L47Q33J449J499P29N30
$$ 814494 811375 807909 804691 802099 799259 795411 791504 789158 788616 788963 789796 791245 792744 793473 794003
58684G94003J818L076K401N18l16L30R94J275K316M231N325M679L535L204L377
$$ 794003 795821 798897 801298 801816 801500 801830 802824 804099 806415 810646 815971 820650 824185 827389 830766
58669H30766L425L762M586M891M072L316L845M920N140M699M634M785M424M097
$$ 830766 834191 837953 842539 847430 851502 854818 858663 863583 868723 873422 878056 882841 887265 891362
58655H91362M762N580M930L431L540N822Q006Q369P700O952N319K228o90j635
$$ 891362 896124 901704 906634 910065 913605 919427 927433 935802 943502 950454 955773 958001 957311 955676
58641I55676j406k107m039n811o917q141r531r975r204q645r554j1340j2462j2234
$$ 955676 954270 952163 948124 942313 935396 927255 917724 907749 898545 889900 880346 869006 856544 844310
58627H44310j1250j0471j0306j0374r947q746p283o262n822n674n672n779n643
$$ 844310 833060 822589 812283 801909 791962 783216 775933 769671 763849 758175 752503 746724 741081
58614G41081m818l308j591j15R82J847K735L504L305J582m67o15J514L527L367
$$ 741081 736263 732955 731364 731249 732231 734078 736813 740317 743622 745204 744737 744122 745636 749163 752530
58599G52530K090J913K571J956n7j161l10O16j01j499k001k031k758l634l418
$$ 752530 754620 756533 759104 761060 761003 759842 759532 760148 760047 758548 756547 754516 751758 748124 744706
58584G44706k677l015m155m113k352o71l43l03P92K210K310J071Ql7L32L92L09
$$ 744706 742029 739014 734859 730746 728394 727723 727380 727077 727869 730079 732389 733460 733468 733431 733763 734155 734464
58567G34464N58J196K033K868L266K746J615J067J754K681K345R58N40K263M522
$$ 734464 735022 736218 738251 741119 744385 747131 748746 749813 751567 754248 756593 757551 758091 760354 764876
58552G64876M624K270J87Q86L549N087L924J677Q86J984L308L490K797K086J598
$$ 764876 769500 771770 771957 772843 776392 781479 785403 787080 787966 789950 793258 796748 799545 801631 803229
58537H03229J308J602K643L543L196J986J529K513L732L830L131K908L501M226
$$ 803229 804537 806139 808782 812325 815521 817507 819036 821549 825281 829111 832242 835150 838651 842877
58523H42877M819N791P233Q277Q267P730P641Q116Q394Q008P468P704Q974J0446
$$ 842877 847696 853487 860720 868997 877264 884994 892635 900751 909145 917153 924621 932325 941299 951745
58509I51745J0998J0394R510R276R775J0714J2327J5100J8659K1707K3260K3523
$$ 951745 962743 973137 982647 991923 1001698 1012412 1024739 1039839 1058498 1080205 1103465 1126988
58497A126988K3330K3134K2688K1385J8857J5505J2390J0117Q083N433K559O45
$$ 1126988 1150318 1173452 1196140 1217525 1236382 1251887 1264277 1274394 1282477 1287910 1290469 1291114
58485A291114j90j107k561l491l236l039m455p129r435j0726j1645j2586j3301
$$ 1291114 1290924 1289817 1287256 1283765 1280529 1277490 1273035 1265906 1256471 1245745 1234100 1221514 1208213
58472A208213j3899j4837j5758j5676j4624j3795j3600j2933j1053r076q484r031
$$ 1208213 1194314 1179477 1163719 1148043 1133419 1119624 1106024 1093091 1082038 1072962 1064478 1055447
58460A055447r288q652p637o600n529n014n920p637p988n768k624j292k380l900
$$ 1055447 1046159 1037507 1029870 1023270 1017741 1012727 1006807 999170 991182 985414 982790 981498 979118 975218
58446I75218m022l137k656k658j774N96L074L755K495R66O20J100J013j81j529
$$ 975218 971196 968059 965403 962745 960971 961567 964641 968396 970891 971857 972477 973577 974590 974409 972880
58431I72880j761o46J089K838M518N920O353N582M664N024O637P942P835P013
$$ 972880 971119 970473 971562 974400 978918 984838 991191 996773 1001437 1006461 1013098 1021040 1028875 1035888
58417A035888O988Q424J0954J3806J5871J5873J3615J0728R015Q266O943M770
$$ 1035888 1042876 1051300 1062254 1076060 1091931 1107804 1121419 1132147 1141162 1149428 1156371 1161141
58405A161141L119K636K160Q24l53l7J376K595L389M314N185N360N204N733O824
$$ 1161141 1164260 1166896 1169056 1169880 1169527 1169490 1170866 1173461 1176850 1181164 1186349 1191709 1196913 1202646 1209470
58390A209470P222O506N642N220M443K470j08j943k354j601l30O52N53q38k848
$$ 1209470 1216692 1223198 1228840 1234060 1238503 1240973 1240865 1238922 1236568 1234967 1234637 1235289 1235842 1235004 1232156
58375A232156m383m573l180r19Q05J260J423K680M626N442M685M072M798N690
$$ 1232156 1227773 1223200 1220020 1219101 1219906 1221166 1222589 1225269 1229895 1235337 1240022 1244094 1248892 1254582
58361A254582N292M442M992O800P815O961N197L676K369Q93m70j180j075l16O86
$$ 1254582 1259874 1264316 1269308 1276108 1283923 1290884 1296081 1299757 1302126 1303019 1302549 1301369 1300294 1299978 1300664
58346A300664J338J403J443J902K105J191j67l35R59K356L046L734M886N687N605
$$ 1300664 1302002 1303405 1304848 1306750 1308855 1310046 1309879 1309544 1310503 1312859 1315905 1319639 1324525 1330212 1335817
58331A335817N523O126O564O051N660O678Q072P609N207L237L250M251M774M963
$$ 1335817 1341340 1347466 1354030 1360081 1365741 1372419 1380491 1388100 1393307 1396544 1399794 1404045 1408819 1413782
58317A413782N697O904P922Q592Q968Q651P707P662R973J3466J4951J3090J0452
$$ 1413782 1419479 1426383 1434305 1442897 1451865 1460516 1468223 1475885 1485858 1499324 1514275 1527365 1537817
58304A537817J0509J3351J5851J5945J4999J5331J6859J7730J7447J7479J8648
$$ 1537817 1548326 1561677 1577528 1593473 1608472 1623803 1640662 1658392 1675839 1693318 1711966
58293A711966J9676J9107J7464J6289J5960J5600J4806J4139J3932J3719J3090
$$ 1711966 1731642 1750749 1768213 1784502 1800462 1816062 1830868 1845007 1858939 1872658 1885748
58282A885748J2327J1944J2197J3243J5138J7414J9267K0505K1774K3486K5038
$$ 1885748 1898075 1910019 1922216 1935459 1950597 1968011 1987278 2007783 2029557 2053043 2078081
58271B078081K5628K5546K6043K7897L0481L2291L2299L0875K9467K9235K9873
$$ 2078081 2103709 2129255 2155298 2183195 2213676 2245967 2278266 2309141 2338608 2367843 2397716
58260B397716L0000K8767K6849K5571K5437K5918K6526K7519K9246L1280L2621
$$ 2397716 2427716 2456483 2483332 2508903 2534340 2560258 2586784 2614303 2643549 2674829 2707450
58249B707450L2853L2760L3539L5476L7678L9174L9904M0415M0972M1539M2440
$$ 2707450 2740303 2773063 2806602 2842078 2879756 2918930 2958834 2999249 3040221 3081760 3124200
58238C124200M4185M6399M7689M7263M6215M6498M8831N2285N5654N8410O0339
$$ 3124200 3168385 3214784 3262473 3309736 3355951 3402449 3451280 3503565 3559219 3617629 3677968
58227C677968O1365O2156O4050O7635P1882P5274P7418P9001Q0728Q3020Q6225
$$ 3677968 3739333 3801489 3865539 3933174 4005056 4080330 4157748 4236749 4317477 4400497 4486722
58216D486722R0191R3954R6849R9740J04076J09802J15382J19956J24228J28998
$$ 4486722 4576913 4670867 4767716 4867456 4971532 5081334 5196716 5316672 5440900 5569898
58206E569898J34192J39833J46579J54445J62214J69161J76265J84568J93355
$$ 5569898 5704090 5843923 5990502 6144947 6307161 6476322 6652587 6837155 7030510
58197G030510K01318K08706K16739K25593K34698K44770K57644K73825K91581
$$ 7030510 7231828 7440534 7657273 7882866 8117564 8362334 8619978 8893803 9185384
58188I185384L08878L25205L41445L59180L80216M05485M33843M62676M90129
$$ 9185384 9494262 9819467 10160912 10520092 10900308 11305793 11739636 12202312 12692441
58179A2692441N16472N43727N74767O11914O54988P01036P47581P95721Q48253
$$ 12692441 13208913 13752640 14327407 14939321 15594309 16295345 17042926 17838647 18686900
58170A8686900R05230R63787J022482J083157J147715J215581J285707J359115
$$ 18686900 19592130 20555917 21578399 22661556 23809271 25024852 26310559 27669674
58162B7669674J437976J523766J617639J721087J834925J958952K093727K241167
$$ 27669674 29107650 30631416 32249055 33970142 35805067 37764019 39857746 42098913
58154D2098913K402247K575646K760042K956514L168134L399333L656676L947678
$$ 42098913 44501160 47076806 49836848 52793362 55961496 59360829 63017505 66965183
58146F6965183M277128M646832N060165N522981O036715O594637P191125P834944
$$ 66965183 71242311 75889143 80949308 86472289 92509004 99103641 106294766 114129710
58138A14129710Q550124R365019J0303782J1382821J2600261J3918446J5264687
$$ 114129710 122679834 132044853 142348635 153731456 166331717 180250163 195514850
58131A95514850J6570169J7818753J9032622K0149184K0855947K0554432J8581144
$$ 195514850 212085019 229903772 248936394 269085578 289941525 310495957 329077101
58124C29077101J4602189Q901571K324852m089189r520153j3573065j6242875
$$ 329077101 343679290 352580861 354905713 350816524 341296371 327723306 311480431
58117C11480431j7758908j8430541j8540788j8292792j7805334j7139286j6326926
$$ 311480431 293721523 275290982 256750194 238457402 220652068 203512782 187185856
58110A87185856j5390517j4354509j3253347j2129344j1022683r964703q977869
$$ 187185856 171795339 157440830 144187483 132058139 121035456 111070753 102092884
58103A02092884q075764p261575o530957n878544n299721m786988m329997l921347
$$ 102092884 94017120 86755545 80224588 74346044 69046323 64259335 59929338 56007991
58095E6007991l559047l241638k963969k719447k503221k311190k138715j982686
$$ 56007991 52448944 49207306 46243337 43523890 41020669 38709479 36570764 34588078
58087C4588078j842651j717706j604159j498358j400010j310556j229689j155542
$$ 34588078 32745427 31027721 29423562 27925204 26525194 25214638 23984949 22829407
58079B2829407j086916j023218r63249r06093q52273q02396p55601p11125o70154
$$ 22829407 21742491 20719273 19756024 18849931 17997658 17195262 16439661 15728536 15058382
58070A5058382o33877o00718n68046n36146n07892m84317m63150m42390m23009
$$ 15058382 14424505 13823787 13255741 12719595 12211703 11727386 11264236 10821846 10398837
58061A0398837m06761l92972l79112l63694l47228l30821l15017k99893k85417
$$ 10398837 9992076 9599104 9219992 8856298 8509070 8178249 7863232 7563339 7277922
58052G277922k71568k58548k46840k36589k27123k17540k07792j98705j90875
$$ 7277922 7006354 6747806 6500966 6264377 6037254 5819714 5611922 5413217 5222342
58043E222342j83895j76822j69180j61228j53508j46351j39637j32758j24965
$$ 5222342 5038447 4861625 4692445 4531217 4377709 4231358 4091721 3958963 3833998
58034C833998j16151j07426j00485r6153r3683r1531q8585q4583p9880p5211p1309
$$ 3833998 3717847 3610421 3509936 3413783 3320100 3228569 3139984 3055401 2975521 2900310 2829001
58023B829001o8218o5180o1655n8281n6195n5319n4112n1384m7976m5931m6025
$$ 2829001 2760783 2695603 2633948 2575667 2519472 2464153 2410041 2358657 2310681 2264750 2218725
58012B218725m6701m5889m3484m1269m0357l9724l7924l5385l3721l3103l1939
$$ 2218725 2172024 2126135 2082651 2041382 2001025 1961301 1923377 1887992 1854271 1821168 1789229
58001A789229k9401k6823k5817k6202k6772k7078k7298k7092k5978k4407k3259
$$ 1789229 1759828 1733005 1707188 1680986 1654214 1627136 1599838 1572746 1546768 1522361 1499102
57990A499102k2465k1317j9940j9331j9806k0492k0548k0123j9866k0050k0197
$$ 1499102 1476637 1455320 1435380 1416049 1396243 1375751 1355203 1335080 1315214 1295164 1274967
57979A274967j9297j6728j3516j2026j3437j5992j6893j5653j4250j4152j4779
$$ 1274967 1255670 1238942 1225426 1213400 1199963 1183971 1167078 1151425 1137175 1123023 1108244
57968A108244j5120j5332j6028j6954j7179j6129j4120j2327j2171j3836j5405
$$ 1108244 1093124 1077792 1061764 1044810 1027631 1011502 997382 985055 972884 959048 943643
57957I43643j4613j1671r231r129j0281j0433q941p019n898n596n246m155k748
$$ 943643 929030 917359 908128 898999 888718 878285 869344 862325 856427 850831 845585 841430 838682
57944H38682k413l850n834o577o169o273p275p518o057m366m017m169l212j756
$$ 838682 836269 832419 826585 820008 813839 807566 800291 792773 786716 782350 778333 774164 770952 769196
57930G69196j861l723n251n230m925n749o894o554m621k831k387k666k593k366
$$ 769196 767335 763612 758361 753131 748206 742457 735563 729009 724388 721557 719170 716504 713911 711545
57916G11545l081m909o533o630n366l976l245k929k494j920j696k267l383l966
$$ 711545 708464 703555 697022 690392 685026 681050 677805 674876 672382 670462 668766 666499 663116 659150
57902F59150l022j043J79l45j484j606q16m60r59j542j843k190k372j824j142
$$ 659150 656128 655085 655264 654919 653435 651829 651013 650553 649594 648052 646209 644019 641647 639823 638681
57887F38681j725l465m463l738k475j789j082K14R63P4j412j777j211j028j075
$$ 638681 636956 633491 629028 625290 622815 621026 619944 620158 621121 621195 619783 618006 616795 615767 614692
57872F14692j6K086L428K985J713P72j08j760m025n775o155n361m371l983m031
$$ 614692 614676 616762 620190 623175 624888 625660 625552 623792 619767 613992 607837 602476 598105 594122 590091
57857E90091l711k763j878j722k186k894l670m006l020q31Q64O97m84q13P2R28
$$ 590091 586380 583617 581739 580017 577831 574937 571267 567261 564241 563410 564274 564971 564487 563674 563746 564674
57841E64674R91P89R48J350J662J753J537J090Q06Q79R40Q54J228K184K463J059
$$ 564674 565665 566454 567402 568752 570414 572167 573704 574794 575600 576479 577419 578273 579501 581685 584148 585207
57825E85207q60j280k06N24P1o44j064j835k999l313k265j265j749l368m954o107
$$ 585207 584347 583067 582861 583385 583456 582812 581748 579913 576914 573601 571336 570071 568322 564954 560000 553893
57809E53893o796o544n158l433k106r22M04J130N79m97q81o35o84j088j048l55
$$ 553893 547097 540553 535395 531962 529856 528934 529338 530468 531047 530550 529669 529034 528350 527262 526214 525859
57793E25859L76R31J806L046L853L691L060K755K885K985K709K121J440Q16K40
$$ 525859 526235 527166 528972 532018 535871 539562 542622 545377 548262 551247 553956 556077 557517 558333 558573
57778E58573l80j089j828k505k856k382q77Q09J139m47k598l354k199m55K91l51
$$ 558573 558193 557104 555276 552771 549915 547533 546656 547465 548604 548157 545559 542205 540006 539551 539842 539491
57762E39491j509k073j784j478k101l380l935l110k129k713m817o562o399m654
$$ 539491 537982 535909 534125 532647 530546 527166 523231 520121 517992 515279 510462 503900 497501 492847
57748D92847k824k036k401l273l835l720l285l025k736j803l97K47p81k859m480
$$ 492847 490023 487987 485586 482313 478478 474758 471473 468448 465712 463909 463512 463759 462978 460119 455639
57733D55639m767l946k615j213j14M04M99O59J135J730K281K921L744M494M845
$$ 455639 450872 446926 444311 443098 442984 443388 443887 444546 445681 447411 449692 452613 456357 460851 465696
57718D65696M742M216L217J975J322K126M267O486P427O708N085L663K909K258
$$ 465696 470438 474654 477871 479846 481168 483294 487561 494047 501474 508182 513267 516930 519839 522097
57704E22097Q28j290k706k168j85J378J427O93L79L75n10k819n529o885n846k840
$$ 522097 522925 521635 518929 516761 516576 517954 519381 520074 520453 520828 520318 517499 511970 505085 499239 496399
57688D96399M59K244J969Q27N83J715K906K530M55j769k435j231O73J866J849
$$ 496399 496858 499102 501071 501898 502481 504196 507102 509632 510087 508318 505883 504652 505325 507191 509040
57673E09040J180P50J069J895K394J945J042R15J876K542J581k54r86k28L46k46
$$ 509040 510220 510970 512039 513934 516328 518273 519315 520230 522106 524648 526229 525975 524989 524761 525107 524861
57657E24861o49N94K370K285P0j954j930n22M47K84k80k86N68J757K164R37j418
$$ 524861 524212 524806 527176 529461 529531 527577 525647 525125 525572 525856 525576 525290 525858 527615 529779 530716 529298
57640E29298l153l011j498j18L94M53M49j6j298k648k739j422j82l18j126p67
$$ 529298 526145 523134 521636 521518 521912 522365 522814 522798 521500 518852 516113 514691 514509 514191 513065 512298
57624E12298J187L136L708L487L745M313M032L018L043N230Q319R897R106P627
$$ 512298 513485 516621 520329 523816 527561 531874 535906 538924 541967 547197 555516 565413 574519 582146
57610E82146Q082J1578J6789K1242K3396K3257K1231J7094J0595K557n217j1067
$$ 582146 590228 601806 618595 639837 663233 686490 707721 724815 735410 737967 732750 721683
57598G21683j4286j5213j4924j4458j3870j2458j0287q847r524j1826j3887j4256
$$ 721683 707397 692184 677260 662802 648932 636474 626187 617340 607816 595990 582103 567847
57586E67847j2562r117m996j927q54p65q4J125J508O66n17j567k743l624l114
$$ 567847 555285 546168 541172 539245 538391 537626 537542 538667 540175 540841 540324 538757 536014 532390 529276
57571E29276j288M42J436K361L103K277j07j573m83J341J288j96p95k76m72j667
$$ 529276 527988 528430 529866 532227 535330 537607 537500 535927 535444 536785 538073 537877 537082 536806 536334 534667
57555E34667j819N3K169K637J835J005J62j102k042j704p14m95j042j078l32j20
$$ 534667 532848 532901 535070 537707 539542 540547 540709 539607 537565 535861 535147 534652 533610 532532 532200 532080
57539E32080j135k088j414M46J557R34n11j370j286q43o13p42j102j396j294p61
$$ 532080 530945 528857 527443 527889 529446 530380 529869 528499 527213 526370 525757 525015 523913 522517 521223 520462
57523E20462k00J8m0n7J13M99J201K117K658K233J003k35r28j158j203j179j178
$$ 520462 520262 520280 520240 520183 520296 520795 521996 524113 526771 529004 530007 529772 528844 527686 526483 525304 524126
57506E24126j248j033J34K347M572N378M288K210N03l18p54j275j418l61J701
$$ 524126 522878 521845 521979 524326 528898 534276 538564 540774 541277 540959 540205 538930 537512 537151 538852
57491E38852L420L778L179K615K343J909J148L98j06l75l07L34J551L073M411
$$ 538852 542272 546050 549229 551844 554187 556096 557244 557642 557536 557161 556854 557188 558739 561812 566223
57476E66223M823L825K195J698K982M506M541L526L124L554L594K933K645L131
$$ 566223 571046 574871 577066 578764 581746 586252 590793 594319 597443 600997 604591 607524 610169 613300
57462F13300L349K622J707J429J582J681J696J559J268J694L666N907N866L471
$$ 613300 616649 619271 620978 622407 623989 625670 627366 628925 630193 631887 635553 641460 647326 650797
57448F50797J842K915M488L563P91q55n34J78O55J867L643M067K401M29j17K82
$$ 650797 652639 655554 660042 663605 664396 663541 663007 663185 663840 665707 669350 673417 675818 676247 676130 676412
57432F76412L18n4r8K54N85R05J395J793J836J923K488L080K754J246o69j956
$$ 676412 676730 676676 676578 676832 677417 678322 679717 681510 683346 685269 687757 690837 693591 694837 694168 692212
57416F92212k041r86N59J665J738J053M53M87Q72Q99K77n23q84o92k89N8K52J55
$$ 692212 690171 689185 689744 691409 693147 694200 694653 695140 696012 696911 697188 696665 695781 695089 694800 694858 695110 695265
57398F95265k17l44L01J333J711J123L82K06L15J88PL20J293K724M282N267M902
$$ 695265 695048 694704 695005 696338 698049 699172 699554 699760 700075 700263 700270 700590 701883 704607 708889 714156 719058
57381G19058L379J943J386J255J063J247K029K349J316M4M76K693M728N067M045
$$ 719058 722437 724380 725766 727021 728084 729331 731360 733709 735025 735069 735545 738238 742966 748033 752078
57366G52078K787J911J534J665K220L117M308N395N642N044M785N639O558O067
$$ 752078 754865 756776 758310 759975 762195 765312 769620 775015 780657 785701 790486 796125 802683 808750
57352H08750M666M241N191N801M892L632L825N382O500N938M382L480L899M632
$$ 808750 813416 817657 822848 828649 833541 837173 840998 846380 852880 858818 863200 866680 870579 875211
57338H75211M406L496L236L886M229L769L690M616N140M258L678N288P616P647
$$ 875211 879617 883113 886349 890235 894464 898233 901923 906539 911679 915937 919615 924903 932519 940166
57324I40166N549M358N120N731N146N176O792P843O583M699M487N278N343N334
$$ 940166 945715 950073 955193 960924 966070 971246 978038 985881 992464 997163 1001650 1006928 1012271 1017605
57310A017605O824Q781Q772P043O258P272Q095P455O687P182Q270Q817R129R907
$$ 1017605 1024429 1033210 1041982 1049025 1055283 1062555 1070650 1078105 1084792 1091974 1100244 1109061 1118190 1128097
57296A128097J0723J0797J0305R701Q677P136O523Q569J2756J6235J6665J4362
$$ 1128097 1138820 1149617 1159922 1169623 1178300 1185436 1191959 1200528 1213284 1229519 1246184 1260546
57284A260546J1443R587R060R307R772J0259J1024J2544J4827J7025J8216J8500
$$ 1260546 1271989 1281576 1290636 1299943 1309715 1319974 1330998 1343542 1358369 1375394 1393610 1412110
57272A412110J8686J8923J8579J7807J8034J9951K2025K2349K1361K1059K1899
$$ 1412110 1430796 1449719 1468298 1486105 1504139 1524090 1546115 1568464 1589825 1610884 1632783
57261A632783K2389K1873K1709K2852K4109K4081K3342K3229K3508K2964K1675
$$ 1632783 1655172 1677045 1698754 1721606 1745715 1769796 1793138 1816367 1839875 1862839 1884514
57250A884514K1017K1543K2318K2537K2503K2710K2951K2853K2711K3253K4698
$$ 1884514 1905531 1927074 1949392 1971929 1994432 2017142 2040093 2062946 2085657 2108910 2133608
57239B133608K6295K6923K6312K5589K6106K7784K9301L0003L0550L1323L1435
$$ 2133608 2159903 2186826 2213138 2238727 2264833 2292617 2321918 2351921 2382471 2413794 2445229
57228B445229L0240K8773K8448K9126K9703K9968L0350L0351K8944K6460K4452
$$ 2445229 2475469 2504242 2532690 2561816 2591519 2621487 2651837 2682188 2711132 2737592 2762044
57217B762044K3437K2308K0403J8767J8615J9660K0797K1648K2632K4068K5893
$$ 2762044 2785481 2807789 2828192 2846959 2865574 2885234 2906031 2927679 2950311 2974379 3000272
57206C000272K7963L0092L2049L3777L5307L6367L6512L5835L4986L4276L3282
$$ 3000272 3028235 3058327 3090376 3124153 3159460 3195827 3232339 3268174 3303160 3337436 3370718
57195C370718L1400K8396K4410K0183J7325J7247J9404K1557K2399K3039K5224
$$ 3370718 3402118 3430514 3454924 3475107 3492432 3509679 3529083 3550640 3573039 3596078 3621302
57184C621302K9015L3281L7738M3047M9061N4373N7851N9697O0556O0352N8489
$$ 3621302 3650317 3683598 3721336 3764383 3813444 3867817 3925668 3985365 4045921 4106273 4164762
57173D164762N4693M9343M3367L7952L3815L0483K6762K2230J7843J4751J3106
$$ 4164762 4219455 4268798 4312165 4350117 4383932 4414415 4441177 4463407 4481250 4496001 4509107
57162D509107J2554J3289J5823J9886K4403K8497L1839L4158L5296L5912L7253
$$ 4509107 4521661 4534950 4550773 4570659 4595062 4623559 4655398 4689556 4724852 4760764 4798017
57151D798017L9831M3062M6475N0301N4174N6397N5765N3558N2283N2556N2632
$$ 4798017 4837848 4880910 4927385 4977686 5031860 5088257 5144022 5197580 5249863 5302419 5355051
57140E355051N1095M8580M6336M4504M2763M1555M1326M1097L9197L5443L1481
$$ 5355051 5406146 5454726 5501062 5545566 5588329 5629884 5671210 5712307 5751504 5786947 5818428
57129E818428K8747K6959K4971K2411J9890J7942J6328J4406J1896R141O702M754
$$ 5818428 5847175 5874134 5899105 5921516 5941406 5959348 5975676 5990082 6001978 6011119 6017821 6022575
57117F022575K934P71j778m317o568q912j2152j6644k1591k5425k7096k6995k6488
$$ 6022575 6025509 6026280 6024502 6020185 6013617 6004705 5992553 5975909 5954318 5928893 5901797 5874802 5848314
57104E848314k6737k7996k9908l2137l4775l8186m2283m6005m8111m8855n0278
$$ 5848314 5821577 5793581 5763673 5731536 5696761 5658575 5616292 5570287 5522176 5473321 5423043
57093E423043n4182o0204o6612p2574p8593q5007r1408r7722j04590j12284j20214
$$ 5423043 5368861 5308657 5242045 5169471 5090878 5005871 4914463 4816741 4712151 4599867 4479653
57082D479653j28092j36560j45984j55577j64694j74188j85360j98055k10958
$$ 4479653 4351561 4215001 4069017 3913440 3748746 3574558 3389198 3191143 2980185
57073B980185k23726k37754k54481k73727k94087l14522l35057l56180C12373
$$ 2980185 2756459 2518705 2264224 1990497 1696410 1381888 1046831 690651 312373
57063h9756m29431m61751m98861n38877n80673o25199o73605p25299p79324q36753
$$ -89756 -519187 -980938 -1479799 -2018676 -2599349 -3224548 -3898153 -4623452 -5402776 -6239529
57053f239529q99623r67889j039884j115982j199297j292032j393557j503404
$$ -6239529 -7139152 -8107041 -9146925 -10262907 -11462204 -12754236 -14147793 -15651197
57045a5651197j624045j758943j909745k077260k263672k471503k701240k951690
$$ -15651197 -17275242 -19034185 -20943930 -23021190 -25284862 -27756365 -30457605 -33409295
57037c3409295l221723l510384l817269m145769m505104m905768n351335n834117
$$ -33409295 -36631018 -40141402 -43958671 -48104440 -52609544 -57515312 -62866647 -68700764
57029f8700764o335714o827550p269524p608872p780706p713541p346353o653543
$$ -68700764 -75036478 -81864028 -89133552 -96742424 -104523130 -112236671 -119583024 -126236567
57021a26236567n655169m394632k903840j201108O64741K568977M321165N734790
$$ -126236567 -131891736 -136286368 -139190208 -140391316 -139726575 -137157598 -132836433 -127101643
57013a27101643O704026P234583P419136P383877P237730P043176O814621O538906
$$ -127101643 -120397617 -113163034 -105743898 -98360021 -91122291 -84079115 -77264494 -70725588
57005g0725588O203226N813659N395736M981132M592632M237733L912323L608168
$$ -70725588 -64522362 -58708703 -53312967 -48331835 -43739203 -39501470 -35589147 -31980979
56997c1980979L318122L038192K768242K511515K272382K053730J856383J680330
$$ -31980979 -28662857 -25624665 -22856423 -20344908 -18072526 -16018796 -14162413 -12482083
56989a2482083J525557J391398J275655J174884J085877J007021R38188Q79057
$$ -12482083 -10956526 -9565128 -8289473 -7114589 -6028712 -5021691 -4083503 -3204446
56981c204446Q27819P82124P41132a47814E27500O47920O19457N86605N47426
$$ -3204446 -2376627 -1594503 -853371 -147814 527500 1175420 1794877 2381482 2928908
56972B928908N01667M51548M01478L55691L15915K81650K51945K25965K02402
$$ 2928908 3430575 3882123 4283601 4639292 4955207 5236857 5488802 5714767 5917169
56963E917169J79662J56854J33913J10842Q7549O4285M1400J8611m682k8216n0669
$$ 5917169 6096831 6253685 6387598 6498440 6585989 6650274 6691674 6710285 6705603 6677387 6626718
56952F626718p0825q8294j03011j14709j23369j29618j34213j37440j39652j42190
$$ 6626718 6555893 6467599 6364588 6249879 6126510 5996892 5862679 5725239 5585587 5443397
56942E443397j46975j54742j64070j72638j79290j84251j87413j87513j83715
$$ 5443397 5296422 5141680 4977610 4804972 4625682 4441431 4254018 4066505 3882790
56933C882790j77250j70268j63340j55217j45037j33554j21979j10801j00206
$$ 3882790 3705540 3535272 3371932 3216715 3071678 2938124 2816145 2705344 2605138
56924B605138r0480q1324p1791o1701n2287m4604l8244l2489k7745k4462k1489
$$ 2605138 2514658 2433334 2361543 2299842 2247555 2202951 2164707 2132218 2104473 2080011 2058522
56913B058522j7108j1539o741l725j426J484M947Q135J0702J2892J5174J8184
$$ 2058522 2041414 2029875 2023134 2019409 2017983 2019467 2024414 2032549 2043251 2056143 2071317 2089501
56901B089501K2255K6651K9919L1435L1893L1999L1430K9633K6874K3839K0720
$$ 2089501 2111756 2138407 2168326 2199761 2231654 2263653 2295083 2324716 2351590 2375429 2396149
56890B396149J7496J4592J2436J0647Q520O258M847M613M696M235L360K587J896
$$ 2396149 2413645 2428237 2440673 2451320 2459840 2466098 2470945 2475558 2480254 2484489 2487849 2490436 2492332
56877B492332J115P16J289K308K370J011n78j242j549l038o209j0204j4221j8095
$$ 2492332 2493447 2494163 2495452 2497760 2500130 2501141 2500563 2499321 2497772 2494734 2488525 2478321 2464100 2446005
56863B446005k1397k3191k3269k2772k2797k2989k2249k0427j8414j6758j5131
$$ 2446005 2424608 2401417 2378148 2355376 2332579 2309590 2287341 2266914 2248500 2231742 2216611
56852B216611j3255j1684j1173j1585j1756j0604q276o094n179n247n147m418
$$ 2216611 2203356 2191672 2180499 2168914 2157158 2146554 2138278 2132184 2127005 2121758 2116611 2112193
56840B112193l671l353k956j910n75K65N45Q04J288J804K275K854L590M442N412
$$ 2112193 2108522 2105169 2102213 2100303 2099728 2099993 2100538 2101342 2102630 2104434 2106709 2109563 2113153 2117595 2123007
56825B123007O322O687O288N470M530L253J574J03p10j280j897j750j15J980K773
$$ 2123007 2129329 2136016 2142304 2147774 2152304 2155557 2157131 2157234 2156524 2155244 2153347 2151597 2151482 2153462 2156235
56810B156235K315K534M637P804J0717J2944J4395J4999J5578J7663K1337K4310
$$ 2156235 2158550 2161084 2165721 2173525 2184242 2197186 2211581 2226580 2242158 2259821 2281158 2305468
56798B305468K4225K1063J6321J0883N037k38l721n490o662p562p392n847l854
$$ 2305468 2329693 2350756 2367077 2377960 2382997 2382759 2379038 2373548 2366886 2359324 2351932 2346085 2342231
56785B342231k338j168K60K105M143O348R133J3265J9213K6008L1086L2382L0578
$$ 2342231 2339893 2338725 2338985 2341090 2345233 2351581 2360714 2373979 2393192 2419200 2450286 2482668 2513246
56772B513246K8111K5774K1692J4234M634m438j1764j7671k1955k3625k2885k1646
$$ 2513246 2541357 2567131 2588823 2603057 2607691 2603253 2591489 2573818 2551863 2528238 2505353 2483707
56760B483707k1310k1044j9199j5771j2467j0508r196o910l007J553N330P835
$$ 2483707 2462397 2441353 2422154 2406383 2393916 2383408 2374212 2367302 2364295 2365848 2371178 2379013
56748B379013R720J1547J2744J2049Q959M271q47n857j0649j4810j7718j9254
$$ 2379013 2388733 2400280 2413024 2425073 2434032 2438303 2437456 2431599 2420950 2406140 2388422 2369168
56736B369168j9985k0475k0742k0527j9880j9243j8932j8611j7356j4430j0160
$$ 2369168 2349183 2328708 2307966 2287439 2267559 2248316 2229384 2210773 2193417 2178987 2168827
56725B168827n980l342k419k083j248r1L07o03k227l805n478p842j0598j2559
$$ 2168827 2162847 2159505 2157086 2155003 2153755 2153664 2153971 2153368 2151141 2147336 2141858 2134016 2123418 2110859
56711B110859j3228j3630j4967j6941j8223j8205j7381j6218j4722j3186j2242
$$ 2110859 2097631 2084001 2069034 2052093 2033870 2015665 1998284 1982066 1967344 1954158 1941916
56700A941916j1775j0859r280q145q205q530p885o612n852n495m425k699j925
$$ 1941916 1930141 1919282 1910002 1901857 1893652 1885122 1877237 1870625 1864773 1859278 1854853 1852154 1850229
56687A850229l059n022o117n932n285m881m720m403l602k484j807k237l403m139
$$ 1850229 1847170 1842148 1836031 1830099 1824814 1819933 1815213 1810810 1807208 1804724 1802917 1800680 1797277 1793138
56673A793138l825l038k586k513k446k430k927m080n312n606m277j795K58N38
$$ 1793138 1789313 1786275 1783689 1781176 1778730 1776300 1773373 1769293 1763981 1758375 1754098 1752303 1752561 1753099
56659A753099p00j964k256j885j618j737k121k669l262l723l890l412j772P74
$$ 1753099 1752399 1750435 1748179 1746294 1744676 1742939 1740818 1738149 1734887 1731164 1727274 1723862 1722090 1722864
56645A722864K579K090P3j047l45M70k36j585j710o24q2j083k954m598n446n200
$$ 1722864 1725443 1727533 1727606 1726559 1726214 1726684 1726448 1724863 1723153 1722529 1722447 1721364 1718410 1713812 1708366 1703166
56629A703166l800j921p19p33j468k070k104j814j945l032m567n370n082m625
$$ 1703166 1699366 1697445 1696726 1695993 1694525 1692455 1690351 1688537 1686592 1683560 1678993 1673623 1668541 1663916
56615A663916m632m292k724p10K08p9l14P0L24j22q70j567k429l332l364j985
$$ 1663916 1659284 1654992 1652268 1651558 1651766 1651687 1651373 1651443 1651767 1651645 1650775 1649208 1646779 1643447 1640083 1638098
56599A638098J08J756K496K433J637J93j427k572k940k756k553k694k868k244
$$ 1638098 1638206 1639962 1642458 1644891 1646528 1646721 1645294 1642722 1639782 1637026 1634473 1631779 1628911 1626667
56585A626667n68J161J678R51Ln51q81r57l22P79J125J43r76o72Q31J608L43k033
$$ 1626667 1626099 1627260 1628938 1629889 1629892 1629341 1628460 1627503 1627181 1627960 1629085 1629228 1628252 1627580 1628411 1630019 1630362 1628329
56567A628329l337k510p50j00j139k571l103k980l124l560l654l398l267k989
$$ 1628329 1624992 1622482 1621732 1621632 1620493 1617922 1614819 1611839 1608715 1605155 1601501 1598103 1594836 1591847
56553A591847j875l79Qj126k331k300j488j069j237j504j763k091k082j486j013
$$ 1591847 1589972 1589593 1589601 1588475 1586144 1583844 1582356 1581287 1580050 1578546 1576783 1574692 1572610 1571124 1570111
56538A570111j505k589l196l093k882k682j965p72L4J1k72l01l74p85j032n46
$$ 1570111 1568606 1566017 1562821 1559728 1556846 1554164 1552199 1551427 1551461 1551472 1551200 1550899 1550525 1549740 1548708 1548162
56522A548162K75O15M43L53L92q2j150j822j217K36J372J616J137Kj890l910m721
$$ 1548162 1548437 1549052 1549495 1549848 1550240 1550158 1549008 1547186 1545969 1546205 1547577 1549193 1550330 1550332 1548442 1544532 1539811
56505A539811l666j703l67j30k25J78J258K741M149M757M019K329R25O87J202
$$ 1539811 1536145 1534442 1534075 1533945 1533720 1533898 1535156 1537897 1542046 1546803 1550822 1553151 1554076 1554763 1555965
56490A555965J300M73n25o29K76J202J183K01j153k512l709m250l673k470j842
$$ 1555965 1557265 1557738 1557213 1556584 1556860 1558062 1559245 1559446 1558293 1555781 1552072 1547822 1544149 1541679 1539837
56475A539837k227k818k793k267j542m61P89J104k20k208l321l368l242l158k479
$$ 1539837 1537610 1534792 1531999 1529732 1528190 1527729 1528518 1529622 1529402 1527194 1523873 1520505 1517263 1514105 1511626
56460A511626j152L5O51R03O85m57k177l331l447l237l332l553l648l697l408
$$ 1511626 1510474 1510509 1511160 1512063 1512748 1512291 1510114 1506783 1503336 1500099 1496767 1493214 1489566 1485869 1482461
56445A482461k198m62L85k15j113j222r83j240j615j199j94L78J32n03j208j899
$$ 1482461 1480263 1479801 1480186 1479971 1478858 1477636 1476653 1475413 1473798 1472599 1472405 1472783 1472915 1472412 1471204 1469305
56429A469305k166j590n48J02J2n60j426k435k986k518j460q99j177j534j328
$$ 1469305 1467139 1465549 1465001 1465103 1465115 1464555 1463129 1460694 1457708 1455190 1453730 1452831 1451654 1450120 1448792
56414A448792r20r95j553j960j774j170o17l71l16l54p36j720k858l166k335j330
$$ 1448792 1447872 1446877 1445324 1443364 1441590 1440420 1439803 1439432 1439116 1438762 1438026 1436306 1433448 1430282 1427947 1426617
56398A426617j227j741j588k61J285J885J450O42k82j523k799l090j797K19J312
$$ 1426617 1425390 1423649 1422061 1421800 1423085 1424970 1426420 1427062 1426780 1425257 1422458 1419368 1417571 1417790 1419102
56383A419102P89m92j229r69j50N70O11l61k007l322l605l194k896k950l065l067
$$ 1419102 1419891 1419399 1418170 1417201 1417051 1417621 1418232 1417871 1415864 1412542 1408937 1405743 1402847 1399897 1396832 1393765
56367A393765k887k236j076r1N2k98l18P8M88R71J614J533p2k051k296q37m5j108
$$ 1393765 1390878 1388642 1387566 1387475 1387527 1387229 1386911 1386989 1387477 1388448 1390062 1391595 1391523 1389472 1387176 1386339 1386294 1385186
56349A385186k233j488L12J064M25l01m34l80l26q3k3p65j948k486k063j344q63
$$ 1385186 1382953 1381465 1381777 1382841 1383266 1382965 1382531 1382151 1381825 1381742 1381719 1380954 1379006 1376520 1374457 1373113 1372250
56332A372250n97n60q43j039n80L47R34Q48M63J6n94j152j093l81K49K06k28l58
$$ 1372250 1371653 1371093 1370250 1369211 1368631 1368978 1369912 1370760 1371223 1371239 1370645 1369493 1368400 1368019 1368268 1368474 1368246 1367888
56314A367888RM20M95N43J236K441K851J516m66q55Q52K581K339N89q23j128r00
$$ 1367888 1367897 1368317 1368812 1369355 1370591 1373032 1375883 1377399 1376933 1376078 1376930 1379511 1381850 1382439 1381616 1380488 1379588
56297A379588o17k91o0ML81J387K311K327J857J902K368K298J563R07L80p99k566
$$ 1379588 1378971 1378680 1378620 1378624 1379005 1380392 1382703 1385030 1386887 1388789 1391157 1393455 1395018 1395925 1396305 1395506 1392940
56280A392940l457k338J77K435L265K704J860K044L324M109L089J295R15K171
$$ 1392940 1389483 1387145 1387322 1389757 1393022 1395726 1397586 1399630 1402954 1407063 1410152 1411447 1412362 1414533
56266A414533K996K130Q89R87K046K533K115J665J463Q89j84q58m19P71J887K543
$$ 1414533 1417529 1419659 1420548 1421535 1423581 1426114 1428229 1429894 1431357 1432246 1432062 1431204 1430785 1431556 1433443 1435986
56250A435986K705K270J292M70P05J996L358M141M847O017O847O097M254L438
$$ 1435986 1438691 1440961 1442253 1442723 1443428 1445424 1448782 1452923 1457770 1463787 1470634 1476731 1480985 1484423
56236A484423M726O905Q479R585J0757J1201J0013Q303Q053R174R626Q656P975
$$ 1484423 1489149 1496054 1504533 1514118 1524875 1536076 1546089 1554392 1562445 1571619 1581245 1589901 1597876
56223A597876R100J1106J2071J1642J1276J2402J5055J7892J9283J8858J8058
$$ 1597876 1606976 1618082 1630153 1641795 1653071 1665473 1680528 1698420 1717703 1736561 1754619
56212A754619J8562K0225K1585K2336K3992K7608L2088L5544L7406L8352L9086
$$ 1754619 1773181 1793406 1814991 1837327 1861319 1888927 1921015 1956559 1993965 2032317 2071403
56201B071403M0187M2485M6436N1232N5391N8412O1280O5298P0766P6894Q2844
$$ 2071403 2111590 2154075 2200511 2251743 2307134 2365546 2426826 2492124 2562890 2639784 2722628
56190B722628Q8724R5367J02985J10383J16104J20089J23613J27620J31822J35345
$$ 2722628 2811352 2906719 3009704 3120087 3236191 3356280 3479893 3607513 3739335 3874680
56180C874680J37353J37025J33747J27674J19299J08363R4098P6822N8320M0022
$$ 3874680 4012033 4149058 4282805 4410479 4529778 4638141 4732239 4809061 4867381 4907403
56170D907403K1591J964j8801l9224n7533p2668q4754r4961j04436j13017j19474
$$ 4907403 4928994 4930958 4912157 4872933 4815400 4742732 4657978 4563017 4458581 4345564 4226090
56159D226090j23146j24598j24521j23006j20321j17338j14350j10394j04778
$$ 4226090 4102944 3978346 3853825 3730819 3610498 3493160 3378810 3268416 3163638
56150C163638r8559r3336q9079q4335p8476p2571o7764o3781n9508n4491m9327
$$ 3163638 3065079 2971743 2882664 2798329 2719853 2647282 2579518 2515737 2456229 2401738 2352411
56139B352411m4802m1068l7766l4710l2097l0054k8307k6643k5271k4217k2676
$$ 2352411 2307609 2266541 2228775 2194065 2161968 2131914 2103607 2076964 2051693 2027476 2004800
56128B004800j9770j5901j2548j0565r492q723q529r292j0336j0152p811l984
$$ 2004800 1985030 1969129 1956581 1946016 1936524 1927801 1919272 1909980 1899644 1889492 1881681 1877697
56116A877697p01K02j076k314j751j56N29J31K75J655L189M287N951Q610J0696
$$ 1877697 1876996 1877198 1876122 1873808 1872057 1871901 1872430 1872561 1872836 1874491 1877680 1881967 1887918 1896528 1907224
56101A907224J0874J0224J0583J1838J2707J3266J4690J6952J8764J9702K0609
$$ 1907224 1918098 1928322 1938905 1950743 1963450 1976716 1991406 2008358 2027122 2046824 2067433
56090B067433K1950K3426K5371K8650L2880L6428L8871M1791M6316N1324N5206
$$ 2067433 2089383 2112809 2138180 2166830 2199710 2236138 2275009 2316800 2363116 2414440 2469646
56079B469646N8046O0607O2271O1632N8677N4858N1155M7499M4094M1703M0242
$$ 2469646 2527692 2588299 2650570 2712202 2770879 2825737 2876892 2924391 2968485 3010188 3050430
56068C050430L8315L4790K9927K4498J8900J3759J0178Q195N879J449m343r466
$$ 3050430 3088745 3123535 3153462 3177960 3196860 3210619 3220797 3228992 3234871 3236320 3231977 3222511
56056C222511j3871j9510k6982l4180l8972m1458m2502m1751l8833l5289l3325
$$ 3222511 3208640 3189130 3162148 3127968 3088996 3047538 3005036 2963285 2924452 2889163 2855838
56045B855838l3022l2365k9813k5572k0639j6098j3127j2153j1761r778n659q34
$$ 2855838 2822816 2790451 2760638 2735066 2714427 2698329 2685202 2673049 2661288 2651510 2645851 2645017
56033B645017L257O252Q071Q596Q579R596J2389J5964J8694J9693J9130J8104
$$ 2645017 2648274 2654526 2662597 2671193 2679772 2689368 2701757 2717721 2736415 2756108 2775238 2793342
56021B793342J8208K0162K2784K4263K4472K4917K6374K7953K8682K8762K8892
$$ 2793342 2811550 2831712 2854496 2878759 2903231 2928148 2954522 2982475 3011157 3039919 3068811
56010C068811K9491L0894L3182L5554L7028L7888L9216M0984M2107M2453M3071
$$ 3068811 3098302 3129196 3162378 3197932 3234960 3272848 3312064 3353048 3395155 3437608 3480679
55999C480679M4111M4362M3524M3132M4363M6521M8445N0002N1450N2908N5117
$$ 3480679 3524790 3569152 3612676 3655808 3700171 3746692 3795137 3845139 3896589 3949497 4004614
55988D004614N8913O3233O5607O5688O6233O9274P3342P6044P7350P8451P9283
$$ 4004614 4063527 4126760 4192367 4258055 4324288 4393562 4466904 4542948 4620298 4698749 4778032
55977D778032P9573Q0888Q4945R0706R5550R8856J02309J06973J12120J16977
$$ 4778032 4857605 4938493 5023438 5114144 5209694 5308550 5410859 5517832 5629952 5746929
55967E746929J21877J27459J33889J40915J47780J53480J58095J63368J70871
$$ 5746929 5868806 5996265 6130154 6271069 6418849 6572329 6730424 6893792 7064663
55958G064663J80032J88981J96948K04774K13483K23296K34003K45703K59199
$$ 7064663 7244695 7433676 7630624 7835398 8048881 8272177 8506180 8751883 9011082
55949I011082K75500K94303L13574L31960L51067L73236L97442M20384M42008
$$ 9011082 9286582 9580885 9894459 10226419 10577486 10950722 11348164 11768548 12210556
55940A2210556M66411M95858N27446N57988N89078O24487O65128P09709P58138
$$ 12210556 12676967 13172825 13700271 14258259 14847337 15471824 16136952 16846661 17604799
55931A7604799Q10796Q65956R21299R77214J035862J098020J163344J232553J306717
$$ 17604799 18415595 19281551 20202850 21180064 22215926 23313946 24477290 25709843 27016560
55922B7016560J385298J467411J554210J648172J751159J864757J990819K129769
$$ 27016560 28401858 29869269 31423479 33071651 34822810 36687567 38678386 40808155
55914D0808155K280516K443642K622144K817431L028529L258027L514770L806981
$$ 40808155 43088671 45532313 48154457 50971888 54000417 57258444 60773214 64580195
55906F4580195M136630M504547M916508N378478N888988O441624P033242P667206
$$ 64580195 68716825 73221372 78137880 83516358 89405346 95846970 102880212 110547418
55898A10547418Q354305R115149R975038J0950821J2050751J3293697J4716855
$$ 110547418 118901723 128016872 137991910 148942731 160993482 174287179 189004034
55891A89004034J6351346J8190990K0165563K2069924K3443341K3550120K1638183
$$ 189004034 205355380 223546370 243711933 265781857 289225198 312775318 334413501
55884C34413501J7395487J1245239M200961k606051q357466j2697389j5647028
$$ 334413501 351808988 363054227 367255188 364649137 356291671 343594282 327947254
55877C27947254j7443925j8394853j8766984j8739527j8418234j7870547j7142315
$$ 327947254 310503329 292108476 273341492 254601965 236183731 218313184 201170869
55870B01170869j6263498j5262662j4179915j3060608j1941014j0846790r800284
$$ 201170869 184907371 169644709 155464794 142404186 130463172 119616382 109816098
55863A09816098q820726p919024p098719o360844n703970n122268m608666m158578
$$ 109816098 100995372 93076348 85977629 79616785 73912815 68790547 64181881 60023303
55855F0023303l767417l427231l129781k870573k646147k449733k273570k113670
$$ 60023303 56255886 52828655 49698874 46828301 44182154 41732421 39458851 37345181
55847C7345181j968644j835607j711023j594260j486810j388839j299222j217668
$$ 37345181 35376537 33540930 31829907 30235647 28748837 27359998 26060776 24843108
55839B4843108j143928j076088j012280r52870q98494q47488p98073p51557p10248
$$ 24843108 23699180 22623092 21610812 20657942 19759448 18911960 18113887 17362330 16652082
55830A6652082o73401o38392o05016n75244n49289n25143n01969m80840m61769
$$ 16652082 15978681 15340289 14735273 14160029 13610740 13085597 12583628 12102788 11641019
55821A1641019m42850m23047m03569l85661l68818l52005l35252l19343l04894
$$ 11641019 11198169 10775122 10371553 9985892 9617074 9265069 8929817 8610474 8305580
55812H305580k92103k80555k69164k57102k44798k33305k23054k13871k05597
$$ 8305580 8013477 7732922 7463758 7206656 6961858 6728553 6505499 6291628 6086031
55803F086031j97730j89182j79579j70290j62862j56917j50848j44050j37035
$$ 6086031 5888301 5699119 5519540 5349250 5186388 5029471 4878623 4734573 4597538
55794D597538j29844j22017j14061j07328j02293r8103r3958q9825q5777q1763
$$ 4597538 4467694 4345677 4231616 4124288 4021995 3923892 3829934 3740109 3654332 3572569
55784C572569p8126p5237p2579o9338o5909o3580o2478o1098n8358n5071n2712
$$ 3572569 3494443 3419206 3346627 3277289 3211380 3147800 3085322 3024224 2965866 2910795 2858083
55773B858083n1527n0652m9504m8139m6504m4223m1413l9068l8097l8024l7316
$$ 2858083 2806556 2755904 2706400 2658261 2611757 2567534 2526121 2487053 2448956 2410932 2373616
55762B373616l5309l3255l2835l3894l4547l3456l1096k8623k6505k4696k3313
$$ 2373616 2338307 2305052 2272217 2238323 2203776 2170320 2139224 2110601 2084096 2059400 2036087
55751B036087k2498k2179k2380k3121k3729k3050k0837j8171j6091j4594j3376
$$ 2036087 2013589 1991410 1969030 1945909 1922180 1899130 1878293 1860122 1844031 1829437 1816061
55740A816061j2565j2097j1454j0740j0929j2117j2655j1271r073q045q320q462
$$ 1816061 1803496 1791399 1779945 1769205 1758276 1746159 1733504 1722233 1713160 1705115 1696795 1688333
55728A688333p865p190o645n578m022l278m436p153j0122j2095j2463j1595j0611
$$ 1688333 1680468 1673278 1666633 1661055 1657033 1653755 1649319 1642166 1632044 1619949 1607486 1595891 1585280
55715A585280j0168r673q294o389m973m166l425l119m485p757j1660j5151j8480
$$ 1585280 1575112 1565439 1557145 1550756 1545783 1541617 1538192 1535073 1530588 1522831 1511171 1496020 1477540
55702A477540k1858k4122k3806k1151j8164j6681j6717j6735j5331j2722j0586
$$ 1477540 1455682 1431560 1407754 1386603 1368439 1351758 1335041 1318306 1302975 1290253 1279667
55691A279667j0414j2076j4177j5438j5411j4213j2302j0493r513r239q852p836
$$ 1279667 1269253 1257177 1243000 1227562 1212151 1197938 1185636 1175143 1165630 1156391 1147539 1139703
55679A139703o608n967o191o843p347p573p670p455o462n076m965p283j0549j1719
$$ 1139703 1133095 1127128 1120937 1114094 1106747 1099174 1091504 1084049 1077587 1072511 1067546 1060263 1049714 1037995
55665A037995r804p066o028o586p065o672n609l932k098j636l248m839l660k11
$$ 1037995 1028191 1021125 1015097 1008511 1001446 994774 989165 985233 983135 981499 978251 973412 969752 969541
55651I69541K227K062J031P85L43j758m670o400o558o353o630p350q355r293r261
$$ 969541 971768 973830 974861 975646 975989 974231 969561 963161 956603 950250 943620 936270 927915 918622 909361
55636I09361p821o093n601o337p004o946o690o659o582o248n823n150l783k051
$$ 909361 901540 895447 889846 883509 876505 869559 862869 856210 849628 843380 837557 832407 828624 826573
55622H26573j155j685k725l078k730k542k900l373l487l171k488j528o96o27j609
$$ 826573 825418 823733 821008 817930 815200 812658 809758 806385 802898 799727 797239 795711 795015 794388 792779
55607G92779l253m767n350m495k439l46N53L04J32P07J107K30j318j794p34L43
$$ 792779 789526 784759 779409 774914 772475 772129 772682 772986 773118 773825 774932 775162 773844 772050 771316 771659
55591G71659o3j632k984l455l358k948j994m00J364K527K470J095q81k277k484
$$ 771659 771596 769964 766980 763525 760167 757219 755225 754825 756189 758716 761186 762281 761400 759123 756639
55576G56639k138k419l736n323o029n375l986l182l901n740p329p727p086n914
$$ 756639 754501 752082 748346 743023 736994 731619 727633 724451 720550 714810 707481 699754 692668 686754
55562F86754m417k911k147k471l223l672m031m807n637n706n038m404m206m249
$$ 686754 682337 679426 677279 674808 671585 667913 663882 659075 653438 647732 642694 638290 634084 629835
55548F29835m342m227l216j080R05J016q04l001m517n472n750m652k522j121j409
$$ 629835 625493 621266 618050 616970 617875 618891 618087 615086 610569 605097 599347 594695 592173 591052 589643
55533E89643k209k141j644j781k132j556m02j78j157j939j715j508k525m301n172
$$ 589643 587434 585293 583649 581868 579736 578180 577778 577600 576443 574504 572789 571281 568756 564455 559283
55518E59283m089j438J399K939K572J201M83J084K033K164J666J506J754J409
$$ 559283 555194 553756 555155 558094 560666 561867 562350 563434 565467 567631 569297 570803 572557 573966
55504E73966Oj498j935j452j258k102l574m866n618n847n445m231k504j221j344
$$ 573966 573972 572474 570539 569087 567829 565727 562153 557287 551669 545822 540377 536146 533642 532421 531077
55489E31077k821m381m650l557k252j576j190n67j40n01j080p69K33N97Ol42J80
$$ 531077 528256 523875 519225 515668 513416 511840 510650 510083 509943 509442 508362 507593 507826 508423 508429 508087 508267
55472E08267N05k36j219j539j946l275m154k495J216M064M298K751O60j809m065
$$ 508267 508772 508536 507317 505778 503832 500557 496403 493908 495124 499188 503486 506237 506897 505088 501023
55457E01023m319j897R64J257j332m357n549m654k733q63K23J44r48k338l191
$$ 501023 496704 494807 495771 497028 495696 491339 485790 481136 478403 477540 477763 477907 476959 474621 471430
55442D71430l184k796k808l254l261k308j296j376k000j471M79K004J571j49j501
$$ 471430 468246 465450 462642 459388 456127 453819 452523 451147 449147 447676 448155 450159 451730 451581 450080
55427D50080j897j747j361r43q88j062m88J202K703K490Q82n66j194j598k058
$$ 450080 448183 446436 445075 444132 443244 442182 441694 442896 445599 448089 448971 448405 447211 445613 443555
55412D43555k061j422p51n32n54m51j48K53M87J81n19o70K28J104M65j390k489
$$ 443555 441494 440072 439321 438789 438235 437784 437636 437889 438376 438557 438038 437368 437596 438700 439165 437775 435286
55395D35286j697n9P95N85J84Q2k45j568l784n590n557l709j576k93N80J621J901
$$ 435286 433589 433530 434325 434910 435094 435176 434931 433363 429579 423989 418432 414723 413147 412854 413434 415055 416956
55378D16956K88k114k887j710r27k104l857m035k587q95L41J162J206J92r43q85
$$ 416956 417244 415130 412243 410533 409606 407502 403645 399610 397023 396128 396469 397631 398837 399029 398086 397201
55362C97201K50J198J399J439J649J532P74j36o01n45j97J50O5p95k134l199l503
$$ 397201 397451 398649 400048 401487 403136 404668 405442 405306 404705 404160 403963 404113 404178 403383 401249 398050 394547
55345C94547l000j819l31P35J001J003J380J738J293K63m32q01j623k621k406
$$ 394547 391547 389728 389397 390132 391133 392136 393516 395254 396547 396810 396378 395577 393954 391333 388927
55330C88927q43K20l46r98J48K159K368J79k195k829k129j285m13P19J353M71
$$ 388927 388084 388304 387958 386960 387108 389267 391635 391814 389619 386790 384661 383376 382963 383682 385035 385506
55314C85506j556l149l255k248j144n48l65j19N22J265J357M61p56j272q25j21
$$ 385506 383950 380801 377546 375298 374154 373606 373241 373122 373644 374909 376266 376727 375971 374699 373874 373753
55298C73753M4m67j170j463j045j64N14M40k93j033j213q91n81o52r10q80m88
$$ 373753 373797 373330 372160 370697 369652 369488 370002 370442 370149 369116 367903 367012 366431 365779 364869 363989 363501
55281C63501k30m58p50m65K61P38Q38J215K110K755K401J323J40j121k502l251
$$ 363501 363271 362813 362063 361598 361859 362597 363435 364650 366760 369515 371916 373239 373379 372258 369756 366505
55265C66505k627j281o84j183j737j676j530j734j683q08L06P04L64n6k20m1Q02
$$ 366505 363878 362597 361913 360730 358993 357317 355787 354053 352370 351562 351868 352572 352936 352880 352660 352619 353421
55248C53421K250L067J841j025l371l650k489j440r71m74L06P52M29j94m30j95
$$ 353421 355671 358738 360579 359554 356183 352533 350044 348604 347633 347159 347465 348217 348646 348452 348022 347827
55232C47827K31Q70J731K054Q01j744l625l167r34Q74P97p15k280k949k498j230
$$ 347827 348058 348928 350659 352713 353514 351770 348145 344978 344044 344918 345715 345000 342720 339771 337273 336043
55216C36043J60R29R23O70O61Q39P93J71j083k413k707j348P57J984J958J759
$$ 336043 336203 337132 338055 338725 339386 340225 341018 341189 340106 337693 334986 333638 334395 336379 338337 340096
55200C40096J943J603J29j265j101k4n6j581k623j522Q50K286J864N09n80j167
$$ 340096 342039 343642 343771 342506 341405 341381 341325 339744 337121 335599 336449 338735 340599 341108 340528 339361
55184C39361j554j645r59N07J913K298J572M83k68o01p56q47q48o96l28R2R1n58
$$ 339361 337807 336162 335203 335710 337623 339921 341493 341976 341708 341107 340351 339504 338656 337960 337632 337724 337815 337257
55166C37257j243j151n11m05j168j911j977j803j711j001P33K345K398J190J55
$$ 337257 336014 334863 334352 333947 332779 330868 328891 327088 325377 324376 325109 327454 329852 331042 331197
55151C31197k55o95j223j015N9R38Q59K46l16r01j609j997j731j152p21m52k21
$$ 331197 330942 330247 329024 328009 328068 329006 329865 330111 329795 328894 327285 325288 323557 322405 321684 321232 321011
55134C21011r9kL90J019J236N67o10j434j297k47R94J437P68k22o14m95m55l90
$$ 321011 320912 320910 321300 322319 323555 324122 323512 322078 320781 320534 321528 322965 323733 323511 322897 322402 321947 321557
55116C21557K11J035J277J127J545K396K375J177J96K84L41p85k358k929k442
$$ 321557 321768 322803 324080 325207 326752 329148 331523 332700 332896 333180 333521 332736 330378 327449 325007
55101C25007j813j261n32p3m45r92n16Q12J606J226M23n2k71m07k68J14K04l66
$$ 325007 323194 321933 321401 321328 320883 319891 319375 320187 321793 323019 323442 323390 323119 322712 322444 322558 322762 322396
55083C22396j365k254k397j245R31K579K185J50j522j570o73r8q3k6M05R58J201
$$ 322396 321031 318777 316380 315135 316066 318645 320830 320980 319458 317888 317215 317117 317034 317008 317413 318371 319572
55066C19572Q82R8o97j211j764k672l266k416l36J110N66j073j884j362o61o40
$$ 319572 320454 320552 319855 318644 316880 314208 310942 308526 308190 309300 309866 308793 306909 305547 304886 304246
55050C04246p99m13K48M71L12L75O35M36j93j88R86K185J961O99J23Q18J461R23
$$ 304246 303447 303034 303282 303753 304065 304440 305075 305511 305318 305130 306116 308301 310262 310961 311084 311902 313363 314286
55032C14286j83p06o36n77m79n3K09k61p61q1J520K436J903Q20J82j13m50o04
$$ 314286 314103 313397 312761 312184 311705 311652 311861 311600 310839 310758 312278 314714 316617 317437 317619 317506 317056 316452
55014C16452k89J65K98O3n32j622k880l416k806j708r52o19m44n00p97q30k62
$$ 316452 316163 316328 316626 316689 316157 314535 311655 308239 305433 303725 302773 302154 301710 301210 300413 299583 299321
54997B99321K50k45j540k225j197J134L201L691K736J729J806K507K447J262J07
$$ 299321 299571 299326 297786 295561 294364 295498 298699 302390 305126 306855 308661 311168 313615 314877 314984
54982C14984n3K39m1p90j185j162j416k052k313j812j094o81l33K15M58k44j455
$$ 314984 314931 315170 315129 314339 313154 311992 310576 308524 306211 304399 303305 302624 302291 302506 302964 302720 301265
54965C01265j882r29M69R59M29kL62P76K49p37o77Q22K265K087N12r48j237l57
$$ 301265 299383 298454 298923 299882 300311 300309 300671 301447 301696 300959 300282 301104 303369 305456 305968 305020 303783 303426
54947C03426J214K768L325K268J64j693k608k776k440j560m38J52q7m96l30K52
$$ 303426 304640 307408 310733 313001 313165 311472 308864 306088 303648 302088 301650 301802 301715 301219 300889 301141
54931C01141N23J54n22r96j022o88k85j2K11M27K30p03j596r92J272L178K641
$$ 301141 301664 301818 301296 300300 299278 298590 298305 298293 298504 298931 299161 298458 296862 295870 297142 300320 302961
54914C02961J41j782j623l96J80j33m64m81n93q55p45p9O86J198J573J820J612
$$ 302961 303102 301320 299697 299301 299481 299348 298884 298403 297810 296955 296210 296131 296817 298015 299588 301408 303020
54897C03020R35L09l3n02j254j528p81O3m40k165l336k811j491r12j200j226l66
$$ 303020 303955 304264 304231 303729 302475 300947 300166 300229 299789 297624 294288 291477 289986 289074 287874 286648 286282
54880B86282P49J226R37L46k14p08j035r24k79N50J060J162J205J352J292P85
$$ 286282 287031 288257 289194 289540 289326 288618 287583 286659 286380 286930 287990 289152 290357 291709 293001 293786
54864B93786K54K59N46L40k52Q0K133M645N382L759J554P16J213J678J620J965
$$ 293786 294040 294299 294845 295185 294933 295013 297146 301791 307173 310932 312486 313202 314415 316093 317713 319678
54848C19678L226M245L597J708M49O20R01j44j995k947k457j622j478j801j870
$$ 319678 322904 327149 330746 332454 332903 333523 334424 334280 332285 329338 326881 325259 323781 321980 320110
54833C20110j596j523k094l184m073l885k431o77J67Qk80l21o91j628k222j550
$$ 320110 318514 316991 314897 311713 307640 303755 301324 300647 300814 300822 300542 300221 299530 297902 295680 294130
54817B94130oJ165J309Q26N00Q46J791K682K910K804L395M821N696M839L053K153
$$ 294130 294124 295289 296598 297424 297924 298770 300561 303243 306153 308957 312352 317173 322869 327708 330761 332914
54801C32914K495K596J286q36k521l544m545n629o059n396m344l881l855l169
$$ 332914 335409 338005 339291 338455 335934 332390 327845 322216 316157 310761 306417 302536 298681 295512
54787B95512j507J8M61N19J199J737N62j746k591j165L5j132l167l413k240k130
$$ 295512 294005 294023 294484 295003 296202 297939 298501 296755 294164 292999 293034 291902 288735 285322 283082 280952
54771B80952l344l584k039p91j253j810n90J507K414K010J658J544O47j009j971
$$ 280952 277608 274024 271985 271194 269941 268131 267541 269048 271462 273472 275130 276674 277321 276312 274341
54756B74341j422k07N01M89J89p8j79o4J01J76L41P17P71j54j651k275j140R82
$$ 274341 272919 272712 273213 273702 273891 273813 273634 273570 273671 273847 274188 274905 275676 275522 273871 271596 270456 271438
54738B71438K448K349J193J79N8N67Q86O53L24M42Q16R15P88J023J661J784O43
$$ 271438 273886 276235 277428 277607 277665 278232 279118 279771 280095 280537 281353 282268 283056 284079 285740 287524 288167
54721B88167j143k090j508k35N21O29Q43J372J511R77P15J570K673K440J068O01
$$ 288167 287024 284934 283426 283191 283712 284341 285184 286556 288067 289044 289759 291329 294002 296442 297510 298111
54705B98111K083L903L931K394J441K314M065M949M131K064Q5l96Q80K439K453
$$ 298111 300194 304097 308028 310422 311863 314177 318242 323191 327322 329386 329471 329075 329955 332394 334847
54690C34847Q00r95j839k248l064m017m238l664l072k938k887k328j239k22Q4
$$ 334847 335647 334652 332813 330565 327501 323484 319246 315582 312510 309572 306685 304357 303118 302896 302980
54675C02980l80j022j242j112j251j999k976l503l209k189q48K90R21J202J567
$$ 302980 302600 301578 300336 299224 297973 295974 292998 289495 286286 284097 283249 283539 284460 285662 287229
54660B87229K194K857L140K641J192o42j502m58J680L050K816J813R44P0r93j482
$$ 287229 289423 292280 295420 298061 299253 298611 297109 296651 298331 301381 304197 306010 306954 307024 306031 304549
54644C04549p99J98K37m53n87P0M62R6k75k46o46k051l497l673k723j866j707
$$ 304549 303750 303948 304185 303732 303145 303215 303677 303773 303498 303252 302606 300555 297058 293385 290662 288796 287089
54627B87089j869j985k056j969j557j100j039j199j034o26n65q23o50P9L60n27
$$ 287089 285220 283235 281179 279210 277653 276553 275514 274315 273281 272655 272090 271267 270617 270696 271056 270529
54611B70529j785k015r71K67O11r4j211j889j621o85Q4K05Kj28l57q01p46M66
$$ 270529 268744 266729 265758 266025 266636 266542 265331 263442 261821 261136 261220 261425 261427 261299 260942 260141 259395 259861
54593B59861K059K472J557Q86J370J651j6k945m426k950M4K038K081J060o9j252
$$ 259861 261920 264392 265949 266835 268205 269856 269840 266895 262469 259519 259563 261601 263682 264742 264673 263421
54577B63421k606l579l372k002m83Q8l57p20K90K769N138N393L158J89j474j621
$$ 263421 260815 257236 253864 251862 251379 251467 251110 250390 250680 253449 258587 263980 267138 267327 265853 264232
54561B64232j533j902k016j187RN59L57K0j07n6K12M99O2j382k569j892K99J854
$$ 264232 262699 260797 258781 257594 257603 258162 258519 258539 258432 258376 258588 259087 259149 257767 255198 253306 253605 255459
54543B55459J617P93R23J632J506L11r15j642k372l296l603k588q10M43N20r9
$$ 255459 257076 257869 258792 260424 261930 262241 261326 259684 257312 254016 250413 247825 247015 247458 247978 247879
54527B47879m83j22P65J524J618J041L27J85R35K110K676J975N15m59l41K46L59
$$ 247879 247396 247274 248039 249563 251181 252222 252549 252734 253669 255779 258455 260430 260945 260486 260145 260391 260750
54510B60750n7k56K13Q79Q95J0j069j325n16M19L27q01j776j655q18k98m66q12
$$ 260750 260693 260437 260650 261529 262424 262434 261365 260040 259524 259943 260270 259469 257693 256038 255220 254922 254456 253644
54492B53644q50p01p12q50p02K7J115J959K126J683R51J73l66k18P13J727K026
$$ 253644 252794 252093 251381 250531 249829 249856 250971 252930 255056 256739 257690 257863 257497 257279 257992 259719 261745
54475B61745J835J966K314J719k69k430l358l229l182l453l129j655K62J438J445
$$ 261745 263580 265546 267860 269579 269310 266880 263522 260293 257111 253658 250529 248874 249136 250574 252019
54460B52019Q67N87Q66J099P09O1m3K61o8j277k126j541q1J003J420J628J648
$$ 252019 252886 253473 254339 255438 256147 256208 256165 256426 256358 255081 252955 251414 251333 252336 253756 255384 257032
54443B57032J153L03n51j527k634k998j866kJ045Q32J08o37j364j529m57J310
$$ 257032 258185 258488 257937 256410 253776 250778 248912 248910 249955 250787 250895 250258 248894 247365 246908 248218
54427B48218K358K204J531P15m44j515j594q89o46j143j315p08j28J75J099K725
$$ 248218 250576 252780 254311 255026 254582 253067 251473 250584 249938 248795 247480 246772 246644 246819 247918 250643
54411B50643L522K627J288Q72R86Q51R33J665J929P27q26r67P8Q48J124J645J980
$$ 250643 254165 256792 258080 258952 259938 260789 261722 263387 265316 266043 265217 264250 264328 265176 266300 267945 269925
54394B69925R35j046k023j249Q3Q98J307J388O37q77k224k926l257l070j794%
$$ 269925 270860 269814 267791 266542 266625 267523 268830 270218 270855 269978 267754 264828 261571 258501 256707 256707
54378B56707P17qo34p3P32N02l91q07o93p89j144j126m77N29J690K844L518L348
$$ 256707 257424 257416 256782 256709 257441 257943 257552 256745 256052 255263 254119 252993 252516 253045 254735 257579 261097 264445
54360B64445K636J994J603J239O65k39j347k051j742q38n50j241j749r71N54J442
$$ 264445 267081 269075 270678 271917 272582 272343 270996 268945 267203 266365 265815 264574 262825 261854 262408 263850
54344B63850J238O05J13k53n71o33j37J075K764M032L854K252M20p35j455k027
$$ 263850 265088 265693 265806 265553 264982 264349 264212 265287 268051 272083 275937 278189 278609 277874 276419 274392
54328B74392j729L6K207K980K104J077R65J100L35j180k024j066J216K914K442
$$ 274392 272663 272699 274906 277886 279990 281067 282032 283132 283467 282287 280263 279197 280413 283327 285769
54313B85769K77j477j538p44l99k52P42K312L066K637K027J768J287N37O70K207
$$ 285769 286046 284569 283031 282287 281888 281636 282378 284690 287756 290393 292420 294188 295475 296012 296682 298889
54297B98889L791L853K564J068k87j699k561j994n68l2j034k379k921l011l320
$$ 298889 302680 306533 309097 310165 309878 308179 305618 303624 303056 303024 301990 299611 296690 293679 290359
54282B90359l295k050l40k01k273m642n098l754k484k205j938o78J050K076K057
$$ 290359 287064 285014 284674 284473 282200 277558 272460 268706 266222 264017 262079 261401 262451 264527 266584
54267B66584J284j36j817k506j377L48N38r19j802p15Q79P92p75j601m80J425
$$ 266584 267868 267732 265915 263409 262032 262380 262918 261999 260197 259482 260361 261153 260378 258777 258297 259722
54251B59722K239J520L64j7M03N98j96j473k151k054j852j541l59J280J270j328
$$ 259722 261961 263481 263845 263828 264231 264829 264633 263160 261009 258955 257103 255562 255203 256483 257753 256425
54235B56425m037l461K26L255K822k7k460l103k361j042Q5K89k65j81J480L566
$$ 256425 252388 248927 249153 252408 255230 255203 252743 249640 247279 246237 246322 246611 246346 246165 247645 251211
54219B51211L974K264J44o69j37N69N05l29j046n72J243L132L584K533J302Q49
$$ 251211 255185 257449 257593 256924 256787 257356 257861 257532 256486 255914 257157 260289 263873 266406 267708 268557
54203B68557Q38O78N60Q53J275J426J690K560L340K675N34j457k057j837j850
$$ 268557 269395 270073 270633 271486 272761 274187 275877 278437 281777 284452 284986 283529 281472 279635 277785
54188B77785j820p51J165K517K514J657M68j112k679k968j532R1K0j659l154l200
$$ 277785 275965 275214 276379 278896 281410 283067 283535 282423 279744 276776 275244 275335 275355 273696 270542 267342
54172B67342k019n09N37N48l40j003n97M5n16j975k447j259O1K04r5K96P79J47
$$ 267342 265323 264814 265351 265899 265559 264556 263959 264004 263488 261513 259066 257807 257868 258072 257977 258273 259052 259199
54154B59199j141j448l84Q71J495J791J856J034o67j800j131O04J520R20p3j77
$$ 259199 258058 256610 256226 257097 258592 260383 262239 263273 262606 260806 259675 260279 261799 262719 262646 262469
54138B62469M79Q25L80l22p24r07r95n67O15J706J530K00q35n40P22J916K237
$$ 262469 262948 263773 264153 263831 263107 262200 261205 260638 261253 262959 264489 264689 263854 263314 264036 265952 268189
54121B68189J186j022k929k931j431n88j232j599j84J701J928P70J59N05N54m
$$ 268189 269375 268353 265424 262493 261062 260474 259242 257643 257459 259160 261088 261858 262017 262522 263076 263072
54105B63072q8M95M93n71j528j539j279j393j298m33O02J015Q99O04Q4m29j85
$$ 263072 262984 263479 263972 263401 261873 260334 259055 257662 256364 255931 256533 257548 258447 259051 259135 258706 258521
54088B58521R00J832K014K097K592K750J745K5j395k154k234j460l01j21j485
$$ 258521 259421 261253 263267 265364 267956 270706 272451 272476 271081 268927 266693 265233 264932 264811 263326
54073B63326l013l087j991j152j121j468k000k565k282n47J512K153J487J191
$$ 263326 260313 257226 255235 254083 252962 251494 249494 246929 244647 244100 245612 247765 249252 250443
54059B50443J856K213J440O50J221K689L356K460R70L10Q46J695J838J272P95
$$ 250443 252299 254512 255952 256602 257823 260512 263868 266328 267298 267608 268454 270149 271987 273259 274054
54044B74054P91P61L43O1M82J086Q14m94j872k343j794q56l28m55n25M16K176
$$ 274054 274845 275606 275949 276010 276492 277578 278392 277898 276026 273683 271889 271033 270705 270250 269725 270141 272317
54027B72317L422L435L026L091L250K829K192J967J750R86L99J054K335K494J056
$$ 272317 275739 279174 282200 285291 288541 291370 293562 295529 297279 298265 298664 299718 302053 304547 305603
54012C05603o50j412j243p00l24o76j702k167r21J362K982L444L463L051J535
$$ 305603 304953 303541 302298 301598 301274 300598 298896 296729 295808 297170 300152 303596 307059 310110 311645
53997C11645n21j346m20P51R13N45N40Q32J042J204J345J454K191M149O260O638
$$ 311645 311124 309778 309358 310109 311022 311567 312107 312939 313981 315185 316530 317984 320175 324324 330584 337222
53981C37222N365M518M952N202M399L913M810N992O466P270R080R907P696L872
$$ 337222 342587 347105 352057 357259 361658 365571 370381 376373 382839 390109 399189 409096 416792 420664
53967D20664J617J622J986J657J318J264P77k88j269k013k694k710j689j100k556
$$ 420664 422281 423903 425889 427546 428864 430128 430905 430617 429348 427335 424641 421931 420242 419142 416586
53952D16586m852n254l785l370n176o675n550l052j782k129k795l286l942m477
$$ 416586 411734 406480 402695 399325 394149 387474 381924 378872 377090 374961 372166 368880 364938 360461
53938C60461m306l727l420l354l322l789m885n332l903j555n53j537k837k745
$$ 360461 356155 352428 349008 345654 342332 338543 333658 328326 324423 322868 322315 320778 317941 315196
53924C15196j323K25J037J075Q20P52Q80P92M65N77J467K250J805M26m19J03J416
$$ 315196 313873 314098 315135 316210 317030 317782 318662 319454 319919 320496 321963 324213 326018 326444 326025 326128 327544
53907C27544K491K723J972N80n07n02J67L92Q3M31K128M312N716O074N781N035
$$ 327544 330035 332758 334730 335310 334803 334301 334468 334860 334943 335374 337502 341814 347530 353604 359385 364420
53891C64420M119L845M714N986O386N579M193K731J406P26J214K398L036K603
$$ 364420 368539 372384 377098 383084 389470 395049 399242 401973 403379 404105 405319 407717 410753 413356
53877D13356J849J603J793J973K119K497L244M330N413N651M421K514J706K662
$$ 413356 415205 416808 418601 420574 422693 425190 428434 432764 438177 443828 448249 450763 452469 455131
53863D55131M113M743M885N512O408O655O390O669P713Q508Q210O980N289L404
$$ 455131 459244 463987 468872 474384 480792 487447 493837 500506 508219 516727 524937 531917 537206 540610
53849E40610J629K49r01k020k572j941q34q80k547m521n453n316m701l933l410
$$ 540610 542239 542488 541587 539567 536995 535054 534220 533340 530793 526272 520819 515503 510802 506869 503459
53834E03459l779m980o010o359o851q210r564r413p679n799n026n377o048o273
$$ 503459 499680 494700 488690 482331 475480 467270 457706 448293 440614 434815 429789 424412 418364 412091
53820D12091n792m896m070l498l229l616m841o016n789m159k619k096j895j352
$$ 412091 406299 401403 397333 393835 390606 386990 382149 376133 370344 366185 363566 361470 359575 358223
53806C58223j114j798k519k196j377j358k120k591k413j952j085L88J386M04k143
$$ 358223 357109 355311 352792 350596 349219 347861 345741 343150 340737 338785 337700 338088 339474 339878 337735
53791C37735l982l734k257r34r1L34p6j446k816l033k003n12P34J414J433R52
$$ 337735 333753 330019 327762 326828 326737 327071 326995 325549 322733 319700 317697 317185 317919 319333 320766 321718
53775C21718M41K78M37O44O56L82l5k54j36P4Q2j64p26j687k517k185n19J211
$$ 321718 322159 322437 322874 323518 324174 324556 324521 324267 324131 324205 324287 324123 323397 321710 319193 317008 316489 317700
53757C17700J967K541M272O641P586O146L568J582P19N65O79Q75J259K145L485
$$ 317700 319667 322208 326480 333121 340707 346853 350421 352003 352722 353287 353966 354841 356100 358245 361730
53742C61730M633N323O189P433P648N569K492J122K038L152K852J803J237J347
$$ 361730 366363 371686 377875 385308 392956 398525 401017 402139 404177 407329 410181 411984 413221 414568
53728D14568J978L021L277R41l538o803o348l598j788k020l051l876m455m531
$$ 414568 416546 419567 422844 423785 420247 413444 407096 403498 401710 399690 396639 392763 388308 383777
53714C83777l592k110j342j736k523k846k571k078j912k392k953k421o27Q37L39
$$ 383777 380185 378075 376733 374997 372474 369628 367057 364979 363067 360675 357722 355301 354674 355511 355850
53699C55850j777l808m697m557l728k473j257l19P36J977K311P88j595k756k086
$$ 355850 354073 350265 345568 341011 337283 334810 333553 333234 333970 335947 338258 339046 337451 334695 332609
53684C32609r16m46n31o72r27j284j098R6J752K817K854K448K608L696M766M331
$$ 332609 331693 331247 330716 330044 329117 327833 326735 326831 328583 331400 334254 336702 339310 343006 347772 352103
53668C52103K160n8n50N01J469J516J295J618K406L179L740M080M183M098L862
$$ 352103 354263 354205 353655 354156 355625 357141 358436 360054 362460 365639 369379 373459 377642 381740 385602
53653C85602L328K526J972K074K446K432K121K049K166K070K082K964M384M880
$$ 385602 388930 391456 393428 395502 397948 400380 402501 404550 406716 408786 410868 413832 418216 423096
53639D23096L851K633K829M224N186M765L697L283L791M181L336J449o3q5J013
$$ 423096 426947 429580 432409 436633 441819 446584 450281 453564 457355 461536 464872 466321 466258 466173 467186
53624D67186J965J957J005n11k043k782k258j079m17o89j247j426j271j158j223
$$ 467186 469151 471108 472113 471602 469559 466777 464519 463440 463023 462334 461087 459661 458390 457232 456009
53609D56009j351j403j369j422j677j646n03J650L278K995J257l58j148j574j910
$$ 456009 454658 453255 451886 450464 448787 447141 446638 448288 451566 454561 455818 455460 454312 452738 450828
53594D50828j852j422r41n4J922M383N549M726L320K919L456L936L940L546K641
$$ 450828 448976 447554 446613 446559 448481 452864 458413 463139 466459 469378 472834 476770 480710 484256 486897
53579D86897J375O51J140K327L311M116N208O211O260N534N219N762O080N076
$$ 486897 488272 488923 490063 492390 495701 499817 505025 511236 517496 523030 528249 534011 540091 545167
53565E45167L300K463L445N313O440O287N764N829O256O166N439M895N112N676
$$ 545167 548467 550930 554375 559688 566128 572415 578179 584008 590264 596430 601869 606764 611876 617552
53551F17552N848N462M961M844N206N539N041L489J675M83j60o43m47J185L374
$$ 617552 623400 628862 633823 638667 643873 649412 654453 657942 659617 660100 659940 659297 658850 660035 663409
53536F63409M013K482N67p0O9k23q02r97j379k819m461m440k489k17J188J912
$$ 663409 667422 669904 670471 670401 670470 670247 669445 668448 667069 664250 659789 655349 652860 652643 653831 655743
53520F55743K044R68j213k982l147k356k052k598l153k860j515L91J775J571p8
$$ 655743 657787 658755 657542 654560 651413 649057 647005 644407 641254 638394 636879 637270 639045 640616 640538
53505F40538j628j780r55n05p51o37N42J926K088R68K56J616M722P475Q229P420
$$ 640538 638910 637130 636175 635670 634919 634282 634824 636750 638838 639806 640062 641678 646400 653875 662104 669524
53489F69524O613O407N993M804L723M175O439R250J0981J0992J0060R553J0037
$$ 669524 676137 682544 688537 693341 697064 701239 707678 716928 727909 738901 748961 758514 768551
53476G68551J0870J1522J2900J6244K0684K3184K1874J8474J6419J7205J9690
$$ 768551 779421 790943 803843 820087 840771 863955 885829 904303 920722 937927 957617
53465I57617K2317K4501K5922K6209K5870K6326K8128K9988L0450K9793K9469
$$ 957617 979934 1004435 1030357 1056566 1082436 1108762 1136890 1166878 1197328 1227121 1256590
53454A256590L0070L0895L1345L1786L2817L4335L5624L6177L6238L6490L7212
$$ 1256590 1286660 1317555 1348900 1380686 1413503 1447838 1483462 1519639 1555877 1592367 1629579
53443A629579L7757L7243L5725L4263L3567L3211L2554L1749L1245L0742K9575
$$ 1629579 1667336 1704579 1740304 1774567 1808134 1841345 1873899 1905648 1936893 1967635 1997210
53432A997210K7829K6210K5027K4107K3663K4098K4929K4923K3676K2163K1273
$$ 1997210 2025039 2051249 2076276 2100383 2124046 2148144 2173073 2197996 2221672 2243835 2265108
53421B265108K0547J8916J6016J2329Q624N794M512M340L686J368k093n372q079
$$ 2265108 2285655 2304571 2320587 2332916 2341540 2347334 2351846 2356186 2359872 2361240 2359147 2353775 2345696
53408B345696j0781j3730j6456j8607k0256k1372k1840k2141k3203k5092k6543
$$ 2345696 2334915 2321185 2304729 2286122 2265866 2244494 2222654 2200513 2177310 2152218 2125675
53397B125675k6464k5409k4918k5509k6104k5660k4678k4474k5200k5448k4018
$$ 2125675 2099211 2073802 2048884 2023375 1997271 1971611 1946933 1922459 1897259 1871811 1847793
53386A847793k1373j8796j6678j4397j1570q546n649k876m93R11J340J718K973
$$ 1847793 1826420 1807624 1790946 1776549 1764979 1756433 1750784 1747908 1747415 1748326 1749666 1751384 1754357
53373A754357N260Q225J1360J3909J5297J6014J7289J9435K1357K2231K2874K4714
$$ 1754357 1759617 1767842 1779202 1793111 1808408 1824422 1841711 1861146 1882503 1904734 1927608 1952322
53361A952322K8097L2221L6048L8710L9833M0246M1625M4572M7827N0054N1581
$$ 1952322 1980419 2012640 2048688 2087398 2127231 2167477 2209102 2253674 2301501 2351555 2403136
53350B403136N3397N5451N7192N8914O1181O3611O5594O7689P0785P4326P6807
$$ 2403136 2456533 2511984 2569176 2628090 2689271 2752882 2818476 2886165 2956950 3031276 3108083
53339C108083P7716P7640P7010P6103P5794P6504P6925P5553P3064P1271P0104
$$ 3108083 3185799 3263439 3340449 3416552 3492346 3568850 3645775 3721328 3794392 3865663 3935767
53328C935767O7898O4438O1220N8602N5243N0823M6649M2865L7700L0646K3770
$$ 3935767 4003665 4068103 4129323 4187925 4243168 4293991 4340640 4383505 4421205 4451851 4475621
53317D475621J8381J2786N152l539j1353j8290k5257l1936l7948m4571n2761o0542
$$ 4475621 4494002 4506788 4511940 4508401 4497048 4478758 4453501 4421565 4383617 4339046 4286285 4225743
53305D225743o4992o6202o6859o8462p0295p1836p3656p5726p6947p6841p6041
$$ 4225743 4160751 4094549 4027690 3959228 3888933 3817097 3743441 3667715 3590768 3513927 3437886
53294C437886p4813p2631o9540o6519o4151o2181o0520n9503n8881n7727n5528
$$ 3437886 3363073 3290442 3220902 3154383 3090232 3028051 2967531 2908028 2849147 2791420 2735892
53283B735892n2498m8821m4700m0955l8443l6858l5197l3316l1771l0324k8073
$$ 2735892 2683394 2634573 2589873 2548918 2510475 2473617 2438420 2405104 2373333 2343009 2314936
53272B314936k5104k2600k1166k0276j9450j8585j7121j4538j1922j1320j2921
$$ 2314936 2289832 2267232 2246066 2225790 2206340 2187755 2170634 2156096 2144174 2132854 2119933
53261B119933j4443j4040j2337j0716r114o771m066k164j272k96J915N543R594
$$ 2119933 2105490 2091450 2079113 2068397 2059283 2052512 2048446 2046282 2045010 2044714 2046629 2052172 2061766
53248B061766J2517J3575J3918J5414J8153K0081J9815J8743J9428K2577K6551
$$ 2061766 2074283 2087858 2101776 2117190 2135343 2155424 2175239 2193982 2213410 2235987 2262538
53237B262538K9386L0454L0354L0000K9878K9832K9499K8908K8292K7433K5782
$$ 2262538 2291924 2322378 2352732 2382732 2412610 2442442 2471941 2500849 2529141 2556574 2582356
53226B582356K3300K0449J7336J3626R389N186J143l097p398j1078j4136j7344
$$ 2582356 2605656 2626105 2643441 2657067 2666456 2671642 2672785 2669688 2662290 2651212 2637076 2619732
53214B619732k0874k4001k6560k9292l2267l4445l5693l7524m0737m3704m4591
$$ 2619732 2598858 2574857 2548297 2519005 2486738 2452293 2416600 2379076 2338339 2294635 2250044
53203B250044m3985m3647m3762m3337m2634m3024m4626m5969m6109m5380m4060
$$ 2250044 2206059 2162412 2118650 2075313 2032679 1989655 1945029 1899060 1852951 1807571 1763511
53192A763511m1906l9499l8340l9045m0390m0732l9419l6696l3343l0693k9829
$$ 1763511 1721605 1682106 1643766 1604721 1564331 1523599 1484180 1447484 1414141 1383448 1353619
53181A353619l0185k9883k7949k5369k3552k2674k2083k1401k0564j9489j8448
$$ 1353619 1323434 1293551 1265602 1240233 1216681 1194007 1171924 1150523 1129959 1110470 1092022
53170A092022j8084j8428j8517j7642j6497j6278j7048j7647j7168j5955j5202
$$ 1092022 1073938 1055510 1036993 1019351 1002854 986576 969528 951881 934713 918758 903556
53159I03556j5820j7500j8787j8412j6748j5446j5457j6002j5833j4823j3701
$$ 903556 887736 870236 851449 833037 816289 800843 785386 769384 753551 738728 725027
53148G25027j2871j2250j1937j2273j3222j4281j4900j4710j3715j2532j2010
$$ 725027 712156 699906 687969 675696 662474 648193 633293 618583 604868 592336 580326
53137E80326j2074j1381q994o027m727n920q098r182q546p211o523o849p274o591
$$ 580326 568252 556871 547877 541850 537123 531203 523105 513923 505377 498166 491643 484794 477520 470929
53123D70929m802l303l187l826l977l690m043n061n353m160k566k027k648l557
$$ 470929 466127 462824 459637 455811 451834 448144 444101 439040 433687 429527 426961 424934 422286 418729
53109D18729m188m448m270l739l134k381j105K98N80o10j797j462o2P97N02m93
$$ 418729 414541 410093 405823 402084 398950 396569 395464 395762 396342 395732 393935 392473 392411 393208 393710 393217
53093C93217j936l558m118k481K59J554N67r97j529j357j282r92k1Q54N49p55
$$ 393217 391281 387723 383605 381124 381383 382937 383504 382507 380978 379621 378339 377347 377326 378180 378729 377974
53077C77974j941k254j585j87J115J236J45p98n50L96J123J557J753J141k60j027
$$ 377974 376033 373779 372194 372007 373122 374358 374503 373705 373155 373551 374674 376231 377984 379125 378865 377838
53061C77838k43O96L0j460j602l78N1r87j479P8K358L200K294O97r61k453l176
$$ 377838 377595 378291 378321 376861 375259 374881 374932 373945 372466 372544 374902 378102 380396 381093 380132 377679 374503
53044C74503k775j925j454j166m85L22N13k8r30k135l477l997k827p57K93l46
$$ 374503 371728 369803 368349 367183 366698 367020 367533 367505 366575 364440 360963 356966 354139 353382 353675 353329
53028C53329j194o23Q89J383P1j397q22J762L825L106R6k624l214k155j161j313
$$ 353329 352135 351512 352401 353784 353855 352458 351636 353398 357223 360329 360425 357801 354587 352432 351271 349958
53012C49958k297l019k667j476m32j22k50o11j754l694m816l610j255n49j975
$$ 349958 347661 344642 341975 340499 340067 339945 339695 339084 337330 333636 328820 325210 323955 323406 321431
52997C21431k821j095J511K076M95p33j06J355K058J811J421J430J606J315K36
$$ 321431 318610 317515 319026 321102 321597 320864 320758 322113 324171 325982 327403 328833 330439 331754 331990
52982C31990j060j490p26L42P87O90N14J48n57j011o17R0nj025k046k327j829
$$ 331990 330930 329440 328714 329056 329843 330533 331047 331195 330638 329627 329010 329100 329095 328070 326024 323697 321868
52965C21868q49O6J80n36r11J9J551K319K300K414K513J578J8k40J385K896K430
$$ 321868 321019 321085 321265 320729 319818 319837 321388 323707 326007 328421 330934 332512 332530 332290 333675 336571 339001
52948C39001P77j19k4j94r57j259n80J28j23j033j569j215j75J137K265K666K058
$$ 339001 339778 339659 339635 339441 338484 337225 336645 336773 336650 335617 334048 332833 332658 333795 336060 338726 340784
52931C40784Q80k0k64k05k01q3K92M55Jl79M47K226L167K139J63r78p99M8J104
$$ 340784 341664 341644 341380 341175 340974 340891 341183 341638 341639 341260 341707 343933 347100 349239 349402 348424 347625 347673 348777
52912C48777K126K431J656Q81J492K967L269J679k51r47p04o32r75j260j228p40
$$ 348777 350903 353334 354990 355871 357363 360330 363599 365278 365027 364080 363376 362744 361769 360509 359281 358541
52896C58541L56J564J655J13j963l123l107k457j425k38K50o30k202l103k875
$$ 358541 358897 360461 362116 362229 360266 357143 354036 351579 350154 349916 350166 349536 347334 344231 341356
52881C41356k079j171k73J81k63j154j497j172j027j450j748j292m01L22Q46J361
$$ 341356 339277 338106 337833 338014 337751 336597 335100 333928 332901 331451 329703 328411 328010 328332 329178 330539
52865C30539J522P48q51k230k202n65J504K363J519J59l00P9K0j095k412k681
$$ 330539 332061 332809 331958 329728 327526 326961 328465 330828 332347 332506 332206 332285 332305 331210 328798 326117
52849C26117j576K14J668K089J615J193J534K075J621R5j222j390q86n35l31k0
$$ 326117 324541 324755 326423 328512 330127 331320 332854 334929 336550 336645 335423 334033 333147 332612 332281 332261
52833C32261k8q31j840j971j130k49j5k97o87q32l35P57J481R59j08M1J822L522
$$ 332261 332233 331402 329562 327591 326461 326212 326197 325900 325213 324381 324046 324803 326284 327243 327135 327176 328998 332520
52815C32520L496K213J296J181Q95j14j066j004r7O79P53M20K13L03O20J161J730
$$ 332520 336016 338229 339525 340706 341601 341487 340421 339417 339320 339999 340752 341172 341385 341688 342308 343469 345199
52798C45199J555m5k268l010j391N40L0k600m044k353N02J389q1j914k866l299
$$ 345199 346754 346709 344441 341431 340040 340580 340610 338010 333966 331613 332115 333504 333423 331509 328643 325344
52782C25344l488l016k016j429j591j871j814j526p60Q12K246J842l13j934j478
$$ 325344 321856 318840 316824 315395 313804 311933 310119 308593 307833 308645 310891 312733 312420 310486 309008
52767C09008j40K14l74o92m52j51K17O58K83j425l056k816j162n1J31P80K200
$$ 309008 308868 309082 308708 308016 307564 307413 307630 308288 308571 307146 304090 301274 300112 300061 300192 300972 303172
52750C03172K775J550k93j405j899k157j702n18J52k55k81J186K562J715m04p59
$$ 303172 305947 307497 307204 305799 303900 301743 300041 299523 299675 299420 299139 300325 302887 304602 304198 303439
52734C03439J253K772J500j327l014k704j424k00M65J57q92j359l73R15P30o05
$$ 303439 304692 307464 308964 307637 304623 301919 300495 300295 300760 300917 300025 298666 298293 299208 299938 299333
52718B99333r52M53J722R61j165k541k316j342n10J8K14K6j20L12J004J109O09
$$ 299333 298381 298834 300556 301517 300352 297811 295495 294153 293643 293661 293875 293901 293781 294093 295097 296206 296815
52701B96815L72O35O44K26M82J939L073J996q13k798k377n23Q08Q68L44K21R43
$$ 296815 297187 297822 298466 298692 299174 301113 304186 306182 305369 302571 300194 299671 300479 301347 301691 301912 302855
52684C02855K264L435L733L107K142J306N19l81j152j400j096n46J18J082K375
$$ 302855 305119 308554 312287 315394 317536 318842 319361 318980 317828 316428 315332 314786 314904 315986 318361
52669C18361L429L321J723m87j813j517k50P90J116J095J117J011L95o38j365
$$ 318361 321790 325111 326834 326347 324534 323017 322767 323557 324673 325768 326885 327896 328291 327653 326288
52654C26288j174m34l60j553k926k692n43J789K391J002j181k812l090j956k85
$$ 326288 325114 324680 324320 322767 319841 317149 316606 318395 320786 321788 320607 317795 314705 312749 312464
52639C12464O87P02P05J298J780J464R77J141J336M23j185j939j450r03r84q45
$$ 312464 313151 313853 314558 315856 317636 319100 320077 321218 322554 322977 321792 319853 318403 317500 316516 315671
52623C15671N36K881M804M739J862k776o266o312l745j311j52P77J890J845J7
$$ 315671 316207 319088 323892 328631 330493 327717 321451 315139 311394 310083 309931 310708 312598 314443 314460
52608C14460j930k247j297l26N43J639K416K374K293K975L551K797J355R31J655
$$ 314460 312530 310283 308986 308660 309203 310842 313258 315632 317925 320900 324451 327248 328603 329534 331189
52593C31189K012J257K63n2K84J054K188L043K530M94j846l086k700j034R08J760
$$ 331189 333201 334458 334721 334669 334953 336007 338195 341238 343768 344262 342416 339330 336630 335596 336504 338264
52577C38264R16n20q35J68J108J121R10J310J929J925J280N69K6m70p79m38P02
$$ 338264 339180 338660 337825 337993 339101 340222 341132 342442 344371 346296 347576 348145 348171 347701 346922 346484 347186
52560C47186K179L188L204K422J509P88j42j635l161l771l260k273j374n36M44
$$ 347186 349365 352553 355757 358179 359688 360476 360334 358699 355538 351767 348507 346234 344860 344324 344768
52545C44768J517K377K570J798N11k41p2J39l11n64N86K520L288K321J110R29
$$ 344768 346285 348662 351232 353030 353541 353300 353228 353367 353056 352492 353078 355598 358886 361207 362317 363246
52529C63246J289J195O40j3q88j802j621K50K306K180m70l373m078k337J27J584
$$ 363246 364535 365730 366370 366357 365469 363667 362046 362296 364602 366782 366312 362939 358861 356524 356651 358235
52513C58235J695J115K77r50k390l171k836k257k456k864k073k30Q74M70q4L62
$$ 358235 359930 361045 361322 360372 357982 354811 351975 349718 347262 344398 342325 342095 342969 343439 343355 343717
52497C43717R04L16p28q52m35r38k188k385q62Q32J227P32N41Q20Q88L73n34j434
$$ 343717 344621 344937 344209 343357 342922 341984 339796 337411 336549 337381 338608 339340 339881 340701 341589 341962 341428 339994
52479C39994j716p31J317L086L272J956L72m16j57Q51K060K811K715K069J608
$$ 339994 338278 337547 338864 341950 345222 347178 347550 347134 346977 347828 349888 352699 355414 357483 359091
52464C59091J726K130K302K094J715J215K58j331k886l168j598R06K644K691J535
$$ 359091 360817 362947 365249 367343 369058 370273 370531 369200 366314 363146 361548 362454 365098 367789 369324
52449C69324L58m1L26R06J227J394J901K792L302K774J645R11P09K28r18k106
$$ 369324 369682 369641 369967 370873 372100 373494 375395 378187 381489 384263 385908 386819 387528 387756 386838 384732
52433C84732k812l346l936l775k028N79K076J279j035l014l365k192p34k53q26
$$ 384732 381920 378574 374638 370863 368835 369414 371490 372769 371734 368720 365355 363163 362429 362176 361350
52418C61350j261n65P65J352O90m54j127j019j75J251K715L510L520L212K770
$$ 361350 360089 359524 360289 361641 362331 361877 360750 359731 359556 360807 363522 367032 370552 373764 376534
52403C76534J934R14M83P95J047Q83J117K205L019K320P48m0K27M24J71L02R64
$$ 376534 378468 379382 379865 380660 381707 382590 383707 385912 388931 391251 391999 391959 392186 392610 392781 393083 394047
52386C94047Q26j048l668n301n273l962j906J41R69j72k470m060l643j391J406
$$ 394047 394873 393825 390157 384856 379583 375621 373715 373856 374825 374653 372183 368123 364480 363089 364495
52371C64495L169K991J369j69m71L34J411K183K457K168J492Q83O28P24J231K246
$$ 364495 367664 370655 372024 371855 371384 371718 373129 375312 377769 379937 381429 382312 382940 383664 384895 387141
52355C87141L298L626L284L150L453L466L181L964O452Q983R523Q272O856N704
$$ 387141 390439 394065 397349 400499 403952 407418 410599 414563 421015 429998 439521 447793 454649 460353
52341D60353L937J376j172l350n192n850m348j726m26j043j672r97j15l03r07
$$ 460353 464290 465666 464494 461144 455952 450102 445754 444028 443602 442559 440887 439890 439775 439472 438565
52326D38565q48n74r09j129j3J939K995K612J945K190L480N171O289O099N054
$$ 438565 437717 437143 436234 435105 435092 437031 440026 442638 444583 446773 450253 455424 461713 467812 472866
52311D72866M688N616O405N687M506M897O752Q002P791P292P120O207M165K802
$$ 472866 477554 483170 489575 495262 499768 504665 511417 519419 527210 534502 541622 547829 551994 554796
52297E54796L651N434N706M313L396M231N689O083N306M585M886O161P779R284
$$ 554796 558447 563881 569587 573900 577296 581527 587216 593299 598605 603190 608076 614237 622016 631300
52283F31300J0718J2282J3763J4631J4917J5557J7279J9434K0715K0883K0924
$$ 631300 642018 654300 668063 682694 697611 713168 730447 749881 770596 791479 812403
52272H12403K1461K2038K2316K2970K4623K6673K8091K8872K9639L0242K9937
$$ 812403 833864 855902 878218 901188 925811 952484 980575 1009447 1039086 1069328 1099265
52261A099265K8923K8324K8369K7862K6006K3689K2175K1474K0863K0086J9008
$$ 1099265 1128188 1156512 1184881 1212743 1238749 1262438 1284613 1306087 1326950 1347036 1366044
52250A366044J6841J3243R619P872P857P596O071M265L098J911j13k302l393l305
$$ 1366044 1382885 1396128 1405747 1413619 1421476 1429072 1435143 1439408 1442506 1444417 1444304 1442002 1438609 1435304
52236A435304k979k989l232l552l789l491k378r52lL81Q62K025L848N777P094
$$ 1435304 1432325 1429336 1426104 1422552 1418763 1415272 1412894 1411942 1411939 1412320 1413182 1415207 1419055 1424832 1431926
52221A431926P609Q119R548J1438J2257J1734J1641J3251J5217J5515J4647J4931
$$ 1431926 1439535 1447654 1457202 1468640 1480897 1492631 1504272 1517523 1532740 1548255 1562902 1577833
52209A577833J6790J7935J6658J4107J2342J1517J0220P690M499J528p56k270
$$ 1577833 1594623 1612558 1629216 1643323 1655665 1667182 1677402 1685092 1689591 1691119 1690363 1688093
52197A688093l413m919p023r032j0250j1028j2146j3433j3822j2864j1476j0837
$$ 1688093 1684680 1679761 1672738 1663706 1653456 1642428 1630282 1616849 1603027 1590163 1578687 1567850
52185A567850j1160j1891j2781j4167j6079j7613j7731j6660j5846j6083j6267
$$ 1567850 1556690 1544799 1532018 1517851 1501772 1484159 1466428 1449768 1433922 1417839 1401572
52174A401572j4784j1910r632q976q686p268n240m208m384m455l659k625j957
$$ 1401572 1386788 1374878 1365246 1356270 1347584 1340316 1335076 1330868 1326484 1322029 1318370 1315745 1313788
52161A313788j432r94j222j962j661P44M036O059O378O205O094N312L711K542
$$ 1313788 1312356 1311362 1310140 1308178 1306517 1307261 1311297 1317356 1323734 1329939 1336033 1341345 1345056 1347598
52147A347598K671L278L239K754K595K656K374J965K014K353K543K911L757L962
$$ 1347598 1350269 1353547 1356786 1359540 1362135 1364791 1367165 1369130 1371144 1373497 1376040 1378951 1382708 1386670
52133A386670K093j133l269l205k227j512n34J187K585K750K710L784N077M513
$$ 1386670 1388763 1387630 1384361 1381156 1378929 1377417 1376883 1378070 1380655 1383405 1386115 1389899 1394976 1399489
52119A399489J902o90j567r31J21P71M93q88k805m475n830p075p516o039k902
$$ 1399489 1401391 1400701 1399134 1398203 1398324 1399095 1399588 1398700 1395895 1391420 1385590 1378515 1370999 1364960 1362058
52104A362058J71J976K855L417L521L130L145M358O235P577Q035Q282Q931R840
$$ 1362058 1362229 1364205 1367060 1370477 1373998 1377128 1380273 1384631 1390866 1398443 1406478 1414760 1423691 1433531
52090A433531J0390J0129R256Q606Q866R764J0463J0827J1626J3268J5079J6270
$$ 1433531 1443921 1454050 1463306 1471912 1480778 1490542 1501005 1511832 1523458 1536726 1551805 1568075
52078A568075J6996J7857J8890J9712K0370K1283K2437K3277K3561K3823K4703
$$ 1568075 1585071 1602928 1621818 1641530 1661900 1683183 1705620 1728897 1752458 1776281 1800984
52067A800984K6042K7010K7191K7172K7760K8721K8927K7828K6159K4785K3692
$$ 1800984 1827026 1854036 1881227 1908399 1936159 1964880 1993807 2021635 2047794 2072579 2096271
52056B096271K2729K2452K3012K2855K0165J5456J1197Q630O544L626L53k307
$$ 2096271 2119000 2141452 2164464 2187319 2207484 2222940 2234137 2242767 2249311 2252937 2253290 2250983
52044B250983m621p370j0484j3427j6071j8135j8712j7546j5869j4735j3415j0966
$$ 2250983 2246362 2238992 2228508 2215081 2199010 2180875 2162163 2144617 2128748 2114013 2100598 2089632
52032B089632q529q044r037q810o147k858j027l96M37J661K481K958M140O489
$$ 2089632 2081103 2073059 2064022 2055212 2049065 2046207 2045180 2044784 2045221 2046882 2049363 2052321 2056461 2062950
52018B062950R228J1416J2894J3986J4768J5009J4593J3670J2425J0908R228P752
$$ 2062950 2072178 2083594 2096488 2110474 2125242 2140251 2154844 2168514 2180939 2191847 2201075 2208827
52006B208827O866O494O133N282L687J221j880m716o489p914j0822j5620j9972
$$ 2208827 2215693 2222187 2228320 2233602 2237289 2238510 2236630 2231914 2225425 2217511 2206689 2191069 2171097
51993B171097k1261j9951j9115k0740k3786k6150k7119k7220k6820k6031k5389
$$ 2171097 2149836 2129885 2110770 2090030 2066244 2040094 2012975 1985755 1958935 1932904 1907515
51982A907515k5484k6040k6293k6254k6761k7918k8306k6562k3386k1088k0925
$$ 1907515 1882031 1855991 1829698 1803444 1776683 1748765 1720459 1693897 1670511 1649423 1628498
51971A628498k1704k1537k0126j8374j6389j3576j0740j0146j2553j5574j6458
$$ 1628498 1606794 1585257 1565131 1546757 1530368 1516792 1506052 1495906 1483353 1467779 1451321
51960A451321j5383j4504j4680j5050j5363j6452j8169j8945j8166j7268j7599
$$ 1451321 1435938 1421434 1406754 1391704 1376341 1359889 1341720 1322775 1304609 1287341 1269742
51949A269742j8609j9291j9949k1163k2084k1402j9527j8134j7703j6970j5056
$$ 1269742 1251133 1231842 1211893 1190730 1168646 1147244 1127717 1109583 1091880 1074910 1059854
51938A059854j2909j1958j2231j2586j2343j1903j1734j1477j0500r063q248q548
$$ 1059854 1046945 1034987 1022756 1010170 997827 985924 974190 962713 952213 943150 934902 926354
51926I26354r064q629p237n788m746l917l341l465m306n317o298p640r426j1071
$$ 926354 917290 908661 901424 895636 890890 886973 883632 880167 875861 870544 864246 856606 847180 836109
51912H36109j2083j2387j1773r937p412n425m469l966l609l771m061l036l59K095
$$ 836109 824026 811639 799866 789929 782517 777092 772623 768657 765048 761277 757216 754180 753821 755916
51898G55916K614J983K072L020L493L060K520K285K000J557J036%j632k435j024
$$ 755916 758530 760513 762585 765605 769098 772158 774678 776963 778963 780520 781556 781556 779924 777489 776465
51883G76465J430K213Q38k55P62K846M212M839N509N939N537N127O275R113J2028
$$ 776465 777895 780108 780946 780691 781453 784299 788511 793350 798859 804798 810335 815462 821737 830850 842878
51868H42878J3432J3070J1812J0739J0212R420P220L727M46j659l555o815j1398
$$ 842878 856310 869380 881192 891931 902143 911563 918783 922510 922956 921297 917742 910927 899529
51855H99529j5528j7632j7880j7858j9005k1161k2625k1939j9507j6839j4428
$$ 899529 884001 866369 848489 830631 811626 790465 767840 745901 726394 709555 695127
51844F95127j1577q299n921n187n103m473l389k322j020N59J523J586K142M097
$$ 695127 683550 675251 669330 664143 659040 654567 651178 648856 647836 648395 649918 651504 653646 657743
51830F57743N803N097K603P03k33k036n109p221o738m904l779l611l495l094k452
$$ 657743 663546 668643 671246 671949 671716 669680 664571 657350 650612 645708 641929 638318 634823 631729 629277
51815F29277j270L28J297J151R94J896L066L050K092J760K584L451L285K037J09
$$ 629277 628007 628335 629632 630783 631777 633673 636739 639789 641881 643641 646225 649676 652961 654998 655107
51800F55107k017l463l491k638k279k731k894k101j259j369j900j677p29j02o
$$ 655107 653090 649627 646136 643498 641219 638488 635594 633493 632234 630865 628965 627288 626559 626457 626451
51785F26451N31J866K708J700n88k191k128j404j404k201l084m075n813p928q714
$$ 626451 626982 628848 631556 633256 632668 630477 628349 626945 625541 623340 620256 616181 610368 602440 593726
51770E93726p060m069j900j340j360j054r63j980l666m598m207l447l424m029
$$ 593726 586666 582597 580697 579357 577997 576943 575980 574000 570334 565736 561529 558082 554658 550629
51756E50629m365m069l592l304k999k369j463m57O34J699K315K140J407P60P27
$$ 550629 546264 542195 538603 535299 532300 529931 528468 528011 528645 530344 532659 534799 536206 536966 537693
51741E37693J366K199K379J360l50j556j835k090l127m242m072k602j342j408
$$ 537693 539059 541258 543637 544997 544647 543091 541256 539166 536039 531797 527725 525123 523781 522373
51727E22373k297k768k227r06O47J811K082J527P96M66O49J291K403L655M216
$$ 522373 520076 517308 515081 514175 514822 516633 518715 520242 521038 521504 522153 523444 525847 529502 533718
51712E33718L488J843L64l6Q36K500M160N336O209P101P663P178N739M499M259
$$ 533718 537206 539049 539413 539377 540213 542713 546873 552209 558418 565519 573182 580360 586099 590598 594857
51697E94857M384L703K112O74L14Q55J286N26j856n178p887q706p651n878m579
$$ 594857 599241 602944 605056 605730 606044 606899 608185 608711 606855 601677 593790 585084 577433 571555 566976
51682E66976m234m604n067m940l906k397j320j159j402j005M20K055K761K434
$$ 566976 562742 558138 553071 548131 544225 541828 540508 539349 537947 536942 537362 539417 542178 544612
51668E44612J979J905J639P74K46J290L376M353K781n86l722n052m217k182q11
$$ 544612 546591 548496 550135 550909 551155 552445 555821 560174 562955 562369 558647 553595 549378 547196 546385
51653E46385j449l395m558l977k853k679l295l501k788j573k58J067K320L322
$$ 546385 544936 541541 536983 533006 530153 527474 524179 520678 517890 516317 516059 517126 519446 522768
51639E22768L799L226J409n74r71M87J993J987J098Q07J250J526J453J527J647
$$ 522768 526567 529793 531202 530628 529657 530144 532137 534124 535222 536029 537279 538805 540258 541785 543432
51624E43432J293O58L49K53j66p87j197j718k732l383k499o06N42M34K23O59J264
$$ 543432 544725 545383 545732 545985 545819 545032 543835 542117 539385 536002 533503 532897 533439 533873 534096 534755 536019
51607E36019J807K938M794O351O775O286N305L981K830K486K394J228r24k242
$$ 536019 537826 540764 545558 551909 558684 564970 570275 574256 577086 579572 581966 583194 582270 580028
51593E80028j706l84N08J156J802J515j96k004k462k008j730j332j65N87j082
$$ 580028 578322 577938 578446 579602 581404 582919 582723 580719 578257 576249 574519 573187 573022 573609 572527
51578E72527m941q319r106p556n127k970j756j639j890j403k1J292J626R39j83
$$ 572527 567586 559267 550161 542605 537478 534508 532752 531113 529223 527820 527799 529091 530717 531656 531473
51563E31473r03m63J052K295J941K92j107j369r59o06n08o44r84j210j086j075
$$ 531473 530570 530107 531159 533454 535395 535687 534580 533211 532252 531646 531138 530494 529510 528300 527214 526139
51547E26139j803k856l029j884j81J286K281K495J591K64J29J871M448O589Q037
$$ 526139 524336 521480 518451 516567 516386 517672 519953 522448 524039 524303 524432 526303 530751 537340 545377
51532E45377Q701P858N341K511P07n83k523m398m098j220J998L405L290L167L472
$$ 545377 554078 561936 567277 569788 570495 569912 567389 562991 558893 557673 559671 563076 566366 569533 573005
51517E73005L644L699M257N258N948O291P302R523J2081J3748J4337J4439J4394
$$ 573005 576649 580348 584605 589863 595811 602102 609404 618927 631008 644756 659093 673532 687926
51504F87926J4260J4297J4681J4972J4759J4733J6206J9327K2644K4714K5498
$$ 687926 702186 716483 731164 746136 760895 775628 791834 811161 833805 858519 884017
51493H84017K5832K6237K6666K6697K5425K1774J5854R615N270L027J030k489
$$ 884017 909849 936086 962752 989449 1014874 1036648 1052502 1062117 1067387 1070414 1071444 1068955
51481A068955p608j3155j7976k1461k3526k4599k5420k6365k7034k6689k5015
$$ 1068955 1061347 1048192 1030216 1008755 985229 960630 935210 908845 881811 855122 830107
51470H30107k2362j9365j6611j4581j3496j2872j1505q556m877k695l423o024
$$ 830107 807745 788380 771769 757188 743692 730820 719315 710759 705882 703187 699764 693740
51458F93740q141q592q096p676p403o986o628o639o772o633o338o172o071n957
$$ 693740 685599 677007 668911 661235 653832 646846 640218 633579 626807 620174 613836 607664 601593 595636
51444E95636o140o711p070o769o444o890p515o799m414j896q41j201j784j762
$$ 595636 589496 582785 575715 568946 562502 555612 548097 541298 536884 534988 534147 532946 531162 529400
51430E29400j247p64p46j250j823j807j108m77o60j326j303j0J583J858L82j508
$$ 529400 528153 527389 526643 525393 523570 521763 520655 520178 519518 518192 516889 516879 518462 520320 520702 519194
51414E19194k231j806j680k854m766o102o127m948l121j469p87j155j796j970
$$ 519194 516963 515157 513477 510623 505857 499755 493628 488680 485559 484090 483303 482148 480352 478382
51400D78382j683j156j28J528L000L213K232J186P07K99m14n80J045M267P047
$$ 478382 476699 475543 475415 476943 479943 483156 485388 486574 487281 487580 487166 486586 487631 491898 498945
51385D98945P307N127K750K171L054L570K925K098K029K348K410K535L216M060
$$ 498945 506252 511379 514129 516300 519354 522924 525849 527947 529976 532324 534734 537269 540485 544545
51371E44545M513M990N939O342M645J162j761k358j210j64k94j232j893j520l98
$$ 544545 549058 554048 559987 566329 570974 572136 570375 568017 566807 566643 566349 565117 563224 561704 561306
51356E61306L76J70l89m20j45m56j332j664o18J443L304L584J551j781l841k965
$$ 561306 561682 561852 561463 561043 560898 560442 559110 557446 556828 558271 561575 565159 566710 564929 561088 558123
51340E58123l95J242J163P72J141J990L114M922O962P742O897O124O981Q968J0661
$$ 558123 557728 558970 560133 560905 562046 564036 567150 572072 579034 586776 593673 599797 606778 615746 626407
51325F26407J1672J2433J3076J3555J4224J5490J7399J9996K3321K6712K9258
$$ 626407 638079 650512 663588 677143 691367 706857 724256 744252 767573 794285 823543
51314H23543L1293L3951L6676L6964L3813K9811K8063K8280K7573K4162J8467
$$ 823543 854836 888787 925463 962427 996240 1026051 1054114 1082394 1109967 1134129 1152596
51303A152596J1442L844l272r244j4885k1231k7443l1611l3424l4328l5057l4956
$$ 1152596 1164038 1167882 1164610 1155366 1140481 1119250 1091807 1060196 1026772 992444 957387 922431
51291I22431l3875l2872l2363l1258k8742k5626k3112k1265j9507j7669j5908
$$ 922431 888556 855684 823321 792063 763321 737695 714583 693318 673811 656142 640234
51280F40234j4275j2919j1986j1100r785q529q265q462p337m653k744l471n411
$$ 640234 625959 613040 601054 589954 580169 571640 563375 554913 547576 542923 540179 536708 531297
51267E31297n723l982k309k071k331j867j072j027j766k337k075j048L39J499
$$ 531297 525574 521592 519283 517212 514881 513014 511942 510915 509149 506812 504737 503689 504028 505527
51253E05527J683N53j054j607m78J147J394k74k533l742l624l159l169l535l652
$$ 505527 507210 507763 506709 505102 504624 505771 507165 506891 504358 500616 496992 493833 490664 487129 483477
51238D83477l079j689K67K035K794K444J658R90L84j99l42J29M50k33j423j547
$$ 483477 480398 478709 478976 481011 483805 486249 487907 488897 489281 489082 488740 488869 489319 489086 487663 486116
51222D86116J16K425L651L378K687K721L543M266L991K491M34j013j034P0J129
$$ 486116 486232 488657 492308 495686 498373 501094 504637 508903 512894 515385 515819 514806 513772 513842 514971
51207E14971J288Q02N33Q11J221J444J746K299K454J334q01k424k449j616j577
$$ 514971 516259 517061 517594 518405 519626 521070 522816 525115 527569 528903 528102 525678 523229 521613 520036
51192E20036k698l600l244k520k846l794l505j590j07p92k551l059k076j443k012
$$ 520036 517338 513738 510494 507974 505128 501334 497829 496239 496132 495340 492789 489730 487654 486211 484199
51177D84199k472j777r98j571k894l120j931r20j158j661q40J310L218L626K852
$$ 484199 481727 479950 478952 477381 474487 471367 469436 468516 467358 465697 464857 466167 469385 473011 475863
51162D75863K141K267K931L332K928J723K06q46q71j03O34R31J127J349R58k74
$$ 475863 478004 480271 483202 486534 489462 491185 491391 490545 489674 489571 490205 491136 492263 493612 494570 494296
51146D94296j164m34J302K261K038J855K137J629k84k016j735J90J862K139J218
$$ 494296 493132 492698 494000 496261 498299 500154 502291 503920 503636 501620 499885 500075 501937 504076 505294
51131E05294j67r66k19J579K323Q75j103j394m39l18j143q05J568M121M833L748
$$ 505294 505127 504161 503942 505521 507844 508719 507616 506222 505783 505465 504322 503517 505085 509206 514039 517787
51115E17787J885k64k148k596j244M72R00J39o12r04j133j273o63R55L013M670
$$ 517787 519672 519408 517260 514664 513420 513892 514792 514931 514319 513415 512282 511009 510346 511301 514314 518984
51099E18984N300M597K741M57j438k561k964k938k926l198l431k965j713l00Q21
$$ 518984 524284 528881 531622 532079 530641 528080 525116 522178 519252 516054 512623 509658 507945 507645 508466
51084E08466J722K252J722j24k393l833l913k725n44J824L025K442J148O90J137
$$ 508466 510188 512440 514162 514038 511645 507812 503899 501174 500630 502454 505479 507921 509069 509759 510896
51069E10896J302P82N88J493K703K805J585K96L12J874L964N093M420K489Q31
$$ 510896 512198 512980 513568 515061 517764 520569 522154 522450 522762 524636 528600 533693 538113 540602 541433
51054E41433M80Q58N56o74j318QK434L615K694J436J779L235L749K614J198Q25
$$ 541433 541913 542771 543327 542653 541335 541343 543777 547392 550086 551522 553301 556536 560285 562899 564097 564922
51038E64922J264J630J618J283N10m18m67J043L261M501M073K882K339L011M200
$$ 564922 566186 567816 569434 570717 571227 570809 570342 571385 574646 579147 583220 586102 588441 591452 595652
51023E95652M548L321J342L26R58K150K552K213K050K212K076J717K154L755N280
$$ 595652 600200 603521 604863 605189 606147 608297 610849 613062 615112 617324 619400 621117 623271 627026 632306
51008F32306N276L941K850K990L799M256M332M915O538Q672J0293J0762J0156
$$ 632306 637582 641523 644373 647363 651162 655418 659750 664665 671203 679875 690168 700930 711086
50995G11086R112Q534Q976J0058J0787J0821J0897J1510J1667R935O617L771K800
$$ 711086 720198 728732 737708 747766 758553 769374 780271 791781 803448 813383 820000 823771 826571
50982H26571K861K156R5k396m172m796m444l584k818k684l462n157p377r215r681
$$ 826571 829432 831588 831683 829287 825115 820319 815875 812291 809473 806789 803327 798170 790793 781578 771897
50967G71897q651p078n978n372m537l085j442k14O40J783L552N222N666M942M524
$$ 771897 763246 756168 750190 744818 740281 737196 735754 735540 736180 737963 741515 746737 752403 757345 761869
50952G61869N391O532O402N513O157R272J2881J4379J3339J1403J0201J0254J1249
$$ 761869 767260 773792 780194 785707 791864 801136 814017 828396 841735 853138 863339 873593 884842
50939H84842J2480J3312J3835J4740J6046J6642J5752J4259J3667J4180J4748
$$ 884842 897322 910634 924469 939209 955255 971897 987649 1001908 1015575 1029755 1044503
50928A044503J4749J4551J4512J4348J3768J3060J2888J3747J5576J7608J8882
$$ 1044503 1059252 1073803 1088315 1102663 1116431 1129491 1142379 1156126 1171702 1189310 1208192
50917A208192J9298J9830K1264K3265K5275K7712L1299L5529L9104M1847M4949
$$ 1208192 1227490 1247320 1268584 1291849 1317124 1344836 1376135 1411664 1450768 1492615 1537564
50906A537564M9050N3245N6541N9403O3055O7775P2641P6710P9714Q1654Q2326
$$ 1537564 1586614 1639859 1696400 1755803 1818858 1886633 1959274 2035984 2115698 2197352 2279678
50895B279678Q1540P9539P6897P3894P0203O5268N8961N1694M3988L6246K8826
$$ 2279678 2361218 2440757 2517654 2591548 2661751 2727019 2785980 2837674 2881662 2917908 2946734
50884B946734K1914J5217Q265J167n290j0484j4538j7979k1284k4749k8107l0291
$$ 2946734 2968648 2983865 2992130 2993297 2988007 2977523 2962985 2945006 2923722 2898973 2870866 2840575
50872B840575l0483k9632k9857l1899l4424l6378l8535m1575m4184m4986m5240
$$ 2840575 2810092 2780460 2750603 2718704 2684280 2647902 2609367 2567792 2523608 2478622 2433382
50861B433382m7388n1319n4419n5368n5618n6553n7181n5760n2189m7813m3931
$$ 2433382 2385994 2334675 2280256 2224888 2169270 2112717 2055536 1999776 1947587 1899774 1855843
50850A855843m1355m0357m0117l9054l6544l3527l0914k8453k5880k3882k2757
$$ 1855843 1814488 1774131 1734014 1694960 1658416 1624889 1593975 1565522 1539642 1515760 1493003
50839A493003k1273j8329j5107j3797j4520j5081j3819j1322q978p181n613m243
$$ 1493003 1471730 1453401 1438294 1424497 1409977 1394896 1381077 1369755 1360777 1353596 1347983 1343740
50827A343740l138j867M3K180L591M114M761O398Q481R700R822J0221J2255J5534
$$ 1343740 1340602 1338735 1338778 1340958 1344549 1348663 1353424 1359822 1368303 1378003 1387825 1398046 1410301 1425835
50813A425835J8392J9809K0340K1275K3427K6702L0269L3146L5131L7225M0539
$$ 1425835 1444227 1464036 1484376 1505651 1529078 1555780 1586049 1619195 1654326 1691551 1732090
50802A732090M4965M9403N3312N7116O1059O4684O7816P1182P5573Q1123Q7830
$$ 1732090 1777055 1826458 1879770 1936886 1997945 2062629 2130445 2201627 2277200 2358323 2446153
50791B446153R5858J04816J13530J21380J29085J37355J45484J52335J58145J64109
$$ 2446153 2542011 2646827 2760357 2881737 3010822 3148177 3293661 3445996 3604141 3768250
50781C768250J70291J75186J77555J77712J76514J73704J67843J57768J43819
$$ 3768250 3938541 4113727 4291282 4468994 4645508 4819212 4987055 5144823 5288642
50772E288642J27356J09085Q8402O5066M1192K0099K750j3130k9402m4384n5051
$$ 5288642 5415998 5525083 5613485 5678551 5719743 5739842 5742592 5729462 5700060 5655676 5600625
50761E600625o1302o5758o9689p1538p0034o6501o3086o0569n9353o0990o6561
$$ 5600625 5539323 5473565 5403876 5332338 5262304 5195803 5132717 5072148 5012795 4951805 4885244
50750D885244p4269q0755q4893q8735r4521j02209j10378j18086j24912j30042
$$ 4885244 4810975 4730220 4645327 4556592 4462071 4359862 4249484 4131398 4006486 3876444
50740C876444j32571j32439j30368j26980j22496j17063j10789j03628r5788q8096
$$ 3876444 3743873 3611434 3481066 3354086 3231590 3114527 3003738 2900110 2804322 2716226
50730B716226q1208p4505o6727n7921m9946m4442m0977l7875l4342l0918k8083
$$ 2716226 2635018 2560513 2493786 2435865 2385919 2341477 2300500 2262625 2228283 2197365 2169282
50719B169282k5463k2658k0073j8544j8378j8908j8919j7689j5920j5184j5935
$$ 2169282 2143819 2121161 2101088 2082544 2064166 2045258 2026339 2008650 1992730 1977546 1961611
50708A961611j6578j5561j3955j4414j7392k0140k0216j8476j7367j7463j7350
$$ 1961611 1945033 1929472 1915517 1901103 1883711 1863571 1843355 1824879 1807512 1790049 1772699
50697A772699j6132j4240j1945q887n388k725j404k60K044N458R094J2655J6486
$$ 1772699 1756567 1742327 1730382 1721495 1716107 1713382 1711978 1711718 1713762 1719220 1728314 1740969 1757455
50684A757455K0663K4795K8610L2204L5790L9544M3682M8322N3243N7962O2105
$$ 1757455 1778118 1802913 1831523 1863727 1899517 1939061 1982743 2031065 2084308 2142270 2204375
50673B204375O5683O9015P2440P6076P9896Q3944Q8117R1780R3971R4236R2922
$$ 2204375 2270058 2339073 2411513 2487589 2567485 2651429 2739546 2831326 2925297 3019533 3112455
50662C112455R0551Q7449Q4221Q1614P9078P4312O5510N3653M1295K9373J6723
$$ 3112455 3203006 3290455 3374676 3456290 3535368 3609680 3675190 3728843 3770138 3799511 3816234
50651C816234K703j1361k3844l4280m2423m7346m8800m8344m7777m7091m5127
$$ 3816234 3818937 3807576 3783732 3749452 3707029 3659683 3610883 3562539 3514762 3467671 3422544
50640C422544m1742l8054l4998l2788l1564l1406l1907l2729l4524l8220m3549
$$ 3422544 3380802 3342748 3307750 3274962 3243398 3211992 3180085 3147356 3112832 3074612 3031063
50629C031063m9146n3974n7698n9905o0306n9625n8952n8032n5482n0994m5877
$$ 3031063 2981917 2927943 2870245 2810340 2750034 2690409 2631457 2573425 2517943 2466949 2421072
50618B421072m0978l5502k8692k1276j4303p699j224M277Q039J1117J5345K0871
$$ 2421072 2380094 2344592 2315900 2294624 2280321 2272622 2271398 2275675 2283714 2294831 2310176 2331047
50606B331047K6063K9662L1662L2277L1584L0465L0449L1965L3742L4590L4904
$$ 2331047 2357110 2386772 2418434 2450711 2482295 2512760 2543209 2575174 2608916 2643506 2678410
50595B678410L5855L7730L9800M1398M2684M4499M7649N1951N6039N8759O0696
$$ 2678410 2714265 2751995 2791795 2833193 2875877 2920376 2968025 3019976 3076015 3134774 3195470
50584C195470O3507O7711P2174P5998P9579Q3185Q5873Q6915Q7048Q6897Q5127
$$ 3195470 3258977 3326688 3398862 3474860 3554439 3637624 3723497 3810412 3897460 3984357 4069484
50573D069484Q0021P2492O5538O0576N6121N0599M4646L9460L4140K6195J4317
$$ 4069484 4149505 4221997 4287535 4348111 4404232 4454831 4499477 4538937 4573077 4599272 4613589
50562D613589m68j6020l0373m1866m9241n2405n2711n1801m9997m6196l9673l1860
$$ 4613589 4613121 4597101 4566728 4524862 4475621 4423216 4370505 4318704 4268707 4222511 4182838 4150978
50550D150978k5558k2080j9715j5998j1124q152r687j5437k3367l2098m1342n0833
$$ 4150978 4125420 4103340 4083625 4067627 4056503 4048351 4038664 4023227 3999860 3967762 3926420 3875587
50538C875587o0082o8947p7416q4791r0042r3114r5154r6989r7908r6468r2263
$$ 3875587 3815505 3746558 3669142 3584351 3494309 3401195 3306041 3209052 3111144 3014676 2922413
50527B922413q6511q0888p6188p2279o8895o5861o2499n7698n1325m4995m0300
$$ 2922413 2835902 2755014 2678826 2606547 2537652 2471791 2409292 2351594 2300269 2255274 2214974
50516B214974l6465l1149k3849j7013j2846j0469p649m303k150j313M96M844J0531
$$ 2214974 2178509 2147360 2123511 2106498 2093652 2083183 2075534 2071231 2069081 2067768 2068264 2073108 2083639
50503B083639J5599J9851K4056K7890L0295L1417L2535L4303L6383L8887M2654
$$ 2083639 2099238 2119089 2143145 2171035 2201330 2232747 2265282 2299585 2335968 2374855 2417509
50492B417509M7537N1687N3424N3235N2967N3671N5104N7046N9899O3801O8007
$$ 2417509 2465046 2516733 2570157 2623392 2676359 2730030 2785134 2842180 2902079 2965880 3033887
50481C033887P1771P5288P9362Q4487R0707R8009J06222J14729J22839J30600
$$ 3033887 3105658 3180946 3260308 3344795 3435502 3533511 3639733 3754462 3877301 4007901
50471D007901J38790J48044J58171J68364J77726J85652J92136J97743K02895
$$ 4007901 4146691 4294735 4452906 4621270 4798996 4984648 5176784 5374527 5577422
50462E577422K07121K09284K08535K04658J97601J87386J74429J59161J41131
$$ 5577422 5784543 5993827 6202362 6407020 6604621 6792007 6966436 7125597 7266728
50453G266728J19415R4229O7266L9821J1616j7655m6512p2592r4793j13254j27677
$$ 7266728 7386143 7480372 7547638 7587459 7599075 7581420 7534908 7462316 7367523 7254269 7126592
50442G126592j37139j41567j41916j38663j31294j19661j04858q8336p1110n4096
$$ 7126592 6989453 6847886 6705970 6567307 6436013 6316352 6211494 6123158 6052048 5997952
50432E997952l8185k3536r922J610Q410Q341J373j1474k9522n1674p5233r7139
$$ 5997952 5959767 5936231 5926309 5927919 5936329 5944670 5946043 5934569 5905047 5853373 5778140 5681001
50420E681001j16221j33129j48224j60693j69777j75733j79240j80500j79210
$$ 5681001 5564780 5431651 5283427 5122734 4952957 4777224 4597984 4417484 4238274
50411D238274j75053j68181j59500j50220j40786j30676j19787j09362j00634
$$ 4238274 4063221 3895040 3735540 3585320 3444534 3313858 3194071 3084709 2984075
50402B984075r2989q4777p5789o7603o1299n6094n0767m5247m0131l5453l0856
$$ 2984075 2891086 2806309 2730520 2662917 2601618 2545524 2494757 2449510 2409379 2373926 2343070
50391B343070k6391k2333j8491j4355r788n195j109K133M586O771R171J1443J2542
$$ 2343070 2316679 2294346 2275855 2261500 2251712 2246517 2245408 2247541 2252127 2258898 2268069 2279512 2292054
50378B292054J1954J0427R142Q553Q346Q193Q156Q555R764J1930J4715J7453J9686
$$ 2292054 2304008 2314435 2323577 2332130 2340476 2348669 2356825 2365380 2375144 2387074 2401789 2419242 2438928
50365B438928K1312K2407K3461K5607K9723L5075L9838M3253M6341N0120N4331
$$ 2438928 2460240 2482647 2506108 2531715 2561438 2596513 2636351 2679604 2725945 2776065 2830396
50354B830396N8682O4048P1145P8913Q5642R1078R6021J00290J02725J03012J01958
$$ 2830396 2889078 2953126 3024271 3103184 3188826 3279904 3375925 3476215 3578940 3681952 3783910
50343C783910R9906R6437R1681Q6360Q0174P1750O0745M8487L5781K1597N017
$$ 3783910 3883816 3980253 4071934 4158294 4238468 4310218 4370963 4419450 4455231 4476828 4481845
50332D481845j2936l0564m7383o3280p6751q5881r0794r3498r5181r4934r1417
$$ 4481845 4468909 4438345 4390962 4327682 4250931 4165050 4074256 3980758 3885577 3790643 3699226
50321C699226q4663p5901o6384n6664m6524l5501k3940j3458n798j349N80L05
$$ 3699226 3614563 3538662 3472278 3415614 3369090 3333589 3309649 3296191 3290393 3289044 3289624 3289929
50309C289929k583q289j6370k6233l7172m7992n7588o5989p3749q0218q3679q3678
$$ 3289929 3287346 3279057 3262687 3236454 3199282 3151290 3093702 3027713 2953964 2873746 2790067 2706389
50297B706389q1997q0627p9841p8938p7673p5810p2340o6690o0172n4645n0000
$$ 2706389 2624392 2543765 2463924 2384986 2307313 2231503 2159163 2092473 2032301 1977656 1927656
50286A927656m4559l7951l1946k7997k5542k3549k2246k2135k2340k1524j9873
$$ 1927656 1883097 1845146 1813200 1785203 1759661 1736112 1713866 1691731 1669391 1647867 1627994
50275A627994j8636j7892j6355j3678j1329j0384r804q132n965n215o146o744
$$ 1627994 1609358 1591466 1575111 1561433 1550104 1539720 1529916 1521784 1515819 1510604 1504458 1497714
50263A497714n424l025j444j215j364j152r14j238k142l229m205n034n841o665
$$ 1497714 1492290 1489265 1487821 1486606 1485242 1484090 1483176 1481938 1479796 1476567 1472362 1467328 1461487 1454822
50249A454822p151o638m834k341q5J550K733L577M106M667N654O769P271P044
$$ 1454822 1447671 1441033 1436199 1433858 1433773 1435323 1438056 1441633 1445739 1450406 1456060 1462829 1470100 1477144
50235A477144O837P176P787Q406R339J0669J1575J1236R927Q529P337O278N918
$$ 1477144 1483981 1491157 1498944 1507350 1516689 1527358 1538933 1550169 1560096 1568625 1575962 1582240 1588158
50222A588158P099R450J1445J2371J3225J4838J5824J3483O751k476j1034j6920
$$ 1588158 1595257 1604707 1616152 1628523 1641748 1656586 1672410 1685893 1692644 1690168 1679134 1662214
50210A662214j9941k0814k0206j8653j6820j5393j4612j3947j2552j0230p732
$$ 1662214 1642273 1621459 1601253 1582600 1565780 1550387 1535775 1521828 1509276 1499046 1491314
50199A491314n873m409k215J327N539R187J1665J3140J3953J4404J4932J5888
$$ 1491314 1485441 1481032 1478817 1480144 1485683 1494870 1506535 1519675 1533628 1548032 1562964 1578852
50187A578852J6988J7503J7059J5855J4064J1675R189P732P738P916O332K495
$$ 1578852 1595840 1613343 1630402 1646257 1660321 1671996 1681185 1688917 1696655 1704571 1710903 1713398
50175A713398k336o896j1218j5914k0771k4627k6509k6489k5551k4807k4640k4327
$$ 1713398 1711062 1704166 1692948 1677034 1656263 1631636 1605127 1578638 1553087 1528280 1503640 1479313
50163A479313k2667j9457j6330j5626j8072k1838k4348k4863k4803k5433k6127
$$ 1479313 1456646 1437189 1420859 1405233 1387161 1365323 1340975 1316112 1291309 1265876 1239749
50152A239749k5426k3271k1022j9457j7913j5739j3520j2113j1347j0571r900
$$ 1239749 1214323 1191052 1170030 1150573 1132660 1116921 1103401 1091288 1079941 1069370 1059470
50141A059470r784r825r186q013p260p075o635n821n740o989q471q854q277p732
$$ 1059470 1049686 1039861 1030675 1022662 1015402 1008327 1001692 995871 990131 983142 974671 965817 957540 949808
50127I49808p418o835o074n802o067o185n983o142o933p413o464m232k005r13
$$ 949808 942390 935555 929481 923679 917612 911427 905444 899302 892369 884956 878492 874260 872255 871342
50113H71342j092j811k064j158P22K470L005K465K178L110M672N540N502N780
$$ 871342 870250 868439 866375 865217 865939 868409 871414 873879 876057 879167 883839 889379 894881 900661
50099I00661P256R125R946R624R532J0641J2369J3499J3751J3934J4820J6258
$$ 900661 907917 917042 926988 936612 946144 956785 969154 982653 996404 1010338 1025158 1041416
50087A041416J7391J7613J7212J7048J7611J8596J9498K0297K1300K2738K4913
$$ 1041416 1058807 1076420 1093632 1110680 1128291 1146887 1166385 1186682 1207982 1230720 1255633
50076A255633K8244L2384L5635L6336L4946L3776L4403L6120L7196L6830L5444
$$ 1255633 1283877 1316261 1351896 1388232 1423178 1456954 1491357 1527477 1564673 1601503 1636947
50065A636947L3885L2973L3083L3420L2119K7808K0948J3187N657j529q451j4718
$$ 1636947 1670832 1703805 1736888 1770308 1802427 1830235 1851183 1864370 1870027 1868498 1860047 1845329
50053A845329j9769k3511k6505k9464l2390l4346l4395l2697l0284k7914k5722
$$ 1845329 1825560 1802049 1775544 1746080 1713690 1679344 1644949 1612252 1581968 1554054 1528332
50042A528332k3805k2258k0694j8617j6394j4814j3704j2123j0162r050r024q674
$$ 1528332 1504527 1482269 1461575 1442958 1426564 1411750 1398046 1385923 1375761 1366711 1357687 1349013
50030A349013p176n719n519n897n677n183n244n350m694m059m700n991o319n871
$$ 1349013 1341837 1336118 1330599 1324702 1319025 1313842 1308598 1303248 1298554 1294495 1289795 1283804 1277485 1271614
$$ [...]
##END NTUPLES=NMR SPECTRUM
##END=
