
##TITLE=AC1078_TOVI01_5819079_KiZ4hY4oMc
##JCAMPDX= 6.0         $$ Bruker NMR JCAMP-DX V2.0
##DATA TYPE= NMR SPECTRUM
##DATA CLASS= NTUPLES
##ORIGIN= BRUKER
##OWNER= Administrator
$$ 1.72 TOPSPIN		Version 2.1
$$ 2012-03-24 21:34:34.421 -0500  Administrator@TOPSPIN
$$ Compression mode = diff/dup
##.OBSERVE FREQUENCY= 400.13188235
##.OBSERVE NUCLEUS= ^1H
##.ACQUISITION MODE= SIMULTANEOUS (DQD)
##.ACQUISITION SCHEME= undefined
##.AVERAGES= 8
##.DIGITISER RES= 22
##SPECTROMETER/DATA SYSTEM= spect
##.PULSE SEQUENCE= zg30
##.SOLVENT NAME= COFFEE_meoh
##.SHIFT REFERENCE= INTERNAL, COFFEE_meoh, 1, 14.98061
##AUDIT TRAIL= $$ (NUMBER, WHEN, WHO, WHERE, PROCESS, VERSION, WHAT)
$$ ##TITLE= Audit trail, TOPSPIN		Version 2.1
$$ ##JCAMPDX= 5.01
$$ ##ORIGIN= Bruker BioSpin GmbH
$$ ##OWNER= Administrator
$$ $$ C:\Bruker\TOPSPIN/data/COFFEE/nmr/AC1078_TOVI01_5819079_KiZ4hY4oMc/10/pdata/1/auditp.txt
$$ ##AUDIT TRAIL=  $$ (NUMBER, WHEN, WHO, WHERE, PROCESS, VERSION, WHAT)
(   1,<2012-03-24 21:34:22.312 -0500>,<Administrator>,<TOPSPIN>,<go>,<TOPSPIN 2.1>,
      <created by zg
	started at 2012-03-24 21:33:15.734 -0500,
	POWCHK enabled, PULCHK disabled,
       configuration hash MD5:
       1A 1E CE 29 27 FD 77 03 67 4E F0 E3 C4 B2 CB 90
       data hash MD5: 64K
       B8 4A 89 BB FA F3 6E 6C 4C DC 26 BC 13 1E E5 C7>)
(   2,<2012-03-24 21:34:25.750 -0500>,<Administrator>,<TOPSPIN>,<proc1d>,<TOPSPIN 2.1>,
      <Start of raw data processing
       efp LB = 0 FT_mod = 6 PKNL = 1 PHC0 = 0 PHC1 = 0 SI = 32K 
       data hash MD5: 32K
       9B A3 05 CB 76 62 A2 A6 47 39 55 FB B0 03 79 EA>)
(   3,<2012-03-24 21:34:26.093 -0500>,<Administrator>,<TOPSPIN>,<proc1d>,<TOPSPIN 2.1>,
      <pk PHC0 = 216.2329 PHC1 = 0 
       data hash MD5: 32K
       17 5A A7 98 04 32 FD BC E3 CB 32 19 D1 09 55 EC>)
(   4,<2012-03-24 21:34:26.171 -0500>,<Administrator>,<TOPSPIN>,<proc1d>,<TOPSPIN 2.1>,
      <abs ABSG = 1 
       data hash MD5: 32K
       57 53 84 65 5F 5F 46 DD C4 D2 8E 50 CB BC 7F 88>)
(   5,<2012-03-24 21:34:26.203 -0500>,<Administrator>,<TOPSPIN>,<proc1d>,<TOPSPIN 2.1>,
      <abs ABSG = 2 
       data hash MD5: 32K
       36 AA 52 1F 0E 7D E4 95 57 75 40 9C 90 97 AD 4F>)
(   6,<2012-03-24 21:34:26.421 -0500>,<Administrator>,<TOPSPIN>,<proc1d>,<TOPSPIN 2.1>,
      <abs ABSG = 3 
       data hash MD5: 32K
       17 88 F4 74 4F 91 B0 39 BA 45 23 24 8E F7 4D F2>)
(   7,<2012-03-24 21:34:26.453 -0500>,<Administrator>,<TOPSPIN>,<proc1d>,<TOPSPIN 2.1>,
      <abs ABSG = 4 
       data hash MD5: 32K
       0A 04 BF 80 47 B9 EE EC B4 F3 F6 36 38 91 57 FB>)
(   8,<2012-03-24 21:34:26.484 -0500>,<Administrator>,<TOPSPIN>,<proc1d>,<TOPSPIN 2.1>,
      <abs ABSG = 5 
       data hash MD5: 32K
       97 1A C5 4A 3B B0 13 46 41 30 A4 CA 99 1B A7 AE>)
$$ ##END=
$$ 
$$ $$ hash MD5
$$ $$ FC B7 7A 8E AD 07 F8 D3 31 FB 97 9C B1 CD FA CF
##$RELAX= 
##$RELAX= 
##$RELAX= 
##$RELAX= 
##$RELAX= 
##$RELAX= 
##$RELAX= 
$$ Bruker specific parameters
$$ --------------------------
$$ [...]
150 150 150 150 150 150 150 150
##$TP07= 0
##$TPNAME0= <>
##$TPNAME1= <>
##$TPNAME2= <>
##$TPNAME3= <>
##$TPNAME4= <>
##$TPNAME5= <>
##$TPNAME6= <>
##$TPNAME7= <>
##$TPOAL= (0..7)
0.5 0.5 0.5 0.5 0.5 0.5 0.5 0.5
##$TPOFFS= (0..7)
0 0 0 0 0 0 0 0
##$TUNHIN= 0
##$TUNHOUT= 0
##$TUNXOUT= 0
##$USERA1= <user>
##$USERA2= <user>
##$USERA3= <user>
##$USERA4= <user>
##$USERA5= <user>
##$V9= 5
##$VALIST= <valist>
##$VCLIST= <CCCCCCCCCCCCCCC>
##$VD= 0
##$VDLIST= <DDDDDDDDDDDDDDD>
##$VPLIST= <PPPPPPPPPPPPPPP>
##$VTLIST= <TTTTTTTTTTTTTTT>
##$WBST= 2048
##$WBSW= 25
##$XGAIN= (0..3)
0 0 0 0
##$XL= 0
##$YL= 0
##$YMAX_a= 529294
##$YMIN_a= -632618
##$ZGOPTNS= <>
##$ZL1= 120
##$ZL2= 120
##$ZL3= 120
##$ZL4= 120
##$ABSF1= 14.98061
##$ABSF2= -5.57192
##$ABSG= 5
##$ABSL= 3
##$ALPHA= 0
##$AQORDER= 0
##$ASSFAC= 0
##$ASSFACI= 0
##$ASSFACX= 0
##$ASSWID= 0
##$AUNMP= <proc_prof1d_extract_pilot.lims>
##$AXLEFT= 0
##$AXNAME= <>
##$AXNUC= <1H>
##$AXRIGHT= 0
##$AXTYPE= 0
##$AXUNIT= <>
##$AZFE= 0.1
##$AZFW= 0.1
##$BCFW= 0
##$BC_mod= 0
##$BYTORDP= 0
##$COROFFS= 0
##$CY= 15
##$DATMOD= 1
##$DC= 0
##$DFILT= <>
##$DTYPP= 0
##$F1P= 0
##$F2P= 0
##$FCOR= 0.5
##$FTSIZE= 32768
##$FT_mod= 6
##$GAMMA= 0
##$GB= 0
##$INTBC= 1
##$INTSCL= 1
##$ISEN= 128
##$LB= 0
##$LEV0= 0
##$LPBIN= 0
##$MAXI= 10000
##$MC2= 0
##$MEAN= 0
##$ME_mod= 0
##$MI= 0
##$NCOEF= 0
##$NC_proc= -8
##$NLEV= 6
##$NOISF1= 0
##$NOISF2= 0
##$NSP= 0
##$NTH_PI= 0
##$NZP= 0
##$OFFSET= 14.98061
##$PC= 1
##$PHC0= 216.2329
##$PHC1= 0
##$PH_mod= 1
##$PKNL= yes
##$PPARMOD= 0
##$PPDIAG= 0
##$PPIPTYP= 0
##$PPMPNUM= 2147483647
##$PPRESOL= 1
##$PSCAL= 4
##$PSIGN= 0
##$PYNMP= <proc.py>
##$REVERSE= no
##$SF= 400.13
##$SI= 32768
##$SIGF1= 0
##$SIGF2= 0
##$SINO= 400
##$SIOLD= 32768
##$SPECTYP= <>
##$SREGLST= <1H.CDCl3>
##$SSB= 0
##$STSI= 32768
##$STSR= 0
##$SW_p= 8223.68421052632
##$SYMM= 0
##$S_DEV= 0
##$TDeff= 65536
##$TDoff= 0
##$TI= <>
##$TILT= no
##$TM1= 0
##$TM2= 0
##$TOPLEV= 0
##$USERP1= <user>
##$USERP2= <user>
##$USERP3= <user>
##$USERP4= <user>
##$USERP5= <user>
##$WDW= 1
##$XDIM= 32768
##$YMAX_p= 462481397
##$YMIN_p= -733792
##$CURPLOT= <Network HP LaserJet P1505>
##$CURPRIN= <$Network HP LaserJet P1505>
##$DFORMAT= <normdp>
##$LAYOUT= <+/1D_H.xwp>
##$LFORMAT= <normlp>
##$PFORMAT= <normpl>
##$SURQMSG= 1
$$ End of Bruker specific parameters
$$ ---------------------------------
##NTUPLES= NMR SPECTRUM
##VAR_NAME=  FREQUENCY,     SPECTRUM/REAL,   SPECTRUM/IMAG
##SYMBOL=    X,             R,               I
##VAR_TYPE=  INDEPENDENT,   DEPENDENT,       DEPENDENT
##VAR_FORM=  AFFN,          ASDF,            ASDF
##VAR_DIM=   32768,         32768,           32768
##UNITS=     HZ,            ARBITRARY UNITS, ARBITRARY UNITS
##FACTOR=    0.250966925370066, 1,           1
##FIRST=     8223.43324360095, -94675,       -156034
##LAST=      0,             -127420,         -38997
##MIN=       0,             -733792,         0
##MAX=       8223.43324360095, 462481397,    0
$$ Real data points
##PAGE= N=1
##DATA TABLE= (X++(R..R)), XYDATA
$$ [...]
19468F0791j8443b86717r818a23413k81880M6138d3643D80653c54446i1237A77577
19456a34438A64244H895b15247B90683a79779C49816b5996a1859j07695A5096
19445c85788m9537f0932m12619E2197B152L96923f4288j2753k58120L0737a06120
19433c43306c2992k0851j85824R8349R555M2426q7040M6039J0854r0942C4067
19421b62179C8350a77068C1782i199H0451i5299C5798b51205C9002a04264A24042
19409c52714A74925p4925a21775A73601d0596B8875b12973J9296l2789B3579a0682
19397d5708G4649c61219R9138A10455b95100a02178l09471J56388o0692J34476
19387a81477d040q0522J7385E6218j1794a76452I6770b97782h048j02356j39626
$$ plain form
19468 60791 42348 -286717 -296535 -123413 -405293 -359155 -43643 480653 -354446 -91237 177577
19456 -134438 164244 8895 -215247 290683 -179779 349816 -25996 -11859 -119554 15096
19445 -385788 -435325 -60932 -473551 52197 2152 399075 -64288 -77041 -335161 -304424 -106120
19433 -343306 -32992 -53843 -239667 -141318 -131763 -89337 -176377 -130338 -119484 -210426 34067
19421 -262179 38350 -177068 31782 -9199 80451 -95299 35798 -251205 39002 -104264 124042
19409 -352714 174925 100000 -121775 173601 -40596 28875 -212973 -193677 -226466 23579 -10682
19397 -45708 74649 -361219 -262081 110455 -295100 -102178 -411649 -255261 -315953 -181477
19387 -181477 -4040 -84562 -67177 56218 44424 -176452 96770 -297782 -8048 -110404 -250030
19376b50030K2607C1838a73461P1144C28349a13026I7729P0162b05280f2030n3114
19365a15144B2301a54859b7385j15914o817O4781k4262K0187B2013r070b84655
19353a15147a4939l1824C738K21356b97098k38350a02566j88671E4976d49277
19342a52352j40446e2147r5418O2719G1302J37280a18363r6654i4978o1981q7341
19331b44300N186B02852D9906a25852N8013c1451A81167b85403h2684j25752E6172
19319b46182h488j65722q0712j1837F0718a5187B6956e5945j60484e6652A75633
19307a22565l15779I9497G334K39424d4969j3578q0568B55408b02444p201b0461
19295b8923a842j29979k11682D2341K92266a54561j79091q6943J55366A48563
$$ plain form
19376 -250030 -227423 31838 -173461 -102317 328349 -113026 97729 167891 -205280 -62030 -115144
19365 -115144 22301 -154859 -27385 -143299 -150116 -85335 -109597 -89410 22013 12943 -284655
19353 -115147 -14939 -46763 3738 225094 -297098 -535448 -102566 -291237 54976 -449277
19342 -152352 -292798 -52147 -147565 -84846 71302 208582 -118363 -215017 -94978 -156959 -244300
19331 -244300 -239114 202852 49906 -125852 -67839 -31451 181167 -285403 -82684 -208436 56172
19319 -246182 -8488 -174210 -254922 -266759 60718 -15187 26956 -55945 -216429 -56652 175633
19307 -122565 -438344 99497 7334 246758 -44969 -58547 -139115 255408 -202444 -209645 -20461
19295 -28923 -1842 -131821 -343503 42341 334607 -154561 -333652 -420595 -265229 148563
19284c90429D8496N8725a02189J4136k05962A06702P2011a67021h215j98957A39957
19272E5142a77168I6287b16135G1818a58378O7436j4674G726a70873m0639p198
19261b18710j70220A26298c63387c9978K471J425l69502d1559P412r6707D40606
19249E5248a8655A26786a1466N412j51908E1153c5826l30779J66182P5320a2816
19237b6186i679q1498b3187F8273c69404i4032k955j2043A98925E0316h8835j82038
19225b70873A52557a12192B21116F3185k1675f543k29659e6343E4925g6838J7472
19214e9366A7143d9092j91033f2119o7870A01006a84897J1907k3443A56354c09931
19202b65938f2229k36000d943j925C0006a39486B471Q3659a81381K3081A69407
$$ plain form
19284 -390429 48496 107221 -102189 -88053 -294015 106702 178713 -167021 -8215 -207172 139957
19272 55142 -177168 96287 -216135 71818 -158378 -90942 -105616 7726 -170873 -211512 -218710
19261 -218710 -388930 126298 -363387 -39978 -37507 -36082 -405584 -41559 -34147 -130854 440606
19249 55248 -18655 126786 -11466 -6054 -157962 51153 -35826 -366605 -200423 -125103 -12816
19237 -26186 -9679 -91177 -23187 68273 -369404 -94032 -96987 -109030 198925 50316 -88835 -270873
19225 -270873 152557 -112192 221116 63185 41510 -6543 -236202 -56343 54925 -76838 -59366
19214 -59366 17143 -49092 -240125 -62119 -129989 101006 -184897 -172990 -196433 156354 -309931
19202 -265938 -62229 -298229 -4943 -6868 30006 -139486 2471 86130 -181381 -158300 169407
19190b05262i9118r2673B13723E081b03038l04748A00810m6469a8409k32324e268
19178E5691M889P317a88639D14809b96496F5778b6617B32452b42155L5085j70592
19167c77662G7432d59875a68107h2270A48567J8820F851a74629j01076B4699b96689
19155b77030L1405F549a03147A45250d34312F0857d1536a773r3957l4083i995
19143f4762G6756e9079K6838F135g156k8734r455c258k09607N5002j22594A81584
19130g1306j08732O0790J8720j54954C47911b56704C0585A1726e1935B09404a14481
19118h8503I9208a27790j66713g3056j14626j3083Q1668a3160B93117A2680c06688
19106B97772a80462k8912H0815b59005E6330a57025F1634d18710A18170a15555
$$ plain form
19190 -205262 -99118 -191791 213723 5081 -203038 -507786 100810 54341 -18409 -250733 -5268
19178 55691 60580 67897 -188639 414809 -296496 65778 -26617 232452 -242155 -207070 -377662
19167 -377662 77432 -459875 -168107 -82270 148567 167387 6851 -174629 -275705 24699 -296689
19155 -277030 -245625 6549 -103147 145250 -434312 60857 -41536 -1773 -95730 -129813 -9995
19143 -64762 76756 -59079 -32241 6135 -7156 -35890 -45345 -3258 -212865 -157863 -280457 181584
19130 -71306 -180038 -119248 -100528 -255482 347911 -256704 30585 11726 -51935 209404 -114481
19118 -88503 99208 -127790 -294503 -73056 -187682 -200765 -119097 -13160 293117 12680 -306688
19106 297772 -180462 -209374 80815 -259005 56330 -157025 61634 -418710 118170 -115555
19095b53978I2861n771J38916h9240O588l1208q2045j69850b13B22055K12259
19084D34314a11898M1784A01514b11094d9924j44406c7861A93997e2180B27424
19073a48755n93a899C9735b05276k7907f1326a0343l03446j00560h9074p5724
19062a64798f9627B38669a69934a6298q5812B12826b48725A23254a33947j65372
19052b99319a48901j07431J25531k49585N8294C55360E6912b98481J02133A28297
19041g9148A38740b00631H3715A2385b79662a11604r6469A03133a93851J9706
19031a74145F1804d23779J55828P1054l3441P389I513e7702k02717i9847A14372
19019b40559B60317b37808P1715K0645P1805L2326A20615h6307L9038G049J34363
$$ plain form
19095 -253978 92861 87090 226006 -89240 -82652 -113860 -195905 -365755 -213 222055 434314
19084 434314 -111898 -70114 101514 -211094 -49924 -194330 -37861 193997 -52180 227424
19073 -148755 -149348 -1899 39735 -205276 -233183 -61326 -10343 -313789 -414349 -89074 -164798
19062 -164798 -69627 238669 -169934 -16298 -102110 212826 -248725 123254 -133947 -299319
19052 -299319 -148901 -256332 -130801 -380386 -322092 355360 56912 -298481 -196348 128297
19041 -79148 138740 -200631 83715 12385 -279662 -111604 -208073 103133 -193851 -174145
19031 -174145 61804 -423779 -267951 -196897 -230338 -222949 9513 -57702 -260419 -99847 114372
19019 -240559 260317 -237808 -166093 -145448 -73643 -41317 120615 -86307 -47269 7049 141412
19008A41412a49449a5715r8432c6571q3739j11938E2057P9161F0765K1672c9123
18996D25904H5789J02673m3817A0211K4912J83985i2663H3589j9960K143a71596
18984a16350l4696q7904I1748D331b41630G6313a43929J1244j78596A40511b74904
18972b07532f9051a009C42790C1383J92931p3444a8087C07221I2829b35071D4001
18960I4611A9078G255K83691j09411N44570j64240j93597M4447A40651m1911c8359
18948b71671A03972L63504a98705B18387D93J0754J20126n8168b22823c4500B57983
18936A7309m386J01644a76354o1223M422O3115B54846a21832a1831A7363K5878
18925D3241J1464a24714m39035f1617k17691F4657a32677m0563B3101J549n768
$$ plain form
19008 141412 -149449 -15715 -114147 -36571 -120310 -232248 52057 131218 60765 82437 -39123
18996 425904 85789 188462 144645 10211 35123 219108 -92663 83589 63629 65772 -171596
18984 -116350 -151046 -238950 91748 4331 -241630 76313 -143929 -132685 -311281 140511 -274904
18972 -207532 -69051 -1009 342790 31383 224314 150870 -18087 307221 92829 -235071 44001
18960 94611 19078 7255 290946 181535 726105 561865 368268 412715 140651 98740 -38359
18948 -271671 103972 467476 -198705 218387 493 11247 131373 73205 -222823 -34500 257983
18936 17309 12923 114567 -176354 -237577 -233155 -170040 254846 -121832 -11831 17363 43241
18925 43241 54705 -124714 -563749 -61617 -279308 64657 -132677 -173240 23101 24650 18882
18914A8882O2834e9971J7666J8967o7564L5027l70986b03662n0222b1053F9614
18902A09901Q7964b41896B24184m988b14649L5935A34862f3576j15243D60002
18891B36908L6567J79821H3145c81005Q5709A40812c10353i6006A94883D066c1513
18879e5221l43741a22860A56117b30910k65735a25315j50168c9822k76748a14768
18868a70801q8802P7041L7362c640B7306I583a35848C06811a24497c6327j12863
18857a49190j8645k3487l6572k27241h3404C301a11834K7295k03479c2687k6325
18846e9012q8285L6650A41129f2617C41715h719l43899I1218a37539M3811q2118
18835a75846f8640C20287j21580A4627g57F635K50116a40978A01024b00393k17674
$$ plain form
18914 18882 81716 -59971 -42305 -23338 -90902 -55875 -426861 -203662 -253884 -21053 69614
18902 109901 197865 -241896 224184 219196 -214649 -178714 134862 -63576 -178819 460002
18891 236908 273475 453296 83145 -381005 -295296 140812 -310353 -96006 194883 4066 -31513
18879 -55221 -398962 -122860 156117 -230910 -496645 -125315 -275483 -39822 -316570 -114768
18868 -170801 -259603 -182562 -145200 -3640 27306 9583 -135848 306811 -124497 -36327 -149190
18857 -149190 -167835 -191322 -227894 -455135 -83404 3301 -111834 -84539 -288018 -32687 -59012
18846 -59012 -147297 -110647 141129 -62617 341715 -8719 -352618 91218 -137539 -93728 -175846
18835 -175846 -68640 320287 198707 14627 -757 6635 256751 -140978 101024 -200393 -418067
18824d18067A81555e7065k90827G1200C445c21526A7527e4243k354n8912k58559
18813c74068a73223J980l20535E1017O1188b26499A82713c88718D8006f6030G8025
18801B18460k8346J84719j05773E5443J35080d8677j2808C09082A01177K53125
18791C54302J3216a23734A96961F9764J57629a37542o5371h5180d2238B27261
18780C5720b41604Q1709C0790Q1898c35432b9576f810C4563L5496a06753L6889
18769f9864j47296f4551C1330J39521d1079k11022b4727j63056Q8925K2670D2426
18757D6892a82291n6201a16810k89636a56617K3438b3055o9106E7747b02634a9792
18745g4349G6040a66978B66810a4753m47927J30537J39618g331D2665c2290l3969
$$ plain form
18824 -418067 181555 -57065 -347892 71200 3445 -321526 17527 -54243 -56597 -115509 -374068
18813 -374068 -173223 -171243 -491778 51017 112205 -226499 182713 -388718 48006 -66030 78025
18801 218460 190114 374833 269060 55443 190523 -48677 -61485 309082 101177 354302
18791 354302 367518 -123734 196961 69764 227393 -137542 -202913 -85180 -42238 227261
18780 35720 -241604 -159895 30790 112688 -335432 -29576 -6810 34563 70059 -106753 -69864
18769 -69864 -217160 -64551 31330 170851 -41079 -252101 -24727 -187783 -98858 -76188 42426
18757 46892 -182291 -238492 -116810 -406446 -156617 -133179 -23055 -92161 57747 -202634 -19792
18745 -74349 76040 -166978 266810 -14753 -462680 -332143 -192525 -7331 42665 -32290 -66259
18734f6259j15466M4373B65764a92712k2092G7411g7088B1034K22811h8431B8232
18722A85237c2371B65294e7684j49251A49257P9414b23078c3715H8544d1631B40776
18710a34838b9297m3036r3394E1640N115g6387A01530N2947a39581A9822c0082
18698C90d48242b23497O7279H4810a97101j43105A01785a67111j25418J36699
18688a55830D3638b92306A22493b01582C1302b70281j0285N6021A60005c8539
18677b42684M4709C64270a00401A24604a3790j26770k03655F3808H932c88838
18666b04175I0832f1956j09786h3728o6554D6576i0283l9529q3899A95501b42279
18654a58841j22127F3026M3896a58557C275b32113a11003k0066a0180A0730d5175
$$ plain form
18734 -66259 -181725 -137352 265764 -192712 -214804 77411 -77088 21034 243845 -88431 28232
18722 185237 -32371 265294 -57684 -206935 149257 228671 -223078 -33715 88544 -41631 240776
18710 -134838 -29297 -72333 -165727 51640 56755 -76387 101530 154477 -139581 19822 -30082
18698 390 -448242 -223497 -156218 84810 -197101 -340206 101785 -167111 -292529 -155830
18688 -155830 43638 -292306 122493 -201582 31302 -270281 -280566 -224545 160005 -38539
18677 -242684 -197975 364270 -100401 124604 -13790 -140560 -344215 63808 8932 -388838
18666 -204175 90832 -61956 -171742 -83728 -150282 46576 -90283 -129812 -213711 195501 -242279
18654 -158841 -280968 63026 106922 -158557 3275 -232113 -111003 -131069 -10180 10730 -45175
18642f9987k57281A83121i8458C15938c07243e2713K321l1632j17524A69683a24736
18630b70124N9671a04836J842o253l2655N3980d3788A9686f0304H1275k6996c02040
18617b00334B8627K6083a25453A3916N086c72768a10411q8204A19011E249b80686
18605B01976H4344a13098A25952a22806j60400A17650e0302B1906Q9669b6355
18594b86924D18758c79141A89086a60149a162I4879D3994a68637P4748j99261
18584b93150J08425A65751E5502d91530D34074b43983b3854q1372N355N498J2953
18573h1420m2020d953C9935b24730Q6442N7837p6684f0260C7946a50720q7753
18562b38473E2687c17558a4631l8577k3155k10125g5270j33192f8027q4659H0322
$$ plain form
18642 -69987 -327268 183121 -98458 315938 -307243 -52713 -50392 -82024 -199548 169683 -124736
18630 -270124 -210453 -104836 -102994 -109247 -141902 -87922 -43788 19686 -60304 81275 54279 -302040
18617 -200334 28627 54710 -125453 13916 19002 -372768 -110411 -198615 119011 5249 -280686
18605 201976 84344 -113098 125952 -122806 -283206 117650 -50302 21906 111575 -26355
18594 -286924 418758 -379141 189086 -160149 -1162 94879 43994 -168637 -93889 -293150
18584 -293150 -184725 165751 55502 -491530 434074 -243983 -23854 -105226 -99871 -94373 -81420
18573 -81420 -123440 -4953 39935 -224730 -138288 -80451 -157135 -60260 37946 -150720 -238473
18562 -238473 52687 -317558 -14631 -53208 -76363 -286488 -75270 -208462 -68027 -152686 80322
18550A98091J63923D7530a56355A3186c35181a02874c4952B7344d1624l3662B56405
18538b82450i7587D1472N636L96240a77528A65301a87472A60254a78099b0442
18527B10128b91604d9424A80516c38097a41708D1158f3908j9490j02784B7158
18516b42196K2846B0410N9717j7171K24965E3862b40699K4568N8273A85171a75051
18504B1061G190O0669a83155G3630a54250A02128d44825A11280O7377G2273a59541
18492e2885D8218c27755e3669A37006a96714B93616a60728j9035I4134a70995
18481A09434c25369a58124N3866j27093m7317A13049b94744a34508B30144a08304
18470I8137a88509I898b41990A69790d3858B02935d43211a16349j62272A7043
$$ plain form
18550 198091 362014 47530 -156355 13186 -335181 -102874 -34952 27344 -41624 -75286 256405
18538 -282450 -97587 41472 47108 443348 -177528 165301 -187472 160254 -178099 -20442
18527 210128 -291604 -49424 180516 -338097 -141708 41158 -63908 -83398 -186182 27158
18516 -242196 -219350 20410 80127 62956 287921 53862 -240699 -216131 -157858 185171 -175051
18504 21061 7190 67859 -183155 73630 -154250 102128 -444825 111280 178657 72273 -159541
18492 -52885 48218 -327755 -53669 137006 -196714 293616 -160728 -179763 94134 -170995
18481 109434 -325369 -158124 -104258 -231351 -278668 113049 -294744 -134508 230144 -108304
18470 98137 -188509 9898 -241990 169790 -43858 202935 -443211 -116349 -278621 17043
18459F2547e3750C08785a10250k6735c1002E1912B3120c00928A07550c4886j44584
18448a79470j87965c7845C0428A506a03188A36918F6399J81396j2291e8965k77763
18437c36728f8468j86896h5788A08575J21673d09973f6715A31411n500A5138a63296
18425a29080D1608J11998l8910R6143d0508o4816F8426a05861D0505a23580l4639
18414a58219c8317r7216I6637f0594G5341J94448f6712A07613c2406k28188N0512
18403b10082n0503A5133A357a31199O2046Q21J9664k91500M5083O0469A670K29443
18391B31113a4552l5948C23805b59086q4420B278J50974K5160H454b3377F9323
18379F1164e645j10961A66608b43623C38811a92798B56441H0336b7893l76843
$$ plain form
18459 62547 -53750 308785 -110250 -136985 -31002 51912 23120 -300928 107550 -34886 -179470
18448 -179470 -367435 -37845 30428 1506 -103188 136918 66399 247795 235504 -58965 -336728
18437 -336728 -68468 -255364 -85788 108575 230248 -409973 -66715 131411 125911 15138 -163296
18425 -129080 41608 153606 114696 210839 -40508 -105324 68426 -105861 40505 -123580 -158219
18414 -158219 -38317 -135533 96637 -60594 75341 269789 -66712 107613 -32406 -260594 -210082
18403 -210082 -260585 15133 1357 -131199 -69153 -68332 -48668 -340168 -295085 -234616 1670 231113
18391 231113 -14552 -50500 323805 -259086 -343506 2278 153252 178412 8454 -23377 69323
18379 61164 -5645 -116606 166608 -243623 338811 -192798 256441 80336 -27893 -404736
18369d04736D2792A3431g7070k55897a3244q5832m3219I417i9865C57990G6185
18357a99899j9802A30092b69219A74783g8791C36145g6796E4786a5110a400B68996
18345A07330J37626f3322C03018e6780R138j49048g6080J9092A98149k5269n2726
18334A20154M8920a81455D7005K057j5539L3919b41880b0074l18159E353P2883
18323G8236f3633A32123a66038A15411C4678c08442i2120D52197a06654j74225
18313b80879L7510B48367h3208j55100A0289b89169O3623F0968a02729A66147
18302D735e5965j87478K7672H0100c3748j77422A16733A6136Q3399B4298L50547
18291C74845F7565a77490C01884l8658c7876B00498j4767M3503b00830A17198
$$ plain form
18369 -404736 42792 13431 -77070 -332967 -13244 -99076 -142295 9417 -99865 357990 76185
18357 -199899 -219701 130092 -269219 174783 -78791 336145 -76796 54786 -15110 -1400 268996
18345 107330 244956 -63322 303018 -56780 -47642 -196690 -76080 -56988 198149 172880 120154
18334 120154 169074 -181455 47005 49062 33523 67442 -241880 -20074 -338233 5353 78236
18323 78236 -63633 132123 -166038 115411 34678 -308442 -92120 452197 -106654 -280879
18313 -280879 -243369 248367 -83208 -238308 10289 -289169 -225546 60968 -102729 166147
18302 4735 -55965 -243443 -215771 80100 -33748 -211170 116733 16136 99535 24298 374845
18291 374845 67565 -177490 301884 263226 -37876 200498 185731 229234 -200830 117198
18280e72062a53497j56199N9344J8781E9567i2720A0437b88566i498A18775D1722
18268d18395B1831d4316p3212o6885p9199d249p5101m2676e5942A18147O7029
18257A85176d1237J2171A04401c64990a39716O1092b9169O208k0532r6086M4910
18246i4669l74J5000p2354B4862L26841G0918a4297j95137A21047b01611A35227
18234c05013L8041G0258J00273a91704O5489n8309A10438c35182k552Q8355E4497
18222e51484a23687A28669a13990a4339o5894c7156j25358g8585j54193d4542
18211a98282Q2805M020F8990L0809b55379Q7568L408m7143f1559r0371A29910
18199b749j80782A40391c07943b3026o8081R808F9585a92090I4650C1648J29236
$$ plain form
18280 -572062 -153497 -309696 -250352 -231571 59567 -92720 10437 -288566 -9498 118775 41722
18268 -418395 21831 -44316 -117528 -184413 -263612 -4249 -79350 -122026 -55942 118147 185176
18257 185176 -41237 -29066 104401 -364990 -139716 -78624 -29169 -22961 -43493 -139579 -94669
18246 -94669 -95043 -80043 -152397 24862 351703 70918 -14297 -209434 121047 -201611 135227
18234 -305013 -266972 70258 170531 -191704 -126215 -184524 110438 -335182 -337734 -249379 54497
18222 -551484 -123687 128669 -113990 -14339 -80233 -37156 -162514 -78585 -232778 -44542
18211 -198282 -115477 -111457 68990 99799 -255379 -167811 -164403 -211546 -61559 -151930 129910
18199 -2749 -183531 140391 -307943 -23026 -91107 -81299 69585 -192090 94650 31648 160884
18188A60884n3470L6954a64462B62881b3940j7575a5802C19406d22337J03178
18178c19159A26174a10712C8187c3210C644b83375h2093G5723a42960E3326b05603
18166I813e1091D6214b8045j52548P8772k00121B08485d9134E4822b29577g4853
18154A79447a27352F8702c7260A71467a59875B9215J3650b90168B01760a86748
18143e3350j17898C4282e2235A19852i7475D48355A95726a68860n3099a1617B51685
18131a75875b5189q0542d0677A09359f5768o1023A44792K21362a56132B0042e4104
18119a74085j31037C04160E4647d7803A34725a89113F1050J4205a09881j4939
18109a24820A8704i4747j14455k69139a10439k93677A9405K15819N4828e1271
$$ plain form
18188 160884 107414 144368 -164462 262881 -23940 -41515 -15802 319406 -422337 -319159
18178 -319159 126174 -110712 38187 -33210 3644 -283375 -82093 75723 -142960 53326 -205603
18166 9813 -51091 46214 -28045 -180593 -101821 -301942 208485 -49134 54822 -229577 -74853
18154 179447 -127352 68702 -37260 171467 -159875 29215 42865 -290168 201760 -186748
18143 -53350 -171248 34282 -52235 119852 -97475 448355 195726 -168860 -221959 -11617 251685
18131 -175875 -25189 -105731 -40677 109359 -65768 -126791 144792 366154 -156132 20042 -54104
18119 -174085 -305122 304160 54647 -47803 134725 -189113 61050 75255 -109881 -124820
18109 -124820 18704 -94747 -209202 -478341 -110439 -404116 19405 235224 290052 -51271
18098D68815a05161B46062r8310f7761p634H7832O5804i8762A28829J4523b38652
18086c19984J1012a6811q237j49140e0730j9946j04448C4890a24166j35551b0324
18074E4983a72077N5332i076F1165a96533i7755A21889F0840J90524K7925H7414
18062C36852A47910J2035i8382A83743c3667B1129O3825J84010a7348k68753B39283
18050a66933A97243E946P7887b27270h4885B53868A04198a22017C2074J00585
18040A32659a7579j25898B114M0029K00328Q3558a10801N3208F9618a4198I7117
18028E8184b07247B05223c26266A46956O7890c2359j92769B32466C2504L2565
18018F5069a68809c251m00514a62550F3887K37360a61280B9876c3813J2389j70496
$$ plain form
18098 468815 -105161 246062 147752 -67761 -75395 87832 153636 -98762 128829 143352 -238652
18086 -319984 -308972 -16811 -25048 -174188 -50730 -70676 -175124 34890 -124166 -259717 -20324
18074 54983 -172077 -116745 -9076 61165 -196533 -97755 121889 60840 251364 279289 87414
18062 336852 147910 159945 -98382 183743 -33667 21129 84954 268964 -17348 -286101 239283
18050 -166933 197243 5946 83833 -227270 -84885 253868 104198 -122017 32074 132659
18040 132659 -17579 -143477 2114 42143 242471 326029 -110801 -57593 69618 -14198 97117
18028 58184 -207247 205223 -326266 146956 214846 -32359 -225128 232466 32504 65069
18018 65069 -168809 -3251 -403765 -162550 63887 301247 -161280 29876 -33813 -21424 -191920
18007a91920R1262I4763a62473A29044K59489C0710c44522B37709A4259b00437
17996I6810J33666g0375n6753G4304N9295a02972k9791G0196J05734c8349E6115
17984B0291R77K4697a20325P17n5333o9295f5268G386a42409A62359J2657M5304
17972B20320b2977j74912A28736M7594a4534D0124K28117a07392A9527a66078
17961B11104a59182O1067F781b10749B37172r0146e8505k491k67342a4727C1911
17949b0985l5551K5429m8858K6110h763B34191o2608J33617a27812B94153A09747
17937B65610b055A22486l4612b02150E0996P0685a930j8834A33216Q4332l4010
17926A83538a01022I5136a41590m1861A42892M3854a79994A63312k336b20089
$$ plain form
18007 -191920 -100658 94763 -162473 129044 388533 30710 -344522 237709 14259 -200437
17996 96810 230476 -70375 -127128 74304 133599 -102972 -132763 70196 175930 -38349 56115
17984 20291 21268 45965 -120325 -119608 -174941 -244236 -65268 7386 -142409 162359 175016 220320
17972 220320 -22977 -197889 128736 176330 -14534 40124 268241 -107392 19527 -166078
17961 211104 -159182 -98115 6781 -210749 237172 147026 -58505 -60996 -328338 -14727 31911
17949 -20985 -56536 -31107 -79965 -53855 -8763 234191 171583 305200 -127812 294153 109747
17937 265610 -2055 122486 87874 -202150 50996 121681 -1930 -20764 133216 217548 183538
17926 183538 -101022 95136 -141590 -183451 142892 186746 -179994 163312 160976 -220089
17915c5872l736j08597c5981H0378J33212D2777i617A46307J00052r6347b42774
17903a0716A53832c2028j87176A06793J1003A003b29129A06536a7942A07178a87214
17891A02782a91401g3977o2681B5911a07832d3411j77114H5565i7547A20810o796
17880A14014n3113O2882d0607p174I6609J19912h0861k21687F2004a84492H5192
17868c41204E1207J86567a04300d2048B45129Q2013E2734K18736a49380k00561
17858c49941J38595B92048A25406P2722E2708a46897B10944J78320C2324e1700
17847b06259a4449B92408g148k44594k7484a38843B98652a48009C9939P3290a07172
17835G0351B9768K9997b08508H5332b46584B3002R6183a89476O5628K2335I0025
$$ plain form
17915 -35872 -39608 -148205 -35981 80378 213590 42777 -9617 146307 246359 150012 -242774
17903 -10716 153832 -32028 -219204 106793 117796 1003 -229129 106536 -17942 107178 -187214
17891 102782 -191401 -73977 -136658 25911 -107832 -43411 -220525 85565 -97547 120810 114014
17880 114014 60901 123783 -40607 -47781 96609 216521 -80861 -302548 62004 -184492 85192
17868 -341204 51207 237774 -104300 -42048 245129 327142 52734 271470 -149380 -349941
17858 -349941 -211346 292048 125406 198128 52708 -146897 210944 389264 32324 -51700
17847 -206259 -14449 292408 -7148 -251742 -279226 -138843 298652 -148009 39939 113229 -107172
17835 70351 29768 59765 -208508 85332 -246584 23002 119185 -189476 -123848 -101513 90025
17823i2171d0764B06784a56505r778j59477I8323a92182D01965r2180a14788A15219
17811E5006P9128n4345a1348j31993C61809I3104a50182j57468A70115H0563R6704
17800A77267F0027K02879a63310A94035o1340J59225A42550J04207k5216e3938
17789C3250J83586f1675B21743c06611h0943b5716a518o2248l4431C25902I9058
17777i0789A70269c9390j23621J4733A24630M7449j2834A1997Q6206O3965J52075
17766C14243A07133a18841A54273a65125E5794J51406a04069A01159K51053A19971
17755d25741J26300a01873j04145A04833c03817A15212B5679d32472A67113a40246
17744d4064C05325j49614n5556k4775b77057i7896B79529j31931j1399J64117
$$ plain form
17823 -92171 -40764 206784 -156505 -166283 -325760 98323 -192182 401965 309785 -114788 115219
17811 55006 134134 79789 -11348 -143341 361809 93104 -150182 -307650 170115 80563 177267
17800 177267 60027 262906 -163310 194035 132695 291920 142550 246757 221541 -53938
17789 33250 216836 -61675 221743 -306611 -80943 -25716 -1518 -63766 -98197 325902 99058
17777 -90789 170269 -39390 -163011 -148278 124630 172079 159245 11997 98203 162168 314243
17766 314243 107133 -118841 154273 -165125 55794 207200 -104069 101159 352212 119971
17755 -425741 -299441 -101873 -206018 104833 -303817 115212 25679 -432472 167113 -140246
17744 -44064 305325 155711 100155 75380 -277057 -97896 279529 147598 136199 300316
17734C00316a64743O0322B0558i6436A18658Q5870a34593G541M1321P6359B5976
17722f1940k15619K3316R550A17630b4950C686J58207N2819C745K97790B2935
17710A0621K32902K53595a1527o8H8209J22450m7040J09314B9337g9030C24732
17698C34330j66195h9944B15550J17904b03289B31536h375B54791D0228P3588
17688A13816a06208H695a80362A20291O7664A7027a35616C34649J348A42162J4547
17677A56709J41536d7884j69227C4007J4058J9504a5286r2957E63150A72891N7350
17666B30241A0958h9663j80053A95541C6734j6406k153c218C22603F2262a1032
17654A65270C8211J72944c3635C08775C0915a40685A63781E7726a01540p8231
$$ plain form
17734 300316 -164743 -104421 20558 -96436 118658 204528 -134593 7541 48862 125221 25976
17722 -61940 -277559 -254243 -244693 117630 -24950 3686 161893 214712 3745 301535 22935
17710 10621 243523 497118 -11527 -11595 88209 210659 163619 272933 29337 -79030 324732
17698 334330 168135 -89944 215550 333454 -203289 231536 -8375 254791 40228 113816
17688 113816 -106208 8695 -180362 120291 187955 17027 -135616 334649 335997 142162 156709
17677 156709 298245 -47884 -217111 34007 48065 67569 -15286 -108243 563150 172891 230241
17666 230241 10958 -89663 -269716 195541 36734 20328 18175 -3218 322603 62262 -11032
17654 165270 38211 211155 -33635 308775 30915 -140685 163781 57726 -101540 -179771
17644a79771B77709q1847I3625J42459a03051C54296A65261P6651C1804M7531
17634G9335o868l0348J28608p2878K6142a21759A12991a64554d2017A77682b13064
17622g0359B11414j7816J72741j01662O6225b5488A50575L14197a22947A90829
17611A82811d0807F2692a1924G2113b05065P5397K8604c7623a0065D729d3058
17599c0226A3288d3625j6859B15080i199E01801k09545E4157O5551d1263j31868
17588a73131j6607B73260d396A37036c3977F7557i9959B93614q2797D1630b4045
17576B97386j00427a9182j67938B46885d8326B36989r6711M48080k31939I2262
17565A72321p4609J76833j28319n1843a26073D42696p5077L1616j99274i9065
$$ plain form
17644 -179771 277709 195862 93625 236084 -103051 354296 165261 241912 31804 79335
17634 79335 72467 42119 170727 97849 123991 -121759 112991 -164554 -42017 177682 -213064
17622 -70359 211414 193598 366339 264677 330902 -25488 150575 464772 -122947 190829
17611 182811 -40807 62692 -11924 72113 -205065 -129668 -101064 -37623 -10065 4729 -43058
17599 -30226 13288 -43625 -60484 215080 -9199 501801 292256 54157 119708 -41263 -173131
17588 -173131 -189738 273260 -4396 137036 -33977 67557 -99959 293614 210817 41630 -24045
17576 297386 196959 -19182 -187120 246885 -48326 236989 140278 588358 356419 92262
17565 172321 97712 274545 146226 94383 -126073 442696 367619 399235 199961 -99065
17554B90777A20383L1785K4936E752Q3900d355B44085p8704F2357K52502j49466
17543A65393k4393E5774J16863b72122A365a4698A60904N2521a00890C32560A03592
17531A61079a6053B45496P2081k0961L2994j26921N9654A20630J54437j23262
17521A51805K01274k6633N1682q6767H0572L35143A26573Q7607O03532l14336
17511E03376L10140K02039l60136j54323K89957j65283J40367j89966j37539j0911
17501D27721J22739J52010C36289M4165Q9485M0145L86682J03907K80302m64640
17491H16335l26351K10115k26322K28754k59743q778A51547K80567j80626J73658
17481D25146I6653J31100I4614l6252J96947M3990p6689H5565K71204p5305J57626
$$ plain form
17554 290777 120383 152168 177104 5752 89652 -4355 244085 165381 62357 314859 165393
17543 165393 141000 55774 172637 -272122 1365 -14698 160904 213425 -100890 332560 103592
17531 161079 -16053 245496 317577 296616 329610 202689 262343 120630 275067 151805
17521 151805 353079 326446 378128 291361 80572 415715 126573 214180 817712 503376
17511 503376 813516 1015555 655419 501096 791053 625770 766137 576171 438632 427721
17501 427721 550460 702470 336289 380454 469939 510084 896766 1000673 1280975 816335
17491 816335 489984 700099 473777 702531 442788 434010 151547 432114 251488 425146
17481 425146 96653 227753 94614 58362 255309 299299 222610 85565 356769 281464 439090
17470D39090F6490L70399J8378L5457a3753B93566J0410P9959A34886J55962K30248
17459E21096A57554K22931P4373F8978J71764f4178G31274C10795o4232K79781
17449E26344k09724l8894K975J45545j78994Q0634a1612A94101L13217o9545e7003
17437C52414c2164D46324A70450K07482A76163M74421B26295L63488O9966r0853
17427E68896j38426M4451r8729p8363J11848G7433M82952o5786A51314N44135
17417F95449B98434K10051A41773M00518j91113b2573E66934k62334J22478Q5473
17407E12551k16623K15540q8774A53684K63376o9134J18715r2423j9639M0879
17397C95458K6455B09555J04358J24169K76722O2673B97521n3248D0278J33453
$$ plain form
17470 439090 66490 436889 455267 490724 -13753 293566 303976 383935 134886 290848 521096
17459 521096 157554 380485 454858 68978 240742 -64178 731274 310795 246563 526344
17449 526344 316620 277726 280701 426246 247252 327886 -11612 194101 507318 437773 -57003
17437 352414 -32164 446324 170450 377932 176163 650584 226295 589783 659749 568896
17427 568896 430470 474921 376192 297829 409677 77433 560385 494599 151314 695449
17417 695449 298434 508485 141773 542291 351178 -22573 566934 304600 427078 512551
17407 512551 295928 511468 422694 153684 417060 347926 466641 374218 354579 395458
17397 395458 421913 209555 313913 438082 714804 777477 297521 244273 40278 173731
17387A73731K89993j40874A28487J97430H4716a42791A97656q3265K18196j11796
17377B20791J34631a72511D53219K5001D0540J50474P997i186C84392j21328N4172
17366C17236m0934J3578J13261i7087D48020j29561I9051J58595k9022N2383j18558
17355A62449M7162I7359M54028A86295R2822j31776M9482O2841J36517j15039
17345B81142j02182J05533j11243K27852A12295h9012C00848L3366A43874j0674
17335A33200J49077J3098H7783L68381L4078B18170J20228M4130A80360K79453
17325D59813j3787A06528J34564j09184J06407J74337j89523J8693L05877J37097
17315F84796A53860J19285Q1435j24443o2225K56619k07689J60981A29242E0740
$$ plain form
17387 173731 463724 322850 128487 325917 84716 -142791 197656 114391 332587 220791
17377 220791 355422 -172511 453219 478220 40540 191014 199011 -9186 384392 263064 317236
17366 317236 276302 289880 403141 -97087 448020 318459 99051 257646 228624 281007 162449
17355 162449 209611 97359 551387 186295 279117 147341 196823 259664 396181 281142
17345 281142 178960 284493 173250 401102 112295 -89012 300848 334214 143874 133200
17335 133200 282277 295375 87783 456164 490242 218170 338398 382528 180360 459813
17325 459813 446026 106528 241092 131908 238315 412652 223129 241822 547699 684796
17315 684796 153860 273145 354580 230137 167912 424531 216842 377823 129242 50740
17304C36501A29596J55005k64l615L4899O336J14800j54260J23257P4400A78992
17292C74633m0258j9149a30801B12953J60192j6679M8370j15864J94049B4670
17281D24156j30566A14645K92185o0130K12930C6910K43647J00344Q8318m3261
17271D25958j53787l5651b1064C52528r4073K06517j58685J23346L03813A99825
17260A81477J80431A01989R4276K54040O153I5231M16635N1659A37183M2888l0573
17249A49498K17913A17003K63939J12632L5636B49799J17508n8266K81054j16431
17239D73664n2773j12708k1835C1691J29936R2718A8422K6549N42742A52917L01799
17228D54716j92174K05294k20194R0068R8376C7386K78620K65214k27386K7485
$$ plain form
17304 336501 129596 284601 284337 280722 315621 321957 436757 282497 405754 480154 178992
17292 374633 334375 315226 -130801 212953 373145 356466 404836 288972 483021 24670
17281 424156 293590 114645 406830 346700 559630 36910 280557 380901 469219 425958
17271 425958 272171 236520 -21064 352528 258455 464972 306287 429633 733446 199825
17260 181477 361908 101989 196265 450305 456458 95231 511866 563525 137183 180071 149498
17249 149498 367411 117003 380942 493574 529210 249799 367307 309041 590095 473664
17239 473664 420891 308183 286348 31691 161627 254345 18422 44971 587713 152917 454716
17228 454716 262542 467836 247642 337710 436086 37386 316006 581220 353834 381319
17218C81319n4741M0154A53294J22709J05131L2264m479P0510p6607j80425K28499
17207D50896A50133L26006j99495A21443K09960j46698K00846R6818A08156K64459
17197C72615L5319F982K28523o2040M43000k63067N3663P3820J31939L2k92961
17186C19891K4881j61684K44287P9277j73131p7748R3691p7281J29431J34438
17176E36052j48253Q401M8476L7128m1775J24788A81716K05607n9091M45448B19977
17164F31395A9808N46640B49754L9154K02990l0249j93505A15516N26816Q151
17154F50483j07165n5902k31072J89552J59430r6078E7890P44506C78663R732
17144C88395J72025j81176N4573A45184J87528K84782r5035L58169k72362k70814
$$ plain form
17218 381319 326578 366732 153294 276003 381134 413398 408919 479429 402822 222397 450896
17207 450896 150133 476139 276644 121443 331403 184705 385551 482369 108156 372615
17197 372615 407934 6982 235505 173465 616465 353398 407061 480881 612820 612852 319891
17186 319891 344772 183088 427375 506652 333521 255773 349464 272183 401614 536052
17176 536052 387799 396200 444676 481804 440029 564817 181716 387323 328232 773680 219977
17164 631395 19808 566448 249754 288908 491898 461649 268144 115516 642332 650483
17154 650483 543318 487416 256344 445896 605326 509248 57890 802396 378663 388395
17144 388395 560420 379244 433817 145184 332712 617494 522459 880628 608266 337452
17134C37452J02666J44986p7221j04351j47539J81822J16914B53776L49313j42393
17124D60696J16500k18847K08536k09530L78280l04753P1301K87372j43027j97562
17114D48966K75246J4505k38144K6180k31136K73328j34348M82846I7988O14015
17104G12003j50863j78575K03517j70762K71202j36371j51183L53442p2511L3875
17094G13774n0519j35302j51592K98109l25889O30088m81519J22448J49767l36302
17084D33063m6149K10914l8612J56391K5189C31122M44626K029m0521J0524K07483
17073I55263j98931j963P3831l00691j2501q0305K96970j18004J41760J08256
17063H63685O2408j41866L05755E29753K26324J08886m12626N48802m29276K56698
$$ plain form
17134 337452 440118 585104 507883 403532 255993 437815 554729 253776 603089 460696
17124 460696 577196 358349 566885 357355 735635 430882 502183 789555 646528 448966
17114 448966 724212 738717 500573 526753 295617 568945 434597 917443 97988 712003
17104 712003 561140 382565 586082 415320 686522 550151 398968 752410 679899 713774
17094 713774 663255 527953 376361 674470 348581 978669 497150 619598 769365 433063
17084 433063 386914 597828 559216 715607 740796 331122 775748 777777 737256 747780 955263
17073 955263 756332 754369 828200 527509 515008 434703 731673 613669 755429 863685
17063 863685 926093 784227 1089982 529753 756077 864963 452337 1001139 571863 828561
17053H28561j65408J96433j65524k7150K86429r8635N6617J05062J87186k32863
17043I70708k19576J12058k47803K42604j1348K7390P9209k9833k08220L90772
17033A105961K7815k18051k34850j57114L56101J58820k4815k52273J36351L6210
17023I34155k51273n6311J97401j98318K71829K69806m18925M04755j28485k51680
17013G72954L24005j53585L11684k52376J52914L2979q1108J97744j61126j11827
17003A032258k88851J47726K59220K26383m88882J07145K08309j60064l0310j24342
16993H88592J55588K46677j03010l326j6147J9177J65118j53948L70507k51616
16983A317612m6063J08257K24330n10523J10597j64299N76691n97701k1646L87249
$$ plain form
17053 828561 663153 859586 694062 666912 953341 854706 911323 1016385 1203571 970708
17043 970708 751132 863190 615387 857991 846643 874033 953242 923409 715189 1105961
17033 1105961 1133776 915725 680875 523761 879862 1038682 1013867 761594 897945 934155
17023 934155 682882 626571 823972 625654 897483 1167289 748364 1153119 1024634 772954
17013 772954 1096959 943374 1255058 1002682 1155596 1188575 1107467 1305211 1144085 1032258
17003 1032258 743407 891133 1150353 1376736 887854 994999 1203308 1043244 1012934 888592
16993 888592 1044180 1290857 1187847 1184521 1168374 1187551 1352669 1198721 1569228 1317612
16983 1317612 1271549 1379806 1604136 1093613 1204210 1039911 1616602 1018901 997255 1384504
16973A384504R1456l70116K18527K40327j76086K1126m4016J83398l13169M7095
16963A283046l09569N15439r8331j10002j44733M32983l69072K85988M6559K5892
16953A558200k74087M88945j51184j43856O0115K00488m9734J25079k96400L17191
16943A834757j62976J50112k68083N0171K9303K15441J42051L340r1789k74506
16933A627821L65726j33976n0753j41971O2635L91765k55869j10646M38706n12501
16923A680937N09852m83251L48550M5059j16549K03883l45900O1043l358M78297
16913B378563j60968P3401j56086j08442Q0125K12724j79742L93279j62020l45892
16903B024942N30604l465r0627j80184M37019m24293J89987O3433K07268k57184
$$ plain form
16973 1384504 1475960 1105844 1324371 1564698 1388612 1409738 1365722 1549120 1235951 1283046
16963 1283046 973477 1488916 1390585 1280583 1135850 1568833 1199761 1485749 1532308 1558200
16953 1558200 1284113 1773058 1621874 1478018 1538133 1738621 1688887 1813966 1517566 1834757
16943 1834757 1671781 1821893 1553810 1603981 1633284 1848725 1990776 1994116 1902327 1627821
16933 1627821 1993547 1859571 1808818 1666847 1729482 2121247 1865378 1754732 2193438 1680937
16923 1680937 2190789 1707538 2056088 2101147 1984598 2188481 1842581 1903624 1900266 2378563
16913 2378563 2217595 2290996 2134910 2026468 2106593 2319317 2139575 2532854 2370834 2024942
16903 2024942 2555546 2552081 2461454 2281270 2718289 2293996 2483983 2547416 2754684 2497500
16893B497500q6399J83866o0319K30979R2320r2236L04351n77276N30074l05000
16883B717860k9069K73615k7872J95327J24614J65863n78845J08789J22183J67892
16873C240357Q6152m9490q8024J73042k97563N82169n29005n0300N33326J5619
16863C616283J4108O0620n6148l5100L53998O5893n0250j08173J89830L56586
16853D407647p5040l35176N58511k60634n7396L71290k81247L45492K46109l6549
16843D883007k01194k50100L40809J83200M39895j42181Q7108p1541o85Q2726
16833E351044J39517j19845Q021J11239k3929L79362L9074L20693k4568m00953
16823E779655P09936L9123j67799J83032N52518m31137r507N00850K6716p175
$$ plain form
16893 2497500 2411101 2594967 2534648 2765627 2857947 2765711 3070062 2492786 3022860 2717860
16883 2717860 2688791 2962406 2934534 3129861 3254475 3420338 2841493 2950282 3072465 3240357
16873 3240357 3326509 3277019 3188995 3362037 3064474 3646643 3117638 3067338 3600664 3616283
16863 3616283 3630391 3691011 3634863 3599763 3953761 4019654 3969404 3861231 4051061 4407647
16853 4407647 4332607 3997431 4555942 4295308 4237912 4609202 4327955 4673447 4919556 4883007
16843 4883007 4681813 4431713 4772522 4955722 5395617 5253436 5340544 5269003 5268318 5351044
16833 5351044 5490561 5370716 5378737 5489976 5466047 5845409 5884483 6205176 6180608 5779655
16823 5779655 6489591 6528714 6360915 6543947 7096465 6665328 6655821 7156671 7183387 7176212
16813G176212L01234K77127N9521O6662O0535M47034j89536L49551R6537j17488
16803H527389L89487K75877K27796k68344Q05643J91549l79981O16635J5824L05113
16793A0706988m542J49629P94755j32406K20249L32848N65936M67631j74284K81655
16783A3208459K37585M75027K9071P78208L10382L33968K13322O79109M88466
16774A6753597P9641J16288J246211J2550P22838M31683J40090N34792N96155
16765B0633845R47314O85857N02502O60491Q90074M88171P99754P53091R92967
16756B7354066Q56272O61739R82259Q87194J044635J018650J122561J351057J024431
16747C6302864J128505J413893J154608J528107J366494J972694J235050J782955
$$ plain form
16813 7176212 7477446 7754573 7814094 7880756 7941291 8388325 8198789 8548340 8644877 8527389
16803 8527389 8916876 9192753 9420549 9152205 9957848 10149397 9769416 10386051 10401875 10706988
16793 10706988 10702446 10852075 11646830 11514424 11734673 12067521 12633457 13101088 12926804 13208459
16783 13208459 13446044 13921071 13950142 14728350 15038732 15372700 15586022 16265131 16753597
16774 16753597 16833238 16949526 18195737 18208287 18931125 19362808 19502898 20037690 20633845
16765 20633845 21581159 22267016 22769518 23430009 24320083 24808254 25608008 26361099 27354066
16756 27354066 28210338 28872077 29854336 30741530 31786165 32804815 33927376 35278433 36302864
16747 36302864 37431369 38845262 39999870 41527977 42894471 44867165 46102215 47885170
16739D7885170J734421J921387K209587J829426K380839K041923K554152K504701
16731F5061606K366194K348456K970615K694704K656952L323852K700972L139244
16723H7262595K898200L648162K773999L066307L032971L014012L204647K976613
16715A11877506K763829L004170K089159K300482K405216J603451J270424J409466
16707A28723703M11912Q13510L5267j17410n45510r62889j304726j735507j859277
16698A23459073k048142k659395k373503k505214l140585l134112l143921l168610
16690A01285591k861766l625480l078399l147403l100580l451226k730537l079566
16682G6210634k433854l346743k089828l106041k778363k419966j693144k607297
$$ plain form
16739 47885170 49619591 51540978 53750565 55579991 57960830 60002753 62556905 65061606
16731 65061606 67427800 69776256 72746871 75441575 78098527 81422379 84123351 87262595
16723 87262595 90160795 93808957 96582956 99649263 102682234 105696246 108900893 111877506
16715 111877506 114641335 117645505 119734664 122035146 124440362 126043813 127314237 128723703
16707 128723703 129135615 129949125 129984392 129866982 129321472 128358583 127053857 125318350 123459073
16698 123459073 121410931 118751536 116378033 113872819 110732234 107598122 104454201 101285591
16690 101285591 98423825 94798345 91719946 88572543 85471963 82020737 79290200 76210634
16682 76210634 73776780 70430037 68340209 65234168 62455805 60035839 58342695 55735398
16674E5735398k438751j808241j747769k071981j478798j815356j706553j466869
16666D1201080j620153j698970j147104j023822j675324p21191j741734p03428
16658C0869354j070750r86826p92166j128697o98646o95085p13597q27660o87058
16649B3268869m36875q92494j104637l80800p58346n22914j24153n41987p27467
16640A7779196l66282m96836n16044o74112r6470l40625m26425n73958k84995
16631A4003449o8775n99808l48230J3610o28883k95139q2586l62064K49763o57682
16621A1223655o03281Q1965m51059k4991l26150L9044n89743L0288l60256j70795
16611H848677p9573R3735p37729M85119l82545k44950l61340k59397L0017J29256
$$ plain form
16674 55735398 53296647 51488406 49740637 47668656 46189858 44374502 42667949 41201080
16666 41201080 39580927 37881957 36734853 35711031 34035707 33314516 31572782 30869354
16658 30869354 29798604 28811778 28019612 26890915 26192269 25497184 24783587 23955927 23268869
16649 23268869 22831994 21939500 20834863 20454063 19695717 19172803 19048650 18506663 17779196
16640 17779196 17412914 16916078 16400034 15725922 15629452 15288827 14862402 14288444 14003449
16631 14003449 13934674 13334866 12986636 13000246 12371363 12076224 11993638 11631574 11881337 11223655
16621 11223655 10620374 10702339 10251280 10226289 9900139 9939183 9349440 9379728 9019472 8848677
16611 8848677 8769104 8862839 8125110 8610229 8227684 7982734 7621394 7361997 7392014 7521270
16601G521270o62772L65494k57373j9592l36724p4713j51745n9712P2471l51163
16591F045441k8682k72066P7828l57825L25487m09759m8706j12662K8571k51765
16581D995862m85267O13052k64959N9659k09588j59261J96934m6534m22952M34847
16571D711793j15177n7145j18975l70678l8930K36378m36264K38641N4538o16453
16561C487728R0070n8062N0475J78928M0043n99564K89095l19880M54924l54107
16551C259650n0231k6474j55028L08799n28057K73281k84819j33970N44840j80515
16541C027476L1105j87035j16037P6686j48887r9910J73077k66202Q5581K13579
16531B789433k31877r4852j65561L52461k58910j06138j96733L31422J07662n76866
$$ plain form
16601 7521270 6858498 7223992 6966619 6947027 6610303 6535590 6383845 6324133 6396604 6045441
16591 6045441 6016759 5744693 5822521 5464696 5790183 5380424 5331718 5219056 5247627 4995862
16581 4995862 4510595 5123647 4858688 4918347 4708759 4549498 4746432 4699898 4276946 4711793
16571 4711793 4596616 4539471 4420496 4049818 4010888 4247266 3811002 4049643 4104181 3487728
16561 3487728 3577798 3519736 3570211 3749139 3789182 3189618 3478713 3158833 3613757 3259650
16551 3259650 3209419 3182945 3027917 3336716 2808659 3081940 2797121 2663151 3207991 3027476
16541 3027476 3058581 2871546 2755509 2832195 2683308 2583398 2756475 2490273 2575854 2789433
16531 2789433 2557556 2462704 2297143 2649604 2390694 2284556 2087823 2419245 2526907 1950041
16521A950041M99995l77830j13625n2312L47751k03330k370k2272J67194o4405
16511B128837j83521k10726L11177K12954M1664j85038j71883n237k80885L21494
16501A978836Q4039k95988k18433M49318r2397j95521J49440l42341J66552j50649
16491A532856L42141k58087j08888M3066J6830l24658N16123k56498j01190J90059
16481A591754j6464j79563K24572k38445K20243l99467q0124J29500j17938K01661
16471A335729O9034L1591N5378j28213L0423j56451J50695k4237m38947K23975
16461A148977K96070k31451r9590R5386J33930j01273j69893J65747N1688l25340
16451I64251M65504n11739L78404P8911j33838q9530j00263k22593K12506j09108
$$ plain form
16521 1950041 2450036 2072206 1958581 1906269 2254020 2050690 2048320 2026048 2193242 2128837
16511 2128837 1945316 1734590 2045767 2258721 2300385 2115347 1943464 1938227 1657342 1978836
16501 1978836 2062875 1766887 1548454 1997772 1905375 1709854 1859294 1516953 1683505 1532856
16491 1532856 1874997 1616910 1508022 1551088 1567918 1243260 1759383 1502885 1401695 1591754
16481 1591754 1575290 1395727 1620299 1381854 1602097 1202630 1122506 1252006 1134068 1335729
16471 1335729 1404763 1436354 1491732 1363519 1393942 1237491 1388186 1363949 925002 1148977
16461 1148977 1445047 1213596 1114006 1209392 1343322 1242049 1072156 1237903 1289591 964251
16451 964251 1429755 918016 1296420 1375331 1241493 1151963 1051700 829107 1041613 932505
16441I32505k8114J0582M77019m79560o3325j41578J27440K12673R181j98872
16431H57951j9690M7576p5342O6834m7591K07042p3855K57208j76383k43194L0542
16420H31098K19794l17418K17914j27887k07747K56231j95032N454K0055j05092
16410E97370L36598j93024J3215k0019J87573j58103K56141k10524n731j96638
16400F06858K28045L4832l31949J14909l18595L17689J10654K40192m60711J56927
16390F98851n7026M07579l42250j39305k3546L18369k70191j3399L9672j17686
16380E01068K65706l56725M46424k95414k25848k4548J93490J49417R6284C22037
16369H93185j77779o0873l5283r5925n215K9943J26378j66497l1308L27004C68213
$$ plain form
16441 932505 904391 914973 1391992 912432 849107 707529 834969 1047642 1056823 857951
16431 857951 838261 885837 810495 877329 829738 1036780 962925 1220133 1043750 800556 831098
16420 831098 1050892 733474 951388 823501 615754 871985 676953 682407 702462 597370
16410 597370 933968 740944 754159 734140 921713 763610 1019751 809227 803496 606858
16400 606858 834903 869735 537786 652695 334100 651789 762443 1002635 541924 698851
16390 698851 641825 1049404 707154 567849 544303 862672 592481 579082 618754 501068
16380 501068 766774 410049 856473 561059 335211 310663 504153 653570 749854 322037
16369 893185 715406 654533 619250 523325 518110 548053 674431 507934 476626 803630 368213
16357G45992l41193J68925k33798L20492P726o2727p5318L4598R5788k19717K53535
16346F94303J79018B92083P3353R4653J1801L95271A92836M15293j98004q1847
16336C28278k6055K9762K26988j39564j84813J07338N6375K36245j03675G9403
16325B75503J08560k1219R6010j07208Q9205Q9861j89738p5262L24051m4106P9419
16314F25076j97979q7133r3750M69570C53468M4866p030m7741K40312O4850j54767
16303D93958O4752Q6119B78714J20166A52325M13490j63044j82075L56874Q4201
16293F61771e1880C67450N1153K61461C39796E0476J18253J70723L4697L7650
16283D11799N9280H8967L98190A85394J04845j41683E8420L57582j03664N5330
$$ plain form
16357 745992 404799 573724 339926 660418 668144 605417 530099 564697 660485 440768 694303
16346 694303 873321 292083 365436 460089 471890 867161 192836 608129 410125 328278
16336 328278 302223 331985 558973 419409 234596 341934 398309 634554 530879 79403
16325 275503 384063 362844 458854 351646 440851 530712 340974 265712 589763 545657 625076
16314 625076 427097 339964 246214 715784 353468 398334 391304 343563 583875 648725 493958
16303 493958 558710 644829 278714 398880 152325 565815 402771 220696 577570 661771
16293 661771 -51880 367450 418603 680064 339796 50476 168729 339452 374149 411799
16283 411799 471079 88967 487157 185394 290239 148556 58420 416002 312338 367668
16273C67668k4954A64233K623K7912J39150A09445J27227J21183A63188N9698
16263B22886L50615r4493A83261J76249r2909m3625G2725N85029j77563E5851
16252C31631r8289M951A15027a19671C30276J07547k01590N9378J68533A75050
16241E83041j4310h5274A10580K03530o8665A17130C2318K68434H1636R5888E3997
16229A48551E6398O05094d8640D0456b625F1103Q6447P7531E9221K76664j02817
16218B33068f067B02921N1923k8967J44288M7538A8804L92918K0616j63572r6107
16207A72659K05049G5336K07962M0411J2709A51864L5604L6465J99718j55945
16197B67706j0086m1548H1737J18307q4398c191A32735K50462j3786m5739a20294
$$ plain form
16273 367668 342714 164233 166856 194768 333918 109445 236672 357855 163188 222886
16263 222886 573501 479008 183261 359510 266601 222976 72725 657754 480191 55851
16252 331631 233342 238293 115027 -119671 330276 437823 236233 295611 464144 175050
16241 583041 568731 -85274 110580 314110 245445 117130 32318 300752 81636 177524 53997
16229 148551 56398 661492 -48640 40456 -2625 61103 147550 225081 59221 335885 233068
16218 233068 -6067 202921 254844 225877 370165 417703 18804 411722 432338 268766 172659
16207 172659 377708 75336 283298 323709 336418 151864 187468 223933 423651 267706
16197 267706 257620 216072 81737 200044 115646 -3191 132735 383197 369411 323672 -120294
16185A87466H9963L96466i9330G7997K48961A0531K38235J64461A01421J87337
16175B88758B3909K6956J83889a90007A7326J84237J7669F8028J62790J31067
16165C61885F0737a69716H2197J11648F8186b95378B66380o2710I6795K68912
16155C65707p4871g699B30483k1894M5812e5622G0855g7766A91082n6664K06313
16144C40731A22298J02464I0867J75056a58815B87615a38960I2965K19025a6261
16133C08317r0289E6496k2573K16041j08819K32136A06498B8322Q721J36691a11160
16121a81015A53258P2604F1923c6069C68952I9858R6750b14990E892P4899c23056
16109a0598m0970l66668B05095M6813a35422M0735q962A18013b0500F527M8553
$$ plain form
16185 187466 89963 486429 -99330 77997 326958 10531 248766 413227 101421 288758
16175 288758 23909 50865 234754 -190007 17326 201563 219232 68028 230818 361885
16165 361885 60737 -169716 82197 193845 68186 -295378 266380 203670 96795 365707
16155 365707 290836 -7699 230483 208589 254401 -55622 70855 -77766 191082 134418 340731
16144 340731 122298 224762 90867 265923 -158815 287615 -138960 92965 311990 -16261
16133 308317 218028 56496 33923 249964 141145 373281 106498 28322 37043 173734 -111160
16121 -181015 153258 225862 61923 -36069 368952 99858 196608 -214990 5892 80791 -323056
16109 -10598 -51568 -418236 205095 251908 -135422 -94687 -103649 118013 -20500 6527 55080
16098E5080a61989P5239F3970c1252B4535d74392C95814D2485a8461B1992e9286
16086C32628c52520g8668J3746r1910C30837m3513D4453b36142F8547J16908j0438
16075A75017q1699J82129O5101p5904B0310Q8113J13513g9541k1495A29527O4549
16064A94076G8571L3089b30398B65732H0394M6425m6324n784Q8817c03855j9560
16053c23415F1205K35588a21182B97383f4691I1266M0531M4905b38952a0396m0956
16042e1352G1859K9816C4137b9492B96691f8056j03028A19394c00067E821d43273
16030c29088J27018B73417c57919A5161Q1198f7876F2948a44543b246D21856f331
16018a67976Q0734A71486J3980e0646r9167g678j89300A22669c15261b3030B29391
$$ plain form
16098 55080 -161989 -86750 63970 -31252 24535 -474392 395814 42485 -18461 21992 -59286
16086 332628 -352520 -78668 -64922 -156832 330837 287324 44453 -236142 68547 185455 175017
16075 175017 93318 275447 340548 264644 20310 108423 221936 -79541 -101036 129527 194076
16064 194076 78571 111660 -230398 265732 80394 126819 80495 74711 163528 -303855 -323415
16053 -323415 61205 296793 -121182 297383 -64691 91266 131797 176702 -238952 -10396 -51352
16042 -51352 71859 101675 34137 -29492 296691 -68056 -171084 119394 -300067 5821 -443273
16030 -329088 -202070 273417 -357919 15161 96359 -67876 62948 -144543 -2246 421856 -6331
16018 -167976 -87242 171486 185466 -50646 -149813 -7678 -196978 122669 -315261 -23030 229391
16006a13393A03415a39176J9031C4852b4840B24139c24971a03237K8955A32733
15995a7105j11677C71998A39527i0453q3834C2070K69054h7961A14319a93879
15984F7392a54969p4463R1009C3754J24343a77814B64240L10102k52817j44385
15974A77140J32482J21646p5284N713L16963K78614k34219K91449m56095N355
15964E63764p2027B24895j1386a18564C151d4079A75073a85027C14454A27456
15953A9267a19766j40498A28994E4799j2935o713N9505J45166p0821a55036B50545
15941A76310m6897e6918C94735D8128K2340c7952E4568b6370E14806A88867a20364
15929b90324d5503Q2A97872F8351A5383a55102E7501b14834F3609a29785b626
$$ plain form
16006 -113393 103415 -139176 -120145 34852 -24840 224139 -324971 -103237 -74282 132733
15995 -17105 -128782 371998 139527 -90453 -174287 32070 301124 -87961 114319 -193879
15984 67392 -154969 -229432 -138423 33754 158097 -177814 264240 574342 321525 177140
15974 177140 309622 431268 355984 361697 678660 957274 723055 1014504 558409 563764
15964 563764 491737 224895 213509 -118564 3151 -44079 175073 -185027 314454 127456
15953 19267 -119766 -260264 128994 54799 41864 35151 94656 239822 169001 -155036 250545
15941 176310 129413 -56918 394735 48128 70468 -37952 54568 -26370 514806 188867 -120364
15929 -290324 -45503 -45421 197872 68351 15383 -155102 57501 -214834 63609 -129785 -2626
15917C25773L4681g046B37141a02051k91638D76852k18308a44148l10899e5459
15906B16173D4678b43818d1295I7581a05805q3369j23722J41696g0160K4697A65784
15894B49446i6949p0436n4631B20207E7735B1882a77785C4693a05654K5926m7927
15883a27655a1890C5316N5295c05438H911J59838g5226I7277b62365A66858f0050
15871B34180b51556B10859J64635A3259a22557A64158a43234j00250P971I5940
15860d21987C94893b91156B55419d1657j93871j88603A1117a03098C65233p7337
15850B87896a08637k10201O6740B69250b60350P8688e0504A6658b5125B85567
15839c31253F838c8925A61610a58335q8378o3681J20088K8653k7322g747D50367
$$ plain form
15917 325773 360454 -7046 237141 -102051 -393689 476852 258544 -144148 -455047 -55459
15906 216173 44678 -243818 -41295 97581 -105805 -189174 -312896 -171200 -70160 -45463 165784
15894 249446 -96949 -167385 -222016 220207 57735 21882 -177785 34693 -105654 -79728 -127655
15883 -127655 -11890 35316 90611 -305438 8911 168749 -75226 97277 -262365 166858 -60050
15871 234180 -251556 210859 375494 13259 -122557 164158 -143234 -243484 -235513 95940
15860 -421987 394893 -291156 255419 -41657 -235528 -424131 11117 -103098 365233 287896
15850 287896 -108637 -318838 -252098 269250 -260350 -181662 -50504 16658 -25125 285567
15839 -331253 6838 -38925 161610 -158335 -246713 -310394 -190306 -161653 -188975 -7747 450367
15827D9210J01696a42843N5360E9659a46813P2918p0384E8274c0916A08594a54873
15815B19609a82675G2694a02961D517K50731j10048D9533N147a069B66592a80463
15803a61382j81400J58309d8441k2743j08104g1148A0661d53551g1821G0580J19983
15792A90563n2161i5469L7549B6172e1914j75953K2858E0258J17018j470q2484
15781H3322J27921c92010A03860b00618R8993G2936b95009B24765c08878n929
15771c14807A20001k0023A7867a33335h104A12869I509J68122N3308m2665a17170
15759c5045A3975M2849b50476r145A6447d34593A10552l493k7257b59581e1286
15747A8216M8329J2945e5347j70991B18282j9426h5815D3364P369a91692k0204
$$ plain form
15827 49210 150906 -142843 -87483 59659 -146813 -73895 -144279 58274 -30916 108594 -154873
15815 219609 -182675 72694 -102961 4517 255248 145200 49533 54680 -1069 266592 -180463
15803 -161382 -342782 -184473 -48441 -71184 -179288 -71148 10661 -453551 -71821 70580 190563
15792 190563 138402 -95469 -57920 26172 -51914 -227867 -205009 50258 167276 165806 83322
15781 83322 211243 -392010 103860 -200618 -101625 72936 -295009 224765 -308878 -314807
15771 -314807 120001 99978 17867 -133335 -8104 112869 9509 177631 230939 188274 -117170
15759 -35045 13975 56824 -250476 -259621 16447 -434593 110552 107059 79802 -259581 -51286
15747 18216 66545 79490 -55347 -226338 218282 198856 -85815 43364 50733 -191692 -211896
15736b11896j29496A71424E8298a1293B1511d2887k5295A2096J40913e6330A90748
15724H4803A0449L08745p6262c06155f1282l462b194j45367A80961b67270A40321
15712i6579A54445b04115A11733m8690Q5235a46945B24420q3935i1601j67210
15702b58811M990H8530C6524P1300d24701A13710c57087d115E9823a46165q1108
15691b27273H0893K0569P8499a75085l8506j01577a45230A81819p7236h5218j1456
15680i6674k63907c3068l9018k2464D37017f3613G9628b26291P2813A86988c39356
15668I2999a88294A41056B6275h9374J862j4376k61177K7728f4944m2970A82701
15656h5822B31194b32158E763M3287b63675l01823B37347A9571J82486f5439G7182
$$ plain form
15736 -211896 -341392 171424 58298 -11293 21511 -42887 -68182 12096 153009 -56330 190748
15724 84803 10449 319194 242932 -306155 -61282 -64744 -2194 -147561 180961 -267270 140321
15712 -96579 154445 -204115 111733 63043 148278 -146945 224420 140485 -91601 -258811
15702 -258811 -253821 88530 36524 107824 -424701 113710 -357087 -4115 59823 -146165 -227273
15691 -227273 80893 101462 179961 -175085 -213591 -315168 -145230 181819 104583 -85218 -96674
15680 -96674 -360581 -33068 -72086 -94550 437017 -63613 79628 -226291 -153478 186988 -339356
15668 92999 -188294 141056 26275 -89374 -87512 -101888 -363065 -335337 -64944 -107914 182701
15656 -85822 231194 -232158 5763 49050 -263675 -565498 237347 19571 202057 -65439 77182
15644c5409k6850k3991c8567q8696l36538a29662A6652b78541b4688j07469m3752
15633a75909o2519P0928A58585m8129E5090Q444J49729A04862L4817c43699N8464
15622b85235A06716e348B25621a91411A07672b91180a17549B59958c10808B43976
15611b90768E9786E702h6127c6115q4795K3352d6127k58253g3312a1342n6956
15600f8298j60549Q5080A12838R8285I4824K13545b54800j61996C09376D6784
15589c25851A03095B2521a03032G19a46868G6452d1093k30341A43683a22598b6047
15577A15971a39163C31485A7094a61193k44624A27410b9428G3066b2918B4530
15566E5110f2975A43015c42423i4746F6942c309B3175K13831G8798c62674i8648
$$ plain form
15644 -35409 -62259 -86250 -38567 -127263 -463801 -129662 16652 -278541 -24688 -132157 -175909
15633 -175909 -238428 -167500 158585 110456 55090 63534 213263 104862 139679 -343699 -285235
15622 -285235 106716 -5348 225621 -191411 107672 -291180 -117549 259958 -310808 243976
15611 -290768 59786 5702 -86127 -36115 -120910 -97558 -46127 -304380 -73312 -11342 -68298
15600 -68298 -228847 -143767 112838 211123 94824 308369 -254800 -416796 309376 46784
15589 -325851 103095 22521 -103032 719 -146868 76452 -41093 -271434 143683 -122598 -26047
15577 115971 -139163 331485 17094 -161193 -405817 127410 -29428 73066 -22918 24530
15566 55110 -62975 143015 -342423 -94746 66942 -3309 23175 237006 78798 -362674 -98648
15554a3406j10723C70864e7903A15612b0600l30784J35832G6226l3897J03377
15544A45706d6076I2822h063j01343K3384k89476h7781A64621C2091N9479J18617
15533B10187b74198a3907m2027R135j18300A17579a48885B00059C7570J95359
15523B32929I4904J57576O8904a50398D07973a3153A64593a28240H2209a71674
15512B63711b52154e0795A8839J90195Q7693k6486h6409G1050K68983g8916A79096
15500C4968K70400L2481b40612D58987A84605N5854m332I1364L21432A4027J97767
15489B11794Q5030A32681n6341J36360L64392B17256N9552M3460r785c4870A28626
15477a92428C92548G263N9921Q1255J73754B7801L44408A9975R3634J45456I9845
$$ plain form
15554 -13406 -124129 370864 -57903 115612 -20600 -351384 -215552 76226 42329 145706
15544 145706 -46076 92822 -8063 -109406 -86022 -375498 -87781 164621 32091 91570 210187
15533 210187 -274198 -13907 -55934 -46799 -165099 117579 -148885 200059 37570 232929
15523 232929 94904 252480 321384 -150398 407973 -13153 164593 -128240 82209 -171674
15512 263711 -252154 -50795 18839 209034 296727 270241 -86409 71050 340033 -78916 179096
15500 34968 305368 337849 -240612 458987 184605 240459 236127 91364 412796 14027 211794
15489 211794 296824 132681 76340 212700 577092 217256 276808 320268 310483 -34870 128626
15477 -192428 392548 7263 67184 148439 322193 27801 372209 19975 113609 259065 99845
15465A94796c32296F4346a3748D47656M3919A04292K05114o1716P8172L84929
15455G10791k73287A35022J16691M1010r9733h4295l7442C0629M65574B01873
15444b39934B47548a35148A8440K73120a12512A16621P8016L01592g9841E9054
15433b26266b8138q7954C04300l1883Q5224Q1643O3330m4587L75240K09818l11565
15422G31520j29093j53794j88025A8336P8077d6272o7660E9896a00555a6545l7226
15411e3771A53637a3534C36406C6044g5037B6654P9055g8340K0676A8462J27306
15400A45768c36013a25394b7519A98602c47934N5576B71514a09387F190i2322
15389a93724B14001B9745j4202b73528B28683i4097A0723K55881A4337O2620b28650
$$ plain form
15465 194796 -332296 64346 -13748 447656 491575 104292 309406 247690 325862 710791
15455 710791 437504 135022 251713 292723 192990 -84295 -121737 30629 496203 201873
15444 -239934 247548 -135148 18440 291560 -112512 116621 194637 496229 -79841 59054
15433 -226266 -28138 -116092 304300 272417 357641 439284 502614 458027 833267 1043085 731520
15422 731520 602427 448633 260608 18336 96413 -46272 -113932 59896 -100555 -16545 -53771
15411 -53771 153637 -13534 336406 36044 -75037 26654 105709 -78340 -57664 18462 145768
15400 145768 -336013 -125394 -27519 198602 -347934 -292358 271514 -109387 6190 -92322
15389 -193724 214001 29745 15543 -273528 228683 -94097 10723 266604 14337 76957 -228650
15377B02552a61960e4368J1195k0575H8602a86009d931p2390A30877K57851A09450
15365F8131P0318D3027o421L7502a42498C5687J80373f4993C52791R459I3800
15353B87204c2817A33797b0779C82684A52582a90680D17736A94876E2511L1186
15343H3697O6717J20273M15787f879E0843K9284N5572K44785n3991b8139m05928
15332d34067B76331J5625o4057M0270o7823R8891p7817K1903K86278k1140j10602
15321C97859a7177j39807A92000J00220c7885a3112j07435D23622b33192H9943
15310A49142a39771H5313d496B35657a20946j8316A51347e8867b608j36665c9160
15298A18207O6553J68953R6595j71815j17731b6263B22922a05087A70935K6956
$$ plain form
15377 202552 -161960 -54368 -43173 -63748 88602 -186009 -4931 -77321 130877 388728 109450
15365 68131 138449 43027 36606 74108 -142498 35687 216060 -64993 352791 362250 93800
15353 287204 -32817 133797 -20779 382684 152582 -190680 417736 194876 52511 83697
15343 83697 150414 270687 686474 -6879 50843 80127 135699 380484 326493 -28139 -434067
15332 -434067 276331 291956 227899 268169 200346 299237 221420 243323 529601 508461 397859
15321 397859 -17177 -156984 192000 292220 -37885 -13112 -120547 423622 -233192 89943
15310 149142 -139771 85313 -4496 235657 -120946 -139262 151347 -58867 -2608 -139273 -39160
15298 118207 184760 353713 450308 278493 160762 -26263 222922 -105087 170935 197891
15288A97891I0236a83232G8498a87071B54767D1719a95313D6614A1977J72674
15278A84651a38177B993g518j4714C98224j81995f2821E0263J44708C584e2846
15266d4687o8418j3769E6842k4338a27430A59999a4163l34895e719G7275a00786
15254b08687D1429a10451D63002B16401b67447B14076E0904j4762K46269c5706
15243e9411k4694l83784a4547A71200P6252K1665a88239E8238N1625Q8995F9465
15231D80851j42788L5739n4177K20841K22584L77386R4711r6341M6950n27569
15221F58187k62134K28949B10868J05943j33994q5229K24716q301j22716E6412
15210A46302l9648P3574j8184p2292J03843h0489j23688A74147b16960b5110A64399
$$ plain form
15288 197891 90236 -183232 78498 -187071 254767 41719 -195313 46614 11977 184651
15278 184651 -138177 2993 -7518 -22232 398224 216229 -62821 50263 194971 3584 -52846
15266 -44687 -113105 -126874 56842 32504 -127430 159999 -14163 -349058 -5719 77275 -100786
15254 -208687 41429 -110451 463002 216401 -267447 214076 50904 36142 282411 -35706
15243 -59411 -84105 -467889 -14547 171200 247452 269117 -188239 58238 109863 198858 69465
15231 480851 338063 373802 319625 540466 763050 1140436 1235147 1138806 1185756 658187
15221 658187 396053 625002 210868 316811 182817 97588 322304 314003 191287 56412
15210 146302 106654 180228 162044 89752 193595 -80489 -204177 174147 -216960 -25110 164399
15198B7367Q6952b72069O3892R6114n3945E2978J04584A3937L51705o3652B7048
15186b8306A63467o1967k6105b9019m1071I1894C2922J33497b6381p1296E671
15174A004J38559m3193N387k7830H599b42977g6849A82513G9851J72257A23258
15162a15410A47183L3576K4107g1103H4647J2909N3044G2529b50460B47920e8367
15150B21780h1191C49846j51681O1998i3465r5529C3222n321e3620A13282B30
15138H3004a71389m658A41734e259m13719B26871j09281l4801C7296j4547h6188
15126f2680A9229K2950c59132C86924p0502J26873b23320B4949d204A66114J43905
15115C10019A25330K95016H4581L95258D1859J79906J12636A42171K2844J0265
$$ plain form
15198 27367 114319 -272069 -208177 -112063 -166008 52978 157562 13937 365642 301990 27048
15186 -28306 163467 101500 75395 -29019 -70090 91894 32922 166419 -26381 -97677 5671
15174 1004 139563 96370 101757 73927 8599 -242977 -76849 182513 79851 252108 123258
15162 -115410 147183 180759 204866 -71103 84647 97556 150600 72529 -250460 247920 -58367
15150 221780 -81191 349846 198165 260163 -93465 -188994 33222 27901 -53620 113282 230
15138 83004 -171389 -176047 141734 -5259 -418978 226871 117590 82789 37296 22749 -86188
15126 -62680 19229 42179 -359132 386924 316422 443295 -223320 24949 -4204 166114 310019
15115 310019 125330 420346 84581 479839 41859 221765 334401 142171 165015 175280
15105A75280l6265J77772J90949A63669D742J41248N51698A97557r011r1070g0752
15093A38103c567A49676L7833m3507a86686A09516J4903L0765m9594O5171b47013
15081C909L5863M7846l746a74302H5901j2718a6568B33069E557J45410O5650a1786
15068h2470B67267a3160C86786A0255J24284a63658D4500L50829j71651D4779
15057a84372j17674B22335d40A82864m8738L08734j17649G1335O1066n0160J79733
15046B61974n6067M9368J38062K43021G1691L15617n3175L7040A15316A7034K58163
15035B75197f2461A75253L8820P3839k7610K25456F7024M00633k17270J41442
15025C91829j22709K70891a9000E40055A62807K01086k170K25253k53737K40884
$$ plain form
15105 175280 139015 316787 507736 163669 4742 145990 697688 197557 188546 97476 -70752
15093 138103 -3567 149676 187509 144002 -186686 109516 124419 155184 105590 170761 -247013
15081 3909 39772 87618 83872 -174302 85901 73183 -16568 233069 5557 150967 216617 -11786
15068 -82470 267267 -13160 386786 10255 134539 -163658 44500 395329 223678 44779
15057 -184372 -302046 222335 -440 182864 134126 442860 325211 71335 132401 82241 261974
15046 261974 205907 255275 393337 636358 71691 387308 334133 371173 115316 17034 275197
15035 275197 -62461 175253 214073 287912 260302 485758 67024 467657 250387 391829
15025 391829 269120 540011 -19000 540055 162807 363893 361723 586976 333239 574123
15015E74123J68239K4116k03289K06787k7736A23708K51013I0405O44080k74741
15005D59744j6423J83755m3252j1788o8040j59090K9020N2251j60746J82365l1697
14994D16099O1805A58001L2026J54897p5355l4114D9529K48342L0928O8448N359
14983D02606J37786L5934J46867B32414M91824l42835k9888O1274A76993J49488
14973C26481J49323m6077J40315j64113K40407K4811j76548p9918M42107n1734
14963H05054j97451J78147J6741A69905L49329O5796j7855J80699M1417j36016
14953F53275k52400L51041B31963L14153E7609J83437o6073J72866A29286K93525
14943D22811j11500L518K95990k67047K50268B12886o1345L26327o8568J23014
$$ plain form
15015 574123 742362 766478 563189 769976 742240 123708 374721 90405 734485 459744
15005 459744 443321 627076 583824 572036 503996 344906 373926 426177 265431 447796 416099
14994 416099 477904 158001 190027 344924 269569 235455 49529 297871 328799 397247 402606
14983 402606 540392 576326 723193 232414 724238 381403 351515 412789 176993 326481
14973 326481 475804 429727 570042 405929 646336 671147 494599 414681 856788 805054
14963 805054 607603 785750 802491 169905 519234 585030 567175 747874 789291 653275
14953 653275 400875 751916 231963 546116 57609 241046 174973 347839 129286 422811
14943 422811 311311 314829 610819 343772 594040 212886 151541 477868 409300 532314
14933E32314k33142R0280K30997B64724L42009J46054k14649K68878j3560l26357
14923D67099j58896L5363J32815B34605N81816B26596M58143p4819M80792j02782
14913I87930j04236O08696m4265m622P9540J09487J09321k1992j37731J05779
14903A687907r7144K53697J69226j32642Q995l02912k67199j0237r8978l45198
14893H65515j3353l19540J88370q9354A24087K37229R5984p6280P4715O5855j28189
14882C93401l8494J30845I579L35510O6276j49371K27326L6059k37770L61513
14872F49122j85521L329n8248P76795l68532l56362M12454j97511l4763M75851
14862A116614j95414M373j74976j85032k21818L2908J4570j12651K93180p4493
$$ plain form
14933 532314 299172 389452 620449 264724 606733 752787 538138 807016 793456 467099
14923 467099 308203 343566 476381 234605 816421 226596 684739 609920 1090712 987930
14913 987930 883694 1492390 1448125 1443503 1523043 1632530 1741851 1719859 1582128 1687907
14903 1687907 1590763 1844460 2013686 1881044 1890039 1587127 1319928 1309691 1210713 865515
14893 865515 852162 532622 720992 631638 124087 361316 457300 381020 455735 521590 393401
14882 393401 354907 485752 9579 345089 411365 261994 489320 525379 287609 649122
14872 649122 463601 466930 408682 1185477 816945 460583 873037 675526 640763 1116614
14862 1116614 921200 925573 750597 565565 343747 376655 391225 278574 571754 497261
14852D97261R5456J20496j1412O4611P1353C05923L36947R4328l68203K6417J8942
14841D14354L50170n4423l49801J24992N62521C72013J79482n836J4959N6260
14831F16878L55362k39685q6799K51456M2096j00485L17951l51560M23773J31446
14821A360433j70329E44086N55956l19327l3511j00519B31838K93021M732J1003
14811E40594L45016l05650L31426R805j76077j20458M88909D61316r7868M18489
14801G81937J40807J10817j47638l87789N30909C90531M0783m7245N17831j01245
14791H00655j35568J14869J02200q9011O3004L18449l53980B85237M80510J29367
14781H95114j98270k05473K12315Q0935B88369J69907K41375o7591j03176o5282
$$ plain form
14852 497261 592717 713213 701801 766412 837765 305923 642870 737198 368995 395412 414354
14841 414354 764524 710101 360300 485292 1047813 372013 551495 545659 560618 616878
14831 616878 972240 732555 645756 897212 939308 838823 1156774 805214 1228987 1360433
14821 1360433 1190104 544086 1100042 780715 747204 646685 231838 524859 529591 540594
14811 540594 885610 579960 911386 921191 745114 624656 1113565 461316 363448 781937
14801 781937 922744 1033561 885923 498134 1029043 390531 431314 384069 901900 800655
14791 800655 665087 779956 882156 793145 856149 1174598 820618 285237 765747 895114
14781 895114 696844 491371 703686 784621 288369 458276 699651 632060 528884 463602
14771D63602K28314k15726R4049M17369m34520n8771Q0606J373L38233j43551
14761G70978K13402k76728N6645J06717k5243J60052l24930K34420j15925J09470
14751I08858k08632j00256R9560P630L5958l0946o3149j61763m6618R3208R6968
14740F30818L14228m31933K62164j14831l18547L99636L1505M0004o8984O3086
14730H07146Q9264k49938L47961j48691J50776m54417q4317L15082n7661j48126
14720E67079M69738j70358O7781L456m7916M21975k87373L00252K29637p8769
14710A475502R2297j11547l08824J75330m75309M1877J69189r3358J18231M3543
14700A126931l42160K85695j9920k7686j51888n214k39971N38232p0086J42176
$$ plain form
14771 463602 691916 476190 570239 987608 553088 494317 574923 576296 914529 770978
14761 770978 984380 707652 764297 871014 845771 1005823 680893 915313 799388 908858
14751 908858 700226 599970 699530 707160 743118 712172 649023 487260 440642 533850 630818
14740 630818 945046 513113 775277 660446 341899 741535 773040 813044 744060 807146
14730 807146 896410 646472 994433 845742 996518 542101 457784 772866 715205 567079
14720 567079 1036817 866459 934240 937696 889780 1311755 1024382 1324634 1554271 1475502
14710 1475502 1567799 1456252 1147428 1322758 847449 889326 1058515 965157 1083388 1126931
14700 1126931 784771 1070466 1050546 1022860 870972 865758 625787 1164019 1093933 1236109
14690A236109n4037K87582j09517L1141K44166P2544L05449m18431J69002j38925
14680A625083l84865J62149l43359J1665O7729j23993j09533k74190M85604j99434
14670I16856P4382R0295k19587m5548J22013M722o3542q8693M8760L94345Q363
14659A242366k76024J63489r0376K5393J06296l30593j00652K78870l12437N12996
14649A219328k43221j24461Q5385j9553J83648k65025O80387m78050L91426m32326
14639I97538p5644L32436K00654k29100J71760l60290J71955J9658j09699P1908
14629A191176k14606K81588P6663j23864j16550q4964L98485j41960R9342o3313
14619A301997k85921J38907Q8605K74129J57244l25496j68303K7996L19245k9470
$$ plain form
14690 1236109 1182072 1469654 1360137 1391278 1635444 1707988 2013437 1595006 1764008 1625083
14680 1625083 1240218 1402367 1059008 1070673 1138402 1014409 904876 630686 1116290 916856
14670 916856 991238 1081533 861946 816398 938411 943133 879591 790898 839658 1234003 1242366
14659 1242366 966342 1129831 1039455 1064848 1171144 840551 739899 1018769 706332 1219328
14649 1219328 976107 851646 937031 917478 1101126 836101 1516488 1038438 1429864 997538
14639 997538 921894 1254330 1454984 1225884 1397644 1037354 1209309 1228967 1119268 1191176
14629 1191176 976570 1258158 1334821 1210957 1094407 1009443 1407928 1265968 1365310 1301997
14619 1301997 1016076 1154983 1243588 1517717 1674961 1349465 1181162 1209158 1528403 1498933
14609A498933k52081J0024j82472L15511R5986o5708K2245j48438L5634M4975
14599A374609o2050J63900J00670J80440l73996J10431K0895M53812j49953l408
14589A815350j27187k50290n4848N50608m69318j18610K94840k16L20577n17168
14579A443738J56123L70815m70111J11255K83897l8416j53613J86537q0897K12161
14569B021489k38712J31910M271J05289K12777p14901L60927n3834M76861l83588
14559A922489l8941K56615q3833R4641k80034K95732q3125P5539L02763J29212
14549B591058j57624J57750k48948N16161j54646J42801M66899k47244L30647
14540C396854l288K71069N26001N83802O41475J549784J808897L598804N983701
$$ plain form
14609 1498933 1246852 1256876 1074404 1389915 1485901 1420193 1442438 1294000 1329634 1374609
14599 1374609 1312559 1476459 1577129 1757569 1383573 1494004 1514899 1968711 1818758 1815350
14589 1815350 1688163 1437873 1383025 1933633 1464315 1345705 1640545 1640329 1960906 1443738
14579 1443738 1599861 1970676 1500565 1611820 1895717 1857301 1703688 1890225 1809328 2021489
14569 2021489 1782777 1914687 1918958 2024247 2237024 1522123 1883050 1829216 2306077 1922489
14559 1922489 1883548 2140163 2056330 2150971 1870937 2166669 2083544 2159083 2461846 2591058
14549 2591058 2433434 2591184 2342236 2858397 2703751 2846552 3313451 3066207 3396854
14540 3396854 3393566 3664635 4190636 4774438 5415913 6965697 8774594 12373398 18357099
14531A8357099R790424J539785r864184n962949l364581k537137k321330j126359
14523D510768K01195L1881m22541q02360p45111j08223M3207m92663J28319j71944
14513B172528J92806m22740L93347q569j72121L54222P9305l88263L67704Q8288
14503B656507j30042K46405o25583O87795k72779J55599k06632K98570O8056K30876
14493C108772l61849m5116J99351k14377J96011K55442l14951K26338K05919l17958
14483B937582J08517J30752J4600L43126j54815L361k44289J36291L62854l05282
14473C332697K7308L1196L18860j15396N0846K77896j75145k5863q8954K58688
14463C892133r1281L7441K08321N3735J44479L8272K6139L2393K83079j76443
$$ plain form
14531 18357099 28147523 29687308 19823124 13860175 10495594 7958457 5637127 4510768
14523 4510768 4711963 4743844 4321303 3518943 2773832 2665609 2708816 2216153 2344472 2172528
14513 2172528 2365334 1942594 2335941 2327372 2155251 2509473 2588778 2200515 2568219 2656507
14503 2656507 2526465 2772870 2147287 2835082 2562303 2717902 2511270 2809840 2877896 3108772
14493 3108772 2746923 2701807 2901158 2686781 2882792 3138234 2823283 3049621 3255540 2937582
14483 2937582 3046099 3176851 3191451 3534577 3379762 3383123 3138834 3275125 3637979 3332697
14473 3332697 3360005 3391201 3710061 3594665 3645511 3923407 3748262 3722399 3633445 3892133
14463 3892133 3800852 3838293 4046614 4100349 4244828 4283100 4309239 4341632 4624711 4448268
14453D448268j2073J63065l27695j04056J97444N40535k77934j5583R8741j13705
14443D597007N30221m32893M98050l7978K82998j42006M0604N3817K00771R208
14433E599799o9178k09597K50038L5797K2115K80571j59799L76149l5522o9191
14423F021182J7464L15128p5453P8348N33520O7993j47431M1101q9049N63497
14413G326300m9200l20971L52032j70791K85273K76107J15382L22656K82306k47325
14403H171769K8722L10818L91900j74849J73811J42667j7805m1163J79160J17061
14393I282091M48109j05702P7159L99772R1165L59776J47575j42071K92639Q4977
14383A0935490K19692J35167P809L24379K22328l8737N1802K70694L97557j25571
$$ plain form
14453 4448268 4436195 4599260 4271565 4167509 4364953 4905488 4627554 4611971 4710712 4597007
14443 4597007 5127228 4694335 5192385 5154407 5437405 5295399 5336003 5389820 5590591 5599799
14433 5599799 5530621 5321024 5571062 5606859 5628974 5909545 5749746 6125895 6090373 6021182
14423 6021182 6038646 6353774 6278321 6356669 6890189 6958182 6810751 6851852 6762803 7326300
14413 7326300 7277100 6956129 7308161 7137370 7422643 7698750 7814132 8136788 8419094 8171769
14403 8171769 8200491 8511309 8903209 8728360 8902171 9044838 9027033 8985870 9165030 9282091
14393 9282091 9730200 9624498 9701657 10101429 10192594 10552370 10699945 10557874 10850513 10935490
14383 10935490 11155182 11290349 11298158 11622537 11844865 11806128 11857930 12128624 12526181 12400610
14373A2400610M51611M65069j33777K49848N82815J70426K28278L43274L47316
14364A5105470K74098J56539k800N47488L38662L02115K21200J07715M13421J87728
14354A7651636O57601P15774N0018K88324Q18493J00372O04308Q1250N13036M43120
14344B1923932N58212P53846J76515N69107O41360M77776K49296J078251J94890
14335B6623185O60620P87347Q45461O17590P14854R76617J012649J088470L11705
14326C3638498J406033Q14511J018742R16741J201289J125203J098113J651551
14318D2870681Q62768J290428J458489J299635J415650J645302K100660J542266
14310E4485879K084257J664982K036996K267384K210620K079456K497759K707721
$$ plain form
14373 12400610 12852221 13317290 13183513 13433361 14016176 14186602 14414880 14758154 15105470
14364 15105470 15379568 15536107 15533307 16080795 16419457 16721572 16942772 17050487 17463908 17651636
14354 17651636 18309237 19025011 19075029 19363353 20181846 20282218 20886526 20967776 21480812 21923932
14344 21923932 22482144 23235990 23412505 23981612 24622972 25100748 25350044 26428295 26623185
14335 26623185 27283805 28071152 28916613 29534203 30249057 31225674 32238323 33326793 33638498
14326 33638498 35044531 35859042 36877784 37794525 38995814 40121017 41219130 42870681
14318 42870681 43733449 45023877 46482366 47782001 49197651 50842953 52943613 54485879
14310 54485879 56570136 58235118 60272114 62539498 64750118 66829574 69327333 72035054
14302G2035054K365345L246976K731024L351162L123544L174081L839673L775655
14294I7642514M458521M355198M118166N423056M920814N932961N605639N815760
14286A38272629O626109P347656P158562P658556Q281798Q603242R319450R745111
14278B03013113R908935J0968549J1186281J2301797J2628030J3150001J3774244
14271B86930950J4247899J4075200J4584835J4417977J4201175J4253011J4625315
14264C87336362J3572509J2040601J1491009J0298191R365587P752339O331981
14257D58188579L654966O37852r72420l987245p427972o217242l890188k042450
14249D37943880o506533p713953r486039j3271791j3215994j3475758j4658092
$$ plain form
14302 72035054 74400399 77647375 80378399 83729561 86853105 90027186 93866859 97642514
14294 97642514 102101035 106456233 110574399 115997455 120918269 126851230 132456869 138272629
14286 138272629 144898738 152246394 159404956 167063512 175345310 183948552 193268002 203013113
14278 203013113 212922048 223890597 235076878 247378675 260006705 273156706 286930950
14271 286930950 301178849 315254049 329838884 344256861 358458036 372711047 387336362
14264 387336362 400908871 412949472 424440481 434738672 444104259 451856598 458188579
14257 458188579 461843545 462481397 461508977 457521732 450093760 443876518 439986330 437943880
14249 437943880 431437347 423723394 414237355 400965564 387749570 374273812 359615720
14242C59615720j4549791j4753212j4255163j4155615j3686203j2923992j2808168
14235B62483576j2390326j1724218j2147266j1431479j1214324j0384293r625416
14228A83566254r327719q718510p830703p596195p032089o475929o059234n981599
14220A24544276n725148n446595m551653m645343l866081m242080m052710l356515
14212H8658151l719276k962526k893754l459185k418559k726653k415519k622436
14204F5440243j601164k861376j751795k033643j685567j687798j403731j849815
14196E0565354j634943j570877j145717j448852r49572j057135j380831j459716
14188C9917711r56610r88829p54541j208378q56518j158987j000857n34280p01464
$$ plain form
14242 359615720 345065929 330312717 316057554 301901939 288215736 275291744 262483576
14235 262483576 250093250 238369032 226221766 214790287 203575963 193191670 183566254
14228 183566254 174238535 165520025 157689322 150093127 143061038 136585109 130525875 124544276
14220 124544276 118819128 113372533 108820880 104175537 100309456 96067376 92014666 88658151
14212 88658151 84938875 81976349 79082595 75623410 73204851 70478198 68062679 65440243
14204 65440243 63839079 60977703 59225908 57192265 55506698 53818900 52415169 50565354
14196 50565354 48930411 47359534 46213817 44764965 43815393 42758258 41377427 39917711
14188 39917711 38961101 37972272 37217731 36009353 35152835 33993848 32992991 32458711 31757247
14179C1757247j208039m66317o82222p09917q09592q23003m76219m59345p58911
14170B5363682n04424l66071m80916r82382r6647p69575n77359j83093n55525
14161B0847690l3883r80612k43627l96216k95806l22516l01508n91332j51509
14152A7530681n56332n51853k56813Q2990l87524m71249j18246k86226l69370
14143A4616058J9380m80032m05437j06310k78875K7616q813p60250O3733j52029
14133A2535041J2638m08224m63417q031n8655l38453l77060Q2990J52657o77170
14123A0452316q4794k4334r4495l18527K47870l4516m79317k60775r4594P775
14113I316609m83929L04818n81671L78591j17198k91122Q4572n10258J59485l16243
$$ plain form
14179 31757247 30549208 30082891 29400669 28690752 27881160 27058157 26581938 26122593 25363682
14170 25363682 24859258 24493187 24012271 23029889 22933242 22163667 21586308 21403215 20847690
14161 20847690 20813807 19833195 19589568 19193352 18897546 18575030 18273522 17682190 17530681
14152 17530681 16974349 16422496 16165683 16248673 15861149 15389900 15271654 14985428 14616058
14143 14616058 14635438 14155406 13749969 13643659 13364784 13392400 13383587 12623337 12687070 12535041
14133 12535041 12547679 12139455 11676038 11668007 11609352 11270899 10893839 10976829 11129486 10452316
14123 10452316 10367522 10343188 10248693 9930166 10178036 10143520 9664203 9403428 9308834 9316609
14113 9316609 8832680 9137498 8555827 8934418 8817220 8526098 8610670 8100412 8259897 7943654
14103G943654J45785j65901m46630L05570m29855J06624j43139J11169o88142
14094F739135m0675K45930j32810J18424l90411L10490n74247K53433o1630J6537
14084F484176k93889j40542p1624J52424j59632j58179j05K31540l19727K4228
14074E748670l31026N64860o06631k94277K80584q0886k86524J53441k68171M78515
14064E358555n26296L38216m75508J01604j23853L26944q14719L31676q097K68582
14054D777104n31408K8763N48376m72412J56027j62141j70678J64126J9732k7500
14044D329989J00312Q8018m01379o4871p6097R7688p4389j52568j1580M7905k09047
14033C673981K1524j38665N3627m63095L41158j75834K16261J1150l00737J06547
$$ plain form
14103 7943654 8089439 7923538 7476908 7782478 7352623 7459247 7316108 7427277 6739135
14094 6739135 6698460 6944390 6811580 6930004 6539593 6850083 6275836 6529269 6467639 6484176
14084 6484176 6190287 6049745 5978121 6130545 5970913 5812734 5812629 6044169 5724442 5748670
14074 5748670 5417644 5982504 5375873 5081596 5362180 5281294 4994770 5148211 4880040 5358555
14064 5358555 4832259 5170475 4694967 4796571 4672718 4999662 4184943 4516619 4508522 4777104
14054 4777104 4245696 4274459 4822835 4350423 4506450 4344309 4173631 4337757 4357489 4329989
14044 4329989 4430301 4518319 4116940 4052069 3975972 4073660 3999271 3846703 3835123 3883028 3673981
14033 3673981 3695505 3556840 3610467 3147372 3488530 3312696 3528957 3540107 3239370 3345917
14023C345917j15691k38421N86333n18940L65096j64264K55407k84097k20893
14014C010447J58328N4296p4173j45317J19524L9283n5269n50378J15324J2764
14004B684829n0748J21411L3419l8018n1594j02826j34650K81624J49576k88785
13994B604238J74401r5044m25466K88123K3564k01006O8126k06419J30945o5238
13984B296224j17263J49174M8201l5452q7362M12479N8529L95518L77874N23051
13974D020973J479446K586425N684097J0141073O498600p634513n729875l508862
13966A3537364l175849k459978j539739j150385r90256l26200k74151j16174k65602
13957C239030k94057k8095l4998k11399J842R2856o64176L30270o2245k35959
$$ plain form
14023 3345917 3230226 2991805 3578138 3059198 3424294 3260030 3515437 3231340 3010447
14014 3010447 3168775 3223071 3148898 3003581 3123105 3162388 3107119 2556741 2672065 2684829
14004 2684829 2634081 2755492 2788911 2750893 2699299 2596473 2461823 2743447 2893023 2604238
13994 2604238 2778639 2683595 2258129 2546252 2569816 2368810 2436936 2230517 2361462 2296224
13984 2296224 2178961 2328135 2376336 2340884 2253522 2666001 2724530 3120048 3497922 4020973
13974 4020973 5500419 8086844 13770941 23912014 30410614 22776101 17046226 13537364
13966 13537364 10361515 7901537 6361798 5211413 4221157 3894957 3620806 3504632 3239030
13957 3239030 2944973 2916878 2881880 2670481 2672323 2765179 2101003 2431273 2369028 2133069
13947B133069J30295K89599j37619J11768k80669m65926O49250l61332J96948
13938B265383j61968M26967n29622m18023N02471j58595k28060J21066k3299J47774
13928A944094n6320k73276L98351j86412J61179k44183L31926j44638m35582K34553
13918A729692M09695j68496k80042j11973J25523n1320j89688L17010M8533k29147
13908A599787N0089j76050l47514M08666K56775n63260Q49641n36831P4047j86889
13898A428461K54232J97146n58210K12280J31850j37625j48748j06526L53020
13889A625880k81182j42864M57559k52974p4939j223L49833n09698K33679j7853
13879A386218m7428m24453M64827k29130J49510j5986R1782K41149j44453J54134
$$ plain form
13947 2133069 2263364 2552963 2415344 2527112 2246443 1780517 2429767 2068435 2265383
13938 2265383 2103415 2530382 2000760 1582737 2085208 1926613 1698553 1819619 1796320 1944094
13928 1944094 1887774 1614498 2012849 1826437 1987616 1743433 2075359 1930721 1495139 1729692
13918 1729692 2139387 1970891 1690849 1578876 1704399 1653079 1463391 1780401 1828934 1599787
13908 1599787 1649876 1473826 1126312 1534978 1791753 1228493 2078134 1541303 1615350 1428461
13898 1428461 1682693 1879839 1321629 1533909 1665759 1528134 1379386 1272860 1625880
13889 1625880 1344698 1201834 1659393 1406419 1331480 1330257 1680090 1170392 1404071 1386218
13879 1386218 1338790 914337 1379164 1150034 1299544 1283558 1375340 1616489 1472036 1626170
13869A626170k06354j59041J23578j58013K66837j50386O3210N2664k49995l51749
13859H56921J82173j26197L77885J22079k83230J19560j40141J53189J02367k72753
13849A091853k3404p7767L75714l88001l6863K33658K27845l12576M4872j72931
13839I62400M3563L18578j00874k28094K10497j75555Q6610J6394L7859r6931
13829A074447J1389j18805L87485l35636k44772L46871j65052N0130O902J48418
13819A161377n41509L89842K09561n05887L53129l9389k09619K12935j25016k04501
13809G00923K22604k37363J93808n629K99358n65306L00515L53197E42711M78626
13799A021337l66769J6273q4105L14319J29466k75736J93397j1319l8038m9685
$$ plain form
13869 1626170 1419816 1260775 1384353 1226340 1493177 1342791 1406001 1458665 1208670 856921
13859 856921 1039094 912897 1290782 1412861 1129631 1249191 1109050 1262239 1364606 1091853
13849 1091853 1068449 990682 1366396 978395 941532 1175190 1403035 1090459 1135331 962400
13839 962400 1005963 1324541 1223667 995573 1206070 1030515 1117125 1133519 1171378 1074447
13829 1074447 1085836 967031 1354516 1018880 774108 1120979 955927 1006057 1012959 1161377
13819 1161377 619868 1009710 1219271 713384 1066513 1027124 817505 1030440 905424 700923
13809 700923 923527 686164 879972 874343 1173701 608395 908910 1262107 542711 1021337
13799 1021337 654568 670841 586736 901055 1030521 754785 948182 936863 898825 849140
13789H49140J96697N0004l07593J20396O7434r604k31601K7132M7300m02182L22838
13778G29961O7905j04297Q128K0173J49436j84248J6938M01412j40090l29887
13768F35431o1860J27441K15840k40517M13808k82706j6383j37757K32176o1312
13758H24161o7322o047J6821C36225L65261J69386J84569D95370R1841J99999
13748G87210k97385J25320J99405j52949k06944K55618R4894J41597k66667J48289
13738H28388B97882L44442k5624j56361J84606k83475L05080J24492l47058K33353
13728F77337K30013k96729q8378m4552K25987A56874P25015j31918k79071K83648
13718G54548l1779R1721l43313O8825N1994G5679N87315j728N7152j13797k8565
$$ plain form
13789 849140 1045837 1095841 788248 908644 976078 966474 734873 762005 809305 407123 729961
13778 729961 797866 693569 701697 721870 871306 687058 703996 1105408 965318 635431
13768 635431 573571 701012 916852 676335 1090143 807437 791054 653297 885473 824161
13758 824161 756839 750792 767613 336225 701486 870872 1055441 495370 587211 787210
13748 787210 489825 615145 814550 661601 454657 710275 805169 946766 680099 828388
13738 828388 297882 642324 616700 460339 644945 361470 666550 791042 443984 677337
13728 677337 907350 610621 522243 477691 703678 156874 881889 749971 470900 754548
13718 754548 722769 814490 471177 540002 591996 75679 662994 661266 718418 604621 576056
13707E76056j56912Q534K99327k25607J61460j52609J42426J88988k15767o7713
13697E58183L10392D21607A42132K91142N869j2088J67214l3580K2092k65434
13687C17347J00809J48522n0262j87627J29720P1866k9392j16415j28601P317
13677B63284O6361J63733M2507B59000K71659A24553R9083M40503k63325J10883
13667E11697j73846l8567J87996R5824j40660m1557L13382q5922k34264J93184
13657E87267q3138q1872L46463p9438J42883j20892o0991J42806H8912L754M20172
13646E12838k31189J60802J72323A9050J30747N58180A1315N81280k57923j9896
13636C14776L14008B17442K51806J69133B19271l338J20697R2287L105A72196
$$ plain form
13707 576056 419144 427678 727005 501398 662858 510249 652675 841663 625896 558183
13697 558183 868575 421607 142132 433274 439143 427055 594269 560689 582781 317347
13687 317347 418156 566678 516416 328789 458509 530375 500983 384568 255967 263284
13677 263284 329645 493378 535885 259000 530659 124553 223636 664139 400814 511697
13667 511697 337851 299284 487280 583104 442444 400887 714269 628347 394083 587267
13657 587267 504129 422257 768720 689282 832165 711273 650282 793088 88912 92666 512838
13646 512838 281649 442451 614774 19050 149797 707977 11315 592595 334672 314776
13636 314776 628784 217442 469248 638381 219271 215933 336630 428917 432022 172196
13625E24657j83784J48946Q2751A20271K28524Q0563K07693B86541J69162J70212
13615F25915j53952p0353J40996j12559N11780C68498m3269J90316r6561J0630
13605D29614K60059j83825j89805O6838L72089l15649A30117M13270A24872L23441
13595D48313H2649J46699J84645j10499K60762k37863N0383J79920j32753P9453
13585E03396k15688j21835J22025L8484q6794o5817K34109A78902K39991B02190
13574B91652K2517l0779I4496M45405A58539J39332J04038A10401K55090H1981
13563A44828K03356r6712j7428K20195j10849j10190J54061K8662n085K90372
13553G01210J9530A07801K23449O4453J37426B29526oa06279B38826J31746j1241
$$ plain form
13625 524657 340873 489819 572570 120271 348795 429358 637051 286541 455703 625915
13615 625915 471963 401610 542606 430047 941827 368498 325229 515545 418984 429614
13605 429614 689673 505848 316043 382881 754970 439321 130117 543387 124872 448313
13595 448313 82649 229348 413993 303494 564256 326393 376776 556696 423943 503396
13585 503396 287708 165873 287898 326382 239588 173771 407880 178902 418893 202190
13574 291652 314169 283390 94496 539901 158539 297871 401909 110401 365491 81981
13563 144828 348184 251472 234044 454239 343390 233200 387261 415923 410838 701210
13553 701210 720740 107801 331250 395703 533129 229526 229520 -106279 238826 370572 359331
13542C59331J71947J6885A86617J76241J1179R1651A75519R0342J12152C4983
13531A05642P1559L74152k51255f0368E27213B55400Q9693M6844K06196A85533
13520C65125p1011j35187M19915k60243N1885A17046Q3152J20173K58786B45052
13509E5429J34328L6502Q8553I2627K78267R9535B07941R8668Q8678j35381M558
13498B64464P665j21780F4149K12028L66041B69938b4021B18081L7053o09k8446
13487B26079M47538A75829j2528P7943N8530g7365A38209M04446B37449O6847
13477C04296K27704A13356L18840A01103L07721g6068M60A81006L32254B02360
13466A9895N91385A17328O1959K9198J3352K63644d6196A28689Q1811J45232j66479
$$ plain form
13542 359331 531278 548163 186617 362858 374037 465688 175519 265861 378013 34983
13531 105642 177201 551353 300098 -60368 527213 255400 345093 391937 598133 185533
13520 365125 294114 158927 578842 318599 370484 117046 200198 320371 579157 245052
13509 55429 189757 226259 314812 92627 370894 470429 207941 306609 395287 259906 264464
13498 264464 272129 150349 64149 276177 642218 269938 -24021 218081 255134 254525 226079
13487 226079 673617 175829 163301 241244 299774 -77365 138209 542655 237449 304296
13477 304296 532000 113356 432196 101103 408824 -76068 -75608 181006 513260 202360
13466 19895 611280 117328 179287 208485 221837 485481 -46196 128689 210500 355732 189253
13455A89253p3284Q881K80314j44635q6580m845J62923A46988P4226K52413i5473
13443A95264E8110J04081L43883j08465A69414q3003K42146j11957o0501r289
13433A46810b5581C43502G4211L51214E236N01846I1245g4983D3914J45856R9320
13422B89090P0233L7347A39086k2092J57273J76708K6204h8166E66358m5421A72111
13410A03878K40981Q9820j34902b6708B20427l9918P0415N0007h7533B82286j07031
13399A75255N283j1383q254J41730J20225A05674J54071j26896L91181o7464j23216
13388C33350M7465j72993p8947L12178j44331A05872L21621j87331B1351Q0102
13378A01453r920Q8349R1374A32559L57709B35633H566J86620K44832c4114j22632
$$ plain form
13455 189253 115969 124850 405164 260529 173949 169104 332027 146988 221214 473627 -95473
13443 195264 58110 162191 506074 397609 169414 86411 328557 216600 156099 146810
13433 146810 -25581 343502 74211 425425 5236 507082 91245 -74983 43914 189770 289090
13422 289090 359323 396670 139086 116994 274267 450975 477179 -88166 566358 520937 172111
13410 103878 344859 434679 299777 -26708 220427 180509 250924 300931 -87533 282286 175255
13399 175255 180538 169155 160901 302631 422856 105674 259745 132849 524030 456566 333350
13388 333350 380815 207822 128875 441053 296722 105872 427493 240162 21351 101453
13378 101453 91533 179882 271256 132559 490268 235633 8566 195186 440018 -34114 -156746
13367a56746B23763r7281L95528A36158Q674J27857f2393C16320H0583C8985K10326
13356B49311P0681n466j22835I1480L43551n4042J1160j17182Q2760p7949b9623
13344D77478B16914o1111K68184A70555L8428K4081k0576P8952i9404B62744O6881
13333C29625j01994K39027A94010K93857A81241K58495J33026A4967K17050Q1645
13323C13662L469q0128J47431Q8575A82343K29696J23824M0707A60496K59897
13313D20393A01190a30432B29310a9705C98780j64789j06969K30901r7881j08154
13303A51888J54830A06461a30735B46878N0304J72123J16804m4888B22462n1107
13293A71355m4226l8996J55381N1377h0117K8326D52905B13471N6977E0851e9157
$$ plain form
13367 -156746 223763 126482 522010 136158 144832 272689 -62393 316320 80583 38985 249311
13356 249311 319992 314526 191691 91480 435031 380989 392149 274967 357727 279778 -29623
13344 477478 216914 155803 423987 170555 208983 233064 212488 291440 -99404 262744 329625
13333 329625 227631 466658 194010 487867 181241 439736 572762 14967 232017 313662
13323 313662 317131 237003 384434 473009 182343 412039 535863 576570 160496 420393
13313 420393 101190 -130432 229310 -19705 398780 233991 127022 357923 260042 151888
13303 151888 306718 106461 -130735 246878 297182 469305 586109 541221 222462 171355
13293 171355 127129 88133 243514 294891 -80117 -51791 452905 213471 270448 50851 -59157
13281D44216A38717c23244A45830K29880C4735L79337B7570J72583C2452K49703
13271B82155f1398C00243m586D240L89766E6948J91916k0537J84429a45084C10025
13259a0964B80032j30285O5800I2034b62062A84796C16J73205p2200a26061n2811
13248a78872H5962A1602K07272L22805b44018K439j956O266A35726g7815B79699
13236A06173L70649B21072J64098B6235J00892a58777A43333J58950A2143P0769
13226H2912Q2002J84100j11459D7660K41442b06055F1063j9992J22815E5517Q9888
13215A45405C1931J349g0517J3996C16609o8164j1622J70634a21986C0096J93419
13204B23515N5575N8041O8178H0297g8621G8116N0781N3713l4259P3246m5258
$$ plain form
13281 444216 138717 -323244 145830 375710 34735 414072 27570 200153 32452 282155
13271 282155 -61398 300243 295657 4240 394006 56948 248864 228327 412756 -145084 310025
13259 -10964 280032 149747 215547 92034 -262062 184796 316 173521 101321 -126061 -178872
13248 -178872 85962 11602 218874 541679 -244018 -241579 -243535 -237269 135726 -77815 279699
13236 106173 476822 221072 385170 26235 127127 -158777 143333 302283 12143 82912
13226 82912 164914 349014 237555 47660 289102 -206055 61063 41071 163886 55517 145405
13215 145405 31931 33280 -70517 -56521 316609 248445 236823 407457 -121986 30096 223515
13204 223515 279090 337131 405309 80297 -78621 78116 128897 182610 148351 221597 176339
13193A76339K62386b78868a26406B53523j01098k368h769B2164e2248A20042f2742
13181B48096c10020J49660J8598B96316a81309A09806m2317i949C12124f7319
13170B00849E4805b7322A51010J0623R1056J986a0283o553l41928b7056A81428
13158C5390b4217C41138c69642f0920G0589h8452A80613K39660A98423P309d4067
13146B51501b68519F473J28491a27835B60187H9881f8440C131J22168b7961A146
13134D3325R440d50742B55059b8960j28641A06804O5295k8087d15930B72417q1817
13123A90600N4217F2688J1196C1594K88493A55527E9202a76120C33428j15451
13113B17977B8594N7590J35677a23411j28477J5013f1061D06257J30401j09524
$$ plain form
13193 176339 438725 -278868 -126406 253523 152425 150057 -8769 22164 -52248 120042 -62742
13181 248096 -310020 -160360 -141762 296316 -181309 109806 67489 -9949 312124 -67319
13170 200849 54805 -27322 151010 161633 252689 254675 -10283 -16836 -358764 -27056 181428
13158 35390 -24217 341138 -369642 -60920 70589 -88452 180613 420273 198423 205732 -44067
13146 251501 -268519 6473 134964 -127835 260187 89881 -68440 3131 125299 -27961 1146
13134 43325 52765 -450742 255059 -28960 -157601 106804 172099 144012 -415930 272417 190600
13123 190600 244817 62688 73884 31594 320087 155527 59202 -176120 333428 217977
13113 217977 28594 86184 221861 -123411 -251888 -236875 -61061 406257 536658 427134
13103D27134F8911J29734o7324a68267k1439F9998K7281h1571b0128A04074K09054
13092C13128f0015C04998o4234A18683d2887C70621a741j8069q5626D8764k2547
13081B6217J26627J51700c9767j47904j5117i8754L8399C0627J104b72161F88527
13069c3414p7871D50257b24587F6671A9767M9827f8541I7083i7340H4349Q3403
13058A67752J60105g6067B10534J05615A27588J67096j33211O0045a39407M2013
13048i7394o2631A5128L1433R627A0458d7799B53460J05444a55036A12473j285
13037A11188J09658C431J20148O3477J50976A39186k9768n1480a26519G5985K17
13026G6202K0334J33669F7869k6536K11393D8534K86162j25058f2202K3407C33425
$$ plain form
13103 427134 68911 198645 131321 -168267 -189706 69998 97279 -81571 -20128 104074 313128
13092 313128 -60015 304998 240764 118683 -42887 370621 -1741 -19810 -105436 48764 26217
13081 26217 152844 304544 -39767 -187671 -202788 -98754 -60355 30627 31731 -272161 688527
13069 -33414 -111285 450257 -224587 66671 19767 69594 -68541 97083 -97340 84349 167752
13058 167752 327857 -76067 210534 316149 127588 294684 161473 221518 -139407 -97394
13048 -97394 -160025 15128 46561 56188 10458 -47799 253460 358904 -155036 112473 111188
13037 111188 220846 3431 123579 187056 338032 139186 109418 57938 -126519 75985 76202
13026 76202 96536 230205 67869 41333 252726 48534 334696 209638 -62202 -38795 333425
13014E0405R1244J41510j38940B7725N2508c6187I1174J13086i3976A64984J0467
13003A75451a41812B67705h5712A349J1311K5335J16403D829K22024j09564a51395
12991a17030j07301C77769j08990q3999b2546H3825J81094Q0197j45151a25389
12980B82587P2366A06932l7743m263d5314A73677i8756B7231K13116c9248l48751
12969c87999a05314B26410C2809L2159a89C18244C8867b5031C6398J00861k560
12958A34699a48406A89537b8469A51054g0198A88268H45J19445P6765J71150A65788
12946B5735a18006L5451B59998G9018J30906D0502c29191a51677d1055P245C38383
12934C9541J22817p8819L77854C9148g2678C20389A34928K98732a09766D0091
$$ plain form
13014 50405 141649 283159 144219 27725 80233 -36187 91174 204260 -93976 164984 175451
13003 175451 -141812 267705 -85712 1349 12660 37995 154398 4829 226853 117289 -151395
12991 -117030 -224331 377769 268779 184780 -22546 83825 264919 345116 199965 -125389
12980 282587 354953 106932 69189 64926 -45314 173677 -98756 27231 240347 -39248 -387999
12969 -387999 -105314 226410 32809 64968 -189 318244 38867 -25031 36398 137259 134699
12958 134699 -148406 189537 -28469 151054 -70198 188268 845 120290 197055 368205 165788
12946 25735 -118006 -82555 259998 79018 209924 40502 -329191 -151677 -41055 -33810 338383
12934 39541 162358 83539 461393 39148 -72678 320389 134928 433660 -109766 40091
12923B00898b3669k7985j63939K983C60802G6234e0135C90964J24309h3947b9736
12911B82095a50610d2472q9146G7929J11467E3062b02079B397J4495c6793m044
12900d0837A63688C042i2k32520d2739G5442P0787O4058C8242h7168A65864A5503
12887b2328k63466I9281b43271R5625B14225C2747J75090E217K31222C0923J59824
12876A90747c11790E2279e3824A87038b29666A5312L1778b10628g8021j1940A5892
12864A24918a7800A0029a07131C2650g4575m3185A19290c13621A93838j6836q0826
12853I6176a41735A86507G9830K66957b74058J15841A13821j6280J26447i6277
12842B8517J77748n1434C4101J33777l2105f2203E5475e9894r0960C1247J00268
$$ plain form
12923 200898 -23669 -51654 -215593 -212610 360802 76234 -50135 390964 515273 -83947 -29736
12911 282095 -150610 -42472 -131618 77929 189396 53062 -202079 2397 16892 -36793 -40837
12900 -40837 163688 3042 -92 -232612 -42739 75442 146229 210287 38242 -87168 165864 15503
12887 -22328 -285794 99281 -243271 -147646 214225 32747 207837 5217 236439 30923 190747
12876 190747 -311790 52279 -53824 187038 -229666 15312 47090 -210628 -78021 -89961 15892
12864 124918 -17800 10029 -107131 32650 -74575 -117760 119290 -313621 193838 177002 96176
12853 96176 -141735 186507 79830 346787 -274058 -158217 113821 97541 223988 -96277
12842 28517 206265 154831 34101 167878 135773 -62203 55475 -59894 -150854 31247 131515
12831A31515C8532J83255e7882A23917k1156J21817a01921A27556a64439b1834
12820A33997M6131J7128B4079a490r7439B13018C5933c63313G8370J05728a67853
12808g7727E6852L66599j59179h4632E6555a05465r0743A3349n775c37143J33936
12797b03207o8611D2442K02005E0728i4360A18077b48927i8919J506m7312F6475
12785D0522a73467B11615a79734F861b50121B76674F2971b78073C5757d33761
12774G0757l3957b81597b8506j27031E8250O812f937A73104a41353L6715K1115
12763h3523A73602c22490D9290a99662A61385b43829A49977a75908j38802B25001
12752I8276n936P3082d1188p6266c1953j56058B3538N5816L8038h5259j63735
$$ plain form
12831 131515 38532 221787 -57882 123917 102761 224578 -101921 127556 -164439 -21834
12820 133997 180128 197256 24079 -1490 -98929 213018 35933 -363313 78370 184098 -167853
12808 -77727 56852 423451 264272 -84632 56555 -105465 -196208 13349 7574 -337143 -203207
12797 -203207 -271818 42442 244447 50728 -94360 118077 -248927 -98919 -97413 -144725 66475
12785 40522 -173467 211615 -179734 6861 -250121 276674 62971 -278073 35757 -433761
12774 70757 36800 -281597 -28506 -155537 58250 65062 -6937 173104 -141353 -104638 -83523
12763 -83523 173602 -322490 49290 -199662 161385 -243829 149977 -175908 -314710 225001
12752 98276 92340 165422 -41188 -117454 -31953 -188011 23538 79354 117392 -85259 -248994
12741b48994a23280k7800A27562J03941p7026m4370e6937k18500d7722I9189D8907
12729b5092m5696o336c7638B10707a50830L6295C28827a64856A41388P4960a45296
12717H6648a18540H4006J93623F0011J66172q5512e5961B8474h3998K7098A07896
12705b12802A2568Q4015a17153B42487p9316a53353A87981b50434A16461A7101
12694b43822A04149f0338B55845p3272J81224F9839J06555q5151J00980G321a42392
12682a04093l14799E1893A2516K09076B7745i5305n0253A93210E3557K76920b81722
12670b8778j32626B3438a15721A56194b35018g8878I3317O50126B41187r6704
12660A44483n9797d9687a9111A42507F4530K27553g9188k0110k92298D7139J97212
$$ plain form
12741 -248994 -123280 -151080 127562 231503 154477 110107 -56937 -275437 -47722 99189 48907
12729 -25092 -70788 -77124 -37638 210707 -150830 -114535 328827 -164856 141388 216348 -145296
12717 86648 -118540 84006 277629 60011 226183 140671 -55961 28474 -83998 -56900 107896
12705 -212802 12568 96583 -117153 242487 163171 -153353 187981 -250434 116461 17101
12694 -243822 104149 -60338 255845 182573 363797 69839 176394 91243 192223 7321 -142392
12682 -104093 -418892 51893 12516 221592 27745 -95305 -145558 193210 53557 330477 -281722
12670 -28778 -161404 23438 -115721 156194 -235018 -78878 93317 743443 241187 144483
12660 144483 84686 -49687 -19111 142507 64530 292083 -79188 -99298 -391596 47139 244351
12649B44351a92748A84981Q1000A23478J35859O0167h582A34875d59206A05700
12638a36019A66320O2332j05630D3297J68913b46108A41020n4082P9059R5171
12628B61168Q0685A24616D0571h8737B89942A13551d3364j37050B48139d8416
12617A67318b14094B30755B7372K50077k7125g2548A17511a9646j4935I6491P6894
12606A73385p7911b56950F3709L57542A02110a02959A23968n6177g4132l2465
12596a06597B55850q0728J6553F0042Q846b11617q0035B0020a1713B5745J98421
12585B24166G0676J65519p9761k935i9424B18919a9186A39175k8003f2717B6444
12573a50778A75476L6755B4906J90567L2847C7914M4576d0419k2156k9346M4928
$$ plain form
12649 244351 -192748 184981 265981 123478 259337 319504 -8582 134875 -459206 105700
12638 -136019 166320 228652 123022 43297 212210 -246108 141020 86938 165997 261168
12628 261168 341853 124616 40571 -88737 289942 113551 -43364 -180414 248139 -48416
12617 167318 -214094 230755 27372 277449 250324 -72548 117511 -19646 -34581 96491 173385
12606 173385 95474 -256950 63709 421251 102110 -102959 123968 67791 -74132 -106597
12596 -106597 255850 175122 191675 60042 68888 -211617 -291652 20020 -11713 25745 224166
12585 224166 70676 236195 156434 153499 -99424 218919 -19186 139175 111172 -62717 26444
12573 -150778 175476 212231 24906 215473 248320 37914 82490 -40419 -62575 -91921 -46993
12562d6993j42241f7619I9109e1110G7075B0800b40423d1089m1037B94497b7174
12550C711a45364H6048a74741N3424l5817e3868A24352R9143I9666K66918j35235
12539B31349F3438a87479B37178a08429o8169j21456f1265j08252A41486J25482
12529B66968a28899b8313A80540G8430c3379A82485D2159a42876H5904b9718e636
12517B2261h2455m3054O546I6983a43349C9767a81781e1132q2054o5908j58070
12506c57164B34984D7473J07503a65399I8822a22247A09806K33913r1513i5706
12495G6358p067M25692I4437l554J03015g389C18967O3360A29597a16225j33493
12484b49718I0461a19088A18319b63784A76372o0867c98688h4516L0757o1172
$$ plain form
12562 -46993 -189234 -67619 99109 -51110 77075 20800 -240423 -41089 -82126 294497 -27174
12550 3711 -145364 86048 -174741 -121317 -157134 -53868 124352 223495 99666 366584 231349
12539 231349 63438 -187479 237178 -108429 -176598 -298054 -61265 -169517 141486 266968
12529 266968 -128899 -28313 180540 78430 -33379 182485 42159 -142876 85904 -29718 -5636
12517 22261 -82455 -125509 -118963 96983 -143349 39767 -181781 -51132 -133186 -199094 -357164
12506 -357164 234984 47473 154976 -165399 98822 -122247 109806 343719 252206 -95706
12495 76358 69291 494983 94437 90883 193898 -7389 318967 382327 129597 -116225 -249718
12484 -249718 90461 -119088 118319 -263784 176372 115505 -398688 -84516 -53759 -114931
12474a14931j30249b8825j74779g8696j0746B39330J94357G9505b13449A04130
12463B61074A17170K4028P7079K77917A57588a16588A13144K806J39947a77872
12452C16597i1089A02353a70996A70677i7126k34964E0363J22329G4618A337b80822
12440A99065a26082j07719I8657B2397a33067d2353A86635l7035g7507I0613I990
12428A27273L24562b20653A03095B6312J88660b24752N4051m26773a58617F3231
12417B76925j10179A6199J26689b87172A76678c57443a45743H43a17636N5133
12407f2503j27174l518P9598D8984a76181j55060e881m98790I5906J05381f7651
12395c5887m8935b1374j13887m6546B03276M0387c0088P731m2703F1347a81279
$$ plain form
12474 -114931 -245180 -28825 -203604 -78696 -89442 239330 433687 79505 -213449 104130
12463 261074 117170 141198 218277 496194 157588 -116588 113144 115950 255897 -177872
12452 316597 -91089 102353 -170996 170677 -97126 -332090 50363 172692 74618 1337 -280822
12440 199065 -126082 -233801 98657 22397 -133067 -42353 186635 149600 -77507 90613 9990
12428 127273 451835 -220653 103095 26312 214972 -224752 -170701 -597474 -158617 63231
12417 276925 166746 16199 142888 -287172 176678 -357443 -145743 843 -117636 -62503
12407 -62503 -189677 -193195 -113597 48984 -176181 -331241 -5881 -504671 95906 201287 -67651
12395 -35887 -84822 -21374 -135261 -181807 203276 243663 -30088 -22357 -65060 61347 -181279
12383A65612b46942A57817a62260C81928A11214g4937j92393m9007d8923D5245
12372G7095b254n6682A31723B4540a19776L2169r1176n4234H5067a21534A08622
12360A03781j676Q0135p3430K53305a07472E5319A2862K84843d0586B52617e1460
12348A3770J38832A6110a29308j36199A97102C2690h9871E889c90966a48639l5326
12337a83965B0005l608a8923j9076j72129f9187b2954j64839e7384A07283Q9183
12326A96466m565d9320B94643A9990P8854a46604E1103h3674B45945F3732L544
12315F7276a28821B9850L98679A71936E4142L16756a51957H7366a01012C79809
12304B22568d0837A12612p406J69771J1055n6822a4208a318B77406e7967F5148
$$ plain form
12383 165612 -246942 157817 -162260 381928 111214 -74937 -267330 -316337 -48923 45245
12372 77095 -2254 -58936 131723 24540 -119776 -87607 -178783 -233017 85067 -121534 108622
12360 103781 102105 182240 108810 362115 -107472 55319 12862 297705 -40586 252617 -51460
12348 13770 152602 16110 -129308 -265507 197102 32690 -89871 5889 -390966 -148639 -183965
12337 -183965 20005 16397 -18923 -37999 -210128 -69187 -22954 -187793 -57384 107283 196466
12326 196466 191901 -49320 294643 19990 98844 -146604 51103 -83674 245945 63732 67276
12315 67276 -128821 29850 428529 171936 54142 370898 -151957 87366 -101012 379809
12304 222568 -40837 112612 105206 274977 286032 229210 -14208 -1318 277406 -57967 65148
12292G5372K03471a85917G4500g616A04517J01629q3922P3026H1695M5404a46129
12280A14912l3134J08491K34151C8182o23J15943J38068j36335G4784B1874L26605
12269C48479k2340C7141J42233A471g72B42892K52882E55J45650K26538n5458
12258C17285f8990B28268j05469L2817K13352j55764e6825F7984a20380B62899
12247F7501L07223A09593l8935a01546A71870L5146k5280J7024o4891K254L13185
12236D49308g1643A28691K58850A33405J90433k1823r1J69318c4021n7203A56249
12224f5561I7117O0098b3056D4971a8154B06481F4169a17639c7880A6983K0707
12213C7690J34814j6360F2867L30118b9270E6148L88731O3393A60884L25365j7500
$$ plain form
12292 75372 278843 -185917 74500 -7616 104517 206146 122224 195250 81695 127099 -146129
12280 114912 81778 190269 424420 38182 37559 153502 291570 155235 74784 21874 348479
12269 348479 326139 37141 179374 1471 -772 242892 495774 555 146205 372743 317285
12258 317285 -68990 228268 122799 155616 368968 213204 -56825 67984 -120380 262899
12247 67501 374724 109593 70658 -101546 171870 207016 181736 198760 133869 136123 449308
12236 449308 -71643 128691 387541 133405 323838 302015 301924 471242 -34021 -91224 156249
12224 -65561 97117 157215 -23056 44971 -18154 206481 64169 -117639 -37880 16983 37690
12213 37690 172504 156144 62867 392985 -29270 56148 444879 508272 160884 486249 468749
12202D68749j68650n0681N3913A13632K97002e9264A97028M5799A7856M80511
12192D98367e1855A37755m8487N4242J22182l4122N9709j3800q3463K39373K5518
12181D58907I1302K43891j07640E5616J22084K79059A44299A6246K9447P8116
12171A23809b25870C32235q9002j05197K69841r3185J29592J10550j43768a00609
12160b61133C29852H9013J20693O3043a9984k42016A91243D4295K84145j7126
12150C11314M9105A14028J89779A40338J38892I6020k5735J54893F7318K41317
12140C08635A3830K11425L8760K46379a31991o4822b5552Q575B55694J89680a55680
12128d926j393A33399A9588g5931B45358j5984g9051A56463g829A41634L75504
$$ plain form
12202 468749 300099 249418 303331 113632 410634 -59264 197028 242827 17856 498367
12192 498367 -51855 137755 89268 143510 265692 231570 291279 277479 194016 433389 458907
12181 458907 91302 335193 227553 55616 177700 456759 144299 16246 45693 123809
12171 123809 -225870 332235 243233 138036 407877 314692 444284 554834 411066 -100609
12160 -261133 329852 89013 209706 272749 -19984 -262000 191243 44295 328440 311314
12150 311314 360419 114028 303807 140338 279230 96020 70285 225178 67318 308635
12140 308635 13830 225255 264015 510394 -131991 -196813 -25552 -16977 255694 445374 -155680
12128 -4926 -6319 133399 19588 -75931 245358 229374 -79051 156463 -7829 141634 517138
12117E17138h3459A03746A6271c20200B98668A24835n362B4185K00712a17340
12106e0879A60992a90311A23063d3503C50231N0472A58810j9968k282D2054N423
12095D7477b45540h7738G0127L5329n442M7203E1882K69639H6323J5364j7699
12084H3988K05294m8540I048K64537g4400B6194a43770e8797a8534A92119E2167
12072E3519K23579I0983K65171a1128B12135H7784B1572J53189A7723J2697j2499
12061A7921L28821C5589i7930H6338K44744C2746J36535m7396G410K41597a33966
12049c15496o5631A68254o9835f1471p2936C33946a944D3367J66761o8531b57017
12037B83764l5999A09891C961a72465a6739B33646f4963d243k76314I4689b9828
$$ plain form
12117 517138 -83459 103746 16271 -320200 298668 124835 119473 24185 224897 -117340
12106 -50879 160992 -190311 123063 -43503 350231 400703 158810 138842 136560 42054 47477
12095 47477 -245540 -87738 70127 105456 100014 147217 51882 321521 86323 101687 83988
12084 83988 289282 240742 9048 273585 -74400 26194 -143770 -58797 -18534 192119 52167
12072 53519 277098 90983 356154 -11128 212135 87784 21572 174761 17723 30420 17921
12061 17921 346742 35589 -97930 86338 331082 32746 169281 121885 7410 249007 -133966
12049 -315496 -381127 168254 98419 -61471 -134407 333946 -1944 43367 210128 141597 -257017
12037 283764 247765 109891 3961 -172465 -16739 233646 -64963 -4243 -280557 94689 -29828
12025C38465A32849B4006K42177h7183k34020J50852M7553D06257a46299k1858
12015a68157A5226N869K35162a89455n5645A43478J79911f8678B30729d16962
12004h7327C41295H7583c1275m7913j03916c5757l4659D77154E8149J07356F6015
11992I2945R3848a42788k8833C46872a60800A47568l0392P0215D8692j8557N3812
11981H3947K5729K8049i8733H9055i9838o3519P8849C3339o8a19349j22640C1407
11968D5675a85724j21558i5D4324h7269n7747C3476b67785A44000a83072E0220
11956B00418K08892A50465G1027b64491e5512b1685C88809a58824d9643C0908
11945f9639r2986J0100C9957h3541j13440d8677g796B4230a71189D54402a68757
$$ plain form
12025 338465 132849 24006 266183 -87183 -321203 -170351 -122798 406257 -146299 -168157
12015 -168157 15226 21095 256257 -189455 -245100 143478 323389 -68678 230729 -416962
12004 -87327 341295 87583 -31275 -79188 -183104 -35757 -70416 477154 58149 165505 66015
11992 92945 186793 -142788 -171621 346872 -160800 147568 117176 187391 48692 30135 83947
11981 83947 109676 137725 -98733 89055 -99838 -163357 -84508 33339 33271 -119349 -241989 31407
11968 45675 -185724 -307282 -95 44324 -87269 -145016 33476 -267785 144000 -183072 50220
11956 200418 409310 150465 71027 -264491 -55512 -21685 388809 -158824 -49643 30908
11945 -69639 -162625 -152525 39957 -83541 -196981 -48677 -7796 24230 -171189 454402 -168757
11933A17487c1565B19342f2745j85242b7552A45749a16596A37565K454B8608K4904
11922E3512c3809B59882a36564O3340K0338j8718B9583f4088k7334B71790b96116
11910c8152l427a8833A98933F7860g3269F37023B23480I7758f2770J2139C2829
11898g6091L7705A0957O3409a62806a9379k44684A68992d9113A3824b5342j89118
11887b14460B6185b6024k5455A70171q4670e4173I6025P2947c17886J42470j66098
11876c41514B69581b41391C4853d155p7388C8588a66239A22321f9317A2634a10090
11864a53223G3843b03766r6428k5796B32254A815J37585P5972b69439J17274I4017
11852C9868P2338d3592j42295M5498C8416a99167c6549j29125J7205a7021D6211
$$ plain form
11933 117487 -31565 219342 -62745 -247987 -27552 145749 -116596 137565 140019 28608 53512
11922 53512 -33809 259882 -136564 -73224 -52886 -71604 29583 -64088 -91422 271790 -296116
11910 -38152 -41579 -18833 198933 67860 -73269 637023 223480 97758 -62770 -50631 32829
11898 -76091 -38386 10957 74366 -162806 -19379 -264063 168992 -49113 13824 -25342 -214460
11887 -214460 26185 -26024 -51479 170171 85501 -54173 96025 168972 -317886 -175416 -341514
11876 -341514 269581 -241391 34853 -4155 -81543 38588 -166239 122321 -69317 12634 -110090
11864 -153223 73843 -203766 -300194 -325990 232254 1815 139400 215372 -269439 -152165 94017
11852 39868 112206 -43592 -185887 -140389 38416 -199167 -36549 -165674 -148469 -17021 46211
11840b04907g7420k21339a28271h971G217a29034k37968J83409c057l45205a10193
11828c15954G3416g3125j18731C12297j25294A6477J26737a66026B73072D5231
11817d4246l8152j4998B82579c89527a3922I9654M5103K6052c146B5187K39627
11806B64814f5834D9435f0370B24205a22996l6941E2411a13600r272C9947a18596
11794A10353b26466d7992j18072o3950a6828l15636i9388A23040n4958k2273K1956
11783F7765R4861a9850j46865j72554C83263A12686e1529A23533a89146I534c45608
11771a68892M7686B36528G2658b57189b4113A7840b2164B50700a30309b7743o3143
11760i0886j74047g2782C1496J80976m5304f1046E6844e6179n8318A86097L410
$$ plain form
11840 -204907 -77420 -298759 -128271 -8971 7217 -129034 -367002 -183593 -3057 -348262 -110193
11828 -315954 73416 -73125 -191856 312297 187003 16477 143214 -166026 273072 45231
11817 -44246 -82398 -97396 282579 -389527 -13922 99654 144757 170809 -3146 25187 264814
11806 264814 -65834 49435 -60370 224205 -122996 -159937 52411 -113600 -122872 39947 -118596
11794 110353 -226466 -47992 -166064 -230014 -16828 -332464 -99388 123040 68082 45809 67765
11783 67765 162626 -19850 -166715 -339269 383263 112686 -51529 123533 -189146 9534 -345608
11771 -168892 -121206 236528 72658 -257189 -24113 17840 -22164 250700 -130309 -27743 -90886
11760 -90886 -264933 -72782 31496 212472 167168 -61046 56844 -56179 -114497 186097 189507
11749A89507B280c96599a96512j53500B45831d5909j43313K4613e9353C9177J58299
11738A97476b36579M1691h6908j35732F4266a57977a2199A4005i6892d5150E1244
11726a79638J5234A67508a43506f9792B43924C6011a06593O598E8849b67917e8071
11714B4280L16620J066j35890B4444d06140G2372a12392C22687h2308E8801L06903
11703C65704F9606a42418o809B45244A05514J01664j6520N625k5338l489Q5601
11692B53057a69008N8484A42407g1229P532H3256a96914l1675a2558m06874A81466
11680C51103B327Q3038Q0601m0957c01634D04085a3389k5092C5136J45103J38972
11669C19211b54395M5541I2843K11885J0393b09427H4688b30133H1510A9971i5906
$$ plain form
11749 189507 2280 -396599 -196512 -350012 245831 -45909 -189222 -164609 -59353 39177 197476
11738 197476 -236579 -194888 -86908 -222640 64266 -157977 -12199 14005 -96892 -45150 51244
11726 -179638 -164404 167508 -143506 -69792 243924 36011 -106593 -99995 58849 -267917 -58071
11714 24280 340900 341966 206076 24444 -406140 72372 -112392 322687 -82308 58801 365704
11703 365704 69606 -142418 -149227 245244 105514 207178 190658 196283 170945 167456 253057
11692 253057 -169008 -110524 142407 -71229 -63697 83256 -196914 -228589 -12558 -419432 181466
11680 351103 2327 85365 165966 125009 -301634 404085 -13389 -38481 35136 180239 319211
11669 319211 -254395 -208854 92843 304728 315121 -209427 84688 -230133 81510 19971 -95906
11657B15967a43227B10188G0892c2566j03477A46151b29601h8195j1066j03456
11647b02717N8056A87885a40191B40680j10658j3579P0465a50721I3697R6495
11637A90192k9994a3837j44225E268f7294A48257m7128R6554A8794b50953B9676
11625A53190g2664A5377h8086A41524J48864a17583A6067R1870j3127C3655a35331
11613a51751I046J57925d417m9763k97414Q5498D6569K1405a51146j07513a5237
11601B08205n2118c15758J44095B98279a72114f7806C74709G8487h6715A09776
11590C677Q041b91611C08047f5263k18956G2837K83557g1349B92540j00027q5308
11579A07205e7801A09373J21690n8828E4417b61173J21182B5488b41406a13214
$$ plain form
11657 215967 -143227 210188 70892 -32566 -136043 146151 -229601 -88195 -99261 -202717
11647 -202717 -144661 187885 -140191 240680 130022 116443 186908 -150721 93697 190192
11637 190192 160198 -13837 -158062 5268 -67294 148257 101129 197683 18794 -250953 29676
11625 153190 -72664 15377 -88086 141524 290388 -117583 16067 107937 94810 33655 -135331
11613 -151751 9046 166971 -4417 -54180 -351594 -266096 46569 67974 -151146 -258659 -15237
11601 208205 156087 -315758 -171663 298279 -172114 -67806 374709 78487 -86715 109776
11590 3677 11718 -291611 308047 -65263 -284219 72837 356394 -71349 292540 192513 107205
11579 107205 -57801 109373 231063 172235 54417 -261173 -139991 25488 -241406 -113214
11568g1077C89820b12365c730A85091f8693j25673e2644j28232A47049E6394P3308
11557A29702a47557B95738a28766B67957C687J36190J09234J10255G8579b11622
11546A04669a76219F7464R0624a50454b9340D785K38976j03995a03170B46090
11535B31393h5706o4494R872C7000J58183J52000E9356J57667p5208J56013D4924
11523C70319B235K91112e1207j71077A03224J15324H7958K52174q3592m4398O274
11512B18416A8695J32429F8483K00577j31901A3904f3939j01764B54020D5826
11501B05491J29758h1167n7184A39577d3517A01128J77872K9771I8602K67914
11491C66516A21149K3467k659Q1267a58558D2766a1635B37038p39J31278G7336
$$ plain form
11568 -71077 389820 -212365 -3730 185091 -68693 -194366 -52644 -180876 147049 56394 129702
11557 129702 -147557 295738 -128766 267957 3687 139877 249111 359366 78579 -211622
11546 104669 -176219 67464 158088 -150454 -29340 4785 243761 139766 -103170 246090
11535 231393 -85706 -150200 -140328 37000 195183 347183 59356 217023 141815 297828 44924
11523 370319 2235 293347 -51207 -222284 103224 218548 87958 340132 256540 212142 218416
11512 218416 18695 151124 68483 269060 137159 13904 -63939 -165703 254020 45826
11501 205491 335249 -81167 -138351 139577 -43517 101128 279000 308771 98602 366516
11491 366516 121149 144616 141957 223224 -158558 42766 -11635 237038 236299 367577 77336
11479A46659a7236B61092F1428a28935F2256L9485B7967J27215E8291J43242o6617
11468A34916b10908C03552r0557a5540D43266k12981J3837d999n0537B16458l2132
11457A84326a12542C65644K76895B78617k4471B7906K38441K85839A18365M3359
11447A61724J56305a63892A39079B3378J05214b60222A18538k5091D478M67859
11437D72337f300A21467J638P9438j9597p8091c4899l587D6133b4169A86885l1770
11425A55115a60536D80983A32475j3346M55272B5778g1432n1381A4622J65367
11415A79989a32801k2918B67990a20454B64312r9247a03026A25343R2593a05368
11404g9773l58948a96346n0993f9043j57636B07460A494J32717f6504j82678A35721
$$ plain form
11479 146659 -17236 261092 61428 -128935 62256 101741 27967 155182 58291 201533 134916
11468 134916 -210908 303552 212995 -15540 443266 230285 244122 -4999 -55536 216458 184326
11457 184326 -112542 365644 642539 278617 254146 27906 266347 552186 118365 161724
11447 161724 318029 -163892 139079 23378 128592 -260222 118538 93447 4478 472337
11437 472337 -6300 121467 123105 202543 182946 104855 -34899 -38486 46133 -24169 186885 155115
11425 155115 -160536 480983 132475 119129 574401 25778 -71432 -122813 14622 179989
11415 179989 -132801 -155719 267990 -120454 264312 165065 -103026 125343 217936 -105368
11404 -79773 -438721 -196346 -247339 -69043 -226679 207460 1494 134211 -66504 -249182 135721
11392a28408A70934A7978L305r073N4766J56337g983C8082b6444D9876A6072l615
11380A2457R9164P3873F3498d0600p1696e637j56473j2363M9698e2929j06677
11369a59606p1764q9138a27067O759N515j39275i496A05988b81862a35827b7072
11357D082a6201m1033A36176m3066k7818a89679j16205K7754B2041N3419d63575
11345b9052B18895d2555n9172j2856A03855D0107b06418P9472k33389A23682J42065
11334B65747K8602J38593c58A63495a19942b4641C9919N2856b08945B7582b00890
11322A46019k129m0531a24921e8739A02132B3711b73169G3149J59113i554A69018
11310C772J57371a96265D0785P7920A5098n124N2734c3497j28608N7694k01288
$$ plain form
11392 -128408 170934 17978 21283 12210 66976 223313 -7983 38082 -26444 49876 16072 12457
11380 12457 111621 185494 63498 -40600 -112296 -5637 -162110 -174473 -124775 -52929 -159606
11369 -159606 -231370 -320508 -127067 -120308 -114793 -254068 -9496 105988 -281862 -135827 -27072
11357 4082 -16201 -57234 136176 93110 65292 -189679 -305884 -278130 22041 75460 -463575
11345 -29052 218895 -42555 -101727 -114583 103855 40107 -206418 -126946 -360335 123682 265747
11334 265747 294349 432942 -358 163495 -119942 -24641 39919 92775 -208945 27582 -200890
11322 146019 143890 103359 -124921 -58739 102132 23711 -273169 73149 232262 -9554 169018
11310 3772 161143 -196265 40785 118705 15098 9974 62708 -33497 -162105 -104411 -305699
11299c05699d578n4630k38780K0956Q8565Q1552A02418a07128B00577f4610F0348
11287A35073f9796B16888a31098I8122g2933B2329Q8308a32230A0567b16855A5143
11275C0485b2830A86055d7758a9470I1440c89945i7345l0984d2432j27720B39610
11263A87133I03K96124g5999r6238H1842i1560C8684c80865h8357B09635f6276
11251G1842J63434i9474r6386n3634J06808A8100M2771b44360j4525O8035A27678
11239b15478D2419J8613i6242b1169m2406A94101a72409e4540C31J02110O7655
11228A70096q4537a30205n628j23256a10773k02431J44202A06341a09608A05655
11217b19203N1426P3049K2492m2269P590A34235e11196e7844d375k89492J22153
$$ plain form
11299 -305699 -4578 -59208 -297988 -277032 -188467 -106915 102418 -107128 200577 -64610 60348
11287 135073 -69796 216888 -131098 98122 -72933 22329 110637 -132230 10567 -216855 15143
11275 30485 -22830 186055 -47758 -19470 91440 -389945 -97345 -128329 -42432 -170152 239610
11263 187133 903 297027 -75999 -172237 81842 -91560 38684 -380865 -88357 209635 -66276
11251 71842 235276 -99474 -195860 -249494 -142686 18100 60871 -244360 -258885 -190850 127678
11239 -215478 42419 61032 -96242 -21169 -63575 194101 -172409 -54540 331 102441 170096
11228 170096 85559 -130205 -135833 -259089 -110773 -313204 -169002 106341 -109608 105655
11217 -219203 -167777 -94728 -72236 -114505 -106915 134235 -511196 -57844 -4375 -293867 -171714
11206a71714j49931A01315h1737a5294E3389a18905D3053k803Q965b70334e9922
11194d3583q315j26192B89403a63982E032K2801K50200A14532a98391J0131a4095
11182a07242k33610a30027B0721a08008K0281l1743a5485m0437q9084j15721F5528
11170f5133J100I6377B53L83372b81752M0244b2261C70466a2063E3794P510J24088
11158A85392a70274j52642C82747A75566K37058h8471j17843E3125b31274h5119
11147h8293A20068D0565a21965j8353A09145j0051l4171g2651j03702j08364q0376
11136c65093G8911a09879I9837a08001M2923p8445A19825C5219c5244I327a63845
11124A78143b59986E5057Q7436E1652J75305F0299h6614A3466b84162I9701b94168
$$ plain form
11206 -171714 -321645 101315 -81737 -15294 53389 -118905 43053 40250 49215 -270334 -59922
11194 -43583 -51898 -178090 289403 -163982 5032 27833 278033 114532 -198391 -188260 -14095
11182 -107242 -340852 -130027 20721 -108008 -87727 -119470 -15485 -55922 -145006 -260727 65528
11170 -65133 -64033 96377 253 383625 -281752 -241508 -22261 370466 -12063 53794 61304 185392
11158 185392 -170274 -322916 382747 175566 412624 -88471 -206314 53125 -231274 -85119
11147 -88293 120068 40565 -121965 -140318 109145 99094 64923 -72651 -176353 -284717 -365093
11136 -365093 78911 -109879 99837 -108001 -65078 -143523 119825 35219 -35244 9327 -163845
11124 178143 -259986 55057 142493 51652 226957 60299 -86614 13466 -284162 99701 -294168
11112A33227N8885q0000E4397J19017j6026j6826C6327a51104D68842A03518J56576
11101B60094K2586D0232J39620g0098A54859D9573K69717f3429C2738J76207k9062
11090A79883H1937K6266a70573h924B80587A16268J66759h3498B02555h9365D5630
11078D16272j53820A0871m770J44375O0549M83237I9119L34506A27954Q6678J39624
11067C54256H0875L02964E793M9936J80993p5562L5289R3521P5856A26405M73361
11056E99766j17206N0500B30802M00759p2107j80353J32364K32063E2487N20906
11046E73393R143J04897j17376K96747k05938k75729J19987L71892J29439m23820
11036E82635N00343r5720o6740K20333l9902m24956L04723k38819N08224K16572
$$ plain form
11112 133227 192112 112112 54397 173414 157388 140562 36327 -151104 468842 103518 260094
11101 260094 282680 40232 179852 -70098 154859 49573 319290 -63429 32738 208945 179883
11090 179883 81937 108203 -170573 -8924 280587 116268 283027 -83498 202555 -89365 45630
11078 416272 262452 10871 6101 150476 211025 694262 99119 433625 127954 214632 354256
11067 354256 80875 383839 5793 55729 236722 161160 196449 289970 365826 126405 599766
11056 599766 482560 533060 230802 631561 559454 379101 511465 743528 52487 573393
11046 573393 582536 687433 570057 866804 660866 385137 505124 877016 1006455 582635
11036 582635 1082978 987258 920518 1140851 1100949 675993 980716 741897 1250121 1466693
11026A466693n23706L19107l05971L53835j10894n7149j43407k5580Q0159L034
11016A056121k47261L34496k49398R1146k30431L31182J05176j61553l1856m34364
11006E63258P18411p2244q5366j53492r0567p2221L29434j84447k32333L5554
10996G55987J31235K32954l80707Q6718j15475k30523R2700K90409j49586o422
10986G07290l22732K96802j46492K71650l5231q1969j9905J62553J13870n6912
10976H88924Q429K86234J22648l43430k55389L7376L82984j64443N8716r7614
10966I24435J75558k98440O50975j21750k8948P9300K04975L00473k22357M11816
10956B076037J88078M74546J83947K70J47330N23299J45994j20780j67215p0850
$$ plain form
11026 1466693 942987 1262094 956123 1309958 1199064 1141915 998508 972928 1053087 1056121
11016 1056121 808860 1143356 893958 985104 754673 1085855 1191031 1029478 997622 563258
11006 563258 1281669 1209425 1124059 970567 880000 807779 1137213 952766 720433 755987
10996 755987 887222 1120176 739469 826187 710712 480189 572889 863298 713712 707290
10986 707290 384558 681360 534868 806518 771287 689318 669413 831966 945836 888924
10976 888924 897353 1183587 1306235 962805 707416 744792 1127776 963333 1022049 924435
10966 924435 1099993 801553 1452528 1330778 1301830 1381130 1586105 1886578 1664221 2076037
10956 2076037 2264115 2738661 2922608 2922878 3070208 3593507 3739501 3618721 3451506 3380656
10946C380656o44419J56946q39793j25806M95921l71984n8868k72087j75708j42685
10936A402173J99542k452k40254j71780n7281n17668L61922j23606l95515H5808
10925E62018q7280j93793K06248k03898a30060D4196c3764B73727a09752A86690
10914B99415c9759A82270J22408l4045a62250A842J80344f3373J5223B33718c37514
10902I0355b39214A22837e7879C39737h8916A19865B8922J0872P1681J77988b0152
10890B59913h3577m34117A88398a07204a4589A62609J52168d4436q0733D9914
10879a8922O482F0602g5508I4424c4207H6436g9456H121e1564k32411A63497a88841
10866e0224k83663B8763g7431j9726J5934j851d0336m1595B59446b20145C8120
$$ plain form
10946 3380656 2736237 2893183 2053390 1927584 2423505 2051521 1992653 1720566 1544858 1402173
10936 1402173 1601715 1599263 1359009 1187229 1129948 612280 974202 850596 455081 85808
10925 562018 474738 280945 487193 283295 -130060 44196 -33764 273727 -109752 186690
10914 299415 -39759 182270 304678 270633 -162250 1842 182186 -63373 -48150 233718 -337514
10902 90355 -239214 122837 -57879 339737 -88916 119865 28922 39794 111475 289463 -20152
10890 259913 -83577 -517694 188398 -107204 -14589 162609 314777 -44436 -125169 49914
10879 -18922 -12440 60602 -75508 94424 -34207 86436 -79456 8121 -51564 -283975 163497 -188841
10866 -50224 -333887 28763 -77431 -97157 -81223 -83074 -40336 -81931 259446 -220145 38120
10854b00791L939A99390B3332L14470b22004A1243e2501B8456a09870r2028d3030
10842c42208a65167p258B46149g3083n0348B55623a63736C1795a41497H4668a73948
10830a03183B90453i2128B19017p206f01080i1052l9760F372J56414c09982b9165
10818b49994i6602l23863a45549B03542b45312e4860E4914g1953k3113A30844
10807F0664Q3768d2237B59495I7620b8058B60258a12602r8826c4159k15764N7974
10796a91949E8878f5827B31459a24557j62644F242b07093A61680b30147j94895
10786d25042b5192A2993N3747a84847A10549b94137i7352I0178L5916e9706A41435
10774H4120R427M280i881D5212a7133r8605k29552A94711a65310O6411j2984o2763
$$ plain form
10854 -200791 -196852 199390 23332 337802 -222004 11243 -52501 28456 -109870 -201898 -43030
10842 -342208 -165167 -172425 246149 -73083 -123431 255623 -163736 31795 -141497 84668 -173948
10830 -103183 290453 -92128 219017 211811 -601080 -91052 -130812 6372 162786 -309982 -29165
10818 -249994 -96602 -420465 -145549 203542 -245312 -54860 54914 -71953 -95066 130844
10807 60664 144432 -42237 259495 97620 -28058 260258 -112602 -211428 -34159 -249923 -191949
10796 -191949 58878 -65827 231459 -124557 -287201 6242 -207093 161680 -230147 -425042
10786 -425042 -25192 12993 66740 -184847 110549 -294137 -97352 90178 126094 -59706 141435
10774 84120 93547 97827 -9881 45212 -17133 -115738 -345290 194711 -165310 -98899 -111883 -174646
10762a74646G9807a59097A08356a26222M6241m77442h8543A78236A133J26372
10752A27505h1650B31564c48768A41847I017P4992g9139A47388c2523k13222k2401
10741b68146C8233b51531B02130p9929b1528k47255A5292K41992A8550a15145
10730a21049H8776O0106b00257i0609B05908d1342B94590b07081D9653a29863
10719c28577a50646G2063a01234k61615a4975j92964e3393j9445j37281A62987
10708a20946G5278J07720p3919R411b17532A40627a01265A86566J54012b13533
10697g5944B2872b75761Q7561H0124b7649l1290k95152B49969G3224P6292e7807
10685b39201N1035M1814a1471l38873b0135B58011g6565j42806g8361C91496b87359
$$ plain form
10762 -174646 79807 -159097 108356 -126222 -79981 -557423 -88543 178236 1133 127505
10752 127505 -81650 231564 -348768 141847 9017 84009 -79139 147388 -32523 -245745 -268146
10741 -268146 38233 -251531 202130 122201 -21528 -268783 15292 257284 18550 -115145
10730 -121049 88776 148882 -200257 -90609 205908 -41342 294590 -207081 49653 -129863
10719 -328577 -150646 72063 -101234 -362849 -14975 -207939 -53393 -72838 -210119 162987
10708 -120946 75278 182998 109079 118490 -217532 140627 -101265 186566 340578 -213533
10697 -75944 22872 -275761 -188200 80124 -27649 -58939 -354091 249969 73224 149516 -57807
10685 -239201 -188166 -146352 -11471 -350344 -20135 258011 -76565 -219371 -78361 391496 -287359
10673i1637j93382k24229d0773A78090L0119e6028j0248j2394k07447o9939f2486
10661a16840n3106j77754a4006n9950D85876A15453m4992a23204j49817I3633
10650a58543O6793r7861A07782a7964C55318c56667c1861j01381A21144a9790
10639a68093k32707i4920l163o35709b29961e8096p2758k0643j02411G7770K05540
10628B83310A04856B5247K97179o6265d83885B8896f3443K3830A40108a67036
10617a21670G6228b00979B0740L1717e3166C03067A9208b38905a03589k84819
10607c88408A81713D3420c7155l37979A32441E3934B0790a22283N3758O008n4299
10596a16816d1695j72816j07084f3733q5460m7265i1282c7530A3733K27180j13218
$$ plain form
10673 -91637 -285019 -509248 -40773 178090 208209 -56028 -66276 -78670 -286117 -356056 -62486
10661 -116840 -169946 -347700 -14006 -73956 485876 115453 70461 -123204 -273021 93633
10650 -158543 -91750 -189611 107782 -17964 355318 -356667 -31861 -133242 121144 -19790
10639 -168093 -400800 -94920 -98083 -733792 -229961 -58096 -130854 -151497 -253908 77770 283310
10628 283310 104856 25247 322426 256161 -483885 28896 -63443 -39613 140108 -167036
10617 -121670 76228 -200979 20740 52457 -53166 303067 19208 -238905 -103589 -388408
10607 -388408 181713 43420 -37155 -375134 132441 53934 20790 -122283 -68525 -62517 -116816
10596 -116816 -41695 -214511 -321595 -63733 -149193 -196458 -91282 -37530 13733 240913 127695
10585A27695a8720p5521A10877a21826G2754i3494j51241j49878B09629a86284
10574a2245D706K41726b8780o2383m9879B03748H7958b79957A10197a6050j74382
10563a90432N2524F894J3603L13753b70014a01511j60542J25379a3865L315o8344
10552g8894r2847A27708b65691C62576C989a82056C15007c4610o1328B36596b56180
10540H6880a798A0948g9459B22197B8449K9774b52742a5359p5133j608A4145b41710
10527b12853f2893j92542j3330A2948R4121R144a84165j72758A59205a62101j8240
10516a80341e7522A66022p3785b47162d9068m9306A08923a82959B88883A9951
10505a1942k47680a04951k2841p8055q552J03714D6843b20879f2251j33684A8175
$$ plain form
10585 127695 -18720 -94241 110877 -121826 72754 -93494 -244735 -394613 209629 -186284
10574 -12245 4706 246432 -28780 -91163 -141042 203748 87958 -279957 110197 -16050 -190432
10563 -190432 -137908 6894 20497 334250 -270014 -101511 -262053 -136674 -13865 -10550 -78894
10552 -78894 -171741 127708 -265691 362576 3989 -182056 315007 -34610 -95938 236596 -256180
10540 86880 -1798 10948 -79459 222197 28449 58223 -252742 -15359 -90492 -92100 14145 -241710
10527 -212853 -62893 -255435 -268765 12948 107069 116213 -184165 -356923 159205 -162101 -180341
10516 -180341 -57522 166022 92237 -247162 -49068 -98374 108923 -182959 288883 19951
10505 -11942 -259622 -104951 -127792 -205847 -214399 -110685 46843 -220879 -62251 -195935 18175
10493a63463G8481e5082j86520b6445A7155d00879J99297B5555a32926F0939J44807
10482B05746b16521i8645A57264a06154A38004e0667l0779b5820B18595a13190
10471C4403b7727q8415F66547A16394K15443F1221J66413a28255H8038J17151
10461B05189N6441C2945M88406H7038K66692A61892e0C22247n4180p7614a00280
10449b71780B9718d0795B20831L4209a96365c7555r7296H6474l8208b9362A1350
10437a93966C6510P7241h5488j56525Q9754j16022q2642A06498f7590j49562c5257
10425b29063d3064A03383J36731a95175A03205K00591q9832E8915b43200A39705
10414A59508b27653r0682E9437d0708k08514l2421A27662F2229q978c03108C360
$$ plain form
10493 -163463 78481 -55082 -241602 -26445 17155 -400879 -201582 25555 -132926 60939 205746
10482 205746 -216521 -98645 157264 -106154 138004 -50667 -81446 -25820 218595 -113190
10471 34403 -27727 -116142 666547 116394 331837 61221 227634 -128255 88038 205189
10461 205189 261630 32945 521351 87038 353730 161892 -50 322247 268067 190453 -100280
10449 -271780 29718 -40795 220831 255040 -196365 -37555 -134851 86474 48266 -29362 11350
10437 -193966 36510 113751 -85488 -242013 -152259 -268281 -350923 106498 -67590 -217152 -35257
10425 -229063 -43064 103383 240114 -195175 103205 303796 213964 58915 -243200 139705
10414 159508 -227653 -318335 59437 -40708 -249222 -281643 127662 62229 53251 -303108 3360
10402A10257a15244C44320A45528n940b48032D050b38509b3720E7757J25136b98073
10390a72730A0001J52562E7142a92434A27280a22903o3529O096B49107A09067
10379G9213a70688e7470A53707R0243j3848a15753D10583A27854K80934r4462
10369C14326q9785k6175c16584B07216g0762A33287m3434N4451d0333A55483K02370
10358C57853O4046a11559C02005N1399n7137L1557K2750l9916K27295m3189J4993
10347E09757N9238j377k79746k1356M14609j50643A87919J82348j83747b8076
10336E09763A78472C8458M57934j31599M67385J5248j32822l20152A92018k3651
10326A68367K68205n7156j08207O1096J46539A60941O0361h3283f9F2941J57240
$$ plain form
10402 110257 -115244 344320 145528 139588 -248032 4050 -238509 -23720 57757 182893 -298073
10390 -172730 10001 162563 57142 -192434 127280 -122903 -186432 -180336 249107 109067
10379 79213 -170688 -57470 153707 243950 230102 -115753 410583 127854 408788 314326
10369 314326 224541 198366 -316584 207216 -70762 133287 89853 144304 -40333 155483 357853
10358 357853 421899 -111559 302005 353404 296267 327824 350574 310658 537953 494764 509757
10347 509757 568995 567618 287872 266516 681125 530482 187919 370267 186520 -28076
10336 509763 178472 38458 496392 364793 832178 847426 714604 394452 192018 168367
10326 168367 436572 379416 271209 332305 478844 160941 221302 -83283 -69 62941 220181
10315B20181M9913J65939j28514a61517A61914J03386q1647k014J44992A03421
10304B65756O7249a74136G4408b9823l1107n1843j1634j6893B56377I2643g5420
10292G0691J67310b33315d805k19327A60253a42862A36554M8800g9744A677K04326
10281B06003G5587K26153A8801K91512a65862P5569m7309M7287r0896A38471J9704
10270A58175F0591h1345A75078b48265M8044E9852a38887A0994a9071j31462L1225
10259a19308b135k25077h4123B99659f1106k83494B34267a95957D0904f1458A4056
10247b70762c9499I3129a55597j52710e0493B22745b39325a09392B6635J08527
10237A35162K13081L8554D4959M2702N4645F1493e9878A70822C9192e543j388
$$ plain form
10315 220181 270094 436033 307519 -161517 161914 265300 183653 181639 326631 103421
10304 265756 333005 -174136 74408 -29823 -60930 -112773 -124407 -141300 256377 92643 -75420
10292 70691 238001 -233315 -4805 -224132 160253 -142862 136554 185354 -79744 1677 206003
10281 206003 75587 301740 18801 310313 -165862 -90293 -137602 -90315 -181211 138471 158175
10270 158175 60591 -81345 175078 -248265 -200221 59852 -138887 10994 -19071 -150533 -119308
10259 -119308 -2135 -227212 -84123 299659 -61106 -344600 234267 -195957 40904 -61458 14056
10247 -270762 -39499 93129 -155597 -308307 -50493 222745 -239325 -109392 26635 135162
10237 135162 348243 386797 44959 87661 142306 61493 -59878 170822 39192 -5543 -6931
10226f931A64600N8799c1555B7581K68786B959N5685L8173a35472K9668n0369
10215a56173j99307B28640D9677L57043a97797P154j04684C4320a8989G7989a91378
10203i2446A75274a14982c1787P224j31330d2368k8327P147k14652a02723F8125
10191A28891J818P5178p8670b3219k26092g7020l2557k45543e1038p3744o2885
10180a87667R862a2086C3606K60861j40130C436a52207j23871Q0655A45349a09122
10168c1846I3690a98317p6980A21327b06375D99b02459r7645I1940i6794M2623
10157e4171l10320A28025c46095d0538F2733J65239f7249A40026B5118J15034
10147A40152J23845q4391P2534a01021A20422j8069d3489j92877g2365B4881g9955
$$ plain form
10226 -6931 164600 223399 -31555 27581 296367 2959 58644 96817 -135472 -105804 -156173
10215 -156173 -355480 228640 49677 406720 -197797 -190643 -295327 34320 -18989 77989 -191378
10203 -92446 175274 -114982 -31787 -24563 -155893 -42368 -70695 -63548 -278200 -102723 68125
10191 128891 130709 205887 127217 -23219 -249311 -77020 -109577 -355120 -51038 -124782 -187667
10180 -187667 -177805 -12086 33606 294467 154337 3436 -152207 -276078 -195423 145349 -109122
10168 -31846 93690 -198317 -275297 121327 -206375 499 -202459 -300104 91940 -96794 -54171
10157 -54171 -364491 128025 -346095 -40538 62733 227972 -67249 140026 25118 140152
10147 140152 263997 179606 252140 -101021 120422 102353 -43489 -236366 -72365 24881 -79955
10135A2004a03537j62768c9722A72872a81480b4542k8942j27808j67807A58069
10124B99249A43944l7822b37712j57188D070c6267m9919q8719P5910D1890b40538
10112b61126c6733B66338a20639m609A65333c20853G1217a75101g9700B2575a04841
10100a83133M1936A10362l2578a25446d5633C24062b33446N1154P5354l3187j02090
10089b42215a542k00914K3032r3739M0549A05399a79063K6163B36515I6316l3088
10078F3228i2089k09911h5771D1485b54073g5466H4571a63277O4420k36793e0409
10066e1730o7527J0899B36344c44301P3460i1242A27743a19333A92575b68505
10055B20468F8199f828B66462e200j14729A02192m1947J22322a65647E3230f9591
$$ plain form
10135 12004 -103537 -266305 -39722 172872 -181480 -24542 -53484 -181292 -349099 158069
10124 299249 143944 106122 -237712 -394900 4070 -36267 -86186 -174905 -98995 41890 -240538
10112 -261126 -36733 266338 -120639 -125248 165333 -320853 71217 -175101 -79700 22575 -104841
10100 -183133 -141197 110362 77784 -125446 -45633 324062 -233446 -182292 -106938 -140125 -242215
10089 -242215 -1542 -202456 -179424 -273163 -232614 105399 -179063 -152900 236515 96316 63228
10078 63228 -92089 -302000 -85771 41485 -254073 -75466 84571 -163277 -98857 -335650 -50409
10066 -51730 -119257 -108358 236344 -344301 -270841 -91242 127743 -119333 192575 -268505
10055 220468 68199 -6828 266462 -5200 -119929 102192 60245 182567 -165647 53230 -69591
10043A95230i4343n3860q730B55265b14800j38035q607N5404M6313J23887C35844
10031C37646A54885c85498b7656n9817A94905r3815k707L07688b22601C33325
10020C6292b20077N3636D4365b42902a11417k55476a5249p33C6489J31673J1756
10009A79918p6162j1515c44438i7885k5350d014I0169a48251r1792k8387k0667
9998b89097A8110J64398P6762c2262j00125K6993j3833o1140f2336q9525M1352
9987a10509B15215b76681J8535a28843A1853O7636a86739D4762a13292L0383m944
9976h7853j7744M4782I0151a21695k3266j88957g6129j29803j38978H0067b66143
9964A65515d8642m5471M5135l56951E8704b0343p2998k69349a42777F2622c19559
$$ plain form
10043 195230 -94343 -148203 -156933 255265 -214800 -352835 -361442 -306038 -259725 -135838 335844
10031 337646 154885 -385498 -27656 -87473 194905 101090 98383 406071 -222601 333325
10020 36292 -220077 -166441 44365 -242902 -111417 -366893 -15249 -15982 36489 168162 179918
10009 179918 103756 92241 -344438 -97885 -123235 -4014 90169 -148251 -240043 -268430 -289097
9998 -289097 18110 182508 259270 -32262 -132387 -105394 -119227 -180367 -62336 -151861 -110509
9987 -110509 215215 -276681 -258146 -128843 11853 79489 -186739 44762 -113292 -82909 -87853
9976 -87853 -105597 -60815 90151 -121695 -144961 -333918 -76129 -205932 -344910 80067 -266143
9964 165515 -48642 -94113 -48978 -405929 58704 -20343 -93341 -362690 -142777 62622 -319559
9952B3233b36050H2672a1231j17249h991k13535k2246d0274a3610k83823f4080
9940f2226k57326J35332P2685K277k4416B83c60022A0490c17655n2874B940a08941
9927I2458D5980e52015F9239a27512r7913e7368l2395I358a01350L2654j34996
9916b03692A7089i3008k41065A07378f0944J9399r9598j26410A59274d6033k30477
9905b76510I2677J01120d1223j58298j97541F1864d19239J85148D9074A9581a22280
9893f0594k47452A64330o6848m4947L10017A3899N3408K59353B8878J54775A2723
9881A56690a59433A19183d5897A36838B594J01465O5440E171K62931a54434j3244
9870a67678A63880g2491k80200l9661K1156a72975G1664a35931o990A74932a88574
$$ plain form
9952 23233 -236050 82672 -11231 -128480 -8991 -222526 -244772 -40274 -13610 -297433 -64080
9940 -62226 -319552 -184220 -111535 -109258 -133674 283 -360022 10490 -317655 -370529 2940 -108941
9927 92458 45980 -552015 69239 -127512 -225425 -57368 -89763 9358 -101350 -68696 -203692
9916 -203692 17089 -93008 -334073 107378 -60944 -41545 -141143 -267553 159274 -46033 -276510
9905 -276510 92677 193797 -41223 -199521 -397062 61864 -419239 -234091 49074 19581 -122280
9893 -60594 -308046 164330 97482 52535 362552 13899 67307 326660 28878 183653 12723
9881 156690 -159433 119183 -45897 136838 2594 104059 169499 5171 268102 -154434 -167678
9870 -167678 163880 -72491 -352691 -392352 -371196 -172975 71664 -135931 -142921 174932 -188574
9858A52832J01529b39823E1026b15897B1462b0705l71286f2459j06051j28692
9848b97202a40638B10501f9201j23631J7291A01809m7845R4431b53340a04407
9837a69827h2356m1228A24405f2480C1942J97682a03735n2200k1570k49495e9766
9825B69742B0760a41067o978o9259a00984r5750E7337Q940O6485J83543b78517
9813A95168i1031H532a87758j9099a4557j06611k86296a48722A29750P025C3154
9801A38620a64766j33950f5824k16838a00719k62356g3267A06654a14990C6591
9790b87841m5921J32716i1202H4743i5744J2653l53211d0849A05482h5757C446
9778A64069p1782f9289a990G9548J15324D9203a48985n0866C0466a40621A1613
$$ plain form
9858 152832 254361 -239823 51026 -215897 21462 -20705 -391991 -62459 -168510 -297202
9848 -297202 -140638 210501 -69201 -192832 -175541 101809 53964 148395 -253340 -104407
9837 -169827 -82356 -123584 124405 -62480 31942 229624 -103735 -155935 -177505 -427000 -59766
9825 269742 20760 -141067 -148045 -217304 -100984 -196734 57337 66277 132762 316305 -278517
9813 195168 -91031 8532 -187758 -206857 -14557 -121168 -407464 -148722 129750 136775 33154
9801 138620 -164766 -298716 -65824 -282662 -100719 -363075 -73267 106654 -114990 36591
9790 -287841 -333762 -201046 -91202 84743 -95744 -83091 -436302 -40849 105482 -85757 3446
9778 164069 92287 -69289 -1990 79548 194872 49203 -148985 -199851 30466 -140621 11613
9766E6392e3819k00256B2735a40474K9673D8726b18644n7537B1092a5537j79358
9755a94895e9022o2358j85906A62292D0257a42285H9403J11957a10511k22559
9745c33070a27463A69485b93417e9792j48501a6381B6157d0758j98553d2337H6116
9733h0076A61338c4148m12284E224d25075i188l69927J40213M6579l8969A99949
9721a14406n0726A06010M6201b66403H0859g7700C48222h5784l476j16943e969
9709i8268p9833g5028q4820A3299R7252c24725D5699g7891A43967c8810r0248
9698a29058K4534J6236m4717l1643D482f0438B22307e5650D7931a91739g3717
9686C9772i2170K5515k3711q5015j65647e0584C34070b8501H2914e6103l8040
$$ plain form
9766 56392 -53819 -254075 22735 -140474 -110801 48726 -218644 -276181 21092 -15537 -194895
9755 -194895 -59022 -121380 -307286 162292 40257 -142285 89403 201360 -110511 -333070
9745 -333070 -127463 169485 -293417 -59792 -208293 -16381 26157 -40758 -239311 -42337 86116
9733 -80076 161338 -34148 -446432 5224 -425075 -9188 -379115 -238902 -192323 -231292 199949
9721 -114406 -165132 106010 152211 -266403 80859 -77700 348222 -85784 -89260 -206203 -5969
9709 -98268 -178101 -75028 -159848 13299 110551 -324725 45699 -77891 143967 -38810 -129058
9698 -129058 -104524 -88288 -133005 -164648 4482 -60438 222307 -55650 47931 -191739 -73717
9686 39772 -92170 -66655 -90366 -175381 -341028 -50584 334070 -28501 82914 -56103 -94143
9675i4143j83944F2605c7328j50045B42257C9029c76562a69352j28201d4374A94516
9663F1869J1551a32900b6739j79678B29791i7372j73512B3977b57724b3644a1739
9651f5455j54247B6720a81440b7081A10913l0179P374f3903E0652d05094h4934
9639c40485G8911B7719d3460k95019a2363H9365K35332a69328j12062k34806d861
9627B4479K4222O7740d1230j41226c6732m52118A19143P481J73833F9434h3019
9615a75668j53535I3815b37138j1142I3781b64514a03369l3102A8990d13080b02842
9603B40784a87377A86134a9722H4068f3413j25853k67124B38247F7390g7448I6437
9591c70824A79892l2008L33191E8135c08437a15811a8714m3717I5781i0543l724
$$ plain form
9675 -94143 -278087 62605 -37328 -187373 242257 39029 -376562 -169352 -297553 -44374 194516
9663 61869 73420 -132900 -26739 -206417 229791 -97372 -270884 23977 -257724 -23644 -11739
9651 -65455 -219702 26720 -181440 -27081 110913 80734 88108 -63903 50652 -405094 -84934
9639 -340485 78911 27719 -43460 -338479 -12363 89365 324697 -169328 -281390 -516196 -4861
9627 24479 48701 116441 -41230 -182456 -36732 -488850 119143 126624 300457 69434 -83019
9615 -175668 -329203 93815 -237138 -248280 93781 -264514 -103369 -136471 18990 -413080 -202842
9603 240784 -187377 186134 -19722 84068 -63413 -189266 -456390 238247 67390 -77448 96437
9591 -370824 179892 147884 481075 58135 -308437 -115811 -18714 -62431 95781 -90543 -94267
9580i4267k71836f4955m1550A01134K0405d3380j77265j2904B08076a28827e664
9568C1403b76895A17598L4120a66173A18587l6797i0207K8316m71429a2109l16296
9557c28405J1711c4348n8369c5728m5829j75315Q4574e2613j37326b0211B05538
9545A35452e859A58671o2609h5774p278A81226b13860A12135c06975J24941C9856
9533G763a22065I0137i3960A40126l0670a01283l4821C14389b31219k8725J22313
9522a37631m4733A26510e5700A59419f3321B92339a11520c6889A8570a14093k1870
9511a35963A20208a52730N2317A65611c1584k72594a05250G6489J53285d29451
9500I2003h0115l5845B5090b07770P1785N8103k3424j93587a07257j03840A25185
$$ plain form
9580 -94267 -366103 -64955 -106505 101134 121539 -43380 -220645 -233549 208076 -128827 -5664
9568 31403 -276895 117598 151718 -166173 118587 81790 -90207 -61891 -533320 -12109 -328405
9557 -328405 -316694 -34348 -92717 -35728 -81557 -256872 -172298 -52613 -189939 -20211 205538
9545 135452 -5859 158671 96062 -85774 -93052 181226 -213860 112135 -306975 -182034 39856
9533 7763 -122065 90137 -93960 140126 109456 -101283 -136104 314389 -231219 -259944 -137631
9522 -137631 -182364 126510 -55700 159419 -63321 292339 -111520 -36889 18570 -114093 -135963
9511 -135963 120208 -152730 -100413 165611 -31584 -304178 -105250 76489 229774 -429451
9500 92003 -80115 -115960 25090 -207770 -135985 -77882 -101306 -294893 -107257 -211097 125185
9488a92647K3700g6836A16026j1258J5701J94328c50004a1060A48546d93053a62022
9476C608b63760G0666c2919k8581j31033L5163H4034R4950c89323J32336m356
9465b61343J7863d2290m50424a69859g7310k36677B7477K5135b9238m2790j77687
9454b49715D6461j4953a71454h5078c6415A52546a88099g7887D3260a60138C8466
9442a56792F1329c3353P999k5585n0405A13615J18821d7860B02513f8403b0504
9430c11410a4885B3644B026a20994C06265E0720J01492a90413B52339c31403D5084
9418a90558g7435B8721P9659a00598d6346k12482D2347a33314D7508a31957B9018
9406a69577k06129g8110l2759J1697j85187h3651D2370O5794b08214r6395C28851
$$ plain form
9488 -192647 -168947 -76836 116026 104768 120469 314797 -350004 -11060 148546 -493053 -162022
9476 3608 -263760 70666 -32919 -61500 -192533 -157370 84034 178984 -389323 -256987 -261343
9465 -261343 -243480 -42290 -492714 -169859 -77310 -313987 27477 52612 -29238 -72028 -249715
9454 -249715 46461 31508 -171454 -85078 -36415 152546 -188099 -77887 43260 -160138 38466
9442 -156792 61329 -33353 -25354 -50939 -101344 113615 232436 -47860 202513 -68403 -20504
9430 -311410 -14885 23644 2026 -120994 306265 50720 152212 -190413 252339 -331403 45084
9418 -190558 -77435 28721 108380 -100598 -46346 -258828 42347 -133314 47508 -131957 29018
9406 -169577 -375706 -78110 -110869 -99172 -284359 -83651 42370 108164 -208214 -304609 328851
9394F6616d02831d1406B75860r4966B1630L1599a18156m9698l46867F4418L3770
9383I8188a33933B8664a87942P7450k8536j05314B0114e3169j09426g4405I4650
9371f3294H4071d15257h2531p722j45500J11834j52605N3797A27358c01982C0680
9359b57583A45434P6191p3333a84805Q8468M3702k30726A86609C5689J17917f1875
9347A76226a59542J9314c8603l85863D2146d1492j68125e1864k32495A65869j7506
9336A48363b20149n661I4184b79473A92363a21858A94884a84300j91512A34637
9325F0343f2470D2201L5849M4367c1672k36467A9918N4973d2087j64472n2176
9314b58735A74618a92836m8821A0770J25880c0665D818i0437C4761P5235b31701
$$ plain form
9394 66616 -402831 -41406 275860 180894 21630 53229 -118156 -167854 -514721 64418 98188
9383 98188 -133933 28664 -187942 -110492 -139028 -244342 20114 -53169 -162595 -74405 94650
9371 -63294 84071 -415257 -82531 -90253 -235753 -123919 -276524 -222727 127358 -301982 30680
9359 -257583 145434 221625 148292 -184805 -96337 -52635 -283361 186609 35689 153606 -61875
9347 176226 -159542 -140228 -38603 -424466 42146 -41492 -209617 -51864 -284359 165869 148363
9336 148363 -220149 -225810 94184 -279473 192363 -121858 194884 -184300 -375812 134637
9325 60343 -62470 42201 78050 122417 -31672 -268139 19918 74891 -42087 -206559 -258735
9314 -258735 174618 -192836 -241657 10770 136650 -30665 4818 -90437 34761 109996 -231701
9302c1155o3298p0376D2655K43557n2897D88b16615d6244m2365j12464A1908J03522
9290A15430m2259j877a42291b1539k81252n1295f9211C33262A00642c01788R1963
9279b09825l6698B13891b27818c2132K50j84250b8484M210n2872b6624A85613
9267f0610E698O0773J19077c2914n0600D38771b34914C58004e6575C9650e0447
9255h225A12171I682a5261j19165q4285A12003E2660c16788J07360a8474J181
9244a7293j09429l2045j89048a66687Q1351B31049A5021f6892a1344j72844j64688
9233c48876h3557A18048C4556f3725J1308q6080o7824H8639b04628b4641A83781
9221c09285Q2025h9271l8106j6860a187F5947f9739F4847c07871A41661b43625
$$ plain form
9302 -31155 -94453 -164829 42655 286212 233315 488 -216615 -46244 -88609 -201073 11908 115430
9290 115430 73171 71294 -142291 -21539 -302791 -354086 -69211 333262 100642 -301788 -209825
9279 -209825 -246523 213891 -227818 -32132 -31882 -216132 -28484 -24274 -77146 -26624 185613
9267 -60610 5698 66471 185548 -32914 -83514 438771 -234914 358004 -56575 39650 -50447
9255 -8225 112171 9682 -15261 -134426 -218711 112003 52660 -316788 -209428 -18474 -17293
9244 -17293 -126722 -158767 -347815 -166687 -85336 231049 15021 -66892 -11344 -184188 -348876
9233 -348876 -83557 118048 34556 -63725 -52417 -138497 -206321 88639 -204628 -24641 183781
9221 -309285 -227260 -89271 -127377 -144237 -1187 65947 -69739 64847 -307871 141661 -243625
9209A8483c64421B8621d7845j03610m4192A23196a09827c8414k6080B08211c90578
9197A9642l980i7416A86286p5416a37054B8404i4281K1110j75602l3820J30222
9186a52371B27598c30359B53288b05117A80365a39883D4993g9311a8238C0818
9175I7496a96590R2463I4486b01765A73071b41861E2772J38075b14454Q84j55209
9164c68779A40491M8901o8014c48825a37376q8790f0417r5891l6966N6908d0169
9152b23373i7492B4088D717c13212d6305J9998B41775B4427f3159j23405B805
9140c46700J09266N4338B37895A4783K6075K64517C8110c8757r4135A88967c27717
9128a03993b9173B8497A0168e8212k09808A7954c46769a35520A58308b95573d3008
$$ plain form
9209 18483 -364421 28621 -47845 -151455 -195647 123196 -109827 -38414 -64494 208211 -390578
9197 19642 15662 -97416 186286 110870 -137054 28404 -94281 -73171 -248773 -282593 -152371
9186 -152371 227598 -330359 253288 -205117 180365 -139883 44993 -79311 -18238 30818
9175 97496 -196590 -104127 94486 -201765 173071 -241861 52772 190847 -214454 -213570 -368779
9164 -368779 140491 189392 121378 -348825 -137376 -226166 -60417 -156308 -193274 -136366 -40169
9152 -223373 -97492 24088 4717 -313212 -46305 -26307 241775 24427 -63159 -186564 2805
9140 -346700 -237434 -183096 237895 14783 40858 305375 38110 -38757 -132892 188967 -327717
9128 -103993 -29173 28497 10168 -58212 -268020 17954 -346769 -135520 158308 -295573 -43008
9116a7757B80406G7296j4922b55389E3570b0342p3534A59592a61424C69891A44273
9104B46775a08017J7996j04606E3434a97313A4722b79720N8926B6204L6321M7958
9093A10483b44463B30686A2540J2115J88085H7528d25662G701a60690C16960a72991
9081g624p149d853j29055j48408j71218a18126m0165N8879a0577m3709j73702
9070b27988h7594k3531G3476a56535G1242A0901i0713h708B36931d107l07189
9059c11296J37570A69706i9765J2437C3969b39893d6964l87158F0636c48954a13017
9047b59314j72513a58695n3423n2188A49762D9034a81314k19967I660b25016d1230
9035c78154A11098a54337A44331a87447B75044A19408E0183a61924j5974N1065
$$ plain form
9116 -17757 280406 77296 62374 -255389 53570 -20342 -93876 159592 -161424 369891 144273
9104 246775 -108017 -90021 -194627 53434 -197313 14722 -279720 -220794 26204 62525 110483
9093 110483 -244463 230686 12540 24655 212740 87528 -425662 7701 -160690 316960 -172991
9081 -7624 -14773 -4853 -133908 -282316 -453534 -118126 -158291 -99412 -10577 -54286 -227988
9070 -227988 -87594 -111125 73476 -156535 71242 10901 -90713 -8708 236931 -4107 -311296
9059 -311296 -173726 169706 -99765 -87328 33969 -239893 -46964 -434122 60636 -348954 -113017
9047 -259314 -431827 -158695 -212118 -264306 149762 49034 -181314 -401281 9660 -225016 -41230
9035 -378154 111098 -154337 144331 -187447 275044 119408 50183 -161924 -177898 -126833
9025a26833A35957g688l10573H5026D1501K6181a03464k13210A46024o4329l0120
9014E1575L02264b16166a943m1137I8086b4979l4448B4401c14649c818j88582
9003a92400B36891G9281f9701B95683o6531d0490A0713c86606g3843J6887B21412
8991B21088a88914A30351g9590k03344j75268B48553A11924j144J08072e3459
8980b33988E380d8441b3241j81562I174b16136R2939k59033J69078R9083j43148
8969b57217A62828i8136c8251j2337A06112J87214F0847J24816r0525a45791q2150
8958b27941i109j75452j28311B5718J51137m0463g0419A99638B9389e63107A4098
8946a429A07059b13985A35164b27730a02319j96871J47023G0505l4737J09220
$$ plain form
9025 -126833 135957 -7688 -318261 85026 41501 67682 -103464 -316674 146024 81695 51575
9014 51575 353839 -216166 -1943 -43080 98086 -24979 -59427 24401 -314649 -3818 -192400
9003 -192400 236891 79281 -69701 295683 229152 -40490 10713 -386606 -73843 -56956 221412
8991 221088 -188914 130351 -79590 -282934 -458202 248553 111924 110780 218852 -53459
8980 -233988 5380 -48441 -23241 -204803 9174 -216136 -123197 -382230 -213152 -114069 -257217
8969 -257217 162828 -98136 -38251 -50588 106112 293326 60847 185663 95138 -145791 -227941
8958 -227941 -9109 -184561 -312872 25718 176855 136392 -70419 199638 29389 -563107 14098
8946 -1429 107059 -213985 135164 -227730 -102319 -299190 -152167 70505 35768 144988
8936A44988a18497C854K36147f2087K2020k00765o3684J04431f5746H56b37090
8924C9766a18283A10491B9534b99424a33549A35978M9095K2118K67475g2966j52367
8913b25333B51059g9411j42036C23206J17807J57065J74986K79383J201069J186183
8903C439699M178070j737522k041904j033340j330131j43697D51411P5274A8236
8893A06822J34153h8406I0840R9808k3228D5829f7160E3529K17623G8651a02103
8881A1896J9629d62639b25803a04874l758L9774B09355D3323b46237M9736B66239
$$ plain form
8936 144988 -118497 3854 240001 -62087 -40067 -240832 -304516 -200085 -65746 856 -237090
8924 39766 -118283 110491 29534 -299424 -133549 135978 185073 207191 474666 -72966 -225333
8913 -225333 251059 -79411 -221447 323206 441013 598078 773064 1052447 2253516 3439699
8903 3439699 7617769 5880247 3838343 2805003 1474872 1331175 451411 526685 18236
8893 106822 240975 -88406 90840 190648 167420 45829 -67160 53529 271152 78651 -102103
8881 11896 31525 -462639 -225803 -104874 -108632 -68858 209355 43323 -246237 -196501 266239
$$ [...]
##END NTUPLES=NMR SPECTRUM
##END=
