
##TITLE=AC1080_MAST01_5819146_kSWaKvAYf4
##JCAMPDX= 6.0         $$ Bruker NMR JCAMP-DX V2.0
##DATA TYPE= NMR SPECTRUM
##DATA CLASS= NTUPLES
##ORIGIN= BRUKER
##OWNER= Administrator
$$ 1.72 TOPSPIN		Version 2.1
$$ 2012-03-24 21:09:11.218 -0500  Administrator@TOPSPIN
$$ Compression mode = diff/dup
##.OBSERVE FREQUENCY= 400.13188235
##.OBSERVE NUCLEUS= ^1H
##.ACQUISITION MODE= SIMULTANEOUS (DQD)
##.ACQUISITION SCHEME= undefined
##.AVERAGES= 64
##.DIGITISER RES= 22
##SPECTROMETER/DATA SYSTEM= spect
##.PULSE SEQUENCE= noesygpps1d.comp
##.SOLVENT NAME= COFFEE_meoh
##.SHIFT REFERENCE= INTERNAL, COFFEE_meoh, 1, 14.96876
##AUDIT TRAIL= $$ (NUMBER, WHEN, WHO, WHERE, PROCESS, VERSION, WHAT)
$$ ##TITLE= Audit trail, TOPSPIN		Version 2.1
$$ ##JCAMPDX= 5.01
$$ ##ORIGIN= Bruker BioSpin GmbH
$$ ##OWNER= Administrator
$$ $$ C:\Bruker\TOPSPIN/data/COFFEE/nmr/AC1080_MAST01_5819146_kSWaKvAYf4/12/pdata/1/auditp.txt
$$ ##AUDIT TRAIL=  $$ (NUMBER, WHEN, WHO, WHERE, PROCESS, VERSION, WHAT)
(   1,<2012-03-24 21:09:06.015 -0500>,<Administrator>,<TOPSPIN>,<go>,<TOPSPIN 2.1>,
      <created by zg
	started at 2012-03-24 20:57:34.359 -0500,
	POWCHK enabled, PULCHK disabled,
       configuration hash MD5:
       1A 1E CE 29 27 FD 77 03 67 4E F0 E3 C4 B2 CB 90
       data hash MD5: 64K
       25 C4 16 2A C9 16 B3 29 48 6F C5 49 17 49 45 83>)
(   2,<2012-03-24 21:09:08.843 -0500>,<Administrator>,<TOPSPIN>,<proc1d>,<TOPSPIN 2.1>,
      <Start of raw data processing
       efp LB = 0.3 FT_mod = 6 PKNL = 1 PHC0 = 0 PHC1 = 0 SI = 128K 
       data hash MD5: 128K
       17 F5 FF 81 2A 88 3C 4F DB 58 73 CF 86 D3 F8 42>)
(   3,<2012-03-24 21:09:10.406 -0500>,<Administrator>,<TOPSPIN>,<proc1d>,<TOPSPIN 2.1>,
      <pk PHC0 = 39.56726 PHC1 = 0 
       data hash MD5: 128K
       BF 80 36 F4 45 99 19 DC 41 9E 3D 2F D3 C4 9C 08>)
(   4,<2012-03-24 21:09:10.890 -0500>,<Administrator>,<TOPSPIN>,<proc1d>,<TOPSPIN 2.1>,
      <abs ABSG = 1 
       data hash MD5: 128K
       D6 BC ED 51 62 87 F8 24 E1 A8 D7 82 56 F1 70 FB>)
(   5,<2012-03-24 21:09:10.968 -0500>,<Administrator>,<TOPSPIN>,<proc1d>,<TOPSPIN 2.1>,
      <abs ABSG = 2 
       data hash MD5: 128K
       B4 B1 DF 71 D2 EB D2 54 CC 7B CC 24 B5 18 E4 9B>)
(   6,<2012-03-24 21:09:11.015 -0500>,<Administrator>,<TOPSPIN>,<proc1d>,<TOPSPIN 2.1>,
      <abs ABSG = 3 
       data hash MD5: 128K
       F7 F5 53 96 CB A3 6A 9F 8E 0A 6A 64 9C 3B E7 92>)
(   7,<2012-03-24 21:09:11.093 -0500>,<Administrator>,<TOPSPIN>,<proc1d>,<TOPSPIN 2.1>,
      <abs ABSG = 4 
       data hash MD5: 128K
       40 43 51 8F F8 87 1E A7 B8 A2 08 F5 94 10 91 C0>)
(   8,<2012-03-24 21:09:11.140 -0500>,<Administrator>,<TOPSPIN>,<proc1d>,<TOPSPIN 2.1>,
      <abs ABSG = 5 
       data hash MD5: 128K
       3F 4F A4 05 13 2F BA 66 D2 54 F6 EA AF 11 A2 81>)
$$ ##END=
$$ 
$$ $$ hash MD5
$$ $$ 9F 30 5D 2F 00 C6 60 9A 45 FB 43 83 67 26 FD 99
##$RELAX= 
##$RELAX= 
##$RELAX= 
##$RELAX= 
##$RELAX= 
##$RELAX= 
##$RELAX= 
##$RELAX= 
$$ Bruker specific parameters
$$ [...]
##$TP07= 0
##$TPNAME0= <>
##$TPNAME1= <>
##$TPNAME2= <>
##$TPNAME3= <>
##$TPNAME4= <>
##$TPNAME5= <>
##$TPNAME6= <>
##$TPNAME7= <>
##$TPOAL= (0..7)
0.5 0.5 0.5 0.5 0.5 0.5 0.5 0.5
##$TPOFFS= (0..7)
0 0 0 0 0 0 0 0
##$TUNHIN= 0
##$TUNHOUT= 0
##$TUNXOUT= 0
##$USERA1= <user>
##$USERA2= <user>
##$USERA3= <user>
##$USERA4= <user>
##$USERA5= <user>
##$V9= 5
##$VALIST= <valist>
##$VCLIST= <CCCCCCCCCCCCCCC>
##$VD= 0
##$VDLIST= <DDDDDDDDDDDDDDD>
##$VPLIST= <PPPPPPPPPPPPPPP>
##$VTLIST= <TTTTTTTTTTTTTTT>
##$WBST= 2048
##$WBSW= 25
##$XGAIN= (0..3)
0 0 0 0
##$XL= 0
##$YL= 0
##$YMAX_a= 15731861
##$YMIN_a= -6922230
##$ZGOPTNS= <>
##$ZL1= 120
##$ZL2= 120
##$ZL3= 120
##$ZL4= 120
##$ABSF1= 14.96876
##$ABSF2= -5.583771
##$ABSG= 5
##$ABSL= 3
##$ALPHA= 0
##$AQORDER= 0
##$ASSFAC= 0
##$ASSFACI= 0
##$ASSFACX= 0
##$ASSWID= 0
##$AUNMP= <proc_prof1d_extract.lims>
##$AXLEFT= 0
##$AXNAME= <>
##$AXNUC= <1H>
##$AXRIGHT= 0
##$AXTYPE= 0
##$AXUNIT= <>
##$AZFE= 0.1
##$AZFW= 0.1
##$BCFW= 0
##$BC_mod= 0
##$BYTORDP= 0
##$COROFFS= 0
##$CY= 15
##$DATMOD= 1
##$DC= 0
##$DFILT= <>
##$DTYPP= 0
##$F1P= 0
##$F2P= 0
##$FCOR= 0.5
##$FTSIZE= 131072
##$FT_mod= 6
##$GAMMA= 0
##$GB= 0
##$INTBC= 1
##$INTSCL= 1
##$ISEN= 128
##$LB= 0.3
##$LEV0= 0
##$LPBIN= 0
##$MAXI= 10000
##$MC2= 0
##$MEAN= 0
##$ME_mod= 0
##$MI= 0
##$NCOEF= 0
##$NC_proc= -3
##$NLEV= 6
##$NOISF1= 0
##$NOISF2= 0
##$NSP= 0
##$NTH_PI= 0
##$NZP= 0
##$OFFSET= 14.96876
##$PC= 1
##$PHC0= 39.56726
##$PHC1= 0
##$PH_mod= 1
##$PKNL= yes
##$PPARMOD= 0
##$PPDIAG= 0
##$PPIPTYP= 0
##$PPMPNUM= 2147483647
##$PPRESOL= 1
##$PSCAL= 4
##$PSIGN= 0
##$PYNMP= <proc.py>
##$REVERSE= no
##$SF= 400.130004743984
##$SI= 131072
##$SIGF1= 0
##$SIGF2= 0
##$SINO= 400
##$SIOLD= 131072
##$SPECTYP= <>
##$SREGLST= <1H.CDCl3>
##$SSB= 0
##$STSI= 131072
##$STSR= 0
##$SW_p= 8223.68421052632
##$SYMM= 0
##$S_DEV= 0
##$TDeff= 65536
##$TDoff= 0
##$TI= <>
##$TILT= no
##$TM1= 0
##$TM2= 0
##$TOPLEV= 0
##$USERP1= <user>
##$USERP2= <user>
##$USERP3= <user>
##$USERP4= <user>
##$USERP5= <user>
##$WDW= 1
##$XDIM= 131072
##$YMAX_p= 548400827
##$YMIN_p= -1661218
##$CURPLOT= <Network HP LaserJet P1505>
##$CURPRIN= <$Network HP LaserJet P1505>
##$DFORMAT= <normdp>
##$LAYOUT= <+/1D_H.xwp>
##$LFORMAT= <normlp>
##$PFORMAT= <normpl>
##$SURQMSG= 1
$$ End of Bruker specific parameters
$$ ---------------------------------
##NTUPLES= NMR SPECTRUM
##VAR_NAME=  FREQUENCY,     SPECTRUM/REAL,   SPECTRUM/IMAG
##SYMBOL=    X,             R,               I
##VAR_TYPE=  INDEPENDENT,   DEPENDENT,       DEPENDENT
##VAR_FORM=  AFFN,          ASDF,            ASDF
##VAR_DIM=   131072,        131072,          131072
##UNITS=     HZ,            ARBITRARY UNITS, ARBITRARY UNITS
##FACTOR=    0.0627417313425165, 1,          1
##FIRST=     8223.62146879498, -5974,        -122630
##LAST=      0,             -1041,           -124584
##MIN=       0,             -1661218,        0
##MAX=       8223.62146879498, 548400827,    0
$$ Real data points
##PAGE= N=1
##DATA TABLE= (X++(R..R)), XYDATA
$$ [...]
60726A163990k134P28L330L897K997K781L906N288O680R190J2866J5826J6745
60713A246090J6615J7024J7965J8395J8084J7815J8271J9607K1614K3506K4036
60702A459022K2617K0131J7925J6309J4702J3011J1987J1980J2116J1190R121
60691A620111P069O115O080N697L878P88k124l256k353r44r31k649m767o282p726
60676A618706r873j2122j3309j3557j3940j4571j4533j3777j3538j4450j5723
60665A469313j6540j6793j6103j3829j0900r687j0816j1779j0269p217m861l338
60653A337181j402P93K132K969M507O065N668L378J525J262J227K80p13p18k10
60638A363944J51Q05K032K790K044K78j373k491l063k991k893m175p085r748j0512
$$ y = [1163990, 1161856, 1162584, 1165914, 1169811, 1172808, 1175589, 1179495, 1184783, 1191463, 1200653, 1213519, 1229345, 1246090, 1262705, 1279729, 1297694, 1316089, 1334173, 1351988, 1370259, 1389866, 1411480, 1434986, 1459022, 1481639, 1501770, 1519695, 1536004, 1550706, 1563717, 1575704, 1587684, 1599800, 1610990, 1620111, 1627180, 1633295, 1639375, 1645072, 1648950, 1649738, 1647614, 1644358, 1642005, 1641061, 1640130, 1637481, 1632714, 1626432, 1618706, 1608833, 1596711, 1583402, 1569845, 1555905, 1541334, 1526801, 1513024, 1499486, 1485036, 1469313, 1452773, 1435980, 1419877, 1406048, 1395148, 1385461, 1374645, 1362866, 1352597, 1345380, 1340519, 1337181, 1335779, 1336572, 1338704, 1341673, 1346180, 1352245, 1357913, 1361291, 1362816, 1364078, 1365305, 1365585, 1364872, 1364154, 1363944, 1364095, 1364900, 1366932, 1369722, 1371766, 1372044, 1370671, 1368180, 1365117, 1362126, 1359233, 1355058, 1347973, 1338225, 1327713]
60623A327713j0366j1448j3835j5623j5940j6070j7185j8594j9061j8688j8367
60612A152536j8133j7211j5482j3768j2501j1074q954o617m711k942p38J454K634
60599A044493K845L097L713M088M317N481P643R036Q360O667N805O094O817P805
60585A126261Q959R171P645N651M998N213M408K615J996L392M936M874L989M149
60571A198257N876Q339J0725J2634J3846J4435J4809J5290J6121J7653J9749K1249
60559A368983K1109J9926J9190J9254J9358J9317J9430J8855J6145J1773Q136
60548A561476O463N599M406L314K466N13l267p299r739j0772j1477j1776j1301
60535A518606j1130j2667j5380j7306j7481j6494j5065j3450j1938j0702r283
$$ y = [1327713, 1317347, 1305899, 1292064, 1276441, 1260501, 1244431, 1227246, 1208652, 1189591, 1170903, 1152536, 1134403, 1117192, 1101710, 1087942, 1075441, 1064367, 1055413, 1048796, 1044085, 1041143, 1040405, 1041859, 1044493, 1047338, 1050435, 1054148, 1058236, 1062553, 1068034, 1075677, 1084713, 1093073, 1099740, 1105545, 1111639, 1118456, 1126261, 1135220, 1144391, 1152036, 1157687, 1162685, 1167898, 1172306, 1174921, 1176917, 1180309, 1185245, 1190119, 1194108, 1198257, 1204133, 1212472, 1223197, 1235831, 1249677, 1264112, 1278921, 1294211, 1310332, 1327985, 1347734, 1368983, 1390092, 1410018, 1429208, 1448462, 1467820, 1487137, 1506567, 1525422, 1541567, 1553340, 1561476, 1567939, 1573538, 1577944, 1581258, 1583724, 1584237, 1580970, 1573671, 1563932, 1553160, 1541683, 1529907, 1518606, 1507476, 1494809, 1479429, 1462123, 1444642, 1428148, 1413083, 1399633, 1387695, 1376993, 1367710]
60524A367710p154m511j828P52K766L040J218r72j439k52Q25R81J093J905K848
60509A366982L025K336J367Q29J188K207K908K736K652M312P990J1972J4097J3617
60495A438218J1573R821R517J0228J0559R837Q728Q064P835P942R008J1426J4106
60482A566862J5541J5934J7160K0400K4855K9173L3308L8377M5172N3339O1761
60471A921882O9083P3816P4659P1310O4871N6606M6179L2032J4156m311j9463
60460B400820l0019l7183m1651m2689m0325l6362l2135k6751j8826q995M42P675
60448B094001J2383J5452J8536K3076K8716L3380L5808L7347M0345M5558N2117
60437B436719N9240O6783P4775Q3600R4244J07284J21952J37132J52768J69247
$$ y = [1367710, 1360556, 1356045, 1354217, 1354969, 1357735, 1360775, 1361993, 1361021, 1359582, 1359330, 1360155, 1361136, 1362229, 1364134, 1366982, 1370007, 1372343, 1373710, 1374539, 1375727, 1377934, 1380842, 1383578, 1386230, 1390542, 1398532, 1410504, 1424601, 1438218, 1449791, 1459612, 1469129, 1479357, 1489916, 1499753, 1508481, 1516545, 1524380, 1532322, 1541330, 1552756, 1566862, 1582403, 1598337, 1615497, 1635897, 1660752, 1689925, 1723233, 1761610, 1806782, 1860121, 1921882, 1990965, 2064781, 2139440, 2210750, 2275621, 2332227, 2378406, 2410438, 2424594, 2420283, 2400820, 2370801, 2333618, 2291967, 2249278, 2208953, 2172591, 2140456, 2113705, 2094879, 2085884, 2086326, 2094001, 2106384, 2121836, 2140372, 2163448, 2192164, 2225544, 2261352, 2298699, 2339044, 2384602, 2436719, 2495959, 2562742, 2637517, 2721117, 2815361, 2922645, 3044597, 3181729, 3334497, 3503744]
60427C503744J85920K01443K15243K27697K39245K50575K63392K79832L00781
60418E667872L25273L50936L74010L89192L90395L71947L29118K59215J64165
60409H622123N1980o5776j78429k78057l58608m15792m48581m59705m54045m36874
60399E578236m12983l85738l56455l25493k94177k64673k37914k12974j89066
60390B898763j67287j49553j36223j25391j14482j02398r0212p9796p1810o5337
60380A796274n9404n4062m9600m5655m1863l8615l6147l3619l0282k6961k4986
60369A355080k4025k2476j9856j7353j5884j5043j4276j3730j3517j3191j2544
60358A173185j1935j1428j0373q394o020m013k634j726q75N48K723M676N106M090
$$ y = [3503744, 3689664, 3891107, 4106350, 4334047, 4573292, 4823867, 5087259, 5367091, 5667872, 5993145, 6344081, 6718091, 7107283, 7497678, 7869625, 8198743, 8457958, 8622123, 8674103, 8608327, 8429898, 8151841, 7793233, 7377441, 6928860, 6469155, 6015110, 5578236, 5165253, 4779515, 4423060, 4097567, 3803390, 3538717, 3300803, 3087829, 2898763, 2731476, 2581923, 2445700, 2320309, 2205827, 2103429, 2013217, 1933421, 1861611, 1796274, 1736870, 1682808, 1633208, 1587553, 1545690, 1507075, 1470928, 1437309, 1407027, 1380066, 1355080, 1331055, 1308579, 1288723, 1271370, 1255486, 1240443, 1226167, 1212437, 1198920, 1185729, 1173185, 1161250, 1149822, 1139449, 1131055, 1125035, 1121022, 1118388, 1116662, 1115787, 1116335, 1119058, 1123734, 1128840, 1132930]
60344A132930K978K521K281K135K902M732O035N299L212J956K713M792O828P949
60330A189263Q049P771Q191R642J0942J0474Q195N840M830M703M076K584J134
60317A275694L82j30j093k372l322l786m056m106l575k523j518p14M39K155L534
60302A255009L438J956N26N51K098L966M956N099N464O626P849Q220Q166Q865
60288A322789J0443J1791J2149J1736J0789R368Q350R081J1231J2461J1226Q804
60276A450218P329O957O323M908L444K413J615R92O90M97K03L05J386L070M505
60261A494855N545O477O910O075M109K032M04j066k670m228n550o798q270j0158
60247A487667j2175j3261j2296r624p169o360o605o476n650m828m432m296m128
$$ y = [1132930, 1135908, 1138429, 1140710, 1142845, 1145747, 1150479, 1156514, 1161813, 1165025, 1166981, 1169694, 1174486, 1181314, 1189263, 1197312, 1205083, 1213274, 1222916, 1233858, 1244332, 1252527, 1258367, 1263197, 1267900, 1271976, 1274560, 1275694, 1276076, 1275946, 1274853, 1272481, 1269159, 1265373, 1261317, 1257211, 1253636, 1251113, 1249595, 1248881, 1249320, 1251475, 1255009, 1258447, 1260403, 1260929, 1261480, 1263578, 1267544, 1272500, 1277599, 1283063, 1289689, 1297538, 1305758, 1313924, 1322789, 1333232, 1345023, 1357172, 1368908, 1379697, 1389065, 1397415, 1406496, 1417727, 1430188, 1441414, 1450218, 1457547, 1464504, 1470827, 1475735, 1479179, 1481592, 1483207, 1484199, 1484889, 1485386, 1485589, 1485894, 1487280, 1490350, 1494855, 1500400, 1506877, 1513787, 1519862, 1523971, 1526003, 1526407, 1525341, 1522671, 1518443, 1512893, 1506095, 1497825, 1487667, 1475492, 1462231, 1449935, 1440311, 1433142, 1426782, 1420177, 1413701, 1408051, 1403223, 1398791, 1394495, 1390367]
60234A390367l561k296p20L43R19J795K707K278N50l58N48J308K52r30J97K830
60218A396229M417M832N871P464P851P268P939J0112J1429J0944J0632J1894J3482
60205A510364J4228J5227J7583K0202K1561K1966K2492K3199K3964K5740K9408
60194A745934L4325L9165M3358M6804M9336N1484N4658N9503O5013P0104P5066
60183B334750Q0688Q7056R4086J02031J10476J17946J23689J28855J34815J41160
60173C455552J46487J50267J52719J53453J51552J46690J39226J29453J17584
60164D742983J04295R0515P6627O2278M7022L1093J5730K448q430j8051k7069
60153E119441l3942l6465l4690l0771k5909j9244j0083N19J1186K1930L3528M6376
$$ y = [1390367, 1386806, 1384510, 1383790, 1384133, 1385052, 1386847, 1389554, 1391832, 1392382, 1392024, 1392572, 1393880, 1394132, 1393202, 1393399, 1396229, 1400646, 1405478, 1411349, 1418813, 1426664, 1433932, 1441871, 1451983, 1463412, 1474356, 1484988, 1496882, 1510364, 1524592, 1539819, 1557402, 1577604, 1599165, 1621131, 1643623, 1666822, 1690786, 1716526, 1745934, 1780259, 1819424, 1862782, 1909586, 1958922, 2010406, 2065064, 2124567, 2189580, 2259684, 2334750, 2415438, 2502494, 2596580, 2698611, 2809087, 2927033, 3050722, 3179577, 3314392, 3455552, 3602039, 3752306, 3905025, 4058478, 4210030, 4356720, 4495946, 4625399, 4742983, 4847278, 4937793, 5014420, 5076698, 5123720, 5154813, 5170543, 5172991, 5164561, 5146510, 5119441, 5085499, 5049034, 5014344, 4983573, 4957664, 4938420, 4928337, 4928856, 4940042, 4961972, 4995500, 5041876]
60141E041876O0508P5656R0557J03355J13456J22080J30448J38214J44020J46492
60131F166662J44496J37707J27340J14996J00539Q2615O1602M0114J9873j12k1099
60120F974733m2145o1298p7718r1141j00530j04858j04508j00708r4282q5660
60110F111885p5165o2443m6774k8761j0570O373K2700L9230N5310O9971Q3297
60099F165053R5304J04702J10020J10907J07420R9473Q8086P5527O2917M9356
60089G068765L4824K1916J2764O195M59k882p17P005J7576K9827M5081O3884Q4815
60076G389512J06988J31104J57186J83703K10006K37610K67871K99882L31977
60067I315839L63887L96037M27587M56525M81366N01576N16406N24261N23493
$$ y = [5041876, 5102384, 5178040, 5268597, 5371952, 5485408, 5607488, 5737936, 5876150, 6020170, 6166662, 6311158, 6448865, 6576205, 6691201, 6791740, 6874355, 6935957, 6976071, 6995944, 6995832, 6974733, 6932588, 6871290, 6793572, 6702431, 6601901, 6497043, 6392535, 6291827, 6197545, 6111885, 6036720, 5974277, 5927503, 5898742, 5888172, 5894545, 5917245, 5956475, 6011785, 6081756, 6165053, 6260357, 6365059, 6475079, 6585986, 6693406, 6792879, 6880965, 6956492, 7019409, 7068765, 7103589, 7125505, 7138269, 7144464, 7144923, 7142041, 7141324, 7148329, 7165905, 7195732, 7240813, 7304697, 7389512, 7496500, 7627604, 7784790, 7968493, 8178499, 8416109, 8683980, 8983862, 9315839, 9679726, 10075763, 10503350, 10959875, 11441241, 11942817, 12459223, 12983484, 13506977]
60058A3506977N13485M94550M66891M30172L84397L30807K71213K06568J36999
60049A6742059O3209j3139r0374j66731k38988l02801l55382l96637m26837m44702
60039A4369677m49206m42005m26282m03903l75244l41077l02954k62137k19701
60030A1147168j77360j36678r7831o0580k6195L162K6694M5048N8246O5156O5160
60019A0911990N8848M6816K9307P603j5431l7095n6524p4241r0702j05769j19282
60008A0555520j31719j44106j56838j68580j77216j82428j86343j90674j94175
59999I023441j94269j90450j84357j76867j67008j54083j39083j23185j06146
59990G587993q7194o6644m5558k4200j855K1568M4643O5688Q4697J03087J21314
$$ y = [13506977, 14020462, 14515012, 14981903, 15412075, 15796472, 16127279, 16398492, 16605060, 16742059, 16805268, 16792129, 16701755, 16535024, 16296036, 15993235, 15637853, 15241216, 14814379, 14369677, 13920471, 13478466, 13052184, 12648281, 12273037, 11931960, 11629006, 11366869, 11147168, 10969808, 10833130, 10735299, 10674719, 10648524, 10651686, 10678380, 10723428, 10781674, 10846830, 10911990, 10970838, 11017654, 11046961, 11054564, 11039133, 11002038, 10945514, 10871273, 10780571, 10674802, 10555520, 10423801, 10279695, 10122857, 9954277, 9777061, 9594633, 9408290, 9217616, 9023441, 8829172, 8638722, 8454365, 8277498, 8110490, 7956407, 7817324, 7694139, 7587993, 7500799, 7434155, 7388597, 7364397, 7362542, 7384110, 7428753, 7494441, 7579138, 7682225, 7803539]
59979G803539J37492J49179J55832J58317J56466J48901J35489J18174R8570P6154
59969I138113M9903K0527r981m0058o8855r5628j19772j40864j58041j70259j77596
59958H227489j81004j80232j73656j61196j45559j29276j12044r2618p1747n1160
59948F928997l0910r831J2266L4723N7532Q0613J02514J21912J39854J58342J77128
59937G773140J93861K06943K16156K20822K19565K11903J98234J78477J52656
59928I571757J22663R1355N9825K7405n752l8029o8261r6216j21001j41037j55947
59917I246762j66553j72553j72120j64458j51105j34150j14619r3118p0589m7665
59907G959832k4410j136K1494M3283O4454Q4723J03536J20980J37201J51143J61403
$$ y = [7803539, 7941031, 8090210, 8246042, 8404359, 8560825, 8709726, 8845215, 8963389, 9061959, 9138113, 9188016, 9208543, 9198562, 9158504, 9089649, 8994021, 8874249, 8733385, 8575344, 8405085, 8227489, 8046485, 7866253, 7692597, 7531401, 7385842, 7256566, 7144522, 7051904, 6980157, 6928997, 6898087, 6888256, 6900522, 6935245, 6992777, 7073390, 7175904, 7297816, 7437670, 7596012, 7773140, 7967001, 8173944, 8390100, 8610922, 8830487, 9042390, 9240624, 9419101, 9571757, 9694420, 9785775, 9845600, 9873005, 9867253, 9829224, 9760963, 9664747, 9543746, 9402709, 9246762, 9080209, 8907656, 8735536, 8571078, 8419973, 8285823, 8171204, 8078086, 8007497, 7959832, 7935422, 7934286, 7955780, 7999063, 8063517, 8148240, 8251776, 8372756, 8509957, 8661100, 8822503]
59896H822503J68062J72087J73170J70124J63362J54947J45963J35914J25090
59887A0231222J15417J08207J02955R9236R8136J00897J07643J18386J33931J54818
59877A1370848J80473K10118K43413K79433L16042L51156L83909M14039M40645
59868A4190076M61641M73595M72174M53842M17481L63843K93952K09443J13975
59859A7450022J2703q9718j89202k80686l58679m19804m63595m90867n02989n02564
59849A4164621m92594m74424m48080m14768l77174l37116k94878k51192k07809
59840A0866586j65620j24179q3540m4641p561K8520O3129R4455J21743J45257
59830A0894149J63412J72897J72546J64195J48345J22063Q3177L4028k0994p9167
$$ y = [8822503, 8990565, 9162652, 9335822, 9505946, 9669308, 9824255, 9970218, 10106132, 10231222, 10346639, 10454846, 10557801, 10657037, 10755173, 10856070, 10963713, 11082099, 11216030, 11370848, 11551321, 11761439, 12004852, 12284285, 12600327, 12951483, 13335392, 13749431, 14190076, 14651717, 15125312, 15597486, 16051328, 16468809, 16832652, 17126604, 17336047, 17450022, 17462725, 17373007, 17183805, 16903119, 16544440, 16124636, 15661041, 15170174, 14667185, 14164621, 13672027, 13197603, 12749523, 12334755, 11957581, 11620465, 11325587, 11074395, 10866586, 10700966, 10576787, 10493247, 10448606, 10441045, 10469565, 10532694, 10627149, 10748892, 10894149, 11057561, 11230458, 11403004, 11567199, 11715544, 11837607, 11920784, 11954812, 11933818, 11854651]
59820A1854651j38394j94878k44922k87804l24267l53309l72845l82609l84220
59811I171403l79248l69120l55902l40950l23623l03336k81858k61371k41232
59802F314763k19308j96007j74282j55501j37917j19689j01388q4818p0917n9573
59792D995363n0196m1855l3861k6678k1551j9015j8346j8492j8747j8692j8346
59781D709584j8305j8923j9475j9119j8567j9816k3989l0197l6705m2524m7600
59770D414364n1974n5198n6525n5610n2958m9484m5603m1023l5300k8204j9662
59759C922823j0092p94O814J2491J7006K0775K3780K6873L1640L8471M5930N2766
59747D188483N9209O5609P1037P4323P5512P5305P4061P2213P0647O9435O7011
$$ y = [11854651, 11716257, 11521379, 11276457, 10988653, 10664386, 10311077, 9938232, 9555623, 9171403, 8792155, 8423035, 8067133, 7726183, 7402560, 7099224, 6817366, 6555995, 6314763, 6095455, 5899448, 5725166, 5569665, 5431748, 5312059, 5210671, 5125853, 5054936, 4995363, 4945167, 4903312, 4869451, 4842773, 4821222, 4802207, 4783861, 4765369, 4746622, 4727930, 4709584, 4691279, 4672356, 4652881, 4633762, 4615195, 4595379, 4571390, 4541193, 4504488, 4461964, 4414364, 4362390, 4307192, 4250667, 4195057, 4142099, 4092615, 4047012, 4005989, 3970689, 3942485, 3922823, 3912731, 3911937, 3918751, 3931242, 3948248, 3969023, 3992803, 4019676, 4051316, 4089787, 4135717, 4188483, 4247692, 4313301, 4384338, 4458661, 4534173, 4609478, 4683539, 4755752, 4826399, 4895834, 4962845]
59736D962845O1952N5050M8504M3433L9343L5572L2308L0179K9807L1672L5884
59725E406549M2086M9861N9008O9362Q0854R3868J08856J25584J43511J62888
59715F342427J84380K07593K31429K56207K83797L15007L48117L80649M11002
59706H960608M37255M55600M60964M48082M11643L47804K57974J50628L8073o8301
59696A1900330j59682k29728k75684k99453l05638k98340k80402k54627k24017
59687I572759j90844j56363j21247q5711n0044j5618J5548M3099O9298R6784J26113
59676I303774J56061J85173K12344K37440K62432K90442L22429L56174L89645
59667A1715914M23699M60028M98417N38028N79643O24215O70554P17102P64793
$$ y = [4962845, 5024797, 5079847, 5128351, 5171784, 5211127, 5246699, 5279007, 5309186, 5338993, 5370665, 5406549, 5448635, 5498496, 5557504, 5626866, 5707720, 5801588, 5910444, 6036028, 6179539, 6342427, 6526807, 6734400, 6965829, 7222036, 7505833, 7820840, 8168957, 8549606, 8960608, 9397863, 9853463, 10314427, 10762509, 11174152, 11521956, 11779930, 11930558, 11968631, 11900330, 11740648, 11510920, 11235236, 10935783, 10630145, 10331805, 10051403, 9796776, 9572759, 9381915, 9225552, 9104305, 9018594, 8968550, 8952932, 8968480, 9011579, 9080877, 9177661, 9303774, 9459835, 9645008, 9857352, 10094792, 10357224, 10647666, 10970095, 11326269, 11715914, 12139613, 12599641, 13098058, 13636086, 14215729, 14839944, 15510498, 16227600, 16992393]
59658A6992393Q15213Q66572R14419R56183R91967J020716J038754J043200J034667
59649B5674084J015438R87101R51483R12590Q75913Q45839Q24100Q09988Q01291
59640C3697827P95202P88714P78376P60241P30561O86239O24681N44457M47139
59631C9853437L37744K22342J05989o257j07783j92107k55943k99290l22894l26867
59621C9008371l11499k77909k27871j63879q8932n277Q6309J85101K89120L96129
59611C8889663N04827O13511P18486Q15332R00717R71039J019918J039198J022080
59602D6494771R63624Q59149P05263N03473K61476q991k94049n77931q44173j078369
59592D6984243j270049j413256j507306j556709j568157j547182j498648j429448
$$ y = [16992393, 17807606, 18674178, 19588597, 20544780, 21536747, 22557463, 23596217, 24639417, 25674084, 26689522, 27676623, 28628106, 29540696, 30416609, 31262448, 32086548, 32896536, 33697827, 34493029, 35281743, 36060119, 36820360, 37550921, 38237160, 38861841, 39406298, 39853437, 40191181, 40413523, 40519512, 40513255, 40405472, 40213365, 39957422, 39658132, 39335238, 39008371, 38696872, 38418963, 38191092, 38027213, 37938281, 37933004, 38019313, 38204414, 38493534, 38889663, 39394490, 40008001, 40726487, 41541819, 42442536, 43413575, 44433493, 45472691, 46494771, 47458395, 48317544, 49022807, 49526280, 49787756, 49778765, 49484716, 48906785, 48062612, 46984243, 45714194, 44300938, 42793632, 41236923, 39668766, 38121584, 36622936, 35193488]
59584C5193488j347906j260284j170305j082744j005453r46942r13208r06605
59576B6560041r25002r60611j001492j036241j057482j061583j047345j016044
59568A8454241r71214r16997q56987p94656p33309o74743o18983n65962n16480
59559A1804910m70957m28464l87912l49622l15014k85073k59397k36390k14601
59550H857480j94313j77340j64471j53973j43939j35310j30640j30231j31650
59541G495613j33058j34761j37043j38828j39418j39607j39919j39210j36137
59532F257632j30654j23175j13734j02942r2466q3384p5082o6607n7894m8750
59522E362944l8194k6246j5172p165j456M770J2910K1873L0066L7048M3016M7960
$$ y = [35193488, 33845582, 32585298, 31414993, 30332249, 29326796, 28379854, 27466646, 26560041, 25635039, 24674428, 23672936, 22636695, 21579213, 20517630, 19470285, 18454241, 17483027, 16566030, 15709043, 14914387, 14181078, 13506335, 12887352, 12321390, 11804910, 11333953, 10905489, 10517577, 10167955, 9852941, 9567868, 9308471, 9072081, 8857480, 8663167, 8485827, 8321356, 8167383, 8023444, 7888134, 7757494, 7627263, 7495613, 7362555, 7227794, 7090751, 6951923, 6812505, 6672898, 6532979, 6393769, 6257632, 6126978, 6003803, 5890069, 5787127, 5694661, 5611277, 5536195, 5469588, 5411694, 5362944, 5324750, 5298504, 5283332, 5276167, 5274711, 5279481, 5292391, 5314264, 5344330, 5381378, 5424394, 5472354]
59510E472354N1920N5444N9192O3199O6866O9700P2087P5172P9895Q6230R3531
59499F245590J01331J09667J18956J29925J43162J58156J73375J87986K02967
59490G571115K19590K37378K54760K71409K88434L06252L23611L38996L51915
59481A0163460L62400L70120L74273L73663L66953L53722L35303L13700K89756
59472A3303350K63388K35302K06978J78654J48821J16466Q2982N1417K4536L835
59462A4615729j0354j8363k0334j5782m368J3167L5487O1617R0384J19243J44731
59451A5011157J63979J74788J74785J61944J35925R7606M7608j3226q2024j54413
59441A5718129k27010k97863l64283m22169m68083n00617n19366n24353n17159
$$ y = [5472354, 5524274, 5579718, 5638910, 5702109, 5768975, 5838675, 5910762, 5985934, 6065829, 6152059, 6245590, 6346921, 6456588, 6575544, 6705469, 6848631, 7006787, 7180162, 7368148, 7571115, 7790705, 8028083, 8282843, 8554252, 8842686, 9148938, 9472549, 9811545, 10163460, 10525860, 10895980, 11270253, 11643916, 12010869, 12364591, 12699894, 13013594, 13303350, 13566738, 13802040, 14009018, 14187672, 14336493, 14452959, 14535941, 14587358, 14611894, 14615729, 14605375, 14587012, 14566678, 14550896, 14546528, 14559695, 14595182, 14656799, 14747183, 14866426, 15011157, 15175136, 15349924, 15524709, 15686653, 15822578, 15920184, 15967792, 15954566, 15872542, 15718129, 15491119, 15193256, 14828973, 14406804, 13938721, 13438104, 12918738, 12394385, 11877226]
59432A1877226n00946m78261m49931m16864l81512l46394l12185k78352k44870
59423H467911k12346j81100j51147j22731r6097p0872m6149k1135M323K9596N3760
59412G654013P6684R9444J23114J47424J71231J93851K15098K34478K51428K65830
59402I432595K77107K83186K81689K71822K53777K26904J90348J45201R4144L8922
59392A1495695j9894q0579j39734j94606k44145k87230l21681l45938l60513l67097
59382I134278l67291l62515l53891l41829l26609l09354k91336k72726k53385
59373F255342k34421k17025k00350j82766j64966j49238j35630j21720j06634
59364D742592r2416q0535o9830n9139m9271m0794l2263k2488j2657m473K307Q958
$$ y = [11877226, 11376280, 10898019, 10448088, 10031224, 9649712, 9303318, 8991133, 8712781, 8467911, 8255565, 8074465, 7923318, 7800587, 7704490, 7633618, 7587469, 7566334, 7570657, 7600253, 7654013, 7730697, 7830141, 7953255, 8100679, 8271910, 8465761, 8680859, 8915337, 9166765, 9432595, 9709702, 9992888, 10274577, 10546399, 10800176, 11027080, 11217428, 11362629, 11456773, 11495695, 11475801, 11395222, 11255488, 11060882, 10816737, 10529507, 10207826, 9861888, 9501375, 9134278, 8766987, 8404472, 8050581, 7708752, 7382143, 7072789, 6781453, 6508727, 6255342, 6020921, 5803896, 5603546, 5420780, 5255814, 5106576, 4970946, 4849226, 4742592, 4650176, 4569641, 4499811, 4440672, 4391401, 4350607, 4318344, 4295856, 4283199, 4278726, 4281033, 4289991]
59352D289991J5881K2837K9728L6215M2086M8578N7064O5626O9582O7049O1539
59341D806176N7482N5752N5642N8403O5700P6465Q8579J02201J18130J33702J43995
59330E762227J47408J47639J49837J56799J68857J85150K04303K25412K48970
59321G396602K75918L05801L36938L68390M00762M35139M72137N11867N53753
59312A1057307N96284O37491O75588P08849P35341P53183P60624P55696P36960
59303A7417323P05166O63380O14754N61096N04023M46264L90769L39198K91768
59294B1933741K47576K04487J59866J12188O1144O089n4063j18924j86468k55219
59284B2110417l24732l93089m56256n11424n58992n99820o32628o56047o71318
$$ y = [4289991, 4305872, 4328709, 4358437, 4394652, 4436738, 4485316, 4542380, 4608006, 4677588, 4744637, 4806176, 4863658, 4919410, 4975052, 5033455, 5099155, 5175620, 5264199, 5366400, 5484530, 5618232, 5762227, 5909635, 6057274, 6207111, 6363910, 6532767, 6717917, 6922220, 7147632, 7396602, 7672520, 7978321, 8315259, 8683649, 9084411, 9519550, 9991687, 10503554, 11057307, 11653591, 12291082, 12966670, 13675519, 14410860, 15164043, 15924667, 16680363, 17417323, 18122489, 18785869, 19400623, 19961719, 20465742, 20912006, 21302775, 21641973, 21933741, 22181317, 22385804, 22545670, 22657858, 22719002, 22725091, 22671028, 22552104, 22365636, 22110417, 21785685, 21392596, 20936340, 20424916, 19865924, 19266104, 18633476, 17977429, 17306111]
59275A7306111o80603o83994o80447o70485o55509o35414o09201n77663n43345
59266A1569450n08084m72200m35849l99555l63620l28295k94348k62553k32979
59257H271967k05500j80244j56899j34648j13484r4216p6491n8552m0021k2893
59247G189019q370N229J9552L3274M4397N3742O3591P4142Q3723R1406R7026R9822
59235G846553R9523R7788R6004R2685Q5635P5828O6301N7938M9169L9517L0538
59224H637479K3379J7995J4821J4758J7436K1807K8479L9090N3183O7885Q0959
59213I017271R2487J03466J14559J25806J35762J41393J40907J35941J28456J16284
59203A0252332R5019O4270K8884o345l9839p0556r5691j13002j22994j27209j26278
$$ y = [17306111, 16625508, 15941514, 15261067, 14590582, 13935073, 13299659, 12690458, 12112795, 11569450, 11061366, 10589166, 10153317, 9753762, 9390142, 9061847, 8767499, 8504946, 8271967, 8066467, 7886223, 7729324, 7594676, 7481192, 7386976, 7310485, 7251933, 7211912, 7189019, 7180649, 7185878, 7205430, 7238704, 7283101, 7336843, 7400434, 7474576, 7558299, 7649705, 7746731, 7846553, 7946076, 8043864, 8139868, 8232553, 8318188, 8394016, 8460317, 8518255, 8567424, 8606941, 8637479, 8660858, 8678853, 8693674, 8708432, 8725868, 8747675, 8776154, 8815244, 8868427, 8936312, 9017271, 9109758, 9213224, 9327783, 9453589, 9589351, 9730744, 9871651, 10007592, 10136048, 10252332, 10347351, 10411621, 10440505, 10434160, 10394321, 10323765, 10228074, 10115072, 9992078, 9864869, 9738591]
59192I738591j21017j13403j04767r4478q1839o8035n4905m3047l2283k3002j5828
59181H985987j0812p805o910p864r908j2785j6743k0979k3170k1554j6660j0171
59169H820626k582P413K1654M0975O4432Q9925J16156J43903J74586K07861K41758
59158I926707K75070L08131L40796L70919L95370M11549M17293M10317L88704
59149A3244856L51638K99422K33194J54915O7118k7477j25578k22525l12642l91008
59139A3271913m54866n03387n36523n54429n58004n49665n32853n10233m82789
59130H589164m51471m18969l88249l59517l30667l01002k72432k46473k22445
59121E597939j99764j79556j62377j46628j31150j17169j05358r3348p9047o4646
$$ y = [9738591, 9617574, 9504171, 9399404, 9304926, 9223087, 9155052, 9100147, 9057100, 9024817, 9001815, 8985987, 8975175, 8967370, 8960460, 8952596, 8942688, 8929903, 8913160, 8892181, 8869011, 8847457, 8830797, 8820626, 8818044, 8825457, 8847111, 8888086, 8952518, 9042443, 9158599, 9302502, 9477088, 9684949, 9926707, 10201777, 10509908, 10850704, 11221623, 11616993, 12028542, 12445835, 12856152, 13244856, 13596494, 13895916, 14129110, 14284025, 14351143, 14323666, 14198088, 13975563, 13662921, 13271913, 12817047, 12313660, 11777137, 11222708, 10664704, 10115039, 9582186, 9071953, 8589164, 8137693, 7718724, 7330475, 6970958, 6640291, 6339289, 6066857, 5820384, 5597939, 5398175, 5218619, 5056242, 4909614, 4778464, 4661295, 4555937, 4462589, 4383542, 4318896]
59111D318896n3925m6811m0012l2142k4628j7978j0840l046L686Q778J3745J9536
59099D135259K5457L1263L7833M5013N1210N5986O1012O7490P4520Q0804Q6399
59088D752246R1873R7264J02445J07428J11975J15953J19872J23901J26674J26628
59078E876259J23993J19831J13896J05562R6146Q7568P8969O7457N2408L6498
59068F758587K2381J0923K775j386k783l809m385j751N213J4122K2759L2054M3823
59055F898523N7762P2479Q7724J03916J20692J37428J54127J70644J86039J99622
59045H188956K11881K23674K35178K45833K54323K58648K57294K50165K37206
59036A0363158K16771J87165J49439J06602O0537J1952l7083q3283j24905j61786
$$ y = [4318896, 4264971, 4218160, 4178148, 4146006, 4121378, 4103400, 4092560, 4089514, 4093200, 4101978, 4115723, 4135259, 4160716, 4191979, 4229812, 4274825, 4326035, 4382021, 4443033, 4510523, 4585043, 4665847, 4752246, 4844119, 4941383, 5043828, 5151256, 5263231, 5379184, 5499056, 5622957, 5749631, 5876259, 6000252, 6120083, 6233979, 6339541, 6435687, 6523255, 6602224, 6669681, 6722089, 6758587, 6780968, 6791891, 6794666, 6793280, 6790497, 6786688, 6782303, 6780552, 6785765, 6799887, 6822646, 6854700, 6898523, 6956285, 7028764, 7116488, 7220404, 7341096, 7478524, 7632651, 7803295, 7989334, 8188956, 8400837, 8624511, 8859689, 9105522, 9359845, 9618493, 9875787, 10125952, 10363158, 10579929, 10767094, 10916533, 11023135, 11083672, 11095624, 11058541, 10975258, 10850353, 10688567]
59026A0688567j92826k16389k33486k47366k59322k67922k72982k76923k80970
59017H440381k83296k82502k80049k77544k74325k69556k64128k58622k51758
59008E998601k42829k33358k24403k14512k02558j90416j80337j71435j61342
58999D177411j50091j39846j31537j24008j16128j08124j00991r5522r1412q6917
58989C032835q0434p2809o6617o2740n9476n5624n2229n0215m8481m5826m2879
58978B395505m0540l8161l4823l0980k7420k3976k0491j7590j5304j2483q709
58967B125028n247l006j210Q36K463L407M824P208R070R152Q160O998N266L056
58953B176005K159L500N133M843L242K419K924L977N315O945Q087Q164P859P807
$$ y = [10688567, 10495741, 10279352, 10045866, 9798500, 9539178, 9271256, 8998274, 8721351, 8440381, 8157085, 7874583, 7594534, 7316990, 7042665, 6773109, 6508981, 6250359, 5998601, 5755772, 5522414, 5298011, 5083499, 4880941, 4690525, 4510188, 4338753, 4177411, 4027320, 3887474, 3755937, 3631929, 3515801, 3407677, 3306686, 3211164, 3119752, 3032835, 2952401, 2879592, 2812975, 2750235, 2690759, 2635135, 2582906, 2532691, 2484210, 2438384, 2395505, 2354965, 2316804, 2281981, 2251001, 2223581, 2199605, 2179114, 2161524, 2146220, 2133737, 2125028, 2119781, 2116775, 2115565, 2116401, 2118864, 2122271, 2127095, 2134303, 2143373, 2152525, 2160685, 2167683, 2172949, 2176005, 2178164, 2181664, 2186797, 2191640, 2194882, 2197301, 2200225, 2204202, 2209517, 2216462, 2224549, 2232713, 2240572, 2248379]
58939B248379P358N875M123L077K513J857J133K25j180k175j086J675L525L595
58925B278894M214P037J0406J2459J4250J7298K0368K1536K1675K3109K6028K8788
58913B486062L0550L1521L1713L1434L1832L3233L4401L4932L6494L9887M3067
58902B865126M4261M4857M6744M9057N0194N0999N2880N4833N5510N6422N9601
58891C430484O3735O6384O8665P3722Q1388Q8404R3579R8927J05651J12744J19905
58880D403588J28315J37886J46749J54353J62522J72625J83977J95637K07679
58871E893331K20236K33272K47682K64699K83778L02838L21014L39654L60428
58862H466932L83996M10490M39715M70766N02907N36686N72912O10911O49372
$$ y = [2248379, 2255737, 2261612, 2265735, 2268812, 2271325, 2273182, 2274315, 2274540, 2273360, 2271185, 2270099, 2271774, 2275299, 2278894, 2283108, 2290145, 2300551, 2313010, 2327260, 2344558, 2364926, 2386462, 2408137, 2431246, 2457274, 2486062, 2516612, 2548133, 2579846, 2611280, 2643112, 2676345, 2710746, 2745678, 2782172, 2822059, 2865126, 2909387, 2954244, 3000988, 3050045, 3100239, 3151238, 3204118, 3258951, 3314461, 3370883, 3430484, 3494219, 3560603, 3629268, 3702990, 3784378, 3872782, 3966361, 4065288, 4170939, 4283683, 4403588, 4531903, 4669789, 4816538, 4970891, 5133413, 5306038, 5490015, 5685652, 5893331, 6113567, 6346839, 6594521, 6859220, 7142998, 7445836, 7766850, 8106504, 8466932, 8850928, 9261418, 9701133, 10171899, 10674806, 11211492, 11784404, 12395315, 13044687]
58853A3044687O88396P28841P69862Q08876Q43798Q73535Q96279R08847R07850
58844B0470971Q90366Q53733P95843P15527O12183M86266L41360J84355K2142
58835B5372746j40603k98960m45286n72055o76281p58862q20700q62186q85368
58826A9912445q93299q87428q68324q38803q03569p65498p24711o81431o37396
58817A2811986n94159n52206n12175m75141m41429m10728l83240l59101l36889
58808H746918l14657k92303k71205k51734k33084k15387j99749j86041j72441
58799F610317j57742j42719j28982j17472j07900r8716q8127p6089o4614n5114
58789E572842m6586l7667k8833k0760j2106j381J0177K0115K8509L7725M9002
$$ y = [13044687, 13733083, 14461924, 15231786, 16040662, 16884460, 17757995, 18654274, 19563121, 20470971, 21361337, 22215070, 23010913, 23726440, 24338623, 24824889, 25166249, 25350604, 25372746, 25232143, 24933183, 24487897, 23915842, 23239561, 22480699, 21659999, 20797813, 19912445, 19019146, 18131718, 17263394, 16424591, 15621022, 14855524, 14130813, 13449382, 12811986, 12217827, 11665621, 11153446, 10678305, 10236876, 9826148, 9442908, 9083807, 8746918, 8432261, 8139958, 7868753, 7617019, 7383935, 7168548, 6968799, 6782758, 6610317, 6452575, 6309856, 6180874, 6063402, 5955502, 5856786, 5768659, 5692570, 5627956, 5572842, 5526256, 5488589, 5459756, 5438996, 5426890, 5425509, 5435686, 5455801, 5484310, 5522035, 5571037]
58778E571037O1500P4113Q6222R7218J07388J18489J31536J45000J57322J69923
58768F719748J85061K01911K17629K31569K45649K61195K78197K97021L18056
58759H956036L40255L62718L87045M15279M46375M77801N09789N44641N82404
58750A3022343O20874O59457O99234P39037P75179Q05510Q30269Q48226Q55155
58741A9855284Q46801Q20575P73808P03553O09153M92767L57067K05124M2838
58732B4706970j21443k80470m29171n62461o75189p64979q32601q79119r05129
58723A9256408r12921r06599q89547q63841q31717p95063p53955p08776o63253
58714A1930736o21832n84389n47392n10164m75817m45721m17641l90340l65575
$$ y = [5571037, 5632537, 5706650, 5792872, 5890090, 5997478, 6115967, 6247503, 6392503, 6549825, 6719748, 6904809, 7106720, 7324349, 7555918, 7801567, 8062762, 8340959, 8637980, 8956036, 9296291, 9659009, 10046054, 10461333, 10907708, 11385509, 11895298, 12439939, 13022343, 13643217, 14302674, 15001908, 15740945, 16516124, 17321634, 18151903, 19000129, 19855284, 20702085, 21522660, 22296468, 23000021, 23609174, 24101941, 24459008, 24664132, 24706970, 24585527, 24305057, 23875886, 23313425, 22638236, 21873257, 21040656, 20161537, 19256408, 18343487, 17436888, 16547341, 15683500, 14851783, 14056720, 13302765, 12593989, 11930736, 11308904, 10724515, 10177123, 9666959, 9191142, 8745421, 8327780, 7937440, 7571865]
58705G571865l44016l23208l01498k80501k61948k45185k29356k14894k01453
58696E169806j87508j73454j61730j52508j42823j31507j21265j13702j06210
58687C879099r6473q6683q0027p5690p0562o3983n7800n3241n0157m8202m6723
58676C149558m4666m2131m0563m0277l9567l7433l5140l3745l2367l0365k8970
58665B744334k9005k9172k8376k7779k8776l0834l2931l5341l8361m1108m3113
58654B379538m5192m7331m7710m5455m2415m0624l9842l9095l8592l8443l7337
58643A917502l4397l0816k8099k6221k4801k4344k4864k4984k3899k2668k2376
58632A630033k2625k2841k3223k3454k2506k0658j9599j9536j8595j6239j4523
$$ y = [7571865, 7227849, 6904641, 6603143, 6322642, 6060694, 5815509, 5586153, 5371259, 5169806, 4982298, 4808844, 4647114, 4494606, 4351783, 4220276, 4099011, 3985309, 3879099, 3782626, 3695943, 3615916, 3540226, 3469664, 3405681, 3347881, 3294640, 3244483, 3196281, 3149558, 3104892, 3062761, 3022198, 2981921, 2942354, 2904921, 2869781, 2836036, 2803669, 2773304, 2744334, 2715329, 2686157, 2657781, 2630002, 2601226, 2570392, 2537461, 2502120, 2463759, 2422651, 2379538, 2334346, 2287015, 2239305, 2193850, 2151435, 2110811, 2070969, 2031874, 1993282, 1954839, 1917502, 1883105, 1852289, 1824190, 1797969, 1773168, 1748824, 1723960, 1698976, 1675077, 1652409, 1630033, 1607408, 1584567, 1561344, 1537890, 1515384, 1494726, 1475127, 1455591, 1436996, 1420757, 1406234]
58621A406234j4526j4231j1706p939m642j659J480L745M464M959O333P576P620
58608A387708P236P021N776K961O07M99J379J196K70j53o19k169l793l736k377
58593A401806j480j359q49N03K014L253M582O648J0009J4423J8343K0332K1129
58580A499354K2676K5119K7015K8517L1425L5587L8549L9835M2247M7329N2718
58569A890371N6003N8211O1374O5432O9852P5678Q3483R1558R8644J06347J16520
58558B773473J28106J38849J48383J57720J67498J78487J91810K06935K21411
58549D312672K34028K45922K57041K64321K65139K59560K47117K24711J90597
58540F501108J47702J00074M8670o239o0854j09714j50363j83374k09206k27641
$$ y = [1406234, 1391708, 1377477, 1365771, 1357832, 1353190, 1351531, 1353011, 1356756, 1361220, 1366179, 1372512, 1380088, 1387708, 1394944, 1401965, 1407741, 1410702, 1411309, 1411808, 1413187, 1414383, 1414653, 1414500, 1413881, 1411712, 1407919, 1404183, 1401806, 1400326, 1398967, 1398118, 1398621, 1400635, 1403888, 1408470, 1415118, 1425127, 1439550, 1457893, 1478225, 1499354, 1522030, 1547149, 1574164, 1602681, 1634106, 1669693, 1708242, 1748077, 1790324, 1837653, 1890371, 1946374, 2004585, 2065959, 2131391, 2201243, 2276921, 2360404, 2451962, 2550606, 2656953, 2773473, 2901579, 3040428, 3188811, 3346531, 3514029, 3692516, 3884326, 4091261, 4312672, 4546700, 4792622, 5049663, 5313984, 5579123, 5838683, 6085800, 6310511, 6501108, 6648810, 6748884, 6797554, 6791315, 6730461, 6620747, 6470384, 6287010, 6077804, 5850163]
58530E850163k38949k43327k40629k32428k22360k12415k01026j86721j71277
58521C901031j56985j43515j30026j17777j07818r8549q8499p9146p2137o6149
58511B840430n9594n4017n1388n0234m7926m4868m2943m1695l9627l7626l7391
58500B333121l7766l6180l2829l0220k9356k9315k9690l0864l2558l4290l6281
58489A973772l8160l8363l6596l4914l4413l3274l0285k7554k6997k6718k4115
58478A622383k0302j8166j8028j8191j7910j7019j4710j1530j0260j1935j3509
58467A450823j2413j0635j0918j1858j0686q260p148p125o693o945r580j2926
58455A335636j4183j3960j4633j5845j5731j4881j5058j5497j4371j2417j1324
$$ y = [5850163, 5611214, 5367887, 5127258, 4894830, 4672470, 4460055, 4259029, 4072308, 3901031, 3744046, 3600531, 3470505, 3352728, 3244910, 3146361, 3057862, 2978716, 2906579, 2840430, 2780836, 2726819, 2675431, 2625197, 2577271, 2532403, 2489460, 2447765, 2408138, 2370512, 2333121, 2295355, 2259175, 2226346, 2196126, 2166770, 2137455, 2107765, 2076901, 2044343, 2010053, 1973772, 1935612, 1897249, 1860653, 1825739, 1791326, 1758052, 1727767, 1700213, 1673216, 1646498, 1622383, 1602081, 1583915, 1565887, 1547696, 1529786, 1512767, 1498057, 1486527, 1476267, 1464332, 1450823, 1438410, 1427775, 1416857, 1404999, 1394313, 1386053, 1378905, 1371780, 1365087, 1358142, 1348562, 1335636, 1321453, 1307493, 1292860, 1277015, 1261284, 1246403, 1231345, 1215848, 1201477, 1189060, 1177736]
58444A177736j0217p590m952m629n584n204l616k516j617rJ003J73p30j1L93j465
58428A131165l234k021L56P60M30K046L795K240j231k764k790m198n779m066m03
58413A114306N60j404k229q90k36q37k61J492J836R13J357K740K031m35j148K73
58397A118068P01l09J89K640L943K994J926J230r54m129n224l837k784k908k356
58382A109190j258j951m065m523l031k509l539l467j600k63r9P33K110J686l84
58367A087030j322p79j174k658k679r51J10J55J182K890K844J469J689L510M225
58352A095541L976N500Q341R165Q143Q939J1853J3073J1704J1446J4099J7063
58340A218843J8505J9481J9829J7486J3173J0490J0175R233O508M053K468J54
$$ y = [1177736, 1167519, 1159929, 1154977, 1150348, 1144764, 1139560, 1135944, 1133428, 1131811, 1131802, 1132805, 1132978, 1132248, 1132237, 1132630, 1131165, 1127931, 1125910, 1126266, 1127026, 1127456, 1129502, 1133297, 1135537, 1134306, 1131542, 1128752, 1124554, 1118775, 1114709, 1114306, 1114866, 1113462, 1111233, 1110343, 1110107, 1109270, 1109009, 1110501, 1112337, 1113250, 1114607, 1117347, 1119378, 1118943, 1117795, 1118068, 1118769, 1118460, 1118649, 1121289, 1125232, 1128226, 1130152, 1131382, 1130428, 1126299, 1121075, 1117238, 1114454, 1111546, 1109190, 1107932, 1105981, 1101916, 1097393, 1094362, 1091853, 1088314, 1084847, 1083247, 1082984, 1082885, 1083618, 1085728, 1087414, 1087030, 1085708, 1084929, 1083755, 1081097, 1078418, 1077467, 1077577, 1077732, 1078914, 1081804, 1084648, 1086117, 1087806, 1091316, 1095541, 1099517, 1105017, 1113358, 1122523, 1130666, 1139605, 1151458, 1164531, 1176235, 1187681, 1201780, 1218843, 1237348, 1256829, 1276658, 1294144, 1307317, 1317807, 1327982, 1337215, 1343723, 1347776, 1350244, 1350398]
58328A350398k260k234m55l95k471l958m490n945p259n626k495j811k703j013
58314A307283K284J971j909l457p21K006K667M270P494Q613O849O353Q728J0740
58300A363171J1244J3134J6584J7762J6164J5877J7696J7588J4739J3480J5158
58289A532597J5757J3690J2304J2586J1167P604N865O620O005L810M515Q307R835
58276A650662P943P591R932R955O692O028J0104J3396J2896J2809J5546J7331
58264A780885J6543J7211K0488K1841K0257K0863K4844K6603K4476K4023K6998
58253B025032K7767K4823K4767L0036L3816L2369L1414L4655L7044L5229L3718
58242B370670L4769L3391K8428K7137L2280L6336L5226L5697M1882M6797M5468
$$ y = [1350398, 1348138, 1345904, 1345449, 1345054, 1342583, 1338625, 1334135, 1328190, 1320931, 1315305, 1312810, 1310999, 1308296, 1307283, 1309567, 1311538, 1309629, 1306172, 1305451, 1307457, 1310124, 1314394, 1321888, 1330501, 1337350, 1343703, 1352431, 1363171, 1374415, 1387549, 1404133, 1421895, 1438059, 1453936, 1471632, 1489220, 1503959, 1517439, 1532597, 1548354, 1562044, 1574348, 1586934, 1598101, 1605705, 1611570, 1618190, 1624195, 1628005, 1632520, 1640827, 1650662, 1658605, 1666196, 1676128, 1686083, 1692775, 1698803, 1708907, 1722303, 1735199, 1748008, 1763554, 1780885, 1797428, 1814639, 1835127, 1856968, 1877225, 1898088, 1922932, 1949535, 1974011, 1998034, 2025032, 2052799, 2077622, 2102389, 2132425, 2166241, 2198610, 2230024, 2264679, 2301723, 2336952, 2370670, 2405439, 2438830, 2467258, 2494395, 2526675, 2563011, 2598237, 2633934, 2675816, 2722613, 2768081]
58231B768081M4305M8674N2916N1966N1426N6388O1198O0124N7734N9126O0359
58220C372297N8102N8150O4589P0933P1689P2229P7749Q3345Q4697Q7349R5337
58209D196466J01945J02109J02578J09311J16418J18264J20677J28986J36804
58200E233558J38075J38611J44446J50714J53247J58575J71139J83489J90693
58191F662547K00727K19022K37305K49987K66185K92433L19521L40423L64672
58182I152822M00005M36602M65222M93797N29816N64310N90668O20960O64809
58173A3919011P10317P45141P78010Q19771Q62819R00040R43956J005175J072068
58164B1756308J133805J201708J285081J369844J446031J531579J641970J761984
$$ y = [2768081, 2812386, 2861060, 2913976, 2965942, 3017368, 3073756, 3134954, 3195078, 3252812, 3311938, 3372297, 3430399, 3488549, 3553138, 3624071, 3695760, 3767989, 3845738, 3929083, 4013780, 4101129, 4196466, 4298411, 4400520, 4503098, 4612409, 4728827, 4847091, 4967768, 5096754, 5233558, 5371633, 5510244, 5654690, 5805404, 5958651, 6117226, 6288365, 6471854, 6662547, 6863274, 7082296, 7319601, 7569588, 7835773, 8128206, 8447727, 8788150, 9152822, 9552827, 9989429, 10454651, 10948448, 11478264, 12042574, 12633242, 13254202, 13919011, 14629328, 15374469, 16152479, 16972250, 17835069, 18735109, 19679065, 20684240, 21756308, 22890113, 24091821, 25376902, 26746746, 28192777, 29724356, 31366326, 33128310]
58156C3128310J875440J995437K135519K280983K421631K581522K780889L001499
58148E2201230L227414L484250L797476M151294M534245M983665N536396O181825
58140H8097795O915631P785298Q823452J0001364J1319165J2867037J4712357
58133A60522099J6810011J9113411K1656027K4421688K7349937L0676815L4890717
58126C35440705L9633087M2552627M0065977L0093550J4160003l437258j8498002
58119D80010689k8977371l4884289l7132708l6788627l4853941l2115067k9034305
58112B46224381k5864861k2815664k0033441j7534565j5281912j3287532j1572630
58105A19833776j0095321q795960p661559o683258n805834m979902m214053l523718
$$ y = [33128310, 35003750, 36999187, 39134706, 41415689, 43837320, 46418842, 49199731, 52201230, 55428644, 58912894, 62710370, 66861664, 71395909, 76379574, 81915970, 88097795, 95013426, 102798724, 111622176, 121623540, 132942705, 145809742, 160522099, 177332110, 196445521, 218101548, 242523236, 269873173, 300549988, 335440705, 375073792, 417626419, 457692396, 487785946, 501945949, 498508691, 480010689, 451033318, 416149029, 379016321, 342227694, 307373753, 275258686, 246224381, 220359520, 197543856, 177510415, 159975850, 144693938, 131406406, 119833776, 109738455, 100942495, 93280936, 86597678, 80791844, 75811942, 71597889, 68074171]
58097F8074171k880848k261240j685324j164269o58695j23516M76704J215398
58089F0992381K126418K973030L216471K414436O76160j374647l089555m181546
58081F3753148m695934m790185m617483m312093l965388l609476l253223k916214
58073C1593152k612787k335055k074575j838915j632948j447328j277950j134766
58065A7238828j020864r23703q35588p62707p06885o58472o13701n79584n55599
58056A0581725n29202m95130m61610m32897m02985l70719l43846l23796l02820
58047F918720k79831k63073k53819k43291k29005k18586k14163k08263j98458
58038D810231j91219j87867j81210j69532j59947j54509j46478j33684j22576
$$ y = [68074171, 65193323, 62932083, 61246759, 60082490, 59423795, 59300279, 59776983, 60992381, 63118799, 66091829, 69308300, 71722736, 72398896, 71024249, 67934694, 63753148, 59057214, 54267029, 49649546, 45337453, 41372065, 37762589, 34509366, 31593152, 28980365, 26645310, 24570735, 22731820, 21098872, 19651544, 18373594, 17238828, 16217964, 15294261, 14458673, 13695966, 12989081, 12330609, 11716908, 11137324, 10581725, 10052523, 9557393, 9095783, 8662886, 8259901, 7889182, 7545336, 7221540, 6918720, 6638889, 6375816, 6121997, 5878706, 5649701, 5431115, 5216952, 5008689, 4810231, 4619012, 4431145, 4249935, 4080403, 3920456, 3765947, 3619469, 3485785, 3363209]
58029C363209j15767j08227r8762r2896r1385q7997q1422p7547p7273p4090o6544
58018B391299o1303o0712n8815n3043m8727m8456m7484m3307l9927l9223l7313
58007A852989l2639k8852k7174k4490k0964k0717k3201k2880j9108j7321j8942
57996A596701j9269j6987j6419j8519j8924j6835j6707j9116j9128j5692j3688
57985A405417j4608j4278j1737j1250j3355j3113r673q386j0786j1583q503o106
57973A272039o718o329k971o97j640k192o37p44m230p178p422q011j0032r525
57959A203713n182j752k198l312k617k505m152m345k069j314l665m899k811j601
57945A161291m381p747q028o992p285p913q057r720j2900j3718j0925q702r693
$$ y = [3363209, 3247442, 3139215, 3040453, 2947557, 2856172, 2768175, 2686753, 2609206, 2531933, 2457843, 2391299, 2329996, 2269284, 2210469, 2157426, 2108699, 2060243, 2012759, 1969452, 1929525, 1890302, 1852989, 1820350, 1791498, 1764324, 1739834, 1718870, 1698153, 1674952, 1652072, 1632964, 1615643, 1596701, 1577432, 1560445, 1544026, 1525507, 1506583, 1489748, 1473041, 1453925, 1434797, 1419105, 1405417, 1390809, 1376531, 1364794, 1353544, 1340189, 1327076, 1317403, 1309017, 1298231, 1286648, 1278145, 1272039, 1265321, 1258992, 1256021, 1255324, 1253684, 1251492, 1250855, 1250111, 1245881, 1238703, 1231281, 1223270, 1213238, 1203713, 1198531, 1196779, 1194581, 1191269, 1188652, 1186147, 1181995, 1177650, 1175581, 1174267, 1170602, 1165703, 1162892, 1161291, 1156910, 1149163, 1141135, 1134143, 1126858, 1118945, 1110888, 1101168, 1088268, 1074550, 1063625, 1054923, 1045230]
57932A045230j1042j0620j0967j3237j3350q679l089r59j226j286j742l227l519
57919I62287j739o81j362l80L600O146L945L03n49L33L76O22K339L038O48k219
57903I76707k638k117k900l603k731k394m118n025k849q15k633o180p207o194
57889I25303o429p918q198p156o503o103m858l510l148k628o77J467K365L059
57875H75066M637N564M346K375J306J55k263m670n805o878q924j0534j0829j1533
57861H32013j3343j3641j0816p596o803p002n699l638k501j417O61K114J744J782
57847G65858M170O773O973O150O883Q395Q598P996P792O836M387L151N374Q362
57833H57698Q162N495L870L844L473K533K044J171j346m054m823m601n594p292
$$ y = [1045230, 1034188, 1023568, 1012601, 999364, 986014, 977335, 974246, 973287, 972061, 970775, 969033, 965806, 962287, 960548, 959867, 958505, 958125, 961725, 967871, 971816, 972119, 971570, 971903, 972279, 972901, 975240, 978278, 978926, 976707, 974069, 971952, 969052, 965449, 962718, 960324, 956206, 951181, 948332, 947517, 944884, 938704, 931497, 925303, 918874, 910956, 902758, 895602, 889099, 882996, 878138, 874628, 871480, 868852, 868175, 869642, 872007, 875066, 879703, 885267, 889613, 891988, 893294, 893449, 891186, 886516, 880711, 873833, 864909, 854375, 843546, 832013, 818670, 805029, 794213, 786617, 779814, 772812, 767113, 763475, 760974, 759557, 760218, 762332, 764076, 765858, 770028, 776801, 783774, 789924, 796807, 805202, 813800, 821796, 829588, 836424, 840811, 843962, 849336, 857698, 865860, 871355, 875225, 879069, 882542, 885075, 887119, 888290, 886944, 882890, 878067, 873466, 867872, 860580]
57819H60580p850p770q607r618r143p723o615n169k956k173m119n683l601J9J037
57804G80609J23J252M845P550Q047Q088Q096O643M354L966O009Q129Q876Q789
57790H65376P853N400K495J049N47j139l798m968m017l090l894o222r321j2089
57776H34182j2411r325n466m465o242p655p241o379o163o287o755p812q405p359
57762G32217n782n672o721p209p389q933j1454j2694j1931j0473r105p709o868
57749F20277p077o969n097k843k585l746l729k186r80m79O35K144K379J666K215
57734E93625M399O162O580P092Q750J0736J1921J1708R519N615K112R28J320J594
57720F82061J993L261L821J964m35k30J732J693j162m004n295o180o983o527n395
$$ y = [860580, 852730, 844960, 836353, 826735, 817592, 809869, 803254, 798085, 795129, 792956, 788837, 783154, 779553, 779572, 780609, 780732, 781984, 786829, 794379, 802426, 810514, 818610, 825253, 829607, 833573, 839582, 847711, 856587, 865376, 873229, 878629, 881124, 882173, 882720, 881581, 877783, 872815, 868798, 865708, 861814, 855592, 846271, 834182, 821771, 812446, 806980, 802515, 796273, 788618, 781377, 774998, 768835, 762548, 755793, 747981, 739576, 732217, 726435, 720763, 714042, 706833, 699444, 690511, 679057, 666363, 654432, 643959, 634854, 627145, 620277, 613200, 606231, 601134, 598291, 595706, 591960, 588231, 586045, 585065, 584586, 585221, 587365, 589744, 591410, 593625, 598024, 604186, 610766, 617858, 626608, 637344, 649265, 660973, 670492, 676107, 678219, 679147, 680467, 682061, 684054, 687315, 691136, 693100, 692665, 692435, 694167, 695860, 694698, 690694, 685399, 679219, 672236, 665709, 660314]
57705F60314n779p451p802o432n813o565o239l854j751j463j427l75M71K95O75
57690F06804K821N446P070Q050R063R780J0050J0236R772P810N617N559P272Q013
57676G13363P165O999Q283Q920Q022P581Q471Q474O255L973L879N178O420Q065
57662H11048J0552J2400J2548J2346J3180J4127J3934J3316J3536J4488J5653
57651I57128J7162J8604J8882J8348J8917K0998K2778K3488K4649K6898K8596
57640A196448K9112L0364L3370L6266L7906M0277M4904M9745N2466N4240N7413
57629A662511O1586O5073O8363P3197P9650Q6686R4374J03217J12675J22430J33621
57618B663383J46730J60022J72258J85129K00385K16223K29175K38188K44202
$$ y = [660314, 654535, 647084, 639282, 632850, 627037, 620472, 614233, 610379, 608628, 607165, 605738, 605363, 605834, 606129, 606804, 609625, 615071, 622141, 630191, 639254, 649034, 659084, 669320, 679092, 686902, 692519, 698078, 705350, 713363, 720528, 727527, 735810, 744730, 752752, 760333, 768804, 777278, 783533, 787506, 791385, 796563, 802983, 811048, 821600, 834000, 846548, 858894, 872074, 886201, 900135, 913451, 926987, 941475, 957128, 974290, 992894, 1011776, 1030124, 1049041, 1070039, 1092817, 1116305, 1140954, 1167852, 1196448, 1225560, 1255924, 1289294, 1325560, 1363466, 1403743, 1448647, 1498392, 1550858, 1605098, 1662511, 1724097, 1789170, 1857533, 1930730, 2010380, 2097066, 2191440, 2294657, 2407332, 2529762, 2663383, 2810113, 2970135, 3142393, 3327522, 3527907, 3744130, 3973305, 4211493, 4455695]
57609D455695K46888K44462K35900K21054J99370J70478J34832R1955L9754k1563
57599F018825q5941j44453j91247k24743k44826k52163k49838k42332k32144k19050
57589C932088k02544j83456j63474j44647j28799j15889j03671r0390p7041o5530
57579B656647n5839m6815l8528l1607k5296j8421j1498n643j07O686J4269K0701
57567B464549K5790L1333L8318M6060N4087O2696P1453P9265Q6280R4054J03383
57556C157268J13482J23551J33674J43784J52951J59925J63566J62600J55947
57547D466748J43274J24528R9359O7974L2253n007m1640p6194j07076j32813j52827
57536D418579j67168j75917j79573j79429j76592j71327j64006j55686j46979
$$ y = [4455695, 4702583, 4947045, 5182945, 5403999, 5603369, 5773847, 5908679, 6000634, 6040388, 6018825, 5932884, 5788431, 5597184, 5372441, 5127615, 4875452, 4625614, 4383282, 4151138, 3932088, 3729544, 3546088, 3382614, 3237967, 3109168, 2993279, 2889608, 2799218, 2722177, 2656647, 2600808, 2553993, 2515465, 2483858, 2458562, 2440141, 2428643, 2423000, 2422893, 2429579, 2443848, 2464549, 2490339, 2521672, 2559990, 2606050, 2660137, 2722833, 2794286, 2873551, 2959831, 3053885, 3157268, 3270750, 3394301, 3527975, 3671759, 3824710, 3984635, 4148201, 4310801, 4466748, 4610022, 4734550, 4833909, 4901883, 4934136, 4929129, 4887489, 4811295, 4704219, 4571406, 4418579, 4251411, 4075494, 3895921, 3716492, 3539900, 3368573, 3204567, 3048881, 2901902]
57527B901902j37361j26752j16476j07520r9057r0256q2306p6811p3050o8742
57517A923571o3048n7073n1782m7148m3038l9485l6068l2255k8258k4762k2050
57506A478604k0019j8465j6759j4167j1077q780p395n574l066j649k122k362k87
57493A366882K949M927N653O884Q852J0329J1291J3089J6028J8774K0150K0189
57481A505997J9791K0368K3002K6780K9225K9677L0691L4330L8887M1634M3143
57470A843525M6088N0918N5694N9538O3363O7706P2471P8387Q6083R4115J00473
57459B618361J05685J11642J17788J21314J21087J18356J13320J03947Q8963O9490
57449C689953M7056K2209m160l0077n3856p4711r1715j03926j11712j16287j17725
$$ y = [2901902, 2764541, 2637789, 2521313, 2413793, 2314736, 2224480, 2142174, 2065363, 1992313, 1923571, 1860523, 1803450, 1751668, 1704520, 1661482, 1621997, 1585929, 1553674, 1525416, 1500654, 1478604, 1458585, 1440120, 1423361, 1409194, 1398117, 1389337, 1381942, 1376368, 1373302, 1371653, 1369531, 1367169, 1366882, 1369831, 1374758, 1380411, 1387295, 1396147, 1406476, 1417767, 1430856, 1446884, 1465658, 1485808, 1505997, 1525788, 1546156, 1569158, 1595938, 1625163, 1654840, 1685531, 1719861, 1758748, 1800382, 1843525, 1889613, 1940531, 1996225, 2055763, 2119126, 2186832, 2259303, 2337690, 2423773, 2517888, 2618361, 2724046, 2835688, 2953476, 3074790, 3195877, 3314233, 3427553, 3531500, 3620463, 3689953, 3737009, 3759218, 3755058, 3724981, 3671125, 3596414, 3504699, 3400773, 3289061, 3172774, 3055049]
57438C055049j15174j09131j01668r4224q6821p9506p2717o6182n9096n1529m4154
57427B174847l6925k9645k3355j9049j5568j0996n801k179m42J332M049O714R036
57414B052018J2301J6893K1286K4382K6925K9936L3445L7363M2045M7518N3448
57403B397560N9880O6871P3803Q0599Q8758R9074J09089J15259J17065J16461
57393C324419J13716J06796R4547P7586N6217L0487K403k4965n0659p5105r6510
57382C558932j11677j20721j27077j31942j32741j28357j21946j16561j11351
57373B456559j04370r6263q8748q1829p4796o8172o2588n7337n1641m5962m0835
57362A684018l6005l1635k8648k6982k5465k4038k3838k4430k3467k0127j6363
$$ y = [3055049, 2939875, 2830744, 2729076, 2634852, 2548031, 2468525, 2395808, 2329626, 2270530, 2219001, 2174847, 2137922, 2108277, 2084922, 2065873, 2050305, 2039309, 2033508, 2031329, 2030887, 2032219, 2036268, 2042982, 2052018, 2064319, 2081212, 2102498, 2126880, 2153805, 2183741, 2217186, 2254549, 2296594, 2344112, 2397560, 2457440, 2524311, 2598114, 2678713, 2767471, 2866545, 2975634, 3090893, 3207958, 3324419, 3438135, 3544931, 3639478, 3717064, 3773281, 3803768, 3806171, 3781206, 3730547, 3655442, 3558932, 3447255, 3326534, 3199457, 3067515, 2934774, 2806417, 2684471, 2567910, 2456559, 2352189, 2255926, 2167178, 2085349, 2010553, 1942381, 1879793, 1822456, 1770815, 1724853, 1684018, 1648013, 1616378, 1587730, 1560748, 1535283, 1511245, 1487407, 1462977, 1439510, 1419383, 1403020]
57351A403020j3676j1354r019q022q751r139p648n428l902k588r41o2p54j815
57337A319921j883j116J24K165M467N581N714O792Q859R417P612N963O268P081
57323A386965P104P738R821J1157J0056Q405Q369Q901Q423Q119R244R941Q343
57310A502586O485P284R601J0225R163Q985J0161J1037J1583J3313J5727J6439
57298A632589J4963J3371J3042J3337J3583J4047J4761J5313J5830J6580J6963
57287A794379J6324J5234J4497J3725J2326J1042J1100J2541J4578J6448J7027
57276A949221J5368J2797J2434J5077J7747J8045J7546J8678K0695K1532K1498
57265B140638K2114K2979K2851K2468K3317K4829K5561K5864K6745K7378K6407
$$ y = [1403020, 1389344, 1377990, 1368971, 1360949, 1352198, 1343059, 1335411, 1329983, 1326081, 1323493, 1322552, 1322490, 1321736, 1319921, 1318038, 1316922, 1317046, 1319211, 1323678, 1329259, 1334973, 1341765, 1350624, 1360041, 1367653, 1373616, 1379884, 1386965, 1394069, 1401807, 1411628, 1422785, 1432841, 1441246, 1449615, 1458516, 1466939, 1475058, 1484302, 1494243, 1502586, 1509071, 1516355, 1525956, 1536181, 1545344, 1554329, 1564490, 1575527, 1587110, 1600423, 1616150, 1632589, 1647552, 1660923, 1673965, 1687302, 1700885, 1714932, 1729693, 1745006, 1760836, 1777416, 1794379, 1810703, 1825937, 1840434, 1854159, 1866485, 1877527, 1888627, 1901168, 1915746, 1932194, 1949221, 1964589, 1977386, 1989820, 2004897, 2022644, 2040689, 2058235, 2076913, 2097608, 2119140, 2140638, 2162752, 2185731, 2208582, 2231050, 2254367, 2279196, 2304757, 2330621, 2357366, 2384744, 2411151]
57254B411151K4591K3556K3214K2873K3313K5116K6511K5853K4697K5351K6984
57243B683210K7364K7088K8405L0979L2401L2344L2747L4262L5659L6395L6978
57232C037832L7179L6560L6281L7826M0514M2620M4033M5579M6940M7696M9017
57221C502077N1643N3698N3425N2502N3552N5897N7208N7708N9172O1037O1232
57210D119151N9801N8149N5770N1254M5404L9847L3891K6522J9959J6955J5870
57199D542573J2872Q084N063M985N955P344J0111J3182J4364J4713J7379K2126
57187D678751K5464K6320K7029K8565K9405K9412L0244L1473L0706K8245K7379
57176D992993K9252L1405L2050L2057L2319L2780L4393L8268M2928M5998M8355
$$ y = [2411151, 2435742, 2459298, 2482512, 2505385, 2528698, 2553814, 2580325, 2606178, 2630875, 2656226, 2683210, 2710574, 2737662, 2766067, 2797046, 2829447, 2861791, 2894538, 2928800, 2964459, 3000854, 3037832, 3075011, 3111571, 3147852, 3185678, 3226192, 3268812, 3312845, 3358424, 3405364, 3453060, 3502077, 3553720, 3607418, 3660843, 3713345, 3766897, 3822794, 3880002, 3937710, 3996882, 4057919, 4119151, 4178952, 4237101, 4292871, 4344125, 4389529, 4429376, 4463267, 4489789, 4509748, 4526703, 4542573, 4555445, 4563529, 4568592, 4573577, 4579532, 4586876, 4596987, 4610169, 4624533, 4639246, 4656625, 4678751, 4704215, 4730535, 4757564, 4786129, 4815534, 4844946, 4875190, 4906663, 4937369, 4965614, 4992993, 5022245, 5053650, 5085700, 5117757, 5150076, 5182856, 5217249, 5255517, 5298445, 5344443, 5392798]
57165E392798N2641N8254O2238O4547O7645P1248P2648P2189P3108P5597P6315
57154F139228P4247P1853O9916O6603O2312N9942N9404N7184N2337M7741M4401
57143F805168M0016L4235K9864K7563K4803K1590K1709K6554L2862L8226M3848
57132G146438N0305N5769O0041O5449P2160P7349Q0019Q1885Q2869Q1049P7399
57121G930732P4754P1697O3951N2394M2774L6743L0490K3288J9330J9316J8292
57110H383761J4316J1394J1244J0083O583M966O929Q453Q084J0305J6853K2801
57098H515772K5296K8260L4110L8619L8586L6885L5545L1691K4823K0226K0563
57087H850376K2050K3186K8600L9621N0074N6594O3855P4271Q2179Q4111Q5132
$$ y = [5392798, 5445439, 5503693, 5565931, 5630478, 5698123, 5769371, 5842019, 5914208, 5987316, 6062913, 6139228, 6213475, 6285328, 6355244, 6421847, 6484159, 6544101, 6603505, 6660689, 6713026, 6760767, 6805168, 6845184, 6879419, 6909283, 6936846, 6961649, 6983239, 7004948, 7031502, 7064364, 7102590, 7146438, 7196743, 7252512, 7312553, 7378002, 7450162, 7527511, 7607530, 7689415, 7772284, 7853333, 7930732, 8005486, 8077183, 8141134, 8193528, 8236302, 8273045, 8303535, 8326823, 8346153, 8365469, 8383761, 8398077, 8409471, 8420715, 8430798, 8437381, 8442347, 8449276, 8457729, 8465813, 8476118, 8492971, 8515772, 8541068, 8569328, 8603438, 8642057, 8680643, 8717528, 8753073, 8784764, 8809587, 8829813, 8850376, 8872426, 8895612, 8924212, 8963833, 9013907, 9070501, 9134356, 9208627, 9290806, 9374917, 9460049]
57076I460049Q8627Q9748Q5603Q1801Q1638P8880O8740N5800M3488K6428J293
57065A0162095k5532m9330p4879j04635j31294j51421j73958k05335k38931k69303
57055H737477l02950l43977l83882m17726m55077n02035n48740n88547o31609
57046D562934o83421p28534p52888p62685p62038A40078e20497n49843m01578
57037a471918j89300J07247M73186a89909A179682J911401K488004L092990L768107
57028A2440184M526319N316127O135456P062472P970422Q250332P121269M417583
57020F3240164R57652k038840l866930m605944m648409m230321l439065k430468
57012C8937839j457848p43285m11223m98918r45058j584781k221610k716388k999874
$$ y = [9460049, 9548676, 9638424, 9724027, 9805828, 9887466, 9966346, 10035086, 10090886, 10134374, 10160802, 10162095, 10136563, 10087233, 10012354, 9907719, 9776425, 9625004, 9451046, 9245711, 9006780, 8737477, 8434527, 8090550, 7706668, 7288942, 6833865, 6331830, 5783090, 5194543, 4562934, 3879513, 3150979, 2398091, 1635406, 873368, 140078, -520497, -1070340, -1471918, -1661218, -1553971, -1080785, -189909, 1179682, 3091083, 5579087, 8672077, 12440184, 16966503, 22282630, 28418086, 35480558, 43450980, 51701312, 58822581, 63240164, 64197816, 62158976, 58292046, 53686102, 49037693, 44807372, 41368307, 38937839, 37479991, 36736706, 36325483, 35826565, 34881507, 33296726, 31075116, 28358728, 25358854]
57003B5358854l042028k855081k507112k088240j661384j260087r12021o34162
56995A0398739m16608k38860r7193J901O4195J03062J21243J16787R9940Q6110
56985A0239316P8238P1774O9997P8384R0170R3517Q8479Q2865P6554O3793M6518
56974A1079605L1617J8582K291j5428k8808l9142n1438o3623p0190p3339p9536
56963A0710591q7889r2684r4725r9766j08011j15209j22042j32528j45153j55141
56953I557443j63684j75379j88081j94719j94124j91260j87955j82121j74944
56944G905176j69806j64902j55593j43079j31899j20003j01362p8363o0650m9719
56934F729800l5831j5828n939k9568r4910j87411k80588l51994l93019m08180
$$ y = [25358854, 22316826, 19461745, 16954633, 14866393, 13205009, 11944922, 11032901, 10398739, 9982131, 9743271, 9646078, 9647979, 9712174, 9815236, 9936479, 10053266, 10153206, 10239316, 10317554, 10389328, 10459325, 10537709, 10627879, 10721396, 10809875, 10892740, 10969294, 11033087, 11079605, 11111222, 11129804, 11132095, 11116667, 11087859, 11048717, 10997279, 10933656, 10863466, 10790127, 10710591, 10622702, 10530018, 10435293, 10335527, 10227516, 10112307, 9990265, 9857737, 9712584, 9557443, 9393759, 9218380, 9030299, 8835580, 8641456, 8450196, 8262241, 8080120, 7905176, 7735370, 7570468, 7414875, 7271796, 7139897, 7019894, 6918532, 6840169, 6779519, 6729800, 6693969, 6678141, 6672202, 6642634, 6547724, 6360313, 6079725, 5727731, 5334712, 4926532]
56924D926532m06021l91371l66816l37565l09495k83736k58176k33470k12463
56915B127419j94552j76163j56868j39774j25711j12202r8560q6874p7279o7209
56905H92227n6216m6825l9623l1931k2433j2838l933N719J5801K2935K4812K2290
56893G69985J6465P281l882j3682k0201k4110k5916k5108k2476j9954j7628j4055
56881F06719r854p350o295l796P97M751O712Q850J2973J8025K2599K6438K8088
56868G08657K4546J5063K562r979k1705l1511l7156l8551l8819m0045m0700l9029
56856D53333l6231l4160l2368k9668k6583k4127k1867j9176j6910j6092j6079
56845A80072j5454j3673j0880p453m590l908n491p552q500q050o221l107P2J749
$$ y = [4926532, 4520511, 4129140, 3762324, 3424759, 3115264, 2831528, 2573352, 2339882, 2127419, 1932867, 1756704, 1599836, 1460062, 1334351, 1222149, 1123589, 1036715, 959436, 892227, 836011, 789186, 749563, 717632, 695199, 682361, 678428, 684147, 699948, 722883, 747695, 769985, 786450, 793731, 789849, 776167, 755966, 731856, 705940, 680832, 658356, 638402, 620774, 606719, 596865, 589515, 583220, 579424, 580221, 584972, 591684, 600534, 613507, 631532, 654131, 680569, 708657, 733203, 748266, 750828, 740849, 719144, 687633, 650477, 611926, 573107, 533062, 492362, 453333, 417102, 382942, 350574, 320906, 294323, 270196, 248329, 229153, 212243, 196151, 180072, 164618, 150945, 140065, 132612, 128022, 124114, 118623, 111071, 102571, 94521, 88300, 85193, 85265, 87014]
56831H7014K388M157P848J2130J6042J9878K3227K4806K4900K5347K6304K5615
56819B99656K2299J8030J4191J0293O461M541N057N814N388N503P950J1481J3933
56806D30597J5369J6892J8285J9023K0256K3502K8407L3247L6340L5660K9129
56795G06707J7263M064o639j4523k1020k6044k8527k8645k7217k3954j8399j1724
56783E21342n641k67N205J0579J5227J9814K5615L2690M0224M7954N5359N9838
56771H27939N7567M6542K8230O607j3829k9970m1162m8198n1248m9830m4877l8932
56759F48839l3466k7703k1047j4649r322l914K525Q744J3394J7537K3007K9478
56747F33423L5068L8512L8705L3590K2171O929p927k0135k9562l5829l8229l7569
$$ y = [87014, 89402, 93559, 101407, 113537, 129579, 149457, 172684, 197490, 222390, 247737, 274041, 299656, 321955, 339985, 354176, 364469, 370930, 375471, 380528, 386342, 391730, 397233, 405183, 416664, 430597, 445966, 462858, 481143, 500166, 520422, 543924, 572331, 605578, 641918, 677578, 706707, 723970, 728034, 721395, 706872, 685852, 659808, 631281, 602636, 575419, 551465, 533066, 521342, 515701, 515434, 520639, 531218, 546445, 566259, 591874, 624564, 664788, 712742, 768101, 827939, 885506, 932048, 960278, 966885, 953056, 923086, 881924, 833726, 782478, 732648, 687771, 648839, 615373, 587670, 566623, 551974, 542652, 538738, 541263, 550007, 563401, 580938, 603945, 633423, 668491, 707003, 745708, 779298, 801469, 808398, 800471, 780336, 750774, 714945, 676716, 639147]
56735F39147l5787l3812l1493k9232k7669k6011k2545j6886j0317m220N40L396
56723D05111M901P172J1577J6342J8145J5683J0160L003m790j1614j6103j9040
56711D40547k2269k5559k6615k4582k1434j9219j7755j5831j3304j0955r262q109
56699B25653p279o795o963p863q554p564m863k489k135k931k871j548j20O98R90
56684A65366P40J51K37J384K051Q38q80n38J794L433K792R45n33j261j484j645
56668A73390k530m103m507k307O45J006j432l576l751l761n357p325p619o363
56654A22410n098m483m100l564k729j646q73j072j961k698l287m315n341n216
56640G6027m119l572m042m298l573k699k588l054l540l544k232P08L746M904M556
$$ y = [639147, 603360, 569548, 538055, 508823, 481154, 455143, 432598, 415712, 405395, 401175, 401715, 405111, 410012, 417184, 428761, 445103, 463248, 478931, 489091, 492094, 487304, 475690, 459587, 440547, 418278, 392719, 366104, 341522, 320088, 300869, 283114, 267283, 253979, 243024, 233762, 225653, 218374, 211579, 204616, 196753, 188199, 180635, 175772, 173283, 171148, 168217, 165346, 163798, 163678, 164376, 165366, 166106, 166257, 166494, 167878, 169929, 170767, 169887, 169349, 171143, 174576, 177368, 178313, 177780, 176519, 175035, 173390, 170860, 166757, 162250, 159943, 160588, 161594, 160162, 156586, 152835, 149074, 143717, 136392, 128773, 122410, 117312, 112829, 108729, 105165, 102436, 100790, 99917, 98845, 96884, 94186, 90899, 86584, 81243, 76027, 71908, 68336, 64294, 59996, 56423, 53724, 51136, 48082, 44542, 40998, 38766, 39474, 43220, 48124, 52680]
56625E2680M804O138P029O985P175P577O483L837K135K669L533K908J698J294
56611A16945J116L36l00j93l09j009q41N41P18j890n061o108n996p123q997r562
56595G2267r354j0689j3532j5694F284a1854k0111k0868j9963j8743j7163j3251
56583a21953o742o27K501L651N495Q708J1856J3811J4868J5733J6461J6565c929
56569A0475J3217J2227J0835R023P782P759Q191Q062P528P254O979N963M439L424
56555A23158L236L190K687J940J616K172L269L669K471N05m90k62k11q69r55K31
56539A45357J421J505J264J591J811J445J702L272M432L754K977M354O531O278
56525A87694L610J810K461L616L342K305J989K538L319L921L928L057K038K070
$$ y = [52680, 57484, 63622, 70651, 77636, 84811, 92388, 98871, 102708, 104843, 107512, 111045, 113953, 115651, 116945, 118061, 118397, 118097, 117904, 117595, 116586, 115745, 116286, 117004, 115114, 110053, 103945, 97949, 90826, 81829, 72267, 62913, 52224, 38692, 22998, 6284, -11854, -31965, -52833, -72796, -91539, -108702, -121953, -128695, -129322, -126821, -123170, -117675, -108967, -97111, -83300, -68432, -52699, -36238, -19673, -3929, 10475, 23692, 35919, 46754, 55777, 63559, 71318, 79509, 87571, 95099, 102353, 109332, 115295, 119734, 123158, 126394, 129584, 132271, 134211, 135827, 137999, 141268, 144937, 147408, 147913, 147423, 147161, 146950, 146081, 145126, 145357, 146778, 148283, 149547, 151138, 152949, 154394, 156096, 159368, 163800, 167554, 170531, 174885, 181416, 187694, 191304, 193114, 195575, 199191, 202533, 204838, 206827, 209365, 212684, 216605, 220533, 223590, 225628, 227698]
56511B27698L194M363N138O108P589R101J0140J0471J0013R369R807J1662J3580
56498C38233J4596J5682J7625J8886J7815J5823J5560J6826J7147J5902J4786
56487E18881J4348J3196J0980R181Q340O977M134P68j929l688m406m367n133p943
56473E59339j1241j2466j2304j3890j7415j9129j7017j4029j3768j5668j6780
56462C95632j6079j4664j3225j1527r593p727o038m819m580n093n532n872o646
56449B84237p162n999l787l127m826o417n729l780k673k529k205j481q39k67K79
56434B33695K63m29q94n53R6O48J360J975J754J244J991L641L641J148j106o18
56418B47856J315J960J303J440L010M606N165M928M312L427K617K280K356K651
$$ y = [227698, 230892, 235255, 240393, 246501, 254090, 263191, 273331, 283802, 293815, 303184, 312991, 324653, 338233, 352829, 368511, 386136, 405022, 422837, 438660, 454220, 471046, 488193, 504095, 518881, 533229, 546425, 557405, 566586, 574926, 581903, 586037, 586805, 584876, 581188, 576782, 572415, 567282, 559339, 548098, 535632, 523328, 509438, 492023, 472894, 455877, 441848, 428080, 412412, 395632, 379553, 364889, 351664, 340137, 330544, 322817, 316779, 311960, 307380, 302287, 296755, 290883, 284237, 277075, 271076, 267289, 264162, 259336, 252919, 247190, 243410, 240737, 238208, 236003, 234522, 233683, 233416, 233695, 233958, 233529, 232635, 232082, 232178, 232826, 234186, 236161, 237915, 239159, 241150, 244791, 248432, 249580, 248474, 247856, 249171, 251131, 252434, 253874, 256884, 261490, 266655, 271583, 275895, 279322, 281939, 284219, 286575, 289226]
56404B89226L187L783L974L823L909M162L878L168L155M237N598O630P409P559
56390C53698O570N437N750O805O136L580J933K488K960J521j02J54J078M46j185
56375C97269j760j130n21m1O90O21j327l807m560l751l545m807o342p025o804
56360C53160n861m416l118k390j861j394j806l371m706m436l030j768r95m95m32
56345C13081o88n43j46q55k884m301l774k558k141j852o70M18J86l78K84J474
56329B94653J603J120J682L224M266M486M830N596O346P138Q058Q277P220N876
56315C64375N389N356N001M727M819M061J752l53l19Q90J017R2p7Q27J369R46
56299C99872M07L37N85J170K115K795K772K591K579K041P85M9N13R72N27K98J305
$$ y = [289226, 292413, 296196, 300170, 303993, 307902, 312064, 315942, 319110, 322265, 326502, 332100, 338730, 346139, 353698, 360268, 365705, 371455, 378260, 384396, 387976, 389909, 392397, 395357, 396878, 396776, 396930, 398008, 398454, 397269, 395509, 394379, 393858, 393817, 394507, 395128, 393801, 389994, 385434, 381683, 378138, 373331, 366989, 359964, 353160, 347299, 342883, 339765, 337375, 335514, 334120, 332314, 328943, 324237, 319801, 316771, 315003, 314008, 313513, 313081, 312393, 311850, 311704, 310849, 307965, 303664, 299890, 297332, 295191, 293339, 292669, 293087, 293273, 292895, 293179, 294653, 296256, 297376, 299058, 302282, 306548, 311034, 315864, 321460, 327806, 334944, 343002, 351279, 358499, 364375, 369764, 375120, 380121, 384848, 389667, 393728, 395480, 395127, 394808, 395698, 396715, 396807, 396730, 397557, 398926, 399872, 400279, 400616, 401201, 402371, 404486, 407281, 410053, 412644, 415223, 417264, 418049, 418098, 418611, 419583, 420110, 420408, 421713]
56282D21713K481K796L259M717N606M446K702K606L874N055O261P865Q461P109
56268D88951N737O238P084O123M794N751Q007Q565P586P731R181R628Q679Q261
56254E92316Q761Q664P991Q342R503R579Q706R161J1458J3516J4119J4189J4264
56241G30569J3525J1726R751Q124P011P217Q866R915Q599O508O457Q216R422R704
56227H55610J0610J2184J3128J3719J5207J6960J7568J7962J9940K2525K3568
56216A038981K4155K7149L1998L5345L6622L8521M1944M4834M6582M9299N4048
56205A469478N9571O5384P2422Q0196Q6890R2693R9621J07776J15431J22839J32240
56194B504541J43853J55590J66771J78323J89381J97844K04374K11648K19260
$$ y = [421713, 424194, 426990, 430249, 434966, 440572, 445018, 447720, 450326, 454200, 459255, 465516, 473381, 481842, 488951, 494688, 500926, 508010, 514133, 518927, 524678, 532685, 541250, 548836, 556567, 565748, 575376, 584055, 592316, 601077, 609741, 617732, 626074, 635577, 645156, 653862, 663023, 674481, 687997, 702116, 716305, 730569, 744094, 755820, 765571, 773695, 780706, 787923, 796789, 806704, 815303, 821811, 828268, 836484, 845906, 855610, 866220, 878404, 891532, 905251, 920458, 937418, 954986, 972948, 992888, 1015413, 1038981, 1063136, 1090285, 1122283, 1157628, 1194250, 1232771, 1274715, 1319549, 1366131, 1415430, 1469478, 1529049, 1594433, 1666855, 1747051, 1833941, 1926634, 2026255, 2134031, 2249462, 2372301, 2504541, 2648394, 2803984, 2970755, 3149078, 3338459, 3536303, 3740677, 3952325, 4171585]
56185D171585K23574K22887K18585K11007J98599J81629J62198J40109J13229
56176E843402Q2487N2034K3859l189k8685n0009o7117q2827r7434j08089j14472
56165E449960j19760j24746j26591j25115j24787j28192j32534j35029j36919
56156D296287j39763j42373j43904j45695j47772j47696j44963j42152j39930
56147C002039j35665j28990j23546j20666j16405j08063r8785r2252q7240q1020
56137A909407p4219o8547o3096n6509m9939m4911m0954l7641l6037l5948l4951
56126A366655l2077k9108k6635k2681j7063j2796j1124r410o169l741l475k861
56114A189515j98K194K397K394M152O267P489R552J3522J7094J8486J9356K1284
$$ y = [4171585, 4395159, 4618046, 4836631, 5047638, 5246237, 5427866, 5590064, 5730173, 5843402, 5925889, 5977923, 6001782, 5998593, 5969908, 5919899, 5852782, 5769955, 5672521, 5564432, 5449960, 5330200, 5205454, 5078863, 4953748, 4828961, 4700769, 4568235, 4433206, 4296287, 4156524, 4014151, 3870247, 3724552, 3576780, 3429084, 3284121, 3141969, 3002039, 2866374, 2737384, 2613838, 2493172, 2376767, 2268704, 2169919, 2077667, 1990427, 1909407, 1835188, 1766641, 1703545, 1647036, 1597097, 1552186, 1511232, 1473591, 1437554, 1401606, 1366655, 1334578, 1305470, 1278835, 1256154, 1239091, 1226295, 1215171, 1205761, 1199592, 1195851, 1192376, 1189515, 1189317, 1191511, 1193908, 1196302, 1200454, 1206721, 1214210, 1223762, 1237284, 1254378, 1272864, 1292220, 1313504]
56101A313504K3113K4233K6378K9740L1501L0737L0331L1551L1443K8442K5746
56090A626719K6004K7235K7243K7335K8519K8754K7515K8415L3726M0652M6407
56079A968524N2470O0469O8618P5836Q4777R7104J10296J22521J35916J51442
56069B927973J65369J74395J79338J80320J73888J59123J41485J26333J13504
56060D341728J01852R3341Q7936P9990O4808M4303K2275n12k2437l8529m7279
56049D727476n4683o6384q0941r5530j12199j32793j53038j67424j75317j77435
56039C511732j71961j59403j45478j33661j20439j03189q6454p4548o4468n2566
56029B399565m2004l6683l3740k8995k4082k1478j8392j2596q332r264j1276r524
$$ y = [1313504, 1336617, 1360850, 1387228, 1416968, 1448469, 1479206, 1509537, 1541088, 1572531, 1600973, 1626719, 1652723, 1679958, 1707201, 1734536, 1763055, 1791809, 1819324, 1847739, 1881465, 1922117, 1968524, 2020994, 2081463, 2150081, 2225917, 2310694, 2407798, 2518094, 2640615, 2776531, 2927973, 3093342, 3267737, 3447075, 3627395, 3801283, 3960406, 4101891, 4228224, 4341728, 4443580, 4536921, 4624857, 4704847, 4769655, 4813958, 4836233, 4835721, 4813284, 4774755, 4727476, 4672793, 4606409, 4525468, 4429938, 4317739, 4184946, 4031908, 3864484, 3689167, 3511732, 3339771, 3180368, 3034890, 2901229, 2780790, 2677601, 2591147, 2516599, 2452131, 2399565, 2357561, 2320878, 2287138, 2258143, 2234061, 2212583, 2194191, 2181595, 2173263, 2163999, 2152723, 2143199]
56017B143199o619o603o906l918l56O31K475Q344J3672J3799J2786J6076K0769
56004B207349K1896K2021K5459K9301K9558K9966L5004M0357M0163L7718L9054
55993B557846M2022M1948M1817M6081N0606M9714M7394N0250N5225N5723N4179
55982C092805N6904O1860O3236O2831O5472O8606O7852O7173P1924P7960P9335
55971C835958Q0182Q6883R5451R9335J02410J10929J20314J23931J27100J37408
55961D919901J49034J52509J52406J58776J68493J72371J73665J81627J93398
55952F422180K00473K06625K20961K39692K53687K67388K90883L19859L43456
55943H765204L65157L95407M30490M60061M88090N24131N61615N88766O13483
$$ y = [2143199, 2136580, 2129977, 2123071, 2119153, 2118797, 2119428, 2121903, 2130247, 2143919, 2157718, 2170504, 2186580, 2207349, 2229245, 2251266, 2276725, 2306026, 2335584, 2365550, 2400554, 2440911, 2481074, 2518792, 2557846, 2599868, 2641816, 2683633, 2729714, 2780320, 2830034, 2877428, 2927678, 2982903, 3038626, 3092805, 3149709, 3211569, 3274805, 3337636, 3403108, 3471714, 3539566, 3606739, 3678663, 3756623, 3835958, 3916140, 4003023, 4098474, 4197809, 4300219, 4411148, 4531462, 4655393, 4782493, 4919901, 5068935, 5221444, 5373850, 5532626, 5701119, 5873490, 6047155, 6228782, 6422180, 6622653, 6829278, 7050239, 7289931, 7543618, 7811006, 8101889, 8421748, 8765204, 9130361, 9525768, 9956258, 10416319, 10904409, 11428540, 11990155, 12578921, 13192404]
55934A3192404O52309P01629P45527P84979Q32280Q83729R26525R66640J020779
55925B0706801J086785J151200J218642J302644J395439J480414J566555J675039
55917C1583519J799812J919280K038751K180530K340064K495832K655759K847728
55909D9861275L071030L305888L563948L877333M245658M650499N114472N685346
55901H3375449O371020P155746Q066743R148302J0386077J1747274J3281337J5081895
55893A64613843J7176264J9581889K2439800K5915999K9988443L4529921L9475734
55886C53721893M4342866M7298946M5289036L6019799K0191189J537098j5517835
55879E32882992k8261425l6201481m0077861m0908397l9668009l7191995l4053798
$$ y = [13192404, 13844713, 14546342, 15291869, 16076848, 16909128, 17792857, 18719382, 19686022, 20706801, 21793586, 22944786, 24163428, 25466072, 26861511, 28341925, 29908480, 31583519, 33383331, 35302611, 37341362, 39521892, 41861956, 44357788, 47013547, 49861275, 52932305, 56238193, 59802141, 63679474, 67925132, 72575631, 77690103, 83375449, 89746469, 96902215, 104968958, 114117260, 124503337, 136250611, 149531948, 164613843, 181790107, 201371996, 223811796, 249727795, 279716238, 314246159, 353721893, 398064759, 445363705, 490652741, 526672540, 546863729, 548400827, 532882992, 504621567, 468420086, 428342225, 387433828, 347765819, 310573824, 276520026]
55872B76520026l0590781k7070073k3735880k0716968j8021105j5646246j3616570
55865A27122403j1913479j0465245r221579q171338p283547o499910n794828n184083
55857F2588394m666652m210515l800488l448517l149652k874554k612660k380603
55849C5444753k181921j997858j823231j673547j550944j437904j329480j238488
55841B2211380j164511j090001j011728r45349q94278q43376p87917p40401p03808
55832A4030011o65211o20822n81667n49710n13375m71361m36825m13124l88645
55823I389271l60382l39877l30522l20802l05670k93862k88543k80426k65819
55814F603368k52871k44707k34107k19637k09615k05476j98075j84734j73477
$$ y = [276520026, 245929245, 218859172, 195123292, 174406324, 156385219, 140738973, 127122403, 115208924, 104743679, 95522100, 87350762, 80067215, 73567305, 67772477, 62588394, 57921742, 53711227, 49910739, 46462222, 43312570, 40438016, 37825356, 35444753, 33262832, 31264974, 29441743, 27768196, 26217252, 24779348, 23449868, 22211380, 21046869, 19956868, 18945140, 17999791, 17105513, 16262137, 15474220, 14733819, 14030011, 13364800, 12743978, 12162311, 11612601, 11099226, 10627865, 10191040, 9777916, 9389271, 9028889, 8689012, 8358490, 8037688, 7732018, 7438156, 7149613, 6869187, 6603368, 6350497, 6105790, 5871683, 5652046, 5442431, 5236955, 5038880, 4854146, 4680669]
55805D680669j66557j56494j42446j33957j33736j32617j26183j20999j19932
55796C447748j16362j07760j00608r7077r0673p9586p1107o8656o7347o5812o9092
55785B513668p6304p8837p4640p1250p1083o7034n6757m7932m4770m1814l5696
55774A847551l0939k9610k7025k2026j9938k1295j9289j2372p840q970j0313r676
55762A628258j2711k1014k7487k8470k9206l2466l3224k9686k8168l1399l2934
55751A321493k8950k5016k5251k5262k1872j9729k1681k2380j8108j3847j3850
55740A085547j3886r779n392n236o553n380l615l896m129k745k975o472r112q181
55726I98196p361r799j2743j3563j4393j6306j5808j1931r825j2340j4712j2526
$$ y = [4680669, 4514112, 4357618, 4215172, 4081215, 3947479, 3814862, 3688679, 3567680, 3447748, 3331386, 3223626, 3123018, 3025941, 2935268, 2855682, 2784575, 2715919, 2648572, 2582760, 2513668, 2437364, 2358527, 2283887, 2212637, 2141554, 2074520, 2017763, 1969831, 1925061, 1883247, 1847551, 1816612, 1787002, 1759977, 1737951, 1718013, 1696718, 1677429, 1665057, 1657217, 1648247, 1637934, 1628258, 1615547, 1594533, 1567046, 1538576, 1509370, 1476904, 1443680, 1413994, 1385826, 1354427, 1321493, 1292543, 1267527, 1242276, 1217014, 1195142, 1175413, 1153732, 1131352, 1113244, 1099397, 1085547, 1071661, 1061882, 1056490, 1051254, 1044701, 1039321, 1035706, 1031810, 1027681, 1024936, 1021961, 1015489, 1006377, 998196, 990835, 981036, 968293, 954730, 940337, 924031, 908223, 896292, 886467, 874127, 859415, 846889]
55714H46889q476o401n245l865n157j0089j3877j3306j2054j3807j6141j6037
55702G22434j5442j6275j5808j2235r229r913j1676j1691j2062j4661j6434j4969
55690E62039j3466j5192j7855j8153j6990j5840j3116q602o173p607q966p462
55678D12617o311q176r689p728n339n861o475l649J7M25q64k08J311M31k224m053
55662C54224n277p003p672o041m404m688m770k719q88j684l236l400l788n574
55648B93080n751k224J705K766L250O052Q558P099L558J883J408o18k936k456
55634C15374r1R42M57L32N30M09J412M220O041M948L885O021R296J0145R439R903
55618C83263J0743R881Q696R329R828P095K495l89j505l073m712m634l811m361
$$ y = [846889, 838413, 832012, 826767, 822902, 817745, 807656, 793779, 780473, 768419, 754612, 738471, 722434, 706992, 690717, 674909, 662674, 653445, 643532, 631856, 620165, 608103, 593442, 577008, 562039, 548573, 533381, 515526, 497373, 480383, 464543, 451427, 442825, 436652, 429045, 420079, 412617, 406306, 398130, 388441, 380713, 375374, 369513, 363038, 359389, 359406, 359831, 358967, 358759, 360070, 360501, 358277, 354224, 348947, 341944, 334272, 328231, 323827, 319139, 314369, 311650, 310762, 309078, 305842, 302442, 298654, 293080, 287329, 285105, 286810, 289576, 292826, 298878, 307436, 314535, 318093, 319976, 321384, 320766, 317830, 315374, 315283, 316225, 316682, 317014, 317544, 317953, 319365, 323585, 329626, 334574, 338459, 344480, 353776, 363921, 373360, 383263, 394006, 403887, 412583, 421912, 431740, 438835, 441330, 440941, 439436, 436363, 431651, 427017, 423206, 418845]
55604D18845n425m909l508l042k862j713q43j243m98L344P312P523N095L543K818
55589D24437R01j060o04R01K08k103k872k092k469m236n182n057n610o825p190
55574C81147p060q013r608j0221j0236j1096j2323j2626j2567j3116j3152j1425
55562B49704r174p846o454m317l672n945q259p627n815n763o149m406k334l178
55548A68765n382m870j984m74r53r07j88r59k808l216k410k696l498k172N83J305
55532A38136l97j478r20p67j624j809j187j335j784n76J322Q30j758k837j624
55517A22192j441l797n742m741k276q21n03l58k49j55K76O25J55l90M44K402L978
55500A09599M832N381M815K330m21j136l93l03o21L46J775J251q28j706j070j367
$$ y = [418845, 413420, 408511, 405003, 401961, 399099, 397386, 396543, 395300, 394802, 398146, 405458, 412981, 418076, 421619, 424437, 425338, 424278, 423674, 424575, 424783, 422680, 419808, 417716, 415247, 411011, 405829, 400772, 395162, 388337, 381147, 374087, 366074, 356466, 346245, 336009, 324913, 312590, 299964, 287397, 274281, 261129, 249704, 240530, 232684, 226230, 221913, 218241, 212296, 204037, 196410, 190595, 184832, 178683, 174277, 171943, 168765, 163383, 158513, 156529, 156055, 155102, 154195, 154007, 153048, 150240, 147024, 144614, 141918, 138420, 136248, 136831, 138136, 137739, 136261, 135341, 134574, 132950, 131141, 129954, 128619, 126835, 126259, 127581, 128411, 126653, 123816, 122192, 120751, 116954, 111212, 106471, 104195, 103374, 102871, 102513, 102264, 102109, 102385, 103010, 103165, 102775, 103219, 105621, 109599, 114431, 119812, 124627, 126957, 126536, 125400, 125007, 124704, 124083, 124429, 126204, 127455, 126627, 124921, 123851, 122484]
55484A22484l251m541m136l379l148k932l003m003m246j156M105P162O226L994
55470A10176L034K861K462K272K284J245q34j894p08J497L094L661L084J287o97
55455A32824j455j153q90m31J005K252J434n84j093R6M06j108k401k114j496j793
55439A23499k439k837l477m334m308l211k401k844m021n089n519m761k966j766
55425G3526k563m473n646n771n369l970j552l12j936m185l567n38J465J341R36
55410C7386Q37l49k457l361k545j628j042M54K700L880L582K980J932o16l435
55395C8318l845j958n78p46j031j216k494l789k400R70K231J58j773j128K92O96
55379B1707J405L320M250K539K21k00M95K01j008j734j718j421p46K49Q10P13
$$ y = [122484, 119233, 114692, 110556, 107177, 104029, 101097, 98094, 94091, 89845, 88689, 92794, 99956, 106182, 110176, 113210, 116071, 118533, 120805, 123089, 124334, 123500, 121606, 120898, 122395, 125489, 129150, 132234, 133521, 132824, 131369, 130216, 129326, 128895, 129900, 132152, 133586, 133002, 131909, 132005, 132411, 131303, 128902, 126788, 125292, 123499, 121060, 118223, 114746, 110412, 106104, 102893, 100492, 97648, 93627, 88538, 83019, 78258, 75292, 73526, 70963, 66490, 60844, 55073, 49704, 45734, 44182, 43870, 41934, 37749, 34182, 33644, 35109, 36450, 37386, 38223, 37874, 35417, 32056, 29511, 27883, 26841, 27295, 29995, 33875, 37457, 40437, 42369, 41753, 38318, 34473, 32515, 31937, 31191, 30160, 28944, 26450, 22661, 20261, 21231, 23462, 23620, 21847, 20719, 21011, 21707, 23112, 26432, 30682, 33221, 33442, 33242, 33737, 33938, 32930, 31196, 29478, 28057, 27311, 27560, 28370, 29083]
55363B9083N27J34j043k042j125J054J743K01j376j567j312j060K02K024K011
55348B7454j06j252M00K624K791J536P94Q79J415K707M253M215K139J64j26J38
55332E0025m81j408j667j619j608j032p0j57j464k262j818j491j845j601n79o73
55316C0250k272k854r66J281J653Q62J82q46k125j521J517L637J998j297k300
55301B7199p79M99M47L45Q26J057N00o27k096l278k962j041P34R69L55Jj94k96
55283B1659N90K398L154J685m88j640k298l387l951k863j083j04L25R62J259P13
55267A6931L89R87J088m88k194j926l33L91j15m91k30P0K96P49J067P95L70K41
55249A7597m1p83j339j394j616j963j096J243L090K995K080J787J502K38j093
$$ y = [29083, 29610, 29744, 28701, 26659, 25534, 26588, 28331, 28532, 27156, 25589, 24277, 23217, 23419, 25443, 27454, 27348, 26096, 26496, 29120, 31911, 33447, 34241, 35120, 36535, 39242, 43495, 47710, 49849, 50013, 49887, 50025, 49544, 48136, 46469, 44850, 43242, 42210, 42140, 41983, 40519, 38257, 36439, 34948, 33103, 31502, 30923, 30250, 27978, 25124, 24158, 25439, 27092, 27954, 28136, 27290, 25165, 23644, 25161, 28798, 30796, 29499, 27199, 26420, 26919, 27366, 27711, 28537, 29594, 30094, 29467, 27371, 24093, 21131, 20090, 20824, 21793, 22148, 22149, 21955, 21659, 22249, 24647, 27801, 29486, 28998, 27358, 25060, 21673, 17722, 14859, 13776, 13672, 13997, 14959, 16218, 16931, 17320, 18307, 19395, 18907, 16713, 14787, 14454, 14845, 14730, 14239, 14009, 14079, 14375, 15124, 16191, 16986, 17356, 17597, 17556, 16773, 15434, 14040, 12424, 10461, 9365, 10608, 13698, 16693, 18773, 20560, 22062, 22300, 21207]
55234B1207j118j48Q63J910K822K406M81j039r54o08j180j455n55k71j882l023
55218A7456j097K066K657N64j075r30l97l1J133K704K831J407M38O97O90n21j885
55201B6707k490k931l682l823k437j10J598J621J51j381j467k09O90L02j84N23
55185A2878J604J418P3r78j278j562j993j705j48K074L582L078N24k196k871j608
55169A0892n44n59k82R81J692Q54q8J88O08J05O2J917M119M213K475R38J07o94
55151B6984r62J61J585J460O3q81j067j485k088j941j098l14N12J664K273J675
55135B6541J039J580K319J837R83J286J928J132m35p14J02J9j161j786j532j617
55119C1521k022j451j02L22m50r12m82j27k22j45m5o41j306o89P90J426J014P81
$$ y = [21207, 20089, 19941, 20804, 22714, 25536, 27942, 28423, 27384, 26430, 25822, 24642, 23187, 22632, 22361, 20479, 17456, 16359, 18425, 21082, 21646, 20571, 19641, 19244, 19213, 20346, 23050, 25881, 27288, 27726, 28423, 29113, 28592, 26707, 24217, 21286, 17604, 13781, 11344, 11234, 12832, 14453, 14604, 13223, 11756, 11547, 12237, 12539, 12355, 12878, 14482, 15900, 15973, 14995, 13717, 12155, 10162, 8457, 8309, 10383, 13965, 17043, 17567, 15371, 12500, 10892, 10348, 9789, 9507, 10488, 12180, 13034, 12946, 13134, 13742, 13847, 13909, 15826, 19945, 24158, 26633, 27571, 27678, 26984, 26022, 26183, 27768, 29228, 29291, 28410, 27343, 25858, 23770, 21829, 20731, 20417, 20929, 22593, 24866, 26541, 27580, 29160, 31479, 33316, 34299, 35585, 37513, 38645, 38210, 37496, 37598, 37617, 36456, 34670, 33138, 31521, 29499, 28048, 27946, 28268, 27818, 26906, 26424, 26297, 26075, 25930, 25885, 25244, 23938, 23249, 24039, 25465, 26479, 27260]
55101B7260P70n1j293j527j045j370k045r56J773L389K562R49L2o73j407j146
55085B5222J32P95L79N51J953K677J393k79k32J122J924J434J76j098j502m74
55069C4173R60R53l47n42J514L760L823K093M88l02p24p88k20M91P20P89J382
55052D8223K367L049L155K899K548K305K135J533J93j113j320q35j168k637l804
55037E7530l571k417j071N35K182K677J382m76j027K81K449M011L834J793p25
55022F7387j717o21J042J411J08j860l204k973r29K060M382M877L535J105j479
55007G3124l312l761k735n47K240M627N458M535K925J578L53j013j820j418m46
54992G9788Mj29l52o59q87mK340M390M181K239O19p1p31j417j219l71k62j113
$$ y = [27260, 28030, 27979, 26686, 25159, 24114, 22744, 20699, 19743, 21516, 24905, 27467, 28416, 28448, 27775, 26368, 25222, 25354, 26149, 26528, 27079, 29032, 31709, 33102, 32823, 32591, 33713, 35637, 37071, 37247, 36149, 34647, 34173, 35133, 36086, 35739, 35197, 36711, 40471, 44294, 46387, 46875, 46573, 45849, 45061, 44841, 45332, 46052, 46841, 48223, 50590, 53639, 56794, 59693, 62241, 64546, 66681, 68214, 68407, 67294, 65974, 65139, 63971, 61334, 57530, 53959, 51542, 50471, 51006, 53188, 55865, 57247, 56771, 55744, 56025, 58474, 62485, 66319, 68112, 67387, 65670, 65049, 66091, 67502, 67610, 65750, 62546, 59573, 58644, 60704, 65086, 69963, 73498, 74603, 73124, 69812, 66051, 63316, 62769, 65009, 69636, 75094, 79629, 82554, 84132, 84485, 83472, 81652, 80234, 79788, 79792, 79663, 79311, 78652, 77765, 77761, 80101, 84491, 88672, 90911, 91530, 91459, 90728, 89311, 88092, 87721, 87459, 86346]
54974H6346j514o30P46J593J674J052M2m16L74J603J841Q55o24k342m141m884
54958H1575l638j484k11J45O50J143R16Q99K407M172L582Q26j153r83j61J65O21
54941H9471J378J383P75J112K403K617J141j39k70q65k924m668m256k338l60J411
54925H5871K586J751j253l964m164k501p98N69J991K979K988K612K497K259J619
54910I5042J271J428J060k91j407j261m75J68R72K040K503K304K852M535N520
54895A16261M559L096K886L360L218K952L733N193O322P313Q596R257Q472P425
54881A92643P775R123R902R955J0332J1148J1477J0940R945Q755P517O538N434
54868C11484K850j747o891j0864j3576j5514j6212j5244j3719j2987j2805j2180
$$ y = [86346, 84832, 84202, 84948, 86541, 88215, 89267, 89309, 88893, 89267, 90870, 92711, 93566, 92942, 90600, 86459, 81575, 77937, 76453, 76242, 76387, 77037, 78180, 79096, 79995, 82402, 86574, 90156, 90982, 89829, 88846, 88685, 88850, 89471, 90849, 92232, 93007, 94119, 96522, 99139, 100280, 100141, 99871, 99006, 96082, 91414, 87158, 84820, 84460, 85871, 88457, 90208, 88955, 84991, 80827, 78326, 77528, 78097, 80088, 83067, 86055, 88667, 91164, 93423, 95042, 96313, 97741, 98801, 98510, 97103, 95842, 95367, 95535, 96507, 98547, 101050, 103354, 106206, 110741, 116261, 120820, 123916, 126802, 130162, 133380, 136332, 140065, 145258, 151580, 158893, 167489, 176746, 185218, 192643, 200418, 209541, 219443, 229398, 239730, 250878, 262355, 273295, 283240, 291995, 299512, 306050, 311484, 314334, 312587, 305696, 294832, 281256, 265742, 249530, 234286, 220567, 207580, 194775, 182595]
54856A82595j1109r964q229n526k989j948j984j832j328q60K8J680K974K849K409
54841A46766L381N182N712M743M249N378P283R145J1394J4223J6451J6672J4723
54828B65302J1500P915M277L04m170q311j0806j1584j2052j2902j2978j1460r870
54815A95165j0134j1548j1661r869q209q304r240q993p005m649l544l664l303
54802I5042j256J243J841L30j020q73n36j146j299M84K568K072r12l452l758k763
54786H6565j861j279r19q93q24o6R83J084j07j653k718l190k945j862o23l48j121
54769F8223j867j793j042k9Q65J021Q8j136j397n75K80M52J63j85l52J64J879
54752F4759M305N967N720L683J022p31m95J514L806M949M619L250J466L17R58
$$ y = [182595, 171486, 161522, 153293, 147767, 144778, 142830, 140846, 139014, 137686, 136826, 136854, 138534, 141508, 144357, 146766, 150147, 155329, 161041, 165784, 170033, 175411, 182694, 191839, 203233, 217456, 233907, 250579, 265302, 276802, 284717, 288994, 289298, 285128, 276817, 266011, 254427, 242375, 229473, 216495, 205035, 195165, 185031, 173483, 161822, 151953, 143744, 135440, 126200, 117207, 110202, 105553, 102009, 98345, 95042, 93786, 95029, 96870, 97200, 96180, 95307, 94771, 93625, 92326, 92810, 95378, 97450, 96538, 93086, 89328, 86565, 84704, 83425, 82506, 81613, 80789, 80723, 81706, 82790, 82683, 81030, 78312, 75122, 72177, 70315, 69692, 69344, 68223, 66356, 64563, 63521, 63492, 64357, 65378, 65466, 64330, 62933, 62358, 62638, 63090, 63253, 63068, 62716, 62880, 64759, 69064, 75031, 80751, 84434, 85456, 84725, 84230, 85744, 89550, 94499, 99118, 102368, 103834, 104151, 105109]
54737A05109L104M782M729M236N153O903P236N630M167M836P383J0100J1702J2145
54723A97215J2310J3167J4711J5913J6067J5621J4990J3363R753M748K5l525o133
54710C18225q127r617j0804j1509j0836q552o254n702o307n880l719j508r10j821
54696B26679l266m686n700n696m428k500o89R00K730M982O983P697P115O918Q791
54681B45830J2042J4136J4054J3591J4450J5506J4484J1180P332L976P22k794
54669C64509o298r493j2042j3349j3484j3704j4842j5789j5038j3029j1358j0393
54657B15690r462q785r061r540q677o834o069o909p358n767l036j108o46r57j124
54642A30357o48K98R14O76J20j9k6m52p04J39J421J583N32l61o31j142k004k029
$$ y = [105109, 108213, 112995, 117724, 121960, 127113, 134016, 141252, 146882, 151049, 155885, 163268, 173368, 185070, 197215, 209525, 222692, 237403, 253316, 269383, 285004, 299994, 313357, 323110, 327858, 327883, 324358, 318225, 310098, 300481, 289677, 278168, 267332, 258780, 252526, 246824, 240517, 234637, 230918, 229410, 228500, 226679, 223413, 218727, 213027, 207331, 202903, 200403, 199714, 200614, 203344, 208326, 215309, 223006, 230121, 237039, 245830, 257872, 272008, 286062, 299653, 314103, 329609, 344093, 355273, 362605, 366581, 367303, 364509, 358211, 348718, 336676, 323327, 309843, 296139, 281297, 265508, 250470, 237441, 226083, 215690, 206228, 197443, 188382, 178842, 170165, 163331, 157262, 150353, 142995, 137228, 134192, 133084, 132438, 131481, 130357, 129709, 130007, 130921, 131597, 131717, 131698, 131672, 131220, 130516, 130655, 132076, 133659, 134191, 133830, 133199, 132057, 130053, 128024]
54624A28024q02N53J300K068L107L239J661n06j564j235l24O21J483J952J735
54609A41312J061N40P33J840L357M267M202M096M720N113L911J865J232K444L368
54594A84061K408O66Q5Q72J870K300K106J355K81n73q58o94k37M67J045J127J226
54577A97507K260M063N426N861O019O141N471L873K598K625L250L077J534j126
54563B48579m187o272o113m296l117l705m592m209l417l970n417n562l762j899
54549A88061j787l009l915l653k492q83Q75K247K597K000J428J598J826P05j974
54534A83624m643n690n074l732k228q77n08j644l271l758l105k874l831m997n437
54519A31955n548n866n772m449k397j000q80j477j997k237k501l011l437l044
$$ y = [128024, 127222, 127775, 129075, 131143, 134250, 137489, 139150, 138644, 137080, 135845, 135521, 136142, 137625, 139577, 141312, 142373, 142913, 143646, 145486, 148843, 153110, 157312, 161408, 166128, 171241, 175152, 177017, 178249, 180693, 184061, 186469, 187135, 187220, 188092, 189962, 192262, 194368, 195723, 196004, 195431, 194573, 193879, 193642, 194109, 195154, 196281, 197507, 199767, 203830, 209256, 215117, 221136, 227277, 232748, 236621, 239219, 241844, 245094, 248171, 249705, 248579, 244392, 238120, 232007, 227711, 224594, 220889, 216297, 212088, 208671, 204701, 199284, 193722, 189960, 188061, 186274, 183265, 179350, 175697, 173205, 172322, 173197, 175444, 178041, 180041, 181469, 183067, 184893, 185598, 183624, 178981, 173291, 168217, 164485, 162257, 161380, 160872, 159228, 155957, 152199, 149094, 146220, 142389, 137392, 131955, 126407, 120541, 114769, 110320, 107923, 106923, 106043, 104566, 102569, 100332, 97831, 94820, 91383, 88339]
54505H8339j558K03J037O97P7O5O83J386J614J077m0j069j443j252r17m82L23
54488H8740J517K732L366K681M08k325l528k576j012k87J97J522K965L043K167
54473I9610K048K839L012K101J355J349J064J7o27L7J205J847K288L242M359M688
54457A30434L836K019k38k052k687k435k167j826o80Q05Q79j023l254m080l565
54442A13966k545j169M29J230M73j009j684j002M79J973K580J520q36k733k812
54427A08860j649p12m17j67J70j2q74j621j394k20J128J955K172K132K164K331
54411A13846K534K508J837O17n8P66K087J744k60j022J231M012L702O76j347n65
54395A32308J031J197J21r70j617j603o12P99J336Q54N30P83P28R7j92J1m66j966
$$ y = [88339, 86781, 86984, 88021, 88718, 88795, 88860, 89543, 90929, 92543, 93620, 93580, 92511, 91068, 89816, 88899, 88417, 88740, 90257, 92989, 96355, 99036, 99444, 97119, 93591, 91015, 90003, 89716, 89913, 91435, 94400, 97443, 99610, 101658, 104497, 107509, 109610, 110965, 112314, 113378, 113395, 112768, 112805, 114010, 115857, 118145, 121387, 125746, 130434, 134270, 136289, 136051, 133999, 131312, 128877, 126710, 124884, 124204, 125009, 125888, 124865, 121611, 117531, 113966, 111421, 110252, 110681, 111911, 112384, 111375, 109691, 108689, 109168, 111141, 113721, 115241, 114405, 111672, 108860, 107211, 106499, 106082, 105915, 106085, 106073, 105199, 103578, 102184, 101964, 103092, 105047, 107219, 109351, 111515, 113846, 116380, 118888, 120725, 121342, 121284, 122050, 124137, 125881, 125621, 124599, 125830, 129842, 133544, 134220, 132873, 132308, 133339, 134536, 134657, 133687, 132070, 130467, 129855, 130654, 131990, 132844, 133374, 134157, 134885, 134982, 134790, 134801, 134335, 132369]
54377A32369l177l237k846k494j563j51K39j006k422k702k333j939j005M65J085
54362A09283L51q8Q59J657P26o67l58J281K190J901J689K066K276J985J684J549
54346A28384J284R22P10N25L74Q63K316M058N334O139O472N847M445L466L444
54331A74583L420K754K260K560K918K946L656N240N586L081n32k229j504k04K86
54316B04821k85j988m184n011l568j733j824l403m536n064o035o740n310k153
54302A52987j15q10k954m533m722l472j109J271K441K283J394l4j680k276r99
54287A37672R33J903K329L540N103N571N145M973M465K193p39j428N15K356K517
54272A77048K394L076L273J918L12j20j35r73k044k119j532j590k629l900m647
$$ y = [132369, 129192, 125955, 123109, 120615, 119052, 118901, 119140, 118134, 115712, 113010, 110677, 108738, 107733, 108198, 109283, 109634, 109546, 110405, 112062, 112788, 112121, 111763, 113044, 115234, 117135, 118824, 120890, 123166, 125151, 126835, 128384, 129668, 130590, 131300, 131825, 132199, 133062, 135378, 139436, 144770, 150909, 157381, 163228, 167673, 171139, 174583, 178003, 180757, 183017, 185577, 188495, 191441, 195097, 200337, 205923, 209004, 208472, 206243, 204739, 204535, 204821, 204536, 202548, 198364, 193353, 189785, 188052, 186228, 182825, 178289, 173225, 167190, 160450, 155140, 152987, 152872, 152062, 149108, 144575, 139853, 136381, 135272, 136543, 138984, 141267, 142661, 142627, 140947, 138671, 137672, 138605, 140508, 142837, 146377, 151480, 157051, 162196, 167169, 171634, 173827, 173088, 171660, 172175, 174531, 177048, 179442, 182518, 185791, 187709, 188021, 187901, 187766, 186793, 184749, 182630, 181098, 179508, 176879, 172979, 168332]
54257A68332m498l623l179m433o793p907o551m229l084l387l910l625k151L05
54243A11267K546K971J550J33n0J7r10k159k382j907k075k843k852j787r99j431
54227I9089k269k245j372o92p90j174j082l69M74R62J009Q34P32Q73J030O07o21
54210I4996j780j712o81k67j117j822r60P58J527R55J03l71o35n74J86J192J501
54193I1299J245J577K902M278M663L768J770o31k017j512k19m6j142j972j904
54178A02059j817j894q67J666L974M324L042J425q1j404j897j237m79p34j414
54163A04666j048M82J783J865J197Q06J040J459J397P56K50O81J784K323J569
54148A21010K21n14k98L42Q88J132Q82m8j424k493k456j165O08J750J864J516
$$ y = [168332, 163834, 160211, 157032, 152599, 145806, 137899, 131348, 127119, 124035, 120648, 116738, 113113, 110962, 111267, 113813, 116784, 118334, 118467, 118417, 118434, 117524, 115365, 112983, 111076, 109001, 106158, 103306, 101519, 100520, 99089, 96820, 94575, 93203, 92511, 91721, 90547, 89465, 89096, 89570, 90532, 91541, 92375, 93107, 93980, 95010, 95617, 94996, 93216, 91504, 90823, 90556, 89439, 87617, 86657, 87415, 88942, 89897, 90000, 89629, 88994, 88420, 88606, 89798, 91299, 92544, 94121, 97023, 101301, 105964, 109732, 111502, 110871, 108854, 107342, 107123, 107077, 105935, 103963, 102059, 100242, 98348, 97481, 99147, 103121, 107445, 110487, 111912, 111831, 110427, 108530, 107293, 106814, 106080, 104666, 103618, 104100, 105883, 107748, 108945, 109751, 110791, 112250, 113647, 114403, 114653, 115334, 117118, 119441, 121010, 121231, 120717, 120419, 120761, 121649, 122781, 123663, 123615, 122191, 119698, 117242, 116077, 116685, 118435, 120299, 121815]
54132A21815J248Q50L4p78j148j630k997m616m741k768j82J051M75p56j238n56
54116A04063M29M76n65j548j599j285j362j187K57K202K672J264k12l16L19M56
54100A04064J64L12J098J914K171J702Q19J97J40j30j512l261l319j011J647K165
54084A07160L53j818k638k082j090k82M48J245J592O67j342k883k725j548r95
54069I4062j394j566q16R4L24J14J93O84J151J175O27k29q33q95q24r75r17j85
54051H9790N50J87j036j630q46M30J092J122J209J670K103J769L94j096j195K45
54035I4758J452R87l01p65m79n82q44O8K090L588L716L122K253P97r02j743j517
54018A05698j003l61Q15J810J250m37j325j070j344k552k730q03J424J984J446
$$ y = [121815, 123063, 123913, 123947, 123169, 122021, 120391, 117394, 112778, 108037, 105269, 105087, 106138, 106613, 105857, 104619, 104063, 104492, 104968, 104403, 102855, 101256, 99971, 98609, 97422, 97679, 99881, 102553, 103817, 103605, 103289, 103608, 104064, 104228, 104540, 105638, 107552, 109723, 111425, 112244, 112441, 112581, 112451, 110939, 107678, 104359, 103348, 104995, 107160, 107513, 105695, 103057, 100975, 99885, 99603, 100051, 101296, 102888, 103555, 102213, 99330, 96605, 95057, 94062, 92668, 91102, 90286, 90380, 90704, 90818, 91011, 91695, 92846, 94021, 94648, 94419, 93586, 92691, 91867, 90892, 89975, 89790, 90340, 90527, 89491, 87861, 87015, 87445, 88537, 89659, 90868, 92538, 94641, 96410, 96804, 95708, 94513, 94758, 96210, 97197, 96896, 96131, 95652, 95070, 94226, 94294, 96384, 99972, 103688, 106810, 109063, 109860, 108958, 107215, 105698, 104695, 104334, 105149, 106959, 108209, 107772, 106447, 105377, 104033, 101481, 98751, 97948, 99372, 101356, 102802]
54003A02802J306J533J419J329J922K756K990K505J464N9n91R15L726M846L007
53988A31988N33q6O33J072J379K222K707K022J571K780M243L885K764L578O103
53973A67394P423O548N644O235P089O825O180O498P718R042J0255J1422J2263
53960B70536J2566J2449J1783J0267Q397P322P271P037N497L057J025J72K26M25
53946C58030K57l05j152k463m268n639n268l355j950k535m155n026n142n839p219
53931C03971p693o273l965k456k324k940l465l544l387l431l851m380m622m305
53917B47335l298j902j009j247j887j662p07m28j043r41P84K637K879K031J699
53902B43241K030J939J134K56k77k70P94K685L553J844j228k857k107o37j06m45
$$ y = [102802, 104108, 105641, 107060, 108389, 110311, 113067, 116057, 118562, 120026, 120085, 119494, 120409, 124135, 128981, 131988, 132521, 132435, 133068, 134140, 135519, 137741, 140448, 142470, 144041, 146821, 151064, 154949, 157713, 161291, 167394, 174817, 181365, 187009, 193244, 200333, 207158, 213338, 219836, 227554, 236596, 246851, 258273, 270536, 283102, 295551, 307334, 317601, 325998, 333320, 340591, 347628, 353125, 356182, 357207, 357379, 357605, 358030, 358287, 357982, 356830, 354367, 350099, 344460, 339192, 335837, 333887, 331352, 327197, 322171, 317029, 311190, 303971, 296278, 290005, 286040, 283584, 281260, 278320, 274855, 271311, 267924, 264493, 260642, 256262, 251640, 247335, 244037, 242135, 241126, 239879, 237992, 236330, 235623, 235195, 234152, 233211, 233995, 236632, 239511, 241542, 243241, 245271, 247210, 248344, 248600, 248323, 248053, 248847, 251532, 255085, 256929, 255701, 252844, 250737, 250100, 249994, 249549]
53886B49549p99p12j07P59J244J088J069J922K944K911K130K116L362M787N514
53871B77777N867O400P093P750Q296Q462P902O714N194L397J614P32J150J922
53857C50270K097K333L773N829O729O048N052M671M686M952N698O460O358N775
53843D20731O180P890R460R769R195Q168O240L450J251P88J175O03j289l121l590
53828D76900k901k427l245m972o112n850n103n278o366p297p777q571r946j1099
53814C89956j1444j1407j1458j1271j0391q999p589o359n264m312l719l971n496
53801B88276p717q965q244o637n914o037n513l973k832l062l798l811l086k276
53787B16411j638j297j599k481l158l202l273m094n219n500m512k967j850j522
$$ y = [249549, 248750, 248038, 247931, 248690, 249934, 251022, 252091, 254013, 256957, 259868, 261998, 264114, 267476, 272263, 277777, 283644, 290044, 297137, 304887, 313183, 321645, 329547, 336261, 341455, 344852, 346466, 347198, 348348, 350270, 352367, 354700, 358473, 364302, 371031, 377079, 382131, 386802, 391488, 396440, 402138, 408598, 414956, 420731, 426911, 434801, 444261, 454030, 463225, 471393, 477633, 481083, 482334, 483122, 484297, 484900, 483611, 480490, 476900, 473999, 471572, 468327, 463355, 457243, 451393, 446290, 441012, 434646, 427349, 419572, 411001, 401055, 389956, 378512, 367105, 355647, 344376, 333985, 324986, 317397, 311038, 305774, 301462, 297743, 293772, 288276, 280559, 271594, 263350, 256713, 250799, 244762, 239249, 235276, 232444, 229382, 225584, 221773, 218687, 216411, 214773, 213476, 211877, 209396, 206238, 203036, 199763, 195669, 190450, 184950, 180438, 177471, 175621, 174099]
53773A74099j646j767j927k460l056k589n23J922K901K114R58N17M02p6n47j29
53757A68193J116J997J621N93L39J144J535L13j262p05K295N253O172N701N242
53742A99547M650L392K412K865M099M779N106N998O946O880O403O936Q119Q459
53728B76591Q039Q035Q001O475M188L560M628M692K816J502K513M038L835K623
53714C41536K179K181J374K16K6M40r8j925l833m663m066k433j103j614l603m703
53698C19911l612k009j988k976l031k031j470j749j859j476j443j975k063j057
53684B91172K60N36q56l311n217n107l281j756j830k442j892m33K65l49j237j616
53668B62906j864k359k785k858k808k767k426j589o14j32o05j969l374l539k068
$$ y = [174099, 172453, 170686, 168759, 166299, 163243, 160654, 160131, 162053, 164954, 167068, 168026, 168543, 168945, 168869, 168322, 168193, 169309, 171306, 172927, 173520, 173859, 175003, 176538, 176851, 175589, 174884, 177179, 182432, 188604, 194305, 199547, 204197, 207589, 210001, 212866, 216965, 221744, 226850, 232848, 239794, 246674, 253077, 260013, 268132, 276591, 284630, 292665, 300666, 307141, 311329, 314889, 319517, 324209, 327025, 328527, 331040, 335078, 338913, 341536, 343715, 345896, 347270, 347486, 347512, 347952, 347854, 345929, 342096, 337433, 333367, 330934, 329831, 328217, 324614, 319911, 316299, 314290, 312302, 309326, 306295, 304264, 302794, 301045, 299186, 297710, 296267, 294292, 292229, 291172, 291432, 291968, 291112, 287801, 282584, 277477, 274196, 272440, 270610, 268168, 266276, 265843, 266108, 265759, 264522, 262906, 261042, 258683, 255898, 253040, 250232, 247465, 245039, 243450, 242836, 242704, 242099, 240130, 236756, 233217, 231149]
53653B31149r1R05P35N07J201K757M322M944M347L351L233M344N750O514O522
53638B80490N819M258K532K358M328O541O802N624N386O845Q206P774N970M239
53624C57172L329L258L908M873N323M716L243J331q19k775l692l156j910j130
53610C73671j109j074l10Q90J516Q79p29k353l220l264k928k632k523k508k417
53595C51889k189j974j996k298k651k724k283j434o58l85l70K9Q20J239J059J232
53579C37306K405L522L225K125K055L158L544K295R26R29J341L80j509k010l8
53564C59654K880M466M010K582J633J786K670L658M490N020M744L394J921J990
53550D04898M058O683Q190Q324P929P684P648P544O921N682M752N497P903J0056
$$ y = [231149, 231058, 231963, 232698, 233205, 234406, 237163, 241485, 246429, 250776, 254127, 257360, 261704, 267454, 273968, 280490, 286309, 290567, 293099, 295457, 299785, 306326, 313128, 318752, 324138, 330983, 339189, 346963, 352933, 357172, 360501, 363759, 367667, 372540, 377863, 382579, 385822, 387153, 386334, 383559, 379867, 376711, 374801, 373671, 372562, 371488, 371178, 372068, 373584, 374463, 373734, 371381, 368161, 364897, 361969, 359337, 356814, 354306, 351889, 349700, 347726, 345730, 343432, 340781, 338057, 335774, 334340, 333682, 333297, 332927, 332956, 333776, 335015, 336074, 337306, 339711, 343233, 346458, 348583, 350638, 353796, 357340, 359635, 360561, 361490, 362831, 363211, 361702, 359692, 359654, 362534, 367000, 371010, 373592, 375225, 377011, 379681, 383339, 387829, 392849, 397593, 400987, 402908, 404898, 408956, 415639, 423829, 432153, 440082, 447766, 455414, 462958, 469879, 475561, 480313, 485810, 493713, 503769]
53536E03769J0192Q675P220O691O507N917M986M404M817O305Q068Q909Q289O788
53522F01537N323M297L679L434L442L382L069K572J973J346J058J484K235K319
53508F41150J317p0q06l89R47K335K738K144K101L923O483P237N561L525K962
53493F81158L379L431K954K572K486K727L534M625N133M959N000N390M959L414
53479G35721K493L547N464O461O649P085P481O909O045O513Q328R858J0272J0279
53465H33105J0439J0353R907J0045J1717J4718J7790J9582J9779J9602K0556K2313
53453A019906K2841K1381K0021K1055K3988K6708K8673L0958L3656L5409L5575
53442A320171L5190L5425L6378L7616L8869L9974M1021M2506M4601M6571M7668
$$ y = [503769, 513961, 522636, 529856, 536547, 543054, 548971, 553957, 558361, 563178, 569483, 577551, 586460, 594749, 601537, 606860, 611157, 614836, 618270, 621712, 625094, 628163, 630735, 632708, 634054, 635112, 636596, 638831, 641150, 642467, 642397, 641591, 641202, 642149, 644484, 647222, 649366, 651467, 655390, 661873, 669110, 674671, 678196, 681158, 684537, 687968, 690922, 693494, 695980, 698707, 702241, 706866, 711999, 716958, 721958, 727348, 732307, 735721, 738214, 741761, 747225, 753686, 760335, 767420, 774901, 781810, 787855, 794368, 802696, 812554, 822826, 833105, 843544, 853897, 863804, 873849, 885566, 900284, 918074, 937656, 957435, 977037, 997593, 1019906, 1042747, 1064128, 1084149, 1105204, 1129192, 1155900, 1184573, 1215531, 1249187, 1284596, 1320171, 1355361, 1390786, 1427164, 1464780, 1503649, 1543623, 1584644, 1627150, 1671751, 1718322, 1765990]
53431A765990M8090M8213M7741M6766M6649M8110M9243M7578M3833M1364M1819
53420B275396M3432M3974M3316M2304M1005L9357L8168L8122L8492L7901L6030
53409B717497L3884L2608L2367L2128L0496K7136K3333K0663J9305J8160J6339
53398C003916J3858J1078Q296N653K811r49n599r924j3106j6067j9941k3864k5940
53385B930222k6061k6143k7505k9601l1538l3220l4570l5130l5034l5236l6171
53374B580013l7150l7593l7883l8453l8790l7930l5471l1845k8004k4848k2517
53363B209529k0294j7670j5159j3423j2066j0253q050o084m247j931P32L021M921
53350B109026P040R500J2008J4723J7809K0531K2254K4022K7506L2420L6666L9066
$$ y = [1765990, 1814080, 1862293, 1910034, 1956800, 2003449, 2051559, 2100802, 2148380, 2192213, 2233577, 2275396, 2318828, 2362802, 2406118, 2448422, 2489427, 2528784, 2566952, 2605074, 2643566, 2681467, 2717497, 2751381, 2783989, 2816356, 2848484, 2878980, 2906116, 2929449, 2950112, 2969417, 2987577, 3003916, 3017774, 3028852, 3037148, 3042801, 3045612, 3044663, 3039064, 3029140, 3016034, 2999967, 2980026, 2956162, 2930222, 2904161, 2878018, 2850513, 2820912, 2789374, 2756154, 2721584, 2686454, 2651420, 2616184, 2580013, 2542863, 2505270, 2467387, 2428934, 2390144, 2352214, 2316743, 2284898, 2256894, 2232046, 2209529, 2189235, 2171565, 2156406, 2142983, 2130917, 2120664, 2112614, 2106530, 2102283, 2100352, 2101084, 2104105, 2109026, 2116066, 2125566, 2137574, 2152297, 2170106, 2190637, 2212891, 2236913, 2264419, 2296839, 2333505, 2372571]
53338B372571M0373M1447M2264M3107M5036M8528N2778N6833O0361O3232O5431
53327B931961O7597P0425P3564P6292P8944Q2203Q5305Q6793Q6941Q7389Q8282
53316C815696Q8038Q6251Q4640Q4448Q4960Q5141Q4655Q2678P8115P1924O6838
53305D713384O3501N9250N2253M4506L8737L4331K8735K1441J4040P237K01p452
53293E070164j5037k2147k9027l5609m1390m6270n0624n4695n8598o2629o6972
53282D587166p1398p5644p9385q1649q1284p8571p5343p2987p1359p0154o9780
53271C759612p0056o9518o7269o4336o2086o0448n8858n7718n7443n7117n5499
53260C079264n2677m9514m6260m2816l9454l6106l2118k7900k5677k6858k9652
$$ y = [2372571, 2412944, 2454391, 2496655, 2539762, 2584798, 2633326, 2686104, 2742937, 2803298, 2866530, 2931961, 2999558, 3069983, 3143547, 3219839, 3298783, 3380986, 3466291, 3553084, 3640025, 3727414, 3815696, 3903734, 3989985, 4074625, 4159073, 4244033, 4329174, 4413829, 4496507, 4574622, 4646546, 4713384, 4776885, 4836135, 4888388, 4932894, 4971631, 5005962, 5034697, 5056138, 5070178, 5077415, 5077616, 5070164, 5055127, 5032980, 5003953, 4968344, 4926954, 4880684, 4830060, 4775365, 4716767, 4654138, 4587166, 4515768, 4440124, 4360739, 4279090, 4197806, 4119235, 4043892, 3970905, 3899546, 3829392, 3759612, 3689556, 3620038, 3552769, 3488433, 3426347, 3365899, 3307041, 3249323, 3191880, 3134763, 3079264, 3026587, 2977073, 2930813, 2887997, 2848543, 2812437, 2780319, 2752419, 2726742, 2699884, 2670232]
53249B670232l1044l0344k9061k7978k6413k4030k1392j8602j5136j1305q465
53238B426462p271o798n709l581q88J760M177O638R249J1298J2007J2030J3067
53225B472441J5737J9036K2411K6564L1294L4507L4993L4518L5308L6884L7525
53214B801218L7473L8022L8525L7180L4485L2826L2455L0682K5848J9707J4746
53203C143167J1121P550L702L85j909l578n428q032j1143j3820j5638j7536k0557
53190C068284k4252k7417k9957l2482l4429l4546l3315l3039l4975l7988m0580
53179B705304m2521m3756m3340m0842l7739l6165l6639l7850l8171l6913l4591
53168B276777l2406l1119l0248k8836k7001k5810k5626k5576k4920k3971k3191
$$ y = [2670232, 2639188, 2608844, 2579783, 2551805, 2525392, 2501362, 2479970, 2461368, 2446232, 2434927, 2426462, 2419191, 2412393, 2406684, 2403103, 2402215, 2403975, 2408152, 2414790, 2424039, 2435337, 2447344, 2459374, 2472441, 2488178, 2507214, 2529625, 2556189, 2587483, 2621990, 2656983, 2691501, 2726809, 2763693, 2801218, 2838691, 2876713, 2915238, 2952418, 2986903, 3019729, 3052184, 3082866, 3108714, 3128421, 3143167, 3154288, 3161838, 3165540, 3165925, 3164016, 3160438, 3155010, 3146978, 3135835, 3122015, 3106377, 3088841, 3068284, 3044032, 3016615, 2986658, 2954176, 2919747, 2885201, 2851886, 2818847, 2783872, 2745884, 2705304, 2662783, 2619027, 2575687, 2534845, 2497106, 2460941, 2424302, 2386452, 2348281, 2311368, 2276777, 2244371, 2213252, 2183004, 2154168, 2127167, 2101357, 2075731, 2050155, 2025235, 2001264, 1978073]
53157A978073k2363k1163j9850j8803j8018j7461j7403j8005j9023k0090k0863
53146A765031k0918k0329k0233k1892k4944k7432k7913k6785k5312k4263k3815
53135A501195k3967k4422k4638k4352k3776k3254k3271k4534k7131k9709l0556
53124A221585k9668k8667k8530k8552k7868k6732k5722k4840k4040k3702k3862
53113I29402k3782k2998k1985k1190k0314j9201j8498j8497j8183j6523j4186
53102G14045j2821j2942j3549j3627j3154j2499j1752j0918j0345j0560j1578
53091E80300j2539j2320j0830r380r212r869r849q785p847p820p972p406o365
53078D60106n448m517l511l329m607o038n509k921n53k85j496k380k495k961m399
$$ y = [1978073, 1955710, 1934547, 1914697, 1895894, 1877876, 1860415, 1843012, 1825007, 1805984, 1785894, 1765031, 1744113, 1723784, 1703551, 1681659, 1656715, 1629283, 1601370, 1574585, 1549273, 1525010, 1501195, 1477228, 1452806, 1428168, 1403816, 1380040, 1356786, 1333515, 1308981, 1281850, 1252141, 1221585, 1191917, 1163250, 1134720, 1106168, 1078300, 1051568, 1025846, 1001006, 976966, 953264, 929402, 905620, 882622, 860637, 839447, 819133, 799932, 781434, 762937, 744754, 728231, 714045, 701224, 688282, 674733, 661106, 647952, 635453, 623701, 612783, 602438, 591878, 580300, 567761, 555441, 544611, 535231, 526019, 516150, 506301, 497516, 489669, 481849, 473877, 466471, 460106, 454658, 450141, 446630, 443301, 438694, 432656, 427147, 424226, 423673, 423388, 421892, 419512, 417017, 414056, 409657]
53063D09657n652n176l198j630j774k934l759m109m606m924m005k076q34j113
53049C63867j681j190k66m32j779l050l587l837l905k989p24J710K667J837N72
53034C47213K76R01J270P98L37R41K229K942K892L180M160M513L257J491Q14P22
53018C77936p48l885o392o136l655j253m68j170k539l923m886n254n313n517n831
53003C20966n661m669l365k551k278j825r16m39j463l712n640o089n326m315l525
52988B69192k845k298k115k217k094j490j031j766l830n663n156k017J493K892
52974B41055K140J109O82j07j776k938k243n83O1o76j475j541j354j366j349j319
52958B28320j719k343k253j283m89n56p02O6J577K966L796L896K997J348k1o15
$$ y = [409657, 404005, 398829, 395631, 394001, 392227, 389293, 385534, 381425, 376819, 371895, 367890, 365814, 364980, 363867, 362186, 360996, 360730, 360298, 358519, 355469, 351882, 348045, 344140, 341151, 340427, 342137, 344804, 346641, 347213, 347489, 348390, 349660, 350458, 350795, 351736, 353965, 356907, 359799, 362979, 367139, 371652, 374909, 376400, 377214, 377936, 377188, 373303, 366911, 360775, 357120, 355867, 355399, 354229, 351690, 347767, 342881, 337627, 332314, 326797, 320966, 315305, 310636, 307271, 304720, 302442, 300617, 299701, 299262, 297799, 294087, 288447, 282358, 277032, 272717, 269192, 266347, 264049, 261934, 259717, 257623, 256133, 255102, 253336, 249506, 243843, 238687, 236670, 238163, 241055, 243195, 244304, 244986, 244879, 243103, 240165, 237922, 237339, 237400, 236724, 235249, 233708, 232354, 230988, 229639, 228320, 226601, 224258, 222005, 220722, 220233, 219677, 218975, 219041, 220618, 223584, 227380, 231276, 234273, 235621, 235600, 234985]
52942B34985j253k556l503k858j280l92j94P31K579L907M024L819L663K638P61
52927B45071j79N69R91n92k437j865L21Q58j002k604k251j475j859k250r59J204
52911B31541K188J775J463J881K262K154J959J766J084O8j64J075K989M069L558
52896B59668K130J301K066L763M574L635K224K182L592M860N046M919N415O040
52882C11415N638M252L377M202O161P525P230N659L776K143J062J039K168L337
52868C68984K978Q57j547k656k169q49L44P27K59l61o50j239k773m117l333q79
52852C53576J27k023m930n096k467m9J89q66j651j926k233k626k523j345P79K652
52836C29588K837J395J38M04J368J508Q21L31J54l40r30p57J34R35J546K439L307
$$ y = [234985, 233732, 231176, 227673, 224815, 223535, 223143, 222949, 223680, 226259, 230166, 234190, 238009, 241672, 244310, 245071, 244892, 245461, 246452, 245860, 243423, 241558, 241879, 242737, 241735, 239131, 236880, 235405, 233546, 231296, 230337, 231541, 233729, 235504, 236967, 238848, 241110, 243264, 245223, 246989, 248073, 248141, 247977, 249052, 252041, 256110, 259668, 261798, 263099, 265165, 268928, 273502, 277137, 279361, 281543, 285135, 289995, 295041, 299960, 305375, 311415, 317053, 321305, 324682, 328884, 335045, 342570, 349800, 355459, 359235, 361378, 362440, 363479, 365647, 368984, 371962, 372819, 371272, 368616, 366447, 365598, 365942, 366669, 366928, 366567, 365917, 364678, 361905, 357788, 354455, 353576, 353703, 351680, 346750, 341654, 339187, 339138, 339327, 338461, 336810, 334884, 332651, 330025, 327502, 326157, 326936, 329588, 332425, 333820, 333958, 334362, 335730, 337238, 338059, 338390, 338544, 338204, 337274, 336517, 336651, 337586, 339132, 341571, 344878]
52819C44878L301K553J888J310K72p13n85K27J10j224k361k486k157j556%K177
52803C45634L248K492J249P98Q14P52R85J442R70p12j946j415j35K33j88k11L86
52786C54396J030J607K127K000J106P27J953L855M658M124L330K682J730N48j99
52771C85674n18j062j911k375j994q37R39K901M074L862L053K872L269L160K223
52756D03330J343J286J744J913J338J22j220k202k928l864m885n194m633m298
52742C81852n024o110o426n993n484m935m198l937m687n462m924l650l577n126
52728C12319o446n947m198k896k938l969n027n191m230k859j849j161n46n62j769
52713B62731l207l236j897j000j487k278k325k171k481k448j206R0o68l499n842
$$ y = [344878, 348179, 350732, 352620, 353930, 354202, 353489, 352904, 353131, 353241, 352017, 349656, 347170, 345013, 343457, 343457, 345634, 348882, 351374, 352623, 353421, 354235, 354987, 355972, 357414, 358384, 357672, 355726, 354311, 354176, 354409, 354221, 354010, 354396, 355426, 357033, 359160, 361160, 362266, 362993, 364946, 368801, 373459, 377583, 380913, 383595, 385325, 385873, 385674, 385156, 384094, 382183, 379808, 377814, 376977, 377916, 380817, 384891, 388753, 391806, 394678, 397947, 401107, 403330, 404673, 405959, 407703, 409616, 410954, 411076, 409856, 407654, 404726, 400862, 395977, 390783, 386150, 381852, 376828, 370718, 364292, 358299, 352815, 347880, 343682, 339745, 335058, 329596, 324672, 321022, 317445, 312319, 305873, 299926, 295728, 292832, 289894, 285925, 280898, 275707, 271477, 268618, 266769, 265608, 265062, 264500, 262731, 259524, 256288, 254391, 253391, 251904, 249626, 247301, 245130, 242649, 240201, 238995, 239085, 238417, 234918, 229076]
52698B29076n505l111j092r16j924k649k508j941j367p35k14n75k231m314n398
52683A94596n038l908k592j148N6P4j462l553m954n571o120o635o206m367k056
52668A41116o78n04m95K51J341J605O07p95j329n42Q78J805J727J225J293J999
52652A49504K218J089o33j439j016m50n71j165j865k586k783j684J06N69j100
52637A38194l019k978j282J63P18J258K142K729K789K759K486J335k39p45K77
52622A46587J497J706J260J105J353J599J751J876J895J995K646L783M627M812
52608A78492M918N364N558M825L472K182R51m76j594j651j002j088k749n210o780
52593A85212o327m106j609m63j061k169k232j135k78p94k119k682j904r71j376
$$ y = [229076, 223571, 220460, 219368, 218452, 216528, 213879, 211371, 209430, 208063, 207328, 207114, 206539, 204308, 199994, 194596, 189558, 185650, 183058, 181910, 181966, 182040, 180578, 177025, 172071, 166500, 160380, 153745, 147539, 143172, 141116, 140438, 139934, 139439, 139690, 141031, 142636, 143243, 142448, 141119, 140577, 141455, 143260, 144987, 146212, 147505, 149504, 151722, 152811, 152178, 150739, 149723, 149273, 148702, 147537, 145672, 143086, 140303, 138619, 138725, 139294, 138194, 135175, 132197, 130915, 131078, 131796, 133054, 135196, 137925, 140714, 143473, 145959, 147294, 147055, 146310, 146587, 148084, 149790, 151050, 152155, 153508, 155107, 156858, 158734, 160629, 162624, 165270, 169053, 173680, 178492, 183410, 188774, 194332, 199157, 202629, 204811, 205762, 205286, 203692, 202041, 201039, 199951, 197202, 191992, 185212, 178885, 174779, 173170, 172707, 171646, 169477, 167245, 166110, 165832, 165038, 162919, 160237, 158333, 157362, 155986]
52578A55986k995m110l459j710n11m94q14n60R3L76O7j63N37K214L790L860K236
52561A54343N08M57J929K949K163L72p95j016j238j888k195j451j98L47k86j358
52545A52643j728r60L14R34L82n20l76J077K435K338J233O91J133J337M31p53
52529A60611j018m83L1N02J361K253K533K644L497M633M576L200K006J739J427
52514A89512N52K84J397K493J941M44m6Q25J751K087K541L551M417M258K956J197
52498B20160J43N97J805J875L56n90J006L804M727L139J344J034J399J192O88
52483B42679P58J511K654L888M389L208R87j09R57K696L120K130R99N64J011K363
52467B73805L975M285K461o3r70J87J645J719N88l07J35J745L272L368J733o50
$$ y = [155986, 152991, 148881, 145422, 143712, 143201, 142707, 141893, 141333, 141426, 141802, 141869, 141706, 142243, 144457, 148247, 152107, 154343, 154851, 155308, 157237, 160186, 162349, 162721, 161926, 160910, 159672, 157784, 155589, 154138, 153940, 154287, 154001, 152643, 150915, 149955, 150269, 151203, 151585, 151065, 150689, 151766, 154201, 156539, 157772, 158463, 159596, 160933, 161364, 160611, 159593, 159110, 159141, 159643, 161004, 163257, 165790, 168434, 171931, 176564, 181140, 184340, 186346, 188085, 189512, 190064, 190348, 191745, 194238, 196179, 196623, 196577, 197402, 199153, 201240, 203781, 207332, 211749, 216007, 218963, 220160, 220303, 220900, 222705, 224580, 224936, 224346, 225352, 229156, 233883, 237022, 238366, 239400, 240799, 241991, 242679, 243437, 244948, 247602, 251490, 255879, 259087, 260074, 259965, 260922, 263618, 266738, 268868, 269867, 270431, 271442, 273805, 277780, 282065, 284526, 284463, 283493, 283680, 285325, 287044, 287632, 287325, 287460, 289205, 292477, 295845, 297578, 296928]
52451B96928k499l200k857j872q76n61j082j790j880j130Q3J129J298K18j563
52436B80346k842k962k339j626q95r9L22l5p67j066p48l07j06m4J01M94J386K896
52418B71709M609N669N479M209K496Q95k34m78N78K612M167L752J600l23m94O06
52402C06852J684K526L657M714M591L141J461L11n40j290j699j975k749l495k435
52387C14754J030M785N989M035P14j862k597j444O83K275K413J554N78m34j685
52372C30788k484j781J65J808K160J780J625J715J473Q20K15j75p08j501j930
52357C33970j319P3J304J949K471L118L246K408J366J111J307R46K76O58K318
52342C55202L645L358K059Q86k34j823l211l022j139R43J845J639J296J314J190
$$ y = [296928, 294429, 291229, 288372, 286500, 285624, 285063, 283981, 282191, 280311, 279181, 279264, 280393, 281691, 281909, 280346, 277504, 274542, 272203, 270577, 269682, 269583, 269905, 269870, 269103, 268037, 267289, 266982, 266876, 266832, 266933, 267427, 268813, 271709, 276318, 281987, 287466, 291675, 294171, 295066, 294832, 294354, 294932, 297544, 301711, 305463, 307063, 306740, 306246, 306852, 308536, 311062, 314719, 319433, 324024, 327165, 328626, 328937, 328397, 327107, 325408, 323433, 320684, 317189, 314754, 315784, 320569, 326558, 330593, 331307, 329445, 326848, 325404, 326087, 328362, 330775, 332329, 332907, 332473, 330788, 328304, 326523, 326688, 328496, 330656, 332436, 334061, 335776, 337249, 338069, 338284, 338109, 337401, 335900, 333970, 332651, 332724, 334028, 335977, 338448, 341566, 344812, 347220, 348586, 349697, 351004, 351950, 352226, 352884, 355202, 358847, 362205, 364264, 365150, 364916, 363093, 359882, 356860, 355721, 356664, 358509, 360148, 361444, 362758, 363948]
52327C63948K63j096j535l17J535K363J883J130N98l34j835k830k322o37J152
52312C61966K201K008O89m80m7J552K223J180J26N94J769K333K785M148N597N557
52296C94201M244L135K685K549L331N657P938P818N847N088O602Q000P386O047
52282D70528N820O159N814N480O472P962P953O374N021M659M316L563L530M999
52268E48650O988Q015P792P019O342O141O634P541Q164Q408R047J0446J1591J1344
52254F64122J0256J0081J1480J3196J3791J3452J3468J4603J6482J8221J9094
52243H18246J8970J8689J9669K2397K5427K6716K6017K5229K6109K8406L0564
52232A086439L1712L2356L3398L5059L6695L7502L7373L7005L7075L7405L7373
$$ y = [363948, 364211, 363115, 361580, 361263, 362798, 365161, 367044, 368174, 368772, 368438, 366603, 363773, 361451, 360814, 361966, 364167, 366175, 366864, 366384, 366337, 367889, 370112, 371292, 371418, 372012, 373781, 376114, 378899, 383047, 388644, 394201, 398445, 401580, 404265, 406814, 410145, 415802, 423740, 431558, 437405, 442493, 449095, 457095, 464481, 470528, 476348, 482507, 488321, 493801, 500273, 508235, 516188, 522562, 527583, 532242, 536558, 540121, 543651, 548650, 555638, 563653, 571445, 578464, 584806, 590947, 597581, 605122, 613286, 621694, 630741, 641187, 652778, 664122, 674378, 684459, 695939, 709135, 722926, 736378, 749846, 764449, 780931, 799152, 818246, 837216, 855905, 875574, 897971, 923398, 950114, 976131, 1001360, 1027469, 1055875, 1086439, 1118151, 1150507, 1183905, 1218964, 1255659, 1293161, 1330534, 1367539, 1404614, 1442019, 1479392]
52221A479392L6897L6472L6237L5809L5085L4467L3953L2842L0849K8732K7192
52210A847927K5772K3521K0378J7163J4487J2291J0270Q232O145M249K881J934
52198A995250R06k30p50l08K22j88j310j927j355J26K039M165O196P613Q114P983
52182B026546Q055R279J1768J4145J4722J3771J3747J6333K0151K2537K2906K2859
52170B216819K3291K3204K1686J9505J8008J7414J6974J6039J4394J2127R748
52159B409209Q002O884N323K405j399m793p262r486j2091j4643j6221j6777j7413
52146B331738j9146k1674k3667k4200k3615k2909k2684k2824k2922k2819k2655
52135B082623k2406k1420j8944j5557j3454j4159j6178j6159j2760q112n019m033
$$ y = [1479392, 1516289, 1552761, 1588998, 1624807, 1659892, 1694359, 1728312, 1761154, 1792003, 1820735, 1847927, 1873699, 1897220, 1917598, 1934761, 1949248, 1961539, 1971809, 1980041, 1986186, 1990435, 1993316, 1995250, 1996156, 1995926, 1995176, 1994868, 1995090, 1994902, 1993592, 1991665, 1990310, 1990436, 1992475, 1996640, 2002836, 2010449, 2018563, 2026546, 2034601, 2043880, 2055648, 2069793, 2084515, 2098286, 2112033, 2128366, 2148517, 2171054, 2193960, 2216819, 2240110, 2263314, 2285000, 2304505, 2322513, 2339927, 2356901, 2372940, 2387334, 2399461, 2409209, 2417211, 2424095, 2429418, 2431823, 2430424, 2425631, 2418369, 2408883, 2396792, 2382149, 2365928, 2349151, 2331738, 2312592, 2290918, 2267251, 2243051, 2219436, 2196527, 2173843, 2151019, 2128097, 2105278, 2082623, 2060217, 2038797, 2019853, 2004296, 1990842, 1976683, 1960505, 1944346, 1931586, 1923474, 1918455, 1914422]
52123A914422m031m351m993n593n665n443n361n205m789m737n337n278l253m39
52109A849947M23j508m235n632n539m806l925l376l944n634p161p353o451n496
52095A785310n118n546o931q806r742q510n496k482j072j608l237m718n376n545
52081A711123n891o329o065m776l202k208j788j479j361k060l761n628o493o119
52067A653963n562n967p094p493o290m223k583j874k080l377n500o861n676k152
52053A587231J448L103K811K079K355L982O065P441Q223R962J3546J7648K0313
52040A686207K1605K3210K5830K8665L1296L4166L6914L8255L8151L8303L9628
52029B042230M0923M1186M1563M3490M6180M7618M7212M5871M4123M1708L8593
$$ y = [1914422, 1910391, 1906040, 1901047, 1895454, 1889789, 1884346, 1878985, 1873780, 1868991, 1864254, 1858917, 1853639, 1850386, 1849947, 1850370, 1848862, 1844627, 1838995, 1833456, 1828650, 1824725, 1821349, 1817405, 1811771, 1804610, 1797257, 1790806, 1785310, 1780192, 1774646, 1767715, 1758909, 1749167, 1740657, 1735161, 1732679, 1731607, 1729999, 1726762, 1722044, 1716668, 1711123, 1705232, 1698903, 1692838, 1688062, 1684860, 1682652, 1680864, 1679385, 1678024, 1675964, 1672203, 1666575, 1660082, 1653963, 1648401, 1642434, 1635340, 1627847, 1621557, 1617334, 1614751, 1612877, 1610797, 1607420, 1601920, 1595059, 1589383, 1587231, 1588679, 1591782, 1594593, 1596672, 1599027, 1603009, 1609074, 1616515, 1624738, 1634700, 1648246, 1665894, 1686207, 1707812, 1731022, 1756852, 1785517, 1816813, 1850979, 1887893, 1926148, 1964299, 2002602, 2042230, 2083153, 2124339, 2165902, 2209392, 2255572, 2303190, 2350402, 2396273, 2440396, 2482104, 2520697]
52018B520697L5093L1270K7395K4493K3050K1640J8383J3653R707P457N294J605
52006B739737l023o982r878j2427j4905j6890j8280j9443k0338k0389j9454j8136
51994B559592j6831j5161j2939j0989j0207j0116r345p467n241k978p0L294N400
51981B466942N276M611N750Q413J0256J0498J0910J2769J4724J4769J2932J0892
51969B588742R783R441R145Q230O424M268K744J939P65j495m207o624r155j2406
51955B607594j5714j7937j9244k1046k4170k8003l1329l3282l3709l3333l3460
51944B316367l4767l6622l8117l9372m1067m3060m4549m5305m5690m5615m4671
51933A857532m3430m3320m4704m6135m6109m4848m3574m2843m2333m1825m1364
$$ y = [2520697, 2555790, 2587060, 2614455, 2638948, 2661998, 2683638, 2702021, 2715674, 2725381, 2732838, 2738132, 2739737, 2736714, 2729732, 2719854, 2707427, 2692522, 2675632, 2657352, 2637909, 2617571, 2597182, 2577728, 2559592, 2542761, 2527600, 2514661, 2503672, 2493465, 2483349, 2474004, 2466537, 2461296, 2458318, 2458248, 2461542, 2466942, 2472218, 2476829, 2482579, 2490992, 2501248, 2511746, 2522656, 2535425, 2550149, 2564918, 2577850, 2588742, 2598525, 2607966, 2617111, 2625341, 2631765, 2636033, 2638777, 2640716, 2641481, 2639986, 2635779, 2629155, 2620000, 2607594, 2591880, 2573943, 2554699, 2533653, 2509483, 2481480, 2450151, 2416869, 2383160, 2349827, 2316367, 2281600, 2244978, 2206861, 2167489, 2126422, 2083362, 2038813, 1993508, 1947818, 1902203, 1857532, 1814102, 1770782, 1726078, 1679943, 1633834, 1588986, 1545412, 1502569, 1460236, 1418411, 1377047]
51922A377047m0657l9214l7213l5490l4502l3893l3413l3466l4195l4502l2997
51911I87505k9849k6893k5556k5356k4887k3631k2228k1314k0880k0605k0231
51900G26075j9622j8812j7935j6766j4770j2144j0274j0265j1242j1223r670q032
51888E65320p585p761p362o427o018o535p082o614n225m103m289n552o705o990
51874D77072o727o393n814m906m449n061n836n348l817k905l415m525n435o216
51860D06225o625n736l551j714j550k384k671j976j035o17j087k292l271k971
51846C68745j796j464k554l434k586q48q6o20j373j799k197k611k837l184m051
51831C37305m943n072m605m214l707k406p09J03l41j074j298j305j615k056k086
$$ y = [1377047, 1336390, 1297176, 1259963, 1224473, 1189971, 1156078, 1122665, 1089199, 1055004, 1020502, 987505, 957656, 930763, 905207, 879851, 854964, 831333, 809105, 787791, 766911, 746306, 726075, 706453, 687641, 669706, 652940, 638170, 626026, 615752, 605487, 594245, 583022, 573352, 565320, 557735, 549974, 542612, 536185, 530167, 523632, 516550, 509936, 504711, 500608, 496319, 490767, 484062, 477072, 470345, 463952, 458138, 453232, 448783, 443722, 437886, 432538, 428721, 425816, 422401, 417876, 412441, 406225, 399600, 393864, 390313, 388599, 387049, 384665, 381994, 380018, 378983, 378366, 377279, 374987, 371716, 368745, 366949, 365485, 362931, 359497, 356911, 356063, 355977, 355357, 353984, 352185, 349988, 347377, 344540, 341356, 337305, 332362, 327290, 322685, 318471, 314764, 312358, 311649, 311752, 311411, 310337, 309039, 307734, 306119, 304063, 301977]
51816C01977j442l58M29O8j444k795k513n46J734K952K665J298j93p75j24J040
51800C01973J844K133K091J582N60l25l03N72J739K997M412N653O062N252L293
51785C39535Q08q90p40M60M97j323k945k431p68j47n28m0J736L107K924J909J052
51768C42216M11j9J66Q30J154R26R19J615K585L403M083M394L801K375P74o80
51752C68953j889k184r86O51Q42n32j631j455j142j744k407j864l65J075K224
51737C57546L256L723L091J776O39p7n15n16O3Q15J303J586J747J509R27P87J665
51720C79325L171M632N734N947M275O40l128m785l796j269J616M096N334M734
51706D06526K852J128N65J127K208L158L457L050K452K149K137K331K992M122
$$ y = [301977, 300535, 300177, 300606, 300674, 299230, 296435, 293922, 293376, 295110, 298062, 300727, 302025, 301832, 301057, 300933, 301973, 303817, 305950, 308041, 309623, 310183, 309858, 309555, 310127, 311866, 314863, 319275, 324928, 330990, 336242, 339535, 340343, 339453, 338713, 339173, 339670, 338347, 335402, 332971, 332203, 332056, 331528, 331488, 333224, 336331, 339255, 341164, 342216, 342627, 342608, 342774, 343604, 344758, 345684, 346603, 348218, 350803, 354206, 358289, 362683, 366484, 368859, 369633, 368953, 367064, 364880, 363894, 364545, 365387, 364855, 363224, 361769, 360627, 358883, 356476, 354612, 354247, 355322, 357546, 360802, 364525, 367616, 369392, 370031, 369954, 369439, 368923, 368986, 369801, 371104, 372690, 374437, 375946, 376873, 377660, 379325, 382496, 387128, 392862, 398809, 403084, 403724, 400596, 395811, 392015, 390746, 392362, 396458, 401792, 406526, 409378, 410506, 411071, 412198, 414406, 417564, 421021, 424071, 426523, 428672, 430809, 433140, 436132, 440254]
51692D40254N029N114M721M398L812K558J733L273P193J0745J1209Q930O716O503
51678E22188P545P923O985N727N203N284N062M023K561J508J364J822J934J017
51664E80146m70j160k48J552K681K307R99M8K80J255J596N11r38r38N91J606P20
51647E90538q74j285o75m96q35m65P44J444R71J03o83j893l441m101l372k436
51631E73244k291k332j680o24K57J120J955K000J246J240K957M970N483N085N670
51616E98300P274Q106P351N844L981J085k691n653o664o489o252n833m814l903
51602E89642m150n279n968n597m854m666n190n989o654p120p555q062q364p984
51588E02210o909n895n747o330o597n849m689m381n269o228n990m674l529l256
$$ y = [440254, 445283, 450397, 455118, 459516, 463328, 465886, 467619, 470892, 478085, 488830, 500039, 508969, 515685, 522188, 529733, 537656, 544641, 550368, 555571, 560855, 565917, 569940, 572501, 574009, 575373, 577195, 579129, 580146, 579676, 578516, 578268, 579820, 582501, 584808, 585807, 585855, 586135, 587390, 588986, 589497, 588559, 587621, 588212, 589818, 590538, 589664, 588379, 587704, 587208, 586373, 585908, 586652, 588096, 589067, 589170, 588487, 586594, 583153, 579052, 575680, 573244, 570953, 568621, 566941, 566317, 566574, 567694, 569649, 571649, 572895, 574135, 577092, 582062, 587545, 592630, 598300, 605574, 613680, 621031, 626875, 630856, 631941, 629250, 623597, 616933, 610444, 604192, 598359, 593545, 589642, 585492, 580213, 574245, 568648, 563794, 559128, 553938, 547949, 541295, 534175, 526620, 518558, 510194, 502210, 495301, 489406, 483659, 477329, 470732, 464883, 460194, 455813, 450544, 444316, 438326, 433652, 430123, 426867]
51574D26867l348l199l092l437l673k854j190o8k68j045j390j608k740m739o137
51559C88079n749m002k143p68K53Q16N67j96m86J45R47R65K82k49l4Q13J775K216
51541C83231J721O26j28J7P05J420K158K900L139K676K326K883L833M062L525
51526D15094L253L823M839N747O298O322N897N540N443M848L237J625J389K118
51512D75473K051O04j178k668m382o294p045n693l047o36N76K88j084k018j024
51497D43923J364L053L262L389M460N539N578N162N159N101M272L158K500K004
51483D97924J279R68J577K141J439k82j962l189l802l119j037R86J523R98O58
51468D96102O50N78Q68J901K622J921P43R82K733M434N238N420M801K858L21j351
$$ y = [426867, 423519, 420320, 417228, 413791, 410118, 407264, 406074, 406006, 405738, 404693, 403303, 401695, 398955, 394216, 388079, 382330, 378328, 376185, 375417, 375670, 376486, 377053, 376857, 376371, 376516, 377463, 378428, 378710, 378461, 378427, 379240, 381015, 383231, 384952, 385578, 385450, 385467, 386172, 387592, 389750, 392650, 395789, 398465, 400791, 403674, 407507, 411569, 415094, 418347, 422170, 427009, 432756, 439054, 445376, 451273, 456813, 462256, 467104, 470341, 471966, 473355, 475473, 477524, 478128, 476950, 474282, 469900, 463606, 456561, 450868, 447821, 447185, 447761, 448049, 446965, 444947, 443923, 445287, 448340, 451602, 454991, 459451, 464990, 470568, 475730, 480889, 485990, 490262, 493420, 495920, 497924, 499203, 500171, 501748, 503889, 505328, 505046, 503084, 499895, 496093, 492974, 491937, 492923, 494446, 495444, 496102, 496752, 497330, 498198, 500099, 502721, 504642, 505385, 506367, 509100, 513534, 518772, 524192, 528993, 531851, 532172, 530821]
51452E30821k102l124m417m528l039j587j648k727l397l031k055j365j783l251
51438D92767m558m672m088l844l675k610r54P0M78J402K786L189K139Q01q7r53
51422D78191j464r2L249O025O071M419L632M426N423N551N203N219N739O137N817
51407E43546N188N772Q427J1616J2711J1250R477R158R469Q814P222N780M955
51394F53385M720N185N806N030K263o24j317pJ114Q69P8k43j36J5J24J34q6l72
51376F75938n53j039k258l606l889k969k075k342l701n407o831p560p357o560
51362F19791o021o272o988p500p555p392p287p292p193o636n414l818k551k116
51348E35756k326k468k016j074j36M51P55J015J415K060K873L381K985J764O70
$$ y = [530821, 528719, 525595, 521178, 516650, 513611, 512024, 510376, 507649, 504252, 501221, 499166, 497801, 496018, 492767, 488209, 483537, 479449, 475605, 471930, 469320, 468366, 468436, 468914, 470316, 473102, 476291, 478430, 479231, 479144, 478191, 476727, 476635, 479884, 485909, 491980, 496399, 500031, 504457, 509880, 515431, 520634, 525853, 531592, 537729, 543546, 548734, 554506, 562933, 574549, 587260, 598510, 607987, 617145, 626614, 635428, 642650, 648430, 653385, 658105, 663290, 669096, 674126, 676389, 675765, 674448, 674441, 675555, 676424, 676502, 676259, 676123, 676138, 676262, 676396, 676310, 675938, 675385, 674346, 672088, 668482, 664593, 661624, 659549, 657207, 653506, 648099, 641268, 633708, 626351, 619791, 613770, 607498, 600510, 593010, 585455, 578063, 570776, 563484, 556291, 549655, 544241, 540423, 537872, 535756, 533430, 530962, 528946, 527872, 527736, 528187, 528942, 529957, 531372, 533432, 536305, 539686, 542671, 544435, 545105]
51333E45105N12Q88N33j350m389p403r239r557r214r420j0138r955q187o310o135
51318D55741p214p552o653o050o663p328o773n520m921n320o203p283q381q890
51304C60990q261o774n104l606k559k446l320m339m592m051l196k292j640j878
51290C06932l229m816n502n065m027k731j360l42N4K66Q21J308P91q57k538k984
51274B76721j944l65M75K25j70L57J480J923J410J154K027L333M053M199M177
51259B99055L895L522M079N916P386O712M621L485M063M744M095K537J079k22
51245C54967j846l788n603o788o822n617m176l960n108o038n365l557k168j990
51231B92141k574l213l620l773l601l070k363j825j623j538j305j091j363k131
$$ y = [545105, 545617, 546505, 547038, 545688, 541299, 533896, 524657, 515100, 505886, 496466, 486328, 476373, 468186, 461876, 455741, 448527, 440975, 434322, 428272, 421609, 414281, 407508, 401988, 397067, 391747, 385544, 378261, 369880, 360990, 352729, 345955, 340851, 337245, 334686, 332240, 328920, 324581, 319989, 315938, 312742, 310450, 308810, 306932, 303703, 298887, 293385, 288320, 284293, 281562, 280202, 279860, 279914, 280180, 281001, 282309, 283100, 282243, 279705, 276721, 274777, 274412, 274887, 275112, 274942, 275299, 276779, 278702, 280112, 281266, 283293, 286626, 290679, 294878, 299055, 302950, 306472, 310551, 316467, 323853, 330565, 335186, 338671, 342734, 347478, 351573, 354110, 355189, 354967, 353121, 349333, 343730, 336942, 330120, 324503, 320327, 316367, 311259, 305221, 299856, 296299, 294131, 292141, 289567, 286354, 282734, 278961, 275360, 272290, 269927, 268102, 266479, 264941, 263636, 262545, 261182, 259051]
51217B59051k757k794k397j685l49J333J933L26k632m950n739n511m590k724m08
51202B26107R29O36l85j024j088n44R93L214M625M258L015K386K450K247J421
51187B49240L09j039k578l371k486p39j14j167k447k748k557k579k241r00N55
51172B25138O54l47n77J101L770N541N272L141M17j312j267n7J223K216K948K867
51156B50728J480j61j93J399K470J754P03J108K282K339J275Q42J645K387J970
51141B72028O84r13k575l505k605k90J469J674J533K207K848K138N87j99J16N64
51125B75761O83R33J424J566J127N89L66M12O95J201J520J142K53m73q57j382
51109B84960k306l195l448k858j673m89P0j5o0L63O96J24j342l126m929o444o781
$$ y = [259051, 256294, 253500, 251103, 249418, 249069, 250402, 252335, 252661, 250029, 245079, 239340, 233829, 229239, 226515, 226107, 227036, 227672, 227287, 226263, 225175, 224631, 225624, 228838, 233463, 237721, 240736, 243122, 245572, 247819, 249240, 249549, 248510, 245932, 242561, 240075, 239336, 239222, 238055, 235608, 232860, 230303, 227724, 225483, 224583, 225138, 225792, 225445, 224868, 225969, 229739, 235280, 240552, 243693, 244110, 242798, 241531, 241474, 242697, 244913, 247861, 250728, 252208, 252047, 251854, 253253, 255723, 257477, 258180, 259288, 261570, 263909, 265184, 266026, 267671, 270058, 272028, 272712, 271799, 269224, 265719, 263114, 262824, 264293, 265967, 267500, 269707, 272555, 274693, 275280, 275081, 275197, 275761, 276444, 277377, 278801, 280367, 281494, 282083, 282449, 282861, 283556, 284757, 286277, 287419, 287672, 287199, 286342, 284960, 282654, 279459, 276011, 273153, 271480, 270991, 271061, 271046, 270986, 271349, 272045, 272169, 270827, 267701, 262772, 256328, 249547]
51092B49547n321k941j300q77q70r16j563k799l510k960j752q24m20n87j524k633
51076B18750k381k41K080K594J616J084J691K195J647Q14Q12J400J539J046Q92
51061B35538J890L569M382L021k26l346m274k943j270p45p56K9J179P08k016m904
51045B29836n413l409q09R59J976K630K730K145J262M07l17l68R50K990L762K430
51029B41761Q45J306L471M999M810M101M048M245L933L312K749J817K84q35m20
51014B80426R33J506P22l01n74m75o38n63P42L000M633M584L482K561K093J571
50998C03702J043J209K063K447J550J58m27k73o13j904l162l341k447r54R78L019
50982C03048M191L777K386J282Q75O43L72M43P58N30l53o89L66J795J984J092
$$ y = [249547, 244226, 241285, 239985, 239108, 238238, 237322, 235759, 232960, 229450, 226490, 224738, 223914, 223494, 222907, 221383, 218750, 216369, 216128, 218208, 220802, 222418, 223502, 225193, 227388, 229035, 229849, 230661, 232061, 233600, 234646, 235538, 237428, 240997, 245379, 248400, 248174, 244828, 240554, 237611, 236341, 235596, 234840, 234869, 236048, 236756, 234740, 229836, 224423, 221014, 220205, 221164, 223140, 225770, 228500, 230645, 231907, 232314, 231997, 231629, 232579, 235569, 239331, 241761, 242606, 243912, 247383, 252382, 257192, 261293, 265341, 269586, 273519, 276831, 279580, 281397, 281681, 280846, 280426, 281359, 282865, 283587, 283286, 282712, 282237, 281599, 281036, 281778, 284778, 289411, 293995, 297477, 300038, 302131, 303702, 304745, 305954, 308017, 310464, 312014, 312172, 311745, 311472, 310859, 308955, 305793, 302452, 300005, 299051, 300029, 303048, 307239, 311016, 313402, 314684, 315559, 316202, 316574, 317017, 317775, 318305, 317952, 317263, 317629, 319424, 321408, 322500]
50966C22500P76J557K093J436O32R55J800J717Q57Q05K148L751M539M697M761
50951C55024M712M454M242M215M233M469N257O188O384O011O268P451Q394Q507
50937D35809Q919J0459J1775J1057Q785P271P861R990J2477J4501J5598J5998
50925E70500J6769J8557K0453K1197K1103K1585K3133K5092K7061K9130L1016
50914H25596L2531L4670L8484M2932M5755M6775M8462N2600N8121O3013O6943
50903A355882P0973P6033Q2556R0568R9166J06766J12607J17202J20942J23427
50893B356122J24742J25838J26843J26339J23336J18517J12325J03508R1285P7667
50883C486522O5470N4689M3021K9554J5844L445p462j6684k3349k7472l0498l3302
$$ y = [322500, 323276, 324833, 326926, 328362, 328994, 329949, 331749, 333466, 334323, 335128, 337276, 341027, 345566, 350263, 355024, 359736, 364190, 368432, 372647, 376880, 381349, 386606, 392794, 399178, 405189, 411457, 418908, 427302, 435809, 444728, 455187, 466962, 478019, 486804, 494075, 501936, 511926, 524403, 538904, 554502, 570500, 587269, 605826, 626279, 647476, 668579, 690164, 713297, 738389, 765450, 794580, 825596, 858127, 892797, 931281, 974213, 1019968, 1066743, 1115205, 1167805, 1225926, 1288939, 1355882, 1426855, 1502888, 1585444, 1676012, 1775178, 1881944, 1994551, 2111753, 2232695, 2356122, 2480864, 2606702, 2733545, 2859884, 2983220, 3101737, 3214062, 3317570, 3408855, 3486522, 3551992, 3606681, 3649702, 3679256, 3695100, 3698545, 3691083, 3674399, 3651050, 3623578, 3593080, 3559778]
50871C559778l4978l4736l3836l4222l5967l7475l8105l9302m2829m8751n5686
50860C123891o2424o8671p4430p9525q3996q8449r3305r7934j01109j02267j01594
50849B170187r8989r4021q7382q1220p7004p3752o9579o4399n9739n6011n1754
50838A356337m5896l9350l3545k8616k4098k0363j7991j6230j3632j0153p259
50827A099204n623m160j914L31J500K341M568Q148J1007J1734J1259J1380J2711
50814A162486J4840J7429K0090K1969K2710K3498K5832K9490L2829L5012L6781
50803A442966L8960M1493M4302M7824N2131N6500O0446O4383O8760P3458P8724
50792B069947Q5635R4713J04813J14489J23929J34596J47347J61702J76620J91047
$$ y = [3559778, 3524800, 3490064, 3456228, 3422006, 3386039, 3348564, 3310459, 3271157, 3228328, 3179577, 3123891, 3061467, 2992796, 2918366, 2838841, 2754845, 2666396, 2573091, 2475157, 2374048, 2271781, 2170187, 2071198, 1977177, 1889795, 1808575, 1731571, 1657819, 1588240, 1523841, 1464102, 1408091, 1356337, 1310441, 1271091, 1237546, 1208930, 1184832, 1164469, 1146478, 1130248, 1116616, 1106463, 1099204, 1093581, 1089421, 1087507, 1087838, 1089338, 1091679, 1096247, 1104395, 1115402, 1127136, 1138395, 1149775, 1162486, 1177326, 1194755, 1214845, 1236814, 1259524, 1283022, 1308854, 1338344, 1371173, 1406185, 1442966, 1481926, 1523419, 1567721, 1615545, 1667676, 1724176, 1784622, 1849005, 1917765, 1991223, 2069947, 2155582, 2250295, 2355108, 2469597, 2593526, 2728122, 2875469, 3037171, 3213791, 3404838]
50782C404838K04141K15978K27825K40743K53988K65644K74541K80596K83519
50773E651813K82410K76706K66296K50534K28448K00547J69308J37067J04212
50764G567341P0187L5687K814k6455n1083p0365q3596r0602r2122q9412q3815
50753G088579p6744o9655o3792o0179n9952o4191p3044q5340r9599j15362j33015
50742F187706j52270j71516j89087k04506k17796k27982k33373k33522k29955
50733D327699k24461k17339k07893j96081j82884j69274j55631j42068j28700
50724B703368j15499j02470r0117p9252p0210o2486n5247m7990m0760l4136k9020
50713A976181k5878k4017k1974j9020j6023j4595j5361j7202j8186j7280j5224
$$ y = [3404838, 3608979, 3824957, 4052782, 4293525, 4547513, 4813157, 5087698, 5368294, 5651813, 5934223, 6210929, 6477225, 6727759, 6956207, 7156754, 7326062, 7463129, 7567341, 7637528, 7673215, 7676029, 7649574, 7598491, 7528126, 7444530, 7353928, 7261806, 7172394, 7088579, 7011835, 6942180, 6878388, 6818209, 6758257, 6694066, 6621022, 6535682, 6436083, 6320721, 6187706, 6035436, 5863920, 5674833, 5470327, 5252531, 5024549, 4791176, 4557654, 4327699, 4103238, 3885899, 3678006, 3481925, 3299041, 3129767, 2974136, 2832068, 2703368, 2587869, 2485399, 2395282, 2316030, 2245820, 2183334, 2128087, 2080097, 2039337, 2005201, 1976181, 1950303, 1926286, 1904312, 1885292, 1869269, 1854674, 1839313, 1822111, 1803925, 1786645, 1771421]
50702A771421j3730j3669j4231j4035j2814j1514j0759r953q257o001m439m134
50690A647885m100k791L06M266P935J1243J5171K0315K5768K9866L2042L3656
50678A821562L6668M1837M8348N4892O0635O5402O9724P4760Q1452Q9370R7042
50667B541692J03835J10870J19415J29015J38166J46288J53728J59971J63411
50658C766391J63355J60807J56497J49455J38750J25508J11442R5867P6106N1225
50648D995403K4043j305k2885m1404n7762p1081p9386q1911q0204p6574p1702
50637D435232o4755n5949m7622m1841l8222l5701l5386l9565m8250n8896o9739
50626C899306q1249r3710j05592j15396j23282j29442j32438j30896j25884j19897
$$ y = [1771421, 1757691, 1744022, 1729791, 1715756, 1702942, 1691428, 1680669, 1670716, 1662459, 1656458, 1652019, 1647885, 1643785, 1640994, 1641300, 1645566, 1653501, 1664744, 1679915, 1700230, 1725998, 1755864, 1787906, 1821562, 1858230, 1900067, 1948415, 2003307, 2063942, 2129344, 2199068, 2273828, 2355280, 2444650, 2541692, 2645527, 2756397, 2875812, 3004827, 3142993, 3289281, 3443009, 3602980, 3766391, 3929746, 4090553, 4247050, 4396505, 4535255, 4660763, 4772205, 4868072, 4944178, 4995403, 5019446, 5018141, 4995256, 4953852, 4896090, 4825009, 4745623, 4663712, 4583508, 4506934, 4435232, 4370477, 4314528, 4266906, 4225065, 4186843, 4151142, 4115756, 4076191, 4027941, 3969045, 3899306, 3818057, 3724347, 3618755, 3503359, 3380077, 3250635, 3118197, 2987301, 2861417, 2741520]
50616B741520j13962j07196r8760q9082p9278p0347o2552n4972m6261l6487k7369
50605A955254j9816j2530m236L833R682J3873J8740K4523K8701K9736K9161K9021
50593B105942K9113K8183K6581K5984K7023K8623K9557K9716K9810L0627L2670
50582B423829L5808L9161M1760M3629M5925M9720N4758N9546O2787O4527O5870
50571B987320O7730P0106P2431P4048P4363P3043P0379O7045O3189N8221N1723
50560C729598M4070L5796K6909J7409Q048j57o856j2288j6431j8857j9214j7554
50548C770473j4450j1062q464o353l117J944P115R938R993Q735O940L763j407
50535C774048p727j4334k1967l2141m5075n9187p2409q3460r2060r8601j03683
$$ y = [2741520, 2627558, 2520362, 2421602, 2332520, 2253242, 2182895, 2120343, 2065371, 2019110, 1982623, 1955254, 1935438, 1922908, 1918672, 1922505, 1932187, 1946060, 1964800, 1989323, 2018024, 2047760, 2076921, 2105942, 2135055, 2163238, 2189819, 2215803, 2242826, 2271449, 2301006, 2330722, 2360532, 2391159, 2423829, 2459637, 2498798, 2540558, 2584187, 2630112, 2679832, 2734590, 2794136, 2856923, 2921450, 2987320, 3055050, 3125156, 3197587, 3271635, 3345998, 3419041, 3489420, 3556465, 3619654, 3677875, 3729598, 3773668, 3809464, 3836373, 3853782, 3861830, 3861673, 3854817, 3842529, 3826098, 3807241, 3788027, 3770473, 3756023, 3744961, 3736497, 3730144, 3727027, 3728971, 3736086, 3746024, 3756017, 3764752, 3771692, 3775455, 3774048, 3766321, 3751987, 3730020, 3697879, 3652804, 3593617, 3521208, 3437748, 3345688, 3247087, 3143404]
50524C143404j07438j09110j07748j03731r9146r5873r3427q9632q3690p7250
50514B176359p1740o6137n8986n1453m5924m2060l7080l0225k4001j9949j6101
50503A712703j0391l983R69M689Q268J0809J1267J1676J5128K1210K6808L0912
50491A840065L5147L9686M2587M3791M6048N0433N4222N5229N5436N8042O2940
50480B383626O7437O9918P0717P0636P0487P1234P2824P3694P2902P1901P2847
50469C168223P6056Q0451Q5523R1283R7187J02733J08605J15757J23807J31716
50459D181341J39347J46993J53906J58987J62580J65953J68937J69601J66483
50450E614128J59974J51288J40999J28789J13766R4841P1785M6202K0768k942
$$ y = [3143404, 3035966, 2926856, 2819108, 2715377, 2616231, 2520358, 2426931, 2337299, 2253609, 2176359, 2104619, 2038482, 1979496, 1928043, 1882119, 1840059, 1802979, 1772754, 1748753, 1728804, 1712703, 1702312, 1698329, 1699298, 1703987, 1712255, 1723064, 1734331, 1746007, 1761135, 1782345, 1809153, 1840065, 1875212, 1914898, 1957485, 2001276, 2047324, 2097757, 2151979, 2207208, 2262644, 2320686, 2383626, 2451063, 2520981, 2591698, 2662334, 2732821, 2804055, 2876879, 2950573, 3023475, 3095376, 3168223, 3244279, 3324730, 3410253, 3501536, 3598723, 3701456, 3810061, 3925818, 4049625, 4181341, 4320688, 4467681, 4621587, 4780574, 4943154, 5109107, 5278044, 5447645, 5614128, 5774102, 5925390, 6066389, 6195178, 6308944, 6403785, 6475570, 6521772, 6542540, 6539598]
50440F539598k5426m7940p0665r2319j11144j25923j36074j41167j40814j35304
50430E512822j25939j14128j00281q4195o6297m7806k9839j3287P07J1215J8297
50419D961269K1904K0230J1079m913k4427m5390o8501r3728j17795j37099j51392
50408D371237j62358j70015j73010j71606j67813j62794j56248j48186j39386
50399B919821j30127j20279j10547j01946r3978q5043p4827o4816n6269m9139
50389B032850m2942l7244l1212k4322j7678j3077j0478p874l983M75M605Q792
50377A857912J3536J8257K2045K4745K6701K8433L0858L4606L8596M0659M0425
50366B176773M0295M2447M5851M7687M7041M5734M5585M6188M5903M4261M2603
$$ y = [6539598, 6514172, 6466232, 6395567, 6303248, 6192104, 6066181, 5930107, 5788940, 5648126, 5512822, 5386883, 5272755, 5172474, 5088279, 5021982, 4974176, 4944337, 4931050, 4931757, 4942972, 4961269, 4983173, 5003403, 5014482, 5009569, 4985142, 4939752, 4871251, 4777523, 4659728, 4522629, 4371237, 4208879, 4038864, 3865854, 3694248, 3526435, 3363641, 3207393, 3059207, 2919821, 2789694, 2669415, 2558868, 2456922, 2362944, 2277901, 2203074, 2138258, 2081989, 2032850, 1989908, 1952664, 1921452, 1897130, 1879452, 1866375, 1855897, 1848023, 1844040, 1844515, 1849120, 1857912, 1871448, 1889705, 1911750, 1936495, 1963196, 1991629, 2022487, 2057093, 2095689, 2136348, 2176773, 2217068, 2259515, 2305366, 2353053, 2400094, 2445828, 2491413, 2537601, 2583504, 2627765, 2670368]
50355B670368M2280M2881M2725M0983L8633L7190L7300L9004M2342M6883N1441
50344C132030N5357N9454O4479O9360P2423P3822P5078P6552P7030P5628P2280
50333C903493O6571N8119M8211L8682K8889J6211L91j5256k8309m0432n4177o8792
50321C953601q1584r1967j01337j09645j14767j15316j12086j06451r8947q9673
50311B931828p8740o6150n2311l8747k7127j7593r029j059N295Q819Q911N182
50299B669279k312j2168k2059l0699l8688m7015n5501o3055o8834p2575p4295
50288B182078p4146p2487o9790o6426o2572n8232n3597m9447m6678m5096m3176
50277A540431l9625l4771k9826k5334k1234j7945j6074j5056j3373j0399p116
$$ y = [2670368, 2712648, 2755529, 2798254, 2839237, 2877870, 2915060, 2952360, 2991364, 3033706, 3080589, 3132030, 3187387, 3246841, 3311320, 3380680, 3453103, 3526925, 3602003, 3678555, 3755585, 3831213, 3903493, 3970064, 4028183, 4076394, 4115076, 4143965, 4160176, 4160567, 4145311, 4117002, 4076570, 4022393, 3953601, 3872017, 3780050, 3678713, 3569068, 3454301, 3338985, 3226899, 3120448, 3021501, 2931828, 2853088, 2786938, 2734627, 2695880, 2668753, 2651160, 2642131, 2641072, 2646367, 2655186, 2664097, 2669279, 2666967, 2654799, 2632740, 2602041, 2563353, 2516338, 2460837, 2397782, 2328948, 2256373, 2182078, 2107932, 2035445, 1965655, 1899229, 1836657, 1778425, 1724828, 1675381, 1628703, 1583607, 1540431, 1500806, 1466035, 1436209, 1410875, 1389641, 1371696, 1355622, 1340566, 1327193, 1316794, 1309678]
50266A309678m620k770p17K021N405R085J2322J4287J4980J5436J6561J8192J9661
50253A429521K0804K2025K3730K6035K8623L0627L1198L0547K9937L0138L0470
50242A733655K9931K8734K7869K7545K6952K5496K3339K0714J7535J3844R949
50231A985563N879J448k852n773o809p162q445j0732j2650j3237j3032j3261j4666
50218A884271j7212k0339k3155k4907k5636k5968k6051k5266k3433k1673k1212
50207A629419k1688k1585k0426j9450j9711k0323j9495j6933j4320j3228j3230
50196A429030j2426r573n292j342J020J935K432L290M386N063N053M903N402O583
50182A440464P505P142N352K820K01k286m525o199p044p142o715n993n501o050
$$ y = [1309678, 1305058, 1302288, 1301571, 1303592, 1308997, 1318082, 1330404, 1344691, 1359671, 1375107, 1391668, 1409860, 1429521, 1450325, 1472350, 1496080, 1522115, 1550738, 1581365, 1612563, 1643110, 1673047, 1703185, 1733655, 1763586, 1792320, 1820189, 1847734, 1874686, 1900182, 1923521, 1944235, 1961770, 1975614, 1985563, 1991442, 1992890, 1990038, 1984265, 1977456, 1970294, 1961849, 1951117, 1938467, 1925230, 1912198, 1898937, 1884271, 1867059, 1846720, 1823565, 1798658, 1773022, 1747054, 1721003, 1695737, 1672304, 1650631, 1629419, 1607731, 1586146, 1565720, 1546270, 1526559, 1506236, 1486741, 1469808, 1455488, 1442260, 1429030, 1416604, 1407031, 1401739, 1400397, 1401417, 1403352, 1405784, 1409074, 1413460, 1418523, 1423576, 1428479, 1433881, 1440464, 1447969, 1455111, 1460463, 1463283, 1463484, 1461198, 1456673, 1450474, 1443430, 1436288, 1429573, 1423580, 1418079, 1412029]
50168A412029p985j0554j2411j2753j1733r971q071o520n570n156n050n084n011
50155A306160m354k855r70N90J710K875M264N332N568N237N076N339N477M744
50141A344193L049J091l85j366k329l449m521n806q058j1231j3857j4511j3519
50128A269301j2422j2065j2158j2436j3105j4070j4728j4735j4241j3268j1825
50117A124248j0687j0906j2203j2906j2005j0357r288q902q504p813p008o211
50105A007458n708n982o827p114o238n129m943n343n280m934n555p438r259r790
50091I17918r354r291j0484j2581j4294j4466j3174j1583j0435r100o792m171
50079G92193k734k841l461l851m329n074n291m259k539j338j030q52N1J657L157
$$ y = [1412029, 1404044, 1393490, 1381079, 1368326, 1356593, 1346622, 1338551, 1332031, 1326461, 1321305, 1316255, 1311171, 1306160, 1301806, 1298951, 1297981, 1298571, 1300281, 1303156, 1307420, 1312752, 1318320, 1323557, 1328633, 1333972, 1339449, 1344193, 1347242, 1348333, 1347948, 1346582, 1344253, 1340804, 1336283, 1330477, 1322419, 1311188, 1297331, 1282820, 1269301, 1256879, 1244814, 1232656, 1220220, 1207115, 1193045, 1178317, 1163582, 1149341, 1136073, 1124248, 1113561, 1102655, 1090452, 1077546, 1065541, 1055184, 1045896, 1036994, 1028490, 1020677, 1013669, 1007458, 1001750, 995768, 988941, 981827, 975589, 970460, 965517, 960174, 954894, 949960, 944405, 936967, 927708, 917918, 908564, 899273, 888789, 876208, 861914, 847448, 834274, 822691, 812256, 803156, 796364, 792193, 789459, 786618, 783157, 779306, 774977, 769903, 764612, 760353, 757814, 756476, 755446, 754594, 754645, 756302, 759459]
50064G59459L829L812L958M830O028O745O740O397O151O295P103Q423R391R237
50050H48398Q410Q050Q392Q586Q215Q042Q767R949J0714J0825J0506R841R007
50037I67702Q515Q510Q297P389O575P090Q935J0887J2064J2547J2424J1341R548
50024A091824Q478R475J2148J4621J5440J4805J3998J3954J4527J4999J5052J5083
50012A254404J5496J5874J5417J4314J4125J6214K0027K3552K5323K5440K4699
50001A464885K3678K3013K3601K5612K7835K8833K8508K7722K6845K5792K5309
49990A751633K6558K8966K9885K7431K2755J8493J5758J3775J1765R764P751N450
49978A969984L122J366j27k362n268p305p481o687o185n719m305k271j125j405
$$ y = [759459, 763288, 767100, 771058, 775888, 781916, 788661, 795401, 801798, 807949, 814244, 821347, 829770, 839161, 848398, 856808, 864858, 873250, 881836, 890051, 898093, 906860, 916809, 927523, 938348, 948854, 958695, 967702, 976217, 984727, 993024, 1000413, 1006988, 1014078, 1023013, 1033900, 1045964, 1058511, 1070935, 1082276, 1091824, 1100302, 1109777, 1121925, 1136546, 1151986, 1166791, 1180789, 1194743, 1209270, 1224269, 1239321, 1254404, 1269900, 1285774, 1301191, 1315505, 1329630, 1345844, 1365871, 1389423, 1414746, 1440186, 1464885, 1488563, 1511576, 1535177, 1560789, 1588624, 1617457, 1645965, 1673687, 1700532, 1726324, 1751633, 1778191, 1807157, 1837042, 1864473, 1887228, 1905721, 1921479, 1935254, 1947019, 1956783, 1964534, 1969984, 1973106, 1974472, 1974345, 1971983, 1966715, 1959410, 1951929, 1945242, 1939057, 1933338, 1929033, 1926762, 1925637, 1924232]
49964A924232j663k2L976R353J4937K0204K5144K9756L3761L6749L8483L8976
49952B173886L8284L6396L3327K9244K4515J9957J6851J5996J6592J6678J5210
49941B436936J3002J0943Q112K931m256j1370j7719k5224l5412m6404n4598n8920
49929B218021o1768o5437o9189p0718o9454o7022o4694o1832n7298n1531m6350
49918A532728m2995m1057l9347l7143l4324l0903k7088k3631k1348k0154j9168
49907A195570j8022j7324j7358j6930j4674j1257r067r298j0396j0244r067q937
49895A042996j0708j2689j2705j0606q181p129p647q652q840p669n844m766n051
49882I32509n754n491m316l697m324m818l523j111L2r71k156j381R43K935M054
$$ y = [1924232, 1922569, 1922547, 1926523, 1935876, 1950813, 1971017, 1996161, 2025917, 2059678, 2096427, 2134910, 2173886, 2212170, 2248566, 2281893, 2311137, 2335652, 2355609, 2372460, 2388456, 2405048, 2421726, 2436936, 2449938, 2460881, 2468993, 2471924, 2467668, 2456298, 2438579, 2413355, 2377943, 2331539, 2276941, 2218021, 2156253, 2090816, 2021627, 1950909, 1881455, 1814433, 1749739, 1687907, 1630609, 1579078, 1532728, 1489733, 1448676, 1409329, 1372186, 1337862, 1306959, 1279871, 1256240, 1234892, 1214738, 1195570, 1177548, 1160224, 1142866, 1125936, 1111262, 1100005, 1090938, 1081640, 1071244, 1061000, 1051933, 1042996, 1032288, 1019599, 1006894, 996288, 988107, 980978, 973331, 964679, 955839, 948170, 942326, 937560, 932509, 926755, 921264, 916948, 913251, 908927, 904109, 900586, 899475, 899507, 898536, 896380, 894999, 895942, 898877, 902931]
$$ [...]
##END NTUPLES=NMR SPECTRUM
##END=
