
##TITLE=AC1082_NSTO01_5818588_j4YIMWLkmI
##JCAMPDX= 6.0         $$ Bruker NMR JCAMP-DX V2.0
##DATA TYPE= NMR SPECTRUM
##DATA CLASS= NTUPLES
##ORIGIN= BRUKER
##OWNER= Administrator
$$ 1.72 TOPSPIN		Version 2.1
$$ 2012-03-26 19:43:06.937 -0500  Administrator@TOPSPIN
$$ Compression mode = diff/dup
##.OBSERVE FREQUENCY= 400.13188235
##.OBSERVE NUCLEUS= ^1H
##.ACQUISITION MODE= SIMULTANEOUS (DQD)
##.ACQUISITION SCHEME= undefined
##.AVERAGES= 8
##.DIGITISER RES= 22
##SPECTROMETER/DATA SYSTEM= spect
##.PULSE SEQUENCE= zg30
##.SOLVENT NAME= COFFEE_meoh
##.SHIFT REFERENCE= INTERNAL, COFFEE_meoh, 1, 14.98061
##AUDIT TRAIL= $$ (NUMBER, WHEN, WHO, WHERE, PROCESS, VERSION, WHAT)
$$ ##TITLE= Audit trail, TOPSPIN		Version 2.1
$$ ##JCAMPDX= 5.01
$$ ##ORIGIN= Bruker BioSpin GmbH
$$ ##OWNER= Administrator
$$ $$ C:\Bruker\TOPSPIN/data/COFFEE/nmr/AC1082_NSTO01_5818588_j4YIMWLkmI/10/pdata/1/auditp.txt
$$ ##AUDIT TRAIL=  $$ (NUMBER, WHEN, WHO, WHERE, PROCESS, VERSION, WHAT)
(   1,<2012-03-26 19:42:59.593 -0500>,<Administrator>,<TOPSPIN>,<go>,<TOPSPIN 2.1>,
      <created by zg
	started at 2012-03-26 19:41:53.140 -0500,
	POWCHK enabled, PULCHK disabled,
       configuration hash MD5:
       1A 1E CE 29 27 FD 77 03 67 4E F0 E3 C4 B2 CB 90
       data hash MD5: 64K
       5A 41 D2 E9 AD EF E1 CC 47 DC 80 7F 38 89 CD E4>)
(   2,<2012-03-26 19:43:02.640 -0500>,<Administrator>,<TOPSPIN>,<proc1d>,<TOPSPIN 2.1>,
      <Start of raw data processing
       efp LB = 0 FT_mod = 6 PKNL = 1 PHC0 = 0 PHC1 = 0 SI = 32K 
       data hash MD5: 32K
       AF AD C6 CE E4 D6 A0 37 84 FF 8A 3F 91 92 66 10>)
(   3,<2012-03-26 19:43:02.984 -0500>,<Administrator>,<TOPSPIN>,<proc1d>,<TOPSPIN 2.1>,
      <pk PHC0 = 217.5787 PHC1 = 0 
       data hash MD5: 32K
       0F E1 61 3C 5B 36 8A 5A 6D 0D F7 CF 40 B8 36 7B>)
(   4,<2012-03-26 19:43:03.031 -0500>,<Administrator>,<TOPSPIN>,<proc1d>,<TOPSPIN 2.1>,
      <abs ABSG = 1 
       data hash MD5: 32K
       38 01 66 37 59 4C 93 EB CB 45 8D 91 AA 5B 22 77>)
(   5,<2012-03-26 19:43:03.062 -0500>,<Administrator>,<TOPSPIN>,<proc1d>,<TOPSPIN 2.1>,
      <abs ABSG = 2 
       data hash MD5: 32K
       05 CA 7F 7F 41 E1 22 EC BD 79 2A BD 85 58 DB 18>)
(   6,<2012-03-26 19:43:03.093 -0500>,<Administrator>,<TOPSPIN>,<proc1d>,<TOPSPIN 2.1>,
      <abs ABSG = 3 
       data hash MD5: 32K
       38 41 81 2C C2 C4 63 E0 32 E0 9C 5A 88 32 69 BF>)
(   7,<2012-03-26 19:43:03.125 -0500>,<Administrator>,<TOPSPIN>,<proc1d>,<TOPSPIN 2.1>,
      <abs ABSG = 4 
       data hash MD5: 32K
       44 2B 30 6C A7 C4 62 DC 69 78 15 7C B9 45 37 40>)
(   8,<2012-03-26 19:43:03.156 -0500>,<Administrator>,<TOPSPIN>,<proc1d>,<TOPSPIN 2.1>,
      <abs ABSG = 5 
       data hash MD5: 32K
       38 4C 3C 5D CA B9 04 7D 81 78 45 9D 22 A0 95 87>)
$$ ##END=
$$ 
$$ $$ hash MD5
$$ $$ CE 28 75 D4 A4 5C 98 37 DF 53 48 75 21 9F C1 CD
##$RELAX= 
##$RELAX= 
##$RELAX= 
##$RELAX= 
##$RELAX= 
##$RELAX= 
##$RELAX= 
$$ Bruker specific parameters
$$ --------------------------
$$ [...]
##$TP= (0..7)
150 150 150 150 150 150 150 150
##$TP07= 0
##$TPNAME0= <>
##$TPNAME1= <>
##$TPNAME2= <>
##$TPNAME3= <>
##$TPNAME4= <>
##$TPNAME5= <>
##$TPNAME6= <>
##$TPNAME7= <>
##$TPOAL= (0..7)
0.5 0.5 0.5 0.5 0.5 0.5 0.5 0.5
##$TPOFFS= (0..7)
0 0 0 0 0 0 0 0
##$TUNHIN= 0
##$TUNHOUT= 0
##$TUNXOUT= 0
##$USERA1= <user>
##$USERA2= <user>
##$USERA3= <user>
##$USERA4= <user>
##$USERA5= <user>
##$V9= 5
##$VALIST= <valist>
##$VCLIST= <CCCCCCCCCCCCCCC>
##$VD= 0
##$VDLIST= <DDDDDDDDDDDDDDD>
##$VPLIST= <PPPPPPPPPPPPPPP>
##$VTLIST= <TTTTTTTTTTTTTTT>
##$WBST= 1024
##$WBSW= 4
##$XGAIN= (0..3)
0 0 0 0
##$XL= 0
##$YL= 0
##$YMAX_a= 537608
##$YMIN_a= -638147
##$ZGOPTNS= <>
##$ZL1= 120
##$ZL2= 120
##$ZL3= 120
##$ZL4= 120
##$ABSF1= 14.98061
##$ABSF2= -5.57192
##$ABSG= 5
##$ABSL= 3
##$ALPHA= 0
##$AQORDER= 0
##$ASSFAC= 0
##$ASSFACI= 0
##$ASSFACX= 0
##$ASSWID= 0
##$AUNMP= <proc_prof1d_extract_pilot.lims>
##$AXLEFT= 0
##$AXNAME= <>
##$AXNUC= <1H>
##$AXRIGHT= 0
##$AXTYPE= 0
##$AXUNIT= <>
##$AZFE= 0.1
##$AZFW= 0.1
##$BCFW= 0
##$BC_mod= 0
##$BYTORDP= 0
##$COROFFS= 0
##$CY= 15
##$DATMOD= 1
##$DC= 0
##$DFILT= <>
##$DTYPP= 0
##$F1P= 0
##$F2P= 0
##$FCOR= 0.5
##$FTSIZE= 32768
##$FT_mod= 6
##$GAMMA= 0
##$GB= 0
##$INTBC= 1
##$INTSCL= 1
##$ISEN= 128
##$LB= 0
##$LEV0= 0
##$LPBIN= 0
##$MAXI= 10000
##$MC2= 0
##$MEAN= 0
##$ME_mod= 0
##$MI= 0
##$NCOEF= 0
##$NC_proc= -8
##$NLEV= 6
##$NOISF1= 0
##$NOISF2= 0
##$NSP= 0
##$NTH_PI= 0
##$NZP= 0
##$OFFSET= 14.98061
##$PC= 1
##$PHC0= 217.5787
##$PHC1= 0
##$PH_mod= 1
##$PKNL= yes
##$PPARMOD= 0
##$PPDIAG= 0
##$PPIPTYP= 0
##$PPMPNUM= 2147483647
##$PPRESOL= 1
##$PSCAL= 4
##$PSIGN= 0
##$PYNMP= <proc.py>
##$REVERSE= no
##$SF= 400.13
##$SI= 32768
##$SIGF1= 0
##$SIGF2= 0
##$SINO= 400
##$SIOLD= 32768
##$SPECTYP= <>
##$SREGLST= <1H.CDCl3>
##$SSB= 0
##$STSI= 32768
##$STSR= 0
##$SW_p= 8223.68421052632
##$SYMM= 0
##$S_DEV= 0
##$TDeff= 65536
##$TDoff= 0
##$TI= <>
##$TILT= no
##$TM1= 0
##$TM2= 0
##$TOPLEV= 0
##$USERP1= <user>
##$USERP2= <user>
##$USERP3= <user>
##$USERP4= <user>
##$USERP5= <user>
##$WDW= 1
##$XDIM= 32768
##$YMAX_p= 464864377
##$YMIN_p= -706183
##$CURPLOT= <Network HP LaserJet P1505>
##$CURPRIN= <$Network HP LaserJet P1505>
##$DFORMAT= <normdp>
##$LAYOUT= <+/1D_H.xwp>
##$LFORMAT= <normlp>
##$PFORMAT= <normpl>
##$SURQMSG= 1
$$ End of Bruker specific parameters
$$ ---------------------------------
##NTUPLES= NMR SPECTRUM
##VAR_NAME=  FREQUENCY,     SPECTRUM/REAL,   SPECTRUM/IMAG
##SYMBOL=    X,             R,               I
##VAR_TYPE=  INDEPENDENT,   DEPENDENT,       DEPENDENT
##VAR_FORM=  AFFN,          ASDF,            ASDF
##VAR_DIM=   32768,         32768,           32768
##UNITS=     HZ,            ARBITRARY UNITS, ARBITRARY UNITS
##FACTOR=    0.250966925370066, 1,           1
##FIRST=     8223.43324360095, 90199,        -86019
##LAST=      0,             23111,           -226111
##MIN=       0,             -706183,         0
##MAX=       8223.43324360095, 464864377,    0
$$ Real data points
##PAGE= N=1
##DATA TABLE= (X++(R..R)), XYDATA
$$ [...]
19457e15971i0916o285I2897b61477D8390J5978K8915M07422i2639A74775d32268
$$ -515971 -90916 -97201 92897 -261477 48390 64368 93283 500705 -92639 174775 -432268
19445a53179M738C5780a02305A20830b84554A94069a48811A3750D357L1488Q4342
$$ -153179 -148441 35780 -102305 120830 -284554 194069 -148811 13750 4357 35845 120187
19434A20187a16597b8630m0237B28349J1847b23549H6680J09392p8982i8340k45343
$$ 120187 -116597 -28630 -68867 228349 240196 -223549 86680 196072 117090 -98340 -343683
19423c43683e5339A17125a40081H3686b13227J1532j69516j72869A64724a39590
$$ -343683 -55339 117125 -140081 83686 -213227 -201695 -371211 -544080 164724 -139590
19412b29281D1939c00031N4394B77470b07133C09013a11484A3907i8125k46119
$$ -229281 41939 -300031 -245637 277470 -207133 309013 -111484 13907 -98125 -344244
19402c44244e3915b3621p32e918B3642a38748H3060d04177A88868a5018k76904
$$ -344244 -53915 -23621 -24353 -5918 23642 -138748 83060 -404177 188868 -15018 -291922
19391b91922B7516d06517a39453q965M742R185j90694J36026i3672H3934a84377
$$ -291922 27516 -406517 -139453 -148418 -143676 -134491 -325185 -189159 -93672 83934 -184377
19379c58137j15448B48293a2634j72791n8307a0993q1496k5408r0324L2049P5179
$$ -358137 -473585 248293 -12634 -185425 -243732 -10993 -92489 -117897 -208221 -176172 -100993
19368a00993p3464k31972J19223A13354a80387Q1088A27235A7675K87136g3067
$$ -100993 -174457 -406429 -287206 113354 -180387 -99299 127235 17675 304811 -73067
19357a16336D7324L0232a5872l41252a54459H0636g3640C0380g4675B65240a29690
$$ -116336 47324 77556 -15872 -357124 -154459 80636 -73640 30380 -74675 265240 -129690
19345a48299j63404l3800e5948F5374a87942K0207a2824E8544g3223j35878R5344
$$ -148299 -311703 -345503 -55948 65374 -187942 -167735 -12824 58544 -73223 -209101 -113757
19334a13757A7687c65516b4648j70722L4939j67666N4574e5098E8756Q7858b03716
$$ -113757 17687 -365516 -24648 -195370 -160431 -328097 -273523 -55098 58756 146614 -203716
19322a90317A99864b70325i9011D9165a2683A9224a12340l5583k68214C5540a33230
$$ -190317 199864 -270325 -99011 49165 -12683 19224 -112340 -147923 -416137 35540 -133230
19310B85954A37435a08633L5296k6366l8617c9474j11686A66479a01793L9232
$$ 285954 137435 -108633 -73337 -99703 -138320 -39474 -151160 166479 -101793 -62561
19300f2561F9377a68842a3208k34681A20189E2474j1098R2234d09475R1984i5165
$$ -62561 69377 -168842 -13208 -247889 120189 52474 41376 133610 -409475 -317491 -95165
19288A9029a7305m703q4356q9496M8455M1908F3695J14081e0911r2991G3975H62
$$ 19029 -17305 -22008 -106364 -195860 -147405 -105497 63695 177776 -50911 -143902 73975 862
19275b93435a5932n482m78922Q1753D04199b0841m6415G6829a51961o38r6471
$$ -293435 -15932 -21414 -500336 -418583 404199 -20841 -67256 76829 -151961 -152599 -249070
19264b49070H1891f0408M067q6896C7150K9581b78655i4476j44035J8829B4596
$$ -249070 81891 -60408 -56341 -143237 37150 66731 -278655 -94476 -238511 -219682 24596
19252c36366D0104a93806L9847A65181a73176A88413i2761H377b9172l21422J17616
$$ -336366 40104 -193806 -153959 165181 -173176 188413 -92761 8377 -29172 -350594 -232978
19241b32978G6529a11584k544B29340a58187G4200K40363B6167O8483e9882j19905
$$ -232978 76529 -111584 -114128 229340 -158187 74200 314563 26167 94650 -59882 -179787
19230a79787e3272F7736a58195M2829A70630a84073j64806a11677A24704a61265
$$ -179787 -53272 67736 -158195 -115366 170630 -184073 -348879 -111677 124704 -161265
19219e82359B707J63893a76294K549l2626G840J00950b33319i9841j22091o6891
$$ -582359 2707 166600 -176294 -173745 -206371 7840 108790 -233319 -99841 -221932 -288823
19208b88823f9982j29544j11718A76982k5381H914Q2044b27203A88776p8660M74411
$$ -288823 -69982 -199526 -311244 176982 151601 8914 90958 -227203 188776 110116 584527
19197E84527a14037A63553l9363d90871a878G2588i3560P139K0885p8085B11745
$$ 584527 -114037 163553 124190 -490871 -1878 72588 -93560 -86421 -65536 -143621 211745
19185b89588n1544J14640d1840j08747C8820L23600B9695K36899a62076d3675
$$ -289588 -341132 -226492 -41840 -150587 38820 362420 29695 266594 -162076 -43675
19174a04694j04880j51914d6023k35486m101H6411a81827m7197M1703k46517c258
$$ -104694 -209574 -361488 -46023 -281509 -285610 86411 -181827 -229024 -187321 -433838 -3258
19162a43408O0995j54856M0980m4191H5544c75182J78526j71206A07591a22755
$$ -143408 -82413 -237269 -196289 -240480 85544 -375182 -196656 -367862 107591 -122755
19151b02684r460I0275i1189l0668j4611K2722j36723Q8593C3549a95246A55704
$$ -202684 -212144 90275 -91189 -121857 -136468 -113746 -250469 -161876 33549 -195246 155704
19139a52549j7981A03433h946C27276a95465H104c62781G367J28590b31725B59636
$$ -152549 -170530 103433 -8946 327276 -195465 8104 -362781 7367 135957 -231725 259636
19127f0920E0685b95559b3982n7113k18560M8412B75362a62015g2398j69345d2982
$$ -60920 50685 -295559 -23982 -81095 -299655 -251243 275362 -162015 -72398 -241743 -42982
19115a81851E4666a80427j69346J26318C5826h7058k9439Q182A45337i7772G6315
$$ -181851 54666 -180427 -349773 -223455 35826 -87058 -116497 -108315 145337 -97772 76315
19103a42499E1648A7576K18801I840K93125c3k0375k57165O6359F7266i2512B51563
$$ -142499 51648 17576 236377 9840 302965 -33 -20408 -277573 -211214 67266 -92512 251563
19090f7509j09850j22039p228A13638C9651a45253a5655r3468A92297I5343c1728
$$ -67509 -177359 -299398 -306626 113638 39651 -145253 -15655 -109123 192297 95343 -31728
19078B17663c9400j8635m5543A25120N8879C794K37348f9764b91k37795A7541
$$ 217663 -39400 -58035 -103578 125120 183999 3794 241142 -69764 -291 -238086 17541
19066B9713K25375a95619C72678c5125k52074B9615c39115J41387E6016a37662
$$ 29713 255088 -195619 372678 -35125 -287199 29615 -339115 -197728 56016 -137662
19055E2839d041j40548m8814a8621l7499k1819l6262M1319q1312q4762j57045
$$ 52839 -4041 -144589 -193403 -18621 -56120 -77939 -114201 -72882 -154194 -238956 -396001
19044c96001E8229P4472o408h7388q3993q4403O6461N5982j95612R3391R9390
$$ -396001 58229 132701 126293 -87388 -171381 -255784 -189323 -133341 -328953 -235562 -136172
19033a36172j57636J08141C0256a05072q2175A26739a15159j6977j08394R6233
$$ -136172 -293808 -185667 30256 -105072 -187247 126739 -115159 -132136 -240530 -144297
19023a44297C3901a9471E6736b07384k26031b11362o7234B5930a55858A5674J32280
$$ -144297 33901 -19471 56736 -207384 -433415 -211362 -278596 25930 -155858 15674 147954
19012A47954c31607B7058O3999K14361F7481j4765G622R4580R9857q6614i8929
$$ 147954 -331607 27058 91057 305418 67481 52716 7622 102202 202059 115445 -98929
19000A58218o5526D1035c55077J50332j7536B06516p4704J72002B4446J94187
$$ 158218 92692 41035 -355077 -204745 -222281 206516 131812 303814 24446 218633
18990B18633i6467j20184b9142j55493j60253e6468A09362D0500c1077j61597
$$ 218633 -96467 -216651 -29142 -184635 -344888 -56468 109362 40500 -31077 -192674
18980a92674m2634e2777A28319J09028c04717L3002a16177C1733K59414a48696
$$ -192674 -235308 -52777 128319 237347 -304717 -271715 -116177 31733 291147 -148696
18969F2283J57806b40701F5742J84427H7932A8815K85025d8763j58210g5951l575
$$ 62283 220089 -240701 65742 250169 87932 18815 303840 -48763 -206973 -75951 -79526
18958g9526A08308J12213J2706m1027M20999A64323O0199d8756a4309o7182b4701
$$ -79526 108308 220521 233227 192200 613199 164323 224522 -48756 -14309 -81491 -24701
18946e4477A31193a37315F1065a87874D7060b88147a9964l70708P1573o976J33745
$$ -54477 131193 -137315 61065 -187874 47060 -288147 -19964 -390672 -319099 -326075 -192330
18935a92330A38061G589a93085d6734E8669g6562B3984a14962B04921C3303K27467
$$ -192330 138061 7589 -193085 -46734 58669 -76562 23984 -114962 204921 33303 260770
18924B60770r7707M7312a69255c1716A88503B9702f5704A45991c8552j10238i073
$$ 260770 163063 210375 -169255 -31716 188503 29702 -65704 145991 -38552 -148790 -9073
18912e1826k25108d366n5825k98718J17577P6985D36779B5131J45049g6237A99431
$$ -51826 -276934 -4366 -60191 -358909 -241332 -164347 436779 25131 170180 -76237 199431
18900d03453a86361e7707B2590K22460F2052J07400C0516K60739L073J08775r1071
$$ -403453 -186361 -57707 22590 245050 62052 169452 30516 291255 294328 403103 312032
18889C12032j04816m08e818A82093a26509e1191j32496i0294G2604j9525b00278
$$ 312032 207216 206808 -5818 182093 -126509 -51191 -183687 -90294 72604 53079 -200278
18877D1517a34969A08573h0805B24733C5578d4614q5226G5600B1776J1486a99687
$$ 41517 -134969 108573 -80805 224733 35578 -44614 -129840 75600 21776 33262 -199687
18865B72902g6406k11055j01728a53325g0425A36638a80152G3195J68514a42966
$$ 272902 -76406 -287461 -389189 -153325 -70425 136638 -180152 73195 241709 -142966
18854f3421k54698i4616A53619G6085P2267A1130M6204a26301A04749m3856b93878
$$ -63421 -318119 -94616 153619 76085 148352 11130 57334 -126301 104749 60893 -293878
18842h3016F7409K41467C1689c34273b3246k5894B0779a52852g4291k6994F7830
$$ -83016 67409 308876 31689 -334273 -23246 -49140 20779 -152852 -74291 -101285 67830
18830A51548a75615B77776d8705a3237A05165b7924j79715J9465d7748A74430
$$ 151548 -175615 277776 -48705 -13237 105165 -27924 -207639 -188174 -47748 174430
18819a5273F2071L902m513h4340G115O8611P4842D4261J26599p2237e9299j65091
$$ -15273 62071 65973 61460 -84340 7115 75726 150568 44261 170860 98623 -59299 -224390
18807b24390m3983i7769C12672A03822a53653A27867a41735p7461A19235a06363
$$ -224390 -268373 -97769 312672 103822 -153653 127867 -141735 -219196 119235 -106363
18796e7497E7994J72496G2672J84482q0439g5914k9575A91824c57530E5728a040
$$ -57497 57994 230490 72672 257154 176715 -75914 -105489 191824 -357530 55728 -1040
18784f2827A39431a78691j0254H7164A8062a06729B67292A20675a20371l57360
$$ -62827 139431 -178691 -188945 87164 18062 -106729 267292 120675 -120371 -477731
18774d77731a38234E9342a40125d6080l017D937K2431L0375A2588e91563M5973
$$ -477731 -138234 59342 -140125 -46080 -49097 4937 27368 57743 12588 -591563 -545590
18763e45590a63007Q0940k84953A83359E1712b9411A96947c0711q8008B11820
$$ -545590 -163007 -82067 -367020 183359 51712 -29411 196947 -30711 -118719 211820
18752B76497a79291A70610d3319k53715a597B68121a86195F0072a80327j9360
$$ 276497 -179291 170610 -43319 -297034 -1597 268121 -186195 60072 -180327 -199687
18742a99687L2759c143E6431a60338A95071i0105J8701A37105n6744f5702C9761
$$ -199687 -166928 -3143 56431 -160338 195071 -90105 -71404 137105 80361 -65702 39761
18730D8115K51783h4719j23348j602g4173C8341N1244J18656a06892e0138k66020
$$ 48115 299898 -84719 -208067 -209669 -74173 38341 89585 208241 -106892 -50138 -316158
18719c16158N7989L0182A42855a49371o3198h8601D0210c44511J37517A55039
$$ -316158 -258169 -227987 142855 -149371 -212569 -88601 40210 -344511 -206994 155039
18708A60533a21716B60622j15236c6485j53249c4393k05166A95806c5569A32446
$$ 160533 -121716 260622 145386 -36485 -189734 -34393 -239559 195806 -35569 132446
18697a24163J8574l56240E0724b87830Q0096F4258c27104A38137b16362m656P1464
$$ -124163 -105589 -461829 50724 -287830 -207734 64258 -327104 138137 -216362 -221018 -149554
18686a49554e3989A08730R5783H0627e33147K59072e2617A72338E5446a49027
$$ -149554 -53989 108730 204513 80627 -533147 -274075 -52617 172338 55446 -149027
18675d19098a20850A4849R7969a91148O3081n3752H8774b70317i2674B11232b29776
$$ -419098 -120850 14849 112818 -191148 -128067 -181819 88774 -270317 -92674 211232 -229776
18663A98053a16130H4607a5692n693j48344H8457a38930j32667B58707b67217
$$ 198053 -116130 84607 -15692 -21385 -169729 88457 -138930 -271597 258707 -267217
18652g0714J5278C9046h2746M854A80137A8042M3206A486L3579b09259E3518K48316
$$ -70714 -55436 39046 -82746 -77892 180137 18042 61248 1486 35065 -209259 53518 301834
18640C01834d4208A14286a13479e3512f589l3835A99902R7547D3505a09449j21047
$$ 301834 -44208 114286 -113479 -53512 -6589 -40424 199902 297449 43505 -109449 -230496
18629b30496A50060a59031A34646h1799K0082G7699b30496f0678k03327J01545
$$ -230496 150060 -159031 134646 -81799 -61717 77699 -230496 -60678 -264005 -162460
18619a62460C3273h1505c8189J2386k20282A49419J76767a78042E11144b77035
$$ -162460 33273 -81505 -38189 -25803 -246085 149419 326186 -178042 511144 -277035
18608A75477F3669M3502a55143O0009k18823J39687o4917A20013i8282A2146a82293
$$ 175477 63669 107171 -155143 -95134 -313957 -174270 -239187 120013 -98282 12146 -182293
18596B460L8540b2760m2100k7610A84463a90411I0599j4458d511r4215M7074J6665
$$ 2460 41000 -22760 -64860 -92470 184463 -190411 90599 76141 -4511 -98726 -51652 -34987
18584c4987l42873I246d4343R198k20444a14759Q899j43720H0783b33420j33690
$$ -34987 -377860 9246 -44343 -35145 -255589 -114759 -105860 -249580 80783 -233420 -367110
18573c67110D8911a94002Q3957A81359c7158j12739d9740q0941O1956A16724e3512
$$ -367110 48911 -194002 -110045 181359 -37158 -149897 -49740 -130681 -68725 116724 -53512
18561b96034e3655K2090l46129D33a86823D973J6091J55054e4731j32498B52422
$$ -296034 -53655 -31565 -377694 433 -186823 4973 21064 176118 -54731 -187229 252422
18549a84262G2259b45596b0891l89748P4519B862c301H8195A3485N1507g092k40986
$$ -184262 72259 -245596 -20891 -410639 -336120 2862 -3301 88195 13485 64992 -7092 -248078
18537b48078a17179j4292D1462J94634b35214D2394a80874A28036i3445C91428
$$ -248078 -117179 -131471 41462 236096 -235214 42394 -180874 128036 -93445 391428
18526C658a52477c0802B35331b11085O8197d4642J2925E3447c07296C14370a59647
$$ 3658 -152477 -30802 235331 -211085 -142888 -44642 -31717 53447 -307296 314370 -159647
18514b0398r0204n6086A03149a28250b6858j53762a8486n4996j8942p6289k66270
$$ -20398 -110602 -166688 103149 -128250 -26858 -180620 -18486 -73482 -92424 -168713 -434983
18503d34983c850A96186c4317C6291e0040n6864M8603I5397L49754b47545A08538
$$ -434983 -3850 196186 -34317 36291 -50040 -106904 -58301 95397 445151 -247545 108538
18491A6455J43659e6964j46312Q0857M0461G6388b64398A5552c10545a06347G7763
$$ 16455 160114 -56964 -203276 -122419 -81958 76388 -264398 15552 -310545 -106347 77763
18479b11356c0524G045b33727k1610P2147I1030B9761b82635a12235o6694f0657
$$ -211356 -30524 7045 -233727 -255337 -183190 91030 29761 -282635 -112235 -178929 -60657
18467A37890F035L81689d39175E8761J46188p0590a75644A38284D7211E790b94463
$$ 137890 6035 387724 -439175 58761 204949 134359 -175644 138284 47211 5790 -294463
18455g8317k27160A72833a7839A18122a59659I8844a68420C51160f5898b98A13273
$$ -78317 -305477 172833 -17839 118122 -159659 98844 -168420 351160 -65898 -298 113273
18443B59675e7270q6613r837D9108a28724j02215Q8323j89980M5470C50337I196
$$ 259675 -57270 -143883 -153720 49108 -128724 -230939 -142616 -332596 -287126 350337 9196
18431a60846A88476B1610N0018f2357B54101a33605B65551r1960e1955B16829
$$ -160846 188476 21610 71628 -62357 254101 -133605 265551 173591 -51955 216829
18420B6958J3351e6906B00708d4154A3148L28180g719j17632H1130c9448A25110
$$ 26958 40309 -56906 200708 -44154 13148 341328 -7719 -125351 81130 -39448 125110
18408B17363m062g8765j2698b6121l51398B88678a19208j5490N4248B0403a32294
$$ 217363 213301 -78765 -91463 -26121 -377519 288678 -119208 -134698 -80450 20403 -132294
18396b6253A88271b62466a00653b4762A21790B7816M11726a56280g4656D2753
$$ -26253 188271 -262466 -100653 -24762 121790 27816 439542 -156280 -74656 42753
18385a11636H8329a64460P9713Q918k26732i6186A13124a07132j72981c4332J0398
$$ -111636 88329 -164460 -84747 -75829 -302561 -96186 113124 -107132 -280113 -34332 -23934
18374b3934K16j225j5370j968J0041a4263j7344D04895I3999d0941p355B13118
$$ -23934 -23718 -24943 -40313 -42281 -32240 -14263 -31607 404895 93999 -40941 -48296 213118
18361g649C69694h7535L1761B57416J34271E9547a41660q3503C61520A13567c8191
$$ -7649 369694 -87535 -55774 257416 391687 59547 -141660 -225163 361520 113567 -38191
18349d5238j0875A4045c03689F1413J47944g309A38031D0629K67355A24528d0569
$$ -45238 -56113 14045 -303689 61413 209357 -7309 138031 40629 307984 124528 -40569
18337B58131E5642a487k31074A15709a59092P0915C25629a5412A57757a1886C66044
$$ 258131 55642 -1487 -232561 115709 -159092 -88177 325629 -15412 157757 -11886 366044
18325c36134A78970q6903j4855b51039a14547h898j13604o6194h964k31305A79175
$$ -336134 178970 92067 77212 -251039 -114547 -8898 -122502 -188696 -8964 -240269 179175
18313A22183b85359B07685b5443k45877a23951A35684o7229a47253K985A39917
$$ 122183 -285359 207685 -25443 -271320 -123951 135684 68455 -147253 -144268 139917
18302b9420k9206C25532J7824c26953H574Q326b96088J24022L5617b5299n3462
$$ -29420 -58626 325532 343356 -326953 8574 16900 -296088 -172066 -136449 -25299 -78761
18291g8761B35042D5832J01786J82046G5986P054d93134K27253a07477j01085
$$ -78761 235042 45832 147618 329664 75986 83040 -493134 -265881 -107477 -208562
18281b08562l4310A01127a16972E0052L9227d8607j34808b4492p5015k40807D91765
$$ -208562 -242872 101127 -116972 50052 89279 -48607 -183415 -24492 -99507 -340314 491765
18269a33981B75432e3119k51846F3623a91189C25443i8086A08718a5621j50329
$$ -133981 275432 -53119 -304965 63623 -191189 325443 -98086 108718 -15621 -165950
18259a65950f0132k64806I8487d293j20375B07722F0851a01908k6860A25626M5661
$$ -165950 -60132 -324938 98487 -4293 -124668 207722 60851 -101908 -128768 125626 171287
18248A71287b34751J09314A61489c1237O46k39675g9035j97779A50479Q0638D5754
$$ 171287 -234751 -125437 161489 -31237 -30591 -270266 -79035 -276814 150479 231117 45754
18236G9309a12718A38323f3479j03431B21544b1757m5304n1784a2071D636a41245
$$ 79309 -112718 138323 -63479 -166910 221544 -21757 -67061 -118845 -12071 4636 -141245
18224C01462a15144j02541P6505A9626b50889f9599j11805j0598j9358N4571j29108
$$ 301462 -115144 -217685 -141180 19626 -250889 -69599 -181404 -192002 -211360 -156789 -285897
18213b85897A31876g4963A10203l0487a08090A95474a69529A05930b2280C86657
$$ -285897 131876 -74963 110203 79716 -108090 195474 -169529 105930 -22280 386657
18202a30222d3731l14380H6855f5768A1164J01908L5873b25139N7711A26301f1600
$$ -130222 -43731 -358111 86855 -65768 11164 113072 148945 -225139 -167428 126301 -61600
18190A51075b98350D8487J90625O624C3207e9608A05390d52362I4462K10938a95736
$$ 151075 -298350 48487 239112 245736 33207 -59608 105390 -452362 94462 305400 -195736
18178B22972a8424n9946j93964q6725J70061G9434g3858F5105a81543K6083k14801
$$ 222972 -18424 -78370 -272334 -359059 -188998 79434 -73858 65105 -181543 -155460 -370261
18167c70261A63332b56206G8617Q7727E5277A8639a4364q9793j59555M2062A51794
$$ -370261 163332 -256206 78617 166344 55277 18639 -14364 -104157 -263712 -221650 151794
18155h3218E0427d8447l7670A1005K47146b37343d1262B13044F2299K5550d89689
$$ -83218 50427 -48447 -86117 11005 258151 -237343 -41262 213044 62299 87849 -489689
18143F092K80079p8203K9181A1915R0855a13236A26245K09309j60726c46827H3133
$$ 6092 286171 207968 237149 11915 102770 -113236 126245 335554 174828 -346827 83133
18131d5493E5865B1883N3143b02952A8584m748a99436C7879N4092j910i2897l0943
$$ -45493 55865 21883 75026 -202952 18584 13836 -199436 37879 91971 90061 -92897 -123840
18119a23840A16468B3368P2902h7830n5896A23557a30111k3742H6346a02851r1220
$$ -123840 116468 23368 96270 -87830 -143726 123557 -130111 -153853 86346 -102851 -194071
18108a94071J9679B00151D1291b21934A84080i2263l22969B89500h8862o2194
$$ -194071 -174392 200151 41291 -221934 184080 -92263 -415232 289500 -88862 -151056
18098a51056L3844o6825e8047m4109F1428M2068a15957N0986A84691F0982i1600
$$ -151056 -117212 -184037 -58047 -102156 61428 103496 -115957 -64971 184691 60982 -91600
18086A13186E048i9785E7248a97598A37920i8268a4242A04983a7376A23034Q1483
$$ 113186 5048 -99785 57248 -197598 137920 -98268 -14242 104983 -17376 123034 204517
18075B04517b0876A06441e6189C55255b14370k18153E5271h1898A95734q2294
$$ 204517 -20876 106441 -56189 355255 -214370 -432523 55271 -81898 195734 113440
18065A13440j9916d4856G547a97606F4857J53198a05B79639a04813A87619E7620
$$ 113440 93524 -44856 7547 -197606 64857 218055 -105 279639 -104813 187619 57620
18053A67626h4772j28067e4283B84499D0715i2732H2021J31672F9529a63173A06802
$$ 167626 -84772 -212839 -54283 284499 40715 -92732 82021 213693 69529 -163173 106802
18041d1990j02952o0729b7045B83968I4546e3811j15209j56455A86044B6072b30952
$$ -41990 -144942 -205671 -27045 283968 94546 -53811 -169020 -325475 186044 26072 -230952
18029b10770m7219A09591K35645F6622c6004k5826L931A53459F0143M5902d7206
$$ -210770 -257989 109591 345236 66622 -36004 -61830 -57899 153459 60143 106045 -47206
18017d3187C6859a00703B18386k7477J50159A56801l6398M7484g9362G736J71515
$$ -43187 36859 -100703 218386 190909 341068 156801 120403 167887 -79362 7736 179251
18006A79251b10789e3060p5202k36528A12024Q6233b86865c3646A20728N1495
$$ 179251 -210789 -53060 -128262 -364790 112024 198257 -286865 -33646 120728 172223
17996A72223B6211K29962O5916J10989A23430a56657A41137o6141a15895B08766
$$ 172223 26211 256173 322089 433078 123430 -156657 141137 74996 -115895 208766
17985A33554g0779j6101F474J60220H528R7027P1796a81610q0868f3533I2504
$$ 133554 -70779 -86880 6474 166694 8528 105555 177351 -181610 -262478 -63533 92504
17973E5388N2963A2264L462a24144p1389n2490J10231D9932b48338B3956a9297
$$ 55388 108351 12264 15726 -124144 -195533 -248023 -137792 49932 -248338 23956 -19297
17961b16668K1440I3749g9212A18658f6130j34970E5358b80767a35839A31054
$$ -216668 -195228 93749 -79212 118658 -66130 -201100 55358 -280767 -135839 131054
17950a51932j5416c389A02885K49283A42144e8401G2355J50354e089G8370Q9227
$$ -151932 -167348 -3389 102885 352168 142144 -58401 72355 222709 -5089 78370 167597
17939A67597K6518b79672D744a37144J2925A90707R5343a4543E5766f5130A60279
$$ 167597 194115 -279672 4744 -137144 -124219 190707 286050 -14543 55766 -65130 160279
17927e8927A4827K2507a2999l6234A50970h5827A79412k6991a52380K3413E8215
$$ -58927 14827 37334 -12999 -49233 150970 -85827 179412 152421 -152380 -128967 58215
17915A35104a30868E6649d0548A75721G6422B2080R75R1768c2623N919B6202c996
$$ 135104 -130868 56649 -40548 175721 76422 22080 23055 114823 -32623 -26704 26202 -3996
17902B80589H4729N2474l9793c1937B46149n7565m223a16205E4674J98947d7574
$$ 280589 84729 137203 97410 -31937 246149 188584 184361 -116205 54674 253621 -47574
17890B79977b7392F4600b1235A41190a69035C55700A03974a88163q5756r837i1268
$$ 279977 -27392 64600 -21235 141190 -169035 355700 103974 -188163 -273919 -283756 -91268
17878a25692C24585A24683P0273e5968C6736a33437A44284a58564D17238a9720
$$ -125692 324585 124683 194956 -55968 36736 -133437 144284 -158564 417238 -19720
17867f3203G8426J28485e0116M872j33949j28649H2328K0939D8067J7862O7006
$$ -63203 78426 206911 -50116 -45244 -179193 -307842 82328 103267 48067 65929 132935
17856A32935a48780F0657J9591f5091p6599A14645a695A77488F3453M3737N8843
$$ 132935 -148780 60657 80248 -65091 -141690 114645 -1695 177488 63453 107190 166033
17845A66033G4516J0748N5617a13589G1404b6201G5288J73116a6609E473K62995
$$ 166033 74516 85264 140881 -113589 71404 -26201 75288 248404 -16609 5473 268468
17834B68468D9445L8234J85909c46373e1525B93693h5137m9107B80475j27185
$$ 268468 49445 87679 273588 -346373 -51525 293693 -85137 -134244 280475 153290
17824A53290J14516n6237G3313b6174C06104A25977b4283j03308N0605j77590
$$ 153290 267806 211569 73313 -26174 306104 125977 -24283 -127591 -76986 -254576
17814b54576A42816a26284c7237j74277B86269b1627G3231h2717o482J5086r9876
$$ -254576 142816 -126284 -37237 -211514 286269 -21627 73231 -82717 -89199 -74113 -173989
17803a73989p2070I3572J5904Q7897F1024L69875a24150C3945H608K6460J94588
$$ -173989 -246059 93572 109476 197373 61024 430899 -124150 33945 8608 35068 229656
17792B29656G0708Q2098d1066B58383K3146b08400L6399A38919K22595m3464I0293
$$ 229656 70708 152806 -41066 258383 281529 -208400 -172001 138919 361514 318050 90293
17780A19731a51026M3105l303B13655a61541m0665H7979J28677b1725k12929B06536
$$ 119731 -151026 -107921 -111224 213655 -161541 -202206 87979 216656 -21725 -234654 206536
17768D4940K88388a43146E7864O5310L6321l9267K4644n2418m4289i4176B32994
$$ 44940 333328 -143146 57864 123174 159495 120228 144872 92454 48165 -94176 232994
17756I9592D3565E394K96678e2276A81181b6723n6736B37390R883m8462J02380
$$ 99592 43565 5394 302072 -52276 181181 -26723 -83459 237390 247273 198811 301191
17745C01191B0403b28509G0180a62011g332E6886K17008E8287A0577J78133a9800
$$ 301191 20403 -228509 70180 -162011 -7332 56886 273894 58287 10577 188710 -19800
17733B28058i4970E18186d3930C42782a12410C53361J28289H4281J7470a74886
$$ 228058 -94970 518186 -43930 342782 -112410 353361 481650 84281 101751 -174886
17722B11969B3436k502J66430J43004a30435b4338A20183b90033B67981r2585
$$ 211969 23436 20934 187364 330368 -130435 -24338 120183 -290033 267981 175396
17712A75396J70761A57782g515H435M30551a37382G0511a1100j41027A79359f0833
$$ 175396 346157 157782 -7515 8435 438986 -137382 70511 -11100 -152127 179359 -60833
17700e6037K5970A39236b01332a9711C00716i8730K7582A03776K07646D9087J4325
$$ -56037 -30067 139236 -201332 -19711 300716 -98730 -71148 103776 311422 49087 63412
17689F3412R1224A0578d5354A11452E2854a3245A89331C0307a14400A88042n2612
$$ 63412 154636 10578 -45354 111452 52854 -13245 189331 30307 -114400 188042 135430
17678A35430r607C3127J27660M9976e1837D1904J92840A668K47536R715b3141
$$ 135430 125823 33127 160787 210763 -51837 41904 234744 1668 249204 258919 -23141
17666D42311A81781o1742E8130M01284e777A60886E9563h6218l4370d8446C5708
$$ 442311 181781 120039 58130 459414 -5777 160886 59563 -86218 -120588 -48446 35708
17654B09557D8495J73749b26337d1805a1170A30880g7242A25006c5003c486j8451
$$ 209557 48495 222244 -226337 -41805 -11170 130880 -77242 125006 -35003 -3486 -21937
17643b1937E091K35891c490l32634A79813a1451C03793a9371C3260L7802M283
$$ -21937 5091 240982 -3490 -336124 179813 -11451 303793 -19371 33260 71062 75345
17632G5345n376J05478q1123a21053B03482K4869q1493g1750C61773A22547J65395
$$ 75345 69969 175447 94324 -121053 203482 228351 146858 -71750 361773 122547 287942
17621B87942A22460a53249B24463c7371G6689l0237a2743D41929j84423a02586
$$ 287942 122460 -153249 224463 -37371 76689 46452 -12743 441929 257506 -102586
17610H022J85231k0522E628Q7576M7283J24617m6393a33577B34622K60369A57522
$$ 8022 193253 172731 5628 93204 140487 265104 218711 -133577 234622 494991 157522
17598H2469R3294k6346J81674r8688A0790R7993k1314M9487K93939g240B73191
$$ 82469 175763 149417 331091 232403 10790 108783 87469 136956 430895 -7240 273191
17586D1212J28070J03251n8611b53277A28489J88661o9343l4916j1634B2085L48104
$$ 41212 169282 272533 213922 -253277 128489 317150 247807 212891 201257 22085 370189
17575C70189c6736B15868G4766l2596J62706a73641B46870B0152J39288b470k91752
$$ 370189 -36736 215868 74766 42170 204876 -173641 246870 20152 159440 -2470 -294222
17564b94222B30282b4496A94281e6055G4032K04700M6655A59186B1211P7907K51921
$$ -294222 230282 -24496 194281 -56055 74032 278732 325387 159186 21211 99118 351039
17553C51039f9511C60415A66199o617G0971N0728J6077j4531D9577J09071K4191
$$ 351039 -69511 360415 166199 159582 70971 121699 137776 123245 49577 158648 182839
17542A82839q2043a57263C31366D2192J15415j106K72935j21798e4250B52451
$$ 182839 100796 -157263 331366 42192 157607 156501 429436 307638 -54250 252451
17531D00426j41234p1163E3586J88355l7970J74838o4484e6828B86964J65361
$$ 400426 259192 188029 53586 241941 203971 378809 314325 -56828 286964 452325
17521D52325D3961P4000K39279N4793j55789j22041j1491J29622A20049M65944
$$ 452325 43961 117961 357240 412033 256244 134203 122712 252334 120049 585993
17511E85993r2878L98391j74429j78671K91756O3438n8403j62504l01204K28708
$$ 585993 493115 891506 717077 538406 830162 893600 835197 672693 371489 600197
17501F00197j71470j75320N1768K989L40516J41441j20066K35883j29996K25834
$$ 600197 428727 253407 305175 308164 648680 790121 670055 905938 775942 1001776
17491A001776m06611o3821J49043k37109P1755J45789B57514A21356J47356Q0922
$$ 1001776 595165 531344 680387 443278 515033 660822 257514 121356 268712 349634
17481C49634K8863r428b20505C913P15518A51267J27798q9695C4832a11652E36054
$$ 349634 378497 369069 -220505 3913 719431 151267 279065 189370 34832 -111652 536054
17469D16480N959j62889J65689K3821r9209j23904M6986K64795M7822j36844i4632
$$ 416480 422439 259550 425239 449060 349851 225947 272933 537728 585550 448706 -94632
17457c6440G4397J45806G7439J81996H7471J61417K64357A72918A4302K76452
$$ -36440 74397 220203 77439 259435 87471 248888 513245 172918 14302 290754
17447B90754A04152J29623Q6872L1304j13845b51A88794n5276j4181J53719p0188
$$ 290754 104152 233775 320647 351951 238106 -251 188794 133518 119337 273056 202868
17436B02868K3750K30944j52548M6325L96508k25223j94344J89050p0921m0533
$$ 202868 226618 457562 305014 351339 747847 522624 328280 517330 446409 405876
17426D05876j51217N7889P5254m2173j50359J47437q856O4236P0374K27097p5553
$$ 405876 254659 312548 387802 345629 195270 342707 333851 398087 468461 695558 620005
17415F20005I6316L67598L1168A94378K51547J3125C3613L61967j00103p0539
$$ 620005 96316 463914 495082 194378 445925 459050 33613 395580 295477 224938
17405B24938J64693M2590j37622J68344F5604K16708P9205j4657q0052N5049K06699
$$ 224938 389631 432221 294599 462943 65604 282312 361517 346860 266808 321857 528556
17394E28556A38483K85383J43545A12442J7002O8045K63554m2234j88017n6211
$$ 528556 138483 423866 567411 112442 129444 197489 461043 418809 230792 174581
17384A74581J04987j06525J45269F9569L83682j52322J01006K6723D765L91204
$$ 174581 279568 173043 318312 69569 453251 300929 401935 428658 4765 395969
17374C95969R5532r5734b8189E49712j30157I8472J95206c3170D00815I552J30739
$$ 395969 491501 395767 -28189 549712 419555 98472 293678 -33170 400815 9552 140291
17363A40291b917C12558j4469A09066d5868E95896A34111P5279J04581K7108J8814
$$ 140291 -2917 312558 298089 109066 -45868 595896 134111 209390 313971 341079 359893
17352C59893r8200D3348h2091B14793L4081K0654o6113Q7722q9316J11850B6525
$$ 359893 261693 43348 -82091 214793 248874 269528 203415 291137 201821 313671 26525
17340A07321N13582j25540j19121P358j4394j78208B6149Q7580J50913n1307L6161
$$ 107321 620903 495363 376242 383600 369206 190998 26149 113729 264642 213335 249496
17329B49496L32118B86285n2776k9445R5631l3485L28164B257M97062o7704C0399
$$ 249496 581614 286285 233509 204064 299695 266210 594374 2257 499319 431615 30399
17317D03274j40044r8868K08551m9978r1629o5032K43653j31048q0822J31467
$$ 403274 263230 164362 372913 322935 231306 166274 409927 278879 198057 329524
17307C29524O8087j52964M2433J97780A76072k6139N0959e0260F56612l18977
$$ 329524 397611 244647 287080 484860 176072 149933 200892 -50260 656612 337635
17297C37635A67209o0544J6963N4303J60007m1675l6391J41960N8318B08175L05485
$$ 337635 167209 106665 123628 177931 337938 296263 259872 401832 460150 208175 513660
17286E13660j90599M894D075J86490M7087J61158O1877o0370A6309L07660C0570
$$ 513660 323061 327955 4075 190565 237652 398810 460687 400317 16309 323969 30570
17274A38867p778i3346C40493k9721R831J5499Q7768A14309K04361l5238L19316
$$ 138867 131089 -93346 340493 310772 320603 336102 423870 114309 318670 283432 602748
17263F02748B23147K05902A97777J36456l8020R1832A17854L81872A84865J06476
$$ 602748 223147 429049 197777 334233 296213 388045 117854 499726 184865 291341
17253B91341J50913j44784n5379J10751K2633A63866P2626J73588l3719O9981
$$ 291341 442254 297470 242091 352842 375475 163866 236492 410080 376361 446342
17243D46342B17608K96765j45377J72951A66357J02229n5189J75597E0992O52139
$$ 446342 217608 514373 368996 541947 166357 268586 213397 388994 50992 703131
17233G03131B47655L39728B83893M27093A62351K14099L6770P3067B37556L52967
$$ 703131 247655 587383 283893 710986 162351 376450 413220 486287 237556 590523
17223E90523B52890L92416A37505L59045k40818M19213A9538K82283J19818A18493
$$ 590523 252890 645306 137505 496550 255732 674945 19538 301821 421639 118493
17212H15795l06240j0939Q664A55962J35411J16438j55882L35207j88482j44558
$$ 815795 509555 498616 507280 155962 291373 407811 251929 587136 398654 254096
17202B54096L46572B21967O4900K1117n8566K8643J14067j2796d568E37707l8916
$$ 254096 600668 221967 286867 307984 249418 278061 392128 379332 -4568 537707 498791
17191D98791A69767L27599J7070k33795P0011L042K04065P1649j49637j01566
$$ 498791 169767 497366 514436 280641 350652 353694 557759 629408 479771 378205
17181C78205K59201C14448j4931Q4292r5580J99792R8519j3260k6122j31419P7
$$ 378205 637406 314448 299517 383809 288229 488021 586540 573280 547158 415739 415816
17170D15816P3393k406J54822m6532k35409p1684L0254J68009j23423K33449j06836
$$ 415816 489209 486803 641625 595093 359684 288000 318254 486263 362840 596289 489453
17159D89453n7516J08254A93735K56498N5379J22236k21887k0151J45106J47341
$$ 489453 431937 540191 193735 450233 505612 627848 405961 385810 530916 678257
17149F78257k92243L76512j83141l8433j3177j05173L6030J98695j94968O023
$$ 678257 386014 762526 579385 540952 527775 422602 458632 657327 462359 468382
17139D68382K98961M5191C60632K11185R2647B60664M09389J08579j13731P1191
$$ 468382 767343 812534 360632 571817 664464 260664 670053 778632 664901 736092
17129G36092N0488j56445B40483M77662K403o9579j56430M71104k37040j56706
$$ 736092 786580 630135 240483 718145 720548 650969 494539 965643 728603 571897
17119E71897j2026j72673J62651J78172J1504J12893l2584j15992k92651J87185
$$ 571897 559871 387198 549849 728021 739525 852418 819834 703842 411191 598376
17109E98376M00848A77527L45644J3232M4849J17458A71519M32885o5785K37445
$$ 598376 999224 177527 523171 536403 581252 698710 171519 604404 538619 776064
17099G76064K8658l78389J04297L21696C45527O55520r1370l45735J37698J16361
$$ 776064 804722 426333 530630 852326 345527 1001047 909677 563942 701640 818001
17089H18001l37404P0447L58541l12885m3539K15157Q5457k42219K92488j82569
$$ 818001 480597 551044 909585 596700 553161 768318 853775 611556 904044 721475
17079G21475k66330l6091L34515k34175N39866D28672O11862l17431P5904p3807
$$ 721475 455145 419054 753569 519394 1059260 428672 1040534 723103 799007 725200
17069G25200J35735j80637J73669j50785l6924J76704L0430O5247j64271P2345
$$ 725200 860935 680298 853967 703182 666258 842962 873392 938639 774368 846713
17059H46713p4928J2960J51285k85984Q4373j14962K4054L99420j64361O2756
$$ 846713 771785 784745 936030 650046 734419 619457 643511 1042931 878570 941326
17049I41326p4200k29687O2599L8224j43380K26525K2479p6951R52O1047R2261
$$ 941326 867126 637439 700038 738262 594882 821407 843886 766935 767887 828934 921195
17038I21195j32803J56477j987l05755J21198K83682j85968o4304L24012k91231
$$ 921195 788392 944869 942882 637127 758325 1042007 856039 791735 1115747 824516
17028H24516K70302K71072o10063K45757l42775R4346K68211K19355j86315O3131
$$ 824516 1094818 1365890 755827 1001584 658809 753155 1021366 1240721 1054406 1117537
17018A117537l688j1413l58036L93582k05775j69419M64420k60892K2818N9220
$$ 1117537 1113849 1102436 744400 1137982 932207 762788 1227208 966316 989134 1048354
17008A048354P0898K96671m90138k7439K56927K31728o89907N04937J62186l40429
$$ 1048354 1119252 1415923 925785 898346 1155273 1387001 697094 1202031 1364217 1023788
16998A023788L41784l92220j4356M40689m64998M28447k43725j96357J85011K64486
$$ 1023788 1365572 973352 958996 1399685 934687 1363134 1119409 923052 1108063 1372549
16988A372549J33151m32482L28047k23324J49361l38030K81365l83748O7375O65571
$$ 1372549 1505700 1073218 1401265 1177941 1327302 989272 1270637 886889 954264 1619835
16978A619835j41628l37047Q9079N63511m24972q5718J15852R5558q0141K31006
$$ 1619835 1478207 1141160 1230239 1793750 1368778 1283060 1398912 1494470 1414329 1645335
16968A645335m73988p4631J87671K38J06044J27944p6990K36111m39462K58149
$$ 1645335 1171347 1096716 1284387 1284625 1390669 1518613 1441623 1677734 1238272 1496421
16958A496421j0231p6566K3007L4003k17207K64845j72566K75741M5121j30412
$$ 1496421 1486190 1409624 1432631 1466634 1249427 1514272 1341706 1617447 1662568 1532156
16948A532156K36849m4843j47157K24508l00536K38623m5485R3901o3360p6545
$$ 1532156 1769005 1724162 1577005 1801513 1500977 1739600 1694115 1788016 1724656 1648111
16938A648111L11374j86717o3217L38758o65799L59507m0135M33240k49623r3660
$$ 1648111 1959485 1772768 1709551 2048309 1382510 1742017 1701882 2135122 1885499 1791839
16928A791839P4483J08925k46401L43942k1017J67669m2975J3483j72019O4911
$$ 1791839 1866322 1975247 1728846 2072788 2051771 2219440 2176465 2189948 2017929 2082840
16918B082840k1009j39966m8192K62770J14189j17169J16035K6369J90360J7060
$$ 2082840 2061831 1921865 1873673 2136443 2250632 2133463 2249498 2275867 2466227 2483287
16908B483287q9181j662p894K8214P5212j25920N2946K17353N6075k30729L09733
$$ 2483287 2394106 2392444 2384550 2412764 2487976 2362056 2415002 2632355 2688430 2457701 2767434
16897B767434m81957K51480o7633J38239J95094j57172J97944k92998j6460L33031
$$ 2767434 2285477 2536957 2469324 2607563 2802657 2645485 2843429 2550431 2533971 2867002
16887B867002k8883P2582K5028J60982j34381K24852K2667N6071R7858l2476j75597
$$ 2867002 2838119 2910701 2935729 3096711 2962330 3187182 3209849 3265920 3363778 3331302 3155705
16876C155705n0138K96615k38223K41074M7893j13433L06493r9570k10633K44889
$$ 3155705 3105567 3402182 3163959 3405033 3452926 3339493 3645986 3546416 3335783 3580672
16866C580672O3836o2133J11316p6758K16899J13400J67743j80364M8961j01329
$$ 3580672 3644508 3582375 3693691 3616933 3833832 3947232 4114975 3934611 3983572 3882243
16856C882243J32064M46390l1632k22409J77206j63342K07723k76276M41829o7110
$$ 3882243 4014307 4460697 4429065 4206656 4383862 4220520 4428243 4151967 4593796 4526686
16846D526686N30998l36632J04932O0324L97234j85124p1292L05449r9597L03109
$$ 4526686 5057684 4721052 4825984 4886308 5283542 5098418 5027126 5332575 5232978 5536087
16836E536087J04665l2463k0549N671N1582M07117m55470P77700j80438m7363
$$ 5536087 5640752 5608289 5587740 5593411 5644993 6052110 5596640 6374340 6193902 6146539
16826F146539J65980J89402k7761J47137J03680k77761N31434J66957j12164L33670
$$ 6146539 6312519 6501921 6474160 6621297 6724977 6447216 6978650 7145607 7033443 7367113
16816G367113J37850J00963J59239m8795J58704K78715J00091L68815L57722k47067
$$ 7367113 7504963 7605926 7765165 7716370 7875074 8153789 8253880 8622695 8980417 8733350
16806H733350M51441p2948k5591O34997j38600O9850J6349M50697J48902K73370
$$ 8733350 9184791 9111843 9086252 9721249 9582649 9652499 9668848 10119545 10268447 10541817
16796A0541817L64095L91829k92180Q997P09218N99921L5715P23648k06530K48929
$$ 10541817 10905912 11297741 11005561 11014558 11723776 12323697 12359412 13083060 12876530 13125459
16786A3125459N93978j31087M05945N96485K8153P90774n4123N15914L24249L56481
$$ 13125459 13719437 13588350 13994295 14590780 14618933 15409707 15355584 15871498 16195747 16552228
16776A6552228L02911P48427K44643N33409L53223O26120L33819N59450R36398
$$ 16552228 16855139 17603566 17848209 18381618 18734841 19360961 19694780 20254230 21190628
16767B1190628M40129M69909O85187P51038Q24156M53180P81058P66080J054241
$$ 21190628 21630757 22100666 22785853 23536891 24361047 24814227 25595285 26361365 27415606
16758B7415606O54776Q55474Q82949Q08660J038767J228794J340140J041771P54623
$$ 27415606 28070382 28925856 29808805 30617465 31656232 32885026 34225166 35266937 36021560
16749C6021560J548495J548060J120088J157227J797918J624717J438155J464690
$$ 36021560 37570055 39118115 40238203 41395430 43193348 44818065 46256220 47720910
16741D7720910J901020J895358J635883K295983K056283K134004K215458K370156
$$ 47720910 49621930 51517288 53153171 55449154 57505437 59639441 61854899 64225055
16733F4225055K418110K919553K318745L078807K633947K864489K788198L101922
$$ 64225055 66643165 69562718 71881463 74960270 77594217 80458706 83246904 86348826
16725H6348826L063996L119470L066159L132931L307613L227227K892134L186712
$$ 86348826 89412822 92532292 95598451 98731382 102038995 105266222 108158356 111345068
16717A11345068K831126K567331K530807K716324K110165J892252J610962J146744
$$ 111345068 114176194 116743525 119274332 121990656 124100821 125993073 127604035 128750779
16709A28750779J296926N92119N69712k75249M7632j171100o09592j572180j744521
$$ 128750779 130047705 130639824 131209536 130934287 130981919 129810819 129201227 127629047 125884526
16700A25884526j790094k100216k554992k782937k424734l297193k968185k832260
$$ 125884526 124094432 121994216 119439224 116656287 114231553 110934360 107966175 105133915
16692A05133915l475170l122056l124933l434303l156814l093304k888602l154107
$$ 105133915 101658745 98536689 95411756 91977453 88820639 85727335 82838733 79684626
16684G9684626k655333l158475k627878k634288k934112k331612k488478k229316
$$ 79684626 77029293 73870818 71242940 68608652 65674540 63342928 60854450 58625134
16676E8625134k021978k167999j911985k218898j773858j551845j654110k161941
$$ 58625134 56603156 54435157 52523172 50304274 48530416 46978571 45324461 43162520
16668D3162520j050745j957179j026545j531445j476409q25471j433550j122032
$$ 43162520 42111775 40154596 39128051 37596606 36120197 35294726 33861176 32739144
16660C2739144j568875l90811j024987j310700r83825r20101p04578p84214l06856
$$ 32739144 31170269 30779458 29754471 28443771 27459946 26539845 25835267 25051053 24744197
16651B4744197j215119l07464p27709r59929l89440o67646p56514l37142n93525
$$ 24744197 23529078 23221614 22493905 21533976 21144536 20476890 19720376 19383234 18789709
16642A8789709m63878n43757p06486k69157l07419l58507p33031k41863o53530
$$ 18789709 18325831 17782074 17075588 16806431 16499012 16140505 15407474 15165611 14512081
16633A4512081J67582m03117l46216m52360p00286J11633m40062l13447k66956
$$ 14512081 14679663 14276546 13930330 13477970 12777684 12889317 12449255 12135808 11868852
16624A1868852q4338j10225p08978k8647p56485j11335N7940j56327l58226R7672
$$ 11868852 11784514 11674289 10965311 10936664 10180179 10068844 10126784 9970457 9612231 9709903
16614I709903n57709j56800r1140p6729L5879j96810l01138n08629L07025k88872
$$ 9709903 9152194 8995394 8904254 8827525 8863404 8666594 8365456 7856827 8163852 7874980
16604G874980Q5119l45907l83881K79993l08155L20287m08463j75192k69590q7058
$$ 7874980 7960099 7614192 7230311 7510304 7202149 7522436 7113973 6938781 6669191 6582133
16594F582133m57313M15448m46834J6764l6971j54589L7337l05249K44287l44455
$$ 6582133 6124820 6540268 6093434 6110198 6073227 5918638 5955975 5650726 5895013 5550558
16584E550558n6506j50578L392p9298k37426J1429j80478j75739J70237l09596
$$ 5550558 5494052 5343474 5346866 5267568 5030142 5041571 4861093 4685354 4855591 4545995
16574D545995K8487J87633k55591J30321K0421k93578m42066N67465l22966q152
$$ 4545995 4574482 4762115 4506524 4636845 4657266 4363688 3921622 4489087 4166121 4157969
16564D157969K91406l09443l77909K57183L326j23035m9231K0197R6197k89035
$$ 4157969 4449375 4139932 3762023 4019206 4022532 3899497 3850266 3870463 3966660 3677625
16554C677625j79852l5188M9512p8437P5672m17925L32902l37507J13467m52279
$$ 3677625 3497773 3462585 3512097 3433660 3509332 3091407 3424309 3086802 3200269 2747990
16544B747990K22661J60383n17808K73838j1928j05774j91375K93522J85167k57232
$$ 2747990 2970651 3131034 2613226 2887064 2875136 2769362 2577987 2871509 3056676 2799444
16534B799444K32331l98722L12499l03033k7811j30260Q3972m4684M6341j57824
$$ 2799444 3031775 2633053 2945552 2642519 2614708 2484448 2568420 2523736 2570077 2412253
16524B412253M2009k5513j68809K36216l1610m30475N8948L2438K42419j16167
$$ 2412253 2454262 2428749 2259940 2496156 2464546 2034071 2093019 2125457 2367876 2251709
16514B251709k75607M20073l44461J78815n975m27993L51014j72150M7728m85178
$$ 2251709 1976102 2396175 2051714 2230529 2224554 1796561 2147575 1975425 2023153 1537975
16504A537975J69268M46413J83566j71815J8195j42368j75639l5424K1059O4097
$$ 1537975 1707243 2153656 2337222 2165407 2183602 2041234 1865595 1830171 1851230 1915327
16494A915327M1957M0836m47345K33720J39146l928l35464j50507K20275J0473
$$ 1915327 1957284 1998120 1550775 1784495 1923641 1919713 1584249 1433742 1654017 1664490
16484A664490k71138J11215p2855K72369k29405L2697k12556o1288O69144m49991
$$ 1664490 1393352 1504567 1431712 1704081 1474676 1507373 1294817 1233529 1902673 1452682
16474A452682K69686k08054n7453R507l1916j43313l5627L31361j21787j06638
$$ 1452682 1722368 1514314 1456861 1466368 1434452 1291139 1255512 1586873 1465086 1358448
16464A358448N2101j38267K30771o7931J36976n07505K48291k89688M37099l2197
$$ 1358448 1410549 1272282 1503053 1435122 1572098 1064593 1312884 1023196 1460295 1428098
16454A428098k56681O1872R8910l01534j9335L98057q8686l6953k75960j68108
$$ 1428098 1171417 1233289 1332199 1030665 1011330 1409387 1320701 1283748 1007788 839680
16444H39680P55796o03398k9949p5871K59922p3617J54155J24172k26698p5503
$$ 839680 1595476 992078 962129 886258 1146180 1072563 1226718 1350890 1124192 1048689
16434A048689J32236q0707k84620M24727j49947K2122j67344p2447K04853M8855
$$ 1048689 1180925 1100218 815598 1240325 1090378 1112500 945156 872709 1077562 1126417
16424A126417K62139l44197j59896L38843j58158r4389J81593k81548J10192j19881
$$ 1126417 1388556 1044359 884463 1223306 1065148 970759 1152352 870804 980996 861115
16414H61115j31453N01603j41716k24884j3600L03407j16152R055p4585r6278
$$ 861115 729662 1231265 1089549 864665 851065 1154472 1038320 1047375 972790 876512
16404H76512k7202l01444M02802j08133J3217l06585K36029j3315N2401R6979
$$ 876512 849310 547866 950668 842535 855752 549167 785196 771881 824282 921261
16394I21261q4607m2970j1927Q9763j15473P8992r1797P6527k30217j56154Q09379
$$ 921261 836654 793684 781757 871520 756047 835039 743242 819769 589552 433398 1242777
16383A242777n29386K54007m13110N4409K41441o3867Q8447j95649J29489J00812
$$ 1242777 713391 967398 554288 608697 850138 786271 874718 679069 808558 909370
16373I09370K7436D30661K23115j10003O44958q9357B99769M48300r732k05857
$$ 909370 936806 430661 653776 543773 1188731 1099374 299769 748069 738337 532480
16363E32480k632K05349n5567m2442O2589j47185N3411j93256M80259k34450n2206
$$ 532480 529848 735197 679630 637188 699777 552592 606003 412747 893006 658556 606350
16352F06350j33779J17529K57078k39213n6881q2323J9576j43982k7216Q8094
$$ 606350 472571 590100 847178 607965 551084 468761 488337 344355 317139 405233
16342D05233K50423K9122j90041j25291M01718k99842p509N9163J79998L51457
$$ 405233 655656 684778 494737 369446 771164 471322 463813 522976 702974 1054431
16332A054431l56715r0214B07982M57870k36449K9825m1764L13562l19067K95325
$$ 1054431 697716 607502 207982 665852 429403 459228 417464 731026 411959 707284
16322G07284k66214o3402M10888m6880q9756j71559K09441o4662j29538j37116
$$ 707284 441070 377668 788556 741676 651920 480361 689802 625140 495602 358486
16312C58486P3204j37864K58595k00279J48820k16717N75309k41335k75180n9427
$$ 358486 431690 293826 552421 352142 500962 284245 859554 618219 343039 283612
16302B83612N68333C52193K43081r751q3626m3830K2083j28608j49212R2504K49261
$$ 283612 851945 352193 595274 585523 501897 458067 480150 351542 202330 294834 544095
16291E44095P6553A58511K08312o1392J19354J55313B68890K08338J92760B75065
$$ 544095 620648 158511 366823 305431 424785 580098 268890 477228 669988 275065
16280C57565K2605q8052J93421A76497M98599j54445r1489K6305A20128J9621
$$ 357565 380170 292118 485539 176497 675096 520651 429162 455467 120128 139749
16270A39749M5195J65994j56803L34857r2988B17406l9372o5762K57252l7970
$$ 139749 184944 350938 194135 528992 436004 217406 178034 112272 369524 331554
16260C31554A60306L25034K622j73666K67747A68376Q3944J33646o417N4053n3481
$$ 331554 160306 485340 487962 314296 582043 168376 252320 385966 379549 433602 380121
16249C80121M401P751j66334M2169J9403o536K27647j84824K5567A56171K97095
$$ 380121 384522 392273 225939 268108 287511 280975 508622 323798 349365 156171 453266
16238D53266k06337M7474m195B3133M12467j71573E9901K45137H1443K70941J28573
$$ 453266 246929 294403 290208 23133 435600 264027 59901 305038 81443 352384 480957
16227D80957j83549Q0809j14144R5499j69993R6320j6536F3759j405K16579k9278
$$ 480957 297408 378217 264073 359572 189579 285899 269363 63759 62354 278933 249655
16216B49655n121K84089A28740g4752C72872l8726j51709a43060F60580A42204
$$ 249655 244534 528623 128740 -74752 372872 334146 182437 -143060 660580 142204
16205A0880J71641j9947k5482J53277j41829K92347J2742j65443K33174A10466
$$ 10880 182521 162574 137092 290369 148540 440887 453629 288186 521360 110466
16194B65128K95455J33334k22570C5046K13999J70076A68520m4130J36693r9465
$$ 265128 560583 693917 471347 35046 249045 419121 168520 124390 261083 161618
16184A61618J94177A61386E3235J8442a37338C07667C5727J72955L6722b70971
$$ 161618 355795 161386 53235 71677 -137338 307667 35727 208682 245404 -270971
16173E43328k63884J30776A28084L20789j66903h8467A18333L28066j65988A03465
$$ 543328 279444 410220 128084 448873 281970 -88467 118333 446399 280411 103465
16162C90444a94189C97899A19421L4879K69265A01817m8244a3512B30092a4323
$$ 390444 -194189 397899 119421 154300 423565 101817 53573 -13512 230092 -14323
16151B7096K11238K13119j39654b03244A75158n0594J03543N3866A32230J46277
$$ 27096 238334 451453 311799 -203244 175158 124564 228107 281973 132230 278507
16141B78507j18443K39304a2663r2722A62039K32489A06004P7152J14676j44193
$$ 278507 160064 399368 -12663 -105385 162039 394528 106004 183156 297832 153639
16131A53639n7797d1640D0090G58N9069J35144e6540C9470Q012J25680Q763D5317
$$ 153639 95842 -41640 40090 758 59827 194971 -56540 39470 47482 173162 181925 45317
16118B72286p3993e6961A23475J98770B5078N594J90915J43723a74390D00593
$$ 272286 198293 -56961 123475 322245 25078 30672 221587 365310 -174390 400593
16107D59103j73004K37381b07509g0158F7878b18492A58868a61608J1680A40666
$$ 459103 286099 523480 -207509 -70158 67878 -218492 158868 -161608 -149928 140666
16096b4805A03818g5537C92150b5787D1211R4735L4684a10373A89372K14016e065
$$ -24805 103818 -75537 392150 -25787 41211 135946 170630 -110373 189372 403388 -5065
16084E2819a55965B34565j7868r3224l0937q706l5388K66603f3659q8541h958
$$ 52819 -155965 234565 216697 123473 92536 83830 48442 315045 -63659 -152200 -8958
16072B60549L2417D1492h8210A9265i8652A79044G5299L3171J095m3047e5367
$$ 260549 292966 41492 -88210 19265 -98652 179044 75299 108470 109565 66518 -55367
16060B0725J75303l0101K0294j4809N9399G3373J88038a41741A9158M4028g6065
$$ 20725 196028 165927 186221 171412 230811 73373 261411 -141741 19158 63186 -76065
16048D9821a24574d1240B85902j12537b43320A55247R2640J29434a38697L4989
$$ 49821 -124574 -41240 285902 173365 -243320 155247 247887 377321 -138697 -103708
16038a03708B65581j11707J8364E1731J19436N9948b125E5346J42818e2976A90572
$$ -103708 265581 153874 172238 51731 171167 231115 -2125 55346 198164 -52976 190572
16026A74396m1532E6539K41824P0341A39102c01814N8165a14520A22351J00909
$$ 174396 132864 56539 298363 368704 139102 -301814 -243649 -114520 122351 223260
16016B23260l9189a72689J7398p3229A33777B5230L3196a74492C08453b53500
$$ 223260 184071 -172689 -155291 -228520 133777 25230 58426 -174492 308453 -253500
16005b0953p0369q3023d1888H6565J18470g6185A89842D1218K71180a6183C05398
$$ -20953 -91322 -174345 -41888 86565 205035 -76185 189842 41218 312398 -16183 305398
15993a20824B05479D8566A3234a30657f3953F2374N5050a05690A03733J80679
$$ -120824 205479 48566 13234 -130657 -63953 62374 117424 -105690 103733 284412
15983B84412I8560m5688J68975e6825C64463H9434l3877A3993R2772L38973j92482
$$ 284412 98560 52872 221847 -56825 364463 89434 55557 13993 106765 445738 253256
15972B53256O57882l45480K38413J54419n557n8067j97689B64145K04866A92433
$$ 253256 911138 565658 804071 958490 952933 894866 697177 264145 469011 192433
15961A53103N5535Q1272r4760J94581C9424J98659J42877c57806a42321M2326
$$ 153103 208638 289910 195150 389731 39424 238083 380960 -357806 -142321 -99995
15951i9995I3670a87418C41755j44747l1672p936j2077L9135a45091q9341E8036
$$ -99995 93670 -187418 341755 197008 165336 157400 145323 184458 -145091 -234432 58036
15939b14815j01398A01328J46728a475m3846B38273h1657A03910O1621o9985c0901
$$ -214815 -316213 101328 248056 -1475 -45321 238273 -81657 103910 165531 95546 -30901
15927b81339J27363L8737A0124K49079b03781b291k25896B18981E8640A9171G587
$$ -281339 -153976 -115239 10124 259203 -203781 -2291 -228187 218981 58640 19171 7587
15915g7201A18813a0731B30686f8830j72836F4459b2332j8826k57488a0417p9019
$$ -77201 118813 -10731 230686 -68830 -241666 64459 -22332 -41158 -298646 -10417 -89436
15904h9436F1563b62992a9847K14p5250A61574G3251b1256m0963A21368R6688
$$ -89436 61563 -262992 -19847 -19633 -94883 161574 73251 -21256 -62219 121368 218056
15893B18056n950b89652c2906j85535N4377m7535G2347L70688C4770b01043f5637
$$ 218056 212106 -289652 -32906 -218441 -164064 -211599 72347 443035 34770 -201043 -65637
15881A37469l2909a45629q1980O5376L5287A72486f6962j26667A6751a20577d2686
$$ 137469 104560 -145629 -227609 -162233 -126946 172486 -66962 -193629 16751 -120577 -42686
15869g2198k12034g6150n46A21561d6010j85762F6566a14535B5506P3784a32013
$$ -72198 -284232 -76150 -76696 121561 -46010 -231772 66566 -114535 25506 99290 -132013
15857a84807B5118Q0179f1168E691b178A64252C1072a16224q4755A57967a33073
$$ -184807 25118 105297 -61168 5691 -2178 164252 31072 -116224 -200979 157967 -133073
15845F6568K21589C7628g1475B47557F2107M0990a06315n2885H5817c06398Q1282
$$ 66568 288157 37628 -71475 247557 62107 103097 -106315 -159200 85817 -306398 -225116
15834b25116B35317f9562D4839i4657m3851E1727g185j08738a3462D57767A08733
$$ -225116 235317 -69562 44839 -94657 -138508 51727 -7185 -115923 -13462 457767 108733
15822A02694l5210O5510F1363d2355F1918A3769c52351a01768p9692A17713f3293
$$ 102694 67484 132994 61363 -42355 61918 13769 -352351 -101768 -181460 117713 -63293
15810b2756k68408M9165A79787o8291g3730B3269a11143H0934i2139I8206J6285
$$ -22756 -291164 -241999 179787 111496 -73730 23269 -111143 80934 -92139 98206 114491
15799A14491a46958L4219j14922N851M4551r771A72939b0893j87018C5315e0665
$$ 114491 -146958 -112739 -227661 -221810 -177259 -187030 172939 -20893 -207911 35315 -50665
15787a69119j70021J55800A17347d5912B2765K77753a9104j70537B80412C8861
$$ -169119 -339140 -183340 117347 -45912 22765 300518 -19104 -189641 280412 38861
15776e5655B23621H5458a44875j34687Q8997Q2335A1983a7859E5346K4652g5946
$$ -55655 223621 85458 -144875 -279562 -190565 -108230 11983 -17859 55346 79998 -75946
15764a55010j8043I5991J51171j02564a08684k84237a18416L8673A57898A3803
$$ -155010 -173053 95991 247162 144598 -108684 -392921 -118416 -79743 157898 13803
15753a43682A5630N8254c4364p1176N0171j6234b1105n7922c0248B18696C758
$$ -143682 15630 73884 -34364 -105540 -55369 -71603 -21105 -79027 -30248 218696 3758
15741a58995J1330N0770A05672Q9961b55741b5033C15483A12449a25797k3460
$$ -158995 -147665 -96895 105672 195633 -255741 -25033 315483 112449 -125797 -149257
15731a49257A78816K09776k6603H8716i874A77790K726L6283F1046K5329A3679
$$ -149257 178816 388592 361989 88716 -9874 177790 180516 216799 61046 86375 13679
15719A52147g3410m9711M5934A09683D1469M2472J41079c1316j17294j67696e1821
$$ 152147 -73410 -123121 -77187 109683 41469 83941 225020 -31316 -148610 -316306 -51821
15707b99164H285i5932B10844a41676K6286M8086A2778b27744E6775d24330B90635
$$ -299164 8285 -95932 210844 -141676 -115390 -67304 12778 -227744 56775 -424330 290635
15695a05296B80779j20974L3869b354k17751J07633j90435a17267n7774G2020
$$ -105296 280779 159805 193674 -2354 -220105 -112472 -302907 -117267 -175041 72020
15684b1881L849k549A728f521D1385J76388a16507D157L96883A28631J72024j41584
$$ -21881 -18032 -20581 1728 -6521 41385 217773 -116507 4157 401040 128631 300655 159071
15672A59071a42948B67368i2457C2280c8649j882C63683H9358a07008j47826N959
$$ 159071 -142948 267368 -92457 32280 -38649 -40531 363683 89358 -107008 -254834 -248875
15661b48875d2430C7956b40239Q4651c8262m7574C3623R8686b09948A19726n3912
$$ -248875 -42430 37956 -240239 -155588 -38262 -85836 33623 132309 -209948 119726 65814
15650F5814Q5119i9741K4540j12775Q5046r7043Q0729b3555I0412K41870c61042
$$ 65814 150933 -99741 -75201 -187976 -102930 -199973 -119244 -23555 90412 332282 -361042
15638B43944a94535B5392K4310K12162c2719n6970k85067J51376r903I1932a53375
$$ 243944 -194535 25392 49702 261864 -32719 -89689 -374756 -223380 -233283 91932 -153375
15626F326K37849j08749P3872c35898e9378B62671b70314A57926M8774I146f6213
$$ 6326 244175 135426 209298 -335898 -59378 262671 -270314 157926 206700 9146 -66213
15614a85422A15546g3595o1163A6783P511F277M2438a24829j7641k34043A57835
$$ -185422 115546 -73595 -134758 16783 24294 6277 48715 -124829 -142470 -376513 157835
15602d09315B8175b25237l7347A07563a31053K9424g808F2464E554a89316M9748
$$ -409315 28175 -225237 -262584 107563 -131053 -101629 -7808 62464 5554 -189316 -139568
15591a39568o4082k70326a4760G3666a37891r7277E3126K7661Q6560b51047E984
$$ -139568 -203650 -473976 -14760 73666 -137891 -235168 53126 80787 167347 -251047 5984
15579b69350C6520R5757A9396a96164B91456j13554d00439a29903A22766M7078
$$ -269350 36520 132277 19396 -196164 291456 177902 -400439 -129903 122766 169844
15569A69844k0669a77222l9978d0788j4361K4748A03478K1339K6044d8934B56775
$$ 169844 149175 -177222 -217200 -40788 -55149 -30401 103478 124817 150861 -48934 256775
15557A39049M3506l3440k5044a40148F9385c3300A36123J38601C3746f3236m34
$$ 139049 182555 149115 124071 -140148 69385 -33300 136123 274724 33746 -63236 -63670
15546f3670A60129J32713A33632j5460a84931j66068G3525i6966C6237a36942
$$ -63670 160129 292842 133632 118172 -184931 -350999 73525 -96966 36237 -136942
15535A26109M6558A4007J85972l1577b17491d8276d742l3362A08369a13196e491
$$ 126109 172667 14007 199979 168402 -217491 -48276 -4742 -38104 108369 -113196 -5491
15523h8801A1403a48083N8694C7866A2525K1183b8871J308k44216F8429A1910
$$ -88801 11403 -148083 -89389 37866 12525 33708 -28871 -27563 -271779 68429 11910
15511B46525L0893i130A38205L0477j0446K87127c8567A67843C6316P5412M2344
$$ 246525 277418 -9130 138205 168682 158236 445363 -38567 167843 36316 111728 154072
15500A54072B4537c0248B36694f1705C29419j62417J39759j49207k7087l3932
$$ 154072 24537 -30248 236694 -61705 329419 167002 306761 157554 130467 96535
15490I6535A2303L08173J15903j49527Q21p8567Q3855d2253J3719G9203M6811
$$ 96535 12303 320476 436379 286852 287673 209106 292961 -42253 -28534 79203 126014
15479A26014J17798r8679k4166g1329D33325A27068h9043B34156h3011E0069a13261
$$ 126014 243812 145133 120967 -71329 433325 127068 -89043 234156 -83011 50069 -113261
15467b4784D10405j67320G2968a76991H372J16506J00470D9798M69747r6800r1509
$$ -24784 410405 243085 72968 -176991 8372 124878 225348 49798 519545 422745 331236
15456C31236j8610K39400k73864b68223D30420c58183D1186M05639a090B4256
$$ 331236 312626 552026 278162 -268223 430420 -358183 41186 446825 -1090 24256
15445C72057a0439E9100P8832O148N2862N8864o3823A0890d4062C9130J69738
$$ 372057 -10439 59100 137932 144080 196942 255806 191983 10890 -44062 39130 208868
15434B08868q8777p985J09357K81800B49965L27763A65471j0392N47657K77909
$$ 208868 120091 112106 221463 503263 249965 577728 165471 155079 702736 980645
15424I80645k03101q8486m3855k03406A30306E7943P3119K19828b65883b6144
$$ 980645 777544 689058 645203 441797 130306 57943 131062 350890 -265883 -26144
15413D3309E218K2990b24170A75896l6299l1095C0292d2148B70388a62971A12109
$$ 43309 5218 28208 -224170 175896 139597 108502 30292 -42148 270388 -162971 112109
15401c3815D8643Q8189g1939G1664a21065C84658g6358D0555J39065M4506b58681
$$ -33815 48643 136832 -71939 71664 -121065 384658 -76358 40555 179620 224126 -258681
15389H0714o481a04651C2267J81245C5209J070J81981E019d2079j57676A35395
$$ 80714 74233 -104651 32267 213512 35209 36279 218260 5019 -42079 -199755 135395
15377c06389A72381i5536l8197k08496G9035P7050c7536q8813A13264J75683h2580
$$ -306389 172381 -95536 -133733 -342229 79035 156085 -37536 -126349 113264 288947 -82580
15365A65925g3470D19358b78827C15013d05947C50575F4722a63137D05990I130
$$ 165925 -73470 419358 -278827 315013 -405947 350575 64722 -163137 405990 9130
15354D69145j80814R0705A70661p4521J99897p0589a5576b344B15681J14572j36131
$$ 469145 288331 379036 170661 96140 296037 225448 -15576 -2344 215681 330253 194122
15343A94122q9158J45756n0975l9436J45164b45033A5589J95918l1342J20438
$$ 194122 104964 250720 199745 160309 305473 -245033 15589 211507 180165 300603
15333C00603P9541a18195A45975L5701L45169j04118l0283l5543A65685H0228
$$ 300603 380144 -118195 145975 181676 526845 422727 392444 356901 165685 80228
15322A34036L49959b0967p6515C93791c3224A27324E8573K34488j37443P7677
$$ 134036 483995 -20967 -97482 393791 -33224 127324 58573 293061 155618 233295
15312B33295E8631L842K02025r6157J58307D1330J76447j318a41568j24228B29832
$$ 233295 58631 62473 264498 168341 326648 41330 217777 216459 -141568 -265796 229832
15300A86782a67728E27292A74318P060l7736D2011K61592J25163K14929l10256
$$ 186782 -167728 527292 174318 181378 143642 42011 303603 428766 643695 333439
15290C33439j08465H7308A9218i2320D13533o6412e801A9515J49375j1279H47
$$ 333439 224974 87308 19218 -92320 413533 347121 -5801 19515 168890 157611 847
15278C10892i3767A32067L01119f9721b1301F02032B75J7397J4585b43127o9543
$$ 310892 -93767 132067 433186 -69721 -21301 602032 275 17672 32257 -243127 -312670
15267c12670A9291J05450K60536a43008a8726C75569I9723a18478D8204a39985
$$ -312670 19291 124741 385277 -143008 -18726 375569 99723 -118478 48204 -139985
15256D7561a06705B474a3943A12666a95991N0593q1601a09495A72697a85011B89573
$$ 47561 -106705 2474 -13943 112666 -195991 -145398 -226999 -109495 172697 -185011 289573
15244b37615B55924o6421G1133J06873a00347B25311r2370L31407G9457A2146
$$ -237615 255924 189503 71133 178006 -100347 225311 132941 464348 79457 12146
15233D8280L45468j2312j28726J39025h4182I92191L33908K76570l33615O33300
$$ 48280 393748 381436 252710 391735 -84182 992191 1326099 1602669 1269054 1902354
15223A902354n48956m26516k58259l01246M7411H6706J00805h2841B49597c05457
$$ 1902354 1353398 926882 668623 367377 414788 86706 187511 -82841 249597 -305457
15212I1066J36497J05998I8562P157R62K02999j45327K0764b15049A52062i3025
$$ 91066 227563 333561 98562 105719 106681 309680 164353 185117 -215049 152062 -93025
15200G7577b04980q0496A81892d0961C04379K05360a5073D3762J41763Q9349H0206
$$ 77577 -204980 -285476 181892 -40961 304379 509739 -15073 43762 185525 274874 80206
15188I7799e5354k87318f5254B5666J12616P7997a03750B9815K98860G8518L32766
$$ 97799 -55354 -342672 -65254 25666 138282 216279 -103750 29815 328675 78518 411284
15177D11284A18518M2571l013F2424Q1261B6871Q1015b05017C92466J062a26198
$$ 411284 118518 161089 158076 62424 143685 26871 107886 -205017 392466 393528 -126198
15165I9701O6113q2038O9556C2152J32448N5539B9708K90534a67085C1286L3062
$$ 99701 165814 83776 153332 32152 164600 220139 29708 320242 -167085 31286 64348
15154F4348D35J60544E3231j7312J96634g3086A13267I345K38581f397A89438
$$ 64348 435 160979 53231 35919 232553 -73086 113267 9345 247926 -6397 189438
15142g6697B06137b4173C41344J11246G2711a23344C43006a21569F18593g2308
$$ -76697 206137 -24173 341344 452590 72711 -123344 343006 -121569 618593 -72308
15131B17658N0497b26443B13926c6242B58118J4560J08c06168J42164D81475A87323
$$ 217658 268155 -226443 213926 -36242 258118 272678 272786 -306168 -164004 481475 187323
15119B13570q0372h1929A70464C7807a44843B07491e522D39389A94215J55225
$$ 213570 133198 -81929 170464 37807 -144843 207491 -5522 439389 194215 349440
15109C49440j03190N4702j2806m1440J98552q3523A25219M37076B44801m2397
$$ 349440 246250 300952 288146 246706 445258 361735 125219 562295 244801 202404
15099B02404J89203A86034a6769C87905j33992J5341r7063i0544A38352h3624
$$ 202404 391607 186034 -16769 387905 253913 269254 172191 -90544 138352 -83624
15088A77435M9381F0482h5111B13868k1036L5736H1657N8899k0711l9287M6118
$$ 177435 226816 60482 -85111 213868 192832 228568 81657 140556 119845 80558 126676
15077A26676J20618A9603b9291A74627j3138K23256B3799J08314f6170j10840
$$ 126676 247294 19603 -29291 174627 161489 384745 23799 132113 -66170 -177010
15067a77010H6168b38817C3550J68314d8386J9201a0749l35253C92052m4435p7537
$$ -177010 86168 -238817 33550 201864 -48386 -29185 -10749 -346002 392052 347617 270080
15056B70080D6583R6240D6293O4144K24451O1874b41165A51751p1073a44643E38151
$$ 270080 46583 142823 46293 110437 334888 396762 -241165 151751 80678 -144643 538151
15044D09753j60982Q036n8512K5034j0220O1900j28572N4421J52562H646N11910
$$ 409753 248771 256807 198295 223329 213109 275009 146437 200858 353420 8646 520556
15033E20556j38146L44615B23959K20236m4211j69791J75072A77186K50273E1176
$$ 520556 382410 727025 223959 444195 399984 230193 405265 177186 427459 51176
15022D74494m5186A14758L94918k32943J65682L51113l82344J1350J16953p8853
$$ 474494 429308 114758 509676 276733 442415 793528 411184 422534 539487 460634
15012D60634K7803K82913j88337q7928J53937A89972K49631N145n6152L21535
$$ 460634 488437 771350 583013 495085 649022 189972 439603 444748 388596 710131
15002G10131B89600K57265j85869R5083k4763j33636n2205r5992K64686K07672
$$ 710131 289600 546865 360996 456079 431316 297680 245475 149483 414169 621841
14992F21841k15053J22958A99831J78618m132A52942O558K23124J62614j92285
$$ 621841 406788 529746 199831 378449 374317 152942 159500 382624 545238 352953
14982C52953O8112j20968P2335Q110n1389J7548J72544F6286M23311j08793J4885
$$ 352953 421065 300097 372432 380542 329153 346701 519245 66286 489597 380804 395689
14971C95689M21021l50164o4571K16680j4588R2969j73558K65578k1744j96113
$$ 395689 816710 466546 401975 618655 604067 697036 523478 789056 767312 571199
14961E71199k01236a3740D89840O8732R996n5998L35549r9653k2696C49367N1490
$$ 571199 369963 -13740 489840 558572 568568 512570 848119 748466 725770 349367 400857
14950D00857A10338L00337J5093M9211r1510J8916j94796L75580j44271j64067
$$ 400857 110338 410675 425768 474979 383469 402385 207589 583169 438898 274831
14940B74831m8427H9994L98707j84354J88431J0798A82473O34659D1472N71481
$$ 274831 226404 89994 488701 304347 492778 503576 182473 817132 41472 612953
14930F12953k50480j00113L73422l4927r3381Q2962R683p9942j87686J96933R894
$$ 612953 362473 262360 635782 600855 507474 590436 600119 520177 332491 529424 539318
14919E39318k53547L73967M7229K64719k67053L42653K54905J9480N06915l73803
$$ 539318 285771 659738 706967 971686 704633 1047286 1302191 1321671 1828586 1454783
14909A454783n4364J82426K42797o89248L14619p9099L62775n5810K87112J77983
$$ 1454783 1400419 1582845 1825642 1136394 1451013 1371914 1734689 1678879 1965991 2143974
14899B143974j73199j82802q32875K29611j47182j00291J02219k30312p4591k13471
$$ 2143974 1970775 1787973 955098 1184709 1037527 937236 1039455 809143 734552 521081
14889E21081J40630Q6368F0820O06802C03494K76191j07972J87143j11567L4209
$$ 521081 661711 748079 60820 667622 303494 579685 471713 658856 547289 581498
14879E81498n0980O3085j97149R6044M52275C17628K90802R0150P4160j21218
$$ 581498 530518 593603 396454 492498 944773 317628 608430 698580 772740 651522
14869F51522J21709L4284n6699l37792K55514K99538j89691P7472j20024J09416
$$ 651522 773231 807515 750816 413024 668538 968076 778385 855857 735833 845249
14859H45249l06940k65875M76817p8151J69823l29045J177L10692j57428J94617
$$ 845249 538309 272434 749251 671100 840923 511878 513055 823747 666319 860936
14849H60936r7931K67764j95055k59698J98594l38069j32359K84564k58252m2164
$$ 860936 763005 1030769 835714 576016 774610 436541 304182 588746 330494 288330
14839B88330R1243n899P0102p8980J55530o6133K43234o2570J43656R7115j74200
$$ 288330 379573 373674 443776 364796 520326 454193 697427 634857 778513 875628 701428
14828G01428j0677L88788j29453K33385N6997q4851r5803R6922k83781J22034
$$ 701428 690751 1079539 950086 1183471 1240468 1155617 1059814 1156736 872955 994989
14818I94989l86234r3525J09681j50166J99719k23533P4473K32243l50390N5306
$$ 994989 608755 515230 624911 474745 674464 450931 525404 757647 407257 462563
14808D62563K42874j0154j28141J29009J81713k28664j06201K77085J51409j25937
$$ 462563 705437 695283 567142 696151 877864 649200 542999 820084 971493 845556
14798H45556K096L8586k56294k0049J14441j4981L40521l75181L68966j66733
$$ 845556 847652 886238 629944 609895 724336 709355 1049876 674695 1043661 876928
14788H76928o2325O868P5997j27658o6321Q1136M5158N0864l25364n0588J36244
$$ 876928 814603 821471 897468 769810 703489 784625 829783 880647 555283 504695 640939
14777F40939K38900k48423k233N599R6825j12357B84732M50395j57254K11662
$$ 640939 879839 631416 629183 634782 731607 619250 284732 735127 577873 789535
14767G89535Q4479j66456k17507O6240J92569r4450M67435j75765J29114L2272
$$ 789535 874014 707558 490051 556291 748860 654410 1121845 946080 1075194 1107466
14757A107466l49518L70043k40933q4384l07814J64989Q3059j74715L00846l55500
$$ 1107466 757948 1127991 887058 802674 494860 659849 742908 568193 869039 513539
14747E13539L90506k86545J22051j22637J20982j92578J63876m9581R0724Q5237
$$ 513539 904045 617500 739551 616914 737896 545318 709194 659613 750337 835574
14737H35574J82502m37846J68303k19766J04949k23510M03829l39734M26631o9335
$$ 835574 1018076 580230 748533 528767 633716 410206 814035 474301 900932 831597
14727H31597l24778J00810R6809J26120R476n8544K96602l1107j47848p3590L26826
$$ 831597 506819 607629 704438 830558 840034 781490 1078092 1046985 899137 825547 1152373
14716A152373j21312O9501L29748j48815J52457K10771m3642k30738K75650m03915
$$ 1152373 1031061 1100562 1430310 1281495 1433952 1644723 1601081 1370343 1645993 1242078
14706A242078k19434J28278j04949J57943j25750r3725R3156O1059j31108L60645
$$ 1242078 1022644 1150922 1045973 1203916 1078166 984441 1077597 1138656 1007548 1368193
14696A368193n06059K28598k63001N30261n75002P8401L27516R8066m4270J10946
$$ 1368193 862134 1090732 827731 1357992 782990 861391 1188907 1286973 1242703 1353649
14686A353649N73598R8289l35774J36961j18184o67663L58792m59379K26758J28481
$$ 1353649 1927247 2025536 1689762 1826723 1708539 1040876 1399668 940289 1167047 1295528
14676A295528l75303J63479q4645L06749l34284K10843j46110j04255j8087J12418
$$ 1295528 920225 1083704 999059 1305808 971524 1182367 1036257 932002 913915 1026333
14666A026333q180j55243J8574J56763m0617J50550J23431q5839j93913J5230
$$ 1026333 1018153 862910 881484 1038247 997630 1148180 1271611 1185772 991859 1007089
14656A007089j28020K4185K5823K23855J92018j83161K9409k74847R8386O7872
$$ 1007089 879069 903254 929077 1152932 1344950 1161789 1191198 916351 1014737 1082609
14646A082609j2173p7887J32700o563O4191j44512m0769J86778K66298k11208
$$ 1082609 1070436 992549 1125249 1118686 1182877 1038365 997596 1184374 1450672 1239464
14636A239464r4713K37711K67451k00144J22096l74191J20788l08843M05293k54135
$$ 1239464 1144751 1382462 1649913 1449769 1571865 1197674 1318462 1009619 1414912 1160777
14626A160777K99542l48727N6852K40934l45062M62911l54939r6169L11815q0216
$$ 1160777 1460319 1111592 1168444 1409378 1064316 1527227 1172288 1076119 1387934 1307718
14616A307718j23124J03846L93775k95469k68035M44750j72411O0643N874M0681
$$ 1307718 1184594 1288440 1682215 1386746 1118711 1563461 1391050 1451693 1457567 1498248
14606A498248J56681j08815L99024o32730K40832R1355m96311P56980k83522J77154
$$ 1498248 1654929 1546114 1945138 1312408 1553240 1644595 1148284 1905264 1621742 1798896
14596A798896j67111K56381k83810J47012k08606j32388M38199l09621L63586
$$ 1798896 1631785 1888166 1604356 1751368 1542762 1410374 1848573 1538952 1902538
14587A902538k17450K01024o7886J20461j60023J04415n0032k31396J51151L55486
$$ 1902538 1685088 1886112 1818226 1938687 1778664 1883079 1833047 1601651 1752802 2108288
14577B108288L488m95002P2301J65739n7199q4325K02821J26595J42394l72090
$$ 2108288 2111776 1616774 1689075 1854814 1797615 1713290 1916111 2042706 2185100 1813010
14567A813010j423K31185k1911o9100K85196p9733K71809j28846j26447j24988
$$ 1813010 1811587 2042772 2020861 1951761 2236957 2157224 2429033 2300187 2173740 2048752
14557B048752J71602n9234L04717o19224Q67198J812k855r9851K68020m6129O278
$$ 2048752 2220354 2161120 2465837 1846613 2713811 2715623 2712768 2612917 2880937 2834808 2841086
14546B841086j26593K88473J42480r0000N07765O0529M72366K65522J72603O57361
$$ 2841086 2714493 3002966 3145446 3055446 3563211 3623740 4096106 4361628 4534231 5191592
14536E191592R05218J239250K279801L658751O538741J0602671K780284j2396166
$$ 5191592 6096810 7336060 9615861 13274612 19813353 30416024 33196308 20800142
14528B0800142q357200m516879k650634r99022m31261P0673P12668O54970j278325
$$ 20800142 12442942 7926063 5275429 4276407 3845146 3915819 4628487 5283457 4005132
14519D005132r53426k4880j52705j39553l23796L30093k82710j67232L74157k33743
$$ 4005132 3051706 3026826 2874121 2734568 2410772 2740865 2458155 2290923 2665080 2431337
14509B431337K93533o7799O0698j29028L82809k74947R1323j37770M20157k7621
$$ 2431337 2724870 2657071 2717769 2588741 2971550 2696603 2787926 2650156 3070313 3042692
14499C042692k11901N494J47879j59519l4763M2438L50706M5308k06342L40167
$$ 3042692 2830791 2836285 2984164 2824645 2789882 2832320 3183026 3228334 3021992 3362159
14489C362159k0536L5613k10790j56342J41642k26265O80131M9375l78661O29075
$$ 3362159 3341623 3377236 3166446 3010104 3151746 2925481 3605612 3654987 3276326 3905401
14479C905401n77522K72910j24024M75752k7245j6454Q5000k94097K3074L17541
$$ 3905401 3327879 3600789 3476765 3952517 3925272 3908818 3993818 3699721 3722795 4040336
14469D040336M2914J15855L8544l96769K69983N0949q2797j33907J47242K89449
$$ 4040336 4083250 4199105 4237649 3840880 4110863 4161812 4079015 3945108 4092350 4381799
14459D381799N0240k01519K91982K16948J84395j88861o5383K02530K1886j90837
$$ 4381799 4432039 4230520 4522502 4739450 4923845 4734984 4669601 4872131 4894017 4703180
14449D703180R4134P0762j7071N8301J42908L43031j15281M5437k11024R6590
$$ 4703180 4797314 4868076 4851005 4909306 5052214 5395245 5279964 5325401 5114377 5210967
14439E210967L31609P1533J16300p7394N3541J21748q1588L04488k56633Q3576
$$ 5210967 5542576 5614109 5730409 5653015 5706556 5828304 5746716 6051204 5794571 5878147
14429E878147K27214o0395N75858l47376J71913L38919l89756J78774P48061k62442
$$ 5878147 6105361 6044966 6620824 6273448 6445361 6784280 6394524 6573298 7321359 7058917
14419G058917l57k19712K34295R0929J92989l7392L67121K95671o2516J14570
$$ 7058917 7058560 6838848 7073143 7164072 7357061 7319669 7686790 7982461 7919945 8034515
14409H034515j56467M78069j47798N29888l28848O35404j83615J43864K10902
$$ 8034515 7878048 8356117 8208319 8738207 8409359 9044763 8861148 9005012 9215914
14400I215914J59704J9152J25330J2074o570M03550j26356L47795J51772l8700
$$ 9215914 9375618 9394770 9520100 9532174 9525604 9929154 9802798 10150593 10302365 10263665
14390A0263665L87844j91787L69204M66494m249l40497P94661l12262K28857p7689
$$ 10263665 10651509 10459722 10828926 11295420 11291171 10950674 11745335 11433073 11661930 11584241
14380A1584241L05866M43755l7380O23213M2693L29167L65189j69128O82750r2142
$$ 11584241 11890107 12333862 12296482 12919695 12962388 13291555 13656744 13487616 14170366 14078224
14370A4078224J60741O15749j36624M49700K91154L48730J22867Q50779K9570
$$ 14078224 14238965 14854714 14718090 15167790 15458944 15807674 15930541 16781320 16810890
14361A6810890l00140N14579O96189q5279M26870N25200M25525J04837M89938
$$ 16810890 16510750 17025329 17721518 17636239 18063109 18588309 19013834 19118671 19608609
14352A9608609N98105O08323J18593R98640k3276K16261Q87096K68700K95215
$$ 19608609 20206714 20815037 20933630 21932270 21908994 22125255 23012351 23281051 23576266
14343B3576266N30479O73706M00191P13794R42122K16058J198932L10826J03240
$$ 23576266 24106745 24780451 25180642 25894436 26836558 27052616 28251548 28562374 28665614
14334B8665614J188584M16356J189730O66593J065127J96938J384168N70185J264281
$$ 28665614 29854198 30270554 31460284 32126877 33192004 33388942 34773110 35343295 36607576
14325C6607576Q85586J151875J101887J002756J096293J316055J048435J314058
$$ 36607576 37493162 38645037 39746924 40749680 41845973 43162028 44210463 45524521
14317D5524521J321566J549612J659310J274885J950375J688924J835953J965212
$$ 45524521 46846087 48395699 50055009 51329894 53280269 54969193 56805146 58770358
14309E8770358J845922J960622K228623K184785K735455K086994L070094K371746
$$ 58770358 60616280 62576902 64805525 66990310 69725765 71812759 74882853 77254599
14301G7254599K842229K891772L034027L646871L746964L474958M127653M283268
$$ 77254599 80096828 82988600 86022627 89669498 93416462 96891420 101019073 105302341
14293A05302341M442785M839897M942332N302786N504672N908636O590480P092567
$$ 105302341 109745126 114585023 119527355 124830141 130334813 136243449 142833929 149926496
14285A49926496O823944P651450P980669Q239768Q902139R545121J0152443J0193178
$$ 149926496 156750440 164401890 172382559 180622327 189524466 199069587 209222030 219415208
14277B19415208J1238177J1693764J2175511J2682152J3135133J3010039J3768287
$$ 219415208 230653385 242347149 254522660 267204812 280339945 293349984 307118271
14270C07118271J3690839J3591872J4153993J3727339J3396479J2559333J1843886
$$ 307118271 320809110 334400982 348554975 362282314 375678793 388238126 400082012
14263D00082012J1084790J0358931R838237Q719468Q671131N924945M387104K965489
$$ 400082012 411166802 421525733 431363970 440083438 448754569 454679514 459066618 462032107
14255D62032107K832270l85620n279812l887042m254481o694532r974424j0703379
$$ 462032107 464864377 464478757 459198945 455311903 451057422 444362890 434388466 423685087
14247D23685087j1238432j2619061j2702221j3933150j4068765j4022083j4473053
$$ 423685087 412446655 399827594 387125373 373192223 359123458 345101375 330628322
14240C30628322j3616150j3310777j2892510j2653684j2627064j2559910j2743080
$$ 330628322 317012172 303701395 290808885 278155201 265528137 252968227 240225147
14233B40225147j2072470j0543646j0612685j0071628r691178r025941q318376
$$ 240225147 228152677 217609031 206996346 196924718 187233540 178207599 169889223
14226A69889223q235830p626263p039817o549457o130823n983133n400374n480374
$$ 169889223 161653393 154027130 146987313 140437856 134307033 128323900 122923526 117443152
14218A17443152n176092m407845m146280m406502l868312l848362l842267k879540
$$ 117443152 112267060 107859215 103712935 99306433 95438121 91589759 87747492 84867952
14210H4867952l496975l067937l037637k614534k232252k602397k118460k586112
$$ 84867952 81370977 78303040 75265403 72650869 70418617 67816220 65697760 63111648
14202F3111648k245574j599896k212100j332954j783006j814454j514892j715032
$$ 63111648 60866074 59266178 57054078 55721124 53938118 52123664 50608772 48893740
14194D8893740j286485j128836j230827j490127r05461j641148j145880q13833
$$ 48893740 47607255 46478419 45247592 43757465 42852004 41210856 40064976 39251143
14186C9251143j422016m86107j055711j244428q08219r51672n46306q66476r02963
$$ 39251143 37829127 37343020 36287309 35042881 34234662 33282990 32736684 31870208 30967245
14177C0967245q39532n93139j181727j89417n85118j071082o29704n30111k30117
$$ 30967245 30127713 29534574 28352847 28163430 27578312 26507230 25877526 25347415 25117298
14168B5117298o99727o77736n17985l35115o41866n70921k70999j44101p00151
$$ 25117298 24417571 23739835 23221850 22886735 22244869 21673948 21402949 21258848 20558697
14159B0558697l81761m04033j00379q51298j75700m11967n06094j09993n45614
$$ 20558697 20176936 19772903 19672524 18821226 18645526 18233559 17727465 17617472 17071858
14150A7071858j10607l49338k53106n98822j26812m08451j42795m65397P197P1661
$$ 17071858 16961251 16611913 16358807 15759985 15633173 15224722 15081927 14616530 14623727 14695388
14140A4695388l47649n95820p7375k71570r9353j66791k49252k44817j92001m1303
$$ 14695388 14347739 13751919 13674544 13402974 13303621 13136830 12887578 12642761 12450760 12409457
14130A2409457k17952l50482m19710O2517r9802k69763m68214J37003m1655l08526
$$ 12409457 12191505 11841023 11421313 11483830 11384028 11114265 10646051 10783054 10741399 10432873
14120A0432873j51883j99573n9161k01257j89109q3370k72297j74683n6379m4116
$$ 10432873 10280990 10081417 10022256 9820999 9631890 9548520 9276223 9101540 9045161 9001045
14110I001045j15963o5982L5425m29135j82130K36997l05741M8480K1382m8551
$$ 9001045 8885082 8819100 8854525 8425390 8243260 8480257 8174516 8222996 8244378 8195827
14100H195827k16148k72238j07699j32862j29951j94265R4915j19528J9q7790
$$ 8195827 7979679 7707441 7599742 7466880 7336929 7142664 7237579 7118051 7118070 7030280
14090G030280J37083l87493j53664K3861L4796k35069j55987l1706k39912o723
$$ 7030280 7167363 6779870 6626206 6650067 6684863 6449794 6293807 6262101 6022189 6015466
14080F015466K57573N6719m82490J30939l30366J9758J32082l04019N0644K70132
$$ 6015466 6273039 6329758 5847268 5978207 5647841 5667599 5799681 5495662 5546306 5816438
14070E816438m04395K02630n57431K45144k30946K82532l18045j326K45342k84392
$$ 5816438 5412043 5614673 5057242 5302386 5071440 5353972 5035927 5034601 5279943 4995551
14060D995551l06162J77593j486k49885L99228m62456j29870l9422K6185k71938
$$ 4995551 4689389 4866982 4865496 4615611 5014839 4552383 4422513 4383091 4409276 4137338
14050D137338M04908k6481k33414r790J29123k2619O3464n1476q7533j91499J06767
$$ 4137338 4542246 4515765 4282351 4272561 4401684 4379065 4442529 4391053 4303520 4112021 4218788
14039D218788j47062j39003R1140l82952K78643K67395p55135L64579J40240k65645
$$ 4218788 4071726 3932723 4023863 3640911 3919554 4186949 3431814 3796393 3936633 3670988
14029C670988K64319l30751M6675r0137k3286l6126J65898j98629n16562L01974
$$ 3670988 3935307 3604556 3651231 3561094 3537808 3501682 3667580 3468951 2952389 3254363
14019C254363p7041M04587m42856N7798l7798j05808J18342L3049l51060J53770
$$ 3254363 3177322 3581909 3139053 3196851 3159053 3053245 3171587 3204636 2853576 3007346
14009C007346J70003l32560M31064n12501m4029p6611k4636l2666J69179j45886
$$ 3007346 3177349 2844789 3275853 2763352 2719323 2642712 2618076 2585410 2754589 2608703
13999B608703K13217J20661J28159l54411l89089N97915l15420k44558o0142M1604
$$ 2608703 2821920 2942581 3070740 2716329 2327240 2925155 2609735 2365177 2305035 2346639
13989B346639K94224k99498K74001j05989k06848L10501m80567L95565M9499q3605
$$ 2346639 2640863 2341365 2615366 2509377 2302529 2613030 2132463 2528028 2577527 2493922
13979B493922K86207o1846P73076M1870O69733J597138K923905N439875J0701502
$$ 2493922 2780129 2718283 3491359 3533229 4202962 5800100 8724005 14163880 24865382
13970B4865382R866418r919699p859250n290326l186094j911436r91936m56552
$$ 24865382 34731800 24812101 16952851 11662525 8476431 6564995 5573059 5116507
13962E116507q78398l45892m27687N909k07791L1422j39716k75146K4736j39539
$$ 5116507 4238109 3892217 3464530 3470439 3262648 3294070 3154354 2879208 2903944 2764405
13952B764405l34875L75306k49517j32082j214J0187q3486O3977k20098n3109
$$ 2764405 2429530 2804836 2555319 2423237 2422023 2432210 2348724 2412701 2192603 2139494
13942B139494Q1762l23477K84219O141J28670l71786L11599o5930R5016k48291
$$ 2139494 2221256 1897779 2181998 2188139 2316809 1945023 2256622 2190692 2285708 2037417
13932B037417J08360l14661p9837J41723p3537j44128R2061J84998R7218m17267
$$ 2037417 2145777 1831116 1751279 1893002 1819465 1675337 1767398 1952396 2049614 1632347
13922A632347J58324j19845n7047K8726q2141L80862m19265J02062J39522k15345
$$ 1632347 1790671 1670826 1613779 1642505 1560364 1941226 1521961 1624023 1763545 1548200
13912A548200j55335N02186k18533L8035l3096l31920K78786L06268k14877k51936
$$ 1548200 1392865 1895051 1676518 1714553 1681457 1349537 1628323 1934591 1719714 1467778
13902A467778J15523j08188J32989r3501j686j19670K39428J1816J60281j2516
$$ 1467778 1583301 1475113 1608102 1514601 1512915 1393245 1632673 1644489 1804770 1792254
13892A792254k02038Q0660l15810k11437M39754l39199K33690j88778O392l5965
$$ 1792254 1590216 1670876 1355066 1143629 1583383 1244184 1477874 1289096 1295488 1259523
13882A259523J31433p8783O0585J65899O4103l6254j78644J37253J59600o34972
$$ 1259523 1390956 1312173 1372758 1538657 1602760 1566506 1387862 1525115 1684715 1049743
13872A049743L30933O4381J25370k07958k7592k73248K33118j98546K19946l83677
$$ 1049743 1380676 1445057 1570427 1362469 1334877 1061629 1294747 1096201 1316147 932470
13862I32470J04277K80873k80541J81305L3507k66571M7241n4394J20003M2838
$$ 932470 1036747 1317620 1037079 1218384 1251891 985320 1032561 978167 1098170 1141008
13852A141008R5811K5397k08049L34280j14840k80551K22603n04711O36163j39929
$$ 1141008 1236819 1262216 1054167 1388447 1273607 993056 1215659 710948 1347111 1207182
13842A207182j10189N3169j43884j09899L5475M7791K29419j64921J34555j61279
$$ 1207182 1096993 1150162 1006278 896379 931854 979645 1209064 1044143 1178698 1017419
13832A017419L4198l5750l5149J19817j08920Q2490L32345l60477k0391K50730
$$ 1017419 1051617 1015867 980718 1100535 991615 1074105 1406450 1045973 1025582 1276312
13822A276312j20728l77289P0811N8963p5882J19997p2712o7698M57094l18579
$$ 1276312 1155584 778295 849106 908069 832187 952184 879472 811774 1268868 950289
13812I50289K1765k05840K05914j24381j88421K85831J48680n2347j14546j45073
$$ 950289 972054 766214 972128 847747 659326 945157 1093837 1041490 926944 781871
13802G81871J26866j90171K87123k44242O5079K02892j68538L11939k59048n1664
$$ 781871 908737 718566 1005689 761447 826526 1029418 860880 1172819 913771 862107
13792H62107J02533R5164E20959N00746j13329o541K56758n02260L51416l6484
$$ 862107 964640 1059804 520959 1021705 908376 901835 1158593 656333 1007749 971265
13782I71265k17042j76784K59343L75313E34380M21874k72508K06542L22819l44548
$$ 971265 754223 577439 836782 1212095 534380 956254 683746 890288 1213107 868559
13772H68559p1295K20038m88992K18576j21130k96781J11603K59741q5722R499
$$ 868559 797264 1017302 528310 746886 625756 328975 440578 700319 614597 624096
13762F24096N4687J15001J4313l33236L8133J29265N5941n0723J85090q3655K2627
$$ 624096 678783 793784 808097 474861 512994 642259 698200 647477 832567 748912 771539
13751G71539k59130L23637k79088l1195L03480J97625m91805O7378k9445n5109
$$ 771539 512409 836046 556958 525763 829243 1026868 535063 602441 572996 517887
13741E17887L87446k77278j68282K28902r7027p230j46972m2481K88612K18558
$$ 517887 905333 628055 459773 688675 591648 584418 437446 394965 683577 902135
13731I02135r4583k20291P7964B00702N55224C54618K28968K00278k36727J2269
$$ 902135 807552 587261 665225 200702 755926 354618 583586 783864 547137 559406
13721E59406J44443r9642q3103J26411J31761l19429J62482l8483l8713R0898
$$ 559406 703849 604207 521104 647515 779276 459847 622329 583846 545133 636031
13711F36031R8351k11722j70224L70043j52435A46377M30954j43225K93923K6114
$$ 636031 734382 522660 352436 722479 570044 146377 577331 434106 728029 754143
13701G54143k5968J35563j32703q0142k55463J50797O4261j58241M25472j25035
$$ 754143 728175 863738 731035 650893 395430 546227 610488 452247 877719 752684
13691G52684k14128q3732J13204o2866Q4170j0846A11314M45287n3215M7748L06950
$$ 752684 538556 454824 568028 505162 589332 578486 111314 556601 503386 551134 858084
13680H58084l06469j98546j71678N70107j00235o9613j77227m8777J49460j81200
$$ 858084 551615 353069 181391 751498 651263 581650 404423 355646 505106 323906
13670C23906J24168R2900J20392C17511L04256J37542B30127J27658l7514k3003
$$ 323906 448074 540974 661366 317511 621767 759309 230127 357785 320271 297268
13660B97268L51077k36839M2391L9395j56403l0733K65605J48887A91684N22241
$$ 297268 648345 411506 453897 493292 336889 306156 571761 720648 191684 713925
13650G13925j42548B51512K67989j5064j74985K43169J06054k46182J30915j07815
$$ 713925 571377 251512 519501 504437 329452 572621 678675 432493 563408 455593
13640D55593K48046O5886C50830j42689L32966p3088k08571L86530K3267j86682
$$ 455593 703639 769525 350830 208141 541107 468019 259448 645978 669245 482563
13630D82563G9702K77979J2321j1649J06607L2337j23964K23352j20007F1638
$$ 482563 79702 357681 370002 358353 464960 497297 373333 596685 476678 61638
13619E26016B08453J32648A12809k1039K64303j32118J68544j19577K3254M2708
$$ 526016 208453 341101 112809 91770 356073 223955 392499 272922 296176 338884
13609C38884N6251j38593M02685A37721N06500q1199j46556j66502f2538G35655
$$ 338884 395135 256542 659227 137721 644221 563022 416466 249964 -62538 735655
13598E34129K58081B54661a11052B84132r4134K36340K92076k91805o7279J34557
$$ 534129 792210 254661 -111052 284132 189998 426338 718414 426609 359330 493887
13588D93887k22971J11587O0433j79965J73789A60627K52942A57255L18679r8819
$$ 493887 270916 382503 442936 262971 436760 160627 413569 157255 475934 377115
13578C77115J34627E3261Q8524N35514l36102M6269g1178D00888m9548N4093R5372
$$ 377115 511742 53261 141785 677299 341197 387466 -71178 400888 351340 405433 500805
13567E00805B06485J36574J93710B34779m0941L23492j05311M1320k20095C9350
$$ 500805 206485 343059 536769 234779 193838 517330 412019 453339 233244 39350
13556E0035J88093K44980j18428d5853B88587L49797a7789D60569j67063q2716
$$ 50035 238128 483108 364680 -45853 288587 638384 -17789 460569 293506 210790
13546B10790K14638J87025j36178p2691q0577J17090A48074J15353P1146m3020
$$ 210790 425428 612453 476275 403584 323007 440097 148074 263427 334573 291553
13536B91553o2116A08971J59084R1229p303J298j05264j5674J64617Q661E8275
$$ 291553 229437 108971 268055 359284 351981 353279 248015 232341 396958 405619 58275
13524A06009J27134J08763O8109A43294J29081K20750j9847A92833J45544A30494
$$ 106009 233143 341906 410015 143294 272375 493125 473278 192833 338377 130494
13513A41005j6742J25760J39667A46355E4983L20700j45880R7407m9294J9529
$$ 141005 124263 250023 389690 146355 54983 375683 229803 327210 277916 297445
13503B97445A16609P4248P1680l6294e3384E223M28426j65286i3251B07411p332
$$ 297445 116609 190857 262537 226243 -53384 5223 433649 268363 -93251 207411 200079
13492B00079J1208l169J3748L3210K3975g487m5808D62664k6628j45142k2608
$$ 200079 211287 208118 221866 255076 279051 -7487 -53295 462664 436036 290894 268286
13481B68286H0416h6423C88830A85591O6125q8323J61077H250K53176o5398J09736
$$ 268286 80416 -86423 388830 185591 251716 163393 324470 8250 261426 196028 305764
13470C05764j10274J97173K97919B51326a46240B7892K88400j02595J40666A49418
$$ 305764 195490 392663 690582 251326 -146240 27892 316292 213697 354363 149418
13459E09869d3294B45760A18746J84280q8921J87314M9031B11607N1836j37D8845
$$ 509869 -43294 245760 118746 303026 214105 401419 450450 211607 263443 263306 48845
13447B84687j04807f0912G9658J70179A05633J51557K73878E1275d9075A49118
$$ 284687 179880 -60912 79658 249837 105633 257190 531068 51275 -49075 149118
13436B51654O6225I3934a05091C00815J68607f7110B46608L2804C2107A0417K47012
$$ 251654 317879 93934 -105091 300815 469422 -67110 246608 279412 32107 10417 257429
13425B57429D6143o618K40459d7844q0080A69184p7121R5196q4628a48083E40384
$$ 257429 46143 39525 279984 -47844 -127924 169184 92063 187259 102631 -148083 540384
13413C63796a6130B84805E9305K78213F7397N84J67893m1204b0487E27804A67314
$$ 363796 -16130 284805 59305 337518 67397 67981 235874 194670 -20487 527804 167314
13401A87645g103j11769B79533O703o8907I4115Q9349l8925J53460Q354a0084
$$ 187645 -7103 -118872 279533 286236 217329 94115 183464 144539 297999 306353 -10084
13389A03314K5738J54457o3912l1608H5139J04864J48789A7969K92266A20023
$$ 103314 129052 283509 219597 187989 85139 190003 338792 17969 310235 120023
13378A62149B68O04469A9435M0586R0044J40340j7586N2377a0160B39519i564
$$ 162149 268 604737 19435 60021 150065 290405 272819 325196 -10160 239519 -9564
13366D32960r4609H338L4675c1796A87152m1340J0358o6265K57420a39043D77386
$$ 432960 338351 8338 43013 -31796 187152 145812 156170 89905 347325 -139043 477386
13354E41799A98905d1862B91063m7685C6632J07613k937Q3383e3880D08415j15837
$$ 541799 198905 -41862 291063 243378 36632 144245 141308 224691 -53880 408415 292578
13343B92578D867R0698L78106B07718P5556r1314K3567k1633J98696F626J51068
$$ 292578 4867 95565 473671 207718 283274 191960 215527 193894 392590 6626 157694
13332A57694o8642J19747J19683g9964I0765a1013j44014J1062C1168O3693K05054
$$ 157694 89052 208799 328482 -79964 90765 -11013 -155027 -143965 31168 94861 299915
13321B99915j3357J98716j75408G8082K38277L26090k57910j84040M9932m0337
$$ 299915 286558 485274 309866 78082 316359 642449 384539 200499 250431 210094
13311B10094E2241Q0005m9869L87343A17669L95308j26832J06805D8610R4750
$$ 210094 52241 132246 82377 469720 117669 512977 386145 492950 48610 143360
13301A43360l0135R9899P917H8805K72440n4179A9532K05089j07351A5514J12500
$$ 143360 113225 213124 221041 88805 361245 307066 19532 224621 117270 15514 128014
13290A28014F1596j0361I993M82487A80127O9268D5757J8041h9304B96587b3034
$$ 128014 61596 51235 9993 492480 180127 249395 45757 63798 -89304 296587 -23034
13278C74282H4836k36B4165R4580M274J25107A07372O234R7453H8325a2394A2201
$$ 374282 84836 84600 24165 118745 123019 248126 107372 113606 211059 88325 -12394 12201
13265A92372L6892b74782B42613d3764A46989D0990K9956B5769K32291b10782
$$ 192372 229264 -274782 242613 -43764 146989 40990 70946 25769 258060 -210782
13254A91714N786J56747F1011L1644J23677J72722j40597r2390G6783J7388K1649
$$ 191714 197500 354247 61011 92655 216332 389054 248457 156067 76783 94171 115820
13243A15820L74243B26058i1851A64851c08137B37948j03162a3467A9890J92417
$$ 115820 490063 226058 -91851 164851 -308137 237948 134786 -13467 19890 212307
13233B12307o1218d81j62310d5111A14715K64919F621a9121A28285L9867Q0586
$$ 212307 151089 -481 -162791 -45111 114715 379634 6621 -19121 128285 168152 248738
13222B48738b1319k13I2071b23719A08265J38977A03954r181O9489a9702B55522
$$ 248738 -21319 -21532 92071 -223719 108265 247242 103954 94773 164262 -19702 255522
13210A80821i7226H6193J82342F7164a08819G1361l4543Q1736b2844I5676a27549
$$ 180821 -97226 86193 268535 67164 -108819 71361 36818 118554 -22844 95676 -127549
13198C5430A7592P9493L08605C4225h0446A97242D7614K24115a55306C6380h7488
$$ 35430 17592 97085 405690 34225 -80446 197242 47614 271729 -155306 36380 -87488
13186E3156b32568A7317f4796A59003a13748B64187D8154K9588K10252l545a13663
$$ 53156 -232568 17317 -64796 159003 -113748 264187 48154 77742 287994 284449 -113663
13174c8929I006K04720r1116k1013D6174k219J93334a67673j72896i6873B83979
$$ -38929 9006 213726 122610 101597 46174 43955 237289 -167673 -340569 -96873 283979
13162B30243J6025C1249K18239c3731B30249O8190c1541C70171a25359o6876H7237
$$ 230243 246268 31249 249488 -33731 230249 298439 -31541 370171 -125359 -192235 87237
13150B77953j819B1161j0203J49811A1778J06975l0631a39881c2912A83654K69157
$$ 277953 276134 21161 10958 160769 11778 118753 88122 -139881 -32912 183654 452811
13139D52811E5329d0378I0778O898f3521p1754c2005B34041b23894K9543f0660
$$ 452811 55329 -40378 90778 97676 -63521 -135275 -32005 234041 -223894 -194351 -60660
13127a29508C29332A4296J11888k1873Q716a18279K6261H6701a25461l576B2900
$$ -129508 329332 14296 126184 104311 113027 -118279 -92018 86701 -125461 -129037 22900
13115b72644g1030F2741J33893b9644A83538F0139k3171j1391J66218d8082A49887
$$ -272644 -71030 62741 196634 -29644 183538 60139 36968 25577 191795 -48082 149887
13103H814L14026b99p9308F1309J58957C5842Q0391J93436j13085a39444A35118
$$ 8814 322840 -299 -79607 61309 220266 35842 116233 309669 196584 -139444 135118
13091a03675C65539C1319o702J5160C088P1688M13584g3506j71315A55449p6446
$$ -103675 365539 31319 24617 39777 3088 74776 488360 -73506 -244821 155449 79003
13080G9003C4030c582k3430B68270J39528F3520d0k1588A24275L0423a06808B97179
$$ 79003 34030 -3582 -27012 268270 407798 63520 -40 -21628 124275 154698 -106808 297179
13067D0649N9499K90003r6927E883e3605B6224K20726a25570E1104K9167Q9648
$$ 40649 100148 390151 293224 5883 -53605 26224 246950 -125570 51104 80271 169919
13056A69919p4534E83J31373R7370a31410d21J97m4580J7177I8054m2891K75868
$$ 169919 95385 583 131956 229326 -131410 -421 -224 -44804 -27627 98054 55163 331031
13044C31031J798K7159A62436m4341l362a484j93307B03565I8135a07570B14360
$$ 331031 332829 359988 162436 118095 114733 -1484 -194791 203565 98135 -107570 214360
13032D7973K85744q1801A8057i4003B50879n8537a51594E8812a46973C1033a94170
$$ 47973 333717 251916 18057 -94003 250879 192342 -151594 58812 -146973 31033 -194170
13020i7737C32838F0812O057a07694e891A30938f0845D97201a07701A6449b52345
$$ -97737 332838 60812 66869 -107694 -5891 130938 -60845 497201 -107701 16449 -252345
13008A83760E2078m547M7925k1356a3851n7983A89518g0337A51917K5973j7918
$$ 183760 52078 47531 95456 74100 -13851 -71834 189518 -70337 151917 177890 159972
12997A59972r478b6448A81522f0151j2997k4975B91667a68226M1184A73086J12527
$$ 159972 150494 -26448 181522 -60151 -73148 -98123 291667 -168226 -127042 173086 285613
12986B85613c3404B20108A2569b3701A62635B7153O6364b4080k35794A4447e39
$$ 285613 -33404 220108 12569 -23701 162635 27153 93517 -24080 -259874 14447 -539
12974A31645E4705c94819R4572J21166B30414O0300a11239A25297f032I3838m1736
$$ 131645 54705 -394819 -300247 -179081 230414 290714 -111239 125297 -6032 93838 52102
12963E2102K72521G9917i6608B53377f2059A22002b56060Q0000B97581b3197j16641
$$ 52102 324623 79917 -96608 253377 -62059 122002 -256060 -176060 297581 -23197 -139838
12952a39838F0448J46810a53305A72207l6724J86762G545K6453b07846b1497H8203
$$ -139838 60448 207258 -153305 172207 135483 322245 7545 33998 -207846 -21497 88203
12940G2409P3737J0324a86017h4270C7985L02832H2748a38169p6655I6205J6433
$$ 72409 146146 156470 -186017 -84270 37985 340817 82748 -138169 -214824 96205 112638
12929A12638i8853A39317b05728B56158a6883B0343e1755G3259l3888K21746b97643
$$ 112638 -98853 139317 -205728 256158 -16883 20343 -51755 73259 39371 261117 -297643
12917A38645L6578b72577B37070d2547j29331J8757N9826a4360p037B59498i7523
$$ 138645 175223 -272577 237070 -42547 -171878 -153121 -93295 -14360 -21397 259498 -97523
12905a70154N8462k934A40371a74290E1872K3449i1160b7191A34512E3515a43858
$$ -170154 -111692 -114626 140371 -174290 51872 75321 -91160 -27191 134512 53515 -143858
12893a76085F8138M9089J65034I4767K4943b35142A63289A9030a21359G4522a3894
$$ -176085 68138 117227 282261 94767 119710 -235142 163289 19030 -121359 74522 -13894
12881h9984D9435K11472G4591K90613c81083C7213j232a21889f018B61320A455
$$ -89984 49435 260907 74591 365204 -381083 37213 35981 -121889 -6018 261320 1455
12869a49647r0505A2029b31944a10754A47226i477r7557G6522J07546j3131p4101
$$ -149647 -240152 12029 -231944 -110754 147226 -9477 -107034 76522 184068 170937 96836
12858I6836J59280i103l28613G5175Q9935R4664F2905b36729F394L7154g9862
$$ 96836 256116 -9103 -337716 75175 165110 259774 62905 -236729 6394 43548 -79862
12846C38492B4g6220a2423m1957j77644B2582J22327C3075K00750D2623a74321
$$ 338492 24 -76220 -12423 -54380 -232024 22582 144909 33075 233825 42623 -174321
12834D6547h7199A35014o7384K8286b31559j09809B06715j7430a33106c1028j58718
$$ 46547 -87199 135014 67630 95916 -231559 -341368 206715 189285 -133106 -31028 -189746
12823a89746A94672i096R39E999N08361a4638k5635A00817a48123n3928j8761
$$ -189746 194672 -9096 -8157 5999 514360 -14638 -40273 100817 -148123 -202051 -220812
12812b20812e2058A69333P7689A13603J48328i3223A89732b33906A93223I796
$$ -220812 -52058 169333 247022 113603 261931 -93223 189732 -233906 193223 9796
12801A64527d26786H2711C1842J3840a02115m3090D0253A5325F673b14648F037
$$ 164527 -426786 82711 31842 45682 -102115 -145205 40253 15325 6673 -214648 6037
12789B60578D8892e2419A60603a53339A34655C0557L35821o5426j37940f2777
$$ 260578 48892 -52419 160603 -153339 134655 30557 366378 300952 163012 -62777
12778b25941B0228J39467c35830C0973J37426a77254B45136b10535R5503j7155
$$ -225941 20228 159695 -335830 30973 168399 -177254 245136 -210535 -115032 -132187
12768a32187k73507A24335b66186o8301A70043c11181J06048B9669g4510c100
$$ -132187 -405694 124335 -266186 -334487 170043 -311181 -205133 29669 -74510 -3100
12757F9845f9884a0869m53374i3365F05K08177a85750h1007k43967f6866l16248
$$ 69845 -69884 -10869 -464243 -93365 605 208782 -185750 -81007 -324974 -66866 -383114
12746c83114g2425E33192C446a65582M620E913c6340G3370c5053B13978C8498
$$ -383114 -72425 533192 3446 -165582 -160962 5913 -36340 73370 -35053 213978 38498
12734a20177j96145J27764b2683k7621k47951R0206k72785B46861d98310b703
$$ -120177 -316322 -188558 -22683 -50304 -298255 -208049 -480834 246861 -498310 -2703
12723c0637H7009K32290a27519A4946J01163i1462K1286B47770q6369a17331N8421
$$ -30637 87009 319299 -127519 14946 116109 -91462 -70176 247770 161401 -117331 -58910
12712e8910j10156B5196j590L29189b39655g1732B55792a27139k14304k4535A18579
$$ -58910 -169066 25196 23606 352795 -239655 -71732 255792 -127139 -341443 -365978 118579
12700C81857A10031O2242c05114A38982a68766A25193J9418l2928m2494J10439
$$ 381857 110031 172273 -305114 138982 -168766 125193 144611 111683 69189 179628
12690A79628b80112B6679J17155L4367n2751M9574J1585C1153J92192b05923h5491
$$ 179628 -280112 26679 143834 178201 125450 175024 186609 31153 223345 -205923 -85491
12678h1810E4326e1538A34589o7277c04196j4187A88852M532h2242a771j7195
$$ -81810 54326 -51538 134589 67312 -304196 -318383 188852 193384 -82242 -1771 -18966
12667a8966p2443H6865d3399C3127R0735J8761L6269p8553D4957j4561c92716
$$ -18966 -91409 86865 -43399 33127 123862 142623 178892 100339 44957 30396 -392716
12655A89663J85578I3348B4927b47621B95227e1177A47348B4568b08970C11378
$$ 189663 375241 93348 24927 -247621 295227 -51177 147348 24568 -208970 311378
12644C68472A10901a8949B02845f163j02043G2317N588A8804J55950H4110J0146
$$ 368472 110901 -18949 202845 -6163 -108206 72317 77905 18804 174754 84110 94256
12633I4256g8860B5997a93741B4378b55132B56864a97481j0150A04800j4277a98278
$$ 94256 -78860 25997 -193741 24378 -255132 256864 -197481 -207631 104800 90523 -198278
12621B7150b33565C37602F0042A3156L08148g4227I7137Q3072o3914L68548D0397
$$ 27150 -233565 337602 60042 13156 321304 -74227 97137 180209 116295 484843 40397
12609I1426e6481B33333h2412B48377a8977C30258K52036a0783k8802B0074b26491
$$ 91426 -56481 233333 -82412 248377 -18977 330258 582294 -10783 -39585 20074 -226491
12597g2430A803K13853b24954B0729Q3072c245B7217m386K2176f1240A35136J85662
$$ -72430 1803 215656 -224954 20729 103801 -3245 27217 22831 45007 -61240 135136 320798
12585C20798E3622P8212K53609a56586E74658A87034i6561a700l00912H7022a23327
$$ 320798 53622 131834 385443 -156586 574658 187034 -96561 -1700 -302612 87022 -123327
12573A81392d0598k79999C69896j41837a6216A6180K98305f4603A02994k7809
$$ 181392 -40598 -320597 369896 228059 -16216 16180 314485 -64603 102994 75185
12563G5185a0000j60352D0034l421J64070b39489d2684a4661m5289A32486b64545
$$ 75185 -10000 -170352 40034 36613 200683 -239489 -42684 -14661 -59950 132486 -264545
12551f6203b2089r6034k28943a56960A0972b904B3542K65505f8311n2906o9481
$$ -66203 -22089 -118123 -347066 -156960 10972 -2904 23542 289047 -68311 -121217 -190698
12540a90698c2377I1302C9695A8058J15118n7127r266a57403E4855L59656a50218
$$ -190698 -32377 91302 39695 18058 133176 76049 66783 -157403 54855 414511 -150218
12528a98990h0363A24705a36386B29740g2874l09580B94111H5095a74162A18385
$$ -198990 -80363 124705 -136386 229740 -72874 -382454 294111 85095 -174162 118385
12517b13080Q5516H5167K5973g0690A01321L8126m9149c5647A47135a71182H0323
$$ -213080 -127564 85167 111140 -70690 101321 139447 90298 -35647 147135 -171182 80323
12505B24728a08644C9968b16225m9954A76498a17603A56091o9092K27646a36393
$$ 224728 -108644 39968 -216225 -266179 176498 -117603 156091 86999 314645 -136393
12494B2825a05925L3551D9993K6703j1315a58663E5233k6008a68049G5558O9521
$$ 22825 -105925 -72374 49993 76696 65381 -158663 55233 29225 -168049 75558 145079
12483A45079b27219A10169B047J50361o3096d614B2648b88518F6240c6166J0784
$$ 145079 -227219 110169 2047 152408 89312 -4614 22648 -288518 66240 -36166 -25382
12472b5382j48790o5469m8388h6802B21109M2969p8392b63926a3790j65427B44638
$$ -25382 -174172 -239641 -288029 -86802 221109 264078 185686 -263926 -13790 -179217 244638
12460B08382a4355A7483J14154a03973A85864A8206M2321B9473b84093Q3069C3075
$$ 208382 -14355 17483 131637 -103973 185864 18206 60527 29473 -284093 -201024 33075
12448h8182M093A97524c10554Q1614O1513c7537A13264k876B2329b61432A15864
$$ -88182 -84089 197524 -310554 -228940 -167427 -37537 113264 110388 22329 -261432 115864
12436a35376j2062J6252A52936a62610J5027A28769a52589B97505h250A49799
$$ -135376 -147438 -131186 152936 -162610 -147583 128769 -152589 297505 -8250 149799
12425C6542K40181A25608k731d0998k98446a16103B37902a62535N4057a9421C9937
$$ 36542 276723 125608 122877 -40998 -339444 -116103 237902 -162535 -108478 -19421 39937
12413D6348J58254a01897g340G5348R0306a91413f3495j00741f2650j99413e5174
$$ 46348 204602 -101897 -7340 75348 165654 -191413 -63495 -164236 -62650 -262063 -55174
12401C2920K6280b12371K3962e8056k18871a26090L3827k46197a34550k97815
$$ 32920 59200 -212371 -188409 -58056 -276927 -126090 -92263 -338460 -134550 -432365
12391d32365a37412N4598c2904r3077A64223a90631B9199n561d37739J74851P8597
$$ -432365 -137412 -82814 -32904 -125981 164223 -190631 29199 23638 -437739 -262888 -184291
12380a84291e620A52788a33660a0014H4697g2688Q322F8929c8984k5016A70036
$$ -184291 -5620 152788 -133660 -10014 84697 -72688 -64366 68929 -38984 -64000 170036
12368g8541B80080a55461f8554C73985a1879A60723c04377d104A74402J20512
$$ -78541 280080 -155461 -68554 373985 -11879 160723 -304377 -4104 174402 294914
12358B94914c492A20043K2272l030a49337O5793J6515A32Q6223a20151q7247B1181
$$ 294914 -3492 120043 142315 139285 -149337 -83544 -67029 132 86355 -120151 -207398 21181
12345F5416c23341F5230b93834e9679C92667b0667C21305a54170f4045n8725B42583
$$ 65416 -323341 65230 -293834 -59679 392667 -20667 321305 -154170 -64045 -122770 242583
12333b9835j65079b5467C83938a61461H5923i3332B25315d9330k43736i787I8750
$$ -29835 -194914 -25467 383938 -161461 85923 -93332 225315 -49330 -293066 -9787 98750
12321b4824H1157k1056a2214A79469P8459J9983r9936m0730L8012E4320J95444
$$ -24824 81157 60101 -12214 179469 257928 277911 177975 137245 175257 54320 249764
12310B49764j03312K67287A93204O3366a6859D34068A99043i2558A81331k6385
$$ 249764 146452 413739 193204 256570 -16859 434068 199043 -92558 181331 154946
12300A54946J4010N4316J02126D4941J54341J05092D7223K48182k1746j28357
$$ 154946 168956 223272 325398 44941 199282 304374 47223 295405 273659 145302
12290A45302F894K1232b45855B14965j4545A1160d5063j94061A09743a09608M4997
$$ 145302 6894 28126 -245855 214965 200420 11160 -45063 -239124 109743 -109608 -64611
12279f4611B17718J34991b65901C22387A54864k4768g5295E55138b02441A89035
$$ -64611 217718 352709 -265901 322387 154864 130096 -75295 555138 -202441 189035
12268B3059L6139Q5091K81604f9949A3260J78481M6597C5197a3572G6370N8735
$$ 23059 59198 144289 425893 -69949 13260 191741 238338 35197 -13572 76370 135105
12257A35105N515R3973r2962A1925M61405A73564E4754J18461J10613a55180C07624
$$ 135105 140620 234593 141631 11925 473330 173564 54754 173215 283828 -155180 307624
12245C27725j16079J38694j67245H5169d5830D3075B587K41399q2750p8314h8442
$$ 327725 211646 350340 183095 85169 -45830 43075 2587 243986 161236 82922 -88442
12233e7814l0841A57172B7644O4758O7299A4521E810a03750M0532F3462J56704
$$ -57814 -88655 157172 27644 92402 159701 14521 5810 -103750 -63218 63462 220166
12222B20166B9776a6010k3685j41817A78687a3943j77484h5216L7258c567j82355
$$ 220166 29776 -16010 -39695 -181512 178687 -13943 -191427 -85216 -47958 -3567 -185922
12211a85922N8476G2766L89515B7201I386K9580a1238p4558B63838c9269C43280
$$ -185922 -127446 72766 462281 27201 9386 38966 -11238 -85796 263838 -39269 343280
12199A43202m4412J29912j9028H1548J34289L1678i5304a1069G9011h4801B27641
$$ 143202 98790 228702 209674 81548 215837 247515 -95304 -11069 79011 -84801 227641
12187C08304J17891F0769q852j9919J34876p0879b58C53720B4088K68230F1082
$$ 308304 426195 60769 51917 31998 166874 95995 -258 353720 24088 292318 61082
12175A21248m3660g2084B85429a78943C27880a17642C15506a49039A7012R5943
$$ 121248 77588 -72084 285429 -178943 327880 -117642 315506 -149039 17012 112955
12165A12955C4184J74975p1693K32259I8296C9041J55208e358j30248a3526B36220
$$ 112955 34184 209159 137466 369725 98296 39041 194249 -5358 -135606 -13526 236220
12153B92976D2072P3263K03444r4082m1420j0481K59664b3345H6185L07418J9119
$$ 292976 42072 115335 318779 224697 183277 172796 432460 -23345 86185 393603 412722
12142D12722O0502A88359K27580A35084J78707i1417B58388I2167j3827J61570
$$ 412722 473224 188359 415939 135084 313791 -91417 258388 92167 78340 239910
12132B39910I1852a11892C9625a15602B54988G7964O2119g5976A75646a0125o9274
$$ 239910 91852 -111892 39625 -115602 254988 77964 140083 -75976 175646 -10125 -79399
12121g9399C08292A09336P5033C4053L64390A46272l3587L05098e7539q4819A68711
$$ -79399 308292 109336 184369 34053 398443 146272 112685 417783 -57539 -142358 168711
12109a80718B58891A0267J52157E5982J10004M64721C1649M55831b9016r7131
$$ -180718 258891 10267 162424 55982 165986 630707 31649 487480 -29016 -126147
12099a26147B59643n9461h5192B40643r2178i466m9649A91770g6601A15814J22407
$$ -126147 259643 200182 -85192 240643 148465 -9466 -59115 191770 -76601 115814 238221
12088B38221f4891A90247J28771D89K11713r0790c3889A24458l9704J35269c2758
$$ 238221 -64891 190247 319018 489 212202 121412 -33889 124458 84754 220023 -32758
12076A5310d4881B5320J41467F7622J83640Q6596C9632K1079K14420d186B49894
$$ 15310 -44881 25320 166787 67622 251262 337858 39632 60711 275131 -4186 249894
12064A7184N12287D2122K6793b20349B05579Q8944h7871H6389b65547g9001q6848
$$ 17184 529471 42122 68915 -220349 205579 294523 -87871 86389 -265547 -79001 -165849
12053a65849A71107j9647h737B21236a28770H0220K25512j30403M1158L9327b36360
$$ -165849 171107 151460 -8737 221236 -128770 80220 305732 175329 216487 255814 -236360
12041a2975j8777m7187A60673K1040G6062a80124f5150G9672P0196c0396A29342
$$ -12975 -31752 -78939 160673 181713 76062 -180124 -65150 79672 149868 -30396 129342
12029C364f9770D82492e522F7876J01557a89449A09731b03901R4642M0978j42901
$$ 3364 -69770 482492 -5522 67876 169433 -189449 109731 -203901 -109259 -68281 -211182
12018b11182g1024A3565c78060A49675e9424B51577i493j04016K5829j96914a39117
$$ -211182 -71024 13565 -378060 149675 -59424 251577 -9493 -113509 -87680 -284594 -139117
12006b15970C888c6657F9130J43837m1919K0108J34007h2434D26888a19340i112
$$ -215970 3888 -36657 69130 212967 171048 191156 325163 -82434 426888 -119340 -9112
11994H7640O4780c6675B43143E7026a37091n255j8228F4637O8964c0242l0505
$$ 87640 152420 -36675 243143 57026 -137091 -142346 -160574 64637 133601 -30242 -60747
11983f0747B93526a25143C1444a74072K904Q3907C60202D9658b04040f6326j25241
$$ -60747 293526 -125143 31444 -174072 -171168 -87261 360202 49658 -204040 -66326 -191567
11972a91567N6601l29431g3875I295J33385b01856c813A97940B1600g0808L5308
$$ -191567 -134966 -464397 -73875 9295 142680 -201856 -3813 197940 21600 -70808 -35500
11961c5500o6229E015J91094q649j9174b67313R8318A1547c81757a26809m7566
$$ -35500 -101729 5015 196109 187460 168286 -267313 -168995 11547 -381757 -126809 -174375
11950a74375M5126e8216A43664N6628I2742a65987A76481a69297A78205G1430
$$ -174375 -129249 -58216 143664 200292 92742 -165987 176481 -169297 178205 71430
11939i71l07637N9880I8568C543L9284J6540P1574a51602D3270a75487d2637k35303
$$ -971 -308608 -248728 98568 3543 42827 59367 130941 -151602 43270 -175487 -42637 -277940
11927b77940N2490A70633c57617J41252g5139B30270h9527B2393c21347e1A71676
$$ -277940 -225450 170633 -357617 -216365 -75139 230270 -89527 22393 -321347 -51 171676
11915g4137C9949P5471b23919A30560D0493b46729r9607D870J41755o2060Q0687
$$ -74137 39949 115420 -223919 130560 40493 -246729 -346336 4870 146625 84565 165252
11904A65252n3267A358J79894A0771b45620e9716E1152c782A43775g987l01148
$$ 165252 111985 1358 181252 10771 -245620 -59716 51152 -3782 143775 -7987 -309135
11893c09135h5434F9913i1918B05267f2452l4891j51624B17581p6325i0061F7967
$$ -309135 -85434 69913 -91918 205267 -62452 -97343 -248967 217581 141256 -90061 67967
11881a38511n7983O9621O1171m1896I4061C5166a00025j44213B27746p3396o9709
$$ -138511 -196494 -126873 -65702 -107598 94061 35166 -100025 -244238 227746 154350 84641
11870H4641A1118R9736a52471C7647c02161C1659b30384C27723i7332A3055a22857
$$ 84641 11118 110854 -152471 37647 -302161 31659 -230384 327723 -97332 13055 -122857
11858a8810q5371B49194a55191M3442K3007C2136h3546n3899c4133j59320A23962
$$ -18810 -104181 249194 -155191 -111749 -88742 32136 -83546 -137445 -34133 -193453 123962
11846b7058k49999P7065b5295l97409C9971q501K37994a31769B67541j14809a24120
$$ -27058 -277057 -199992 -25295 -422704 39971 31470 269464 -131769 267541 152732 -124120
11834A31205d29488a86023r3134g8612e523k45449D1635a79824B64954o6694a34282
$$ 131205 -429488 -186023 -279157 -78612 -5523 -250972 41635 -179824 264954 198260 -134282
11822a40760a6851k25652Q5858N3995A07389m5663B3379L9018g5342d981n20503
$$ -140760 -16851 -242503 -156645 -102650 107389 61726 23379 62397 -75342 -4981 -525484
11811e25484a29565p5516k8723d953A05123l8422e6493b7752B2363a21268B2415
$$ -525484 -129565 -205081 -233804 -4953 105123 66701 -56493 -27752 22363 -121268 22415
11799b48215a04379B30426b73393E7285A3361a8835j88598E1196a88161A16956
$$ -248215 -104379 230426 -273393 57285 13361 -18835 -207433 51196 -188161 116956
11788D002b1902j02480A17563c19201B38061m0484J9843b99210c494G3224g4152
$$ 4002 -21902 -124382 117563 -319201 238061 197577 217420 -299210 -3494 73224 -74152
11776A78441a90464p7738k0613c569A30230G277J38415a6951j34152B91038d53271
$$ 178441 -190464 -268202 -288815 -3569 130230 7277 145692 -16951 -151103 291038 -453271
11764D581d36535J82730c91m3479n9155C609J43239A23K29339p6811E3189a67353
$$ 4581 -436535 -253805 -391 -43870 -103025 3609 146848 123 229462 152651 53189 -167353
11751f2351b2430E5864A1530e9413m6108j06911D4442b71428C05369b12039F2593
$$ -62351 -22430 55864 11530 -59413 -105521 -212432 44442 -271428 305369 -212039 62593
11739C6616K65427c7914A19719D1335b49894f2047n5487p8724E5575a2870p1794
$$ 36616 302043 -37914 119719 41335 -249894 -62047 -117534 -196258 55575 -12870 -84664
11728h4664j20179D25782a59951A34972a30033D6512K63310N5680e3117A05522
$$ -84664 -204843 425782 -159951 134972 -130033 46512 309822 365502 -53117 105522
11717B74858j18026B2137M7286J41242J22776d20978H1926c5723I7694Q8625a14589
$$ 274858 156832 22137 69423 210665 333441 -420978 81926 -35723 97694 186319 -114589
11705d2803J246j39732P0389q5414A50564l6268l535a11457q6288B09197L2068
$$ -42803 -41557 -181289 -110900 -196314 150564 114296 110761 -111457 -197745 209197 241265
11694B41265A7788J39186l8524O5351d2164B5699M2617b20869b8370r5088j80903
$$ 241265 17788 156974 118450 183801 -42164 25699 68316 -220869 -28370 -123458 -304361
11683c04361A92551o5642D3947L6146J38651i1747l2131l32682K12377k1459a6965
$$ -304361 192551 126909 43947 80093 218744 -91747 -123878 -456560 -244183 -265642 -16965
11671a49936f2632o6577p3859q9193B72223G2822f6797C46593b71505d4829H6447
$$ -149936 -62632 -129209 -203068 -292261 272223 72822 -66797 346593 -271505 -44829 86447
11659f8435A25263e853p2156p7248B38596n5123H3527c08770a42570l0930O4122
$$ -68435 125263 -5853 -78009 -155257 238596 183473 83527 -308770 -142570 -173500 -109378
11648a09378D0099J28117c3532l9114A01453b28277K6486A29953E1776J59837
$$ -109378 40099 168216 -33532 -72646 101453 -228277 -201791 129953 51776 211613
11638B11613F8503J68081p4897B333a69924B01871E2082e4505A92595E2739c52585
$$ 211613 68503 236584 161687 2333 -169924 201871 52082 -54505 192595 52739 -352585
11626A3854O5637g8606j16867r9735L364G8148K7824J08450j1136d4555n5028
$$ 13854 79491 -78606 -195473 -295208 -291844 78148 105972 214422 203286 -44555 -99583
11615i9583D2545a88430A14326k4878a81428D1388d27101C4730a90500b0275A02108
$$ -99583 42545 -188430 114326 89448 -181428 41388 -427101 34730 -190500 -20275 102108
11603G5954c55964e3277N877A73251b55923m7314b6093A82999K35713A46947A6650
$$ 75954 -355964 -53277 -47400 173251 -255923 -303237 -26093 182999 418712 146947 16650
11591G8813N06774f9970A88211H9711h5039A0972a63543O9572B46573o7409C3174
$$ 78813 585587 -69970 188211 89711 -85039 10972 -163543 -93971 246573 179164 33174
11579a84841a3662m5915B3675j0586d5919D707g9656I5936b69291c6748D17333
$$ -184841 -13662 -59577 23675 13089 -45919 4707 -79656 95936 -269291 -36748 417333
11567a13867C29810I1926K37059h1953B29994J52803I0751k0093i4946o0900K1293
$$ -113867 329810 91926 328985 -81953 229994 382797 90751 70658 -94946 -155846 -134553
11556a34553j01963A10744b48265b7203A45006B3894M5383L20978A24510E0966
$$ -134553 -236516 110744 -248265 -27203 145006 23894 69277 390255 124510 50966
11545B09633E7078b8659k11197C6207a51555A23184m7619a05535A05376l1130
$$ 209633 57078 -28659 -239856 36207 -151555 123184 75565 -105535 105376 74246
11535G4246F358P2550K1749d2814A12926C3611d8764C06550I7315c180j11256
$$ 74246 6358 78908 100657 -42814 112926 33611 -48764 306550 97315 -3180 -114436
11524a14436A85506L4767C493J96130A9603K28193K75333A67924A3520M25549
$$ -114436 185506 220273 3493 199623 19603 247796 523129 167924 13520 439069
11514D39069a40127A39317K0367c4764j14951o7860a08780G5288k4470b68991
$$ 439069 -140127 139317 159684 -34764 -149715 -217575 -108780 75288 50818 -268991
11503h4745B2860L77220H8549b5616m2376F3908K01215G400a50249L1555A63812
$$ -84745 22860 400080 88549 -25616 -67992 63908 265123 7400 -150249 -118694 163812
11491B9784A1027M1404K23957G8083N1812b1942B26441R1229p2930G8269f293
$$ 29784 11027 52431 276388 78083 129895 -21942 226441 317670 244740 78269 -6293
11479A08382o191N5822A9757K3954K88777j08054b24524a5466B90914H6881j4422
$$ 108382 102191 158013 19757 43711 332488 224434 -224524 -15466 290914 86881 72459
11468G2459K27702j31772K6906b28997G416a3157A26735l1835D5295F881f6098
$$ 72459 300161 168389 195295 -228997 7416 -13157 126735 94900 45295 6881 -66098
11456D2398a19112A36638m7191J76080b2659D8595B257Q8661K77657a90813B21741
$$ 42398 -119112 136638 89447 265527 -22659 48595 2257 90918 368575 -190813 221741
11444A58663b37035c298p7556K84B76496m2069b2568D1508a62988a0704C90859
$$ 158663 -237035 -3298 -80854 -80570 276496 234427 -22568 41508 -162988 -10704 390859
11432A99293F5016Q448R3386J9681r0643a05250G9566b72566A76844r788R4486
$$ 199293 65016 73464 166850 186531 95888 -105250 79566 -272566 176844 167056 261542
11421B61542d575A10750j402K60758j57439p6078a1843D6199K90175r6078A01701
$$ 261542 -4575 110750 109348 370106 212667 136589 -11843 46199 336374 240296 101701
11409C36646A49400b88916J8153C07903C4657h8463j8886I0450O2220a04050K4109
$$ 336646 149400 -288916 -270763 307903 34657 -88463 -107349 90450 152670 -104050 -79941
11398g9941l9411j05215A82974G9814J409L6933k9416a52196b4872p4461k07051
$$ -79941 -119352 -224567 182974 79814 81223 118156 88740 -152196 -24872 -99333 -306384
11387c06384i465A26434B0209N0125L5315j0702P7735K0433L06646g869k3142
$$ -306384 -9465 126434 20209 70334 105649 94947 172682 193115 499761 -7869 -31011
11376c1011o4405B06437a58951A06558e174B9880c80894c5379j5086K3622j82075
$$ -31011 -95416 206437 -158951 106558 -5174 29880 -380894 -35379 -50465 -26843 -208918
11365b08918e8745A85001b8760j14216O732m2766N2923j51097B04450J48159i1605
$$ -208918 -58745 185001 -28760 -142976 -136244 -179010 -126087 -277184 204450 352609 -91605
11353b6146h333F8050h651j12653k49964R9478j19499D1621a17285C24204b99467
$$ -26146 -8333 68050 -8651 -121304 -371268 -271790 -391289 41621 -117285 324204 -299467
11341b44384j60257A6865J30435a21240r1378d8720l69626a51478k39438J08103
$$ -244384 -404641 16865 147300 -121240 -212618 -48720 -418346 -151478 -390916 -282813
11331b82813o3187A48685a84796A71086C5232f7508E8428P1438L29404d27456
$$ -282813 -346000 148685 -184796 171086 35232 -67508 58428 129866 459270 -427456
11320B3683M5503b2388k3683A89612b51911B87738H3266b49486d4068A43687m2796
$$ 23683 69186 -22388 -46071 189612 -251911 287738 83266 -249486 -44068 143687 100891
11309A00891b55773D0865c60257A83728B1811d6601A27332D3415c92697A3420
$$ 100891 -255773 40865 -360257 183728 21811 -46601 127332 43415 -392697 13420
11298a13843j85032A86500d985D6675M1558A4405R5351a57824O6321q5204l40730
$$ -113843 -298875 186500 -4985 46675 88233 14405 109756 -157824 -91503 -176707 -517437
11287e17437K17693a17434M0564j88972A11805B0739b85788J06624G7698d4190
$$ -517437 -299744 -117434 -76870 -265842 111805 20739 -285788 -179164 77698 -44190
11276a69204j10871G9378J21514a0015p8073G3583B3712a94763A09942a69765
$$ -169204 -280075 79378 200892 -10015 -88088 73583 23712 -194763 109942 -169765
11265C5800b29437e9049k66596A67416a74020r673j54923B3064A680e9549B28894
$$ 35800 -229437 -59049 -325645 167416 -174020 -183693 -338616 23064 1680 -59549 228894
11253c97757A29825a22021A15526a71814F7735J6848a87037j7738n5617l050G6387
$$ -397757 129825 -122021 115526 -171814 67735 84583 -187037 -204775 -260392 -263442 76387
11241A11632A6607f8058h098j78277O9723A37941P1153a52807j96976Q8839D4246
$$ 111632 16607 -68058 -8098 -186375 -116652 137941 209094 -152807 -349783 -260944 44246
11229E8866a19265M8726B7786g6055k02225h304I3604d29964i8632R218L8087
$$ 58866 -119265 -70539 27786 -76055 -278280 -8304 93604 -429964 -98632 -89414 -51327
11218e1327j41560J9985g2801k07765O2771F4454B8314b61081j11597J36698a0484
$$ -51327 -192887 -172902 -72801 -280566 -217795 64454 28314 -261081 -372678 -235980 -10484
11206D9538h185p1611B81512b6057B9160b32578n0905F7137a41347f2851A98474
$$ 49538 -8185 -79796 281512 -26057 29160 -232578 -283483 67137 -141347 -62851 198474
11194B02253a89183E6450b98780E0672e5831E0957b50210Q3247C189J60772R6820
$$ 202253 -189183 56450 -298780 50672 -55831 50957 -250210 -166963 3189 163961 260781
11183B60781f2341l06072J75709m8240A36111c2362A02983L6941D2517a07950
$$ 260781 -62341 -368413 -192704 -240944 136111 -32362 102983 139924 42517 -107950
11172h8386E8648f423l38370J49938D01863B3298J85391G9718G616a04059L5043
$$ -88386 58648 -6423 -344793 -194855 401863 23298 208689 79718 7616 -104059 -69016
11161f9016G7000e6537k3891j09286k4861C4259b38309B36333a74848B35221a02736
$$ -69016 77000 -56537 -80428 -189714 -214575 34259 -238309 236333 -174848 235221 -102736
11149A78882b80451E7382b39906o1004A71935b871l39992j7773A35900a64931
$$ 178882 -280451 57382 -239906 -300910 171935 -2871 -342863 -360636 135900 -164931
11138B48135q5436N6549b1985k53460e1632m45275a18233E8023M6914F244a16627
$$ 248135 162699 219248 -21985 -275445 -51632 -496907 -118233 58023 104937 6244 -116627
11126h832o3049A80086l3279F9540L490e9984j76577i7881b8444l9378l6625k6161
$$ -8832 -71881 180086 146807 69540 73030 -59984 -236561 -97881 -28444 -67822 -104447 -130608
11114a30608r1631A29348Q0349d5402j3297j8984A34883g1630B02105G6918R7553
$$ -130608 -222239 129348 209697 -45402 -58699 -77683 134883 -71630 202105 76918 174471
11103A74471M2825C8038K8823i580j1554D3903b36529a4403B66735f1639A19910
$$ 174471 217296 38038 66861 -9580 -21134 43903 -236529 -14403 266735 -61639 119910
11091A91745D3697K50250H7474b08377e0134j45536B090K46153J26045F0135a60928
$$ 191745 43697 293947 87474 -208377 -50134 -195670 2090 248243 374288 60135 -160928
11079a24165F59922A95157P517C3941J95456a96651f912C03104b8678B42143K38736
$$ -124165 659922 195157 202674 33941 229397 -196651 -6912 303104 -28678 242143 480879
11068D80879k18329c1679B14129F5497M00348n8048Q3514o1956O871j21793M886
$$ 480879 262550 -31679 214129 65497 465845 407797 491311 429355 436226 314433 319319
11057C19319N2811K49040C812K33578j4962K6552m9256K9553K51118j64070A9526
$$ 319319 372130 621170 3812 237390 222428 248980 199724 229277 480395 316325 19526
11045B92818M68892j70065j30499J0816j98846J94307J72677j46041K1900L04992
$$ 292818 761710 591645 461146 471962 273116 467423 640100 494059 515959 820951
11035H20951k41372K58763m16229K71929J83253j53733K69289j64132O2371C82124
$$ 820951 579579 838342 422113 694042 877295 723562 992851 828719 891090 382124
11024G23256K75122r8179K0498j72300l27762K18219L04247l53414k10545N30440
$$ 723256 998378 900199 920697 748397 420635 638854 943101 589687 379142 909582
11014I09582j96702J42401p6744L8023j17124n6828K8046J20086m3913k42222
$$ 909582 712880 855281 778537 816560 699436 642608 670654 790740 746827 504605
11004E04605J74190q0208j85704K42677n7775k42043L48105J93020C21595M36952
$$ 504605 678795 598587 412883 655560 597785 355742 703847 896867 321595 758547
10994G58547k00825J17004o4643K27358K0744k03277r7826Q7011j37263j10475
$$ 758547 557722 674726 610083 837441 858185 654908 557082 644093 506830 396355
10984C96355j13634M51740j63774j81732L00585j15546m8506J59682B95554L04361
$$ 396355 282721 734461 570687 388955 689540 573994 525488 685170 295554 599915
10974E99915m5623P4850n7369J10844K85236K54442n06633K14503r2493m5012
$$ 599915 554292 629142 571773 682617 967853 1222295 715662 930165 837672 792660
10964G92660K43471K44374l80724J99605K61943L7258k05773L62312j85855P25878
$$ 792660 1036131 1280505 899781 1099386 1361329 1398587 1192814 1555126 1369271 2095149
10954B095149J79555m0548M70684j91965l61223j26605M57149N4435m16511k93609
$$ 2095149 2274704 2234156 2704840 2512875 2151652 2025047 2482196 2536631 2120120 1826511
10944A826511N5131k02699j14616N4227j08496j19683k1165O7174K01177j8180
$$ 1826511 1881642 1678943 1564327 1618554 1510058 1390375 1369210 1436384 1637561 1619381
10934A619381m22977q9955j18853n6739l52737J52762N9200k5095F5238P6564
$$ 1619381 1196404 1106449 987596 930857 578120 730882 790082 764987 65238 141802
10924A41802o6395K36882G3917R585K35973n9413A26639K65692a31413N0250H0161
$$ 141802 75407 312289 73917 83502 319475 260062 126639 392331 -131413 -81163 80161
10912B77764H4539J24897a75345o9714p8147A96644B0464i285D0916K48756j02608
$$ 277764 84539 209436 -175345 -245059 -323206 196644 20464 -9285 40916 289672 187064
10901A87064a68838A26491d20787a18300A98126i4596b42A22163a6886I3784m3970
$$ 187064 -168838 126491 -420787 -118300 198126 -94596 -242 122163 -16886 93784 49814
10890D9814k2797a6782j25794m7606C6654M5276B1397a41187k6448E5767a25941
$$ 49814 27017 -16782 -142576 -190182 36654 81930 21397 -141187 -167635 55767 -125941
10878A3531b28834B76068r6611G4270A3505R1626b86790B4205P0772p551d71222
$$ 13531 -228834 276068 179457 74270 13505 105131 -286790 24205 94977 87426 -471222
10866a03892F9655a55752a2736o4079l05458a04857l13622E0164Q6498a77607
$$ -103892 69655 -155752 -12736 -76815 -382273 -104857 -418479 50164 136662 -177607
10855g1980C48455a26342r7035i8831A92186h1636F6785I190d09476J99691F493
$$ -71980 348455 -126342 -223377 -98831 192186 -81636 66785 9190 -409476 -209785 6493
10843a1535k82939f832j69262h3501C4548e1245k3082B14301C4592e6112q8643
$$ -11535 -294474 -6832 -176094 -83501 34548 -51245 -74327 214301 34592 -56112 -144755
10832a44755A92430d5395H854a71508e2588J1907n4523A90455d1721k88075I6672
$$ -144755 192430 -45395 8854 -171508 -52588 -40681 -95204 190455 -41721 -329796 96672
10820C50382a66182C59940F1909b17915d6602j36044g572A11781h9450E7600b36658
$$ 350382 -166182 359940 61909 -217915 -46602 -182646 -7572 111781 -89450 57600 -236658
10808A1138d29526a66127q397K0585b8319A27785G266a11446b7078j19218d2049
$$ 11138 -429526 -166127 -174524 -153939 -28319 127785 7266 -111446 -27078 -146296 -42049
10796C46094b99169B25730a82060O3007l06343I272c5137A61266a01198j1918
$$ 346094 -299169 225730 -182060 -119053 -425396 9272 -35137 161266 -101198 -113116
10786a13116A37777M9527c5064p9434o410C20799j54477C0610L4809a98885H5364
$$ -113116 137777 187304 -35064 -114498 -120908 320799 166322 30610 65419 -198885 85364
10774a18906r8473h097A33249l0522m2706a52364g3242k96454O6044B252b98864
$$ -118906 -217379 -8097 133249 102727 60021 -152364 -73242 -369696 -303652 2252 -298864
10762E0474L9532e6867l9965r9243B31366I197e7145j3044g229o547C7368J81299
$$ 50474 90006 -56867 -96832 -196075 231366 9197 -57145 -70189 -7229 -13776 37368 218667
10750B18667q8569a50975M8224M0068n8337G4512b56059j64024e9894A65181m2321
$$ 218667 130098 -150975 -102751 -62683 -121020 74512 -256059 -420083 -59894 165181 122860
10739A22860g5606L0077H2148J35950a17217b4762k82183A93857c14458B44090
$$ 122860 -75606 -45529 82148 218098 -117217 -24762 -306945 193857 -314458 244090
10728c5732A74041a98365c0867J727A42005h1976A64146a8955A52144A183g5850
$$ -35732 174041 -198365 -30867 -29140 142005 -81976 164146 -18955 152144 1183 -75850
10716a37921B13325h8082a2972l04825C7639b30914B42369A6968R7592h8147j03516
$$ -137921 213325 -88082 -12972 -317797 37639 -230914 242369 16968 114560 -88147 -191663
10705a91663r072K4138A46862d27668a82936N4615N645f738A2628P1467a40582
$$ -191663 -200735 -176597 146862 -427668 -182936 -128321 -122676 -6738 12628 84095 -140582
10693e27763a13620K8993k49608a09432p2322e9487B43160D0034J5369Q5999b37030
$$ -527763 -113620 -84627 -334235 -109432 -181754 -59487 243160 40034 55403 141402 -237030
10681c8674l4587A3138J94461b07832L1412f2885l2601l5144l0717N8090O420
$$ -38674 -73261 13138 207599 -207832 -176420 -62885 -95486 -130630 -161347 -103257 -96837
10670i6837E0652a66132j7716O7566c2541m40536K28682Q0519e2868a3682H9648
$$ -96837 50652 -166132 -183848 -116282 -32541 -473077 -244395 -163876 -52868 -13682 89648
10658E219b43122A54736J76212A51583b08513F8044K1858b8557G5427i9691K0513
$$ 5219 -243122 154736 330948 151583 -208513 68044 89902 -28557 75427 -99691 -79178
10647g9178A45744n2501c26644B9343d72981h0738o1087l9932B76436b74737O3276
$$ -79178 145744 93243 -326644 29343 -472981 -80738 -141825 -181757 276436 -274737 -211461
10636b11461M519A87760M4410a06095M0340j75439j5889R8781B4680a06776k60063
$$ -211461 -206942 187760 232170 -106095 -65755 -241194 -257083 -158302 24680 -106776 -366839
10625c66839J31247k1195A16006a55666j83578I9350i9380C2814a46306L7332
$$ -366839 -235592 -256787 116006 -155666 -339244 99350 -99380 32814 -146306 -108974
10615a08974k37582R4553A9979K81129A6281c0453j08215I024J17267R6957a41109
$$ -108974 -346556 -252003 19979 301108 16281 -30453 -138668 9024 126291 223248 -141109
10603I1800k1917O4291b06521r0990a23978A47731a5406B10059b55432I3472J66931
$$ 91800 69883 134174 -206521 -297511 -123978 147731 -15406 210059 -255432 93472 260403
10592B60403j765h9848i267B1124a64632L0664A55443a52072A26317d8465F6965
$$ 260403 258638 -89848 -9267 21124 -164632 -133968 155443 -152072 126317 -48465 66965
10580b21458j68654R1283e8936k72708c7700m7359C27067g3814B05725A5957b16289
$$ -221458 -390112 -298829 -58936 -331644 -37700 -85059 327067 -73814 205725 15957 -216289
10568a65483O2890D73155c50053B28178b97463Q2036G8199M1688H440b12657P0944
$$ -165483 -102593 473155 -350053 228178 -297463 -215427 78199 119887 8440 -212657 -141713
10557a41713B18791b29709I1243a02618A39662l6093a93484Q0945k26996e778
$$ -141713 218791 -229709 91243 -102618 139662 103569 -193484 -112539 -339535 -5778
10546a48534B9018J66773l9847L1856c72379d3085k27335A6684a64885n9087g1534
$$ -148534 29018 195791 155944 187800 -372379 -43085 -270420 16684 -164885 -223972 -71534
10534a25516e4057F5042K03361B161h6832A49003C7179P2563c10806h0743j31689
$$ -125516 -54057 65042 268403 2161 -86832 149003 37179 109742 -310806 -80743 -212432
10523b12432A11882a3383A42190o7607O1448f7010A09808b30138D9799J13216
$$ -212432 111882 -13383 142190 74583 136031 -67010 109808 -230138 49799 163015
10513A63015a9297Q980j49818c4548A81698A3093K545c73952a55219l11342a34229
$$ 163015 -19297 -10317 -160135 -34548 181698 13093 15638 -373952 -155219 -466561 -134229
10501b01185d6102n9608D6006f9422k49962B00667a73421j17674L8511K9357G127
$$ -201185 -46102 -105710 46006 -69422 -319384 200667 -173421 -291095 -252584 -223227 7127
10489b1652G7862L6805b54197h0677k89571a72660A8030J3649a97341C0056a60840
$$ -21652 77862 114667 -254197 -80677 -370248 -172660 18030 31679 -197341 30056 -160840
10477i3910q6785r531q5648k6893a01689j06974C08660C4329c8235k05269C6771
$$ -93910 -180695 -190226 -275874 -302767 -101689 -208663 308660 34329 -38235 -243504 36771
10465C5465a32308j3785B27053j11158K93360B5272K68054B2637M27667j87538
$$ 35465 -132308 -146093 227053 115895 409255 25272 293326 22637 450304 262766
10455B62766K3944K2985a2121r637G9988b11156A28534J9673a29118K4862B47148
$$ 262766 286710 309695 -12121 -21758 79988 -211156 128534 148207 -129118 -104256 247148
10443a25317A13042b37875j94587K14442A87656k399h9877A59504c17212A96677
$$ -125317 113042 -237875 -432462 -218020 187656 185257 -89877 159504 -317212 196677
10432a98729A27106D9884g8709H2531O9204C2982a84608M5770C9486M1837d2117
$$ -198729 127106 49884 -78709 82531 151735 32982 -184608 -138838 39486 81323 -42117
10420B20041b57229D81170a27788n069B3160N3129R2438g2621L3205m3276j21066
$$ 220041 -257229 481170 -127788 -132857 23160 76289 168727 -72621 -39416 -82692 -203758
10409b03758n7584k8640d3954j1996k88178c7223C50653j44408c68599R0582B12313
$$ -203758 -261342 -289982 -43954 -55950 -344128 -37223 350653 206245 -368599 -278017 212313
10397A60850N9523a73085B41729a55740L8432k13042a05941B3882J84443h1762
$$ 160850 220373 -173085 241729 -155740 -117308 -330350 -105941 23882 208325 -81762
10386i388C06310k8792a3308m7606j28412A53992i6164j76988I0034h3209b9333
$$ -9388 306310 277518 -13308 -60914 -189326 153992 -96164 -273152 90034 -83209 -29333
10374a93624C954J93529K2180J68931j86851i4878B98271j28851B2226i1385p896
$$ -193624 3954 197483 219663 388594 201743 -94878 298271 169420 22226 -91385 -99281
10363i9281B6257K90168j12439B8802L33950b40414B07524J83390c5055B7571
$$ -99281 26257 316425 203986 28802 362752 -240414 207524 390914 -35055 27571
10352A91673K06208o1861I663a78872F46377k33512P2496j9657j48889H7788N03550
$$ 191673 397881 336020 9663 -178872 646377 412865 485361 465704 316815 87788 591338
10341E91338B47200M4738j24575E0741K77987N1071q5449j12909J33699j12729
$$ 591338 247200 291938 167363 50741 328728 379799 294350 181441 315140 202411
10331B02411M57853o4469k46248J42830I6768J70267K4J9325a37469C69991A31468
$$ 202411 660264 595795 349547 492377 96768 267035 267059 286384 -137469 369991 131468
10319H2126A2199e7594C325L15700c4138E7774N8063j7664C0070K73934M5750
$$ 82126 12199 -57594 3325 319025 -34138 57774 115837 98173 30070 304004 349754
10308C49754a83381A78099i3563D78361d7031m6091A20941E859a22021N2580C03580
$$ 349754 -183381 178099 -93563 478361 -47031 -93122 120941 5859 -122021 -69441 303580
10296A02834B7575O821K44432B0690c3483A35953j5144d8845o3530n3523J6670
$$ 102834 27575 34396 278828 20690 -33483 135953 120809 -48845 -112375 -165898 -149228
10285a49228A75643j9959a64761q068A21902d4352p2348H2515c0972l42438h3504
$$ -149228 175643 155684 -164761 -172829 121902 -44352 -116700 82515 -30972 -373410 -83504
10273A13851J3346C0069f3724l37477a01538m6339C6763J92777b0528k7708A18098
$$ 113851 127197 30069 -63724 -401201 -101538 -147877 36763 229540 -20528 -48236 118098
10261C5830A2283g5434K1575A42101a1886j41675A51108N9115f3270B18012m3051
$$ 35830 12283 -75434 -53859 142101 -11886 -153561 151108 210223 -63270 218012 174961
10250A74961n7603a11662j53824I3282g1974k83870J75642g1382B99475j41049
$$ 174961 117358 -111662 -265486 93282 -71974 -355844 -180202 -71382 299475 158426
10240A58426Q8523c05393D2366g4022B67183F790J86508J87543Q6653H2864J09240
$$ 158426 246949 -305393 42366 -74022 267183 6790 193298 380841 467494 82864 192104
10229A92104K9338a56701A1245a41160o3809O3117A32730J34108a7919k1668o5427
$$ 192104 221442 -156701 11245 -141160 -204969 -141852 132730 266838 -17919 -39587 -105014
10218a05014F8152G872a53695C70538c63694E295c46431J40640j04331H6365k7586
$$ -105014 68152 7872 -153695 370538 -363694 5295 -346431 -205791 -310122 86365 58779
10207E8779O5118b62211B06313B2569d08695e6337C38981c2134k76950L102i1570
$$ 58779 123897 -262211 206313 22569 -408695 -56337 338981 -32134 -309084 -305982 -91570
10195D7024J14268a55178L102A86124i6910A3908b48576A72694n9153a23930m5749
$$ 47024 161292 -155178 -152076 186124 -96910 13908 -248576 172694 113541 -123930 -169679
10184a69679P4139K2787a1331k52153C9534a56120j08547q3475A98309K25519
$$ -169679 -95540 -72753 -11331 -263484 39534 -156120 -264667 -348142 198309 423828
10174D23828I2140K5512b51676A36441b80855r079A96274f412m54523a61045f5988
$$ 423828 92140 117652 -251676 136441 -280855 -289934 196274 -6412 -460935 -161045 -65988
10162a54650F4396c52364M5372G7798f6304L1674j93490A60667a13037l04143
$$ -154650 64396 -352364 -306992 77798 -66304 -34630 -228120 160667 -113037 -417180
10152d17180b0624D3157M1365c2718I20a32986j50806h8036M3162L153A75962
$$ -417180 -20624 43157 84522 -32718 920 -132986 -283792 -88036 -44874 -41721 175962
10140d28597G0177A8163g3489l8575k3543r2897l25032A7071c706A86668g2914
$$ -428597 70177 18163 -73489 -112064 -135607 -228504 -553536 17071 -3706 186668 -72914
10128d86266D0893c0797j23442K5365M3068B94330j10503b6756j03022D8521C711
$$ -486266 40893 -30797 -154239 -128874 -85806 294330 183827 -26756 -129778 48521 3711
10116C0735a37016J523d6860J8734m09960J80189a4956l18080G4321d7038B80144
$$ 30735 -137016 -135493 -46860 -28126 -438086 -257897 -14956 -333036 74321 -47038 280144
10104c7431k60892A12273a60076C7588b50283A34790a66225C49589e9063L530
$$ -37431 -298323 112273 -160076 37588 -250283 134790 -166225 349589 -59063 -55533
10094e5533r6156B21859R0011C2491a12037A99102k5768C911c44852A68217A2004
$$ -55533 -151689 221859 311870 32491 -112037 199102 173334 3911 -344852 168217 12004
10082A08978a80766L0729O4343k31772a08679L5650A71780e6597b3604l56549
$$ 108978 -180766 -150037 -85694 -317466 -108679 -73029 171780 -56597 -23604 -380153
10072c80153a66822A83203k3897d26059A32213g9013c7336l14711A13503K750
$$ -380153 -166822 183203 159306 -426059 132213 -79013 -37336 -352047 113503 116253
10062A16253A5023a63513k26216a76021A03035a41859C0825a47406j84497A23781
$$ 116253 15023 -163513 -389729 -176021 103035 -141859 30825 -147406 -331903 123781
10051a93556q6428f5369F3826B1919i5084j55284N6054n11869C13012a0601B18329
$$ -193556 -279984 -65369 63826 21919 -95084 -250368 -194314 -706183 313012 -10601 218329
10039B90408f0490K8189A44045C33Q344N0688a80293N2723B1223D540J49557k6633
$$ 290408 -60490 -32301 144045 333 8677 59365 -180293 -127570 21223 4540 154097 127464
10027A27464e8309b2327k76911B5371c80154J32474g5350B3316b38094l04504
$$ 127464 -58309 -22327 -299238 25371 -380154 -247680 -75350 23316 -238094 -542598
10017e42598a14058A3469b12803Q3100G3692b22546R9484l11857J86294i7715
$$ -542598 -114058 13469 -212803 -129703 73692 -222546 -123062 -434919 -248625 -97715
10006a01710e077j9334j38921D1603h8660A10837b65431A53697a68640B39487
$$ -101710 -5077 -24411 -163332 41603 -88660 110837 -265431 153697 -168640 239487
9995A40806d35156a50767A83314a65455P9253l1704q9724j6140N9423p3498O2237
$$ 140806 -435156 -150767 183314 -165455 -86202 -117906 -207630 -223770 -164347 -237845 -175608
9984a75608c3276A65693o590a04253j46765j1639e4194r981m2672g475C8592c44393
$$ -175608 -33276 165693 159103 -104253 -251018 -262657 -54194 -64175 -106847 -7475 38592 -344393
9971a06983j11468H8339b99904M8824a0066l91178F8570K70284a73938Q4620L7886
$$ -106983 -218451 88339 -299904 -251080 -10066 -401244 68570 338854 -173938 -89318 -51432
9960e1432B64524I0610i8496b8809c515j92177j40491A83946a61116A5376Q7913
$$ -51432 264524 90610 -98496 -28809 -3515 -195692 -336183 183946 -161116 15376 103289
9949A03289I32J20086o0340c5231C8923O3185J2350b10817D0852J27717f3953
$$ 103289 932 121018 60678 -35231 38923 102108 114458 -210817 40852 168569 -63953
9937D7451b336j39178F3717c1109l93101e1876m4852q4261k23701a35673j02677
$$ 47451 -2336 -141514 63717 -31109 -424210 -51876 -96728 -180989 -404690 -135673 -238350
9926b38350A0488a16421k96166A0014J0678a69141l5923n6675E8818b32711C92135
$$ -238350 10488 -116421 -412587 10014 20692 -169141 -205064 -261739 58818 -232711 392135
9914b42727a09674p2125m9441m254j7694j35572F6290R1713P1016P0059f0257
$$ -242727 -109674 -181799 -231240 -235494 -253188 -388760 66290 158003 229019 299078 -60257
9902I9480a95410H3718a00110j30786k74074g9866A05452b13576b801k5198o1478
$$ 99480 -195410 83718 -100110 -230896 -504970 -79866 105452 -213576 -2801 -27999 -89477
9891h9477k6364k52113I5258F524J02891b23293a9708k12988d6517H3094d1412
$$ -89477 -115841 -367954 95258 6524 109415 -223293 -19708 -232696 -46517 83094 -41412
9879a75051n7375A0288e8133A37725g3087j6317K8133a4033n2756k54522a42592
$$ -175051 -232426 10288 -58133 137725 -73087 -89404 -61271 -14033 -66789 -321311 -142592
9867a44985A44803E3407J52550E0203N9859a23774H6218a62841d085k70397a15779
$$ -144985 144803 53407 205957 50203 110062 -123774 86218 -162841 -4085 -274482 -115779
9855b65827q9261h6764C12553j37023a34403A34707a03334A15380i6907A5245
$$ -265827 -355088 -86764 312553 175530 -134403 134707 -103334 115380 -96907 15245
9844b76669j24446A16580k7554a83646H707a14029j60238A19302b11010I1316
$$ -276669 -401115 116580 89026 -183646 8707 -114029 -274267 119302 -211010 91316
9833a24410C16579j36426a70545j7751d3028A03506Q3886d8233l9906q7988A46327
$$ -124410 316579 180153 -170545 -188296 -43028 103506 187392 -48233 -88139 -176127 146327
9821b79852Q6896n9441D2114A8014L6324a32039A13854a01865k13322B03849F666
$$ -279852 -192956 -252397 42114 18014 54338 -132039 113854 -101865 -315187 203849 6666
9809c6365p5728A63761c0499j9247K379p8051B025M28214C0198e4182n4231j17704
$$ -36365 -112093 163761 -30499 -49746 -47367 -125418 2025 430239 30198 -54182 -108413 -226117
9797b26117h6642j67597C36494i8547A20129J34528c34345a33348M5258r2401
$$ -226117 -86642 -254239 336494 -98547 120129 254657 -334345 -133348 -88090 -180491
9787a80491I2308f0650A97045o9534a93631A36333a95771M9468B09009b14609
$$ -180491 92308 -60650 197045 127511 -193631 136333 -195771 -146303 209009 -214609
9776E8788b06315D9037d64272B2983b22433K7015O3038B7070b08698k10717c2212
$$ 58788 -206315 49037 -464272 22983 -222433 -195418 -132380 27070 -208698 -419415 -32212
9764a13380J8146d1300J3447D1482a71042J3634N2074q2626C23187f0936n8806
$$ -113380 -95234 -41300 -27853 41482 -171042 -157408 -105334 -187960 323187 -60936 -119742
9753a19742L4762j467k2267c0050j8318n5356B40708p1997c3803D3591a3610j80680
$$ -119742 -84980 -86447 -108714 -30050 -48368 -103724 240708 168711 -33803 43591 -13610 -194290
9741a94290O6697A27596b17867h5519B68554F5628b1636D2500b60171J13424C5008
$$ -194290 -127593 127596 -217867 -85519 268554 65628 -21636 42500 -260171 -146747 35008
9729b62393A33191g0666j90051J24317k06905J56043K9322q3124a16822J0449
$$ -262393 133191 -70666 -260717 -136400 -343305 -187262 -157940 -241064 -116822 -106373
9719a06373H348f3657A10292b47816B9482b88450a14809L1714j12756D2085P2111
$$ -106373 8348 -63657 110292 -247816 29482 -288450 -114809 -83095 -195851 42085 114196
9708A14196e27131f7853j03960G7304O0829L71007E551c62907Q612i9204J6259
$$ 114196 -527131 -67853 -171813 77304 138133 509140 5551 -362907 -354295 -99204 -82945
9697h2945J8358D5739M3178a47923I1634c26705b2050D7291c96155H912d9006
$$ -82945 -64587 45739 88917 -147923 91634 -326705 -22050 47291 -396155 8912 -49006
9685b94987F7010B0197a16982A7501c6423J46B52160e0246G4772a64890D9532
$$ -294987 67010 20197 -116982 17501 -36423 -36277 252160 -50246 74772 -164890 49532
9673B2027J43530C2573J34525b34263a03464D4110b12064Q1411B40445o7163a55913
$$ 22027 165557 32573 167098 -234263 -103464 44110 -212064 -130653 240445 173282 -155913
9661a45803A08614K3602i1606k88681j8707A23498g4626D565N9917a18963j94540
$$ -145803 108614 132216 -91606 -380287 -398994 123498 -74626 4565 64482 -118963 -313503
9650c13503e2804k57264O5868C24786H5517J99631K36314h1099q1780n4593i6883
$$ -313503 -52804 -310068 -244200 324786 85517 285148 521462 -81099 -162879 -217472 -96883
9638b5604j93109B32090e3486A42324c21627a37885j3792c3639l55492A72590
$$ -25604 -218713 232090 -53486 142324 -321627 -137885 -151677 -33639 -389131 172590
9627B34174B2727J738E490c15893i8292j88151a04221j0411G1630k3956a62491
$$ 234174 22727 24465 5490 -315893 -98292 -286443 -104221 -114632 71630 47674 -162491
9615I2740C1716j1694O2861A8733e2503b4989j68860f5157j89436R1246A17582
$$ 92740 31716 20022 82883 18733 -52503 -24989 -193849 -65157 -254593 -163347 117582
9603B42306j6556o6877a17204j19499j5926d4748B6753c7326k09821q4363a18741
$$ 242306 225750 158873 -117204 -236703 -252629 -44748 26753 -37326 -247147 -331510 -118741
9591i0598n8251j26117q6750F9091J34657a16571I8305a68764c3612r3064j08997
$$ -90598 -148849 -274966 -361716 69091 203748 -116571 98305 -168764 -33612 -126676 -235673
9580b35673i2841I71J02704g7290j59985B14856B0926J03866F0991P9584d5043
$$ -235673 -92841 971 103675 -77290 -237275 214856 20926 124792 60991 140575 -45043
9568a17974j67219R797a24341l83201a05524k11883R3420J05442d2265j40501
$$ -117974 -285193 -275396 -124341 -507542 -105524 -317407 -223987 -118545 -42265 -182766
9558a82766I4206b06855j9051E5594j216b84645c2148l78581H3516b47075k37443
$$ -182766 94206 -206855 -225906 55594 54378 -284645 -32148 -410729 83516 -247075 -484518
9547d84518B877b37657A69863a44285L0054d7450k62021P1979j1776R7276L3152
$$ -484518 2877 -237657 169863 -144285 -114231 -47450 -309471 -237492 -249268 -151992 -118840
9536a18840F966a48545B10107b77489B34026e986o6513r4065A60715a76573l4532
$$ -118840 6966 -148545 210107 -277489 234026 -5986 -72499 -166564 160715 -176573 -211105
9525b11105F056i157D0087a42414B72889j28650a5327k25359I8975b30692a9735
$$ -211105 6056 -9157 40087 -142414 272889 144239 -15327 -240686 98975 -230692 -19735
9513h3809C17353A09166k7988M0048b00813g8350c0705j34231a5813j42099E2929
$$ -83809 317353 109166 81178 121226 -200813 -78350 -30705 -164936 -15813 -157912 52929
9501a25008B83845a6462A87346a82101N1337j11358h3370K6440n3171H0683a19002
$$ -125008 283845 -16462 187346 -182101 -130764 -242122 -83370 -56930 -110101 80683 -119002
9489A64931c96376d6235A0197b21928E2235N2396C8040e6226k20692c2265o842
$$ 164931 -396376 -46235 10197 -221928 52235 104631 38040 -56226 -276918 -32265 -39107
9478c9107k27108h5690o8415d7782A29140a76945K9724l1237A12309b00133Q1274
$$ -39107 -266215 -85690 -154105 -47782 129140 -176945 -147221 -178458 112309 -200133 -118859
9467a18859o3134A88291m4697e270j03881B3480J36096n2966Q7539C259i6213
$$ -118859 -181993 188291 143594 -5270 -109151 23480 159576 106610 194149 3259 -96213
9455B3680K27148b30970o1250i6171K0272Q7j60048A5291M0652a54976p1277m4297
$$ 23680 250828 -230970 -292220 -96171 -75899 -75812 -235860 15291 55943 -154976 -226253 -270550
9443b70550j02209J44176c478G7639J95338i3592D8061M1998J7213C3586J19621
$$ -270550 -372759 -228583 -3478 77639 272977 -93592 48061 90059 107272 33586 153207
9432A53207A5597a21012b7020J3135H076K06378C4563a61467L0668B08225O1938
$$ 153207 15597 -121012 -27020 -13885 8076 214454 34563 -161467 -130799 208225 270163
9421B70163b78408c9743l26605H3074f6181B3210a67418j23k4860k03152a89409
$$ 270163 -278408 -39743 -366348 83074 -66181 23210 -167418 -167541 -192401 -395553 -189409
9409c05782a16227k18380b4344j71245j65166J6859A00006i7125E2588b29035
$$ -305782 -116227 -334607 -24344 -195589 -360755 -343896 100006 -97125 52588 -229035
9398b25838B97389d06366A45293a4077j77532d7520k68092A11327K25164a30002
$$ -225838 297389 -406366 145293 -14077 -191609 -47520 -315612 111327 336491 -130002
9387b00804J6521g2370A77646a66662M0700q5244H7914c37824i6405j72596H358
$$ -200804 -184283 -72370 177646 -166662 -125962 -211206 87914 -337824 -96405 -269001 8358
9375f8961B76028a1902j20043A66881c60726A66335A8490a57915j61325c5688
$$ -68961 276028 -11902 -131945 166881 -360726 166335 18490 -157915 -319240 -35688
9364c4607a6165B56078b34883R1701j087A84513a37121A87710q2895b466H2454
$$ -34607 -16165 256078 -234883 -143182 -144269 184513 -137121 187710 104815 -2466 82454
9352C0050K0237b99708c0754j48761h190D977A502a94020k37974A75580a24257
$$ 30050 50287 -299708 -30754 -179515 -8190 4977 1502 -194020 -431994 175580 -124257
9340A45127J1472c91391R5660a24984f764j1115l83486a0785m9677o775n8718
$$ 145127 156599 -391391 -295731 -124984 -6764 -17879 -401365 -10785 -60462 -67237 -125955
9329a25955A46048o6638a96998q2484A98457D1369g9050K7280J0023k2682n497
$$ -125955 146048 79410 -196998 -279482 198457 41369 -79050 -51770 -41747 -64429 -69926
9318f9926a5145j50400k08405a6793A43479P8032c68147J23026o8138e0032j03234
$$ -69926 -15145 -165545 -373950 -16793 143479 221511 -368147 -245121 -313259 -50032 -153266
9307a53266E3663a43146K7144r05B6276J08327d1535C7553b17386E7579L37297
$$ -153266 53663 -143146 -116002 -116907 26276 134603 -41535 37553 -217386 57579 394876
9296C94876F2111a05223o3346A38373f249j27125G3394a44430B02086d49561M7481
$$ 394876 62111 -105223 -168569 138373 -6249 -133374 73394 -144430 202086 -449561 -402080
9285d02080c6187A21809a84843K4363G5961K0806K0259b16478O4015A36473a78517
$$ -402080 -36187 121809 -184843 -160480 75961 96767 117026 -216478 -152463 136473 -178517
9273a81167B18639J42239b69624m28641a62794p6136J09538j9443D729J07148
$$ -181167 218639 360878 -269624 -698265 -162794 -238930 -129392 -148835 4729 111877
9263A11877d83135F1502i6703j24528a2020m3109F7134K24717c8586k28243A993
$$ 111877 -483135 61502 -96703 -221231 -12020 -55129 67134 291851 -38586 -266829 1993
9251a02490j17815B1334f6347r8372G3560g5655C1303a90212B95231e8176A12678
$$ -102490 -220305 21334 -66347 -164719 73560 -75655 31303 -190212 295231 -58176 112678
9239c8375E1733b76786c9522p0173A20804a77704k7280h0215j43072g5885j53932
$$ -38375 51733 -276786 -39522 -109695 120804 -177704 -204984 -80215 -223287 -75885 -229817
9228b29817b1115J0041p3469d1909l58802a95085B14162f5087l3526A5982J01314
$$ -229817 -21115 -11074 -84543 -41909 -400711 -195085 214162 -65087 -98613 15982 117296
9217A17296c6852A98626b5783j38426e582H1029e5707I8224L80881a11295k56798
$$ 117296 -36852 198626 -25783 -164209 -5582 81029 -55707 98224 479105 -111295 -368093
9206c68093A37898A8627h7521j24024k60490a68723h0467c1904A07847a77641
$$ -368093 137898 18627 -87521 -211545 -472035 -168723 -80467 -31904 107847 -177641
9195a63740C35428j65386a17441j3231A06877f861m0486k35945M8334A41776R1089
$$ -163740 335428 170042 -117441 -130672 106877 -6861 -47347 -283292 -234958 141776 232865
9184B32865C3838L9635d24539f5732j05018q3036C516c8075A88419a10957K4194
$$ 232865 33838 73473 -424539 -65732 -170750 -253786 3516 -38075 188419 -110957 -86763
9173h6763M2614B39281b58540h8821j71376J13751I7698k945h3129B64L55007
$$ -86763 -44149 239281 -258540 -88821 -260197 -146446 97698 94753 -83129 264 355271
9162C55271b10844A31196a87630A86607C1986b39585o3707J32067h1792k50834
$$ 355271 -210844 131196 -187630 186607 31986 -239585 -303292 -171225 -81792 -332626
9152c32626h5791q712n9548n8564B00049a5981B32126c82286O4173N8793J23765
$$ -332626 -85791 -94503 -154051 -212615 200049 -15981 232126 -382286 -318113 -259320 -135555
9141a35555L1823q1757f0619l8838a8444m3216B64109C9571b67225A97613f7744
$$ -135555 -103732 -185489 -60619 -99457 -18444 -61660 264109 39571 -267225 197613 -67744
9129a38340I8188a80235M3177e1991j21673k38100a00018A75310l8687b46051
$$ -138340 98188 -180235 -137058 -51991 -173664 -411764 -100018 175310 136623 -246051
9118A15664c34065D1226f7888k12794a09863b7110B6315L7140g3638A32359b31808
$$ 115664 -334065 41226 -67888 -280682 -109863 -27110 26315 63455 -73638 132359 -231808
9106b52184H4904N0859d5488k86971i2104H6480d76609n8297A45378a29286a5246
$$ -252184 84904 135763 -45488 -332459 -92104 86480 -476609 -534906 145378 -129286 -15246
9094a54513A35724a00818q4950A90219h720j08587C27886C3518i2672A80891C5536
$$ -154513 135724 -100818 -185768 190219 -8720 -117307 327886 33518 -92672 180891 35536
9082a60938j47432P6919A85518O5061a05630j85071B16493c07831A18902b129
$$ -160938 -308370 -231451 185518 250579 -105630 -290701 216493 -307831 118902 -2129
9071A41139e1615o6828C01290C8038J19092J01260b20699B28192d3160j3667K6756
$$ 141139 -51615 -118443 301290 38038 157130 258390 -220699 228192 -43160 -56827 -30071
9060c0071l6732k72851A77150o9557h5712D2937a79469D7200A7726c44661A17809
$$ -30071 -66803 -339654 177150 107593 -85712 42937 -179469 47200 17726 -344661 117809
9048d8042B46024C0877e4524k56754C8966b53594d0504B23051a96627m4066A42238
$$ -48042 246024 30877 -54524 -311278 38966 -253594 -40504 223051 -196627 -240693 142238
9036c26379C81930a57258A3817J5245a9798k2770A08119a92323Q7861m6487O3249
$$ -326379 381930 -157258 13817 29062 -19798 -42568 108119 -192323 -104462 -150949 -87700
9025h7700c263A0233D009a9285H0523d2606j18510B5754a29848N6322G1976a3747
$$ -87700 -3263 10233 4009 -19285 80523 -42606 -161116 25754 -129848 -73526 71976 -13747
9012a10261A22745m5104K63412a12611p6388i1401C2266j1411J96904b2409E8446
$$ -110261 122745 77641 341053 -112611 -188999 -91401 32266 20855 217759 -22409 58446
9000A858d54328K23520B06505b21833B39337r6536a79852f6561j63608k2192m4019
$$ 1858 -454328 -230808 206505 -221833 239337 142801 -179852 -66561 -230169 -252361 -296380
8989b96380A72147a70506j6128C73385a06794C75014B3039b43274c7672A71393
$$ -296380 172147 -170506 -186634 373385 -106794 375014 23039 -243274 -37672 171393
8978a65478E2458b20675H9398b5824E3005b17486d2440q2494B5124J4758e0351
$$ -165478 52458 -220675 89398 -25824 53005 -217486 -42440 -124934 25124 39882 -50351
8966h8564l603j80442i1666k34762h1823G445a50156j61449a25176K0525B49437
$$ -88564 -92167 -272609 -91666 -326428 -81823 7445 -150156 -311605 -125176 -104651 249437
8954e3248b0087j12741J177O3571B17393B2875a46507j48375A46898a57126l8532
$$ -53248 -20087 -132828 -131651 -68080 217393 22875 -146507 -294882 146898 -157126 -195658
8943a95658C1379i4806b5867q474j12945f2547k80750i7458A88893I2475a73216
$$ -195658 31379 -94806 -25867 -34341 -147286 -62547 -343297 -97458 188893 92475 -173216
8931c86303a88870a1095n4801l14050o5482J71574C8400a67553N2352A24314j2633
$$ -386303 -188870 -11095 -65896 -379946 -445428 -273854 38400 -167553 -115201 124314 111681
8920A11681a11118j2105A65658b24497E07214C296K99441j46885G3238J8985J58198
$$ 111681 -111118 -123223 165658 -224497 507214 3296 302737 155852 73238 92223 250421
8909B50421M87154k10859J40225N03401M40803J241034L473738K215814l993554
$$ 250421 737575 526716 666941 1170342 1611145 2852179 6325917 8541731 4548177
8900D548177j855122j253187E36386K71631A04449M61296I6935j8001L22073j11340
$$ 4548177 2693055 1439868 536386 808017 104449 565745 96935 78934 401007 289667
8890B89667L9839p6368j9907j5436a80864O0987J470j16942f5062o4849j34086
$$ 289667 329506 253138 233231 217795 -180864 -119877 -118407 -235349 -65062 -129911 -263997
8879b63997i4582k38540E8095a72003k88692M5465A5876J02192b65307f7041I4707
$$ -263997 -94582 -333122 58095 -172003 -460695 -415230 15876 118068 -265307 -67041 94707
8867a35837B05584I1249i2083c7783C22584A09915a61965b5943j80146c3332A99911
$$ -135837 205584 91249 -92083 -37783 322584 109915 -161965 -25943 -206089 -33332 199911
8855A86591f2934k2636j6416j38903h306k83890J25152o1965G5487c88296a54860
$$ 186591 -62934 -85570 -101986 -240889 -8306 -292196 -167044 -229009 75487 -388296 -154860
$$ [...]
##END NTUPLES=NMR SPECTRUM
##END=
