
##TITLE=AC1082_NSTO01_5818588_j4YIMWLkmI
##JCAMPDX= 6.0         $$ Bruker NMR JCAMP-DX V2.0
##DATA TYPE= NMR SPECTRUM
##DATA CLASS= NTUPLES
##ORIGIN= BRUKER
##OWNER= Administrator
$$ 1.72 TOPSPIN		Version 2.1
$$ 2012-04-16 19:08:33.203 -0500  Administrator@TOPSPIN
$$ Compression mode = diff/dup
##.OBSERVE FREQUENCY= 400.13188235
##.OBSERVE NUCLEUS= ^1H
##.ACQUISITION MODE= SIMULTANEOUS (DQD)
##.ACQUISITION SCHEME= undefined
##.AVERAGES= 8
##.DIGITISER RES= 22
##SPECTROMETER/DATA SYSTEM= spect
##.PULSE SEQUENCE= zg30
##.SOLVENT NAME= COFFEE_meoh
##.SHIFT REFERENCE= INTERNAL, COFFEE_meoh, 1, 14.98061
##AUDIT TRAIL= $$ (NUMBER, WHEN, WHO, WHERE, PROCESS, VERSION, WHAT)
$$ ##TITLE= Audit trail, TOPSPIN		Version 2.1
$$ ##JCAMPDX= 5.01
$$ ##ORIGIN= Bruker BioSpin GmbH
$$ ##OWNER= Administrator
$$ $$ C:\Bruker\TOPSPIN/data/COFFEE/nmr/AC1082_NSTO01_5818588_j4YIMWLkmI/20/pdata/1/auditp.txt
$$ ##AUDIT TRAIL=  $$ (NUMBER, WHEN, WHO, WHERE, PROCESS, VERSION, WHAT)
(   1,<2012-04-15 14:41:44.234 -0500>,<Administrator>,<TOPSPIN>,<go>,<TOPSPIN 2.1>,
      <created by zg
	started at 2012-04-15 14:40:37.609 -0500,
	POWCHK enabled, PULCHK disabled,
       configuration hash MD5:
       1A 1E CE 29 27 FD 77 03 67 4E F0 E3 C4 B2 CB 90
       data hash MD5: 64K
       E8 AF A6 9F 51 3E 7B D8 22 BA C9 7D 6B A7 AA 34>)
(   2,<2012-04-15 14:41:46.859 -0500>,<Administrator>,<TOPSPIN>,<proc1d>,<TOPSPIN 2.1>,
      <Start of raw data processing
       efp LB = 0 FT_mod = 6 PKNL = 1 PHC0 = 0 PHC1 = 0 SI = 32K 
       data hash MD5: 32K
       AE B3 CD 83 B1 23 85 39 37 13 5F A2 F0 A5 12 0E>)
(   3,<2012-04-15 14:41:47.328 -0500>,<Administrator>,<TOPSPIN>,<proc1d>,<TOPSPIN 2.1>,
      <pk PHC0 = 214.7717 PHC1 = 0 
       data hash MD5: 32K
       C2 25 09 26 0A 0F BB D2 40 47 1E 0C 86 F0 21 F1>)
(   4,<2012-04-15 14:41:47.406 -0500>,<Administrator>,<TOPSPIN>,<proc1d>,<TOPSPIN 2.1>,
      <abs ABSG = 1 
       data hash MD5: 32K
       B9 BC B3 73 0B 50 07 C0 45 86 19 C6 C4 47 38 CC>)
(   5,<2012-04-15 14:41:47.437 -0500>,<Administrator>,<TOPSPIN>,<proc1d>,<TOPSPIN 2.1>,
      <abs ABSG = 2 
       data hash MD5: 32K
       79 05 74 E2 4E B5 72 3E 59 52 64 32 0E 3F E1 2E>)
(   6,<2012-04-15 14:41:47.468 -0500>,<Administrator>,<TOPSPIN>,<proc1d>,<TOPSPIN 2.1>,
      <abs ABSG = 3 
       data hash MD5: 32K
       1C CB 56 65 A5 F8 08 57 BD A4 59 20 F5 8D 38 DD>)
(   7,<2012-04-15 14:41:47.500 -0500>,<Administrator>,<TOPSPIN>,<proc1d>,<TOPSPIN 2.1>,
      <abs ABSG = 4 
       data hash MD5: 32K
       61 D2 10 BB 22 50 09 0A 48 39 2A 2B 05 61 B1 BD>)
(   8,<2012-04-15 14:41:47.531 -0500>,<Administrator>,<TOPSPIN>,<proc1d>,<TOPSPIN 2.1>,
      <abs ABSG = 5 
       data hash MD5: 32K
       1D 29 7D 4E 67 FA AE CF 15 8B 18 59 3C F5 8E 75>)
(   9,<2012-04-15 14:41:51.171 -0500>,<Administrator>,<TOPSPIN>,<audit>,<TOPSPIN 2.1>,
      <user comment:
       ICON-NMR User ID: COFFEE
       data hash MD5: 32K
       1D 29 7D 4E 67 FA AE CF 15 8B 18 59 3C F5 8E 75>)
$$ ##END=
$$ 
$$ [...]
##$TP= (0..7)
150 150 150 150 150 150 150 150
##$TP07= 0
##$TPNAME0= <>
##$TPNAME1= <>
##$TPNAME2= <>
##$TPNAME3= <>
##$TPNAME4= <>
##$TPNAME5= <>
##$TPNAME6= <>
##$TPNAME7= <>
##$TPOAL= (0..7)
0.5 0.5 0.5 0.5 0.5 0.5 0.5 0.5
##$TPOFFS= (0..7)
0 0 0 0 0 0 0 0
##$TUNHIN= 0
##$TUNHOUT= 0
##$TUNXOUT= 0
##$USERA1= <user>
##$USERA2= <user>
##$USERA3= <user>
##$USERA4= <user>
##$USERA5= <user>
##$V9= 5
##$VALIST= <valist>
##$VCLIST= <CCCCCCCCCCCCCCC>
##$VD= 0
##$VDLIST= <DDDDDDDDDDDDDDD>
##$VPLIST= <PPPPPPPPPPPPPPP>
##$VTLIST= <TTTTTTTTTTTTTTT>
##$WBST= 2048
##$WBSW= 25
##$XGAIN= (0..3)
0 0 0 0
##$XL= 0
##$YL= 0
##$YMAX_a= 530614
##$YMIN_a= -634941
##$ZGOPTNS= <>
##$ZL1= 120
##$ZL2= 120
##$ZL3= 120
##$ZL4= 120
##$ABSF1= 14.98061
##$ABSF2= -5.57192
##$ABSG= 5
##$ABSL= 3
##$ALPHA= 0
##$AQORDER= 0
##$ASSFAC= 0
##$ASSFACI= 0
##$ASSFACX= 0
##$ASSWID= 0
##$AUNMP= <proc_prof1d_extract_pilot.lims>
##$AXLEFT= 0
##$AXNAME= <>
##$AXNUC= <1H>
##$AXRIGHT= 0
##$AXTYPE= 0
##$AXUNIT= <>
##$AZFE= 0.1
##$AZFW= 0.1
##$BCFW= 0
##$BC_mod= 0
##$BYTORDP= 0
##$COROFFS= 0
##$CY= 15
##$DATMOD= 1
##$DC= 0
##$DFILT= <>
##$DTYPP= 0
##$F1P= 0
##$F2P= 0
##$FCOR= 0.5
##$FTSIZE= 32768
##$FT_mod= 6
##$GAMMA= 0
##$GB= 0
##$INTBC= 1
##$INTSCL= 1
##$ISEN= 128
##$LB= 0
##$LEV0= 0
##$LPBIN= 0
##$MAXI= 10000
##$MC2= 0
##$MEAN= 0
##$ME_mod= 0
##$MI= 0
##$NCOEF= 0
##$NC_proc= -8
##$NLEV= 6
##$NOISF1= 0
##$NOISF2= 0
##$NSP= 0
##$NTH_PI= 0
##$NZP= 0
##$OFFSET= 14.98061
##$PC= 1
##$PHC0= 214.7717
##$PHC1= 0
##$PH_mod= 1
##$PKNL= yes
##$PPARMOD= 0
##$PPDIAG= 0
##$PPIPTYP= 0
##$PPMPNUM= 2147483647
##$PPRESOL= 1
##$PSCAL= 4
##$PSIGN= 0
##$PYNMP= <proc.py>
##$REVERSE= no
##$SF= 400.13
##$SI= 32768
##$SIGF1= 0
##$SIGF2= 0
##$SINO= 400
##$SIOLD= 32768
##$SPECTYP= <>
##$SREGLST= <1H.CDCl3>
##$SSB= 0
##$STSI= 32768
##$STSR= 0
##$SW_p= 8223.68421052632
##$SYMM= 0
##$S_DEV= 0
##$TDeff= 65536
##$TDoff= 0
##$TI= <>
##$TILT= no
##$TM1= 0
##$TM2= 0
##$TOPLEV= 0
##$USERP1= <user>
##$USERP2= <user>
##$USERP3= <user>
##$USERP4= <user>
##$USERP5= <user>
##$WDW= 1
##$XDIM= 32768
##$YMAX_p= 462519611
##$YMIN_p= -671127
##$CURPLOT= <Network HP LaserJet P1505>
##$CURPRIN= <$Network HP LaserJet P1505>
##$DFORMAT= <normdp>
##$LAYOUT= <+/1D_H.xwp>
##$LFORMAT= <normlp>
##$PFORMAT= <normpl>
##$SURQMSG= 1
$$ End of Bruker specific parameters
$$ ---------------------------------
##NTUPLES= NMR SPECTRUM
##VAR_NAME=  FREQUENCY,     SPECTRUM/REAL,   SPECTRUM/IMAG
##SYMBOL=    X,             R,               I
##VAR_TYPE=  INDEPENDENT,   DEPENDENT,       DEPENDENT
##VAR_FORM=  AFFN,          ASDF,            ASDF
##VAR_DIM=   32768,         32768,           32768
##UNITS=     HZ,            ARBITRARY UNITS, ARBITRARY UNITS
##FACTOR=    0.250966925370066, 1,           1
##FIRST=     8223.43324360095, -101318,      -81419
##LAST=      0,             189045,          95319
##MIN=       0,             -671127,         0
##MAX=       8223.43324360095, 462519611,    0
$$ Real data points
##PAGE= N=1
##DATA TABLE= (X++(R..R)), XYDATA
$$ [...]
19507a85843j05542a09249j17278A29685e3687A7213a40106C92195a07541j45978
19497b53519C1172a27505D5109L45442A65638e9392j69569a00119A96839C5009
19486F6933Q4992E8685c30415O9298B7642b25414p8366d9231n3777Q244I048e31469
19473c57594J51353j37248L0646H5900c16978a49530A41148e0900l88120K04298
19463b34722h3346A8502J8827i0528i855k12338m48934a2592K898I569a97798
19451c49526g2747J7220m7683D9126a10271j34292f5325A05612C3607e6368j08613
19440a64981d1825l42511b9733N783j39521q2087b084l19340H2079a70155J7726
19429a52429j2418C83149e2867j49664i7225l1888k19106O2820a21731A6220a66791
$$ plain form
19507 -185843 -291385 -109249 -226527 129685 -53687 17213 -140106 392195 -107541 -253519
19497 -253519 31172 -127505 45109 390551 165638 -59392 -228961 -100119 196839 35009
19486 66933 151925 58685 -330415 -261117 27642 -225414 -303780 -49231 -103008 -94764 9048 -531469
19473 -357594 -206241 -343489 -312843 85900 -316978 -149530 141148 -50900 -439020 -234722
19463 -234722 -83346 18502 37329 -90528 -9855 -222193 -671127 -12592 -9694 9569 -197798
19451 -349526 -72747 -55527 -103210 49126 -110271 -244563 -65325 105612 33607 -56368 -164981
19440 -164981 -41825 -384336 -29733 -23950 -163471 -245558 -2084 -321424 82079 -170155 -152429
19429 -152429 -164847 383149 -52867 -202531 -97225 -129113 -348219 -285399 -121731 16220 -166791
19417B0130b32035C8841d3954E7358f1038j21579j47996P8060f9107K9896B4091
19405e8743k6227l5767N7910k04544A08918g9586a816j11369J5709A15310a34478
19393a58859A12063H025K24486b05215E3926a35118m081C63358b17735B51072
19382a22447F9713b82375A26925h8608r5985d284k32523C1728a18610e0041b1063
19370e2616q564j05993H3694B0746c01459o282J7102A68837d21423a35754C2388
19358b97277A23601a91744B67428a41085m9584B9913K79382a78223I9312n612
19348I3700a45685j1401A19602d11076a40121m9327e3926j5252g68k34654G7905
19336e7002N963A42974a0582B9072b0415B1174a25204A52395c4210a6000k87642
$$ plain form
19417 20130 -232035 38841 -43954 57358 -61038 -182617 -330613 -252553 -69107 -39211 24091
19405 -58743 -84970 -120737 -62827 -267371 108918 -79586 -1816 -113185 -97476 115310 -134478
19393 -158859 112063 8025 232511 -205215 53926 -135118 -139199 363358 -217735 251072
19382 -122447 69713 -282375 126925 -88608 -184593 -4284 -236807 31728 -118610 -50041 -21063
19370 -52616 -61180 -167173 83694 20746 -301459 -307741 -290639 168837 -421423 -135754 32388
19358 -297277 123601 -191744 267428 -141085 -190669 29913 309295 -178223 99312 93700
19348 93700 -145685 -157086 119602 -411076 -140121 -189448 -53926 -69178 -768 -235422 77905
19336 -57002 -51039 142974 -10582 29072 -20415 21174 -125204 152395 -34210 -16000 -303642
19325c03642M0646l3638B07045d7057n8345a1001k22387J05632G8114b61213J21674
19314a39539B18586c6589k27356A47529b04731E0243e3210B8143b39495d7651
19303a47136j03411I6789b9942A76082b63823A22279L7916N483f5205B1964b91137
19291a51254A65046l8858c36783b7999p272j48250A87002b54453k88250f7646
19280f3517B0112K82874r2091r6865a53386H3763c4694j93910c1118D1228a51295
19268a65248A67721h8975E3794N2482a4372C3971R4886B396L56J44244h3288m52218
19256e35506b46103R4392l74026g6906j59074B81888a66395b7782k23316C01806
19245A6429c69128j4996i7821l6923H0685Q7342m0532C6990J40439a37898H7472
$$ plain form
19325 -303642 -262996 -296634 207045 -47057 -105402 -11001 -233388 -127756 78114 -261213 -139539
19314 -139539 218586 -36589 -263945 147529 -204731 50243 -53210 28143 -239495 -47651
19303 -147136 -250547 96789 -29942 176082 -263823 122279 160195 165678 -65205 21964 -291137
19291 -151254 165046 126188 -336783 -27999 -35271 -183521 187002 -254453 -542703 -67646
19280 -63517 20112 302986 210895 114030 -153386 83763 -34694 -228604 -31118 41228 -151295
19268 -165248 167721 -88975 53794 106276 -14372 33971 128857 2396 2752 146996 -83288 -535506
19256 -535506 -246103 -151711 -525737 -76906 -235980 281888 -166395 -27782 -251098 301806
19245 16429 -369128 -384124 -97821 -134744 80685 168027 127495 36990 177429 -137898 87472
19233A82558a0797H5661A2935a26564o0176k01029A5202a32989l43200P2053a53960
19221C1281K6897b00418A49061a00766c220A46552a17569p2368i866j24581N7287
19210g7160k8099A37321a94775P0305l7070n9541g8836K2357F781a13586I5472
19198b70398j11678J11690G0819a64214A43445n5472f6875j40929B03811E4557
19187h0815J1185H0673a12670j69174F7193e9576r9096B23657q2120k9278b26665
19175h2247j57931F909a31207A99223a81449r5745B93270A7678f0173b1833G9730
19163d03255A8249d3423l02418a69800E2633a61504M2379L2835j26770K4287j8406
19152b07179J153R1293B04538D6367e4178j71258A01689f8900j35682A44397a09845
$$ plain form
19233 182558 -10797 85661 12935 -126564 -186740 -387769 15202 -132989 -476189 -404136 -153960
19221 31281 58178 -200418 149061 -100766 -3220 146552 -117569 -189937 -9866 -134447 -77160
19210 -77160 -105259 137321 -194775 -124470 -161540 -221081 -78836 -56479 6781 -113586 95472
19198 -270398 -382076 -270386 70819 -164214 143445 87973 -66875 -207804 203811 54557
19187 -80815 -69630 80673 -112670 -281844 67193 -59576 -158672 223657 141537 112259 -226665
19175 -82247 -240178 6909 -131207 199223 -181449 -277194 293270 17678 -60173 -21833 79730
19163 -403255 18249 -43423 -345841 -169800 52633 -161504 -119125 -86290 -213060 -188773 -207179
19152 -207179 -206026 -114733 204538 46367 -54178 -225436 101689 -68900 -204582 144397 -109845
19140d28798a36935j6618A61971D5210b18948K7822H1817n289d32413A9869a28295
19128A57468h6566k80619A2940N8204c60946B61651b72370a29008A92455L6668
19118B29123d2422k4292A7365D418c92878F9175K7213J17301F2710c59819A93173
19106c0663p2589P755k15871I1309a41421H2621a29367B03485I147a00545j64721
19095b65266k5735a18371B43236h2079k91779a43198A06473B630f3941H0491C4744
19083A51808K8596c39306B7255c85373a62437F4027b89816N9746D5329a26414
19072i3045B2428J05282c0528k65420A08711a9260n65141B02716b31280B3045
19061A99534E4421b96734A67388f1839l21820B4193L553K58553F7811a991D4186
$$ plain form
19140 -428798 -136935 -153553 161971 45210 -218948 -191126 81817 76528 -432413 19869 -128295
19128 157468 -86566 -367185 12940 71144 -360946 261651 -272370 -129008 192455 229123
19118 229123 -42422 -66714 17365 4418 -392878 69175 96388 213689 62710 -359819 193173
19106 -30663 -103252 -95497 -311368 91309 -141421 82621 -129367 203485 9147 -100545 -265266
19095 -265266 -291001 -118371 243236 -82079 -373858 -143198 106473 2630 -63941 80491 34744
19083 151808 180404 -339306 27255 -385373 -162437 64027 -289816 -230070 45329 -126414
19072 -93045 22428 127710 -30528 -295948 108711 -19260 -584401 202716 -231280 23045
19061 199534 54421 -296734 167388 -61839 -383659 24193 27746 286299 67811 -1991 44186
19049a96886C7622J4430e5753j8411m4904a5794n1544q4836G6330J8174b65627
19037a32016E6428B4315c17333B49131F6302c49527a48799A08236a89448L9235
19027a50213b0927E4420a58052P8619B15582a44266m25430h2120K7169A59372
19016i2025j93584J29575G4191J99696e5424n2258o973d3049G784c8432A53551
19004A67693a41289d3854p4678A03043l1555R078e5724k90993B7318c18199H1401
18992E6843b5023j28981i952L984m27188b889o4430F2582j2521b2126F7959b11846
18979a08084r8242a02834B55525L1703i3906O725A60694E1473N8458a58663j45322
18968c03985e6663j55767I1731a48181M1614K7122K7923A41439g0387m1589r245
$$ plain form
19049 -196886 37622 52052 -55753 -74164 -119068 -15794 -67338 -152174 76330 94504 -265627
19037 -132016 56428 24315 -317333 249131 66302 -349527 -148799 108236 -189448 -150213
19027 -150213 -20927 54420 -158052 -79433 215582 -144266 -569696 -82120 -54951 159372
19016 -92025 -285609 -156034 74191 273887 -55424 -107682 -114655 -43049 7784 -38432 153551
19004 167693 -141289 -43854 -118532 103043 71488 80566 -55724 -346717 27318 -318199 81401
18992 56843 -25023 -154004 -9952 -5968 -433156 -2889 -67319 62582 50061 -22126 67959 -211846
18979 -108084 -206326 -102834 255525 287228 -93906 -87181 160694 51473 109931 -158663 -303985
18968 -303985 -56663 -212430 91731 -148181 -106567 -79445 -51522 141439 -70387 -111976 -121221
18957a21221D3275K84696d5882j55478C97791A84498h2286q1370B35617d5312
18946C45116a57297H7762b67269A96341o4373k6642b3325G1073H809c80652a5873
18934b60047J06027b1617B85478E9299b69730r2002a36652k74551B86059H3153
18923B64112a04871j15679o96P8848l20026H245a76421B61831a21891p2328B07619
18911a5077F4609d8938j89424E9545J9671a6147B58245B7459a2789l09109a33170
18899A4069P8551J33068e0529C9224b70845N6107O0658A69040b9692B36127l9759
18888A96368J05571l1830h542k3721E5332J00021p5609h1137A09612i938A7680
18876c00631M7805L0145p3545c3658a1110o6360F7391j5722f1581a1049B3370
$$ plain form
18957 -121221 43275 327971 -45882 -201360 397791 184498 -82286 -163656 235617 -45312
18946 345116 -157297 87762 -267269 196341 131968 105326 -23325 71073 8809 -380652 -15873
18934 -260047 -154020 -21617 285478 59299 -269730 -361732 -136652 -411203 286059 83153
18923 264112 -104871 -220550 -221246 -142398 -462424 8245 -176421 261831 -121891 -194219 207619
18911 -15077 64609 -48938 -238362 59545 79216 -16147 258245 27459 -12789 -321898 -133170
18899 14069 92620 225688 -50529 39224 -270845 -214738 -154080 169040 -29692 236127 196368
18888 196368 301939 270109 -8542 -32263 55332 155353 79744 -81137 109612 -9938 17680
18876 -300631 -252826 -222681 -296226 -33658 -11110 -77470 67391 51669 -61581 -11049 23370
18864g7395l88267f4835H0894a01058k2853B68900p7856L7087c16467f6952j38628
18853b05580n2442M0813q321G4767J83657a67218i316l76075a71667F2093b03560
18841B40435A00963J28823a80304B18808q2011E2920c35345G3739a59101n3988
18831b13089M9361j1257i394C4643a65760j6737e8869A04436D5694b22522j58194
18820c80716a86466M8162E2291J60283b8648M092j37060k09784H3241a39972o6525
18809b06497q1998I851c2481I4965h0283G3776K7510i637j62964A27212h5524
18797d4678n4563J2877B61888F737c6941H6855a09812j9096b2658l0941o2400
18786a15999A21460k5568d71841B93556a40662c7289j42321P3543j30912j84082
$$ plain form
18864 -77395 -465662 -64835 80894 -101058 -123911 268900 191044 228131 -316467 -66952 -205580
18853 -205580 -258022 -217209 -225530 74767 258424 -167218 -9316 -385391 -171667 62093 -203560
18841 240435 100963 229786 -180304 218808 136797 52920 -335345 73739 -159101 -213089
18831 -213089 -163728 -174985 -9394 34643 -165760 -182497 -58869 104436 45694 -222522 -380716
18820 -380716 -186466 -138304 52291 212574 -28648 -24556 -161616 -371400 83241 -139972 -206497
18809 -206497 -288495 9851 -32481 94965 -80283 73776 101286 -9637 -172601 127212 -85524
18797 -44678 -99241 -86364 261888 6737 -36941 86855 -109812 -128908 -22658 -53599 -115999
18786 -115999 121460 95892 -471841 293556 -140662 -37289 -179610 -106067 -236979 -421061
18776d21061i9485M3402l1390B07533J3727a88630B3183a39D9028g725q6747r7033
18764a91505L1313D7205b46335A67060a42934I138J2478K76995A10650B7576b0687
18752B7842j958J3232a17843E1010d4925j6363k14151B53323F5200c95242J1872
18741c83370J82958J1897L4880I9287m2237A4159g2567o4383L3845b0478j03070
18730a23548j39896j14469J08594A21924R5261G0467k8074q688b98225J15153
18720a83072e8666B55990k1104b34103L8543e0977j80295a0310B447e1659j83433
18709b35092J10889f1826b1605r6638J5413n6857c5941l9502K6993H9894a60290
18697A12417o281g6755k05271o9301A98530r1987M7798a52680K3669A1834c9510
$$ plain form
18776 -421061 -99485 -56083 -87473 207533 221260 -188630 23183 -139 49028 -7725 -94472 -191505
18764 -191505 -160192 47205 -246335 167060 -142934 9138 21616 298611 110650 27576 -20687
18752 27842 25884 39116 -117843 51010 -44925 -61288 -275439 253323 65200 -395242 -383370
18741 -383370 -200412 -188515 -153635 99287 57050 14159 -72567 -136950 -103105 -20478 -123548
18730 -123548 -263444 -377913 -269319 121924 217185 70467 42393 33705 -298225 -183072
18720 -183072 -58666 255990 234886 -234103 -195560 -50977 -231272 -10310 2447 -51659 -235092
18709 -235092 -124203 -61826 -21605 -118243 -102830 -159687 -35941 -75443 -48450 89894 -160290
18697 112417 106136 -76755 -282026 -351327 198530 106543 154341 -152680 -129011 11834 -39510
18685a59788q2058K9362N0478K3477q2012g4855j27067Q7831C3479n480Q2557
18674A10556a26019n4305B8139b67066J12311m0965C7436O8868m9965a46522b0007
18662E5856c0774k59511B06105G8038M1324c20816C0654a73837m4624K6676A40673
18650h0884p8812g2248l39081a65017j52220a49709H2787A812J09552a2775j40569
18639a53344j33c1066r9154j8226C7397d2267p735a1214r7987A50069J53895a50817
18626c48346p3891G9591a58900C7831J50803H6657J44515a62857f7972b2339j53516
18615a75855b2351E1179M6183h859k61086A50760b51954c0726G1299b15510p6014
18604b91524M1226O9909Q3394B11554b38815C39282c2521I486b10674K9955N2400
$$ plain form
18685 -159788 -241846 -212484 -162006 -138529 -220541 -74855 -201922 -114091 33479 27999 110556
18674 110556 -126019 -180324 28139 -267066 -154755 -195720 37436 106304 56339 -146522 -20007
18662 55856 -30774 -290285 206105 78038 119362 -320816 30654 -173837 -218461 -191785 140673
18650 -80884 -159696 -72248 -411329 -165017 -317237 -149709 82787 1812 111364 -12775 -153344
18639 -153344 -153477 -31066 -130220 -148446 37397 -42267 -50002 -11214 -109201 150069 303964 -150817
18626 -348346 -422237 79591 -158900 37831 188634 86657 231172 -162857 -67972 -22339 -175855
18615 -175855 -22351 51179 97362 -8859 -269945 150760 -251954 -30726 71299 -215510 -291524
18604 -291524 -250298 -180389 -96995 211554 -238815 339282 -32521 9486 -210674 -180719 -128319
18593a28319F5115b47560a4956l12403a5692C05227h8988n2738J0022j95868B2449
18581D3090N1120A5669O2481L2258B7237N6397A1016a66248J1852j21351M5102
18570b30645R8845A07515a79563g6237B2620a71640A25396N6736B9769K00811
18560B30580b4482j45372A77531C9762i1532A59696C876d5779l1797A4851a4566
18548A7475K11729B2844L7525J54265a63380m75860b57556I7690J60073C6873
18537A6329p200O3243a47282b0693F1496J63167A08500n2647J0221b13150j295
18526b14445a1118j64271F0194b01353j2738A58779d28592A77219H7089b13649
18515a87907b7152k88877P3818j52148a16532j10381F8312a0671A42434b8227
$$ plain form
18593 -128319 65115 -247560 -14956 -327359 -15692 305227 -88988 -141726 -131704 -327572 22449
18581 43090 94210 15669 78150 110408 27237 83634 11016 -166248 -154396 -275747 -230645
18570 -230645 -131800 107515 -179563 -76237 22620 -171640 125396 182132 29769 230580
18560 230580 -24482 -169854 177531 39762 -91532 159696 3876 -45779 -77576 14851 -14566
18548 17475 229204 22844 60369 214634 -163380 -639240 -257556 97690 257763 36873
18537 16329 9129 72372 -147282 -20693 61496 224663 108500 55853 66074 -213150 -214445
18526 -214445 -11118 -175389 60194 -201353 -214091 158779 -428592 177219 87089 -213649
18515 -187907 -27152 -316029 -242211 -394359 -116532 -226913 68312 -10671 142434 -28227
18504c0884C6615B61N0497b45047K8638E7068a88465A26643C5588o706f2124A27961
18491a41013n6225J7356E00a61517f288k89832A23342a02101D0037a77369A29044
18479b58485O092H1638L0848M3347a55976j73773e8384p8321j77340c3974B39027
18467C2538i4420j40609e67j84599o224B43085b08015A0882J07921n7876c58562
18455a44772a0660G7653g6478J9014C5637c11847C6571b3752l3026k38633a39406
18443A45023K1573g310k89366H0937b01165N252g667m8771A37962a13345A37498
18431a05800c302D0114a82645A69029a90999I8983A7768K3455a02295c6943A36634
18419D4217d2006k21985A86486b62439i3377j26483J03104k70716f6991k75627
$$ plain form
18504 -30884 36615 261 50758 -245047 -216409 57068 -188465 126643 35588 28882 -62124 127961
18491 -141013 -197238 -179882 500 -161517 -6288 -296120 123342 -102101 40037 -177369 129044
18479 -258485 -252393 81638 112486 155833 -155976 -329749 -58384 -136705 -314045 -33974 239027
18467 32538 -94420 -235029 -567 -185166 -191390 243085 -208015 10882 118803 60927 -358562
18455 -144772 -10660 77653 -76478 -57464 35637 -311847 36571 -23752 -56778 -295411 -139406
18443 145023 166596 -7310 -296676 80937 -201165 -195913 -7667 -56438 137962 -113345 137498
18431 -105800 -3302 40114 -182645 169029 -190999 98983 17768 41223 -102295 -36943 136634
18419 44217 -42006 -263991 186486 -262439 -93377 -219860 -116756 -387472 -66991 -342618
18409c42618h4767A85273f6306l2645j16024I8157a46966o3572R6031Q699e2592
18397c7755K541l25425J33996o5006I1718d8566o2519A13247a98233A82765h0033
18385b1433j0910A01124b8453j1717m0307C7624L9912M6323d7177B00251k3356
18374A76895h8940j47255j85906A72205l1213a75804R605A51625c10885j29797
18364d40682a53235g093l500H7015c4677C6213b06827c1120j4804h330l41003
18353c49333B6240d8259g978B89609H4907b24295a0131A25699N1719d0584A98608
18341a45189f8765E1456b62146A14690b20696e9570E980c81688C66992b00337
18330A84013g6678j67004E58191a76875L7204M2389p7540A42396J3061o1202g5269
$$ plain form
18409 -342618 -84767 185273 -66306 -98951 -214975 98157 -146966 -210538 -114507 -105808 -52592
18397 -37755 -35214 -360639 -226643 -291649 91718 -48566 -111085 113247 -198233 182765 -80033
18385 -21433 -32343 101124 -28453 -40170 -80477 37624 77536 123859 -47177 200251 176895
18374 176895 -88940 -236195 -422101 172205 140992 -175804 -166199 151625 -310885 -440682
18364 -440682 -153235 -7093 -10593 87015 -34677 36213 -206827 -31120 -45924 -8330 -349333
18353 -349333 26240 -48259 -7978 289609 84907 -224295 -10131 125699 177418 -40584 198608
18341 -145189 -68765 51456 -262146 114690 -220696 -59570 5980 -381688 366992 -200337
18330 184013 -76678 -243682 558191 -176875 -139671 -97282 -174822 142396 155457 94255 -75269
18318F5712f6425k8030j13092f5673k72299h4353C4008J03896d6905j77239B2497
18306a51720D3814a46567H0403e61233C3392K51153H717R9867L7128b967j08576
18295a11543I4948g5665o2529B32197l3421b1947m537L74j7997l25870O6074F229
18282a55045r4280K7999C57084A45452G0742a23086B46183a40345c0668k06793
18272b37461e1383j33962c7972l3774j43476i5278j8661q0833N0268k37832a20852
18260B414J83326F5672b77361D0945J30270a86896H4239f4936J7581B02607r8121
18249A04486A1831e4300j66708P288E6072a70476d1380ik38860B78968C4903L5227
18237G0130f6039j48579j23162A85226a05926D3995a68630d1378B7172L96448
$$ plain form
18318 65712 -66425 -94455 -207547 -65673 -337972 -84353 34008 137904 -46905 -224144 22497
18306 -151720 43814 -146567 80403 -561233 33392 284545 8717 108584 145712 -2967 -111543
18295 -111543 94948 -75665 -138194 232197 198776 -21947 -26484 -26110 -44107 -369977 -303903 6229
18282 -155045 -249325 -221326 357084 145452 70742 -123086 246183 -140345 -30668 -237461
18272 -237461 -51383 -185345 -37972 -71746 -215222 -95278 -113939 -194772 -144504 -382336 -120852
18260 2414 185740 65672 -277361 40945 171215 -186896 84239 -64936 -47355 202607 104486
18249 104486 11831 -54300 -221008 -213720 56072 -170476 -41380 -9 -238869 278968 34903 70130
18237 70130 -66039 -214618 -337780 185226 -105926 43995 -168630 -41378 27172 423620
18227D23620A70683b65040d7289o5378p2660N802A61476a80468I2825l7914c3487
18215i6109A4822O4942k3415K32360a38383j91952D2353a26066e0680A2452P3123
18204H5575R1659b49904a2161G7823J64949C196M1835F251a37004q2405A69988
18192a32001d1064J9237C12920r6580r8871i2275j07155j58123b5226l10007K7095
18181c08138J20930j75676A59608h1201A35279J78961f867q7393B96536c92209
18170b02337B8963d0154k5370A37548n7717J24042c00586a8931q5382q8423A08448
18158b31152Q9294B4442K09433B344b47027B01059g8469l04187J76473B1163i1720
18146H0272K8634b4608k09908c5306l41230a14458a6689I2490C4509J24729n5160
$$ plain form
18227 423620 170683 -265040 -47289 -112667 -185327 -179525 161476 -180468 92825 54911 -33487
18215 -96109 14822 79764 56349 288709 -138383 -330335 42353 -126066 -50680 12452 85575
18204 85575 177234 -249904 -12161 77823 242772 3196 45031 6251 -137004 -219409 169988
18192 -132001 -41064 -21827 312920 216340 117469 -92275 -199430 -357553 -25226 -335233 -308138
18181 -308138 -187208 -362884 159608 -81201 135279 314240 -6867 -94260 296536 -392209
18170 -202337 28963 -40154 -65524 137548 79831 203873 -300586 -18931 -104313 -192736 108448
18158 -231152 -141858 24442 233875 2344 -247027 201059 -78469 -382656 -206183 21163 -91720
18146 80272 108906 -24608 -234516 -35306 -376536 -114458 -16689 92490 34509 159238 104078
18135A04078i7212k34230J41290B63125a10481M5259B82414f1174A62922h7518
18124b84831b0765q0290c1545B18931E6998j9955g238C73375H9950N6872L0650
18113A77472o8101b6038o0780A09736b16773M7089A2291J25291N4176G0082a003
18101A43257k9960d2576J7972j15924B27757f1102A954b42197C4100J13051B9931
18089H1515Q6136c0219j10619d4490k11594B57447c80250g4137j40562A55811
18078A02820j2700f3746j56721K8222a421B81418g9297l6553m4150B02950a33633
18066A20279h737D26279C107P2162b93092C5176K09308h2164K5332A3462c7934
18054i5636J9724K5268R744F7811f0685B8495i433C2892L7921A7486b72134C0035
$$ plain form
18135 104078 -97212 -331442 -190152 263125 -110481 -65222 282414 -61174 162922 -87518
18124 -284831 -20765 -101055 -31545 218931 56998 37043 -7238 373375 89950 146822 177472
18113 177472 109371 -26038 -86818 109736 -216773 -169684 12291 137582 191758 70082 -1003
18101 143257 113297 -42576 -24604 -140528 227757 -61102 1954 -242197 34100 147151 29931
18089 81515 167651 -30219 -140838 -44490 -256084 257447 -380250 -74137 -214699 155811
18078 102820 90120 -63746 -220467 -192245 -1421 281418 -79297 -115850 -160000 202950 -133633
18066 120279 -8737 426279 3107 75269 -293092 35176 244484 -82164 -56832 13462 -37934
18054 -95636 -75912 -50644 -40900 67811 -60685 28495 -9433 32892 70813 17486 -272134 30035
18041a23291j38886a13753A24155i5105j33600C0266L7320J30905a67221P3645
18031i3576k4346C00417q4618a72375L2569H3987a3363A70803a13524H0932c5952
18019e3335J6794E6733j6376e3464c815m49527a60900p4031L8188C09645b07746
18007a71115E756J36318a12096l0346b7672k02316e0653j02039j32822D17167
17996C7989c13659F2790b21647h7855q2266j10126a21849p555o6638A6865Q2329
17985I9194c7693l08019E6240M0025E937L6594i7455H1856P7003p3967d1557k91884
17973c33441J16752R9903l884A086L41920c6138A01907a19183b0361j33234A13632
17961a09019I7775j7540K39192F8178i0857F1598d4163k94684A27881j9751a7323
$$ plain form
18041 -123291 -262177 -113753 124155 -95105 -228705 30266 67586 198491 -167221 -93576
18031 -93576 -117922 300417 215799 -172375 -139806 83987 -13363 170803 -113524 80932 -35952
18019 -53335 -36541 56733 40357 -53464 -3815 -453342 -160900 -234931 -196743 309645 -207746
18007 -171115 5756 142074 -112096 -142442 -27672 -229988 -50653 -152692 -285514 417167
17996 37989 -313659 62790 -221647 -87855 -170121 -280247 -121849 -129404 -196042 16865 99194
17985 99194 -37693 -345712 56240 96265 5937 42531 -97455 81856 158859 84892 -41557 -333441
17973 -333441 -216689 -116786 -120670 1086 343006 -36138 101907 -119183 -20361 -153595 113632
17961 -109019 97775 80235 319427 68178 -90857 61598 -44163 -338847 127881 108130 -17323
17949b36140j25720f1772J7040l4124A61248l7821g4961G3731J25172b45928A09438
17937a64922A50275h4996D2090J4601b41090D5115a47111a2555j79014F8359a31597
17925A4957J07635P992P6265c48274E2781J51046a05456B47017b4408c005D88620
17913a84864A38609F8906J80055g2093B1724K87518A13000f8865A05774c9998
17902a3462D63874B3419L14766j43496B3617a07000E127K75033i1203B527J08400
17891A10927J7445b53559A82861m0679i0053B29639a78375e1389k86596C09351
17880b6417l17971d7391F0653b03464B5520c1584B8278a74436d2426E9541O888
17869F6429A0199L7102b23378c9088B9773M710J39217L9197M27389A35335b45791
$$ plain form
17949 -236140 -361860 -61772 -44732 -78856 161248 123427 -74961 73731 198903 -245928 109438
17937 -164922 150275 -84996 42090 56691 -241090 45115 -147111 -12555 -191569 68359 -131597
17925 14957 122592 130584 206849 -348274 52781 203827 -105456 247017 -24408 -3005 488620
17913 -184864 138609 68906 248961 -72093 21724 309242 113000 -68865 105774 -39998
17902 -13462 463874 23419 338185 194689 23617 -107000 5127 280160 -91203 2527 110927
17891 110927 128372 -253559 182861 142182 -90053 229639 -178375 -51389 -337985 309351
17880 -26417 -344388 -47391 60653 -203464 25520 -31584 28278 -174436 -42426 59541 66429
17869 66429 10199 47301 -223378 -39088 29773 34483 173700 212897 640286 135335 -245791
17857H3018a58845A8107R2191a68514A85912d22665a9875D05937B2173c89785
17846E2806Q0607a47007C23415e9580A61186p7736b09445e9639m193q6805C8124
17834A44148j2895L6139J24746I2219e792m7075b0471L442A57104a39239I7769
17822G4161A7957a9166j55416e9205A18890h4277A43108R7408q5513a48627a3334
17810B97015A14407K2506P648i078j79335B38161e9926F2834a43374I3854J93733
17799B87587p125b79538g1286l4780c0552G76i0310d0421E5779C095K0544J5487
17787C9126M02863a21008B13776b66300B09209c45671A08382a99033C25465A33675
17776H829N25100A9096d7510B10734C7599b41818J03197A12735d1887k44019A10959
$$ plain form
17857 83018 -158845 18107 110298 -168514 185912 -422665 -19875 405937 22173 -389785
17846 52806 133413 -147007 323415 -59580 161186 83450 -209445 -59639 -63832 -150637 38124
17834 144148 131253 167392 292138 92219 -5792 -52867 -20471 -17029 157104 -139239 97769
17822 74161 17957 -19166 -174582 -59205 118890 -84277 143108 240516 155003 -148627 -13334
17810 297015 114407 136913 144561 -9078 -188413 238161 -59926 62834 -143374 93854 287587
17799 287587 280462 -279538 -71286 -106066 -30552 776 -90310 -40421 55779 3095 23639 39126
17787 39126 441989 -121008 213776 -266300 209209 -345671 108382 -199033 325465 133675
17776 8829 533929 19096 -47510 210734 37599 -241818 -138621 112735 -41887 -285906 110959
17764a14731A1179R7875R5158N3020b02627F8719B2581L71297A73506O7943d7411
17752A97811F0268A5552h3836B76106a47214K4733F4691e5471F5245J17055o4612
17741A17688a92048e4810E6621M7137K16011C5360p237K21404a50021l4828A12480
17729H3052K2078a9364A40954a32752C5951J34828J14552a72297B49087G5594
17718A48035c27852C9286h7442A65823e9782p8187f3326a4594A92422O726d0150
17706F1103J6899l8188a11367L3689B2606M4240a78498H7610J25203E5094J1205
17695F6299A4976h930A85166Q5455o6782B2177a36877B62365H7991J69955E4119
17683I193a78086g1600B17033b5282A62624d50995A0117Q8054N4841p1526j2455
$$ plain form
17764 -114731 11179 109054 204212 257232 -202627 68719 22581 393878 173506 241449 -47411
17752 197811 60268 15552 -83836 276106 -147214 -122481 64691 -55471 65245 182300 117688
17741 117688 -192048 -54810 56621 103758 319769 35360 28123 249527 -150021 -184849 112480
17729 83052 105130 -19364 140954 -132752 35951 170779 285331 -172297 249087 75594
17718 148035 -327852 39286 -87442 165823 -59782 -137969 -63326 -14594 192422 199148 -40150
17706 61103 78002 39814 -111367 -77678 22606 66846 -178498 87610 212813 55094 66299
17695 66299 14976 -8930 185166 270621 203839 22177 -136877 262365 87991 257946 54119
17683 9193 -178086 -71600 217033 -25282 162624 -450995 10117 98171 153012 81486 69031
17672F9031j3672i5262d6137j195E1563K4814c08487B00745Q9513l0484Q2416
17661C42190a17948A25222A6858f0069l15752F6281i4399j8991L707o1506P8401
17650i2788B36188A14651A9087f3378n7179C75941A1944J99691b55669J24722
17640a30947A39575a87284H9222l6288b296B04102j7156d8792A24022K85132l3580
17629C75574G4617a78798F7304J90347G9694a76419A14176O0679o9438b47543
17618A54444g8392B5985L55791d3363I3745M564C0266L48705i9830G2903P5382
17607A48285b19570P831a0549G8757C5972L71783j44892A17242K9082l4136P9206
17596A91394i4581A11935R3379b15099d520A42194d4889J8333D0720L9746K42109
$$ plain form
17672 69031 55359 -95262 -46137 -47332 51563 76377 -308487 200745 290258 259774 342190
17661 342190 -117948 125222 16858 -60069 -375821 66281 -94399 -113390 -109683 -171189 -92788
17650 -92788 236188 114651 19087 -63378 -120557 375941 11944 211635 -255669 -130947
17640 -130947 139575 -187284 89222 52934 -2296 204102 186946 -48792 124022 409154 375574
17629 375574 74617 -178798 67304 257651 79694 -176419 114176 174855 105417 -247543
17618 154444 -78392 25985 381776 -43363 93745 98309 30266 378971 -99830 72903 148285
17607 148285 -219570 -211739 -10549 78757 35972 407755 262863 117242 146324 112188 191394
17596 191394 -94581 111935 205314 -215099 -4520 142194 -44889 -26556 40720 80466 322575
17585C22575G162J41798Q3001l1584j1774d4972A15470f630A35312J95712I0971
17573C5106e1927G9765K7702l907C6996g1043A82995a30077A46329R7129j2152
17562B31306F666b66799C03924q8072R4289M6092L0946L5468M7972c22117A71865
17550B16823R3956q5925a57521L5982b0736B11268A02739K30476b3981B13335
17539c7520k8555A45555J75760j49881l9359o365M2877b17251A67206O5813K05601
17528D38620C5529L60497D7646J50301L00912B37057D361d5039A68648k1184P5632
17517B23096C2647K48277L1807K59013A22675M36124B29682K36128R3647J64437
17507G23894K13612R455j2338k62471k19453l5534n7167j71178L42227A99865
$$ plain form
17585 322575 7162 148960 231961 200377 188603 -44972 115470 -6630 135312 331024 90971
17573 35106 -51927 79765 107467 103560 36996 -71043 182995 -130077 146329 243458 231306
17562 231306 6666 -266799 303924 215852 310141 356233 387179 422647 470619 -322117 171865
17550 216823 310779 224854 -157521 -121539 -20736 211268 102739 333215 -23981 213335
17539 -37520 -66075 145555 321315 171434 132075 125710 168587 -217251 167206 233019 438620
17528 438620 35529 396026 47646 197947 498859 237057 4361 -45039 168648 147464 223096
17517 223096 32647 280924 312731 571744 122675 558799 229682 465810 559457 723894
17507 723894 937506 946961 934623 672152 452699 417165 359998 188820 531047 199865
17496D71429k29128L20217K74480L5117j11595O6426C61083l7429L15707j30652
17486E08709j49825A36453K56149n2894r1792J67891L02047B22703G4227K99500
17476C73727j83606J77818d2448A17137K6155L46941l5129J69041H3090L10789
17466C93879R8523A54071l3725J39870k9054d0823m3436D03235J44594G8040P7871
17455A55911K42764N5355A92166N4272i8148A91480l8034k9389J4504e8293D18018
17443D37582l4062b82341A47180a0988D11259K30530j14767m5163j74681D7973
17432A39008L50234K09734C49284m6906R3907j29970q8571K97259j55828P765
17422C26940J29410J28662j1732j47656d6639C91706j00105L69964k74881j54267
$$ plain form
17496 471429 242301 562518 836998 872115 760520 826946 361083 323654 639361 508709
17486 508709 358884 136453 392602 339708 247916 415807 717854 222703 74227 373727
17476 373727 190121 367939 -42448 117137 143292 490233 455104 624145 83090 393879
17466 393879 492402 154071 120346 260216 231162 -40823 -84259 403235 547829 78040 155911
17455 155911 398675 454030 192166 246438 -98148 191480 153446 124057 138561 -58293 418018
17443 437582 403520 -282341 147180 -10988 411259 641789 527022 481859 307178 47973
17432 139008 489242 698976 349284 302378 396285 266315 177744 475003 319175 326940
17422 326940 456350 585012 573280 425624 -46639 391706 291601 661565 386684 232417
17412B32417o4990L05577k00817j396k3237K65228k11268J43413j94929J6684
17402B66682J01955A75339M7611L94003B52683J6754q7715O1531j12607D5803
17391b1882D38907D1222f3101A64511k9355d3404C8L04590j51698M9320e5803
17379B20929o8851f1957C85665F3514O34308B40851p1993R098J07052j30174p5642
17368G9192C9278K22929J75688B18911p8631k6052K33550n8035o6657L02426F3036
17356B45080c63209A44078F3914J10487C6725K05232O1158K34721B54976m3357
17346B11619J74780j25614b74D33412j61418J40300R7401j42340O2298d7345E21101
17334B48264A06233O907N5780A6414J76348j9270A1632J21358J32531A23980K83723
$$ plain form
17412 232417 167427 473004 272187 270791 247554 512782 301514 444927 249998 266682
17402 266682 368637 175339 222950 616953 252683 269437 181722 243253 130646 45803
17391 -21882 438907 41222 -63101 164511 135156 -43404 38 304628 152930 202250 -55803
17379 220929 152078 -61957 385665 63514 697822 240851 168858 177956 285008 154834 79192
17368 79192 39278 262207 437895 218911 140280 114228 347778 289743 223086 525512 63036
17356 245080 -363209 144078 63914 174401 36725 241957 303115 537836 254976 211619
17346 211619 386399 260785 -274 433412 271994 412294 509695 367355 429653 -47345 521101
17334 248264 106233 113140 168920 16414 192762 173492 11632 132990 265521 123980 407703
17323D07703A40461J47951K3147G7742N6045K66879A17062l3819R6604p4762J67068
17312B72153j0592J35247j84712J584N821A02392K087L47598a0207B38208a0860
17300D25273c3595B8126J30068j1332C2263L17322A73990Q2963J14266A81638
17289A9308L36545D9418K13010E2913L00609a02749C83407j35514N7294k7892
17279B77295q4170K20616H3147B5078R9031J59655o9415A03873J60626j7771P173
17268B53901k2024n087O0225E1634J62802J07213A39277j6013K6195C9339K57343
17257B96682B4791L97845c3729A05058R2107q4702O0530o8207L80318j18904F8747
17245C89250J39929j2480B7053L12200p1625C2386J41153J72835r451P4183k01063
$$ plain form
17323 407703 140461 288412 311559 77742 133787 400666 117062 83243 179847 105085 272153
17312 272153 261561 396808 212096 213680 219501 102392 104479 452077 -10207 238208 -10860
17300 425273 -33595 28126 158194 146862 32263 349585 173990 256953 371219 181638
17289 19308 355853 49418 262428 52913 353522 -102749 383407 247893 305187 277295
17279 277295 193125 413741 83147 25078 124109 283764 214349 103873 264499 246728 253901
17268 253901 231877 226790 287015 51634 214436 321649 139277 123264 149459 39339 296682
17257 296682 24791 422636 -33729 105058 197165 112463 172993 104786 485104 366200 68747
17245 389250 529179 516699 27053 339253 267628 32386 173539 346374 336923 411106 210043
17234B10043M0284H4355N035J25495P8258F6162L68366B12204r7415K74992L2
17223C89813a62676E66920A48598A8971L18023r8604L82154J8803j21548k40224
17213B77575l1710a3799F39017q6525G6009M35135j34468k6934L3164m8973k7403
17202C06530J55195A34822D6964N75373A83805K66430B1045K78205A22636J84175
17192C06811A10841C9962L51476j49541N9065J31657r1091r311j13404J88434
17182D07247m5758L0998E9215K23300J68698j85553I583M02655A32668L24101
17172D56769J0278H3247J42953K09720o9143J23179q6343K7328j34168l8973K41954
17161D99754j82101k9005K14055j92940I5416L78089j78271k9600J54413K84250
$$ plain form
17234 210043 250327 84355 89390 214885 293143 66162 434528 212204 114789 389781 389813
17223 389813 -162676 566920 148598 18971 336994 238390 620544 639347 517799 277575
17213 277575 245865 -13799 639017 552492 76009 511144 376676 349742 382906 333933 306530
17202 306530 461725 134822 46964 622337 183805 450235 21045 299250 122636 306811
17192 306811 110841 39962 391438 241897 300962 432619 341528 332217 218813 407247
17182 407247 361489 392487 59215 282515 451213 265660 9583 412238 132668 456769
17172 456769 467047 83247 226200 435920 366777 489956 403613 430941 296773 257800 499754
17161 499754 317653 288648 502703 309763 95416 473505 295234 265634 420047 704297
17151G04297B79947a5477G84688A52524L11006J31574k25327j74311L50461j24175
17141D21752j08314K14761j63049J05772j41789A02190K81609J1401Q3188J05535
17131E83923A96732G0576L04016J21667B14644K51332r0668D803M89677j7344
17121D77136Q6400k25392L30699q1826M2909J1758j92896m4314A39384L82417
17111E21801K85432C11677N3474L308J51143l716O2120k01935N1272N3978N8374
17100E39695J72982C08767J93699J20425J06349C27190J53101B08005N46433O6243
17090H20681q9433A13785N73994j7875k59092K00198K7259l1793o9248J83625
17080G20853m8389k34744L70152k33602l7890p0631j4707J35430J30033l00396
$$ plain form
17151 704297 279947 -15477 784688 152524 463530 595104 369777 195466 545927 421752
17141 421752 313438 528199 365150 470922 329133 102190 383799 395200 478388 583923
17131 583923 196732 70576 374592 496259 214644 465976 375308 4803 494480 477136
17121 477136 563536 338144 668843 587017 629926 641684 448788 404474 139384 521801
17111 521801 807233 311677 365151 368459 519602 515886 578006 376071 427343 481321 539695
17100 539695 712677 308767 502466 622891 729240 327190 480291 208005 754438 820681
17090 820681 731248 113785 687779 669904 410812 611010 638269 606476 537228 720853
17080 720853 672464 437720 807872 574270 536380 465749 451042 586472 716505 416109
17070D16109J30063L92160l95722Q2900r2066J22030M7864l7858o1467m3614K10568
17059G70967A31800N20248C06838J29789O2993j83804J72106J92181J28781R8311
17049I07195C85185j8111N54467m45914L08065l37765M27980j76106J01029j49639
17039F49191J14523C47490L71637R3710k31851N5981K5183q5892K96637k40594
17029F32301L33238m25622J40357K19611k35705L2910q7892N2577j4009O5810
17019G13576o1086L8193p2277K07136p0107o0419M3344J8006J20931j37146J12188
17008H52339n3091K57388j50853k29169J19976J22207j9297n0239N1854j99874
16998G01241K57097O1197k14247K04528l44311L24981j67007J10628k8991J48085
$$ plain form
17070 416109 546172 938332 542610 625510 533444 655474 703338 665480 604013 560399 770967
17059 770967 131800 652048 306838 436627 499620 315816 487922 680103 808884 907195
17049 907195 385185 367074 921541 475627 783692 445927 873907 697801 798830 649191
17039 649191 763714 347490 719127 812837 580986 636967 662150 576258 872895 632301
17029 632301 965539 539917 680274 899885 664180 697090 609198 661775 647766 713576
17019 713576 652490 690683 618406 825542 755435 695016 738360 756366 877297 740151 852339
17008 852339 799248 1056636 905783 676614 796590 918797 899500 849261 901115 701241
16998 701241 958338 1019535 805288 1009816 665505 990486 823479 934107 905116 1053201
16988A053201Q7596E40502L19359K73320k38339K9931M2705k0429J46495l07152
16978G86392j09168l349K07190J40808R9872K9297l1920K96309k25577j23706
16968A066148l277j57224M51219k55222q9263J37081R6937o6792M3084j23685
16958A099006J23028m5944K41229j97296N4522L56343m38555j70651R7242K0206
16948A139130J64974k13420K79587J59370m49154M4716K79667j43348O7105N0515
16938A379142l66601L15047K79445j93399k0608K46217m42403K12283j39861J99589
16928A468851J59425o93590N36261J54318r1003j24210j5574J17681J46997K33936
16918A893092m53676J27211K18045K12388l13820J4192j69586J44325J57030k86498
$$ plain form
16988 1053201 1140797 540502 859861 1133181 894842 924773 967478 947049 1093544 786392
16978 786392 677224 673875 881065 1021873 1121745 1151042 1119122 1415431 1189854 1066148
16968 1066148 1062871 905647 1356866 1101644 1012381 1149462 1246399 1179607 1222691 1099006
16958 1099006 1222034 1176090 1417319 1220023 1274545 1630888 1192333 1021682 1118924 1139130
16948 1139130 1304104 1090684 1370271 1529641 1080487 1125203 1404870 1261522 1328627 1379142
16938 1379142 1012541 1327588 1607033 1413634 1393026 1639243 1196840 1409123 1269262 1468851
16928 1468851 1628276 934686 1470947 1625265 1534262 1410052 1394478 1512159 1659156 1893092
16918 1893092 1439416 1566627 1784672 1997060 1683240 1697432 1527846 1672171 1829201 1542703
16908A542703L4002M23136N9760k85745K56098J29752n15268J84139q7861J47303
16898A888019K00686J294J7860p9002J26396L86265k97661n04122O15152j36520
16888B218367K1521K9179k82668J16211K73185k57008K51945r7733K48980l13279
16878B208700K48417R5939o2228j27755L62108N0299l45344M28998o08232N44012
16868B794914k48019q9918K89113K31543m96322N12588j42490J42954j08859K00601
16858C086105j56766r8708L62268l00581K79042L00070k34465k2882L17178k40489
16848C290772L35083r5279k2753K77005k395K3808K16201j85557k9777L2430j3437
16837C826101J31154J17556j40944J12410N21654J20907r4016j93857M28094j43769
$$ plain form
16908 1542703 1576705 1999841 2059601 1773856 2029954 2159706 1644438 1828577 1740716 1888019
16898 1888019 2088705 2089999 2107859 2028857 2155253 2541518 2243857 1739735 2354887 2218367
16888 2218367 2239888 2269067 1986399 2102610 2375795 2118787 2370732 2272999 2521979 2208700
16878 2208700 2457117 2553056 2490828 2363073 2725181 2775480 2430136 2859134 2250902 2794914
16868 2794914 2546895 2456977 2746090 2977633 2481311 2993899 2851409 2994363 2885504 3086105
16858 3086105 2929339 2830631 3192899 2892318 3171360 3471430 3236965 3214083 3531261 3290772
16848 3290772 3625855 3530576 3507823 3784828 3782433 3806241 4022442 3836885 3807108 3839538 3826101
16837 3826101 3957255 4074811 3933867 4046277 4567931 4688838 4594822 4400965 4829059 4685290
16827D685290J30056J15134L92980l99805K41295j55931K72491l3076P9309K32775
16817E560518j3450k4499L10480P0652J50822q4903M08503j87213R8571K42783
16807F532264L27584j74615J91680J50333K44831K00912j0444K40251K92783p1079
16797G924500P31827l56395J37019L50940K76483o2344L28691j3280M49629K00097
16787I967167M75928K78066M6561J33301L43327J55467K61921K88572M13097Q7939
16777A2451346N67237O7768N03143L49441L88651P25815K56131J28074P02213
16768A6139819K54573N26406N50551J71465P83258M04164Q32260M96574P74192
16759B0933262K86972Q21369Q64691R65744P65957M80224Q08122J186750Q88051
$$ plain form
16827 4685290 4815346 4930480 5323460 4923655 5164950 5009019 5281510 5248434 5327743 5560518
16817 5560518 5547068 5522569 5833049 5903701 6054523 5969620 6378123 6190910 6289481 6532264
16807 6532264 6859848 6685233 6876913 7027246 7272077 7472989 7462545 7702796 7995579 7924500
16797 7924500 8656327 8299932 8436951 8787891 9064374 9002030 9330721 9317441 9767070 9967167
16787 9967167 10443095 10721161 10767722 10901023 11244350 11399817 11661738 11950310 12363407 12451346
16777 12451346 13018583 13086351 13589494 13938935 14327586 15053401 15309532 15437606 16139819
16768 16139819 16394392 16920798 17471349 17642814 18426072 18830236 19662496 20159070 20933262
16759 20933262 21220234 22041603 22906294 23872038 24637995 25118219 25926341 27113091 28001142
16750B8001142J346651M24490J370212J086382J291615J252120J595959J849336
16742C8217907J057256J550072J903941J528209K082492J706528K255962K275347
16734E2577714K421818K283631K764854K402244L264783K642762L435795L364857
16726G5158458L398125L222590M091412L719224M010381M707731L913592M245809
16718A06467322M556066M595184L876843M663425M280078M055319L633877L927164
16710A40055278K986791K973880K527022J677960J230290N52331N31429m46205
16702A52088776r83850j210575k443202k491836l116966l312388l826421m028533
16694A30675005m415819m384192l865731m930674m209222m619954m193036m165599
$$ plain form
16750 28001142 29347793 29772283 31142495 32228877 33520492 34772612 36368571 38217907
16742 38217907 39275163 40825235 42729176 44257385 46339877 48046405 50302367 52577714
16734 52577714 54999532 57283163 60048017 62450261 65715044 68357806 71793601 75158458
16726 75158458 78556583 81779173 85870585 89589809 93600190 98307921 102221513 106467322
16718 106467322 111023388 115618572 119495415 124158840 128438918 132494237 136128114 140055278
16710 140055278 143042069 146015949 148542971 150220931 151451221 152003552 152534981 152088776
16702 152088776 151104926 149894351 147451149 144959313 141842347 138529959 134703538 130675005
16694 130675005 126259186 121874994 118009263 113078589 108869367 104249413 100056377 95890778
16686I5890778m454026l866358m054494l366454l875198l227480l118416l370189
16678F6558163l168223k860078k581806k428066k561737k483138k025112k167839
16670D6282164j726981k152378j435795j970955j408540j571676j023096j593214
16662C3399529j308321j092627j350443j181414q98157r27730r09420j043346
16654B4688071q47994p69979o11488q32807n66292p21382o33479p12470r21144
16645A8071036k55439m23504l19336q92438n53967k39811k77829o08841n09440
16636A3990431n42736j33933n42660j53742j95596l94284j36954m69139m72138
16627A0949249r1987n24274r0971k84778k2407k26260n32042K51698n44928M404
$$ plain form
16686 95890778 91436752 87570394 83515900 80149446 76274248 73046768 69928352 66558163
16678 66558163 63389940 60529862 57948056 55519990 52958253 50475115 48450003 46282164
16670 46282164 44555183 42402805 40967010 38996055 37587515 36015839 34992743 33399529
16662 33399529 32091208 30998581 29648138 28466724 27568567 26640837 25731417 24688071
16654 24688071 23840077 23070098 22458610 21625803 21059511 20338129 19704650 18992180 18071036
16645 18071036 17815597 17392093 17072757 16180319 15626352 15386541 15108712 14499871 13990431
16636 13990431 13447695 13313762 12771102 12617360 12421764 12027480 11890526 11421387 10949249
16627 10949249 10857262 10332988 10242017 9957239 9934832 9708572 9176530 9428228 8883300 8887704
16617H887704l89009j47197k69361m02863O4364r5686J68200m17512n467J30689
16607G523862p40183J35625J48164l09181m87938L96017m03989o7434r3356k80457
16597E821130K9811j14245j86471l1325l13353q0112J60034m09056Q6371n2087
16587D910697n33253K43000R1593n4358J81272j52221k90093m3191j62279J1379
16577D202546j55369j11121L22215m08549j09699j5957q8930J34189k33881L33271
16567C868715k29757j90341j59185K98786m06572K040k31271K91316l87454J87502
16557C043779N3718J36898l674k22343j09472l33697L09530L09468m90918l46029
16547B347260L66859k03251J0455r6101K89683l45257Q4581l55149M41602k74263
$$ plain form
16617 8887704 8498695 8351498 8082137 7679274 7743638 7647952 7816152 7398640 7393173 7523862
16607 7523862 6783679 6919304 7067468 6758287 6270349 6666366 6262377 6194943 6101587 5821130
16597 5821130 5850941 5736696 5550225 5518900 5205547 5125435 5285469 4876413 4962784 4910697
16587 4910697 4377444 4620444 4712037 4657679 4838951 4686730 4396637 4353446 4191167 4202546
16577 4202546 4047177 3936056 4258271 3849722 3740023 3724066 3635136 3769325 3535444 3868715
16567 3868715 3638958 3448617 3289432 3588218 3181646 3183686 2952415 3243731 2856277 3043779
16557 3043779 3097497 3234395 3230721 3008378 2898906 2565209 2874739 3184207 2693289 2347260
16547 2347260 2714119 2510868 2521323 2425222 2714905 2369648 2454229 2099080 2540682 2266419
16537B266419M46485n65494M15103k08772j62257j46241l5431J42909j28423k19889
16527A804409K86815k0248j61504k43800M74574l98533L83083l41986p4133L17550
16517B026227l39645K8865L05115n91334M18110m4605k7180k00129L39237o16890
16507A297771K8870J97342J91976N6563k09016J000j02413J18318Q4036K227j75907
16496A490767L51961n26340K45294L2411P3324j22190m42053J14353K29165n4499
16486A392193k9927J12221J16403m08982M8784K35932k48582P8120J16700m74240
16476I38622M26064n29947M03191j7508k61077L87185L966j04497J04764l49978
16466A000785n640m3810R3770L68769k56568q6689r4221l9279K1081J34566k11338
$$ plain form
16537 2266419 2712904 2147410 2562513 2353741 2191484 2045243 2009812 2152721 2024298 1804409
16527 1804409 2091224 2070976 1909472 1665672 2140246 1741713 2124796 1782810 1708677 2026227
16517 2026227 1686582 1715447 2020562 1429228 1847338 1802733 1775553 1575424 1914661 1297771
16507 1297771 1326641 1523983 1715959 1772522 1563506 1564506 1462093 1580411 1664447 1666674 1490767
16496 1490767 1842728 1316388 1561682 1594093 1667417 1545227 1103174 1217527 1446692 1392193
16486 1392193 1362266 1474487 1590890 1181908 1230692 1466624 1218042 1296162 1412862 938622
16476 938622 1364686 834739 1237930 1220422 959345 1346530 1350496 1245999 1350763 1000785
16466 1000785 995145 951335 1045105 1413874 1157306 1070617 976396 937117 958198 1092764 881426
16455H81426Q0537o2856K11039m13964O8805j06996J59197M84730B03110J081686
16445A284796j21934K6085L9273m54560K96364k31042J53320k29679J44381N1636
16435I58640l12547r5621L93820O8536L14928l85436K25762j21842k91724j33517
16425F20999K4513N08447j81887m7487M623k33931j02326J14503j99272J29217
16415F37399k9481K92454k82773L1621P3749j43784J11846P4209j45802P5093
16405F94531n2791K29709j51555j32578J77041j7959J2865j02677K1072k38805
16395D38853Q7071L61632l6997o3565k56783q1537M49777k94529j44851K33727
16385F92798J30618k94178j5112K11923j36821o483K07841q5889J98167D18375
$$ plain form
16455 881426 961963 899107 1110146 696182 764987 657991 817188 1301918 203110 1284796
16445 1284796 1162862 1188947 1228220 773660 1070024 838982 992302 762623 907004 958640
16435 958640 646093 550472 944292 1012828 1327756 942320 1168082 1046240 754516 620999
16425 620999 645512 1153959 972072 924585 929208 695277 592951 707454 508182 637399
16415 637399 607918 900372 617599 649220 722969 579185 691031 765240 619438 694531
16405 694531 641740 871449 719894 587316 764357 746398 759263 656586 677658 438853
16395 438853 525924 887556 850559 786994 530211 448674 898451 603922 459071 692798
16385 692798 823416 529238 514126 726049 589228 582745 790586 704697 902864 418375
16374G80522k68656J22040j18318j16853P7862M9123K3467J30958j25893n0220
16364E04032K16845p8282B71938o6000N77429B04090M42817n8016n5780J41057
16354F74168l25998J95985M6422J25377l33736o5770J58885j82229j22680J86991
16344C57415n9275J54310L1630k23006L4848K01219J27447j81902J86813B09325
16333E89103o9048J82234B95444J03347R8192J27666j06287B48831K54677j76621
16323C26887J02783A7566O59466l02208J58338B38309O7746R3386p6725J02402
16313D25118o006j72811N1696L93788I5679M76885k43769K1567j52474L43179
16303E41067j67306j37779M07518k46722L00483l398l06147R0007K17695B82035
$$ plain form
16374 780522 511866 633906 515588 398735 476597 525720 549187 680145 554252 504032
16364 504032 720877 642595 271938 205938 783367 204090 646907 588891 533111 674168
16354 674168 348170 544155 590577 715954 382218 316448 475333 293104 170424 357415
16344 357415 298140 452450 484080 261074 295922 497141 624588 442686 629499 209325
16333 589103 520055 702289 295444 398791 496983 624649 518362 248831 503508 326887
16323 326887 429670 17566 677032 374824 533162 238309 306055 399441 322716 425118
16313 425118 419112 246301 297997 691785 95679 572564 328795 350362 197888 541067
16303 541067 373761 235982 643500 396778 697261 693863 387716 477723 695418 282035
16292a66480C68867K30858B29456Q7271p0706j04739J87288j32460L35812A35393
16281G28317B84813K25830j48674O793A52391L21254A21769J84419k2647K02129
16271D85670j36991r4977F1011J72316L10004B65619D462L47468m4263q3593K54711
16260D78785j12901l9168j39355n2748O1093G6067K3326K46465D6656L70724A21926
16248D02310h8656B24762P102K00646j9273B04800r4101K43305r9380J65540A15846
16236B41061M1647A01235Q0495q2591L09286J62000B84287p1270K75H3982N65069
16225F49051j49010B25790I9894R9531K4568n1457N0864J874h8866A93567K02560
16214C96127j40925j20341J93598j56672N2306A08929J16689q314g5333l64985
$$ plain form
16292 -166480 368867 599725 229456 316727 246021 141282 328570 196110 531922 135393
16281 728317 284813 510643 361969 368762 152391 473645 121769 306188 283541 485670
16271 485670 348679 253702 61011 233327 543331 265619 4462 351930 307667 224074 478785
16260 478785 365884 326716 187361 134613 195706 76067 99393 345858 46656 417380 121926
16248 402310 -88656 224762 231864 432510 413237 204800 110699 354004 254624 420164 115846
16236 241061 282708 101235 181730 99139 408425 570425 284287 213017 213292 83982 649051
16225 649051 500041 225790 99894 199425 223993 172536 223400 225274 -88866 193567 396127
16214 396127 255202 134861 328459 171787 224093 108929 225618 217304 -75333 -440318
16204d40318C99143H2234R4712K1824k1258J03655A9792O1488J71783r1404M1885
16193B03544J09151k3975q0377I8420J78025r7865a99994C92877A54020A1894
16182A13399K17881l2901k4456o2472A964R4245J95017q0352E5790K36576o4595
16171B27771n1093M38381B93377I9846J38220f6626F89002e0777D5165Q5705K14258
16160C45128A22751C0550J12731J04568q1079a0932D8586A7628a91606A21457
16149C16929f056r2323b0635k1318B03005p8655E3754c3700A8977K57920d7176
16137B88084o6271a20556A17206J77342j26551A5399M17716j44412d0270B34786
16126c51498J16392J10818B75558J15275E2319B352L11206a78570f9342C76097
$$ plain form
16204 -440318 399143 82234 176946 198770 177512 281167 19792 81280 253063 161659 203544
16193 203544 312695 288720 208343 98420 276445 178580 -199994 392877 154020 11894
16182 113399 331280 298379 273923 211451 1964 96209 291226 210874 55790 292366 227771
16171 227771 176678 615059 293377 99846 238066 -66626 689002 -50777 45165 130870 345128
16160 345128 122751 30550 143281 247849 166770 -10932 48586 17628 -191606 121457
16149 316929 -6056 -98379 -20635 -41953 203005 124350 53754 -33700 18977 276897 -47176
16137 288084 221813 -120556 117206 294548 167997 15399 433115 288703 -40270 234786
16126 -351498 -235106 -124288 275558 390833 52319 2352 313558 -178570 -69342 376097
16115a79104j42109B63946a01342A10020b8333o446C4952b6279j67271G3865d8808
16103f9570A9964J24437a642A61462c5207j95926M3775B54767g3511J6966B3544
16091E2399h5346E7268O8761j6628h9300A02673b56705B71037i6719D4464f5195
16079B20266a34727B35562g9283B88466f8135k38751j9308A72814B7278e5557
16068A94814r4766J48060a41446o9255F3681c2411G8294P9707h3952B8831K21264
16057B50095I8931a80251g9007a8384A92818j6386K8744R4257D6953N6566a52349
16045a17567E2387M2878g5935A69537B2432d1741j73745n2984A26882f7410N095
16034f2315A00335L0146E1460a34647D7576m495a2132E5024b15860A30913J0129
$$ plain form
16115 -179104 -321213 263946 -101342 110020 -28333 -34779 34952 -26279 -193550 73865 -48808
16103 -69570 19964 144401 -1642 161462 -35207 -231133 -187358 254767 -73511 -56545 23544
16091 52399 -85346 57268 126029 109401 -89300 102673 -256705 271037 -96719 44464 -65195
16079 220266 -134727 235562 -79283 288466 -68135 -306886 -326194 172814 27278 -55557
16068 194814 100048 248108 -141446 -210701 63681 -32411 78294 158001 -83952 28831 250095
16057 250095 98931 -180251 -79007 -18384 192818 176432 205176 299433 46953 103519 -152349
16045 -117567 52387 95265 -75935 169537 22432 -41741 -215486 -268470 126882 -67410 -62315
16034 -62315 100335 130481 51460 -134647 47576 43081 -12132 55024 -215860 130913 141042
16023A41042N1975k8464c13898a56823G3543B3270Q4503j9464K1343f9271D4759
16011d99843a98779R0842k3040N6743J6160q0093D0532F465M87551a53419A6287
15999a94506E0345M3603a66263G4655B770a14776A23845a3729D4424h1856A85455
15987a83786D2858a82213H7613a08281B95122d5921k04080A55118J72863g0157
15976B58009J837A15066E6561J76812J70999N1887K33250P9189C44891J28948
15966D73839l3506J06878A25489a09901G2106B4138J4867K19417B5776c9766D6001
15954F0550R3867a07573J5347C5540L0356d43486C43841j69094n2770c49513d3251
15942a8171A46607j049a74275C1445G814J74838m7439b35768A53131R3735b91229
$$ plain form
16023 141042 193017 164553 -313898 -156823 73543 23270 107773 88309 109652 -69271 44759
16011 -499843 -198779 -107937 -130977 -74234 -58074 -138167 40532 6465 494016 -153419 16287
15999 -194506 50345 93948 -166263 74655 2770 -114776 123845 -13729 44424 -81856 185455
15987 -183786 42858 -182213 87613 -108281 295122 -45921 -250001 155118 327981 -70157
15976 258009 259846 115066 56561 233373 404372 456259 689509 768698 344891 473839
15966 473839 440333 547211 125489 -109901 72106 24138 39005 258422 25776 -39766 46001
15954 60550 154417 -107573 -92226 35540 65896 -443486 343841 174747 121977 -349513 -43251
15942 -18171 146607 145558 -174275 31445 7814 182652 135213 -235768 153131 246866 -291229
15930G6746d7978j20028a7725A35916c50887h2046A8835a31213c3853j48479M8705
15919a33627B68601F6130b45897R4783A86605f9675G2704i8573o2322n6645A54856
15907g6235j08815H2219b3595j74800B42935I5343b16035j39910B26690a2244
15896b01298o2814J10231h703k41577J2476h9468j55796m3994h8465D7681a81210
15884F8730g220k05076C64448k6236k1646A18106i5287I3200a04727A65689k1062
15873A44627A3818J67402P6118b27272l4577j7130R6954E6142b68378b2121j87050
15862b09171g079j9183B24979D7403e9549C4366a87602m8697a16052a559G9126
15850f9542m5504D279c58446a25479J8740G7953J5195a090C68967D5597a12289
$$ plain form
15930 76746 -47978 -168006 -17725 135916 -350887 -82046 18835 -131213 -33853 -182332 -133627
15919 -133627 268601 66130 -245897 -151114 186605 -69675 72704 -98573 -160895 -217540 154856
15907 -76235 -185050 82219 -23595 -198395 242935 95343 -216035 -355945 226690 -12244
15896 -201298 -264112 -153881 -8703 -250280 -237804 -89468 -245264 -289258 -88465 47681 -181210
15884 68730 -7220 -212296 364448 338212 316566 118106 -95287 93200 -104727 165689 144627
15873 144627 13818 181220 257338 -227272 -261849 -278979 -182025 56142 -268378 -22121 -209171
15862 -209171 -7079 -26262 224979 47403 -59549 34366 -187602 -236299 -116052 -1559 79126
15850 -69542 -115046 4279 -358446 -125479 -106739 77953 93148 -1090 368967 45597 -112289
15838i1477B31635J40444H2707N0379a00714K3019q0799O6090A7732Q6170b55375
15826b65485P0262m3767q9192A61104J65451O8665g3671D1936J32815E5586c49171
15814d31665f8369l6333j52671J4957C9565J63905a8815p6240O036o9120K7894
15803a30245b422l15148B17453h6274J6142F4639a77980b5117i716m051D4964
15791H4645b13100i8753o3693C58453E7791f3118j17408h2299B18881B9481h108
15779i275j29704k53518a24693A43415B4942O069R3155a64903d3662H2071i3851
15767G6962l186D490a84959G7157a48611A30970c34920A1299L51223a44656a0101
15755A3134i2930A78744e35752e0610n563j23187C1206h0538l20892A29853e4074
$$ plain form
15838 -91477 231635 372079 82707 133086 -100714 -77695 -158494 -92404 17732 103902 -255375
15826 -265485 -195223 -238990 -328182 161104 326555 395220 -73671 41936 174751 55586 -349171
15814 -431665 -68369 -104702 -257373 -242416 39565 203470 -18815 -95055 -89019 -158139 -130245
15803 -130245 -2422 -317570 217453 -86274 -70132 64639 -177980 -25117 -9716 -13767 44964
15791 84645 -213100 -98753 -162446 358453 57791 -63118 -180526 -82299 218881 29481 -8108
15779 -9275 -138979 -392497 -124693 143415 24942 31011 124166 -164903 -43662 82071 -93851
15767 76962 73776 4490 -184959 77157 -148611 130970 -334920 11299 362522 -144656 -10101
15755 13134 -92930 178744 -535752 -50610 -56173 -179360 31206 -80538 -401430 129853 -54074
15743I163a18036C58220j36854N4197a2404j0910A8519b19678f1349k25410C87752
15731A72380J1470e70608K63407a35165l0105a007j45756m1302h2867k36015A16629
15719b26151a08555A01703b7826A00738c10168e919q7102B25759h7132K5734N30
15708f0868k01167A49781n8685c08822g9906k31833A37261b28508d317j49203
15698a53520k21485e7282o6868b9399B18003n0238a54785e0288C6187J27185n3235
15687A10137l6356K0339C659b89728j7572i4430M3179A1047K02568C7474a88163
15675a12388A90321C550a5176A05952J66232D482d8313A40392D2796O6849a6796
15663a42219a0592E0236B4152i7257p2653D32510G4307a86249P3478I349a6351
$$ plain form
15743 9163 -118036 358220 221366 275563 -12404 -23314 18519 -219678 -61349 -286759 387752
15731 172380 183850 -570608 -307201 -135165 -165270 -1007 -146763 -188065 -82867 -318882 116629
15719 -226151 -108555 101703 -27826 100738 -310168 -5919 -93021 225759 -87132 -61398 -60868
15708 -60868 -262035 149781 91096 -308822 -79906 -311739 137261 -228508 -4317 -153520
15698 -153520 -375005 -57282 -124150 -29399 218003 167765 -154785 -50288 36187 163372 110137
15687 110137 73781 94120 3659 -289728 -307300 -94430 -51251 11047 213615 37474 -188163
15675 -112388 190321 3550 -15176 105952 272184 4482 -48313 140392 42796 109645 -16796
15663 -142219 -10592 50236 24152 -97257 -169910 432510 74307 -186249 -112771 9349 -16351
15651A33395N8759i6674M2431A96525b01023o3289A11390N078d01879a85347A33826
15639a2794A5083c23416J34956F2022b83448a29426A63576c03873J05837a5128
15628a98542f358n1624B99014C5696h9043j91982A95171J37710A44178m9778j0912
15617H3488c43420a11466j38715e4580j06602A56397D0483b23103D1411p490h4843
15605A47535J1273B8176b95103A21008B9996g4735A64234b29381h9303d3288J1754
15594c1534j86474a07589B19924b52072L8819B33650r4108c7864j11423E37b33199
15582b85732a39450A01316i2757j93923A42007g8198A93178d9139D7372b06462
15571A02741b70697D9073M1308e5353K0228p9857L8679A47001a35864N9590A24715
$$ plain form
15651 133395 192154 -96674 -54243 196525 -201023 -264312 111390 116468 -401879 -185347 133826
15639 -12794 15083 -323416 -188460 62022 -283448 -129426 163576 -303873 -198036 -15128
15628 -198542 -6358 -57982 299014 35696 -89043 -281025 195171 332881 144178 94400 83488
15617 83488 -343420 -111466 -250181 -54580 -161182 156397 40483 -223103 41411 33921 -84843
15605 147535 158808 28176 -295103 121008 29996 -74735 164234 -229381 -89303 -43288 -31534
15594 -31534 -218008 -107589 219924 -252072 -213253 233650 139542 -37864 -149287 537 -233199
15582 -285732 -139450 101316 -92757 -286680 142007 -78198 193178 -49139 47372 -206462
15571 102741 -270697 49073 90381 -55353 -35125 -114982 -76303 147001 -135864 -76274 124715
15559A39886a10284F2655K41431A44800j2678g1554k02874g5839E2896g1829l0381
15548a02210A02791d5199A09976i8667A22308b94909A18192J40934c7689A551
15537a40801k4483j66843D0955J83685a20302H6082b6350G2838A9693P0881h4077
15525A23018b230G9544R2002E099L54021n8474l9475F3476K72918j57346o1585
15514A17463Q6582C0251a11610a994H5578a25491D10474j45758K14925B19978
15503C90995A50865G0417j8978a7982r5095C28067H0206e7672c193m64111d4342
15491b00633f3240G4230f5035l5288F692K13176b09000I9475d6177j04867C35921
15479a82486r5116g0146D0351e5503J5949B9449a38819H2380M8813b36834D83904
$$ plain form
15559 139886 -110284 62655 304086 144800 132122 -71554 -274428 -75839 52896 -71829 -102210
15548 -102210 102791 -45199 109976 -98667 122308 -294909 118192 259126 -37689 1551
15537 -140801 -165284 -332127 40955 224640 -120302 86082 -26350 72838 19693 90574 -84077
15525 123018 -2230 79544 171546 5099 359120 300646 261171 63476 336394 179048 117463
15514 117463 204045 30251 -111610 -1994 85578 -125491 410474 264716 479641 219978
15503 390995 150865 70417 51439 -17982 -113077 328067 80206 -57672 -3193 -467304 -44342
15491 -200633 -63240 74230 -65035 -100323 6692 219868 -209000 99475 -46177 -151044 335921
15479 -182486 -277602 -70146 40351 -55503 -39554 29449 -138819 82380 131193 -236834 483904
15467G0588i5685C15596D4687b02552C80376A09960J82915n6430L9519J96842
15457D72806J78486C21092g1187C88795A73034D3837B1372K3880J49496G6629
15446b540H4702a90571A49947K3918n8665b7426o5055J9058I7081D1260K72164
15435C13424j9909c1153J2890A43515J12253M6589i295A62179K34487j21591K70090
15424E45165j19137P661K9968p6872I2145D5694d32896B16741k2841c353r5819
15413i9172A02533O3708p3445e6507A26108f1875j97006c3704B42232h0953j54399
15402b35352A19261J9271L9628J62708b56154E5764a02936j94072A19182a02823
15391A42883K3558Q7990a74824h129A4723f2463b522j7120B34890j15598a26458
$$ plain form
15467 70588 -95685 315596 44687 -202552 380376 109960 292875 236445 275964 472806
15457 472806 651292 321092 -71187 388795 173034 43837 21372 45252 194748 76629
15446 -2540 84702 -190571 149947 173865 115200 -27426 -92481 -73423 97081 41260 313424
15435 313424 293515 -31153 -18263 143515 255768 302357 -9295 162179 396666 275075 545165
15424 545165 426028 433689 463657 386785 92145 45694 -432896 216741 193900 -3353 -99172
15413 -99172 102533 166241 92796 -56507 126108 -61875 -258881 -33704 242232 -80953 -235352
15402 -235352 119261 138532 178160 340868 -256154 55764 -102936 -297008 119182 -102823
15391 142883 166441 254431 -174824 -8129 14723 -62463 -2522 -19642 234890 119292 -126458
15379A12283b53928d017k45265F9815Q9821C8880K38726R1614A29719a12781B49521
15367D9436c1775A32470a98045A05854K15740g8104P062B67180A31813J79200
15357C11013A10513J82237D5148K19825E1269b15242A14792a9905A67416R5834
15347B63250j6146a53819I7421k8247O2265O0548K956a3072d077B1311N0070i0043
15334A85508g1239D53969d6070B34800l58A10365a15312A17675K15941r2873j15057
15323A25686R9726K5768r0301Q9577B5550K6504K75904D9288J11422c1258A68857
15311C78386B9282j3637A781K00397P9218n0107q7714B063M7940b20518G6082
15299C13801M833G4691N1356L4329J21529i7867m567B7036K84024M7489c7480
$$ plain form
15379 112283 -253928 -4017 -249282 69815 159636 38880 277606 369220 129719 -112781 249521
15367 49436 -31775 132470 -198045 105854 321594 -78104 -71042 267180 131813 311013
15357 311013 110513 292750 45148 264973 51269 -215242 114792 -19905 167416 263250
15347 263250 247104 -153819 97421 69174 131439 191987 194943 -13072 -4077 21311 71381 -90043
15334 185508 -71239 453969 -46070 234800 234442 110365 -115312 117675 333616 240743 125686
15323 125686 225412 251180 160879 250456 25550 52054 327958 49288 160710 -31258 168857
15311 378386 29282 15645 1781 202178 281396 231289 143575 2063 50003 -220518 76082
15299 313801 318634 74691 126047 160376 281905 -97867 -102434 27036 311060 358549 -37480
15287A08168a6354j43063E6433N6971g1713l304m1033G6031q418b102k4401B47797
15274a5986q0551G1758b7376A63090O8397L6491L8959I9290h3284A47692a12316
15262A8375b49695j62056i964A42060j4309i8821K1604l3975C11221a04533j24654
15251b29187c459r8344A78073q7337b18153h7952l17132B64844b59528B72950
15240F6819M7112b30390b6700j25943A54415n3975A1445J90881J03870r2484L34769
15229E48481O80862O40442m72573k7375m29154C90841P1330F4512K59782E8689
15218C19893D3187j9886h2889B44148E1237a00621c2175A16032P7355D6022f5915
15206e9731E4492g0432n0853B64095a02074a5534D8313K05693b54991f9611C13713
$$ plain form
15287 108168 -16354 -159417 56433 113404 -71713 -75017 -116050 76031 67613 -2102 -26503 247797
15274 -15986 -96537 71758 -27376 163090 231487 267978 306937 99290 -83284 147692 -112316
15262 18375 -249695 -411751 -9964 142060 127751 -98821 -77217 -111192 311221 -104533 -229187
15251 -229187 -3459 -101803 178073 90736 -218153 -87952 -405084 264844 -259528 272950
15240 66819 113931 -230390 -26700 -152643 154415 100440 11445 202326 306196 213712 548481
15229 548481 1229343 1869785 1397212 1369837 940683 390841 462171 64512 324294 58689
15218 319893 43187 23301 -82889 244148 51237 -100621 -32175 116032 193387 46022 -65915
15206 -59731 54492 -70432 -121285 264095 -102074 -15534 48313 254006 -254991 -69611 313713
15194E7123b68949D3264b03568I708b2978G0220K05281I5830l3507J86517f8440
15182a86577I5767a51789A62940G847N4521a16306B84129H1630a28691C8041L69356
15171D07397f0019m928b7772j14325F6316b6807F0943b78037J09551C78116I5096
15159H9345D4065a36857n2307d787A93604K21614a30397N9874B83023a06212C24735
15147d3994A46520o5245J02053b25921F0876P4424D0889J4912J98509E0302K04622
15136B54924E0925K45541D9754f2710I8846J69800C7559J46755J37204j26309
15126A95209M8740l7473a57948A51890O64K81350A28610J9041K23547H6362R6441
15115A82803p8987J43160a64722A40117b80832B7725L97198A91161J27518A02869
$$ plain form
15194 57123 -268949 43264 -203568 9708 -22978 70220 275501 95830 62323 248840 -68440
15182 -186577 95767 -151789 162940 7847 62368 -116306 284129 81630 -128691 38041 407397
15171 407397 -60019 -64947 -27772 -142097 66316 -26807 60943 -278037 -168486 378116 95096
15159 89345 44065 -136857 -189164 -4787 193604 415218 -130397 -70523 283023 -106212 324735
15147 -43994 146520 81275 183328 -225921 60876 135300 40889 55801 254310 50302 254924
15136 254924 50925 296466 49754 -62710 98846 268646 37559 184314 321518 195209
15126 195209 243949 206476 -157948 151890 152554 433904 128610 147651 371198 86362 182803
15115 182803 103816 246976 -164722 140117 -280832 27725 424923 191161 318679 102869
15104A59070n4784J9824K26243A19771J58753J21494A27816F401a21564C80997
15093G4278K49295A60913b868F6753d3916E0621L11119A24323D0980J64840j01093
15082A04727a31249B41261O4602L8369g6528I9533J94045n1178j18066k8254N361
15071A01441L39842j70247h0583H5318C7310g2162K7676C08419Q2846J20351k15603
15060B96013F9227L47701b6791D73449M2062G4558J75704r1317J15225a40550
15049d633I4285K83174A674M95803H7071K1058c3740D24081H2286P3580J33141
15038B89007K8732A50985L18034j87504J87016j55530j03034l0879J8755K67067
15028D64910A55495Q2839M9161J38328A90392K21288k04041K74492J34651k43713
$$ plain form
15104 159070 104286 124110 350353 119771 278524 400018 127816 6401 -121564 380997
15093 74278 323573 160913 -2868 66753 -43916 50621 361740 124323 40980 205820 104727
15082 104727 -131249 241261 305863 344232 -76528 99533 293578 242400 124334 96080 101441
15071 101441 441283 271036 -80583 85318 37310 -72162 -44486 308419 391265 511616 296013
15060 296013 69227 416928 -26791 473449 515511 74558 250262 158945 274170 -140550
15049 -4633 94285 377459 1674 497477 87071 108129 -33740 424081 82286 155866 289007
15038 289007 317739 150985 469019 281515 468531 313001 209967 179088 197843 464910
15028 464910 155495 238334 287495 425823 190392 411680 207639 482131 616782 373069
15018C73069j37745L04764j27575n2431K03505J45544C18482M62912B14787M87570
15008G02357k08889j22767Q5238A91408J20736L48773j71031j43547A46123J16000
14998B62123l4155L22852k60624J50254l4829A92745F8961J05204L12930A73722
14987A28926M42021B21836K8814J67787O314L1693l7511a65649C29520K97043
14977F26563C12442r0583K28680j14161m0582N7577q1738P6030J00786B20685
14966D68558O3476k5660K58259C70215N801J48425M8051j29151A60292R2382K75476
14955E28150N3457J03217A76733Q5651K287n1996M1207K14464j0041j91005J31322
14944C98622J34570k54625M8190j42812K0461R0129o9956J51898A60488N4406
$$ plain form
15018 373069 235324 540088 412513 360082 563587 709131 318482 781394 214787 702357
15008 702357 493468 370701 455939 191408 312144 660917 489886 346339 146123 262123
14998 262123 227968 550820 290196 440450 405621 192745 68961 174165 487095 173722
14987 128926 570947 221836 250650 418437 424751 456444 418933 -165649 329520 626563
14977 626563 312442 221859 450539 336378 295796 353373 271635 347665 448451 220685
14966 468558 532034 506374 764633 370215 376016 524441 572492 443341 160292 252674 528150
14955 528150 581607 684824 176733 262384 264671 212675 253882 468346 458305 267300 398622
14944 398622 533192 278567 326757 183945 204406 294535 224579 376477 160488 214894
14934B14894p9961M67723B41465J72660J72967j98218K75305j95116A79137L63574
14924E42711j6262B19508J56609L56790I057M21534M6635r0687L26700p8934K32689
14913H66994j13586M46034J79046j46385r0674P5664j1806J62515j67461l13657
14903H86684L04125J13735J51428J1065L66585l43727n4297l24465j12575k67192
14893G31366k74709J51289l6184k83796J19409N3982R6919m8492A63750L62841
14883E26591A84748N3699K88625m1681H6001K66004A56347J18738M01998P2762
14873G49845k82841k20457K26306J03451L9987O8221K75485D67411P7653k45567
14863B99497L61160p5792J22559P3238m958J7770q1295j87775M5988M1990B36318
$$ plain form
14934 214894 134933 602656 241465 414125 587092 388874 664179 469063 179137 542711
14924 542711 526449 219508 376117 732907 9057 430591 477226 386539 713239 634305 866994
14913 866994 753408 1199442 1378488 1232103 1141429 1217093 1205287 1367802 1200341 886684
14903 886684 1190809 1304544 1455972 1467037 1833622 1489895 1435598 1111133 998558 731366
14893 731366 456657 607946 571762 287966 407375 461357 558276 509784 163750 526591
14883 526591 184748 238447 527072 485391 86001 352005 156347 275085 677083 749845
14873 749845 467004 246547 472853 576304 616291 684512 959997 467411 545064 299497
14863 299497 660657 584865 707424 780662 775704 793474 712179 524404 570392 612382 236318
14851B75701L49285q0026j14640k3830J8033k475J19686A66167L79258B20904
14840F28892A99318K93399A23864K62299J91063N8943K4607m2467B97421M11121
14830G08542C08361j1358L5553N05920j30220q4725O12026m33434K29977P5813
14820A107913r1637p63j52985J7155m01533K86682l21875L0768j88753P0265M3098
14809C98335M05802B99774K06327j02750J87024L29611l87606J34432P9156N9331
14799H05299j84014K96853l93309K81471j18126l23793M14834r8615L32996k13781
14789G99815l42545L7437O18560R6599m19729J16816k66344R7754J30367L6822
14779I05552L7647D56978J21942k9886K49906k76802K77650k08326n3955J59892
$$ plain form
14851 275701 624986 544960 430320 406490 424523 422048 541734 166167 545425 220904
14840 628892 199318 492717 123864 386163 577226 636169 660776 618309 297421 708542
14830 708542 308361 297003 332556 838476 708256 623531 1235557 802123 1032100 1107913
14820 1107913 1016276 1015513 862528 879683 478150 764832 442957 473725 284972 355237 398335
14809 398335 804137 299774 506101 403351 590375 919986 532380 666812 745968 805299
14799 805299 621285 918138 524829 806300 688174 364381 779215 680600 1013596 799815
14789 799815 457270 494707 1113267 1209866 790137 906953 640609 738363 868730 905552
14779 905552 943199 456978 578920 549034 798940 522138 799788 591462 537507 697399
14769F97399r050J06422k04382O5550j0940L8384R8126C83346K24564L0978K3495
14758F62383K35361r073j81210k33497K55404J08709B99536O10152q2497D00457
14747F65565J8726J70807J57330D30963J35118m2204L81847l19972K50988k74588
14737E62152L8119J39691j34576o6621K44011j51038n5978M49949D94995L71465
14727H66460j70125M4374C62234K18016R9778L74800k85805k04919L88594D67241
14716I36458j42373j33929K73318n4699k26434K67613L99552j16937L37631q3562
14706A456638k93899J06751n7054K9471k08884j64368K09290k52895R5091j43563
14696G76578J11213D11081N92675j0688l18809L38773o021p0716J55810j7032
$$ plain form
14769 697399 688349 794771 590389 655939 644999 683383 781509 383346 607910 638888 662383
14758 662383 897744 888671 707461 473964 729368 838077 299536 909688 827191 400457
14747 665565 684291 855098 1012428 430963 566081 523877 905724 585752 836740 562152
14737 562152 600271 739962 605386 538765 782776 631738 575760 1025709 494995 866460
14727 866460 696335 740709 362234 580250 680028 1054828 769023 564104 952698 467241
14716 936458 794085 660156 933474 878775 652341 919954 1319506 1202569 1540200 1456638
14706 1456638 1162739 1269490 1212436 1241907 1033023 868655 1077945 825050 920141 776578
14696 776578 887791 411081 1003756 993068 674259 1013032 1007011 936295 1092105 1075073
14686A075073R8061J63332L21301j43527n7355P0085j63416J72841p21569J79647
14676I94473j61848p697O4870p3896M54862N071m66329O835K7739r6977N06323
14665A253426k37855N4073Q298M4075k0150J48119m15703j29028O53761l92589
14655I66427j16503M26576l45547J88317k63061J36692l47734Q59664l77735K9512
14645A156608m7450J89921m8029k76113J63390j93048L72045m38618J96308J75884
14635A250898j18296J58680Q3110K00418j03256l81433J9500J76728J55932Q6342
14625A528623j82585l06486L70111l5947l9412j1652r0550O9209j16303L62998
14615A548006l38044j7316j13968J62029j30567o4461O60621l31873R7672j97509
$$ plain form
14686 1075073 1173134 1336466 1657767 1514240 1456885 1526970 1363554 1536395 814826 994473
14676 994473 832625 824928 889798 815902 1270764 1275835 809506 816341 844080 747103 1253426
14665 1253426 1015571 1069644 1077942 1122017 1101867 1249986 834283 705255 1359016 966427
14655 966427 849924 1276500 930953 1119270 856209 992901 645167 1504831 1127096 1156608
14645 1156608 1109158 1299079 1251050 974937 1138327 945279 1317324 878706 1075014 1250898
14635 1250898 1132602 1291282 1374392 1574810 1471554 1090121 1109621 1286349 1442281 1528623
14625 1528623 1346038 1039552 1409663 1373716 1334304 1322652 1232102 1301311 1185008 1548006
14615 1548006 1209962 1192646 1078678 1240707 1110140 1045679 1706300 1374427 1472099 1274590
14605A274590R149l750J03563l9431K42175k83434L4591J34024m4620K0933J58689
14594A606479j19095J21200m04763K77663P3994J94570K88471p57090K82028o1606
14584A501851J75149J17684n9194k09584K79924k61932J2422l4652n6929O734
14574A471473J46152J69858J64217J11263l42286K35219N6941k12909K01929m9281
14564A952576m5806P4453K52123j82580K45117O3396j64394R9179Q2185j44548
14554B231701j60275J60453K91018J01445k14700m0475K66883o0064q2259N14298
14544C008025J55043j70171K41819M54032K13486M2351Q87696N67158J485562
14535F885001J307706L017273L472091O190265R609560J11607j2921791p435042
$$ plain form
14605 1274590 1283739 1279989 1383552 1344121 1586296 1302862 1337453 1471477 1426857 1447790 1606479
14594 1606479 1487384 1608584 1203821 1481484 1555478 1750048 2038519 1281429 1563457 1501851
14584 1501851 1677000 1794684 1735490 1525906 1805830 1543898 1556320 1521668 1464739 1471473
14574 1471473 1617625 1787483 1951700 2062963 1720677 1955896 2012837 1799928 2001857 1952576
14564 1952576 1906770 1981223 2233346 2050766 2295883 2359279 2194885 2294064 2376249 2231701
14554 2231701 2071426 2231879 2522897 2624342 2409642 2369167 2636050 2575986 2493727 3008025
14544 3008025 3163068 2992897 3234716 3688748 3902234 3944585 4832281 5399439 6885001
14535 6885001 8192707 11209980 14682071 20872336 30481896 30593503 17671712 10236670
14527A0236670l768248j752297K0741O53113r41238r88735p74204k70434o308
14518B409060o8185j9916J78397n18468N38361Q2552k90979Q5794O5468l33427
14508B128657J9006L34574J71296j87417r8265K37907N2731k70724M93056l38445
14498B542376j4311M43453n17516K43807K03298J59644O4316k35874o136J63662
14488C046719k10940J64877K8934J85624K01527j13530N4587j50624J80786K30307
14478C618267k85365L8494R7657o4483M94871m02195M03325k93174j98193L83714
14468C792918j09493J47124K3230k00054J36138L7622R6081L5975j1207K58007
14458D206341K95375j94794j06048R4092l765J54750k73009O25238l97642J83713
$$ plain form
14527 10236670 6468422 4716125 4736866 5389979 4448741 3460006 2685802 2415368 2409060
14518 2409060 2340875 2320959 2499356 1980888 2519249 2601801 2310822 2396616 2462084 2128657
14508 2128657 2147663 2482237 2653533 2466116 2367851 2605758 2658489 2387765 2880821 2542376
14498 2542376 2528065 2971518 2454002 2697809 2901107 3060751 3125067 2889193 2883057 3046719
14488 3046719 2835779 3000656 3029590 3215214 3416741 3303211 3357798 3207174 3387960 3618267
14478 3618267 3332902 3371396 3469053 3404570 3899441 3497246 3900571 3607397 3409204 3792918
14468 3792918 3683425 3830549 3853779 3653725 3789863 3827485 3923566 3959541 3948334 4206341
14458 4206341 4501716 4306922 4200874 4294966 4291201 4445951 4172942 4798180 4400538 4584251
14448D584251J27401J54594k14875k38027J25247P82427l59168J61942j29589
14439D994203J33636m3869M77804m83888j18018M88972q9402K17551k57503O85506
14429F004992k30942M51550j94223M4453k14602L91686L27576k37458j56075L76113
14419F563070l5313L41115J33320J67203j25412K15280p7408M83999k92944J27808
14409G500718J86044L25136k73981K09405K08354O1937K66919J5172L95714N9090
14399H954508L56201m08399K33343l51768O25910j92524M59228k06264L58117
14390I828352K99887n3447J48516K98574M40980K03825n215k59619M55908k30977
14380A1126784M98568K74682p7125K72673J90711J64158L20687J33074N17221
$$ plain form
14448 4584251 4711652 4866246 4651371 4413344 4538591 5321018 4961850 5123792 4994203
14439 4994203 5127839 5083970 5561774 5077886 4959868 5448840 5359438 5576989 5319486 6004992
14429 6004992 5774050 6225600 6031377 6075830 5861228 6252914 6580490 6343032 6186957 6563070
14419 6563070 6527757 6868872 7002192 7169395 7043983 7259263 7181855 7665854 7372910 7500718
14409 7500718 7686762 8011898 7737917 7947322 8155676 8217613 8484532 8499704 8895418 8954508
14399 8954508 9310709 8902310 9135653 8783885 9409795 9217271 9676499 9470235 9828352
14390 9828352 10128239 10074792 10223308 10521882 10962862 11166687 11161472 10901853 11357761 11126784
14380 11126784 11625352 11900034 11822909 12095582 12286293 12450451 12771138 12904212 13421433
14371A3421433q2037O49648J76395K20219J99057J25226M00015J90106M52792
14362A5752854N16462J07725J05464N97939J10636L67603R5929K50747J123113
14353A9028472k03691P87790P9221N98441K74202P56293K96703K77566R61763
14344B2856760J7257R24564L02844J63936J071731Q29934K91702N98067O77663
14335B7734458N39085O61891Q24322P94563Q23504R67926N29897J211973O62628
14326C4750247Q91622J264178O55886J374380R38690J553388O23188J538656J607640
14317D5197875J296964J232792J648846J515399J752140J723434J764688J696232
14309E7828370K376116K246103K009272K041970K853231K068450K983435K791502
$$ plain form
14371 13421433 13339396 13989044 14165439 14385658 14584715 14709941 15109956 15300062 15752854
14362 15752854 16269316 16377041 16482505 17080444 17191080 17558683 17654612 17905359 19028472
14353 19028472 18824781 19612571 19691792 20290233 20564435 21320728 21617431 21894997 22856760
14344 22856760 22874017 23798581 24101425 24265361 25337092 26167026 26458728 27056795 27734458
14335 27734458 28273543 28935434 29759756 30554319 31377823 32345749 32875646 34087619 34750247
14326 34750247 35641869 36906047 37561933 38936313 39875003 41428391 42051579 43590235 45197875
14317 45197875 46494839 47727631 49376477 50891876 52644016 54367450 56132138 57828370
14309 57828370 60204486 62450589 64459861 66501831 69355062 71423512 74406947 77198449
14301G7198449K953096L262327L099428L700198L524354L945830M007948M102934
14293A05794564N045249M905915M901962N808109N765433O141918O511369O931704
14285A51806223P412697P848376Q167371Q559240R150721R848303J0452682J0465803
14277B23711416J1137679J2020474J2779709J2968069J3923680J3850004J4542834
14270C14933865J4948656J4788557J4569874J4012887J3147024J2798701J1489882
14263D10689446J1466526R929012R499543P946480N017641K011680J774422K031952
14255D60366702K152909m88561n597138n596861q266649j1078048j2258759j2997831
14247D06235764j3824941j4246362j4371315j3974030j3099935j3160617j3538870
$$ plain form
14301 77198449 80151545 83413872 86513300 90213498 93737852 97683682 101691630 105794564
14293 105794564 110839813 115745728 120647690 126455799 132221232 138363150 144874519 151806223
14285 151806223 159218920 167067296 175234667 183793907 192944628 202792931 213245613 223711416
14277 223711416 234849095 246869569 259649278 272617347 286541027 300391031 314933865
14270 314933865 329882521 344671078 359240952 373253839 386400863 399199564 410689446
14263 410689446 422155972 432084984 441584527 449531007 454548648 456560328 458334750 460366702
14255 460366702 462519611 462031050 456433912 450837051 442570402 431492354 419233595 406235764
14247 406235764 392410823 378164461 363793146 349819116 336719181 323558564 310019694
14240C10019694j2975695j3025631j2644383j2325558j2071755j0937984j0348476
14233B25690212j1231271j0449350j0498257j0119098r092931q538590q236209
14226A57524506p604789o743004o736974n835594n804507n405599n492288m988776
14218A08912975m556147m213247l666690l833481l870592l195862l419305l298691
14210G8858960k509688k821606l056844k287000k433405k306643j902430k342628
14202E9198716j796086j905455j829325j513034j228738k107783r18116j384354
14194D6515825j576963j415058p20623j426982j200981j074074j340986q54839
14186C6905319q29415p72899j031952j295612k72215r65289q06894r63286k80008
$$ plain form
14240 310019694 297043999 284018368 271373985 259048427 246976672 236038688 225690212
14233 225690212 214458941 204009591 193511334 183392236 174299305 165760715 157524506
14226 157524506 149919717 143176713 136439739 130604145 124799638 119394039 113901751 108912975
14218 108912975 104356828 100143581 96476891 92643410 88772818 85576956 82157651 78858960
14210 78858960 76349272 73527666 70470822 68183822 65750417 63443774 61541344 59198716
14202 59198716 57402630 55497175 53667850 52154816 50926078 48818295 47900179 46515825
14194 46515825 44938862 43523804 42803181 41376199 40175218 39101144 37760158 36905319
14186 36905319 36075904 35303005 34271053 32975441 32703226 31737937 30931043 29967757 29687749
14177B9687749r10344q31084o79292p72624n59030j79966r20806n45214m39382
14168B3850007j79653q31371p33050l79826n10798O8662p93941n65222J11485
14159B0036293o08330l79438k89584m23559n57142l07616k88481l11239l95924
14150A6474980k68229k93325j41204o39548J38469m23775k39034m33828k00652
14141A3973854J17524l91741q9509l54304l73338m6644p6533k67802j45231m19900
14131A1926376j2931m97290j92045o6974j81191N5146n29277K38636m92957J80051
14121A0427544l45193J00386n44058K52406l17660j068j23096l9972j04261m85731
14111H819297J1566m40573L77342j76436K66377p81714N804M19008n57857L1442
$$ plain form
14177 29687749 28777405 27946321 27267029 26494405 25935375 25755409 24834603 24289389 23850007
14168 23850007 23670354 22838983 22105933 21726107 21215309 21283971 20490030 19924808 20036293
14159 20036293 19427963 19048525 18758941 18335382 17778240 17470624 17182143 16870904 16474980
14150 16474980 16206751 15913426 15772222 15132674 15271143 14847368 14608334 14174506 13973854
14141 13973854 14091378 13699637 13610128 13255824 12882486 12835842 12759309 12491507 12346276 11926376
14131 11926376 11913445 11416155 11224110 11157136 10975945 11031091 10501814 10740450 10247493 10427544
14121 10427544 10082351 10182737 9638679 9891085 9573425 9572357 9449261 9409289 9305028 8819297
14111 8819297 8830863 8390290 8767632 8591196 8857573 8075859 8081663 8500671 7942814 7974256
14101G974256k09227j51012l17711O5885j32407K1692p2881l24237L35964j90423
14091F999899k96674l63557Q6141K54181k40236j5713J48708k90763J55907n45625
14081E892268O9766J21074l14332K32479n06779J01657k01901J72931L12792l13242
14071E566713Q1357l28809k29831L13736l41931k1646j58740o4294J81910K00796
14061E199261l55487j41682K19655p6241j56674l61430M06282k82947k6083j26498
14051D298156K59361k21697J92263n60780L19916J67600n6622j15449M9777m13044
14041C919481j09546J06422J8712l69996K79958j98984P1024j32641K3634j79625
14031C428439R5922p5553L04831m35304L766J68641q0094O6227l0829k41069p8897
$$ plain form
14101 7974256 7765029 7614017 7296306 7362191 7229784 7251476 7178595 6854358 7190322 6999899
14091 6999899 6703225 6339668 6425809 6679990 6439754 6424041 6572749 6281986 6437893 5892268
14081 5892268 5962034 6083108 5768776 6001255 5494476 5596133 5394232 5567163 5879955 5566713
14071 5566713 5648070 5319261 5089430 5403166 5061235 5039589 4880849 4816555 4998465 5199261
14061 5199261 4843774 4702092 4921747 4845506 4688832 4327402 4733684 4450737 4424654 4298156
14051 4298156 4557517 4335820 4528083 3967303 4287219 4454819 4398197 4282748 4332525 3919481
14041 3919481 3809935 3916357 3935069 3565073 3845031 3646047 3717071 3584430 3608064 3428439
14031 3428439 3524361 3448808 3753639 3318335 3322101 3490742 3410648 3476875 3446046 3204977 3126080
14020C126080K17070N8747k88524K40229m9134K3680p1662k46282K65344k1984
14010C253564m78120J25174j51029K61096L6319p1602n38441P6593J63931j77106
14000B500379J46017J40446m01657M17276j68007P478k10607r3289K78351l86047
13990B230340J05154j40125j1057K41876J88583k61168K07367j25391J94517j86834
13980B443262Q8941J38191M91186J73143O25970J453624J885788L512895N403174
13971A6216174J0091893O143159j0555415q060831m482393k443099j065182p71881
13963E072425n88567n58250k28319k87044l24940N8416l6543p4009m86190K12784
13953B759763k7933j03679L3658q9885l20446L2566K76880j44294j23841n68551
$$ plain form
14020 3126080 3343150 3401897 3113373 3353602 3304468 3328148 3256486 3010204 3275548 3253564
14010 3253564 2775444 2900618 2749589 3010685 3047004 2975402 2436961 2513554 2677485 2500379
14000 2500379 2646396 2786842 2385185 2802461 2634454 2641932 2431325 2338036 2616387 2230340
13990 2230340 2335494 2195369 2184312 2426188 2614771 2353603 2560970 2435579 2630096 2443262
13980 2443262 2532203 2670394 3161580 3334723 3960693 5414317 7300105 10813000 16216174
13971 16216174 26308067 32451226 21895811 13834980 9352587 6909488 5844306 5072425
13963 5072425 4483858 3925608 3697289 3410245 3085305 3143721 3107178 3033169 2546979 2759763
13953 2759763 2731830 2628151 2661809 2571924 2251478 2284044 2560924 2416630 2292789 1724238
13943A724238P04804l44334l2910K3300J05962P2580l57881m9702K48546J41282
13933B235885j35075k05093R0390j93071J04119K25859N9666l92233j20103K10298
13923A880642j40555m5467R8500j33143l9109L13419j87420M30652l62794j91581
13913A623144K64641m8204L6815j14790j16563j55920M3626K50986n48297K63902
13903A499340j07210N21073m55074R9841n7053p4685K70555k30169L14818l28464
13893A452972J20682j40363K2462k06753J69710l76473N05453j25201k08776L56852
13883A570565q2575K79345j28488j68006k89298K28359L00607j78293N6589j03481
13873A485324j01305O3643k36574J73037L0162K98507m23346O5530q9190m2231
$$ plain form
13943 1724238 2429042 2084708 2051798 2075098 2181060 2253640 1895759 1846057 2094603 2235885
13933 2235885 2100810 1895717 1986107 1793036 1897155 2123014 2182680 1790447 1670344 1880642
13923 1880642 1740087 1694620 1793120 1659977 1620868 1934287 1746867 2177519 1814725 1623144
13913 1623144 1887785 1839581 1876396 1761606 1645043 1489123 1532749 1783735 1235438 1499340
13903 1499340 1392130 1913203 1458129 1557970 1500917 1426232 1696787 1466618 1781436 1452972
13893 1452972 1573654 1433291 1455753 1249000 1418710 1042237 1547690 1422489 1213713 1570565
13883 1570565 1487990 1767335 1638847 1470841 1181543 1409902 1710509 1532216 1588805 1485324
13873 1485324 1384019 1447662 1211088 1384125 1414287 1712794 1289448 1354978 1265788 1223557
13863A223557l52664M66359k64070l08958J14659J62738J75558l7017M4029j131
13853A223060L5459k72209M30604l50229N6444J56464k60991K17367k24788j41357
13843H69824J96906J21101M0871k10845K02081m27474K4403L02754k67893L06332
13833A158060k54409N81580n61019O4796J62666j15904N2493L2878k40024M743
13823H85860m7429K68015p2656j73806j50801J29698P1727k25560L42474j91399
13813H36123L33195k55670q3863N8700K56078k01841Q3507p4254j37685K13314
13803A027604j89766J75350K87437m85368m3996J02289R5647k14953L94855m00684
13793G48415M02880l03984j52981J87285J0098k74407J84250O4994J02505j5367
$$ plain form
13863 1223557 870893 1337252 1073182 764224 878883 1041621 1217179 1180162 1224191 1223060
13853 1223060 1258519 986310 1416914 1066685 1123129 1279593 1018602 1235969 1011181 869824
13843 869824 1066730 1187831 1228702 1017857 1219938 792464 816867 1119621 851728 1158060
13833 1158060 903651 1485231 924212 989008 1151674 1035770 1088263 1121141 881117 885860
13823 885860 838431 1106446 1033790 859984 709183 838881 910608 685048 1027522 836123
13813 836123 1169318 913648 829785 888485 1144563 942722 1026229 951975 814290 1027604
13803 1027604 837838 1013188 1300625 815257 771261 873550 969197 754244 1149099 748415
13793 748415 1151295 847311 694330 881615 891713 617306 801556 866550 969055 953688
13783I53688l7255J11878J22373l66654N69642n60682J46997j25029n8038O549
13773G63469p0716K69802j60844j43797R1540K537J99742k13832J05116J02722
13763I45739m01367K70899L7493l96396K64957L24364k47342K3298j00573j68142
13753E52930M24233k05183L6343j25819o2328k13883J10858J84256k67063j57276
13743B77068N70935j77915J32400j48813M9828j16823J86350J2203j63602K9525
13733F51156L8818l6852p2096J92859J81807j30334k65503r0457j25769A49736
13722F43996M9491r5066j50911K73575M0322l15644j0899J96206j57720O4237
13712E37587j92916J39246p1039K34055j92993K00712J33820l70070K98441p8703
$$ plain form
13783 953688 916433 1028311 1150684 784030 1353672 792990 939987 814958 756920 763469
13773 763469 692753 962555 801711 657914 749454 751991 951733 737901 843017 945739
13763 945739 544372 815271 852764 456368 721325 1045689 798347 821645 721072 552930
13753 552930 977163 771980 808323 682504 620176 406293 517151 701407 434344 277068
13743 277068 848003 670088 802488 653675 703503 586680 773030 785233 621631 651156
13733 651156 689974 653122 581026 773885 955692 825358 559855 469398 343629 149736
13722 643996 693487 598421 447510 721085 761407 445763 434864 631070 473350 537587
13712 537587 344671 483917 412878 646933 453940 654652 788472 418402 716843 638140
13702F38140N4994K6073A85557O80068l97886o5789K96564M2409j91581J72773
13692G22115j50980J02815r702j96987J11560K10981C94743K58464q2360j88137
13682C82710K61376B80617M60855k77311o8827n3249L17055J1931j37900K19381
13672G52552j93880G9074K41243K09555j06363K49055l30961K47446K3377k2712
13662E89714r5706j98685A42680N01662j92832j14771K36071m8090K579L5762
13652E63061j8981j32249J10334J99470k43147q0093l0191A13777J87494L34714
13642F35985k09318J40653l4559m2669K63409k56746j62976N6482n8775j10284
13632B21202N10248l52812R8305R3941j76086L4041J03624j36530j6661l6365
$$ plain form
13702 638140 693134 719207 185557 865625 467739 401950 698514 740923 549342 722115
13692 722115 571135 673950 664248 467261 578821 789802 394743 653207 570847 382710
13682 382710 644086 280617 741472 464161 395334 342085 659140 671071 533171 752552
13672 752552 558672 79074 320317 529872 423509 672564 341603 589049 612426 589714
13662 589714 494008 295323 142680 644342 451510 336739 572810 524720 527299 563061
13652 563061 544080 411831 522165 721635 478488 398395 368204 113777 301271 635985
13642 635985 426667 567320 532761 490092 753501 496755 333779 390261 331486 221202
13632 221202 731450 378638 476943 570884 394798 428839 532463 395933 379272 342907
13622C42907Q2268o027J49813k58384j41304K92698J12626L6876j16718p1526
13612D23229q8140J08945J40049L0629M8612j96339j93826J54415m8607n3543
13602C25424L8624O4348J31598j18235j35594K9668A46936J34042p5825J3255
13592B18408K85785j25221n7234J16958J2796J9324j8177j48988P7140A10735
13581C23161n7327J20711k9032j14472J3988K09478l1467N0489p4235q4442K29583
13570E56435j63051K03006k49119P1425A57355M2375L13522j67753r3092J94522
13560D46929j2787P7749J7146h436G61181A69811K87070h5185D83120k36866J7423
13549B63677L59642A89963K01169B0706K90575K28203j79693J33849B10836A4632
$$ plain form
13622 342907 425175 419148 568961 310577 169273 461971 574597 611473 494755 423229
13612 423229 335089 444034 584083 614712 663324 466985 273159 427574 378967 325424
13602 325424 364048 428396 559994 441759 306165 335833 146936 280978 205153 218408
13592 218408 504193 378972 321738 438696 451492 470816 452639 303651 380791 110735
13581 323161 265834 386545 357513 243041 257029 466507 435040 485529 411294 326852 556435
13570 556435 393384 596390 347271 418696 157355 199730 513252 345499 252407 446929
13560 446929 434142 511891 529037 -8436 761181 169811 456881 -85185 483120 246254 263677
13549 263677 623319 189963 391132 20706 311281 539484 359791 493640 210836 14632
13538D24286K24986A64957l6262J5835K91996f3194F5125M3728L72380B15860
13527C87357j14964G6757J62461P6054j42238O9568q4136n8472K57543A24681
13516B72212c9102A14669J51138M8153j20524D1946K68492Q1284A71359R2301
13506B63660B6386J20659J282J73289O7880N7702A26821R4617J77879M6104P5483
13495E20904k10451K45639L5904B39232K1083J7710K50200k43667I9814J61483
13485B61297b2437F10688B7007J98445N2106A34056K23785j04951K9251o547l3633
13474B41961q3190J50925e677n3857D92349J44194B95909n1504a24321I6379a9744
13462B51624J63807j62088n7411J01485A32319K99322n7802j79870f7253B19534
$$ plain form
13538 424286 649272 164957 128695 144530 436526 -63194 65125 108853 481233 215860
13527 387357 272393 76757 239218 315272 173034 242602 158466 99994 357537 124681
13516 272212 -39102 114669 265807 313960 193436 41946 310438 391722 171359 263660
13506 263660 26386 147045 148327 321616 389496 447198 126821 221438 399317 445421 520904
13495 520904 310453 556092 591996 239232 260315 278025 528225 284558 99814 261297
13485 261297 -22437 610688 27007 225452 277558 134056 357841 252890 282141 275594 241961
13474 241961 158771 309696 -5677 -59534 492349 636543 295909 244405 -124321 96379 -19744
13462 251624 415431 253343 195932 297417 132319 431641 373839 193969 -67253 219534
13451C8385K45691R5234o774m2669m6759J05461k5275A78474J57929I3498K99209
13440C92707A07053g4413E7936L71123i3985D32891E6574k7651K72981q2919r9841
13429A19144L0440K81404A96879C7140A055K97407j07423j8629K74759j85197
13419B61972l1657o420K0825L9668l6927K43834B31012k7924O1418F9425J27550
13408A96975k0529A3064K03610O0740H9540J91432P1561M195j34377N9048a24222
13396C73223Q5363o6663D2938O0907A8699J04302J56119H7767A6091J23418F3578
13384B23812J42701O4445E1981R3147a45566B99737j18636F2847K33573r3429
13374B02991F3304Q6376l4959K0085l5713P376a7324C85483o4912K02990A69502
$$ plain form
13451 38385 284076 379310 372536 329867 283108 388569 363294 178474 336403 93498 392707
13440 392707 107053 -74413 57936 429059 -93985 432891 56574 28923 301904 218985 119144
13429 119144 149584 430988 196879 37140 1055 298462 191039 172410 447169 261972
13419 261972 230315 223895 244720 284388 247461 491295 231012 203088 264506 69425 196975
13408 196975 176446 13064 216674 277414 89540 280972 352533 356728 222351 281399 -124222
13396 373223 458586 391923 42938 103845 18699 123001 279120 87767 16091 139509 63578
13384 223812 366513 430958 51981 145128 -145566 299737 181101 62847 296420 202991
13374 202991 63304 149680 114721 134806 99093 106469 -17324 385483 320571 523561 169502
13362B88957J22685E1012O7642L42357A13229L83383A79259J49374J51586J22081
13352F02300j43835j98930K10736A76994q5184M75805B29742j4725P4776L9624
13342C29417K306p2272p7670C2162L15565R4682A43175P979J25100o1743j0806
13331B03705L230B8494K66375L56395l24796E9436N56497j89289A05250K57884
13321C63134N9255j47149K39944A27106O4307R1355j26283j297c8508C52518G0474
13309C05890D3664M9676O5255K73422j14269D8493M49653j84602n2676P2547m1237
13298B92178d6027B52498r6608o8885N2772n0720J64147H4964L62312A36920P5090
13287B12010f3313I9886a9868A49069j6570K3511R9079J72959j76610A18041a36131
$$ plain form
13362 288957 411642 51012 118654 461011 113229 496612 179259 328633 480219 602300
13352 602300 458465 259535 470271 176994 91810 567615 229742 215017 289793 329417
13342 329417 331723 259451 181781 32162 347727 442409 143175 151154 276254 214511 203705
13331 203705 206935 28494 294869 651264 326468 59436 615933 426644 105250 363134
13321 363134 422389 275240 515184 127106 191413 282768 156485 155188 -38508 352518 70474
13309 305890 43664 93340 158595 432017 317748 48493 498146 313544 260868 333415 292178
13298 292178 -46027 252498 155890 87005 139777 89057 253204 84964 447276 136920 212010
13287 212010 -63313 99886 -19868 149069 132499 156010 255089 428048 251438 118041 -136131
13275A8851M54850A02313R7074b46368f9211A08467b8690C12672A8733K09579
13265B28312A09508K80121A38698C4740d4802N087A93369a03288E3053K8021e4233
13253a19805A19289P0566q3312a39345B03742j4360L22425B28380i336G9045Q4388
13242A63433l3048g5852A9555Q2619J1103J38595j4891o8481J23383G1674J91745
13231B63419d1462A92372i9514C14088j17905i3498M4809C98064o6766A03817
13220d6282F0926J69458a39999I8270L3067J4871P297d2577E1687b8554j3929
13209d2483C5256b3313C10760a15872B38384o2172h00A89223B0548h7592a8342
13197i9069E1564J62933f9942A3546L01124m5747D0629a12208a8543j1037I8049
$$ plain form
13275 18851 473701 102313 199387 -246368 -69211 108467 -28690 312672 18733 228312
13265 228312 109508 389629 138698 34740 -44802 -39715 193369 -103288 53053 81074 -54233
13253 -119805 119289 189855 106543 -139345 203742 189382 511807 228380 -9336 79045 163433
13242 163433 130385 -75852 19555 102174 113277 251872 236981 168500 291883 71674 263419
13231 263419 -41462 192372 -99514 314088 196183 -93498 -48689 398064 331298 103817
13220 -46282 60926 230384 -139999 98270 131337 146208 153505 -42577 51687 -28554 -42483
13209 -42483 35256 -23313 310760 -115872 238384 176212 -800 189223 20548 -87592 -18342
13197 -99069 51564 214497 -69942 13546 314670 268923 40629 -112208 -18543 -29580 98049
13185F5167a64796C32815j34686J07621A04399D2807c07822B66971A21836m3099
13175G8737A1085J29849J20827a23723e7386A50071O4076a3493k1291a4482p6051
13164i0533b6092B93966a4089j32300A87760K27553A03576R2759B3768K80549
13154C04317m2658O3344n7735G2840J75735a73362A08900D3614a69952E5130a54169
13142A76136P2149n6905J18561b847r1751A15092N7945H3993B3214J02891a18930
13130C12540a71839L9527B76873e348A51910K9459o6462J03721C882J50788a23261
13118B28842O5777j38232L3956b60910R2460B74077a83220A86257J71582A01027
13107b0366B02967o3657C3732P5362J41717E4758J62437C1459L57165a98202A19075
$$ plain form
13185 65167 -164796 332815 198129 305750 104399 42807 -307822 266971 121836 78737
13175 78737 11085 140934 261761 -123723 -57386 150071 214147 -13493 -34784 -14482 -90533
13164 -90533 -26092 293966 -14089 -146389 187760 415313 103576 196335 23768 304317
13154 304317 261659 325003 267268 72840 248575 -173362 108900 43614 -169952 55130 -154169
13142 176136 248285 191380 309941 -2847 -94598 115092 173037 83993 23214 126105 -118930
13130 312540 -171839 -132312 276873 -5348 151910 181369 114907 218628 3882 154670 -123261
13118 228842 294619 156387 190343 -260910 -168450 274077 -183220 186257 357839 101027
13107 -20366 202967 139310 33732 109094 250811 54758 217195 31459 388624 -198202 119075
13095a27516A88459d5973p2492D30377I7512J41863p6622E6007K71280l8050b52937
13083I4526k2015P9057B9643O8596a25322f1191B59877D5064J49162d1829j74885
13072b16714E9241J02178a90428a1301A46178L7865O3880g9132C98631j52156
13062B46475D9053Q9480b12176A02787J42175A263a10638C3490K53006m8190H1271
13050a91471d9186A07108L2618n7847l5478J06755F9947Q5591K09796B0724P0462
13039I1186d5895j90081A04860l1396k3337J95164j0370G3823P6282a83872E9982
13027I6083J69375K0560J15287A97403k4913B9206K46325b274A53756K96573j00635
13016C49694A05754a37123F6890J25291c19762e9546H853Q2890K576J62887A09312
$$ plain form
13095 -127516 188459 -45973 -118465 430377 97512 239375 162753 56007 327287 289237 -252937
13083 94526 72511 151568 29643 98239 -125322 -61191 259877 45064 194226 -41829 -216714
13072 -216714 59241 161419 -190428 -11301 146178 184043 247923 -79132 398631 246475
13062 246475 49053 138533 -212176 102787 244962 1263 -110638 33490 286496 238306 81271
13050 -191471 -49186 107108 139726 81879 46401 153156 69947 155538 365334 20724 91186
13039 91186 -45895 -235976 104860 73464 50127 245291 234921 73823 150105 -183872 59982
13027 96083 265458 286018 401305 197403 172490 29206 275531 -2274 153756 450329 349694
13016 349694 105754 -137123 66890 192181 -319762 -59546 8853 91743 94319 257206 109312
13004B01479d7851b275I3491c56922K4517B1231K57861k0155r7558k9733F1787
12992b06599A76661e0262j64962A86422d1262B83699J44483H8813P4944K11955
12982C75712a28089M7507C6628J373e7850l4958i384C73515E1025R6J18622a88355
12969G0792J05536a90213E4672a05479C14572J42461E1541P6338J89071g2175
12958B19146C9391h2315h324r9953o3760c9494I332L21544a99701e3452A49685
12946d55247A73503a91930d7467n5857G2472M2820b9561R983B05838R9481J20347
12935D25666b01811n4145N9590f0513H8069A0695L4431a24253I9739D8502j7688
12924C0814K12934F4532b67884B37813a39724L0099A6984K32983j23893f904B02483
$$ plain form
13004 201479 -47851 -2275 93491 -356922 -332405 21231 279092 258937 161379 131646 61787
12992 -206599 176661 -50262 -215224 186422 -41262 283699 428182 88813 163757 375712
12982 375712 -128089 -80582 36628 38001 -57850 -92808 -9384 373515 51025 51121 169743 -188355
12969 70792 176328 -190213 54672 -105479 314572 457033 51541 127879 316950 -72175
12958 219146 39391 -82315 -8324 -108277 -172037 -39494 9332 330876 -199701 -53452 149685
12946 -455247 173503 -191930 -47467 -103324 72472 115292 -29561 -19578 205838 305319 425666
12935 425666 -201811 -255956 -196366 -60513 88069 10695 45126 -124253 99739 48502 30814
12924 30814 243748 64532 -267884 237813 -139724 -109625 16984 249967 126074 -6904 202483
12912I4577O7925b4890Q113l0024j78989l5059A83796M3887i8681Q483j51604
12901b41802A30951b21816F3701K0009J18924D1478a73444e0651B86634r5295
12891A91339p6540k0234a43113A42824K9042b80801A29173e9125C13771i1819
12880A38092q915r573J25640O0475C2423h9353j69296A79861D879J76701m828
12869A76752a36311k04013B56368j26153h57B79766C0728a58424l4786b0697A06832
12857b86336B59405a40164j46957B7580O0247a57187B6851h1557j46126G1280
12846c46091a69878j4193H0801h9588A75752p5173a58630K6382B52180I7264b2848
12834b6377B24437f1975B34341p5135E9140J07940b999j51812a1917j82856B8982
$$ plain form
12912 94577 162502 -24890 -16777 -46801 -225790 -260849 183796 227683 -98681 -90198 -241802
12901 -241802 130951 -221816 63701 83710 202634 41478 -173444 -50651 286634 191339
12891 191339 114799 94565 -143113 142824 171866 -280801 129173 -59125 313771 -91819
12880 138092 129177 119604 245244 305719 32423 -89353 -258649 179861 4879 181580 176752
12869 176752 -136311 -340324 256368 130215 -857 279766 30728 -158424 -193210 -20697 106832
12857 -286336 259405 -140164 -287121 27580 87827 -157187 26851 -81557 -227683 71280
12846 -346091 -169878 -184071 80801 -89588 175752 100579 -158630 -132248 252180 97264 -22848
12834 -26377 224437 -61975 234341 159206 59140 167080 -2999 -154811 -11917 -194773 28982
12822i6398D006J72031g427k10067E2786J16283k737h5814L5557b3548j58601
12811a82149E599e5691o9109j35706k07370A39358P2842J54249A01526J29116
12801B30642R0305E9182A0624J09024B0185b07603c3083l8363G28K18454H6125
12789C5154h0438B6510a4383B16402a45200N9528B89990I142a85544N1055A32430
12777D29634E6640a44836N1584A79998n4395o1047a56134A59182c59196A8137
12766b49569m1354A7032L29716B9665a44909j05025O7577B0114O3129c2332A51468
12754C72089d1322k51498I5837C5586o283R1579h3194A61513R3587I2766L6365
12743A29131a07971A80827c9415k4877A13483O2932k8291b537B2800L07242a09345
$$ plain form
12822 -96398 4006 176037 -7427 -217494 52786 169069 166332 -85814 -50257 -23548 -182149
12811 -182149 5599 -55691 -124800 -260506 -467876 139358 212200 366449 101526 230642
12801 230642 320947 59182 10624 119648 20185 -207603 -33083 -71446 728 219182 86125
12789 35154 -80438 26510 -14383 216402 -145200 -85672 289990 9142 -185544 -134489 132430
12777 429634 56640 -144836 -93252 179998 125603 64556 -156134 159182 -359196 18137
12766 -249569 -290923 17032 346748 29665 -144909 -249934 -182357 20114 83243 -32332 151468
12754 372089 -41322 -292820 95837 35586 29303 120882 -83194 161513 255100 92766 129131
12743 129131 -107971 180827 -39415 -64292 113483 176415 148124 -2537 22800 330042 -109345
12731b70193A46643e561o9871k06795f1684j24343B01669a77380g4409K9234G2904
12719A54785H270b793A92298E5319M8215K8774i560k70197J21277d4139q4564
12708a28703A3867L37503e2060j18291k9114n5448H8054a8111F0689P7555L6063
12697A74307a61939E1566F005N1156L56936A65264J65871e8806A15177J64186
12687B79363c0362A62840J9859M6294b65090d6582m6570H5610l9415d9505j37366
12676a86871A17723Q1217K9728a06595D18103B03416J72719D8680N1782a83426
12665G0245L03425d7162M18A02196l1980L57412a16117F0398K3331a36402C32405
12653g5241k133j80589C42581A56890F3242f9073a3012B91599Q7878p7457d7693
$$ plain form
12731 -270193 146643 -5561 -75432 -282227 -61684 -186027 201669 -177380 -74409 -45175 72904
12719 154785 8270 -2793 192298 55319 103534 132308 -9560 -279757 -158480 -44139 -128703
12708 -128703 13867 351370 -52060 -170351 -199465 -254913 88054 -18111 60689 138244 174307
12697 174307 -161939 51566 6005 57161 414097 165264 331135 -58806 115177 279363
12687 279363 -30362 162840 182699 228993 -265090 -46582 -93152 85610 46195 -49505 -186871
12676 -186871 117723 198940 228668 -106595 418103 203416 376135 48680 100462 -183426
12665 70245 373670 -47162 -46744 102196 70216 427628 -116117 60398 83729 -136402 332405
12653 -75241 -77374 -257963 342581 156890 63242 -69073 -13012 291599 379477 302020 -47693
12641A21683c0876p699l1377A86776m4655B4781L15890A14643M9491A6496C866
12629B8226a52499k52976B93399A34815e7581E4468a91043B48996G4003J06040
12619A80043q7634Q8656k0208a12759H6289K02253n9495L55521A32559J204K42512
12608C76275a88231B50822J83433a29547b0212A74252b3454A674a7472A08115
12597g8853A9860b03361i3473R680F8695Q0129a88646D80112d0516A68717a68900
12585B9485J57753R2324b4628B58969N9739G2738K9954J51510b2140A05641J0397
12574A16038d0481k7353D2033b6308k08291A7997J09369e259n1818B69794G7540
12562c61721B11217n4276n8552a06859j0351B4135a83425A37477J09565J36769
$$ plain form
12641 121683 -30876 -38575 -69952 186776 142121 24781 340671 114643 164134 16496 3866
12629 28226 -152499 -405475 293399 134815 -57581 54468 -191043 248996 74003 180043
12619 180043 92409 181065 160857 -112759 86289 288542 229047 584568 132559 133763 376275
12608 376275 -188231 250822 434255 -129547 -20212 174252 -23454 1674 -17472 108115
12597 -78853 19860 -203361 -93473 -83793 68695 148824 -188646 480112 -40516 168717 -168900
12585 29485 187238 279562 -24628 258969 318708 72738 102692 254202 -22140 105641 116038
12574 116038 -40481 -67834 42033 -26308 -234599 17997 127366 -5259 -57077 269794 77540
12562 -361721 211217 156941 98389 -106859 -117210 24135 -183425 137477 247042 383811
12552C83811j18519k9044H4727P6765H0544a17068M1574C22198C0668b2522A40159
12540a03630o5279j31027b1252j24879D8128O9325J12512g739C23912a5578B26017
12528a44958G5714J58970b97910P2999l1250A22552K7764D5017J43497n3228b41122
12516a72482A10593a00149k15002c9859a5732p6592j63686e2103A49383b76194
12505b7160A65172B4656K19934H1454K55908H3079i2160B03998c77383I1023e606
12493D4427l103K9589a42701n8620G8851J99638a71970m1988B72714m3163J35416
12482C64967J28481q4854A48611l0657K18154E7600O7335K11796A37731A6716
12471d9207B85310p5651b40169c7700B08869a39223L2561a6916A74058b7781A57669
$$ plain form
12552 383811 265292 236248 84727 161492 80544 -117068 -75494 322198 30668 -22522 140159
12540 -103630 -168909 -299936 -21252 -146131 48128 117453 229965 -7739 323912 -15578 226017
12528 -144958 75714 234684 -297910 -224911 -256161 122552 150316 45017 188514 135286 -241122
12516 -172482 110593 -100149 -315151 -39859 -15732 -92324 -256010 -52103 149383 -276194
12505 -27160 165172 24656 244590 81454 337362 83079 -92160 203998 -377383 91023 -5606
12493 44427 41324 70913 -142701 -201321 78851 278489 -171970 -213958 272714 229551 364967
12482 364967 493448 408594 148611 117954 336108 57600 124935 336731 137731 16716
12471 -49207 285310 209659 -240169 -37700 208869 -139223 -106662 -16916 174058 -27781 157669
12459g2769A48515h0235A27758J34045P501a26234k29862J36533R5166j38959
12449b63356H190L2996a7315j2796n307C31597j9969E1961R2730n1842b28074
12437a34864d394D79J03302K3369b63991A15925a29299A40199c23972h7438Q621
12426g8817f673C5180A4320a5538E6508R1834c2522p0784j74243e9174A68085
12414c5161A5827a86788B52037E5923K64774A15396K6997Q9270a71695n5513e5041
12402I3307h3666L008J790C4846b10538i9404I4398a83803A13144a17902k8185
12391a46087N2708l0294B08045a02826A21779L01020G1027P6630b52485J24341
12381a28144A04301b7186o6847j26905B41247K20858a80824F5705a65064c4587
$$ plain form
12459 -72769 148515 -80235 127758 261803 269304 -126234 -356096 -219563 -124397 -263356
12449 -263356 8190 41186 -17315 -30111 -35418 331597 311628 51961 144691 92849 -228074
12437 -134864 -4394 479 103781 127150 -263991 115925 -129299 140199 -323972 -87438 -78817
12426 -78817 -6673 35180 14320 -15538 56508 148342 -32522 -103306 -277549 -59174 168085
12414 -35161 15827 -186788 252037 55923 320697 115396 142393 231663 -171695 -227208 -55041
12402 93307 -83666 -80658 -78868 34846 -210538 -99404 94398 -183803 113144 -117902 -146087
12391 -146087 -93379 -123673 208045 -102826 121779 422799 71027 147657 -252485 -128144
12381 -128144 104301 -27186 -94033 -220938 241247 462105 -180824 65705 -165064 -34587
12370b58987C64266G796a48342B29622c07411f0902A27698b7894j32348H7933
12359e4262A21909a6411j02422A43547c16628f5753G9589K7662a31330I3431A8670
12347b3174a002A14573Q4840l4458F4180a21638E2915J16010a53790G4169Q1282
12336A55451f1311A68023p9125b68143B68527a45098K771A10486K8447F606K31776
12325B38382j06434K24667i1057c0951F3543k7640d80j09624k9555e636A35717
12313C13543A55249D8131a82171h7437I8221J07891M3903I2116L65100i87j68910
12302a69897H3252j9881A7870J35348J59365a27088B21320H2790a08129I9162
12291a93052D21052B07177I4970J45752H3148f0638C01270n1016I0476K79739
$$ plain form
12370 -258987 364266 7796 -148342 229622 -307411 -60902 127698 -27894 -160242 87933
12359 -54262 121909 -16411 -118833 143547 -316628 -65753 79589 107251 -131330 93431 18670
12347 -23174 -1002 114573 199413 164955 64180 -121638 52915 168925 -153790 74169 155451
12336 155451 -61311 168023 88898 -268143 268527 -145098 -142327 110486 138933 6606 238382
12325 238382 131948 356615 -91057 -30951 63543 35903 -480 -110104 -139659 -5636 135717
12313 313543 155249 48131 -182171 -87437 98221 206112 250015 92116 457216 -987 -169897
12302 -169897 83252 63371 17870 153218 312583 -127088 221320 82790 -108129 99162
12291 -193052 421052 207177 94970 240722 83148 -60638 301270 250254 90476 370215
12281C70215A19804b74023d0752D0199M1388a17889I8653c69401a5031A08142
12270B93210e3528m9913D62680a58645c1702A0613O6479b75392b9128r4284G8094
12258B56573G7364a79704a0094j72244C52237A688a73981A86554J80237A83028
12247E3181Q3755A4987c0444G1525E137Q325J0184J21200a8152e407A00469a36979
12234b19139B55212n0372m0171K49565A27065O0307E9710L19837d3888D44647
12223d7532g567G6109d4573O139A4094a89548a4273B39243R3091j8016h2685J724
12211h0961A17590J69240a2581H4009K51100p5804J70067K0723J29540B6797K92724
12200C19521B0445K68446a66411B07Q7395p734J4644J18911J6305A01123K08764
$$ plain form
12281 370215 119804 -274023 -40752 40199 81587 -117889 98653 -369401 -15031 108142
12270 293210 -53528 -103441 462680 -158645 -31702 10613 77092 -275392 -29128 -123412 78094
12258 256573 77364 -179704 -10094 -182338 352237 1688 -173981 186554 366791 183028
12247 53181 136936 14987 -30444 71525 5137 13462 23646 144846 -18152 -5407 100469 -136979
12234 -219139 255212 204840 164669 414234 127065 187372 59710 379547 -43888 444647
12223 -47532 -7567 76109 -44573 -38434 14094 -189548 -14273 239243 332334 314318 -82685 -80961
12211 -80961 117590 286830 -12581 84009 335109 259305 429372 450095 579635 26797 319521
12200 319521 20445 288891 -166411 207 87602 79868 94512 213423 229728 101123 309887
12189C09887A4347c6158B26535A02552J19186J23351I5794L10527i6323C34630
12178E65849k39045j54156L93694g5856a9337A89244a04747D61858A83031j8776
12168A64255N6179m5019a588G705L47662G223P5992O3993J87444a16122D45125
12156B07036L28556j06837j90836n6193p0210J66405b15214D31126b13548B21387
12145d2058A275L36342j8389j47503l1561A28L37909N0526i2848B13406K5928
12134B39334G438K07352E1339J23503h2568B05790J13251C5682K77259E2575K06855
12123B59430a05503J8994A12881J81664G0784J15705e4189B68379h48G2961J68735
12112B41696M7365D3728a42371B21450c5027C40463e0644E9696K14537b1929C48654
$$ plain form
12189 309887 14347 -36158 226535 102552 221738 345089 95794 406321 -96323 334630
12178 565849 326804 172648 566342 -75856 -19337 189244 -104747 461858 183031 164255
12168 164255 220434 175415 -1588 7705 355367 7223 83215 147208 334652 -116122 445125
12156 207036 535592 428755 237919 181726 111516 277921 -215214 431126 -213548 221387
12145 -42058 1275 337617 319228 171725 140164 128 338037 388563 -92848 213406 239334
12134 239334 7438 214790 51339 174842 -82568 205790 319041 35682 312941 52575 259430
12123 259430 -105503 -86509 112881 294545 70784 186489 -54189 268379 -848 72961 241696
12112 241696 289061 43728 -142371 221450 -35027 340463 -50644 59696 274233 -21929 348654
12100C31294j11966D7981M15439A3825l945O6011B3012J33833b55440a26866D00501
12088C01589a44166B93027l0185H0950b68751B0258P5622K25615n4091e894l15989
12077c21883E7630a62213A08085K7419d8403B45453e8377j9423A970L2126f6248
12065A60755l1529J06688m4207P7519e5435D4357M30244i0840G0352P2310a93860
12053B92713b3354B16198J09867o5834a37960A14637P3424M2488H0714A9816q116
12042A1700J21444a03016j45683J23248A77102F9374J56982E5525g898l6060A00932
12030b9821j04650j3510j28161Q3650b3005j25311C7741c64815D008b6147k41107
12019b67254e6854E2815M5637g6462A49546a1953A50403L37o0420c01362J02166
$$ plain form
12100 331294 219328 47981 463420 13825 9880 75891 23012 156845 -255440 -126866 400501
12088 301589 -144166 293027 262842 80950 -268751 20258 95880 321495 267404 -5894 -321883
12077 -321883 57630 -162213 108085 135504 -48403 245453 -58377 -77800 1970 34096 -66248
12065 160755 129226 235914 191707 269226 -55435 44357 474601 -90840 70352 142662 -193860
12053 292713 -23354 216198 326065 260231 -137960 114637 188061 230549 80714 19816 11700
12042 11700 133144 -103016 -248699 -125451 177102 69374 226356 55525 -7898 -43958 100932
12030 -29821 -134471 -147981 -276142 -192492 -23005 -148316 37741 -364815 4008 -26147 -267254
12019 -267254 -56854 52815 98452 -76462 149546 -11953 150403 150740 90320 -301362 -199196
12008a99196a5046o1971g525A48100a56300B54055e78458A00338a06449G3897
11997i0483E9256e677k58254D90989a917G4028a40362p5893b8690A60674D0096
11985B21235a21290b0412B64210a24915A26535a13001k80835a17815I1929a81990
11974c6519G8371J60173G4560c02147Q9142B98900h1085c4722l64331b6021A15422
11962b01896C230a770D7559J06935a64247j7587f2609D9909b24304g4962A29421
11950b0790A47137a06579j98471B55755a53761B23286i8405k64231b2170B9156
11939B09605E9202j5603a00396n921j10170j94067J96401B00061J10726b2113
11928C7660a23046c927A76443Q963O8916G153O4077e7598K7660k19538A161K44047
$$ plain form
12008 -199196 -15046 -77017 -7525 148100 -156300 254055 -578458 100338 -106449 73897
11997 -90483 59256 -5677 -263931 490989 -1917 74028 -140362 -216255 -28690 160674 40096
11985 221235 -121290 -20412 264210 -124915 126535 -113001 -393836 -117815 91929 -181990
11974 -36519 78371 238544 74560 -302147 -213005 298900 -81085 -34722 -399053 -26021 115422
11962 -201896 3230 -1770 47559 154494 -164247 -181834 -62609 49909 -224304 -74962 129421
11950 -20790 147137 -106579 -305050 255755 -153761 223286 -98405 -362636 -22170 29156
11939 209605 59202 43599 -100396 -106317 -216487 -410554 -214153 200061 310787 -22113
11928 37660 -123046 -3927 176443 185406 254322 7153 71230 -57598 -29938 -249476 1161 245208
11916B45208b51322H3722A0846b20667j50470a15876j07510R3847F1165J48485
11906B09650a00829A72003i992B590a5943k86529c7523r9243B15249a46597q9713
11895b36310b2901G303R4645a9817A95871h6172f341k7814a370j26945F756c17305
11882a17100B24228K3641b78309f0660k19188A14458A888J10410a79141A16661
11871A93814b92684A7636b67970o426K5383A22847a02194D7753P9196k4648a68553
11859E3393J81527c8799B983a434j31436J620B56876b66519M5745k10538A05317
11847c25229A2787d45572G2504i1124j24881B14546J2338g5168l1859A47593n745
11836A41848a6524B6396J41785J18729a57950d9820k75129a15835B0277d02729
$$ plain form
11916 245208 -251322 83722 10846 -220667 -371137 -115876 -223386 -129539 61165 209650
11906 209650 -100829 172003 -9992 2590 -15943 -302472 -37523 -136766 215249 -146597 -236310
11895 -236310 -22901 7303 101948 -19817 195871 -86172 -6341 -34155 -1370 -128315 6756 -317305
11882 -117100 224228 247869 -278309 -60660 -279848 114458 1888 112298 -179141 116661
11871 193814 -292684 17636 -267970 -274396 -249013 122847 -102194 47753 126949 102301 -168553
11859 53393 234920 -38799 2983 -1434 -132870 -131250 256876 -266519 -220774 -431312 105317
11847 -325229 12787 -445572 72504 -91124 -216005 214546 226884 -75168 -107027 147593 141848
11836 141848 -16524 26396 168181 286910 -157950 -49820 -324949 -115835 20277 -402729
11825b00116F485K75566D6356J49943H6566a60891e4149E4237A6927M1684b49526
11813F3113J75347a31758B9398d6651j44209a8069A02866f8716P228D3275K3912
11802F7187a94501p1400B5302b14442k6167B52854b6256A1377J40246a48010A50309
11790e8660j25858j97513i1622j14224C09425H7889Q7367f7758i795l23085Q172
11779c24708A41690b13170b2833A01203b50763p0717E5685c37278A10576J9298
11769A29874b32987A96277k9405b13974h9287C58761A06368i4832k850E1186a99901
11757C91015j53170a96934A48145k9415a50135f291B21506c17765A74584E4426
11746A71516o3850B6376a5493n6315h111A46280g596k49324R3945N6588D2315
$$ plain form
11825 -200116 6485 282051 46356 196299 86566 -160891 -54149 54237 16927 58611 -249526
11813 63113 238460 -131758 29398 -46651 -190860 -18069 102866 -68716 -61488 43275 67187
11802 67187 -194501 -265901 25302 -214442 -240609 252854 -26256 11377 151623 -148010 150309
11790 -58660 -184518 -382031 -91622 -205846 309425 87889 175256 -67758 -9795 -332880 -324708
11779 -324708 141690 -213170 -22833 101203 -250763 -321480 55685 -337278 110576 129874
11769 129874 -232987 196277 166872 -213974 -89287 358761 106368 -94832 -97682 51186 -199901
11757 391015 237845 -196934 148145 118730 -150135 -6291 221506 -317765 174584 54426
11746 171516 107666 26376 -15493 -71808 -8111 146280 -7596 -256920 -162975 -106387 42315
11734A19260f7737j87642A53224F4750b7763I7579A8375B811d7031A19239a37748
11722a19228D9334a45297L182B41910o8381c32872B8414h7435l1100B16201r7397
11711A18804K12052b16023b0350j50916M1272A15710b04765B45876a50652P0935
11701g9717j28577B83460A09853i9206A27377L2027J09088a00479q2012G5372
11690a65535m1011a6352m1258C5292c9300A94192G6924J24456c68931B24265a9714
11678E7872c29241B59637b1567B44796a08776A68313b44041A91750q2552J11437
11668B20635r2471a4787A69847B8599J0735b70922i625C72159g5014b7039j20454
11657a47493A32080J42641b0336B84567j19484A9789a20879A56893A0681a34677
$$ plain form
11734 119260 -67737 -255379 153224 64750 -27763 97579 18375 2811 -47031 119239 -137748
11722 -119228 49334 -145297 -142115 241910 173529 -332872 28414 -87435 -118535 216201 118804
11711 118804 330856 -216023 -20350 -171266 -129994 115710 -204765 245876 -150652 -79717
11701 -79717 -208294 283460 109853 -99206 127377 159404 268492 -100479 -182491 75372
11690 -165535 -206546 -16352 -57610 35292 -39300 194192 76924 201380 -368931 224265 -19714
11678 57872 -329241 259637 -21567 244796 -108776 168313 -244041 191750 109198 220635
11668 220635 128164 -14787 169847 28599 39334 -270922 -9625 372159 -75014 -27039 -147493
11657 -147493 132080 274721 -20336 284567 165083 19789 -120879 156893 10681 -134677
11646b9698E1563j7156K27476b18880c3701H8808J79549a49760k42124J36669
11636b55215A94843G7436a13848A08398J26395j02839a84696A70434A7754a98116
11625i0373A020b93283c5316C33482b6124A20082E5272J12864C680J84512e7164
11613h8303A03207k262P2187J29983h2967A14766J6866i7467l2889B23832b6887
11601a20171F1772K68684q0569b59594H7323K10898f1078a3042j21896B07935
11590f7538J0294N220b2396l928A34491K06251a63461B9916i273I541Q7733J37719
11578B34993a44596b6277I4367h127j75546A11459E0291D420i3825B53773F7680
11566e7085B72533M3398h1118A46842g0914e599l7913B26870E6005N6570J1895
$$ plain form
11646 -29698 51563 34407 261883 -218880 -33701 88808 268357 -149760 -391884 -255215
11636 -255215 194843 77436 -113848 108398 234793 131954 -184696 170434 17754 -198116
11625 -90373 1020 -293283 -35316 333482 -26124 120082 55272 168136 3680 188192 -57164
11613 -88303 103207 100945 173132 303115 -82967 114766 131632 -97467 -130356 223832 -26887
11601 -120171 61772 330456 249887 -259594 87323 298221 -61078 -13042 -134938 207935
11590 -67538 -57244 -52024 -22396 -26324 134491 340742 -163461 29916 -9273 9541 97274 234993
11578 234993 -144596 -26277 94367 -8127 -183673 111459 50291 4420 -93825 253773 67680
11566 -57085 272533 315931 -81118 146842 -70914 -5599 -43512 226870 56005 112575 124470
11555A24470B6716K57271i5585j4549K2731B95483e3936B8296a33104E7195J13537
11544A70732o5391J30858d7334A25732K09804b8451I1876b23174A07558a68587
11533F5397J16304a5931r7356A17233b19592A66179L20267E7099B7129d1269C34553
11521h5969C562b00199A83493F547O102K09881K69773A91528j0189K1538H504
11509H9188b52462B70404J19910B8193f7014A00226b0586j58568P9095A50931
11498I0435K74417F9341J64913D9049J29608J20591m0266E2817a11232I4039J88435
11487B82474D6222h7558D44145j43068A24136J22911J32393r0294G6351J53831
11477B30182a29247M3351A2232J63519b18401C75297o9268a3872I8427O3354K85
$$ plain form
11555 124470 26716 283987 -95585 -110134 -87403 295483 -53936 28296 -133104 57195 170732
11544 170732 105341 236199 -47334 125732 335536 -28451 91876 -223174 107558 -168587
11533 65397 181701 -15931 -113287 117233 -219592 166179 486446 57099 27129 -41269 334553
11521 -85969 3562 -200199 183493 6547 12649 222530 492303 191528 181339 202877 8504
11509 89188 -252462 270404 390314 28193 -67014 100226 -20586 -179154 -100059 150931
11498 90435 364852 69341 234254 49049 178657 299248 258982 52817 -111232 94039 282474
11487 282474 46222 -87558 444145 301077 124136 247047 379440 289146 76351 230182
11477 230182 -129247 -85896 12232 175751 -218401 375297 306029 -13872 98427 161781 162066
11466A62066d8000C59032A54795p2432b81055B04769c7257D21337b58245C88811
11455C67579J42149H8573M79277A86494A662K82849j15414J74850h3683A11251
11444G233a98915A39241l95a6329A8215J81449H8167J5543M42672A78458B5639
11432D46701A82069K00776A68854L1563h0416K4630K0858r9551a0011n5188G7824
11420C11627A06675e341p691C1864b7578A16564b4923A39066m9000b48449B17090
11408b25622B25690a11552d072H6738a98762A44097a31519I792J42751d500A33640
11396A75405b0966A48261k3348b26822A46530J70393a88453F6136e6775j95004
11386b51779D70003b529A13228J54752p6413P690I601J31313m0517J07178m3941
$$ plain form
11466 162066 -48000 359032 154795 82363 -281055 204769 -37257 421337 -258245 388811
11455 367579 509728 88573 567850 186494 1662 284511 169097 343947 -83683 111251
11444 7233 -198915 139241 138846 -16329 18215 199664 88167 103710 546382 178458 25639
11432 446701 182069 382845 168854 200417 -80416 -55786 -34928 -134479 -10011 -65199 77824
11420 311627 106675 -5341 -13032 31864 -27578 116564 -24923 139066 90066 -248449 217090
11408 -225622 225690 -111552 -4072 86738 -198762 144097 -131519 9792 152543 -4500 133640
11396 175405 -20966 148261 124913 -226822 146530 316923 -188453 66136 -56775 -251779
11386 -251779 470003 -2529 113228 267980 191567 199257 9601 140914 100397 207575 163634
11375A63634a86977g2763G1425d02532B365Q1122d373D2043j1516b05532m3621
11364b49153i8828R524A11490P9895A2089E532K04366d2964o022r3210K7727K8246
11352h6223k1689A9446q560M67002a28060j31787i3935K0914j21062F2123j1579
11341E0544a24321A5377P1995a02584C44936A9181b75847R6417F5832J57414e3016
11329B2117Q5239a66303B27710B7084K53381j05307d7403A39787g2038C7683O4698
11318A02381K49648D7616J69497d4995k742b1614D3317H723c90679b9397A28950
11306E2597b83494G3656J05103g5393i657j16244A470a5861E4785K91671A6648
11294B74643a82904J3491B6382b10931e3207A93404e820A68795a16499b8479E3033
$$ plain form
11375 163634 -186977 -72763 71425 -402532 2365 83487 -4373 42043 30527 -205532 -249153
11364 -249153 -98828 -89304 111490 191385 12089 5532 209898 -42964 -48986 -142196 -114469 -86223
11352 -86223 -107912 19446 10886 477888 -128060 -259847 -93935 -73021 -194083 62123 50544
11341 50544 -124321 15377 87372 -102584 344936 19181 -275847 -179430 65832 223246 -53016
11329 22117 107356 -166303 227710 27084 280465 175158 -47403 139787 -72038 37683 102381
11318 102381 352029 47616 217113 -44995 -47737 -21614 43317 8723 -390679 -29397 128950
11306 52597 -283494 73656 178759 -75393 -9657 -125901 1470 -15861 54785 346456 16648
11294 274643 -182904 -169413 26382 -210931 -53207 193404 -5820 168795 -116499 -28479 53033
11282a16099H2590b90423D5527a27439o0782G3589j2188a8080l0111k02949b790
11270c41647k4472a32860j97919i034j72621A24143a74913A8066P6150a27004
11259D04597a04777F1580i8347J7360r8358g6061j5382j01929B4603a19915n3605
11248a73520L2733m5441E9554M7409a49703D2723b31626d7955a7945k86681j60702
11237d65328e0567D9321A3902N3826B9821R5226J19520a45179J8308j30080A73861
11225b1789j7003A76004B653b03860R4026A11635j9951K10483a16142I9810D6885
11213h3316D07820c4249A82697a79198L6431e4171m6017l00668a05601A83621
11202F5588b30654A98966b26656e9935j03401D0770b7146I9751b24812H2304b5636
$$ plain form
11282 -116099 82590 -290423 45527 -127439 -188221 73589 61401 -18080 -48191 -251140 -2790
11270 -341647 -366119 -132860 -330779 -9034 -181655 124143 -174913 18066 94216 -127004
11259 404597 -104777 61580 -98347 -80987 -179345 -76061 -91443 -193372 24603 -119915 -173520
11248 -173520 -140787 -186228 59554 106963 -149703 42723 -231626 -47955 -17945 -304626 -465328
11237 -465328 -50567 49321 13902 67728 29821 125047 244567 -145179 -126871 -256951 173861
11225 -21789 -38792 176004 2653 -203860 -109834 111635 91684 302167 -116142 99810 46885
11213 -83316 407820 -34249 182697 -179198 -142767 -54171 -100188 -400856 -105601 183621
11202 65588 -230654 198966 -226656 -59935 -163336 40770 -27146 99751 -224812 82304 -25636
11190f7521b3847k35271o8763a04519C1116d1037f908D8228c14115A83001j4644
11179A68357J13974e0707I370L2800a26961d3373B52516l1383c15290A87334B6954
11167d65025c126F7240a9266k25676a01132k6495j34112G3189a12539A34134f0815
11155a37346k93965a3709j07330A07056J31736a36334A16338c29602B48615a33550
11144a63115l5219j9811H4980J18271a49695G0192D371a79108C65758h1483C5019
11132e7177A90390p0393c34143a9311B64209Q2625g2028a0758B02404c0389G302
11120B72045m2347a07673N2485B59668j9002F8794a62343D9357M8441P951e0866
11108B11652H3301a05567A37223b01473g9277A95184G6762e9659A33126H267c05026
$$ plain form
11190 -67521 -23847 -259118 -327881 -104519 31116 -41037 -6908 48228 -314115 183001 168357
11179 168357 282331 -50707 9370 42170 -126961 -43373 252516 221133 -315290 187334 26954
11167 -465025 -3126 67240 -19266 -244942 -101132 -127627 -261739 73189 -112539 134134 -60815
11155 -137346 -431311 -13709 -121039 107056 238792 -136334 116338 -329602 248615 -133550
11144 -163115 -198334 -218145 84980 203251 -149695 70192 4371 -179108 365758 -81483 35019
11132 -57177 190390 119997 -334143 -19311 264209 346834 -72028 -10758 202404 -30389 7302
11120 272045 229698 -107673 -55188 259668 240666 68794 -162343 49357 97798 105749 -50866
11108 211652 83301 -105567 137223 -201473 -79277 195184 76762 -59659 133126 8267 -305026
11096B76505C8006a23864M1634A85988p4824a65365G2316d2011A51899E1881d5743
11084A08002A0395L60511D1076P5473L4374A2703K15673M4712j07799J80161M2832
11073C88282j15052n0310K93648A82613P9477J30374R4185k02212Q4817j18713
11063B50541K3854R9321j21338J42656A94507J98256r4261j0860j37918L10990
11053D60714A58912L03893k1271r848J98175j54024l1001j97220K79628j16025
11043D11219M52470l24672r8677L09195j30420L18930j1453k54707L55916j68941
11033H58860j40240K66425j27732O9842J20207k88404p398O11669k55977j32658
11023I74594o2731k20295L50124o6473K0172n902j7603k8373k12087K41451l22495
$$ plain form
11096 276505 38006 -123864 -82230 185988 111164 -165365 72316 -42011 151899 51881 -45743
11084 108002 10395 370906 41076 116549 150923 12703 228376 273088 165289 345450 388282
11073 388282 273230 222920 516568 182613 262090 392464 486649 284437 369254 250541
11063 250541 274395 373716 252378 395034 194507 392763 298502 287642 149724 460714
11053 460714 158912 462805 441534 431686 629861 475837 444836 247616 527244 411219
11043 411219 863689 539017 440340 749535 619115 938045 926592 671885 1027801 858860
11033 858860 718620 985045 857313 927155 1047362 758958 751560 1363229 1107252 974594
11023 974594 911863 691568 1041692 975219 995391 989489 971886 943513 731426 972877 650382
11012F50382K52674k19002K11699J63587K79589l82873k51389L59077q2613l16957
11002F64174M69751k41066j40549N108P5026k23341L1716j8707J5158M25125k96616
10991G65779M9059j83901O1951k88527K31357P918L14972j16444k50511k0392
10981E71261n4992N43413l88530N920J89011K3580k82301n1725L96453l9942m4592
10970H67556k161Q2199M00119l89093J89819J18793J31797K50240p9744K85647
10960A855172K72141j38184K89488K25696L13334m1416K15784K25352R5435O7022
10950C379824J1437j91930k53939n96411j11882l50683l3101k27505q8656L3326
10940A570480j7986m5340l65683J84802K32674l75048k11065m0402p2844M3608
$$ plain form
11012 650382 903056 684054 895753 1059340 1338929 956056 704667 1063744 981131 664174
11002 664174 1133925 892859 752310 757418 832444 609103 640819 622112 637270 1062395 765779
10991 765779 814838 630937 692888 404361 635718 643636 958608 842164 591653 571261
10981 571261 516269 1059682 671152 677072 866083 889663 607362 555637 952090 912148 867556
10970 867556 865395 947594 1347713 958620 1148439 1267232 1399029 1649269 1569525 1855172
10960 1855172 2127313 1989129 2278617 2504313 2817647 2776231 2992015 3217367 3312802 3379824
10950 3379824 3391261 3199331 2945392 2348981 2237099 1886416 1853315 1625810 1537154 1570480
10940 1570480 1552494 1507154 1141471 1326273 1558947 1183899 972834 932432 859588 903196
10930I03196k27742A88435J10884j4788L45585k98762K65112j39452A17313L28721
10920D46034O083d070n7555A16476J67248d557C04686a20376B46830J06631E3083
10908A66483G5845K0189a44882M3430q4732e5883l3810A04740J63414P419a54353
10896f9972H0433c56k3422A01059B1309c29273a40429e2703B3041J34056p6386
10885H0711j1808R909b7748D7978i3095M6298G6927b41996h2602m2467I7066J10827
10873B07893b10403b1188I0060O9417F5460a4209k13610I1423B0415c58390h9194
10861F2348J03599a15286m0392A18579d8096n8620A06634m8797J52028b35566
10850b87682a38063m9525A72329a52295G8721J19596b23544j0209C1797O5726
$$ plain form
10930 903196 675454 188435 299319 284531 630116 331354 596466 457014 117313 446034
10920 446034 452117 -4070 -61625 116476 283724 -4557 304686 -120376 246830 353461 53083
10908 166483 75845 96034 -144882 -101452 -186184 -55883 -89693 104740 268154 275573 -154353
10896 -69972 80433 -356 -23778 101059 21309 -329273 -140429 -52703 23041 157097 80711
10885 80711 68903 78812 -27748 47978 -93095 -46797 76927 -241996 -82602 -125069 97066 207893
10873 207893 -210403 -21188 90060 159477 65460 -14209 -227819 91423 20415 -358390 -89194
10861 62348 165947 -115286 -155678 118579 -48096 -106716 106634 57837 209865 -235566
10850 -287682 -138063 -187588 172329 -152295 78721 198317 -223544 -233753 31797 97523
10840I7523j6301C4035b9390k92546A13428c77184A38720J06411F4075N3245E6654
10828b13948h7551k358C16147E4507b05300m2138c5665k62306f4669B14874J02701
10817C17575e0927J8662C39917G3530M9911i5600r7691J1927A27036a65249j71218
10806c36467e259E5311j4615b17631A23508a03694C6533L59570l5739e7910k54028
10795c11938c4244j21033K4980O971B09244N3064K6353E344P4009A3727L72035
10784C85762a65405G3023a76350n7596L8670j6074K3216c3723j58653L9647j09477
10773b62206b6809k19662J1383F6211c65446R7959P8771F0705Q9657b03923D8652
10761H7910l4843A0339g6472k62113D879h6890r9299A91283E4385e2144p8690
$$ plain form
10840 97523 81222 34035 -29390 -321936 113428 -377184 138720 245131 64075 117320 56654
10828 -213948 -87551 -89909 316147 54507 -205300 -247438 -35665 -297971 -64669 214874 317575
10817 317575 -50927 -32265 339917 73530 123441 -95600 -193291 -181364 127036 -165249 -336467
10806 -336467 -5259 55311 40696 -217631 123508 -103694 36533 396103 360364 -57910 -311938
10795 -311938 -34244 -155277 -130297 -123326 209244 262308 288661 5344 79353 13727 385762
10784 385762 -165405 73023 -176350 -233946 -195276 -211350 -188134 -33723 -192376 -152729 -262206
10773 -262206 -26809 -246471 -235088 66211 -365446 -267487 -188716 60705 150362 -203923 48652
10761 87910 53067 10339 -76472 -338585 4879 -86890 -186189 191283 54385 -52144 -130834
10750a30834E6063J6496E169J666a4728B50259F6048F687a08231A97915J463c8581
10737A77842C7907k751K36735a41006F281b23257A06814J58592c18603B90811
10726d682k9974G7572c56777k03576a31226b0798k8767j2251K9512j92157A39491
10714h8385E2826K46579c6205j93261J00126O3220k6293B06140b62468a754C77146
10702b18466O4866j23307C6038b42369J00801k63933H782a2340p1698B46666c51751
10690f4431A82252j1832b93598A6e5579D0030P4170d23851a05142A86918d08808
10678c70393c1039a1405m8256j25702k00362f3174A10546d08811b00980a9861
10667a63772a0248A34656a74638A20763O5265b23806o9432a37372C65660a84557
$$ plain form
10750 -130834 56063 72559 5169 6835 -14728 250259 66048 6687 -108231 197915 199378 -38581
10737 177842 37907 35156 271891 -141006 6281 -223257 106814 265406 -318603 290811
10726 -4682 -34656 77572 -356777 -560353 -131226 -20798 -49565 -61816 -32304 -224461 139491
10714 -88385 52826 299405 -36205 -229466 -129340 -66120 -92413 206140 -262468 -1754 377146
10702 -218466 -153600 -276907 36038 -242369 -141568 -405501 8782 -12340 -84038 246666 -351751
10690 -64431 182252 170420 -293598 16 -55579 40030 114200 -423851 -105142 186918 -408808
10678 -370393 -31039 -11405 -59661 -185363 -385725 -63174 110546 -408811 -200980 -19861
10667 -163772 -10248 134656 -174638 120763 186028 -223806 -293238 -137372 365660 -184557
10656B42021Q0524E8842A6204b38766j94217a37848m4956O8416j30872A97160
10645B09935i1674L7047C25230A09615g7691k76106e9368H4629J22094I6092b76757
10633a99632h3291j43680E1967b2432B23774F9063J06531C1028a21280A11179
10622a62026a1410G0095J24819q2872a83557g0011c1655p9713j97673A18289B6430
10610e76291a10662j20304M949b9309m035A10726b55825F5940j4394Q1383a22755
10598a70391j13306a1213j19398M5613D0161Q702a16680A63410p1408D3418a46311
10586g2021H0515c94141c2848m4112j4821B17243F9313M9371c44108a7338l4914
10575e2252k68534a29059a1378B29084n000d9033j70281O1795A09859j4583a21750
$$ plain form
10656 242021 322545 58842 16204 -238766 -432983 -137848 -182804 -114388 -245260 197160
10645 209935 -91674 -54627 325230 109615 -77691 -353797 -59368 84629 206723 96092 -276757
10633 -199632 -83291 -226971 51967 -22432 223774 69063 175594 31028 -121280 111179
10622 -162026 -11410 70095 194914 112042 -183557 -70011 -31655 -111368 -309041 118289 26430
10610 -576291 -110662 -230966 -226017 -29309 -33344 110726 -255825 65940 51546 132929 -122755
10598 -170391 -283697 -11213 -130611 -84998 40161 48863 -116680 163410 92002 43418 -146311
10586 -72021 80515 -394141 -32848 -76960 -91781 217243 69313 118684 -344108 -17338 -52252
10575 -52252 -320786 -129059 -11378 229084 224084 -49033 -219314 -157519 109859 95276 -121750
10563a07758c615I1337b42527C6602b43235A39012A8111R2731a20115K7623A11900
10551h7374I4089C3508L6933f0997A26120c39429A4833b67554j5463a10474A85455
10539b13381k3787j20626g8554C001b85557j46182C76121b64167a12917A47653
10528e5502l55552H0490e28860e6936b2990D8487a46243A3318c95478B45338B9193
10516g3337e719A19210D7815f575n8962j71701j5172A88322a39723B4554g8406
10504a26601o5064c8194p6341c3092H4155C947b54627L9208a02834H593M9865
10493E8458a65342j28728D7892b67716A29802a19841l3779L5090A22985m1673
10483H1312a1064B3538M03988B0783f6335A67258b9857F2142b4318A58825f43486
$$ plain form
10563 -107758 -3615 91337 -242527 36602 -243235 139012 18111 110842 -120115 -92492 111900
10551 -87374 94089 33508 70441 -60997 126120 -339429 14833 -267554 -283017 -110474 185455
10539 -213381 -237168 -357794 -78554 3001 -285557 -431739 376121 -264167 -112917 147653
10528 -55502 -411054 80490 -528860 -56936 -22990 48487 -146243 13318 -395478 245338 29193
10516 -73337 -5719 119210 47815 -6575 -65537 -237238 -252410 188322 -139723 24554 -78406
10504 -126601 -191665 -38194 -114535 -33092 84155 3947 -254627 -215419 -102834 8593 58458
10493 58458 -165342 -294070 47892 -267716 129802 -119841 -153620 -118530 122985 81312
10483 81312 -11064 23538 427526 20783 -66335 167258 -29857 62142 -24318 158825 -643486
10471H1081A5440P8744a60901A69888O045D5398d0743C18436j32666L28685K1164
10460E35619J24151B73429m5745a50998c1799A28665J3618J56316A2287P4508
10450H6795a60328A9679b13364k55185D6754b59745A3110J44128d26000b02510
10439d10659P2557a52304k05258A57874o7017d5809b1325j43876d0014E4782D372
10427A29943a82320f3900k00241h3143k32216A7327g2040A14085k4648L7811l5528
10416I1720a15232b5265l24385a52594G4733f111j22995e681D3187L4536e2205
10404f1651m0171A0016J4409b6894j14134p3471A73422b46300a4907B81571a75801
10392e0239B0397a62000b1584A86648o0744f0742m6496l2009e3542B92825f6515
$$ plain form
10471 81081 15440 94184 -160901 169888 175933 45398 -40743 318436 185770 514455 535619
10460 535619 659770 273429 227684 -150998 -31799 128665 142283 298599 12287 86795
10450 86795 -160328 19679 -213364 -468549 46754 -259745 13110 157238 -426000 -202510
10439 -410659 -338102 -152304 -357562 157874 90857 -45809 -21325 -165201 -40014 54782 4372
10427 129943 -182320 -63900 -264141 -83143 -315359 17327 -72040 114085 89437 127248 91720
10416 91720 -115232 -25265 -349650 -152594 74733 -6111 -129106 -5681 43187 77723 -52205
10404 -61651 -101822 10016 24425 -26894 -141028 -214499 173422 -246300 -14907 281571 -175801
10392 -50239 20397 -162000 -21584 186648 125904 -60742 -107238 -139247 -53542 292825 -66515
10380a03717q573C06353H771a19422B28903B9464c9801A72981P215q64e0504D4029
10367D25323A41950e2106B03005a46172B31578q0642a25497N5659B26480J64339
10357C90819j57454J2104Q9252a75833C88625A52961J09736K20904j54713L15249
10347F44137L8363l40252K32560G2763J32785r219M5237J46329a52328A91177
10336B28552J11985K48869L9637q2398J25768j7098k33233A67775J46298J24956
10326D39029A55538J73931k281K42253j30435l8620f2096G72187b51944E86243
10315a9206o339A86645J56914N3799A73586J95398r4131b5894A89485Q1929H7690
10303B08175n0365J2952J47960j00568n2282F7688m225Q8147b10090d6542H9137
$$ plain form
10380 -103717 -112290 306353 8771 -119422 228903 29464 -39801 172981 180196 179332 -50504 44029
10367 425323 141950 -52106 203005 -146172 231578 150936 -125497 -69838 226480 390819
10357 390819 233365 245469 334721 -175833 388625 152961 262697 483601 328888 644137
10347 644137 682500 342248 574808 72763 205548 196329 241566 387895 -152328 191177
10336 228552 340537 589406 629043 546645 672413 655315 422082 167775 314073 439029
10326 439029 155538 329469 327188 569441 439006 400386 -62096 772187 -251944 586243
10315 -19206 -25545 186645 343559 397358 173586 368984 274853 -25894 189485 271414 87690
10303 208175 157810 170762 318722 218154 165872 67688 63463 151610 -210090 -46542 89137
10291a23668A95589m3494o8487L2885A3412N2262a04440E3151c1146I5654k4685
10280G0969b69463B3707a35033a5544k4578D24853A73386n4103a02002M1549b5171
10268b62312J24808A14119g2322j01591k09282E1278j7793a50724A39073K62157
10258D01230A89J17059Q9392n5743b19760d2135j79290H5382b8598F9828N4558
10247A24386J3876k9163c60987A72568h062E24438B8824L64058j35385j22695
10237A34802k9207O1187k4473i630C7610h3062j88671A05915j3029B1039N9100
10226H0139b5317E4944a65563L5354L0852A3503a75705P2073l0309K6715A13616
10214C10a95513c3685j45523j60321a50190k51045g2585j10142A27611J31424
$$ plain form
10291 -123668 195589 152095 83608 116493 13412 65674 -104440 53151 -31146 95654 70969
10280 70969 -269463 23707 -135033 -15544 -40122 424853 173386 119283 -102002 -60453 -25171
10268 -262312 -137504 114119 -72322 -173913 -383195 51278 33485 -150724 139073 401230
10258 401230 189 117248 206640 150897 -219760 -42135 -221425 85382 -28598 69828 124386
10247 124386 138262 109099 -360987 172568 -8062 524438 28824 392882 257497 134802
10237 134802 105595 166782 142309 -9630 37610 -83062 -271733 105915 92886 21039 80139
10226 80139 -25317 54944 -165563 -130209 -99357 13503 -175705 -103632 -133941 -107226 113616
10214 310 -195513 -33685 -179208 -339529 -150190 -401235 -72585 -182727 127611 259035
10204B59035a4773A53279c24437A51624a30899j89423a6174A4373K3376d31952
10193c85088M0435C9846e9715A60735c03361F3953c49859A07953a57724I8043
10182B0198e4586C9576E450c47719b9828P556j38409A8050b45758A27292a58496
10170a88424R2085L68k86828C49529j65346q5681a11898l9957q168d092B29737
10158c5159k36978J26350o9965P9913A26922a53250I9691R0958F2618D103a158
10146f3679B61862B5000f2107o4251k9664J4710j41451D1399a15787B4965a25592
10134A27214L233a56554A46492A3049c06180G7644c05756g7641o9514p2373D4085
10122a28233k27329A31032a80556k0288A77991k8673K04003b1740j48059A32182
$$ plain form
10204 259035 -14773 153279 -324437 151624 -130899 -320322 -16174 14373 37749 -431952
10193 -385088 -344653 39846 -59715 160735 -303361 63953 -349859 107953 -157724 98043
10182 20198 -54586 39576 5450 -347719 -29828 -22272 -160681 18050 -245758 127292 -158496
10170 -188424 -96339 -95971 -382799 349529 184183 98502 -111898 -151855 -160023 -4092 229737
10158 -35159 -272137 -145787 -215752 -135839 126922 -153250 99691 190649 62618 4103 -1158
10146 -63679 261862 25000 -62107 -126358 -156022 -141312 -282763 41399 -115787 24965 -125592
10134 127214 130447 -156554 146492 13049 -306180 77644 -305756 -77641 -147155 -219528 44085
10122 -128233 -355562 131032 -180556 -200844 177991 149318 353321 -21740 -169799 132182
10111b90538a23369A76518A2756a95985n3723h9585q3680j72693k3440j7788C3799
10099C61557f2345l6730L3431A37637D9596h7008A62254D2632a07463K2325j05808
10088a90946f3094A54069g9762c7294A51164a00480L3802A07128b2736j84994
10078b07730N7374o1877R9561E1000a32298k56028A5062N5060a95364h0357j45663
10067b26020O0059A05520A140J6095c83723b8752F0730A1607K57815a97849J9396
10056a78453d5203j06303o375A15529A8501K84186a62346H2251J42836b97683
10045b67283B71633b44541A39062a14258l95764G0293b44734N5695k30960B80898
10034a28126n47j37755A12889k3180c6611k6528a9888p9803k26252h5332K8206
$$ plain form
10111 -290538 -123369 176518 12756 -195985 -249708 -89585 -173265 -345958 -369398 -387186 33799
10099 361557 -62345 -99075 -65644 137637 49596 -87008 162254 42632 -107463 -85138 -190946
10088 -190946 -63094 154069 -79762 -37294 151164 -100480 -66678 107128 -22736 -207730
10078 -207730 -150356 -212233 -112672 51000 -132298 -388326 15062 70122 -195364 -80357 -226020
10067 -226020 -165961 105520 1140 17235 -383723 -28752 60730 11607 269422 -197849 -178453
10056 -178453 -45203 -151506 -157881 115529 18501 302687 -162346 82251 225087 -297683
10045 -267283 271633 -244541 139062 -114258 -510022 70293 -244734 -189039 -419999 280898
10034 -128126 -128673 -266428 112889 89709 -36611 -63139 -19888 -99691 -325943 -85332 -57126
10023e7126A27470n1371B6419k099a99770F7035B6899a79597j04229j55480H8484
10011B5484b53385J2646J16618A29932Q0436E4084a69037A58920n4091B7252J38701
10000A65953b33411b5007D0579a42617M2560b933j63806P0856d0770E8519j5964
9989D2555A4732b9195j77109h3810p1398l9663A58920a05189d4971r5713M6482
9978i4202j79675B25821A07210r218g9227b5813l23720A39690a68964O8804k04159
9967c04319f4729d542D9143j614b43196J0357F7439O9463b92575J1673j09528
9956c90430a46508l38032a6875E092i3416G2059a43600A78753L0855r6157l0974
9945H2477b30255B16370h455B29000a58188a5957j25184l15354A69136c11020
$$ plain form
10023 -57126 127470 76099 26419 24320 -199770 67035 26899 -179597 -283826 -439306 88484
10011 25484 -253385 -240739 -124121 129932 210368 54084 -169037 158920 104829 27252 165953
10000 165953 -233411 -25007 40579 -142617 -100057 -2933 -166739 -95883 -40770 58519 42555
9989 42555 14732 -29195 -206304 -83810 -155208 -194871 158920 -105189 -44971 -140684 -94202
9978 -94202 -273877 225821 107210 97992 -79227 -25813 -349533 139690 -168964 -100160 -304319
9967 -304319 -64729 -4542 49143 47529 -243196 -232839 67439 136902 -292575 -280902 -390430
9956 -390430 -146508 -484540 -16875 5092 -93416 72059 -143600 178753 209608 113451 82477
9945 82477 -230255 216370 -8455 229000 -158188 -15957 -141141 -456495 169136 -311020
9934A21998A4499b91491M0029K3265a157q8918A63139J14249i1818A01422a77572
9922a29391D9581c901k22107H273c90153B72851H623f9256l26527A04995f018
9910a48123a9863C4914K12940d1919k73411A3441O5485e0228A27110a67893L176
9899a64717j13858P511h6202B57937a56315B96168h1429E3782J62790n8585d6456
9887A07900e1757j396l2208j68271J03073j75882a16825A32458d8748j58690D3341
9875c2038l37703n505O4254a09979l91006A20661b44979B03185K30435h8236A27123
9863A98200h897n3920J6421J8813l1433l3848c2480k31224d015r5303k9360L6003
9851i2675J5621k44728a07953B7467R6045A0520f0721j79424c628k5839m30045
$$ plain form
9934 121998 14499 -291491 -251462 -228197 -1157 -90075 163139 277388 -91818 101422 -177572
9922 -129391 49581 -3901 -226008 8273 -390153 272851 8623 -69256 -395783 104995 -6018
9910 -148123 -19863 34914 247854 -41919 -315330 13441 78926 -50228 127110 -167893 -164717
9899 -164717 -278575 -271064 -86202 257937 -156315 296168 -81429 53782 216572 157987 -46456
9887 107900 -51757 -53153 -85361 -253632 -150559 -326441 -116825 132458 -48748 -207438 43341
9875 -32038 -369741 -375246 -310992 -109979 -500985 120661 -244979 203185 433620 -88236 127123
9863 198200 -8897 -62817 -46396 -27583 -59016 -92864 -32480 -263704 -4015 -99318 -128678 -92675
9851 -92675 -77054 -321782 -107953 27467 123512 10520 -60721 -240145 -3628 -29467 -459512
9840d59512b8775c629j49089G915a67847J0964C53656B6439b72476B3151b58434
9828C4972b07416l7823g6761m83765A95102P3579D6717B3133h6620j73814A40228
9816a3984k28013k5489h4270l8854c4989l2659n0115j9516k62488a69153j440
9805a70593I3004a58461L3976L3354a4143j30694j02234N9429L9747j06226i6441
9793a67252e7288k1921c8602A9059a73236O1056l8449n5960i0311o2115E2630
9781b5977A7568a01025I0907e3878G8898K21889i7711l16797b9331C79150c43830
9769d09948B57277b11731a02899H5327e6577A2101a0169I2809M9119b771k11034
9758b13805D7041a64765I513K29827a92624a6943A48304A6917e3202j42823Q5360
$$ plain form
9840 -459512 -28775 -3629 -152718 7915 -167847 -156883 353656 26439 -272476 23151 -258434
9828 34972 -207416 -245239 -76761 -560526 195102 268681 46717 23133 -86620 -260434 140228
9816 -13984 -241997 -267486 -84270 -123124 -34989 -67648 -117763 -137279 -399767 -169153 -170593
9805 -170593 93004 -158461 -124485 -91131 -14143 -144837 -247071 -187642 -147895 -254121 -96441
9793 -167252 -57288 -79209 -38602 19059 -173236 -112180 -150629 -206589 -90311 -152426 52630
9781 -25977 17568 -101025 90907 -53878 78898 300787 -97711 -414508 -29331 379150 -343830
9769 -409948 257277 -211731 -102899 85327 -56577 12101 -10169 92809 141928 -2771 -213805
9758 -213805 47041 -164765 9513 239340 -192624 -16943 148304 16917 -53202 -196025 -110665
9747a10665A91934c50000F8343b60605R6396j39148N0323B216b60820D7630g4688
9735d64263a71557K2329e7524j53543A3507L2950a72695L2471c6306n5671B9573
9723i6406A60789a16635N1961n012j45227R3661j69885B64878b82483c2474A1014
9711i8823I4504a94912A06552M0001l8776N0267a07971l15669J24386q4457F4583
9699I6249m2979a93806J9560c7880j68161H4061c8730j50710L2987M3763J5301
9688i7389q695A60638B8243c12303k2551a28503j84271A9364b09069c8436l0600
9677f9036g982l22774B73330h4251L0353k90908i9165m5018O7657E7353e3950
9665a03482A46688i9607B5942c89034f1801j797A57804d68996D6235a97273O9275
$$ plain form
9747 -110665 191934 -350000 68343 -260605 -164209 -303357 -253034 2216 -260820 47630 -74688
9735 -464263 -171557 -149228 -57524 -211067 13507 46457 -172695 -140224 -36306 -91977 29573
9723 -96406 160789 -116635 -64674 -69686 -214913 -121252 -291137 264878 -282483 -32474 11014
9711 -98823 94504 -194912 106552 146553 107777 158044 -107971 -423640 -299254 -383711 64583
9699 96249 53270 -193806 -174246 -37880 -206041 84061 -38730 -189440 -156453 -112690 -97389
9688 -97389 -106084 160638 28243 -312303 -334854 -128503 -312774 19364 -209069 -38436 -69036
9677 -69036 -7982 -330756 273330 -84251 -53898 -344806 -99165 -144183 -76526 57353 -53950
9665 -103482 146688 -99607 25942 -389034 -61801 -63598 157804 -468996 46235 -197273 -127998
9654a27998A5452L1582M3862a04300A19330J58151B8818L789a9583F8419k7042
9643D1377J10394h3897A5926b85742P2651K0483E3761a63097A69468a88009b5044
9631d653A85386r2123R9591B2490L9572a88303A2548Q9124c43208p818a64464
9619e55646A79628m0699a56504k38086F6751a03003l64265B13524D5217J2826
9609E8043h1691I3255l4792a23841A94787B1854a41465j32553F4040a72160E6275
9597A74165G2651K8212a79607c6151J2104l26455C0119a67554B08410G1507a03388
9585c24981E7534i1760E4216K7481L4997e4601B11876H368b36886J11642k151
9574a27395J8817o5799F7689e65183b3199k80367h9656j16112M1501K1732F0128
$$ plain form
9654 -127998 15452 47034 90896 -104300 119330 277481 28818 32607 -19583 68419 41377
9643 41377 151771 -83897 15926 -285742 -213091 -192608 53761 -163097 169468 -188009 -25044
9631 -4653 185386 93263 192854 22490 62062 -188303 12548 101672 -343208 -351026 -164464
9619 -555646 179628 138929 -156504 -394590 66751 -103003 -467268 213524 45217 58043
9609 58043 -81691 93255 58463 -123841 194787 21854 -141465 -274018 64040 -172160 56275
9597 174165 72651 100863 -179607 -36151 -24047 -350502 30119 -167554 208410 71507 -103388
9585 -324981 57534 -91760 54216 81697 116694 -54601 211876 8368 -236886 -125244 -127395
9574 -127395 -108578 -174377 67689 -565183 -23199 -303566 -89656 -205768 -164267 -142535 60128
9562i5541r2493k03457i8685j9699b2869I4428k4382g5315j16819A5920a94319
9550a5836k25063J04276E3701b6816j22555l4359k9681F7376c59464B9009b7622
9538a63874l9382E0318c98137F8474K022K3425d512k45573e1967j2155j89309
9527b53431D1132f6839A64758M1138b21902i0554b4090k8417k7952G1765a84734
9515a52079k4507I3637g4081c1178D1682b081p585k63060B7267J14855M9214a2843
9502c2962B14498o0194a7876j98869k02421B9614c69012A12831c87621J89391
9492a98230O8624h578j00976n0370B81502f4265j28379E2054i0333A20960c39157
9480D77089I8162a46164H6672J89879c3198j40613b3560k675j82879a1356A82034
$$ plain form
9562 -95541 -188034 -391491 -98685 -118384 -22869 94428 70046 -75315 -192134 15920 -194319
9550 -15836 -240899 -136623 53701 -26816 -149371 -183730 -213411 67376 -359464 29009 -27622
9538 -163874 -203256 50318 -398137 68474 70496 93921 -4512 -250085 -51967 -64122 -253431
9527 -253431 41132 -66839 164758 205896 -221902 -90554 -24090 -52507 -80459 71765 -184734
9515 -152079 -176586 93637 -74081 -31178 41682 -2081 -9666 -272726 27267 142122 191336 -12843
9502 -32962 214498 154304 -17876 -216745 -419166 29614 -369012 112831 -387621 -198230
9492 -198230 -129606 -8578 -109554 -159924 281502 -64265 -192644 52054 -90333 120960 -339157
9480 477089 98162 -146164 86672 276551 -33198 -173811 -23560 -26235 -209114 -11356 182034
9468A29371b5772k09501O7149A00328C7332d18613J35172L0364d4218k70937A75092
9456d19153A55830b6750H1609b10857C9531L544m154K6327a38672A10454a5918
9444a15485j86014i47B33473a64266r207d5890A68360G7264i7560B437b99307
9432c44006a43113B57000d2390A85514b15594C7477A3251b38276j089b0073j35175
9421a55248e7312j29969o5896J16429a8955B89561a45849B4026F808L31405a15134
9409e9571k2341J1555k7370k3566A26027d0890k33431G6989f1764o4214A49927
9397b93736a05301a3108B5013e2527A05467k9128M290b3005I0307a65546d5796
9385a42769E8778g599j24090A35405E6117a65400J3445e9171F04a08599b0599
$$ plain form
9468 129371 -25772 -235273 -168124 100328 37332 -418613 -283441 -253077 -44218 -315155 175092
9456 -419153 155830 -26750 81609 -210857 39531 43075 38921 65248 -138672 110454 -15918
9444 -115485 -301499 -947 233473 -164266 -173473 -45890 168360 77264 -97560 2437 -299307
9432 -344006 -143113 257000 -42390 185514 -215594 37477 13251 -238276 -239365 -20073 -155248
9421 -155248 -57312 -187281 -253177 -136748 -18955 289561 -145849 24026 6808 338213 -115134
9409 -59571 -81912 -70357 -97727 -121293 126027 -40890 -274321 76989 -61764 -125978 149927
9397 -293736 -105301 -13108 25013 -52527 105467 76339 80629 -23005 90307 -165546 -45796
9385 -142769 58778 -7599 -131689 135405 56117 -165400 -151955 -59171 604 -108599 -20599
9373h5285E6235a34417M7911I1693c17648M8026C8964b53892h4975R552C4269
9361b4110j55570G4481O4948J98754b80513i3291c8454k6823j10064P7332j10378
9350b08387H6278j8631M2761b0479j54414k31570i5692H751b56347j47157d9612
9338i9419C8118J2714b07034D3470M6863g0967n5350B71791b09042E8931b03376
9326e0466B1885n379b94352A77576H5368a9200k27593a05173j01088d0101j7913
9315e8014A1045d1624F5822E955a2554B66444a62256B42495E7766h2306a8329
9303b84920a19789l7942A19023b9603m3904j26711G2659a39527j66353b3827J1188
9292a2639D6013K18068D7335a81644j70258E7149F359J1217R7027k6323e23539
$$ plain form
9373 -85285 56235 -134417 -86506 91693 -317648 -269622 38964 -253892 -84975 -75423 34269
9361 -24110 -179680 74481 139429 338183 -280513 -93291 -38454 -65277 -175341 -98009 -208387
9350 -208387 86278 67647 110408 -20479 -174893 -406463 -95692 8751 -256347 -403504 -49612
9338 -99419 38118 50832 -207034 43470 90333 -70967 -126317 271791 -209042 58931 -203376
9326 -50466 21885 16506 -294352 177576 85368 -19200 -246793 -105173 -206261 -40101 -58014
9315 -58014 11045 -41624 65822 5955 -12554 266444 -162256 242495 57766 -82306 -18329
9303 -284920 -119789 -157731 119023 -29603 -73507 -200218 72659 -139527 -305880 -23827 -12639
9292 -12639 46013 264081 47335 -181644 -351902 57149 6359 17576 114603 88280 -523539
9280C8521b12064J8612b7513B20420F2478J5062e3100l43606A05582b66386J31524
9269a34862a3838j54991M1922B48338H7394b37258J02731D566N2969a28911A01830
9257c54258m173J12781B06727a31567M6272L68j81643g1145k25379O6632J10427
9246a19465l7396j9757A15412a85902f3416A56433P8925b9341A08390f9198A38696
9234b66208K8883i6198A39458a25952k41457A60059h9542C328f5161k4717d3256
9222b7722n12311a55709A04918J92b1238C4475b44768J09497k48909J6268J59106
9211b08806c7942G6470b60853a01423A53124l024b05226K7855E8569g1266k58760
9200c30026m7224a3248I5133c9275j56590j86780C3391a30545C23653c05730A74458
$$ plain form
9280 38521 -212064 -193452 -27513 220420 62478 77540 -53100 -396706 105582 -266386 -134862
9269 -134862 -13838 -168829 -126907 248338 87394 -237258 -134527 4566 57535 -128911 101830
9257 -354258 -358431 -245650 206727 -131567 -85295 -84927 -266570 -71145 -296524 -229892 -119465
9246 -119465 -156861 -176618 115412 -185902 -63416 156433 235358 -29341 108390 -69198 138696
9234 -266208 -237325 -96198 139458 -125952 -367409 160059 -89542 3328 -65161 -89878 -43256
9222 -27722 -540033 -155709 104918 105110 -21238 34475 -244768 -135271 -384180 -367912 -208806
9211 -208806 -37942 76470 -260853 -101423 153124 150100 -205226 -177371 58569 -71266 -330026
9200 -330026 -377250 -13248 95133 -39275 -195865 -382645 33391 -130545 323653 -305730 174458
9188b95701a02198B29285a20180B81217l9122b21328f3059C39443b76286J32275
9178a44011j00050N3293F4580N5402a43845Q754A84033g0821A70670a73956A60300
9166C1666h0888G2365k9580I488b39844A80389R498G037b67793R1231O2793d9904
9153B22313a11151A20870b44774e717I8258a55610B59121a34285f3787A66964
9142a8414j67383b7421l80471E8387a36996K6691B7443Q0703E760i4902m45903
9131e40805F7165f162C5112a97962A0008b40344I047b72687f6810a6590q3238
9120i9828a9810C30312p5291d11381f24j51654A61509a70144C5558a69602j0885
9109a80487k96148A05695c23174a42891B87341A15685b88964i4667j84495a4030
$$ plain form
9188 -295701 -102198 229285 -120180 281217 242095 -221328 -63059 339443 -276286 -144011
9178 -144011 -244061 -190768 64580 119982 -143845 -135091 184033 -70821 170670 -173956 160300
9166 31666 -80888 72365 42785 9488 -239844 180389 189887 7037 -267793 -176562 -113769 -49904
9153 222313 -111151 120870 -244774 -5717 98258 -155610 259121 -134285 -63787 166964
9142 -18414 -185797 -27421 -407892 58387 -136996 -110305 27443 108146 5760 -94902 -540805
9131 -540805 67165 -6162 35112 -197962 10008 -240344 9047 -272687 -66810 -16590 -99828
9120 -99828 -19810 330312 255021 -411381 -624 -152278 161509 -170144 35558 -169602 -180487
9109 -180487 -476635 105695 -323174 -142891 287341 115685 -288964 -94667 -279162 -14030
9098a32070M4751G9050L18940b086B432a03006m8645o0289k26400C4747e2553
9086c27804C22016i0498I6930a93800A71425p71e6298G8147M2953a00040A01701
9074i8314d1051m0761A27385K6441a53583M8978c0292j0815E3158b07801n7890
9063b65691A7400O1185c02694A06321a97229A59088g882B3813K4702b50437A19390
9051A07767k5600D334K23982b90123I3501C0280P3389I515a47180j93041e54o4117
9039f4671j0069l02501J65832c8721A1109a0868A06979o665a24361b3120o3539
9028h6659b5226p9972j4748k8222F9990a25507m242B61208d91552D8214b46795
9016i7360j09057i3711K5013j23280I1301J18778c25072h352D441K6939f9054
$$ plain form
9098 -132070 -87319 79050 397990 -2086 2432 -103006 -151651 -211940 -438340 34747 -52553
9086 -327804 322016 -90498 96930 -193800 171425 170654 -56298 78147 121100 -100040 101701
9074 -98314 -41051 -81812 127385 153826 -153583 -104605 -30292 -41107 53158 -207801 -265691
9063 -265691 17400 78585 -302694 106321 -197229 159088 -7882 23813 48515 -250437 119390
9051 107767 82167 4334 228316 -290123 93501 30280 103669 9515 -147180 -340221 -554 -64671
9039 -64671 -74740 -377241 -211409 -38721 11109 -10868 106979 100314 -124361 -23120 -86659
9028 -86659 -25226 -105198 -119946 -148168 69990 -125507 -129749 261208 -491552 48214 -246795
9016 -97360 -206417 -93711 -68698 -191978 91301 210079 -325072 -8352 4441 31380 -69054
9004I7779a83147P9655M6305b7220B28416l4591O4682c10986a8992q6473K2821
8993h2644H1547J68348C3296c36632D738J84478P9341b98488R2204J01436A79525
8981A61997a27918B75910i944r9591G6572g7985m27099d1912p8503E317a19979
8969a16449m0125j3096O9502i131j42772N4230k31201a0546j30721j52062e2202
8957A11346j0270b790j8861r1704B66852d08544a50596j28204B7154b6986B88163
8945c79105K7113A55530j9853i1216a7521l49460J44647A6091P6011A1801J5047
8934B6848p344N9221c46087a653B15813c86234r4393H3664J80355A03720a23113
8922D8842a93246P4325E1078i0866A98114m7307K16071b08228r894f2811A33402
$$ plain form
9004 97779 -183147 -103492 -57187 -27220 228416 193825 258507 -310986 -18992 -105465 -82644
8993 -82644 81547 249895 33296 -336632 4738 189216 268557 -298488 -206284 -104848 179525
8981 161997 -127918 275910 -9944 -109535 76572 -77985 -505084 -41912 -120415 5317 -119979
8969 -116449 -156574 -169670 -100168 -9131 -151903 -97673 -328874 -10546 -141267 -293329 -52202
8957 111346 101076 -2790 -21651 -113355 266852 -408544 -150596 -278800 27154 -26986 288163
8945 -379105 -351992 155530 135677 -91216 -17521 -366981 -222334 16091 92102 11801 26848
8934 26848 19504 78725 -346087 -1653 215813 -386234 -480627 83664 264019 103720 -123113
8922 48842 -193246 -118921 51078 -90866 198114 150807 366878 -208228 -218122 -62811 133402
8910A41069P0334J91573K03295P6998N97434J149931K951282j297676j888816
8901B195424H20400A71020M18182j80311A85680a37424a261A43382a96245A71715
8890A45819b61859H6781k5178b58573k9909E3282b31721h2952j90662J566a1491
8878A19863D7941b49885c5849H8710J1819c33636f3288B4668J80312c46480m8831
8867c95311a20390B6252A2999b18218A19458b91987A44479D0849p944J19109k8708
$$ plain form
8910 141069 211403 402976 606271 683269 1280703 2430634 5381916 4084240 2195424
8901 2195424 820400 171020 589202 408891 185680 -137424 -1261 143382 -196245 171715
8890 145819 -261859 86781 61603 -258573 -288482 53282 -231721 -82952 -273614 -272048 -11491
8878 119863 47941 -249885 -35849 88710 100529 -333636 -63288 24668 204980 -346480 -395311
8867 -395311 -120390 26252 12999 -218218 119458 -291987 144479 40849 32905 152014 123306
$$ [...]
##END NTUPLES=NMR SPECTRUM
##END=
