
##TITLE=AC1109_Colombia_5835779_yvp2IzYgP9
##JCAMPDX= 6.0         $$ Bruker NMR JCAMP-DX V2.0
##DATA TYPE= NMR SPECTRUM
##DATA CLASS= NTUPLES
##ORIGIN= BRUKER
##OWNER= Administrator
$$ 1.72 TOPSPIN		Version 2.1
$$ 2012-03-28 11:05:07.937 -0500  Administrator@TOPSPIN
$$ Compression mode = diff/dup
##.OBSERVE FREQUENCY= 400.13188235
##.OBSERVE NUCLEUS= ^1H
##.ACQUISITION MODE= SIMULTANEOUS (DQD)
##.ACQUISITION SCHEME= undefined
##.AVERAGES= 8
##.DIGITISER RES= 22
##SPECTROMETER/DATA SYSTEM= spect
##.PULSE SEQUENCE= zg30
##.SOLVENT NAME= COFFEE_meoh
##.SHIFT REFERENCE= INTERNAL, COFFEE_meoh, 1, 14.98061
##AUDIT TRAIL= $$ (NUMBER, WHEN, WHO, WHERE, PROCESS, VERSION, WHAT)
$$ ##TITLE= Audit trail, TOPSPIN		Version 2.1
$$ ##JCAMPDX= 5.01
$$ ##ORIGIN= Bruker BioSpin GmbH
$$ ##OWNER= Administrator
$$ $$ C:\Bruker\TOPSPIN/data/COFFEE/nmr/AC1109_Colombia_5835779_yvp2IzYgP9/20/pdata/1/auditp.txt
$$ ##AUDIT TRAIL=  $$ (NUMBER, WHEN, WHO, WHERE, PROCESS, VERSION, WHAT)
(   1,<2012-03-27 20:08:02.468 -0500>,<Administrator>,<TOPSPIN>,<go>,<TOPSPIN 2.1>,
      <created by zg
	started at 2012-03-27 20:06:55.640 -0500,
	POWCHK enabled, PULCHK disabled,
       configuration hash MD5:
       1A 1E CE 29 27 FD 77 03 67 4E F0 E3 C4 B2 CB 90
       data hash MD5: 64K
       59 A7 D2 83 C8 9E FD 46 74 8D F8 4C F7 71 61 61>)
(   2,<2012-03-27 20:08:05.750 -0500>,<Administrator>,<TOPSPIN>,<proc1d>,<TOPSPIN 2.1>,
      <Start of raw data processing
       efp LB = 0 FT_mod = 6 PKNL = 1 PHC0 = 0 PHC1 = 0 SI = 32K 
       data hash MD5: 32K
       1B 02 7A 54 B6 4C B2 F6 47 F8 CB 60 72 5C 89 4E>)
(   3,<2012-03-27 20:08:06.218 -0500>,<Administrator>,<TOPSPIN>,<proc1d>,<TOPSPIN 2.1>,
      <pk PHC0 = 216.535 PHC1 = 0 
       data hash MD5: 32K
       50 DD 19 77 41 CA 9A D5 71 C2 40 63 FF F1 B2 65>)
(   4,<2012-03-27 20:08:06.578 -0500>,<Administrator>,<TOPSPIN>,<proc1d>,<TOPSPIN 2.1>,
      <abs ABSG = 1 
       data hash MD5: 32K
       75 4E 2C 79 FA 29 3A 5A 77 83 6E F3 8E F5 AD 5B>)
(   5,<2012-03-27 20:08:06.671 -0500>,<Administrator>,<TOPSPIN>,<proc1d>,<TOPSPIN 2.1>,
      <abs ABSG = 2 
       data hash MD5: 32K
       97 26 17 F0 01 AD 88 29 5E B9 8D 4B 77 F8 6D D9>)
(   6,<2012-03-27 20:08:06.968 -0500>,<Administrator>,<TOPSPIN>,<proc1d>,<TOPSPIN 2.1>,
      <abs ABSG = 3 
       data hash MD5: 32K
       68 65 24 F9 88 7B 31 F8 E3 E6 1C 9D 75 84 2A 71>)
(   7,<2012-03-27 20:08:07.078 -0500>,<Administrator>,<TOPSPIN>,<proc1d>,<TOPSPIN 2.1>,
      <abs ABSG = 4 
       data hash MD5: 32K
       97 FF 88 18 91 4C AC 0C AC 3C A3 A8 DE 31 6B EF>)
(   8,<2012-03-27 20:08:07.343 -0500>,<Administrator>,<TOPSPIN>,<proc1d>,<TOPSPIN 2.1>,
      <abs ABSG = 5 
       data hash MD5: 32K
       42 B1 D0 88 DD E9 FC 7C EE FE 79 B1 70 39 6D BE>)
(   9,<2012-03-27 20:08:12.140 -0500>,<Administrator>,<TOPSPIN>,<audit>,<TOPSPIN 2.1>,
      <user comment:
       ICON-NMR User ID: COFFEE
       data hash MD5: 32K
       42 B1 D0 88 DD E9 FC 7C EE FE 79 B1 70 39 6D BE>)
$$ [...]
##$TP= (0..7)
150 150 150 150 150 150 150 150
##$TP07= 0
##$TPNAME0= <>
##$TPNAME1= <>
##$TPNAME2= <>
##$TPNAME3= <>
##$TPNAME4= <>
##$TPNAME5= <>
##$TPNAME6= <>
##$TPNAME7= <>
##$TPOAL= (0..7)
0.5 0.5 0.5 0.5 0.5 0.5 0.5 0.5
##$TPOFFS= (0..7)
0 0 0 0 0 0 0 0
##$TUNHIN= 0
##$TUNHOUT= 0
##$TUNXOUT= 0
##$USERA1= <user>
##$USERA2= <user>
##$USERA3= <user>
##$USERA4= <user>
##$USERA5= <user>
##$V9= 5
##$VALIST= <valist>
##$VCLIST= <CCCCCCCCCCCCCCC>
##$VD= 0
##$VDLIST= <DDDDDDDDDDDDDDD>
##$VPLIST= <PPPPPPPPPPPPPPP>
##$VTLIST= <TTTTTTTTTTTTTTT>
##$WBST= 2048
##$WBSW= 25
##$XGAIN= (0..3)
0 0 0 0
##$XL= 0
##$YL= 0
##$YMAX_a= 522759
##$YMIN_a= -621316
##$ZGOPTNS= <>
##$ZL1= 120
##$ZL2= 120
##$ZL3= 120
##$ZL4= 120
##$ABSF1= 14.98061
##$ABSF2= -5.57192
##$ABSG= 5
##$ABSL= 3
##$ALPHA= 0
##$AQORDER= 0
##$ASSFAC= 0
##$ASSFACI= 0
##$ASSFACX= 0
##$ASSWID= 0
##$AUNMP= <proc_prof1d_extract_pilot.lims>
##$AXLEFT= 0
##$AXNAME= <>
##$AXNUC= <1H>
##$AXRIGHT= 0
##$AXTYPE= 0
##$AXUNIT= <>
##$AZFE= 0.1
##$AZFW= 0.1
##$BCFW= 0
##$BC_mod= 0
##$BYTORDP= 0
##$COROFFS= 0
##$CY= 15
##$DATMOD= 1
##$DC= 0
##$DFILT= <>
##$DTYPP= 0
##$F1P= 0
##$F2P= 0
##$FCOR= 0.5
##$FTSIZE= 32768
##$FT_mod= 6
##$GAMMA= 0
##$GB= 0
##$INTBC= 1
##$INTSCL= 1
##$ISEN= 128
##$LB= 0
##$LEV0= 0
##$LPBIN= 0
##$MAXI= 10000
##$MC2= 0
##$MEAN= 0
##$ME_mod= 0
##$MI= 0
##$NCOEF= 0
##$NC_proc= -8
##$NLEV= 6
##$NOISF1= 0
##$NOISF2= 0
##$NSP= 0
##$NTH_PI= 0
##$NZP= 0
##$OFFSET= 14.98061
##$PC= 1
##$PHC0= 216.535
##$PHC1= 0
##$PH_mod= 1
##$PKNL= yes
##$PPARMOD= 0
##$PPDIAG= 0
##$PPIPTYP= 0
##$PPMPNUM= 2147483647
##$PPRESOL= 1
##$PSCAL= 4
##$PSIGN= 0
##$PYNMP= <proc.py>
##$REVERSE= no
##$SF= 400.13
##$SI= 32768
##$SIGF1= 0
##$SIGF2= 0
##$SINO= 400
##$SIOLD= 32768
##$SPECTYP= <>
##$SREGLST= <1H.CDCl3>
##$SSB= 0
##$STSI= 32768
##$STSR= 0
##$SW_p= 8223.68421052632
##$SYMM= 0
##$S_DEV= 0
##$TDeff= 65536
##$TDoff= 0
##$TI= <>
##$TILT= no
##$TM1= 0
##$TM2= 0
##$TOPLEV= 0
##$USERP1= <user>
##$USERP2= <user>
##$USERP3= <user>
##$USERP4= <user>
##$USERP5= <user>
##$WDW= 1
##$XDIM= 32768
##$YMAX_p= 459124951
##$YMIN_p= -714527
##$CURPLOT= <Network HP LaserJet P1505>
##$CURPRIN= <$Network HP LaserJet P1505>
##$DFORMAT= <normdp>
##$LAYOUT= <+/1D_H.xwp>
##$LFORMAT= <normlp>
##$PFORMAT= <normpl>
##$SURQMSG= 1
$$ End of Bruker specific parameters
$$ ---------------------------------
##NTUPLES= NMR SPECTRUM
##VAR_NAME=  FREQUENCY,     SPECTRUM/REAL,   SPECTRUM/IMAG
##SYMBOL=    X,             R,               I
##VAR_TYPE=  INDEPENDENT,   DEPENDENT,       DEPENDENT
##VAR_FORM=  AFFN,          ASDF,            ASDF
##VAR_DIM=   32768,         32768,           32768
##UNITS=     HZ,            ARBITRARY UNITS, ARBITRARY UNITS
##FACTOR=    0.250966925370066, 1,           1
##FIRST=     8223.43324360095, -4135,        -30700
##LAST=      0,             -1895,           4461
##MIN=       0,             -714527,         0
##MAX=       8223.43324360095, 459124951,    0
$$ Real data points
##PAGE= N=1
##DATA TABLE= (X++(R..R)), XYDATA
$$ [...]
19501c53552O4177F5035d6980j09642B01451A6106P7647a09562A42965b87748
$$ -353552 -289375 65035 -46980 -156622 201451 16106 93753 -109562 142965 -287748
19490a90666F0153f5148l6043J6783A62309j1865E8264a35529H0575a72091A86308
$$ -190666 60153 -65148 -101191 -84408 162309 150444 58264 -135529 80575 -172091 186308
19478a98010A05205a42655f000B05579H8795b00488A61597R5197c19912B19097
$$ -198010 105205 -142655 -6000 205579 88795 -200488 161597 256794 -319912 219097
19467D20505c91133d1853j63012g6802q5532B19730A5210b47725B10406h6720
$$ 420505 -391133 -41853 -204865 -76802 -162334 219730 15210 -247725 210406 -86720
19456B3287e102l17250a4435B1980d15410F7504a4662q5892j7234A42359e0325
$$ 23287 -5102 -322352 -14435 21980 -415410 67504 -14662 -100554 -117788 142359 -50325
19444f7029L2432A11274m277i0670j96349J14981B3529a04127M7761k58852B03125
$$ -67029 -34597 111274 106997 -90670 -287019 -172038 23529 -104127 -56366 -315218 203125
19432g0870a298k00268A44451a55495k8529b2924A45531a18472e1524n5148B40728
$$ -70870 -1298 -201566 144451 -155495 -184024 -22924 145531 -118472 -51524 -106672 240728
19420a3973k76250g5927A08015b6736k53646A461c0643j65475c7789l11r960n7194
$$ -13973 -290223 -75927 108015 -26736 -280382 1461 -30643 -196118 -37789 -38100 -48060 -105254
19408a05254J9514k97060a06100A81428d6809Q512l01703a26850a8405A55738
$$ -105254 -85740 -382800 -106100 181428 -46809 -38297 -340000 -126850 -18405 155738
19397a34153e3762a9968k01317j83063J69659j53954a62251c7809A79987a88775
$$ -134153 -53762 -19968 -221285 -404348 -234689 -388643 -162251 -37809 179987 -188775
19386A53268R6076l8438a43824o5680g9993L5974l19520J41926e3215I1758i1910
$$ 153268 249344 210906 -143824 -209504 -79993 -44019 -363539 -221613 -53215 91758 -91910
19374I7125l1339a9969A4418b57359j33186a95098f6780L1189A00432H72J45295
$$ 97125 65786 -19969 14418 -257359 -390545 -195098 -66780 -35591 100432 872 146167
19363A46167o2116a03301k08948a15078l35111E8655L7173a32086C240o87b09868
$$ 146167 84051 -103301 -312249 -115078 -450189 58655 95828 -132086 3240 2553 -209868
19351E4231a02532J75l51021D6142e2649A7931a16636A13967J0384e1689a3649
$$ 54231 -102532 -102357 -453378 46142 -52649 17931 -116636 113967 124351 -51689 -13649
19339f6120A52666a70691D556P6335d38541f4890b0403j93930j2351B02979a47800
$$ -66120 152666 -170691 4556 80891 -438541 -64890 -20403 -214333 -226684 202979 -147800
19327b12379d8327j48848O5839G4460R1793H682a18807A66414n1001K45803E2547
$$ -212379 -48327 -197175 -131336 74460 166253 8682 -118807 166414 115413 361216 52547
19315a93362c7929A16094a72874d1650k13978d0298m1050o7137D7385d39541C9545
$$ -193362 -37929 116094 -172874 -41650 -255628 -40298 -81348 -148485 47385 -439541 39545
19303a22994D3076c3048n9149j4889A95373c01338A98499I1929A4425c68461a28446
$$ -122994 43076 -33048 -92197 -107086 195373 -301338 198499 91929 14425 -368461 -128446
19291A20832b41451J06271n0208h0632j32676A9007F464a07052C3832K8368d78664
$$ 120832 -241451 -135180 -185388 -80632 -213308 19007 6464 -107052 33832 62200 -478664
19279E6437f8466j55140e0034q6674q9560a05520K6796R73A60950e0030M985j3762
$$ 56437 -68466 -223606 -50034 -136708 -226268 -105520 -78724 -77751 160950 -50030 -45045 -58807
19267e8807J7592j60468d9375C12169A02443C9129d6692o5757j76273a07179r3969
$$ -58807 -41215 -201683 -49375 312169 102443 39129 -46692 -112449 -288722 -107179 -201148
19256b01148A77173m7936L9218d5034j23327q8486g2165J7735M429J0536D004
$$ -201148 177173 129237 168455 -45034 -168361 -256847 -72165 -54430 -50001 -39465 4004
19244b18889j31070a47262d4881k41050M8332M91L918a03263m0576j30051D5872
$$ -218889 -349959 -147262 -44881 -285931 -237599 -237108 -233190 -103263 -143839 -273890 45872
19232B1681a74759N3383A77989A4902a66018e2173I9834c16690C4590b91197A3142
$$ 21681 -174759 -121376 177989 14902 -166018 -52173 99834 -316690 34590 -291197 13142
19220D8987Q5684K7050a39255K6544D9656a33391i834l57577B13630l0745a98130
$$ 48987 134671 161721 -139255 -112711 49656 -133391 -9834 -367411 213630 182885 -198130
19208b48492a9600B56936b06245B55500f6186c2459k11689f4728K4473j63120
$$ -248492 -19600 256936 -206245 255500 -66186 -32459 -244148 -64728 -40255 -203375
19198b03375K2507E0862M8207M17901a46058m5830C95a74582F7236K77922f5975
$$ -203375 -180868 50862 99069 516970 -146058 -191888 395 -174582 67236 345158 -65975
19186D3070a77487C3668a98455c389j15853k05687J10885M4116K0209j88013L4644
$$ 43070 -177487 33668 -198455 -3389 -119242 -324929 -214044 -169928 -149719 -337732 -303088
19175c03088E2737C389b05794B14545e5924k00458A72191b32086d2997k1155k68499
$$ -303088 52737 3389 -205794 214545 -55924 -256382 172191 -232086 -42997 -64152 -332651
19164c32651A08268b38101f2057p5266K225A4231b0988A66816J35551a87718d975
$$ -332651 108268 -238101 -62057 -137323 -135098 14231 -20988 166816 302367 -187718 -4975
19152a73227B32186H5187f6887A16741b49128N1052h6382K7223A0955b4088H5650
$$ -173227 232186 85187 -66887 116741 -249128 -198076 -86382 -59159 10955 -24088 85650
19140g401H13d5564B35306I2493b52661A65066a74401c3792C09299i8206j35F7432
$$ -7401 813 -45564 235306 92493 -252661 165066 -174401 -33792 309299 -98206 -98341 67432
19127a01317J8484k11404A06832L11816I728b18623N2587B3468a31497j07705
$$ -101317 -82833 -294237 106832 418648 9728 -218623 -166036 23468 -131497 -239202
19117b39202E8543B373N7805a13427o9126f7862m1634j9902O2810C4260J3448
$$ -239202 58543 2373 60178 -113427 -182553 -67862 -109496 -129398 -66588 34260 47708
19106D7708B0643a21080j49264I6470N7127d6621k97800A93506l4171F7139i9214
$$ 47708 20643 -121080 -270344 96470 153597 -46621 -344421 193506 159335 67139 -99214
19094C77781a9659p5600j90481Q5950e333l22126E5674a2425C00925b56346B4338
$$ 377781 -19659 -95259 -285740 -199790 -5333 -327459 55674 -12425 300925 -256346 24338
19082a95368B22157a26198k35441A65284c7479j22625C02808f5878n7135a6514
$$ -195368 222157 -126198 -361639 165284 -37479 -160104 302808 -65878 -123013 -16514
19071B19930b761B958L52237a25952k71884B0573J26430F7223L10769e8632A44181
$$ 219930 -2761 2958 355195 -125952 -397836 20573 147003 67223 377992 -58632 144181
19059B54025G3192f4117I7834a2638C5289O5709K6063J41147A5706b65946C19275
$$ 254025 73192 -64117 97834 -12638 35289 100998 127061 268208 15706 -265946 319275
19047F0036k872a43763f363j78076b0409G8853a87854E8736a58024D5757M2915
$$ 60036 57164 -143763 -6363 -184439 -20409 78853 -187854 58736 -158024 45757 88672
19036H8672b50022m5520P9519R1484A38716b03528J2233j69839B06647a22397
$$ 88672 -250022 -295542 -216023 -124539 138716 -203528 -191295 -361134 206647 -122397
19025b36908A61439k4464c11720e148j97806A80153d1420A37652F540a63262j1609
$$ -236908 161439 136975 -311720 -5148 -202954 180153 -41420 137652 6540 -163262 -174871
19014a74871h1942j00396B97741a49398K4156N5371D43005D2533f2707E5936c80570
$$ -174871 -81942 -182338 297741 -149398 -125242 -69871 443005 42533 -62707 55936 -380570
19002a72861K633E4871b37618d9822k5193K919B961a17787N3287m6954N1175E5829
$$ -172861 -170228 54871 -237618 -49822 -75015 -72096 2961 -117787 -64500 -111454 -60279 55829
18989A48328o4249a95091b3558a0385c228j41944j56633c5449C676b79393g4088
$$ 148328 84079 -195091 -23558 -10385 -3228 -145172 -301805 -35449 3676 -279393 -74088
18977e0531m9108m7094O4404j94112j989A2076b88060a32718A52226F7031b40291
$$ -50531 -99639 -146733 -82329 -276441 -278430 12076 -288060 -132718 152226 67031 -240291
18965D2411a11677A73025d33051a48738A99849a1246B9415J84694L92532B50444
$$ 42411 -111677 173025 -433051 -148738 199849 -11246 29415 214109 606641 250444
18954e6244A77642N5O4790g8930A145a36904k78790E5023a65924j07853a14645
$$ -56244 177642 177697 242487 -78930 1145 -136904 -415694 55023 -165924 -273777 -114645
18942c79297G2016d8835j49598C8111d0955B38269a52979G4048C3467d14478B1820
$$ -379297 72016 -48835 -198433 38111 -40955 238269 -152979 74048 33467 -414478 21820
18930F7262a87123N4173E9614k3885b00629A63294H687J11406K99124a38419b078
$$ 67262 -187123 -132950 59614 35729 -200629 163294 8687 120093 419217 -138419 -2078
18918G9688k798a22463D2705b5378j58728B70838A34951b09531D5529e16228a58770
$$ 79688 76890 -122463 42705 -25378 -184106 270838 134951 -209531 45529 -516228 -158770
18906D2354N5013a460C45820a56027D7602K67646b82983a09820C0623b2989q0592
$$ 42354 97367 -1460 345820 -156027 47602 315248 -282983 -109820 30623 -22989 -103581
18895a03581E6633K27191K68880G9048K51711j24199a10966j47090D6046M3250
$$ -103581 56633 283824 552704 79048 330759 206560 -110966 -258056 46046 89296
18885H9296a18619o0675k58347I3963a02664j65j41175J3107g8306q5365k2467
$$ 89296 -118619 -179294 -437641 93963 -102664 -102829 -244004 -230897 -78306 -163671 -186138
18874a86138D24b07991k0511A44735E7495K3003d9122b3918p2950B00227f4703
$$ -186138 424 -207991 -228502 144735 57495 80498 -49122 -23918 -96868 200227 -64703
18862b1174B22690a07624l82747a37343O66j47615o2593H5396a68048e6774j28626
$$ -21174 222690 -107624 -490371 -137343 -136677 -284292 -346885 85396 -168048 -56774 -185400
18851a85400P6960K3871j09919A56024o0349b83329B08986A00572b98957P0460
$$ -185400 -108440 -84569 -194488 156024 95675 -283329 208986 100572 -298957 -228497
18841b28497I3649b08331b1280A8452c9634D44891a95514A27957D6652a62072
$$ -228497 93649 -208331 -21280 18452 -39634 444891 -195514 127957 46652 -162072
18830A5866N4881N9330C7190b17428i0779F081b6087j19166i838j07939C37299
$$ 15866 70747 130077 37190 -217428 -90779 6081 -26087 -145253 -9838 -117777 337299
18818A126a76641K0722G763a96326F3590J06044r427b28253n1930E2383N8434
$$ 1126 -176641 -155919 7763 -196326 63590 169634 160207 -228253 -280183 52383 110817
18807A10817g5330c064k58314I0686B9970J07066B7589f14284I5401h0818L8898
$$ 110817 -75330 -3064 -261378 90686 29970 137036 27589 -614284 95401 -80818 -41920
18796d1920F7411a37935B44266a51926B49826d60180A98147f1033E7381b252E0248
$$ -41920 67411 -137935 244266 -151926 249826 -460180 198147 -61033 57381 -2252 50248
18784d9775D1925F442M8893A9875a9386C0860a82485q2891P5409r948h2315j27646
$$ -49775 41925 6442 55335 19875 -19386 30860 -182485 -265376 -189967 -199915 -82315 -209961
18772b09961A36513K69459f4527A6603h1943A58293A2746a65808F8236j270c63297
$$ -209961 136513 405972 -64527 16603 -81943 158293 12746 -165808 68236 66966 -363297
18760g5079B54566c1812B12310M782a05213p9503b1086k33962a25370p036A36143
$$ -75079 254566 -31812 212310 217092 -105213 -184716 -21086 -255048 -125370 -132406 136143
18748C5936J43945o4663d92291a59290A42903m4793c29410f4494c0786H285a78419
$$ 35936 179881 115218 -492291 -159290 142903 98110 -329410 -64494 -30786 8285 -178419
18736H3987P8563a94217d1676B31798a07392j75939A7159e0307B47331a75139
$$ 83987 162550 -194217 -41676 231798 -107392 -283331 17159 -50307 247331 -175139
18725A70009f5934j52112P0742c1287A62557L8586m4278a66713H9686J86107A06943
$$ 170009 -65934 -218046 -147304 -31287 162557 201143 156865 -166713 89686 275793 106943
18713I3877a79524D9646J24445B5528O3296a13290o0850r1483L0954I8598J87749
$$ 93877 -179524 49646 174091 25528 88824 -113290 -174140 -265623 -234669 98598 286347
18702B86347b25636h0989o097B70184k4770f0581B9785b78471A2425n306b66820
$$ 286347 -225636 -80989 -87086 270184 245414 -60581 29785 -278471 12425 7119 -266820
18690b0570A13499b32298c7967B27674c30912A70035a06481A52020E245N0172
$$ -20570 113499 -232298 -37967 227674 -330912 170035 -106481 152020 5245 55417
18680E5417a09684A03277f6299A89546b7198j37125f4426F850R1056J16485C586
$$ 55417 -109684 103277 -66299 189546 -27198 -164323 -64426 6850 97906 214391 3586
18668a76991K6685N8527L1805p3394K5087J6664L695k8008K8220p8106L940n4291
$$ -176991 -150306 -91779 -59974 -133368 -108281 -91617 -87922 -115930 -87710 -165816 -161876 -216167
18656b16167F7285g182D9084K46617a98876i9380n371j82649I1861C2407a08703
$$ -216167 67285 -7182 49084 295701 -198876 -99380 -104751 -287400 91861 32407 -108703
18644d2706E9368a92294O3186q8293G1100A7176d2305j71812j69986A20156Q5965
$$ -42706 59368 -192294 -129108 -217401 71100 17176 -42305 -214117 -384103 120156 206121
18633B06121n5864M0550a46682M0788j70273N3634Q1233j52014J32975C6032a6270
$$ 206121 150257 190807 -146682 -105894 -276167 -222533 -141300 -293314 -160339 36032 -16270
18621c37282J63070O1475j86979A14704J63659A00720J25299b59108J20001L9143
$$ -337282 -174212 -112737 -299716 114704 278363 100720 226019 -259108 -139107 -99964
18611i9964j49563g2379C9998P8815a76315A13J58553p8809d3209l66729c8806
$$ -99964 -249527 -72379 39998 118813 -176315 113 158666 79857 -43209 -409938 -38806
18599A19057a29292j6450k34925M7691J31707a7129E240a73959E6656B7739c10016
$$ 119057 -129292 -145742 -380667 -332976 -201269 -17129 5240 -173959 56656 27739 -310016
18587H4486c8639J7762B04928c0023C28629E8949O7225D6841a86925E3489b4930
$$ 84486 -38639 -20877 204928 -30023 328629 58949 126174 46841 -186925 53489 -24930
18575G9082j76c38696c2255f82p3443r0054r7588e3238B07072m5568b09350E6539
$$ 79082 78906 -338696 -32255 -682 -74125 -164179 -261767 -53238 207072 161504 -209350 56539
18562G8833j8614a18121k95124a13863A11257b86047K81n7720R571e1873B31713
$$ 78833 60219 -118121 -413245 -113863 111257 -286047 -285766 -343486 -333915 -51873 231713
18550b49916E2143b56458D26831a1886F7611M6766a346k39164b1419j47080C2450
$$ -249916 52143 -256458 426831 -11886 67611 114377 -1346 -240510 -21419 -168499 32450
18538D6280d8767r7131j00616A74283J82117H3925c53169a74480B42216p6603
$$ 46280 -48767 -145898 -246514 174283 356400 83925 -353169 -174480 242216 165613
18528A65613c70330e934B02261B7844R4829g1474A73802A998a2875A03094M0695
$$ 165613 -370330 -5934 202261 27844 122673 -71474 173802 1998 -12875 103094 143789
18517A43789c0563l07402E8782a98041A85178a43154n7897K6127j4689f9700n0483
$$ 143789 -30563 -337965 58782 -198041 185178 -143154 -201051 -174924 -189613 -69700 -120183
18506a20183p792C3328P3192a18754k63796a10631I6192A5452a26528j63032k3806
$$ -120183 -127975 33328 106520 -118754 -382550 -110631 96192 15452 -126528 -289560 -313366
18495c13366K4101A45227c1930p7094B2169f2134A55288a99833F3667c36634G672
$$ -313366 -289265 145227 -31930 -109024 22169 -62134 155288 -199833 63667 -336634 7672
18483B15421b98523J03357A01672a03994A25391B5438b7078A50268A4827a39894
$$ 215421 -298523 -195166 101672 -103994 125391 25438 -27078 150268 14827 -139894
18472A02376d8044C4076f6453I032e6932l7643f729E900a14281e399B17655A01242
$$ 102376 -48044 34076 -66453 9032 -56932 -94575 -6729 5900 -114281 -5399 217655 101242
18459e5502I5961c93752A32062a7488I6247J8820f0352b9678j08863L4740A89179
$$ -55502 95961 -393752 132062 -17488 96247 115067 -60352 -29678 -138541 -103801 189179
18447a11661I1697a49243A85761a43591A65339i122B9531a00686k90170a0885
$$ -111661 91697 -149243 185761 -143591 165339 -9122 29531 -100686 -390856 -10885
18436b22673q9562d4130H7508b03548a6847L872j02863B5966K03492p829J89668
$$ -222673 -312235 -44130 87508 -203548 -16847 -12975 -115838 25966 229458 221629 411297
18425D11297a76584p8933A51509d61978a07010d5084r0059m0441p1997P4369I4774
$$ 411297 -176584 -255517 151509 -461978 -107010 -45084 -135143 -175584 -247581 -173212 94774
18413B07693E9470J46712b12456A52721a83729e4328m904k25210A29659d0453
$$ 207693 59470 206182 -212456 152721 -183729 -54328 -59232 -284442 129659 -40453
18402G998b58019A27996D8319e5505j03390B05931f9626k5512A30911b08293h242
$$ 7998 -258019 127996 48319 -55505 -158895 205931 -69626 -95138 130911 -208293 -8242
18390c34436i1470H256K78322a17023k15820D9041J3316O1363O3895B5779J89759
$$ -334436 -91470 8256 286578 -117023 -332843 49041 62357 123720 187615 25779 215538
18379B15538E9338J1741K1134a77624F5869A1068M469b33071a6549o2790I2542
$$ 215538 59338 71079 92213 -177624 65869 11068 15537 -233071 -16549 -79339 92542
18367G8857Q5254a50316j18031A19152a77032D2025c73743B4572K42099i7952
$$ 78857 164111 -150316 -268347 119152 -177032 42025 -373743 24572 266671 -97952
18356B930K2132b61988a16536D50251E8582a21583k27517e6703m3105B192L97776
$$ 2930 25062 -261988 -116536 450251 58582 -121583 -349100 -56703 -99808 2192 399968
18345C99968b6229l5100o9434B89592a04668j69497B33087A2651K3110N8407a78043
$$ 399968 -26229 -61329 -130763 289592 -104668 -274165 233087 12651 35761 94168 -178043
18333A60868a78876E2835a38171A17920b36580h698q0138F0982R9943b71206A74233
$$ 160868 -178876 52835 -138171 117920 -236580 -8698 -88836 60982 160925 -271206 174233
18321h8320C39000B1194M855b33935B69671a58321B5469a76692I266K924L526
$$ -88320 339000 21194 26049 -233935 269671 -158321 25469 -176692 9266 12190 15716
18310A5716a53407A70116m8460m5765k366a44356O0860L8434B62035C8633e8911
$$ 15716 -153407 170116 121656 75891 73525 -144356 -83496 -45062 262035 38633 -58911
18298B73830D6369c03058A33415A4685i5183k7830j6602K2145a3703A48907k1401
$$ 273830 46369 -303058 133415 14685 -95183 -123013 -139615 -117470 -13703 148907 127506
18287A27506b55563G0713b63881B03994p8144a01300B3473e3485q7781m090j64660
$$ 127506 -255563 70713 -263881 203994 125850 -101300 23473 -53485 -141266 -145356 -310016
18276c10016R293F2833a90312D6888e26307J56081c0212B2594K4117h9707q5383
$$ -310016 -300723 62833 -190312 46888 -526307 -370226 -30212 22594 46711 -89707 -175090
18265a75090p5293A30597d0599k13531n7057g7808F7642g4010H0275c10895g644
$$ -175090 -250383 130597 -40599 -254130 -311187 -77808 67642 -74010 80275 -310895 -7644
18253d1647D9263J94804e3776E8192c4447j48256D95926A05943B291J87847a1410
$$ -41647 49263 244067 -53776 58192 -34447 -182703 495926 105943 2291 190138 -11410
18241h3920A25960J89460d29459L7512F5005b42047B90997B2534h0823n2490e953
$$ -83920 125960 315420 -429459 -391947 65005 -242047 290997 22534 -80823 -133313 -5953
18229B0054c7261H0521J08845L6023a8146j40737r6799a06373a3250j78608E8313
$$ 20054 -37261 80521 189366 225389 -18146 -158883 -255682 -106373 -13250 -191858 58313
18217C2835f8851k85192h4926A75510a23896n5675A16644a8568j296B32566E1595
$$ 32835 -68851 -354043 -84926 175510 -123896 -179571 116644 -18568 -19864 232566 51595
18205B89865m4534D1867a25259a7179H7189m1964a03314C0320e9775J6020j45201
$$ 289865 245331 41867 -125259 -17179 87189 45225 -103314 30320 -59775 -43755 -188956
18194a88956F417L26389j37800a6985A32431h0680m503b6396l0436A55483p1661
$$ -188956 6417 332806 195006 -16985 132431 -80680 -85183 -26396 -56832 155483 83822
18183H3822J08544b03300A34136J41468a17357d0628j32983J2343A52842j6565
$$ 83822 192366 -203300 134136 275604 -117357 -40628 -173611 -161268 152842 136277
18173A36277e7164A37510d62366c5250r6002a1753l2828k29339A67979e6505G1359
$$ 136277 -57164 137510 -462366 -35250 -131252 -11753 -44581 -273920 167979 -56505 71359
18161A91274D9706N9070R033d9923j01839c7728k67486o676e3754F3281P1218
$$ 191274 49706 108776 117809 -49923 -151762 -37728 -305214 -311890 -53754 63281 134499
18150A34499o6431h6243A02520M1739R5552a17355M1626i924k64347B75576C723
$$ 134499 68068 -86243 102520 144259 239811 -117355 -75729 -9924 -274271 275576 3723
18138A21916a73223L9440G8455a25849J3803I3805l4636a84691A82658g676A66519
$$ 121916 -173223 -133783 78455 -125849 -112046 93805 59169 -184691 182658 -7676 166519
18126e8336A56129n2286d0108H0656b6170F6050c4226B83653j07853h7493A2343
$$ -58336 156129 103843 -40108 80656 -26170 66050 -34226 283653 175800 -87493 12343
18114b78792I500a90728B53616F9290a02965H2569L2755a61928I7184a62678A53614
$$ -278792 9500 -190728 253616 69290 -102965 82569 115324 -161928 97184 -162678 153614
18102D5582l313g4819j44379j41283A96326b35303A06606I242a64211h017H2626
$$ 45582 42269 -74819 -219198 -360481 196326 -235303 106606 9242 -164211 -8017 82626
18090c7949m7389a2981k25742h152B23531b37082a09773j10011L8987d8585E56
$$ -37949 -85338 -12981 -238723 -8152 223531 -237082 -109773 -219784 -180797 -48585 556
18078B19893f8820B89488f0990A75804i9004A17797h2207B18874E5585B5759b3593
$$ 219893 -68820 289488 -60990 175804 -99004 117797 -82207 218874 55585 25759 -23593
18066B21660f0303C6996f2411a7042j07108B00838d3186B68251e7905p8344k1412
$$ 221660 -60303 36996 -62411 -17042 -124150 200838 -43186 268251 -57905 -136249 -157661
18055a57661d6958p2558E0409i4385p408A32323b64726e201m3846j65299E6724
$$ -157661 -46958 -119516 50409 -94385 -101793 132323 -264726 -5201 -49047 -214346 56724
18043G3496b403l7108q3119B07573b730D9082A07f0286C32169f0091B53103Q9919
$$ 73496 -2403 -39511 -122630 207573 -2730 49082 107 -60286 332169 -60091 253103 343022
18031C43022j58793a49633P0241A0505c50353A22730N5073b3373k52154F360a93239
$$ 343022 184229 -149633 -79392 10505 -350353 122730 177803 -23373 -275527 6360 -193239
18019a0631A71072b01465G4199J78257c84674B44311a80991A00049a69638Q2690
$$ -10631 171072 -201465 74199 252456 -384674 244311 -180991 100049 -169638 -86948
18009h6948k58985H5167a93634d4537j59902a1499m8860n6053A57031b84A26376
$$ -86948 -345933 85167 -193634 -44537 -204439 -11499 -60359 -116412 157031 -284 126376
17997A98935p1197i1654m2269b257p7975B64278G50b338G7980C5075c57584G1945
$$ 198935 127738 -91654 -133923 -2257 -80232 264278 750 -2338 77980 35075 -357584 71945
17984B22186E5111d3138I3694h6117D5245R0788J3811d6446n4134A30802F697
$$ 222186 55111 -43138 93694 -86117 45245 136033 149844 -46446 -100580 130802 6697
17972b02322C88913a58932A40736a91793B60369b61792O1999A5265L556b821k18744
$$ -202322 388913 -158932 140736 -191793 260369 -261792 -199793 15265 18821 -2821 -221565
17961b21565G3905b7850A04051N8492O4762g2891K4306E3661J22641D6413J15400
$$ -221565 73905 -27850 104051 162543 227305 -72891 -48585 53661 176302 46413 161813
17950A61813i9304A13374i1410A28475j5392n2396O6985d95721I550J35717a5046
$$ 161813 -99304 113374 -91410 128475 113083 60687 127672 -495721 9550 145267 -15046
17938H0198l2697j9164J14842Q1383q3123o3054J48719J24865b86580a6455k38831
$$ 80198 47501 28337 143179 224562 141439 78385 227104 351969 -286580 -16455 -255286
17927b55286B60053b8195n4200j63375A8072b56888b4875A37719L2184a52616
$$ -255286 260053 -28195 -82395 -245770 18072 -256888 -24875 137719 169903 -152616
17916a0745A75856e2312B90197i9721B6693b59975C98848D7327a74881C61983
$$ -10745 175856 -52312 290197 -99721 26693 -259975 398848 47327 -174881 361983
17905a75737k5622A78686a79485O3605I7397b0302B8915h4071q2317A80287b84617
$$ -175737 -201359 178686 -179485 -115880 97397 -20302 28915 -84071 -166388 180287 -284617
17893B64500G9406b17095A22179a49660D09324b36824B4376c4860C09270a22578
$$ 264500 79406 -217095 122179 -149660 409324 -236824 24376 -34860 309270 -122578
17882B42811H1521g4787G3286c2370a1233D676J33156P2291a17552B47797k9160
$$ 242811 81521 -74787 73286 -32370 -11233 4676 137832 210123 -117552 247797 218637
17871B18637a76531j59484e2804B29707b3660k8508P609A67040q0609K65186b5368
$$ 218637 -176531 -336015 -52804 229707 -23660 -52168 -44559 167040 86431 351617 -25368
17859C24007J6197a30240l2753O499D18044j33858E8755a55835a4295k4874B5725
$$ 324007 340204 -130240 -162993 -156494 418044 284186 58755 -155835 -14295 -39169 25725
17847C9866J97318d1797H9164J31907B7301g876I4629N6245F378Q7007c60266
$$ 39866 237184 -41797 89164 221071 27301 -7876 94629 150874 6378 93385 -360266
17835A57983n6507D6422d5287D394J17480J13355n2797a49793B96886p2996e853
$$ 157983 101476 46422 -45287 4394 121874 235229 182432 -149793 296886 223890 -5853
17823F1607a69231A90075g2271A13367h104r8442A91527a01940I7574b0443C39105
$$ 61607 -169231 190075 -72271 113367 -8104 -106546 191527 -101940 97574 -20443 339105
17811A71797g3900H0647j074h7281K9994C0929L88645C3184a93109A74432m2875
$$ 171797 -73900 80647 79573 -87281 -57287 30929 419574 33184 -193109 174432 131557
17800A31557b82970B28211I2277k8537a58386P5326l5923H1471b3855j31133B83703
$$ 131557 -282970 228211 92277 63740 -158386 -83060 -118983 81471 -23855 -154988 283703
17788b22559B78867O2810n0909G675L32418H5181B7868N3396J85852j14046n4424
$$ -222559 278867 341677 290768 7675 340093 85181 27868 81264 267116 153070 98646
17777I8646a39274A05872a32416k996a0634C41620c3736B30146a09444A26766
$$ 98646 -139274 105872 -132416 -135412 -10634 341620 -33736 230146 -109444 126766
17766A62248G315J38221c8779F0504f0949a9090m3450A23445J07894d68927a05658
$$ 162248 7315 145536 -38779 60504 -60949 -19090 -62540 123445 231339 -468927 -105658
17754b6033q1499j6072A9571b21712A43089L0548J54592b26912D32995E4575K38266
$$ -26033 -107532 -123604 19571 -221712 143089 173637 328229 -226912 432995 54575 292841
17743B92841a60496M413a7399r8320A42951N3612e1200A85997l5263c7769D26283
$$ 292841 -160496 -156083 -17399 -115719 142951 196563 -51200 185997 150734 -37769 426283
17731B26234D96M15214a2261k49831A58668p1554i6182C82361I7684a42256N8155
$$ 226234 496 415710 -12261 -262092 158668 87114 -96182 382361 97684 -142256 -84101
17720h4101a6592C27247A43049k329K7339o1421K46115a35455P877B5052a47964
$$ -84101 -16592 327247 143049 140720 168059 106638 352753 -135455 -127578 25052 -147964
17708H1173J12982J72069e6670A47785R2718A06741M8069J98500F9264L0353a17942
$$ 81173 194155 366224 -56670 147785 240503 106741 154810 353310 69264 99617 -117942
17696B63232f7394B4413m757J52656k5513j2776i1029I4314k0468K10125A28340
$$ 263232 -67394 24413 19656 172312 146799 134023 -91029 94314 73846 283971 128340
17684a45731C75761b45379A43761a3063B46282I7927l9720e5260J9519c523l38864
$$ -145731 375761 -245379 143761 -13063 246282 97927 58207 -55260 -35741 -3523 -342387
17673c42387a68487B25356G3388d0513A40186C7062J52684b1560A50618B7683
$$ -342387 -168487 225356 73388 -40513 140186 37062 189746 -21560 150618 27683
17662B45290a14065B6884J85401r3207J31569c71684a00695B0132J05917J20176
$$ 245290 -114065 26884 212285 119078 250647 -371684 -100695 20132 126049 246225
17652B46225c4943j33522D96695A65745k1474M6403a06341A10295d6611D6811
$$ 246225 -34943 -168465 496695 165745 144271 190674 -106341 110295 -46611 46811
17641H4881B1332R419a16924A43988i6177a4583o8958A67499D8182J53670I369
$$ 84881 21332 30751 -116924 143988 -96177 -14583 -83541 167499 48182 201852 9369
17629C14988F9816L30037f2265D5143K73311a37451J3698N3585j63385C93440
$$ 314988 69816 399853 -62265 45143 318454 -137451 -123753 -70168 -233553 393440
17618B72049a67025C70909j28400A16020c9166B67830c8147N157B07248F2136
$$ 272049 -167025 370909 242509 116020 -39166 267830 -38147 -32990 207248 62136
17607A29002K63235F0693e3158A6651J1681L05845J710a48926C0841K01081J54202
$$ 129002 392237 60693 -53158 16651 28332 334177 335887 -148926 30841 231922 386124
17596C86124H5878k7076J08472D3560K37345n7686F7182j3218J84877m3585j3211
$$ 386124 85878 58802 167274 43560 280905 223219 67182 53964 238841 195256 182045
17585A82045J9409N4626A21113L2664n3011N5107b10083B25279E2220L3590K59296
$$ 182045 201454 256080 121113 153777 100766 155873 -210083 225279 52220 85810 345106
17574C45106A20915D6667K3947c29806A34030K66814A3848J31847a24053B82368
$$ 345106 120915 46667 70614 -329806 134030 400844 13848 145695 -124053 282368
17563B33477k8715l1535D0659a33318B42056j04844c3261C4505g7828A07317K46279
$$ 233477 204762 173227 40659 -133318 242056 137212 -33261 34505 -77828 107317 353596
17552C53596b06887C51277j69947E0595L64094j95344J79169A73834J3845P839
$$ 353596 -206887 351277 181330 50595 414689 219345 398514 173834 187679 195518
17542A95518M5354j01592A7795J76497L2280K96440k22458a3022C14757f6120
$$ 195518 240872 139280 17795 194292 226572 523012 300554 -13022 314757 -66120
17531A51851J98953m4408b4312B6317e7464B34148K7338G382J21723M43166H0958
$$ 151851 350804 306396 -24312 26317 -57464 234148 261486 7382 129105 572271 80958
17519B86044q1893j6813K94118G9081K09327H4462J94304J56307K767J88505l5816
$$ 286044 204151 187338 481456 79081 288408 84462 278766 435073 437840 626345 590529
17508E90529L57061l01008J1680k33403J77564j95650J96996j07195B41311M00188
$$ 590529 947590 646582 658262 424859 602423 406773 603769 496574 241311 641499
17498F41499j92058K6122K11582N3550k08307K44940P8885R0298j83037L0648
$$ 641499 449441 475563 687145 740695 532388 777328 856213 946511 763474 794122
17488G94122l09733J22804k25878J5223J80990G6380K01449A06931b38734A27947
$$ 794122 484389 607193 381315 396538 577528 76380 277829 106931 -238734 127947
17477A77334j3698R1398M2057a17891D55161j56843n6870L67819A47221J15788
$$ 177334 163636 255034 297091 -117891 455161 298318 241448 609267 147221 263009
17467B63009K40796j86694j11939L43887j15878A50029L14407k00956L18624B12946
$$ 263009 503805 317111 205172 549059 433181 150029 464436 263480 582104 212946
17456A39237L00829A63568K38367R0937A39741J47948j42521L03041B796K46953
$$ 139237 440066 163568 401935 492872 139741 287689 145168 448209 2796 249749
17446B49749o9007H5818n321P4074L35501J1437A51225L8319P3440N8023j26655
$$ 249749 180742 85818 80497 154571 490072 501509 151225 189544 262984 321007 194352
17435A94352L5029J62936a02809C54337l1180J33946p252L9439j10593r4334O0924
$$ 194352 229381 392317 -102809 354337 323157 457103 449851 489290 378697 284363 345287
17424C45287P7228A28577K66664A46274N770J34052J08240M4574H9632K04642
$$ 345287 422515 128577 395241 146274 152044 286096 394336 438910 89632 294274
17414B94274J328L3196m2250Q1558K30737k83516Q099K9130j67346K95864F6279
$$ 294274 295602 328798 286548 368106 598843 315327 323426 352556 185210 481074 66279
17402C47480R8708R368J57628k72686J3873k6692j29650K06819b90440E07254
$$ 347480 446188 455556 613184 340498 354371 327679 198029 404848 -290440 507254
17391C59820q1334N2562J38826A25218J59953j5289r5721n1774l0423d0176C67743
$$ 359820 278486 331048 469874 125218 285171 269882 174161 122387 91964 -40176 367743
17379B52857J29553j44007e1338N141m3552B14244K2218m9703b3946E4471J90473
$$ 252857 382410 238403 -51338 -46197 -89749 214244 236462 186759 -23946 54471 244944
17368B44944o1162K58296a61163C34598L03091D216e8552C39538A44943J21963
$$ 244944 183782 442078 -161163 334598 637689 4216 -58552 339538 144943 266906
17358B66906j04488J21747J49416B15678K77705A8543b08661B17401C8707R4421
$$ 266906 162418 284165 433581 215678 493383 18543 -208661 217401 38707 133128
17348A33128P2047Q1994G5595R0217C5823K99470J04259a22374C70381E275K25370
$$ 133128 205175 287169 75595 165812 35823 335293 439552 -122374 370381 5275 230645
17337B30645I3743L3513l1440L433O1592J65157j1537J14796A8368O07836B76885
$$ 230645 93743 127256 95816 99249 160841 325998 314461 429257 18368 626204 276885
17325C50639n6027j39337J64398l4394H2804Q380J33676I7969k719K4216J05997
$$ 350639 294612 155275 319673 285279 82804 91184 224860 97969 95250 119466 225463
17314B25463J30547L4800m0566A37712R5379J53975i8432D43469j06860r0441
$$ 225463 356010 390810 350244 137712 233091 387066 -98432 443469 336609 246168
17304B46168m8564H0863O3754E1774J43004J55396E3928M68681j24450A56280
$$ 246168 197604 80863 144617 51774 194778 350174 53928 522609 398159 156280
17293A47675J46745J0648M5694j64595P9985K29873k27194k9331n0711m2276R7767
$$ 147675 294420 305068 350762 186167 266152 496025 268831 239500 188789 146513 244280
17282B44280A21536N7997q9143K29956j09547L25848B4576N02000A02230J5000
$$ 244280 121536 179533 90390 320346 210799 536647 24576 526576 102230 117230
17272A17230J95692J88562j50975Q5988K8525j59789A20790R787L08786q1339
$$ 117230 312922 501484 350509 436497 465022 305233 120790 130577 439363 358024
17262C58024K32785k92306A22440N02940k66480j26098L35883k40368J06954M2317
$$ 358024 590809 298503 122440 625380 358900 232802 568685 328317 435271 477588
17252D77588k26096Q7596j49082R4831E1034f0523E02940B11434J09680A35314
$$ 477588 251492 339088 190006 284837 51034 -60523 502940 211434 321114 135314
17241C01960P3531l1452j073k030b8928C73714F9732L65995B15987J9133L8618
$$ 301960 375491 344039 342966 340936 -28928 373714 69732 435727 215987 235120 273738
17230B73738j18628D1047J15269J58366q6266N11429A9370L42404M908D630J14922
$$ 273738 155110 41047 156316 314682 228416 739845 19370 361774 366682 4630 119552
17219A19552L95057k24980p6274j0136L89835j43683A83878l0087M18647A74007
$$ 119552 514609 289629 213355 203219 593054 449371 183878 153791 572438 174007
17208B93250J76098J7652J09520B77783l5301A1604K55105k9505M46573k98520
$$ 293250 469348 487000 596520 277783 242482 11604 266709 237204 683777 385257
17198C85257Q9694A33642P6435c6628E15723A36972m0804K44957A4185O21612
$$ 385257 474951 133642 210077 -36628 515723 136972 96168 341125 14185 635797
17188F35797l11950O4j58476L87026N9500k87797M6077J84988o0348O0247j27441
$$ 635797 323847 323911 165435 552461 611961 324164 370241 555229 494881 555128 427687
17177D27687A16733J51606K88374j1688B18870K24856J52476n4889j63819p3333
$$ 427687 116733 268339 556713 545025 218870 443726 596202 541313 377494 304161
17167C04161Q9326Q7051A23650I537M99336k07558m1899K86179A79501L76329
$$ 304161 393487 480538 123650 9537 508873 301315 259416 545595 179501 555830
17157E55830m200B25385K48354j95690n3383k1311K30141n6992n0981J23964j11558
$$ 555830 551630 225385 473739 278049 224666 203355 433496 376504 325523 449487 337929
17146C37929K97070k04292j16974L7095J32127q0766K68126k09226p8776L80004
$$ 337929 634999 430707 313733 350828 482955 402189 670315 461089 382313 762317
17136G62317A83260K37527j77673N6736L54557k79289P3683J69206J9192j54802
$$ 762317 183260 420787 243114 299850 654407 375118 448801 618007 637199 482397
17126D82397L1258p9058K75631l37380R5650n3553J02278R3842j30816l7511K79060
$$ 482397 513655 434597 710228 372848 468498 414945 517223 611065 480249 442738 721798
17115G21798j26645k87899L13165p941m1256L0740j02864q5642K37440k60872
$$ 721798 595153 307254 620419 612478 571222 601962 499098 413456 650896 390024
17105C90024L68255R37j16244k62143j9550K17517n2996K06412J32298D23773
$$ 390024 758279 759216 642972 380829 361279 578796 525800 732212 864510 423773
17094D54455K40274L30005l15885j59029J4769L23995D15621K10056j50851L24479
$$ 454455 694729 1024734 708849 549820 564589 888584 415621 625677 474826 799305
17084G99305l62994K94445k40086R7449m3815j18562M92187k04740k89947L06724
$$ 799305 436311 730756 490670 588119 544304 425742 917929 713189 423242 729966
17074G29966k17603O6196J03373n6730k34173L85115j74682j27658J17652J50003
$$ 729966 512363 578559 681932 625202 391029 776144 601462 473804 591456 741459
17064G41459J9933j45840Q0812L06442l38786j11542L5047l8856M0989K49471
$$ 741459 761392 615552 696364 1002806 664020 552478 587525 548669 589658 839129
17054H39129l38047K99576l94494L35627j04478N7779K80893j27956k37269j4762
$$ 839129 501082 800658 406164 741791 637313 695092 975985 848029 610760 595998
17044E95998J73805L02880l30053J92935q0826j35608K2C10384O05732p5437J61814
$$ 595998 769803 1072683 742630 935565 854739 719131 719153 310384 916116 840679 1002493
17033A002493j23082q2462J68375k22306J04490j37061K92459j07324M477m3686
$$ 1002493 879411 796949 965324 743018 847508 710447 1002906 895582 900059 856373
17023H56373q12O533J76651l17705M7173K73444R3527n31374K26857J99424q4625
$$ 856373 855561 862094 1038745 721040 768213 1041657 1135184 603810 830667 1030091 945466
17012I45466k48718N28066m33372L51096k56930k0406J48012Q6495o1630M3675
$$ 945466 696748 1224814 791442 1142538 885608 865202 1013214 1099709 1038079 1081754
17002A081754l0503O0404M7796O0340l1448k47794L92493j87114J56055j18032
$$ 1081754 1051251 1111655 1159451 1219791 1188343 940549 1333042 1145928 1301983 1183951
16992A183951J9375l70300O1619J07146k43624N92927j27374k40172j6881K83179
$$ 1183951 1203326 833026 894645 1001791 758167 1351094 1223720 983548 966667 1249846
16982A249846J28310k67115J1599n3721L73420j73739j85139J99658p5297k10975
$$ 1249846 1378156 1111041 1122640 1068919 1442339 1268600 1083461 1283119 1207822 996847
16972I96847L09274j06631o8374M0452j8381K16410M406o7245j54107J69368M8430
$$ 996847 1306121 1199490 1131116 1171568 1153187 1369597 1374003 1306758 1152651 1322019 1370449
16961A370449P664J05859q782j2824L2945j87573L13095k03668p0514J6068J67351
$$ 1370449 1378113 1483972 1475190 1462366 1495311 1307738 1620833 1417165 1346651 1362719 1530070
16950A530070k13576L24713l23183J03428Q8718j3737k8826q9405K14261j16972
$$ 1530070 1316494 1641207 1318024 1421452 1510170 1496433 1467607 1378202 1592463 1475491
16940A475491p3613J53715j95217P0372N25K74386P9850O453j73732k34851L17094
$$ 1475491 1401878 1555593 1360376 1430748 1431273 1705659 1785509 1791962 1618230 1383379 1700473
16929A700473j3413N3123L14990k5117l87686K67020j24010J14276K2933k49120
$$ 1700473 1687060 1740183 2055173 2030056 1642370 1909390 1785380 1899656 1922589 1673469
16919A673469M1259J94285J12245j64633j8236J44460J73184k7704r0794j08702
$$ 1673469 1714728 1909013 2021258 1856625 1838389 1982849 2156033 2128329 2037535 1928833
16909A928833q6772L58669N6784k03926J49792L5698M4645k98869m205M18743
$$ 1928833 1842061 2200730 2257514 2053588 2203380 2239078 2283723 1984854 1980649 2399392
16899B399392j18180o6147K47148k80473M83584l18432J06764r5658N327Q5041
$$ 2399392 2281212 2215065 2462213 2181740 2665324 2346892 2453656 2357998 2363325 2448366
16889B448366j59829L63246j69037k1683L15229J374o616j21193K45654K41881
$$ 2448366 2288537 2651783 2482746 2461063 2776292 2777666 2771050 2649857 2895511 3137392
16879C137392n58168K38703Q6175k4478M2095l07682L09364j02010K0063r6877
$$ 3137392 2579224 2817927 2904102 2879624 2921719 2614037 2923401 2821391 2841454 2744577
16869B744577L43807N6580J83217k10930j04254J5683K64127J76049l59873L83549
$$ 2744577 3088384 3144964 3328181 3117251 3012997 3028680 3292807 3468856 3108983 3492532
16859C492532K2277o0725O773K86774k41138K50098J02136P3633k63830J90821
$$ 3492532 3514809 3454084 3460857 3747631 3506493 3756591 3858727 3932360 3668530 3859351
16849C859351J09709o8994K57789j8438j86333O61626r3635l41394M3382M25987
$$ 3859351 3969060 3900066 4157855 4139417 3953084 4614710 4521075 4179681 4223063 4649050
16839D649050m7776N3328J777j91042M6894M16080K40K701M84738l83718L29996
$$ 4649050 4601274 4654602 4656379 4465337 4512231 4928311 4928551 4931252 5415990 5032272 5362268
16828E362268j53721K75916m9760O22292n28470J75747j8693Q0469M72404q1988
$$ 5362268 5208547 5484463 5434703 6056995 5528525 5704272 5685579 5766048 6238452 6156464
16818F156464j46300N15299J22186j0934o4906N37313j78689k3846M01287J09338
$$ 6156464 6010164 6525463 6647649 6636715 6571809 7109122 6930433 6906587 7307874 7417212
16808G417212K07682J36400k82771L40398J45368M40479j2582j8933J72732L80678
$$ 7417212 7624894 7761294 7478523 7818921 7964289 8404768 8392186 8373253 8545985 8926663
16798H926663J98776j11264L54097J25122L38956K90070K76642L89130j79262
$$ 8926663 9125439 9014175 9368272 9493394 9832350 10122420 10399062 10788192 10608930
16789A0608930K18572N92479J64944K79908n0082Q26342J97091K69620L96674
$$ 10608930 10827502 11419981 11584925 11864833 11814751 12641093 12838184 13107804 13504478
16780A3504478R3018J80904L46922M01200N76901K0147P23724M39847M14347K86449
$$ 13504478 13597496 13778400 14125322 14526522 15103423 15123570 15847294 16287141 16701488 16987937
16770A6987937P47046M96647J8378M29165R65119K36420N97076J091994K17037
$$ 16987937 17734983 18231630 18250008 18679173 19644292 19880712 20477788 21569782 21786819
16761B1786819P15432P61963O29271Q55613R19349M86550J020555J066891O72735
$$ 21786819 22502251 23264214 23893485 24749098 25668447 26154997 27175552 28242443 28915178
16752B8915178J294287R54876J009601J114886Q57634J251212J667535J132997
$$ 28915178 30209465 31164341 32173942 33288828 34146462 35397674 37065209 38198206
16744C8198206J709651J436415J495519J770313J643277J524681K292557J768650
$$ 38198206 39907857 41344272 42839791 44610104 46253381 47778062 50070619 51839269
16736E1839269J994589K326092K377686K446276K267477K607688K997226K658746
$$ 51839269 53833858 56159950 58537636 60983912 63251389 65859077 68856303 71515049
16728G1515049K629931L099328L532332L061499L029858L583838L740851L670798
$$ 71515049 74144980 77244308 80776640 83838139 86867997 90451835 94192686 97863484
16720I7863484L272558L023489L903773L046027L662134K992068L323397K834872
$$ 97863484 101136042 104159531 108063304 111109331 114771465 117763533 121086930 123921802
16712A23921802K496440K620103K126089J731429R94814R30985M78975K61951
$$ 123921802 126418242 129038345 131164434 132895863 133890677 134821662 135300637 135562588
16704A35562588l23922p82555j150573j557483k109934j985454k587355k574797
$$ 135562588 135238666 134456111 133305538 131748055 129638121 127652667 125065312 122490515
16696A22490515k978979l286003l096822l677774l741679l065008m004830l145589
$$ 122490515 119511536 116225533 113128711 109450937 105709258 102644250 98639420 95493831
16688I5493831l747403l459532l245599l155641l078754l801185k660684l082568
$$ 95493831 91746428 88286896 85041297 81885656 78806902 75005717 72345033 69262465
16680F9262465k700205k261464k818434k581582k380231k362383k301715j565339
$$ 69262465 66562260 64300796 61482362 58900780 56520549 54158166 51856451 50291112
16672E0291112j948390k276493j923908j479063j810235j276286j532611j578574
$$ 50291112 48342722 46066229 44142321 42663258 40853023 39576737 38044126 36465552
16664C6465552j029013j569741r16694j422688q71914r43712j167894q41203j013641
$$ 36465552 35436539 33866798 32950104 31527416 30655502 29711790 28543896 27702693 26689052
16655B6689052j143021m37476j002892q27311m49327r47857o01546o03243m86391
$$ 26689052 25546031 25108555 24105663 23278352 22829025 21881168 21279622 20676379 20189988
16646B0189988j043483j98652j136333q8800l09700m61993m01209m77726q01918
$$ 20189988 19146505 18947853 17811520 17722720 17413020 16951027 16549818 16072092 15270174
16637A5270174k69574j58522l20315l94568l21406m85600l42215n42966q8992
$$ 15270174 15000600 14842078 14521763 14127195 13805789 13320189 12977974 12435008 12346016
16628A2346016n05706j05956k31786j41480m82729P5619q94503K23394m12629
$$ 12346016 11840310 11734354 11502568 11361088 10878359 10953978 10059475 10282869 9870240
16619I870240k65210k98827R2191k40281k27429k5743j98903k42431l32171j23655
$$ 9870240 9605030 9306203 9398394 9158113 8930684 8904941 8706038 8463607 8131436 8007781
16609H007781j55857k6263J61803n89604P9529n46858R5318K44831l20019m32661
$$ 8007781 7851924 7825661 7987464 7397860 7477389 6930531 7025849 7270680 6950661 6518000
16599F518000m801J58669k02867o70951N93248o04213M36402k71420k23775k84579
$$ 6518000 6513199 6671868 6469001 5798050 6391298 5787085 6223487 5952067 5728292 5443713
16589E443713L19948l17122K11168m05471M9638l4215k33201l13328j38170o4046
$$ 5443713 5763661 5446539 5657707 5252236 5301874 5267659 5034458 4721130 4582960 4518914
16579D518914K5904L32519k99019k45340M9021k1631j46209Q6275m2182k27187
$$ 4518914 4544818 4877337 4578318 4332978 4381999 4360368 4214159 4300434 4258252 4031065
16569D031065K4856k8533j21400l0988J99879n05926j79714N07114n9215k45423
$$ 4031065 4055921 4027388 3905988 3875000 4074879 3568953 3389239 3896353 3837138 3591715
16559C591715j36154L39879k35921l13847k47926L04525p6277O3311k45938L05649
$$ 3591715 3455561 3795440 3559519 3245672 2997746 3302271 3225994 3289305 3043367 3349016
16549C349016k99916j79161k2331L06011l27709l46824M31701l12445N70289k87358
$$ 3349016 3049100 2869939 2847608 3153619 2825910 2479086 2910787 2598342 3168631 2881273
16539B881273m01645L84761N2141n75934j07627N42396m25292L98395l31643j76443
$$ 2881273 2479628 2864389 2916530 2340596 2232969 2775365 2350073 2748468 2416825 2240382
16529B240382M2368r6362K14222j9868Q769j61630n0605M8887J3516m20468M50655
$$ 2240382 2282750 2186388 2400610 2380742 2389511 2227881 2177276 2226163 2239679 1819211 2269866
16518B269866l84744L29384l84098L5202M20931l21836k69465K42959r4336j24508
$$ 2269866 1885122 2214506 1830408 1865610 2286541 1964705 1695240 1938199 1843863 1719355
16508A719355J1302J98749l1411q4781N4J32261M8096j94220j04651K20258r6361
$$ 1719355 1730657 1929406 1897995 1813214 1813268 1945529 1993625 1799405 1694754 1915012 1818651
16497A818651k70107m5293K97171m1171q2759J08700n5252j95618M27178l75641
$$ 1818651 1548544 1503251 1800422 1759251 1676492 1785192 1729940 1534322 1961500 1585859
16487A585859j63331L69476k26986J993N4928n0018J70238j37398M335j35631
$$ 1585859 1422528 1792004 1565018 1567011 1621939 1571921 1742159 1604761 1609096 1473465
16477A473465j21305r3961J53049J29484n6645L1035O0001m6391k5498j20883
$$ 1473465 1352160 1258199 1411248 1540732 1484087 1515122 1575123 1528732 1503234 1382351
16467A382351P6911j03696J44395n99671N34114r3212j234o7800K98527m04824
$$ 1382351 1459262 1355566 1499961 900290 1434404 1341192 1339958 1272158 1570685 1165861
16457A165861K26687l04484N5202L6107j31236J49618L96930l87678J88310l42111
$$ 1165861 1392548 1088064 1143266 1179373 1048137 1197755 1594685 1207007 1395317 1053206
16447A053206J24684p3957J568j66779P5541J36114k74106J10529J19844N1400
$$ 1053206 1177890 1103933 1105501 938722 1014263 1150377 876271 986800 1106644 1158044
16437A158044j01962j84670p7052J70211j45360j28499M41980l57744o039K59060
$$ 1158044 1056082 871412 794360 964571 819211 690712 1132692 774948 768909 1027969
16427A027969K8459j48746K49734k7667k6903M428k26776m7659N4379R7816J09689
$$ 1027969 1056428 907682 1157416 1129749 1102846 1107274 880498 832839 887218 985034 1094723
16416A094723m94013P2523j47619N37194j56489K95043k26578N5275l02869r9578
$$ 1094723 600710 673233 525614 1062808 906319 1201362 974784 1030059 727190 627612
16406F27612L18151n7544k14153L93882k83656J8170L4296m261P8269l52386P5194
$$ 627612 945763 888219 674066 1067948 784292 802462 836758 832497 910766 558380 633574
16395F33574K11183n7807m0460n0237K65174m40668L54133l3001O228n5697j13144
$$ 633574 844757 786950 746490 696253 961427 520759 874892 841891 848119 792422 679278
16384F79278K70945D24877L70844j79840J71266j17831n9450J95852k26676J79909
$$ 679278 950223 424877 795721 615881 787147 669316 609866 805718 579042 758951
16374G58951k967K61475m80261L94993j97450K63737D34521N61396D25382K35170
$$ 758951 755984 1017459 537198 932191 734741 998478 434521 995917 425382 660552
16364F60552J46031l71707r6062L14163j59764J70026n2986K73730k04199L10055
$$ 660552 806583 434876 338814 652977 493213 663239 610253 883983 679784 989839
16354I89839C77528J50166K8140j18185P4621K04013j80430O2355j6892P9200
$$ 989839 377528 527694 555834 437649 512270 716283 535853 598208 581316 660516
16344F60516k06084K35589j30685j52050N9659M51561l89136J23786N9279k53
$$ 660516 454432 690021 559336 407286 466945 918506 529370 653156 712435 712182
16334G12182k56610J98697j03892B12632M39143J01284p8622C19178L03408N01131
$$ 712182 455572 654269 550377 212632 651775 753059 674437 319178 622586 1123717
16324A123717l74038j75613J29821j32093j46541o1385N9384J22345A03382P58469
$$ 1123717 749679 574066 703887 571794 425253 363868 423252 545597 103382 861851
16314H61851j85748m6591j64163n4637M8066A98582L26110q1000j0389K33095
$$ 861851 676103 629512 465349 410712 458778 198582 524692 443692 433303 666398
16304F66398j76204o3061m7035J88509B39916K95919K29772j27487k22840K8918
$$ 666398 490194 427133 380098 568607 239916 535835 765607 638120 415280 444198
16294D44198m5413K85500l11802j32327J03005J07146J02995J8610J34873l47883
$$ 444198 398785 684285 372483 240156 343161 450307 553302 571912 706785 358902
16284C58902K46473B28882r5293M04942p0167K64398I2737K76353j4606N3251
$$ 358902 605375 228882 133589 538531 468364 732762 92737 369090 354484 407735
16274D07735j13565L25110a12912D68229r6680K09240j84822N7666A0407N35816
$$ 407735 294170 619280 -112912 468229 371549 580789 395967 453633 10407 546223
16264E46223A17907K92210K13740k15348j34844N2041r0764n3679M09672j8926
$$ 546223 117907 410117 623857 408509 273665 325706 234942 181263 590935 572009
16254E72009G8366M80476j07689J9707p9820p8815p7557K04887K8769m5558q9606
$$ 572009 78366 558842 451153 470860 391040 312225 234668 439555 468324 422766 333160
16243C33160N25A50846Q7504m0113J06805J53470k03750E8808j6942L74989j46704
$$ 333160 333685 150846 238350 198237 305042 458512 254762 58808 41866 416855 270151
16232B70151k6541o7995K50370q464C0513M76448k9975j07196H5204J20778J85530
$$ 270151 243610 175615 425985 417521 30513 506961 476986 369790 85204 205982 391512
16221C91512A38476C1062K07385H7042L02621A62667L25203k43801K90567A87943
$$ 391512 138476 31062 238447 87042 389663 162667 487870 244069 534636 187943
16210C65740K03008k20312L30239C01871j48894N4486J54104r9518M0203f7169
$$ 365740 568748 348436 678675 301871 152977 207463 361567 262049 302252 -67169
16199A59090K31955A07077K65325k3910K743C8579j2840K72461F990b59838A39178
$$ 159090 391045 107077 372402 348492 351235 38579 25739 298200 6990 -259838 139178
16187B70389E9651K00746J13262G3633A8209K73074H4315g6396C08929M7093M0937
$$ 270389 59651 260397 373659 73633 18209 291283 84315 -76396 308929 356022 396959
16176C96959A00189L166L54136A1554g2174A74211o7977R3559D2444Q0682L97350
$$ 396959 100189 103355 457491 11554 -72174 174211 106234 199793 42444 123126 520476
16165E20476A79404N1424D2824O4370J95104r5225J25008m7857a07906b8516B37155
$$ 520476 179404 230828 42824 107194 302298 207073 332081 284224 -107906 -28516 237155
16153d3986A45133K08106A41240K19575r3561j1643b5014D2593i3002D32958B07602
$$ -43986 145133 353239 141240 360815 267254 255611 -25014 42593 -93002 432958 207602
16141A75034J57257r1146K06357A85115J22679d2272C60878j57984J6408r7457
$$ 175034 332291 241145 447502 185115 307794 -42272 360878 202894 219302 121845
16131A21845N1431M1319b30737A68698J41468A44327K17508I2792l144J01886
$$ 121845 173276 214595 -230737 168698 310166 144327 361835 92792 89648 191534
16121A91534k4396M8267d6573j32467A40555L11973k25203G4242K94264b43924
$$ 191534 167138 215405 -46573 -179040 140555 452528 227325 74242 368506 -243924
16110A71564K98499H1724L16457p693I4910L7944a68147A82336a17653D3178E956
$$ 171564 470063 81724 398181 390488 94910 132854 -168147 182336 -117653 43178 5956
16098B83044j9491M2812p1709J78770j96712l2759J9668A4533b48745A08418a85405
$$ 283044 263553 306365 234656 413426 216714 183955 203623 14533 -248745 108418 -185405
16086B89027A21567a84093e9367H6059i1596F251J41598a68675A11493b9561n4307
$$ 289027 121567 -184093 -59367 86059 -91596 6251 147849 -168675 111493 -29561 -83868
16075h3868L2174B44908A04039g7255B85171a83571B70509j33760L113J72718
$$ -83868 -51694 244908 104039 -77255 285171 -183571 270509 136749 139862 312580
16065C12580G3140g135A9321N3232a47137B90938k7241L1970j35987e8821A74445
$$ 312580 73140 -7135 19321 72553 -147137 290938 263697 295667 159680 -58821 174445
16053a82516B13813a10778k41372H4363O1683m0501J69542K29576A69057F6464
$$ -182516 213813 -110778 -352150 84363 146046 105545 275087 504663 169057 66464
16042a21429j11194g0272A54583J5347a33176O0588A40620g9539B15505k3415
$$ -121429 -232623 -70272 154583 169930 -133176 -72588 140620 -79539 215505 192090
16032A92090c1808B12565H9917C6562L1162J90715c4285D49234b24752a00419
$$ 192090 -31808 212565 89917 36562 67724 258439 -34285 449234 -224752 -100419
16021h5681C58663q7007d497j27990L2888C57747C3823C340Q1038K28002b9623
$$ -85681 358663 271656 -4497 -132487 -99599 357747 33823 3340 84378 312380 -29623
16009f2005B20765b86445c7685A73340E2390i4602J2892B44479b91514D8792a93161
$$ -62005 220765 -286445 -37685 173340 52390 -94602 -81710 244479 -291514 48792 -193161
15997e4112C0742K05846j06077b42203J5206e5515r6192A48085k335E8890J24858
$$ -54112 30742 236588 130511 -242203 -226997 -55515 -151707 148085 145750 58890 183748
15986A83748Q3696o5298n5442e7093C16687A08283J93258l2256c08411A45760
$$ 183748 267444 202146 146704 -57093 316687 108283 301541 269285 -308411 145760
15975C73026Q6114j955B13116L20756n6341L56877K7972L34433n65476C07507
$$ 373026 459140 457185 213116 533872 477531 834408 862380 1196813 631337 307507
15964A81223Q1308J2977J20145a57964I6209a61162G269K03663A04762Q4569M4973
$$ 181223 262531 275508 395653 -157964 96209 -161162 7269 210932 104762 189331 234304
15953B34304a44620C6147J58845E0336c34299l1922a21244A04550J17704e529
$$ 234304 -144620 36147 194992 50336 -334299 -366221 -121244 104550 222254 -5529
15942H1126f4980I3857A7914a01952A1827f1662F4254b06246k12111c9649k91
$$ 81126 -64980 93857 17914 -101952 11827 -61662 64254 -206246 -418357 -39649 -39940
15931c9940D3944K21303c431j58396K5646H7267c81150C17931a19055A90439o1353
$$ -39940 43944 265247 -3431 -161827 -136181 87267 -381150 317931 -119055 190439 129086
15920A29086d4785k20167B0360K01063f1902A20016P4088o0900c0127n359k1460
$$ 129086 -44785 -264952 20360 221423 -61902 120016 194104 133204 -30127 -35486 -56946
15909e6946A76199A9217J52979b2194j27517A57093N5890j5303a59168A97171
$$ -56946 176199 19217 172196 -22194 -149711 157093 212983 197680 -159168 197171
15898a1464j74188N9660A249c685G7742b25304O4647A02037d48165a2741j92612
$$ -11464 -185652 -125992 1249 -3685 77742 -225304 -160657 102037 -448165 -12741 -205353
15887b05353H7169f0942A20320C742h7641B26547a30217A28749l1574b74161a23371
$$ -205353 87169 -60942 120320 3742 -87641 226547 -130217 128749 97175 -274161 -123371
15875e8080n3734A22598R2931f5270H8708a67330M5956G7411D09a64333A60609
$$ -58080 -111814 122598 215529 -65270 88708 -167330 -121374 77411 409 -164333 160609
15863C06349d41703F3425J85700E5627a44642d7309A3403c3615j01121k4246G5408
$$ 306349 -441703 63425 249125 55627 -144642 -47309 13403 -33615 -134736 -158982 75408
15851A78714a35209j10347i8234D2889d9382B1438O1905a08889q9509N6954l6563
$$ 178714 -135209 -245556 -98234 42889 -49382 21438 83343 -108889 -198398 -141444 -178007
15840a78007d799k37134E9872c06717A04623a97029F2653L11526j29760b82502
$$ -178007 -4799 -241933 59872 -306717 104623 -197029 62653 374179 244419 -282502
15829a87065k9583e2289A94974b09553B11397j02923B7408J61243a37086E0955
$$ -187065 -216648 -52289 194974 -209553 211397 108474 27408 188651 -137086 50955
15818a45681j6154o0380B15732c07633A44094K4869G8418H439b47814J16135C89542
$$ -145681 -161835 -222215 215732 -307633 144094 168963 78418 8439 -247814 -131679 389542
15806F8284c3427A45363b89431G4222b88796C809a62497J5414B6751b40482R2020
$$ 68284 -33427 145363 -289431 74222 -288796 3809 -162497 -147083 26751 -240482 -148462
15795a48462A1370P9914B7950e4722A046a5402k5759j1732A62111b5430l0296
$$ -148462 11370 91284 27950 -54722 1046 -15402 -41161 -52893 162111 -25430 -55726
15784e5726b6181j26798A75983N7253n6592a95387R7298A40010b12889E3639b84199
$$ -55726 -26181 -152979 175983 233236 176644 -195387 -98089 140010 -212889 53639 -284199
15772A22643c8706l16485e3740k7818A58782a7435j45754A05625a36734A04801
$$ 122643 -38706 -355191 -53740 -81558 158782 -17435 -163189 105625 -136734 104801
15761I6011D4095i6556A0854M001E869a94476b2927j45947B00538E6218B7703
$$ 96011 44095 -96556 10854 14855 5869 -194476 -22927 -168874 200538 56218 27703
15749b3501j84637j94508C4013O7537O7687b7347j65989C1103j1446a20068G8427
$$ -23501 -208138 -402646 34013 101550 169237 -27347 -193336 31103 19657 -120068 78427
15737B06959a5380k21040b8454p3829C816N775a66894n9185F6461J0630a38468
$$ 206959 -15380 -236420 -28454 -102283 3816 9591 -166894 -226079 66461 77091 -138468
15725C10604a47926A63534a72470O1789j1628k14779a31626A78554b54115A34135
$$ 310604 -147926 163534 -172470 -110681 -122309 -337088 -131626 178554 -254115 134135
15714A58304a06176M5296B1337b7599f00D8955c097j16991M2004B9723A399g5636
$$ 158304 -106176 -60880 21337 -27599 -600 48955 -3097 -120088 -78084 29723 1399 -75636
15701c9438k4488j07816o4862A7742b6833k70949n52A55361a40006A40304d9175
$$ -39438 -63926 -171742 -236604 17742 -26833 -297782 -298334 155361 -140006 140304 -49175
15689B10742b46724e5414j83760K6982f199j68399D3162M0195a22412B54471b27920
$$ 210742 -246724 -55414 -239174 -212192 -6199 -174598 43162 83357 -122412 254471 -227920
15677A88189n6117B9735L54527a20683L7160A41844e05684K31635J02709D68798
$$ 188189 132072 29735 384262 -120683 -83523 141844 -505684 -274049 -171340 468798
15666A18954D649a45311L4864A23686d0730B34700g0623C4807J18161a16390j55436
$$ 118954 4649 -145311 -110447 123686 -40730 234700 -70623 34807 152968 -116390 -271826
15655b71826J21104B16098g5300J2599B8694g5821q4861I4749J4541i9973B63773
$$ -271826 -150722 216098 -75300 -62701 28694 -75821 -160682 94749 109290 -99973 263773
15643b19928g725a253C0482a45530A62496f9335j8956j64301c2295a2167l07769
$$ -219928 -7725 -1253 30482 -145530 162496 -69335 -88291 -252592 -32295 -12167 -319936
15632c19936i5464C77582i4207a1890E33432i4447B1669g9110I8969a86261D1284
$$ -319936 -95464 377582 -94207 -11890 533432 -94447 21669 -79110 98969 -186261 41284
15620f5937l6357j4509J109L7547m9716j3916D40193a80038E0951b77936A2326
$$ -65937 -102294 -116803 -115694 -78147 -127863 -141779 440193 -180038 50951 -277936 12326
15608i4556A29816J48580C7440c9816A03650R3339b99093B09543A8393c56025
$$ -94556 129816 278396 37440 -39816 103650 196989 -299093 209543 18393 -356025
15597A89742C7581J72900a02448B37029E2014a64085M7156A6141N8788a71154
$$ 189742 37581 210481 -102448 237029 52014 -164085 -116929 16141 74929 -171154
15586c4974A33416g1791k33135e2376A27731a54201k829J8198B43339q9825a815
$$ -34974 133416 -71791 -304926 -52376 127731 -154201 -157030 -138832 243339 153514 -1815
15574i3657C1142J92070b5972A79942b35244a07682L1478D3748b34484O2261C6861
$$ -93657 31142 223212 -25972 179942 -235244 -107682 -76204 43748 -234484 -172223 36861
15562a05352A7491Q4363j8573P9014g0682k37601F3056a73824I9467i9432k8864
$$ -105352 17491 101854 83281 162295 -70682 -308283 63056 -173824 99467 -99432 -128296
15551a28296D8653P187a64133J5743E8848b13630I7120c1208A62214a87467M8144
$$ -128296 48653 55840 -164133 -148390 58848 -213630 97120 -31208 162214 -187467 -139323
15540a39323B54016b80508A09114b28483j54A06350J00304F1199a17442k35718
$$ -139323 254016 -280508 109114 -228483 -228637 106350 206654 61199 -117442 -353160
15530c53160G1015A6815g2038o4876B45711G2449i0222j96577A44403J29037B7634
$$ -353160 71015 16815 -72038 -136914 245711 72449 -90222 -286799 144403 273440 27634
15518A4456a56347J0858I126L27203a64214I6810b13394c9699C43636a68706D71837
$$ 14456 -156347 -145489 9126 336329 -164214 96810 -213394 -39699 343636 -168706 471837
15506b6079r1486j6320e7666A00169f7492A26292N2181b7972j44298Q417j1081
$$ -26079 -117565 -133885 -57666 100169 -67492 126292 178473 -27972 -172270 -163853 -174934
15495a74934C67668e3426b3421C03356a02103B15292q0441d9214j50145B39671
$$ -174934 367668 -53426 -23421 303356 -102103 215292 134851 -49214 -199359 239671
15484B62094F8214J56423d8012B475K70290j23137J1479d5035E64994b3472J1038
$$ 262094 68214 224637 -48012 2475 272765 149628 161107 -45035 564994 -23472 -12434
15473a2434j0988C66277J1698n8473d0206j0497L408j17457e0368j35282A3248
$$ -12434 -23422 366277 377975 319502 -40206 -50703 -47295 -164752 -50368 -185650 13248
15461C3112J52446K64890q8165P4888J41984K37668I5829L36517i8164B41330
$$ 33112 185558 450448 362283 437171 579155 816823 95829 432346 -98164 241330
15450C48309a37802B23866r4371E8267k0630K87089j39476e9600A06146b40341
$$ 348309 -137802 223866 129495 58267 37637 324726 185250 -59600 106146 -240341
15439E3659P2914g80l0191l50023a2484D03058a19863E7489J06046K86049o5652
$$ 53659 126573 -780 -30971 -380994 -12484 403058 -119863 57489 163535 449584 383932
15428C83932A88489K13934N33056j20771P6340k72369N1804k95016j35491J77809
$$ 383932 188489 402423 935479 814708 891048 618679 670483 375467 239976 417785
15418D17785A50779K42160A01158k3082N943a7824k96690j30375f4593o1356A58683
$$ 417785 150779 392939 101158 78076 84019 -17824 -314514 -444889 -64593 -125949 158683
15406a03658h854I183M8792a50789m508H9729c33842a8784B657J27057i588r7346
$$ -103658 -8854 9183 57975 -150789 -155297 89729 -333842 -18784 2657 129714 -9588 -106934
15394a06934G4435J51618J85893E4140J06389a07826k64361C58453b47440A65502
$$ -106934 74435 226053 411946 54140 160529 -107826 -372187 358453 -247440 165502
15383c07462A23933j3992a11563A46281N9525b01922c2836l605j3040K4545m1352
$$ -307462 123933 109941 -111563 146281 205806 -201922 -32836 -36441 -49481 -24936 -66288
15372f6288B38203a01262k1250j07904E5383J44798A0235a33038B04435G7244
$$ -66288 238203 -101262 -122512 -230416 55383 200181 10235 -133038 204435 77244
15361f9167A46786K5362a06202A9001J95474H6399K96733j67231q2340o0564L88513
$$ -69167 146786 172148 -106202 19001 214475 86399 383132 215901 133561 72997 461510
15350D61510j99536J55391g7623B29487k6888J78319p2885r5173d5768I9071N5025
$$ 461510 261974 417365 -77623 229487 202599 380918 308033 212860 -45768 99071 154096
15339A54096F9010J53495h6628h15H6588J10798a17086a3670A64802m1243l2542
$$ 154096 69010 222505 -86628 -815 86588 197386 -117086 -13670 164802 123559 91017
15328I1017M70519j69170B4414a7016B88122l0633j16599J02116K9084D7458J30236
$$ 91017 561536 392366 24414 -17016 288122 257489 140890 243006 272090 47458 177694
15317A77694L8810I060L77075A90184P7330O9220J37733k09469A27005J8204b53223
$$ 177694 216504 9060 386135 190184 267514 336734 474467 264998 127005 145209 -253223
15305C8168a23239C53203j51584F937N3913J10531Q026A8275Q5147i3724B88390
$$ 38168 -123239 353203 201619 6937 60850 171381 179407 18275 103422 -93724 288390
15293g1285J1594A82002K47723b6662D5964J75185p3685C4777J82152C0091L8821
$$ -71285 -59691 182002 429725 -26662 45964 221149 147464 34777 216929 30091 68912
15282F8912A3136J448a5502b574A63772J41108a6808j19209B14123p7829c32909
$$ 68912 13136 14584 -15502 -2574 163772 304880 -16808 -136017 214123 136294 -332909
15270E229O3621M7025a07956k1524A17222m6983i2241q188I8196a51841B59915
$$ 5229 68850 115875 -107956 -129480 117222 70239 -92241 -100429 98196 -151841 259915
15258C33211j25026a13503j14360B05398E0676Q3016b9043A56041l8207b04542
$$ 333211 208185 -113503 -227863 205398 50676 133692 -29043 156041 117834 -204542
15247A9409M4403a24425A85519A4226J18602b42048A74508b61881B2321a22803
$$ 19409 63812 -124425 185519 14226 132828 -242048 174508 -261881 22321 -122803
15236c4200E5260L92983H7459M19751r3032k8404K85285K22228L50491J9970q5014
$$ -34200 55260 448243 87459 507210 414178 385774 671059 893287 1243778 1263748 1178734
15225A178734J61593E02607l0858B14121P4784G5784f3105C7656M1816a9309B86660
$$ 1178734 1340327 502607 471749 214121 288905 75784 -63105 37656 79472 -19309 286660
15213A1474J28641J01841c0645k2174B2826O9580N1154h0446A44720k3148A2671
$$ 11474 140115 241956 -30645 -52819 22826 92406 143560 -80446 144720 121572 12671
15201E995K7046J78904J50644q4277J21790q6054A33075b2166q9966A91625m1868
$$ 5995 33041 211945 362589 278312 400102 314048 133075 -22166 -112132 191625 149757
15190A49757a53069e0950B23031J20444j6647H2165b86822A15894m0148L35232
$$ 149757 -153069 -50950 223031 343475 326828 82165 -286822 115894 75746 410978
15180D10978E8707b4836F3218P5577a16202n8408L4840a617B83478A20512L7193
$$ 410978 58707 -24836 63218 138795 -116202 -174610 -139770 -1617 283478 120512 157705
15169A57705C378L06733a25813a5576k87801c5257A50776D183K16357g8890A32792
$$ 157705 3378 310111 -125813 -15576 -303377 -35257 150776 4183 220540 -78890 132792
15157a44872A44001P8668g5560J69A11042d6135A33335k5811b840A83669J28588
$$ -144872 144001 222669 -75560 -75391 111042 -46135 133335 107524 -2840 183669 312257
15146C12257b0331I9625B4031J36795d7532B06250a40842c1368A14481a30884
$$ 312257 -20331 99625 24031 160826 -47532 206250 -140842 -31368 114481 -130884
15135G0968J47399n9624G7208O9495K67688B03929I470N34429h6502A24478A4228
$$ 70968 218367 158743 77208 146703 414391 203929 9470 543899 -86502 124478 14228
15123A14138A1985a21613B87331I7062a10034H0885k5667J89076j175G6190a9544
$$ 114138 11985 -121613 287331 97062 -110034 80885 55218 244294 243119 76190 -19544
15111I6509m6172J49453K31178j51800A32737J8689R8582L52075j46977j61743
$$ 96509 50337 199790 430968 279168 132737 151426 250008 602083 455106 293363
15101B93363p4646L3731P9818N7205A29401a6558j29328A71620J87037G7480a092
$$ 293363 218717 252448 332266 389471 129401 -16558 -145886 171620 358657 77480 -1092
15089A74732R3311k9747k3168K99965a6517C81609b54123C59734a0425l1728B26998
$$ 174732 268043 238296 215128 515093 -16517 381609 -254123 359734 -10425 -42153 226998
15077b0068D14341B206P0059L12627C7207J45817K02290i6140B55665J91714B12340
$$ -20068 414341 2206 72265 384892 37207 183024 385314 -96140 255665 447379 212340
15065f8159a3610B63432l5291A09502K58379A46403M9861n851J96510a14251A52163
$$ -68159 -13610 263432 228141 109502 367881 146403 196264 190413 386923 -114251 152163
15053C8299K16749j8989n0607K13319j57737a17034B70127J45408j42018a600
$$ 38299 255048 236059 185452 398771 241034 -117034 270127 415535 273517 -1600
15042B52978J46705l1879k2647K6585j39987M14062B96644K47612h3306E1291
$$ 252978 399683 367804 345157 371742 231755 645817 296644 544256 -83306 51291
15031B67137j28196J21472J9501C4347L72077J47607I2116N6068J32676J92458
$$ 267137 138941 260413 279914 34347 406424 554031 92116 148184 280860 473318
15021D73318K284q9313o2474A18964L32358L6725j50230O6307K62741J02695J8266
$$ 473318 475602 386289 323815 118964 451322 488047 337817 404124 666865 769560 787826
15010G87826C26685J87762m3288j2052A51408M42851j45415A91053M41258k20921
$$ 787826 326685 514447 471159 459107 151408 594259 448844 191053 632311 411390
15000D11390l6834J39180B39849L99909j5394B75185K33014j13433J57781k13096
$$ 411390 374556 513736 239849 639758 624364 275185 508199 394766 552547 339451
14990C39451o0949p6037K02538o0478r3723L73667k41818L71943j48859n8371
$$ 339451 278502 202465 405003 344525 250802 624469 382651 754594 605735 547364
14980E47364j48644j73776R2393j39212K42709L9746p2494n6117J47957j40711
$$ 547364 398720 224944 317337 178125 420834 460580 388086 331969 479926 339215
14970C39215J26007r8522J29231N5345O8463L21943D54500L50855k48493Q7733
$$ 339215 465222 366700 495931 551276 619739 941682 454500 805355 556862 644595
14960F44595j61856j2080J59323j91165K99161j92075k04973N9832N06699B43221
$$ 644595 482739 470659 629982 438817 737978 545903 340930 400762 907461 243221
14949A77213J8557M24835J2578G2699M25074n1257R7632k62285Q3583J6899K76866
$$ 177213 195770 620605 633183 72699 497773 446516 544148 281863 365446 382345 659211
14938F59211p7263q9133p2016A88849J05591j1263J39603N6680J42138k46870
$$ 659211 581948 492815 420799 188849 294440 283177 422780 479460 621598 374728
14928C74728j20795K25734K94569C43612L32927p1936l2942B32998J67631M30724
$$ 374728 253933 479667 774236 343612 676539 604603 571661 232998 400629 831353
14918H31353m08453J23902N1977K5751M54675l47495O00362J62910M8498m7555
$$ 831353 422900 546802 598779 624530 1079205 731710 1332072 1494982 1543480 1495925
14908A495925q8889P5781K8671k64034J67743j38372N43214K58492k78152j5545
$$ 1495925 1407036 1482817 1511488 1247454 1415197 1276825 1820039 2078531 1800379 1784834
14898A784834m5263j91024k64659m57305P5713k80277j93336J80139k9632J17234
$$ 1784834 1739571 1548547 1283888 826583 902296 622019 428683 608822 579190 696424
14888F96424k89694J21898k56491j18456L52683J73422j37954j55332K08720k74695
$$ 696424 406730 528628 272137 153681 506364 679786 541832 386500 595220 320525
14878C20525A45613K63064J23262j89159j27373O38749j97269Q1086k37440K1187
$$ 320525 145613 408677 531939 342780 215407 854156 656887 737973 500533 521720
14868E21720p4252L11774J50901l82963J23509j00702M20052k56818M572k05142
$$ 521720 447468 759242 910143 527180 650689 549987 970039 713221 717793 512651
14858E12651K24157l13304k03245L11040M7718B86842N87164A16946N61552P248
$$ 512651 736808 423504 220259 531299 579017 286842 874006 116946 678498 685746
14848F85746J01422k88344K12424n1553P7982k09155J57459j36552j37046J19141
$$ 685746 787168 498824 711248 659695 737677 528522 685981 549429 412383 531524
14838E31524K31598j464l33595j26396K35532O4435j96605r7370M22515k67176
$$ 531524 763122 761658 428063 301667 537199 601634 405029 307659 730174 462998
14828D62998O18081k56911N8925L48582R98k79661j94522L88617n27724K8707
$$ 462998 1081079 824168 883093 1231675 1232673 953012 758490 1147107 619383 648090
14818F48090k33931J3891K09919l1098j01266J65577K7644l182l2730m7811k45342
$$ 648090 414159 428050 637969 606871 505605 671182 698826 695644 662914 615103 369761
14807C69761K43225K86508D49401O9727q1904K73323J04879C48642P5057K08633
$$ 369761 612986 899494 449401 519128 437224 710547 815426 348642 423699 632332
14797F32332K18033j00064l30807M58322k01219K6923P2293k65249L20374j98359
$$ 632332 850365 750301 419494 877816 676597 703520 775813 510564 830938 632579
14787F32579K61127j21188n8232J33127k03064j3077K66912C83809N6040J01139
$$ 632579 893706 772518 714286 847413 644349 631272 898184 383809 439849 540988
14777E40988L519L25417m25786N2099K46029J32068K03458m74457N25473C91740
$$ 540988 544507 869924 444138 496237 742266 874334 1077792 603335 1128808 391740
14766I18170p9436J61936C69642L71577J61533K3967N4331J1217L0079r7219l43696
$$ 918170 838734 1000670 369642 741219 902752 926719 981050 992267 1022346 925127 581431
14755E81431K28075j92648K12575k72782J71828L4274j02863m320L30832m6833
$$ 581431 809506 616858 829433 556651 728479 762753 659890 655570 986402 939569
14745I39569J0467k17674p9712Q7519k8203N4817l67057Q155J66770p3441J88171
$$ 939569 950036 732362 652650 740169 711966 766783 399726 407881 574651 501210 689381
14734F89381Q1570j01578q2407K30532o1581l05707r0636L18688J10381J9568
$$ 689381 770951 669373 586966 817498 755917 450210 359574 678262 788643 808211
14724H08211J1548J78493j76811K0410J14617J2079K6235k39854J02783j13228
$$ 808211 819759 998252 821441 841851 956468 968547 994782 754928 857711 744483
14714G44483K69875P494M7563L88191N55413k83173r7453j04658l10229N7176
$$ 744483 1014358 1021852 1069415 1457606 2013019 1729846 1632393 1527735 1217506 1274682
14704A274682K3303m0058j18323j95724l3693P838K09069j83750j63527N7270
$$ 1274682 1297985 1257927 1139604 943880 910187 918025 1127094 943344 779817 837087
14694H37087J66406P087J40880j90899J32454j99457K31097J20771j14958M25925
$$ 837087 1003493 1010580 1151460 960561 1093015 893558 1124655 1245426 1130468 1556393
14684A556393K32168k46978j27358J90693k60671m84654K45059J33132J64473
$$ 1556393 1788561 1541583 1414225 1604918 1344247 859593 1104652 1237784 1402257
14675A402257l25353K46698r9583j61691k52056K82454l02496J37762J38190J48120
$$ 1402257 1076904 1323602 1224019 1062328 810272 1092726 790230 927992 1066182 1214302
14665A214302j6706l08761J56078j87189o7295K85160j04901L2746J96842j95067
$$ 1214302 1197596 888835 1044913 857724 790429 1075589 970688 1003434 1200276 1005209
14655A005209K52643l09678J42247k4029J610k95861O15828k42598p8196k14268
$$ 1005209 1257852 948174 1090421 1066392 1068002 772141 1387969 1145371 1067175 852907
14645H52907n4203M26342q4410j54306J52789l01435M27339j74285l8394K93721
$$ 852907 798704 1225046 1140636 986330 1139119 837684 1265023 1090738 1052344 1346065
14635A346065J75949m0774l26007J27190L52525k41848j02004J2378l43698L07262
$$ 1346065 1522014 1481240 1155233 1282423 1634948 1393100 1291096 1303474 959776 1267038
14625A267038k47074K52241O787k5856N7732J84323l01119L09216L600k3606k0680
$$ 1267038 1019964 1272205 1278992 1253136 1310868 1495191 1194072 1503288 1506888 1483282 1462602
14614A462602k7866k95236L08793M5253j70955n2787j27109L60474l71766l9637
$$ 1462602 1434736 1139500 1448293 1493546 1322591 1269804 1142695 1503169 1131403 1091766
14604A091766L74282j87288M57294O8278m10605O4186M37621m30013M2054R855
$$ 1091766 1466048 1278760 1736054 1804332 1393727 1457913 1895534 1465521 1507575 1517430
14594A517430K00846k77041Q3230j70865K023L24154J13885j31180k23441P74297
$$ 1517430 1718276 1441235 1524465 1353600 1355623 1679777 1793662 1662482 1439041 2213338
14584B213338l04107l53665K86784l0205k12709o0528N01500k54615R6820L4118
$$ 2213338 1909231 1555566 1842350 1812145 1599436 1538908 2040408 1785793 1882613 1916731
14574A916731k10701K84031J77715k36951l73502K69801K73504r5848n10767L45821
$$ 1916731 1706030 1990061 2167776 1930825 1557323 1827124 2100628 2004780 1494013 1839834
14564A839834M12093K58707o32740K14053l0125n1822J80173J7116k774M3030
$$ 1839834 2251927 2510634 1877894 2091947 2061822 2010000 2190173 2207289 2204515 2247545
14554B247545R3222k99393K9407N88699j13987J22220k90854M02309j03144K02824
$$ 2247545 2340767 2041374 2070781 2659480 2545493 2667713 2376859 2779168 2676024 2878848
14544B878848k86173L87948N49048j54645P2951M04313M36273O07962Q22679J314836
$$ 2878848 2592675 2980623 3529671 3375026 3447977 3852290 4288563 4896525 5719204 7034040
14534G034040K227049L266611O235788J0499145J839735j1065372o961036m170483
$$ 7034040 9261089 12527700 18763488 29262633 31102368 20036996 13075960 8905477
14526H905477k695912j003114N24118j004214j179479l00018l40303k21184k4026
$$ 8905477 6209565 5206451 5730569 4726355 3546876 3246858 2906555 2685371 2661345
14517B661345m72909L81679l19548J54209k11940K19203M917K01767n2000l4430
$$ 2661345 2188436 2570115 2250567 2404776 2192836 2412039 2416956 2618723 2566723 2532293
14507B532293j98489P3411L2135K44203j25799K28953m14895L30143J16651N7660
$$ 2532293 2333804 2407215 2439350 2683553 2557754 2786707 2371812 2701955 2818606 2876266
14497B876266j39617j9823L2181J60037j07696L25979k42523J33115k8412K91338
$$ 2876266 2736649 2716826 2749007 2909044 2801348 3127327 2884804 3017919 2989507 3280845
14487C280845k79966K42198k92027N25073p4959m23581J87665L49979k61547K00597
$$ 3280845 3000879 3243077 2951050 3476123 3401164 2977583 3165248 3515227 3253680 3454277
14477C454277q9297L4547j75755o7495N70833L2173p8102K61241k37475L62525
$$ 3454277 3364980 3399527 3223772 3156277 3727110 3759283 3681181 3942422 3704947 4067472
14467D067472j47375p0063j33609K55711l87240K06860K37116M8291J57210j05631
$$ 4067472 3920097 3850034 3716425 3972136 3584896 3791756 4028872 4077163 4234373 4128742
14457D128742Q341m5474J00220l9308M05764j18133N0469j12825N1007J52344
$$ 4128742 4137083 4091609 4191829 4152521 4558285 4440152 4490621 4377796 4428803 4581147
14447D581147j5565r2253M90654l47357N93740m12774L06571k55561J45715L58485
$$ 4581147 4565582 4473329 4963983 4616626 5210366 4797592 5104163 4848602 4994317 5352802
14437E352802l8718o1369K91909j91655K42829P012n0221P0004K67060K0923J5019
$$ 5352802 5314084 5252715 5544624 5352969 5595798 5602810 5552589 5622593 5889653 5910576 5925595
14426E925595N9892M00054m54208L88073J19622J58639Q904N7672J58900k70886
$$ 5925595 5985487 6385541 5931333 6319406 6439028 6597667 6606571 6664243 6823143 6552257
14416F552257J07546K33129k33072J64482J47229M35470k49381M64738p3562O13000
$$ 6552257 6659803 6892932 6659860 6824342 6971571 7407041 7157660 7622398 7548836 8161836
14406H161836L6952m10333K37303P90190j24596M4321P660M6497k42724O83333
$$ 8161836 8198788 7788455 8025758 8815948 8691352 8735673 8743333 8789830 8547106 9230439
14396I230439j11884J12019J99870k17038J95647J20438M19642N9287J32349M97082
$$ 9230439 9118555 9230574 9430444 9213406 9409053 9529491 9949133 10008420 10140769 10637851
14386A0637851p6267K4461l7495L68588K24901O30064k00747j74829K85995L21609
$$ 10637851 10561584 10586045 10548550 10917138 11142039 11772103 11571356 11396527 11682522 12004131
14376A2004131k35145N19173m0461N48006M0260N01666J74132P0463L90354J50958
$$ 12004131 11768986 12288159 12247698 12795704 12835964 13337630 13511762 13582225 13972579 14123537
14366A4123537N29948Q6620K25932N37453L75755K02868J49736M97575R2089N51577
$$ 14123537 14653485 14740105 14966037 15503490 15879245 16082113 16231849 16729424 16821513 17373090
14356A7373090j44535Q25541Q2470N64678K84178L26113J0487Q29218K73422O52095
$$ 17373090 17228555 18054096 18136566 18701244 18985422 19311535 19322022 20151240 20424662 21076757
14346B1076757N80924L59939M42358L74018L77536O97407L79177Q08706O72641
$$ 21076757 21657681 22017620 22459978 22833996 23211532 23908939 24288116 25096822 25769463
14337B5769463P7985R15142P90686L73931Q99516N73395Q15770O03989J111402
$$ 25769463 25847448 26762590 27553276 27927207 28826723 29400118 30215888 30819877 31931279
14328C1931279P77745J036507Q28865R13799J018075Q77309J408821J019672R70800
$$ 31931279 32709024 33745531 34574396 35488195 36506270 37383579 38792400 39812072 40782872
14319D0782872J053837J646594J162451J188030J841868J278730J517769J924820
$$ 40782872 41836709 43483303 44645754 45833784 47675652 48954382 50472151 52396971
14311E2396971J368029J812207J980631K111948J557731K703181J867304K466093
$$ 52396971 53765000 55577207 57557838 59669786 61227517 63930698 65798002 68264095
14303F8264095K517710K635341K438857L132519K696482L308600L254200L557653
$$ 68264095 70781805 73417146 75856003 78988522 81685004 84993604 88247804 91805457
14295I1805457L760958M237656M148802M618629M530700N352318N166623N596001
$$ 91805457 95566415 99804071 103952873 108571502 113102202 118454520 123621143 129217144
14287A29217144N914428O771428O830793P635706P658343Q097311Q477104Q722341
$$ 129217144 135131572 141903000 148733793 156369499 164027842 172125153 180602257 189324598
14279A89324598J0080668R881087J0556046J1207104J1960763J2575832J2905355
$$ 189324598 199405266 209286353 219842399 231049503 243010266 255586098 268491453
14272B68491453J3661413J3686269J4229669J4325380J4435904J4598293J4181821
$$ 268491453 282152866 295839135 310068804 324394184 338830088 353428381 367610202
14265C67610202J3739294J3080617J2400878J1264697J0159230R346696P945696
$$ 367610202 381349496 394430113 406830991 418095688 428254918 437601614 445547310
14258D45547310M946405L485105L173116J973015j934911o242794l825437l823250
$$ 445547310 450493715 453978820 457151936 459124951 457190040 450947246 447121809 443298559
14250D43298559m030924r155838j1662546j2702272j2647584j4232172j3525116
$$ 443298559 439267635 430111797 418449251 405746979 393099395 378867223 365342107
14243C65342107j2938835j2976750j3388513j4129926j3533553j3120952j3228600
$$ 365342107 352403272 339426522 326038009 311908083 298374530 285253578 272024978
14236B72024978j2667042j2010259j0814843j2419143j1589016j0952464j0034096
$$ 272024978 259357936 247347677 236532834 224113691 212524675 201572211 191538115
14229A91538115r611279q964972q300491q153233p479015o777721o453015n981793
$$ 191538115 181926836 172961864 164661373 156508140 149029125 142251404 135798389 129816596
14221A29816596o109704n291666n312373m855107m881434l752296m126924m025834
$$ 129816596 123706892 118415226 113102853 108247746 103366312 99614016 95487092 91461258
14213I1461258l550209l381567l146117l443517k751273k634383k658599k819361
$$ 91461258 87911049 84529482 81383365 77939848 75188575 72554192 69895593 67076232
14205F7076232j962921k457992k196515k106007j863820j711095j414178j856721
$$ 67076232 65113311 62655319 60458804 58352797 56488977 54777882 53363704 51506983
14197E1506983j470753j557160j446927j506110r93597j460566r37513j544165
$$ 51506983 50036230 48479070 47032143 45526033 44532436 43071870 42134357 40590192
14189D0590192j080095j108371j044406q13004j063399m10936j302572r61464
$$ 40590192 39510097 38401726 37357320 36544316 35480917 35069981 33767409 32805945
14181C2805945r76343l80126q45632p79847j055438k69425j143967n17793p29491
$$ 32805945 31829602 31449476 30603844 29823997 28768559 28499134 27355167 26837374 26107883
14172B6107883l89628q80886l01462q98721l60176L0830p02626q95739m02768
$$ 26107883 25718255 24837369 24535907 23637186 23277010 23307840 22605214 21709475 21306707
14163B1306707l41468m40515k77966n43730k40587l88369o72068L3968k56821
$$ 21306707 20965239 20524724 20246758 19703028 19462441 19074072 18402004 18435972 18179151
14154A8179151o52319k39943m85077k84133k2089n37743l20454l96444l31295
$$ 18179151 17526832 17286889 16801812 16517679 16495590 15957847 15637393 15240949 14909654
14145A4909654j37414P1154p92800M9980m26115k3145k21234l88290j06172Q2595
$$ 14909654 14772240 14843394 14050594 14100574 13674459 13651314 13430080 13041790 12935618 13018213
14135A3018213o62543M04947o86395N2707l44281j43372l14614l09166O6533p44310
$$ 13018213 12355670 12760617 12074222 12126929 11782648 11639276 11324662 11015496 11082029 10337719
14125A0337719K05470j35037P2479l92403J01531l23161Q2218o24567N47915m18192
$$ 10337719 10543189 10408152 10480631 10088228 10189759 9866598 9948816 9324249 9872164 9453972
14115I453972k89108J08429l47232k62853m6280j10301j2088k86340O2557k93383
$$ 9453972 9164864 9273293 8926061 8663208 8616928 8506627 8494539 8208199 8270756 7977373
14105G977373m1978J99941k35026k74514j71862J29849l2093Q1324l41983J0354
$$ 7977373 7935395 8135336 7900310 7625796 7453934 7583783 7551690 7633014 7291031 7301385
14095G301385k83539p3255j4014j98131j20383n589J05429l301m30357j18446
$$ 7301385 7017846 6944591 6930577 6732446 6612063 6606474 6711903 6708602 6278245 6159799
14085F159799L6454L1242m45605M25605k51299p2016J69204m59364J1153J13346
$$ 6159799 6196253 6227495 5781890 6207495 5956196 5884180 6053384 5594020 5605173 5718519
14075E718519j44573j48293J16404k06218K1668P6666j59086k55092o7775Q702
$$ 5718519 5573946 5425653 5542057 5335839 5357507 5434173 5275087 5019995 4952220 4960922
14065D960922l29834K68429k71095O0973Q3855j50565j70566j04945J32010j42593
$$ 4960922 4631088 4899517 4628422 4689395 4773250 4622685 4452119 4347174 4479184 4336591
14055D336591J98028j16757k36241J27443p6282r0739J16336k85340J04964L10379
$$ 4336591 4534619 4417862 4181621 4309064 4232782 4142043 4258379 3973039 4078003 4388382
14045D388382j81826M3275K14672l42678j5031L2177k13082k0291j99922M11954
$$ 4388382 4206556 4249831 4464503 4121825 4106794 4138971 3925889 3905598 3705676 4117630
14035D117630m86834j81688K82852k09104o2874K26180k50696k87941M02802n71493
$$ 4117630 3630796 3449108 3731960 3522856 3459982 3686162 3435466 3147525 3550327 2978834
14025B978834M84732l4211j26779l56673n4343N6938P2682M82156m72134J79852
$$ 2978834 3463566 3429355 3302576 2945903 2891560 2948498 3021180 3503336 3031202 3211054
14015C211054p6393j58030L29780k47642m27482K34747k79324J66158J61844k1545
$$ 3211054 3134661 2976631 3306411 3058769 2631287 2866034 2586710 2752868 2914712 2893167
14005B893167k60654R8429J50347n27170J01812L21434k97974k21216N34574J42790
$$ 2893167 2632513 2730942 2881289 2354119 2455931 2777365 2479391 2258175 2792749 2935539
13995B935539n72382J21323k85971L29645P989l35033K15619m7364l06453R7542
$$ 2935539 2363157 2484480 2198509 2528154 2536143 2201110 2416729 2369365 2062912 2160454
13985B160454m5529J5911l201p9498L18695K37436k80431K82596K27196N07806
$$ 2160454 2114925 2130836 2127635 2048137 2366832 2604268 2323837 2606433 2833629 3341435
13975C341435O26772K152410K456926N058628J0368237Q395786q759571p126643
$$ 3341435 3968207 6120617 8577543 13636171 24004408 32400194 23640623 16513980
13967A6513980m675251k895465k108743j141609j024975n58556l00476j92913
$$ 16513980 11838729 8943264 6834521 5692912 4667937 4109381 3808905 3615992
13959C615992m06963l86016K04453o7035k67411j09908k27931K11871o0982k24580
$$ 3615992 3209029 2823013 3027466 2960431 2693020 2583112 2355181 2567052 2506070 2281490
13949B281490m3541K63247l82412J35693j16709K6812k20382K32239o6055n5084
$$ 2281490 2237949 2501196 2118784 2254477 2137768 2164580 1944198 2176437 2110382 2055298
13939B055298J14352o456R5755j03678k65439J06306j45529K56721k37472M2111
$$ 2055298 2169650 2163194 2258949 2155271 1889832 1996138 1850609 2107330 1869858 1911969
13929A911969m6923o6056J17893K9566J26769j73281r5341K7493k3666l57513
$$ 1911969 1865046 1798990 1916883 1946449 2073218 1899937 1804596 1832089 1808423 1450910
13919A450910n6079M74987j35976K4794l73241J88364K90546j40074J62066j90687
$$ 1450910 1394831 1869818 1733842 1758636 1385395 1573759 1864305 1724231 1886297 1695610
13909A695610J87859n26042K49021R64n6923k26137l7352j06794L68492K0565
$$ 1695610 1883469 1357427 1606448 1607412 1550489 1324352 1287000 1180206 1548698 1569263
13899A569263j54291j43623L33704m40298L44740n7807R4971j04945J25939n1382
$$ 1569263 1414972 1271349 1605053 1164755 1509495 1451688 1546659 1441714 1567653 1516271
13889A516271J26641j26009j54625k7223k55006L95045m65503M42068j14761q0489
$$ 1516271 1642912 1516903 1362278 1335055 1080049 1475094 1009591 1451659 1336898 1256409
13879A256409L9038J96171o5919m07953M18883k10913p2059J19305m788l31405
$$ 1256409 1295447 1491618 1425699 1017746 1436629 1225716 1153657 1272962 1268174 936769
13869I36769J89409K02561j62828K11028J45586k92708K29306l84594q7109K54039
$$ 936769 1126178 1328739 1165911 1376939 1522525 1229817 1459123 1074529 987420 1241459
13859A241459j18016K75656k39235O2408K7470j40863R1838k30145M06809n32749
$$ 1241459 1123443 1399099 1159864 1222272 1249742 1108879 1200717 970572 1377381 844632
13849H44632J4667J89283K79653j4555j50317N6173k84985J5499K16043r3194
$$ 844632 859299 1048582 1328235 1313680 1163363 1219536 934551 950050 1166093 1072899
13839A072899j57155R9641N53869n05915j10840j73893j25968M37061j03334J27097
$$ 1072899 915744 1015385 1569254 1063339 952499 778606 652638 1089699 986365 1113462
13829A113462m5826k8764j74541J52219j88695K56800j1825l89969M30623k95235
$$ 1113462 1067636 1038872 864331 1016550 827855 1084655 1072830 682861 1113484 818249
13819H18249q3547L44640p1986k45187J93818J99181j16794q5267m68743K65888
$$ 818249 734702 1079342 1007356 762169 955987 1155168 1038374 953107 484364 750252
13809G50252J98806j21951M2813k60366M35767j7817l65167O68J68126j79942
$$ 750252 949058 827107 869920 609554 1045321 1027504 662337 663005 831131 651189
13799F51189R1465K92111P507m7425L3462o7713k55511K60960k2627k9403m2942
$$ 651189 742654 1034765 1042272 994847 1028309 960596 705085 966045 943418 914015 871073
13788H71073K26114j97435j91606J07344Q0065J69208l58354M8204o3496K04839
$$ 871073 1097187 899752 708146 815490 895555 1064763 706409 754613 691117 895956
13778H95956j22279p3122J07063J08675j7102m2029k23680O7672o9988K73789
$$ 895956 773677 700555 807618 916293 899191 857162 633482 701154 631166 904955
13768I04955j43848l16598J70103K60468k01385J69183k95577k50348K15396J90689
$$ 904955 761107 444509 614612 875080 673695 842878 547301 296953 512349 703038
13758G03038o5647L3993R5924k6617k52207N34471j28209D14100K57178K05982
$$ 703038 637391 671384 767308 740691 488484 1022955 894746 414100 671278 877260
13748H77260k29318K49234J0191r6975j71061J03450p3986J42262M6588l36955
$$ 877260 647942 897176 907367 810392 639331 742781 668795 811057 857645 520690
13738E20690K43855k11103K26098k10515L47614k74013K6169J10328L8469j80791
$$ 520690 764545 553442 779540 569025 916639 642626 668795 779123 817592 636801
13728F36801M8847P6167k25903Q8833j82386K51148l34031L17094J6711k15672
$$ 636801 685648 761815 535912 624745 442359 693507 359476 676570 693281 477609
13718D77609j35265l0005K17199K82576k49611j72132M4785L6644P2914l2641
$$ 477609 342344 312339 529538 812114 562503 390371 435156 471800 544714 512073
13708E12073J90728j69485J71387B84249L03470O4223J74918D06998j31324M48515
$$ 512073 702801 533316 704703 284249 587719 651942 826860 406998 275674 724189
13698G24189B16442P8904N20067j16170k39781O4755j33914L5905L89638j76985
$$ 724189 216442 295346 815413 699243 459462 524217 390303 426208 815846 638861
13688F38861k47027A83410L62031k52985K38846j9087n4931J00983J16554k54316
$$ 638861 391834 183410 545441 292456 531302 512215 457284 558267 674821 420505
13678D20505K79615K5702C23344m7457K79987J07057j17338j23502K17583j37320
$$ 420505 700120 725822 323344 275887 555874 662931 545593 422091 639674 502354
13668E02354k29755K45338J30388k92435K14931J21661j27837B24037K98424j13582
$$ 502354 272599 517937 648325 355890 570821 692482 564645 224037 522461 408879
13658D08879K47299j82456M3981k13021J79025j10645J16953M9563A63591K31331
$$ 408879 656178 473722 517703 304682 483707 373062 490015 539578 163591 394922
13648C94922J14363J40710l09992L8762M2619L91090C53395J57029q1448J61070
$$ 394922 509285 649995 340003 378765 421384 812474 353395 510424 428976 590046
13638E90046q9458j89516r9837L97002j12538k8526O0358L2231B54977J58588
$$ 590046 500588 311072 211235 608237 495699 467173 527531 559762 254977 413565
13628D13565L47448r1682C21549J20803k07939K11553q5741o6005J15245Q8839
$$ 413565 761013 669331 321549 442352 234413 445966 360225 294220 409465 498304
13618D98304K398k31142N97579B98157K76345j93008j63609P9828r6539M46277
$$ 498304 500702 269560 867139 298157 574502 381494 217885 297713 201174 647451
13608F47451B92068J6527M06466d0057C86095N059l8757L39553k30196j60524
$$ 647451 292068 308595 715061 -40057 386095 391154 352397 691950 461754 301230
13598C01230K60197p0807B42043n2889P8927M7680K68648j6960K171L1659k73764
$$ 301230 561427 490620 242043 189154 268081 315761 584409 567449 569620 601279 327515
13587C27515L2452P4161j1251P4644A66982L2990l9610i6250F01030c3118C77064
$$ 327515 359967 434128 422877 497521 166982 199972 160362 -96250 601030 -33118 377064
13575D25602l9305K16139r4142j81308p1128K45787k34959J18000j58001K24377
$$ 425602 386297 602436 508294 326986 255858 501645 266686 384686 226685 451062
13565D51062j52763L2900K13760A62801K39003j1771j06890J69343k04415j07405
$$ 451062 298299 331199 544959 162801 401804 390033 283143 452486 248071 140666
13555A40666K84556a16035C53479Q1947M2824j66711j9733R302K07258A38305
$$ 140666 425222 -116035 353479 435426 478250 311539 291806 301108 508366 138305
13544C38035r194I9590J51820J1383J89275B00871L20480j79460J46001j29138
$$ 338035 328841 99590 251410 262793 452068 200871 521351 341891 487892 358754
13534C58754r1670K27686m1996j76160O5349K04802j81121R1632d4838j27533
$$ 358754 267084 494770 452774 276614 341963 546765 365644 457276 -44838 -172371
13524a72371D5046J9041J06373L5075L53403B24084L25577G1327J92898J93989
$$ -172371 45046 64087 170460 205535 558938 224084 549661 71327 264225 458214
13514D58214A61238P9095j01264M23951k77834n3937m2670R9991G1912J46827
$$ 458214 161238 240333 139069 563020 285186 231249 188579 288570 71912 218739
13504B18739J18877A34622J50056E4802L46744j3899n7434f73C36538A09829P398
$$ 218739 337616 134622 284678 54802 401546 387647 330213 -673 336538 109829 117227
13493A17227L35138A85545C7556b713B62016G9350k2945A3202L14517j46256M51405
$$ 117227 452365 185545 37556 -2713 262016 79350 56405 13202 327719 181463 632868
13482F32868n3702B65772k2381h4314n7259C69181o4023E3319J86961G00R4848
$$ 632868 579166 265772 243391 -84314 -141573 369181 305158 53319 240280 700 95548
13471I5548L21693i6062B37852J60719m3887A13726K82649o1579b6127B76475
$$ 95548 417241 -96062 237852 398571 354684 113726 396375 334796 -26127 276475
13460B92246K23591A89247K17017K278R7534B18080k786c7270B70686Q9926I266
$$ 292246 515837 189247 406264 408542 506076 218080 215294 -37270 270686 360612 9266
13448A46731J52359k026j0567I9936O1943J12888a66332C07982h4228B93882a04800
$$ 146731 299090 297064 286497 99936 161879 274767 -166332 307982 -84228 293882 -104800
13436C76332J70355F4928K22971N0712j54283J97880C8966K76775G9830L26778
$$ 376332 546687 64928 287899 338611 184328 382208 38966 315741 79830 406608
13426D06608j74752J73937A72582J18805K38790I5511g8480A4683L62698A76507
$$ 406608 231856 405793 172582 291387 530177 95511 -78480 14683 377381 176507
13415D1246a00477C05872j47351K53104A26277m6010l046M25169A70919a4781
$$ 41246 -100477 305872 158521 411625 126277 80267 77221 502390 170919 -14781
13404C41086D2326M74254A75126K92414N0828A09175J72461c7138B95399a5710
$$ 341086 42326 516580 175126 467540 518368 109175 281636 -37138 295399 -15710
13393D70289F5140K4598K97527G1261J55544K3154e521C98380o2684A37872J97923
$$ 470289 65140 89738 387265 71261 226805 249959 -5521 398380 335696 137872 335795
13382C35795D3552R2524C8432e680j05951B98765j42827J38100j46889K72586
$$ 335795 43552 136076 38432 -5680 -111631 298765 155938 294038 147149 419735
13372D19735A18825R8138d7266A01188d1507A58348K5575E6898b5935A52923Q9290
$$ 419735 118825 216963 -47266 101188 -41507 158348 183923 56898 -25935 152923 242213
13361B42213F8598J70059B2142L81989B7610K98858A27517n6251J07570J46943
$$ 242213 68598 238657 22142 404131 27610 326468 127517 71266 178836 325779
13351C25779j41622k6247Q2776J31199l2176J11897j58146j4896q9009K52814
$$ 325779 184157 157910 240686 371885 339709 451606 293460 278564 189555 442369
13341D42369k4683r6792j12102b1970B33536H8104L59108I3042K97661A94679
$$ 442369 417686 320894 208792 -21970 233536 88104 447212 93042 390703 194679
13330E87272A87573A7610N32297k02413L4956A74255O8740J08532A65794J65921
$$ 587272 187573 17610 549907 347494 382450 174255 242995 351527 165794 331715
13320C31715d5B56026a0345A29926L62214j07372H274M4159Q9684a64193a1021
$$ 331715 -45 256026 -10345 129926 492140 384768 8274 52433 142117 -164193 -11021
13308E3408L68132a88895D51812A80516J63034j69270b4593G4124L95222p3719
$$ 53408 421540 -188895 451812 180516 343550 174280 -24593 74124 469346 395627
13298C95627r9824q9161h5521B91489K9206p7286K04767A40595M9437K14352j43954
$$ 395627 295803 206642 -85521 291489 320695 243409 448176 140595 190032 404384 260430
13287B60430K3028D741K39549q1749e8940A01745J33974E1584a01294A01717m1624
$$ 260430 283458 4741 244290 162541 -58940 101745 235719 51584 -101294 101717 60093
13276F0093L7004k9017L79226j36770B0465M15268A42939K63686A26271M216J17484
$$ 60093 97097 68080 447306 310536 20465 435733 142939 406625 126271 130487 247971
13265B47971j05015g98B33765J56718j03346j14234J07433A08103K14708a95731
$$ 247971 142956 -798 233765 390483 287137 172903 280336 108103 322811 -195731
13254A46695E4953K1288a15900N1074N466C26587n3778A26751J53309A24547a90228
$$ 146695 54953 76241 -115900 -64826 -59360 326587 272809 126751 280060 124547 -190228
13242G1500J2090a71972a8449D94906G0485l2516a09508L1662A23062J89998c27457
$$ 71500 83590 -171972 -18449 494906 70485 37969 -109508 -77846 123062 313060 -327457
13230I6543N8856f2753l3488j19623A9566J58372o8412L31625f9103B7837K06966
$$ 96543 155399 -62753 -96241 -215864 19566 177938 109526 441151 -69103 27837 234803
13219B34803K3993I0557c798B61743c6204D4463L6401J24413e5743j19278B6416
$$ 234803 258796 90557 -3798 261743 -36204 44463 80864 205277 -55743 -175021 26416
13207b5736B30366j10461a16896G4762J48338i5239b7718k43079C08480j03786
$$ -25736 230366 119905 -116896 74762 223100 -95239 -27718 -270797 308480 204694
13197B04694J10910j45874i2836G9153M7255a0197B08033E0602M5902Q1612K6321
$$ 204694 315604 169730 -92836 79153 126408 -10197 208033 50602 96504 178116 204437
13186B04437E1648K23067D9920b28697E506Q6931R866K97917d2484A54666D1405
$$ 204437 51648 274715 49920 -228697 5506 92437 102303 400220 -42484 154666 41405
13174C2863N8952A2739a20860K8865E8746I161J89273a99646f143n6747B68987
$$ 32863 91815 12739 -120860 -91995 58746 9161 198434 -199646 -6143 -62890 268987
13162e1329K5080F2623L53816A6765a51964C64490A14739K9083a91217B57672
$$ -51329 -26249 62623 416439 16765 -151964 364490 114739 143822 -191217 257672
13151A76934J19430F886N4855K97711A27379i9853A36210C3115P4539a32967B03385
$$ 176934 296364 6886 61741 359452 127379 -99853 136210 33115 107654 -132967 203385
13139B28066H1190c1367E32580A65584Q4193j06049A5904F623a07878k7799G8563
$$ 228066 81190 -31367 532580 165584 249777 143728 15904 6623 -107878 -135677 78563
13127C78060a88652i426B44798f2152B19171r6583N3575A8737c9930H1834b62908
$$ 378060 -188652 -9426 244798 -62152 219171 122588 176163 18737 -39930 81834 -262908
13115h819A03441a3212I8408b82224C00888a26405k07651f3016E87J21273A0865
$$ -8819 103441 -13212 98408 -282224 300888 -126405 -334056 -63016 587 121860 10865
13103E024h4097a1233B18862b2283E2761K89676a23045G8683J1637a6290B44926
$$ 5024 -84097 -11233 218862 -22283 52761 342437 -123045 78683 90320 -16290 244926
13091F2234J4340K39132i8628i616H9336i6592D9164b50311B63996b85119C6363
$$ 62234 76574 315706 -98628 -9616 89336 -96592 49164 -250311 263996 -285119 36363
13079a65615N6503C01466A8426K30466A9123a23378d107n3309C05319e1046A6918
$$ -165615 -109112 301466 18426 248892 19123 -123378 -4107 -57416 305319 -51046 16918
13067b7025C27020j32196a08774K5753B96593j32969C4046L0677Q7572J24761
$$ -27025 327020 194824 -108774 -83021 296593 163624 34046 64723 152295 277056
13057B77056F9528B7775J05219A9229a3817A77041b1059j14824E0814K11323j08831
$$ 277056 69528 27775 132994 19229 -13817 177041 -21059 -135883 50814 262137 153306
13046A53306b7841j9013A49782B8500O9224a47648A17143J15573a4963j53335
$$ 153306 -27841 -46854 149782 28500 97724 -147648 117143 232716 -14963 -168298
13036a68298I8462J71042F4602d6075l6122A12335K71036f9685B42338d7315B97945
$$ -168298 98462 269504 64602 -46075 -82197 112335 383371 -69685 242338 -47315 297945
13024A52281J33115A17603O2026a00714B2320J19609n567F390a03037j3478A65884
$$ 152281 285396 117603 179629 -100714 22320 141929 136362 6390 -103037 -116515 165884
13012H8459A1832J23932f5916A80863C2507R6209e7968C0030h9388A31005b5533
$$ 88459 11832 135764 -65916 180863 32507 128716 -57968 30030 -89388 131005 -25533
13000E3536J3491J00594R5238h617D7989g4056A54633K8483c6268B49018F9203
$$ 53536 67027 167621 262859 -8617 47989 -74056 154633 183116 -36268 249018 69203
12988g2662j70738A65440R6603A3864J19085b87312E3177f0004j42798c3202C19040
$$ -72662 -243400 165440 262043 13864 132949 -287312 53177 -60004 -202802 -33202 319040
12976F7233d4089A81616K47466a0393l56291B53783a2192n5342A04264D5488M789
$$ 67233 -44089 181616 429082 -10393 -366684 253783 -12192 -67534 104264 45488 50277
12965E0277j3944K3941b491A64604a59545F3540b6885B64695a36553H1361b06743
$$ 50277 36333 60274 -2491 164604 -159545 63540 -26885 264695 -136553 81361 -206743
12953a71379h3919l1369H6710a5788k6783l4404B03148J06563B3178K98881I4982
$$ -171379 -83919 -115288 86710 -15788 -42571 -76975 203148 309711 23178 322059 94982
12941d7521E8973b84820i3391A30170J06521b45981D02879A7425a3936k09255
$$ -47521 58973 -284820 -93391 130170 236691 -245981 402879 17425 -13936 -223191
12931b23191B28489P5783d3093E3903a38406B73181j9731b4156p8107m9109N1187
$$ -223191 228489 304272 -43093 53903 -138406 273181 253450 -24156 -102263 -151372 -100185
12920a00185j10400D9206a99356G6086B0964N606Q3798r435k4503K1364j1019
$$ -100185 -210585 49206 -199356 76086 20964 26570 110368 100933 76430 97794 86775
12909H6775g117m4320D57561j82796d4735H5994a84779A38936b05882A41404h3115
$$ 86775 -7117 -51437 457561 274765 -44735 85994 -184779 138936 -205882 141404 -83115
12897B99492j6161A6945H079J28401a43841r0844A5336b89450D690L32386A14974
$$ 299492 283331 16945 8079 136480 -143841 -234685 15336 -289450 4690 337076 114974
12885B55258q9983b42812B58213A20626N6849l0355E2131h5217Q653A08847n3145
$$ 255258 165275 -242812 258213 120626 177475 147120 52131 -85217 -76564 108847 55702
12874E5702f8010p9075N4621c682B22358o600M358p2675R514F1528Q0987a20641
$$ 55702 -68010 -147085 -92464 -3682 222358 215758 220116 147441 156955 61528 142515 -120641
12861c95709A7635g6146l9278d3309B6156f354G3800J07361J5937f0301B94907
$$ -395709 17635 -76146 -115424 -43309 26156 -6354 73800 181161 197098 -60301 294907
12849a69689A65561a1842j02019C0179A2356e3224A81671B6807j0047Q2402M9325
$$ -169689 165561 -11842 -113861 30179 12356 -53224 181671 26807 16760 99162 148487
12838A48487A8108b16292H0881c7388A89901b10731q3302O3052Q9547A73358b85747
$$ 148487 18108 -216292 80881 -37388 189901 -210731 -294033 -230981 -141434 173358 -285747
12826a19305L1467E9925L7734a66415Q563p2083I9829b24441C7687J64522e4169
$$ -119305 -87838 59925 97659 -166415 -157852 -229935 99829 -224441 37687 202209 -54169
12814C11212a43770k9390C24882a50377k6747j8507A72034p7722e2179C6713d6406
$$ 311212 -143770 -173160 324882 -150377 -177124 -195631 172034 94312 -52179 36713 -46406
12802C81309c81060a21394I2429f4723H2650k1420J344J62878a8310j51444m597
$$ 381309 -381060 -121394 92429 -64723 82650 61230 62574 225452 -18310 -169754 -174351
12791a74351D44122g2154A98297d3103n6473k3761e3894B73545F0603B0168a37926
$$ -174351 444122 -72154 198297 -43103 -99576 -123337 -53894 273545 60603 20168 -137926
12779A42188D1200b7582A02733d891I4193M3650g2038A68153J57352c87539b0506
$$ 142188 41200 -27582 102733 -4891 94193 137843 -72038 168153 325505 -387539 -20506
12767f5051E7212J15552a04909A1535b6646l0589a8396j37727j41955C85017H0804
$$ -65051 57212 172764 -104909 11535 -26646 -57235 -18396 -156123 -298078 385017 80804
12755F5535A3879O8236c04339J16329j4106g7179n9084B08333b31313h3876o0260
$$ 65535 13879 82115 -304339 -188010 -202116 -77179 -136263 208333 -231313 -83876 -144136
12744a44136q7069D376K0053J45684b86429R8755R2571n6042A54540a89718B68398
$$ -144136 -231205 4376 24429 170113 -286429 -187674 -95103 -151145 154540 -189718 268398
12732A18070j3107n1480g4029m9472G6345J7747h170k64601I7125J5915C0811
$$ 118070 104963 53483 -74029 -123501 76345 94092 -8170 -272771 97125 113040 30811
12720B512a01192A33429J64134d90747a64195F103M5070b88106B50460a90963
$$ 2512 -101192 133429 297563 -490747 -164195 6103 51173 -288106 250460 -190963
12709c43196C32162B7067K7458O8359d9595j60137M9438B7838M6480a90892A98212
$$ -343196 332162 27067 54525 122884 -49595 -209732 -160294 27838 74318 -190892 198212
12697B03452c46612b8083D6645K50808A40823J24976K34414A15732a73308c8218
$$ 203452 -346612 -28083 46645 297453 140823 265799 500213 115732 -173308 -38218
12686A30248Q5430a53088O6560A9106K34014H405L09132A34114a74324C7534J85171
$$ 130248 215678 -153088 -86528 19106 253120 8405 317537 134114 -174324 37534 222705
12675B22705r0953a730C10353e900A46421b04028A24638d9189A27062P7066e0815
$$ 222705 131752 -1730 310353 -5900 146421 -204028 124638 -49189 127062 204128 -50815
12663b91918B78346p5475r0159b08499C11254c3602r9011G3823A3601g8394p9815
$$ -291918 278346 202871 112712 -208499 311254 -33602 -132613 73823 13601 -78394 -158209
12652a58209j7416N3798r4516P6452D20876a65430b0560B68851h3289B78284g0615
$$ -158209 -175625 -121827 -216343 -139891 420876 -165430 -20560 268851 -83289 278284 -70615
12640F9932J80552i2377k4627k7130A49281F9050j2974K39694o5146p7936K7596
$$ 69932 250484 -92377 -117004 -144134 149281 69050 56076 295770 230624 152688 180284
12629A80284o6080K00429A8735K95111E091Q3461D255h6856A46725o2945O6527
$$ 180284 114204 314633 18735 313846 5091 88552 4255 -86856 146725 83780 150307
12618A50307e6489A07029J42670B1030J99938k2424L9067f8249B35819E9502N46956
$$ 150307 -56489 107029 249699 21030 220968 198544 237611 -68249 235819 59502 606458
12607F06458A89776G4022J96687c01826A25993a06128n6416a7642A57279K88361
$$ 606458 189776 74022 270709 -301826 125993 -106128 -162544 -17642 157279 445640
12597D45640F1545A9478J35649b62301b9566A85039b354A4221a15492n3181P8430
$$ 445640 61545 19478 155127 -262301 -29566 185039 -2354 14221 -115492 -168673 -90243
12586i0243A79990k2665b26006A72071l0697J5378a69929l1715h0762G1384K28163
$$ -90243 179990 157325 -226006 172071 141374 156752 -169929 -201644 -80762 71384 299547
12575B99547g5865j44964A25270j8906c04966J12065A25742j1914b97991a0941
$$ 299547 -75865 -220829 125270 106364 -304966 -192901 125742 113828 -297991 -10941
12564e7896I0880C3940N796Q5595C6880I676K8084a55713M1526a9219H557g5305
$$ -57896 90880 33940 39736 125331 36880 9676 37760 -155713 -114187 -19219 8557 -75305
12551a27191A1818J310d7932A58849a06951j03659P3118A46963K12400J85903
$$ -127191 11818 13128 -47932 158849 -106951 -210610 -137492 146963 359363 545266
12541E45266D8336A771i9357B14934E4537a7389B74935a0105l2457e89G5608a97199
$$ 545266 48336 1771 -99357 214934 54537 -17389 274935 -10105 -42562 -589 75608 -197199
12528B6984J81340I6809b9614m282k68892j4401J25146Q4718N1358A61168p5143
$$ 26984 208324 96809 -29614 -33896 -302788 -317189 -192043 -107325 -55967 161168 86025
12517H6025a28868A32151c15469a5509o4112j56035E9067a16593A60621c381j45536
$$ 86025 -128868 132151 -315469 -15509 -79621 -235656 59067 -116593 160621 -3381 -148917
12506a48917P3784j24301M045L1242j4360b5876H5780c8560A38435B0594R5203
$$ -148917 -75133 -199434 -195389 -164147 -178507 -25876 85780 -38560 138435 20594 115797
12495A15797a22991A55894m3751a78982G400J0167a50136d5528D4062A9450J25252
$$ 115797 -122991 155894 112143 -178982 7400 17567 -150136 -45528 44062 19450 144702
12484A44702a70211A9311a08797A30881L3560f0523A40809F6921J69665D5190
$$ 144702 -170211 19311 -108797 130881 164441 -60523 140809 66921 236586 45190
12473B10762m6810q0822d5667F9439a25940A52982r362a12778M9686E0358a93748
$$ 210762 163952 83130 -45667 69439 -125940 152982 143620 -112778 -63092 50358 -193748
12461a83763A43005j9936R378b18763e0717A49741k9995J16949a6603B97025a85595
$$ -183763 143005 123069 132447 -218763 -50717 149741 119746 236695 -16603 297025 -185595
12449b3456j9290A55713E5042a12671B22878a69539A65616f6798q952A26965n7029
$$ -23456 -42746 155713 55042 -112671 222878 -169539 165616 -66798 -75750 126965 69936
12438F9936b33209A38531I831g2245k49020A04449b02310G2602N0531n4437b24381
$$ 69936 -233209 138531 9831 -72245 -321265 104449 -202310 72602 123133 68696 -224381
12426D49381D8a05552O037j08197A9356J39237b23385h9655c8037I7326d3634
$$ 449381 48 -105552 -99515 -207712 19356 158593 -223385 -89655 -38037 97326 -43634
12414C0886b5844A82386L1740F7909i513C8894a28780a8940k11580A26414H725
$$ 30886 -25844 182386 214126 67909 -9513 38894 -128780 -18940 -230520 126414 8725
12402d08161a92994g0800j26706g6217C99601A21118i6428A17129a07989q3392
$$ -408161 -192994 -70800 -197506 -76217 399601 121118 -96428 117129 -107989 -191381
12392a91381f7899A12109J27564m1211g3727A15677a93965i5945j1091F2540a65554
$$ -191381 -67899 112109 239673 198462 -73727 115677 -193965 -95945 -107036 62540 -165554
12380C00550g3130A09258k6208g0317j75558i324j60847B38154I6765c50334a03
$$ 300550 -73130 109258 83050 -70317 -245875 -9324 -170171 238154 96765 -350334 -103
12368A14683f4587B59931a16192A92382C0433N352a00172C09157A0103a27368
$$ 114683 -64587 259931 -116192 192382 30433 35785 -100172 309157 10103 -127368
12357d8977l61155C36763b6427n2491B10517D6550B1075J80259b4521A31776o2293
$$ -48977 -410132 336763 -26427 -78918 210517 46550 21075 201334 -24521 131776 69483
12346F9483A0690a53483j60646a44000D70748I4795J55171a7188j5305n7544c3693
$$ 69483 10690 -153483 -314129 -144000 470748 94795 249966 -17188 -32493 -90037 -33693
12334A17898R773c8707k88072H1372J03674c85889E921a11288C84956a1739k566
$$ 117898 127671 -38707 -326779 81372 185046 -385889 5921 -111288 384956 -11739 -14305
12323a4305l6523m245A18421J40579B22a07496B97452A44531m6355b73783A3623
$$ -14305 -50828 -55073 118421 259000 222 -107496 297452 144531 98176 -273783 13623
12311C43638A40298m5961K74772F273K46809o2842a2947G3734j8995J96249f4704
$$ 343638 140298 94337 369109 6273 253082 190240 -12947 73734 54739 250988 -64704
12299B18291A0121M44900A14728j795A1781K16276f6546o5131C4688J58343a75988
$$ 218291 10121 455021 114728 112933 11781 228057 -66546 -131677 34688 193031 -175988
12287D3705b73254B50904H4977i9871H6572m2754N682k771j6271K3287Q9132J7480
$$ 43705 -273254 250904 84977 -99871 86572 43818 49500 46729 30458 53745 142877 160357
12275A60357a58004A55627J34327q8434n9361o5564B0169L49476A04277d1290
$$ 160357 -158004 155627 289954 201520 142159 76595 20169 369645 104277 -41290
12264A21277J8768l4767K66565B1923N1504a36550A2468L87493A06997J2405E3894
$$ 121277 140045 105278 371843 21923 73427 -136550 12468 399961 106997 119402 53894
12252B04546J10580I253J32217h7025E24609k21103D4506J06580F0816h0639A47704
$$ 204546 315126 9253 141470 -87025 524609 303506 44506 151086 60816 -80639 147704
12240F9354J12505O3959a23886B33912M6411d2446j56484A55539K9001b28981
$$ 69354 181859 245818 -123886 233912 280323 -42446 -198930 155539 184540 -228981
12229A29657K13302i647C18811c07956C90550b48455E74541f7146A78782b27483
$$ 129657 342959 -9647 318811 -307956 390550 -248455 574541 -67146 178782 -227483
12218C01702a40473B68326m072J16184b17114C22464G1947J62909k2918J9271
$$ 301702 -140473 268326 264254 380438 -217114 322464 71947 234856 211938 231209
12208B31209d7665A15689J21489r6963a34676j4990F8264b3481D33287F8163J97584
$$ 231209 -47665 115689 237178 140215 -134676 -149666 68264 -23481 433287 68163 265747
12197B65747c2911C62172d7376E2397J00679J05076N163H3466L3344L03643A74149
$$ 265747 -32911 362172 -47376 52397 153076 258152 263315 83466 116810 420453 174149
12185a52542C7484J91834j3689r7003J52129H1751c9710D44884k20926a27203
$$ -152542 37484 229318 215629 118626 270755 81751 -39710 444884 223958 -127203
12174B34178b1989H7902K2584l9144a03791C9126C640J86695M2028H8616j5075
$$ 234178 -21989 87902 110486 71342 -103791 39126 3640 190335 232363 88616 73541
12163G3541f1393A83841K16973A38343o1229j7754e8639C26231c59139A35192
$$ 73541 -61393 183841 400814 138343 77114 59360 -58639 326231 -359139 135192
12152B08819B1386K94348D6122K96852l532p1997m5259D1860J51027m3596K23478
$$ 208819 21386 315734 46122 342974 339442 267445 222186 41860 192887 149291 372769
12141C72769m9066b62289A71195j8255J24294l4902i438d07A93717F829J9124
$$ 372769 323703 -262289 171195 152940 277234 242332 -9438 -407 193717 6829 25953
12130B5953J03114h4488j9836b6756B91805b50661a5826k64248B08775a63844
$$ 25953 129067 -84488 -104324 -26756 291805 -250661 -15826 -280074 208775 -163844
12119E2847J8962P6169l221K2596B800b4514B57770a2705F0811J66420j12091
$$ 52847 71809 147978 144757 167353 2800 -24514 257770 -12705 60811 227231 115140
12108A15140i9792B36869a6028B32463F7923L3275J72K7996M0249c17315a47122
$$ 115140 -99792 236869 -16028 232463 67923 101198 101370 129366 169615 -317315 -147122
12096B75161e0178E52290k61704a62646J3735a3685j69425b9844n8194C01805
$$ 275161 -50178 552290 290586 -162646 -148911 -13685 -183110 -29844 -88038 301805
12085B53008r4392L48036a61598c354E01532H9149I246h4514q3399B78062B3536
$$ 253008 158616 506652 -161598 -3354 501532 89149 9246 -84514 -167913 278062 23536
12073A80297c23438A37503e1499J4075G4167K45242A20736a04418B01642b85395
$$ 180297 -323438 137503 -51499 -37424 74167 319409 120736 -104418 201642 -285395
12062A84750j365b18247b4537B41403A3309a19617p3207H9962h7870B49720K6190
$$ 184750 183385 -218247 -24537 241403 13309 -119617 -192824 89962 -87870 249720 275910
12051B75910M9306j35995L6091d391n3604j11207a1525B50545D750M74575A63894
$$ 275910 325216 189221 225312 -4391 -57995 -169202 -11525 250545 4750 479325 163894
12039d37268I5195L992O7193C0987K78811A45271K9743e7377n9179I8641b4015
$$ -437268 95195 99187 166380 30987 309798 145271 175014 -57377 -116556 98641 -24015
12027B81913c24645K1832d296k5752o3440F28b26613g7831D9031R1873D5488b27576
$$ 281913 -324645 -302813 -4296 -30048 -93488 628 -226613 -77831 49031 140904 45488 -227576
12014H5551N3294b55913f6225L1565E4715d026A03538h0296a3206m8844B53698
$$ 85551 138845 -255913 -66225 -34660 54715 -4026 103538 -80296 -13206 -62050 253698
12002D3494K40574a64587q3079n7593b9408B68607C8007M1555J89537g459I1331
$$ 43494 284068 -164587 -247666 -305259 -29408 268607 38007 79562 269099 -7459 91331
11990A75823M6514B601b8205B06599E8574N7917c0439E9916B7437J15947J80934
$$ 175823 222337 2601 -28205 206599 58574 116491 -30439 59916 27437 143384 324318
11979C24318A36653D1344R6893J905e3387A93555b21352A4906f7834A60508J0147
$$ 324318 136653 41344 138237 140142 -53387 193555 -221352 14906 -67834 160508 170655
11968A70655g8284A57984e3437A14316a810G681b52506A55537J0025d3427G0889
$$ 170655 -78284 157984 -53437 114316 -1810 7681 -252506 155537 165562 -43427 70889
11956B40887B1323b65981A74139a86455l34997h547q9577k97954a77126j40206
$$ 240887 21323 -265981 174139 -186455 -521452 -8547 -98124 -396078 -177126 -317332
11946c17332a51539I4791K27722D7748L2744b63681f7850o2517O2221a5726k32733
$$ -317332 -151539 94791 322513 47748 80492 -263681 -67850 -130367 -68146 -15726 -248459
11935b48459M6375r4419h2162C03488a04183r637M5389j73141a00242A99137N4213
$$ -248459 -202084 -296503 -82162 303488 -104183 -113820 -68431 -241572 -100242 199137 253350
11924B53350e6412a3599n9912C8144K46604j05903a23185j47211A01532c00212
$$ 253350 -56412 -13599 -73511 38144 284748 178845 -123185 -270396 101532 -300212
11913B6986b23728a3397B39271C4608b99691a39898e7877j453A22338a57435E6012
$$ 26986 -223728 -13397 239271 34608 -299691 -139898 -57877 -59330 122338 -157435 56012
11901C5771J62266b50722e9120j01845C33168h8556k40200C0503d7224h168D8960
$$ 35771 198037 -250722 -59120 -160965 333168 -88556 -328756 30503 -47224 -8168 48960
11889A1954N5855N9895B994e7158M700A15116c0680A65926E553P702b64182c6735
$$ 11954 67809 127704 2994 -57158 -52458 115116 -30680 165926 5553 13255 -264182 -36735
11876A40340N6742n9739B5368a35831A32948p996c68619A88761F6748j6331a1859
$$ 140340 197082 137343 25368 -135831 132948 124952 -368619 188761 66748 50417 -11859
11864B77074a65095e8323A41379a94367l29039i5183D3610f7721C5955E532a99737
$$ 277074 -165095 -58323 141379 -194367 -523406 -95183 43610 -67721 35955 5532 -199737
11852a94777j2818J6057A5407K33811H431f7455b499A1089J09726e9450C2277
$$ -194777 -207595 -191538 15407 249218 8431 -67455 -2499 11089 120815 -59450 32277
11840B360J38077b57576B8368N6430a14647L7880k57286J58264A55464O3404C7840
$$ 2360 140437 -257576 28368 84798 -114647 -76767 -334053 -175789 155464 218868 37840
11828F6610a68573j46623a19111l45635b00494L5709j5370A70946P4048H0627
$$ 66610 -168573 -315196 -119111 -464746 -200494 -164785 -180155 170946 244994 80627
11817g1466j85494C0256a11546d2229k39244h5784A98153a33084O4032j59212
$$ -71466 -256960 30256 -111546 -42229 -281473 -85784 198153 -133084 -69052 -228264
11807b28264R9276H386d25645J80178A10343c12916i991k3200i972k3588j53428
$$ -228264 -128988 8386 -425645 -245467 110343 -312916 -9991 -33191 -9972 -33560 -186988
11796a86988C4879K53188F5018g4844B9739J37849d7715k10367h1122j37966A58271
$$ -186988 34879 288067 65018 -74844 29739 167588 -47715 -258082 -81122 -219088 158271
11784b19466c8417E2298J02692J1416a9076C21637h0470F0956b29080C80853C3041
$$ -219466 -38417 52298 154990 166406 -19076 321637 -80470 60956 -229080 380853 33041
11772G3452b26707J09781e5089j13374P5632A37533h0721k33203a16601B0838
$$ 73452 -226707 -116926 -55089 -168463 -92831 137533 -80721 -313924 -116601 20838
11761a3056j09886a9582E5194J14027k667b25130O6166j08189A7105e1020d071
$$ -13056 -122942 -19582 55194 169221 166554 -225130 -158964 -267153 17105 -51020 -4071
11749G9242j6104a30498A79722c54881d837G1486C5012a01261D9310g4351C8064
$$ 79242 63138 -130498 179722 -354881 -4837 71486 35012 -101261 49310 -74351 38064
11737B95853G7274J55538i1843B23205b35302a12312A84347a69948j99814E4794
$$ 295853 77274 232812 -91843 223205 -235302 -112312 184347 -169948 -369762 54794
11726a21453J2697A4046J58107o5977a82176C31997h747j91017B6101K51625r2020
$$ -121453 -108756 14046 172153 106176 -182176 331997 -8747 -199764 26101 277726 185706
11715A85706a75309k5038I5197c20790A73260a00580M5793A01955J69861e0716
$$ 185706 -175309 -200347 95197 -320790 173260 -100580 -54787 101955 271816 -50716
11704b91379K6456C80360a18958O444D51318d89728B23878e2583A76680a4656
$$ -291379 -264923 380360 -118958 -112514 451318 -489728 223878 -52583 176680 -14656
11693a58958A16587a91759C04101D7723R7413K9377a26533B29189b96045A18105
$$ -158958 116587 -191759 304101 47723 145136 174513 -126533 229189 -296045 118105
11682h2226a3943j53101j63889a62506f6041A78032a40877d522j42677e1878m2710
$$ -82226 -13943 -167044 -330933 -162506 -66041 178032 -140877 -4522 -147199 -51878 -94588
11671i4588l6092A53760a49562d6922F1703B7132a55855g5313A31796C5234b70261
$$ -94588 -130680 153760 -149562 -46922 61703 27132 -155855 -75313 131796 35234 -270261
11659e2762k66764b6498j2180o9076K6256J7094L1967B06146a6970A16315J09329
$$ -52762 -319526 -26498 -38678 -107754 -81498 -64404 -32437 206146 -16970 116315 225644
11648B25644H7094a6895C40793b1867A04507J24735I4621B6491J18919k0180J21062
$$ 225644 87094 -16895 340793 -21867 104507 229242 94621 26491 145410 125230 246292
11637B46292a797G0320b33262N7806A9582a49702C66792a92959A5916c57020H9008
$$ 246292 -1797 70320 -233262 -175456 19582 -149702 366792 -192959 15916 -357020 89008
11625b7650C74182C31J82491e5738b3523h585B04170d0822k76447C0933K1818
$$ -27650 374182 331 182822 -55738 -23523 -8585 204170 -40822 -317269 30933 52751
11614E2751i694D8373J6780a68775E6968M4285f8184b6555A44670b33038F6884
$$ 52751 -9694 48373 65153 -168775 56968 101253 -68184 -26555 144670 -233038 66884
11602b66412a22588B54006C6090b8344B7206h2683h633A54875c03955B8598h3589
$$ -266412 -122588 254006 36090 -28344 27206 -82683 -8633 154875 -303955 28598 -83589
11590C2479J37519l8533a26326n7681c2305j2214J1533j7638a7968A1894K15356
$$ 32479 169998 131465 -126326 -184007 -32305 -44519 -32986 -50624 -17968 11894 227250
11579B27250j8314K04787b02601m7522I4667J18031d3210h406C2506J3232b72746
$$ 227250 208936 413723 -202601 -250123 94667 212698 -43210 -8406 32506 45738 -272746
11567B55532P2732e4621c974j97798A70699a04921A99987A0539R2084K20973g1017
$$ 255532 328264 -54621 -3974 -201772 170699 -104921 199987 10539 102623 323596 -71017
11555f3001j19383e1809A26132J25253E7474J04064a88149g2736j21742C89734
$$ -63001 -182384 -51809 126132 251385 57474 161538 -188149 -72736 -194478 389734
11544a08659A52135E3722N9017l4879j3942b131l33452b4667m6986c343I1773
$$ -108659 152135 53722 112739 77860 63918 -2131 -335583 -24667 -71653 -3343 91773
11532a27737d7919A6249a18847C5876c57309A87321o2588a03277A00334b1025
$$ -127737 -47919 16249 -118847 35876 -357309 187321 124733 -103277 100334 -21025
11521f6121B0252K59344I6419b77887A1401Q5640K68537I0493C0890R0220B2624
$$ -66121 20252 279596 96419 -277887 11401 97041 365578 90493 30890 121110 22624
11509e3661J1664p1508M8769E3194J79706A05036C6878K68200j09191a37855H8296
$$ -53661 -41997 -113505 -64736 53194 232900 105036 36878 305078 195887 -137855 88296
11497B71320C9084h605j44362a7002F4205B2134Q2911b7245A75009o3745a6499
$$ 271320 39084 -8605 -152967 -17002 64205 22134 105045 -27245 175009 111264 -16499
11485B57600j2104c13618C25042R878A0209a21361A16910P577h9750a8577C50398
$$ 257600 245496 -313618 325042 334920 10209 -121361 116910 124487 -89750 -18577 350398
11473B78451j0688f8599A42131o9016i3298A99932a02894j09389B01563K03018
$$ 278451 267763 -68599 142131 73115 -93298 199932 -102894 -212283 201563 404581
11463D04581j40439a03209B62417A16674b551B19317a0499j48066I5890K53181
$$ 404581 264142 -103209 262417 116674 -2551 219317 -10499 -158565 95890 349071
11453C49071j70607D6660c0722A1296J82246d1738H9899K24727G2148N4143M09093
$$ 349071 178464 46660 -30722 11296 193542 -41738 89899 314626 72148 126291 535384
11442E35384k10888G2861J27752P9344A7872Q6849a03262I0832b7750A18313J97221
$$ 535384 324496 72861 200613 279957 17872 104721 -103262 90832 -27750 118313 315534
11431C15534c683A83772J33952A17907j0053J34737j17763h1338D1205j0647a7682
$$ 315534 -3683 183772 317724 117907 107854 242591 124828 -81338 41205 30558 -17682
11419B87139B160h0229I0881h9221A14430a24535m9696H1510K80502j59320a47870
$$ 287139 2160 -80229 90881 -89221 114430 -124535 -174231 81510 362012 202692 -147870
11407B56419F4188L60862a60937a2941D2793K47905a4544A77911A3390d6621l5717
$$ 256419 64188 425050 -160937 -12941 42793 290698 -14544 177911 13390 -46621 -82338
11396h2338l72859g0590k53628J42396d92B13698a64141B17120A00075b24404
$$ -82338 -455197 -70590 -324218 -181822 -492 213698 -164141 217120 100075 -224404
11385A135L99951F4162N43a84665N2796j5396N8183j80077g8487D9956b80275
$$ 1135 401086 64162 64705 -184665 -131869 -147265 -89082 -269159 -78487 49956 -280275
11373a82800a2903B7917b26021C85604B4804a06706C18318i5796c8529a8625j3521
$$ -182800 -12903 27917 -226021 385604 24804 -106706 318318 -95796 -38529 -18625 -32146
11362c2146A29731a70858h1590j25847i3583B46723O3341n1630a8250j48608F5222
$$ -32146 129731 -170858 -81590 -207437 -93583 246723 310064 258434 -18250 -166858 65222
11350A04504J94105j44877d8978k88044p571g0186k09695I857b44306P5854l69859
$$ 104504 298609 153732 -48978 -337022 -344593 -70186 -279881 9857 -244306 -168452 -538311
11339e38311K05402J49926l7288Q3527f3690a7827l53334R4095L7294g6449j48592
$$ -538311 -332909 -182983 -220271 -136744 -63690 -17827 -371161 -277066 -239772 -76449 -225041
11328b25041B6286K4258b29053d2213r5880a2303B32400b46553D3145b66776a08230
$$ -225041 26286 50544 -229053 -42213 -138093 -12303 232400 -246553 43145 -266776 -108230
11316b13458H4095a58947k10938A56397a16372B3705M28561A42662J71318b94617
$$ -213458 84095 -158947 -369885 156397 -116372 23705 452266 142662 313980 -294617
11305b77543B38194A08273B860M2351a42591k2045n3544A03717g6305A07237c50710
$$ -277543 238194 108273 2860 45211 -142591 -164636 -218180 103717 -76305 107237 -350710
11293a93795h5560B67129a6208B72938b39696P8918e8839A7527K40962k2999A7906
$$ -193795 -85560 267129 -16208 272938 -239696 -160778 -58839 17527 258489 235490 17906
11281a67844B4018L3472K2109b79605I7046e91996b40464a7348A42178o8398a41224
$$ -167844 24018 57490 79599 -279605 97046 -591996 -240464 -17348 142178 73780 -141224
11269a0186D4539Q0679C2105d3568D7845b67261J08509j56161J44038J2649A1916
$$ -10186 44539 125218 32105 -43568 47845 -267261 -158752 -314913 -170875 -158226 11916
11257a22376B83918E3205b28773A6622i1969K3753j9127r269G708J60079J3633
$$ -122376 283918 53205 -228773 16622 -91969 -68216 -87343 -96612 7708 167787 181420
11246A81420m7801a12605P18A45366D205a73133B15186M5102g6132A83675a30495
$$ 181420 133619 -112605 -111887 145366 4205 -173133 215186 260288 -76132 183675 -130495
11234a35808A51363a27310e4814A11276c7002n18k09038f1047m4743r5436b3105
$$ -135808 151363 -127310 -54814 111276 -37002 -37520 -246558 -61047 -105790 -201226 -23105
11222a32341j74089D57213A57855C7614a93174C3663b61610R0831k0571A44345
$$ -132341 -306430 457213 157855 37614 -193174 33663 -261610 -170779 -191350 144345
11211a47678H20b65204O2124A42043b13943i3681M2289K577j09506N6518j77845
$$ -147678 820 -265204 -203080 142043 -213943 -93681 -51392 -48815 -158321 -101803 -279648
11200b79648h0668j27085J4801l687M0380A40519l1343c7509k07976a6433l88500
$$ -279648 -80668 -207753 -192952 -196639 -156259 140519 109176 -37509 -245485 -16433 -404933
11189d04933c6635j24024A47374L3010p5599b26141Q9195m5564j31323a5182A61063
$$ -404933 -36635 -160659 147374 180384 104785 -226141 -136946 -182510 -313833 -15182 161063
11177d88664A76521e4011A44971H674J22995b55548q7520D7141b6973B36820c30980
$$ -488664 176521 -54011 144971 8674 131669 -255548 -343068 47141 -26973 236820 -330980
11165c1984G7404j9669a3604l28767f9953p1286J4605j34290j0955C7172a74696
$$ -31984 77404 57735 -13604 -342371 -69953 -141239 -126634 -260924 -271879 37172 -174696
11153a06304k391j57122a06004N2405r0378B18982a2867j7853l3393j1967l0768
$$ -106304 -108695 -265817 -106004 -53599 -143977 218982 -12867 -30720 -64113 -76080 -106848
11142a06848F7723c8387j65094P8018A86542a70096j70595B15180r1536K3818
$$ -106848 67723 -38387 -203481 -125463 186542 -170096 -340691 215180 123644 147462
11132A47462b06132b786k31639h8914j7371I6381J9157c030A10855b36796D1396
$$ 147462 -206132 -2786 -234425 -88914 -106285 96381 115538 -3030 110855 -236796 41396
11120a74012g8204H9365c13897Q2553L6271d91p5732j59202F984J10174E2807
$$ -174012 -78204 89365 -313897 -231344 -195073 -491 -76223 -235425 6984 117158 52807
11108H3543b8732k74185R3442D6562b28334D2401b53B08615a72621A42849a01566
$$ 83543 -28732 -302917 -209475 46562 -228334 42401 -253 208615 -172621 142849 -101566
11096c06247A01288a10594n7314B2164c4403D89220A68743J61212C9931A342K33025
$$ -306247 101288 -110594 -167908 22164 -34403 489220 168743 329955 39931 1342 234367
11085B34367L3621C2180J7826M30256F0499J50006b7125A412d5434p3030M9260
$$ 234367 267988 32180 50006 480262 60499 210505 -27125 1412 -45434 -118464 -69204
11074f9204B69613L0795q2050C7540a5558C18255J65394H6747J41561i201A52897
$$ -69204 269613 300408 218358 37540 -15558 318255 483649 86747 228308 -9201 152897
11062B53921J25666a77559B57895l1828l9529n6761L3245n3481J77127J6890a32141
$$ 253921 379587 -177559 257895 226067 186538 129777 163022 109541 286668 303558 -132141
11050C58150A62981K3133M22055k61392q0591j03781K05087M7216o7701K05377
$$ 358150 162981 186114 608169 346777 266186 162405 367492 414708 347007 552384
11040E52384Q8543l19836M36799p6825J54446k69901k04082J36957J90926J63756
$$ 552384 640927 321091 757890 681065 835511 565610 361528 498485 689411 853167
11030H53167j46000k48313k00009K77591k874J94527k14314j87546Q9448L53769
$$ 853167 707167 458854 258845 536436 533562 728089 513775 326229 415677 769446
11020G69446j39229J0764q0854k39352J70998K5965B21293M89394J88368o8154
$$ 769446 630217 640981 560127 320775 491773 517738 221293 710687 899055 830901
11010H30901l17317B47575M36929j67810j59785L97088l57415K16632j6681k921
$$ 830901 513584 247575 684504 516694 356909 753997 396582 613214 596533 593612
11000E93612j74927J44132B42454K83996N7968K4154C00992L98090l29903j08660
$$ 593612 418685 562817 242454 526450 584418 608572 300992 699082 369179 260519
10990B60519J62874L55007m9136k78458k2030J26217j84814M1671M04564j10699
$$ 260519 423393 778400 729264 450806 428776 554993 370179 411850 816414 705715
10980G05715j06265o3253K65405M2869J14486B68621L05521k79840J33723k10771
$$ 705715 599450 536197 801602 844471 958957 268621 574142 294302 428025 217254
10970B17254N12699J5421K18250D29798L32360L82616l06236J99273j72518J26203
$$ 217254 729953 745374 963624 429798 762158 1144774 838538 1037811 865293 991496
10960I91496L35870j94830L46475K23923j05608M07099j76091J48567P2652j65186
$$ 991496 1327366 1132536 1479011 1702934 1597326 2004425 1828334 1976901 2049553 1884367
10950A884367j90167M80660q45723K57907j55813J47782n77549K74298j11751
$$ 1884367 1694200 2174860 1329137 1587044 1431231 1579013 1001464 1275762 1164011
10941A164011j07700L79802r0538L67940j98965J10167k95145l93800J75873l66445
$$ 1164011 1056311 1436113 1345575 1713515 1514550 1624717 1329572 935772 1111645 745200
10931G45200r3886k15024J37787j12454A32965J21889N67936l78087K7637A76037
$$ 745200 651314 436290 574077 461623 132965 254854 822790 444703 472340 176037
10920e3146A72939p8887e0722j38187C33350H4736L87184A1009K89009a57815
$$ -53146 172939 94052 -50722 -188909 333350 84736 471920 11009 300018 -157815
10909F7932a34776b3705I8199J43552a19538B52914B3622J51214A1667f4140A74155
$$ 67932 -134776 -23705 98199 241751 -119538 252914 23622 174836 11667 -64140 174155
10897b4359H0717N5285k5565b07745f111o9854K0321m02767B28987h9059n0320
$$ -24359 80717 136002 110437 -207745 -6111 -75965 -55644 -458411 228987 -89059 -139379
10886a39379I2529i8582A48014j9152b08298f86l0456k4144m0998b9922k6790
$$ -139379 92529 -98582 148014 128862 -208298 -686 -31142 -55286 -96284 -29922 -56712
10875e6712A00368J4376J0665C304b4597k39902n1316j3757B04962a46065A97378
$$ -56712 100368 114744 125409 3304 -24597 -264499 -315815 -329572 204962 -146065 197378
10863a79819P5908Q08j92546A87745b56153G5082b30006f8705K4360l9K1563k57430
$$ -179819 -103911 -103103 -295649 187745 -256153 75082 -230006 -68705 -44345 -44384 -22821 -280251
10851b80251A908b3231j26091A14756k6847a59940A65685g7922B91024A4100a26128
$$ -280251 1908 -23231 -149322 114756 87909 -159940 165685 -77922 291024 14100 -126128
10839c72608a26586A04976a87296e3254A89821r2915l0032r956J27959c5199a2764
$$ -372608 -126586 104976 -187296 -53254 189821 96906 66874 56918 184877 -35199 -12764
10827e6120J6127k02060c4496l88521J20542L5969j57273a14376l15439d1907
$$ -56120 -39993 -242053 -34496 -423017 -302475 -266506 -423779 -114376 -429815 -41907
10816A45836i2479F7185K46145D7738L1028c8661F9087N4264E3680K58312a2240
$$ 145836 -92479 67185 313330 47738 78766 -38661 69087 123351 53680 311992 -12240
10804a37269N7891E15608b72568f8780G4667a28408k87305d5586D6778b14850
$$ -137269 -79378 515608 -272568 -68780 74667 -128408 -415713 -45586 46778 -214850
10793a59282J7647b062G0986b32211h2347p99B32801a87011b2579A09311R9366
$$ -159282 -141635 -2062 70986 -232211 -82347 -83146 232801 -187011 -22579 109311 208677
10782B08677O3632a10428j32449D9725N6410a66300j17527B0341d10454f3358
$$ 208677 272309 -110428 -242877 49725 106135 -166300 -283827 20341 -410454 -63358
10771C6746b46206J7358f4549j26778I933b6227D1673a51649e0005A97206b19047
$$ 36746 -246206 -228848 -64549 -191327 9933 -26227 41673 -151649 -50005 197206 -219047
10759b48371B68542a44744N1660a4261j48916r0439B29402b06537Q7953A00854
$$ -248371 268542 -144744 -93084 -14261 -163177 -253616 229402 -206537 -118584 100854
10748i2624C8750e2834k60292J49418E4691E403J19673a14252D0253L9339a66952
$$ -92624 38750 -52834 -313126 -163708 54691 5403 125076 -114252 40253 79592 -166952
10736a1191o5419m3703M3856B82271e1590j37329B16624a33569a5028k77713C51452
$$ -11191 -76610 -120313 -76457 282271 -51590 -188919 216624 -133569 -15028 -292741 351452
10724b20128h1098j19376N25K8258H8286b56160A46842P6929a35326n7625n0511
$$ -220128 -81098 -200474 -199949 -171691 88286 -256160 146842 223771 -135326 -192951 -243462
10713b43462d0465q5583B45460I0693K9864b12609G488a03676c7196p5743o9994
$$ -243462 -40465 -126048 245460 90693 120557 -212609 7488 -103676 -37196 -112939 -182933
10702a82933e7938l7434l70379A832a85512l7509A09001K6375a45904M165l27950
$$ -182933 -57938 -95372 -465751 1832 -185512 -223021 109001 135376 -145904 -141739 -469689
10691d69689A38190A5699a11375j30775e1948A08336J0835O4364a94617R6702
$$ -469689 138190 15699 -111375 -242150 -51948 108336 119171 183535 -194617 -97915
10681i7915B88256a80762M0500F7603a65281e5448m19672A98926D3463c6167l8521
$$ -97915 288256 -180762 -140262 67603 -165281 -55448 -475120 198926 43463 -36167 -74688
10670g4688I2134J50079g6680A87424b17238C0297f89j71942j14682A15555i1946
$$ -74688 92134 242213 -76680 187424 -217238 30297 -689 -172631 -287313 115555 -91946
10658a60006A77050G795M3538j0844c0605A90061e0321r8036I6996g7235j72494
$$ -160006 177050 7795 51333 40489 -30605 190061 -50321 -148357 96996 -77235 -249729
10647b49729j0763A72645m5636h3497b3612B95692c55752A97533a47468n4613
$$ -249729 -260492 172645 127009 -83497 -23612 295692 -355752 197533 -147468 -202081
10637b02081B7281A1886J57312F0219b51483I5952a14406M4519l03758A53332
$$ -202081 27281 11886 169198 60219 -251483 95952 -114406 -69887 -373645 153332
10626d117j76257d4360l51195I7688b1880q0014R635p3572Q582A19060a37248
$$ -4117 -180374 -44360 -395555 97688 -21880 -101894 -92259 -165831 -157249 119060 -137248
10614a85392F4227g8427j84722i6592C5426e3449P158A3880k477i930k34899M9997
$$ -185392 64227 -78427 -263149 -96592 35426 -53449 -46291 13880 11403 -9930 -244829 -194832
10602a94832K3858H2878c18321A00863d1178l7263C6251Q2737b61032A00724a22684
$$ -194832 -170974 82878 -318321 100863 -41178 -78441 36251 118988 -261032 100724 -122684
10590a20156k83088A87465d2954k61565e8947A06329e2530C3470K49372a29113
$$ -120156 -403244 187465 -42954 -304519 -58947 106329 -52530 33470 282842 -129113
10579C37595I791O9554b16315A39382a89956f7131A1677b34441O51C1823A5248
$$ 337595 9791 79345 -216315 139382 -189956 -67131 11677 -234441 -233790 31823 15248
10567a29075b8885b309p8735D6974j5263b7033o486h3j93001c1060C504J89871
$$ -129075 -28885 -2309 -81044 46974 31711 -27033 -33519 -83 -193084 -31060 3504 193375
10555A93375d37645b3738k25520M042e0476o4300j44160h4714j76540a19098a3346
$$ 193375 -437645 -23738 -249258 -245216 -50476 -114776 -258936 -84714 -261254 -119098 -13346
10543i6043A95354D8115c8271O937A51788a3512B1009f3262j16284M8235k64443
$$ -96043 195354 48115 -38271 -31334 151788 -13512 21009 -63262 -179546 -131311 -395754
10532c95754J47054A34018D4767a21123A66017o1081a08779j46052H1353K7018
$$ -395754 -248700 134018 44767 -121123 166017 104936 -108779 -254831 81353 108371
10522A08371h0995n70726A8979q352l761K3383K07849q8503R2107A00482a31474
$$ 108371 -80995 -651721 18979 10627 6866 30249 238098 149595 241702 100482 -131474
10510c865l007j22853C98970h2569j91161H5159g5631j85292j328A68358a67175
$$ -3865 -6872 -129725 398970 -82569 -273730 85159 -75631 -260923 -262251 168358 -167175
10498c49452A33728C88b40357D0968K3024c42274B25885f0949B69201j10369a81913
$$ -349452 133728 388 -240357 40968 63992 -342274 225885 -60949 269201 158832 -181913
10486a6179j23799j5996G960J8070d0290a3662m440j57719k6516A49716b21971
$$ -16179 -139978 -155974 7960 26030 -40290 -13662 -18102 -175821 -202337 149716 -221971
10474g5541n480l06197A56004c80480h0564B33235F4259K03123d3371I7187O6962
$$ -75541 -81021 -387218 156004 -380480 -80564 233235 64259 267382 -43371 97187 164149
10463A64149O495R4323n2274K47665j16601K27329k29384A04471i51B572d9263
$$ 164149 170644 264967 212693 460358 343757 571086 341702 104471 -951 2572 -49263
10451a4722j12995N0010A82360e4827A28740K2745b00295M6719O1432C7274i5805
$$ -14722 -127717 -77707 182360 -54827 128740 151485 -200295 -153576 -92144 37274 -95805
10439I1318b07898b7477j53052A59054J75452b08958A62418q0416a46680A7502
$$ 91318 -207898 -27477 -180529 159054 334506 -208958 162418 82002 -146680 17502
10428a73674k38502Q7689A03961d21289J95972F0198b68178F6236K85487C5197
$$ -173674 -412176 -324487 103961 -421289 -225317 60198 -268178 66236 351723 35197
10417g0507K1719A66087a48198B31148i1646I8934d3433a6048j52998B27028f9417
$$ -70507 -48788 166087 -148198 231148 -91646 98934 -43433 -16048 -169046 227028 -69417
10405B12435a83434b3903I7232D7971J8375J52786e6742j28879I8439b90527i4147
$$ 212435 -183434 -23903 97232 47971 66346 219132 -56742 -185621 98439 -290527 -94147
10393a3419B07091a77204E7914b67517j0386O7078c6821p3421J9745Q873r853
$$ -13419 207091 -177204 57914 -267517 -277903 -210825 -36821 -110242 -90497 -81624 -91477
10382i1477c8068n9167B63726j15634m8753l5446a24991J1246A19135E5719g9186
$$ -91477 -38068 -97235 263726 148092 99339 63893 -124991 -113745 119135 55719 -79186
10370c49634B67519l2644A00878c00061e4666A72796d2180A23766f1136A10599
$$ -349634 267519 234875 100878 -300061 -54666 172796 -42180 123766 -61136 110599
10359F6244J13550H4140K07990G2717J92813h6334A97481j236M14722J0001B04662
$$ 66244 179794 84140 292130 72717 265530 -86334 197481 196245 610967 620968 204662
10347B24053j1566K1566D8791L06728K07019k43305J6580a3780B20856r3112a7363
$$ 224053 212487 234053 48791 355519 562538 319233 335813 -13780 220856 127744 -17363
10335i3763A76872P5052G7208L81125K6775j57739L0733e0434B34257L84047H1022
$$ -93763 176872 251924 77208 458333 485108 327369 358102 -50434 234257 618304 81022
10323D13584A01634a36453B37909A14798c6758C349J99479i5061A05273D5344
$$ 413584 101634 -136453 237909 114798 -36758 3349 202828 -95061 105273 45344
10312B23156a02053E4817a14629C92481A0974J67907K88165A05569J50002A25490
$$ 223156 -102053 54817 -114629 392481 10974 178881 467046 105569 255571 125490
10301d0263k7868A29630R0678b65439A43474J10626I217K83409A05893a41028
$$ -40263 -68131 129630 220308 -265439 143474 254100 9217 292626 105893 -141028
10290F2251b09931P4334j81699J5864A69448B653c16407e852k39874F0428b13098
$$ 62251 -209931 -135597 -317296 -301432 169448 2653 -316407 -5852 -245726 60428 -213098
10278a72776Q3963A2320J89326G0956i5245C30965p1062a07322M2309A130b03016
$$ -172776 -88813 12320 201646 70956 -95245 330965 259903 -107322 -65013 1130 -203016
10266d91219J44409A23524e6313k0949j95499J00663L0087p2420B65392a85594
$$ -491219 -346810 123524 -56313 -77262 -272761 -172098 -142011 -214431 265392 -185594
10255f6400p8442A34864m2614l8528D549c8714k66719G5561J76512a48511B00863
$$ -66400 -144842 134864 92250 53722 4549 -38714 -305433 75561 252073 -148511 200863
10243F4864E946a28614A99740M0425q2508m1406j0520Q4268b11416A53148J79931
$$ 64864 5946 -128614 199740 240165 157657 116251 105731 189999 -211416 153148 333079
10232C33079A65996o5443a18782G541K20673g0681H5829a40445j20607h8562A30168
$$ 333079 165996 100553 -118782 7541 228214 -70681 85829 -140445 -261052 -88562 130168
10220d7995B9166L1351K82584a76883f9053A36341a99340B1090i2406A80435q5471
$$ -47995 29166 60517 343101 -176883 -69053 136341 -199340 21090 -92406 180435 94964
10209I4964a53765G2631a61142m1523P1361M7855H0048l1838b34460J2147k1682
$$ 94964 -153765 72631 -161142 -202665 -131304 -83449 80048 48210 -234460 -222313 -243995
10198b43995N1838A74945b08133D1542a19439E5067a96020a6545j02741m2347
$$ -243995 -192157 174945 -208133 41542 -119439 55067 -196020 -16545 -119286 -161633
10188a61633A13902O4016c5313B41044c07975f7863G7177a25075K2905L5664B14486
$$ -161633 113902 177918 -35313 241044 -307975 -67863 77177 -125075 -102170 -66506 214486
10176A25561e2543q8302e8418r5362I6369c09574O5478f2610A61103b10459c3248
$$ 125561 -52543 -140845 -58418 -153780 96369 -309574 -244096 -62610 161103 -210459 -33248
10164c40741C44205b60817a05684n1001k1524A11754f149B23777d5330A02577
$$ -340741 344205 -260817 -105684 -156685 -178209 111754 -6149 223777 -45330 102577
10153a68745b4097l02853J45827A63519A7533J05909L10344b12041A25315a29241
$$ -168745 -24097 -326950 -181123 163519 17533 123442 433786 -212041 125315 -129241
10142b20454n8214J35975j12564d8132n5838j47732A27499n3541a78118m0271
$$ -220454 -278668 -142693 -255257 -48132 -103970 -251702 127499 73958 -178118 -218389
10132b18389e3130k22069k4158H2716b53254b364k85200a9877k37750I814c7570
$$ -218389 -53130 -275199 -299357 82716 -253254 -2364 -287564 -19877 -257627 9814 -37570
10120b89132D8999Q5292P2633A2180M2678a69862m7882g2701B05962c19879e6736
$$ -289132 48999 134291 206924 12180 54858 -169862 -217744 -72701 205962 -319879 -56736
10108b34364D402K24927a13350l0264B03142d58487a81795Q7629B7544b50703
$$ -234364 4402 229329 -113350 -143614 203142 -458487 -181795 -94166 27544 -250703
10097e6777A00467O8991D0516O8678e8318j30259D0490J41539c44606B1962d98122
$$ -56777 100467 169458 40516 109194 -58318 -188577 40490 182029 -344606 21962 -498122
10085B8128J00168J3946a77455k19602J75174B39884C4152a1805q8289k8081L6965
$$ 28128 128296 142242 -177455 -397057 -221883 239884 34152 -11805 -100094 -128175 -91210
10074i1210A1570N3503J37892B38c32249B92269G031a15705j60347p503d3646
$$ -91210 11570 65073 202965 238 -332249 292269 7031 -115705 -276052 -283555 -43646
10062B8234b36777k12073a99326J6914F1694R3954a32568A55591m0007f7958E2872
$$ 28234 -236777 -448850 -199326 -182412 61694 155648 -132568 155591 115584 -67958 52872
10050A1157J36218a44014B12626a6486A06390D6382a49331b4688k33330I9949
$$ 11157 147375 -144014 212626 -16486 106390 46382 -149331 -24688 -258018 99949
10039A43995a09187B1841a51610C2416j4096J24693E0026b52073Q6138q9371D121
$$ 143995 -109187 21841 -151610 32416 18320 143013 50026 -252073 -165935 -255306 4121
10027b19010j69311F2369a46981j27246D2810J06974L2745b14198O3360B08518
$$ -219010 -388321 62369 -146981 -274227 42810 149784 182529 -214198 -150838 208518
10016a25948b7860j15543C2080c39583b7987C09379B9555a45303e8722m3651I0112
$$ -125948 -27860 -143403 32080 -339583 -27987 309379 29555 -145303 -58722 -102373 90112
10004a6649G9461b13128f023j02143I2659C1856a54880J8947c2708J2043m5758
$$ -16649 79461 -213128 -6023 -108166 92659 31856 -154880 -135933 -32708 -20665 -66423
9993f6423A81069h2911j32082j11255E5681a33432p6518B88800e0316I7692f1356
$$ -66423 181069 -82911 -214993 -326248 55681 -133432 -209950 288800 -50316 97692 -61356
9981f3280l3686D3871J0150j1574c69677A55319b93732B0045d5290B14933c02534
$$ -63280 -96966 43871 54021 42447 -369677 155319 -293732 20045 -45290 214933 -302534
9969I3123D4814a5316j32339L5306A18917a02539j16471A50377o5339B3284a18557
$$ 93123 44814 -15316 -147655 -112349 118917 -102539 -219010 150377 85038 23284 -118557
9957a24481H6354c34003K1804e0528k38445B37198j17770b61448a24786k1763
$$ -124481 86354 -334003 -312199 -50528 -288973 237198 119428 -261448 -124786 -146549
9947a46549j15232A12327m6611L8558b7686m3193p1575D8425f5871C9086b72140
$$ -146549 -261781 112327 65716 104274 -27686 -70879 -142454 48425 -65871 39086 -272140
9935c80269C9200b11112D6556J08166c24660A24727k7476R6948a25507j7755B95053
$$ -380269 39200 -211112 46556 154722 -324660 124727 97251 194199 -125507 -143262 295053
9923b92350E5932c61748A00411K09976j04013a97330f345l61092B35922b57296
$$ -292350 55932 -361748 100411 310387 206374 -197330 -6345 -367437 235922 -257296
9912c8361A50153E7165b31479A49601b07939L9556A76789k029k551a04742k98620
$$ -38361 150153 57165 -231479 149601 -207939 -168383 176789 174760 172209 -104742 -403362
9901d03362A50342a97405j34011h3598j3100B68312f8382J317K2440b0392j64852
$$ -403362 150342 -197405 -331416 -83598 -96698 268312 -68382 -67065 -44625 -20392 -185244
9890a85244C158a5095r3070l6206m9104N5158D10944c92781O4976J39671K2367
$$ -185244 3158 -15095 -108165 -144371 -193475 -138317 410944 -392781 -327805 -188134 -165767
9879a65767j28097E65545a23835m237d6168l39083a59722l7110J0819L2367A17167
$$ -165767 -293864 565545 -123835 -128072 -46168 -385251 -159722 -196832 -186013 -153646 117167
9867B06338E6411e4422j34052B21773a54248q5370k88717K13636a54604A83274
$$ 206338 56411 -54422 -188474 221773 -154248 -239618 -528335 -314699 -154604 183274
9856c82633J08108R9364Q4005m7320C05463f357k16684B29112b4730H8864a66295
$$ -382633 -274525 -175161 -91156 -138476 305463 -6357 -223041 229112 -24730 88864 -166295
9844F8648a37856j8440q0964C14195a26646H1797p467c45880a56875f2520k30788
$$ 68648 -137856 -156296 -237260 314195 -126646 81797 74330 -345880 -156875 -62520 -293308
9833b93308A67236q0587J03126a86026P1131j33795j366N8494m7150B7480b49507
$$ -293308 167236 86649 189775 -186026 -114895 -248690 -250056 -191562 -238712 27480 -249507
9821a85365A95710a96015e1383j49527A34602A9626K15643f2647j14362A28071
$$ -185365 195710 -196015 -51383 -200910 134602 19626 235269 -62647 -177009 128071
9810a10458B6989O9734D598c96740c5718A18387B355a57049r325P1156k69071
$$ -110458 26989 96723 4598 -396740 -35718 118387 2355 -157049 -166374 -95218 -364289
9799c64289J30579B77092E039M4375b30627Q0892A79811P225H0887B7460i3562
$$ -364289 -233710 277092 5039 49414 -230627 -149735 179811 187036 80887 27460 -93562
9787b23181a01414k19641J18516K5894k1913E5597a60723E7872L34793c56795
$$ -223181 -101414 -321055 -202539 -176645 -198558 55597 -160723 57872 392665 -356795
9776b75490h3217l89482c6201F0679a38900A7628K1009d03391b6869A39738g9446
$$ -275490 -83217 -472699 -36201 60679 -138900 17628 38637 -403391 -26869 139738 -79446
9764a52060F2553c76600J64286G850C380J03866N3654b00485f5311J6295A77502
$$ -152060 62553 -376600 -212314 7850 3380 107246 160900 -200485 -65311 -49016 177502
9752a67807H816i1020b192j17392N1515A0105b35535e928C12137d59A9787g5879
$$ -167807 8816 -91020 -2192 -119584 -68069 10105 -235535 -5928 312137 -459 19787 -75879
9739C9734a01646A91734g6983r9941n9827I1675c53174g5444K3749A60459A3944
$$ 39734 -101646 191734 -76983 -176924 -236751 91675 -353174 -75444 -51695 160459 13944
9727b4841j98032B25071C0315a75377P0588j471j35134Q5331c2862j84613C5747
$$ -24841 -222873 225071 30315 -175377 -104789 -106260 -241394 -156063 -32862 -217475 35747
9715b06302j56276a34218j62626A21810a2673k73851E9646b59568G9058d27501
$$ -206302 -362578 -134218 -296844 121810 -12673 -286524 59646 -259568 79058 -427501
9704C0797Q142a15349A07131h5799A15124a4979j11666j04686J09620B8620b25188
$$ 30797 38939 -115349 107131 -85799 115124 -14979 -126645 -231331 -121711 28620 -225188
9692d28696a01005n1311O9735B36312G4449k5022J96950a44369A59664b29633
$$ -428696 -101005 -152316 -82581 236312 74449 49427 246377 -144369 159664 -229633
9681a72163d3351B30765o1151C0527c4109B06797b68834a06263a9662I7276P8532
$$ -172163 -43351 230765 169614 30527 -34109 206797 -268834 -106263 -19662 97276 175808
9670A75808a21012j53687J31511O6659B3225e9139k11487a08521M3527A45190
$$ 175808 -121012 -274699 -143188 -76529 23225 -59139 -270626 -108521 -64994 145190
9659B98095a53472P6013j25055e9197D0503b31066a01916A2439c4709p9969L9938
$$ 298095 -153472 -77459 -202514 -59197 40503 -231066 -101916 12439 -34709 -114678 -74740
9648g4740f93o7746O98k36929i5967b1946l34341a70708A59989d7526A91287c16815
$$ -74740 -693 -68439 -67741 -304670 -95967 -21946 -356287 -170708 159989 -47526 191287 -316815
9635a35239N4594B03893E0497c39851d792j09716C46839A6207p031a96189j10084
$$ -135239 -80645 203893 50497 -339851 -4792 -114508 346839 16207 9176 -196189 -306273
9624c06273a22431P09I1966b64091K421g453H4003b75387J07711A9826g1639l8164
$$ -306273 -122431 -121722 91966 -264091 -261670 -7453 84003 -275387 -167676 19826 -71639 -109803
9612a09803a9530m10050g1129o6679H5542g0903l84049D4425J02236j5239B5263
$$ -109803 -19530 -429580 -71129 -137808 85542 -70903 -454952 44425 146661 131422 25263
9600a88742j23970Q8692j32208g6749C0974b83563L708K3531J12815j76803a14176
$$ -188742 -312712 -224020 -356228 -76749 30974 -283563 -279855 -256324 -143509 -320312 -114176
9588A14447E2152a32703M945D9704b06052b560j72777k70248J89277B6087a51122
$$ 114447 52152 -132703 -127758 49704 -206052 -2560 -175337 -445585 -256308 26087 -151122
9576C41948H3478h5576j40439A7580J65790d2386B98650a21975H4655J42218m1604
$$ 341948 83478 -85576 -226015 17580 183370 -42386 298650 -121975 84655 226873 185269
9565A85269g8556j13275o5013i5516B6529R9351b25262A42272l9161J20426b77072
$$ 185269 -78556 -191831 -256844 -95516 26529 125880 -225262 142272 103111 223537 -277072
9553a5309n6674o7604A75847a86027d9430A19490J68786b00018j13556a47670
$$ -15309 -71983 -139587 175847 -186027 -49430 119490 288276 -200018 -313574 -147670
9542e2809j21769f5558A48553a91567L7067b1207j89378C6815J7600K3005a34503
$$ -52809 -174578 -65558 148553 -191567 -154500 -21207 -210585 36815 54415 77420 -134503
9530b00271c2905A68787d23805e7842A12250i4980j59111O2879k19630A05656
$$ -200271 -32905 168787 -423805 -57842 112250 -94980 -254091 -191212 -410842 105656
9519A27367B4342a85762P7375A9542c7967j01546C3586a17775d6923j58634b2015
$$ 127367 24342 -185762 -108387 19542 -37967 -139513 33586 -117775 -46923 -205557 -22015
9507a10871B25541J22215d48772A14011A0693c01956A51612D0733Q5823b06757
$$ -110871 225541 347756 -448772 114011 10693 -301956 151612 40733 126556 -206757
9496g9746r0950j22410J17328b9851j03700L2833A34358a08605B6149i0932o7914
$$ -79746 -170696 -293106 -175778 -29851 -133551 -100718 134358 -108605 26149 -90932 -158846
9485a58846c5848B25673d43328R9694J32440C1427a03001n37435a02127L3074
$$ -158846 -35848 225673 -443328 -343634 -211194 31427 -103001 -640436 -102127 -69053
9475f9053k4313l1402Q248b7351A32052i7891E8600M8545a22487E9255j8846L9053
$$ -69053 -93366 -124768 -116520 -27351 132052 -97891 58600 107145 -122487 59255 40409 79462
9463G9462g929k27708d3374a0430k58635M1170g8212L125J9150A2808e4710k48254
$$ 79462 -7929 -235637 -43374 -10430 -269065 -227895 -78212 -75087 -55937 12808 -54710 -302964
9451c02964L7607m433q9610l9787a7425o3539J3087J9896A03595m2264a72646
$$ -302964 -265357 -269790 -359400 -399187 -17425 -80964 -67877 -47981 103595 61331 -172646
9439B20743A550a63074o8119E9193a37747A69107b11300J01491A2221a4170j16911
$$ 220743 1550 -163074 -231193 59193 -137747 169107 -211300 -109809 12221 -14170 -131081
9428a31081E0562d2893j10303A25196h1437C027a58519e3536B11063b12130C10735
$$ -131081 50562 -42893 -153196 125196 -81437 3027 -158519 -53536 211063 -212130 310735
9416c2720A29513b12624e3823j21532r0773g4359J9986I7223K54632a30664A37125
$$ -32720 129513 -212624 -53823 -175355 -266128 -74359 -54373 97223 351855 -130664 137125
9404D0222O557e253j9776j8076g959K483C28660p4687E099b273H9321h119j55331
$$ 40222 46779 -5253 -25029 -43105 -7959 -5476 328660 253973 5099 -2273 89321 -8119 -163450
9391a63450j11210C10672c66902a65682h1305H5069c59747e2105k44867a46277
$$ -163450 -274660 310672 -366902 -165682 -81305 85069 -359747 -52105 -296972 -146277
9380a11330l27449B1779K3676a45683B96934A0182K8679b19560c9413m9258a1547
$$ -111330 -438779 21779 45455 -145683 296934 10182 38861 -219560 -39413 -88671 -11547
9368a25112J0336l10921G3875M3595a99106R7204C43143j61578a35968b2343A5907
$$ -125112 -114776 -425697 73875 117470 -199106 -101902 343143 181565 -135968 -22343 15907
9356I4708e5656k20465b1995j66718E6442b70757a0203A71339D4664b925A1198
$$ 94708 -55656 -276121 -21995 -188713 56442 -270757 -10203 171339 44664 -2925 11198
9344d2147l3753a2377o4470J1614B14602a10694A35054m7661a01360B32909H7140
$$ -42147 -75900 -12377 -76847 -65233 214602 -110694 135054 87393 -101360 232909 87140
9332A33997a06550o3305A03327e8852a9196j08921n7988a2599j31601f8564c2583
$$ 133997 -106550 -169855 103327 -58852 -19196 -128117 -186105 -12599 -144200 -68564 -32583
9320c9387m24263a02864A19159I665e0701j88789M716A64750b57778e6321k49035
$$ -39387 -463650 -102864 119159 9665 -50701 -239490 -234774 164750 -257778 -56321 -305356
9309c05356A34371a80894B50255c4754j5412A08678g3795H1690K7426a18234B14603
$$ -305356 134371 -180894 250255 -34754 -50166 108678 -73795 81690 109116 -118234 214603
9297a16240J8942A97447i7657L7930k29675d8666j9113j51143B6391J42428a25693
$$ -116240 -97298 197447 -97657 -59727 -289402 -48666 -67779 -218922 26391 168819 -125693
9285h2992C0113K23703e6777C9706b45416c1029j54506m9042J04474N6794k27360
$$ -82992 30113 253816 -56777 39706 -245416 -31029 -185535 -234577 -130103 -73309 -300669
9274c00669P0967c0703a3542j98711j13093b5912m70C62591I524h3951n9824j09369
$$ -300669 -229702 -30703 -13542 -212253 -325346 -25912 -26382 362591 9524 -83951 -143775 -253144
9262b53144J6520q6437d938G5034B0594M9733A4757h1255k1074k1153k25988J58700
$$ -253144 -236624 -323061 -4938 75034 20594 70327 14757 -81255 -102329 -123482 -349470 -190770
9250a90770j12982P9636L1133f5423k00346g215I8015i0319d1921a3332k15738
$$ -190770 -303752 -224116 -192983 -65423 -265769 -7215 98015 -90319 -41921 -13332 -229070
9239b29070O7203B51243I6938J36187c10653J2559c4739A0958O7834a00395J7194
$$ -229070 -161867 251243 96938 233125 -310653 -298094 -34739 10958 78792 -100395 -83201
9228h3201K317q7860C54515A38481m9539J4173b21499r8852J34320D659a77881
$$ -83201 -80884 -168744 354515 138481 88942 103115 -221499 -320351 -186031 4659 -177881
9216i6498A3092a53813j16913A21924A3106c13k92255B9071O9005a06764N983
$$ -96498 13092 -153813 -270726 121924 13106 -313 -292568 29071 98076 -106764 -100781
9205a00781D66i0341B6615L343G283L5627a81494L772B00764b0998B98532a46061
$$ -100781 466 -90341 26615 29958 7283 42910 -181494 -177722 200764 -20998 298532 -146061
9192b08498a8770A88128b75982g8592B39453A16309f1941j55691I8041b57645
$$ -208498 -18770 188128 -275982 -78592 239453 116309 -61941 -217632 98041 -257645
9181H2710C3154a73882F098b6028B29263E1697a85643C01334a36109k758j00191
$$ 82710 33154 -173882 6098 -26028 229263 51697 -185643 301334 -136109 -138867 -239058
9170b39058A33307c70295A00301a18165k3969G3640c68168C35447b22811d8293
$$ -239058 133307 -370295 100301 -118165 -142134 73640 -368168 335447 -222811 -48293
9159i7666B29503d4157D153K26047a37730d2229b0551r0252B32350I6862c53754
$$ -97666 229503 -44157 4153 230200 -137730 -42229 -20551 -110803 232350 96862 -353754
9147g2257L0764k88143B44461b31267e0267q5163a0764l03064h4208A381g3613
$$ -72257 -41493 -329636 244461 -231267 -50267 -135430 -10764 -313828 -84208 1381 -73613
9135B22228i4832A12781h4757j00531c4391m7817C7528g3802k49933C28500F3361
$$ 222228 -94832 112781 -84757 -185288 -34391 -82208 37528 -73802 -323735 328500 63361
9123i4663a223G8977J0617g0656q7665D6602e9472b6937A47586E089a1679k97751
$$ -94663 -1223 78977 89594 -70656 -158321 46602 -59472 -26937 147586 5089 -11679 -309430
9111c09430J03319k18633a00612J1289L079k83803F125J93371c55748m1377B0562
$$ -309430 -206111 -424744 -100612 -89323 -86244 -370047 6125 199496 -355748 -397125 20562
9099a44328d1707j45243j66375a06586k08636A73309b85220a07891A85078c5898
$$ -144328 -41707 -186950 -353325 -106586 -315222 173309 -285220 -107891 185078 -35898
9088e5482P509C4260c23456j41132a31028j24293a04350A99922e7795l6594A28068
$$ -55482 -47973 34260 -323456 -464588 -131028 -255321 -104350 199922 -57795 -94389 128068
9076a78065j8495E0969M1740b40897C6651Q753b26410Q3035F7894J04538i031
$$ -178065 -196560 50969 92709 -240897 36651 45404 -226410 -143375 67894 172432 -9031
9064g4535l27166a13972j21642b4516H2162f25579b34412A3288b47451A96471
$$ -74535 -401701 -113972 -235614 -24516 82162 -625579 -234412 13288 -247451 196471
9053c8220k2738k0970J5705A36357A8845M544N7193K3869J55660C6379p975M0748
$$ -38220 -60958 -81928 -66223 136357 18845 23389 80582 104451 260111 36379 28404 69152
9041F9152d786D0573b09601e8138i394j7668Q528A22177b72765h3479a4179I7045
$$ 69152 -4786 40573 -209601 -58138 -9394 -27062 -18534 122177 -272765 -83479 -14179 97045
9028B32413c6482k86463D1788f7440C03469E2835j4040a16202j05934A96809n2740
$$ 232413 -36482 -322945 41788 -67440 303469 52835 38795 -116202 -222136 196809 144069
9017A44069K01739b73295e5499A64759b00195f653C3465M1441c28602H9501b6010
$$ 144069 345808 -273295 -55499 164759 -200195 -6653 33465 74906 -328602 89501 -26010
9005a63861c1744A8403c60610D5476a27508j1903k35313a50714M4334j55583p8383
$$ -163861 -31744 18403 -360610 45476 -127508 -139411 -374724 -150714 -106380 -261963 -340346
8994c40346k0201a30559L6547F4441b26168e156r6143k17561a29881L8602a5778
$$ -340346 -360547 -130559 -94012 64441 -226168 -5156 -101299 -318860 -129881 -91279 -15778
8982A72512c07440o4510f1583k39326J12240A16507a67028a4181j14755r0266
$$ 172512 -307440 -371950 -61583 -300909 -188669 116507 -167028 -14181 -128936 -219202
8972b19202p443a12490A50097Q265k4580C6648M6118a54684P5563p2935J8262
$$ -219202 -226645 -112490 150097 158362 133782 36648 82766 -154684 -79121 -152056 -133794
8961a33794E6380a87841A13625b72943h2226A63496f205H3271M3013J02204e4930
$$ -133794 56380 -187841 113625 -272943 -82226 163496 -6205 83271 126284 228488 -54930
8949c7230B08127E977c03129B51852a62921J0832k5130A39925P7380b55404a2836
$$ -37230 208127 5977 -303129 251852 -162921 -152089 -177219 139925 217305 -255404 -12836
8937g0928k64401A12484g4990K3552D6562Q0052a39112E3303a13675a8421j52508
$$ -70928 -335329 112484 -74990 -51438 46562 126614 -139112 53303 -113675 -18421 -170929
8926a70929D1961J2375A0027a86445a4050k5458B3457L6732f8629e341D0626c16816
$$ -170929 41961 54336 10027 -186445 -14050 -39508 23457 60189 -68629 -5341 40626 -316816
8913A06908e7688B63171n8068p7244a78225F78314j73250N41898M91179K667711
$$ 106908 -57688 263171 205103 127859 -178225 678314 505064 1046962 1538141 4205852
8903D205852L517546l629829j535557j149042r9508C61489J41426n6079I6128
$$ 4205852 7723398 4093569 2558012 1408970 1309462 361489 502915 446836 96128
8893E2097b0277E4703b164p9116J4114j86256k4120J07299P1592j10147d5685
$$ 52097 -20277 54703 -2164 -81280 -67166 -253422 -277542 -170243 -98651 -208798 -45685
8881d32640G4068f0421C351c43700a41396b9864A81465E686J03017c07813d7030
$$ -432640 74068 -60421 3351 -343700 -141396 -29864 181465 5686 108703 -307813 -47030
8869d51937K00561Q992j0447A14080b99180j8965d0910j28980G2898f5429J5147
$$ -451937 -251376 -242384 -252831 114080 -299180 -318145 -40910 -169890 72898 -65429 -50282
8858e0282k77860H1885b63782b9374G6788D928N4658b21234B71088e2219l2550
$$ -50282 -328142 81885 -263782 -29374 76788 4928 59586 -221234 271088 -52219 -84769
8847h4769H7995K5504l9439N3703h4667j8655I6442a64997P4960m7325f7134p7719
$$ -84769 87995 113499 74060 127763 -84667 -103322 96442 -164997 -90037 -137362 -67134 -144853
$$ [...]
##END NTUPLES=NMR SPECTRUM
##END=
