
##TITLE=AC1109_Colombia_5835779_yvp2IzYgP9
##JCAMPDX= 6.0         $$ Bruker NMR JCAMP-DX V2.0
##DATA TYPE= NMR SPECTRUM
##DATA CLASS= NTUPLES
##ORIGIN= BRUKER
##OWNER= Administrator
$$ 1.72 TOPSPIN		Version 2.1
$$ 2012-04-16 19:08:22.859 -0500  Administrator@TOPSPIN
$$ Compression mode = diff/dup
##.OBSERVE FREQUENCY= 400.13188235
##.OBSERVE NUCLEUS= ^1H
##.ACQUISITION MODE= SIMULTANEOUS (DQD)
##.ACQUISITION SCHEME= undefined
##.AVERAGES= 64
##.DIGITISER RES= 22
##SPECTROMETER/DATA SYSTEM= spect
##.PULSE SEQUENCE= noesygpps1d.comp
##.SOLVENT NAME= COFFEE_meoh
##.SHIFT REFERENCE= INTERNAL, COFFEE_meoh, 1, 14.96849
##AUDIT TRAIL= $$ (NUMBER, WHEN, WHO, WHERE, PROCESS, VERSION, WHAT)
$$ ##TITLE= Audit trail, TOPSPIN		Version 2.1
$$ ##JCAMPDX= 5.01
$$ ##ORIGIN= Bruker BioSpin GmbH
$$ ##OWNER= Administrator
$$ $$ C:\Bruker\TOPSPIN/data/COFFEE/nmr/AC1109_Colombia_5835779_yvp2IzYgP9/32/pdata/1/auditp.txt
$$ ##AUDIT TRAIL=  $$ (NUMBER, WHEN, WHO, WHERE, PROCESS, VERSION, WHAT)
(   1,<2012-04-15 15:34:06.281 -0500>,<Administrator>,<TOPSPIN>,<go>,<TOPSPIN 2.1>,
      <created by zg
	started at 2012-04-15 15:22:34.703 -0500,
	POWCHK enabled, PULCHK disabled,
       configuration hash MD5:
       1A 1E CE 29 27 FD 77 03 67 4E F0 E3 C4 B2 CB 90
       data hash MD5: 64K
       86 47 2A D8 0F AD F4 AA BC 69 1E 72 FD C5 51 5B>)
(   2,<2012-04-15 15:34:09.000 -0500>,<Administrator>,<TOPSPIN>,<proc1d>,<TOPSPIN 2.1>,
      <Start of raw data processing
       efp LB = 0.3 FT_mod = 6 PKNL = 1 PHC0 = 0 PHC1 = 0 SI = 128K 
       data hash MD5: 128K
       F4 1C 44 D8 24 AA C8 4A 40 42 3F E1 9C 57 E2 C9>)
(   3,<2012-04-15 15:34:10.281 -0500>,<Administrator>,<TOPSPIN>,<proc1d>,<TOPSPIN 2.1>,
      <pk PHC0 = 34.4696 PHC1 = 0 
       data hash MD5: 128K
       A8 9A AB 5E D2 7F 9C 1D 5C 65 D3 C0 14 56 52 C0>)
(   4,<2012-04-15 15:34:10.515 -0500>,<Administrator>,<TOPSPIN>,<proc1d>,<TOPSPIN 2.1>,
      <abs ABSG = 1 
       data hash MD5: 128K
       EE A4 12 70 65 B3 8B AC 6F EB 61 FA 01 58 75 47>)
(   5,<2012-04-15 15:34:10.593 -0500>,<Administrator>,<TOPSPIN>,<proc1d>,<TOPSPIN 2.1>,
      <abs ABSG = 2 
       data hash MD5: 128K
       38 7B B9 12 D4 45 E2 6E B8 57 5F 18 70 60 54 2A>)
(   6,<2012-04-15 15:34:10.656 -0500>,<Administrator>,<TOPSPIN>,<proc1d>,<TOPSPIN 2.1>,
      <abs ABSG = 3 
       data hash MD5: 128K
       8B 90 A9 EC AD AA 43 C3 A8 0C 5A C8 94 AC 49 E5>)
(   7,<2012-04-15 15:34:10.875 -0500>,<Administrator>,<TOPSPIN>,<proc1d>,<TOPSPIN 2.1>,
      <abs ABSG = 4 
       data hash MD5: 128K
       8C CA A0 E6 8B 44 3D 59 39 87 02 6C FB C1 D4 1E>)
(   8,<2012-04-15 15:34:10.921 -0500>,<Administrator>,<TOPSPIN>,<proc1d>,<TOPSPIN 2.1>,
      <abs ABSG = 5 
       data hash MD5: 128K
       F3 24 EC C6 3D 4C 4B E0 45 E0 23 85 16 3B 81 8F>)
(   9,<2012-04-15 15:34:11.171 -0500>,<Administrator>,<TOPSPIN>,<audit>,<TOPSPIN 2.1>,
      <user comment:
       ICON-NMR User ID: COFFEE
       data hash MD5: 128K
$$ [...]
##$TP07= 0
##$TPNAME0= <>
##$TPNAME1= <>
##$TPNAME2= <>
##$TPNAME3= <>
##$TPNAME4= <>
##$TPNAME5= <>
##$TPNAME6= <>
##$TPNAME7= <>
##$TPOAL= (0..7)
0.5 0.5 0.5 0.5 0.5 0.5 0.5 0.5
##$TPOFFS= (0..7)
0 0 0 0 0 0 0 0
##$TUNHIN= 0
##$TUNHOUT= 0
##$TUNXOUT= 0
##$USERA1= <user>
##$USERA2= <user>
##$USERA3= <user>
##$USERA4= <user>
##$USERA5= <user>
##$V9= 5
##$VALIST= <valist>
##$VCLIST= <CCCCCCCCCCCCCCC>
##$VD= 0
##$VDLIST= <DDDDDDDDDDDDDDD>
##$VPLIST= <PPPPPPPPPPPPPPP>
##$VTLIST= <TTTTTTTTTTTTTTT>
##$WBST= 2048
##$WBSW= 25
##$XGAIN= (0..3)
0 0 0 0
##$XL= 0
##$YL= 0
##$YMAX_a= 11266780
##$YMIN_a= -6843002
##$ZGOPTNS= <>
##$ZL1= 120
##$ZL2= 120
##$ZL3= 120
##$ZL4= 120
##$ABSF1= 14.96849
##$ABSF2= -5.584041
##$ABSG= 5
##$ABSL= 3
##$ALPHA= 0
##$AQORDER= 0
##$ASSFAC= 0
##$ASSFACI= 0
##$ASSFACX= 0
##$ASSWID= 0
##$AUNMP= <proc_prof1d_extract.lims>
##$AXLEFT= 0
##$AXNAME= <>
##$AXNUC= <1H>
##$AXRIGHT= 0
##$AXTYPE= 0
##$AXUNIT= <>
##$AZFE= 0.1
##$AZFW= 0.1
##$BCFW= 0
##$BC_mod= 0
##$BYTORDP= 0
##$COROFFS= 0
##$CY= 15
##$DATMOD= 1
##$DC= 0
##$DFILT= <>
##$DTYPP= 0
##$F1P= 0
##$F2P= 0
##$FCOR= 0.5
##$FTSIZE= 131072
##$FT_mod= 6
##$GAMMA= 0
##$GB= 0
##$INTBC= 1
##$INTSCL= 1
##$ISEN= 128
##$LB= 0.3
##$LEV0= 0
##$LPBIN= 0
##$MAXI= 10000
##$MC2= 0
##$MEAN= 0
##$ME_mod= 0
##$MI= 0
##$NCOEF= 0
##$NC_proc= -2
##$NLEV= 6
##$NOISF1= 0
##$NOISF2= 0
##$NSP= 0
##$NTH_PI= 0
##$NZP= 0
##$OFFSET= 14.96849
##$PC= 1
##$PHC0= 34.4696
##$PHC1= 0
##$PH_mod= 1
##$PKNL= yes
##$PPARMOD= 0
##$PPDIAG= 0
##$PPIPTYP= 0
##$PPMPNUM= 2147483647
##$PPRESOL= 1
##$PSCAL= 4
##$PSIGN= 0
##$PYNMP= <proc.py>
##$REVERSE= no
##$SF= 400.130004850841
##$SI= 131072
##$SIGF1= 0
##$SIGF2= 0
##$SINO= 400
##$SIOLD= 131072
##$SPECTYP= <>
##$SREGLST= <1H.CDCl3>
##$SSB= 0
##$STSI= 131072
##$STSR= 0
##$SW_p= 8223.68421052632
##$SYMM= 0
##$S_DEV= 0
##$TDeff= 65536
##$TDoff= 0
##$TI= <>
##$TILT= no
##$TM1= 0
##$TM2= 0
##$TOPLEV= 0
##$USERP1= <user>
##$USERP2= <user>
##$USERP3= <user>
##$USERP4= <user>
##$USERP5= <user>
##$WDW= 1
##$XDIM= 131072
##$YMAX_p= 229570673
##$YMIN_p= -341288361
##$CURPLOT= <Network HP LaserJet P1505>
##$CURPRIN= <$Network HP LaserJet P1505>
##$DFORMAT= <normdp>
##$LAYOUT= <+/1D_H.xwp>
##$LFORMAT= <normlp>
##$PFORMAT= <normpl>
##$SURQMSG= 1
$$ End of Bruker specific parameters
$$ ---------------------------------
##NTUPLES= NMR SPECTRUM
##VAR_NAME=  FREQUENCY,     SPECTRUM/REAL,   SPECTRUM/IMAG
##SYMBOL=    X,             R,               I
##VAR_TYPE=  INDEPENDENT,   DEPENDENT,       DEPENDENT
##VAR_FORM=  AFFN,          ASDF,            ASDF
##VAR_DIM=   131072,        131072,          131072
##UNITS=     HZ,            ARBITRARY UNITS, ARBITRARY UNITS
##FACTOR=    0.0627417313425165, 1,          1
##FIRST=     8223.62146879498, 3200,         -41200
##LAST=      0,             4198,            -41192
##MIN=       0,             -341288361,      0
##MAX=       8223.62146879498, 229570673,    0
$$ Real data points
##PAGE= N=1
##DATA TABLE= (X++(R..R)), XYDATA
$$ [...]
$$ plain form
62027 1664389 1692734 1722640 1753848 1785194 1815471 1844176 1871499 1897943 1924142 1950781 1978352
62016 1978352 2006954 2036393 2066434 2096926 2127927 2159799 2192971 2227387 2262345 2297160 2331901
62005 2331901 2367312 2404023 2441986 2480533 2518742 2555728 2590810 2623558 2653734 2681341 2706713
61994 2706713 2730320 2752226 2771880 2788624 2802391 2813669 2822926 2830322 2835940 2839973 2842602 2843971
61982 2843971 2844394 2844388 2844312 2844162 2843836 2843482 2843345 2843339 2843015 2842029 2840508 2838876 2837391 2835928 2834149 2831724 2828386 2823975
61964 2823975 2818627 2812866 2807256 2801887 2796389 2790518 2784501 2778636 2772734 2766307 2759282 2752272 2746044 2740921
61950 2740921 2736763 2733332 2730490 2728200 2726546 2725766 2726085 2727470 2729622 2732273 2735488 2739610 2744821 2750723
61936 2750723 2756402 2760974 2764068 2765721 2765988 2764852 2762403 2758743 2753579 2746289 2736672 2725433 2713537 2701139
$$ packed form
62027A664389K8345K9906L1208L1346L0277K8705K7323K6444K6199K6639K7571
62016A978352K8602K9439L0041L0492L1001L1872L3172L4416L4958L4815L4741
62005B331901L5411L6711L7963L8547L8209L6986L5082L2748L0176K7607K5372
61994B706713K3607K1906J9654J6744J3767J1278R257P396N618M033K629J369
61982B843971M23op6j50l26l54j37ol24r86j521j632j485j463j779k425l338m411
61964B823975n348n761n610n369n498n871o017n865n902o427p025p010o228n123
61950B740921m158l431k842k290j654p80L19J385K152K651L215M122N211N902
61936B750723N679M572L094J653K67j136k449l660n164p290r617j1239j1896j2398
$$ plain form
61922 2701139 2687513 2672067 2655098 2637389 2619377 2600919 2581688 2561550 2540639 2519235 2497583
61911 2497583 2475747 2453759 2431953 2410891 2390716 2370798 2350385 2329565 2309209 2289923 2271425
61900 2271425 2253084 2234750 2216840 2199811 2183823 2168769 2154453 2140741 2127644 2115222 2103478
61889 2103478 2092568 2083167 2076231 2072079 2069829 2068028 2065752 2063020 2060438 2058872 2059293 2062392 2068137 2075848
61875 2075848 2084751 2094352 2104441 2115162 2127114 2141069 2157429 2176126 2197045 2220242 2245776 2273758
61863 2273758 2304742 2339687 2379303 2423626 2472453 2525864 2584184 2647839 2717727 2795485 2882923
61852 2882923 2981194 3090919 3213056 3349246 3501254 3670539 3858581 4067310 4298786 4554483
61842 4554483 4835069 5140816 5471864 5827681 6205980 6601893 7007750 7413063 7804277
$$ packed form
61922B701139j3626j5446j6969j7709j8012j8458j9231k0138k0911k1404k1652
61911B497583k1836k1988k1806k1062k0175j9918k0413k0820k0356j9286j8498
61900B271425j8341j8334j7910j7029j5988j5054j4316j3712j3097j2422j1744
61889B103478j0910r401o936m152k250j801k276k732k582j566M21L099N745P711
61875B075848Q903R601J0089J0721J1952J3955J6360J8697K0919K3197K5534K7982
61863B273758L0984L4945L9616M4323M8827N3411N8320O3655O9888P7758Q7438
61852B882923R8271J09725J22137J36190J52008J69285J88042K08729K31476K55697
61842D554483K80586L05747L31048L55817L78299L95913M05857M05313L91214
$$ plain form
61833 7804277 8164931 8477276 8725214 8896770 8984750 8986340 8903210 8741978 8513505 8230740
61823 8230740 7906667 7553637 7183257 6805656 6428600 6057642 5697121 5350664 5020806
61814 5020806 4708756 4414973 4139752 3883148 3644793 3424288 3221634 3036826 2868978
61805 2868978 2716277 2576926 2449870 2334510 2230037 2135329 2049305 1971092 1899925 1835137
61795 1835137 1776262 1722988 1674976 1631802 1593066 1558473 1527834 1501020 1477793 1457583 1439527
61784 1439527 1422861 1407238 1392690 1379356 1367283 1356306 1346088 1336516 1328125 1321733 1317429 1314256
61772 1314256 1311279 1308604 1306925 1306346 1306345 1306843 1308599 1312324 1317839 1324248 1330585 1336253 1341418 1347165 1354765
61757 1354765 1364456 1375312 1386533 1398396 1411671 1426650 1443309 1462065 1483695 1508556 1536296
$$ packed form
61833G804277L60654L12345K47938J71556Q7980J590q3130j61232k28473k82765
61823H230740l24073l53030l70380l77601l77056l70958l60521l46457l29858
61814E020806l12050k93783k75221k56604k38355k20505k02654j84808j67848
61805B868978j52701j39351j27056j15360j04473r4708q6024p8213p1167o4788
61795A835137n8875n3274m8012m3174l8736l4593l0639k6814k3227k0210j8056
61784A439527j6666j5623j4548j3334j2073j0977j0218r572q391o392m304l173
61772A314256k977k675j679n79jM98J756L725N515O409O337N668N165N747P600
61757A354765R691J0856J1221J1863J3275J4979J6659J8756K1630K4861K7740
$$ plain form
61746 1536296 1566310 1598248 1632283 1669228 1710216 1755835 1805715 1859327 1917056 1980070 2049188
61735 2049188 2124299 2204906 2290837 2382397 2480208 2585017 2697512 2818321 2948342 3088887
61725 3088887 3241235 3406274 3584994 3779234 3991412 4223638 4477700 4755979 5061747
61716 5061747 5398220 5767817 6172730 6615887 7100835 7630597 8206639 8828402 9493038
61707 9493038 10194965 10925040 11669503 12409171 13119673 13772893 14339197 14790270 15102705
61698 15102705 15261551 15262170 15109759 14817542 14404817 13894745 13311580 12678218 12015029 11339581
61688 11339581 10666185 10005374 9364285 8747974 8160433 7604573 7081877 6592653 6136822
61679 6136822 5714398 5325312 4968859 4643329 4346205 4074858 3827195 3601694 3396887
$$ packed form
61746A536296L0014L1938L4035L6945M0988M5619M9880N3612N7729O3014O9118
61735B049188P5111Q0607Q5931R1560R7811J04809J12495J20809J30021J40545
61725C088887J52348J65039J78720J94240K12178K32226K54062K78279L05768
61716E061747L36473L69597M04913M43157M84948N29762N76042O21763O64636
61707I493038P01927P30075P44463P39668P10502O53220N66304M51073L12435
61698A5102705J58846O19j52411k92217m12725n10072n83165o33362o63189o75448
61688A1339581o73396o60811o41089o16311n87541n55860n22696m89224m55831
61679F136822m22424l89086l56453l25530k97124k71347k47663k25501k04807
$$ plain form
61670 3396887 3210986 3042094 2888640 2749385 2623025 2507971 2402583 2305520 2215818 2132780
61660 2132780 2055928 1984971 1919623 1859439 1803809 1752033 1703318 1656928 1612642 1570942 1532423
61649 1532423 1496914 1463442 1431129 1399873 1370061 1341902 1315258 1289917 1265812 1243041 1221727
61638 1221727 1201708 1182350 1162976 1143599 1124898 1107280 1090330 1073439 1056620 1040322 1024699
61627 1024699 1009516 994559 979789 965249 951228 938284 926728 916210 906201 896685 887938 879887
61615 879887 872256 865148 858910 853519 848731 844661 841490 838653 835194 830992 826725 822423 816980 809609
61601 809609 801020 792597 785044 778421 772829 768340 764585 761094 757758 754466 750786 746623 742728 739758
61587 739758 737159 733929 730346 727977 727824 729267 731038 732496 733612 734459 735239 736430 738344 740739 743263
$$ packed form
61670C396887j85901j68892j53454j39255j26360j15054j05388r7063q9702q3038
61660B132780p6852p0957o5348o0184n5630n1776m8715m6390m4286m1700l8519
61649A532423l5509l3472l2313l1256k9812k8159k6644k5341k4105k2771k1314
61638A221727k0019j9358j9374j9377j8701j7618j6950j6891j6819j6298j5623
61627A024699j5183j4957j4770j4540j4021j2944j1556j0518j0009r516q747q051
61615H79887p631p108o238n391m788m070l171k837l459m202m267m302n443p371
61601H09609q589q423p553o623n592m489l755l491l336l292l680m163l895k970
61587G39758k599l230l583k369j53J443J771J458J116Q47P80J191J914K395K524
$$ plain form
61572 743263 746099 749777 754405 759389 763945 767689 770725 773363 775853 778290 780687 783028 785239 787093
61558 787093 788229 788277 787042 784650 781534 778201 774894 771515 767840 763713 759010 753665 747856 742001 736370
61543 736370 730787 724924 718790 712784 707302 702481 698229 694266 690130 685459 680456 675986 673050 672055
61529 672055 672558 673690 674840 676017 677690 680402 684462 689760 695808 702251 709469 718348 729114 740760
61515 740760 752193 763739 776806 792085 808902 826491 845093 865300 886959 909328 931887
61504 931887 954508 977157 999941 1023070 1046285 1068707 1089743 1109768 1129328 1148065 1165257
61493 1165257 1181181 1197030 1213382 1229441 1243915 1256072 1265803 1273274 1278813 1282797 1285435 1286776
61481 1286776 1286841 1285487 1282391 1277632 1272072 1266602 1261116 1254841 1247676 1240532 1234348 1229384 1225591 1223069
$$ packed form
61572G43263K836L678M628M984M556L744L036K638K490K437K397K341K211J854
61558G87093J136M8j235k392l116l333l307l379l675m127m703n345n809n855n631
61543G36370n583n863o134o006n482m821m252l963m136m671n003m470k936r95
61529F72055N03J132J150J177J673K712M060N298O048O443P218Q879J0766J1646
61515G40760J1433J1546J3067J5279J6817J7589J8602K0207K1659K2369K2559
61504I31887K2621K2649K2784K3129K3215K2422K1036K0025J9560J8737J7192
61493A165257J5924J5849J6352J6059J4474J2157R731P471N539L984K638J341
61481A286776O5j354l096m759n560n470n486o275p165p144o184m964l793k522
$$ plain form
61467 1223069 1221939 1222282 1224369 1228470 1234447 1242089 1251962 1265254 1282620 1303773 1328385 1356684 1388933
61454 1388933 1425078 1465323 1510516 1561548 1618892 1682960 1754258 1832854 1918438 2011433 2113323
61443 2113323 2225282 2347055 2477783 2617107 2764490 2917933 3074324 3230710 3384209
61434 3384209 3530714 3664744 3780872 3874936 3944268 3987832 4006364 4001664 3975513 3929720 3867109
61423 3867109 3791470 3706179 3613495 3515498 3414980 3314867 3217228 3123337 3034328 2951140 2874067
61412 2874067 2803033 2738480 2681610 2633544 2594366 2563180 2539032 2521685 2511459 2508507 2512508 2523063
61400 2523063 2539955 2562724 2590276 2621397 2655528 2692558 2731913 2772440 2813351 2854710 2896596
61389 2896596 2938261 2978659 3017630 3055974 3094283 3132123 3168525 3203005 3235846 3267548 3298236
$$ packed form
61467A223069j130L43K087M101N977P642R873J3292J7366K1153K4612K8299L2249
61454A388933L6145M0245M5193N1032N7344O4068P1298P8596Q5584R2995J01890
61443B113323J11959J21773J30728J39324J47383J53443J56391J56386J53499
61434C384209J46505J34030J16128R4064O9332M3564J8532m700k6151m5793o2611
61423C867109p5639q5291r2684r7997j00518j00113r7639r3891q9009q3188p7073
61412B874067p1034o4553n6870m8066l9178l1186k4148j7347j0226k952M001J0555
61400B523063J6892K2769K7552L1121L4131L7030L9355M0527M0911M1359M1886
61389B896596M1665M0398L8971L8344L8309L7840L6402L4480L2841L1702L0688
$$ plain form
61378 3298236 3327550 3354868 3379557 3401264 3420098 3436479 3450713 3462777 3472524 3479867 3484616 3486467
61366 3486467 3485490 3482371 3477629 3470706 3460494 3446973 3431735 3416541 3401850 3387121 3372049 3356883
61354 3356883 3341851 3326963 3312439 3298827 3286636 3276053 3266916 3258643 3250346 3241363 3231606 3221088
61342 3221088 3209383 3196054 3181452 3166576 3152206 3138634 3126257 3115879 3108396 3104741 3106157 3113924
61330 3113924 3128572 3149908 3178167 3214745 3261512 3319639 3389385 3470732 3563960 3669654 3788232
61319 3788232 3919259 4061206 4212125 4370505 4534977 4703052 4870604 5032702 5184500
61310 5184500 5321160 5437783 5530354 5596821 5636933 5651080 5639646 5603382 5543962 5463949 5366140
61299 5366140 5252870 5125967 4987437 4840017 4686664 4529596 4370318 4210622 4052857
$$ packed form
61378C298236K9314K7318K4689K1707J8834J6381J4234J2064R747P343M749J851
61366C486467r77l119m742o923j0212j3521j5238j5194j4691j4729j5072j5166
61354C356883j5032j4888j4524j3612j2191j0583r137q273q297q983r757j0518
61342C221088j1705j3329j4602j4876j4370j3572j2377j0378p483l655J416P767
61330C113924J4648K1336K8259L6578M6767N8127O9746Q1347R3228J05694J18578
61319C788232J31027J41947J50919J58380J64472J68075J67552J62098J51798
61310E184500J36660J16623R2571O6467M0112J4147j1434l6264n9420q0013r7809
61299E366140j13270j26903j38530j47420j53353j57068j59278j59696j57765
$$ plain form
61290 4052857 3898982 3749942 3606384 3469351 3339726 3217560 3102753 2996069 2898697 2811031
61280 2811031 2732706 2663707 2604500 2554866 2513504 2479206 2451836 2431661 2418289 2410890 2409208 2413692
61268 2413692 2424600 2441326 2462666 2487454 2514936 2544740 2576596 2609893 2643506 2676244 2707600
61257 2707600 2737940 2767788 2796966 2824616 2850012 2873092 2894038 2912642 2928397 2941067 2950687
61246 2950687 2956966 2959206 2957040 2950878 2941359 2928687 2912827 2894020 2872601 2848530 2821613 2792104
61234 2792104 2760645 2727636 2693174 2657648 2621898 2586609 2551890 2517620 2483962 2451433 2420764
61223 2420764 2392755 2367906 2345964 2326030 2307267 2289316 2272064 2255423 2239462 2224348 2209863
61212 2209863 2195266 2179966 2164177 2148634 2133882 2120065 2107249 2095600 2085354 2076875 2070628 2066833
$$ packed form
61290D052857j53875j49040j43558j37033j29625j22166j14807j06684r7372q7666
61280B811031p8325o8999n9207m9634m1362l4298k7370k0175j3372p399j682M484
61268B413692J0908J6726K1340K4788K7482K9804L1856L3297L3613L2738L1356
61257B707600L0340K9848K9178K7650K5396K3080K0946J8604J5755J2670R620
61246B950687O279K240k166o162r519j2672j5860j8807k1419k4071k6917k9509
61234B792104l1459l3009l4462l5526l5750l5289l4719l4270l3658l2529l0669
61223B420764k8009k4849k1942j9934j8763j7951j7252j6641j5961j5114j4485
61212B209863j4597j5300j5789j5543j4752j3817j2816j1649j0246q479o247l795
$$ plain form
61200 2066833 2065253 2065663 2068504 2074795 2085364 2100449 2120109 2144803 2175457 2213044 2258112 2310509
61188 2310509 2369459 2433946 2503021 2575592 2649926 2723504 2793407 2856715 2910569 2952148 2978964
61177 2978964 2989268 2982188 2957660 2916549 2860870 2793536 2717450 2634779 2547289 2457223 2367269
61166 2367269 2279328 2193720 2110174 2029382 1952932 1881732 1815334 1753182 1695825 1644224 1598232
61155 1598232 1556517 1517933 1482379 1450251 1421650 1396367 1374294 1355507 1340039 1327714 1318169
61144 1318169 1311115 1306732 1305624 1308088 1313508 1320722 1328863 1337429 1345732 1352960 1358967 1364344 1369357 1373347
61130 1373347 1375567 1376140 1375623 1374003 1370734 1365554 1358629 1349987 1339472 1327367 1314510 1301559 1288545
61117 1288545 1275214 1261434 1247069 1231872 1215780 1198999 1181607 1163406 1144412 1125142 1106031
$$ packed form
61200B066833j580M10K841O291J0569J5085J9660K4694L0654L7587M5068N2397
61188B310509N8950O4487O9075P2571P4334P3578O9903O3308N3854M1579K6816
61177B978964J0304p080k4528m1111n5679o7334p6086q2671q7490r0066q9954
61166B367269q7941q5608q3546q0792p6450p1200o6398o2152n7357n1601m5992
61155A598232m1715l8584l5554l2128k8601k5283k2073j8787j5468j2325r545
61144A318169p054m383j108K464N420P214Q141Q566Q303P228O007N377N013L990
61130A373347K220N73n17j620l269n180o925q642j0515j2105j2857j2951j3014
61117A288545j3331j3780j4365j5197j6092j6781j7392j8201j8994j9270j9111
$$ plain form
61106 1106031 1086803 1066847 1046034 1024700 1002894 980236 956738 933432 911765 892420 874886
61095 874886 858161 841733 825818 810723 796162 781353 765767 749555 733157 716752 700354
61084 700354 684237 668876 654462 640797 627770 615601 604512 594441 585310 577378 571051 566411
61072 566411 563120 560726 558993 558066 558468 560760 564932 570227 575759 581225 586825 592666 598624 604737 611266
61057 611266 618265 625433 632506 639447 646144 652439 658763 666257 675609 685927 695362 702789 708386 712584
61043 712584 715233 716174 716033 715787 715666 714995 713142 710247 706951 703718 700623 697574 694556 691632 688821
61028 688821 686034 683131 680082 677051 674283 671858 669507 666672 662972 658700 654705 651501 648618 645201
61014 645201 641155 637142 633360 629011 623473 617511 612620 609360 606918 604238 600978 597448 594211 591868
$$ packed form
61106A106031j9228j9956k0813k1334k1806k2658k3498k3306k1667j9345j7534
61095H74886j6725j6428j5915j5095j4561j4809j5586j6212j6398j6405j6398
61084G00354j6117j5361j4414j3665j3027j2169j1089j0071r131p932o327m640
61072E66411l291k394j733r27M02K292M172N295N532N466N600N841N958O113O529
61057F11266O999P168P073O941O697O295O324P494R352J0318R435P427N597M198
61043G12584K649R41j41k46j21o71j853k895l296l233l095l049l018k924k811
61028F88821k787k903l049l031k768k425k351k835l700m272l995l204k883l417
61014F45201m046m013l782m349n538n962m891l260k442k680l260l530l237k343
$$ plain form
61000 591868 590602 589780 588559 587085 586515 587553 589488 591097 592082 593162 595115 598253 602547 607721 613248
60985 613248 618756 624429 630773 638066 646259 655195 664622 674245 684142 694912 706964 719865 732888
60972 732888 746041 759993 775055 790848 807057 823986 842245 862375 884847 909921 937241
60961 937241 965963 995530 1026061 1057996 1091824 1128155 1167447 1209465 1253592 1299965 1349731
60950 1349731 1403870 1462344 1524859 1591787 1663675 1740274 1820889 1905468 1994754 2089632 2191068
60939 2191068 2300606 2420124 2551041 2694273 2850867 3022056 3208966 3413542 3640159
60930 3640159 3895505 4186514 4519305 4900512 5338309 5841022 6415928 7071324 7819783
60921 7819783 8678313 9666280 10804541 12111886 13588779 15189978 16808974 18298999
$$ packed form
61000E91868j266q22j221j474n70J038J935J609R85J080J953L138M294N174N527
60985F13248N508N673O344P293Q193Q936R427R623R897J0770J2052J2901J3023
60972G32888J3153J3952J5062J5793J6209J6929J8259K0130K2472K5074K7320
60961I37241K8722K9567L0531L1935L3828L6331L9292M2018M4127M6373M9766
60950A349731N4139N8474O2515O6928P1888P6599Q0615Q4579Q9286R4878J01436
60939B191068J09538J19518J30917J43232J56594J71189J86910K04576K26617
60930C640159K55346K91009L32791L81207M37797N02713N74906O55396P48459
60921G819783Q58530R87967J138261J307345J476893J601199J618996J490025
$$ plain form
60913 18298999 19526309 20420623 20990950 21307913 21475908 21607741 21794694 22069351 22381076
60904 22381076 22609458 22615006 22296543 21622981 20631107 19402575 18036024 16623117 15233032
60895 15233032 13908570 12672335 11535566 10502764 9572152 8736577 7986600 7312919 6706143
60886 6706143 6156310 5654827 5197042 4781775 4408177 4073844 3775767 3511284 3277135
60877 3277135 3068630 2881047 2711407 2558003 2418721 2291039 2173359 2065050 1964997
60868 1964997 1871192 1782055 1697209 1616588 1539691 1466286 1397016 1332533 1272482 1215970 1162661
60857 1162661 1112781 1066330 1022956 982493 945040 910484 878362 848258 820026 793640 769057
60846 769057 746227 724984 705022 686161 668583 652593 638193 625064 612866 601375 590406
$$ packed form
60913A8298999J227310Q94314N70327L16963J67995J31833J86953K74657L11725
60904B2381076K28382N548l18463o73562r91874j228532j366551j412907j390085
60895A5233032j324462j236235j136769j032802r30612q35575p49977o73681o06776
60886F706143n49833n01483m57785m15267l73598l34333k98077k64483k34149
60877C277135k08505j87583j69640j53404j39282j27682j17680j08309j00053
60868A964997r3805q9137q4846q0621p6897p3405o9270o4483o0051n6512n3309
60857A162661m9880m6451m3374m0463l7453l4556l2122l0104k8232k6386k4583
60846G69057k2830k1243j9962j8861j7578j5990j4400j3129j2198j1491j0969
$$ plain form
60835 590406 579942 570298 561984 555278 549955 545440 541253 537367 534135 531764 530027 528739 528306 529315
60821 529315 531581 534186 536628 539366 542909 546966 550937 554708 558333 561360 563220 564097 564700 565201 565011
60806 565011 563624 561163 558068 554790 551787 549288 546912 543988 540350 536465 532790 529501 526846 525169
60792 525169 524417 524150 524250 525120 526971 529505 532612 536870 542843 550255 558305 566545 574948 583361 591360
60777 591360 598672 605403 611869 618406 625210 632142 638783 644928 650854 656890 662899 668468 673515 678363
60763 678363 683264 688154 692800 697001 700618 703685 706504 709379 712187 714352 715336 715145 714348 713679 713489
60748 713489 713445 712756 710756 707275 702557 697023 691133 685165 678980 672183 664648 656653 648389 639691 630556
60733 630556 621654 613864 607438 602028 597414 593806 591331 589622 588052 586199 584054 582052 580950 581450
$$ packed form
60835E90406j0464r644q314o706n323m515m187l886l232k371j737j288m33J009
60821E29315K266K605K442K738L543M057L971L771L625L027J860Q77O03N01j90
60806E65011j387k461l095l278l003k499k376k924l638l885l675l289k655j677
60792E25169p52k67J00Q70J851K534L107M258N973P412Q050Q240Q403Q413P999
60777E91360P312O731O466O537O804O932O641O145N926O036O009N569N047M848
60763F78363M901M890M646M201L617L067K819K875K808K165R84j91p97o69j90
60748G13489m4o89k000l481m718n534n890n968o185o797p535p995q264q698r135
60733F30556q902p790o426n410m614l608k475j709j570j853k145k002j102N00
$$ plain form
60719 581450 583761 587655 592926 599562 607367 615622 623371 630152 636439 643343 651715 661472 671895 682615
60705 682615 693955 706073 718104 728664 737159 744183 750669 757108 763657 770379 777003 782831 787377
60692 787377 790954 794346 797988 801734 805310 808666 811869 814921 817766 820294 822242 823210 822914 821426 819121
60677 819121 816402 813499 810489 807413 804302 801119 797766 794202 790451 786460 782043 777050 771481 765372
60663 765372 758767 751968 745645 740400 736222 732629 729304 726353 723946 722045 720591 719706 719493 719729 719880
60648 719880 719382 717940 715683 713029 710236 707168 703699 700276 697750 696592 696522 696964 697515 697881 697753 697064
60632 697064 696197 695716 695976 696988 698354 699220 698669 696455 693178 689472 685309 680304 674413 667894 660750
60617 660750 652635 643338 633157 622863 613437 605579 599162 593284 587202 581055 575393 570277 565326 560539
$$ packed form
60719E81450K311L894N271O636P805Q255P749O781O287O904Q372R757J0423J0720
60705F82615J1340J2118J2031J0560Q495P024O486O439O549O722O624N828M546
60692G87377L577L392L642L746L576L356L203L052K845K528J948R68k96j488k305
60677H19121k719k903l010l076l111l183l353l564l751l991m417m993n569o109
60663G65372o605o799o323n245m178l593l325k951k407j901j454q85k13K36J51
60648G19880m98j442k257k654k793l068l469l423k526j158p0M42N51L66j28o89
60632F97064q67m81K60J012J366Q66n51k214l277l706m163n005n891o519p144
60617F60750q115r297j0181j0294r426p858o417n878o082o147n662n116m951m787
$$ plain form
60603 560539 556471 553526 551592 550548 550619 551955 554191 556735 559304 561938 564649 567344 569976 572557 574992
60588 574992 577027 578456 579411 580523 582632 586038 590040 593425 595489 596441 596890 597297 597969 599132 600740
60573 600740 602426 603991 605880 608912 613518 619328 625518 631543 637591 644275 651810 659646 667206 674887
60559 674887 683907 695069 708083 722210 737008 752109 766789 780431 793255 806000 818881 831242
60547 831242 842205 851209 857912 862015 863406 862188 858486 852505 844800 836080 826594 816037 804244
60534 804244 791675 779005 766583 754539 743116 732494 722551 713258 705135 698831 694212 690370 686702
60521 686702 683572 681651 680892 680499 679759 678645 677652 677280 677637 678332 678753 678629 678327 678466 679240 680321 681450
60504 681450 682924 685331 688892 693232 697853 702698 708184 714615 721667 728568 734841 740731 746773 753058
$$ packed form
60603E60539m068k945j934j044P1J336K236K544K569K634K711K695K632K581K435
60588E74992K035J429R55J112K109L406M002L385K064R52M49M07O72J163J608
60573F00740J686J565J889L032M606N810O190O025O048O684P535P836P560P681
60559F74887R020J1162J3014J4127J4798J5101J4680J3642J2824J2745J2881J2361
60547H31242J0963R004O703M103J391j218l702n981p705q720r486j0557j1793
60534H04244j2569j2670j2422j2044j1423j0622r943r293q123o304m619l842l668
60521F86702l130j921p59l93p40j114r93l72L57O95M21j24l02J39P74J081J129
60504F81450J474K407L561M340M621M845N486O431P052O901O273N890O042O285
$$ plain form
60490 753058 759161 764729 769912 775179 780992 787715 795595 804599 814518 825429 837943 852774 870155
60477 870155 889776 911084 933353 955647 977059 996968 1014784 1029555 1040241 1046446 1048518 1046859
60465 1046859 1041478 1032437 1020488 1007092 993957 982620 974096 968622 965824 965275 966770 970044 974654
60452 974654 980425 987706 996815 1007379 1018614 1030204 1042604 1056553 1072597 1091060 1112153 1136114
60440 1136114 1163542 1195565 1233341 1277361 1327594 1384363 1448663 1521458 1603042 1693350 1792548
60429 1792548 1900894 2018343 2144900 2281533 2430347 2593552 2772073 2964758 3168111
60420 3168111 3376118 3580207 3769667 3932645 4057578 4134932 4159006 4129112 4049456 3927734
60410 3927734 3773288 3595741 3404312 3207314 3011482 2821424 2639684 2467396 2305003
$$ packed form
60490G53058O103N568N183N267N813O723P880R004R919J0911J2514J4831J7381
60477H70155J9621K1308K2269K2294K1412J9909J7816J4771J0686O205K072j659
60465A046859n381r041j1949j3396j3135j1337q524n474k798n49J495L274M610
60452I74654N771P281R109J0564J1235J1590J2400J3949J6044J8463K1093K3961
60440A136114K7428L2023L7776M4020N0233N6769O4300P2795Q1584R0308R9198
60429A792548J08346J17449J26557J36633J48814J63205J78521J92685K03353
60420C168111K08007K04089J89460J62978J24933P7354K4074k9894p9656j21722
60410C927734j54446j77547j91429j96998j95832j90058j81740j72288j62393
$$ plain form
60401 2305003 2152639 2010214 1877472 1754120 1640014 1535226 1439866 1353696 1275886 1205288
60391 1205288 1141052 1082899 1030710 983964 941824 903745 869780 840081 814253 791391 770663
60380 770663 751604 733841 716886 700466 684852 670519 657560 645691 634829 625256 617030 609560
60368 609560 602082 594368 586697 579249 571981 565080 559096 554354 550563 547339 544895 543757 543775 543909 543335
60353 543335 542494 542585 544075 546123 547665 548678 549998 552144 554887 557938 561425 565315 568863 571261 572666
60338 572666 574048 575960 578064 580056 582488 586130 590795 595394 599176 602429 605759 609096 611800 613666
60324 613666 615473 618416 623035 628637 633717 637035 638475 638908 639216 639584 639815 640017 640506 641075 640988 640018 639013
60307 639013 638920 639507 639692 639095 638626 639333 641275 643828 646663 649863 653396 657037 660793 664945 669625 674674
$$ packed form
60401B305003j52364j42425j32742j23352j14106j04788r5360q6170p7810p0598
60391A205288o4236n8153n2189m6746m2140l8079l3965k9699k5828k2862k0728
60380G70663j9059j7763j6955j6420j5614j4333j2959j1869j0862r573q226p470
60368F09560p478p714p671p448p268o901n984m742l791l224k444j138J8J34n74
60353E43335q41R1J490K048J542J013J320K146K743L051L487L890L548K398J405
60338E72666J382J912K104J992K432L642M665M599L782L253L330L337K704J866
60324F13666J807K943M619N602N080L318J440M33L08L68K31K02M89N69q7r70j005
60307F39013r3N87J85n97m69P07J942K553K835L200L533L641L756M152M680N049
$$ plain form
60291 674674 679938 685381 690879 696246 701595 707378 713887 720950 728210 735514 742735 749428 754971 759162
60277 759162 762472 765597 768731 771355 772882 773561 774551 776898 780513 784408 787870 791058 794390 797748 800581
60262 800581 802549 803765 804472 804728 804325 802805 799669 794831 788867 782602 776402 770123 763750 757770 752682
60247 752682 748282 743745 738505 732872 727710 723614 720616 718574 717481 717222 717304 717246 717217 717880 719535 721654
60231 721654 723375 724110 723593 721843 719485 717758 717588 718722 720192 721621 723496 726126 728974 731401 733652
60216 733652 736602 740730 745711 750894 755800 760265 764487 769006 774268 780124 786008 791740 797895 805246
60202 805246 814038 823896 834263 844781 855510 867037 880241 895708 913381 932895 954096 977011
60190 977011 1001506 1027449 1055262 1085917 1120148 1157919 1198880 1243125 1291208 1343524 1400009
$$ packed form
60291F74674N264N443N498N367N349N783O509P063P260P304P221O693N543M191
60277G59162L310L125L134K624J527O79R90K347L615L895L462L188L332L358K833
60262H00581J968J216P07K56m03j520l136m838n964o265o200o279o373n980n088
60247G52682m400m537n240n633n162m096k998k042j093k59Q2n8k9O63J655K119
60231G21654J721P35n17j750k358j727j70J134J470J429J875K630K848K427K251
60216G33652K950M128M981N183M906M465M222M519N262N856N884N732O155P351
60202H05246Q792R858J0367J0518J0729J1527J3204J5467J7673J9514K1201K2915
60190I77011K4495K5943K7813L0655L4231L7771M0961M4245M8083N2316N6485
$$ plain form
60179 1400009 1460430 1524670 1592666 1664305 1739548 1818443 1900747 1985478 2071016 2155685 2238269
60168 2238269 2317973 2393995 2465265 2530604 2588995 2639627 2681785 2714962 2739173 2754943 2762810
60157 2762810 2763026 2756029 2743192 2726766 2708918 2690921 2673356 2656884 2642631 2631884 2625681 2624742
60145 2624742 2629684 2641145 2659668 2685497 2718515 2758477 2805332 2859285 2920439 2988315 3061694
60134 3061694 3138942 3218377 3298222 3376253 3449854 3516747 3575745 3626530 3668613 3700783 3721778
60123 3721778 3731236 3729548 3716967 3693419 3659434 3616791 3567940 3515052 3460010 3405014 3352464 3304106
60111 3304106 3260741 3222998 3191996 3168929 3154422 3148780 3152638 3166638 3190396 3222351 3260955 3305436
60099 3305436 3354962 3407514 3460317 3511233 3559083 3602651 3640241 3670592 3693670 3710138 3720598
$$ packed form
60179A400009O0421O4240O7996P1639P5243P8895Q2304Q4731Q5538Q4669Q2584
60168B238269P9704P6022P1270O5339N8391N0632M2158L3177K4211J5770P867
60157B762810K16o997j2837j6426j7848j7997j7565j6472j4253j0747o203r39
60145B624742M942J1461J8523K5829L3018L9962M6855N3953O1154O7876P3379
60134C061694P7248P9435P9845P8031P3601O6893N8998N0785M2083L2170K0995
60123C721778R458j688j2581k3548l3985m2643m8851n2888n5042n4996n2550m8358
60111C304106m3365l7743l1002k3067j4507n642L858J4000K3758L1955L8604M4481
60099C305436M9526N2552N2803N0916M7850M3568L7590L0351K3078J6468J0460
$$ plain form
60088 3720598 3725838 3727312 3726564 3724378 3721266 3718790 3719639 3726197 3739639 3760656 3790358 3830001 3880335
60075 3880335 3941895 4015699 4103106 4205071 4322057 4454602 4603475 4769138 4951467 5150102
60065 5150102 5364690 5594450 5837690 6091969 6354560 6622451 6891918 7158410 7417138
60056 7417138 7663792 7894684 8106265 8294665 8455818 8586032 8682384 8742723 8765545 8750208
60046 8750208 8697335 8609004 8488454 8339520 8166269 7973103 7765093 7548038 7327958 7110393
60036 7110393 6900026 6700669 6515361 6346392 6195404 6063533 5951455 5859417 5787362 5734998
60026 5734998 5701581 5685670 5685227 5697851 5720643 5749972 5781926 5813293 5841922 5866008 5883404 5891964
60014 5891964 5890399 5878430 5856134 5823381 5779973 5726115 5662562 5590200 5509438 5420119 5322257
$$ packed form
60088C720598N240J474p48k186l112k476Q49O558J3442K1017K9702L9643N0334
60075C880335O1560P3804Q7407J01965J16986J32545J48873J65663J82329J98635
60065E150102K14588K29760K43240K54279K62591K67891K69467K66492K58728
60056G417138K46654K30892K11581J88400J61153J30214R6352O0339K2822j5337
60046H750208n2873q8331j20550j48934j73251j93166k08010k17055k20080k17565
60036G110393k10367j99357j85308j68969j50988j31871j12078r2038p2055n2364
60026E734998l3417j5911m43J2624K2792K9329L1954L1367K8629K4086J7396Q560
60014E891964j565j1969k2296l2753m3408n3858o3553p2362q0762q9319r7862
$$ plain form
60003 5322257 5216885 5106010 4991798 4876096 4760643 4647157 4536898 4430622 4329400
59994 4329400 4235171 4149992 4074938 4010172 3955942 3912988 3882046 3863452 3857314 3863678 3882435 3913374
59982 3913374 3956280 4010563 4074679 4146283 4223001 4302720 4383099 4461355 4534796 4601292 4658940
59971 4658940 4705627 4739326 4758748 4763524 4753818 4729931 4692150 4640846 4576825 4501740 4418097 4328789
59959 4328789 4236647 4144267 4053870 3967149 3885436 3810129 3742718 3684363 3635752 3597501 3570389
59948 3570389 3554984 3551446 3559954 3581062 3615238 3662317 3721806 3793527 3877455 3972861 4077927
59937 4077927 4190253 4307461 4427340 4547640 4665763 4778531 4882430 4974455 5052715 5116008
59927 5116008 5162968 5192071 5202424 5194077 5167544 5123556 5063624 4990462 4907485 4818023 4725152
$$ packed form
60003E322257j05372j10875j14212j15702j15453j13486j10259j06276j01222
59994D329400r4229q5179p5054o4766n4230m2954l0942j8594o138O364J8757L0939
59982C913374M2906N4283O4116P1604P6718P9719Q0379P8256P3441O6496N7648
59971D658940M6687L3699J9422M776r706k3887l7781n1304o4021p5085q3643q9308
59959D328789r2142r2380r0397q6721q1713p5307o7411n8355m8611l8251k7112
59948C570389j5405l538Q508K1108L4176M7079N9489P1721Q3928R5406J05066
59937D077927J12326J17208J19879J20300J18123J12768J03899R2025P8260O3293
59927E116008M6960K9103J0353q347k6533m3988n9932p3162q2977q9462r2871
$$ plain form
59916 4725152 4631896 4541109 4455198 4376154 4305761 4245477 4196113 4157956 4131341 4116994 4115673
59905 4115673 4127451 4151364 4185907 4230003 4283388 4345772 4415661 4490458 4567860 4646719 4726241
59894 4726241 4804834 4880448 4951865 5019028 5082120 5140918 5195168 5244989 5290687 5332679 5371997
59883 5371997 5410521 5450400 5493601 5542358 5599571 5668154 5750196 5847286 5961463 6095078 6249578
59872 6249578 6424920 6620308 6834950 7067655 7315850 7575153 7839632 8102295 8355602
59863 8355602 8591789 8802845 8980525 9117165 9207141 9247690 9238415 9180499 9076807 8932391
59853 8932391 8754127 8549361 8324801 8086524 7840656 7593603 7351342 7118325 6897183
59844 6897183 6689753 6498416 6326193 6175512 6047276 5941338 5857544 5796016 5756757 5739468
$$ packed form
59916D725152r3256r0787q5911p9044p0393o0284m9364l8157k6615j4347j321
59905D115673J1778K3913L4543M4096N3385O2384O9889P4797P7402P8859P9522
59894D726241P8593P5614P1417O7163O3092N8798N4250M9821M5698M1992L9318
59883E371997L8524L9879M3201M8757N7213O8583Q2042R7090J14177J33615J54500
59872F249578J75342J95388K14642K32705K48195K59303K64479K62663K53307
59863H355602K36187K11056J77680J36640Q9976M0549r275n7916j03692j44416
59853H932391j78264k04766k24560k38277k45868k47053k42261k33017k21142
59844F897183k07430j91337j72223j50681j28236j05938q3794o1528l9259j7289
$$ plain form
59834 5739468 5743579 5768005 5810854 5869709 5942090 6025182 6115096 6206920 6295662 6376813 6445850
59823 6445850 6497728 6527392 6530862 6505804 6451488 6368661 6259450 6126978 5974784 5806488 5625777
59812 5625777 5436392 5241986 5046043 4851809 4662039 4478623 4302575 4134595 3975668
59803 3975668 3827089 3690008 3565108 3452695 3352777 3264837 3187678 3119770 3059763 3006559
59793 3006559 2959056 2916162 2877106 2841431 2808672 2778324 2750153 2724133 2699995 2677235 2655797
59782 2655797 2636246 2618853 2602824 2586820 2569975 2551938 2532193 2509952 2484802 2457076 2427608
59771 2427608 2397432 2367576 2338705 2311031 2284879 2261088 2240246 2221641 2203757 2186054 2169755
59760 2169755 2156692 2147884 2143400 2142974 2146288 2152972 2162792 2175681 2191469 2209911 2231151 2255741 2283912
$$ packed form
59834E739468M111K4426M2849N8855P2381Q3092Q9914R1824Q8742Q1151O9037
59823F445850N1878K9664L470k5058n4316q2827j09211j32472j52194j68296j80711
59812E625777j89385j94406j95943j94234j89770j83416j76048j67980j58927
59803C975668j48579j37081j24900j12413r9918q7940p7159o7908o0007n3204
59793C006559m7503m2894l9056l5675l2759l0348k8171k6020k4138k2760k1438
59782B655797j9551j7393j6029j6004j6845j8037j9745k2241k5150k7726k9468
59771B427608l0176k9856k8871k7674k6152k3791k0842j8605j7884j7703j6299
59760B169755j3063q808m484m26L314O684R820J2889J5788J8442K1240K4590K8171
$$ plain form
59747 2283912 2315209 2349069 2385329 2423743 2463422 2503259 2542634 2581143 2617877 2651652 2681933
59736 2681933 2708997 2733104 2754103 2772141 2788380 2804666 2822576 2842940 2866167 2892802 2923770
59725 2923770 2960232 3003392 3054477 3114764 3185415 3267318 3361300 3468533 3590445 3728198 3882508
59714 3882508 4054098 4243905 4452384 4678509 4919170 5168768 5418762 5657918 5873852
59705 5873852 6055024 6192030 6278390 6311654 6294285 6232962 6136503 6014137 5874961 5727597
59695 5727597 5579235 5434877 5297786 5170518 5055293 4953545 4865755 4792036 4732738 4688340
59685 4688340 4658977 4644460 4644767 4660254 4691225 4737607 4799227 4876189 4968640 5076386 5199256
59674 5199256 5337882 5493652 5667754 5860579 6072186 6302993 6553897 6826212 7121836
$$ packed form
59747B283912L1297L3860L6260L8414L9679L9837L9375L8509L6734L3775L0281
59736B681933K7064K4107K0999J8038J6239J6286J7910K0364K3227K6635L0968
59725B923770L6462M3160N1085O0287P0651Q1903R3982J07233J21912J37753J54310
59714C882508J71590J89807K08479K26125K40661K49598K49994K39156K15934
59705E873852J81172J37006Q6360L3264j7369o1323r6459j22366j39176j47364
59695E727597j48362j44358j37091j27268j15225j01748q7790p3719n9298m4398
59685D688340k9363j4517L07J5487L0971M6382O1620P6962R2451J07746J22870
59674E199256J38626J55770J74102J92825K11607K30807K50904K72315K95624
$$ plain form
59665 7121836 7442987 7791153 8166329 8567643 8994556 9446930 9923874 10422781 10939464
59656 10939464 11468863 12005523 12543712 13077549 13601463 14111114 14604324 15081288 15543949
59647 15543949 15995209 16438402 16876732 17312553 17747032 18180210 18610588 19034177 19444384
59638 19444384 19833406 20193684 20517969 20799022 21030535 21208642 21332264 21402459 21422354 21397670
59628 21397670 21336285 21246844 21138062 21019133 20899702 20788871 20694648 20624539 20585964 20585573 20628669
59617 20628669 20719754 20863149 21062469 21319752 21635504 22009103 22438239 22917672 23438707
59608 23438707 23989558 24555500 25118513 25657318 26148424 26567742 26892304 27102145 27182311
59599 27182311 27124454 26927615 26598166 26148904 25597283 24963222 24267376 23530216 22771305
$$ packed form
59665G121836L21151L48166L75176M01314M26913M52374M76944M98907N16683
59656A0939464N29399N36660N38189N33837N23914N09651M93210M76964M62661
59647A5543949M51260M43193M38330M35821M34479M33178M30378M23589M10207
59638A9444384L89022L60278L24285K81053K31513J78107J23622P0195J9895k4684
59628B1397670o1385q9441j08782j18929j19431j10831r4223p0109l8575l91M3096
59617B0628669R1085J43395J99320K57283L15752L73599M29136M79433N21035
59608B3438707N50851N65942N63013N38805M91106M19318L24562K09841Q0166
59599B7182311n7857j96839l29449m49262n51621o34061o95846p37160p58911
$$ plain form
59590 22771305 22008119 21254684 20521077 19814021 19137416 18491728 17872936 17272884 16681561
59581 16681561 16089712 15490234 14878770 14254505 13620709 12983791 12351252 11730223 11127190
59572 11127190 10547807 9996174 9474509 8983858 8524938 8098056 7702577 7336990 6999583
59563 6999583 6688876 6403546 6142284 5903784 5686705 5489555 5310747 5148841 5002688
59554 5002688 4871258 4753263 4646933 4550295 4461718 4380065 4304177 4232352 4162600 4093376 4023888
59543 4023888 3953737 3882614 3810394 3737221 3663338 3589013 3514721 3441192 3369208 3299541 3233113
59532 3233113 3170942 3113705 3061455 3013849 2970573 2931625 2897466 2868930 2846660 2830452 2819335
59521 2819335 2812473 2809821 2811770 2818349 2828987 2843021 2860178 2880472 2903584 2928526 2954201 2980457
$$ packed form
59590B2771305p63186p53435p33607p07056o76605o45688o18792o00052n91323
59581A6681561n91849n99478o11464o24265o33796o36918o32539o21029o03033
59572A1127190n79383n51633n21665m90651m58920m26882l95479l65587l37407
59563F999583l10707k85330k61262k38500k17079j97150j78808j61906j46153
59554E002688j31430j17995j06330r6638q8577q1653p5888p1825o9752o9224o9488
59543D023888p0151p1123p2220p3173p3883p4325p4292p3529p1984o9667o6428
59532C233113o2171n7237n2250m7606m3276l8948l4159k8536k2270j6208j1117
59521B819335o862k652J949O579J0638J4034J7157K0294K3112K4942K5675K6256
$$ plain form
59509 2980457 3008289 3038801 3072283 3108675 3148451 3192303 3240124 3291204 3345685 3405082 3471071
59498 3471071 3544363 3625115 3713791 3811029 3917071 4031903 4155700 4288759 4431281 4583613
59488 4583613 4746295 4919306 5101443 5290860 5485913 5684987 5885860 6085984 6283313
59479 6283313 6476211 6662579 6839710 7005085 7156701 7292590 7410800 7510370 7591873 7656629
59469 7656629 7705686 7739968 7761116 7771634 7774242 7771544 7766393 7762165 7762298 7769735 7787080 7817086 7862354
59456 7862354 7924058 8001043 8090312 8188122 8290205 8391165 8484370 8562918 8620533 8651704 8651620
59445 8651620 8616604 8544614 8435317 8290049 8111912 7905500 7675979 7428428 7168118 6900883
59435 6900883 6632591 6368229 6111664 5866049 5633918 5416952 5216091 5031956 4865037
$$ packed form
59509B980457K7832L0512L3482L6392L9776M3852M7821N1080N4481N9397O5989
59498C471071P3292Q0752Q8676R7238J06042J14832J23797J33059J42522J52332
59488D583613J62682J73011J82137J89417J95053J99074K00873K00124J97329
59479F283313J92898J86368J77131J65375J51616J35889J18210R9570Q1503O4756
59469G656629M9057L4282K1148J0518K608k698n151m228J33P437J7345L0006M5268
59456G862354O1704P6985Q9269R7810J02083J00960R3205P8548N7615L1171q4
59445H651620l5016p1990j09297j45268j78137k06412k29521k47551k60310k67235
59435F900883k68292k64362k56565k45615k32131k16966k00861j84135j66919
$$ plain form
59426 4865037 4715561 4583544 4468925 4371520 4290923 4226695 4178546 4146130 4128879 4126345 4138532
59415 4138532 4165567 4207202 4262973 4332700 4416377 4513625 4623551 4745042 4876707 5016478
59405 5016478 5161596 5309087 5456050 5599436 5735695 5860534 5968972 6055996 6117678 6151671
59395 6151671 6156554 6131263 6075771 5992085 5883764 5754323 5606525 5443136 5267658 5084036
59385 5084036 4895992 4706716 4518756 4334003 4154038 3980500 3814866 3657986 3510258
59376 3510258 3372118 3243838 3125027 3015033 2913875 2821995 2739034 2663710 2595201 2533835
59366 2533835 2479986 2433034 2392012 2356643 2327056 2302947 2283776 2269468 2260199 2255602 2254845 2257462
59354 2257462 2263638 2273734 2287960 2306309 2328163 2351899 2375410 2397289 2417373 2436223 2454502
$$ packed form
59426D865037j49476j32017j14619r7405q0597o4228m8149l2416j7251k534J2187
59415D138532K7035M1635N5771O9727Q3677R7248J09926J21491J31665J39771
59405E016478J45118J47491J46963J43386J36259J24839J08438Q7024O1682L3993
59395F151671M883k5291n5492q3686j08321j29441j47798j63389j75478j83622
59385E084036j88044j89276j87960j84753j79965j73538j65634j56880j47728
59376C510258j38140j28280j18811j09994j01158r1880q2961p5324o8509o1366
59366B533835n3849m6952m1022l5369k9587k4109j9171j4308r269m597p57K617
59354B257462O176J0096J4226J8349K1854K3736K3511K1879K0084J8850J8279
$$ plain form
59343 2454502 2472962 2492764 2515594 2543417 2577888 2619630 2667971 2721387 2778204 2837107 2897573
59332 2897573 2960298 3026987 3099422 3178859 3266547 3364314 3474056 3596816 3732968 3883237
59322 3883237 4048898 4231063 4430568 4648795 4887949 5150030 5435841 5745284 6078161
59313 6078161 6434108 6811765 7208191 7618943 8038515 8460940 8880335 9291056 9687555
59304 9687555 10064750 10418993 10748487 11052444 11330021 11580401 11803572 12000244 12170792
59295 12170792 12314557 12430123 12515686 12568911 12586939 12567105 12507676 12407817 12267239 12086450
59285 12086450 11867323 11613014 11327163 11013327 10675181 10316983 9943619 9560164 9171273
59276 9171273 8780799 8391966 8008030 7632694 7269563 6921209 6589082 6274316 5978174
$$ packed form
59343B454502J8460J9802K2830K7823L4471M1742M8341N3416N6817N8903O0466
59332B897573O2725O6689P2435P9437Q7688R7767J09742J22760J36152J50269
59322C883237J65661J82165J99505K18227K39154K62081K85811L09443L32877
59313F078161L55947L77657L96426M10752M19572M22425M19395M10721L96499
59304I687555L77195L54243L29494L03957K77577K50380K23171J96672J70548
59295A2170792J43765J15566Q5563N3225J8028j9834n9429r9859j40578j80789
59285A2086450k19127k54309k85851l13836l38146l58198l73364l83455l88891
59276I171273l90474l88833l83936l75336l63131l48354l32127l14766k96142
$$ plain form
59267 5978174 5701495 5444157 5205573 4985589 4784464 4601979 4436916 4287516 4152346
59258 4152346 4030736 3922594 3827766 3745435 3674160 3612598 3560106 3516503 3481530 3454801 3436091
59247 3436091 3425138 3421183 3423209 3430813 3444501 3464900 3491891 3524584 3561830 3602593 3646186 3692433
59235 3692433 3741395 3792635 3844848 3896425 3946300 3994095 4039658 4082830 4123655 4162640 4200708
59224 4200708 4238932 4278186 4318906 4361262 4405642 4452913 4504091 4559872 4620509 4685848 4755135
59213 4755135 4826759 4898419 4967554 5031570 5087949 5134643 5170583 5195567 5209400 5211272 5200135
59202 5200135 5175705 5138993 5091916 5036530 4974654 4908066 4838787 4768991 4700572 4634917 4573130
59191 4573130 4516400 4465900 4422216 4385005 4353493 4327411 4307314 4293784 4286441 4283924 4284853 4288560
$$ packed form
59267E978174k76679k57338k38584k19984k01125j82485j65063j49400j35170
59258D152346j21610j08142r4828q2331p1275o1562n2492m3603l4973k6729j8710
59247C436091j0953l955K026P604J3688K0399K6991L2693L7246M0763M3593M6247
59235C692433M8962N1240N2213N1577M9875M7795M5563M3172M0825L8985L8068
59224D200708L8224L9254M0720M2356M4380M7271N1178N5781O0637O5339O9287
59213D755135P1624P1660O9135O4016N6379M6694L5940K4984J3833J872j1137
59202E200135k4430l6712m7077n5386o1876o6588o9279o9796o8419o5655o1787
59191D573130n6730n0500m3684l7211l1512k6082k0097j3530p343k517R29L707
$$ plain form
59179 4288560 4294775 4302868 4311807 4320923 4330570 4341921 4356167 4373973 4395752 4422385 4455542 4497225
59167 4497225 4549164 4612869 4690031 4782431 4891347 5017435 5161276 5323547 5504315 5702386
59157 5702386 5915448 6140335 6372676 6606673 6835723 7052978 7250907 7420910 7554543
59148 7554543 7645451 7689806 7685348 7631116 7528387 7380984 7194128 6973473 6725363 6457093
59138 6457093 6175997 5888369 5599435 5313780 5035205 4766471 4509661 4266612 4038653
59129 4038653 3826212 3629066 3446789 3278779 3124274 2982791 2854193 2737911 2632454
59120 2632454 2536277 2448822 2370150 2299775 2236525 2179453 2128226 2082618 2042197 2006577 1975534
59109 1975534 1948747 1925864 1906837 1891794 1880593 1872889 1868619 1867900 1870494 1875917 1884182 1895820 1910967
$$ packed form
59179D288560O215Q093Q939R116R647J1351J4246J7806K1779K6633L3157M1683
59167D497225N1939O3705P7162R2400J08916J26088J43841J62271J80768J98071
59157E702386K13062K24887K32341K33997K29050K17255J97929J70003J33633
59148G554543R0908M4355m458n4232j02729j47403j86856k20655k48110k68270
59138F457093k81096k87628k88934k85655k78575k68734k56810k43049k27959
59129D038653k12441j97146j82277j68010j54505j41483j28598j16282j05457
59120B632454r6177q7455p8672p0375o3250n7072n1227m5608m0421l5620l1043
59109A975534k6787k2883j9027j5043j1201p704m270p19K594N423Q265J1638J5147
$$ plain form
59096 1910967 1928970 1949209 1971836 1997382 2026045 2057749 2092538 2130488 2171413 2215105 2261661
59085 2261661 2311208 2363400 2417553 2473188 2530102 2587909 2645830 2702943 2758417 2811504 2861549
59074 2861549 2908094 2950775 2989118 3022570 3050770 3073693 3091650 3105352 3115902 3124427 3131661 3138107
59062 3138107 3144598 3152383 3162520 3175522 3191759 3211993 3237216 3268193 3305459 3349581 3401064 3459976
59050 3459976 3526072 3599300 3679911 3768056 3863574 3966226 4075783 4191787 4313613 4440813
59040 4440813 4572838 4708119 4843829 4976834 5104273 5222679 5327234 5413025 5477115 5518719
59030 5518719 5537540 5532871 5504576 5454028 5383565 5295625 5192765 5077812 4953242 4820702 4681644
59019 4681644 4538085 4392134 4245042 4097281 3949429 3802402 3656931 3513459 3372692
$$ packed form
59096A910967J8003K0239K2627K5546K8663L1704L4789L7950M0925M3692M6556
59085B261661M9547N2192N4153N5635N6914N7807N7921N7113N5474N3087N0045
59074B861549M6545M2681L8343L3452K8200K2923J7957J3702J0550Q525P234O446
59062C138107O491P785J0137J3002J6237K0234K5223L0977L7266M4122N1483N8912
59050C459976O6096P3228Q0611Q8145R5518J02652J09557J16004J21826J27200
59040D440813J32025J35281J35710J33005J27439J18406J04555Q5791O4090M1604
59030E518719J8821m669k8295n0548p0463q7940j02860j14953j24570j32540j39058
59019D681644j43559j45951j47092j47761j47852j47027j45471j43472j40767
$$ plain form
59010 3372692 3235803 3103860 2977316 2856143 2740237 2629574 2524220 2424385 2330420 2242634
59000 2242634 2161019 2085079 2013986 1947099 1884359 1825987 1771814 1721171 1673524 1628849 1587281
58989 1587281 1548797 1513434 1481316 1452021 1424297 1396930 1369710 1343161 1317593 1292945 1269395
58978 1269395 1247518 1227741 1209971 1193702 1178239 1162983 1147931 1133796 1121269 1110360 1100892
58967 1100892 1093350 1088527 1086324 1085587 1085287 1085317 1085970 1087179 1088547 1089750 1090639 1091276 1091968 1093001 1094209 1095157
58951 1095157 1095863 1096919 1098785 1101372 1104468 1108101 1112232 1116481 1120553 1124595 1128797 1132860 1136244 1138785
58937 1138785 1140759 1142455 1143990 1145497 1147213 1149314 1151813 1154673 1157963 1161886 1166628 1172186 1178428 1185380
58923 1185380 1193206 1201724 1210192 1218037 1225675 1234157 1243991 1254769 1265985 1277657 1289985 1302951 1316632
$$ packed form
59010C372692j36889j31943j26544j21173j15906j10663j05354r9835r3965q7786
59000B242634q1615p5940p1093o6887o2740n8372n4173n0643m7647m4675m1568
58989A587281l8484l5363l2118k9295k7724k7367k7220k6549k5568k4648k3550
58978A269395k1877j9777j7770j6269j5463j5256j5052j4135j2527j0909r468
58967A100892p542m823k203p37l00L0O53J209J368J203Q89O37O92J033J208R48
58951A095157P06J056J866K587L096L633M131M249M072M042M202M063L384K541
58937A138785J974J696J535J507J716K101K499K860L290L923M742N558O242O952
58923A185380P826Q518Q468P845P638Q482R834J0778J1216J1672J2328J2966J3681
$$ plain form
58910 1316632 1331470 1347818 1365536 1384365 1404369 1425577 1447419 1469041 1490148 1511217 1532975
58899 1532975 1555974 1580533 1606660 1633950 1661873 1690278 1719454 1749672 1780853 1812789 1845584
58888 1845584 1879851 1916511 1956325 1999516 2045814 2094860 2146506 2200796 2257942 2318534 2383569
58877 2383569 2453985 2530105 2611642 2698254 2789968 2887192 2990522 3100680 3218537 3344988
58867 3344988 3480638 3625586 3779793 3943869 4119419 4308375 4512046 4731062 4966155
58858 4966155 5218617 5489833 5780716 6091825 6423819 6777559 7153864 7553238 7975563
58849 7975563 8419749 8883600 9363981 9856848 10356887 10857162 11349155 11823036 12267988
58840 12267988 12672750 13026353 13318649 13540665 13685375 13748883 13730937 13634201 13463240 13224296
$$ packed form
58910A316632J4838J6348J7718J8829K0004K1208K1842K1622K1107K1069K1758
58899A532975K2999K4559K6127K7290K7923K8405K9176L0218L1181L1936L2795
58888A845584L4267L6660L9814M3191M6298M9046N1646N4290N7146O0592O5035
58877B383569P0416P6120Q1537Q6612R1714R7224J03330J10158J17857J26451
58867C344988J35650J44948J54207J64076J75550J88956K03671K19016K35093
58858D966155K52462K71216K90883L11109L31994L53740L76305L99374M22325
58849G975563M44186M63851M80381M92867N00039N00275M91993M73881M44952
58840A2267988M04762L53603K92296K22016J44710O3508j7946r6736j70961k38944
$$ plain form
58830 13224296 12925478 12576315 12186721 11766326 11324351 10869413 10409056 9949578 9496340
58821 9496340 9054022 8626511 8216750 7826811 7457916 7110292 6783217 6475512 6186170
58812 6186170 5914659 5660724 5423893 5203038 4996451 4802541 4620570 4450617 4292777
58803 4292777 4146564 4011115 3885654 3769470 3661710 3561667 3469300 3384969 3308507 3238937
58793 3238937 3175388 3117897 3066961 3022638 2984607 2952811 2927359 2907848 2893508 2884076 2879889 2881046
58781 2881046 2887293 2898957 2917074 2942021 2972827 3008557 3049704 3097324 3151454 3211461 3277553
58770 3277553 3350676 3430914 3517303 3609590 3709171 3817823 3936280 4064492 4202608 4351168
58760 4351168 4510851 4682603 4867733 5067550 5283101 5515383 5765349 6033600 6320660
$$ packed form
58830A3224296k98818l49163l89594m20395m41975m54938m60357m59478m53238
58821I496340m42318m27511m09761l89939l68895l47624l27075l07705k89342
58812F186170k71511k53935k36831k20855k06587j93910j81971j69953j57840
58803D292777j46213j35449j25461j16184j07760j00043r2367q4331p6462o9570
58793C238937o3549n7491n0936m4323l8031l1796k5452j9511j4340r432m187J157
58781B881046O247J1664J8117K4947L0806L5730M1147M7620N4130O0007O6092
58770C277553P3123Q0238Q6389R2287R9581J08652J18457J28212J38116J48560
58760D351168J59683J71752J85130J99817K15551K32282K49966K68251K87060
$$ plain form
58751 6320660 6627797 6956997 7309751 7686305 8086171 8508455 8951038 9409915 9879878
58742 9879878 10355205 10828902 11291694 11732638 12140657 12505045 12814988 13059989 13231530
58733 13231530 13324404 13336720 13269259 13125067 12909347 12629424 12294569 11915240 11501748 11063230
58723 11063230 10607680 10142512 9674620 9209951 8753238 8308104 7877289 7462957 7067021
58714 7067021 6691069 6335902 6001396 5686965 5391848 5114891 4854619 4610012 4380939
58705 4380939 4167352 3968339 3782336 3608101 3445073 3292993 3151567 3020312 2898359
58696 2898359 2784585 2678265 2579411 2488133 2403946 2326086 2254188 2188132 2127421 2071283 2019238
58685 2019238 1971064 1926321 1884434 1845172 1808520 1774096 1741258 1709832 1680250 1652825 1627200
$$ packed form
58751F320660L07137L29200L52754L76554L99866M22284M42583M58877M69963
58742I879878M75327M73697M62792M40944M08019L64388L09943K45001J71541
58733A3231530R2874J2316o7461j44192k15720k79923l34855l79329m13492m38518
58723A1063230m55550m65168m67892m64669m56713m45134m30815m14332l95936
58714G067021l75952l55167l34506l14431k95117k76957k60272k44607k29073
58705D380939k13587j99013j86003j74235j63028j52080j41426j31255j21953
58696B898359j13774j06320r8854r1278q4187p7860p1898o6056o0711n6138n2045
58685B019238m8174m4743m1887l9262l6652l4424l2838l1426k9582k7425k5625
$$ plain form
58674 1627200 1602597 1578364 1554313 1530831 1508580 1487820 1468037 1448503 1428995 1409641 1390349
58663 1390349 1370877 1351269 1331550 1311078 1288890 1264837 1239806 1214696 1189663 1164568 1139578
58652 1139578 1114976 1090780 1066973 1043977 1022540 1003115 985395 968453 951496 934650 918795
58641 918795 904359 890534 876187 861319 846924 833401 819941 805837 791663 778507 766461
58630 766461 754638 742601 731076 721025 712443 704443 696379 688523 681587 675859 671052 666908 663662
58617 663662 661834 661807 663678 667239 671868 676633 680793 684247 687416 690772 694479 698194 701081 702331 701930
58602 701930 700705 699373 697773 695263 691599 687087 682204 677438 673286 669972 667283 665038 663559 663303
58588 663303 664248 666104 668923 673020 678368 684614 691607 699469 708176 717610 728084 740315 754728 771064
$$ packed form
58674A627200k4603k4233k4051k3482k2251k0760j9783j9534j9508j9354j9292
58663A390349j9472j9608j9719k0472k2188k4053k5031k5110k5033k5095k4990
58652A139578k4602k4196k3807k2996k1437j9425j7720j6942j6957j6846j5855
58641I18795j4436j3825j4347j4868j4395j3523j3460j4104j4174j3156j2046
58630G66461j1823j2037j1525j0051q582q000q064p856o936n728m807m144l246
58617F63662j828k7J871L561M629M765M160L454L169L356L707L715K887J250m01
58602G01930j225j332j600k510l664m512m883m766m152l314k689k245j479k56
58588F63303R45J856K819M097N348O246O993P862Q707R434J0474J2231J4413J6336
$$ plain form
58574 771064 788753 807473 827438 849384 874104 901658 931282 962461 995814 1032384 1072297
58563 1072297 1114837 1159773 1207910 1260282 1317444 1379691 1447347 1520660 1599944 1685988 1779838
58552 1779838 1881962 1992032 2109577 2234358 2365899 2503014 2643799 2785597 2924961
58543 2924961 3058167 3181850 3292619 3386193 3457995 3505104 3527074 3524581 3498075 3448393 3378057
58532 3378057 3291116 3191772 3083547 2969369 2851719 2732628 2613894 2497355 2384642 2276762
58522 2276762 2174188 2077417 1987279 1904691 1830171 1763464 1703626 1649584 1600718 1556788 1517402
58511 1517402 1481810 1449202 1418926 1390373 1362956 1336259 1309981 1283796 1257671 1232328 1208853
58500 1208853 1187580 1167676 1148012 1128130 1108181 1088269 1068230 1047838 1026956 1005516 983569
$$ packed form
58574G71064J7689J8720J9965K1946K4720K7554K9624L1179L3353L6570L9913
58563A072297M2540M4936M8137N2372N7162O2247O7656P3313P9284Q6044R3850
58552A779838J02124J10070J17545J24781J31541J37115J40785J41798J39364
58543B924961J33206J23683J10769R3574P1802M7109K1970k493k6506m9682p0336
58532C378057q6941r9344j08225j14178j17650j19091j18734j16539j12713j07880
58522B276762j02574r6771r0138q2588p4520o6707n9838n4042m8866m3930l9386
58511A517402l5592l2608l0276k8553k7417k6697k6278k6185k6125k5343k3475
58500A208853k1273j9904j9664j9882j9949j9912k0039k0392k0882k1440k1947
$$ plain form
58489 983569 961367 939309 917792 897036 876980 857453 838569 820762 804212 788504 773211
58478 773211 758651 745592 734228 723831 713471 702822 692271 682521 674061 666798 660256 654245
58466 654245 648976 644365 639742 634755 630063 626465 623746 621141 618509 616107 613513 609962 605740 602070
58452 602070 599431 596968 593845 590171 586272 582021 577372 572713 568163 563238 557738 552281 547461 543086
58438 543086 538738 534507 530686 527319 524515 522631 521612 520640 518977 516762 514568 512592 510701 508837
58424 508837 506948 504866 502573 500238 497806 495044 492186 489916 488397 486969 485154 483288 481777 480372
58410 480372 478728 477068 475756 474692 473628 472569 471461 470045 468504 467616 467694 467964 467661 467174 467436 468678
58394 468678 470602 473395 477633 483233 489208 494561 499055 503117 507255 511455 515034 517299 518422 519220
$$ packed form
58489I83569k2202k2058k1517k0756k0056j9527j8884j7807j6550j5708j5293
58478G73211j4560j3059j1364j0397j0360j0649j0551r750q460p263o542o011
58466F54245n269m611m623m987m692l598k719k605k632k402k594l551m222l670
58452F02070k639k463l123l674l899m251m649m659m550m925n500n457m820m375
58438E43086m348m231l821l367k804j884j019r72j663k215k194j976j891j864
58424E08837j889k082k293k335k432k762k858k270j519j428j815j866j511j405
58410D80372j644j660j312j064j064j059j108j416j541q88P8K70l03m87K62J242
58394D68678J924K793M238N600N975N353M494M062M138M200L579K265J123P98
$$ plain form
58380 519220 519945 519874 518290 515296 511367 506772 501829 497145 493083 489448 486047 483061 480488 477854 474831
58365 474831 471639 468515 465410 462532 460410 459040 457736 456294 455474 455789 456714 457736 459331 462094 465670
58350 465670 469405 473378 477979 483097 488572 494838 502282 510468 518762 527130 535522 543184 549500 555014
58336 555014 560723 566849 573073 579349 585629 591414 596530 601757 607684 613548 618234 621804 624956 627566
58322 627566 629053 629663 630031 629736 627657 623756 619328 615471 612294 609621 607466 605761 604410 603673 603800
58307 603800 604486 605373 606846 609555 613388 617690 622200 626974 631709 636052 640386 645462 651449 657987 664834
58292 664834 671662 677616 681991 685129 687948 690853 693776 696759 699773 702397 704496 706653 709220 711623
58278 711623 713396 715096 717200 718986 719723 720197 721733 724401 727566 731550 737186 744227 751690 759442 768004
$$ packed form
58380E19220P25p1j584k994l929m595m943m684m062l635l401k986k573k634l023
58365D74831l192l124l105k878k122j370j304j442q20L15R25J022J595K763L576
58350D65670L735L973M601N118N475O266P444Q186Q294Q368Q392P662O316N514
58336E55014N709O126O224O276O280N785N116N227N927N864M686L570L152K610
58322F27566J487O10L68k95k079l901m428l857l177k673k155j705j351p37J27
58307F03800O86Q87J473K709L833M302M510M774M735M343M334N076N987O538O847
58292F64834O828N954M375L138K819K905K923K983L014K624K099K157K567K403
58278G11623J773J700K104J786P37M74J536K668L165L984N636P041P463P752Q562
$$ plain form
58263 768004 777183 786382 795959 806820 818858 831176 843543 856242 868835 880558 891739 903368
58251 903368 915459 927262 938854 951089 964155 977530 991107 1004938 1018226 1030090 1041146
58240 1041146 1052878 1065661 1078794 1092104 1105966 1120123 1134062 1148293 1163720 1180131 1196818
58229 1196818 1214205 1233148 1253191 1273353 1294199 1317177 1342261 1368200 1394738 1422628 1451798
58218 1451798 1481616 1512627 1545907 1580909 1616047 1651197 1687596 1725668 1765088 1806461 1850601
58207 1850601 1896632 1943299 1991729 2044209 2100672 2159254 2219937 2284488 2352953 2423547 2496319
58196 2496319 2573642 2656629 2744148 2835826 2932919 3035532 3142052 3252148 3367658 3489870
58186 3489870 3618586 3754263 3898241 4050500 4209977 4377402 4554938 4743009 4940643
$$ packed form
58263G68004R179R199R577J0861J2038J2318J2367J2699J2593J1723J1181J1629
58251I03368J2091J1803J1592J2235J3066J3375J3577J3831J3288J1864J1056
58240A041146J1732J2783J3133J3310J3862J4157J3939J4231J5427J6411J6687
58229A196818J7387J8943K0043K0162K0846K2978K5084K5939K6538K7890K9170
58218A451798K9818L1011L3280L5002L5138L5150L6399L8072L9420M1373M4140
58207A850601M6031M6667M8430N2480N6463N8582O0683O4551O8465P0594P2772
58196B496319P7323Q2987Q7519R1678R7093J02613J06520J10096J15510J22212
58186C489870J28716J35677J43978J52259J59477J67425J77536J88071J97634
$$ plain form
58177 4940643 5148965 5370935 5607562 5857984 6123293 6406541 6708959 7030282 7372914
58168 7372914 7741437 8137704 8560734 9011511 9493201 10006601 10550661 11127966 11744438
58159 11744438 12403311 13105077 13853795 14657332 15520743 16445728 17437282 18504352 19653631
58150 19653631 20890281 22225590 23676384 25256930 26980856 28872462 30967753 33305562
58142 33305562 35930013 38902201 42295645 46179002 50619852 55710624 61576876 68357223
58134 68357223 76188123 85200994 95508507 107206921 120440880 135438329 152311515
58127 152311515 170625344 189101456 205833419 218918294 227022884 229570673 226668218
58120 226668218 219004552 207730424 194211063 179709391 165182080 151252934 138270002
$$ packed form
58177D940643K08322K21970K36627K50422K65309K83248L02418L21323L42632
58168G372914L68523L96267M23030M50777M81690N13400N44060N77305O16472
58159A1744438O58873P01766P48718Q03537Q63411R24985R91554J067070J149279
58150A9653631J236650J335309J450794J580546J723926J891606K095291K337809
58142C3305562K624451K972188L393444L883357M440850N090772N866252O780347
58134F8357223P830900R012871J0307513J1698414J3233959J4997449J6873186
58127A52311515J8313829J8476112J6731963J3084875Q104590K547789k902455
58120B26668218p663666j1274128j3519361j4501672j4527311j3929146j2982932
$$ plain form
58113 138270002 126366772 115532845 105693536 96757179 88623278 81195009 74411117 68262123
58105 68262123 62774183 57986306 53935048 50634220 48056814 46143845 44824386 44000312
58097 44000312 43502267 43085918 42500351 41570960 40229232 38493337 36441712 34190805 31864106
58088 31864106 29560346 27342569 25247240 23294642 21493986 19848527 18358686 17018169
58080 17018169 15809808 14710144 13698295 12759755 11886220 11076329 10334139 9662243 9056538
58071 9056538 8508977 8012400 7560140 7144207 6757867 6398582 6065723 5757149 5470212
58062 5470212 5203805 4956667 4725577 4507786 4303443 4113175 3935013 3765840 3604082
58053 3604082 3448745 3297673 3149131 3003670 2862417 2725234 2592538 2467028 2351209
$$ packed form
58113A38270002j1903230j0833927r839309q936357q133901p428269o783892o148994
58105F8262123n487940m787877m051258l300828k577406j912969j319459q24074
58097D4000312m98045m16349n85567r29391j341728j735895k051625k250907k326699
58088C1864106k303760k217777k095329j952598j800656j645459j489841j340517
58080A7018169j208361j099664j011849r38540q73535q09891p42190o71896o05705
58071I056538n47561m96577m52260m15933l86340l59285l32859l08574k86937
58062E470212k66407k47138k31090k17791k04343j90268j78162j69173j61758
58053C604082j55337j51072j48542j45461j41253j37183j32696j25510j15819
$$ plain form
58044 2351209 2244542 2145109 2052581 1967473 1888931 1815561 1747319 1684518 1625955 1570006 1516674
58033 1516674 1466850 1420437 1376761 1335824 1297668 1261484 1226740 1194147 1164145 1135613 1107386
58022 1107386 1079752 1053111 1026522 999154 971859 945729 920357 895118 870825 848311 826625
58011 826625 804687 783702 765763 750730 736514 722089 708388 696449 686307 677676 670351 663883
57999 663883 657797 651959 646053 639292 631427 623354 615820 608327 600209 591981 584582 578109 572325 567543
57985 567543 563862 560346 556219 552172 549290 547314 545115 542280 539142 535898 532786 530502 529339 528504
57971 528504 527256 526020 525381 524835 523654 522110 520534 517972 513299 507176 501496 497158 493585 490067 486444
57956 486444 482723 479159 476411 474754 473453 471688 469496 467032 463755 459398 454895 451119 447478 443058
$$ packed form
58044B351209j06667r9433r2528q5108p8542p3370o8242o2801n8563n5949n3332
58033A516674m9824m6413m3676m0937l8156l6184l4744l2593l0002k8532k8227
58022A107386k7634k6641k6589k7368k7295k6130k5372k5239k4293k2514k1686
58011H26625k1938k0985j7939j5033j4216j4425j3701j1939j0142q631p325o468
57999F63883o086n838n906o761p865q073p534p493q118q228p399o473n784m782
57985E67543l681l516m127m047k882j976k199k835l138l244l112k284j163q35
57971E28504j248j236o39n46j181j544j576k562m673o123n680m338l573l518l623
57956D86444l721l564k748j657j301j765k192k464l277m357m503l776l641m420
$$ plain form
57942 443058 438379 434519 431114 426871 421673 416619 412270 408459 405650 404763 405514 406391 406502 406227 405929 405320
57926 405320 404324 403383 402550 401248 399225 396955 394939 393365 392490 392486 392895 393010 392821 392764 392650 391727 389826 387542
57908 387542 385270 382973 380916 379642 378988 378011 376146 373786 371533 369539 367705 365924 363976 361745 359487
57893 359487 357419 355192 352430 349610 347563 346210 344604 342267 339700 337519 335917 335126 335585 337322 339692
57878 339692 341906 343464 344139 344098 343964 344142 344063 342724 339952 336521 333036 329423 325598 321892 318553 315363
57862 315363 312065 308783 305817 303285 301054 298877 296689 294974 294552 295619 297334 298776 300042 301882
57848 301882 304562 307683 310871 314015 316964 319594 322032 324298 326002 326968 327810 329180 330669 331205 330388
57833 330388 328749 326921 325281 324151 323470 322345 319763 315779 311361 307219 303506 300404 298038 295824
$$ packed form
57942D43058m679l860l405m243n198n054m349l811k809q87P51Q77J11k75k98o09
57926D05320r96r41q33j302k023k270k016j574q75mM09J15j89n7j14r23j901k284
57908C87542k272k297k057j274o54r77j865k360k253j994j834j781j948k231k258
57893C59487k068k227k762k820k047j353j606k337k567k181j602p91M59J737K370
57878C39692K214J558O75m1j34J78p9j339k772l431l485l613l825l706l339l190
57862C15363l298l282k966k532k231k177k188j715m22J067J715J442J266J840
57848C01882K680L121L188L144K949K630K438K266J704R66Q42J370J489N36q17
57833C30388j639j828j640j130o81j125k582l984m418m142l713l102k366k214
$$ plain form
57819 295824 292898 289347 286257 284403 283576 283193 282804 281942 280396 278823 278397 279578 281825 284557 287676
57804 287676 291063 294364 297552 301013 304793 308324 311153 313410 315349 316872 317749 317846 317076 315490 313416
57789 313416 311115 308326 304627 300143 295369 290450 285239 279896 274754 269703 264468 259477 255653 253258
57775 253258 251589 249837 247634 244852 241610 238465 235821 233162 229610 225157 220557 216108 211500 206792
57761 206792 202440 198242 193408 187962 182982 179074 175597 171865 168171 165020 162179 159140 155961 153093
57747 153093 150811 149125 147789 146263 144353 143039 143804 146817 150598 153810 156560 159465 162409 164919
57733 164919 167104 169516 172470 175973 179847 183534 186325 188205 189938 192018 194154 196086 198124 200400
57719 200400 202227 202830 202171 200656 198525 195967 193224 190186 186477 182321 178647 175923 173588 171080 168641
$$ packed form
57819B95824k926l551l090j854q27l83l89q62j546j573m26J181K247K732L119
57804B87676L387L301L188L461L780L531K829K257J939J523Q77R7p70j586k074
57789C13416k301k789l699m484m774m919n211n343n142n051n235m991l824k395
57775B53258j669j752k203k782l242l145k644k659l552m453m600m449m608m708
57761B06792m352m198m834n446m980l908l477l732l694l151k841l039l179k868
57747A53093k282j686j336j526j910j314P65L013L781L212K750K905K944K510
57733A64919K185K412K954L503L874L687K791J880J733K080K136J932K038K276
57719B00400J827O03o59j515k131k558k743l038l709m156l674k724k335k508k439
$$ plain form
57704 168641 166540 164362 161774 159300 157514 156072 154398 152827 152280 153158 155226 158094 161175 163687 165491
57689 165491 167512 170615 174439 178053 181252 184470 187884 191476 195530 200148 204561 207841 210113 212279
57675 212279 214820 217689 221047 225039 228989 231935 234010 236307 239241 242105 244552 247512 252018 257807
57661 257807 263726 269170 274540 280527 287475 295376 304079 313295 322564 331503 340228 349419 359686 370883
57647 370883 382401 394167 406904 421206 436812 453158 470194 488283 507633 528306 550504
57636 550504 574412 599959 627137 656264 687630 721187 757086 796148 839341 886980 938900
57625 938900 995191 1056422 1123426 1197222 1278730 1368162 1465164 1570015 1684062 1808182 1941274
57614 1941274 2081026 2225614 2373503 2521919 2666926 2805221 2934623 3052113 3152072 3227071
$$ packed form
57704A68641k101k178k588k474j786j442j674j571n47Q78K068K868L081K512J804
57689A65491K021L103L824L614L199L218L414L592M054M618M413L280K272K166
57675B12279K541K869L358L992L950K946K075K297K934K864K447K960M506N789
57661B57807N919N444N370N987O948P901Q703R216R269Q939Q725R191J0267J1197
57647C70883J1518J1766J2737J4302J5606J6346J7036J8089J9350K0673K2198
57636E50504K3908K5547K7178K9127L1366L3557L5899L9062M3193M7639N1920
57625I38900N6291O1231O7004P3796Q1508Q9432R7002J04851J14047J24120J33092
57614A941274J39752J44588J47889J48416J45007J38295J29402J17490R9959P4999
$$ plain form
57604 3227071 3270344 3277823 3249023 3186927 3096965 2985633 2859632 2725465 2588662 2452894
57594 2452894 2320126 2191762 2069282 1953808 1845775 1745416 1653174 1569329 1493555 1425210
57584 1425210 1363952 1309836 1262876 1222617 1188155 1158618 1133757 1113952 1099464 1089839 1084252 1082234
57572 1082234 1083807 1089085 1098201 1111481 1129298 1151747 1178733 1210209 1246115 1286392 1331556 1382929
57560 1382929 1441631 1507410 1579070 1655968 1738399 1826417 1918868 2013730 2108812 2201780 2289889
57549 2289889 2369954 2438513 2492092 2527855 2544256 2540990 2518450 2477599 2420316 2349408 2268040
57538 2268040 2179184 2085337 1988368 1889672 1790759 1693446 1599095 1508000 1420135 1336276 1257669
57527 1257669 1184734 1116889 1053648 995066 940972 890645 843582 799958 759983 723363 689747
$$ packed form
57604C227071M3273P479k8800o2096q9962j11332j26001j34167j36803j35768
57594B452894j32768j28364j22480j15474j08033j00359r2242q3845p5774o8345
57584A425210o1258n4116m6960m0259l4462k9537k4861j9805j4488r625n587k018
57572A082234J573N278R116J3280J7817K2449K6986L1476L5906M0277M5164N1373
57560A382929N8702O5779P1660P6898Q2431Q8018R2451R4862R5082R2968Q8109
57549B289889Q0065O8559N3579L5763J6401l266k2540m0851n7283p0908q1368
57538B268040q8856r3847r6969r8696r8913r7313r4351r1095q7865q3859p8607
57527A257669p2935o7845o3241n8582n4094n0327m7063m3624l9975l6620l3616
$$ plain form
57516 689747 659123 631461 606409 583631 562973 544046 526246 509540 494667 482101 471287
57505 471287 461353 452049 443469 435304 427150 419381 413027 408663 405863 403792 402020 400691 400233 401041 403252
57490 403252 406676 410953 415856 421500 428266 436481 446142 457094 469485 483719 499778 516974 534846
57477 534846 553956 575193 598521 623191 649147 677361 708629 742888 780067 820845 865980
57466 865980 915478 968988 1026590 1088574 1154751 1224487 1297134 1371851 1447180 1521283 1592431
57455 1592431 1658859 1718277 1768031 1805717 1829484 1838097 1831337 1810293 1776807 1732529 1678809 1617371
57443 1617371 1550624 1481119 1410861 1341103 1272579 1205903 1141904 1081526 1025285 972971 924117
57432 924117 878652 836902 799092 765192 735206 709318 687611 669795 655264 643422 634050 627425
$$ packed form
57516F89747l0624k7662k5052k2778k0658j8927j7800j6706j4873j2566j0814
57505D71287r934r304q580q165q154p769o354m364k800k071j772j329m58Q08K211
57490D03252L424M277M903N644O766Q215R661J0952J2391J4234J6059J7196J7872
57477E34846J9110K1237K3328K4670K5956K8214L1268L4259L7179M0778M5135
57466H65980M9498N3510N7602O1984O6177O9736P2647P4717P5329P4103P1148
57455A592431O6428N9418M9754L7686K3767Q613o760k1044l3486m4278n3720o1438
57443A617371o6747o9505p0258o9758o8524o6676o3999o0378n6241n2314m8854
57432I24117m5465m1750l7810l3900k9986k5888k1707j7816j4531j1842r372o625
$$ plain form
57420 627425 623917 623362 625010 628292 633458 641240 651992 665433 681175 699275 720262 744807 773334
57407 773334 805826 842046 882064 926423 975585 1029370 1087143 1148462 1213163 1280739 1349832
57396 1349832 1418348 1483835 1543664 1595137 1635761 1663524 1676988 1675328 1658538 1627588 1584219
57385 1584219 1530323 1467533 1397449 1322108 1243959 1165207 1087307 1011146 937507 867093 800291
57374 800291 737223 678058 623004 571993 524625 480455 439128 400222 363348 328569 296443
57363 296443 267316 240696 215581 191450 168739 148293 130461 114830 100706 87584 75066
57352 75066 62641 50010 37625 26502 17278 9765 3487 -1811 -6574 -11761 -18142 -25399 -32503
57339 -32503 -38880 -44645 -49907 -54564 -58865 -63449 -68584 -73922 -79200 -84641 -90337 -95821 -100648 -105056
$$ packed form
57420F27425l508n55J648L282N166P782J0752J3441J5742J8100K0987K4545K8527
57407G73334L2492L6220M0018M4359M9162N3785N7773O1319O4701O7576O9093
57396A349832O8516O5487N9829N1473M0624K7763J3464j660j6790l0950m3369
57385A584219n3896o2790p0084p5341p8149p8752p7900p6161p3639p0414o6802
57374H00291o3068n9165n5054n1011m7368m4170m1327l8906l6874l4779l2126
57363B96443k9127k6620k5115k4131k2711k0446j7832j5631j4124j3122j2518
57352G5066j2425j2631j2385j1123r224p513C487a811m763n187o381p257p104
57339c2503o377n765n262m657m301m584n135n338n278n441n696n484m827m408
$$ plain form
57325 -105056 -109560 -114145 -118268 -121596 -124437 -127418 -130861 -134474 -137667 -140300 -143014 -146561 -150894 -155182
57311 -155182 -158618 -160853 -161865 -162023 -162270 -163476 -165390 -166833 -167174 -167031 -167226 -167767 -168314 -169029 -170273 -171876
57295 -171876 -173397 -174887 -176762 -178998 -181002 -182336 -183167 -184006 -185316 -187399 -190368 -194088 -198163 -201960 -204746
57280 -204746 -206171 -206768 -207658 -209553 -212167 -214694 -216536 -217520 -217816 -217877 -218135 -218537 -218620 -218262 -217965 -218222 -218976 -219905
57262 -219905 -220829 -221581 -221918 -221907 -222005 -222469 -223080 -223713 -224695 -226151 -227514 -228142 -228073 -227679 -226973 -225807 -224332 -222729
57244 -222729 -220772 -218222 -215338 -212377 -208867 -204076 -198093 -191805 -185814 -179879 -173383 -165932 -157554 -148684
57230 -148684 -139875 -131173 -121942 -111577 -100130 -87944 -75011 -61160 -46509 -31284 -15599 26 14453
57217 14453 26941 38090 48823 58677 66018 69819 70240 67394 60605 49327 33990 15496 -5602
$$ packed form
57325a05056m504m585m123l328k841k981l443l613l193k633k714l547m333m288
57311a55182l436k235j012j58k47j206j914j443l41J43j95n41n47p15j244j603
57295a71876j521j490j875k236k004j334q31q39j310k083k969l720m075l797k786
57280b04746j425n97q90j895k614k527j842r84k96o1k58m02q3L58K97k57p54r29
57262b19905r24p52l37J1r8m64o11o33r82j456j363o28O9L94P06J166J475J603
57244b22729J957K550K884K961L510M791N983O288N991N935O496P451Q378Q870
57230a48684Q809Q702R231J0365J1447J2186J2933J3851J4651J5225a5599B6J4427
57217A4453J2488J1149J0733R854P341L801M21k846o789j1278j5337A5496e602
$$ plain form
57203 -29056 -54418 -80951 -107741 -133719 -157972 -180263 -201034 -220794 -239636 -257271 -273239 -287149
57191 -287149 -299093 -309765 -319839 -329334 -337972 -345935 -353730 -361408 -368454 -374522 -379784 -384600 -389276
57178 -389276 -394010 -398607 -402435 -405292 -408125 -412145 -417258 -422197 -426192 -429565 -432506 -434210 -433780 -431264
57164 -431264 -427287 -422155 -415835 -408407 -400060 -390868 -380839 -369913 -357797 -344176 -329323 -314017 -298619
57151 -298619 -282627 -265466 -247317 -228846 -210480 -192349 -174678 -157801 -141835 -126603 -111920
57140 -111920 -97837 -84565 -72011 -59383 -45557 -30130 -13779 2881 20423 39834 60879 82103
57128 82103 102610 123020 144322 166476 188541 209657 229462 247952 265326 281745 297047 310946
57116 310946 323492 335003 345549 354987 363519 371631 379364 386273 392252 397755 402943 407229 410094
$$ packed form
57203b9056k5362k6533k6790k5978k4253k2291k0771j9760j8842j7635j5968j3910
57191b87149j1944j0672j0074r495q638p963p795p678p046o068n262m816m676
57178c89276m734m597l828k857k833m020n113m939l995l373k941j704M30K516
57164d31264L977N132O320P428Q347R192J0029J0926J2116J3621J4853J5306J5398
57151b98619J5992J7161J8149J8471J8366J8131J7671J6877J5966J5232J4683
57140a11920J4083J3272J2554J2628J3826J5427a3779B881J7542J9411K1045K1224
57128H2103K0507K0410K1302K2154K2065K1116J9805J8490J7374J6419J5302J3899
57116C10946J2546J1511J0546R438Q532Q112P733O909N979N503N188M286K865
$$ plain form
57103 410094 411913 413585 415597 417644 418951 418928 417858 416797 416249 414954 410612 401745 388172 369751
57089 369751 345672 315284 278687 236061 186995 130785 66707 -6300 -89525 -183672 -288778
57078 -288778 -405167 -533763 -675282 -829918 -998101 -1180773 -1378575 -1591620 -1820393 -2065986
57068 -2065986 -2329091 -2609844 -2909292 -3230121 -3575284 -3946847 -4346969 -4779439 -5249603
57059 -5249603 -5763408 -6326965 -6946427 -7627885 -8378112 -9205656 -10120468 -11132500 -12252068
57050 -12252068 -13492079 -14868710 -16399745 -18104180 -20004551 -22128677 -24509144 -27183562
57042 -27183562 -30197055 -33603809 -37466598 -41858279 -46866944 -52600673 -59188855 -66779116
57034 -66779116 -75523554 -85549730 -96933929 -109707366 -123891931 -139511738 -156539268
$$ packed form
57103D10094J819J672K012K047J307k3j070j061n48j295m342q867j3573j8421
57089C69751k4079l0388l6597m2626m9066n6210o4078f300q3225r4147j05106
57078b88778j16389j28596j41519j54636j68183j82672j97802k13045k28773k45593
57068b065986k63105k80753k99448l20829l45163l71563m00122m32470m70164
57059e249603n13805n63557o19462o81458p50227q27544r14812j012032j119568
57050a2252068j240011j376631j531035j704435j900371k124126k380467k674418
57042b7183562l013493l406754l862789m391681n008665n733729o588182p590261
57034f6779116q744438j0026176j1384199j2773437j4184565j5619807j7027530
$$ plain form
57027 -156539268 -174816490 -194038402 -213822976 -233789309 -253557486 -272680567 -290597917
57020 -290597917 -306669840 -320265808 -330838632 -337952760 -341288361 -340657747 -336045870 -327654228
57012 -327654228 -315914125 -301447259 -284979060 -267235687 -248863687 -230395707 -212253748
57005 -212253748 -194757172 -178111423 -162391000 -147554473 -133506854 -120177464 -107564489
56998 -107564489 -95728214 -84754311 -74717384 -65658818 -57579427 -50443725 -44190452
56991 -44190452 -38742294 -34012263 -29909756 -26347859 -23248723 -20544920 -18178978 -16103039
56983 -16103039 -14277355 -12667361 -11242230 -9976074 -8848732 -7843929 -6947081 -6145206
56975 -6145206 -5427588 -4785094 -4209162 -3691997 -3226984 -2808012 -2428923 -2084402 -1770906
$$ packed form
57027a56539268j8277222j9221912j9784574j9966333j9768177j9123081j7917350
57020b90597917j6071923j3595968j0572824p114128l335601O30614M611877Q391642
57012c27654228J1740103J4466866J6468199J7743373J8372000J8467980J8141959
57005b12253748J7496576J6645749J5720423J4836527J4047619J3329390J2612975
56998a07564489J1836275J0973903J0036927R058566Q079391P135702O253273
56991d4190452N448158M730031M102507L561897L099136K703803K365942K075939
56983a6103039J825684J609994J425131J266156J127342J004803Q96848Q01875
56975f145206P17618O42494N75932N17165M65013M18972L79089L44521L13496
$$ plain form
56966 -1770906 -1485914 -1226678 -990358 -774800 -578241 -398493 -233211 -80894 58976 186684
56956 186684 302594 407092 500775 584522 658780 722994 776469 819601 853433 877813 890741
56945 890741 890168 876464 853274 826199 800240 777336 755427 729931 696714 654181 603102 545269
56933 545269 482802 418372 355158 295929 242196 194380 152578 116754 86284 59811 35789
56922 35789 12871 -10268 -34863 -61188 -88116 -114119 -138586 -161702 -183298 -202632 -219366 -233900
56910 -233900 -246496 -256727 -264170 -269032 -271678 -272136 -270529 -267403 -262905 -256083 -245836 -232389 -217192
56897 -217192 -201548 -186168 -171933 -160073 -151190 -144771 -140066 -136876 -135082 -133937 -132483 -130439 -128108
56884 -128108 -125507 -122155 -117819 -112992 -108390 -104176 -99848 -94709 -88278 -80345 -70852 -59754 -46979 -32576
$$ packed form
56966a770906K84992K59236K36320K15558J96559J79748J65282h0894E8976J27708
56956A86684J15910J04498R3683Q3747P4258O4214N3475M3132L3832K4380J2928
56945H90741n73j3704k3190k7075k5959k2904k1909k5496l3217m2533n1079n7833
56933E45269o2467o4430o3214n9229n3733m7816m1802l5824l0470k6473k4022
56922C5789A2871a0268k4595k6325k6928k6003k4467k3116k1596j9334j6734j4534
56910b33900j2596j0231p443m862k646m58J607L126M498O822J0247J3447J5197
56897b17192J5644J5380J4235J1860Q883O419M705L190J794J145J454K044K331
56884a28108K601L352M336M827M602M214M328N139O431P933R493J1098J2775J4403
$$ plain form
56870 -32576 -17007 -1306 13133 24982 33306 37708 38339 35788 30815 24166 16655 9301 3039 -1857
56855 -5852 -9390 -12221 -13729 -13872 -13484 -13530 -14241 -14997 -14840 -13084 -9771 -5708 -1862 1496 4978 9265
56839 9265 14386 19914 25609 31583 38005 45032 52909 61791 71480 81664 92435 104256 117383 131539
56825 131539 146078 160130 172642 182754 190303 195601 198602 198820 196302 192169 187722 183362 178906
56812 178906 174616 171176 168771 166963 165700 165759 167867 171907 177471 184758 194302 205879 218265 230140
56798 230140 240791 249817 256542 260105 260038 256579 250498 242734 234111 225170 216213 207595 199937 193983
56784 193983 190266 189021 190296 193920 199449 206586 215905 228829 246450 268358 292798 317765 341484
56771 341484 362008 377239 385896 388202 385242 377893 366737 352716 337270 321801 307347 294694
$$ packed form
56870c2576J5569a306A3133J1849Q324M402O31k551m973o649p511p354C039a857
56855e852l538k831j508j43L88m6p11p56J57J756L313M063a862A496L482M287
56839I265N121N528N695N974O422P027P877Q882R689J0184J0771J1821J3127J4156
56825A31539J4539J4052J2512J0112P549N298L001K18k518m133m447m360m456
56812A78906m290l440k405j808j263N9K108M040N564P287R544J1577J2386J1875
56798B30140J0651R026O725L563o7l459o081p764q623q941q957q618p658n954
56784A93983l717j245J275L624N529P137R319J2924J7621K1908K4440K4967K3719
56771C41484K0524J5231Q657K306k960p349j1156j4021j5446j5469j4454j2653
$$ plain form
56759 294694 284305 276082 269609 264786 261890 260977 261669 263782 267841 274648 284425 296472 309397 321516
56745 321516 331293 337743 340508 339594 335238 327997 318633 307755 295838 283641 272157 261908 252595
56732 252595 243788 235689 228954 224002 220852 219376 219367 220543 222900 226893 232864 240347 248228 255423 261034
56717 261034 264091 263869 260600 255440 249504 243144 236221 228657 220596 212269 203905 195639 187427 179252
56703 179252 171425 164454 158546 153419 148685 144237 140258 136999 134598 132919 131540 130095 128682 127781
56689 127781 127739 128411 129199 129343 128338 126395 124413 123244 122959 123054 123164 123270 123312 123096 122599 122034 121560 121244
56671 121244 121218 121487 121651 121247 120370 119449 118441 116835 114565 112291 110541 109171 107955 107092 106705 106413 105967
56654 105967 105860 106655 107920 108483 107710 106089 104610 103942 104152 104783 105217 105269 105392 106009 106773 106874 106029 104752
$$ packed form
56759B94694j0389q223o473m823k896r13O92K113M059O807R777J2047J2925J2119
56745C21516R777O450K765r14m356p241r364j0878j1917j2197j1484j0249r313
56732B52595q807q099o735m952l150j476rJ176K357L993N971P483P881P195N611
56717B61034L057k22l269n160n936o360o923p564q061q327q364q266q212q175
56703A79252p827o971n908n127m734m448l979l259k401j679j379j445j413r01
56689A27781m2O72P88J44j005j943j982j169k85R5J10J06M2k16m97n65m74l16
56671A21244k6K69J64m04q77r21j008j606k270k274j750j370j216q63l87k92m46
56654A05967j07P95J265N63p73j621j479o68K10O31M34N2J23O17P64J01q45j277
$$ plain form
56636 104752 103609 102616 101489 100126 98584 96821 94731 92393 90087 88030 86246 84743 83666 83103 82762
56621 82762 82164 81336 81033 81897 83584 85091 85916 86427 87127 88067 89126 90315 91567 92698 93812 95283
56605 95283 97065 98556 99531 100590 102158 103555 103829 103202 102860 103416 104356 105027 105427 105850 106373 106968 107651
56588 107651 108253 108436 108148 107793 107769 108108 108679 109374 109947 109988 109280 108009 106508 105008 103711 102767 102043 101205
56570 101205 100189 99352 98976 98930 98966 99016 98961 98403 97094 95421 94142 93746 94289 95631 97462 99225 100544
56553 100544 101761 103566 105905 107774 108439 108468 109055 110533 112179 113456 114744 116556 118603 120157 121051
56538 121051 121773 122692 123726 124766 125958 127415 128983 130474 131897 133385 135075 137040 139071 140583 141114
56523 141114 140920 140714 140859 141276 142118 143811 146224 148465 149963 151227 153015 155268 157416 159361 161502
$$ packed form
56636A04752j143r93j127j363j542j763k090k338k306k057j784j503j077n63l41
56621H2762n98q28l03Q64J687J507Q25N11P00R40J059J189J252J131J114J471
56605I5283J782J491R75J059J568J397K74o27l42N56R40O71M00M23N23N95O83
56588A07651O02J83k88l55k4L39N71O95N73M1p08j271j501j500j297r44p24q38
56570A01205j016q37l76m6L6N0n5n58j309j673j279l96N43J342J831J763J319
56553A00544J217J805K339J869O65K9N87J478J646J277J288J812K047J554Q94
56538A21051P22R19J034J040J192J457J568J491J423J488J690J965K031J512N31
56523A41114j94k06J45M17Q42J693K413K241J498J264J788K253K148J945K141
$$ plain form
56508 161502 164048 166997 170592 175147 180433 185791 190900 195965 201160 206384 211621 217107 223028 229375
56494 229375 236112 243137 250056 256382 262013 267203 272037 276224 279454 281670 282979 283574 283721 283568 282955
56479 282955 281608 279411 276357 272464 268033 263652 259483 254792 248773 241701 234718 228576 223182 218247
56465 218247 213638 209032 203966 198483 193121 188117 183231 178559 174800 172265 170205 167629 164441 161343
56451 161343 158884 157041 155458 153760 151748 149591 147666 146015 144216 141987 139714 138111 137536 137823 138564
56436 138564 139402 140214 141159 142400 143733 144722 145209 145380 145371 145284 145651 147229 150013 152909 154767 155400 155377 155292
56418 155292 155599 156644 158281 159771 160626 161287 162486 164160 165571 166337 166797 167406 168289 169410 170736 172202
56402 172202 173891 176273 179820 184347 189116 193623 197866 201748 204741 206496 207473 208541 210054 211583
$$ packed form
56508A61502K546K949L595M555N286N358N109N065N195N224N237N486N921O347
56494B29375O737P025O919O326N631N190M834M187L230K216J309N95J47j53o13
56479B82955j347k197l054l893m431m381m169m691o019p072o983o142n394m935
56465B18247m609m606n066n483n362n004m886m672l759k535k060k576l188l098
56451A61343k459j843j583j698k012k157j925j651j799k229k273j603n75K87P41
56436A38564Q38Q12R45J241J333R89M87J71rq7L67J578K784K896J858O33k3q5
56418A55292L07J045J637J490Q55O61J199J674J411P66M60O09Q83J121J326J466
56402A72202J689K382L547M527M769M507M243L882K993J755R77J068J513J529
$$ plain form
56388 211583 212559 212986 213448 214519 216212 217898 218718 218116 216119 213251 210276 207887 206406 205571 204637 202917
56372 202917 200437 198013 196499 195913 195462 194425 192774 190914 189149 187681 186776 186470 186281 185678 184823 184367
56356 184367 184463 184434 183584 181968 180182 178651 177316 175846 173960 171718 169594 168158 167590 167573 167585 167144 165962
56339 165962 164229 162669 161889 161682 161325 160558 159866 159758 160251 161103 162062 162748 162885 162875 163625 165504 167911 170154
56321 170154 172185 174106 175491 175900 175742 175985 177024 178369 179482 180505 181974 184002 185960 187075 187363
56306 187363 187756 189059 190989 192697 194088 195877 198310 200636 202295 203794 205812 208006 209555 210490 211610
56291 211610 213175 214520 215111 215358 216080 217580 219515 221380 222879 223916 224506 224843 225414 226784 229021 231470
56275 231470 233447 235086 237097 239687 242314 244642 247104 250219 253911 257906 262251 266937 271491 275569
$$ packed form
56388B11583R76M27M62J071J693J686Q20o02j997k868k975k389j481q35r34j720
56372B02917k480k424j514n86m51j037j651j860j765j468r05l06j89o03q55m56
56356A84367R6k9q50j616j786j531j335j470j886k242k124j436n68j7J2m41j182
56339A65962j733j560p80k07l57p67o92j08M93Q52R59O86J37j0P50J879K407K243
56321A70154K031J921J385M09j58K43J039J345J113J023J469K028J958J115K88
56306A87363L93J303J930J708J391J789K433K326J659J499K018K194J549R35J120
56291B11610J565J345N91K47P22J500J935J865J499J037N90L37N71J370K237K449
56275B31470J977J639K011K590K627K328K462L115L692L995M345M686M554M078
$$ plain form
56261 275569 279641 284462 290049 295733 301070 306187 311443 317215 323855 331309 338870 345768 351941 357874
56247 357874 363881 370047 376674 384102 392008 399412 405586 410699 415491 420494 425548 429890 432864 434785
56233 434785 436893 440185 444526 449229 454134 459597 465629 471753 477800 484369 492322 502097 513566 526338
56219 526338 540193 555371 572315 590981 610668 630850 651933 674830 699991 727279 756659
56208 756659 788599 823817 862970 906536 954663 1007121 1063632 1124288 1189671 1260707 1338349
56197 1338349 1422962 1513955 1610505 1712740 1821537 1936873 2057155 2180615 2306493 2433979
56187 2433979 2560669 2683073 2798365 2904723 3000313 3082977 3150948 3203169 3239067 3258771
56177 3258771 3263362 3254216 3232189 3198207 3154308 3103085 3046095 2983718 2916482 2845521 2771624 2694825
$$ packed form
56261B75569M072M821N587N684N337N117N256N772O640P454P561O898O173N933
56247C57874O007O166O627P428P906P404O174N113M792N003N054M342K974J921
56233D34785K108L292M341M703M905N463O032O124O047O569P953R775J1469J2772
56219E26338J3855J5178J6944J8666J9687K0182K1083K2897K5161K7288K9380
56208G56659L1940L5218L9153M3566M8127N2458N6511O0656O5383P1036P7642
56197A338349Q4613R0993R6550J02235J08797J15336J20282J23460J25878J27486
56187B433979J26690J22404J15292J06358R5590Q2664O7971N2221L5898J9704
56177C258771M591r146k2027l3982m3899n1223n6990o2377o7236p0961p3897p6799
$$ plain form
56165 2694825 2615240 2533565 2450491 2366380 2281692 2196988 2112288 2027130 1941553 1856380 1772311
56154 1772311 1689425 1607882 1528512 1452378 1380196 1312345 1248891 1189405 1133298 1080471 1031142
56143 1031142 984982 941210 899726 861416 826937 795845 767287 740988 717115 695658 676377
56132 676377 658999 643088 627981 613247 599023 585768 573896 563673 555164 548201 542660 538682
56120 538682 536255 534770 533510 532471 532138 532615 533708 535712 539196 543898 548822 553754 559767 567695 576894
56105 576894 586147 595331 605472 617379 630706 644365 657572 670454 683568 696789 709023 719436
56093 719436 728624 737947 747922 758031 767948 778101 788982 800741 813647 828185 844572 862909
56081 862909 883936 908906 938599 973235 1013451 1060450 1114896 1176331 1243719 1315587 1389428
$$ packed form
56165B694825p9585q1675q3074q4111q4688q4704q4700q5158q5577q5173q4069
56154A772311q2886q1543p9370p6134p2182o7851o3454n9486n6107n2827m9329
56143A031142m6160m3772m1484l8310l4479l1092k8558k6299k3873k1457j9281
56132F76377j7378j5911j5107j4734j4224j3255j1872j0223q509o963n541l978
56120E38682k427j485j260j039l33M77J093K004L484M702M924M932O013P928R199
56105E76894R253R184J0141J1907J3327J3659J3207J2882J3114J3221J2234J0413
56093G19436R188R323R975J0109R917J0153J0881J1759J2906J4538J6387J8337
56081H62909K1027K4970K9693L4636M0216M6999N4446O1435O7388P1868P3841
$$ plain form
56070 1389428 1462052 1531140 1595889 1656066 1711439 1762518 1810685 1856796 1900142 1939128 1972200
56059 1972200 1997776 2014348 2021470 2020104 2011502 1996328 1975052 1948211 1915639 1876311 1829685 1776569
56047 1776569 1718173 1655176 1588526 1520401 1453408 1389254 1328802 1272911 1222372 1177329 1137411
56036 1137411 1102204 1071188 1043642 1019142 997865 980016 965257 952942 942448 933039 924028 915384
56024 915384 907638 900902 894556 888170 882019 876391 871098 866049 861625 858073 855227 853147 852318 852928 854680
56009 854680 857579 862058 868016 874635 881490 888911 896933 904963 912978 921966 932559 944200 956242
55996 956242 968870 982300 996061 1009735 1023485 1037316 1050825 1064278 1078882 1095313 1112967
55985 1112967 1131293 1150753 1171796 1194006 1217017 1241181 1266598 1292627 1319129 1347023 1376804
$$ packed form
56070A389428P2624O9088O4749O0177N5373N1079M8167M6111M3346L8986L3072
56059A972200K5576J6572P122j366q602j5174k1276k6841l2572l9328m6626n3116
56047A776569n8396o2997o6650o8125o6993o4154o0452n5891n0539m5043l9918
56036A137411l5207l1016k7546k4500k1277j7849j4759j2315j0494r409r011q644
56024I15384p746o736o346o386o151n628n293n049m424l552k846k080q29O10J752
56009H54680K899M479N958O619O855P421Q022Q030Q015Q988J0593J1641J2042
55996I56242J2628J3430J3761J3674J3750J3831J3509J3453J4604J6431J7654
55985A112967J8326J9460K1043K2210K3011K4164K5417K6029K6502K7894K9781
$$ plain form
55974 1376804 1407765 1439458 1472671 1508016 1544776 1582183 1620723 1661303 1704265 1750062 1799572
55963 1799572 1852801 1908534 1966162 2026555 2090425 2157445 2227885 2303275 2384201 2469148 2556831
55952 2556831 2648044 2743900 2844041 2948059 3056898 3171309 3290637 3414684 3545071 3683145
55942 3683145 3828393 3980573 4141435 4312548 4493316 4683050 4883041 5094810 5318550
55933 5318550 5555344 5808553 6080647 6370998 6679260 7008616 7362978 7743234 8149004
55924 8149004 8581719 9043232 9533928 10055356 10612211 11208658 11845498 12524299 13251214
55915 13251214 14032985 14872437 15772244 16739906 17784436 18911552 20127580 21445313 22881152
55906 22881152 24450227 26170725 28070739 30186726 32560941 35247816 38318162 41849174
$$ packed form
55974A376804L0961L1693L3213L5345L6760L7407L8540M0580M2962M5797M9510
55963A799572N3229N5733N7628O0393O3870O7020P0440P5390Q0926Q4947Q7683
55952B556831R1213R5856J00141J04018J08839J14411J19328J24047J30387J38074
55942C683145J45248J52180J60862J71113J80768J89734J99991K11769K23740
55933E318550K36794K53209K72094K90351L08262L29356L54362L80256M05770
55924H149004M32715M61513M90696N21428N56855N96447O36840O78801P26915
55915A3251214P81771Q39452Q99807R67662J044530J127116J216028J317733J435839
55906B2881152J569075J720498J900014K115987K374215K686875L070346L531012
$$ plain form
55898 41849174 45915335 50598130 55999979 62241080 69453041 77790782 87442761 98608947
55890 98608947 111460203 126092357 142418180 159955459 177641682 193912744 207099409
55883 207099409 215893211 219595451 218122822 211933979 201948662 189380877 175463611 161198784
55875 161198784 147264407 134059540 121784458 110506192 100215630 90869603 82402083
55868 82402083 74722534 67732347 61353234 55538051 50260142 45501407 41246032 37471768
55860 37471768 34141840 31208466 28623446 26342058 24320829 22519769 20907566 19460249
55852 19460249 18155467 16972246 15894832 14911656 14010803 13180493 12413148 11704646 11049726
55843 11049726 10441640 9875727 9349549 8859717 8401920 7973831 7574727 7202357 6853165
$$ packed form
55898D1849174M066161M682795N401849O241101P211961Q337741R651979J1166186
55890I8608947J2851256J4632154J6325823J7537279J7686223J6271062J3186665
55883B07099409Q793802L702240j472629o188843r985317j2567785j3917266j4264827
55875A61198784j3934377j3204867j2275082j1278266j0290562r346027q467520
55868H2402083p679549o990187o379113n815183n277909m758735m255375l774264
55860C7471768l329928k933374k585020k281388k021229j801060j612203j447317
55852A9460249j304782j183221j077414r83176r00853q30310p67345p08502o54920
55843A1049726o08086n65913n26178m89832m57797m28089l99104l72370l49192
$$ plain form
55834 6853165 6525497 6219599 5934416 5667040 5415394 5178950 4956717 4746772 4547926
55825 4547926 4359768 4181081 4010214 3846984 3692258 3545663 3405468 3270720 3141749
55816 3141749 3018618 2900689 2787682 2679561 2575399 2473757 2374220 2277479 2184240 2095286
55806 2095286 2012093 1935861 1866092 1801359 1741209 1686188 1636433 1591413 1550507 1512535 1475284
55795 1475284 1436938 1397674 1358758 1320672 1283294 1247151 1212882 1180025 1147873 1117091 1088942
55784 1088942 1063326 1039123 1016153 995172 976155 958175 940893 924775 909858 895666 882305
55773 882305 870416 860088 850897 842769 835703 828944 821649 814062 806730 798966 789501 778372 766677
55760 766677 754691 741821 728264 715006 702063 688391 673854 659767 646970 634746 622264
$$ packed form
55834F853165l27668l05898k85183k67376k51646k36444k22233k09945j98846
55825D547926j88158j78687j70867j63230j54726j46595j40195j34748j28971
55816C141749j23131j17929j13007j08121j04162j01642r9537r6741r3239q8954
55806B095286q3193p6232o9769o4733o0150n5021m9755m5020m0906l7972l7251
55795A475284l8346l9264l8916l8086l7378l6143l4269l2857l2152l0782k8149
55784A088942k5616k4203k2970k0981j9017j7980j7282j6118j4917j4192j3361
55773H82305j1889j0328r191q128p066o759p295p587p332p764r465j1129j1695
55760G66677j1986j2870j3557j3258j2943j3672j4537j4087j2797j2224j2482
$$ plain form
55749 622264 609963 598871 589401 581337 574356 568141 562512 557586 553360 549288 544985 541057 538327 536421
55735 536421 534192 531411 528868 526819 524569 521751 518818 515837 511868 506082 498825 491195 484129 478076
55721 478076 472866 467743 462162 456680 452400 449497 446916 443507 438697 432166 423799 414215 404590 395673
55707 395673 387463 379802 372654 365826 359130 352768 346939 341249 335290 329511 324566 319999 314678 308473
55693 308473 302297 296451 290190 283194 276218 269816 263535 256939 250524 244919 239925 234997 230133 225760
55679 225760 222106 219061 216266 213249 210007 207485 206707 207280 207552 206487 204625 202908 201475 200098 198961
55664 198961 198317 197962 197649 197544 197713 197564 196383 194251 192033 190574 190075 189988 189390 187818 185868 184687 184813
55647 184813 185857 187277 188899 190673 192449 194100 195420 195907 195267 194135 193590 193881 194319 194518 194911 195804
$$ packed form
55749F22264j2301j1092r470q064o981o215n629m926m226m072m303l928k730j906
55735E36421k229k781k543k049k250k818k933k981l969n786p257p630p066o053
55721D78076n210n123n581n482m280k903k581l409m810o531q367r584r625q917
55707C95673q210p661p148o828o696o362n829n690n959n779m945m567n321o205
55693C08473o176n846o261o996o976o402o281o596o415n605m994m928m864m373
55679B25760l654l045k795l017l242k522p78N73K72j065j862j717j433j377j137
55664A98961o44l55l13j05J69j49j181k132k218j459m99q7n98j572j950j181J26
55647A84813J044J420J622J774J776J651J320M87o40j132n45K91M38J99L93Q93
$$ plain form
55631 195804 196754 197312 197696 198287 199015 199671 200307 201040 201958 203465 206091 209621 213049 215786 218361 221458
55615 221458 224809 227470 228767 228556 227041 224774 222459 220349 218164 215832 213801 212337 211103 209905
55601 209905 209295 209836 211160 212299 212717 212484 211768 210705 209709 209373 209965 211254 212808 214321 215690 216828
55585 216828 217343 216552 214096 210435 206359 202160 197795 193762 190932 189323 187750 185134 181586 177866 174296
55570 174296 170666 166759 162570 158290 154360 151191 148558 145684 142185 138580 135616 133543 132225 131430
55556 131430 130663 129211 126797 123906 121233 119158 117874 117422 117348 116931 116084 115458 115344 115153 114461 113829 113999
55539 113999 114860 115841 116719 117332 117092 115664 113764 112422 111663 110729 109388 108148 107249 106308 105126 104119
55523 104119 103655 103437 102827 101506 99681 97830 96330 95274 94636 94598 95370 96583 97297 96963 96051 95375 95194
$$ packed form
55631A95804R50N58L84N91P28O56O36P33R18J507K626L530L428K737K575L097
55615B21458L351K661J297k11j515k267k315k110k185k332k031j464j234j198
55601B09905o10N41J324J139M18k33p16j063r96l36N92J289J554J513J369J138
55585B16828N15p91k456l661m076m199m365m033k830j609j573k616l548l720l570
55570A74296l630l907m189m280l930l169k633k874l499l605k964k073j318p95
55556A31430p67j452k414k891k673k075j284m52p4m17q47o26j14j91o92o32J70
55539A13999Q61R81Q78O13k40j428j900j342p59r34j341j240q99r41j182j007
55523A04119m64k18o10j321j825j851j500j056o38l8P72J213P14l34r12o76j81
$$ plain form
55506 95194 95351 95905 97024 98486 99881 101124 102279 103029 102966 102297 101678 101274 100571 99234 97732 96887 97071
55489 97071 97972 98946 99539 99829 100200 100698 100740 99725 97806 95778 94278 93347 92748 92443 92645 93441 94389 94664
55471 94664 93895 92844 92841 94402 96793 99024 100747 101953 102444 102125 101406 100762 100155 99393 98816 99061 100283
55454 100283 102018 103678 104845 105300 105144 104665 103791 102023 99240 96166 93516 91134 88571 86162 84752
55439 84752 84526 84801 84916 84682 84027 82897 81592 80606 79987 79251 78004 76341 74657 73339 72468 71518 69684
55422 69684 66968 64556 63456 63136 62304 60773 59577 59283 59233 58709 57944 57525 57484 57384 56865 55814 54416
55405 54416 53190 52544 52164 51346 50033 48890 48296 47944 47673 47876 48713 49602 50000 50006 49765 48929 47444 46279
55387 46279 46503 47910 49299 49933 50025 49918 49586 49010 48402 47910 47537 47486 48039 48981 49545 49272 48549 48057 47937
$$ packed form
55506I5194J57N54J119J462J395J243J155P50o3o69o19m04p03j337j502q45J84
55489I7071R01R74N93K90L71M98M2j015j919k028j500r31n99l05K02P96R48K75
55471I4664p69j051lJ561K391K231J723J206M91l19p19o44o07p62n77K45J222
55454A00283J735J660J167M55j56m79q74j768k783l074k650k382k563k409j410
55439H4752k26K75J15k34o55j130j305r86o19p36j247j663j684j318q71r50j834
55422F9684k716k412j100l20q32j531j196k94n0n24p65m19m1j00n19j051j398
55405E4416j226o46l80q18j313j143n94l52k71K03Q37Q89L98Ok41q36j485j165
55387D6279K24J407J389O34R2j07l32n76o08m92l73n1N53R42N64k73p23m92j20
$$ plain form
55368 47937 47828 47510 47161 47007 47019 47051 47060 47025 46787 46154 45208 44368 44067 44380 44955 45294 45098 44505 44035 44192 45077
55347 45077 46374 47694 48758 49323 49234 48738 48446 48722 49231 49331 48806 47984 47310 47062 47371 48153 49034 49627
55329 49627 49918 50152 50355 50264 49733 48943 48150 47471 46994 46896 47329 48246 49382 50387 51077 51585 52106 52393 51831
55310 51831 50241 48321 46895 46002 45137 44174 43457 43088 42736 42224 41760 41497 41323 41250 41491 41997 42341 42258 41907
55291 41907 41457 40826 39988 39151 38415 37673 37040 36947 37504 38237 38739 39189 39849 40482 40746 40853 41294 42079 42744
55272 42744 43010 43012 42903 42677 42428 42454 42921 43607 44067 43950 43191 42000 40627 39159 37616 36261 35539 35631 36237
55253 36237 36950 37566 37923 37742 36915 35733 34653 34055 34338 35760 37804 39130 38801 37377 36277 36179 36657
55236 36657 37191 37764 38334 38528 38268 38129 38593 39381 39966 40397 41011 41614 41636 41048 40546 40682 41359 42357 43741
$$ packed form
55368D7937j09l18l49j54J2L2Rl5k38o33r46q40l01L13N75L39j96n93m70J57Q85
55347D5077J297J320J064N65q9m96k92K76N09J00n25q22o74k48L09P82Q81N93
55329D9627K91K34K03r1n31p90p93o79m77r8M33R17J136J005O90N08N21K87n62
55310E1831j590j920j426q93q65r63p17l69l52n12m64k63j74p3K41N06L44q3l51
55291D1907m50o31q38q37p36p42o33r3N57P33N02M50O60O33K64J07M41P85O65
55272D2744K66Kj09k26k49K6M67O86M60j17p59j191j373j468j543j355p22R2O06
55253C6237P13O16L57j81q27j182j080n98K83J422K044J326l29j424j100r8M78
55236C6657N34N73N70J94k60j39M64P88N85M31O14O03K2n88n02J36O77R98J384
$$ plain form
55217 43741 45346 46332 45903 44336 42737 41732 40990 40159 39671 40184 41540 42842 43452 43515 43493 43647 44006 44475
55199 44475 44809 44739 44332 43991 43898 43675 42847 41489 40176 39364 39143 39502 40490 41933 43218 43708 43370 42804
55181 42804 42556 42549 42323 41686 40913 40293 39806 39374 39198 39541 40309 41162 42017 43113 44482 45636 45986 45430 44407
55162 44407 43495 43109 43455 44511 45952 47225 47869 47835 47526 47453 47817 48426 49033 49646 50382 51084 51262 50510 48913
55143 48913 47038 45515 44646 44358 44456 44839 45442 46094 46643 47201 48002 48963 49678 50002 50336 51076 52086 53030
55125 53030 53961 55055 55912 55742 54362 52577 51380 51059 51248 51434 51244 50553 49610 48882 48568 48404 48076 47548
55107 47548 46827 45695 44021 42212 40967 40519 40339 39693 38415 37094 36521 36946 37857 38528 38694 38646 38725 38887
55089 38887 38780 38157 37254 36809 37516 39270 41117 42246 42847 43590 44400 44399 43229 41831 41506 42569 44262
$$ packed form
55217D3741J605R86m29j567j599j005p42q31m88N13J356J302O10O3k2J54L59M69
55199D4475L34p0m07l41r3k23q28j358j313q12k21L59R88J443J285M90l38n66
55181D2804k48pk26o37p73o20m87m32j76L43P68Q53Q55J096J369J154L50n56j023
55162D4407r12l86L46J056J441J273O44l4l09p3L64O09O07O13P36P02J78p52j597
55143D8913j875j523q69k88R8L83O03O52N49N58Q01R61P15L24L34P40J010R44
55125E3030R31J094Q57j70j380j785j197l21J89J86j90o91r43p28l14j64l28n28
55107D7548p21j132j674j809j245m48j80o46j278j321n73M25R11O71J66m8P9J62
55089C8887j07o23r03m45P07J754J847J129O01P43Q10jj170j398l25J063J693
$$ plain form
55072 44262 45685 46388 46311 45692 45022 44716 44712 44570 44029 43325 43036 43687 45382 47633 49575 50604 50801 50703 50726
55053 50726 50856 50773 50123 48865 47550 47134 48222 50446 52789 54496 55534 56212 56604 56481 55699 54571 53796
55036 53796 53930 54832 55717 55917 55613 55668 56765 58855 61439 64084 66464 68105 68524 67738 66333 64887 63529
55019 63529 62319 61668 61916 62623 63000 63143 64120 66421 68923 70019 69423 68231 67453 67206 67247 67456 67686 67779
55001 67779 67996 68883 70438 71846 72337 71917 71017 69841 68404 66886 65560 64501 63587 62696 61780 60935 60422
54984 60422 60337 60300 59858 59243 59201 59843 60259 59605 58195 57037 56628 56641 56623 56520 56580 57011 57767 58508 58870 58795 58480
54963 58480 58029 57530 57431 58284 59901 61310 61861 61960 62362 63170 63936 64342 64310 63830 63121 62752 63117 64038 65167
54944 65167 66446 67806 68873 69499 70165 71214 72102 72121 71617 71619 72319 72733 72005 70429 68949 68185 68097 68255
$$ packed form
55072D4262J423P03p7o19o70l06mj42n41p04k89O51J695K251J942J029J97r8K3
55053E0726J30q3o50j258j315m16J088K224K343J707J038O78L92j23p82j128p75
55036E3796J34R02Q85K00l04N5J097K090K584K645K380J641M19p86j405j446j358
55019F3529j210o51K48P07L77J43R77K301K502J096n96j192p78k47M1K09K30R3
55001F7779K17Q87J555J408M91m20r00j176j437j518j326j059r14q91r16q45n13
54984F0422q5l7m42o15m2O42M16o54j410j158m09J3j8j03O0M31P56P41L62p5l15
54963E8480m51m99r9Q53J617J409N51R9M02Q08P66M06l2m80p09l69L65R21J129
54944F5167J279J360J067O26O66J049Q88J9n04KP00M14p28j576j480p64q8J58
$$ plain form
54926 68255 68280 68269 68786 70127 71781 72941 73398 73456 73189 72412 71314 70465 70078 69814 69440 69161 69181 69440 69924
54907 69924 70783 71939 72997 73722 74328 75151 76326 77791 79276 80323 80691 80805 81423 82885 85076 88028
54891 88028 91945 96546 101057 105128 109269 114101 119597 125326 131101 137128 143738 151122 159050 166784
54877 166784 173545 179085 183497 186605 188053 187925 186615 184069 179898 174361 168395 162356 155608 147871
54863 147871 140184 133787 128612 123697 118665 113969 109922 106393 103358 100986 99042 96899 94418 92326
54849 92326 91498 92167 94026 96780 100309 104423 108740 112918 116987 121381 126493 132243 138280 144589 151540
54834 151540 159121 166422 172183 175725 177170 176963 175467 172822 168879 163387 156455 148792 141251 134245
54820 134245 127784 121836 116390 111270 106271 101471 97183 93598 90624 88026 85581 83190 81015 79373
$$ packed form
54926F8255K5j1N17J341J654J160M57N8k67p77j098q49l87k64l74k79K0K59M84
54907F9924Q59J156J058P25O06Q23J175J465J485J047L68J14O18J462K191K952
54891H8028L917M601M511M071M141M832N496N729N775O027O610P384P928P734
54877A66784O761N540M412L108J448j28j310k546m171n537n966o039o748p737
54863A47871p687o397n175m915n032m696m047l529l035k372j944k143k481k092
54849I2326q28O69J859K754L529M114M317M178M069M394N112N750O037O309O951
54834A51540P581P301N761L542J445k07j496k645l943n492o932p663p541p006
54820A34245o461n948n446n120m999m800m288l585k974k598k445k391k175j642
$$ plain form
54806 79373 78313 77428 76289 74927 73654 72547 71409 70204 69223 68721 68608 68508 68106 67451 66996 67198 67922
54789 67922 68406 68023 67033 66326 66445 66993 67050 66073 64375 62790 61886 61584 61532 61660 62009 62197 61627 60372 59307
54770 59307 59029 59146 59024 58802 59058 59798 60441 60716 60948 61389 61849 62082 62085 61833 61148 60047 58973 58505 59002
54751 59002 60457 62411 64104 65104 65879 67292 69461 71626 73291 74963 77384 80510 83752 86885 90099
54736 90099 93312 96113 98475 101030 104351 108309 112433 116719 121799 128337 136373 145253 154071 162230
54722 162230 169652 176412 182227 186435 188603 188980 188136 186266 183168 178911 174168 169674 165580 161572 157462
54707 157462 153331 149200 144965 140786 137241 134855 133543 132673 131618 130236 128947 128459 129318 131609 135005
54692 135005 139116 143724 148736 154071 159669 165592 172098 179609 188486 198734 209985 221800 233782
$$ packed form
54806G9373j060q85j139j362j273j107j138j205r81n02j13j00m02o55m55K02P24
54789F7922M84l83r90p07J19N48N7r77j698j585r04l02n2J28L49J88n70j255j065
54770E9307k78J17j22k22K56P40O43K75K32M41M60K33Lk52o85j101j074m68M97
54751E9002J455J954J693J000P75J413K169K165J665J672K421L126L242L133L214
54736I0099L213K801K362K555L321L958M124M286N080O538Q036Q880Q818Q159
54722A62230P422O760N815M208K168L77q44j870l098m257m743m494m094m008m110
54707A57462m131m131m235m179l545k386j312q70j055j382j289m88Q59K291L396
54692A35005M111M608N012N335N598N923O506P511Q877J0248J1251J1815J1982
$$ plain form
54679 233782 245279 255332 263308 269341 273670 275727 274535 270026 263322 255535 246909 237344 227069
54666 227069 216380 205350 194339 184242 175586 167764 159834 151768 144216 137359 130844 124755 119728
54653 119728 115995 113096 110726 109087 108076 106789 104402 101135 97920 95402 93646 92546 92112 92385 93267
54638 93267 94345 94866 94244 92798 91685 91757 92715 93592 93805 93432 92746 91937 91233 90871 90907 91265 91965 93055
54620 93055 94363 95599 96680 97774 98956 100061 100905 101541 102258 103418 105236 107570 109942 111934 113569
54605 113569 115180 116942 118751 120575 122677 125348 128521 131795 134765 137344 139818 142614 145878 149195
54591 149195 151858 153508 154491 155519 157042 159035 161259 163539 165827 168208 170909 174206 178197 182790
54577 182790 187975 194034 201292 209680 218680 227817 237192 247415 258868 270955 282168 291090 297370
$$ packed form
54679B33782J1497J0053P976O033M329K057j192m509o704p787q626r565j0275
54666B27069j0689j1030j1011j0097q656p822p930q066p552o857o515o089n027
54653A19728l733k899k370j639j011j287k387l267l215k518j756j100m34K73Q82
54638I3267J078N21o22j446j113P2R58Q77K13l73o86q09p04l62L6L58P00J090
54620I3055J308J236J081J094J182J105Q44O36P17J160J818K334K372J992J635
54605A13569J611J762J809J824K102K671L173L274K970K579K474K796L264L317
54591A49195K663J650R83J028J523J993K224K280K288K381K701L297L991M593
54577A82790N185O059P258Q388R000R137R375J0223J1453J2087J1213Q922O280
$$ plain form
54564 297370 301518 303741 303335 299489 292421 283262 272988 261993 250757 240225 231083 223025 215262
54551 215262 207603 200574 194570 189364 184550 180086 176164 172821 169822 166795 163385 159465 155374 151759
54537 151759 149015 146923 144979 142958 141029 139365 137851 136157 134023 131406 128469 125442 122422 119305
54523 119305 115984 112551 109201 105919 102514 99051 96043 93948 92568 91259 89699 88068 86469 84658
54509 84658 82632 81017 80379 80405 80306 79862 79466 79162 78352 76649 74424 72242 70278 68677 67993 68669 70377
54492 70377 72338 74142 75821 77337 78549 79590 80748 81913 82596 82607 82407 82694 83808 85535 87225 88201
54476 88201 88366 88408 89124 90612 92433 94442 97005 100414 104544 109158 114066 118915 123341 127600 132524
54461 132524 138532 144982 150812 155456 158834 160863 161545 161354 160945 160429 159310 157144 153920 149825 145074
$$ packed form
54564B97370M148K223m06l846p068r159j0274j0995j1236j0532r142q058p763
54551B15262p659p029o004n206m814m464l922l343k999l027l410l920m091l615
54537A51759k744k092j944k021j929j664j514j694k134k617k937l027l020l117
54523A19305l321l433l350l282l405l463l008k095j380j309j560j631j599j811
54509H4658k026j615o38K6r9m44l96l04q10j703k225k182j964j601o84O76J708
54492G0377J961J804J679J516J212J041J158J165O83J1k00K87J114J727J690R76
54476H8201J65M2P16J488J821K009K563L409M130M614M908M849M426M259M924
54461A32524O008O450N830M644L378K029O82j91m09n16j119k166l224m095m751
$$ plain form
54446 145074 140078 135324 130824 126031 120660 115368 111136 108005 104971 101303 97516 94664 92960 91643
54432 91643 90096 88488 87171 86073 85082 84569 84897 85648 85985 85798 85915 86998 88680 90087 90858 91306 91770
54415 91770 92211 92477 92754 93557 95260 97706 100397 103053 105787 108628 111111 112692 113394 113728 113982 113970 113536
54398 113536 112924 112547 112625 113130 113855 114474 114743 114720 114551 114060 112931 111269 109610 108206 106711 104799 102767
54381 102767 101253 100543 100388 100283 99796 98808 97637 96689 95908 94804 93182 91464 90140 89252 88672 88507 88883
54364 88883 89647 90619 91825 93112 93860 93604 92728 92065 91944 92125 92500 93326 94685 96239 97600 98630 99385
54347 99385 100084 101144 102813 104775 106416 107551 108581 109924 111671 113740 116011 118307 120619 123326 126723
54332 126723 130357 133318 135292 136806 138345 139796 140895 141567 141526 140262 137922 135561 133859 132123 129360
$$ packed form
54446A45074m996m754m500m793n371n292m232l131l034l668l787k852j704j317
54432I1643j547j608j317j098r91n13L28P51L37j87J17J083J682J407P71M48M64
54415I1770M41K66K77Q03J703K446K691K656K734K841K483J581P02L34K54j2m34
54398A13536o12l77P8N05P25O19K69k3j69m91j129j662j659j404j495j912k032
54381A02767j514p10j55j05m87r88j171r48p81j104j622j718j324q88n80j65L76
54364H8883P64R72J206J287P48k56q76o63j21J81L75Q26J359J554J361J030P55
54347I9385O99J060J669J962J641J135J030J343J747K069K271K296K312K707L397
54332A26723L634K961J974J514J539J451J099O72m1j264k340k361j702j736k763
$$ plain form
54317 129360 125931 123169 121426 119554 116528 112732 109218 106439 104242 102610 101659 101124 100470 99524 98528
54302 98528 97553 96316 94707 93115 92002 91351 90817 90299 90088 90414 91072 91607 91774 91681 91495 91276 91126 91307
54284 91307 91973 92878 93634 94304 95442 97415 99879 102167 104090 106060 108428 110901 112752 113529 113480 113265
54268 113265 113273 113226 112509 110871 108665 106393 104242 102229 100546 99372 98372 96831 94451 91750 89455 87665
54252 87665 85866 83654 81188 78862 76751 74568 72174 69990 68711 68534 68836 68796 68225 67516 66930 66290
54236 66290 65416 64409 63392 62384 61670 61808 62794 63589 63097 61509 60063 59480 59233 58512 57374 56593 56740
54219 56740 57729 59044 60134 60726 60991 61271 61572 61561 61231 61230 62176 63842 65423 66499 67308 68120 68814 69250
54201 69250 69661 70362 71284 72153 72977 74049 75424 76730 77581 77915 77823 77311 76492 75841 75884 76650 77688 78623
$$ packed form
54317A29360l429k762j743j872l026l796l514k779k197j632r51n35o54r46r96
54302I8528r75j237j609j592j113o51n34n18k11L26O58N35J67r3j86k19j50J81
54284I1307O66R05P56O70J138J973K464K288J923J970K368K473J851P77m9k15
54268A13265Qm7p17j638k206k272k151k013j683j174j000j541k380k701k295j790
54252H7665j799k212k466k326k111k183k394k184j279j77L02m0n71p09n86o40
54236F6290q74j007j017j008p14J38R86P95m92j588j446n83k47p21j138p81J47
54219E6740R89J315J090N92K65K80L01j1l30jR46J666J581J076Q09Q12O94M36
54201F9250M11P01R22Q69Q24J072J375J306Q51L34r2n12q19o51M3P66J038R35
$$ plain form
54183 78623 79365 79745 79424 78438 77506 77354 77814 78003 77379 76294 75442 75082 74957 74771 74534 74475 74760 75302 75828
54164 75828 76191 76542 77147 78058 79046 79886 80602 81395 82327 83153 83556 83628 83955 85016 86576 87964 88868 89411
54146 89411 89493 88676 87008 85312 84230 83464 82501 81554 81078 80830 80255 79556 79404 79722 79750 79334 79088 79063 78385
54127 78385 76675 74839 73786 73231 72538 71974 72136 72629 72367 71050 69478 68484 68279 68807 69903 70994 71348
54110 71348 70890 70313 70128 70023 69437 68477 67957 68602 70341 72366 73820 74452 74570 74463 74127 73573 73035 72632
54092 72632 72103 71166 69915 68641 67442 66235 64900 63228 61081 58900 57662 57925 59134 60266 60840
54077 60840 60958 60701 60044 59122 58111 57076 56277 56243 56907 57199 56269 54788 54100 54330 54412 53936 53706 54206 54699
54058 54699 54455 53893 53696 53508 52448 50548 48880 48346 48894 49789 50221 49776 48728 47829 47496 47393 47046 46644
$$ packed form
54183G8623P42L80l21r86r32j52M60J89o24j085q52l60j25j86k37n9K85N42N26
54164G5828L63L51O05R11R88Q40P16P93R32Q26M03P2L27J061J560J388R04N43
54146H9411Q2q17j668j696j082p66r63r47m76k48n75o99j52L18K8m16k46k5o78
54127G8385j710j836j053n55o93n64J62M93k62j317j572r94k05N28J096J091L54
54110G1348m58n77j85j05n86r60n20O45J739K025J454O32J18j07l36n54n38m03
54092G2632n29r37j251j274j199j207j335j672k147k181j238K63J209J132N74
54077F0840J18k57o57r22j011j035p99l4O64K92r30j481o88K30Q2m76k30N00M93
54058E4699k44n62j97j88j060j900j668n34N48Q95M32m45j048q99l33j03l47m02
$$ plain form
54040 46644 46857 48064 50055 52358 54498 56084 57025 57594 58051 58251 57912 57088 56108 55155 54263 53633 53555 53983
54022 53983 54552 55087 55782 56719 57493 57616 57160 56728 56700 56723 56136 54823 53452 52823 53157 54136 55460 57077
54004 57077 58910 60657 61970 62744 63191 63672 64377 65084 65389 65308 65448 66319 67649 68741 69374 69935 70743 71723
53986 71723 72803 74137 75769 77510 79316 81416 83829 86096 87744 88753 89431 90135 91315 93461 96711
53971 96711 100686 104902 109083 113026 116571 119969 123831 128406 133157 137444 141285 145132 149157 153133
53957 153133 156808 160045 162771 165143 167550 170092 172286 173622 174240 174648 174930 174664 173554 171800 169908
53942 169908 168355 167282 166185 164209 161112 157694 154800 152124 148651 144147 139522 135670 132597 129881
53928 129881 127355 124991 122605 120137 117943 116491 115894 115952 116424 117025 117374 117182 116482 115512 114513 113719 113373
$$ packed form
54040D6644K13J207J991K303K140J586R41N69M57K00l39q24r80r53q92o30p8M28
54022E3983N69N35O95R37P74J23m56m32k8K3n87j313j371o29L34R79J324J617
54004E7077J833J747J313P74M47M81P05P07L05q1J40Q71J330J092O33N61Q08R80
53986G1723J080J334J632J741J806K100K413K267J648J009O78P04J180K146L250
53971I6711L975M216M181L943L545L398L862M575M751M287L841L847M025L976
53957A53133L675L237K726K372K407K542K194J336O18M08K82k66j110j754j892
53942A69908j553j073j097j976l097l418k894k676l473m504m625l852l073k716
53928A29881k526k364k386k468k194j452n97N8M72O01L49j92p00r70r99p94l46
$$ plain form
53911 113373 113578 114175 114836 115173 114802 113589 111972 110815 110701 111459 112494 113469 114517 115877 117502 119058
53895 119058 120220 120973 121597 122308 122986 123358 123422 123455 123622 123807 123895 123973 124130 124313 124613 125480 127336 130050 133056
53876 133056 136006 139055 142423 145974 149401 152665 156015 159600 163258 166718 169795 172336 174123 175017
53862 175017 175125 174731 174195 174009 174721 176419 178450 180059 181367 183199 185798 188251 189612 190225 191378 193833
53846 193833 197259 201049 205091 209497 214040 218210 221659 224398 226660 228664 230347 231250 230854 229175 226872
53831 226872 224628 222588 220545 218545 216973 216000 215128 213486 210561 206568 202048 197281 192238 187011 181971
53816 181971 177413 173291 169473 166006 162910 159939 156871 153851 151058 148235 144970 141433 138293 135758
53802 135758 133202 130025 126515 123488 121278 119450 117406 114973 112374 109849 107439 105101 102956 101324
$$ packed form
53911A13373K05N97O61L37l71j213j617j157j14P58J035R75J048J360J625J556
53895A19058J162P53O24P11O78L72O4L3J67J85Q8P8J57J83L00Q67J856K714L006
53876A33056K950L049L368L551L427L264L350L585L658L460L077K541J787Q94
53862A75017J08l94n36j86P12J698K031J609J308J832K599K453J361O13J153K455
53846A93833L426L790M042M406M543M170L449K739K262K004J683R03l96j679k303
53831B26872k244k040k043k000j572r73q72j642k925l993m520m767n043n227n040
53816A81971m558m122l818l467l096k971l068l020k793k823l265l537l140k535
53802A35758k556l177l510l027k210j828k044k433k599k525k410k338k145j632
$$ plain form
53788 101324 100347 99654 98610 96964 95118 93691 92949 92697 92522 92069 91252 90323 89616 89193 88876 88597 88452
53771 88452 88409 88296 88165 88316 88779 89141 89092 88815 88537 88100 87362 86741 86799 87495 88347 89191 90178 91087 91296 90652
53751 90652 89829 89536 89818 90429 91430 92973 94782 96362 97629 98887 100255 101536 102707 104122 106041
53736 106041 108259 110432 112643 115364 118868 122812 126449 129192 131006 132362 133891 136013 138740 141743
53722 141743 144573 146905 148592 149616 150130 150549 151357 152581 153593 153755 153213 152679 152371 151676 150125 148221
53706 148221 146819 145957 144932 143386 141676 140132 138626 137156 136193 136057 136394 136735 137154 137827 138314 137995
53690 137995 137085 136483 136503 136373 135279 133420 131745 130917 130785 130604 129638 127758 125629 124084 123253 122580 121754
53673 121754 121154 121111 121222 120833 119958 119224 118993 118970 118647 117853 116857 116118 115935 116185 116470 116596 116694 116736 116330 115331
$$ packed form
53788A01324r77o93j044j646j846j427p42k52j75m53q17r29p07m23l17k79j45
53771H8452m3j13j31J51M63L62m9k77k78m37p38o21N8O96Q52Q44R87R09K09o44
53751I0652q23k93K82O11J001J543J809J580J267J258J368J281J171J415J919
53736A06041K218K173K211K721L504L944L637K743J814J356J529K122K727L003
53722A41743K830K332J687J024N14M19Q08J224J012J62n42n34l08o95j551j904
53706A48221j402q62j025j546j710j544j506j470r63j36L37L41M19O73M87l19
53690A37995r10o02K0j30j094j859j675q28j32j81r66j880k129j545q31o73q26
53673A21754o00m3J11l89q75p34k31k3l23p94r96p39j83K50K85J26R8M2m06r99
$$ plain form
53653 115331 114307 113870 113785 113428 112997 113477 115219 117241 118363 118495 118428 118732 119405 120350 121662 123425 125550
53636 125550 127797 129785 131202 132326 134120 137267 141125 144133 145458 145850 146676 148517 151075 154124 157831
53621 157831 162066 165974 168611 169766 169862 169317 168472 167955 168404 169597 170372 169891 168665 167898 167980 168160 167624
53604 167624 166369 164924 163685 162782 162226 161895 161559 161108 160664 160287 159820 159119 158255 157326 156308 155256 154412
53587 154412 153885 153505 153177 153138 153524 153976 154065 153927 154011 154333 154529 154645 155254 156568 157938 158546 158259 157546 156909
53568 156909 156728 157334 158713 160318 161600 162643 163927 165535 167089 168462 170047 172172 174648 177103 179441
53553 179441 181702 183780 185516 186916 188045 188979 190043 191778 194339 197176 199717 202120 204946 208307
53539 208307 211921 215803 220175 224606 228100 230404 232563 235628 239283 242403 244631 246672 249185 252081
$$ packed form
53653A15331j024m37q5l57m31M80J742K022J122J32o7L04O73R45J312J763K125
53636A25550K247J988J417J124J794L147L858L008J325L92Q26J841K558L049L707
53621A57831M235L908K637J155R6n45q45n17M49J193P75m81j226p67Q2J80n36
53604A67624j255j445j239r03n56l31l36m51m44l77m67p01q64r29j018j052q44
53587A54412n27l80l28l9L86M52Q9j38Q4L22J96J16O09J314J370O08k87p13o37
53568A56909j81O06J379J605J282J043J284J608J554J373J585K125K476K455K338
53553A79441K261K078J736J400J129R34J064J735K561K837K541K403K826L361
53539B08307L614L882M372M431L494K304K159L065L655L120K228K041K513K896
$$ plain form
53525 252081 254945 257484 259413 260540 261325 262800 265386 268067 269326 268830 267658 266872 266442 265896 265505 266130
53509 266130 267924 269860 270847 270908 270766 270593 269846 268386 267118 267082 268255 269657 270486 270811 271209 272077 273382
53492 273382 274874 276411 278113 280147 282368 284284 285448 285846 285948 286552 288426 291711 295563 298829 301265
53477 301265 303686 306716 309948 312800 315663 319441 324250 329325 334146 338906 343821 348680 353354 358182
53463 358182 363550 369432 375521 381499 387154 392662 398782 406292 415105 424436 433930 444023 454939 466009
53449 466009 476425 486241 496247 507213 519561 533271 547726 562139 576602 592162 609317 626951
53437 626951 643598 659400 675900 694052 713390 733196 753468 774296 795069 814996 834064
53426 834064 852997 872391 892266 912318 932300 952178 972051 991893 1011400 1030291 1048816
$$ packed form
53525B52081K864K539J929J127P85J475K586K681J259m96j172p86m30n46l91O25
53509B66130J794J936R87O1j42j73p47j460j268l6J173J402Q29L25L98Q68J305
53492B73382J492J537J702K034K221J916J164L98J02O04J874L285L852L266K436
53477C01265K421L030L232K852K863L778M809N075M821M760M915M859M674M828
53463C58182N368N882O089N978N655N508O120P510Q813R331R494J0093J0916J1070
53449D66009J0416R816J0006J0966J2348J3710J4455J4413J4463J5560J7155J7634
53437F26951J6647J5802J6500J8152J9338J9806K0272K0828K0773J9927J9068
53426H34064J8933J9394J9875K0052J9982J9878J9873J9842J9507J8891J8525
$$ plain form
53415 1048816 1067639 1087104 1106889 1126564 1146094 1165497 1184300 1201867 1218171 1233752 1248827
53404 1248827 1262887 1275425 1286683 1297341 1307595 1316891 1324539 1330278 1334143 1336138 1336305 1334995 1332738
53391 1332738 1329750 1325667 1319905 1312272 1303220 1293445 1283229 1272239 1260073 1246907 1233358 1219699
53379 1219699 1205541 1190402 1174281 1157452 1140038 1122210 1104565 1087754 1071824 1056399 1041473
53368 1041473 1027537 1014861 1003209 992395 982664 974310 967269 961255 955890 950617 945064 939811 936203
53355 936203 934987 935485 936485 937484 938715 940606 943812 949240 957081 966096 974799 983317 993249 1005694
53341 1005694 1020314 1036446 1054084 1073256 1093269 1113372 1133795 1155461 1178908 1204030 1230640
53330 1230640 1258661 1287736 1317258 1347071 1377907 1410860 1446379 1483825 1521996 1560189 1598719
$$ packed form
53415A048816J8823J9465J9785J9675J9530J9403J8803J7567J6304J5581J5075
53404A248827J4060J2538J1258J0658J0254R296P648N739L865J995J67j310k257
53391A332738k988m083n762p633r052r775j0216j0990j2166j3166j3549j3659
53379A219699j4158j5139j6121j6829j7414j7828j7645j6811j5930j5425j4926
53368A041473j3936j2676j1652j0814r731q354p041o014n365n273n553n253l608
53355I36203j216M98J000R99J231J891L206N428P841R015Q703Q518R932J2445
53341A005694J4620J6132J7638J9172K0013K0103K0423K1666K3447K5122K6610
53330A230640K8021K9075K9522K9813L0836L2953L5519L7446L8171L8193L8530
$$ plain form
53319 1598719 1638290 1678898 1719597 1759434 1798311 1836673 1874644 1911863 1948079 1983383 2017747
53308 2017747 2050650 2081456 2109925 2136116 2159914 2180953 2198937 2213799 2225477 2233842 2238948 2241081
53296 2241081 2240289 2236079 2227900 2215862 2200618 2182619 2161901 2138695 2113742 2087617 2060015 2030084
53284 2030084 1997463 1962736 1926985 1891105 1855442 1819828 1783945 1747781 1711758 1676362 1641889
53273 1641889 1608579 1576676 1545995 1515667 1484826 1453594 1423076 1394310 1367446 1341957 1317415
53262 1317415 1293990 1272305 1252844 1235463 1219531 1204568 1190538 1177405 1164770 1152244 1139836
53251 1139836 1127624 1115382 1103057 1091283 1080727 1071087 1061549 1052216 1044199 1038094 1033241 1028901 1025327
53238 1025327 1023103 1022083 1021817 1022519 1024756 1028325 1032259 1035983 1039787 1044130 1049102 1054759 1061414 1069393
$$ packed form
53319A598719L9571M0608M0699L9837L8877L8362L7971L7219L6216L5304L4364
53308B017747L2903L0806K8469K6191K3798K1039J7984J4862J1678Q365N106K133
53296B241081p92m210q179j2038j5244j7999k0718k3206k4953k6125k7602k9931
53284B030084l2621l4727l5751l5880l5663l5614l5883l6164l6023l5396l4473
53273A641889l3310l1903l0681l0328l0841l1232l0518k8766k6864k5489k4542
53262A317415k3425k1685j9461j7381j5932j4963j4030j3133j2635j2526j2408
53251A139836j2212j2242j2325j1774j0556r640r538r333q017o105m853m340l574
53238A025327k224j020k66P02K237L569L934L724L804M343M972N657O655P979
$$ plain form
53224 1069393 1078911 1090405 1104408 1120699 1137959 1154816 1171134 1187853 1205614 1224006 1242193
53213 1242193 1259796 1276854 1293223 1308448 1322236 1334761 1346360 1357045 1366325 1373441 1377888 1379952
53201 1379952 1380682 1381019 1380822 1378993 1374647 1367809 1358884 1347975 1335183 1321172 1306795 1292218 1276952
53188 1276952 1260715 1243688 1225901 1207075 1187315 1167393 1147901 1128551 1108698 1088247 1067585
53177 1067585 1046888 1026009 1004997 984319 964477 945590 927382 909516 892099 875857 861476
53166 861476 848584 835775 822076 808079 795199 784054 774120 764802 756085 748079 740667 733947 728432
53153 728432 724306 720804 716792 711778 705970 699630 692854 685900 679143 672557 665676 658262 650719 643582
53139 643582 636901 630414 624166 618516 613527 608654 603190 596866 589936 582786 575646 568559 561477 554269
$$ packed form
53224A069393R518J1494J4003J6291J7260J6857J6318J6719J7761J8392J8187
53213A242193J7603J7058J6369J5225J3788J2525J1599J0685R280P116M447K064
53201A379952P30L37j97j829m346o838q925j0909j2792j4011j4377j4577j5266
53188A276952j6237j7027j7787j8826j9760j9922j9492j9350j9853k0451k0662
53177A067585k0697k0879k1012k0678j9842j8887j8208j7866j7417j6242j4381
53166H61476j2892j2809j3699j3997j2880j1145r934r318q717q006p412o720n515
53153G28432m126l502m012n014n808o340o776o954o757o586o881p414p543p137
53139F43582o681o487o248n650m989m873n464o324o930p150p140p087p082p208
$$ plain form
53125 554269 546590 537858 527655 516380 505312 495573 487002 478411 469094 459664 451211 444029 437521
53112 437521 430980 423980 416290 408067 400063 393004 386606 379781 372071 364378 357902 352674 347564 341576
53098 341576 334753 327853 321511 315775 310258 304518 298278 291399 283896 276140 268887 262802 257917 253784
53084 253784 250104 246900 244065 241140 237711 233768 229581 225429 221581 218231 215356 212882 211048 210131
53070 210131 209682 208534 205999 202650 199540 196969 194528 192067 189924 188266 186841 185525 184626 184383 184444
53055 184444 184105 182925 180989 178719 176569 174830 173573 172664 171749 170364 168364 166337 165240 165322 165696 165311
53039 165311 164188 163297 163316 163960 164506 164579 164292 163973 163928 164292 164992 165959 167312 169125 171152 173058 174871 176810
53021 176810 178663 179818 180022 179687 179222 178471 177125 175348 173569 171876 170047 168071 166213 164573 162977
$$ packed form
53125E54269p679q732j0203j1275j1068r739q571q591r317r430q453p182o508
53112D37521o541p000p690q223q004p059o398o825p710p693o476n228n110n988
53098C41576o823o900o342n736n517n740o240o879p503p756p253o085m885m133
53084B53784l680l204k835k925l429l943m187m152l848l350k875k474j834r17
53070B10131m49j148k535l349l110k571k441k461k143j658j425j316q99k43O1
53055A84444l39j180j936k270k150j739j257r09r15j385k000k027j097Q2L74l85
53039A65311j123q91J9O44N46P3k87l19m5L64P00R67J353J813K027J906J813J939
53021A76810J853J155K04l35m65p51j346j777j779j693j829j976j858j640j596
$$ plain form
53006 162977 161423 160214 159430 158521 156846 154503 152273 150632 149154 147133 144570 142154 140315 138697 136757
52991 136757 134573 132812 132008 132067 132376 132262 131467 130369 129610 129318 128888 127754 126128 124615 123285 121647
52975 121647 119535 117489 116054 115168 114444 113674 112744 111407 109592 107750 106483 105873 105472 104929 104314 103859
52959 103859 103668 103772 104201 104837 105343 105408 105045 104544 104165 103899 103500 102734 101632 100496 99592 98908 98332 98044
52941 98044 98430 99474 100455 100614 100068 99681 99941 100391 100413 100189 100337 100850 101087 100913 101147 102470 104423 105994
52923 105994 106821 107216 107262 106664 105492 104354 103550 102685 101531 100840 101657 103974 106551 108114 108433 108184 108091
52906 108091 108389 108888 109288 109415 109361 109505 110286 111773 113461 114664 115176 115417 115822 116353 116818 117419 118546 120091
52888 120091 121491 122566 123901 126134 129181 132451 135569 138543 141408 144083 146516 148696 150606 152381
$$ packed form
53006A62977j554j209p84r09j675k343k230j641j478k021k563k416j839j618j940
52991A36757k184j761q04N9L09j14p95j098p59k92m30j134j626j513j330j638
52975A21647k112k046j435q86p24p70r30j337j815j842j267o10m01n43o15m55
52959A03859j91J04M29O36N06O5l63n01l79k66l99p66j102j136r04o84n76k88
52941I8044L86J044R81J59n46l87K60M50K2k24J48N13K37j74K34J323J953J571
52923A05994Q27L95M6n98j172j138q04q65j154o91Q17K317K577J563L19k49r3
52906A08091K98M99M00J27n4J44P81J487J688J203N12K41M05N31M65O01J127J545
52888A20091J400J075J335K233L047L270L118K974K865K675K433K180J910J775
$$ plain form
52874 152381 154452 157144 160151 162741 164532 165741 166638 167173 167353 167572 168128 168625 168345 167171 165751 164584
52858 164584 163358 161498 159131 157158 156375 156714 157352 157346 156214 154180 151999 150381 149400 148570 147504 146287
52842 146287 145156 144106 143104 142468 142591 143285 143829 143787 143511 143645 144415 145563 146792 147984 149105 150194
52826 150194 151390 152697 153687 153708 152562 150830 149416 148801 148825 149080 149370 149725 150145 150475 150543 150309 149763 148803
52808 148803 147462 146327 146394 148160 150910 153237 154366 154718 155039 155363 155201 154508 153892 153779 153876 153717 153354
52791 153354 153094 152825 152142 151169 150737 151524 153301 155288 157083 158979 161434 164438 167472 169960 171715 172932
52775 172932 173820 174371 174547 174507 174447 174356 174197 174277 175046 176401 177585 178003 177894 177959 178541 179392 180079 180373 180404 180656
52755 180656 181630 183278 184899 185802 185946 185704 185295 184788 184412 184390 184527 184338 183571 182258 180411 178115 175832
$$ packed form
52874A52381K071K692L007K590J791J209Q97N35J80K19N56M97k80j174j420j167
52858A64584j226j860k367j973p83L39O38oj132k034k181j618r81q30j066j217
52842A46287j131j050j002o36J23O94N44m2k76J34P70J148J229J192J121J089
52826A50194J196J307R90K1j146j732j414o15K4K55K90L55M20L30O8k34n46r60
52808A48803j341j135O7J766K750K327J129L52L21L24j62o93o16j13R7j59l63
52791A53354k60k69o83r73m32P87J777J987J795J896K455L004L034K488J755J217
52775A72932Q88N51J76m0o0r1j59Q0P69J355J184M18j09O5N82Q51O87K94L1K52
52755A80656R74J648J621R03J44k42m09n07l76k2J37j89p67j313j847k296k283
$$ plain form
52738 175832 174041 172534 170565 167825 164739 161712 158644 155436 152364 149631 147026 144468 142356 140875
52724 140875 139400 137242 134669 132533 131085 129917 128988 128810 129400 129793 129038 127248 125257 123648 122464
52709 122464 121489 120368 118652 116250 113756 111982 111171 110936 110822 110557 109887 108626 106988 105494 104451 103807
52693 103807 103528 103698 104129 104290 103868 103033 101869 99967 97052 93768 91229 89871 89214 88665 88059 87305 86142
52676 86142 84527 82908 81726 80897 80051 79131 78464 78317 78553 78704 78372 77677 77311 77808 78694 78705 77057 74278
52658 74278 71595 69906 69507 70338 71916 73307 73775 73467 72989 72433 71348 69715 68323 67874 68115 68210 67797
52641 67797 67330 67444 68213 69167 69867 70310 70715 71108 71318 71339 71331 71240 70805 70099 69634 69651 69729 69535 69574 70573 72315
52620 72315 73801 74514 74893 75498 76377 77429 78800 80566 82414 83984 85255 86354 87259 87940 88569 89368
$$ packed form
52738A75832j791j507j969k740l086l027l068l208l072k733k605k558k112j481
52724A40875j475k158k573k136j448j168r29j78N90L93p55j790j991j609j184
52709A22464r75j121j716k402k494j774q11k35j14k65o70j261j638j494j043o44
52693A03807k79J70M31J61m22q35j164j902k915l284k539j358o57n49o06p54j163
52676H6142j615j619j182q29q46r20o67j47K36J51l32o95l66M97Q86J1j648k779
52658G4278k683j689l99Q31J578J391M68l08m78n56j085j633j392m49K41R5m13
52641F7797m67J14P69R54P00M43M05L93K10K1qr1m35p06m65J7P8j94L9R99J742
52620G2315J486P13L79O05Q79J052J371J766J848J570J271J099R05O81O29P99
$$ plain form
52604 89368 90419 91778 93535 95548 97268 98094 97921 97279 96885 97014 97244 96956 96105 95198 94352 92849 90149
52587 90149 86961 84600 83402 82535 81358 80152 79334 78748 78095 77395 76657 75664 74431 73332 72389 71076
52571 71076 69322 68082 68232 69338 70175 70154 69547 68610 67278 65742 64636 64489 65272 66495 67496 67773 67432
52554 67432 67237 67893 69340 70913 71987 72177 71261 69408 67305 65598 64296 63082 62008 61407 61284 61370
52538 61370 61713 62661 64209 65899 67456 69022 70583 71623 71620 70699 69567 68962 69216 70164 71389 72611 73875
52521 73875 75277 76638 77650 78254 78645 78969 79231 79439 79632 79811 80068 80693 81905 83532 85146 86436 87233
52504 87233 87319 86539 85082 83459 82200 81703 82215 83698 85769 87966 90010 91739 93008 93825 94367 94720
52488 94720 94879 95129 96005 97592 99302 100658 101840 102991 103607 103305 102733 102820 103391 103496 103025 103003 104165 106113
$$ packed form
52604H9368J051J359J757K013J720Q26j73o42l94J29K30k88q51r07q46j503k700
52587I0149l188k361j198q67j177j206q18n86o53p00p38r93j233j099r43j313
52571G1076j754j240J50J106Q37k1o07r37j332j536j106j47P83J223J001K77l41
52554F7432j95O56J447J573J074J90r16j853k103j707j302j214j074o01j23Q6
52538F1370L43R48J548J690J557J566J561J040lr21j132o05K54R48J225J222J264
52521G3875J402J361J012O04L91L24K62K08J93J79K57O25J212J627J614J290P97
52504H7233Q6p80j457j623j259m97N12J483K071K197K044J729J269Q17N42L53
52488I4720J59K50Q76J587J710J356J182J151O16l02n72Q7N71J05m71k2J162J948
$$ plain form
52470 106113 108137 110063 111925 113505 114600 115249 115375 114707 113397 112223 111720 111516 110888 109693 108417 107581
52454 107581 107443 108061 109316 110947 112668 114164 115068 115254 115151 115339 115792 115999 115901 116089 116853 117528 117218 115807
52436 115807 114013 112731 112512 113215 113899 113505 112037 110708 110547 111256 111868 112153 112744 114019 115468 116265 116158
52419 116158 115688 115681 116484 117639 118361 118368 118031 117720 117443 117257 117513 118287 118950 118829 118149 117842 118470 119707 120850
52400 120850 121535 121906 122354 123132 124112 124923 125400 125769 126249 126676 126765 126703 127190 128784 131236 133530 134697 134696 134358
52381 134358 134413 134752 134880 134733 134540 134091 132922 131321 130407 130867 132168 133329 133980 134287 134427 134619 135206 136191
52363 136191 137017 137316 137492 138070 138847 139284 139373 139460 139459 139016 138325 138006 138189 138387 138426 138795 139843 141211 142333
52344 142333 143065 143533 143741 143711 143741 144126 144729 145091 145061 145113 145945 147746 149900 151510 152251 152609 153306 154684 156658
$$ packed form
52470A06113K024J926J862J580J095O49J26o68j310j174n03k04o28j195j276q36
52454A07581j38O18J255J631J721J496R04J86j03J88M53K07r8J88P64O75l10j411
52436A15807j794j282k19P03O84l94j468j329j61P09O12K85N91J275J449P97j07
52419A16158m70pQ03J155P22Pl37l11k77j86K56P74O63j21o80l07O28J237J143
52400A20850O85L71M48P78R80Q11M77L69M80M27Q9o2M87J594K452K294J167jl38
52381A34358N5L39J28j47j93m49j169j601r14M60J301J161O51L07J40J92N87R85
52363A36191Q26K99J76N78P77M37Q9Q7jm43o91l19J83J98L9L69J048J368J122
52344A42333P32M68K08l0L0L85O03L62l0N2Q32J801K154J610P41L58O97J378J974
$$ plain form
52325 156658 159008 161536 164084 166555 168713 169973 169756 168270 166581 165593 165310 165363 165811 166876 168217 169118
52309 169118 169312 169057 168489 167508 166327 165568 165637 166351 167300 168250 169158 170085 171146 172293 173204 173741 174397 175799
52291 175799 177831 179786 181448 183389 185953 188486 190038 190564 191047 192561 195401 198963 202204 204379 205610
52276 205610 206789 208774 211625 214634 217054 218802 220464 222614 225180 227642 229828 232169 235006 238083
52262 238083 241087 244356 248438 253091 257386 260890 264223 268242 273133 278503 283966 289318 294444 299462
52248 299462 304875 311258 318729 326811 334898 342921 351472 361123 371613 382062 392157 402711 414643
52235 414643 427753 441121 454460 468362 483147 498239 512919 527171 541457 556011 570656
52224 570656 585055 598933 612286 625491 638950 652588 665981 678945 691563 703602 714467
$$ packed form
52325A56658K350K528K548K471K158J260k17j486j689r88k83N3M48J065J341R01
52309A69118J94k55n68r81j181p59O9P14R49R50R08R27J061J147R11N37O56J402
52291A75799K032J955J662J941K564K533J552N26M83J514K840L562L241K175J231
52276B05610J179J985K851L009K420J748J662K150K566K462K186K341K837L077
52262B38083L004L269M082M653M295L504L333M019M891N370N463N352N126N018
52248B99462N413O383P471Q082Q087Q023Q551R651J0490J0449J0095J0554J1932
52235D14643J3110J3368J3339J3902J4785J5092J4680J4252J4286J4554J4645
52224E70656J4399J3878J3353J3205J3459J3638J3393J2964J2618J2039J0865
$$ plain form
52213 714467 723941 732462 740381 747391 753022 757334 760772 763624 766011 768149 770230 772139 773507 773988
52199 773988 773412 771922 770064 768429 767069 765576 763858 762388 761492 760928 760545 760874 762575 765570 769278
52184 769278 773473 778315 783715 789304 795167 802094 810836 821297 832620 843930 854875 865547 875999
52171 875999 885963 895103 903417 911134 918274 924617 930124 934940 938884 941373 942121 941530 940093 937793 934445
52156 934445 930253 925522 920080 913487 905729 897247 888364 879075 869295 858908 847651 835399 822588
52143 822588 809963 797833 785898 773899 762114 751115 741167 731980 723029 714124 705675 698180 691534
52130 691534 685201 679150 674055 670233 666915 663116 658855 654878 651525 648600 646068 643985 641771 638571
52116 638571 634608 631356 629943 629975 630324 630408 630114 629024 626518 622581 617978 613633 610147 607749 606251 605047
$$ packed form
52213G14467R474Q521P919P010N631M312L438K852K387K138K081J909J368M81
52199G73988n76j490j858j635j360j493j718j470q96n64l83L29J701K995L708
52184G69278M195M842N400N589N863O927Q742J0461J1323J1310J0945J0672J0452
52171H75999R964R140Q314P717P140O343N507M816L944K489P48n91j437k300l348
52156I34445m192m731n442o593p758q482q883r289r780j0387j1257j2252j2811
52143H22588j2625j2130j1935j1999j1785j0999r948r187q951q905q449p495o646
52130F91534o333o051n095l822l318l799m261l977l353k925k532k083k214l200
52116F38571l963l252j413L2L49Q4k94j090k506l937m603m345l486k398j498j204
$$ plain form
52100 605047 603491 601396 598976 596368 593480 590301 587089 584151 581580 579337 577486 576210 575522 574978 573854
52085 573854 571784 569234 567140 565990 565361 564399 562659 560433 558389 556940 555938 554977 553994 553390 553379 553455
52069 553455 552883 551671 550537 549883 549341 548600 548103 548452 549468 550401 550881 551142 551399 551626 552053 553298 555740
52052 555740 559122 563043 567476 572551 578113 583916 590070 596893 604434 612606 621747 632498 644897 658083
52038 658083 671323 685064 700405 717563 735393 752596 768948 785083 801450 817967 834476
52027 834476 850988 867359 883141 898014 912108 925684 938677 950838 962149 972687 982041 989317
52015 989317 994024 996767 998713 1000397 1001359 1000969 999233 996599 993339 989447 984937 979775 973628 966153 957667
52000 957667 949083 941013 933281 925502 917800 910650 904324 898820 894162 890376 887355 885083 883859 883906 884836
$$ packed form
52100F05047j556k095k420k608k888l179l212k938k571k243j851j276o88n44j124
52085E73854k070k550k094j150o29r62j740k226k044j449j002r61r83o04j1P6
52069E53455n72j212j134o54n42p41m97L49J016R33M80K61K57K27M27J245K442
52052E55740L382L921M433N075N562N803O154O823P541Q172R141J0751J2399J3186
52038F58083J3240J3741J5341J7158J7830J7203J6352J6135J6367J6517J6509
52027H34476J6512J6371J5782J4873J4094J3576J2993J2161J1311J0538R354P276
52015I89317M707K743J946J684R62l90j736k634l260l892m510n162o147p475q486
52000I57667q584q070p732p779p702p150o326n504m658l786l021k272j224M7R30
$$ plain form
51985 884836 885887 886718 887688 889406 892354 896845 902803 909444 915621 920761 925288 930009 935314 941049 946863
51970 946863 952431 957582 962324 966630 970147 972428 973484 973809 973626 972470 969756 965417 959712 952721 944477
51955 944477 935380 925979 916362 906158 895168 883557 871368 858241 843892 828597 812897 796968
51943 796968 780576 763628 746437 729268 711841 693599 674563 655663 638047 622109 607297
51932 607297 592736 577829 562388 546537 530590 514766 498968 483007 467147 452140 438550
51921 438550 426192 414362 402429 390135 377650 365588 354716 345284 336724 328254 319702 311501
51909 311501 304006 297144 290681 284546 278864 273853 269658 266103 262712 259190 255797 252960 250580 248076
51895 248076 245110 241933 238962 236341 234004 231808 229426 226385 222446 217857 213124 208696 204952 202219
$$ packed form
51985H84836J051Q31R70J718K948M491N958O641O177N140M527M721N305N735N814
51970I46863N568N151M742M306L517K281J056L25j83j156k714m339n705o991q244
51955I44477r097r401r617j0204j0990j1611j2189j3127j4349j5295j5700j5929
51943G96968j6392j6948j7191j7169j7427j8242j9036j8900j7616j5938j4812
51932F07297j4561j4907j5441j5851j5947j5824j5798j5961j5860j5007j3590
51921D38550j2358j1830j1933j2294j2485j2062j0872r432q560q470q552q201
51909C11501p495o862o463o135n682n011m195l555l391l522l393k837k380k504
51895B48076k966l177k971k621k337k196k382l041l939m589m733m428l744k733
$$ plain form
51881 202219 200572 199676 198961 197856 195960 193246 190238 187693 185939 184671 183442 182047 180278 177753 174404
51866 174404 170925 168319 167053 166854 167116 167165 166376 164574 162325 160423 159075 157956 157003 156542 156544 156371 155631
51849 155631 154839 154784 155491 156206 156210 155283 153600 151641 150062 149169 148471 147185 145248 143448 142451 142041 141450 140123
51831 140123 138031 135596 133499 132257 131732 131258 130523 129996 130163 130711 130973 130957 131261 131951 132313 131993 131731 132417
51813 132417 133811 134846 135027 134913 135167 135745 136202 136352 136334 136381 136809 137967 139809 141653 142767 143137 143334
51796 143334 143650 143802 143641 143706 144733 146722 148809 150074 150333 150217 150614 151953 153855 155461 156307 156818 157738
51779 157738 159104 160075 159939 159044 158482 158921 159938 160511 160030 158801 157644 157031 156620 155704 154112 152488 151498
51762 151498 150987 150213 148906 147714 147481 148311 149565 150570 151132 151441 151728 152089 152516 153066 153924 155163 156401
$$ packed form
51881B02219j647q96p15j105j896k714l008k545j754j268j229j395j769k525l349
51866A74404l479k606j266j99K62M9p89j802k249j902j348j119r53m61Kj73p40
51849A55631p92n5P07P15Mr27j683j959j579q93o98j286j937j800r97m10n91j327
51831A40123k092k435k097j242n25m74p35n27J67N48K62j6L04O90L62l20k62O86
51813A32417J394J035J81j14K54N78M57J50j8M7M28J158J842J844J114L70J97
51796A43334L16J52j61O5J027J989K087J265K59j16L97J339J902J606Q46N11R20
51779A57738J366R71j36q95n62M39J017N73m81j229j157o13m11r16j592j624r90
51762A51498n11p74j307j192k33Q30J254J005N62L09K87L61M27N50Q58J239J238
$$ plain form
51745 156401 156931 156417 155296 154267 153496 152611 151405 150187 149385 149155 149469 150250 151205 151734 151358 150164 148724
51728 148724 147596 146965 146599 146090 145339 144867 145394 146958 148725 149893 150444 150715 150616 149804 148526 147687 148030
51711 148030 149655 152222 155083 157170 157470 155977 153819 152177 151415 151429 152266 153880 155696 157026 157895 159014
51695 159014 160947 163575 166306 168537 170056 171233 172753 174914 177378 179768 182214 184975 187844 190461
51681 190461 193024 196087 199712 203406 206943 210755 215377 220974 227459 234515 241319 246784 250407 252583
51667 252583 253897 254524 254519 254192 253762 253016 251778 250460 249681 249438 249075 248040 246430 244795 243637 243069 242779
51650 242779 242385 241903 241714 241956 242155 241663 240348 238638 237065 235945 235350 235166 235261 235668 236457 237402 238110 238605
51632 238605 239381 240598 241708 242225 242527 243367 244911 246794 248900 251470 254563 257975 261634 265460 268926
$$ packed form
51745A56401N30n14j121j029p71q85j206j218q02k30L14P81R55N29l76j194j440
51728A48724j128o31l66n09p51m72N27J564J767J168N51K71r9q12j278q39L43
51711A48030J625K567K861K087L00j493k158j642p62J4Q37J614J816J330Q69J119
51695A59014J933K628K731K231J519J177J520K161K464K390K446K761K869K617
51681A90461K563L063L625L694L537L812M622N597O485P056O804N465L623K176
51667B52583J314O27nl27m30p46j238j318p79k43l63j035j610j635j158n68k90
51650B42779l94m82j89K42J99m92j315j710j573j120n95j84R5M07P89R45P08M95
51632B38605P76J217J110N17L02Q40J544J883K106K570L093L412L659L826L466
$$ plain form
51617 268926 271377 272822 273781 274296 273809 272236 270491 269595 269767 270720 272265 274115 275610 276238 276225 276072 275792
51600 275792 275124 274360 274318 275378 276946 277965 277711 276041 273228 269691 265790 261748 257809 254241 251034
51585 251034 247738 243968 240029 236682 234244 232192 229790 226825 223576 220294 217035 213918 211222 209145
51571 209145 207563 206101 204351 202110 199492 196937 194901 193381 191814 189656 187057 184738 183202 182318
51557 182318 181803 181690 181997 182180 181500 179938 178296 177272 176822 176588 176532 176787 177159 177199 176727 175996 175346 174933
51539 174933 174784 174882 175098 175171 174848 174092 173173 172563 172628 173434 174906 177132 180221 183860 187375 190443 193515
51522 193515 197294 201992 207348 213101 218998 224509 229026 232436 235084 237136 238433 239089 239710 240645 241322
51507 241322 240833 238987 236367 233495 230459 227346 224460 221857 219178 216342 214018 212883 212593 212137 211202
$$ packed form
51617B68926K451J445R59N15m87j573j745q96J72R53J545J850J495O28j3j53k80
51600B75792o68p64m2J060J568J019k54j670k813l537l901m042l939l568l207
51585B51034l296l770l939l347k438k052k402k965l249l282l259l117k696k077
51571B09145j582j462j750k241k618k555k036j520j567k158k599k319j536q84
51557A82318n15j13L07J83o80j562j642j024m50k34n6K55L72M0m72p31o50m13
51539A74933j49R8K16P3l23p56r19o10O5Q06J472K226L089L639L515L068L072
51522A93515L779M698N356N753N897N511M517L410K648K052J297O56O21R35O77
51507B41322m89j846k620k872l036l113k886k603k679k836k324j135k90m56r35
$$ plain form
51492 211202 210628 211313 213228 215812 218786 222059 225146 227398 228786 229955 231429 233198 235170 237536 240412
51477 240412 243455 246126 248180 249722 250881 251548 251360 249955 247438 244571 242228 240676 239707 239406 240179
51462 240179 241832 243326 243913 244052 244630 245691 246665 247603 249262 251850 254469 256187 257073 257680 257972 257432
51446 257432 256067 254641 253704 252797 250964 247882 244206 240821 238065 235713 233400 230766 227435 223306 218959
51431 218959 215353 212953 211336 209780 207977 206028 204076 202272 200869 200049 199810 200282 201868 204639 207743
51416 207743 209971 210940 211363 212136 213556 215489 217842 220637 223870 227498 231418 235444 239465 243587 247882
51401 247882 252110 256131 260441 265743 271901 277920 283139 287830 292298 296080 298645 300338 301934 303519
51387 303519 304584 305064 305495 306132 306628 306744 306731 306719 306361 305498 304728 304795 305673 306690 307379 307825 308351 309241 310715
$$ packed form
51492B11202n74O85J915K584K974L273L087K252J388J169J474J769J972K366K876
51477B40412L043K671K054J542J159O67j88j405k517k867k343j552r69l01P73
51462B40179J653J494N87J39N78J061R74R38J659K588K619J718Q86O07K92n40
51446B57432j365j426r37r07j833l082l676l385k756k352k313k634l331m129m347
51431B18959l606k400j617j556j803j949j952j804j403q20k39M72J586K771L104
51416B07743K228R69M23P73J420J933K353K795L233L628L920M026M021M122M295
51401B47882M228M021M310N302O158O019N219M691M468L782K565J693J596J585
51387C03519J065M80M31O37M96J16j3j2l58q63p70O7Q78J017O89M46N26Q90J474
$$ plain form
51368 310715 312752 314911 316618 317655 318132 317949 316695 314193 310868 307360 303969 300629 297224 293688 289880
51353 289880 285623 280898 275897 270924 266336 262493 259591 257552 256197 255427 255086 254755 253962 252668 251302
51338 251302 250288 249715 249609 250208 251728 253983 256484 258895 261116 263012 264392 265393 266526 268014 269236
51323 269236 269253 267918 266102 264606 263162 260887 257567 253993 250897 247970 244269 239308 233390 227037 220576
51308 220576 214328 208752 204090 200049 196077 191900 187654 183518 179398 175042 170463 166145 162635 159877
51294 159877 157166 153989 150712 148102 146315 144760 142959 141075 139472 138202 137154 136281 135405 134123 132313
51279 132313 130528 129497 129370 129720 130125 130479 130859 131399 132149 132834 132909 132206 131328 131094 131730 132917 134383 135950
51261 135950 137159 137523 137284 137420 138697 140965 143525 145887 148066 150418 153313 156835 160722 164722 168829
$$ packed form
51368C10715K037K159J707J037M77j83j254k502l325l508l391l340l405l536l808
51353B89880m257m725n001m973m588l843k902k039j355p70l41l31p93j294j366
51338B51302j014n73j06N99J520K255K501K411K221J896J380J001J133J488J222
51323B69236J7j335j816j496j444k275l320l574l096k927l701m961n918o353o461
51308B20576o248n576m662m041l972m177m246m136m120m356m579m318l510k758
51294A59877k711l177l277k610j787j555j801j884j603j270j048q73q76j282j810
51279A32313j785j031j27L50M05L54L80N40P50O85P5p03q78k34O36J187J466J567
51261A35950J209L64k39J36J277K268K560K362K179K352K895L522L887M000M107
$$ plain form
51246 168829 172953 176574 179199 181009 182524 183737 184226 184114 184154 184579 184629 183585 181703 179600 177300 174568
51230 174568 171762 169566 167965 166143 163492 160264 157167 154658 152667 150693 148188 145075 141904 139252
51216 139252 137113 135154 133433 132354 131892 131373 130262 128836 127774 127211 126447 124663 121785 118634 116237
51201 116237 115032 114784 115071 115582 115908 115491 114153 112469 111254 110747 110634 110761 111413 112779 114535 116177
51185 116177 117575 119003 120698 122560 124243 125444 126062 126092 125503 124377 123103 122141 121506 120763 119718 118842
51169 118842 118715 119299 120084 120775 121411 121952 122215 122262 122384 122635 122785 122802 123026 123683 124537 125177 125372 125049 124238
51150 124238 123247 122594 122642 123457 125037 127187 129083 129585 128489 127045 126628 127200 127646 127452 127231 127567 128155
51133 128155 128438 128475 128645 128904 128949 128908 129190 129616 129300 127709 125443 123633 122806 122669 122834 123286 124133 125211
$$ packed form
51246A68829M124L621K625J810J515J213M89j12M0M25N0j044j882k103k300k732
51230A74568k806k196j601j822k651l228l097k509j991j974k505l113l171k652
51216A39252k139j959j721j079m62n19j111j426j062n63p64j784k878l151k397
51201A16237j205k48K87N11L26m17j338j684j215n07j13J27O52J366J756J642
51185A16177J398J428J695J862J683J201O18L0n89j126j274r62o35p43j045q76
51169A18842j27N84P85O91O36N41K63M7J22K51J50J7K24O57Q54O40J95l23q11
51150A24238r91o53M8Q15J580K150J896N02j096j444m17N72M46j94k21L36N88
51133A28155K83L7J70K59M5m1K82M26l16j591k266j810q27j37J65M52Q47J078
$$ plain form
51115 125211 126141 126601 126421 125602 124376 123136 122179 121536 121089 120716 120300 119793 119385 119395 119817 120132 119804 118854
51097 118854 117758 116918 116480 116494 116853 117099 116684 115605 114494 113950 113927 113907 113454 112482 111177 109869 108825 108044
51079 108044 107331 106684 106461 106954 107889 108549 108478 107966 107730 108150 108837 109079 108690 108261 108494 109456 110735 112164
51061 112164 113994 116322 118739 120743 122233 123432 124590 125956 127747 129809 131438 131895 131060 129348 127105
51046 127105 124487 121893 120014 119144 118766 118157 117314 116892 117233 117878 118268 118600 119522 121050 122310 122591 122226
51029 122226 122077 122418 122877 123332 124276 126048 128219 130062 131407 132688 134278 135997 137261 137549 136798 135432
51013 135432 133941 132459 130946 129673 129136 129383 129876 130252 130854 132119 133799 135165 135778 135695 135149 134448 133994
50996 133994 133900 133685 132828 131558 130613 130259 130055 129614 129054 128671 128647 129220 130600 132492 134201 135480 136812
$$ packed form
51115A25211R30M60j80q19j226j240r57o43m47l73m16n07m08J0M22L15l28r50
51097A18854j096q40m38J4L59K46m15j079j111n44k3k0m53r72j305j308j044p81
51079A08044p13o47k23M93R35O60p1n12k36M20O87K42l89m29K33R62J279J429
51061A12164J830K328K417K004J490J199J158J366J791K062J629M57q35j712k243
51046A27105k618k594j879q70l78o09q43m22L41O45L90L32R22J528J260K81l65
51029A22226j49L41M59M55R44J772K171J843J345J281J590J719J264K88p51j366
51013A35432j491j482j513j273n37K47M93L76O02J265J680J366O13q3n46p01m54
50996A33994r4k15q57j270r45l54k04m41n60l83k4N73J380J892J709J279J332
$$ plain form
50979 136812 138611 140646 142640 144904 147754 150612 152415 152858 152676 152662 152921 153260 153773 154688 155816 156554
50963 156554 156492 155924 155628 156128 157208 158249 159007 159857 161204 162907 164495 165749 166848 167975 169088 170115
50947 170115 171229 172809 175163 178249 181673 185072 188505 192262 196255 199878 202730 205258 208416 212788
50933 212788 218275 224428 230737 236692 242006 246972 252396 259097 267481 277404 288184 298874 308929
50920 308929 318710 329138 340857 353962 368411 384282 401560 420091 439919 461424 484995 510836
50908 510836 539153 570133 603623 639218 676933 717388 760996 807285 855367 904775 955364
50897 955364 1006603 1057601 1107851 1157349 1205736 1251796 1294116 1331998 1365360 1393943 1417029
50886 1417029 1434021 1445002 1450571 1451281 1447452 1439455 1427926 1413592 1396978 1378415 1358339 1337461
$$ packed form
50979A36812J799K035J994K264K850K858J803M43j82j4K59L39N13R15J128P38
50963A56554o2n68k96N00J080J041P58Q50J347J703J588J254J099J127J113J027
50947A70115J114J580K354L086L424L399L433L757L993L623K852K528L158M372
50933B12788N487O153O309N955N314M966N424O701Q384R923J0780J0690J0055
50920C08929R781J0428J1719J3105J4449J5871J7278J8531J9828K1505K3571K5841
50908E10836K8317L0980L3490L5595L7715M0455M3608M6289M8082M9408N0589
50897I55364N1239N0998N0250M9498M8387M6060M2320L7882L3362K8583K3086
50886A417029J6992J0981N569P10l829p997j1529j4334j6614j8563k0076k0878
$$ plain form
50874 1337461 1316613 1296395 1276828 1257285 1236883 1215136 1192182 1168319 1143495 1117481 1090364
50863 1090364 1062453 1033745 1003968 973280 942355 911434 879747 846469 812100 778311 746394
50852 746394 716321 687448 659676 633556 609491 587264 566438 546976 529282 513680 499998
50841 499998 487758 476655 466696 457938 450337 443937 438937 435419 433170 431924 431567 431926 432539 432971 433232
50826 433232 433677 434569 436040 438296 441448 445193 449070 453147 458029 464100 471106 478664 486815 495776 505463
50811 505463 515642 526360 537911 550470 564126 579183 596019 614559 634246 654790 676746
50800 676746 701089 728272 757950 789663 823622 860719 901950 947971 999143 1055750 1118057
50789 1118057 1186262 1260484 1340751 1426942 1518810 1616064 1718332 1824999 1935216 2048117
$$ packed form
50874A337461k0848k0218j9567j9543k0402k1747k2954k3863k4824k6014k7117
50863A090364k7911k8708k9777l0688l0925l0921l1687l3278l4369l3789l1917
50852G46394l0073k8873k7772k6120k4065k2227k0826j9462j7694j5602j3682
50841D99998j2240j1103r959q758p601o400n000l518k249j246l57L59O13M32K61
50826D33232M45Q92J471K256L152L745L877M077M882O071P006P558Q151Q961R687
50811E05463J0179J0718J1551J2559J3656J5057J6836J8540J9687K0544K1956
50800F76746K4343K7183K9678L1713L3959L7097M1231M6021N1172N6607O2307
50789A118057O8205P4222Q0267Q6191R1868R7254J02268J06667J10217J12901
$$ plain form
50779 2048117 2162759 2277692 2390802 2499807 2602741 2697687 2782315 2854305 2912368 2956449
50769 2956449 2986734 3002866 3004489 2992365 2968593 2935769 2896190 2851782 2804319 2755365 2706100
50758 2706100 2657440 2610339 2565666 2523543 2482892 2441967 2399411 2354689 2307556 2257556 2204175
50747 2204175 2147148 2086297 2021387 1952595 1880870 1807390 1732764 1657264 1581730 1507612 1436038
50736 1436038 1367379 1301857 1239975 1182068 1127979 1077624 1031449 989854 952413 918144 886449
50725 886449 857443 831514 808916 789701 773647 760172 748508 738023 728406 719693 712220 706241
50713 706241 701443 697049 692545 688055 683828 679763 675709 671884 668594 665777 663174 660611 657773 654149
50699 654149 649798 645779 643101 641527 640276 639648 640890 644350 648913 653740 659580 667672 678116 690253
$$ packed form
50779B048117J14642J14933J13110J09005J02934R4946Q4628P1990N8063M4081
50769B956449L0285J6132J623j2124k3772l2824l9579m4408m7463m8954m9265
50758B706100m8660m7101m4673m2123m0651m0925m2556m4722m7133n0000n3381
50747B204175n7027o0851o4910o8792p1725p3480p4626p5500p5534p4118p1574
50736A436038o8659o5522o1882n7907n4089n0355m6175m1595l7441l4269l1695
50725H86449k9006k5929k2598j9215j6054j3475j1664j0485r617q713p473n979
50713G06241m798m394m504m490m227m065m054l825l290k817k603k563k838l624
50699F54149m351m019k678j574j251o28J242L460M563M827N840Q092J0444J2137
$$ plain form
50685 690253 704107 720445 739525 760706 783470 808161 835470 865685 898717 934527 973288
50674 973288 1015344 1061170 1111151 1165263 1223154 1284636 1349846 1418650 1490081 1562650 1635215
50663 1635215 1707259 1778285 1847118 1911962 1970994 2022810 2066414 2101121 2126542 2142480 2148678
50652 2148678 2144801 2130876 2107685 2076589 2039093 1996857 1952056 1907169 1863977 1822854 1783296
50641 1783296 1745121 1708935 1675511 1644975 1616671 1589516 1562279 1533750 1502960 1469422 1433083
50630 1433083 1394091 1352741 1309642 1265661 1221493 1177405 1133566 1090498 1048923 1009211 971315
$$ packed form
50685F90253J3854J6338J9080K1181K2764K4691K7309L0215L3032L5810L8761
50674I73288M2056M5826M9981N4112N7891O1482O5210O8804P1431P2569P2565
50663A635215P2044P1026O8833O4844N9032N1816M3604L4707K5421J5938O198
50652B148678l877j3925k3191l1096l7496m2236m4801m4887m3192m1123l9558
50641A783296l8175l6186l3424l0536k8304k7155k7237k8529l0790l3538l6339
50630A433083l8992m1350m3099m3981m4168m4088m3839m3068m1575l9712l7896
$$ [...]
##END NTUPLES=NMR SPECTRUM
##END=
