
##TITLE=AC1111_Colombia_5835338_vh2UkRcLu9
##JCAMPDX= 6.0         $$ Bruker NMR JCAMP-DX V2.0
##DATA TYPE= NMR SPECTRUM
##DATA CLASS= NTUPLES
##ORIGIN= BRUKER
##OWNER= Administrator
$$ 1.72 TOPSPIN		Version 2.1
$$ 2012-04-10 11:03:59.171 -0500  Administrator@TOPSPIN
$$ Compression mode = diff/dup
##.OBSERVE FREQUENCY= 400.13188235
##.OBSERVE NUCLEUS= ^1H
##.ACQUISITION MODE= SIMULTANEOUS (DQD)
##.ACQUISITION SCHEME= undefined
##.AVERAGES= 8
##.DIGITISER RES= 22
##SPECTROMETER/DATA SYSTEM= spect
##.PULSE SEQUENCE= zg30
##.SOLVENT NAME= COFFEE_meoh
##.SHIFT REFERENCE= INTERNAL, COFFEE_meoh, 1, 14.98061
##AUDIT TRAIL= $$ (NUMBER, WHEN, WHO, WHERE, PROCESS, VERSION, WHAT)
$$ ##TITLE= Audit trail, TOPSPIN		Version 2.1
$$ ##JCAMPDX= 5.01
$$ ##ORIGIN= Bruker BioSpin GmbH
$$ ##OWNER= Administrator
$$ $$ C:\Bruker\TOPSPIN/data/COFFEE/nmr/AC1111_Colombia_5835338_vh2UkRcLu9/10/pdata/1/auditp.txt
$$ ##AUDIT TRAIL=  $$ (NUMBER, WHEN, WHO, WHERE, PROCESS, VERSION, WHAT)
(   1,<2012-03-26 21:02:00.703 -0500>,<Administrator>,<TOPSPIN>,<go>,<TOPSPIN 2.1>,
      <created by zg
	started at 2012-03-26 21:00:54.109 -0500,
	POWCHK enabled, PULCHK disabled,
       configuration hash MD5:
       1A 1E CE 29 27 FD 77 03 67 4E F0 E3 C4 B2 CB 90
       data hash MD5: 64K
       2F 30 65 C4 8C 87 38 1D 49 4D F1 6D E8 93 B0 74>)
(   2,<2012-03-26 21:02:03.437 -0500>,<Administrator>,<TOPSPIN>,<proc1d>,<TOPSPIN 2.1>,
      <Start of raw data processing
       efp LB = 0 FT_mod = 6 PKNL = 1 PHC0 = 0 PHC1 = 0 SI = 32K 
       data hash MD5: 32K
       BD 2E 39 95 73 7D 5F 6D 4B 63 D8 8A 59 C7 3C 27>)
(   3,<2012-03-26 21:02:03.812 -0500>,<Administrator>,<TOPSPIN>,<proc1d>,<TOPSPIN 2.1>,
      <pk PHC0 = 210.7123 PHC1 = 0 
       data hash MD5: 32K
       2A 80 B1 BF 7D 76 00 95 32 86 AC E3 B8 16 40 D3>)
(   4,<2012-03-26 21:02:03.890 -0500>,<Administrator>,<TOPSPIN>,<proc1d>,<TOPSPIN 2.1>,
      <abs ABSG = 1 
       data hash MD5: 32K
       9A DD 60 2A C1 5B 53 77 3A 9B E1 CC 02 4B A0 3C>)
(   5,<2012-03-26 21:02:03.921 -0500>,<Administrator>,<TOPSPIN>,<proc1d>,<TOPSPIN 2.1>,
      <abs ABSG = 2 
       data hash MD5: 32K
       6A EA 17 B4 C2 90 E8 C4 82 63 AC 90 12 AF 18 09>)
(   6,<2012-03-26 21:02:03.937 -0500>,<Administrator>,<TOPSPIN>,<proc1d>,<TOPSPIN 2.1>,
      <abs ABSG = 3 
       data hash MD5: 32K
       66 75 2A 1A 8B C7 35 36 83 D6 1B 4A E6 DF D1 B8>)
(   7,<2012-03-26 21:02:03.968 -0500>,<Administrator>,<TOPSPIN>,<proc1d>,<TOPSPIN 2.1>,
      <abs ABSG = 4 
       data hash MD5: 32K
       46 5A 38 97 95 BC 0B 57 E9 90 60 70 F9 06 7D DA>)
(   8,<2012-03-26 21:02:04.000 -0500>,<Administrator>,<TOPSPIN>,<proc1d>,<TOPSPIN 2.1>,
      <abs ABSG = 5 
       data hash MD5: 32K
       58 83 E0 DC 5D E7 0A AA 81 AF 96 5B C2 DB 1B 46>)
(   9,<2012-03-26 21:02:08.125 -0500>,<Administrator>,<TOPSPIN>,<audit>,<TOPSPIN 2.1>,
      <user comment:
       ICON-NMR User ID: COFFEE
       data hash MD5: 32K
       58 83 E0 DC 5D E7 0A AA 81 AF 96 5B C2 DB 1B 46>)
$$ [...]
##$TP= (0..7)
150 150 150 150 150 150 150 150
##$TP07= 0
##$TPNAME0= <>
##$TPNAME1= <>
##$TPNAME2= <>
##$TPNAME3= <>
##$TPNAME4= <>
##$TPNAME5= <>
##$TPNAME6= <>
##$TPNAME7= <>
##$TPOAL= (0..7)
0.5 0.5 0.5 0.5 0.5 0.5 0.5 0.5
##$TPOFFS= (0..7)
0 0 0 0 0 0 0 0
##$TUNHIN= 0
##$TUNHOUT= 0
##$TUNXOUT= 0
##$USERA1= <user>
##$USERA2= <user>
##$USERA3= <user>
##$USERA4= <user>
##$USERA5= <user>
##$V9= 5
##$VALIST= <valist>
##$VCLIST= <CCCCCCCCCCCCCCC>
##$VD= 0
##$VDLIST= <DDDDDDDDDDDDDDD>
##$VPLIST= <PPPPPPPPPPPPPPP>
##$VTLIST= <TTTTTTTTTTTTTTT>
##$WBST= 1024
##$WBSW= 4
##$XGAIN= (0..3)
0 0 0 0
##$XL= 0
##$YL= 0
##$YMAX_a= 517016
##$YMIN_a= -637420
##$ZGOPTNS= <>
##$ZL1= 120
##$ZL2= 120
##$ZL3= 120
##$ZL4= 120
##$ABSF1= 14.98061
##$ABSF2= -5.57192
##$ABSG= 5
##$ABSL= 3
##$ALPHA= 0
##$AQORDER= 0
##$ASSFAC= 0
##$ASSFACI= 0
##$ASSFACX= 0
##$ASSWID= 0
##$AUNMP= <proc_prof1d_extract_pilot.lims>
##$AXLEFT= 0
##$AXNAME= <>
##$AXNUC= <1H>
##$AXRIGHT= 0
##$AXTYPE= 0
##$AXUNIT= <>
##$AZFE= 0.1
##$AZFW= 0.1
##$BCFW= 0
##$BC_mod= 0
##$BYTORDP= 0
##$COROFFS= 0
##$CY= 15
##$DATMOD= 1
##$DC= 0
##$DFILT= <>
##$DTYPP= 0
##$F1P= 0
##$F2P= 0
##$FCOR= 0.5
##$FTSIZE= 32768
##$FT_mod= 6
##$GAMMA= 0
##$GB= 0
##$INTBC= 1
##$INTSCL= 1
##$ISEN= 128
##$LB= 0
##$LEV0= 0
##$LPBIN= 0
##$MAXI= 10000
##$MC2= 0
##$MEAN= 0
##$ME_mod= 0
##$MI= 0
##$NCOEF= 0
##$NC_proc= -8
##$NLEV= 6
##$NOISF1= 0
##$NOISF2= 0
##$NSP= 0
##$NTH_PI= 0
##$NZP= 0
##$OFFSET= 14.98061
##$PC= 1
##$PHC0= 210.7123
##$PHC1= 0
##$PH_mod= 1
##$PKNL= yes
##$PPARMOD= 0
##$PPDIAG= 0
##$PPIPTYP= 0
##$PPMPNUM= 2147483647
##$PPRESOL= 1
##$PSCAL= 4
##$PSIGN= 0
##$PYNMP= <proc.py>
##$REVERSE= no
##$SF= 400.13
##$SI= 32768
##$SIGF1= 0
##$SIGF2= 0
##$SINO= 400
##$SIOLD= 32768
##$SPECTYP= <>
##$SREGLST= <1H.CDCl3>
##$SSB= 0
##$STSI= 32768
##$STSR= 0
##$SW_p= 8223.68421052632
##$SYMM= 0
##$S_DEV= 0
##$TDeff= 65536
##$TDoff= 0
##$TI= <>
##$TILT= no
##$TM1= 0
##$TM2= 0
##$TOPLEV= 0
##$USERP1= <user>
##$USERP2= <user>
##$USERP3= <user>
##$USERP4= <user>
##$USERP5= <user>
##$WDW= 1
##$XDIM= 32768
##$YMAX_p= 448300257
##$YMIN_p= -720203
##$CURPLOT= <Network HP LaserJet P1505>
##$CURPRIN= <$Network HP LaserJet P1505>
##$DFORMAT= <normdp>
##$LAYOUT= <+/1D_H.xwp>
##$LFORMAT= <normlp>
##$PFORMAT= <normpl>
##$SURQMSG= 1
$$ End of Bruker specific parameters
$$ ---------------------------------
##NTUPLES= NMR SPECTRUM
##VAR_NAME=  FREQUENCY,     SPECTRUM/REAL,   SPECTRUM/IMAG
##SYMBOL=    X,             R,               I
##VAR_TYPE=  INDEPENDENT,   DEPENDENT,       DEPENDENT
##VAR_FORM=  AFFN,          ASDF,            ASDF
##VAR_DIM=   32768,         32768,           32768
##UNITS=     HZ,            ARBITRARY UNITS, ARBITRARY UNITS
##FACTOR=    0.250966925370066, 1,           1
##FIRST=     8223.43324360095, 122065,       224312
##LAST=      0,             49719,           -74153
##MIN=       0,             -720203,         0
##MAX=       8223.43324360095, 448300257,    0
$$ Real data points
##PAGE= N=1
##DATA TABLE= (X++(R..R)), XYDATA
$$ [...]
23791 -27992 15231 96466 209869 -84739 18585 -86059 18351 456742 -244243 437546 220102
23780 220102 180287 -147872 127079 251539 57392 121731 -61027 -121037 -53321 47033 38181
23769 38181 74767 -128525 28130 181941 -129149 -26312 56537 -119313 103853 162910 44618
23757 -201842 73728 -132533 -225606 168073 1598 25836 270475 -239015 173595 -71952 -339021
23746 -339021 -9767 64940 111880 118126 18385 -102626 -213029 141565 -144920 326301 -407385
23734 83762 -346682 45731 -253582 226014 -31324 28824 -179102 206575 -288941 66554
23723 -216847 -223427 -52930 83936 143221 209074 97891 -48311 112458 -26424 -16049 139519
23711 -155964 -315192 -52018 -178641 -90059 -189077 1250 -108346 -300499 183628 -53690 -48249
23700 -48249 -11775 -243775 14241 -12628 -83933 -146595 -18653 114899 -290622 -74837 -62941
23689 -62941 301646 43276 126642 48738 49497 -59684 -97428 1674 22344 -320200 56532 -243266
23676 -72116 -368541 -88900 113066 66287 144878 -108340 -288561 -350853 124048 367847
23666 367847 -11664 -165652 -53624 107714 -107183 115493 130380 -203174 -148099 131667
23655 -34556 144476 117276 -188880 111388 -186087 124155 47022 -205037 -89017 -39023
23644 178474 20162 -72091 36598 -66678 25147 -195008 -92633 -78898 -188530 58121 -7616
23632 151909 -278358 24462 -244470 177735 -297090 -239372 -99227 55085 -188850 -70156
23621 142131 -141317 98332 -15891 196466 -304129 -196121 10647 156503 293833 -143745
23610 33594 -46639 -57145 -35902 -101225 -169767 -365265 119321 182678 -221764 89266 -4577
23598 -74947 -200224 -246464 4369 -100110 -106830 77558 -23642 -65180 162562 -303205 -8093
23586 56019 -126233 126995 302541 298666 371542 57340 448352 11155 117165 -139020 242784
23574 13316 306656 156706 106905 177181 63777 -152089 272437 90937 56282 -116199 12728
23562 -118451 173202 30592 -139101 -87541 -303181 87188 -312795 -67558 -204724 -274418
23552 -274418 -23919 -252273 117814 38686 302734 74348 27127 -103329 -54140 -32038 -60973
23541 -60973 -41710 -164713 70591 -324348 -124791 -72418 33165 -35523 -23508 22605 -282584
23529 5400 -54503 42589 197477 3466 -277030 -271670 162957 -283076 19067 -66025 -8204 49878
23516 -86522 -270709 -256499 158044 -12458 -282975 -367997 -138398 21222 -279381 75076 -39484
23504 -93688 54841 202861 125257 -45757 230951 163317 -188353 218698 60319 138058 -192718
23492 135216 -26059 -349132 -306893 50042 -94573 -71881 150531 168914 -10706 67175 -64777
23480 -146767 205571 -42166 -221512 -77922 79331 -59956 -189078 -43167 255100 -73452 -122591
23469 -122591 346956 -8588 -188384 299195 352403 39708 -9756 160102 120826 110413 -69030
23457 114121 -263516 -41034 -127975 -36813 -376795 -178021 -410446 75306 116776 -206416
23446 -338016 55224 180128 -245234 229497 -147280 -136693 16780 -296503 -75107 -237607
23436 -237607 5656 -111545 80031 -175512 158132 161133 249777 -289521 124114 -132308 102463
23424 132927 -387439 -99968 -325377 70672 75692 -24513 -199015 6197 -130645 -26691 -69883
23413 -69883 -107604 298690 -110510 -74609 22061 -76748 246171 -315 -166216 -121783 -28184
23401 -79467 -63903 137228 103038 -132492 -180053 -119314 -57550 -211841 -50837 -29571 24675
23389 -31798 -258552 150154 -105630 -16321 -237796 -25321 -124237 66622 80613 247605 -75315
23377 88282 -38160 110372 -28493 79794 -88754 -55240 -49690 91097 -68481 -188950 233414
23365 -106690 -201864 258783 104645 50776 -75755 -219188 -42784 331614 -263576 -613163
23355 -613163 89340 -97011 -73105 167598 -147534 7931 17065 80744 -106627 -49352 -81971
23344 -81971 19771 273078 -72012 -206912 -67323 73768 8695 144414 -169188 -33434 -70325
23333 -70325 -202683 -12955 -186921 -52051 -5257 -435987 -177622 34329 -99266 -55571 -10613
23321 106784 97694 -164494 93556 163999 59294 -219636 -260165 -192269 36100 -188233 114548
23309 -6291 -85605 -86550 151827 -119802 305207 4393 133074 40828 -164337 -138874 300220
23297 -107563 -230042 146779 -8439 130310 -318675 -156942 -160748 41541 -56544 136650 199688
23286 199688 63468 147144 -45395 242790 -8939 -26909 -302323 1449 160519 -130699 119533
23274 -7577 -47217 217331 457046 -23140 259308 225121 24341 -220317 47466 207050 303321
23263 303321 51639 -132997 49229 12480 -369914 -323397 5569 -388070 85461 104561 40640
23251 -86820 40610 16991 21349 -158190 6615 54908 -86669 -75858 -335123 135839 86498
23240 86498 134843 209635 117927 -241932 -134491 4929 178668 -69707 3297 -59247 80546
23228 312884 -221541 -337409 32420 -122149 -8465 230961 220936 301900 21717 -39587 116989
23216 -79500 -81623 -113489 -65026 201 -144354 -61610 -146500 65985 -105647 24406 -265381 -292918
23204 -292918 98235 381 255809 -112862 -281556 -22234 299597 3462 201440 143063 -132149
23192 69072 -89345 76176 100296 -67751 340312 -6849 -189725 -16470 -163606 -282702 59803
23180 30989 -152203 282210 -302117 265206 9030 -184613 50622 114455 -68674 -261231 -201157
23169 -201157 146856 -240145 193022 -172033 114122 -79916 -115379 -208706 40185 -214002
23158 -32580 -450668 -219206 27789 90634 -131954 18350 -24103 1371 83924 55610 -11938
23146 49076 -116835 -188127 36373 -145742 107940 -195329 -7739 -35571 -4083 9659 22193
23135 22193 -250641 -248629 145686 -38060 -316468 -126221 -22934 335381 -155829 -98499 22579
23123 -149311 100438 137148 122664 -33612 -59128 33463 -193265 158599 84509 405271 197094
23111 -177316 322481 212285 -270810 -6643 -180681 162424 140390 423683 -244362 -216937
23101 -216937 196185 148827 114839 -224302 -83196 -100961 58440 -102286 -285474 44159 52947
23090 52947 22207 -38053 -51127 208852 31348 66251 -103936 125766 -102282 207581 195335
23079 195335 162761 113997 27566 37790 391299 18961 -250013 85490 -71284 282892 -116189
23067 145048 32932 13959 -220032 -39449 -121086 -147913 -237446 -34766 47007 154134 -143646
23055 -49524 -81098 70979 -151624 -250077 -130499 31334 1150 -14390 -177081 -363327 -164383
23043 32983 -240862 77568 37010 -171823 -24284 -231200 -32178 67780 -106064 442327 -98242
23031 -40375 -151290 127253 -121963 -7597 12854 273788 137887 126207 -199023 -12255 357144
23019 101160 354429 155453 68685 -156849 96352 133515 41053 -55722 150572 264428
23009 264428 -79155 -81604 -243546 -221746 -38238 128790 37700 179199 228355 -131624 32077
22997 -132563 -124577 -17856 -93356 53392 -73971 232123 -105109 190442 258741 -151821 -145202
22986 -145202 38536 -273156 323026 173457 33464 -105019 -147891 37638 10253 95121 93104
22975 93104 192330 -319961 -9263 -102607 -3404 -150591 -330605 -163062 -21030 -273673 -35114
22963 155704 -285264 -435208 95854 -137372 -192795 128591 41615 -121221 80419 -324255
22952 174841 -93359 -187293 -96275 -100734 -178234 -233950 -159849 -112486 43589 19289 -236026
22940 -321545 59066 -25502 -34323 -95457 -242892 -335739 -88703 95173 130594 150041 -11789
22928 71969 311732 -196090 79969 83922 26562 54194 102507 -90789 31464 -10035 69256
22916 164182 321434 -99318 -232882 -268952 117154 -427878 24753 -76943 -84695 115287 45270
22904 -75911 9524 -70332 298702 -21217 99553 -121651 242343 25043 158997 -55425 109362
22892 -46239 -61278 -245324 -63362 -161388 -62421 -126346 47374 -95498 -197692 -88637 -17871
22880 -105270 -132400 47054 21171 329011 239778 185985 -29568 40391 -207206 -27539 -49156
22869 -49156 -68697 -11380 -240627 144018 -33075 274402 -110785 176771 53438 -204636
22858 98225 25148 -416756 102711 -359244 -448891 -206507 96838 -40489 -267741 -173849 -35327
22846 35497 -405106 136315 5598 -239930 151551 -67834 -201505 -76206 3191 115482 -405331
22834 -265979 196692 -1179 77064 -194545 20645 9234 25705 -167792 55321 -47993 145944
22822 105004 121780 18478 125390 -184159 2226 -112802 59304 217152 -11283 -218547 331558
22810 81649 -384848 248416 -189152 69064 -203549 316431 -238703 -15829 167631 169087
22800 169087 -32508 -35961 98867 74561 252101 26761 -88449 -70824 -330460 -176339 -201082
22789 -201082 335737 -27046 25538 -294849 -430838 215029 245313 -14397 10722 38454 -154204
22777 -112701 112222 -145987 65868 14657 89552 -29317 -282286 177238 158749 216023 221901
22766 221901 44470 64513 -32231 -15621 101831 6637 -365628 -154636 -56326 -178341 -89389
22755 -89389 -58051 513594 -22118 74685 -110370 276560 -95787 -48802 192024 -23180 787
22743 33165 -16 -62219 -233992 -239755 -156512 365528 -267865 31218 544060 -58840 -116910 26868
22730 377712 -13529 -226252 -219712 -288181 -105247 -116191 -31523 -326320 -52960 133742 59950
22718 3460 60018 -474212 -83077 -258750 -252725 67902 -104067 -160897 238522 -173744 121381
22706 182155 58537 -548055 -2149 -193427 118496 -254643 -298305 -203260 57948 -262126 15806
22694 -215429 84060 -8603 94907 119269 -153756 -311527 -16044 -105693 -197035 -153338 14494
22682 141557 -266448 45076 -131945 -206708 -287373 -199022 -21544 32015 -226443 -231103 8817
22670 -430060 8108 -416939 206618 -199909 -168077 181563 277164 108902 7354 29768 -194246
22658 -146021 -179578 -37575 159706 -132632 -146068 -137494 -99793 -64758 53275 -271152 28228
22646 159183 -55491 86922 87761 -354009 -36969 -337960 -351779 -40589 -97844 149909 -185189
22634 -138849 49176 -3785 13852 9025 76800 20794 -17342 -522238 78328 -116977 127529
22622 125906 -52868 149940 -10791 148725 152963 -159996 155687 301581 -137198 -147129 -126942
22611 -126942 -246631 35598 107850 7358 -37490 -140648 -135980 -102991 -41361 -107289 -10516
22599 -280298 -309632 -156685 -58398 -28955 -190114 -170590 -104881 123747 -166045 147304
22588 267696 301167 -70040 80316 -284196 -105775 136333 350584 -142722 54522 180617
22578 180617 263150 -298611 -257141 -78803 203290 179710 1743 23666 14251 125364 177920
22567 177920 71601 -186518 -216337 -38922 131117 -67267 -274017 -137433 171739 132212
22557 132212 28204 -14130 8452 -109824 29589 -310713 44464 -78426 -306859 265625 96279
22545 -207673 -140625 45612 -250201 41797 -16995 23123 -210459 -138930 77812 -85969 -268321
22534 -268321 -84467 -218185 24327 17971 78609 -385719 -44394 -169234 -169015 400753 -131491
22522 -194056 -114954 -58600 -9009 23079 -274233 47062 150622 -265653 -220663 95607 -75610
22510 265263 2328 -54673 -115597 67060 -94655 -262876 -1435 2225 -272654 -123930 -82173
22499 -82173 -180559 70763 118414 -216936 -48107 135255 -99446 -126021 -88259 -168702 -182907
22488 -182907 27934 28731 -30283 -203099 225291 221549 45851 21676 -23771 43687 98951 -177163
22475 -71940 236025 136851 29509 -176978 -157634 -119145 -149047 -88166 -238728 -136327 140770
22463 -18327 -23766 145643 63386 140489 164453 -352615 83011 -308971 -104989 -185965 -56028
22451 76272 -87475 -111580 -133808 -214366 78137 421547 -186714 -4491 31245 -94532 -18070
22439 10588 -168563 -234901 -45275 220590 -318877 -66003 -189892 79734 -59193 -103967 4292
22427 203991 429585 17513 92039 -103169 54416 -11202 -285913 -188012 11503 -128017 3375
22415 -231688 -136660 28658 -81448 -84306 -20948 -14807 -37609 -67105 -103090 -171640 -259730 58418
22402 -210429 -57262 -185893 -175495 -104155 -381013 -227314 321574 -86189 250237 -44610
22391 -191239 225385 -65386 96671 156098 162708 -154889 -78135 129591 -82739 -304411 -43677
22379 162680 -111647 -105964 77029 54762 80990 -107002 113624 39096 -270829 46698 -104989
22367 -315462 168972 -220703 -28960 -3830 28995 -245095 -61475 -33977 -33021 -122668 163327
22355 -59570 14088 -173648 -136712 -142323 155337 -333625 25263 -76789 85861 -125441 -192096
22344 -192096 -187309 73490 265644 250347 -330469 -46875 -2624 -80889 40546 4920 -256069
22332 -4982 -243977 13389 -202008 -126005 -77887 -223385 -226299 -52355 -70438 219360 -172751
22320 -113411 -197651 129245 145945 171676 88681 -99982 -160766 143072 171852 -63710 -175629
22309 -175629 -171612 80121 105551 -316724 -232283 -296332 -56540 -296810 -157812 -119434 127721
22297 220269 124698 102683 20402 144804 371190 -24287 -124995 158790 -37057 -128494 145063
22285 108147 -68095 123552 -168634 -47217 -25117 42023 -116444 -24066 -228766 -70732 -220073
22274 -220073 -474274 219757 -388876 -208723 23692 188290 -77422 -86717 -67404 37192 193998
22263 193998 197494 -87601 277612 195394 -100721 224747 -130337 -50048 138705 -219515
22252 469 -305828 215028 -59665 67150 2077 -61770 -73196 -354296 -186817 56528 168616
22241 168616 -125126 -110133 -163926 -181846 -66208 129626 -195442 -2655 -96750 -190189 -338387
22230 -338387 -224572 91147 -17218 264584 -322709 -289286 67531 13410 -116643 -138415 214650
22218 -1205 -77188 10170 -250546 95878 -78501 200047 4552 270587 56006 -28609 63857
22206 6249 -30491 127462 28166 370402 179824 276731 10430 280559 -165432 -96251 -145352
22195 -145352 -219632 -64956 -132585 -106315 28984 112716 -447248 -10847 -171063 -79733 32165
22183 -127503 52812 -145764 84509 396362 76899 97293 -144515 4785 18022 -264546 -233522
22172 -233522 109534 -235367 42791 -440731 -326259 -10512 -133505 -279617 44415 -398624
22161 161667 -227609 -214332 196797 -47069 167714 -6865 176999 -285938 -151219 195342
22150 29690 -120535 -368489 137356 330578 -89378 -59238 214773 -128207 169895 -165508
22139 129751 -111830 231050 -431924 -15496 112419 363487 -220193 -350592 62319 157191
22129 157191 -45315 -105650 81631 -176696 -254447 -177426 139741 -123175 7513 25676 -42241
22117 226473 -111359 -208503 20157 94027 -31209 193922 83904 14299 413494 -266544 -249597
22106 -249597 -83163 -77757 78599 -105343 28206 -59381 -458245 -63920 -41654 162609 68521
22094 -24583 -193649 48636 -130508 -120696 -255461 38413 32688 -164073 -115201 284111 -99069
22082 84654 -147331 335537 -10422 -94520 164121 -113957 45394 -89403 42417 -148602 -41978
22070 -307319 27204 -239927 166822 -282842 132773 -13541 124803 87739 -156154 -436412
22060 -436412 17304 -170554 -29090 236656 -163843 -17627 -237303 348130 190754 32138
22049 152667 -130596 -337816 -399576 112753 229025 -135284 -17345 -39749 -3310 -180519
22039 -180519 -165390 -349117 -66439 -326182 -195697 -312118 -164463 24278 53750 124895
22029 124895 166258 -171509 -116145 -101185 225318 184135 19998 103241 42653 -41515 233908
22017 -85338 -134873 -110246 -234436 -209480 -72089 -57624 62756 -148825 -79611 -151470 -100129
22006 -100129 -347090 33974 -181671 -155085 -327754 126078 -184869 -214281 43229 -81840
21995 237371 135221 414100 -31409 -128932 56497 -416089 -82628 -319348 -135686 678 -53374
21983 118567 11680 26167 -127099 115127 172717 40129 177125 -71298 48177 -31032 -12352
21971 303720 140949 -125802 145014 -295283 -149320 -233208 -129403 -56410 -36210 -254666
21961 -254666 -100621 47123 25668 -74440 151267 190667 -23257 -15597 -59055 -195713 -336548
21950 -336548 72000 5825 27659 -304967 107054 -257819 -202256 52871 115122 -364375 -93567
21938 54397 -30599 -226374 87857 90190 193162 300191 106635 -175598 119054 -138584
21927 76332 -265173 35928 47726 -409170 24502 66988 342404 -160407 -187320 -377547 -114399
21915 -163767 -46627 -190528 173519 54912 104985 -313733 -262428 -55392 148751 -200422
21904 889 22047 -108750 -40545 -257719 110894 -172932 8274 -73720 79294 -317730 -135682
21892 -43726 -508189 -106523 149863 -48558 288143 202239 11259 -376697 8127 278534 -97101
21880 161939 56291 281309 20928 -30759 -54519 18356 239453 155352 -332400 28765 118134
21869 118134 -307183 3428 -76803 -359351 -50372 40037 681 -256861 -231035 -80845 -13023
21857 -243409 -107616 -243208 38982 77531 -258347 67293 -102372 -210032 -56860 130636
21846 40741 -130778 -61511 -235771 -214322 -198336 -104711 180612 -313040 7568 483632 -128094
21834 -19671 -26425 -741 187063 -319341 -135539 -89472 -118893 -7141 42275 -101543 13327 -178631
21821 -93988 -1434 -67436 -50035 8028 -153934 95446 -116574 -90147 -165781 -184819 -9843 -79793
21809 -79793 217841 163627 -51850 3504 -491715 204458 -72694 -220736 9783 398726 224186
21798 224186 196512 -284695 -42858 -86469 -317900 150968 -246306 143886 -325468 10152
21787 -268893 -369069 294797 101863 199207 288742 -128190 -186122 143700 22965 -372785
21776 241221 -29433 -168362 34149 -395872 -207538 141261 16537 -332414 -37571 85318
21765 170071 126828 -215120 399523 -74821 160018 91265 -10621 -137479 -114856 -180043 -281124
21754 -281124 82980 507786 81703 79228 -68455 199121 -96395 -152934 -93268 280855 -262979
21742 81551 245521 202458 -83635 -259111 -33517 -364115 -178159 -118183 -100856 -228267 -175323
21731 -175323 -82094 -68678 289138 204460 64059 18056 89704 -87211 -181245 312055 217140
21720 217140 146810 -102548 132588 187888 -58390 -84813 -317924 47769 -2439 258048 -76477
21708 91401 -38427 -44940 -353031 75597 18520 -350285 -162496 -92262 -44340 28403 -335601
21696 -261951 -184690 -121659 300514 -39854 -286687 126470 -18845 -191138 73908 215062
21686 215062 284602 -23967 -214745 -224596 -238974 -85122 136476 -91274 -52807 105875 67466
21675 67466 -230538 -442014 -179672 -34624 -251608 4314 250788 -157564 -58391 -218100
21665 -218100 -325259 -50633 31564 89198 -46939 -204495 70739 -187033 -284427 87778 -10113
21653 63105 -132086 -11227 -99550 -109880 -146533 -87535 11677 -191731 157355 -116226 -175397
21642 -175397 -63605 -330181 -259419 -187743 -211935 188531 -10316 -721 -185358 -233432 -274359
21631 -274359 -261849 -83661 -50427 53678 -122333 -159016 190870 153628 102453 21050 342107
21620 342107 -216168 332534 -109605 -36482 -247383 -89425 -144455 69215 -48000 134692
21609 -132931 278089 313987 -288456 54959 105163 -146972 -177158 -192364 -171461 -49680 -211448
21598 -211448 -62986 70396 -84125 -226007 -15101 119937 -189412 -34571 138370 188944 -402310
21586 169639 -253949 -93741 -135286 133340 259874 -144403 90151 -157903 -133828 41600
21575 26806 92993 -140857 -130538 -22898 64822 109648 -58637 117333 -612 -65181 -134791 -526
21562 12760 -123625 89399 46652 61680 61126 82941 -53335 -108036 92444 -39810 128650 -50338
21549 111208 94530 -243223 1568 -11218 -311473 -117496 -84814 -228612 -200267 83524 -63142
21537 -37844 -188612 33903 7529 -237637 -4527 -329929 -2879 -57040 56145 -138777 194891
21525 -68399 238860 46724 -183390 -328146 -23018 110886 138458 -149159 -44659 -105427 -280136
21514 -280136 -145286 161941 96042 -139285 -205774 -187300 39634 108433 -80227 -251080 135359
21502 -14741 -26218 62718 106327 -198095 -173202 -67367 274702 82127 -179661 22726 135511
21491 135511 126861 -54435 96055 -17570 204256 -15880 -47179 16605 -71355 46733 100551
21480 100551 224002 -91576 92760 123815 -120924 -165631 -56993 31356 -777 23225 -267481
21468 -105154 203230 113943 -145548 -409492 112135 -251843 -66137 574576 -27775 -26850 -522670
21457 -522670 -151319 33944 62792 -30952 -454115 90415 118224 -190354 -90944 -46009 -132471
21446 -132471 264033 104253 -1077 123582 -3079 -192294 84315 -249225 98279 254889 -292409
21434 71893 -335577 14980 31985 -1925 -84473 82391 -40572 -234108 49353 97591 369176
21423 369176 -114270 -19928 293883 231374 220103 198531 -185295 52455 -186565 51434 -105193
21411 -26705 -55486 219175 -105610 21162 -182907 21067 -67076 -68451 -123937 165649 23853
21399 37800 -164746 -242000 -66702 -38746 -73558 -81303 -225252 -216852 -358392 -170034 22271
21387 -356656 125212 -55769 1467 -212589 -73456 -235262 112297 -137624 44255 -61510 -252873
21376 -252873 -50127 249658 28939 31625 -45592 -415158 12136 93426 -163538 -150078 31386
21364 -49777 32274 171821 -303811 39461 225194 -190621 -255635 -273425 167294 79356 211601
21353 211601 -37408 -141108 -12358 -45697 49378 21020 64473 -147418 -111560 -120963 -361583
21342 -361583 123031 73063 -284312 56701 -160764 -304962 259161 -77504 -81937 -287 162903
21330 -447680 -165275 94099 4836 -253382 -146238 -263169 31018 -271071 147585 -76255
21319 -235863 50102 -426296 222993 -291232 -244259 -168711 74075 28113 -144447 7826 66258
21308 66258 -45857 120153 -152796 -309730 -76196 143447 -33339 47698 229641 289507 -60971
21296 -162199 144926 -116352 121116 96817 -245237 -4173 -208181 -21831 1060 -64426 335901
21284 133139 -96895 -193800 -271934 12638 96944 3031 -70549 -245831 191846 -401005 85890
21272 -339647 -4997 -186276 -164478 10523 153263 -183696 -333466 146693 -227844 -269153
21262 -269153 -65989 -144035 -104610 69697 -74374 -108949 -469758 -86251 -96774 135584 -208329
21250 -78769 173286 -97454 -145167 -18218 -83730 -59157 -148888 -193890 205633 315115 -411137
21238 139169 -61950 116090 208098 22699 -120856 111301 -33289 -20694 -18047 -230111 -101687
21226 186842 -68356 122204 -317049 71880 -176691 -76325 -134249 -250630 -202284 -175451 -234983
21215 -234983 218497 105012 13474 90618 233980 -42640 23715 -75866 105033 -321273
21204 123826 137549 -181312 -95489 -195628 -147927 -48485 -358592 1673 148236 123884 -230921
21192 2353 86121 21428 129333 -174004 160408 -135714 -318686 -146472 114226 296389
21182 296389 -137801 -59971 106708 -135777 -154060 -95323 -69743 32694 243530 -149760
21171 28253 -266633 -5486 129284 -127833 -389114 44740 -168141 107163 87069 -98403 -149686
21160 -149686 -243351 447167 -87931 80048 -124357 82001 -84100 -280039 48497 -105192 -61657
21149 -61657 -83230 -144573 85205 -221756 208424 147090 89125 192497 -174117 -65563 205622
21137 -152556 148438 -119412 -116543 -153715 -230639 -43334 66664 -140293 64537 -178960 -528292
21126 -528292 -331293 -181781 -12793 -201233 -121673 287399 -226374 -78849 156165 185551
21116 185551 108897 -229123 -123446 -51710 -286576 -313330 -109594 -354891 149062 -10047
21105 -57812 81438 -118239 17470 -143894 130384 49476 -282929 147295 90115 77770 -120128
21093 -173276 81720 -122327 116557 -206380 51358 11249 52460 -24751 -131246 97309 30357
21081 -363598 -89668 135530 158949 -180497 32638 206613 -136233 -163913 -105294 -187415 90913
21069 184287 -152597 127032 61529 41217 -261084 -336900 6291 -310679 -190598 65837 133570
21058 133570 485130 -23263 -97285 -59510 -106030 116572 -59922 -2589 -21287 -357200 -363804
21047 -363804 -93605 155594 -120308 257793 -291728 -187703 21474 -292952 -35349 -83849
21037 -83849 -225280 128636 149208 -17484 -187530 -346806 -321255 195527 -23913 190577
21026 38383 38259 -304359 -170113 144919 147184 174844 -300580 -87027 -291719 41090 53285
21015 53285 -35696 6824 -211752 -233391 51958 -87076 -166448 -51293 423603 -54993 123175
21003 -116967 -135006 256596 485244 -74992 -269761 -123704 -119520 106432 206 58120 -31420
20991 259032 143321 122535 49103 103386 -1791 -91076 -142467 -217051 -26735 147660 -341886
20979 31924 90680 34725 72767 200560 192678 -114710 195820 -200612 -308789 -120740 -206815
20968 -206815 -30610 -435443 147296 6417 94311 83499 48127 -301082 -25597 240048 -122772
20956 -45867 -2540 -69571 -121240 -307033 198631 219474 -73107 176472 -369856 -30746 -174482
20945 -174482 156949 10584 -41599 -65510 8850 -35828 -25879 82795 44142 41904 -17780 54728
20932 39316 149693 -132278 -124905 547503 354772 39057 123568 -3945 233139 -82442 -97513
20921 -97513 -35010 89151 -227383 104209 -151674 -54108 95615 -57057 77630 -305929 -66336
20909 -910 -73548 188145 36522 -55528 -471368 -94980 85656 -129200 -360145 -120359 -405437
20898 -405437 -60306 -361378 -254486 -300447 -151654 427949 -214238 64265 -168756 -310179
20888 -310179 -250962 177467 -144326 155556 -104118 -33844 -34699 158344 -160630 -408855
20878 -408855 35746 7600 22383 51598 -72642 115528 -228976 -259744 105212 -79909 -59923
20867 -59923 180687 -157701 222970 -172175 -166759 -20484 137553 41174 -78205 -169105 -151905
20856 -151905 34142 1859 -217180 134610 -143627 151139 -134294 -587627 -121702 -511723
20846 -511723 -202616 69436 -60198 153157 -56345 -292064 -83679 -278389 61561 80961 136926
20835 136926 125644 104160 22915 -40184 -65837 61924 -101602 216749 -344813 -66720 139075
20823 -39585 -187552 16672 -138503 14057 -46517 -34236 23378 -55967 129400 -40624 168476
20811 -62856 -285865 -448371 -144091 6440 109518 -189131 141104 -170560 26333 -104285
20800 -14655 84545 54963 -230064 -403097 -149037 -214173 67759 -471106 144092 -95010 117711
20788 40078 -235644 -180121 182032 -216329 90745 -294251 217924 -422224 40682 -125884
20777 -35035 -86842 -40489 56492 -230429 48920 87816 -207054 -82926 -59734 -129205 108039
20765 -168222 -5049 60933 -36514 -356705 30317 91933 -199119 -197154 -369305 6094 -217842
20753 -183615 -443114 256534 -181643 -65862 -423285 -413978 -274461 -139891 -219304 -186204
20743 -186204 59967 -275483 -23972 -132036 209005 -25112 6472 105799 128431 287713 -123787
20731 331363 -193269 250232 391023 -25568 -30245 -135739 -204426 -248331 -63576 101670 -167089
20719 -174496 5425 109513 209356 22162 130468 -156572 24252 17952 156355 -43447 -151507
20708 -151507 -24071 -162420 43768 -243536 176611 -244825 359900 -205952 -341546 -247395
20698 -247395 -276126 -256579 -59424 -103576 -229441 35458 -42982 3873 -114478 -104158 111852
20686 -149889 99799 190153 1496 285028 -172116 -135561 -308111 -115220 -55992 -6140 -97404
20675 -97404 -168321 -19004 277053 -195184 -274952 40659 60634 36609 59693 -253659 -142116
20664 -142116 114368 19996 39322 149767 -100730 -140011 -345751 -59189 -371505 -260877
20654 -260877 -227769 111061 -169087 136353 -42066 -116655 -68100 -188540 -128329 -217440 -213037
20643 -213037 -179445 -17952 -194067 137022 -168983 -147663 -85854 60877 -178711 -46560 -81708
20632 -81708 -294316 176246 -199226 66727 325507 -155529 -25072 -97213 -15562 -40267 60967
20620 -58139 -239160 200379 -215371 -77066 -295397 -230603 176913 52229 -298462 168838
20609 205088 -108723 -202407 23488 14707 -9484 76689 -45104 163730 -136960 -129147 -309084
20598 -309084 -212029 -142689 122365 225589 34616 224741 -148041 135473 -240632 -78866
20587 -261178 -390648 -247916 17509 -7895 -74308 -121281 290566 -29506 -66741 165125 56981
20575 236198 -242597 -392603 -31956 245797 301430 1273 184729 -60490 -198313 12886 -63280
20563 163693 -56600 -212615 -261245 -137640 -196775 38878 33969 -158702 -127213 25874 102616
20552 102616 -191950 -178909 -205085 -36155 -49208 -3627 157314 107152 55092 322684 -110110
20540 70686 -217553 -113345 -42035 5624 60212 75212 180312 73141 -226575 -60817 -226365
20529 -226365 -65706 49407 9924 -149510 -20115 115076 73449 -229982 -217674 -76343 -43680
20518 -43680 124025 -118496 -487906 -93316 41692 -415972 -59535 -96578 -119735 222545 -102500
20506 73130 -328904 -22677 94027 -201655 -169571 -160632 -203066 -10522 -293650 297280 -40600
20494 154183 -173654 -279486 -451855 -373515 -35443 -91425 151104 -155046 126711 -220100
20483 53514 -99162 -81963 145813 157580 184384 -144102 66729 -132467 -263031 -387359 -59373
20471 -124814 163335 -185868 12933 -105573 -56849 -70757 113894 -81247 -47483 245272
20460 -330378 83613 -77467 -52362 -197985 -38329 -153235 41392 51824 189599 -167169 -179541
20449 -179541 65120 18285 31143 -58334 464334 129198 -130989 -51248 92581 292976 -168527
20437 -90007 11654 -114385 -24307 -10156 82227 26568 -165506 -159560 -264454 -89269 182961
20425 178708 293073 -44170 -16202 12999 27671 -18560 -304518 127742 -85826 -67815 34583
20413 -49143 280977 -326491 -63441 -9541 -108667 -224600 -122610 -63126 13545 -224201 -181948
20402 -181948 -102403 -130254 -145488 -49723 -134386 16118 7535 -341703 -179640 42793 -339113
20390 -144070 96073 -173657 -273098 23535 -286984 -8188 -257243 -126149 -310262 442466
20379 233997 75096 -3263 -259316 -46285 -322763 -33140 -216731 -318221 166295 -196773
20368 157076 -283216 -206312 8383 52470 8133 -68058 -348614 -131049 -163760 23174 -8001
20356 -119497 -67076 -420819 13165 177574 -257615 -213831 -21288 126996 76268 -21172 165926
20344 244142 -63027 -126600 -356039 -172045 -69048 -186266 -40136 -288349 -274785 158848
20333 173534 -196721 -6729 -11862 -167618 -111277 264369 101912 22890 -261315 -157477 -115241
20322 -115241 -422873 -267777 -761 -47464 -93730 -94308 -167496 -47582 195070 -110382 -211504
20311 -211504 190874 -137997 -13157 -193849 163931 36350 -291979 48567 137864 64533
20300 126030 -92233 -183892 -252996 13164 16787 55451 -101096 -210128 -67661 81468 113928
20289 113928 -192064 -239385 153974 -110929 -181204 991 9790 -4333 61006 -313667 -119917
20277 -5334 64693 44842 -73706 -5028 -66658 -124676 -77844 -313434 98653 -75174 -188669 102409
20264 -9553 97315 127700 -74953 -117137 51238 -278296 68357 134366 -125879 2351 -22457 -325198
20252 -325198 262181 33649 -204527 -3246 -75978 59882 173464 39841 -59866 -221593 208848
20240 -28753 -118741 38788 -171947 -218242 119581 -520633 -98234 -12276 -234762 72307 40301
20229 40301 -86 -145031 -127048 -190404 123334 66802 -132604 102003 54166 -102870 -123064
20218 -123064 -514691 -203750 -41350 114253 -262951 51225 -241253 73627 -192436 -140643
20208 -140643 -326423 -232741 -183262 -100256 -64740 20140 -142547 116169 -362676 -489582
20198 -489582 -31290 223382 -15432 27808 -198562 -198861 58485 -109198 -56438 -304298 -123238
20186 -36942 -260819 -15984 45554 107969 -120906 -192640 67647 -3901 261626 -492931 -206856
20174 -8004 49367 -292429 -154071 -6261 -297992 179229 -159505 -223472 36364 144924 -190682
20162 -193309 497179 627 161838 143098 486255 -124397 2004 74513 108436 224133 140614
20151 140614 -279591 18774 320259 -48067 16239 -328359 -327144 -202152 -300979 -238373 197055
20139 49424 59060 127399 229230 -34390 159716 302456 -198502 400182 -52856 617059 495738
20128 495738 -133570 401629 101875 234214 76866 176299 163004 653252 297659 127274
20117 233657 91864 215863 -310083 -281249 -105266 -36622 -44005 -211924 241551 164178 -293088
20105 42057 -407688 30454 -76242 -406174 -73653 -127855 30357 -68227 -286888 -249694 -217417
20094 -217417 207014 13660 -142875 -450252 3086 -139094 -114230 -16093 -240332 -160921 -77012
20082 -183000 -222654 -354759 -36096 -65194 71696 -253421 28012 -89868 -95086 31062 -237963
20070 -8598 188352 -161099 -98040 -187474 -539622 -82128 -184376 88343 -301314 -81729 -18541
20058 37402 -83677 42822 -32787 -378568 -462046 -23320 -63325 -194059 -5280 -425289 -195988
20046 7070 214606 -128252 91536 -73796 -377359 275993 49231 94411 67539 -129380 243722
20034 157022 -101568 140117 -49895 -160932 -209429 -49197 32465 -118134 76274 -134083
20023 -122960 -66839 -78128 -138015 105132 -115780 -47086 -2409 15898 -118972 149415 58838
20011 -286613 -93973 105337 299153 168673 1050 190158 -110591 -162916 159579 68306
20000 168881 49656 -57183 94599 -42234 -32131 -68909 134114 -206920 5877 25964 2494
19988 73827 -36556 164784 26658 4890 62649 171060 -59674 349395 102382 -10754 523965
19976 278309 -251589 4154 246736 264235 257197 -248352 104695 199078 95514 6934 -135407
19964 142247 -120985 -331274 241530 -112507 -38148 27295 33507 23886 247071 -57728 97224
19952 -1315 -283639 17498 24110 -6319 353144 95212 15098 51065 -53831 225206 -62833 132611
19939 241561 24661 122858 104992 382241 249197 -93511 10309 31071 121562 -21259 -17188
19928 -17188 -273141 -289441 -210519 -71242 -193808 -41621 -91656 -5117 284985 -116398 98767
19916 8963 -297309 109423 -107413 -46044 86745 -233845 10393 -256770 -172497 -80118 -187988
19905 -187988 -18808 30624 -144617 130752 146806 -267760 -173568 249897 66203 -113572
19894 16287 -218716 -155856 -85703 -168316 35875 -394565 -354974 120523 -356632 86690 145264
19883 145264 69251 216168 42904 -426536 -59912 -149413 -218374 -109724 -353799 213088
19872 -268742 203845 21821 -511507 114516 -245296 -621478 26969 -426064 -226795 67287
19861 222347 -52274 -213271 55577 131270 29473 -213607 19974 -28990 33059 -127724 -262495
19850 -262495 -137062 -77365 -361214 511309 -120169 -216850 -364104 -384159 -93969 -39794
19839 -150216 119605 -77540 116871 -23263 214025 -51385 -42896 97440 4524 83316 -27871
19827 -169043 78359 -24814 16607 239382 -447055 -301859 -455520 40151 136967 -105638
19816 -5107 36499 -21841 17679 -135765 237842 -298678 -86982 -165517 142682 -34870 59990
19804 -272811 -30991 -530 140281 -79818 -354234 -158518 376441 -63595 -110710 -191784 12800
19792 216598 -116906 -140843 -8992 -202354 141126 -219065 116293 264313 -134551 12009
19781 -151044 -50347 -298074 -119449 3270 125705 45749 -179839 85554 -129678 251556
19770 285480 145514 15072 -438810 236372 -44277 -167671 -19007 33069 -134288 -241567
19760 -241567 -110863 -171930 -307652 47519 128262 -168793 -157845 -224433 102772 -210627
19749 -167657 -32350 -4519 198408 -424108 296343 236674 204822 62153 -66216 -120645 -281388
19738 -281388 -349745 560 141401 -27577 -329165 42200 -26869 127180 -6712 -304787 -235955
19727 -235955 -231630 -959 -264285 -1093 -120165 95889 147574 376519 -133375 7906 77805 226650
19715 226650 464778 235833 341679 526644 110426 60338 -133669 -129168 155328 5200
19704 -95221 17667 759 -137681 177122 212663 -152803 -167757 168113 149514 180920 -73430
19692 -126674 119637 297197 -217381 -338678 -391567 186091 37708 279898 177687 341341
19682 341341 381795 1929 319032 237678 -20503 237773 103146 31079 -205636 146097 -129930
19670 -53870 -175576 -36319 -303105 -236408 -208081 -274848 -16843 45428 68812 -2228 189604
19658 -62541 54400 -34185 -154985 -162068 -101557 -270251 -86062 -164515 -221231 -156457 -262720
19647 -262720 147020 -15191 -131924 -19829 299578 -16425 -24921 -67095 -102633 -415797 -25889
19635 -176936 33181 266712 -379125 82854 -158040 -176886 1570 -33017 84750 33192 -51099
19623 41700 -255251 71024 171276 -73997 321245 165075 -160739 4660 25647 -116557 1187
19611 -131763 -173994 97611 -27055 6514 -3692 -232035 144405 -307289 -24510 119263 -22899
19599 -69088 199637 -119824 232238 -108032 19053 23958 -68727 -162988 11519 32515 24790
19588 24790 -168363 -187579 -326637 -290830 -51406 -88853 18419 191984 7531 248734 -247762
19576 -313764 73814 -388913 -17257 211447 88062 56610 117304 -482861 -160848 -185736 -12517
19564 69501 -280804 -375467 -107248 -146568 -318764 -133142 -95274 159261 -65396 -283787
19554 -283787 -212552 230500 -162741 -167698 -206139 -287600 -209 -56830 109990 -120107 -153475
19543 -153475 21026 -156738 184127 -81763 285877 -299670 -450958 150558 -190447 195097
19532 29838 -313479 -82070 -273997 37922 211095 185134 189935 122206 -392262 -212448 29392
19520 39058 -147248 92077 -170259 233280 147987 -83339 4085 -146375 -39829 -274016 -561197
19509 -561197 133493 226408 240168 -263276 36252 -333267 -48167 -260789 -94817 -178497 -157138
19498 -157138 312462 -115753 -177748 -44225 -41828 106822 12061 15514 -286559 -71216 -79028
19487 -79028 33873 -127436 -95056 -175807 -8111 -133169 -281246 -9123 -129754 37945 -120887
19475 -274505 -232150 -17635 -224197 925 -154678 15036 75500 -114643 79554 -106264 -99052
19464 -99052 -61954 -199977 -300745 249435 -395472 -495191 -294498 33699 -178258 -216975
19454 -216975 76406 -47060 313955 -80634 -276506 147226 389450 -70699 206764 24259
19443 -164476 366211 302419 41938 -147151 -322303 -191297 121519 203919 175017 10202
19432 94234 185825 -298331 -181766 -144228 155203 -76253 145734 -189008 -77501 15089 -251850
19420 -15372 192192 -332527 -14933 -16760 -199125 -208461 -110163 -54087 -159584 -112843 -76859
19409 -76859 540 -103726 145892 -250914 331138 -18556 -221025 217830 -255247 -113692
19398 25825 -40296 -2180 -41949 -3422 204665 -45825 -175536 -15257 -52673 -221065 -197206
19387 -197206 -17461 -43103 -197727 -112862 292164 -311942 254585 -142375 33998 115260
19377 115260 -55179 -379090 117012 1867 -277423 -63430 -32953 -58561 -188096 -120343 -200848
19366 -200848 -53870 156554 -108359 -81259 -503888 -32458 23416 -253609 -168849 -145281 -59441
19354 23009 -89153 -187261 -92842 -16402 70652 126164 -359615 -35572 -283819 70745 145022
19343 145022 46617 -41138 -67068 88943 102417 -53154 73038 312981 -54575 -400249 14369
19331 38294 -163985 -272452 -227123 -34578 141050 144417 -163727 205059 -395435 187907
19320 104874 -326112 -147008 -88539 -98739 200428 -172545 54685 81043 -97930 -693911
19310 -693911 100072 -35780 -3673 -134448 -105001 -61904 -138 7211 103575 -102312 74100 -198993
19297 -58391 -490205 424851 -54521 -178354 -173502 -120520 29650 138889 -52886 -204829 -227278
19286 -227278 -68551 -137928 -482276 33649 -232818 -308769 -186504 -113840 220492 -214634
19275 -68938 -210415 53272 -12167 -64370 -150725 -436498 -20325 -96050 -13464 -3776 -196698
19264 -196698 -164779 -400795 -70702 59671 169072 378179 -135632 -145683 -300553 -440502
19254 -440502 4927 -79360 -199242 -387306 -54653 -296511 -18136 191102 65996 26053 -249762
19242 -393879 -286088 -162207 -141462 -125157 -231113 -127198 -43755 140278 28048 -77558
19231 -81213 -151538 -76047 -150871 -126547 37193 130925 -255403 112038 101009 -32362 -66905
19220 -66905 83478 -344666 -15179 -19123 -16329 225050 2005 -181613 -88826 -82466 -76573 93369
19207 182570 118972 77419 -9739 -63075 167034 -263610 106435 -212500 -76644 -72229 -181341
19196 -181341 651 339388 147955 -46996 251175 -181803 221023 -76497 -230324 -138219 65573
19184 -234362 -81595 -179517 -66257 68107 -142168 -70171 -165673 6574 -99618 -95688 413056
19172 -166732 233897 202021 -36263 -111339 67835 -26676 335622 -113319 -125672 -93383 265400
19160 -87006 -163832 -145769 -198320 129777 -20126 61163 73985 55348 -199078 10547 -50977
19148 -334965 -129664 -258769 3094 249306 317611 -173903 75353 197074 -71294 67656 62305
19137 62305 151736 -229273 -80922 -52599 -128503 -88812 -177968 -497694 52224 -23014 -169490
19126 -169490 -156643 304034 -165770 135886 138397 -290683 -122106 2599 25759 59066 247410
19115 247410 -176647 -10920 -168253 -116594 34867 -248215 -76418 -10308 -12067 -31700 -222012
19104 -222012 68254 145472 -115422 69451 -306127 -395846 -146600 52837 112720 -70070 -81338
19093 -81338 -176633 -279728 -75097 -250122 -321804 -243002 103080 -410346 -121682 -366695
19083 -366695 -218695 -233639 -18294 -131184 114619 190530 -186813 -37564 121039 213503
19073 213503 -275427 -134148 -65028 -127815 -186117 -76867 -322247 -42680 -4908 -103673 -172949
19062 -172949 43249 -323221 -223727 -146208 10470 -257609 43425 -77203 174995 61591 226851
19051 226851 5272 -221929 95177 -86422 -152061 227893 215910 -11674 246239 -110100 -104241
19040 -104241 16487 45221 393833 -236351 -146016 28626 -115849 337733 -249710 -182429
19030 -182429 -73754 -4356 115513 -73005 242371 -519354 -24283 -617283 105656 -149277
19019 -71090 -108251 -65672 -358992 -196085 210944 98264 -111770 -141577 57258 -112217 63233
19007 -7404 122150 -93888 125127 250122 72235 201922 -46500 57025 -188626 8668 -75746
18995 -335268 -208670 427147 -78931 84258 -78083 -192130 -77151 198932 197276 -140833 64945
18983 -128882 43606 45397 97096 77068 -79457 -299828 -158342 299255 -12852 232869 -41606
18971 -163213 20600 4549 -34439 -331509 -239023 36792 204971 -292542 -36689 -262679 34417
18959 144742 155082 176426 198928 457910 -7039 107630 -220495 53588 -294281 149084 125808
18948 125808 166997 -199732 -211394 -132687 -307351 -425848 160149 -90956 -47411 193525
18937 250417 64573 -132739 64756 -234998 220263 67409 -166912 -309253 -132850 296445
18926 -15871 133867 -278650 217840 -287449 -29595 -335140 -123319 -310422 492341 -25091
18915 -61616 36217 -197070 -172168 -122042 -129429 -44797 9939 -166310 131607 -106715 158148
18903 45893 -112117 -120659 -146457 -199092 -79048 114305 -232179 367823 -83299 275084 494402
18892 494402 649057 241294 227967 243484 449272 71555 -357601 -91300 7217 -104700 79136
18880 -466973 -33727 24678 -235298 -67499 -79230 -64506 2349 -60454 56262 114585 -219215
18868 52034 -104089 10393 143993 9488 -41928 4053 -129410 -107507 -77624 146295 -52013
18856 143299 -186772 -79287 -442898 8706 -236912 -527647 120945 33930 37367 -312481 121400
18844 159520 111519 489845 -5826 -235767 138190 -74090 -111564 -21870 -95279 165011 43566
18832 101548 176018 145300 66732 -57186 -233409 171991 8216 36654 36718 -28140 54279 308113
18820 308113 -403685 -392129 -27502 -169602 55873 -52648 -128333 3495 -26809 -205238 -157681
18809 -157681 -176797 300338 -139420 -33686 -1055 -266096 105966 50153 197716 48756 32243
18798 32243 52358 292270 -61433 -23130 -81497 38983 218930 -100969 -267318 -57125 -122533
18787 -122533 -271676 -8882 -63106 272098 -221605 -378355 -12818 -102333 -236869 -213829 43892
18775 47911 -264737 290626 -55706 -470190 -113576 -123262 -32029 -195797 48588 176296 -207015
18763 -271839 165544 95348 -18770 178444 -175145 -486187 -36689 -60489 -65850 -5277 -79816
18752 -79816 -156802 -2030 81203 41928 -4181 100503 40294 -194243 -68562 8552 -244324 144025
18739 -187872 275227 98135 145781 -64378 -145534 -36231 -21490 18331 27461 -257551 -86211
18727 13323 -68563 -316684 -246135 -219987 62546 117168 48782 7666 188779 -146171 -47124
18715 54476 19960 -77671 371176 150960 -92310 -200407 141202 157094 189213 -34954 207753
18703 2781 -106544 125250 -167102 130820 -152794 -32362 -209076 -239166 -142588 -120258 -366684
18692 -366684 -129234 -120000 -53311 -90522 -99804 -221508 -149829 -66695 -48427 -47606 -44762 -192286
18680 -192286 177597 -34131 -385121 -239306 -214726 68140 -374137 74521 -168770 -365281
18670 -365281 165709 152320 -267442 176669 -172178 114075 -12786 66823 120371 -36571
18659 -47106 -269553 -310907 -108309 -52417 -242527 -2627 -133153 19629 -5837 12626 -64390
18647 119894 15914 -61093 40814 -100011 -54464 -110506 -188534 -30661 -283448 406033 124108
18635 -71259 58067 3881 -53000 67702 21973 34649 180050 -293451 3683 -256452 -195942
18624 -195942 -39830 176126 -5551 -194636 189173 53068 -87865 -303166 -206644 -33241 267315
18612 25652 -144837 -76746 -113005 -28859 75359 46011 57403 128725 -66668 175801 -157044
18600 -417726 35294 103637 44140 19048 38083 -132689 -166241 60586 -60516 -113312 154214
18588 -127778 1644 -234975 -275285 359335 -191146 -417223 176614 120448 -20461 82928 -296007
18576 249955 -299485 144765 268683 129776 -112834 -250304 16855 -64733 -190180 204042
18565 -26267 -82101 21147 -6875 -52957 1047 203267 97277 251895 209907 -245162 -404558
18554 -404558 72415 51923 -120721 -304435 -4444 15958 -126564 95474 -226543 -198719 58516
18542 -39335 -155008 -221340 7560 108706 58220 -408777 84175 248188 -149524 -447688 264983
18530 181987 -137686 -194607 -144202 -421570 -256835 -144544 -94351 -209988 -82509 -229135
18520 -229135 133509 -11377 -217326 -209087 -30686 96 41626 -279430 -128394 -132017 -122783 4320
18507 3269 102347 44145 135312 -109153 -19499 -10509 5280 68661 -145569 -192266 -8561 -253201
18495 -253201 1020 -376334 131526 -254254 -570377 268876 -206877 -24560 -53638 150794
18484 174698 -107483 -94084 -277252 -5669 144787 38383 97080 32357 -23553 509073 -161450
18472 -50765 9255 308968 -235671 12099 178649 339721 161831 -187193 133191 -209490
18461 -197004 -117336 -181936 -106449 40857 320531 -268095 191100 -144368 98626 155378 -46991
18449 -39682 -230287 62112 -88305 382099 -33488 -345793 378504 -255873 318746 -155490
18438 23240 75255 23002 -74296 246886 -246779 -113644 6495 -15070 156510 214617 -145829
18426 -66804 18281 -17472 -148319 44452 142841 -132004 -92 -181699 -92553 -76615 157512
18414 361073 -170512 -128928 155221 -43702 -151556 -108624 -181705 -142269 -66546 -250078 -88381
18402 -53396 -89708 -1147 -135189 -27575 -41545 -66531 381194 118313 113451 71181 251536
18391 251536 222222 151972 -41641 -227544 -41458 65502 66568 -39517 -266275 -25952 162047
18379 -302943 -70534 -267448 -76835 -123289 144709 27905 -148664 -43272 -243544 -204693 -46400
18367 193636 99406 -138304 -70157 61143 -435539 78173 138200 185287 280759 161867 -106675
18355 -185480 52105 -44005 40827 14735 20251 241610 258933 20526 -184245 -14971 -82240
18344 -82240 7405 -438 191810 -210160 -30999 -35476 98705 367419 123637 10457 -105756
18332 -253903 318464 -115903 -66870 167439 -20457 138081 -65848 -293945 -31097 92028
18321 -38503 -169622 -147309 -145747 31844 -413217 -91878 79662 12367 -82377 29997 -60775
18309 -137318 -257184 -9434 73316 276315 14805 -55283 -178678 -28356 -24264 -39989 -32606
18298 -32606 -1143 -48689 -64632 -76294 -100201 -382095 -230916 -89626 -215870 -14446 -49782
18287 -49782 -182633 -338883 -25133 -253780 228012 45594 -19146 -35834 -262869 215451
18276 82550 -43100 52770 55357 141549 93252 20610 -125208 184323 -51176 -102335 397542
18264 69311 -162290 7458 -106032 -13781 -249923 207874 320977 106447 -232011 -229621 68073
18252 59946 23207 -11272 81899 45035 -63003 -115919 208579 -65702 119114 -22664 -53824
18241 -53824 -217534 71419 -3120 -135868 -163769 -248140 -198942 100709 -5493 152303 -128209
18229 -143171 233573 30779 246685 -242981 43557 487079 82188 54807 -6474 -13178 226888
18217 218996 143353 -346864 -301453 -503821 5203 -49631 9903 -155148 26630 -35918 178218
18205 -6373 -216931 -57104 -86069 82953 -444629 -20203 -56767 67302 -185796 -191885 -68912
18193 -261900 261524 -201384 180898 -123857 -36275 -110710 -21626 56403 96707 98058 55334
18182 55334 -170904 291547 36386 -97452 -172325 -94863 -97896 206040 160141 -61251 -229112
18171 -229112 -48565 134309 -253779 226697 -349916 -176117 97628 206900 108251 -197369
18160 -71413 -197518 -86949 125914 232472 146417 -115261 25968 41497 5674 8687 -70420
18148 84636 -11151 -72319 -175301 -182722 -90358 -21097 58242 91332 -325072 -21739 168171
18136 -407078 259352 -202659 70466 -146057 -134319 -142739 49418 -159483 -129019 82618 215622
18125 215622 -242257 -11529 172496 47951 19818 77961 -79196 97700 108818 297108 18040
18113 -255889 39398 17366 -307212 17112 51944 159297 42548 -160990 -156105 -181244 90476
18101 125062 -93052 -58555 46852 -151157 119165 -46251 -19142 -274526 166439 -128365
18090 176642 69529 -167553 126299 -176959 32039 -13667 -129404 45089 -239404 136018
18079 8244 -125946 -109334 -315563 75608 376779 27108 -297954 29124 -125145 196481 -266062
18067 -288510 13205 -264324 301674 -228290 -165671 -2545 50830 -141685 211949 -119291
18056 106673 -177488 -26947 23488 275035 49600 6068 -152593 -196607 -37856 -19300 -357572
18045 -357572 -384492 -405165 -63508 231351 184837 117339 223605 -191114 -171190 -138462 214335
18033 -368054 -55448 -160322 161936 65470 230833 -45870 4515 -100367 103263 81534 215072
18022 215072 -96683 86138 38833 -29310 177333 -81579 -202575 166550 175736 7775 -181750
18010 -38281 427032 237539 132702 -259851 -225122 3446 113233 327816 -43010 155290
17999 -192542 230579 206675 -188615 -81066 -28720 165948 -138922 322566 -226409 236566
17988 -111224 93455 25169 -160387 -80574 -326266 49727 -29063 37842 -149957 -60024 13549
17976 10196 110956 -95709 -148946 -143817 -250756 254642 236066 255050 -194480 44353 12363
17964 -173010 -159666 -147183 -92827 -84379 -93340 135827 -143485 -191379 -97866 48536 -86987
17952 85001 177307 -7009 119612 -198394 70802 -68367 191671 -59234 -136084 -240722 92045
17940 100617 -214268 213781 521372 -210078 192923 -298388 47463 120757 -19493 181962
17929 152850 196300 225575 253419 -147262 -209103 -314042 -84018 -72100 124707 43169 -81702
17917 -52103 -33327 171731 55855 56470 -94205 33448 151061 -70528 38340 181314 25941
17905 -227735 97610 129385 -18394 24130 -130658 1491 -59700 96966 18394 93170 8372 10680
17893 10680 -47874 -345840 234702 99080 -303235 69498 -85012 190229 565016 44277 -19645
17881 35366 -53196 -215804 -79051 -295630 37912 103573 -132511 26832 30559 242110 -157192
17869 -91136 62987 -94966 220323 109605 194060 -129635 62984 -146627 -205079 -113086 65986
17857 -177061 120549 124043 126745 78395 137443 -58782 -7979 -100185 -194975 -37290 264138 37262
17844 110181 -32156 13184 73319 27550 72704 1892 -40044 -99998 -15816 -148729 -39315
17832 -98780 -54989 105119 6092 -115895 -890 -384117 -207649 111741 117859 900 -111150 72728
17819 147872 8494 -31913 -189522 -46783 272000 -255835 346433 35815 -95669 74481 -14013
17807 68461 98678 -480745 348309 383121 76318 125240 -58929 104074 139514 306568 -300316
17795 -99850 213670 93909 -188874 91684 34629 140110 367584 284303 -45470 10363 -78970
17783 128120 -240935 63521 33335 -53779 -11946 -42766 -36511 3486 -247728 72109 198297
17772 198297 367753 137233 197644 57180 103379 58365 1740 7043 -300890 -80548 168042
17760 49660 -325438 68401 23733 330991 142753 39064 72382 249025 -23971 -60880 163233
17748 169293 183851 -56962 -333940 344453 -54366 85197 105233 37702 171328 39749 -38480
17736 171174 66953 21473 59910 237269 -11700 -47807 97690 -49504 100732 55915 122608
17725 122608 27874 4194 118753 -59169 -30038 13366 180799 66019 -105999 -73957 511955
17713 239883 176514 116371 285136 305807 41282 -184955 12881 -43185 -190233 49586 -474212
17701 -25041 -175918 -200877 -35088 219795 -61113 4064 306461 73802 168248 42820 19999
17689 67765 36739 134899 -126067 -27182 -37448 142422 130294 -26744 242477 118872 236318
17678 236318 162848 -19654 242746 153222 187126 226573 199545 76595 232384 347787 59587
17666 -185907 -152863 136734 471862 -335150 66673 209061 -184849 -62698 289797 89573
17655 371049 -105522 207993 -370010 186536 288034 -89736 158631 -42882 -17032 104354
17644 60842 160163 35370 -14740 157011 226730 258612 178460 127642 240036 -23380 230962
17632 -197015 230085 -14124 -223089 -46075 160863 -375363 -204098 -6766 -141498 -123549
17622 -123549 -25666 147981 380527 387912 10717 -166198 98638 -8267 163943 285932 66554
17610 -62558 -18615 80492 -259632 172434 245779 22612 -16352 -109320 -92186 -86366 -84909 310657
17597 265700 91168 142264 -247961 146566 -79662 231343 322406 50975 -114880 16310 118753
17586 118753 371750 249877 145547 -136131 137835 -71231 -37077 -21271 154520 58768
17575 270727 413312 210421 99620 169511 -113209 -68685 350764 137842 -89619 -35210
17564 -142208 -7195 90414 -347074 319935 220900 -27588 265538 650135 341061 184143
17554 184143 163769 107528 317903 187624 112118 459871 128543 95206 452981 229225
17544 229225 122386 16612 19498 135530 221320 330485 362128 272511 214259 -166300 208167
17532 162810 185873 -34442 210323 373108 351754 171487 293624 146569 164642 223249
17522 223249 335238 131658 386454 161874 285157 239786 197255 -45073 172358 317450
17512 317450 521396 438868 730249 925264 905186 1054470 694123 980251 140028 334030
17502 334030 305160 115313 367404 22671 301713 128682 319009 643969 398777 617408
17492 617408 927631 703398 515498 452787 174961 -87393 395691 232777 212589 373356
17482 373356 363708 303739 424498 211528 242037 64997 549995 529464 39187 384354 195995
17471 195995 432949 249814 240713 233476 152683 276629 307196 160143 364846 102071 303023
17460 303023 257536 284911 -77693 285619 151164 -13018 138726 -630 427246 122031 219667
17449 219667 80444 25684 314261 467242 200452 476994 131128 -146772 350615 228265
17439 228265 329964 -19236 219572 316971 -66412 319980 204273 246075 517058 33789
17428 524472 429221 343107 92037 271814 309541 230029 480056 414924 338926 682661 439422
17417 439422 668919 435869 335179 -68830 569940 469537 -36269 355004 309125 162798
17407 162798 174862 404010 250207 195713 276043 367197 194700 367335 360309 431403 292921
17396 292921 169412 385298 61694 272905 228480 601541 249511 141998 -96311 262952
17385 155707 260371 412359 46004 620130 70522 -1831 12320 255700 384627 366817 154568
17373 270631 235439 437533 363977 118762 176034 283482 506201 89182 422625 305469
17363 305469 -23252 247720 155218 122703 551261 507594 82963 42667 317427 159578 245139
17352 245139 477153 104967 399164 297003 79531 325634 265240 235559 259731 318122
17342 318122 70996 336514 68009 6934 259017 148905 72498 19258 75396 131958 436142
17331 436142 375460 160481 378478 205463 1702 108398 211300 -87095 106280 231690
17321 231690 142395 174184 493143 216435 206386 278168 204234 234574 240343 30991 -142366
17309 64262 238300 362765 250696 350671 257595 395328 288075 627567 112009 287905
17299 287905 323614 186784 204179 138565 249290 179854 108073 278578 232328 304929 320308
17288 320308 208617 354422 40103 560204 286360 416244 363841 31889 449934 238353
17278 238353 277703 230907 566638 45863 271849 619689 193636 -279571 265378 265266 391636
17267 391636 479645 88097 239497 322641 222656 314533 379662 227379 162344 553363 255512
17255 544346 468562 358957 134488 -116132 472771 330536 320371 350669 80115 270588
17245 270588 36791 432836 338943 450033 546426 490768 226381 486906 261357 223216
17235 223216 337885 268669 341735 265309 291383 174894 169991 193655 126294 334134 50381
17223 189295 367131 485064 213910 318110 434953 241278 -15909 492712 644011 308362
17212 234859 32666 57247 -13081 575578 389252 140265 475141 302153 199749 356022
17202 356022 154269 205179 269875 359324 254341 527274 23790 318748 220838 388488
17192 388488 185486 307317 285849 429669 64535 28277 536379 450916 666665 64461
17181 282731 579018 569092 134705 207007 102501 310940 273586 458043 360997 125806
17170 52542 -49173 648281 733166 104513 736953 49944 215528 285293 555916 510976 417743
17159 417743 204694 731966 174283 30680 284090 234530 226113 236984 533047 142669
17148 326093 504098 537542 754533 427044 350944 521527 533975 357372 105731 544037
17138 544037 1002405 460386 491471 869236 200000 702425 379698 273535 495724 573184
17128 573184 333534 415179 412929 418409 682172 308987 489793 213142 444834 475023 277153
17117 277153 288593 272810 566399 366014 515943 469774 422432 424797 622468 484420 376937
17106 376937 508346 443720 547345 205891 735484 524596 396557 649352 326382 178065
17096 178065 449808 486367 345512 443527 496537 516234 626709 762481 583927 411261
17086 411261 169120 535697 760413 355429 799025 496755 712738 515538 571938 597446
17076 597446 493258 614752 481044 207490 766764 742437 333052 583848 370573 549389
17066 549389 230553 455393 713293 733871 814492 668220 842272 668376 563242 937807
17056 937807 805701 763212 461009 552904 483465 912830 1032102 983351 1083927 619908
17046 619908 901526 470095 796278 770836 837504 611049 862201 817241 939354 811944
17036 811944 1018334 932772 739426 812646 1100612 849954 1253074 1112208 598530 1332125
17026 1332125 710416 898086 872296 1018958 1046746 523550 534864 700802 528258 1127610
17016 1127610 504453 988189 793829 770990 709409 771252 682122 1054560 884840 1095770
17006 1095770 712068 775404 1025545 797542 1142950 666819 1177550 1039166 934880 949899
16996 949899 893476 952097 1193038 1246767 1052210 941389 1162124 1062418 939515 1090307
16986 1090307 1393087 836612 1020882 1197369 1403668 1165297 994254 929788 907563 1104240
16976 1104240 1034878 886139 954410 993667 1382910 856257 1573694 1085096 1122249 1069155
16966 1069155 1331605 1059749 1484728 1338046 1184580 1482365 1306075 1394036 1059734 1068342
16956 1068342 1332431 1082655 1367417 1333485 1342946 1396714 1238451 1088524 1468344 1155150
16946 1155150 1622513 1650256 1284701 1424117 1572013 1179294 1506017 1463771 1279989 1439990
16936 1439990 1519029 1556923 1421083 1243218 1580507 1123058 1678265 1710453 1358064 1471773
16926 1471773 1351181 1691734 1793977 1706414 1758877 1571064 1503690 1801091 1720129 1774172
16916 1774172 1721193 1840954 1817446 1718810 1892035 1920522 2098239 1574516 2090906 1633458
16906 1633458 2058260 2048953 2022063 1860220 2020035 1830090 2273366 2010475 2169576 2397480
16896 2397480 2178015 1985908 2187366 2378514 2357141 2310454 2480899 2535005 2550419 2038764
16886 2038764 2557411 2297415 2373218 2725915 2576422 2447540 2447688 2604342 2495570 3030611
16876 3030611 2636657 2782979 2741825 2688551 2902170 2639519 2708550 3018638 2737924 2915038
16866 2915038 2859666 3218264 3339332 3030899 3115152 3107579 3268019 3257027 3219411 3572154
16856 3572154 3397734 3452031 3498191 3566207 3964660 3891426 3874512 3874746 3783644 4015876 3660422
16845 3660422 4123314 4081769 4438265 4364150 4122982 4558892 4362120 4211700 4179793 4520244
16835 4520244 4988804 4650135 4739257 4739696 4792325 4899268 5315188 5033068 5314684 4889246
16825 4889246 5430400 5423622 5324654 5765660 5877438 6002178 5847041 5498342 6103733 6366107
16815 6366107 6505341 6699693 6647063 6842511 6780081 7043522 6824329 7077029 7791716 7743952
16805 7743952 7579216 8158246 7905512 8254596 8366605 8607440 8826444 8120368 8971859
16796 8971859 9514055 9535327 9514635 9361184 9975701 10132148 10395579 10595761 11221790 11215271
16786 11215271 11471234 11642148 12125879 12834381 12599256 12866048 13072885 13648181 13954420
16777 13954420 14397669 14526787 15092030 15543332 16129088 16576348 16717403 17551182 17477028
16768 17477028 18259195 18832604 19450168 19933369 20499115 20804569 21820556 22536310 22931475
16759 22931475 24014261 24674656 25436649 26489849 27484592 28447085 29612985 30223877 31351995
16750 31351995 32390759 33588677 35342863 36127464 37815615 38746156 40576084 42284837
16742 42284837 43877657 45735720 47668216 49707672 51703720 54024210 56117644 58616845
16734 58616845 61370310 63914272 66636505 69968885 72689698 75669018 79281055 82645709
16726 82645709 85968867 89549711 93466320 97113007 101157072 104918678 109171651 113150843
16718 113150843 116579633 120429570 124153866 127355386 130923238 133858020 136076507 138758689
16710 138758689 140212634 142087256 142580353 143029409 142710573 142108184 140845041 139162516
16702 139162516 137257987 134603377 131770699 128972989 125237365 121579042 118012025 114132822
16694 114132822 110063515 106296137 102377511 98185886 94006025 90506768 86718715 82915249
16686 82915249 79658050 76115422 72830157 69548235 66742406 63940354 60941395 58518999
16678 58518999 56071722 53274827 51200120 48759327 47263585 45194575 43132531 41335522
16670 41335522 40038176 37978648 36705599 35520506 33790349 32678923 31505102 30014104
16662 30014104 29351761 27940214 27068320 26093315 25310161 24371372 23734846 22923705 22200022
16653 22200022 20978527 20919015 20117518 19013598 18572109 18049481 17787463 17335660 16673322
16644 16673322 16199993 15936171 15237370 14926348 14315427 13858877 13550951 13295647 12863291
16635 12863291 12669511 12443721 11810519 11572369 11539659 11338511 11127692 10767380 10088643
16626 10088643 9828888 9775361 9621459 9146253 8910553 9140517 8579496 8520626 8472115 7901719
16616 7901719 7895716 7809012 8040121 7776433 7477179 7177075 7155416 6865639 7144145 6571179
16606 6571179 6590971 6545066 6370066 6431970 6088091 5634408 5866300 5647773 5663194 5697715
16596 5697715 5497829 5430121 4933989 5142224 5145086 5203519 4702915 4924899 4773767 4697436
16586 4697436 4710230 4300211 4234148 4384129 4352215 4134480 4022386 3956217 4336288 4182004
16576 4182004 3995757 3923241 3776693 3629172 3746691 3272738 3431608 3582314 3338744 3572040
16566 3572040 3613951 3322803 3366675 3300857 2852749 3189333 2968812 2756104 3318696 3059714
16556 3059714 2716009 3170285 3031447 2785008 3315523 2741193 2432249 2543285 2607372 2595662
16546 2595662 2597945 2607135 2502591 2648410 2376760 2217512 2439903 2512352 2212084 2428777
16536 2428777 2292147 2186043 2399804 2268663 2494427 2441743 2297310 2290432 2198560 2287647
16526 2287647 2171949 1975161 1964381 1767708 1780904 1947078 1803821 1969272 2325474 1853178
16516 1853178 1673682 1775875 1798101 1846405 1910369 1864715 1564031 1721836 1770060 1656809
16506 1656809 1391674 1701730 2028784 1580196 1575169 1828809 1672470 1795863 1146871 1639092
16496 1639092 1759574 1479626 1164585 1861989 1510512 1639492 1173532 1395088 1544318
16487 1544318 997903 1508524 1038099 1026504 1201697 1433029 1284338 1413337 1076251 1079463
16477 1079463 1390326 1263434 1249300 942049 1010161 1047471 1532665 1144319 972409 1206886
16467 1206886 1071197 1186890 1077560 800561 1040222 1322712 1108499 1313933 1180309
16458 1180309 1238060 790689 1012909 933342 1269072 851185 1034268 739734 1046787 993086
16448 993086 1059360 1001939 862717 1370212 1216195 893181 949735 937622 668998 961503
16438 961503 421700 1024277 620609 695161 1007819 1159561 851012 695777 487172 828931
16428 828931 1019511 1177748 1056132 895839 792462 692281 712645 867124 990872 761765
16418 761765 866588 872504 475655 669245 819267 582980 657941 697520 840145 1105967
16408 1105967 770274 581382 621914 541761 322073 672334 682824 554962 676880 695023
16398 695023 1000916 501240 919993 494321 530375 659733 694830 858945 522756 374796
16388 374796 760875 875333 674346 466072 612363 787363 590096 482528 923224 396268
16377 516757 835606 622875 626797 384419 457801 466913 805080 381246 850415 638374
16367 638374 633072 664085 611691 305606 384488 430142 232828 672503 487810 529350 669879
16356 669879 632464 671809 643399 617506 460539 781068 530106 561230 744637 711881 617999
16345 617999 652128 453764 590314 411517 433603 460558 393441 230891 475404 402301
16335 402301 564490 352888 404248 542468 603496 396436 631831 449649 457231 535185
16325 535185 426592 181561 723778 557992 537389 42722 600802 317377 344582 299280
16315 299280 430742 546852 218439 188869 437118 383497 183704 410617 399457 221145
16305 221145 481208 455217 248966 158232 310887 332916 399171 531631 220484 292037
16295 292037 296588 -91529 -39368 469487 268704 408753 174506 209825 463238 5954 578043
16284 578043 338671 611012 281497 202858 350875 356394 317585 363199 -75443 396290 274173
16273 274173 66151 138619 409891 407765 42599 378621 451564 270750 340599 125329 375458
16262 375458 310476 468740 426099 385395 226575 168200 273851 512638 254504 199064
16252 199064 393625 183711 424882 158113 302658 215618 307910 362611 347560 307102
16242 307102 320801 72671 376782 388172 253494 141473 109831 194981 -96967 438632 689959
16231 689959 138775 409842 125605 381157 171183 343934 118558 330640 285089 35795
16220 184770 241567 -80415 110405 539020 439578 258606 207992 -136156 196984 275449
16210 275449 197946 179488 269964 381605 351527 362258 365404 199320 496022 232040 197449
16199 197449 144662 209256 213695 291407 277297 616244 65833 -54087 122732 105714 354707
16188 354707 110815 223727 -18639 -95077 241446 6704 22696 378447 94207 314739 267525
16177 267525 164252 364218 207769 327780 185390 171682 107159 284168 308292 -38695
16166 170805 292146 20607 19704 23832 -58760 -209104 364532 90345 283696 -98551 252884
16154 64204 40005 121064 104653 21930 200287 164106 195433 385893 -452 394554 10678
16142 309723 -59666 179501 22168 274497 297648 -137763 -15469 190900 -5965 -162381 67530
16130 100413 298746 -157417 -140382 348896 162683 39296 -62031 66942 59389 16707 64002
16119 64002 323387 -158805 67420 -74667 152019 -163388 64014 177245 34019 66342 149449
16108 149449 -244971 130319 -63824 -46710 74282 -231834 33566 304692 295960 292577 154106
16097 154106 12662 172482 131675 -247344 -108085 58121 -147048 253701 177121 -97482
16086 -67928 122015 84899 -47843 96057 169821 188205 -316906 -97526 -175303 183340 70796
16074 30660 286060 59349 -97135 -296 9991 -71909 354334 -20690 87950 23262 55083 111268
16062 111268 -15326 122685 175377 82104 167280 261350 218287 -128112 179697 -22252 38521
16050 352206 -21304 -13747 -96466 314370 -184163 -170106 197260 203373 -14408 -84543 -218980
16039 -218980 314325 -70696 36021 348740 -68987 -68873 128434 127650 -106789 103820 -39663
16027 -126906 -55556 -215337 -289811 -109722 -2757 -10435 315250 119570 32129 40589 53530
16016 53530 -178270 150797 91194 -44315 -110844 78662 -92942 150109 202568 -58885 -87662
16005 -87662 190316 -111170 217061 -40772 -133201 278098 -100769 -382646 -289216 -11315
15994 -6146 -257137 24417 170869 7124 144091 -101897 315513 38334 221557 2623 198802
15983 198802 136582 120011 -250711 -219196 -6183 -73710 -87930 191848 -278202 208036 423469
15972 423469 394476 663364 534770 776067 655346 694810 323210 -81777 188200 607427
15962 607427 -29930 357916 -176336 287096 42963 -40330 -52751 208341 -120340 60755
15951 165402 237110 -206259 132007 42390 -9803 -120847 44876 -160121 8707 73524 -54831
15939 290943 -121981 160858 114790 230610 116325 15525 1371 -34462 147451 224730 -73387
15927 186429 -286260 -41691 -129392 60965 -171134 -81514 236044 111241 73066 -594905
15916 -262542 59598 90299 252378 -14288 75922 70809 -72553 56728 -141001 -50889 -100576
15905 -100576 28834 -142890 59775 298700 143669 83108 -107415 2442 248152 -208854
15894 -292993 416404 -263717 -253442 -71695 -96903 109305 -83984 385642 -35826 137443
15883 111947 -54854 -34542 202168 33859 41597 328528 -110004 -169542 -96481 -315598 100724
15871 -68799 29823 -199678 203712 -185425 -173659 10842 3757 104447 20095 24619 -91536
15859 113417 -58558 -302372 -95104 -189283 -123008 -243101 -3517 141245 32461 -58745 -140002
15848 -140002 -274943 -306295 107919 70004 -8949 -323076 -159184 -310023 231104 -383603
15837 -52981 131036 -160607 -138111 68871 106734 -104479 -124342 -341954 86029 108139 -40998
15825 -74330 -214143 -176883 245121 -17053 132694 -108749 7217 -25480 22603 41524 -143456
15813 -60494 -164161 77646 -390838 259862 -212714 291990 -43012 -173790 -30384 64097
15802 -189472 -245057 -68799 -434146 3281 281858 376770 -193069 128309 377691 -135459
15791 14367 -67482 39909 -158212 85609 -142000 72166 -221577 32659 165122 1522 -42398
15779 -28970 76443 -23935 -195389 244272 -131245 184759 110631 81765 -280379 -34412 62701
15767 205343 309921 -126177 -215225 -282566 -192142 -33125 -122200 -251960 -68756 -49765 286731
15755 -294486 -52610 -129393 -131269 83252 72004 64632 123520 -219715 -226161 -2606 86947 21439
15742 185524 -168609 91108 -31811 202008 143073 338448 75071 -66024 105217 -6732 103619
15730 -8606 60978 143220 -47868 214858 132170 -257063 -224352 177667 150243 238179 29580
15718 133368 -244407 -106445 -371659 -70573 -162699 -82872 -357000 184339 -107824 157741
15707 -41633 266791 -284521 285982 -117822 -350859 157712 -93186 184029 2262 -125634
15696 25304 26458 -195794 16126 -160537 -167095 63288 33251 -98778 -206243 -306259 -39899
15684 11703 -90692 -176188 87392 -229232 187171 -213302 -71836 -22847 317173 441404 194644
15672 230128 316062 23302 -44364 44031 -111996 -52346 214800 -114597 -249039 -150684 8852
15660 -227259 -36364 202760 287677 1836 -5883 140869 -12122 -69796 -202262 131670 274805
15649 274805 -63292 169920 167031 -308946 -181390 -116042 -67852 -94125 -47751 -166348 -44808
15637 -36445 122596 115592 -137675 -20960 29550 -145109 -114230 168146 270844 133262 -277426
15625 171728 -228237 218508 -301614 -302152 175068 -81660 -140747 -143523 28076 -314426 198736
15613 51705 -227459 -37017 306595 -192215 38646 -203573 -213374 -168448 -541425 259784 -133843
15601 16750 32254 -151188 -138249 108820 -1752 95235 78816 -47706 -45941 83542 -229672
15589 -380416 -50898 177702 -222022 -107952 -139944 -270385 110871 -97365 -40340 -162219
15579 -162219 -37952 -270421 24715 84187 -227993 236018 224570 -422601 102104 416700
15569 416700 -194276 92281 -133103 -236123 -150327 -2523 -150761 -252691 -155324 -91168 -323100
15558 -323100 -23158 89238 -317685 117099 12729 -39198 -261886 -221966 90493 78735 -183963
15546 -178989 152838 -61010 -104276 -161859 -117529 263966 124807 61762 212780 -371760
15535 146238 -215999 469224 68324 -140413 -155920 213849 165882 -70003 -197006 73225
15524 -20040 -62405 282385 -12119 141029 -50036 -329458 -324596 -277754 145390 132050 -29061
15512 -119240 -7835 -59870 -10406 42549 9884 154988 52719 -92158 169007 -20910 54861
15500 -28238 214724 155401 -46118 116460 -115655 184240 208793 177734 -78266 128318 484725
15489 484725 228274 105807 446356 127200 124588 257376 131800 284008 -94434 595838
15478 86176 -134499 -129867 -31017 169145 196616 -34878 212865 17772 -78346 -183265 -127321
15467 -127321 61346 87151 219128 429451 291628 46833 357252 118202 132676 411517
15457 411517 236768 593019 556277 424039 273496 266072 202643 194355 203464 -9597 39465
15445 464 -61151 94646 -88230 -79008 -184038 -114444 115701 -173146 67706 -51991 -40961 247354
15432 313410 -277925 414 234406 -68833 62032 451949 416176 782850 1017100 754886 457097
15421 457097 484564 214811 -124681 93845 -7379 4215 78154 -168056 167420 -106088 84555
15409 -284362 -151365 -35651 -184016 -323455 268195 61997 29235 18005 132224 -101480
15398 154152 -167645 55998 -228372 24832 90220 -36697 -234777 23222 151154 171134 364072
15387 364072 4300 -155805 162681 -191483 -158965 48111 32184 -37787 248938 80882 39540
15375 81255 -279295 313835 -68681 26080 -113417 369507 42430 -40923 49748 47520 354955
15364 354955 -159618 -70529 -183737 -65062 42255 -28143 152752 7505 207392 219260 -176561
15352 322907 276579 135939 49804 43747 3295 65423 324151 272943 140180 11799 184484
15341 184484 221766 162317 159574 245521 -178002 105626 185399 465044 225401 286045 -117759
15329 133606 236430 480710 -5410 483517 229690 332114 183686 156 205480 183737 -9451
15317 283713 270337 178179 223356 -148033 453048 377250 270560 -36737 -26696 -87955 -176459
15306 -176459 -197077 113506 12730 -31818 26011 66362 -40482 295262 228713 -199022 56974
15294 221812 291303 -99309 169669 -2534 -261806 196987 -28414 229974 33015 95417 31086
15282 99776 356386 -65458 173109 -188041 -112538 94024 54040 -222060 -183467 151756 153340
15271 153340 11075 33104 234640 -14321 85417 129572 -312432 -80573 333441 -289249 97071
15259 7322 77722 111874 -410925 110708 122592 70964 135467 109811 146974 74767 137944
15248 137944 -77170 -150045 -269888 317577 129265 328271 -14263 80086 145421 294208
15238 294208 67476 -72518 99494 118419 233901 63266 151676 509606 514277 674357 1319920
15227 1319920 1532971 1016558 1279293 538538 338395 394240 359568 123299 -36373 22703
15216 212934 18358 -114922 454629 -21827 43952 180798 -184159 -27553 57086 105679 41757
15204 -130972 -179439 52454 124146 -155570 -167617 -93775 273846 -267544 -310376 -331941 -73215
15192 102847 -382448 -109561 -49099 140563 -234368 91125 94796 35891 113146 -61436 275293
15180 131522 -182335 -14040 135322 174046 77863 143234 110752 271487 13146 -2000 24672
15168 -5088 87342 237916 80600 171659 61493 153787 -217801 6763 146122 -75129 340344
15156 -58552 129878 -175566 65307 -52518 -155236 -12233 282554 244508 43735 322770 99304
15144 178979 -5096 241250 231411 -108338 103698 70481 104204 45360 -79257 522316 220942
15132 471388 -15215 194279 79522 30947 -369693 377558 25453 103027 -89426 -194337 -139240
15121 -139240 126493 258926 73651 76979 230112 321169 489912 -140188 16885 117192
15111 117192 280875 -26433 -48175 391711 80737 300987 442022 380299 386247 276572 471659
15100 471659 99382 105141 207929 136279 -6663 45808 -81101 185108 257798 -20140 21351
15088 280069 58435 -209443 528116 -53452 -17166 334443 283803 -65764 -276916 206185
15077 325706 96604 137880 12992 5416 -438688 96855 -150031 175559 203721 239221 194890
15066 194890 56568 453485 -20440 506660 441146 84979 181315 221297 -28623 194145 -143047
15054 450228 106779 300519 118329 426678 -23495 271154 137769 348696 -74448 281376
15043 257065 215911 31953 207099 377798 110100 55834 417809 -57061 464843 377704
15033 377704 453964 98203 328404 438459 339216 275364 353220 156277 15795 506591 459966
15022 459966 382983 183789 534747 147726 261644 142941 229353 618262 516046 462455
15012 462455 742560 329828 504037 646039 696301 413310 341924 310810 172669 605973
15002 605973 266758 446706 569323 393043 300634 297241 472586 224243 547545 311547
14992 311547 404442 348487 309917 667575 509583 27407 258278 528771 267736 284062
14982 284062 395538 465724 421342 477401 -19399 437407 449976 490267 177127 222411 361900
14971 361900 483918 482144 349552 202051 649824 960707 710009 666494 494417 612535
14961 612535 521960 446291 408567 611561 429259 755609 443123 886853 333136 456640
14951 456640 361220 605697 112668 134222 497171 133113 352766 357772 341669 377286 359742
14940 359742 119880 385172 241186 169315 105406 600705 495099 570863 472602 465146 659339
14929 659339 527479 549751 626292 543372 710052 602552 598350 282917 442081 347734 82309
14917 658187 413305 791018 835939 742651 666970 1587380 1376577 1064420 1091753 1140877
14907 1140877 1325818 1282363 1615400 1155346 1087851 1356579 1520607 1704894 1895107 1319731
14897 1319731 1471149 724187 1035901 968665 1005745 758742 350895 782497 391471 779557
14887 779557 305915 381312 284246 295965 570270 397023 422318 663192 534051 269590
14877 269590 488884 340470 562345 699301 278859 460332 514703 394768 649399 556591
14867 556591 678063 847247 802112 903069 806698 553307 575467 861176 605097 689977
14857 689977 631655 480270 531950 385868 632454 318639 425662 733286 724475 892858
14847 892858 945238 555690 675240 903380 773908 326301 527919 193624 231695 253968
14837 253968 426334 581347 340212 617902 504469 603464 410902 474359 459674 733888
14827 733888 378811 901822 1132877 937593 1033313 933076 801825 1071182 972162 759616
14817 759616 445999 637364 273716 508262 66884 384701 626825 585219 664502 539883
14807 539883 717635 804621 439107 731795 556677 551838 751099 766859 466990 703991
14797 703991 670768 792506 720359 567369 879466 639748 849675 416037 511313 707002
14787 707002 757785 986120 977758 702759 1036218 573060 872609 336876 750166 563317
14777 563317 912568 797595 650067 320283 665861 560932 467789 545994 909412 779307
14767 779307 278265 847824 791684 753087 679148 788100 1125398 488224 626868 791602
14757 791602 1124952 613839 550680 645575 647401 551098 836672 338143 507313 587982 356542
14746 356542 174721 855640 734791 939870 544354 217843 404614 575906 620905 936471
14736 936471 547670 589232 622349 782599 415491 603375 619717 396183 571570 565419
14726 565419 590655 823687 663178 438279 1075151 867708 901478 703536 903276 936634
14716 936634 671734 692832 924546 1137605 1257751 1269705 1105947 1392326 1646937 1522760
14706 1522760 1259492 1316247 827699 1058191 958367 867131 935161 669111 842131 1162749
14696 1162749 979542 1042078 853858 1082478 885292 939666 1088899 719955 1293773 1218177
14686 1218177 1124195 1595273 1527107 1447569 1546776 1730998 1310415 1151065 1320703 1001831
14676 1001831 971308 873762 747607 823692 837721 1041662 769212 731247 1091657 750733
14666 750733 853050 1103625 994468 1110777 1033810 957344 1056727 770863 1263053 902614
14656 902614 1032927 499794 1169810 841773 928940 1078778 768005 1067200 956394 1144928
14646 1144928 1076386 965246 1200156 776176 1050066 1004950 1406694 993068 1300740 795535
14636 795535 1332541 1390902 1182820 1473359 1333999 1177945 1076691 1099724 1191530 1126933
14626 1126933 1143481 1245595 1374410 1274450 1093985 1568324 1395049 1324583 1339240 1291409
14616 1291409 1508196 829979 1339817 987794 1482716 1543314 1307474 1533220 1395090 1304382
14606 1304382 1273311 1359172 1498871 1609951 1264402 1365890 1462165 1359014 1415057 1311560
14596 1311560 1085358 1293638 1765700 1197824 1748114 1339490 1685628 1525409 1556480 1764975
14586 1764975 1809916 1238741 1445073 2041933 1542509 1974454 1794278 1746077 1893927 1475644
14576 1475644 1880681 1497319 2102355 1884950 1770959 1796804 1670771 1757537 2016618 1763582
14566 1763582 1696396 2027197 1690930 1733026 2001226 2072984 2328420 1964085 2302234 2230910
14556 2230910 1908500 2121984 2324557 2517540 2250661 2353760 2271228 2479663 2578900 2665763
14546 2665763 2524416 2706179 2941538 2865506 3181015 3597211 3812473 4223021 4693634 5177749
14536 5177749 5821588 7626820 10153321 13746178 19192608 29018945 33984714 19011418
14528 19011418 10663062 6756201 5083646 4665605 4789521 5051452 3478612 2865892 2635810
14519 2635810 2451723 2600564 2331022 2199254 2524138 2360826 2386583 2537790 2410787 2480468
14509 2480468 2164138 2259062 2481468 2596282 2491021 2769491 2558415 2545327 2765354 2388099
14499 2388099 2460667 2696356 3110181 2963359 2617967 2839899 2854555 2850300 2616550 3089933
14489 3089933 3229458 3165523 2966025 3097252 3033016 3431232 2956888 3349087 3202649 3224426
14479 3224426 3112857 3341642 3435161 3467759 3517263 3994435 3695809 3381590 3807339 3643295
14469 3643295 3849917 3909581 3677727 3698017 3833127 3645511 3906753 3955210 3954270 4064820
14459 4064820 4138587 4259848 4154389 4433757 4569811 4689611 4699710 4050341 4650269 4529208
14449 4529208 4771721 4645824 4856222 4810273 4751420 4765745 5004992 4972635 5172287 5164927
14439 5164927 5184909 5349109 5106121 5412313 5632927 5568611 5508504 5680886 5964463 5902128
14429 5902128 5959655 5851649 6052422 5922125 6401268 6397567 6343036 6515448 6333204 6664083
14419 6664083 6945345 7069422 7153277 7121911 7321934 6975686 7260268 6882865 7681464 7477752
14409 7477752 7672678 7757617 7853322 8069132 8015584 8204631 8597137 8802987 8760166 9336899
14399 9336899 9289458 8671078 9350780 8990620 9143567 9645231 9778203 9528090 9864077 10138657
14389 10138657 10350145 10552935 11010238 11102452 10897723 11386889 11391558 11529595 11662363 11541474
14379 11541474 11963613 11965237 12772695 12818580 12800237 13387543 12977006 13634251 13784109 14059159
14369 14059159 14333643 14669201 14728953 15018560 15648622 15528853 16134781 16244650 16531950
14360 16531950 16771185 17538616 17578839 17877862 18313086 18505662 19191124 19074890 19941604
14351 19941604 20505726 20325204 21305311 21664302 22522880 22616770 23167555 23466912 24257696
14342 24257696 24820600 25145486 25524996 26225376 27026714 27637846 28178742 29100512 29529886
14333 29529886 30492030 31243671 32096734 32823157 33669963 34982297 35663336 36632595 37636427
14324 37636427 38867564 39926801 40921181 42179516 43594941 45005701 46158205 47649392
14316 47649392 49176116 50519562 51988514 54252409 55585846 57330065 59647397 61943082
14308 61943082 63583702 66025315 68320466 71062297 73668806 76229643 79161694 82409850
14300 82409850 85242713 88962888 92074514 96112374 99879700 104130393 108522290 113219724
14292 113219724 118179331 123533223 129132372 135164688 141411524 148123034 155646646 162647181
14284 162647181 170419339 178958186 188296463 197451502 207082111 217575565 228696578 240159058
14276 240159058 252234241 264698744 278008311 291686012 305255084 319196387 333307852
14269 333307852 347728767 361539987 374898896 386805683 398027464 407860692 416884299
14262 416884299 425422235 433160213 440183473 444836231 446656326 446361485 447039770 448300257
14254 448300257 446036759 439316297 432403891 422747752 410637413 399289226 386956627
14247 386956627 374031496 360560466 346930207 333657104 320347935 306784093 292947616
14240 292947616 280301010 268143828 256198428 244613671 233486237 222646472 213506823
14233 213506823 203179397 192322632 182664057 173479827 165358406 157182419 149659556 142826574
14225 142826574 136001459 130096369 124681499 119079088 113678409 108970315 104257259 99741443
14217 99741443 96034212 92203065 88874830 84943930 81713098 78654909 75807610 72848888
14209 72848888 70342346 67849635 65302690 62960602 61009758 58841809 57080533 55612317
14201 55612317 53208214 51610004 50124815 49014389 47285750 45945284 44479867 43057509
14193 43057509 41973142 40965528 39934439 38975636 37744374 36495564 35517134 34970353
14185 34970353 34126722 32969845 32283632 30944289 30191528 29732317 29132547 28376712 27674663
14176 27674663 26991137 26163268 25574517 25468272 24622847 24245046 23525708 23287943 22634903
14167 22634903 21821517 21493628 21107631 20351810 20056490 20027659 19566057 19160390 18611883
14158 18611883 18558171 18131126 17752079 17397757 16776732 16841371 16508005 15957009 15620253 15282548
14148 15282548 15241043 15041772 14547275 13995770 14430968 14034912 13429322 13419662 13094515 13013742
14138 13013742 12776519 12674594 12576675 12332268 12227961 11942040 11423630 11274405 11030472
14129 11030472 11049182 10838440 10669664 10355876 10392112 10297994 10514502 9987623 10145740 9777864
14119 9777864 9446894 9637016 9406224 9047949 8938672 9243050 8628684 8763825 8548728
14110 8548728 8716225 8522240 8240040 8099060 7801127 7714755 7983384 7627628 7500827 7430683
14100 7430683 7588732 7504365 7226902 7288318 7197360 6744264 6915655 6791848 6966646 6622278
14090 6622278 6677241 6462760 6034767 6283723 6379759 6426292 6149714 6158519 6035512 5680235
14080 5680235 5818729 6036933 5541786 5952096 5442565 5478596 5404537 5357533 5115352 5476543
14070 5476543 4878098 5250864 4918964 5238639 5187529 4536613 5047107 5043685 4809427 4854967
14060 4854967 4891927 4507694 4412158 4376421 4235167 4833019 4440528 4426862 4518808 4450415
14050 4450415 4459492 4338225 4367281 4064448 4093512 4282049 4027367 4193492 4160834 4199388
14040 4199388 3898625 4148822 3613900 3525749 3671580 3807092 3666946 3391119 3462467 3230841
14030 3230841 3258933 3403769 3361552 3483919 3389110 3113559 3524055 3541768 3148543 3033552
14020 3033552 3278286 3103633 3237483 3307794 3553784 3075470 3516246 3076663 2853728 3066685
14010 3066685 3203930 2799055 3061321 2979140 2529245 2871432 2619956 2686825 2820675 2515259
14000 2515259 2634221 2457123 2564133 2527440 2587687 2385341 2423401 2371052 2141892 2397827
13990 2397827 2316315 2434455 2266764 2380054 2601095 2260969 2019292 2412263 2732464 2574067
13980 2574067 2438529 2885625 2962905 3191117 3942333 4639298 6201297 9779286 14086308
13971 14086308 24054802 34969113 23596076 14451673 9738199 7322305 5655995 4996265
13963 4996265 4343661 3941299 3923932 3561582 3219513 2695684 2795142 2826457 2784106 2707289
13953 2707289 2843269 2546563 2394971 2594238 2414493 2262287 2337361 2334184 2499698 1930920
13943 1930920 2090515 2070996 2082192 2472281 2184757 1911685 1822404 1864364 2210605 2170355
13933 2170355 1828461 1902933 1937015 2222970 2233849 2057930 1945493 1790276 1980710 1978238
13923 1978238 1763846 1616843 1602576 1830482 1774927 2132344 1537057 1776544 1523254 1575833
13913 1575833 1621042 1877391 1673001 1638952 1848713 1901049 1433221 1892969 1629786 1795692
13903 1795692 1596998 1601064 1842024 1227669 1792566 1435029 1503782 1489064 1547503 1207437
13893 1207437 1467933 1174904 1417232 1578253 1694622 1531295 1469544 1272536 1523511 1353882
13883 1353882 1228767 1438625 1307489 1186461 1283933 1617930 1431430 1507337 1453959 1373460
13873 1373460 918020 1275838 1366401 1443323 1395863 1253529 1137365 1359417 1078686 1129962
13863 1129962 1455697 1362517 1221213 989652 1027351 1207933 818840 1143368 1119996 1183047
13853 1183047 1062679 1155721 1262359 1190983 977350 1126094 1196522 958040 1090192 936321
13843 936321 1114275 1052092 1001142 838341 1099959 1271356 1289339 1014326 1021552 852717
13833 852717 885465 1035284 767351 641967 995419 567914 925169 998438 1077971 1127662
13823 1127662 932941 899210 1053194 795511 891933 892143 1154355 1062115 974360 804915 923681
13812 923681 1040757 986964 970476 1148445 811697 742696 838711 1189572 790744 1149526
13802 1149526 1005754 771883 1202799 656329 935972 1009244 1038227 1136945 732515 686590
13792 686590 1061692 993571 1063016 826088 489330 663393 846629 845618 678682 792897
13782 792897 948557 719430 694615 586138 841574 929188 458470 572431 891064 587953
13772 587953 617075 764859 818054 706725 857038 514273 744486 1097353 714517 494136
13762 494136 1004719 542749 479775 715252 635624 997618 911461 913136 892786 652906 894294
13751 894294 943954 482599 764151 681462 853083 720023 1006018 944381 686709 650973
13741 650973 720745 562078 522639 805212 725084 681259 599825 735148 676160 743436 310768
13729 427032 400294 717089 1164581 809925 544558 1075322 864632 786000 544791 714808
13719 714808 1004142 912554 788166 718452 658798 661726 551527 575705 684228 433204 563920
13708 563920 539844 795573 640317 597125 464287 817612 340001 774723 546507 558783
13698 558783 545852 798392 868701 315706 433314 429668 431586 743173 635772 732018 545240
13687 545240 998838 678319 359939 845430 679096 714802 467807 494954 838574 346000
13676 324614 436773 752925 407676 716101 674989 711988 575046 655605 574857 251208
13665 416674 410253 699564 559034 339929 695194 1031099 449619 306919 504357 415497
13655 415497 443895 700164 371357 746475 261865 389313 454272 385489 785751 525410
13645 525410 405650 695248 473704 712505 851671 796904 369319 438491 583697 504057
13635 504057 291753 468493 285822 432158 240090 481035 392959 526573 437911 389233
13625 389233 476002 596716 299980 398246 201389 558197 320010 451118 473160 362333
13615 362333 79489 513081 402344 271699 562715 468283 524111 351445 480474 727089
13605 727089 430119 114279 319852 398374 519076 232416 644787 259885 350360 558291
13595 558291 213454 244826 331197 395149 136103 198727 460223 216307 154201 454173
13585 454173 417975 268050 326263 -34354 409779 504883 334590 352460 231279 205320 242505
13574 242505 243647 170213 602031 416861 525765 195979 432401 167493 318805 664366
13564 664366 282376 246228 347417 467141 166317 241403 367720 269631 385123 169368
13553 102039 230608 354458 214635 462179 101759 34255 362229 299126 182951 323240
13543 323240 440481 139291 300069 428793 235183 95012 406496 426701 156351 398290
13533 398290 530126 266122 385124 640089 -25437 432318 -57185 590606 636829 487961
13523 487961 557253 169414 303572 741977 353691 457759 291831 263495 131885 445731
13513 445731 374116 215116 8418 169666 -27133 -45155 361012 456095 477205 38643 269814
13502 269814 220165 121010 39242 300693 107842 337743 421476 379732 499258 -224681
13491 140277 378245 472918 355483 364433 -23469 72024 258185 43653 -32006 93434 436977
13480 436977 -73939 211108 373494 315737 501999 285749 311946 218753 455133 350437
13470 350437 290987 238609 291619 434041 317680 401680 366848 275919 89222 229939 218524
13459 218524 186156 347393 161494 453460 208342 9239 227496 38167 493850 235433
13448 177589 348479 388757 320878 -152169 217235 259541 -225916 336951 27312 293623
13438 293623 387123 35502 511320 54323 420723 390188 264470 153303 391089 -76590
13427 121698 236005 39948 401442 174517 194023 214157 321498 181659 308919 259788
13417 259788 90325 237464 262298 378817 68586 235118 593895 -91488 299196 75896
13406 185291 262320 173245 -240449 118990 57347 398243 291175 543677 200689 -113985
13395 310188 135522 -16972 233074 -1994 395526 398921 -159427 184540 229691 314424 303618
13384 303618 -266694 -176692 416425 438217 435444 112534 366601 -36694 28310 364654 154681
13372 142882 523807 102610 -7279 400549 374518 243634 77715 272340 342935 126607
13361 20545 392941 231850 235061 86573 235447 156141 257815 215695 376835 171361 26826
13349 230440 96512 272937 99569 218172 383834 99065 -120099 370745 271677 261375
13339 261375 133047 376865 198866 234694 300508 58909 244251 265784 52834 138388 507848
13328 507848 460866 167547 226405 385181 -43983 454619 313661 -23223 26468 301940
13318 301940 84869 165911 140727 -46595 347398 318119 220206 246820 248902 -309479 482140
13306 327483 163732 16954 117461 114212 -77158 13346 391578 109618 -9280 -9677 241929
13294 92766 541187 146047 -55991 248702 357728 282428 467189 157190 350592 194050
13284 194050 -13895 -117760 3725 113565 107748 362601 -29420 26840 447824 148867 365130
13273 365130 294903 -8778 137946 230100 -9069 553391 145423 244073 -6746 9531 325173
13262 325173 394464 454592 5996 546714 -124969 99944 411009 78651 -31877 262861 205940
13251 205940 -186012 167231 275815 4969 -66012 107193 -19324 189755 352696 -128261
13240 171313 22962 -22311 139925 -40898 -164595 186302 51426 92827 343459 -86493 370311
13228 -54573 220400 -9272 382379 -102508 -23377 233810 180059 508236 -4610 313181 80565
13216 191470 -47469 193890 -18594 -193897 346248 -116182 237981 -55067 96326 110341
13206 110341 -293423 172462 43850 -241209 15184 72671 -104103 205811 139726 64921
13195 361047 -140620 -281314 130257 422293 56152 648519 95359 170850 -80380 203507
13184 390682 224283 187229 4455 92076 53290 113678 82469 226690 219933 99018 71555
13173 71555 -136833 44393 -58683 382355 -152772 -131282 -21406 276056 85340 178610 -63498
13161 263679 -1755 -90572 147725 216770 255222 12292 -87991 125524 243552 82258 62586
13150 62586 -26134 17307 294424 53604 54758 244706 172469 283214 -312856 139671 -118873
13138 -87831 -63868 -55259 194606 -94894 216133 94682 162517 -2841 118813 -138311 -67065
13126 256762 237600 -3239 -58165 -245915 14927 63325 56111 262661 240707 104204 -162978
13114 77501 -131484 137002 -87853 209985 -66849 300818 138890 -150142 237590 150505
13104 150505 429995 171777 78852 32057 134275 99610 184222 -99022 6348 -160402 60722
13092 83024 -43380 292693 34501 -35023 345195 -81851 99974 123915 -240499 263271 90170
13080 208712 -120036 276828 104715 32620 223375 98671 67671 6660 -21354 18042 -69358
13068 294323 313370 -38231 187214 146589 -13176 -113981 202886 184850 -87901 -185036 55576
13056 222344 3282 228488 -277673 222223 70967 -81478 203371 -23263 129518 100722 -168670
13044 92389 16459 -29397 130706 23260 -44784 42345 -101715 149682 124438 180628 325994
13033 325994 223223 131654 168310 103723 224395 249742 -98581 226657 77799 -68438 230150
13021 277574 167879 136643 -13520 238545 305074 75611 -70226 52183 94058 216402 104630
13009 131297 326921 34160 -222276 219979 -64936 622540 215749 526645 483811 214341
12998 213225 413153 -167044 100392 -218628 -317 -13094 145225 231696 381564 334190 102116
12986 123706 228484 17459 216874 -200954 198102 -143412 85681 -4079 183941 -15701
12975 10798 -53023 -133668 -15896 -260513 -90462 62299 260411 -235488 117859 161753 -42568
12963 124290 -151345 -5101 279217 -90610 -37047 172621 214363 -141411 -30810 360783 216523
12952 216523 75692 178827 -229284 159947 367113 -61068 -55381 49020 2929 362529 239158
12941 239158 34211 62807 204979 -50467 -286403 -75267 127167 -279145 -41352 81527 -140908
12929 -22029 -101514 -143987 -213611 -50047 112513 967 65978 105511 -234515 61127 163141
12918 163141 63274 -63277 -86245 108087 16225 136087 -124369 -276533 146945 -202783
12907 157644 -233383 -49520 -46460 -210788 -121822 -26216 -108562 -164237 43369 -233694 548279
12895 -119153 76068 -23630 245174 133304 -123188 103906 -193214 -34775 130720 88295
12885 88295 -49028 -65422 292922 -202843 190820 -21107 214958 111112 -32726 -117921 385891
12873 -11180 76671 -180700 92476 -175294 113388 -134960 -171771 150811 -2836 231408 136788
12862 136788 -139287 -379418 164597 -266288 2353 107980 303790 484 -190779 952 3242
12851 3242 177708 -138468 -203826 -521781 130560 283432 -76113 82130 120524 165542 49564
12839 54021 -162762 -377197 -105791 -91412 -72066 -174229 141353 37702 -180481 81329
12828 198944 299989 -124799 -10538 -296844 -113204 187937 -30753 -210145 -78179 41706
12817 -62365 17539 109123 -303941 -161794 24801 -77501 -162868 -313802 -220427 150109 151145
12806 151145 -40183 185047 352991 246369 175895 68847 277893 42900 -131441 53 641933
12795 641933 53917 -45920 -110935 87237 179885 134998 164438 -100942 -256300 -178745 109489
12783 -4183 -186207 -30118 164529 9161 68453 116915 9439 -77443 22531 -289873 42881 146196
12771 146196 -146114 20264 -262518 151999 -102244 393272 -48184 102167 -257844 15451
12760 221678 -309470 -87166 -194601 441208 357030 -119792 77585 52083 15668 -190360
12749 396216 -230512 297182 -51576 87666 312579 16237 238589 11193 261612 82243
12738 32943 45805 124326 103042 28990 10544 43437 -279940 258253 -85254 -278446 187602
12726 254151 31798 -214866 -12385 225714 325873 178170 164553 374642 101010 -25188
12715 306926 -122852 -37010 92054 -57686 222396 -250344 -45839 189626 -172472 -11976
12704 -99351 67558 -78530 258524 -12194 167377 193280 -74918 156298 112645 57713 -32730
12692 431061 109750 399195 269683 500158 175798 63793 59948 347899 -102307 264609
12681 -54346 91080 -87661 173343 116906 30505 105398 15804 -169076 -40075 34572 215236
12670 215236 -71334 -325718 222248 -83221 303898 68742 466316 -39008 202412 -7363 -56508
12659 -56508 285165 3162 157125 41362 -234195 141325 236033 16422 -391305 10504 130711
12648 130711 344473 158836 -306806 166601 218310 201524 -191586 277264 -28173 162955
12637 183403 37924 118077 122291 -113800 -128347 235759 195181 115875 446659 -60631 -126337
12626 -126337 75406 -37319 61869 -168408 -9748 128924 57470 42988 47431 -95644 -105649
12615 -105649 69584 -27143 437908 462877 220599 -143718 -141614 -11244 -27022 -310515 -86662
12603 45028 451672 227432 241407 36680 52045 -278313 6150 331966 -31296 -113499 -34660
12591 -25290 -388812 274121 23356 332 53908 -88874 190144 372016 -9137 233119 96103
12579 -141239 -8009 -117784 128510 78572 116868 -209361 -71794 309373 -282664 178611
12568 23142 13385 -55839 132020 -171479 -132931 17833 114282 -222618 -84406 59446 224579
12557 224579 -420803 188076 55404 110942 -35719 -84337 27124 147428 306391 157470
12547 157470 412733 -134899 139080 -328604 -137101 78640 -22214 -404029 58433 -187469
12536 66407 -362821 -206986 266709 84038 159297 -108057 28515 180346 13376 -35160 -137133
12525 -137133 -87249 -320321 193208 -20669 60613 -50111 -186741 -344083 -384788 85744 -62228
12513 248162 -230244 89654 -70254 204714 -252629 121160 6802 12956 102244 -177211 -344834
12502 -344834 -24917 -106417 33296 166300 184420 -343562 307971 -128467 266910 -32662
12491 373537 -32190 -63881 -230810 -95034 130050 19724 -208747 -215051 989 -134522 18722
12479 320380 -59038 74648 -121989 -76715 247973 -165099 -21999 -59656 270307 89962 -175485
12467 17645 42913 -285771 65309 -60095 200504 -2632 63531 -59511 162674 32654 174287
12456 174287 -99895 404260 -111341 -241135 -24237 180999 342077 288750 356800 31003
12445 -73132 -224517 200977 210058 -216551 180501 -141558 38888 -167635 1481 -57559 78000
12433 240994 33070 -89616 67026 93024 63336 46903 54604 76547 86021 -212103 40319 187809
12421 187809 85544 253735 -49561 -185174 -217247 -11388 37853 -308535 83968 -165187 47978
12409 64831 -187892 68603 -210147 52290 -167059 -195839 -137523 -46034 -221950 -114116 -119900
12398 -119900 301225 -81757 -169975 -179735 34935 -171423 -21527 -95213 -19886 -483628 1145
12386 155767 -43397 196841 -49748 51742 105884 -205416 99761 22104 -192164 -362586 386837
12374 130599 17741 -13741 149466 250498 -80171 259678 112275 -164977 217643 241575
12364 241575 197479 -44901 155939 167510 248287 250341 -45065 163616 314319 159391 218627
12353 218627 -55143 -63069 92402 -98350 118702 -44109 114252 -78324 29184 -147633 -40989
12341 154848 -235385 115545 4139 99070 -87157 40392 56750 -307753 -5597 304610 169481
12330 169481 -27371 113484 136912 -193891 67960 -123397 40819 117131 42530 -196691 347072
12318 360284 -101125 369449 -71711 19619 230015 114823 -6317 264722 26743 85829 256258
12307 256258 -54168 237312 892 329726 328984 -24925 63242 434490 -231214 -31945 460894
12295 -174279 108675 453408 90136 -223919 115568 -77635 -20925 67105 -68982 181979
12284 50373 -161379 -70859 82144 -145204 -16154 -76457 79243 196647 275633 127319 -60686
12272 407987 455489 64221 143968 -50663 -185000 -150628 -100000 -57996 -49207 196456 -188220
12260 80163 138034 215450 79532 -187186 100317 238001 310807 120903 410598 157125
12249 22332 38046 132431 -148046 -14951 220905 45177 548364 -24593 110918 82419 210714
12238 210714 277624 97376 9834 212056 -120126 -70516 -140778 198357 397775 114301 262946
12227 262946 -34896 95071 93802 299859 165530 382342 -388799 173227 159210 28588 457061
12216 457061 -112990 36750 477720 387915 -78535 487104 123337 279485 -21330 -185209
12206 -185209 169369 416407 204955 329023 184990 643932 123486 458344 94677 388075
12196 388075 365057 204877 95593 102902 63260 142835 40206 -17569 8877 269732 271031 176241
12184 176241 -197648 -191549 44175 42296 649757 226564 61095 110795 35420 -110974 -29172
12172 108273 111354 244625 -91837 -144842 120026 -280631 -296127 298185 -79389 277479 -43735
12160 46885 270537 316761 5910 424951 423770 304325 158047 133182 623835 639704 178976
12148 -65963 280924 272937 137122 309547 348288 -5310 63556 223882 -149683 96002 469567
12137 469567 299031 305408 -85807 -354881 373872 -94324 -22055 107452 136525 -232057 143814
12125 -111048 134729 99599 184008 -107148 70429 -86403 9825 126508 176341 102319 130941
12114 130941 262805 56978 69855 183723 -138556 368972 50951 19006 -161823 177335
12103 150823 321633 21999 221316 -231475 62474 -130149 91683 86407 229427 -39415 -11130
12091 172380 -87091 -10288 254756 -139924 57789 -53775 -32312 196016 118241 -205537 90884
12079 58482 103127 -126481 123913 -71101 -211996 292437 80854 39024 -244930 -175678 15153
12067 -24128 100121 341061 -62111 -28072 30759 70032 -3189 36127 -111092 175401 -25219
12055 -8709 -177382 1815 128477 220641 29517 178633 26123 114904 264332 110546 266873
12044 266873 106961 -93691 214123 -131090 128398 -219447 12421 -315463 159968 180667
12034 180667 -181469 56700 93819 -33599 107285 -19448 -209457 -246432 -174570 113801 165319
12023 165319 -212676 -65179 118708 119460 135539 -119091 -44264 5582 48529 -256472 -122981
12011 -49004 290192 74780 44877 -21364 117825 -310375 60369 255175 49234 430730 220548
12000 220548 275880 -94513 -161387 -69505 8122 254701 285569 220318 56339 161647 24768
11988 47194 33400 234435 -58157 -19758 103296 121948 27226 -46045 -114941 17816 28846
11977 28846 -76997 -229365 -63669 241041 -336571 -86499 -5963 213246 198981 20146 230604
11966 230604 -128749 8866 -117650 324987 -140985 -51940 252352 312688 18072 165870
11956 165870 -8639 79381 -335040 -251983 -118519 191017 -138012 -161267 -189555 91883 -201869
11944 116095 110998 209206 -312798 95870 -68130 213117 108627 -58815 192300 312989 -121468
11932 96789 -217220 -176843 -18937 196415 43681 -26120 65348 229545 -16459 237747 -200272
11920 194388 183594 -155667 -163459 -104673 -224177 153469 -58849 -159309 267088 -170154
11909 85771 -44447 95119 230950 72316 -12573 167773 236616 25252 -20213 26463 199803
11898 199803 -62546 96165 -210432 72284 314551 -313927 300208 -31276 -121636 15991 77443
11887 77443 -16013 -162552 -513407 -72530 -3011 176906 -46340 -239564 -59193 -72581 -332057
11876 -332057 16364 -46672 -156355 -9147 140399 -82351 207724 30143 -212601 -162184 23288
11864 55322 -220768 75670 66924 5919 240345 57642 41192 118635 -13176 34743 76073 33954
11851 101050 355888 56652 102502 247953 920 45695 -77535 63364 -235898 354280 1775
11839 82647 106080 62052 -2975 -158438 -1096 44041 -3991 -45016 251976 -165216 -238738 -35731
11826 -176626 27215 -18269 -41610 192589 46180 48462 24915 89758 140128 62521 -358603
11814 132792 -96531 -65168 -83274 -294844 264294 -25188 20614 -39531 -277437 -108753 54065
11802 48279 88597 219163 -41405 -200313 350439 -36695 -119234 -304099 11522 18237 -50934
11790 -437644 -184932 -232981 304369 232701 -133047 78553 67109 -7213 -262832 -148615 -324017
11779 -324017 -100484 -66580 -52290 -199224 -46303 -162210 87531 37907 -179879 127865
11768 116381 -176795 26637 -122909 22900 -197569 -124459 -9571 -172317 194099 -199774
11757 -42032 68968 98579 218655 181674 -37606 220996 -105410 -40386 -160749 63790 -365977
11745 -84906 -33589 -22955 -50676 155609 -49197 -189893 -192614 -32256 45097 79005 -48193
11733 144853 -202058 92984 -138193 -10689 142968 -209008 68928 331495 -38936 170054
11722 131771 5495 23461 -66086 -17449 -250706 -92531 11099 212787 95302 -173960 -112534
11711 -112534 106423 17976 98537 279639 105521 72470 358044 153598 -88326 30092
11700 59084 -30370 -94603 -100968 -264797 -214714 -230740 62390 25635 212803 88106 -73786
11688 -155562 54964 -209815 -47423 262997 -5604 -53765 -28735 -38446 176422 -114511 -59416
11677 -59416 276091 -2576 108206 146904 -23806 -317529 -239461 184191 -92995 -120385 -152342
11666 -152342 616419 334579 -77917 32564 -120289 197378 266509 -100463 67573 -300410
11655 -158968 -247967 -24676 -254187 73823 118593 -94773 7965 202858 89514 -158786 -2933
11643 101276 16942 105417 147647 -74227 -78261 -198285 -2050 -89213 -179014 -112131 122979
11631 31353 -234494 -86560 -169190 115633 -180342 153926 -134683 37670 197627 -105302
11620 129113 41733 51685 -193620 -30764 -106092 -95045 -370703 152942 -264463 47167 180352
11609 180352 246382 -129837 160732 32633 253312 472945 155456 84415 -135822 50187
11598 114313 124847 76259 -33332 101072 -189584 10831 -46680 -11587 -138732 -32293 335687
11586 -62911 -32248 93810 17552 -147299 22806 -135876 303009 234024 -182212 290444 21920
11574 30896 18627 366877 -25734 -17355 -1995 200061 -75972 216538 62274 176886 -256088
11562 -50500 79417 73430 -139648 107103 -18643 3849 177418 4525 -123261 265395 130694
11550 23496 12624 160225 69198 9160 251575 -5058 61114 144857 239664 53319 83313 -141442
11537 108104 -119877 224635 229536 114974 628 -203701 -156851 166626 81828 68273 -204889
11525 84425 259521 72189 -140532 259598 -153855 338116 129547 140127 -99966 4773 14330
11514 14330 55490 -51241 -249833 -21639 24743 -80354 -121921 170700 312504 -185688 -48698
11502 150557 103454 66685 307903 148826 362020 -3648 265530 334998 -27058 -168059 -229235
11491 -229235 -31031 -59893 273624 329367 -42973 137185 20702 158287 146742 -57917 -362607
11480 -362607 134185 268626 -63832 230628 33931 -47339 34467 -173818 -37955 139927
11469 -85342 310855 51961 -15473 -196554 -70279 -155515 26041 48117 129813 191598 109307
11458 109307 18096 156187 162121 62267 -37896 370523 128497 -23267 259976 24109 299647
11447 299647 185430 -59132 328208 182795 21892 -98896 23298 41534 90924 118460 -55492
11435 -15894 181603 367069 17632 181323 113958 123662 141895 -15425 -129395 338889 302319
11424 302319 264380 328826 72148 -40832 250337 -38579 -208959 381274 107651 -109918
11413 302969 176640 25436 -28929 -178214 122188 30879 125803 -151118 -50283 120024
11402 -172131 -136135 80924 -88065 -232137 -110425 -182389 -119621 -143994 222840 -175797 -322400
11391 -322400 121399 -48958 -32898 -42851 -4437 -192145 62388 -46062 -149568 51803 -304579
11379 -191521 255428 22521 -318833 -22027 -97486 345904 52564 -58463 -106019 -115540 -100610
11368 -100610 72694 -65272 184817 -24866 -148920 92585 -61415 143355 4056 149376 51055
11356 87514 -224789 202742 44506 -239170 6730 -81098 -124580 -167702 109957 -76493 -109408
11345 -109408 -222846 -192263 71739 84520 -87738 -113096 53792 34223 -92252 -225843 84820
11333 -112156 44128 -233202 -347342 116002 53232 93684 68842 317088 -94279 26874 155725
11322 155725 -207300 -107144 -49655 378136 7618 -127529 -67189 -157490 -270932 -216015 136282
11310 154762 -18204 -290826 -136935 91213 257918 -215146 229658 -396454 -88316 121064
11299 -179425 -122995 -158711 -7861 250673 -54810 212878 3828 -255783 308722 -390109 212139
11287 275509 -403508 -277971 75289 -78320 51967 -87468 67634 -83229 -134871 -95230 23787
11275 -65632 216400 -87996 -114600 -48423 59842 -27829 -92472 66882 -93807 -179558 -189957
11264 -189957 -53389 -185732 -44247 -248382 328947 -316137 -248412 -180275 -264325 190308
11253 -127807 -77933 -159814 250805 15728 140086 -108969 -34086 -154512 -265549 -91680
11242 -226885 31888 89191 164207 -136855 34441 56817 116149 59468 127384 172430 55600
11230 114621 -46362 197884 48075 -117882 54120 93433 -182699 -163591 -62824 46300 58692
11219 58692 -191200 48171 114327 -372650 158881 244290 -142006 -132700 -426980 -42631 101133
11207 -153926 288192 -135035 188457 114577 -86370 54754 261808 -91435 -15368 -191738
11197 -191738 -102036 -122759 16395 103075 25409 159483 -45391 105121 -100101 190037 -440103
11185 -165827 -25991 -151220 -305422 -180597 -86721 -148371 -48911 -78161 -320209 -76802 155005
11173 -136456 -124402 -243952 -110869 34764 187187 351587 289309 325956 -183935 106803
11162 131754 -270314 -111458 -153545 -263913 110985 55108 -52098 26752 -60010 50515 191033
11151 191033 -140310 -248791 -97556 -76882 -171450 -900 -387903 12334 -50938 -78029 -341251
11140 -341251 153249 -286001 18572 -87834 -283265 -74310 -46538 -258260 -75063 -83700 167053
11128 -114978 -161499 -39713 -43825 135980 -109518 -302038 -36975 -486649 185425 75503 -214827
11116 -191832 -160234 -272507 31002 -42239 -19468 -96506 -48944 183733 300505 -158049 -106803
11105 -106803 -89812 30293 213031 -49481 -109361 255600 142682 -126168 -17737 79365 -92153
11093 -149422 318618 -165084 94501 82909 -274878 107544 366078 -181980 -69746 199638
11082 156365 174905 187824 168520 236258 203479 298218 -202348 300464 232093 -52115 153327
11070 31718 327986 236328 -43368 69706 177754 99262 358219 209986 219165 258449 335920
11059 335920 347374 -73645 153004 83459 28918 242164 108262 134107 200457 185345 410556
11048 410556 244566 315136 576798 414107 523643 448459 508318 375131 425330 476883
11038 476883 622503 712353 882838 447634 972477 537146 749648 888342 465151 654527
11028 654527 669066 467890 532623 632691 621370 599002 632230 549930 825060 363531 669695
11017 669695 855368 471169 354294 553478 881366 577019 399286 503990 795126 702313
11007 702313 645898 525931 564598 523333 615744 722535 771897 562791 547764 481244 608019
10996 608019 351014 726374 563736 244839 659747 616222 715737 736454 450241 568322
10986 568322 442036 703870 643225 326965 669550 270065 834654 919521 540765 462126
10976 462126 743979 339039 947045 696194 607287 542009 830555 739124 750905 1002311
10966 1002311 596604 983093 1041576 788097 728688 855229 1300308 1495349 1689222 1622999
10956 1622999 1439614 1801657 2099024 2027159 1986040 1823320 1643388 1812365 1666778 1675598
10946 1675598 1256530 1200617 1506330 1334430 1022008 1457179 1454056 1225842 1576283 1311224
10936 1311224 1238949 1187805 1027661 861117 979074 996575 569590 404790 502813 148023
10925 35211 99982 401810 335871 310283 125108 149397 141600 -18448 233994 182389 243672
10914 243672 31968 271950 307194 393141 -78021 51826 -27781 -420829 165075 91778 39893
10902 10135 19158 84683 -119746 -130384 -89099 -238249 199565 -94460 -361549 -2747 338073
10890 -190128 174750 -258696 30723 -117446 119209 244457 -55928 -189062 -264973 -106530
10879 -573003 59770 -265370 -101450 -36382 -185700 -179655 -3716 -62612 -24664 -81490 61330
10867 -192979 -29509 -133828 -120912 -190015 -94784 -108410 -155604 -49362 -34485 -8332 183596
10855 -132637 89651 123336 -198185 144843 -195154 -55043 180083 -14064 329564 219653
10845 219653 76771 -334835 -4085 27170 -116100 -277587 -27930 -335922 -206103 -221573 142481
10833 59954 -216029 -70100 60802 268419 -377985 293766 168791 -125862 -49736 128152
10822 229894 115783 75694 335982 230960 -152030 -354769 -114010 -158409 -68053 -101776
10812 -101776 107562 -29425 -69016 -72360 271185 -381728 -8026 -4066 -227548 -178518 -165691
10801 -165691 -71927 -156696 -406509 -76366 196415 -153266 9333 161989 -351657 16201 -171519
10789 43708 -300065 -78278 -549326 224412 -219850 -32406 -167809 73584 -152901 59382
10778 31743 -91176 -91657 -19729 -133169 -17187 -78065 -87585 190105 -364275 18199 -245412
10766 -14602 -268065 -212069 93322 -120615 -202038 -85731 -99656 -4377 -340874 -57217 103965
10754 -189151 -42719 -5826 -115454 -184045 152125 244889 -185588 -315906 90411 -203651 -3894
10742 -128485 376031 235249 38133 365578 184613 -124281 147558 -34218 72828 -131974
10731 6787 -8309 187827 -296580 -167725 -181798 292304 -187227 279967 -151229 -74234 -184401
10720 -184401 -95884 -209485 92478 -8108 -213947 324679 -84460 105533 -215426 82200 61982
10709 61982 265823 -12583 -45121 -174404 -31493 -45408 -276233 277124 -231923 -120489
10699 -120489 -251603 138523 91124 87561 -101781 177420 -192953 -22462 69671 -496593
10688 -131748 126654 43074 -148424 76855 59831 -67230 294248 -397306 56192 247817
10678 247817 33901 33934 -80476 111448 -21948 -131441 -140072 188578 70492 147838 317866
10667 317866 157573 -158729 -332940 -149924 129540 -51067 160485 174478 -77025 109863
10656 -151910 -87372 -342880 -28322 44551 -560514 -57287 -251309 -160728 325 -283480 217055
10644 -26485 481321 -121029 -154724 612 98934 -169990 -152863 95800 -192089 103132 10401
10632 -27426 46427 -268214 -147813 -56758 127647 57389 -68835 171390 41613 -59364 110488
10620 -164174 -172156 66555 -110413 -7602 25798 -28940 -224060 73678 89868 -358565 309565
10608 6844 226658 -346227 257847 -84655 -121656 -307106 55240 28866 -131842 -102560 -36670
10596 -299782 -231899 -124122 51208 228700 -113892 96049 144996 -147962 -48252 197961
10585 -200868 53499 -177679 -8592 -56934 -141253 -18761 -278353 311184 23007 -196666 -377703
10574 -377703 19677 -88342 -306810 45939 100531 -191018 -397546 -196890 644 18304 111257
10563 111257 -85176 -11663 13190 1104 160876 35728 -152898 -251706 81381 -133224 -175861
10552 -175861 18160 -93920 93108 214385 -381324 163392 255303 -252461 -48483 244813
10541 -325104 261533 -172213 112586 148114 -20879 81077 -206804 56463 119220 193443 -79157
10529 111136 52943 -279587 -121263 -84346 149748 49923 46698 -67711 -360363 -49427 -26769
10518 -26769 -79895 2488 -142872 -22594 405610 340800 226159 215613 21379 -221693 -102874
10506 -222794 224378 -164617 -177033 -191577 -74700 -84122 -162749 302404 -59663 -372588 -297558
10495 -297558 83828 -1587 139808 -131590 -299619 -217048 -29299 -150823 195635 26799 182679
10484 182679 -12968 26635 -159516 25899 1072 -145291 20636 -161789 207924 107837 -102572
10472 82424 32516 -256845 -219844 -27775 116576 -290702 16585 -69843 371910 144044 91688
10461 91688 403580 183820 344477 379783 153738 -43040 150874 -69770 171641 -30034
10450 -150286 -193835 348333 182958 424887 -82994 -39367 74870 29046 198488 166966 69105
10438 -10129 -157149 153403 -56455 -182712 -124918 276062 -82666 -129553 198142 -220813
10427 -68154 -45898 -125773 -36049 -77474 40458 -202395 -295980 -81772 -161709 76307 191590
10416 191590 -131914 -152592 -300724 367532 -1159 -207391 38977 -121388 -112496 224627 -271440
10404 -281198 395641 -116193 -11348 115303 -334643 -250161 -143982 77329 169354 -154462
10393 -278365 31245 -230200 114777 -295471 64973 -275430 -78804 49588 7308 84633 -27791
10381 197369 -64058 137071 -157634 143961 -204056 14275 -112112 -16846 143736 -159917
10370 34219 -243404 -144127 -55618 -4023 -124254 49159 -38563 6675 364972 5344 61688 245953
10358 245953 374979 318554 155155 -3687 125100 -11363 513377 488965 383629 114756
10347 173467 475135 93004 224298 189590 242773 334170 346265 20867 326465 76891 172788
10336 172788 482279 211979 368786 222445 306823 379474 133587 177964 165559 197916
10326 197916 9231 237819 173018 162683 536281 -66124 90734 79824 250179 126696 -230131
10314 327500 -191594 154539 353469 118185 230608 -30550 215188 329497 295188 280583
10304 280583 471617 -30481 211383 269117 278088 -10371 -6528 335865 354142 129023 138902
10293 138902 -72384 -177179 -37665 -246805 -36667 82699 -39512 20454 122851 -106710 93380
10281 -106107 -7031 120728 53236 5877 -241235 -83815 99936 114933 -75518 -23068 -245254
10270 -245254 428061 185999 -39094 -100694 66282 -318983 -217423 118613 34642 67403
10260 67403 -168299 193431 178188 73816 113639 53349 144601 217134 118629 -130069 -160623
10249 -160623 84568 136586 -76247 -255292 381381 -411272 185001 -57261 10181 -147904
10238 169411 199011 207896 -355524 -20479 73235 64976 -141285 -81597 -195770 -47860 -96282
10227 -96282 -122864 58378 -58100 148993 38816 -73238 -122110 88236 -420437 195399 327791
10216 327791 -50262 -349662 -110328 -16728 -18536 -94788 -49375 -135674 -420275 -282807 -28939
10204 282405 -69294 68067 4072 -176863 -142721 -3396 137118 150451 256296 -87117 -183462
10193 -183462 105722 -6922 16988 -271039 -78564 -9627 -177497 108078 -356262 -165010 -109489
10182 -109489 -96841 -216462 -202154 -61972 -29698 102990 91061 -285212 -328915 -156111 -68190
10170 28638 -193089 -138407 -195279 -136736 119830 -42804 -456672 -28314 36823 -270896 -131833
10158 -46416 -13197 -184634 194576 -212225 37077 2017 38743 -112360 131654 104849 269328
10147 269328 -50082 -216439 -122861 -174262 -95572 -265548 -59400 -223627 120614 46655 17044
10135 122339 20509 127469 68056 91476 -165264 5092 -106420 -239545 -265663 7949 -452441
10123 -139842 -132385 -193769 32954 -193050 -30303 -141714 -166887 -261279 -295905 -64642 -103536
10112 -103536 -106952 -445507 12736 90926 -174549 -58763 -237598 -175242 261565 -281359 -404438
10101 -404438 -142647 -130356 -229509 -119095 -165375 -289687 -88935 235329 -97300 -105450 -103486
10090 -103486 -32197 -99811 -38771 19428 -378685 -49910 -118076 33042 -4299 -114146 108899
10078 -21477 116042 17489 -38984 -73046 146496 -75029 83913 89888 131118 160004 -80714
10066 -166717 196258 -137183 -59275 -7547 -150507 99004 -32437 -221851 -299234 -122561 290591
10054 -191187 -7730 -105922 -216920 -62327 -71915 7548 -169830 159784 -223557 -224543 -350674
10043 -350674 -266014 106877 -181410 -64068 -15216 -80970 248345 41558 -294526 -34424 -148928
10032 -148928 -30648 64154 -236087 -277043 43621 -133885 35657 -223875 12778 121901 114995
10021 114995 -101005 -341893 -149449 -118440 57125 -201397 -410790 269900 -289241 105462
10010 -186035 271575 -58345 75706 211703 31721 198116 336850 -304073 256574 -144030
9999 1812 281542 308796 -130711 -448836 -286228 -43976 -80278 220950 37403 -76180 151873
9987 194014 -144628 -331332 225237 176424 157810 116979 19314 43213 11898 -123161 112968
9975 -193830 -206076 -74341 76230 186673 -33798 -228466 -184765 -226788 -261657 2857 -370497
9963 -146981 -342066 110938 -291594 3896 -28038 -493119 -93176 -8831 5197 134015 -77385
9951 -161986 -14757 -274274 -343575 37989 -18387 -221034 -263433 47337 -114263 -201491 -207009
9940 -207009 -13254 231590 -101885 -239254 -56613 -273216 -21537 -319662 -95336 -117221 -101099
9929 -101099 -433031 -104477 -81105 -214936 -189574 -244973 -230011 122748 -131904 -138875 -271756
9918 -271756 -454887 -63406 -242510 17149 -479112 41523 -466711 -86742 189191 -93978 -287690
9907 -287690 -337659 -31095 103260 18822 -70254 -282093 -5308 -17661 -15912 -294819 -210061
9896 -210061 40096 -45732 -51665 -22833 -97799 -9159 -39640 -364939 -10027 119053 81698 38597
9883 -384928 -231015 -19551 -270313 -107842 58437 -461837 -131389 70826 -108179 -433520
9873 -433520 88179 -38149 41565 -388468 302975 -216845 82944 -56320 -274526 281258 -275188
9861 -287750 -50577 -338290 68314 -150993 112835 -248735 -88735 230256 -424000 -227372
9851 -227372 -403636 -292607 -440162 219812 -342070 -75352 -40637 -177164 46875 -100724
9840 87479 -110811 14004 -139769 6719 -179437 -49120 95990 -116325 297885 -264077 162478
9828 -69646 -247010 -106859 -235763 327899 -42759 -6807 19352 -64346 -321377 -76917 361126
9816 44909 131914 -292930 -42203 409254 3798 -74101 -163056 -398505 124441 -166756 85292
9804 116911 -190472 -152075 140453 -102513 -84818 -108715 235125 74398 -119278 -72023 120768
9792 -212089 195791 -107004 362746 -33045 -247691 -201036 46071 -230322 -118843 94341
9781 -195620 22770 -142748 -56410 -49088 -82539 -156761 -127989 -41814 -12831 97746 -117997
9769 -174040 60246 102834 161570 -314213 -242655 143692 -46848 89794 -459464 -173 -285062
9758 -285062 264977 224528 -121490 163607 89101 33779 -279340 -15942 131563 38677 -172336
9746 214251 -198793 77449 125847 116567 -265095 -227292 -227948 81892 7449 189264 260145 -149929
9733 -50024 3503 -259027 169110 -137234 -100542 -370173 -78087 1168 -436056 177213 -255758
9721 391390 -215349 -117026 122251 16786 -12907 236050 -120069 223861 43177 -220464
9710 59807 -83595 114161 -24913 69032 -160168 84931 250116 -6300 20212 -113225 -270072
9699 -270072 -107606 30888 -187814 158676 -153285 -84991 -148052 -103275 -145714 -72107 -17527
9687 -190567 -111035 35260 167393 -271657 -151075 -192980 -16047 -195058 313362 22947 196867
9676 196867 -196176 -97694 2152 -163980 379114 140951 271746 -294415 -16471 -115033 140959
9664 207676 -286850 -121751 -263676 137826 150656 -93555 -16841 25300 114069 -244883 -21539
9652 -83936 144276 -273045 -4561 -131285 69955 137259 -149351 13040 -141080 39048 -256585
9640 -148017 -75396 -293410 -156758 -19627 -283009 -57282 33751 108759 -18501 108752 -133066
9628 50077 -255405 -357882 -23325 118847 11723 82022 -73950 -21049 -247574 -128200 -45071
9616 2985 206007 81122 -86753 197410 141607 -123463 -22497 65230 83555 -75936 -206728
9605 -206728 -25457 80427 54707 1419 206041 -185152 6231 19814 -109477 168477 -165486
9593 97931 -34493 -92097 -54089 163977 210131 -213584 -122483 -22703 85275 -127873 -226697
9582 -226697 16715 48877 126365 -124035 8092 -211183 -323879 -46465 268648 40354 69274
9571 69274 -168905 -501682 106431 -34436 103251 -40685 -102220 203484 -120259 -59122 95400
9559 -145179 -99129 135528 -355316 -149923 -404329 110669 -220474 -189878 11586 24157
9549 24157 -159513 -211219 63033 -127828 -100105 -217856 18649 -74864 -3437 -3181 -96071 -91377
9537 -91377 231456 -122891 -33230 -55765 145262 -71543 -171675 64723 135317 -26701 15433
9525 -122540 6732 59019 -104521 -180823 -263232 -157201 -212456 -6878 164681 34493 -91815
9513 -128460 -319546 9563 -330809 249010 84442 -38463 66536 46101 89337 20715 -40231
9501 -82124 -226028 114875 337279 395719 -376005 -95601 -254299 -236538 -200897 105635 280962
9490 280962 -153525 -301676 6884 -102698 -64379 219523 -83945 -31702 -225922 -125117 112642
9478 -398736 -307589 -275045 -121833 -116918 32582 -122065 -144294 196428 -112927 -175186 -87712
9467 -87712 -14463 -111062 109091 155418 15522 -27461 -58220 -95447 -87090 -111884 5160 -185665
9454 -73456 198266 73393 -381107 -174836 -163850 -44144 -232605 99358 -153927 -113608 280638
9442 -151406 -126339 198344 -217098 214825 181970 88285 -235811 -326216 -152088 -234528 35707
9430 13288 -402406 -214325 289220 128932 72092 22401 69555 243415 -230545 -257110 121643
9418 172592 -97232 -208733 -65016 -120915 107866 -47739 4696 188439 55743 147461 34439
9406 301325 49396 -49007 265928 252375 -217767 77256 463 -48378 -50581 -50494 -214624 -43819
9393 -202606 -164881 3578 -241555 -61229 -144062 -435393 -118643 -491616 -13833 40823 108025
9382 108025 -239509 354965 -257344 -56272 264986 -69041 189500 -144776 -201273 102902
9371 80687 -221273 -68740 -138322 -88096 6164 28282 85513 -188221 122716 -182501 -26186
9359 -301962 47629 -68281 -110853 -33621 -228 94300 137644 -255391 38531 -101828 -7051 58713
9346 -312980 -289569 -101675 29428 132594 -23666 32811 -154937 -62238 41566 -89257 -429812
9335 -429812 -146056 -304457 -142103 -27429 -280778 -150830 -280807 218941 4261 -447877
9324 -38328 148056 -130394 115027 -36608 -135288 146424 5813 -225293 28990 114556 241014
9313 241014 -56647 97648 -136311 -126969 79985 -170044 86511 33143 -3961 99235 -364189
9301 -499254 -7543 -83725 -57016 -149653 -114765 -41108 -14286 35424 -207281 -4253 -305687 -304566
9289 -304566 91749 241440 -267696 -249151 -162015 -194435 -197891 -126144 115595 -43967 57060
9277 206293 -29488 -114279 -117843 -302146 3102 -133831 -149314 -67211 -94341 -21622 -211145
9266 -211145 -241529 -132655 172390 20587 -95244 -95444 -182374 -391675 -136725 -34711 101607
9254 -100548 -96344 122888 -240810 -35701 -11746 -42184 -33836 -38654 9276 -19280 59819 -110900
9241 -15182 -110320 -108179 -25165 -118860 -83980 95256 -146217 -162467 -249451 87897 -29941 -405593
9229 -405593 -292051 -414975 -148128 -7588 -339711 8580 105711 -369084 -96778 28969 21714
9218 21714 199695 164027 -195540 -132005 170347 -20935 -251020 -57340 -177252 -84598 -281047
9207 -281047 -111031 119142 -20709 -178864 87827 101576 52868 -73411 -129068 30032 140626
9196 140626 -76451 -41484 112004 -176862 -214264 -383857 230665 -271391 -178488 -110528 142129
9184 -142978 72827 51181 -116560 24112 -181753 -75225 150081 -288265 -127632 64839 -292416
9172 23593 -608584 -79473 -325482 -257901 85671 160354 -12089 -212255 -110289 160628 152124
9161 152124 -32449 -10152 26186 -68119 -367516 146982 -63702 68149 5173 -72359 -155222
9150 -155222 -57152 7060 40444 27465 -110822 -163898 -25319 -75797 -233710 -325618 -347536
9139 -347536 -91715 -4115 178125 246647 -215313 -326778 -39238 68784 -195296 -12924 -99853
9128 -99853 -205 -26389 74325 -164923 91049 -183088 -19463 -92926 121759 -429073 -210753
9116 -178425 70532 -54113 168379 -96001 -260290 -1258 -347173 -163465 50556 -98105 -7372
9104 49230 -238565 52988 -34577 53425 -353684 -6145 274476 184383 4517 -277494 -296576
9093 -296576 112467 -24090 -163657 -191303 -123282 130745 -208469 -233426 20687 -118289 -181686
9082 -181686 54008 79177 -241119 75338 289613 161551 -56941 -76651 84287 246417 -256030
9070 227035 -118745 -316650 10573 318815 310312 -94679 14993 -42556 -166137 -297169 188471
9058 -46154 113003 -340261 222360 -76749 -130243 50155 5259 74581 21561 2581 -88978 279684
9045 -247774 -48974 -32693 145867 -279848 76809 195559 -213267 3775 -87952 -199811 -225815
9034 -225815 -219695 279194 170406 -175592 19841 -43259 77641 -156008 -75395 35648 -125239
9022 -15063 83192 -86614 -64972 -129446 -288939 17632 -113400 -95123 -75998 101252 -62776
9010 -245793 -61691 -66432 -203333 -307138 -91980 -56537 310022 -69272 -191524 171675 9677
8998 156806 -47072 -41125 -506900 -208561 297079 56167 -216857 -244288 157797 -524980 -30439
8986 -110819 -30156 -85577 -191252 -205693 -69396 -114940 -52930 -354701 -48961 -195703 122009
8974 -156662 2741 -36805 -86664 -229871 108324 -55958 -144398 182971 -164996 -141080 -212143
8963 -212143 32356 -204179 -50344 271004 85098 -82731 -240832 -20546 -199177 -410720 -155735
8951 16320 44488 30420 148392 -172908 4702 127637 90415 -248346 58402 -162107 -60930
8939 -215321 -154312 11792 -157034 60269 -26521 -42193 -87731 -67540 -210606 -307304 -109976
8927 -274439 115494 -235681 370383 -403391 85361 -221048 148939 -8400 -130404 262986
8916 127898 178411 267754 -71564 167994 200092 108850 318519 241226 629724 630684 1040005
8905 1040005 1913686 3362661 7739440 3127895 1601227 747291 438814 508718 297371
8896 297371 87290 72918 217057 53105 -23477 24142 226597 316185 -210855 184441 -106817
8884 -46710 132692 125082 61351 -384657 128219 7077 97431 215686 13046 156739 -210358
8872 -11044 -466483 126406 -93980 -55897 -249246 -212852 332643 -43352 216448 -103958 -198637
8861 -198637 -26977 -283824 23498 -22151 70445 -210852 -69912 -186431 -433249 139662 107406
8850 107406 117151 -151338 403090 -23943 -162776 283831 -98148 162400 -240954 57009 -200473
8838 -250942 222308 178901 109724 251349 48072 -219917 -178492 64311 220312 5154 268896
8827 268896 255774 -54332 -499747 -68928 -149992 -336455 118415 363558 -13202 -110966 245481
8815 14732 -82768 233827 -131965 -264086 -52311 14877 51225 130734 25223 -238162 -118860
8803 152908 116309 -126985 -79128 -50437 -49848 79659 57180 279719 -251772 81877 31592
8791 -565737 273925 3881 47499 -154045 18004 -160892 -31030 255083 39862 122074 25013
8779 186928 -47894 -115048 34027 43167 -67277 242662 -172440 -161772 -141539 -221798 -71633
8767 192242 -238635 -222993 312369 237141 122499 -94753 132768 63791 -172620 82130 -458036
8755 -1794 -6260 298082 -89877 58662 226571 29995 -74856 99566 -65545 -111795 115825 -171240
8742 -8634 -320909 -189836 42235 -158980 -224097 -8680 -129541 23 -33545 93378 -38179 -308361
8730 -308361 -87664 -177506 -232485 -280831 -194560 44900 -229369 105086 -11240 281066 9602
8718 -80534 5571 -209805 149182 -331630 -63233 151601 -46820 -95870 -107636 -358210 97065
8706 123183 101068 165808 -27530 -86303 -311051 -25412 -11490 5361 -116010 -220849 127859
8694 -58991 31742 247105 -95859 130801 -64923 3424 248082 -193562 3099 -152216 -238485
8683 -238485 43117 67720 -357452 -177043 158644 -217303 207685 -9869 256007 -46542 -19534
8671 99624 -209879 -54051 -429788 14345 346850 -63596 -14471 -64449 -211024 106876 253233
8660 253233 -101005 52850 -469669 -78309 -81078 -246359 -75322 -17893 194895 -35055 -216812
8649 -216812 -185157 -301551 20403 -326247 -269889 53466 -201681 341609 -87387 47293 141819
8638 141819 -334554 -74089 117939 134209 -292555 -84140 41169 -23156 -529547 -74907 -112462
8627 -112462 -257284 148792 -12157 -1824 358472 235653 90451 -29795 -227413 27205 17473
8616 17473 -36006 50243 -123081 123489 62461 -301346 -185028 -135323 204678 59870 -296481
8604 -75928 -202870 2469 -369679 -184402 2943 32146 125524 -362729 -28813 202838 -77673
8592 22612 -174539 -367089 240313 -122493 -28872 -221529 -268016 -39004 195634 218325 -40379
8580 -30723 -255487 101344 623 -442510 306324 170851 -178396 -42978 -112698 -262469 45472
8568 104692 63502 -191726 66535 61048 64876 -207884 -222981 -19533 -46142 -19587 -494864
8557 -494864 -105284 -228914 -128204 151625 -221376 -181841 -18618 -50098 -246631 -369138
8547 -369138 -145950 -282826 273189 -81129 121960 17009 164890 -288856 -364427 -317534
8537 -317534 69149 -158412 -93301 -145741 15343 -28692 -80162 -62890 57328 22910 117844
8526 117844 -149140 21121 -123215 -44060 -218408 13137 90924 52287 -89243 -38653 -143217
8515 -143217 -127283 -94878 -75811 49624 173845 127704 -110967 -54553 -11987 -39001 -33545
8504 -33545 41312 -197570 -34942 46006 -56252 -186580 397765 -79665 -39693 -15749 -184499
8493 -184499 247186 161504 242430 -297554 36518 -106599 160635 -24517 -111940 -273196 60024
8481 3448 -52393 47252 -273214 -92917 -18125 -37443 -138669 91836 294086 33787 146274
8470 146274 -14671 -403757 8275 -37208 209206 133769 -180469 -26261 235895 16652 236488
8459 236488 -71348 -136079 -319280 -215156 309443 -32959 -83105 -780 274438 -101899 -94322
8448 -94322 49716 -83958 -347101 -154668 76623 430215 -77711 -138608 34494 -341548 172659
8436 -107588 -156135 -94980 98579 -102751 -196280 -55085 -272397 170791 237555 179270 144072
8425 144072 -99525 -338326 225713 -45155 -301998 -103629 -27307 -206040 -240459 169429
8414 -156139 96377 -1326 168958 13014 -83442 31203 -162152 95066 41406 -22907 -237247
8403 -237247 -228080 -339075 -33077 -218 -111145 -194418 -72924 99674 -167427 -136674 -190980 39551
8390 -259407 40987 -71252 -47274 -65764 4261 68907 -415898 -313917 92506 31157 -26227
8378 -72847 -307958 15668 -355130 -85720 -2510 -189847 125691 -369023 34516 50663 -156382
8366 -316914 57589 41356 -349094 -83135 -214632 -47606 -182718 -222606 -263977 -38436 325822
8354 51835 -63175 -181050 -178541 108455 -27249 -344239 -170583 158814 -27218 130034 106976
8343 106976 -16024 -894 174338 -150890 -64555 -124882 17715 -317133 -193224 -177082 -100978
8332 -100978 92029 -248658 -153744 -59271 -132557 -76655 59163 45958 42126 126397 -134580
8320 -1619 113519 -111323 -313549 135811 -246548 -12116 157988 186632 88668 -215776 -64333
8308 -38848 -227132 -364747 -278294 37926 -23007 -150290 -147076 365779 24606 38103 -168137
8296 -92712 -176050 -303914 -228033 38340 146924 249926 -78559 86548 20173 100109 -152599
8284 6324 -18467 96382 -240282 -478818 35658 156251 -107707 -138888 115531 -77194 284588
8272 137791 -244715 -93815 44690 25303 -70041 55190 194093 -70787 -40570 -395269 -173272
8260 -144113 -364483 -49455 22993 -111074 -39801 166313 117169 -105327 85564 117139 -454371
8248 -226757 -307133 -228909 -135105 -63841 27952 102356 -164233 13338 -122960 53099 -150721
8236 202259 183900 45523 172606 196672 -12438 59072 -259478 -100415 -16960 -167697 -79651
8224 -206011 -401910 -389510 -219578 111654 -169740 -272616 75665 -103550 -154530 -99289
8214 -99289 -202967 -111339 62014 -285205 -278523 -203492 -176090 -142096 -191777 24366 -231011
8202 169251 -178820 -46410 -111526 28629 -143275 -78375 215908 93041 48822 -216060 -407444
8191 -407444 112576 -296555 118286 -52268 -148367 -99640 61404 -300036 117029 -168693
8180 66253 179005 -81439 -317638 156268 -77566 -34854 -40349 286522 128943 -281676 98740
8168 -37141 1184 176060 -332237 80854 -114512 -85041 213418 -298861 104443 -222202 65227
8156 -57048 -296635 402594 244008 -64363 -164052 -260807 -133402 -285215 91011 174951 -223248
8144 -279086 149482 2699 -56626 -173325 -194451 -140562 150400 -16177 -216881 -559763 -305535
8133 -305535 -88048 147754 36066 -84988 83288 -206097 -77173 -200014 213946 -251431 -153095
8122 -153095 130340 -217933 -85747 264235 226644 -116828 -119767 -86752 -109078 -133946 -111654
8111 -111654 29702 -52110 298487 225197 -216242 -41099 54152 -204219 -3255 -69799 -232550
8100 -232550 -172340 -84060 170962 -63062 -163323 -156706 101843 -56978 190439 -95936 -61075
8089 -61075 -31427 308893 -222358 -103940 23885 122400 -60785 73541 218278 -58182 -25622
8077 124526 -219667 201774 -19521 -186607 -192369 -157455 15510 134991 -111202 346651 281298
8066 281298 -68227 37954 -48592 -237063 71808 47261 31375 85573 -59858 -108879 -164009
8055 -164009 -58410 54341 -4342 -522469 77402 -4834 -87241 -194112 48368 203107 -127703
8043 -366928 -74412 -156941 -71632 75668 -127030 -51094 -37121 -56883 -268449 -28723 -728 -64518
8031 -64518 -237693 24430 -142804 -309503 -102597 205580 -1769 -77523 128213 -140849 -58231
8019 -132468 20038 -60222 -114528 -408004 41232 132323 -272695 -91622 -156870 -59807 -65801
8008 -65801 -59718 155071 -261032 230625 190606 149089 91539 -279839 -24254 297612 -190243
7996 -226026 -36439 -344176 -22758 100427 -94830 134150 195828 -87333 100266 -33985 366361
7984 84750 5907 -420 -193942 109722 -63479 -99204 41951 -244316 -269124 -399870 -9688 -159457
7972 -159457 -46453 92977 260 239656 -342194 -254873 87668 49557 -157459 -236524 -108587
7960 -147055 -116915 -892 95181 70232 -187183 -68665 119210 46592 -85948 4014 -353222 -9517
7947 -142216 -94159 -54746 -266277 -158493 88708 30018 83258 218846 157498 -285508 176763
7935 317342 -121853 -175472 52380 -146431 149966 -50223 -128631 -150534 -122719 84489 78813
7924 78813 -15189 -157033 -255263 95643 30268 -26411 113035 239156 45580 115687 -54686
7912 -34002 22140 -57818 -13769 -164426 104946 -73394 -16423 -178447 83983 122270 -289729
7900 27020 -358951 -118971 -14413 -141288 -167075 49703 -296185 -157817 -327965 -30982 -54354
7889 -54354 432083 97868 -206609 224781 -116443 80232 63577 -219346 19833 -200753 -300428
7878 -300428 -111513 -276483 180643 -376110 -258439 84341 221322 79299 -170925 -99674
7868 -99674 92285 -184546 -276088 23442 -277816 112586 234942 -75714 107779 -192581 -147781
7857 -147781 -123544 188665 -113998 83221 5558 -151991 -83950 -96651 188518 75179 -549673
7845 58016 -3421 -270588 237941 -50889 -120009 94794 55416 157020 55691 356665 -103946
7833 108503 -98126 -98369 -8794 -134997 27776 -330055 49038 -45171 -27640 -186457 -332980
7822 -332980 113930 -367339 81311 189027 115077 333754 60758 12920 2878 22201 -153379
7810 187779 -100859 42988 -34072 -295515 369199 53191 -122941 56765 -194498 71229 -240585
7798 -235234 -6539 188409 57625 -291050 -71985 -78618 -37924 17206 -44317 31329 -171415
7786 -26678 -216011 -274415 -6160 -126522 84917 377531 56079 244793 -133265 -107721 127709
7774 -115723 83880 -174425 67727 -196770 203393 93039 -271189 -184622 -427576 -353576 -48844
7762 -43379 70329 58397 69195 42397 167352 -275496 -69818 -171565 -55080 -116280 -101754
7751 -101754 38578 -335816 -48405 86918 -23370 28007 -207776 -229544 -332662 -705 -171263
7740 -171263 406264 -15401 -72251 121585 -178935 137218 -98396 274033 -230107 96313
7729 -4815 17556 67739 313196 -127528 -86878 -47655 82263 -238968 77153 -187941 122756
7717 8079 -34096 -177 -114650 135522 81413 44729 -1238 37377 -155910 -99603 -247278 214916
7704 101207 -80046 -166221 126881 135680 -207707 -80061 -242866 38388 -126967 108661 -63640
7692 -404885 95466 -108585 370031 -117443 -24507 -106924 122079 -7938 290035 -135915 173518
7680 20696 -319767 -128223 -149666 1410 -54809 -41854 -122051 -218067 -251119 10494 -248898
7668 -67572 29469 -138199 -49874 109993 -111586 -223303 141048 202045 -26001 119730 -59278
7656 -321868 -191249 -278371 57413 -146662 16519 138946 176188 -104516 382703 -204540
7645 -106581 -396739 -137786 -229110 -389105 41204 -16839 10115 -341042 53480 -720203 86208
7633 -408173 -9572 161468 -41662 -2310 6799 -291349 -189191 -345317 -94337 150472 132833
7622 132833 -29165 -152307 157436 -93377 105958 62234 -61679 -190209 -26769 -3678 -213045
7611 -213045 -101535 -54311 -160690 -55856 -192947 -255667 576908 -96745 13083 281894 89893
7599 -78974 -219286 -36216 275078 -85136 -109180 -105357 -211961 37162 31331 40851 200652 -153694
7586 181379 -246621 -365093 19110 -209018 -127647 26913 -19262 -397384 -77883 -109727 8855
7574 -169140 -200769 76195 41818 -188815 111837 35949 80336 -126782 -48013 13220 -76262
7562 -14717 -127930 -120963 -202135 102297 93192 -179881 -29574 -363833 -26922 16385 515070
7551 515070 -171390 -163757 -12764 -71998 63924 -104394 -276510 -281841 -41592 365376 -120187
7539 85090 -247251 -90678 -252088 87531 10435 154543 -133928 66716 -94442 -25247 124968
7527 -38595 -122529 -164599 -111067 -216487 214049 -33946 108268 -183698 201537 -199100 -45408
7515 123172 -363124 -189450 -157709 244100 -9377 -322914 129213 145422 -187516 235070
7504 -175086 13895 150674 9812 133573 43545 -25902 18850 235007 61195 -264180 205896
7492 -74217 138820 134460 -85697 -114941 122146 -227063 -157931 53384 43724 88809 -142826
7480 -151981 -43520 -216737 -177033 130473 -400505 -126600 -74016 -149485 -74612 -48508 239549
7468 144647 -51736 -210474 -56514 -493652 -26850 -62889 -49705 106446 69092 -253910 80408
7456 -388311 89256 180358 -126254 -212359 50745 -18586 -318107 156885 -29681 106442 129210
7445 129210 -201484 141385 -211419 -115482 -127707 -151309 -171570 -93321 -84561 97227 -32540
7433 -125840 55326 77566 -25835 -101693 154116 5416 -319106 123773 -304994 -62427 -231705
7422 -231705 199459 -206646 -223315 58148 -11799 -30419 204860 -220510 102293 146675 -75282
7410 294948 -285620 128321 154361 -273396 -31353 -222842 -24939 -151040 88293 -212960
7399 -295476 -11468 -37542 -250451 65979 426218 -128192 -111894 -199849 -10686 -214827 -13463
7387 283429 13609 -490804 -114626 286220 -351625 155009 17482 114616 -193503 8186 326585
7376 326585 -40725 97504 -34755 -164260 87007 85955 -145519 -140229 -146801 -177442 -174078 43694
7363 -74553 224764 205951 -288339 156843 -47286 236574 -54284 -266171 -182620 91010 -30451
7351 -1659 244429 234908 -58455 281938 122285 -87937 -81641 158573 -317148 -29953 77838
7339 41673 -75068 111690 74842 149132 123190 -313452 -42638 -41310 -381238 -91057 99993
7327 373028 -155178 -77937 112802 37777 -62979 -288684 -177336 -117268 -229509 96465 155760
7316 155760 -291137 126922 -45897 -91542 -374012 -181080 84710 -882 86758 16018 -32 52030
7303 -189355 20360 -159761 158512 -25621 42398 -41669 -458397 -245064 -243275 207245 112609
7292 112609 -292418 -42999 223877 -151684 207043 -38630 -208383 -249530 4688 -244391 -207653
7281 -207653 161909 140970 301597 -301869 38880 116207 -187957 170960 51657 -220100
7270 134731 212935 25757 -114083 -161754 -90882 88039 134984 206887 120281 149743 89402
7259 89402 -203621 112953 -145734 24498 122482 -55570 -75839 -209892 -42758 93550 58860
7248 58860 84475 30549 -249428 -228003 161584 180899 -22038 -30785 57096 -314368 36494
7236 75790 -159042 -35502 41298 -60790 -75590 -18517 -233176 -105213 -218687 -260261 136838
7224 -4646 -128931 -226907 89247 113738 -297013 -25729 -69694 145577 2746 191566 -400557
7212 -84445 -379484 41385 354323 -36882 -41645 -57665 -72985 132881 60706 -184972 -37185
7200 -168783 166022 281370 -233939 -65806 6111 -55957 1818 -224766 -119048 130561 -259640
7188 55110 -74455 -126670 305637 341104 -212395 -31816 -87850 145922 -264228 -26848 28075
7176 -60792 86368 -36279 -282674 283514 -331399 -215426 173007 -254728 -143956 108267
7165 -64362 -323985 -179668 113861 22866 276715 214312 -12378 -4203 29047 -97073 39231
7153 123335 -137248 174168 -151186 89234 231139 60769 -207511 -62348 -68127 37624 160698
7142 160698 152105 24099 -3331 -90301 -85976 -153589 11748 114772 -36923 74605 16819 -114200
7129 58766 -62908 135296 2652 149492 -102053 -130087 -95962 135521 355976 32264 -303660
7117 -65126 -15594 240885 -373107 129970 169102 48964 -276509 169018 22716 -443046 -41965
7105 -9415 33354 -222373 -215952 -115167 -424997 -3424 170706 -337890 -134750 17014 -356762
7093 107360 -123822 -52063 130431 -325877 -105314 -117044 -214109 12947 190412 5175 -20591
7081 27013 -181751 -269385 -230884 300326 -198207 -48489 60585 -24173 -238349 31485 169689
7070 169689 -4539 191189 292594 132031 -139589 198871 -69779 -117306 -56853 492 -368363
7058 -179557 -6227 114853 98883 39522 145355 367420 225786 -78634 63269 -19824 150954
7046 -269140 127360 154071 103800 131569 151531 100346 -277807 -104482 -79778 92619 -297948
7034 91996 -229166 202825 115539 -35898 -307668 91358 48951 -172063 -104030 -58349 123716
7022 51995 287556 -119417 32617 300309 -83522 -171501 -140322 -108499 18206 -131618 16165
7010 48423 -176934 144694 153578 -352336 12791 -232545 -175909 164616 -16577 -3833 -162466
6999 -162466 -66793 61365 -18724 -33047 -115178 -37430 -120409 -75481 -89355 27494 76892 468476
6987 468476 216230 -31289 -172445 -145261 302579 -195588 235764 -165277 -164102 24924 19917
6976 19917 -7179 735 149852 268786 44759 -31444 -30740 -195098 -502390 28839 310109 -54805
6963 16801 -111670 -33383 -216768 -410207 -62671 155276 -287281 246756 -239674 -143524
6953 -143524 171545 15301 242078 -29374 -2589 59569 35277 90140 -274301 -131520 216826
6941 77408 244483 -45848 67649 151787 96382 220820 342677 77439 -82938 -98523 85310
6929 161371 -243337 -166192 388620 -227951 -153588 -194143 -64810 -140618 56012 -8470 -62237
6918 -62237 -61726 -97924 433328 252425 42204 -203512 -232363 -287599 100963 -95775 -106875
6907 -106875 251591 -92885 85523 9450 54077 9839 65935 -151943 5763 -76476 -44417 -300857
6895 -300857 -47184 311467 -259887 -90370 186722 113311 -181543 -331867 215427 50468
6884 99898 65945 -48742 -14491 -119954 -45876 -25778 154665 -195684 -8170 -151194 -271776
6873 -271776 -98582 58370 37432 -11341 -104791 8097 -201421 116695 136639 -442460 76888
6861 59230 145117 -88607 215272 -106837 204667 80128 -125962 -103957 -115099 -273100 189613
6849 260532 34008 -66555 319907 -144749 -45016 -262449 -155737 -151980 50118 -183319 -54510
6837 49870 -96542 -55996 -80591 -267 111559 166165 -31027 -138551 -188739 -97416 -49349 -159791
6825 -159791 80555 -103082 230008 24799 39957 -160111 443073 -207178 -42798 178653
6814 -221633 -53381 -49696 -64378 68902 -83716 -207088 92073 -101905 -77149 263753 53508
6802 350330 -1791 -60744 39951 5060 -181928 16012 150298 -144018 -103536 -324429 263086
6790 -346023 -171682 102938 -175023 -137880 -151755 80147 225838 169940 16856 37837 42869
6779 42869 -263317 -124239 -169542 314446 -92581 46489 -111443 325576 -22987 -135935 -29907
6767 -139780 389075 277741 210555 105555 -117246 61589 136141 125687 61592 41986 -289339
6755 -189090 22977 82724 -79706 70246 35978 139699 -173186 -147901 -80666 204541 142727
6744 142727 64650 67559 -438285 245834 180330 113714 352 -98899 181091 -200481 -73979
6732 289414 -103205 37423 -50327 -172937 -109976 175571 -28840 22915 -159052 63751 -37934
6720 237418 38983 -206091 6269 -66764 -123668 389812 232988 193114 -237133 -30413 -161040
6709 -161040 -264703 125408 -271444 431399 102633 11246 -68610 -11354 -217193 170255
6698 -157226 -29976 61345 41827 64679 -152903 375793 -301273 -118950 -13643 101247 188382
6687 188382 -29747 -150187 31277 -92116 11003 -165374 56465 94904 168877 134812 -136415
6675 -221238 236820 -12284 41711 -74975 -372466 -196204 -95354 18120 -20313 61819 -523067
6663 -203869 45436 -16706 -67946 -124274 183950 -462820 -225612 -255930 257554 -3658 172065
6651 -52657 -527528 239288 -102580 57868 -43321 -234431 408014 91106 -200959 -226190 -21004
6639 224848 -183734 136394 -254124 -322892 204278 6410 133956 -49242 -132655 -388607 332005
6627 152935 29302 -16764 252345 -30870 44608 -127972 -3249 216634 86585 -11202 -202812
6616 -202812 -199167 220741 -291437 15317 306159 -93158 -71936 53608 -110395 18534 -361204
6604 117394 -138342 83677 -72141 256342 -55523 -138658 -4659 -154054 -217850 -378430 -382869
6593 -382869 33969 -155222 96274 -262928 119784 163766 -21322 61426 76531 114962 -27245
6581 -139327 -93174 -354975 27853 -75923 80253 125999 -268980 -56828 -187341 119008 -113122
6569 135379 147100 -156630 41229 39616 23484 -69238 -397300 496370 -26449 77158 -14777
6557 -76242 76934 68953 127965 -81562 -158287 468191 43536 28735 -214234 -92792 -37840 -57900
6545 -57900 25626 326823 -84537 -9247 94637 134906 107519 202868 -156721 25147 114718 -155527
6532 -58200 -114490 -20906 -132163 -60083 -114701 161804 234714 36403 -373852 -130987 148739
6520 75578 35032 -25379 -163067 -343101 121959 33351 177225 -165151 -13256 -189593 150852
6508 -216747 -9918 2245 -105303 -263515 73308 58178 78304 281793 79288 11237 -350541
6496 -159179 -15492 -535470 -83688 87337 -27916 -54431 -214868 -21749 -323357 -48438 142287
6484 243277 -97892 38127 -49040 -60514 -161983 -434280 31637 -6320 -210163 -279120 74830
6472 -84000 12619 -106170 789 -67798 -352411 -9891 93586 147465 126415 -52729 21115 76886
6460 76886 -96313 -151324 -148807 41825 193320 260169 110352 128253 -325433 -72166 287672
6448 -35039 -86396 26100 -435914 -21440 138303 249651 262189 -8304 -208233 100193 -94364
6436 -86977 -165694 191326 25558 61921 10393 37762 8143 -8025 -217357 -194251 43132 249728
6424 249728 276439 -332025 109478 -24243 122482 143395 -270184 -28577 -166953 -236598 -111997
6412 13901 430218 -39227 139995 -193049 136087 10639 -14243 -19327 280948 253624 97386
6400 87735 -145021 64144 -6119 -274419 -122569 26668 -59118 -383278 27461 -8364 291714
6388 -3347 112426 19266 -20549 -38954 41806 180901 -45592 53661 -37938 -392208 53798
6376 138289 -57113 129693 -169199 70352 -41843 -162008 172565 -231018 -323545 -56470 -23403
6364 40532 33170 64093 -142512 -66589 289596 24672 168064 139578 423055 -250935 124089
6352 6738 -59323 292401 -141171 -182836 -58758 4598 80750 122228 -50431 224641 -136413
6340 -42420 -163474 -179614 -304366 58314 -263116 64527 67963 326645 57362 -266259 -323594
6329 -323594 252055 5472 172210 37353 -16801 -170770 20330 54315 219283 149596 -13439
6317 27966 161468 187637 97012 -114856 59332 87941 287515 6039 -209392 -79528 -245530
6306 -245530 65212 -112980 121809 60173 96721 -387785 -384385 -102678 -20567 -24365 198701
6294 -72773 -145877 -96125 -63805 93814 -40751 17343 32701 -212973 -243425 84117 -4999 -177661
6282 -177661 127411 -315984 -136619 -170831 -48590 -239402 199955 155903 -357893 -132146
6271 35834 -44785 265827 55695 -304482 97887 9678 146532 -51716 101133 -272826 -113598
6259 155163 -40444 30432 109117 -155982 90391 -329694 252042 24732 -194331 40137 71841
6248 71841 146132 205399 -121989 -230503 26967 -313037 -177771 -18624 -83786 227992 81502
6236 -279223 -147229 4046 187370 121492 81038 214212 183091 201863 -121756 -216841 -46364
6224 113725 204100 -121744 -232456 108831 -129938 -63216 141446 -254929 207206 188989
6214 188989 106393 -192696 -118018 -14679 157173 146918 11447 238879 -150650 36202 179613
6203 179613 -161407 -193413 -522893 30086 -66114 -27960 -94651 94041 -90363 148035 412436
6192 412436 31136 120186 12365 -23323 -106952 330655 -126394 232123 -381483 -24557 -103729
6181 -103729 58051 249882 -31412 -90036 190802 -305415 211823 -206255 -73277 38819 -68014
6169 10182 -106043 -23112 74915 -12762 -44490 -184099 -76454 204214 164092 -236361 127904
6157 138998 -179049 112970 144427 183279 -97714 -75483 -135192 -383519 -69308 103562 81736
6146 81736 143950 -344620 -102477 19398 -47664 -12538 115448 16737 13682 -259268 -192442
6135 -192442 -32952 81364 66697 252392 -104910 -181518 -158866 -99311 186047 -12470 -17794
6124 -17794 362831 -177641 57798 8869 -369143 -87830 -99101 157535 -125664 245055 144011
6113 144011 -217275 -195325 -65904 -32779 -186291 55514 -129474 71592 5663 -325144 285102
6101 -222817 -138349 31762 285021 133333 -101531 65359 -470318 -74220 -142754 56729 -305107
6089 -232330 217044 1467 -227216 -72922 156084 -111968 -806 -53636 -61329 160901 -98194
6077 49718 47910 -5186 58228 10655 165288 -353901 18262 -174571 -160672 -74856 90026 21881
6064 66826 -202394 -243260 -168349 84679 71165 -227552 204381 -66249 -209337 -188868 37081
6052 -125768 160809 -93312 212714 337096 19657 114653 21066 -66869 -271789 27369 -59998
6040 18693 335036 -284856 387467 -61595 24220 -334419 68397 -3622 -699 -25742 228571
6028 -62715 -72098 -2704 272346 37875 187604 -285533 116771 -10972 -25798 -44379 202917
6016 4158 -59720 348532 281189 -217284 226787 -344543 -167870 -31454 -190854 243411 186721
6005 186721 -528003 124243 -31516 99510 152983 -130627 268144 -74817 -375521 -102101
5994 -80566 -307361 304819 -27340 -230414 -193113 62243 65678 -90888 -314587 105982 5239
5982 129215 144142 222051 73015 -98278 -204607 67628 233407 -151457 -12655 -343508 69971
5970 -73420 -18078 20449 232697 134043 139663 -71807 56014 89767 -61679 -103274 13234 335857
5958 335857 -11791 -148301 -62717 -250616 -301545 -170335 -237681 110669 80076 107862 -233527
5946 -37033 -81551 -154820 -97665 -240099 206844 135784 -132532 -244105 100841 -64166 121530
5934 -74092 -104775 -342138 -401100 -68410 -445481 -90349 108927 -220642 13034 176183 68926
5922 35180 -179943 -280271 37228 -28418 -312148 -61784 94956 -18539 -7681 297562 138051
5910 33685 -127771 -269255 157944 -116142 -72656 284885 120035 -126507 -77275 -89677
5900 -89677 -123305 -96808 -206890 131446 -60818 -131765 -442554 -13911 121577 -112335 6017
5888 -107868 -71815 135298 -96317 -10464 -291722 47375 49038 -36416 139943 -29137 39344
5876 -8493 -76130 -168660 -41032 -62868 255514 -15001 169981 -77538 119459 151317 -85901
5864 89 -111321 203870 78399 -182564 -88482 295587 162857 124054 -100019 97442 272705
5853 272705 78429 29853 -35468 102881 -56784 -47358 192012 -302397 253957 178361 450333
5842 450333 -69845 73359 169237 16060 -26272 46907 37349 94191 124855 -144951 48620 -501906
5829 164904 -235522 42969 192561 -181491 -74900 171581 275579 -208958 -98306 -233690
5819 -233690 -56626 -139491 114837 226395 199047 -68042 -12903 179591 -31958 118629 -63202
5807 -236543 12597 165602 -31349 2996 137194 -217180 36276 113675 -188516 -603 -92266
5796 -92266 -210154 -201968 -80465 210340 -71574 75145 165663 -389864 -250769 -47894 75322
5784 -247628 134126 -262977 -188901 56257 -32491 57945 -200318 166495 2987 240131 313652
5773 313652 11821 -48924 -167671 115659 31717 -58558 15370 -297239 -67427 252739 -2755
5761 47573 -30307 139959 205885 -147345 180668 -121919 -143421 17209 -308383 -217101 62165
5749 -381698 -4050 17462 -93237 -105226 90140 -93270 295253 -321590 65459 59791 -184779
5737 354261 86582 2537 49569 -237168 -94308 -201136 107850 -9391 -67179 -324801 225923
5725 -60787 -193907 -124769 -73085 -383398 -96974 47529 55033 167650 164782 177631 64567 40179
5713 40179 -43820 10990 -90860 156753 -191297 178533 25323 -19467 -182590 254331 -169833
5701 133710 -126456 25260 -108632 -80436 75406 345560 -349038 507 -199155 -325955 -189302
5690 -189302 -93291 273765 117340 -12324 -194588 53138 101757 57104 214903 85398 -113280
5678 -183038 83990 54660 -38638 -301988 223368 -74170 7837 282557 -44451 181158 -146467
5666 -159572 -6031 109893 41721 9361 179990 -301745 -51711 43041 -156516 130295 -173128
5654 33569 -308914 21488 296787 75106 -8158 -143702 -71670 67695 -72883 -66014 -94139 345874
5641 70776 50335 170841 142345 79123 39962 170600 33014 -154001 101754 -69833 179002
5629 60976 109312 -139096 95151 22073 -33873 -3755 -81650 49061 64406 403599 -91015 -408317
5617 -408317 -103731 160039 160131 132012 45508 -198213 -72767 45857 -3831 156354 -276028
5605 3006 -191374 -12312 -21395 55686 -156239 298534 -46905 185892 -255580 -159938 81065
5593 -24163 -115147 86522 198077 -42679 147170 167994 -268418 81199 9094 144142 6687
5581 232240 -265611 -450832 42450 -80268 -150440 59829 -49605 309447 134387 220997 250746
5570 250746 -46808 132522 158115 -46467 23028 -24239 127084 -172144 -46468 75518 27229
5558 119476 -66623 -49941 197236 -138041 -52164 31273 -86005 4890 57036 7197 43741 123354
5546 123354 260674 -180040 -60633 -158328 -531664 -384684 -248918 60334 -390933 84505
5535 -195545 -104605 194728 36716 -126962 -36898 319803 -13202 -9850 -354126 -196665 242552
5523 -262256 -63110 -101818 -33601 -306134 296130 29051 194562 -126017 -201592 -30711 -13915
5511 342161 297798 324467 -148821 37524 348823 225239 -22568 137283 -131066 62139 -139166
5499 -63049 74634 -306964 79662 28704 235063 -207904 -160163 2450 -55766 -258989 -147914
5488 -147914 -230746 -33230 292867 -81931 103497 -198339 277636 -129686 -77767 -184037
5478 -184037 239293 14483 -336621 -69431 192717 91081 -139429 18390 61817 95896 -21655
5466 -65249 -302605 108145 -132975 136025 182788 -129674 92605 16245 -97117 -109721 -46196
5454 61285 152539 227729 153355 -127351 47077 -107975 -69413 194084 -73411 66118 -172006
5442 73139 -25626 -17371 -88296 -41853 -212067 -105500 8553 -21323 -196463 232237 298874
5431 298874 -45244 -68170 -131916 179155 144072 -187964 -393676 -81806 378876 112681 202119
5420 202119 12508 5676 -150704 -18660 269130 18539 69889 199656 -80294 286396 -185734
5408 -221960 -290618 191745 -134172 -167417 125484 -119000 -122061 -60375 137476 61373 12797
5396 -142133 264689 -81950 -109112 159175 32656 -144158 129316 -275381 193943 99826
5386 99826 127812 156624 -221483 320702 422942 163771 -278861 137190 59913 -124207
5375 149478 221792 -67656 17868 261153 149721 276208 -7249 414074 74744 -132166 -235812
5364 -235812 -44630 -41663 -211998 47692 -24797 -208504 34236 39917 -164781 158390 111816
5353 111816 368522 -136778 46798 -228343 -139836 64848 -115950 -38269 -6770 104233 -80229
5341 19189 58385 94155 -28114 227110 355590 91561 179604 -185448 71849 245078 244841
5330 244841 -40920 -203295 271719 282666 31175 6127 -8736 120734 36955 -1373 -290190
5319 -290190 139590 2542 -222011 350072 -303997 -126499 -331905 -137496 254234 -8970
5308 82670 -141112 -83210 71092 350071 23117 37255 -180370 -625954 -18107 -133953 30952
5296 -70763 61395 -107218 48302 -149426 3082 -32370 164479 160778 -309613 -333212 -108837
5284 -228196 -280702 -1174 22667 -57046 56239 37544 -341928 -224001 -40585 301499 176224
5273 176224 99624 158257 32311 -323053 -8888 -119900 -6294 62588 330907 -111810 -526921
5262 -526921 -83249 45406 65790 45526 -42825 37456 -109936 -387547 -297758 818 -215036
5250 -181452 -194281 108105 -186979 286722 296290 -122598 -34332 138098 -153921 112020
5239 -245409 155879 -164418 -313359 -21895 187388 -90330 -76301 -259142 148336 -225032
5228 154718 -19159 14933 278530 83251 22045 129202 240833 -226222 80554 159510 294331
5217 294331 -89957 232047 29873 -102957 24517 -89083 -46066 -241856 39574 202783 313482
5206 313482 -216154 73068 -77155 -81146 462048 -380215 19643 328348 329987 -24365 59258
5194 67956 227567 67569 54516 76590 -283207 -80597 129815 -7624 -54869 21310 -50908
5182 -202368 205342 74457 -184265 1549 -218106 85201 18206 -100568 -46127 -91040 -337528
5171 -337528 196617 -41924 -137509 -173731 205903 57697 180618 -270622 -79152 -74406 -61886
5160 -61886 36842 -38678 140269 248806 -110249 -19294 -122412 -52000 -115298 -58301 124308
5148 35647 97747 369588 318642 148231 -120403 -32925 -353789 -68924 85533 180108 50663
5136 -222341 -473283 5611 16252 50073 -10194 -277435 283567 168507 209387 34617 -234844
5124 -42253 99614 154705 -204428 131190 350585 9265 101433 -151136 -104489 70944 48696
5113 48696 -93288 -98312 -29759 74134 -147592 -265641 -44735 -162273 -58784 -132899 371303
5101 -127843 -59899 -132309 -96823 15150 146265 77374 -272034 500527 152385 -71159 -210171
5090 -210171 -47550 34258 75096 -306248 -270819 81179 -32282 63834 297187 -123464 313062
5078 111601 -162828 91271 151989 -118540 -132433 58665 127423 96177 -31036 -40333 56115
5066 -16757 -75194 -120969 -20694 -175567 192416 -10901 412487 22244 399291 -55551 190631
5054 176635 215894 264457 211814 -1666 10744 -100248 455831 -85892 136736 46200 447411
5043 447411 37151 140224 -17029 19454 241579 -69620 -29089 225258 -8872 60533 135801
5032 135801 30338 50019 -259426 149460 -102974 191695 -24773 -101276 116669 -315284
5021 -223800 243394 -249775 215827 94439 -299159 -239506 255171 -438032 -213429 139405
5010 40024 114015 193896 293253 166372 80205 -77505 -122509 271242 -63989 -315367 -325161
4999 -325161 -74229 -99228 -67931 76491 -120782 67145 116351 55256 317777 126355 -101159
4987 -24567 -159853 -77527 -149282 -32232 61774 -72859 65421 227966 87481 -318512 85455
4975 3396 -112868 -97648 -5218 -22383 60048 -124083 -97726 -178524 -177516 197069 -12141 -2203
4962 -1748 -52760 78016 -249321 -4709 139354 139973 72917 246307 -83280 192656 324382 99332
4949 -71663 -12318 -22754 -108953 -113836 -127019 -119139 159650 155563 -33788 132907 -179615 231789
4936 -101993 -366602 -184255 220393 -27846 -370254 277960 77738 66310 112218 177168 161351
4925 161351 -4304 -1892 261142 95029 -153976 -78654 160191 132834 179231 31732 -247867
4913 168599 52755 41543 -232810 -103455 167186 345025 -43586 -190570 -365908 6977 78915
4902 78915 -137232 -219690 6760 134674 92859 -3688 -142230 91625 -52084 -102899 35937 175014
4890 175014 -9281 -118652 110902 99924 -288661 -117050 167652 205419 305273 -180994 -26499
4878 -147682 -56981 131389 -249657 134231 56639 193299 4238 225280 -2189 221646 -66174
4866 144447 84396 288214 73095 97818 144307 -245516 272575 -260468 11851 -240243 7870
4854 92703 -143388 -63268 247057 198079 167080 27399 72510 -324163 159606 -217884 -111304
4843 -111304 29833 -95143 138233 -57774 97774 -182229 145294 67928 234481 61961 67804
4832 67804 233775 99902 -74501 220049 353082 21334 -235593 174559 64749 51379 -311373
4820 -241093 248743 -13964 21643 81857 132544 203814 206042 -141210 -49854 112372 147219
4809 147219 81281 297647 413615 -155856 216779 -75239 -48022 22830 -4553 -170674 -20503
4797 -96313 -82578 115440 45155 333492 -89862 -299855 406869 -316843 59935 214222 82021
4785 17414 33072 131271 -361060 29122 -26478 200592 44329 -77531 -57938 -1987 -108673
4774 -108673 122300 319556 -67172 -159942 157628 -301750 275141 -170439 83220 63247
4764 63247 242535 237477 -38412 -230416 -96197 159612 105185 346348 235143 -131121 83996
4752 63652 -107130 31613 -233782 -99723 133205 184343 125380 -290337 -56894 169975 37297
4740 -32818 6044 364567 141277 -101403 39564 2577 27576 -289723 190654 18138 -200733
4728 -60277 19654 45389 177820 -188856 -56908 207445 -253281 200092 -99618 -370512 -513501
4717 -513501 154342 205697 333801 37330 83062 76260 184741 -48776 11775 66375 -19679
4705 113862 34709 -620370 121302 335657 52845 -19446 93585 323111 -195517 -154190 -84847
4694 -84847 38034 -244584 -149986 181481 215791 -29391 364208 -82619 151649 307680 132957
4682 -140682 158271 8093 123822 -209964 -152893 47884 -318708 -238007 143607 -146613 -231104
4671 -231104 151838 76964 -71838 233468 245413 148542 -91937 -51362 -46032 304962 -29797
4659 -5692 197984 -187679 169556 434681 -60984 201260 -55657 57326 -128467 -230499 -124985
4648 -124985 18497 315701 297913 183544 85243 -73057 105363 174543 -18847 -80041 -207362
4637 -207362 -299508 74846 -28199 -128607 34708 71986 102306 -293150 -114704 79255 -21157
4625 -109630 -221554 -114003 -70668 -71290 -12056 233166 -68484 -16133 -113423 -133688 160088
4613 398336 307697 264658 -27054 51462 -119021 277181 19809 169682 -9290 -89784 -74104
4602 -74104 -91321 208911 154878 132860 -118409 34998 38774 -35451 93102 154027 291480
4591 291480 -98568 268114 -64671 133480 -31120 -82255 -226258 55616 61109 -61909 -94817
4580 -94817 65250 -44905 245493 3682 317577 437971 15786 13202 -80448 -37872 -60355 -116761
4568 -116761 -15157 1975 -47981 46944 -172283 109036 -116856 -62614 -95981 6986 -190294
4556 -170163 117649 -108765 -141893 329009 -157384 85283 -108295 -128044 -133087 84289 43493
4545 43493 46327 -260835 203691 -271599 17543 131265 78066 -351920 -212213 -180345 149877
4533 131186 -74206 -343995 -124036 76024 80056 237195 194540 -95071 161020 115008 -212969
4521 -110863 219642 -212023 -26230 97129 139991 179260 102416 154408 -98282 -91222 -236256
4510 -236256 -9486 -27614 95087 144808 -118955 104858 -53205 133945 74617 93349 -24729
4498 27026 141805 176733 62058 -329885 309651 117236 66191 197586 -73445 -67929 -16207
4486 257340 -103586 -205252 -110268 43464 60394 146554 319171 -207415 -59394 111433 192410
$$ [...]
##END NTUPLES=NMR SPECTRUM
##END=
