
##TITLE=AC1111_Colombia_5835338_vh2UkRcLu9
##JCAMPDX= 6.0         $$ Bruker NMR JCAMP-DX V2.0
##DATA TYPE= NMR SPECTRUM
##DATA CLASS= NTUPLES
##ORIGIN= BRUKER
##OWNER= Administrator
$$ 1.72 TOPSPIN		Version 2.1
$$ 2012-04-10 11:04:06.546 -0500  Administrator@TOPSPIN
$$ Compression mode = diff/dup
##.OBSERVE FREQUENCY= 400.13188235
##.OBSERVE NUCLEUS= ^1H
##.ACQUISITION MODE= SIMULTANEOUS (DQD)
##.ACQUISITION SCHEME= undefined
##.AVERAGES= 64
##.DIGITISER RES= 22
##SPECTROMETER/DATA SYSTEM= spect
##.PULSE SEQUENCE= noesygpps1d.comp
##.SOLVENT NAME= COFFEE_meoh
##.SHIFT REFERENCE= INTERNAL, COFFEE_meoh, 1, 14.96837
##AUDIT TRAIL= $$ (NUMBER, WHEN, WHO, WHERE, PROCESS, VERSION, WHAT)
$$ ##TITLE= Audit trail, TOPSPIN		Version 2.1
$$ ##JCAMPDX= 5.01
$$ ##ORIGIN= Bruker BioSpin GmbH
$$ ##OWNER= Administrator
$$ $$ C:\Bruker\TOPSPIN/data/COFFEE/nmr/AC1111_Colombia_5835338_vh2UkRcLu9/12/pdata/1/auditp.txt
$$ ##AUDIT TRAIL=  $$ (NUMBER, WHEN, WHO, WHERE, PROCESS, VERSION, WHAT)
(   1,<2012-03-26 21:15:37.437 -0500>,<Administrator>,<TOPSPIN>,<go>,<TOPSPIN 2.1>,
      <created by zg
	started at 2012-03-26 21:04:05.765 -0500,
	POWCHK enabled, PULCHK disabled,
       configuration hash MD5:
       1A 1E CE 29 27 FD 77 03 67 4E F0 E3 C4 B2 CB 90
       data hash MD5: 64K
       98 14 48 6D 05 AA 0C 1E 0F 79 89 F6 0D 37 87 72>)
(   2,<2012-03-26 21:15:40.375 -0500>,<Administrator>,<TOPSPIN>,<proc1d>,<TOPSPIN 2.1>,
      <Start of raw data processing
       efp LB = 0.3 FT_mod = 6 PKNL = 1 PHC0 = 0 PHC1 = 0 SI = 128K 
       data hash MD5: 128K
       9F 9E BD A8 CA 65 9F 96 46 A0 53 8D 09 D5 D1 DC>)
(   3,<2012-03-26 21:15:41.578 -0500>,<Administrator>,<TOPSPIN>,<proc1d>,<TOPSPIN 2.1>,
      <pk PHC0 = 31.61865 PHC1 = 0 
       data hash MD5: 128K
       3B BE 0C 8C B0 FD 9B 1A 5D B7 82 B1 12 30 16 B3>)
(   4,<2012-03-26 21:15:41.812 -0500>,<Administrator>,<TOPSPIN>,<proc1d>,<TOPSPIN 2.1>,
      <abs ABSG = 1 
       data hash MD5: 128K
       50 45 4F FC 5A ED A2 FB EC 09 08 DD 66 87 2E 4D>)
(   5,<2012-03-26 21:15:41.875 -0500>,<Administrator>,<TOPSPIN>,<proc1d>,<TOPSPIN 2.1>,
      <abs ABSG = 2 
       data hash MD5: 128K
       44 1D BB E6 7D 3B 8C 60 86 C5 50 1A 48 20 18 DB>)
(   6,<2012-03-26 21:15:42.156 -0500>,<Administrator>,<TOPSPIN>,<proc1d>,<TOPSPIN 2.1>,
      <abs ABSG = 3 
       data hash MD5: 128K
       72 47 8B 2C 0C 4F 1D 27 1C C0 E3 92 A3 5B C2 61>)
(   7,<2012-03-26 21:15:42.203 -0500>,<Administrator>,<TOPSPIN>,<proc1d>,<TOPSPIN 2.1>,
      <abs ABSG = 4 
       data hash MD5: 128K
       C4 E6 DA D7 48 C4 4A 69 61 2E 54 5B A5 6F 49 49>)
(   8,<2012-03-26 21:15:42.250 -0500>,<Administrator>,<TOPSPIN>,<proc1d>,<TOPSPIN 2.1>,
      <abs ABSG = 5 
       data hash MD5: 128K
       86 BB 26 7E C0 C9 72 4A E4 E0 5B 19 EC C3 A3 51>)
(   9,<2012-03-26 21:15:44.218 -0500>,<Administrator>,<TOPSPIN>,<audit>,<TOPSPIN 2.1>,
      <user comment:
       ICON-NMR User ID: COFFEE
       data hash MD5: 128K
$$ [...]
##$TP07= 0
##$TPNAME0= <>
##$TPNAME1= <>
##$TPNAME2= <>
##$TPNAME3= <>
##$TPNAME4= <>
##$TPNAME5= <>
##$TPNAME6= <>
##$TPNAME7= <>
##$TPOAL= (0..7)
0.5 0.5 0.5 0.5 0.5 0.5 0.5 0.5
##$TPOFFS= (0..7)
0 0 0 0 0 0 0 0
##$TUNHIN= 0
##$TUNHOUT= 0
##$TUNXOUT= 0
##$USERA1= <user>
##$USERA2= <user>
##$USERA3= <user>
##$USERA4= <user>
##$USERA5= <user>
##$V9= 5
##$VALIST= <valist>
##$VCLIST= <CCCCCCCCCCCCCCC>
##$VD= 0
##$VDLIST= <DDDDDDDDDDDDDDD>
##$VPLIST= <PPPPPPPPPPPPPPP>
##$VTLIST= <TTTTTTTTTTTTTTT>
##$WBST= 1024
##$WBSW= 4
##$XGAIN= (0..3)
0 0 0 0
##$XL= 0
##$YL= 0
##$YMAX_a= 13902431
##$YMIN_a= -5966973
##$ZGOPTNS= <>
##$ZL1= 120
##$ZL2= 120
##$ZL3= 120
##$ZL4= 120
##$ABSF1= 14.96837
##$ABSF2= -5.58416
##$ABSG= 5
##$ABSL= 3
##$ALPHA= 0
##$AQORDER= 0
##$ASSFAC= 0
##$ASSFACI= 0
##$ASSFACX= 0
##$ASSWID= 0
##$AUNMP= <proc_prof1d_extract.lims>
##$AXLEFT= 0
##$AXNAME= <>
##$AXNUC= <1H>
##$AXRIGHT= 0
##$AXTYPE= 0
##$AXUNIT= <>
##$AZFE= 0.1
##$AZFW= 0.1
##$BCFW= 0
##$BC_mod= 0
##$BYTORDP= 0
##$COROFFS= 0
##$CY= 15
##$DATMOD= 1
##$DC= 0
##$DFILT= <>
##$DTYPP= 0
##$F1P= 0
##$F2P= 0
##$FCOR= 0.5
##$FTSIZE= 131072
##$FT_mod= 6
##$GAMMA= 0
##$GB= 0
##$INTBC= 1
##$INTSCL= 1
##$ISEN= 128
##$LB= 0.3
##$LEV0= 0
##$LPBIN= 0
##$MAXI= 10000
##$MC2= 0
##$MEAN= 0
##$ME_mod= 0
##$MI= 0
##$NCOEF= 0
##$NC_proc= -3
##$NLEV= 6
##$NOISF1= 0
##$NOISF2= 0
##$NSP= 0
##$NTH_PI= 0
##$NZP= 0
##$OFFSET= 14.96837
##$PC= 1
##$PHC0= 31.61865
##$PHC1= 0
##$PH_mod= 1
##$PKNL= yes
##$PPARMOD= 0
##$PPDIAG= 0
##$PPIPTYP= 0
##$PPMPNUM= 2147483647
##$PPRESOL= 1
##$PSCAL= 4
##$PSIGN= 0
##$PYNMP= <proc.py>
##$REVERSE= no
##$SF= 400.130004899858
##$SI= 131072
##$SIGF1= 0
##$SIGF2= 0
##$SINO= 400
##$SIOLD= 131072
##$SPECTYP= <>
##$SREGLST= <1H.CDCl3>
##$SSB= 0
##$STSI= 131072
##$STSR= 0
##$SW_p= 8223.68421052632
##$SYMM= 0
##$S_DEV= 0
##$TDeff= 65536
##$TDoff= 0
##$TI= <>
##$TILT= no
##$TM1= 0
##$TM2= 0
##$TOPLEV= 0
##$USERP1= <user>
##$USERP2= <user>
##$USERP3= <user>
##$USERP4= <user>
##$USERP5= <user>
##$WDW= 1
##$XDIM= 131072
##$YMAX_p= 497881675
##$YMIN_p= -231973985
##$CURPLOT= <Network HP LaserJet P1505>
##$CURPRIN= <$Network HP LaserJet P1505>
##$DFORMAT= <normdp>
##$LAYOUT= <+/1D_H.xwp>
##$LFORMAT= <normlp>
##$PFORMAT= <normpl>
##$SURQMSG= 1
$$ End of Bruker specific parameters
$$ ---------------------------------
##NTUPLES= NMR SPECTRUM
##VAR_NAME=  FREQUENCY,     SPECTRUM/REAL,   SPECTRUM/IMAG
##SYMBOL=    X,             R,               I
##VAR_TYPE=  INDEPENDENT,   DEPENDENT,       DEPENDENT
##VAR_FORM=  AFFN,          ASDF,            ASDF
##VAR_DIM=   131072,        131072,          131072
##UNITS=     HZ,            ARBITRARY UNITS, ARBITRARY UNITS
##FACTOR=    0.0627417313425165, 1,          1
##FIRST=     8223.62146879498, 4566,         -102128
##LAST=      0,             4891,            -101101
##MIN=       0,             -231973985,      0
##MAX=       8223.62146879498, 497881675,    0
$$ Real data points
##PAGE= N=1
##DATA TABLE= (X++(R..R)), XYDATA
$$ [...]
60723A208022l927k26K066K656K443K653L812N577P282Q553R474J0260J1000J1941
$$ 1208022 1204095 1203869 1205935 1208591 1211034 1213687 1217499 1223076 1230358 1238911 1248385 1258645 1269645 1281586
60709A281586J3624J6244J9093K1378K3323K5534K7497K7841K6301K4125K2203
$$ 1281586 1295210 1311454 1330547 1351925 1375248 1400782 1428279 1456120 1482421 1506546 1528749
60698A528749K0116J7626J5756J5240J5110J4010J2183J0880J0381R987R451R056
$$ 1528749 1548865 1566491 1582247 1597487 1612597 1626607 1638790 1649670 1660051 1670038 1679489 1688545
60686A688545Q441O756M150K056J689K843M227M400K567q63m505p297r233j0428
$$ 1688545 1696986 1703742 1707892 1709948 1711637 1714480 1718707 1723107 1725674 1724811 1720306 1713009 1703776 1693348
60672A693348j0195q114n455m228m963o599q314j0110j1672j2234j1892j1743
$$ 1693348 1683153 1675039 1669584 1665356 1660393 1653794 1645480 1635370 1623698 1611464 1599572 1587829
60660A587829j2202j2462j2117j1997j2566j2721j1206q401n586l223j068O61
$$ 1587829 1575627 1563165 1551048 1539051 1526485 1513764 1502558 1494157 1488571 1485348 1484280 1484941
60648A484941J454J669K243L320M090M064L517K586R39j316l235m112m313m448
$$ 1484941 1486395 1488064 1490307 1493627 1497717 1501781 1505298 1507884 1508823 1507507 1504272 1500160 1495847 1491399
60634A491399m349l503k129r99l25L54J123J273L37j058j916k153k630l998o012
$$ 1491399 1487050 1483547 1481418 1480419 1480094 1480448 1481571 1482844 1483181 1482123 1480207 1478054 1475424 1471426 1465414
60619A465414q021r716j1250j2916j4866j6976j8762j9656j9554j9053j8982j9551
$$ 1465414 1457393 1447677 1436427 1423511 1408645 1391669 1372907 1353251 1333697 1314644 1295662 1276111
60607A276111j9985j9014j6061j2068q931p743p641o711m076p99J281J340J55
$$ 1276111 1256126 1237112 1221051 1208983 1200052 1192309 1184668 1177957 1173881 1173082 1174363 1175703 1175858
60594A175858p02j79J523L346M583N491O538P426P433O533N427M433L141J358
$$ 1175858 1175156 1174977 1176500 1179846 1184429 1189920 1196458 1203884 1211317 1217850 1223277 1227710 1230851 1232209
60580A232209l08j160j034M3K069M392N500M398J909O4L11K616N821Q417R433
$$ 1232209 1231901 1230741 1229707 1229750 1231819 1236211 1241711 1246109 1248018 1248082 1248393 1251009 1256830 1265247 1274680
60565A274680R235R274J0570J2780J5050J7110J8934K0073K0377K0876K2751K5677
$$ 1274680 1283915 1293189 1303759 1316539 1331589 1348699 1367633 1387706 1408083 1428959 1451710 1477387
60553A477387K8334L0366L2456L4557L5498L4812L3538L2462L0786K7532K3199
$$ 1477387 1505721 1536087 1568543 1603100 1638598 1673410 1706948 1739410 1770196 1797728 1820927
60542A820927J8798J3904P146j543j0383j7575k2708k6174k8137k8630k8154k7599
$$ 1820927 1839725 1853629 1860775 1859232 1848849 1831274 1808566 1782392 1754255 1725625 1697471 1669872
60530A669872k7671k8395k8902k7697k3890j8476j3905j1896j1861j1860j0750
$$ 1669872 1642201 1613806 1584904 1557207 1533317 1514841 1500936 1489040 1477179 1465319 1454569
60519A454569q843o736m348j501J178K505J857j54k102k813k115q86k37m87r05
$$ 1454569 1445726 1438990 1434642 1433141 1434319 1436824 1438681 1438527 1436425 1433612 1431497 1430611 1430374 1429887 1428982
60504A428982m11J452M199O793Q379R035R889J2120J5431J8025J8495J7463J6734
$$ 1428982 1428571 1430023 1434222 1441015 1449394 1458429 1468318 1480438 1495869 1513894 1532389 1549852 1566586
60491A566586J7119J7921J8501J9330K1077K3445K5604K7262K8649K9775L0443
$$ 1566586 1583705 1601626 1620127 1639457 1660534 1683979 1709583 1736845 1765494 1795269 1825712
60480A825712L0900L1768L3355L5549L8355M1803M5028M6145M3669L7864L0151
$$ 1825712 1856612 1888380 1921735 1957284 1995639 2037442 2082470 2128615 2172284 2210148 2240299
60469B240299K1291J0825j396j3646k3012k7814k8919k8409k7229k4616j9697
$$ 2240299 2261590 2272415 2271019 2257373 2234361 2206547 2177628 2149219 2121990 2097374 2077677
60458B077677j2968n868O12O349J1381J5513J8692K1181K3070K4177K4821K6163
$$ 2077677 2064709 2058841 2059453 2065802 2077183 2092696 2111388 2132569 2155639 2179816 2204637 2230800
60446B230800K9072L2995L6824M0783M6420N4476O4006P4211Q6036J00676J17288
$$ 2230800 2259872 2292867 2329691 2370474 2416894 2471370 2535376 2609587 2695623 2796299 2913587
60435B913587J33797J49736J66594J85147K04071K21978K39311K57234K75809
$$ 2913587 3047384 3197120 3363714 3548861 3752932 3974910 4214221 4471455 4747264
60426D747264K94659L14749L37990L64914L93162M17507M30437M23598L90526
$$ 4747264 5041923 5356672 5694662 6059576 6452738 6870245 7300682 7724280 8114806
60417H114806L28865K40202J29022L082j26280k46545l47794m24112m72699m93936
$$ 8114806 8443671 8683873 8812895 8815977 8689697 8443152 8095358 7671246 7198547 6704611
60407F704611m92295m74911m47914m14867l78543l42148l07879k75864k45806
$$ 6704611 6212316 5737405 5289491 4874624 4496081 4153933 3846054 3570190 3324384
60398C324384k18547j94998j74630j56330j39929j25646j12868j00770q9663q0367
$$ 3324384 3105837 2910839 2736209 2579879 2439950 2314304 2201436 2100666 2011003 1930636
60388A930636p2665o5622n9113n3805m9644m5696m1603l8049l5562l3674l1679
$$ 1930636 1857971 1792349 1733236 1679431 1629787 1584091 1542488 1504439 1468877 1435203 1403524
60377A403524k9352k6681k3574k0292j7595j5985j5055j3976j2469j1039j0347
$$ 1403524 1374172 1347491 1323917 1303625 1286030 1270045 1254990 1241014 1228545 1217506 1207159
60366A207159j0503j0961j1145j1068j1182j1463j1074r321o764m816m156l927
$$ 1207159 1196656 1185695 1174550 1163482 1152300 1140837 1129763 1120442 1113678 1108862 1104706 1100779
60354A100779k783m79J890L269L931N040P048R011R796R364Q400P236N966N238
$$ 1100779 1097996 1097517 1099407 1102676 1106607 1111647 1118695 1127706 1137502 1146866 1155266 1162502 1168468 1173706
60340A173706N745O828O994O116N969P685R819J0134Q630P416P717Q362P712O024
$$ 1173706 1179451 1186279 1193273 1199389 1205358 1213043 1222862 1232996 1241626 1249042 1256759 1265121 1272833 1278857
60326A278857N102N901P296P462O018M237L213K575J478J91k32M19J162J150M64
$$ 1278857 1283959 1289860 1297156 1304618 1310636 1314873 1318086 1320661 1322139 1322330 1322098 1322517 1323679 1324829 1325293
60311A325293m52j254j492r22k11l31j003q20O99K390L227L586M041M248M031
$$ 1325293 1324841 1323587 1322095 1321173 1320962 1320631 1319628 1318808 1319507 1321897 1325124 1328710 1332751 1336999 1341030
60296A341030M351N884P629Q327Q486R563J1652J3376J3853J3474J2969J2854
$$ 1341030 1345381 1351265 1358894 1367221 1375707 1385270 1396922 1410298 1424151 1437625 1450594 1463448
60284A463448J3589J5160J6513J6378J4573J1889Q976O175L914K262N18j616l034
$$ 1463448 1477037 1492197 1508710 1525088 1539661 1551550 1560526 1566701 1570615 1572877 1573395 1571779 1568745
60271A568745k663j510j630l129l772j941J364L983M933M707M083L254J813o09
$$ 1568745 1566082 1564572 1562942 1559813 1556041 1554100 1555464 1559447 1564380 1569087 1573170 1576424 1578237 1577628
60257A577628l521n697o612p212q532j0116j0882j0958j1204j1272r903p173m797
$$ 1577628 1574107 1568410 1561798 1554586 1546054 1535938 1525056 1514098 1502894 1491622 1481719 1474546 1469749
60244A469749l832l586l292l265l690l692k555r49N5M31R14J868L058M002M103
$$ 1469749 1465917 1462331 1459039 1455774 1452084 1448392 1445837 1444888 1444943 1445374 1446288 1448156 1451214 1455216 1459319
60229A459319L031J354J41l28o75j098r50j5R13J414K231L942N788O972Q206J0728
$$ 1459319 1462350 1463704 1463845 1463517 1462842 1461744 1460794 1460779 1461692 1463106 1465337 1469279 1475067 1482039 1490245 1500973
60213A500973J4178J6670J6999J5897J4994J5090J5651J5650J4846J4195J4774
$$ 1500973 1515151 1531821 1548820 1564717 1579711 1594801 1610452 1626102 1640948 1655143 1669917
60202A669917J6425J8008J8937J9695K0742K1986K3697K6779L1341L5894L9007
$$ 1669917 1686342 1704350 1723287 1742982 1763724 1785710 1809407 1836186 1867527 1903421 1942428
60191A942428M1131M3859M7950N3034N8837O5467P2711Q0013Q7210R4426J01399
$$ 1942428 1983559 2027418 2075368 2128402 2187239 2252706 2325417 2405430 2492640 2587066 2688465
60180B688465J07826J14373J22284J31759J41472J50030J57125J62930J67133
$$ 2688465 2796291 2910664 3032948 3164707 3306179 3456209 3613334 3776264 3943397
60171C943397J69243J69361J67871J64515J58454J49405J38061J25065J10033
$$ 3943397 4112640 4282001 4449872 4614387 4772841 4922246 5060307 5185372 5295405
60162E295405R2308P2596N3111L5556J9392K867j4374l0307m2257m8953n0686
$$ 5295405 5387713 5460309 5513420 5548976 5568368 5571235 5556861 5526554 5484297 5435344 5384658
60151E384658m8412m3263l6393k8324j8552o519P054K0595L3564M7068O2094P7862
$$ 5384658 5336246 5292983 5256590 5228266 5209714 5203195 5210249 5230844 5264408 5311476 5373570 5451432
60139E451432R2756J06526J20456J35105J48803J59034J64744J66524J64884J59346
$$ 5451432 5544188 5650714 5771170 5906275 6055078 6214112 6378856 6545380 6710264 6869610
60129F869610J49371J35292J17933R7793P5098N0359K4608p92k4621m6395o6501
$$ 6869610 7018981 7154273 7272206 7369999 7445097 7495456 7520064 7519272 7494651 7448256 7381755
60118G381755q5131j01144j12598j18646j20153j18257j13198j04815r3299p8887
$$ 7381755 7296624 7195480 7082882 6964236 6844083 6725826 6612628 6507813 6414514 6335627
60108F335627o1757m2873k3838n089J4702L6288N7917P7054R3094J06635J16751
$$ 6335627 6273870 6230997 6207159 6202070 6216772 6253060 6310977 6388031 6481125 6587760 6704511
60097F704511J21211J19466J13536J05475R5531Q3353O9421N4577L9408K4943
$$ 6704511 6825722 6945188 7058724 7164199 7259730 7343083 7412504 7467081 7506489 7531432
60087G531432J2887M109k227p072r496p189J230J4994L2102N1053P1791R5100
$$ 7531432 7544319 7548428 7546201 7539129 7529633 7522444 7523674 7538668 7570770 7621823 7693614 7788714
60075G788714J21036J48235J75202K01947K29559K58400K87782L17548L48722
$$ 7788714 7909750 8057985 8233187 8435134 8664693 8923093 9210875 9528423 9877145
60066I877145L81817M15220M45994M72111M93505N11149N25173N33898N34722
$$ 9877145 10258962 10674182 11120176 11592287 12085792 12596941 13122114 13656012 14190734
60057A4190734N26014N07671M79778M41856L94266L39306K79333K14395J43280
$$ 14190734 14716748 15224419 15704197 16146053 16540319 16879625 17158958 17373353 17516633
60048A7516633O6607j2713r1818j68782k41346l06742l63290m10280m45963m67764
$$ 17516633 17583240 17570527 17478709 17309927 17068581 16761839 16398549 15988269 15542306 15074542
60038A5074542m75313m71273m58058m35608m03779l65044l23011k79416k34392
$$ 15074542 14599229 14127956 13669898 13234290 12830511 12465467 12142456 11863040 11628648
60029A1628648j88793j44396j02223o2200k4374J0426M0912O5558Q2979R2648
$$ 11628648 11439855 11295459 11193236 11131036 11106662 11117088 11158000 11223558 11306537 11399185
60019A1399185R4795Q9395P6428N7504L5622J2368j2995m0453o7151r0298j10693
$$ 11399185 11493980 11583375 11659803 11717307 11752929 11765297 11752302 11711849 11644698 11554400 11443707
60008A1443707j30976j51369j69709j85215j99445k13221k24951k32812k36752
$$ 11443707 11312731 11161362 10991653 10806438 10606993 10393772 10168821 9936009 9699257
59999I699257k37505k35046k28879k18914k05413j88897j70341j50587j29401
$$ 9699257 9461752 9226706 8997827 8778913 8573500 8384603 8214262 8063675 7934274
59990G934274j06155q1607n7690l5081j2219J2475L8260O2865Q4954J04992J23894
$$ 7934274 7828119 7746512 7688822 7653741 7641522 7653997 7692257 7755122 7840076 7945068 8068962
59979H068962J41507J56436J67078J72686J73296J68536J57176J38557J14151
$$ 8068962 8210469 8366905 8533983 8706669 8879965 9048501 9205677 9344234 9458385
59970I458385Q6602N7268K5706q209m2761p5613j05702j33086j57488j77778j92808
$$ 9458385 9544987 9602255 9627961 9619752 9576991 9501378 9395676 9262590 9105102 8927324 8734516
59959H734516k02025k05315k02754j94786j82380j66787j49025j29477j07982
$$ 8734516 8532491 8327176 8124422 7929636 7747256 7580469 7431444 7301967 7193985
59950G193985q4411n9245l3582q415J6049M0359O5094R0229J15272J39891J64007
$$ 7193985 7109574 7050329 7016747 7008332 7024381 7064740 7129834 7220063 7335335 7475226 7639233
59939G639233J87191K08503K27285K43503K56634K64546K64563K55535K38256
$$ 7639233 7826424 8034927 8262212 8505715 8762349 9026895 9291458 9546993 9785249
59930I785249K14057J84155J50278J14321P6896L7418l725m4402q2808j18878
$$ 9785249 9999306 10183461 10333739 10448060 10524956 10562374 10558649 10514247 10431439 10312561
59920A0312561j52355j80737k00877k12086k15970k13620k04559j88573j67012
$$ 10312561 10160206 9979469 9778592 9566506 9350536 9136916 8932357 8743784 8576772
59911H576772j41861j14615q6437n8322l0565k738K5246N2481P7708J00192J19828
$$ 8576772 8434911 8320296 8233859 8175537 8144972 8142234 8167480 8219961 8297669 8397861 8517689
59900H517689J36904J51817J64443J73619J77897J77180J73143J67547J60454
$$ 8517689 8654593 8806410 8970853 9144472 9322369 9499549 9672692 9840239 10000693
59891A0000693J50745J38341J25156J13356J03046R2652Q1806P2964O9437P2307
$$ 10000693 10151438 10289779 10414935 10528291 10631337 10723989 10805795 10878759 10948196 11020503
59881A1020503Q0225R1808J06965J26102J49387J77117K09456K45331K82772L20938
$$ 11020503 11100728 11192536 11299501 11425603 11574990 11752107 11961563 12206894 12489666 12810604
59871A2810604L60507M01282M40610M75117N02918N22770N32031N27095N05501
$$ 12810604 13171111 13572393 14013003 14488120 14991038 15513808 16045839 16572934 17078435
59862A7078435M66472M09668L34811K42831J36858K2259r3926k04383l03471l87989
$$ 17078435 17544907 17954575 18289386 18532217 18669075 18691334 18597408 18393025 18089554 17701565
59852A7701565m55984n05795n36930n50861n49890n35773n10373m76726m38163
$$ 17701565 17245581 16739786 16202856 15651995 15102105 14566332 14055959 13579233 13141070
59843A3141070l96694l53123l07935k61080k11990j61409j12439o7955k7337J2349
$$ 13141070 12744376 12391253 12083318 11822238 11610248 11448839 11336400 11268445 11241108 11253457
59833A1253457N2052Q9509J22356J50399J73962J91656K01001K00480J89968J69489
$$ 11253457 11305509 11395018 11517374 11667773 11841735 12033391 12234392 12434872 12624840 12794329
59823A2794329J38344R5731M2225j9374q4862j50489k13675k72058l22994l64551
$$ 12794329 12932673 13028404 13070629 13051255 12966393 12815904 12602229 12330171 12007177 11642626
59813A1642626l96115m17363m27841m28499m22299m11784l96971l77091l53433
$$ 11642626 11246511 10829148 10401307 9972808 9550509 9138725 8741754 8364663 8011230
59804H011230l28595l03707k78427k53194k29309k06929j84912j62743j40887
$$ 8011230 7682635 7378928 7100501 6847307 6617998 6411069 6226157 6063414 5922527
59795E922527j19457r8500p9488o4337n2827m3067l4690k9309k7328k6789k6135
$$ 5922527 5803070 5704570 5625082 5560745 5507918 5464851 5430161 5400852 5373524 5346735 5320600
59784E320600k5955k6819k7521k6903k5679k4982k4624k4216k4690k7102l0944
$$ 5320600 5294645 5267826 5240305 5213402 5187723 5162741 5138117 5113901 5089211 5062109 5031165
59773E031165l5102l9585m4875n0347n4580n6731n6665n4433n0775m7400m5589
$$ 5031165 4996063 4956478 4911603 4861256 4806676 4749945 4693280 4638847 4588072 4540672 4495083
59762D495083m4819m3578m0919l6405k9389j9683q647J411Q949J3885J7151K0220
$$ 4495083 4450264 4406686 4365767 4329362 4299973 4280290 4271643 4273054 4282003 4295888 4313039 4333259
59750D333259K4476L0165L6272M2051M8122N5379O3419P1013P7694Q3843Q9321
$$ 4333259 4357735 4387900 4424172 4466223 4514345 4569724 4633143 4704156 4781850 4865693 4955014
59739D955014R2855R3069Q9693Q3794P6932O9938O2355N3557M4467L7487L4255
$$ 4955014 5047869 5140938 5230631 5314425 5391357 5461295 5523650 5577207 5621674 5659161 5693416
59728E693416L4185L5785L8817M4344N2958O3860P5831Q8720J03722J22181J44003
$$ 5693416 5727601 5763386 5802203 5846547 5899505 5963365 6039196 6127916 6231638 6353819 6497822
59717F497822J67369J90416K13084K36887K63034K91418L21345L52331L83961
$$ 6497822 6665191 6855607 7068691 7305578 7568612 7860030 8181375 8533706 8917667
59708H917667M15679M46855M76006M99187N09492M98391M58095L84339K79457
$$ 8917667 9333346 9780201 10256207 10755394 11264886 11763277 12221372 12605711 12885168
59699A2885168J53689K2136j00922k05459k85399l37916l64061l68320l55863
$$ 12885168 13038857 13060993 12960071 12754612 12469213 12131297 11767236 11398916 11043053
59690A1043053l30744k96920k58964k20023j80266j39139r8356o0857k7330M185
$$ 11043053 10712309 10415389 10156425 9936402 9756136 9616997 9518641 9457784 9430454 9434639
59680I434639L5306O5752R5163J24515J54690J84923K14027K42700K73179L06522
$$ 9434639 9469945 9535697 9630860 9755375 9910065 10094988 10309015 10551715 10824894 11131416
59670A1131416L41268L75349M08762M43619M81847N23673N68337O15248O63835
$$ 11131416 11472684 11848033 12256795 12700414 13182261 13705934 14274271 14889519 15553354
59661A5553354P13125P62549Q12879Q65232R19193R72525J022616J067106J103210
$$ 15553354 16266479 17029028 17841907 18707139 19626332 20598857 21621473 22688579 23791789
59652B3791789J127656J137968J133384J114366J082228J039803R91928R44489
$$ 23791789 24919445 26057413 27190797 28305163 29387391 30427194 31419122 32363611
59644C2363611R02582Q69134Q44668Q28197Q18216Q12421Q06401P93886P69419
$$ 32363611 33266193 34135327 34979995 35808192 36626408 37438829 38245230 39039116 39808535
59635C9808535P30280O75064O01854N09772M01899K84625J64179M5443o6029j63385
$$ 39808535 40538815 41213879 41815733 42325505 42727404 43012029 43176208 43221651 43155622 42992237
59625D2992237k40841k95486l26457l34004l19750k86187k35219j68376q8483
$$ 42992237 42751396 42455910 42129453 41795449 41475699 41189512 40954293 40785917 40697434
59616D0697434Q48R7720K01897L11758M23575N34826O45757P56032Q61535R56188
$$ 40697434 40698282 40796002 40997899 41309657 41733232 42268058 42913815 43669847 44531382 45487570
59606D5487570J035190J094475J128161J128377J087276R98215Q56590O61623
$$ 45487570 46522760 47617235 48745396 49873773 50961049 51959264 52815854 53477477
59598E3477477M17728J34050j76022m94653q01506j078626j313687j498878j629479
$$ 53477477 53895205 54029255 53853233 53358580 52557074 51478448 50164761 48665883 47036404
59589D7036404j705438j732384j718463j670733j595913j502568j399949j295473
$$ 47036404 45330966 43598582 41880119 40209386 38613473 37110905 35710956 34415483
59581C4415483j195652j108744j044106j008784j005424j031569j078376j131192
$$ 34415483 33219831 32111087 31066981 30058197 29052773 28021204 26942828 25811636
59573B5811636j174844j199648j202099j181962j141494j086204j022581r54379
$$ 25811636 24636792 23437144 22235045 21053083 19911589 18825385 17802804 16848425
59565A6848425q83111q11526p43452o80079o19627n61435n07654m59933m17111
$$ 16848425 15965314 15153788 14410336 13730257 13110630 12549195 12041541 11581608 11164497
59556A1164497l77525l41289l08870k79390k51898k26798k04580j84610j66568
$$ 11164497 10786972 10445683 10136813 9857423 9605525 9378727 9174147 8989537 8822969
59547H822969j51714j41210j34160j28844j25085j24049j26219j30675j36056
$$ 8822969 8671255 8530045 8395885 8267041 8141956 8017907 7891688 7761013 7624957
59538G624957j41289j45708j49076j51115j50879j47368j41196j34463j28201
$$ 7624957 7483668 7337960 7188884 7037769 6886890 6739522 6598326 6463863 6335662
59529F335662j20971j10989r8761q6424p5113o4318n3459m2876l3136k4269j5930
$$ 6335662 6214691 6103702 6004941 5918517 5843404 5779086 5725627 5682751 5649615 5625346 5609416
59518E609416p754N20Q890J6970K4389L1218L7742M3953M9565N4383N8390O1747
$$ 5609416 5601662 5602182 5611072 5628042 5652431 5683649 5721391 5765344 5814909 5869292 5927682 5989429
59506E989429O5010O9026P4116P9562Q4476Q9141R4944J02954J13083J24750J37668
$$ 5989429 6054439 6123465 6197581 6277143 6361619 6450760 6545704 6648658 6761741 6886491 7024159
59495G024159J51542J65658J79677J94593K11872K31479K51766K71658K91772
$$ 7024159 7175701 7341359 7521036 7715629 7927501 8158980 8410746 8682404 8974176
59486H974176L12638L32916L50837L66491L80903L93229M00918M02901M00531
$$ 8974176 9286814 9619730 9970567 10337058 10717961 11111190 11512108 11915009 12315540
59477A2315540L94689L83900L66564L43423L16275K85461K50351K11596J71341
$$ 12315540 12710229 13094129 13460693 13804116 14120391 14405852 14656203 14867799 15039140
59468A5039140J31640R3918N9502K9441M031j6486l1304m0028m3419m1858l3922
$$ 15039140 15170780 15264698 15324200 15353641 15357672 15341186 15309882 15269854 15226435 15184577 15150655
59457A5150655j8077M778L2202O3126R7801J34829J70267K00095K21879K33381
$$ 15150655 15132578 15137356 15169558 15232684 15330485 15465314 15635581 15835676 16057555 16290936
59447A6290936K31414K13295J78564J28475O4783j0044r2294j77885k63460l45829
$$ 16290936 16522350 16735645 16914209 17042684 17107467 17097423 17005129 16827244 16563784 16217955
59437A6217955m20778m83513n30638n61252n76076n76086n62533n37919n06005
$$ 16217955 15797177 15313664 14783026 14221774 13645698 13069612 12507079 11969160 11463155
59428A1463155m70195m32214l92720l52575l12713k73413k35020j98992j66512
$$ 11463155 10992960 10560746 10168026 9815451 9502738 9229325 8994305 8795313 8628801
59419H628801j36108j04778p2081m0881j3018J3511M1306O9648R6249J21333J47014
$$ 8628801 8492693 8387915 8315834 8274953 8261935 8275446 8316752 8386400 8482649 8603982 8750996
59408H750996J73483J98660K21478K42731K62443K78728K89855K95496K95367
$$ 8750996 8924479 9123139 9344617 9587348 9849791 10128519 10418374 10713870 11009237
59399A1009237K88327K73247K49218K14789J68971J13549N2643j0679p5642j41055
$$ 11009237 11297564 11570811 11820029 12034818 12203789 12317338 12369981 12359302 12283660 12142605
59389A2142605k03308k58374l04536l41978l70761l90468m01166m03739l99495
$$ 12142605 11939297 11680923 11376387 11034409 10663648 10273180 9872014 9468275 9068780
59380I068780l89957l76625l60535l42326l22707l02241k80966k59029k37530
$$ 9068780 8678823 8302198 7941663 7599337 7276630 6974389 6693423 6434394 6196864
59371F196864k17652j99246j81389j64097j48004j32649j16931j01315q7578p5998
$$ 6196864 5979212 5779966 5598577 5434480 5286476 5153827 5036896 4935581 4848003 4772005
59361D772005o4887n3519m3374l5342k7757j8808r237q84O168J3145K0435K7866
$$ 4772005 4707118 4653599 4610225 4574883 4547126 4528318 4519081 4518197 4524365 4537510 4557945 4585811
59349D585811L6209M5954N4547N7231N1792M1323L1591K6473K6504L0703L8347
$$ 4585811 4622020 4667974 4722521 4779752 4831544 4872867 4904458 4930931 4957435 4988138 5026485
59338E026485M8943O1683P5598Q9720J02412J11079J13963J12762J12345J16970
$$ 5026485 5075428 5137111 5212709 5302429 5404841 5515920 5629883 5742645 5854990 5971960
59328E971960J27314J41703J59118J79559K02329K25946K49965K75334L02741
$$ 5971960 6099274 6240977 6400095 6579654 6781983 7007929 7257894 7533228 7835969
59319G835969L31881L62703L95968M32079M70435N10427N52177N95833O40982
$$ 7835969 8167850 8530553 8926521 9358600 9829035 10339462 10891639 11487472 12128454
59310A2128454O86993P32794P75854Q12446Q39590Q55888Q60143Q50334Q24985
$$ 12128454 12815447 13548241 14324095 15136541 15976131 16832019 17692162 18542496 19367481
59301A9367481P84921P33037O72805O07569N40652M75185M13590L57050L05057
$$ 19367481 20152402 20885439 21558244 22165813 22706465 23181650 23595240 23952290 24257347
59292B4257347K55505K05862J54449J00127M1158k4615r8192j78697k64186l52279
$$ 24257347 24512852 24718714 24873163 24973290 25014448 24989833 24891641 24712944 24448758 24096479
59282B4096479m39993n23925o00944o68317p23632p65805p96078q16720q28476
$$ 24096479 23656486 23132561 22531617 21863300 21139668 20373863 19577785 18761065 17932589
59273A7932589q30269q21371q02633p75620p42060p04389o65155o25180n83606
$$ 17932589 17102320 16280949 15478316 14702696 13960636 13256247 12591092 11965912 11382306
59264A1382306n40407m97520m56739m17782l79555l42312l07395k75456k45986
$$ 11382306 10841899 10344379 9887640 9469858 9090303 8747991 8440596 8165140 7919154
59255G919154k18394j92751j69488j48694j29590j10859r1991p4117n8780m5910
$$ 7919154 7700760 7508009 7338521 7189827 7060237 6949378 6857387 6783270 6724490 6678580
59245F678580l3813k1122p914N000J6912K7477L7224M7737O0100P3240Q5073R5199
$$ 6678580 6644767 6623645 6615731 6620731 6637643 6665120 6702344 6750081 6810181 6883421 6968494 7063693
59233G063693J05037J15288J25015J33460J40956J47447J51832J53604J53749
$$ 7063693 7168730 7284018 7409033 7542493 7683449 7830896 7982728 8136332 8290081
59224H290081J53172J51522J48338J44199J39918J35689J31762J28940J27751
$$ 8290081 8443253 8594775 8743113 8887312 9027230 9162919 9294681 9423621 9551372
59215I551372J27808J28307J28133J25557J19398J10736J01851R3018Q2135O7975
$$ 9551372 9679180 9807487 9935620 10061177 10180575 10291311 10393162 10486180 10568315 10636290
59205A0636290N1703L4164J3787j1125l9503o8386r5570j19949j40501j56494
$$ 10636290 10687993 10722157 10735944 10724819 10685316 10616930 10521360 10401411 10260910 10104416
59195A0104416j68119j75698j78848j77269j71445j61699j47688j29933j10793
$$ 10104416 9936297 9760599 9581751 9404482 9233037 9071338 8923650 8793717 8682924
59186H682924r2564p5297n7643l9195k0838l297J3439K9323M3676N5505O4314
$$ 8682924 8590360 8515063 8457420 8418225 8397387 8394090 8407529 8436852 8480528 8536033 8600347
59175H600347P0702P6015Q0873Q4525Q6434Q7819R0272R3693R7520J03200J12786
$$ 8600347 8671049 8747064 8827937 8912462 8998896 9086715 9176987 9270680 9368200 9471400 9584186
59164I584186J25402J38306J51854J69928J94363K22379K51244K82122L16700
$$ 9584186 9709588 9847894 9999748 10169676 10364039 10586418 10837662 11119784 11436484
59155A1436484L52710L85746M13545M35474M49224M50966M37922M08586L61548
$$ 11436484 11789194 12174940 12588485 13023959 13473183 13924149 14362071 14770657 15132205
59146A5132205K96615K16305J24139K2385q6426j96938l02421l98213m81697n49879
$$ 15132205 15428820 15645125 15769264 15791649 15705223 15508285 15205864 14807651 14325954 13776075
59136A3776075n99629o30041o42602o39468o23502n99003n69811n36701m98858
$$ 13776075 13176446 12546405 11903803 11264335 10640833 10041830 9472019 8935318 8436460
59127H436460m57675m17111l80319l47855l19061k93261k69461k46664k24837
$$ 8436460 7978785 7561674 7181355 6833500 6514439 6221178 5951717 5705053 5480216
59118E480216k04425j85219j66928j50329j36278j24082j12428j01354r1517q2213
$$ 5480216 5275791 5090572 4923644 4773315 4637037 4512955 4400527 4299173 4207656 4125443
59108D125443p2266o2481n4848m9201m2922l4471k5307j7652j1872o752j116N450
$$ 4125443 4053177 3990696 3935848 3886647 3843725 3809254 3783947 3766295 3754423 3747671 3746555 3752005
59096C752005J2559J9262K4976L0297L6315M3235N0309N6667O1728O5371O8661
$$ 3752005 3764564 3783826 3808802 3839099 3875414 3918649 3968958 4025625 4087353 4152724 4221385
59085D221385P3512Q0626Q8432R5074J00578J05858J10752J14714J18550J23484
$$ 4221385 4294897 4375523 4463955 4559029 4659607 4765465 4876217 4990931 5109481 5232965
59075E232965J28926J32942J34637J34669J33740J32004J29544J26114J20924
$$ 5232965 5361891 5494833 5629470 5764139 5897879 6029883 6159427 6285541 6406465
59066F406465J13848J05962R7608Q7404P5028O3544N6290N2374M8162M2735L8962
$$ 6406465 6520313 6626275 6723883 6811287 6886315 6949859 7006149 7058523 7106685 7149420 7188382
59055G188382L9197M2810M8358N5462O3725P2326Q1628R3236J07439J22274J36025
$$ 7188382 7227579 7270389 7318747 7374209 7437934 7510260 7591888 7685124 7792563 7914837 8050862
59044H050862J49103J62733J77164J91904K06281K19047K28593K34258K36384
$$ 8050862 8199965 8362698 8539862 8731766 8938047 9157094 9385687 9619945 9856329
59035I856329K34567K26868K11269J86984J54163J13321O5763J4003l8555q8259
$$ 9856329 10090896 10317764 10529033 10716017 10870180 10983501 11049264 11063267 11024712 10936453
59025A0936453j32085j68651j98057k20325k34769k41605k42957k41093k36829
$$ 10936453 10804368 10635717 10437660 10217335 9982566 9740961 9498004 9256911 9020082
59016I020082k30920k25509k22218k20120k17816k16370k17550k20134k20997
$$ 9020082 8789162 8563653 8341435 8121315 7903499 7687129 7469579 7249445 7028448
59007G028448k19431k17411k15783k13382k10033k07205k04860k00606j93144
$$ 7028448 6809017 6591606 6375823 6162441 5952408 5745203 5540343 5339737 5146593
58998E146593j84084j75307j66754j57861j49035j40512j31742j22936j15419
$$ 5146593 4962509 4787202 4620448 4462587 4313552 4173040 4041298 3918362 3802943
58989C802943j09382j03095r5362q7130p9670p2969o6881o2148n9099n6938n5270
$$ 3802943 3693561 3590466 3495104 3407974 3328304 3255335 3188454 3126306 3067207 3010269 2954999
58978B954999n4745n5167n4689n2160m8749m5893m3085l9098l4190k9524k5372
$$ 2954999 2900254 2845087 2790398 2738238 2689489 2643596 2600511 2561413 2527223 2497699 2472327
58967B472327k1237j7081j3199r412n479j832P98K130K199J118m93j618j841j729
$$ 2472327 2451090 2434009 2420810 2411398 2405919 2404087 2404885 2407015 2409214 2410332 2409839 2408221 2406380 2404651
58953B404651j802j850j547j038n70j04N17J617L726O720R112R260P408N418M506
$$ 2404651 2402849 2400999 2399452 2398414 2397844 2397740 2398257 2399874 2403600 2410320 2419432 2428692 2436100 2441518 2446024
58938B446024M294M074L837L748L665L266K130J7k173k506k94K549L912M296N506
$$ 2446024 2450318 2454392 2458229 2461977 2465642 2468908 2471038 2471055 2468882 2466376 2466082 2468631 2472543 2476839 2482345
58923B482345P512R051J0578J3695J7756K0050J9839J9465K0611K2085K2469K2568
$$ 2482345 2489857 2498908 2509486 2523181 2540937 2560987 2580826 2600291 2620902 2642987 2665456 2688024
58911B688024K3824K6061K8175K9676L0577L1041L1926L4303L7744M0488M1847
$$ 2688024 2711848 2737909 2766084 2795760 2826337 2857378 2889304 2923607 2961351 3001839 3043686
58900C043686M2973M4749M6534M7591M8203M8704M8966M9475N1491N5547O0901
$$ 3043686 3086659 3131408 3177942 3225533 3273736 3322440 3371406 3420881 3472372 3527919 3588820
58889C588820O6698P2384P7091Q0374Q3524Q8305R4399J00065J05176J11173J18165
$$ 3588820 3655518 3727902 3804993 3885367 3968891 4057196 4151595 4251660 4356836 4468009 4586174
58878D586174J24833J31448J39937J50317J60121J68459J77694J89652K02901
$$ 4586174 4711007 4842455 4982392 5132709 5292830 5461289 5638983 5828635 6031536
58869F031536K15491K28064K42498K59372K78315K99034L20722L42330L64559
$$ 6031536 6247027 6475091 6717589 6976961 7255276 7554310 7875032 8217362 8581921
58860H581921L89666M18313M48728M79917N13198N49383N87084O25340O65328
$$ 8581921 8971587 9389900 9838628 10318545 10831743 11381126 11968210 12593550 13258878
58851A3258878P07683P50528P92047Q32630Q72459R09203R40170R64456R80800
$$ 13258878 13966561 14717089 15509136 16341766 17214225 18123428 19063598 20028054 21008854
58842B1008854R85218R73100R41876Q89627Q13069P09666N80551M29538K60902
$$ 21008854 21994072 22967172 23909048 24798675 25611744 26321410 26901961 27331499 27592401
58833B7592401Q0224j04307k84035m52421o04083p33300q35974r11977r63519
$$ 27592401 27672625 27568318 27284283 26831862 26227779 25494479 24658505 23746528 22783009
58824B2783009r92318j000104r90263r66787r32584q90342q43473p94448p43819
$$ 22783009 21790691 20790587 19800324 18833537 17900953 17010611 16167138 15372690 14628871
58815A4628871o92631o43858n99476n58137n18125m80672m47784m18699l91384
$$ 14628871 13936240 13292382 12692906 12134769 11616644 11135972 10688188 10269489 9878105
58806I878105l65928l43497l23288l03560k84449k66876k49855k32029k14692
$$ 9878105 9512177 9168680 8845392 8541832 8257383 7990507 7740652 7508623 7293931
58797G293931j99972j86774j72071j55672j40256j26804j13549r9757q7091p6367
$$ 7293931 7093959 6907185 6735114 6579442 6439186 6312382 6198833 6099076 6011985 5935618
58787E935618o5785n3645m0543k7845j5835m326O491J6675K6903L7605M8626N9791
$$ 5935618 5869833 5816188 5775645 5747800 5731965 5727639 5734130 5750805 5777708 5815313 5863939 5923730
58775E923730P0867Q1178R0520J00177J11694J24698J37317J48770J60346J73743
$$ 5923730 5994597 6075775 6166295 6266472 6378166 6502864 6640181 6788951 6949297 7123040
58765G123040J89416K06494K23570K39878K56293K74739K95966L18865L42594
$$ 7123040 7312456 7518950 7742520 7982398 8238691 8513430 8809396 9128261 9470855
58756I470855L68129L96627M27549M59814M93625N29663N67475O06286O46448
$$ 9470855 9838984 10235611 10663160 11122974 11616599 12146262 12713737 13320023 13966471
58747A3966471O88483P31499P73881Q14628Q52554Q85258R10373R26725R32686
$$ 13966471 14654954 15386453 16160334 16974962 17827516 18712774 19623147 20549872 21482558
58738B1482558R24370Q97055Q47406P73112O72172N44780L94963K28633N1166
$$ 21482558 22406928 23303983 24151389 24924501 25596673 26141453 26536416 26765049 26816215
58729B6816215j31428l10693m77659o25950p51609q51667r25268r74657j002472
$$ 26816215 26684787 26374094 25896435 25270485 24518876 23667209 22741941 21767284 20764812
58720B0764812j009413r97088r71424r39616r04355q64204q19142p72376p26821
$$ 20764812 19755399 18758311 17786887 16847271 15942916 15078712 14259570 13487194 12760373
58711A2760373o82995o40791o00713n62875n26854m92772m60679m29299l97562
$$ 12760373 12077378 11436587 10835874 10272999 9746145 9253373 8792694 8363395 7965833
58702G965833l67012l40365l17805k97012k76612k57292k39706k23556k08782
$$ 7965833 7598821 7258456 6940651 6643639 6367027 6109735 5870029 5646473 5437691
58693E437691j95456j82658j69481j56772j45752j35518j24457j13534j05204
$$ 5437691 5242235 5059577 4890096 4733324 4587572 4452054 4327597 4214063 4108859
58684D108859r9213r2650q4443p6849p1746o8204o4602o0794n7118n3389m9832
$$ 4108859 4009646 3916996 3832553 3755704 3683958 3615754 3551152 3490358 3433240 3379851 3330019
58673C330019m7390m6198m5227m3874m2482m1059l9080l6942l5934l6368l7066
$$ 3330019 3282629 3236431 3191204 3147330 3104848 3063789 3024709 2987767 2951833 2915465 2878399
58662B878399l7017l6422l6052l6744l9183m2918m6095m7615m8846n1461n4365
$$ 2878399 2841382 2804960 2768908 2732164 2692981 2650063 2603968 2556353 2507507 2456046 2401681
58651B401681n4896n2641m9731m7723m6402m5426m4923m4340m2760m0317l7584
$$ 2401681 2346785 2294144 2244413 2196690 2150288 2104862 2059939 2015599 1972839 1932522 1894938
58640A894938l4023k9149k4594k2557k2563k2340k1574k1961k3626k4588k4316
$$ 1894938 1860915 1831766 1807172 1784615 1762052 1739712 1718138 1696177 1672551 1647963 1623647
58629A623647k4710k6633k8125k7365k5213k3376k1801j9365j6015j3014j1621
$$ 1623647 1598937 1572304 1544179 1516814 1491601 1468225 1446424 1427059 1411044 1398030 1386409
58618A386409j1985j2779j1982q696m050K91L750O192P044O480O287P833J0154
$$ 1386409 1374424 1361645 1349663 1340967 1336917 1337208 1340958 1347150 1354194 1360674 1366961 1374794 1384948
58605A384948J1771J2992J4414J4650J2081P644L286j062o133j0338j1474j0577
$$ 1384948 1396719 1409711 1424125 1438775 1450856 1458500 1461786 1460724 1454591 1444253 1432779 1422202
58593A422202j0525j1471j1073q786o255l812l29L446N311N720P656J1791J5432
$$ 1422202 1411677 1400206 1389133 1380347 1374092 1370280 1369951 1373397 1378708 1384428 1392084 1403875 1419307
58580A419307J7151J8966K2603K6876L0113L2606L5259L8083M1033M4166M6551
$$ 1419307 1436458 1455424 1478027 1504903 1535016 1567622 1602881 1640964 1681997 1726163 1772714
58569A772714M7225M7524M9939N4452N8806O2609O8097P6143Q4701R2140R9421
$$ 1772714 1819939 1867463 1917402 1971854 2030660 2093269 2161366 2237509 2322210 2414350 2513771
58558B513771J07876J17251J26908J36758J46485J55858J66138J78791J92940
$$ 2513771 2621647 2738898 2865806 3002564 3149049 3304907 3471045 3649836 3842776
58549C842776K06410K19089K32337K45567K56741K65941K74610K80921K79793
$$ 3842776 4049186 4268275 4500612 4746179 5002920 5268861 5543471 5824392 6104185
58540F104185K68122K46424K15036J72958J21582O5434P829n0534j07380j57319
$$ 6104185 6372307 6618731 6833767 7006725 7128307 7193741 7201570 7151036 7043656 6886337
58530F886337j96562k25936k47435k60908k65908k63827k56441k44823k30863
$$ 6886337 6689775 6463839 6216404 5955496 5689588 5425761 5169320 4924497 4693634
58521D693634k16990k03290j87817j70693j54694j40866j27262j13141j00677
$$ 4693634 4476644 4273354 4085537 3914844 3760150 3619284 3492022 3378881 3278204
58512C278204r0966q2062p2771o4838n9532n5352n0940m7019m3873m0278l6470
$$ 3278204 3187238 3105176 3032405 2967567 2908035 2852683 2801743 2754724 2710851 2670573 2634103
58501B634103l4676l5148l5335l4384l4505l6233l6788l5195l4436l6026l7053
$$ 2634103 2599427 2564279 2528944 2494560 2460055 2423822 2387034 2351839 2317403 2281377 2244324
58490B244324l5574l4419l6170l8687l9355l9758m1989m3967m2870m0083l8451
$$ 2244324 2208750 2174331 2138161 2099474 2060119 2020361 1978372 1934405 1891535 1851452 1813001
58479A813001l7428l5297l3399l3527l3587l0578k5980k3569k3401k2567k0616
$$ 1813001 1775573 1740276 1706877 1673350 1639763 1609185 1583205 1559636 1536235 1513668 1493052
58468A493052j9575j9389j7820j4804j2811j2620j2165j0112p718o633o979p976
$$ 1493052 1473477 1454088 1436268 1421464 1408653 1396033 1383868 1373756 1366038 1359405 1352426 1344450
58456A344450q750q521p326o218n825n500m743m090l585k108M76K349K383J897
$$ 1344450 1335700 1327179 1319853 1313635 1307810 1302310 1297567 1293477 1289892 1287784 1288260 1290609 1292992 1294889
58442A294889K250K652K032J065N55l61k518n043o926q484r852j0119r358r270
$$ 1294889 1297139 1299791 1301823 1302888 1303443 1303082 1300564 1295521 1288595 1280111 1270259 1260140 1250782 1241512
58428A241512j0231j0234q357o612o545o760n951n511o723p974p320n542m210
$$ 1241512 1231281 1221047 1212690 1206078 1199533 1192773 1186822 1181311 1174588 1166614 1159294 1153752 1149542
58415A149542l062j667j411l320n910p335p675p274n403k513j098k205l771m330
$$ 1149542 1146480 1144813 1143402 1140082 1134172 1126837 1119162 1111888 1106485 1103972 1102874 1100669 1096898 1092568
58401A092568n241p116p630n576l634l961m298j973J429K984L186L994M717L824
$$ 1092568 1087327 1080211 1072581 1067005 1063371 1059410 1055112 1053139 1054568 1057552 1060738 1064732 1069449 1073273
58387A073273K785M173P563J0615J2674J4229J4642J3460J2388J3053J4377J4491
$$ 1073273 1076058 1080231 1087794 1098409 1111083 1125312 1139954 1153414 1165802 1178855 1193232 1207723
58375A207723J3482J2036R611O105K963N69k714o962r343q667p788q965j0490
$$ 1207723 1221205 1233241 1242852 1248957 1251920 1252489 1249775 1242813 1233470 1224803 1217015 1208050 1197560
58362A197560j0669j1112j2893j3365j0534o858n076l948j838n58j467j759R17
$$ 1197560 1186891 1175779 1162886 1149521 1138987 1132129 1127053 1123105 1121267 1120709 1119242 1117483 1118400
58349A118400L926M315M258O807R915J0033Q424Q436R428Q861P716Q335R327Q037
$$ 1118400 1122326 1126641 1130899 1137706 1147621 1157654 1166078 1174514 1183942 1192803 1200519 1208854 1218181 1226218
58335A226218N813N627O643O298N508O688Q761R139Q505Q781Q798O933N525P442
$$ 1226218 1232031 1237658 1244301 1250599 1256107 1262795 1271556 1280695 1289200 1297981 1306779 1313712 1319237 1326679
58321A326679J0774J2163J2753J5368J8288J7730J4244J1159Q725N389K624K805
$$ 1326679 1337453 1349616 1362369 1377737 1396025 1413755 1427999 1439158 1447883 1453272 1455896 1458701
58309A458701M282M034L035L651M308K549P45K650O535P987P248P650Q982Q871
$$ 1458701 1462983 1467017 1470052 1473703 1478011 1480560 1481305 1483955 1490490 1498477 1505725 1513375 1522357 1531228
58295A531228Q592J0986J4383J4978J3477J3290J3973J2754J0488R811R539P276
$$ 1531228 1539820 1550806 1565189 1580167 1593644 1606934 1620907 1633661 1644149 1653960 1663499 1670775
58283A670775N196O632R216Q327N119M190N562O046O182Q471J0947J0102P968
$$ 1670775 1675971 1682603 1691819 1700146 1705265 1709455 1715017 1721063 1727245 1735716 1746663 1756765 1764733
58270A764733Q745J0819J0016Q345J0945J6486J9390J9838K2627K7458K9395K8018
$$ 1764733 1773478 1784297 1794313 1802658 1813603 1830089 1849479 1869317 1891944 1919402 1948797 1976815
58258A976815K7376K7846K6659K5467K8459L3815L5758L4274L4130L5470L4522
$$ 1976815 2004191 2032037 2058696 2084163 2112622 2146437 2182195 2216469 2250599 2286069 2320591
58247B320591L2384L3577L6599L5616L0968K8429K8596K6817K3300K3114K6183
$$ 2320591 2352975 2386552 2423151 2458767 2489735 2518164 2546760 2573577 2596877 2619991 2646174
58236B646174K7305K6351K8577L4410L8784M0871M4761N0130N2145N0967N1722
$$ 2646174 2673479 2699830 2728407 2762817 2801601 2842472 2887233 2937363 2989508 3040475 3092197
58225C092197N4675N5152N3231N3755N6796N8012N8046O1463O6922O9035O9192
$$ 3092197 3146872 3202024 3255255 3309010 3365806 3423818 3481864 3543327 3610249 3679284 3748476
58214C748476P3612Q1325Q5570Q6402R0119R6778J00533J01883J07140J15944
$$ 3748476 3822088 3903413 3988983 4075385 4165504 4262282 4362815 4464698 4571838 4687782
58204D687782J21852J24929J30961J39033J43236J45646J53504J64508J69841
$$ 4687782 4809634 4934563 5065524 5204557 5347793 5493439 5646943 5811451 5981292
58195E981292J70833J76899J87627J93737J95608K03290K17556K28996K37125
$$ 5981292 6152125 6329024 6516651 6710388 6905996 7109286 7326842 7555838 7792963
58186G792963K51938K74732K96093L14923L40334L72217L99748M22309M51882
$$ 7792963 8044901 8319633 8615726 8930649 9270983 9643200 10042948 10465257 10917139
58177A0917139M91198N29598N64037O03289O47503O85303P15989P53092Q01140
$$ 10917139 11408337 11937935 12501972 13105261 13752764 14438067 15154056 15907148 16708288
58168A6708288Q50513Q99541R58473J026871J090885J148130J211011J281013
$$ 16708288 17558801 18458342 19416815 20443686 21534571 22682701 23893712 25174725
58160B5174725J345434J404207J472558J552461J630645J709976J811840J941895
$$ 25174725 26520159 27924366 29396924 30949385 32580030 34290006 36101846 38043741
58152C8043741K086204K246831K445849K688213K958849L262670L625178M045805
$$ 38043741 40129945 42376776 44822625 47510838 50469687 53732357 57357535 61403340
58144F1403340M497150M981066N537759O189851O930198P773578Q758556R886128
$$ 61403340 65900490 70881556 76419315 82609166 89539364 97312942 106071498 115957626
58136A15957626J1123627J2478362J3985695J5615849J7302164J9095455K1190458
$$ 115957626 127081253 139559615 153545310 169161159 186463323 205558778 226749236
58129B26749236K3796165K7117248L1360094L6240588M0113896L9980753L3228041
$$ 226749236 250545401 277662649 309022743 345263331 385377227 425357980 458586021
58122D58586021J9883434L076711j2899944k5042454l2520012l5939336l6346183
$$ 458586021 478469455 481546166 468646222 443603768 411083756 375144420 338798237
58115C38798237l4777622l2131921k9039189k5831082k2680450j9718247j7020957
$$ 338798237 304020615 271888694 242849505 217018423 194337973 174619726 157598769
58108A57598769j4597318j2443437j0564619q931964p477876o152239m940492
$$ 157598769 143001451 130558014 119993395 111061431 103583555 97431316 92490824
58101I2490824l827945k797780j866148j077432m81116j66714k89328r55938k054835
$$ 92490824 88662879 85865099 83998951 82921519 82440403 82273689 81984361 81028423 78973588
58092G8973588l263185m258832m894153n175414n161911m930495m576008m176594
$$ 78973588 75710403 71451571 66557418 61382004 56220093 51289598 46713590 42536996
58084D2536996l764264l351354k962022k616139k308769k030642j789160j590232
$$ 42536996 38772732 35421378 32459356 29843217 27534448 25503806 23714646 22124414
58076B2124414j420720j268054j137887j035314r47805q63642p89558p34012o89483
$$ 22124414 20703694 19435640 18297753 17262439 16314634 15450992 14661434 13927422 13237939
58067A3237939o46241o07628n77566n48098n13047m79751m54556m30522m01268
$$ 13237939 12591698 11984070 11406504 10858406 10345359 9865608 9411052 8980530 8579262
58058H579262l73140l52132l32450l09469k90608k81890k76331k66700k57452
$$ 8579262 8206122 7853990 7521540 7212071 6921463 6639573 6363242 6096542 5839090
58049E839090k53230k47876k35942k23516k16683k10258j98625j86961j80931
$$ 5839090 5585860 5337984 5102042 4878526 4661843 4451585 4252960 4065999 3885068
58040C885068j75423j64261j51611j43401j36290j25413j14471j08269j03124
$$ 3885068 3709645 3545384 3393773 3250372 3114082 2988669 2874198 2765929 2662805
58031B662805r4272q5301q1073p8472p2930o7199o5194o3928n9690n5556n5023
$$ 2662805 2568533 2483232 2402159 2323687 2250757 2183558 2118364 2054436 1994746 1939190 1884167
58020A884167n4749n1097m7303m6721m5726m0780l5936l5645l6375l3141k8557
$$ 1884167 1829418 1778321 1731018 1684297 1638571 1597791 1561855 1526210 1489835 1456694 1428137
58009A428137k7699k9246k9066k7767k7744k7396k4628k1631k0367j8141j3188
$$ 1428137 1400438 1371192 1342126 1314359 1286615 1259219 1234591 1212960 1192593 1174452 1161264
57998A161264r426j0057j1706j0543q889r945j1368j0156q862j0676j2972j1727
$$ 1161264 1151838 1141781 1130075 1119532 1110643 1100698 1089330 1079174 1070312 1059636 1046664 1034937
57986A034937q266o125n199m049l877n488o607o325p424j0322j0326n440r57j318
$$ 1034937 1026671 1020546 1015347 1011298 1007421 1001933 995326 989001 981577 971255 960929 955489 954532 953214
57972I53214l320k790j947m088o622n955m265m933n928m124j884k934n698o834
$$ 953214 949894 947104 945157 941069 934447 928492 924227 919294 913366 909242 907358 904424 898726 891892
57958H91892p354r288j0302p879m967n348p039o398m990o121q172p790o463p497
$$ 891892 884538 875250 864948 857069 852102 846754 839715 833317 828327 822206 814034 806244 799781 792284
57944G92284r377q613o332n826o091m097j134o67j843j170J119K146K132L471
$$ 792284 782907 774294 767962 762136 756045 751948 750814 750147 748304 747134 748253 750399 752531 756002
57930G56002N664O382O078O518O457L799L20p52j76q96k605k992k602l404m269
$$ 756002 761666 768048 774126 780644 787101 790900 791220 790468 790292 789396 786791 783799 781197 777793 773524
57915G73524k922q94j438l821m641l657l511m755n751o408p664q317o761m619
$$ 773524 770602 769708 768270 764449 759808 756151 752640 747885 742134 735726 728062 719745 712984 708365
57901G08365m429n143m283k991m141o723p026m650k722k707l332l974m946n129
$$ 708365 703936 698793 694510 691519 687378 680655 673629 668979 666257 663550 660218 656244 651298 646169
57887F46169l411j686k489m493m360k052j08J214L567O087O072L779K154J902
$$ 646169 642758 641072 638583 634090 629730 627678 627570 628784 632351 638438 644510 648289 650443 652345
57873F52345J027p98j618j215j697l719n593o518p463q546q738q308q610r407
$$ 652345 653372 652574 650956 649741 648044 644325 638732 632214 624751 616205 607467 599159 590549 581142
57859E81142r196q019p104o015l272M04K461K163J200Q03P65J146K356L717M184
$$ 581142 571946 563927 556823 550808 547536 547940 550401 552564 553764 554567 555332 556478 558834 562551 566735
57844E66735M166M587M942M435L970M578N032L708J648J009J600J718J311J264
$$ 566735 570901 575488 580430 584865 588835 593413 598445 602153 603801 604810 606410 608128 609439 610703
57830F10703O72j940n394p060o642n957n700n257m879n224n490m801m450n901
$$ 610703 611375 609435 604041 596981 590339 584382 578682 573425 568546 563322 557832 553031 548581 542680
57816E42680p639p076m680l051k791k382j323k59J161L487N402N447M833N614
$$ 542680 535041 527965 523285 520234 517443 515061 513738 513479 514640 518127 523529 528976 533809 539423
57802E39423P234Q015Q556J0096J0976Q751M804K713K793K430J113P04J070j04
$$ 539423 546657 554672 563228 573324 584300 593051 597855 600568 603361 605791 606904 607608 608678 608574
57788F08574k965n040n412n589o166o393p034r617j2759j3309j1431j0324j0569
$$ 608574 605609 600569 595157 589568 583402 577009 569975 560358 547599 534290 522859 512535 501966
57775E01966r256n577k779k973m086l873l410m443o260p311p619p917q213q528
$$ 501966 492710 487133 484354 481381 477295 473422 470012 465569 459309 451998 444379 436462 428249 419721
57761D19721r229r826r368q418q678j0210j1282j1128j0618j0000q515o359m685
$$ 419721 410492 400666 391298 382880 374202 363992 352710 341582 330964 320964 312449 306090 301405
57748C01405l518k056q13q17j033M60L051M553N104O489P955O920L981K775M090
$$ 301405 297887 295831 295018 294201 293168 293628 296679 301232 306336 312825 320780 327700 331681 334456 338546
57733C38546M561K372j37j073j755k897k209J523N553P097P030P110O627M749
$$ 338546 343107 345479 345342 344269 342514 339617 337408 338931 344484 351581 358611 365721 372348 377097
57719C77097L251L737M365K608n31k167j968j949k886l738m109m818o138p277
$$ 377097 380348 384085 388450 391058 390527 388360 386392 384443 381557 377819 373710 368892 362754 355477
57705C55477p543o869n482l961l069k749k004l82J259J926J507L74q73j138K04
$$ 355477 347934 341065 335583 331622 328553 325804 323800 323418 324677 326603 328110 328484 327611 326473 326677
57690C26677J960K436K219L547O624Q884Q755P776P912Q855R297Q961Q038O369
$$ 326677 328637 331073 333292 336839 343463 352347 361102 368878 376790 385645 394942 403903 411941 418310
57676D18310M426L575M191N058N524O491Q305R624R608R353R711R521P637N127
$$ 418310 422736 426311 430502 435560 441084 447575 455880 465504 475112 484465 494176 503697 511334 516461
57662E16461L816L878M458N477P344R785J2271J4647J6396J6452J4928J3823J4690
$$ 516461 520277 524155 528613 534090 541434 551219 563490 578137 594533 610985 625913 639736 654426
57649F54426J6559J7449J7131J7057J8241K0390K2805K5176K7529K9840L1751
$$ 654426 670985 688434 705565 722622 740863 761253 784058 809234 836763 866603 898354
57638H98354L2801L3263L4242L6189L8178L9693M2136M6961N3154N8644O3318
$$ 898354 931155 964418 998660 1034849 1073027 1112720 1154856 1201817 1254971 1313615 1376933
57627A376933O8290P3135P6922Q1428Q9660J01075J11974J21186J31527J44604
$$ 1376933 1445223 1518358 1595280 1676708 1766368 1867443 1979417 2100603 2232130 2376734
57617B376734J58380J71675J86909K05601K24613K40252K53567K68267K85232
$$ 2376734 2535114 2706789 2893698 3099299 3323912 3564164 3817731 4085998 4371230
57608D371230L02024L15719L22531L15709K87641K34934J60436P1638k0963j05782
$$ 4371230 4673254 4988973 5311504 5627213 5914854 6149788 6310224 6381862 6360899 6255117
57598F255117j74277k24158k57620k77094k84211k81547k72662k60144k45048
$$ 6255117 6080840 5856682 5599062 5321968 5037757 4756210 4483548 4223404 3978356
57589C978356k28053k09816j90668j71304j53392j38294j25486j13277j00671
$$ 3978356 3750303 3540487 3349819 3178515 3025123 2886829 2761343 2648066 2547395
57580B547395q7841p5481o4508n5521m7889m0247l2455k5728k0252j4355p024
$$ 2547395 2459554 2384073 2319565 2264044 2216155 2175908 2143453 2117725 2097473 2083118 2076094
57569B076094N18P048J3386K0648K8164L4966M1841M9921N8465O6112P3364Q1825
$$ 2076094 2076612 2083660 2097046 2117694 2145858 2180824 2222665 2272586 2331051 2397163 2470527 2552352
57557B552352R1716J02032J12432J23231J34085J44306J53790J62307J68679J72053
$$ 2552352 2644068 2746100 2858532 2981763 3115848 3260154 3413944 3576251 3744930 3916983
57547C916983J72802J70482J62213J45142J19723Q8478N2482J1533l2606p5587
$$ 3916983 4089785 4260267 4422480 4567622 4687345 4775823 4828305 4839838 4807232 4731645
57537D731645j13452j44551j68669j85966j96945k02060k01401j95911j88280
$$ 4731645 4618193 4473642 4304973 4119007 3922062 3720002 3518601 3322690 3134410
57528C134410j80964j73667j64457j53080j41382j30695j20719j11253j03035
$$ 3134410 2953446 2779779 2615322 2462242 2320860 2190165 2069446 1958193 1855158
57519A855158r6268q9734q2280p4224o6727o0356n4724m9170m3552l8491l4691
$$ 1855158 1758890 1669156 1586876 1512652 1445925 1385569 1330845 1281675 1238123 1199632 1164941
57508A164941l1924k9276k6466k4093k2227j9934j6892j4207j2664j1402r519
$$ 1164941 1133017 1103741 1077275 1053182 1030955 1011021 994129 979922 967258 955856 946337
57497I46337p750p035o490m571j573P67J755K218K904L967N756Q530J1469J3341
$$ 946337 938587 931552 925062 920491 918918 919685 921440 923658 926562 930529 936285 944815 956284 969625
57483I69625J4130J4898J6143J7445J8535J9669K1021K2627K4759K7492L0402
$$ 969625 983755 998653 1014796 1032241 1050776 1070445 1091466 1114093 1138852 1166344 1196746
57472A196746L3326L6875M1326M5917N0158N4874O0725O6770P2019P7453Q4714
$$ 1196746 1230072 1266947 1308273 1354190 1404348 1459222 1519947 1586717 1658736 1736189 1820903
57461A820903R3502J02141J10012J17607J24582J30041J34489J39273J43746J44854
$$ 1820903 1914405 2016546 2126558 2244165 2368747 2498788 2633277 2772550 2916296 3061150
57451C061150J40038J29001J12309R0012O2361L0742k794l6112o6908r3104j13800
$$ 3061150 3201188 3330189 3442498 3532510 3594871 3625613 3622819 3586707 3519799 3426695 3312895
57440C312895j29147j39247j44049j44317j41691j37448j31795j24371j14916
$$ 3312895 3183748 3044501 2900452 2756135 2614444 2476996 2345201 2220830 2105914
57431B105914j03654r1730q0957p2438o5632n9264n2632m5547l8039l1036k6202
$$ 2105914 2002260 1910530 1829573 1757135 1691503 1632239 1579607 1534060 1496021 1464985 1438783
57420A438783k3776k1432j6821j0504m817n87L269P458J1615J5631J9900K4403
$$ 1438783 1415007 1393575 1376754 1366250 1361433 1360846 1364115 1371573 1383188 1398819 1418719 1443122
57408A443122K8982L4196M0435M6792N2521N8837O7053P5617Q1753Q5789R1046
$$ 1443122 1472104 1506300 1546735 1593527 1646048 1704885 1771938 1847555 1929308 2015097 2106143
57397B106143R9035J07560J14215J18887J21778J21684J17846J11230J02092Q8075
$$ 2106143 2205178 2312738 2426953 2545840 2667618 2789302 2907148 3018378 3120470 3208545
57387C208545O6771L8954P586k5165n8001q8703j14311j33241j45909j53437j56693
$$ 3208545 3275316 3314270 3321856 3296691 3238690 3149987 3035676 2902435 2756526 2603089 2446396
57376B446396j56322j52814j46689j39088j31645j25060j18246j09666r9219q8436
$$ 2446396 2290074 2137260 1990571 1851483 1719838 1594778 1476532 1366866 1267647 1179211
57366A179211p9236p2736o8559o4799n9515n2881m7120m3675m1323l8068l4055
$$ 1179211 1099975 1027239 958680 893881 834366 781485 734365 690690 649367 611299 577244
57355E77244l1178l0146k9407k7317k4301k2122k1545k1482k0470j8370j6335
$$ 577244 546066 515920 486513 459196 434895 412773 391228 369746 349276 330906 314571
57344C14571j5332j5225j5223j4705j3527j2085j1296j1783j2775j2745j1649
$$ 314571 299239 284014 268791 254086 240559 228474 217178 205395 192620 179875 168226
57333A68226j1290j2557j3590j2404j0197r774j1143j1289q667n402l975l937
$$ 168226 156936 144379 130789 118385 108188 98414 87271 75982 67315 61913 57938 54001
57321E4001l442k386k124k994l948m193l804k906j500l9Q25J155J602K384L080
$$ 54001 50559 48173 46049 43055 39107 34914 31110 28204 26704 26665 27490 28645 30247 32631 35711
57306C5711L405L596L882M078L916L546L507M207N317N807M917L144J971K362
$$ 35711 39116 42712 46594 50672 54588 58134 61641 65848 71165 76972 81889 85033 87004 89366
57292H9366L667M157K612m70l066l288j257R56J488M96o64j321j613j334MJ941
$$ 89366 93033 97190 99802 99332 96266 92978 91721 92677 94165 94661 93997 92676 91063 89729 89733 91674
57276I1674L283L728M108M711M701L728K888L174M082M714N425P111R454J1088
$$ 91674 94957 98685 102793 107504 112205 115933 118821 121995 126077 130791 136216 143327 152781 163869
57262A63869J1406J1112J0969J0834J0176Q920P580O876P353R073J1495J3839
$$ 163869 175275 186387 197356 208190 218366 227286 234866 241742 249095 258168 269663 283502
57250B83502J5639J6889J7687J7831J6887J4809J2544J1687J3059J5688J7596
$$ 283502 299141 316030 333717 351548 368435 383244 395788 407475 420534 436222 453818
57239D53818J7688J6582J5726J6056J7509J9264K0338K0407K0271K1125K3261
$$ 453818 471506 488088 503814 519870 537379 556643 576981 597388 617659 638784 662045
57228F62045K5773K7722K9166L0867L3257L5979L8407M0435M2673M5733M9415
$$ 662045 687818 715540 744706 775573 808830 844809 883216 923651 966324 1012057 1061472
57217A061472N2939N5947N8665O0941O2008O1579O0245N7962N3302M5477L6168
$$ 1061472 1114411 1170358 1229023 1289964 1351972 1413551 1473796 1531758 1585060 1630537 1666705
57206A666705K7675J9956J1604L361k098m387o642j1074j5508j6457j3959j0907
$$ 1666705 1694380 1714336 1725940 1729301 1727203 1722816 1716174 1705100 1689592 1673135 1659176 1648269
57194A648269q605n793j931J272K315J964J797K115K288K043J448M17p34r60L91
$$ 1648269 1639664 1633871 1631940 1633212 1635527 1637491 1639288 1641403 1643691 1645734 1647182 1647599 1646865 1645905 1646296
57179A646296K688N173Q397J3349J9533K5188K9459L3133L7024M0722M3373M4743
$$ 1646296 1648984 1654157 1662554 1675903 1695436 1720624 1750083 1783216 1820240 1860962 1904335 1949078
57167A949078M4934M3865M1777L9633L8207L7152L5583L3255L0628K8146K6127
$$ 1949078 1994012 2037877 2079654 2119287 2157494 2194646 2230229 2263484 2294112 2322258 2348385
57156B348385K4929K4618K4770K5208K6541K9148L2083L3926L4498L4789L5447
$$ 2348385 2373314 2397932 2422702 2447910 2474451 2503599 2535682 2569608 2604106 2638895 2674342
57145B674342L6361L7607L9607M2263M4847M7088M9542N2724N6641O1105O5690
$$ 2674342 2710703 2748310 2787917 2830180 2875027 2922115 2971657 3024381 3081022 3142127 3207817
57134C207817O9314P0747O9748O6973O2929N7880N2516M7623M3153L8659L4599
$$ 3207817 3277131 3347878 3417626 3484599 3547528 3605408 3657924 3705547 3748700 3787359 3821958
57123C821958L1892L0326K8656K6295K3526K0168J5702J0761O796M039J617k13
$$ 3821958 3853850 3884176 3912832 3939127 3962653 3982821 3998523 4009284 4016080 4020119 4021736 4021523
57111D021523j4K239M736O749R610J3735J7025J7895J7984J9884K3541K6782K8330
$$ 4021523 4021509 4023748 4028484 4035233 4044843 4058578 4075603 4093498 4111482 4131366 4154907 4181689 4210019
57098D210019K8634K8427K7912K6869K4579K0268J4252P658M55q930k1276l4935
$$ 4210019 4238653 4267080 4294992 4321861 4346440 4366708 4380960 4388618 4389073 4380143 4358867 4323932
57086D323932m7265n6560o2333o5290o7564p1227p6013q0138q3612q8511r5625
$$ 4323932 4276667 4220107 4157774 4092484 4024920 3953693 3877680 3797542 3713930 3625419 3529794
57075C529794j03419j11150j20328j32082j45704j60874j78580j98763k19970
$$ 3529794 3426375 3315225 3194897 3062815 2917111 2756237 2577657 2378894 2158924
57066B158924k42561k69116l00342l33823l68182B39981b04679m85750n28472
$$ 2158924 1916363 1647247 1346905 1013082 644900 239981 -204679 -690429 -1218901
57057a218901n76680o32626o94359p60691q34372r17372j007511j103163j207177
$$ -1218901 -1795581 -2428207 -3122566 -3883257 -4717629 -5635001 -6642512 -7745675 -8952852
57048h952852j322863j450484j591019j748755j926937k125774k347723k598829
$$ -8952852 -10275715 -11726199 -13317218 -15065973 -16992910 -19118684 -21466407 -24065236
57040b4065236k881612l193881l538958l929875m378782m888512n455490o069738
$$ -24065236 -26946848 -30140729 -33679687 -37609562 -41988344 -46876856 -52332346 -58402084
57032e8402084o712137p371313q065342q812050r554980j0154666j0506741j0668508
$$ -58402084 -65114221 -72485534 -80550876 -89362926 -98917906 -109072572 -119579313 -130247821
57024a30247821j0829892j1151577j1648588j2198312j2578694j2475437j1543914
$$ -130247821 -141077713 -152229290 -163877878 -176076190 -188654884 -201130321 -212674235
57017b12674235r578052o651178l070520Q01156M662915Q261129J1350418J3722493
$$ -212674235 -222252287 -228903465 -231973985 -231172829 -226509914 -218248785 -206898367 -193175874
57009a93175874J5265230J5982734J5976626J5417897J4507826J3425599J2292654
$$ -193175874 -177910644 -161927910 -145951284 -130533387 -116025561 -102599962 -90307308
57002i0307308J1175630J0107231R098480Q146775P249582O412389N641826M938625
$$ -90307308 -79131678 -69024447 -59925967 -51779192 -44529610 -38117221 -32475395 -27536770
56994b7536770M302146L734895L236933K801720K422734K098642J826981J598138
$$ -27536770 -23234624 -19499729 -16262796 -13461076 -11038342 -8939700 -7112719 -5514581
56986e514581J401037J230426J084013h42039B903P47118O63592N90468N23314
$$ -5514581 -4113544 -2883118 -1799105 -842039 2903 750021 1413613 2004081 2527395
56977B527395M62099M08798L62742L22014K86760K57337K31451K06645J83798
$$ 2527395 2989494 3398292 3761034 4083048 4369808 4627145 4858596 5065241 5249039
56968E249039J65076J50018J36358J22983J09840R6428Q2454O8467N4367L8959
$$ 5249039 5414115 5564133 5700491 5823474 5933314 6029742 6112196 6180663 6235030 6273989
56958F273989K2291O511o461j6002k0982j9925j4151q074m992m844o572r517j1726
$$ 6273989 6296280 6302791 6296330 6280328 6259346 6239421 6225270 6217196 6212204 6207360 6200788 6191271 6179545
56945F179545j0106l196Q797K5301M0670L8102k941q6971j93761k93460l67577
$$ 6179545 6169439 6166243 6175040 6200341 6241011 6279113 6276172 6189201 5995440 5701980 5334403
56934E334403m12976m32288m28555m07433l76948l42875l07211k71219k37030
$$ 5334403 4921427 4489139 4060584 3653151 3276203 2933328 2626117 2354898 2117868
56925B117868k06247j79419j56664j37269j19509j02689q8372p7932p0174o3097
$$ 2117868 1911621 1732202 1575538 1438269 1318760 1216071 1127699 1049767 979593 916496
56915I16496n6507n1054m6172m1005l6041l1930k7940k3349j8777j4500r233k523
$$ 916496 859989 808935 762763 721758 685717 653787 625847 602498 583721 569221 559988 557465
56903E57465L505P092R742J3740J8442K1674K3507K5652K7767K7043K1400J1326
$$ 557465 560970 568062 577804 591544 609986 631660 655167 680819 708586 735629 757029 768355
56891G68355r22j2282j9890k2967k3456k3479k3002k1104j8251j5572j2989r756
$$ 768355 767433 755151 735261 712294 688838 665359 642357 621253 603002 587430 574441 564685
56879E64685o031k497P20L508N364O785R748J5253K1508K5885K7386K5865K0512
$$ 564685 558654 556157 556877 560385 565749 572534 582282 597535 619043 644928 672314 698179 718691
56866G18691J1045o29j1645k0277k5898k8368k8708k8779k8872k7166k2917j8270
$$ 718691 729736 729107 717462 697185 671287 642919 614211 585432 556560 529394 506477 488207
56854D88207j5356j3481j0989p990n333k761j41J285R56N01J138J584P52M08K507
$$ 488207 472851 459370 448381 440391 435058 432297 432156 433441 434397 434898 436036 437620 438372 438780 441287
56839D41287N825Q032R225J0488J0825Q970O697O773Q632R521R089R353J0750
$$ 441287 447112 455144 464369 474857 485682 494652 501349 508122 516754 526275 535364 544717 555467
56826E55467J1585J1084R861P688L816p97m481p634j1626j5477j6864j5930j4683
$$ 555467 567052 578136 587997 595685 599501 598704 594223 586589 574963 559486 542622 526692 512009
56813E12009j2986q858k865J696L706N799R929J4758J8703K2579K7567L3048L8035
$$ 512009 499023 490165 487300 488996 492702 498501 508430 523188 541891 564470 592037 625085 663120
56800F63120M2705M7012M9484M8590M3798L4745K1368N819p774j6730k1633k4122
$$ 663120 705825 752837 802321 850911 894709 929454 950822 956641 948867 932137 910504 886382
56788H86382k4542k2768j9545j5758j1470o660j881K630P539J3507K0388K7617
$$ 886382 861840 839072 819527 803769 792299 785639 783758 786388 793927 807434 827822 855439
56776H55439L4631M1008M6997N3405N9608O2119N6961M3392K3986J847k0176l8388
$$ 855439 890070 931078 978075 1031480 1091088 1153207 1210168 1253560 1277546 1279393 1259217 1220829
56764A220829m9614n4264n5432n4452m9857m1395l2127k5000j9609j4018p797
$$ 1220829 1171215 1116951 1061519 1007067 957210 915815 883688 858688 839079 825061 817264
56753H17264j556M850J1690J8111K3232K7725L2778L7974M1171M0026L2931J9577
$$ 817264 815708 820558 832248 850359 873591 901316 934094 972068 1013239 1053265 1086196 1105773
56741A105773J844j6448l1702m2345m8275m9590m6914m2247l8083l5391l2967
$$ 1105773 1107617 1091169 1059467 1017122 968847 919257 872343 830096 792013 756622 723655
56730G23655k8939k2838j6163j0892p502m750j425K442O391J0519J4805J8159
$$ 723655 694716 671878 655715 644823 637321 632571 631146 633588 639979 650498 665303 683462
56718F83462J9117J6910J1260K264q428j7609k3269k6404k8644k9349k7106k2949
$$ 683462 702579 719489 730749 733013 724585 706976 683707 657303 628659 599310 572204 549255
56706E49255j9523j7599j5930j4093j2877j2039j0402q325p419p498o439l579
$$ 549255 529732 512133 496203 482110 469233 457194 446792 438467 431048 423550 417111 413532
56694D13532p41P14J458K033J603j64k037k993l218k723j072P89P94j211k861
$$ 413532 412791 413505 414963 416996 418599 418435 416398 413405 410187 407464 406392 407181 407975 406764 403903
56679D03903k639j707j359r52K51J232Q59l38j375k230k866k592j516r41j288
$$ 403903 401264 399557 398198 397246 397497 398729 399588 399250 397875 395645 392779 390187 388671 387730 386442
56664C86442j420j057j577l163l631j937l88j110k443j593Q38J903P20j078k521
$$ 386442 385022 383965 382388 379225 375594 373657 373269 372159 369716 368123 368961 370864 371584 370506 367985
56649C67985l979m902l830j052J030R56j13m48j5J29l25o64l26L21M50o8l62L56
$$ 367985 364006 359104 355274 354222 355252 356208 356095 355647 355632 355761 355436 354772 354446 354767 355217 355149 354787 355143
56631C55143J640K410K469K515K811K989L092L424L367K035L54M56K338L198J286
$$ 355143 356783 359193 361662 364177 366988 369977 373069 376493 379860 381895 382249 382705 385043 388241 389527
56616C89527j440j986j98J662K046J230K20j03O05J549J316k14j488j491j012
$$ 389527 388087 386101 385903 387565 389611 390841 391061 390958 391563 393112 394428 394214 392726 391235 390223
56601C90223r23p70j72P4l05J07K093L837L285J237N3K30M70K80K70K59p69k781
$$ 390223 389300 388530 388358 388432 388127 388234 390327 394164 397449 398686 398739 398969 399439 399719 399989 400248 399479 396698
56583C96698m611n740o706p739q340q241p686o911o287o506p551q071o957n026
$$ 396698 392087 386347 379641 371902 363562 355321 347635 340724 334437 327931 320380 312309 305352 300326
56569C00326l902l854m093m585n848p324p626o476m976l906k953j709l81O42J088
$$ 300326 296424 292570 288477 283892 278044 270720 263094 256618 251642 247736 244783 243074 242693 243335 244423
56554B44423P45r5l64P96K974N079O544P279P090O116N235N081N169M912M794
$$ 244423 245168 245073 244709 245505 248479 253558 260102 267381 274471 280587 285822 290903 296072 300984 305778
56539C05778N359N812N035L477K522K303J638J13j167j122J9J237J729J413J044
$$ 305778 311137 316949 321984 325461 327983 330286 331924 332037 330870 329748 329767 331004 332733 334146 335190
56524C35190J643L237M454M105K684J599J303J090L89n44r92k63J835M490O304
$$ 335190 336833 340070 344524 348629 351313 352912 354215 355305 355694 355150 354158 353895 355730 360220 366524
56509C66524O785O846P415Q356R227J0082J0733J0370Q958Q055R162J1905J4677
$$ 366524 373309 380155 387570 395926 405153 415235 425968 436338 445296 453351 462513 474418 489095
56496D89095J6327J6423J4959J2765J1252J0773J0225R109Q500Q845Q502O155
$$ 489095 505422 521845 536804 549569 560821 571594 581819 590928 599428 608273 616775 622930
56484F22930L239K013K239J901L01j617l474n843q604j0725j1620j1453j0518
$$ 622930 626169 628182 630421 632322 632623 631006 627532 621689 613085 602360 590740 579287 568769
56471E68769r566j0045j2449j5042j5678j4288j2147r804p405o041o418p015n864
$$ 568769 559203 549158 536709 521667 505989 491701 479554 469750 462345 456304 449886 442871 437007
56458D37007l737l145m442n426m867l906l534l057j874r10j176k198k728k202
$$ 437007 433270 430125 425683 420257 415390 411484 407950 404893 403019 402109 400933 398735 396007 393805
56444C93805j041k71q97k860m657m868l804k803k418k268k098j834j239o61j239
$$ 393805 392764 392493 391596 388736 384079 379211 375407 372604 370186 367918 365820 363986 362747 362086 360847
56429C60847l028l937k279N47J794R72l10j250k189k572j209J396L268L669L670
$$ 360847 357819 353882 351603 352150 353944 354916 354606 353356 351167 348595 347386 348782 352050 355719 359389
56414C59389M004M337M561M885M675L285J834K063L551M351M252M935O795Q255
$$ 359389 363393 367730 372291 377176 381851 385136 386970 389033 392584 396935 401187 406122 412917 421172
56400D21172Q598Q953R810J0021R016P853P183O263M781L659L222K505J269P69
$$ 421172 429770 438723 448533 458554 467570 475423 482606 488869 493650 497309 500531 503036 504305 505074
56386E05074J629K598K419J330n5j726l391m122l712l037k511j765j238k285m898
$$ 505074 506703 509301 511720 513050 512995 511269 507878 503756 500044 497007 494496 492731 491493 489208 484310
56371D84310p058p248o254n606n628n744n535m815l667k847k975l312k595j157
$$ 484310 477252 470004 463750 458144 452516 446772 441237 436422 432755 429908 426933 423621 421026 419869
56357D19869n67j144j567j133o05n14m65m38r30j515j213n02j035k883m116l589
$$ 419869 419302 418158 416591 415458 414853 414339 413874 413436 412506 410991 409778 409276 408241 405358 401242 397653
56341C97653k194r16L06J317J492J299K096L839M946M800M181L071N95k376l361
$$ 397653 395459 394543 394849 396166 397658 398957 401053 404892 409838 414638 418819 421890 422485 420109 416748
56326D16748j836K5R48K095L973M912M118L386M077M906M548L863L627K632K77
$$ 416748 414912 414937 415885 417980 421953 426865 430983 434369 438446 443352 447900 451763 455390 458022 458299
56311D58299j264RK577L478K336J212J492K874M322M611L158J375J655L884N080
$$ 458299 457035 457044 459621 463099 465435 466647 468139 471013 475335 479946 483104 484479 486134 490018 495098
56296D95098L769K369L377N639O744O948P898R137Q864P127N589M801M015L110
$$ 495098 498867 501236 504613 510252 516996 523944 531842 540979 549843 556970 562559 567360 571375 574485
56282E74485K627K421K141K408L857N619O296N816M884L628K159J367J607J686
$$ 574485 577112 579533 581674 584082 587939 593558 599854 605670 610554 614182 616341 617708 619315 621001
56268F21001P59J58J540M188N976O325O492P453Q992J0453J1247J1154J0827J1189
$$ 621001 621760 621918 623458 627646 633622 639947 646439 653892 662884 673337 684584 695738 706565 717754
56254G17754J1788J1206R762R822J2247J4697J5139J4959J6389J8679J9379J8281
$$ 717754 729542 740748 750510 760332 772579 787276 802415 817374 833763 852442 871821 890102
56242H90102J7444J7983J8985J9303J8568J6856J4777J3472J3387J3705J3746
$$ 890102 907546 925529 944514 963817 982385 999241 1014018 1027490 1040877 1054582 1068328
56231A068328J3712J3318J1544Q996Q445J1146J4533J5666J5313J6196J8814K1678
$$ 1068328 1082040 1095358 1106902 1115898 1124343 1135489 1150022 1165688 1181001 1197197 1216011 1237689
56219A237689K4453K7953L1713L4334L6157L9157M4087M9581N4172N7767O1212
$$ 1237689 1262142 1290095 1321808 1356142 1392299 1431456 1475543 1525124 1579296 1637063 1698275
56208A698275O5585P1576P8682Q5524R1798R8914J07884J17887J27977J38707
$$ 1698275 1763860 1835436 1914118 1999642 2091440 2190354 2298238 2416125 2544102 2682809
56198B682809J50700J63115J75134J87537K01100K14743K26870K37414K46973
$$ 2682809 2833509 2996624 3171758 3359295 3560395 3775138 4002008 4239422 4486395
56189D486395K55060K60631K63130K61682K54775K42042K24873K03946J78028
$$ 4486395 4741455 5002086 5265216 5526898 5781673 6023715 6248588 6452534 6630562
56180F630562J46566J11477P4892L7446N00l2638o0186q4227j06976j26890j41262
$$ 6630562 6777128 6888605 6963497 7000943 7001443 6968805 6908619 6824392 6717416 6590526 6449264
56169F449264j50656j57651j62800j65034j64920j64584j65209j66877j69659
$$ 6449264 6298608 6140957 5978157 5813123 5648203 5483619 5318410 5151533 4981874
56160D981874j72794j74365j73932j73739j75075j75654j73166j69114j65986
$$ 4981874 4809080 4634715 4460783 4287044 4111969 3936315 3763149 3594035 3428049
56151C428049j62795j56968j48837j40698j32920j24469j15916j08507j01576
$$ 3428049 3265254 3108286 2959449 2818751 2685831 2561362 2445446 2336939 2235363
56142B235363r4171q7587q2930p7932p0034o1029n4594n0679m6428m1451l7729
$$ 2235363 2141192 2053605 1970675 1892743 1822709 1761680 1707086 1656407 1609979 1568528 1530799
56131A530799l5214l2053k8568k6666k5679k3104j9252j6952j6645j5807j3339
$$ 1530799 1495585 1463532 1434964 1408298 1382619 1359515 1340263 1323311 1306666 1290859 1277520
56120A277520j0762q844o748m573l238j896J068M630O271O318P413R881J1456
$$ 1277520 1266758 1257914 1251166 1246593 1243355 1241459 1242527 1247157 1253428 1259746 1267159 1277040 1288496
56107A288496J1637J2470J4750J7116J9127K1719K4313K5003K4001K3657K4861
$$ 1288496 1300133 1312603 1327353 1344469 1363596 1385315 1409628 1434631 1458632 1482289 1507150
56096A507150K6379K7680K9242L0355K9892K8967K9636L1428L2483L3258L5404
$$ 1507150 1533529 1561209 1590451 1620806 1650698 1679665 1709301 1740729 1773212 1806470 1841874
56085A841874L7881L8438L8349M1333M8065N6106O4956P6425R0085J03078J14857
$$ 1841874 1879755 1918193 1956542 1997875 2045940 2102046 2167002 2243427 2333512 2436590 2551447
56074B551447J27672J41724J54004J62349J66532J65305J56855J42822J27694
$$ 2551447 2679119 2820843 2974847 3137196 3303728 3469033 3625888 3768710 3896404
56065C896404J13767J00542Q8730Q0026P2505O1220M4340K4613M445j5797l4255
$$ 3896404 4010171 4110713 4199443 4279469 4351974 4413194 4457534 4482147 4486592 4470795 4436540
56054D436540m7471n5312o1850p0308q0865r3655j09385j26156j39991j49244
$$ 4436540 4389069 4333757 4271907 4201599 4120734 4027079 3917694 3791538 3651547 3502303
56044C502303j54647j55224j48814j36930j24158j12235r9410q5749p3865o3946
$$ 3502303 3347656 3192432 3043618 2906688 2782530 2670295 2570885 2485136 2411271 2347325
56034B347325n3372m2036l2898k6528k0273j3439q174m697r47K640L568K838M119
$$ 2347325 2293953 2251917 2219019 2192491 2172218 2158779 2150605 2145908 2144961 2147601 2151169 2154007 2158126
56021B158126O955P125M358L085M373M079P56j368N15L885O184Q182J0191J0871
$$ 2158126 2165081 2172206 2176564 2179649 2184022 2188101 2188857 2187489 2188004 2191889 2198073 2206255 2216446 2227317
56007B227317J1516J5444K1461K4086K2087K0458K2218K4774K6224K8402L1542
$$ 2227317 2238833 2254277 2275738 2299824 2321911 2342369 2364587 2389361 2415585 2443987 2475529
55996B475529L2610L1329L1510L4372L6835L8154M1302M6159M8558M7939M8553
$$ 2475529 2508139 2539468 2570978 2605350 2642185 2680339 2721641 2767800 2816358 2864297 2912850
55985B912850N1281N2068N0278N0501N3866N6011N5908N7966O2944O5837O5643
$$ 2912850 2964131 3016199 3066477 3116978 3170844 3226855 3282763 3340729 3403673 3469510 3535153
55974C535153O7847P4024P8576P9234Q1139Q6729R1474R3691R8499J07600J15260
$$ 3535153 3603000 3677024 3755600 3834834 3915973 4002702 4094176 4187867 4286366 4393966 4509226
55963D509226J19061J24438J33821J41907J46585J53652J65108J74064J77242
$$ 4509226 4628287 4752725 4886546 5028453 5175038 5328690 5493798 5667862 5845104
55954E845104J81318J90497J99299K04345K11573K24411K36561K44346K54682
$$ 5845104 6026422 6216919 6416218 6620563 6832136 7056547 7293108 7537454 7792136
55945G792136K72748K93151L11345L32130L58565L84531M06875M32839M66847
$$ 7792136 8064884 8358035 8669380 9001510 9360075 9744606 10151481 10584320 11051167
55936A1051167N02220N34472N69551O10167O48176O80212P16345P63152Q13290
$$ 11051167 11553387 12087859 12657410 13267577 13915753 14595965 15312310 16075462 16888752
55927A6888752Q62101R18113R85468J052847J112387J172536J239418J304058
$$ 16888752 17750853 18668966 19654434 20707281 21819668 22992204 24231622 25535680
55919B5535680J362191J427118J507290J591380J672584J767063J890032K034972
$$ 25535680 26897871 28324989 29832279 31423659 33096243 34863306 36753338 38788310
55911C8788310K195753K386537K618956K883643L176872L519809L926806M382362
$$ 38788310 40984063 43370600 45989556 48873199 52050071 55569880 59496686 63879048
55903F3879048M877446N440976O107115O881776P769562Q794336R956479J1212611
$$ 63879048 68756494 74197470 80304585 87186361 94955923 103750259 113706738 124919349
55895A24919349J2542194J3992937J5620782J7447855J9537472K2036102K5061588
$$ 124919349 137461543 151454480 167075262 184523117 204060589 226096691 251158279
55888B51158279K8620467L2661908L6918265M0310408M0619881L5422193K3962555
$$ 251158279 279778746 312440654 349358919 389669327 430289208 465711401 489673956
55881D89673956Q207719q139583k1774636l1154175l6333105l8108107l7439227
$$ 489673956 497881675 489742092 467967456 436813281 400480176 362372069 324932842
55874C24932842l5245608l2269194k8982969k5657966k2485427j9595193j7025942
$$ 324932842 289687234 257418040 228435071 202777105 180291678 160696485 143670543
55867A43670543j4765357j2810783j1156751r760409q567761p553510o701525
$$ 143670543 128905186 116094403 104937652 95177243 86609482 79055972 72354447
55860G2354447n972098n324017m748513m250636l816400l426152l081047k788358
$$ 72354447 66382349 61058332 56309819 52059183 48242783 44816631 41735584 38947226
55852C8947226k536342k308402k106630j937957j791573j652523j524325j416690
$$ 38947226 36410884 34102482 31995852 30057895 28266322 26613799 25089474 23672784
55844B3672784j323125j231023j142593j066315r97890r28046q59794q00903p48115
$$ 23672784 22349659 21118636 19976043 18909728 17911838 16983792 16123998 15323095 14574980
55835A4574980o94723o44938o05304n70298n31328m92069m60810m35425m09573
$$ 14574980 13880257 13235319 12630015 12059717 11528389 11036320 10575510 10140085 9730512
55826I730512l85951l69870l56834l39671l21332l08274k97744k83627k68362
$$ 9730512 9344561 8974691 8617857 8278186 7956854 7648580 7350836 7067209 6798847
55817F798847k57376k48012k35371k22813k15471k09556j99150j87458j80350
$$ 6798847 6541471 6293459 6058088 5835275 5619804 5410248 5211098 5023640 4843290
55808D843290j74875j65411j55354j51206j50244j45433j37768j32605j28179
$$ 4843290 4668415 4503004 4347650 4196444 4046200 3900767 3762999 3630394 3502215
55799C502215j19107j07856j01770j01424j01757j01828j03832j05115j00854
$$ 3502215 3383108 3275252 3173482 3072058 2970301 2868473 2764641 2659526 2558672
55790B558672r2690q6229q2031p6884p1313o7966o5221o0030n4438n1951n0384
$$ 2558672 2465982 2379753 2297722 2220838 2149525 2081559 2016338 1956308 1901870 1849919 1799535
55779A799535m5677l9663l6598l5022l0645k4446k0521j8602j5842j3177j2823
$$ 1799535 1753858 1714195 1677597 1642575 1611930 1587484 1566963 1548361 1532519 1519342 1506519
55768A506519j2485r154n569n804p633o730n129p681j3007j5962j6582j8742k2231
$$ 1506519 1494034 1484880 1479311 1473507 1465874 1459144 1454015 1446334 1433327 1417365 1400783 1382041 1359810
55755A359810k4064k5460k9549l3985l3888l0503k9137k9822k8028k3468k0349
$$ 1359810 1335746 1310286 1280737 1246752 1212864 1182361 1153224 1123402 1095374 1071906 1051557
55744A051557j9423j7460j4235j2689j2426j0200o760o075p667o774k602K21o25
$$ 1051557 1032134 1014674 1000439 987750 975324 965124 958364 952289 944622 937848 935246 935467 934842
55731I34842k292k542k655l466l738l574m846p590r924j1584j3379j3882j1131
$$ 934842 932550 930008 927353 923887 920149 916575 911729 904139 894215 882631 869252 855370 844239
55718H44239p049n438o227o332n529o496r724j3259j6831k1266k4578k3815k0311
$$ 844239 837190 831752 825525 819193 813664 807168 797444 784185 767354 746088 721510 697695 677384
55705F77384j8003j7086j4511j0182p241o406n499m483n621q378r354p781o206
$$ 677384 659381 642295 627784 617602 610361 603955 598456 593973 588352 579974 570620 562839 556633
55692E56633n463l852j615j281k992m039l597l618m732n584o364q555j1123j1382
$$ 556633 551170 547318 545703 544422 541430 537391 533794 530176 525444 519860 513496 504941 493818 482436
55678D82436r751r127r662q899p122p439j0059j1507j0293q690p991o775m821
$$ 482436 472685 463558 453896 444997 437875 430436 420377 408870 398577 389887 381896 375121 370300
55665C70300m144n032n308m627n243p499q678p527n968n279m272k395q83L4J469
$$ 370300 366156 361124 355816 351189 345946 338447 329769 322242 316274 310995 306723 304328 303445 303479 304948
55650C04948K803J982n62j954j367o56l16R74K484J714q55j827o60o04k798m267
$$ 304948 307751 309733 309171 307217 305850 305194 304878 305852 308336 310050 309195 307368 306708 306104 303306 299039
55634B99039l363k440l044l015p38J762K476K571L359L585K176P69J104K542M170
$$ 299039 295676 293236 290192 287177 286439 288201 290677 293248 296607 300192 302368 303137 304241 306783 310953
55619C10953O684J0230J2822J2860J1072Q633N717K971J733J565K07k793n247
$$ 310953 317637 327867 340689 353549 364621 373254 378971 381942 383675 385240 385447 382654 377407
55606C77407o075o887q596r565q571o796n420l982k393j663j437J08K663L384
$$ 377407 371332 364445 355849 346284 337713 330917 325497 321515 319122 317459 316022 316130 318793 322177
55592C22177J633O46K494M643L940J143r43j503j420r95j55O38J220J976K185
$$ 322177 323810 324456 326950 331593 335533 336676 335733 334230 332810 331815 331660 332298 333518 335494 337679
55577C37679L06l136n415n510n590p280r171r569r025q449p399n907n507o523
$$ 337679 337985 334849 329434 323924 318334 311054 301883 292314 283289 274840 267441 261534 256027 249504
55563B49504o880n492m342n168o523o367n383n294n813n511m359l337k820k855
$$ 249504 242624 237132 232790 227622 221099 214732 209349 204055 198242 192731 188372 185035 182215 179360
55549A79360l623m385l634j474O8J37J60P59K87j871l339k282m77l73j261r33
$$ 179360 175737 171352 167718 166244 166312 166449 166609 167368 167655 165784 162445 160163 159686 159313 158052 157119
55533A57119N78J519J299N01p10k054k260q33L62o97l317n210n559n260m961m585
$$ 157119 157697 159216 160515 161016 160306 158252 155992 155159 155521 154824 151507 146297 140738 135478 130517 125932
55517A25932m126l621k861j994j607j604j240p85j500l319m358l664k495j966
$$ 125932 121806 118185 115324 113330 111723 110119 108879 108094 106594 103275 98917 95253 92758 90792
55503I0792j550r47j206k461k832j247O11R53N06O25O92n81k732m397n223n297
$$ 90792 89242 88295 87089 84628 81796 80549 81160 82113 82619 83244 83936 83355 80623 76226 71003 65706
55487F5706m162k041m61q6N85K647M680N017M408M419M641L660J616j53r88q11
$$ 65706 61544 59503 59042 58956 59541 62188 66868 71885 76293 80712 85353 89013 90629 90476 89488 88677
55471H8677O26K742L738K913K044K836M346M729L916K760J053j360k832j779O25
$$ 88677 89303 92045 95783 98696 100740 103576 107922 112651 116567 119327 120380 119020 116188 114409 115034
55456A15034J807J228M83O11J234J898K477K597K059J476J401J454J232J167J457
$$ 115034 116841 118069 118552 119163 120397 122295 124772 127369 129428 130904 132305 133759 134991 136158 137615
55441A37615J259k0j774l417n170o703o660m759k612j235L40K587L838K870J163
$$ 137615 138874 138854 137080 133663 128493 121790 115130 110371 107759 106524 106864 109451 113289 116159 117322
55426A17322M61Q1j118k019j132M02M43p91j634k060l145m408m433l483k968k907
$$ 117322 117783 117864 116746 114727 113595 113997 114440 113649 112015 109955 106810 102402 97969 94486 91518 88611
55410H8611k286j324j031j121n98Q8k19j119j321j058j454k187k090j649k253
$$ 88611 86325 85001 83970 82849 82251 82339 82120 81001 79680 78622 77168 74981 72891 71242 68989
55395F8989l383l149j540o11j178j799j396o50k21M48J657K329J246j544m810
$$ 68989 65606 62457 60917 60306 59128 57329 55933 55283 55062 55510 57167 59496 60742 59198 54388
55380E4388o916o554l671K65L530N329N407L619P60j330j824j854k297k052j67
$$ 54388 47472 40918 37247 37512 41042 46371 51778 55397 56157 54827 53003 51149 48852 46800 46633
55365D6633J845J932N47m40p26j142j302k83R83P22o62j089q6R08J284J777K246
$$ 46633 48478 50410 50957 50517 49791 48649 47347 47064 48047 48769 48107 47018 46932 47840 49124 50901 53147
55348E3147J509l15j564j553j286j385j350j090j268j737j504n68K3J73R80K558
$$ 53147 54656 54341 52777 51224 49938 48553 47203 46113 44845 43108 41604 41036 41059 41232 42212 44770
55332D4770L519L039J900J026M93L14O67R78J71j618k880k562j102M48J299J070
$$ 44770 48289 51328 53228 54254 54747 55061 55728 56706 56877 55259 52379 49817 48715 49163 50462 51532
55316E1532J57k10O21J708J960J898K500L196K786J655J042P44l38j897k689k807
$$ 51532 51689 51479 52100 53808 55768 57666 60166 63362 66148 67803 68845 69589 69251 67354 64665 61858
55300F1858l148l129j623J98k3j895k584j354n50j273j514M8J480Q49n67n57N69
$$ 61858 58710 55581 53958 54156 54133 52238 49654 48300 47750 46477 44963 45011 46491 47340 46773 46216 46785
55283D6785J131J060J441K068J639n1j751k351j798q41n85j657l163l298j565
$$ 46785 47916 48976 50417 52485 54124 54073 52322 49971 48173 47332 46747 45090 41927 38629 37064
55268C7064M38J114O77K60K71N39J041J610J677J136O97P78Q81O00L11J95l29
$$ 37064 37502 38616 39293 39553 39824 40363 41404 43014 44691 45827 46524 47302 48183 48783 49094 49289 48960
55251D8960j354j731o51R01J333N19m66j048j477j722j314l64K47K6l95j47O52
$$ 48960 47606 45875 45224 46125 47458 47977 47511 46463 44986 43264 41950 41586 41833 41859 41464 41317 41969
55234D1969J078P23K27K03K18l88j075o73O36J327R39Q50J773K191Q28q29n22
$$ 41969 43047 43770 43997 44200 44418 44030 42955 42282 42918 44245 45184 46034 47807 49998 50826 49997 49475
55217D9475J232J909P99k93m6R05J703K348K532J388q09k293k000q17l2J88J42
$$ 49475 50707 52616 53415 53122 53076 53981 55684 58032 60564 61952 61143 58850 56850 56033 56001 56189 56331
55200E6331l57j325j918j243M62J930J859L4k132k633j220o8j038k979l328j722
$$ 56331 55974 54649 52731 51488 51950 53880 55739 55773 53641 51008 49788 49720 48682 45703 42375 40653
55184D0653j03M53P85J462J759J293P58M10m39j687j964p61N27O29J15J37O10
$$ 40653 40550 41003 41788 43250 45009 46302 47060 47470 47031 45344 43380 42619 43146 43775 43890 44027 44637
55167D4637O93K67PM22J349K037J731N90k68k73l31j206j899j192P8L48K11J489
$$ 44637 45330 45597 45604 46026 47375 49412 51143 51733 51465 51192 50861 49655 47756 46564 46642 46990 47201 48690
55149D8690L700M229K231k17j328j444j077J15J595J719M42j52Q31J668J146N59
$$ 48690 52390 56619 58850 58633 57305 55861 54784 54899 56494 58213 58655 58503 59334 61002 62148 62707
55133F2707J017J248M0j326j232m26m03p67m22L7n46j518j404l90J81l9m63r94
$$ 62707 63724 64972 65012 63686 62454 62028 61625 60858 60436 60473 59927 58409 57005 56615 56796 56757 56294 55300
55115E5300j592j407j20Q28J77q80l69J382K407K252K179K534K187P27o35q49
$$ 55300 53708 52301 52181 53009 53186 52306 51937 53319 55726 57978 60157 62691 64878 65605 64970 64121
55099F4121l39j79q87k063k557j430M57P29j439l604k988l14J383J079N86J117
$$ 64121 63782 63603 62716 60653 58096 56666 57123 57852 56413 52809 49821 49507 50890 51969 52555 53672
55083E3672J598J016K49L51P54M65j31p7K90l23k124l724l741k259l80J062J986
$$ 53672 55270 56286 56535 56886 57640 58105 57974 57897 58187 57864 55740 52016 48275 46016 45636 46698 48684
55066D8684K501K476J844R70K65l61j170j882j848r85O1Q14J427K186L008L635
$$ 48684 51185 53661 55505 56475 56740 56379 55209 53327 51479 50494 50555 51369 52796 54982 57990 61625
55050F1625L808L323K411J880K219K709K390J640J646K439K832K400J982J873
$$ 61625 65433 68756 71167 73047 75266 77975 80365 82005 83651 86090 88922 91322 93304 95177
55036I5177J185l93j666j634q46j92M12J216J738J609J305J157P16p6k39P04J680
$$ 95177 96362 95969 94303 92669 91823 91631 92043 93259 94997 96606 97911 99068 99784 99708 99469 100173 101853
55019A01853J661J133R48Q66M42K60Q99J530J049p9m99N3O48N47l86k011l662
$$ 101853 103514 104647 105595 106461 106903 107163 108062 109592 110641 110562 110063 110116 110764 111311 110925 108914 105252
55002A05252m106k808p83N62Q04K08r09j668q42J283K445J146j251k498k369k032
$$ 105252 101146 98338 97555 98117 98921 99129 98220 96552 95710 96993 99438 100584 99333 96835 94466 92434
54986I2434j739j044m11n78q67j40R40O49j023k152j535Q6J427J794P88j399l266
$$ 92434 90695 89651 89240 88662 87795 87655 88595 89244 88221 86069 84534 84620 86047 87841 88629 87230 83964
54969H3964l065r20J302K419K932L375L093J399q74j870n87J943L485K844J256
$$ 83964 80899 79979 81281 83700 86632 90007 93100 94499 93625 91755 91168 93111 96596 99440 100696
54954A00696Q87J984K694K055J425J984K526J530p0k14R89J576P75k85p43p93
$$ 100696 101583 103567 106261 108316 109741 111725 114251 115781 115711 115497 116486 118062 118837 118552 117809 117016
54938A17016l98Q22K243K516J456J81o88j446j960j595o82l89q10p32L26J274
$$ 117016 116618 117440 119683 122199 123655 123836 123148 121702 119742 118147 117465 117076 116266 115534 115860 117134
54922A17134J137K87m62q73r68p49n67q17j092o51K39N38Q8j91J93P63J169J540
$$ 117134 118271 118558 118096 117223 116255 115506 114939 114122 113030 112379 112618 113156 113244 113053 113246 114009 115178 116718
54904A16718J626Q76l34q23j95P39J388K035K903L681M180M394L960K756J937
$$ 116718 118344 119220 118886 118063 117868 118607 119995 122030 124933 128614 132794 137188 141148 143904 145841
54889A45841K846M894O093N885N698O446P328P729Q468J0210J2208J3637J4870
$$ 145841 148687 153581 159674 165559 171257 177703 185031 192760 201228 211438 223646 237283 252153
54876B52153J6341J7443J7499J6804J5687J3647J0287O104J497l856r626j4007
$$ 252153 268494 285937 303436 320240 335927 349574 359861 365965 367462 363606 353980 339973
54864C39973j5495j4775j3734j3414j3771j4563j5234j4735j2745j0485r216q581
$$ 339973 324478 309703 295969 282555 268784 254221 238987 224252 211507 201022 191806 183225
54852A83225p554o224n278m373k642n10O62Q60J672L911O373P561P470P004O659
$$ 183225 175671 169447 164169 159796 157154 156644 157306 158166 159838 163749 170122 177683 185153 192157 198816
54837A98816O588P147Q394R596J0132J0578J1877J3673J4453J3444J1306Q630
$$ 198816 205404 212551 220945 230541 240673 251251 263128 276801 291254 304698 316004 324634
54825C24634M883l69n943r929j1798j2594j3221j3673j4002j4710j5613j5431
$$ 324634 329517 329148 323205 313276 301478 288884 275663 261990 247988 233278 217665 202234
54813B02234j3413j0625q732p981p324o200n191m868m806m057k304m28K06p95
$$ 202234 188821 178196 169464 161483 154159 147959 142768 137900 133094 129037 126733 126305 126511 125716
54799A25716k211k480j654j241j999k829k419r65M49J339J800J722R62q0q18j028
$$ 125716 123505 121025 119371 118130 116131 113302 110883 109918 110367 111706 113506 115228 116190 116110 115292 114264
54783A14264n94N04J445Q09j477l525l836l217l153l378k732j533j167j758k065
$$ 114264 113670 114174 115619 116428 114951 111426 107590 104373 101220 97842 95110 93577 92410 90652 88587
54768H8587j496o10K10R67J120M7j513k057j310k59O00J500K074J618O56N29J318
$$ 88587 87091 86481 86691 87658 88778 88825 87312 85255 83945 83686 84286 85786 87860 89478 90134 90663 91981
54751I1981J930K280L386M943N087L297J557J552K431K584K052J910K422L183
$$ 91981 93911 96191 99577 104520 109607 112904 114461 116013 118444 121028 123080 124990 127412 130595
54737A30595M168N357O032N634M863M944O086P495Q562R358J0078J0597J0688
$$ 130595 134763 140120 146152 151786 156649 161593 167679 175174 183736 193094 203172 213769 224457
54724B24457J0576J1159J3283J6447J8754J8813J7244J5550J4020J1776Q424M444
$$ 224457 235033 246192 259475 275922 294676 313489 330733 346283 360303 372079 380503 384947
54712C84947L47l396n994p247q360j0301j1928j1517r741q895r343r109p164m715
$$ 384947 385294 381898 375904 368657 360297 349996 338068 326551 316810 307915 298572 289463 282299 277584
54698B77584k709n47J774K704J669M88Q38J973K509K883M376O882R202J0817J2125
$$ 277584 274875 274328 276102 278806 280475 280963 281801 283774 286283 289166 293542 300424 309626 320443 332568
54683C32568J3528J5191J7048J8557J9293K0003K1886K4524K6057K5629K3782
$$ 332568 346096 361287 378335 396892 416185 436188 458074 482598 508655 534284 558066
54672E58066K0206J3510M174m745j1318j6912k3026k8250l0446l0044k8786k6839
$$ 558066 578272 591782 595956 591211 579893 562981 539955 511705 481259 451215 422429 395590
54660C95590k3619k0167j8084j6924j5106j2763j1368j1084j0756j0124r797r317
$$ 395590 371971 351804 333720 316796 301690 288927 277559 266475 255719 245595 235798 226481
54648B26481p524m881l294l364l728l416l059l311l670l528l035k305q51J436
$$ 226481 218957 214076 210782 207418 203690 200274 197215 193904 190234 186706 183671 181366 180515 181951
54634A81951L426L633J722j036k768k607j420o31m63j63J45n82j986j816R53M066
$$ 181951 185377 189010 190732 189696 186928 184321 182901 182270 181807 181644 181789 181207 179221 177405 178358 182424
54618A82424M732L258K088K189K463K124J660J531J750K672M541O323O483N008
$$ 182424 187156 190414 192502 194691 197154 199278 200938 202469 204219 206891 211432 217755 224238 229246
54604B29246L439K969L629M934O088N995M563L450M061N348N333M245L920M550
$$ 229246 232685 235654 239283 244217 250305 256300 260863 264313 268374 273722 279055 283300 287220 291770
54590B91770M422L083K205K706L340L112L038M187N677O092N733O030P454R277
$$ 291770 296192 299275 301480 304186 307526 310638 313676 317863 323540 329632 335365 341395 348849 358126
54576C58126J0786J1790J2422J3203J4932J7793K0954K3509K5467K7358K9133
$$ 358126 368912 380702 393124 406327 421259 439052 460006 483515 508982 536340 565473
54565E65473K9883K8441K4249J7865J0585L207m508j2695k0182k5399k8258k9966
$$ 565473 595356 623797 648046 665911 676496 679703 675195 662500 642318 616919 588661 558695
54553E58695l1029l0578k7979k4003k0012j6798j4588j3366j2748j2122j1234
$$ 558695 527666 497088 469109 445106 425094 408296 393708 380342 367594 355472 344238
54542C44238j0218r055p627o202n177m433l697l352l860m628m632m117m292n226
$$ 344238 334020 324965 317338 311136 305959 301526 297829 294477 290617 285989 281357 277240 272948 267722
54528B67722n682n409n833p587q917p969n553l989l880l771k892k527l983o349
$$ 267722 262040 256631 250798 243211 234294 226325 220772 216783 212903 209132 206240 203713 199730 193381
54514A93381p353o092l935k695k589k573k063j469j102o43p6k11j420k614k450
$$ 193381 186028 179936 176001 173306 170717 168144 166081 164612 163510 162867 162791 162580 161160 158546 156096
54499A56096j135j33k74j057j606j478p85j87m59j252r35J242L427L193R77k95
$$ 156096 154961 154828 154554 153497 151891 150413 149628 149441 148982 147730 146795 148037 151464 154657 155634 155339
54483A55339Q43K650K876J489o8r10q44K86K150L552L654L175L433M640N895O486
$$ 155339 156182 158832 161708 163197 163129 162219 161375 161661 163811 167363 171017 174192 177625 182265 188160 194646
54467A94646O420O019N778O364Q032J0139J1753J2683J3395J4053J4174J3291
$$ 194646 201066 207085 212863 219227 227259 237398 249151 261834 275229 289282 303456 316747
54455C16747J1495R157O372K927j145n106p840q846q747q614q998r778j0724j1685
$$ 316747 328242 337399 343771 346698 345553 340447 332607 323761 315014 306400 297402 287624 276900 265215
54441B65215j2398j2558j2078j1026r523p953o913o506n992m741l122j872r44
$$ 265215 252817 240259 228181 217155 207632 199679 192766 186260 180268 175527 172405 170533 169589
54428A69589J23J082J238O79K78M03O01N83O21P84P64N69N81P31N48J90M84J531
$$ 169589 169712 170794 172032 172711 172989 173392 173993 174576 175197 175981 176745 177314 177895 178626 179174 179364 179848 181379
54410A81379K283K051J666K385M175N669N657M302K995L046M255M963L920J814
$$ 181379 183662 185713 187379 189764 193939 199608 205265 209567 212562 215608 219863 224826 228746 230560
54396B30560L28J2K8l46j088k137l397m009l075j449j211k764l915k818n44N74
$$ 230560 230888 230900 230928 230582 229494 227357 223960 219951 216876 215427 214216 211452 207537 204719 204175 204749
54380B04749Q8n31m41m61j576l589n512o518o293n058l510k373j842j543j053
$$ 204749 204837 204306 203865 203404 201828 198239 192727 186209 179916 174858 171348 168975 167133 165590 164537
54365A64537l96m4m19j281j871j824j600j526r95M92J883J683M68O94L285N911
$$ 164537 164141 164097 163678 162397 160526 158702 157102 155576 154581 155073 156956 158639 159107 159801 163086 168997
54349A68997N759L006L34k91J010L218N483O929O792N309L696K942L123L971N395
$$ 168997 174756 177762 178096 177805 178815 182033 187516 194445 201237 206546 210242 213184 216307 220278 225673
54334B25673P066Q211Q309P742P167O447M778K016o89j960j654q84p23j387k606
$$ 225673 232739 240950 249259 257001 264168 270615 275393 277409 276720 274760 273106 272222 271499 270112 267506
54319B67506m114n493o201o178o039o201o306n970n512n362n185m443l343k468
$$ 267506 263392 257899 251698 245520 239481 233280 226974 221004 215492 210130 204945 200502 197159 194691
54305A94691j794j069p64j462k504k592j806j710l014m356m099k368n00Q22J942
$$ 194691 192897 191828 191064 189602 187098 184506 182700 180990 177976 173620 169521 167153 166653 167475 169417
54290A69417L163M088M060K863J035m58r75o19J66J163K161K613K247J752J934
$$ 169417 172580 176668 180728 183591 184626 184168 183193 182574 182740 183903 186064 188677 190924 192676 194610
54275A94610K348J899P79O32K200M057M352L101J748R78jj985m337n506m768l183
$$ 194610 196958 198857 199636 200268 202468 206525 210877 213978 215726 216704 216703 214718 210381 204875 200107 196924
54259A96924k562l610n312o128n386l588j977j875l515n234m954k965j919l114
$$ 196924 194362 190752 185440 179312 173926 170338 168361 166486 162971 157737 152783 149818 147899 144785
54245A44785m383l207n36O37m30j766k110k221k633k609j928j658k354l137l214
$$ 144785 140402 137195 136659 137296 136866 135100 132990 130769 128136 125527 123599 121941 119587 116450 113236
54230A13236k691j456R02L440M055K260J23m82m6J4o44j627k631k906j488J113
$$ 113236 110545 109089 109991 113431 117486 119746 119869 119387 119341 119355 118711 117084 114453 111547 110059 111172
54214A11172K864K847K340K417K277J221M61J212K479K522J378M15L63J144K462
$$ 111172 114036 116883 119223 121640 123917 125138 125599 126811 129290 131812 133190 133605 133968 135112 137574
54199A37574L317K308j27j316J98K405K837K102K108K395J185j022k106k083k901
$$ 137574 140891 143199 143072 141756 141954 144359 147196 149298 151406 153801 154986 153964 151858 149775 146874
54184A46874m496m319j623Q11N61j142j637n25O27R81J002Q52m5j748l094k719
$$ 146874 142378 138059 136436 137247 137808 136666 135029 134504 135131 136112 137114 137966 137921 136173 133079 130360
54168A30360n69J868K894K257J218R50J347J785K326L377M492M601L420J897J126
$$ 130360 129791 131659 134553 136810 138028 138978 140325 142110 144436 147813 152305 156906 160326 162223 163349
54153A63349J276J648J503Q90O12J187J950J872J136R20J524J893J340L89o19
$$ 163349 164625 166273 167776 168666 169278 170465 172415 174287 175423 176343 177867 179760 181100 181489 180870
54138A80870k193m210n326m964m315m189l508j588k16j259l509m256l150k118
$$ 180870 178677 174467 169141 164177 159862 155673 152165 150577 150361 149102 145593 141337 138187 136069
54124A36069k022j931j464j429j889j690l55J175J947J768O46j086k258k046j376
$$ 136069 134047 132116 130652 129223 127334 125644 125289 126464 128411 130179 130825 129739 127481 125435 124059
54109A24059j547j928r22J076J991J347Q77J519K047J311j56j434k255k185o38
$$ 124059 122512 120584 119662 120738 122729 124076 124953 126472 128519 129830 129674 128240 125985 123800 123162
54094A23162J476J928j31l080n064n667m897k506N78K120J123p98j809k122k717
$$ 123162 124638 126566 126435 123355 118291 112624 107727 105221 105799 107919 109042 108244 106435 104313 101596
54079A01596l222k609j075K14O25K71n71j362j260o2J385K245K376J746K73j154
$$ 101596 98374 95765 94690 94904 95529 95800 95229 93867 92607 92545 93930 96175 98551 100297 100570 99416
54063I9416r49R53K398J638l80j422p13P38J695J484M3j685k157r53N33R11M77
$$ 99416 98467 99420 101818 103456 103076 101654 100941 101679 103374 104858 104901 103216 101059 100106 100639 101550 102027
54046A02027K61L54K76R9K4l29j033j035L84K018K022M41j029j401j159p78m9
$$ 102027 102288 102642 102918 103017 103041 102712 101679 100644 101028 103046 105068 105509 104480 103079 101920 101142 101093
54029A01093R54J532J377J007R34J096J330J660J911J703J078N73M89O50R75J658
$$ 101093 102047 103579 104956 105963 106897 107993 109323 110983 112894 114597 115675 116248 116737 117387 118362 120020
54013A20020K535K825J987M74p44j239j272j095o30o1j13j091j926j095J345L443
$$ 120020 122555 125380 127367 127841 127097 125858 124586 123491 122861 122800 122687 121596 119670 118575 119920 123363
53997A23363L619K345J102N49N92J275K264K271O62q40R7K996M947M500L205K725
$$ 123363 126982 129327 130429 130978 131570 132845 135109 137380 138042 137202 137299 140295 145242 149742 152947 155672
53981A55672K640K160K019L037M285M425L842L842M533N198O026P758R822J0589
$$ 155672 158312 160472 162491 165528 169813 174238 178080 181922 186455 191653 197679 205437 215259 225848
53967B25848R601Q253P925Q558R358R960J0325J0181R115P117M761K850J957K239
$$ 225848 235449 243702 251627 260185 269543 279503 289828 300009 309124 316241 321002 323852 325809 328048
53953C28048L467M999N747M804K589P74L18J55j217l368m640m694m637m734m086
$$ 328048 331515 336514 342261 347065 349654 350428 350746 350901 349684 346316 341676 336982 332345 327611 323525
53938C23525k958l097m948o618o796o683p520q210p350n975n996o945o698m774
$$ 323525 320567 317470 312522 305904 299108 292425 284905 276695 269345 263370 257374 250429 243731 238957
53924B38957k677j416o92l93r00j820k111j588q74J3J469K766K465N47j357k107
$$ 238957 236280 234864 234172 233779 232879 231059 228948 227360 226486 226499 227968 230734 233199 233746 232389 230282
53908B30282k019j538n08Q48J672J778K024K752L044K119N39o40j112j142q09
$$ 230282 228263 226725 226217 227065 228737 230515 232539 235291 238335 240454 240993 240353 239241 238099 237290
53893B37290q9P28J251J451J683K388L615M519L782J165j665k623j391O13K109
$$ 237290 237201 237929 239180 240631 242314 244702 248317 252836 256618 257783 256118 253495 252104 252717 254826
53878B54826K948L462L915M592N550O294O446O476O951P458P359P153P691Q208
$$ 254826 257774 261236 265151 269743 275293 281587 288033 294509 301460 308918 316277 323430 331121 339329
53864C39329O955L956J422Q91J527J968K365L451M690M747L364J699J008J594
$$ 339329 346284 350240 351662 352553 354080 356048 358413 361864 366554 371301 374665 376364 377372 378966
53850C78966K819L742L938L940M630O139P745Q729Q787P709N629L468K280J964
$$ 378966 381785 385527 389465 393405 398035 404174 411919 420648 429435 437144 442773 446241 448521 450485
53836D50485J558Q21L60J43p78k582m032m187l629l347l469l874m930o694q232
$$ 450485 452043 452864 453224 453367 452589 450007 445975 441788 438159 434812 431343 427469 422539 415845 407613
53821D07613q810q976r579j0326j0340r512q469p675p350p668q249q110o924n683
$$ 407613 398803 389827 380248 369922 359582 350070 341601 333926 326576 318908 310659 302549 295625 289942
53807B89942n329n486n419n327n549n453m527l778m369n521n592m862n061o266
$$ 289942 284613 279127 273708 268381 262832 257379 252852 249074 244705 239184 233592 228730 223669 217403
53793B17403o515m945l140k500k255j303k60k01p28q68q17j151j289n50N3r48
$$ 217403 210888 205943 202803 200303 198048 196745 196485 196284 195556 194688 193871 192720 191431 190881 190934 189986
53777A89986k777l162j773p70j450k388j973r21q55j686k115j841j551j212p3
$$ 189986 187209 184047 182274 181504 180054 177666 175693 174772 173917 172231 170116 168275 166724 165512 165439
53762A65439J705K893K945K650K734K874K568J986J475R80N01M44J027J877K623
$$ 165439 167144 170037 172982 175632 178366 181240 183808 185794 187269 188249 188750 189194 190221 192098 194721
53747A94721L302L854L819L142K535K480K427J779J154J802L849N993O973O817
$$ 194721 198023 201877 205696 208838 211373 213853 216280 218059 219213 221015 224864 230857 237830 244647
53733B44647O480O651P097P064O238N202M666M462L941L210L092L590L589K674
$$ 244647 251127 257778 264875 271939 278177 283379 288045 292507 296448 299658 302750 306340 309929 312603
53719C12603K122L015M319M186K537Q06m90k179m336n528m868l521l262m328n605
$$ 312603 314725 317740 322059 326245 328782 329588 329098 326919 322583 317055 312187 308666 305404 301076 295471
53704B95471o264o272n658m192k061k22K62o54j763j817r56m61q21p98Q25L086
$$ 295471 289207 282935 277277 273085 271024 270802 271064 270410 268647 266830 265874 265413 264592 263794 264619 267705
53688B67705L603J590j040j895o56J069J790J404P17K56k13j084k061k348j851
$$ 267705 271308 272898 271858 269963 269307 270376 272166 273570 274287 274543 274330 273246 271185 268837 266986
53673B66986j510k044k956l413l435l403l084k338k113l254m710m662l282k567
$$ 266986 265476 263432 260476 257063 253628 250225 247141 244803 242690 239436 234726 230064 226782 224215
53659B24215l153l344j864K02J239J315J417J877K566L453L963L072J176N42K406
$$ 224215 221062 217718 215854 216056 217295 218610 220027 221904 224470 227923 231886 234958 236134 236676 239082
53644B39082M915N583M640M158M687M927M231L415L131L278L965N385O687O645
$$ 239082 243997 249580 254220 258378 263065 267992 272223 275638 278769 282047 286012 291397 298084 304729
53630C04729N491M530M024L206K365K731M012M243K916K087L214M752M412K206
$$ 304729 310220 314750 318774 321980 324345 327076 331088 335331 338247 340334 343548 348300 352712 354918
53616C54918j85j745k198j156Q77J798K70j916j987j82P50j74r44j08R46M00j190
$$ 354918 354733 352988 350790 349634 350511 352309 352579 350663 348676 348494 349244 349070 348126 348018 348964 349364 348174
53599C48174k058j896j774k151k464k248j535l84R18J536Q75m07j126j164j428
$$ 348174 346116 344220 342446 340295 337831 335583 334048 333664 334582 336118 336993 336586 335460 334296 332868
53584C32868k265k927k779k105j279J0K013L848M095K558Q16N47J557K014R04
$$ 332868 330603 327676 324897 322792 321513 321523 323536 327384 331479 334037 334853 335400 336957 338971 339875
53569C39875m63OK412M640M938L687K214J060L13N87K209L963M204L142K710M049
$$ 339875 339412 339418 341830 346470 351408 355095 357309 358369 358682 359269 361478 365441 369645 372787 375497 379546
53553C79546O333Q143Q738P819N649L791M177O608Q472P914N980M642M103L526
$$ 379546 385879 394022 402760 410579 416228 420019 424196 430804 439276 447190 453170 457812 461915 465441
53539D65441L204M097N808O909P032O982O971O446N642N580O247O476N956N752
$$ 465441 468645 472742 478550 485459 492491 499473 506444 512890 518532 524112 530359 536835 542791 548543
53525E48543O222O042M278J990P16N38P50J279K092K145O10j320j534J49J730
$$ 548543 554765 560807 565085 567075 567791 568329 569079 570358 572450 574595 575205 573885 572351 572500 574230
53510E74230J769R98P59J075J082O32M25Q88J640K158K397K635K975L256L368
$$ 574230 575999 576997 577756 578831 579913 580545 580970 581858 583498 585656 588053 590688 593663 596919 600287
53495F00287L419L505L467L134K807L125M185N116M920L735K840L276M735N969
$$ 600287 603706 607211 610678 613812 616619 619744 623929 629045 633965 637700 640540 643816 648551 654520
53481F54520O164N708N677O759Q606J0168J0582R874Q823Q126P864P864Q395R941
$$ 654520 660684 666392 672069 678828 687434 697602 708184 718058 726881 735007 742871 750735 759130 769071
53467G69071J2142J3556J3135J1659J0963J1798J3245J4395J5629J7634J9876
$$ 769071 781213 794769 807904 819563 830526 842324 855569 869964 885593 903227 923103
53456I23103K1009K0652J9994K0456K2187K4045K5026K5656K7541L1139L4398
$$ 923103 944112 964764 984758 1005214 1027401 1051446 1076472 1102128 1129669 1160808 1195206
53445A195206L4814L2868L1866L3814L7053L9056L9919M1209M2715M2831M1644
$$ 1195206 1230020 1262888 1294754 1328568 1365621 1404677 1444596 1485805 1528520 1571351 1612995
53434A612995M1164M2347M4101M5411M6317M6422M4838M2400M1576M2960M4043
$$ 1612995 1654159 1696506 1740607 1786018 1832335 1878757 1923595 1965995 2007571 2050531 2094574
53423B094574M2932M1208M1247M2565M3151M2964M3515M4808M5269M4417M3290
$$ 2094574 2137506 2178714 2219961 2262526 2305677 2348641 2392156 2436964 2482233 2526650 2569940
53412B569940M2241M0502L8124L6261L5169L3691L1258K8645K6203K3108J9177
$$ 2569940 2612181 2652683 2690807 2727068 2762237 2795928 2827186 2855831 2882034 2905142 2924319
53401B924319J5833J4085J2760J0026N821J619j647m336p154j0497j4548j9191
$$ 2924319 2940152 2954237 2966997 2977023 2982844 2984463 2982816 2978480 2971326 2960829 2946281 2927090
53389B927090k3615k6634k7659k7386k7452k9155l2134l4524l4917l4041l3858
$$ 2927090 2903475 2876841 2849182 2821796 2794344 2765189 2733055 2698531 2663614 2629573 2595715
53378B595715l5102l6602l7132l6854l6486l5991l4916l3470l2346l1598l0236
$$ 2595715 2560613 2524011 2486879 2450025 2413539 2377548 2342632 2309162 2276816 2245218 2214982
53367B214982k7077k1948j6328j2607j2029j3126j2909r856n272j477N45J400
$$ 2214982 2187905 2165957 2149629 2137022 2124993 2111867 2098958 2089102 2083830 2082353 2082898 2084298
53355B084298K181L781O539R752J2132J3394J4875J7830K1804K5555K8857L2312
$$ 2084298 2086479 2090260 2096799 2106551 2118683 2132077 2146952 2164782 2186586 2212141 2240998 2273310
53343B273310L5772L8390M0053M1518M3091M4427M5846M8515N2737N7195O0558
$$ 2273310 2309082 2347472 2387525 2429043 2472134 2516561 2562407 2610922 2663659 2720854 2781412
53332B781412O3009O5458O8029P0217P1973P3708P5588P7586Q0010Q3136Q6434
$$ 2781412 2844421 2909879 2977908 3048125 3120098 3193806 3269394 3346980 3426990 3510126 3596560
53321C596560Q8913R0172R0467Q9854Q8085Q5555Q3363Q2057Q0866P8768P5829
$$ 3596560 3685473 3775645 3866112 3955966 4044051 4129606 4212969 4295026 4375892 4454660 4530489
53310D530489P2805O9662O5301N8918N1156M3467L6562K9881K2639J5041Q011
$$ 4530489 4603294 4672956 4738257 4797175 4848331 4891798 4928360 4958241 4980880 4995921 5003932
53299E003932J768m825j2913k1993l0279l6811m2495m8545n4580n9167o2070o4894
$$ 5003932 5005700 5000875 4987962 4965969 4935690 4898879 4856384 4807839 4753259 4694092 4632022 4567128
53287D567128o9071p3974p7730p9573q0563q1814q2889q2518q0577p8499p7494
$$ 4567128 4498057 4424083 4346353 4266780 4186217 4104403 4021514 3938996 3858419 3779920 3702426
53276C702426p7060p5801p3442p1182o9944o9078o7344o4627o1921n9757n7487
$$ 3702426 3625366 3549565 3476123 3404941 3334997 3265919 3198575 3133948 3072027 3012270 2954783
53265B954783n4385n0753m7448m4687m1927l8846l5876l3515l1542k9360k7055
$$ 2954783 2900398 2849645 2802197 2757510 2715583 2676737 2640861 2607346 2575804 2546444 2519389
53254B519389k5556k5482k6138k6073k4545k1941j8958j6052j3811j2907j3085
$$ 2519389 2493833 2468351 2442213 2416140 2391595 2369654 2350696 2334644 2320833 2307926 2294841
53243B294841j2819j0857p666m623k203M6K131L514M357N571P297Q693R696J1670
$$ 2294841 2282022 2271165 2263499 2258876 2256673 2256719 2258850 2262364 2266721 2272292 2279589 2288282 2297978 2309648
53229B309648J5434J9814K3330K6263K9736L3444L6020L7253L8296L9587M0232
$$ 2309648 2325082 2344896 2368226 2394489 2424225 2457669 2493689 2530942 2569238 2608825 2649057
53218B649057L9823L9430L9941M0536L9698L7113L3739L0527K7723K5034K1863
$$ 2649057 2688880 2728310 2768251 2808787 2848485 2885598 2919337 2949864 2977587 3002621 3024484
53207C024484J7761J3101Q893N472K000k238o603j0107j3109j6812k1184k4567
$$ 3024484 3042245 3055346 3064239 3069711 3071711 3069473 3062870 3052763 3039654 3022842 3001658 2977091
53195B977091k5717k5427k5732k8075l2512l7914m2408m4378m3925m3191m4405
$$ 2977091 2951374 2925947 2900215 2872140 2839628 2801714 2759306 2714928 2671003 2627812 2583407
53184B583407m7533n0288n0503m8058m4531m1619m0204m0384m1644m2983m3309
$$ 2583407 2535874 2485586 2435083 2387025 2342494 2300875 2260671 2220287 2178643 2135660 2092351
53173B092351m2024l9304l5936l2996l1477l1645l2639l3007l1939k9784k7279
$$ 2092351 2050327 2011023 1975087 1942091 1910614 1878969 1846330 1813323 1781384 1751600 1724321
53162A724321k4649k1862j9313j7540j6374j5178j3990j3543j3794j3466j1781
$$ 1724321 1699672 1677810 1658497 1640957 1624583 1609405 1595415 1581872 1568078 1554612 1542831
53151A542831r880r439j0444j1587j2469j3878j5883j7296j7602j7807j8503j8545
$$ 1542831 1532951 1523512 1513068 1501481 1489012 1475134 1459251 1441955 1424353 1406546 1388043 1369498
53139A369498j6917j4700j3606j3450j2806j1601j1112j1663j2318j2866j4218
$$ 1369498 1352581 1337881 1324275 1310825 1298019 1286418 1275306 1263643 1251325 1238459 1224241
53128A224241j6340j7790j8013j8292j9441k0250j9586j8484j8579j9452j9448
$$ 1224241 1207901 1190111 1172098 1153806 1134365 1114115 1094529 1076045 1057466 1038014 1018566
53117A018566j8382j7672j8077j8798j8931j8468j7870j7507j7603j7894j7618
$$ 1018566 1000184 982512 964435 945637 926706 908238 890368 872861 855258 837364 819746
53106H19746j6516j5434j5110j4986j4271j3434j3386j3682j3085j1612j0554
$$ 819746 803230 787796 772686 757700 743429 729995 716609 702927 689842 678230 667676
53095F67676j0664j1601j2801j3547j2749j0437q858r994j2340j2670j0793r737
$$ 667676 657012 645411 632610 619063 606314 595877 587019 577025 564685 552015 541222 531485
53083E31485j0768j1494j0063q170q007q770q553p530o833n941l930j956j801
$$ 531485 520717 509223 499160 490990 482983 474213 465660 458130 451297 445356 441426 439470 437669
53070D37669k827l052k530k921m165m455l617l638n252o508n794m078k947k202
$$ 437669 434842 431790 429260 426339 422174 417719 414102 410464 405212 398704 392910 388832 385885 383683
53056C83683r05M36L04j643m025n162m558l168k446k878l552l553l308l648l985
$$ 383683 382778 383214 383518 381875 377850 372688 368130 364962 362516 359638 356086 352533 349225 345577 341592
53041C41592k986j013k66j935m541n916n602m455k962j168M09R67N47O7K49R37
$$ 341592 338606 337593 337327 335392 330851 324935 319333 314878 311916 310748 311157 312124 312671 312738 312987 313924
53025C13924J426J201L92l79o50m33K23J548L312M339L804K755L045M746N961
$$ 313924 315350 316551 316943 316564 315914 315481 315704 317252 320564 324903 328707 331462 334507 339253 345214
53010C45214N567M526L794K520l23l563m848l732k282k465m105n678o211n863
$$ 345214 350781 355307 359101 361621 361298 357735 352887 349155 346873 344408 340303 334625 328414 322551
52996C22551n214m543l779k872k124k089l031m452n303m807l182j631j349k373
$$ 322551 317337 312794 309015 306143 304019 301930 298899 294447 289144 284337 281155 279524 278175 275802
52982B75802l538l808l352k984k866k452j622j120j700l268n023n999n520l612
$$ 275802 272264 268456 265104 262120 259254 256802 255180 254060 252360 249092 244069 238070 232550 228938
52968B28938j168P30J674J882J519N84p14k063l385m405m245k376J41J524J404
$$ 228938 227770 228500 230174 232056 233575 234159 233445 231382 227997 223592 219347 216971 217112 218636 220040
52953B20040R77R46O11n66j844k366k397k486k340j483l58K48L45N22Q69R33N02
$$ 220040 221017 221963 222574 222008 220164 217798 215401 212915 210575 209092 208734 208982 209327 209849 210718 211651 212153
52936B12153j73p72j087j021p11k75O37K398M287M716L058N48j151j591j293p91
$$ 212153 211980 211208 210121 209100 208389 208114 208751 211149 215436 220152 223210 223758 222607 221016 219723 218932
52920B18932n42q26j032L2K187L280J796q29j922r93J32J73k48k13J78M49O10
$$ 218932 218390 217564 216532 216564 218751 222031 223827 222998 221076 220083 220215 220388 220140 219927 220105 220554 221164
52903B21164Q37J047J153J121Q22L02J37P15J428J311M09l08j56R00K634M297
$$ 221164 222001 223048 224201 225322 226144 226446 226583 227298 228726 230037 230446 230138 229982 230882 233516 237813
52887B37813M459K564L85K84K031L061K194J205J989L959N374N719N418M411K620
$$ 237813 242272 244836 245221 245505 247536 250597 252791 253996 255985 259944 265318 271037 276455 280866 283486
52872B83486J088J115K558M111M933N002M415L474L137M101N626O279N645M366
$$ 283486 284574 285689 288247 292358 297291 302293 306708 310182 313319 317420 323046 329325 334970 339336
52858C39336K878J276J59J80Q03Q04M0o15j115k331m010m504l340k296k635k955
$$ 339336 342214 343490 343649 343829 344632 345436 345476 344861 343746 341415 337405 332901 329561 327265 324630 321675
52842C21675j445R23J607J99j239j408j212j676k367k602k617k550j747j37Q53
$$ 321675 320230 321153 322760 322959 321720 320312 319100 317424 315057 312455 309838 307288 305541 305404 306257
52827C06257R9j310j354J98J643J699Q04M9j45L5K84L16%m05m74j44L34Q18J244
$$ 306257 306356 305046 303692 303890 305533 307232 308036 308085 307940 307975 308259 308575 308575 308170 307696 307552 307886 308704 309948
52808C09948J277O08m60j101p90K55J235J259J04j195j059O89K285K165R65K81
$$ 309948 311225 311833 311373 310272 309482 309737 310972 312231 312335 311140 310081 310770 313055 315220 316185 316466
52792C16466J90l95j265q39J195K968K941J843J231J531K479M098N919O352M491
$$ 316466 316656 316261 314996 314157 315352 318320 321261 323104 324335 325866 328345 332443 338362 344714 349205
52777C49205J908J053K151L062K151Kj706j907o38J171K194J745M70n91j330k164
$$ 349205 351113 352166 354317 357379 359530 359532 357826 355919 355281 356452 358646 360391 360861 360270 358940 356776
52761C56776k696k078p05p4n43o51M98J520P11j158j639m9J518J084n79j098L83
$$ 356776 354080 352002 351297 351223 350680 350029 350527 352047 352758 351600 349961 349912 351430 352514 351935 350837 351220
52744C51220K363L082K447J536R75M01p28k421m222n564n984n336l982k683k195
$$ 351220 353583 356665 359112 360648 361623 362024 361296 358875 354653 349089 343105 337769 333787 331104 328909
52729C28909k925m612o156o240m664k860k432l368m359m709m887n167m903l761
$$ 328909 325984 321372 315216 308976 304312 301452 299020 295652 291293 286584 281697 276530 271627 267866
52715B67866k674k709l554l945l255k006j140j345k729m474n163m120k258r69
$$ 267866 265192 262483 258929 254984 251729 249723 248583 247238 244509 240035 234872 230752 228494 227525
52701B27525m58N9P82Q83j76j695k537k433k067k080k399k498k153j711j739k484
$$ 227525 227067 227126 227908 228791 228615 226920 224383 221950 219883 217803 215404 212906 210753 209042 207303 204819
52685B04819l740m940n262m114k012n80q43j812j743o99n27k072l851m180l349
$$ 204819 201079 196139 190877 186763 184751 184171 183328 181516 179773 179074 178547 176475 172624 168444 165095
52670A65095k630k311j911j539j619j810j477q91p76j017j029j017j532k059j504
$$ 165095 162465 160154 158243 156704 155085 153275 151798 150907 150131 149114 148085 147068 145536 143477 141973
52655A41973j67L53n34j549j463o91k87l97m67k68O8N59J246J775J498P9k048
$$ 141973 141806 142159 141625 140076 138613 137922 137635 137238 136771 136503 136571 137130 138376 140151 141649 141728 139680
52638A39680l640l440j514M60R22J49m73n46p90j254q68P61K366K633J894J407
$$ 139680 136040 132600 131086 131546 132468 132617 132144 131598 130808 129554 128686 129447 131813 134446 136340 137747
52622A37747J647K098K160J567L77p24n39J336L577M256K954J166M90R20J200
$$ 137747 139394 141492 143652 145219 145596 144872 144333 145669 149246 153502 156456 157622 158112 159032 160232
52607A60232N63k85r6J344K995L962M417M772M677L685K444K131K657K678J555
$$ 160232 160795 160510 160414 161758 164753 168715 173132 177904 182581 186266 188710 190841 193498 196176 197731
52592A97731L31J67P64J043P87P40J312J900J540j06k376m131m722m481m123l832
$$ 197731 198062 198229 198993 200036 200823 201563 202875 204775 206315 206209 203833 199702 194980 190499 186376 182544
52576A82544l334k683k394k736l433m102m414l940k582j253j163k137k524j338
$$ 182544 179210 176527 174133 171397 167964 163862 159448 155508 152926 151673 150510 148373 145849 144511
52562A44511K98N37q63k411k789k112j336j023r34n85L7M78N38O41J114J439R16
$$ 144511 144809 145346 144483 142072 139283 137171 135835 134812 133878 133293 133330 133808 134346 134987 136101 137540 138456
52545A38456p2l39M05J013N31m38n89L56J476J964J958K027K309K392K014J612
$$ 138456 138384 138045 138450 139463 139994 139556 138967 139323 140799 142763 144721 146748 149057 151449 153463 155075
52529A55075J748J962R53j507l514k937k10J991J924N48j35N47J794K662K811
$$ 155075 156823 158785 159738 158231 154717 151780 151570 153561 155485 156033 155898 156445 158239 160901 163712
52514A63712K400J813J225L70p46j098M51L309N224M731K609O24l60n48m40n56
$$ 163712 166112 167925 169150 169520 168774 167676 168127 171436 176660 181391 184000 184624 184264 183716 183276 182720
52498A82720j113j490o61J242K703K572J285j26j269j980j754m87R75J819K080
$$ 182720 181607 180117 179456 180698 183401 185973 187258 187132 185863 183883 182129 181642 182617 184436 186516
52483A86516J894R12o96j663j047N29J925K890L570L675L302L516M784N758N029
$$ 186516 188410 189322 188626 186963 185916 186445 188370 191260 194830 198505 201807 205323 210107 215865 220894
52468B20894L205J911J492J296J279J566J206n87k474k412o83O09P63Q59J107
$$ 220894 224099 226010 227502 228798 230077 231643 232849 232262 229788 227376 226693 227302 228065 228924 230031
52453B30031M69p41n94J178K181R74o28l92J146K127K231K130J472k69j821j302
$$ 230031 230500 229759 229165 230343 232524 233498 232870 232478 233624 235751 237982 240112 241584 241315 239494 238192
52437B38192Q88K392K031R45M62M69L24N0NK22N31P39N47j80r96j333j307j405
$$ 238192 239080 241472 243503 244448 244910 245379 245703 245753 245758 245980 246511 247250 247797 247617 246621 245288 243981 242576
52419B42576j394n27J081K174J839O45o5M35J790K953K889J469p5j83J233K601
$$ 242576 241182 240655 241736 243910 245749 246394 246329 246764 248554 251507 254396 255865 255790 255607 256840 259441
52403B59441K683K044J865K017J360k60j512j368m02K68N52J115J939K184J425
$$ 259441 262124 264168 266033 268050 269410 269150 267638 266270 265868 266136 266688 267803 269742 271926 273351
52388B73351L06k84m1Q70K056K696J894r6j593j280R4P56M35N94J961L136K495
$$ 273351 273657 273373 273332 274202 276258 278954 280848 280752 279159 277879 277973 278729 279164 279758 281719 284855 287350
52371B87350N83n42P6J377J979J727J240P77K52p6L20J369K127J594k31k197k921
$$ 287350 287933 287391 287467 288844 290823 292550 293790 294567 294819 294743 295063 296432 298559 300153 299922 297725 294804
52354B94804j974k59Q81Q93K92k61p13j202j324n63O51J104L79m23j4J430K534
$$ 294804 292830 292571 293452 294345 294637 294376 293663 292461 291137 290574 291225 292329 292708 292285 292271 293701 296235
52337B96235K363J284M22P35K335M168M611L157J268P84J662K289J983J825K761
$$ 296235 298598 299882 300304 301039 303374 307542 312153 315310 316578 317362 319024 321313 323296 325121 327882
52322C27882M116M818M941N146N307M758L464K008Q84L98P68J481J344J18n96
$$ 327882 331998 336816 341757 346903 352210 356968 360432 362440 363324 363722 364490 365971 367315 367433 366837
52307C66837N71K445K660J005l66p2R46J475J761K236K121P40q22q51P90K878
$$ 366837 367408 369853 372513 373518 373152 373080 374026 375501 377262 379498 381619 382359 381537 380686 381476 384354
52291C84354M661O199P115O638N031L630L007K254Q57J98J988N598Q323Q471P087
$$ 384354 389015 395214 402329 408967 413998 417628 420635 422889 423746 423944 425932 431530 439853 448324 455411
52276D55411O158O111O080N869O203P049P260O386N594N846O265N591M437M514
$$ 455411 461569 467680 473760 479629 485832 492881 500141 506527 512121 517967 524232 529823 534260 538774
52262E38774N959P161P370P799R495J1570J2502J2235J2079J3027J4929J6828
$$ 538774 544733 551894 559264 567063 576558 588128 600630 612865 624944 637971 652900 669728
52250F69728J7597J6924J6103J7127K0285K3523K4843K4520K4084K4083K4182
$$ 669728 687325 704249 720352 737479 757764 781287 806130 830650 854734 878817 902999
52239I02999K4693K6385K8923L1014L2117L2749L3067L2590L1569L1195L1904
$$ 902999 927692 954077 983000 1014014 1046131 1078880 1111947 1144537 1176106 1207301 1239205
52228A239205L2709L2812L2707L2901L2685L1206K8975K7156K5908K4462K2415
$$ 1239205 1271914 1304726 1337433 1370334 1403019 1434225 1463200 1490356 1516264 1540726 1563141
52217A563141J9966J7301J4734J3049J2552J2030R903O372L232J540P00L0k33
$$ 1563141 1583107 1600408 1615142 1628191 1640743 1652773 1662676 1669048 1672280 1673820 1674520 1674550 1674317
52204A674317j33p89k770m647m557k771j390j510j988j365J8O95L70O18K925O582
$$ 1674317 1674184 1673395 1670625 1665978 1661421 1658650 1657260 1655750 1653762 1652397 1652415 1653110 1653480 1654098 1657023 1663605
52188A663605R254R740R538J0978J4355J7868K0183K1703K2868K2898K1242J9226
$$ 1663605 1672859 1682599 1692137 1703115 1717470 1735338 1755521 1777224 1800092 1822990 1844232 1863458
52176A863458J8716J9690K0549K0402J9666J8510J6384J3288J0190P719N604L656
$$ 1863458 1882174 1901864 1922413 1942815 1962481 1980991 1997375 2010663 2020853 2028572 2034176 2037832
52164B037832K117O53j756n349r067j1987j4211j5860j6587j6856j8353k1842
$$ 2037832 2039949 2040602 2038846 2033497 2024430 2012443 1998232 1982372 1965785 1948929 1930576 1908734
52152A908734k5692k7776k7907k7236k6291k5110k4492k5190k6236k5813k3689
$$ 1908734 1883042 1855266 1827359 1800123 1773832 1748722 1724230 1699040 1672804 1646991 1623302
52141A623302k1252j9283j7408j5755j5253j5799j5742j4065j1768j0301r753
$$ 1623302 1602050 1582767 1565359 1549604 1534351 1518552 1502810 1488745 1476977 1466676 1456923
52130A456923r400r031q806q604q399q555q939q437o288l348j224n45q53j727
$$ 1456923 1447523 1438492 1429686 1421082 1412683 1404128 1395189 1386752 1380464 1377116 1375892 1375347 1374494 1372767
52116A372767l011m179m576m285m100m476n084n421n349m955m460m282m736n500
$$ 1372767 1369756 1365577 1361001 1356716 1352616 1348140 1343056 1337635 1332286 1327331 1322871 1318589 1313853 1308353
52102A308353n835n465m886m668m766m769m537m369m568n039n249m698l530k678
$$ 1308353 1302518 1297053 1292167 1287499 1282733 1277964 1273427 1269058 1264490 1259451 1254202 1249504 1245974 1243296
52088A243296l072m568n843n652m129k661k422l271m095l983k942j612o42k47
$$ 1243296 1240224 1235656 1229813 1224161 1220032 1217371 1214949 1211678 1207583 1203600 1200658 1199046 1198404 1198157
52074A198157k08k56m71j073j682j278N46K554K971J684M30N34J363J694J726
$$ 1198157 1197949 1197693 1197222 1196149 1194467 1193189 1193735 1196289 1199260 1200944 1201374 1201908 1203271 1204965 1206691
52059A206691K688M788O758P517P450P707Q891J0742J2784J4760J6637J8338J9699
$$ 1206691 1209379 1214167 1220925 1228442 1235892 1243599 1252490 1263232 1276016 1290776 1307413 1325751 1345450
52046A345450K0793K2234K4730K8064L0926L2237L2396L2754L4017L5673L6916
$$ 1345450 1366243 1388477 1413207 1441271 1472197 1504434 1536830 1569584 1603601 1639274 1676190
52035A676190L7624L8254L9098L9803L9612L8158L5930L3785L2005L0231K8276
$$ 1676190 1713814 1752068 1791166 1830969 1870581 1908739 1944669 1978454 2010459 2040690 2068966
52024B068966K6339K4306K1628J8187J4581J1193P784M390J639l67k508n150p322
$$ 2068966 2095305 2119611 2141239 2159426 2174007 2185200 2192984 2197374 2199013 2198646 2196138 2190988 2183666
52011B183666q347r266j1401j4383j6946j8856k0526k1538k1245k0178j9115j7355
$$ 2183666 2175319 2166053 2154652 2140269 2123323 2104467 2083941 2062403 2041158 2020980 2001865 1984510
51999A984510j4004j0468r188r949r873p489m447k469r37J421M431P295R838J1748
$$ 1984510 1970506 1960038 1950850 1940901 1931028 1923539 1919092 1916623 1915686 1917107 1921538 1928833 1938671 1950419
51985A950419J2168J1253J0738J1742J3375J4581J5844J7571J8249J6126J1934
$$ 1950419 1962587 1973840 1984578 1996320 2009695 2024276 2040120 2057691 2075940 2092066 2104000
51974B104000Q259O611O394O245N320L592J751L74j235m416q861j2370j3752j4505
$$ 2104000 2112259 2118870 2125264 2131509 2136829 2140421 2142172 2142546 2141311 2136895 2128034 2115664 2101912 2087407
51960B087407j6410j8983k0952k2776k5629k8877l0757l1110l1471l2783l4767
$$ 2087407 2070997 2052014 2031062 2008286 1982657 1953780 1923023 1891913 1860442 1827659 1792892
51949A792892l7144l9625m1011m0135l7836l6328l6570l7586l8215l8008l6645
$$ 1792892 1755748 1716123 1675112 1634977 1597141 1560813 1524243 1486657 1448442 1410434 1373789
51938A373789l4237l2210l2109l3362l3818l2682l1286l0707l0454k9989k9801
$$ 1373789 1339552 1307342 1275233 1241871 1208053 1175371 1144085 1113378 1082924 1052935 1023134
51927A023134l0122l0063k8973k7473k6301k5143k3494k1888k1262k1564k1652
$$ 1023134 993012 962949 933976 906503 880202 855059 831565 809677 788415 766851 745199
51916G45199k0509j8253j6203j5709j6543j6811j5238j2990j2140j2786j3154
$$ 745199 724690 706437 690234 674525 657982 641171 625933 612943 600803 588017 574863
51905E74863j2265j0877r776q825q029p835p991p639o925o878p388p084n847n293
$$ 574863 562598 551721 541945 533120 525091 517256 509265 501626 494701 487823 480435 473351 467504 462211
51891D62211n901n877m235k881l605m899m190j924p62j427k049j540j079j743
$$ 462211 456310 450433 446198 443317 439712 434813 430623 428699 427937 426510 424461 422921 421842 420099
51877D20099k830l332l447l725l914l595l001k504k044j644j782k579l326l324
$$ 420099 417269 413937 410490 406765 402851 399256 396255 393751 391707 390063 388281 385702 382376 379052
51863C79052k800k455k617l304m580o235p395p153n593l840k995l221l800l853
$$ 379052 376252 373797 371180 367876 363296 357061 349666 342513 336920 333080 330085 326864 323064 319211
51849C19211l092k039j535j918k632k776k008r48n78j233k209k517k038j691k242
$$ 319211 316119 314080 312545 310627 307995 305219 303211 302263 301685 300452 298243 295726 293688 291997 289755
51834B89755l197l225j705M15J460O07j437l125l355k189n79N47R43R53R20Q23
$$ 289755 286558 283333 281628 282043 283503 284110 282673 279548 276193 274004 273425 273972 274915 275868 276788 277611
51818B77611N14O5k37l28m32n93m19L73J319J636J342J446K698M455N156L757
$$ 277611 278125 278190 277953 277625 277193 276600 276181 276554 277873 279509 280851 282297 284995 289450 294606 298363
51802B98363O62k464l731k431K27K108K239J517J224J524J885K196K539K568K108
$$ 298363 299025 296561 292830 290399 290626 292734 294973 296490 297714 299238 301123 303319 305858 308426 310534
51787C10534J974L011M609N385N156M886M712L533J064j238k041j770j483j160
$$ 310534 312508 315519 320128 325513 330669 335555 340267 343800 344864 343626 341585 339815 338332 337172
51773C37172l16N23K06j333k846l242k665k054k154k861l259k535j048n6q4j84
$$ 337172 336856 337379 337585 336252 333406 330164 327499 325445 323291 320430 317171 314636 313588 313532 313448 313264
51757C13264O58J963K386J489J62n32k16Q89K109K540J758M22m11n14n59r94j514
$$ 313264 313922 315885 318271 319760 319922 319390 319174 320063 322172 324712 326470 326892 326481 325967 325408 324414 322900
51740C22900j768j965k472l159l496l192k549k127k104k013j381m86q2j92R7J272
$$ 322900 321132 319167 316695 313536 310040 306848 304299 302172 300068 298055 296674 296188 296106 295914 296011 297283
51724B97283K396K251J027O1JK01kl69m70n39r26j180n02R79K117K118J516J382
$$ 297283 299679 301930 302957 303018 303019 303220 303218 302849 302379 301840 300914 299734 299232 300211 302328 304446 305962 307344
51706C07344J902K212J595L04r39j657j527k12J975L625L455K058J462K682M569
$$ 307344 309246 311458 313053 313357 312418 310761 309234 309022 310997 314622 318077 320135 321597 324279 328848
51691C28848N560N602N543N433M602L124K136K554M195O163P515P717P101O954
$$ 328848 334408 340010 345553 350986 355588 358712 360848 363402 367597 373760 381275 388992 396093 403047
51677D03047Q307J0606J2206J2378J2034J2273J2986J3368J2959J1582Q982N447
$$ 403047 411354 421960 434166 446544 458578 470851 483837 497205 510164 521746 530728 536175
51665E36175K385J198J530J511m5k418m262n262n950o532o715o487o099n380l944
$$ 536175 538560 539758 541288 542799 542754 540336 536074 530812 524862 518330 511615 505128 499029 493649 489705
51650D89705k264j595k331l200k854j610p15l48M05J728K468J808M59l74m09J3
$$ 489705 487441 485846 483515 480315 477461 475851 475136 474788 475193 476921 479389 481197 481656 481282 480873 480886
51634D80886Q84K206L207K942J733J171K374M780O829P483O922O096N892O518
$$ 480886 481770 483976 487183 490125 491858 493029 495403 500183 507012 514495 521417 527513 533405 539923
51620E39923P517Q236Q307P682O434M702K757R36l45m95Q61L169M957N169M258
$$ 539923 547440 555676 563983 571665 578099 582801 585558 586494 586149 585654 586515 589684 594641 599810 604068
51605F04068L442L027K236Q10k32M5R39Q55o60k468l524m083m824n625o085o729
$$ 604068 607510 610537 612773 613583 613351 613396 614335 615190 614530 612062 608538 604455 599631 594006 587921 581192
51589E81192q398j0435j0776q613n959n507p467r553r860q577o942n725n122n118
$$ 581192 572794 562359 551583 542970 537011 531504 524037 514484 504624 496047 489105 483380 478258 473140
51575D73140n315n106m618m756n761o443n669m149l637m559n397m709k912j609
$$ 473140 467825 462719 458101 453345 447584 441141 435472 431323 427686 423127 417730 413021 410109 408500
51561D08500j663k424k796k576k480k989l581l437k674k267k730l338l005j536
$$ 408500 406837 404413 401617 399041 396561 393572 389991 386554 383880 381613 378883 375545 372540 371004
51547C71004L26J713K210J961J594J768K373K494J498l3q96n21O90J942K482J930
$$ 371004 371330 373043 375253 377214 378808 380576 382949 385443 386941 386908 386012 385491 386181 388123 390605 392535
51531C92535P98M80J929M334N913O073N961O665P689P933P488P645R085J0873
$$ 392535 393333 393813 395742 400076 405989 412062 418023 424688 432377 440310 447798 455443 464528 475401
51517D75401J1509J0486Q429O039L435O37j905l649m662n541o549p230o979n829
$$ 475401 486910 497396 505825 511864 515299 515936 514031 510382 505720 500179 493630 486400 479421 473592
51503D73592m532l893m033m229l617k226j061p99p14M48K601M166M042K955K390
$$ 473592 469060 465167 461134 456905 453288 451062 450001 449202 448488 448936 451537 455703 459745 462700 465090
51488D65090K802L544M039M297M419M383M291M363M593M699M430L636K175J15
$$ 465090 467892 471436 475475 479772 484191 488574 492865 497228 501821 506520 510950 514586 516761 516876
51474E16876k030l581m266m313m035l583k995k249j309l01L28J61o56j278p56
$$ 516876 514846 511265 506999 502686 498651 495068 492073 489824 488515 488214 488542 488703 488047 486769 486013
51459D86013J037L088M161M224M573N972P227O503L934J759J531K384K533J465
$$ 486013 487050 490138 494299 498523 503096 509068 516295 522798 526732 528491 530022 532406 534939 536404
51445E36404k46k304m646o573p185o618n940n828o126o567p055p263o753n744
$$ 536404 536158 533854 529208 522635 515450 508832 502892 497064 490938 484371 477316 470053 463300 457556
51431D57556m989m741m489l939l555l729l922l202j422N18J694K156K736L864
$$ 457556 452567 447826 443337 439398 435843 432114 428192 424990 423568 424086 425780 427936 430672 434536
51417D34536M842M718L702L089L591M451M667M411M591N441O392P078P695Q389
$$ 434536 439378 444096 447798 450887 454478 458929 463596 468007 472598 478039 484431 491509 499204 507593
51403E07593Q999R395R599R542R244R155R759J0745J1076J0085Q225O565N674
$$ 507593 516592 525987 535586 545128 554372 563527 573286 584031 595107 605192 613417 619982 625656
51390F25656N044L624J143j304k433k435k633l381l460k034r2R38J040R18N05
$$ 625656 630700 634324 635467 634163 631730 629295 626662 623281 619821 617787 617695 618633 619673 620591 621096
51375F21096m81j150k98J732L543M753N951O793O006L659J561Q37N20o73k550
$$ 621096 620615 619465 619167 620899 624442 629195 635146 641939 647945 651604 653165 654002 654522 653849 651299
51360F51299m219n457o416p013p458q466j0051j1035j0529r132p813o537m961
$$ 651299 647080 641623 635207 628194 620736 612270 602219 591184 580655 571523 563710 557173 552212
51347E52212l576l003k787k199j705k310l650m059k608p9K103L026K415P73m39
$$ 552212 548636 545633 542846 540647 538942 536632 532982 528923 526315 526236 528339 531365 533780 534553 534114
51332E34114K54K721N180O116N558M277K659R51k35n28n06r83j903k791m013o333
$$ 534114 534368 537089 542269 548385 553943 558220 560879 561830 561595 561067 560561 559578 557675 554884 550871 544538
51316E44538r165j0506r467p792p889r972j2239j3425j3723j3339j1863r600q055
$$ 544538 535373 524867 515400 507608 499719 489747 477508 464083 450360 437021 425158 415558 407503
51303D07503q118q753q524p554o912o797o575o123n843n666n160m442l884l265
$$ 407503 399385 390632 382108 374554 367642 360845 354270 348147 342304 336638 331478 327036 323152 319887
51289C19887k342j946l006m652m895l382j827j366j202m58K79K93R5J90k12j796
$$ 319887 317545 315599 312593 307941 303046 299664 297837 296471 295269 294811 295090 295383 295478 295668 295456 293660
51273B93660l437l518k400j864k381k484j016J365L238L904L446K311J350J475
$$ 293660 290223 286705 284305 282441 280060 277576 276560 277925 281163 285067 288513 290824 292174 293649
51259B93649K623L592L514L076L608N264O775P030O185N082M248L924M481N993
$$ 293649 296272 299864 303378 306454 310062 315326 322101 329131 335316 340398 344646 348570 353051 359044
51245C59044P514P731O547N344N279N896N833M329J575j817n005p030p593p470
$$ 359044 366558 374289 380836 386180 391459 397355 403188 407517 409092 407275 402270 395240 387647 380177
51231C80177p583p943q090q059q095p915p151o181n604n192m493m021m541n438
$$ 380177 372594 364651 356561 348502 340407 332492 325341 319160 313556 308364 303871 299850 295309 289871
51217B89871n268l940k826k548k239j394r00j540k733l552l932m095l816l052
$$ 289871 284603 280663 277837 275289 273050 271656 270756 269216 266483 262931 258999 254904 251088 248036
51203B48036k515k817l608m043l517j745R51L216L567K120M58m42r22j210q04
$$ 248036 245521 242704 239096 235053 231536 229791 230742 233958 237525 239645 240103 239661 238739 237529 236725
51188B36725J91P55O48R02J809K099J133J32K7r8r39j101O59K769K717P12p72
$$ 236725 236916 237671 238319 239221 241030 243129 244262 244394 244421 244323 243384 242283 242942 245711 248428 249140 248368
51171B48368n06M94J076J064L93r93k300k468j584n35M16J471K280K508K840L773
$$ 248368 247862 248356 249432 250496 250889 249896 247596 245128 243544 243009 243425 244896 247176 249684 252524 256297
51155B56297M034K136r21k543k037j162j103j053r8J332K444K948K540J180M3
$$ 256297 260331 262467 261546 259003 256966 255804 254701 253648 253550 254882 257326 260274 262814 263994 264037
51140B64037N91K302L017J805k09k007l549m151k566L42J504j85j822n28K307
$$ 264037 264628 266930 269947 271752 271543 269536 265987 261836 259270 259612 261116 260931 259109 258581 260888
51125B60888L221J671J92J24l6j716l852m320k561RJ550J281j16j199j170n86
$$ 260888 264109 265780 265972 266096 266060 264344 260492 256172 253611 253620 255170 256451 256335 255136 253966 253380
51109B53380n62j425k458k702j703K42K118K766J923O53L09J101J923J568Pj501
$$ 253380 252818 251393 248935 246233 244530 244772 246890 249656 251579 252232 252541 253642 255565 257133 257140 255639
51093B55639j649n91J0j203l595n224m954l323j498l19k55j148j809j022O75J207
$$ 255639 253990 253399 253409 252206 248611 243387 238433 235110 233612 233293 233038 231890 230081 229059 229734 230941
51077B30941l92k512k887j250O97J413Q52j9k65K66Q78Q62M10L33Q36J298J310
$$ 230941 230549 228037 225150 223900 224597 226010 226862 226843 226578 226844 227722 228584 228994 229327 230163 231461 232771
51060B32771J222J451K109L411N425P103O823M427J749L38k06r14j680j918j953
$$ 232771 233993 235444 237553 240964 246389 253492 260315 264742 266491 266829 266623 265709 264029 262111 260158
51045B60158k331k443j313N23J249jk078l076k085J94K059K285J403J087J941
$$ 260158 257827 255384 254071 254594 255843 255842 253764 250688 248603 248797 250856 253141 254544 255631 257572
51030B57572K668J981M32n50n93k34M35J633K826L120K498J657R38M27N60J348
$$ 257572 260240 262221 262653 262103 261510 261276 261711 263344 266170 269290 271788 273445 274383 274810 275370 276718
51014B76718J561J75j636j739q0J295J360J265J888K296J708J151J753K639K180
$$ 276718 278279 278454 276818 275079 274999 276294 277654 278919 280807 283103 284811 285962 287715 290354 292534
50999B92534N46o18o19l13l93m91k57k06r06j987k505k017r86k25m3Q1R90K858
$$ 292534 293080 292462 291843 291530 291137 290646 290389 290183 289277 287290 284785 282768 281782 281557 281514 281595 282585 285443
50981B85443M755N471M701L274K229J892J956K103K304K557K688K661K771L224
$$ 285443 290198 295669 300370 303644 305873 307765 309721 311824 314128 316685 319373 322034 324805 328029
50967C28029L571L155K048J006L91j84p80n74Q78K451K558J182j42k65N56J502
$$ 328029 331600 334755 336803 337809 338200 338016 337236 336662 337540 339991 342549 343731 343589 343324 343880 345382
50951C45382K052J977J514J687L410N917P218O619N686N924O675O466N645O071
$$ 345382 347434 349411 350925 352612 356022 361939 369157 375776 381462 387386 394061 400527 406172 412243
50937D12243Q383J1086J2598J2994J3123J3074J2531J2076J2850J4660J5539J4060
$$ 412243 420626 431712 444310 457304 470427 483501 496032 508108 520958 535618 551157 565217
50925E65217J1686J1602J5033J9795K3139K4977K7048K9672L1224L1048L0905
$$ 565217 576903 588505 603538 623333 646472 671449 698497 728169 759393 790441 821346
50914H21346L2573L5470L8084M0661M4850N1078N7893O3868O8869P3296P7287
$$ 821346 853919 889389 927473 968134 1012984 1064062 1121955 1185823 1254692 1327988 1405275
50903A405275Q1053Q5070Q9506R4094R8803J03837J08838J12761J14809J14858
$$ 1405275 1486328 1571398 1660904 1754998 1853801 1957638 2066476 2179237 2294046 2408904
50893B408904J12903J08888J03201R6350Q7988P7305O4789N2274M0673K8796J5502
$$ 2408904 2521807 2630695 2733896 2830246 2918234 2995539 3060328 3112602 3153275 3182071 3197573
50882C197573J837j0147j9951k8561l6477m3241m8630n2802n5307n5450n3707
$$ 3197573 3199410 3189263 3169312 3140751 3104274 3061033 3012403 2959601 2904294 2848844 2795137
50871B795137n1534m9614m7582m5728m5409m7212m9977n2439n4746n7440o0086
$$ 2795137 2743603 2693989 2646407 2600679 2555270 2508058 2458081 2405642 2350896 2293456 2233370
50860B233370o2137o4319o7808p2279p5918p7372p6772p4938p2340o9060o5165
$$ 2233370 2171233 2106914 2039106 1966827 1890909 1813537 1736765 1661827 1589487 1520427 1455262
50849A455262o0930n6922n3618n0695m7029m1954l6328l1744k8819k6725k4356
$$ 1455262 1394332 1337410 1283792 1233097 1186068 1144114 1107786 1076042 1047223 1020498 996142
50838I96142k1413j8310j5437j2709r812o947m921m087l276q68K928N928O719
$$ 996142 974729 956419 940982 928273 918461 911514 906593 902506 899230 898362 901290 907218 913937
50825I13937O411O746P608P815P594Q484J0913J3519J5075J5725J6090J6474J7364
$$ 913937 920348 927094 934702 942517 950111 958595 969508 983027 998102 1013827 1029917 1046391 1063755
50812A063755J9468K2592K5464K7246K8513L0201L2421L4789L7250L9944M2902
$$ 1063755 1083223 1105815 1131279 1158525 1187038 1217239 1249660 1284449 1321699 1361643 1404545
50801A404545M6363N0800N6137O1478O6205P0918P6743Q4096R2538J01564J11065
$$ 1404545 1450908 1501708 1557845 1619323 1685528 1756446 1833189 1917285 2009823 2111387 2222452
50790B222452J21224J32232J43950J55731J66981J77978J89706K02639K15976
$$ 2222452 2343676 2475908 2619858 2775589 2942570 3120548 3310254 3512893 3728869
50781C728869K28120K37569K43524K46273K46972K46283K43136K35405K21796
$$ 3728869 3956989 4194558 4438082 4684355 4931327 5177610 5420746 5656151 5877947
50772E877947K02441J77920J48970J17120Q4179N0636J5925j9064n1198p7816
$$ 5877947 6080388 6258308 6407278 6524398 6608577 6659213 6675138 6656074 6604876 6527060
50762F527060r9106j16500j29713j36939j37619j33530j27100j19639j11349j02425
$$ 6527060 6427954 6311454 6181741 6044802 5907183 5773653 5646553 5526914 5415565 5313140
50752E313140r4002q8288q7362r1344r8166j05620j13221j21570j30720j40069
$$ 5313140 5219138 5130850 5043488 4952144 4853978 4748358 4635137 4513567 4382847 4242778
50742D242778j49318j58279j65891j70492j71320j69099j65000j59549j52571
$$ 4242778 4093460 3935181 3769290 3598798 3427478 3258379 3093379 2933830 2781259
50733B781259j43792j33432j22412j11866j02271r3305q4582p6008o7406n8565
$$ 2781259 2637467 2504035 2381623 2269757 2167486 2074181 1989599 1913591 1846185 1787620
50723A787620m9980m2625l6500l0313k3294j6568j1921r928r933j1059j2313j2587
$$ 1787620 1737640 1695015 1658515 1628202 1604908 1588340 1576419 1566491 1556558 1545499 1533186 1520599
50711A520599j1650j0569j0234j0188r760r419r768j0087r421q328q003q189p688
$$ 1520599 1508949 1498380 1488146 1477958 1468198 1458779 1449011 1438924 1429503 1421175 1413172 1404983 1397295
50698A397295o457n527n030m097k537p79J797O405J2391J7177J9361K0319K2139
$$ 1397295 1390838 1385311 1380281 1376184 1373647 1372868 1374665 1381070 1393461 1410638 1429999 1450318 1472457
50685A472457K5428K9814L4988M0384M5154M9404N4420O0831O7545P3334P8519
$$ 1472457 1497885 1527699 1562687 1603071 1648225 1697629 1752049 1812880 1880425 1953759 2032278
50674B032278Q4270R1055R8586J06504J14431J22051J29666J37876J46165J52708
$$ 2032278 2116548 2207603 2306189 2412693 2527124 2649175 2778841 2916717 3062882 3215590
50664C215590J56166J56881J55713J52601J47046J39066J28877J16309J01399
$$ 3215590 3371756 3528637 3684350 3836951 3983997 4123063 4251940 4368249 4469648
50655D469648Q4834O7083M7694K6169L039k0584m3799o5579q4330r8651j08174
$$ 4469648 4554482 4621565 4669259 4695428 4698467 4677883 4634084 4568505 4484175 4385524 4277350
50644D277350j13225j14201j11745j06821j00106r1928q3113p4904o7655o0822
$$ 4277350 4164125 4049924 3938179 3831358 3731252 3639324 3556211 3481307 3413652 3352830
50634C352830n4879n1884n3015n6896o1648o7414p5121q3798r1110r6187r9910
$$ 3352830 3297951 3246067 3193052 3136156 3074508 3007094 2931973 2848175 2757065 2660878 2560968
50623B560968j02423j02289r8558r2172q4799p7379p0264o3701n7517n1047m3873
$$ 2560968 2458545 2356256 2257698 2165526 2080727 2003348 1933084 1869383 1811866 1760819 1716946
50612A716946l6273k8750k1647j5249r611m205J651P875J3714J8714K2921K6153
$$ 1716946 1680673 1651923 1630276 1615027 1605416 1601211 1602862 1610737 1624451 1643165 1666086 1692239
50600A692239K7911K8233K7983K7928K8106K8318K8708K9499L0575L1618L2445
$$ 1692239 1720150 1748383 1776366 1804294 1832400 1860718 1889426 1918925 1949500 1981118 2013563
50589B013563L3046L3581L4422L6046L8721M2334M6478N0597N4353N7954O1976
$$ 2013563 2046609 2080190 2114612 2150658 2189379 2231713 2278191 2328788 2383141 2441095 2503071
50578B503071O6680P1758P6832Q1665Q5842Q8979R1456R4060R6425R7018R5369
$$ 2503071 2569751 2641509 2718341 2800006 2885848 2974827 3066283 3160343 3256768 3353786 3449155
50567C449155R3018R0857Q6876P8584O7042N6166M7976M0778L2498K3521J5162
$$ 3449155 3542173 3633030 3719906 3798490 3865532 3921698 3969674 4010452 4042950 4066471 4081633
50556D081633P340m85p262j1093j1479r381n452K42O785J2108J4696J4790J3500
$$ 4081633 4088973 4088488 4081226 4070133 4058654 4049273 4043821 4044063 4050848 4062956 4077652 4092442 4105942
50543D105942J1294P752K433m563j2861k2365l3329m5779n8974p1568q2498r1680
$$ 4105942 4117236 4124988 4127421 4122858 4109997 4087632 4054303 4008524 3949550 3877982 3795484 3703804
50531C703804r9896j07948j15691j21698j24281j23179j20012j16588j13050j08340
$$ 3703804 3603908 3495960 3380269 3258571 3134290 3011111 2891099 2774511 2661461 2553121
50521B553121j02115r5234q8413q1517p4608o8542o3784n9362n3839m6979l9759
$$ 2553121 2451006 2355772 2267359 2185842 2111234 2042692 1978908 1919546 1865707 1818728 1778969
50510A778969l3030k6938k1352j6192j1359o864k973K26L271O880J1063J5228
$$ 1778969 1745939 1719001 1697649 1681457 1670098 1663234 1660261 1660487 1663758 1670638 1681701 1696929
50498A696929J9154K3329K8146L3138L7320M0133M1835M3043M4222M5643M7584
$$ 1696929 1716083 1739412 1767558 1800696 1838016 1878149 1919984 1963027 2007249 2052892 2100476
50487B100476N0219N3238N5986N8137N9968O1668O2757O2710O1901O1294O1258
$$ 2100476 2150695 2203933 2259919 2318056 2378024 2439692 2502449 2565159 2627060 2688354 2749612
50476B749612O1497O2091O3721O6581P0035P3829P8750Q5405R3080J00761J08625
$$ 2749612 2811109 2873200 2936921 3003502 3073537 3147366 3226116 3311521 3404601 3505362 3613987
50465C613987J17501J27169J36469J44951J53307J61919J69989J76475J80876
$$ 3613987 3731488 3858657 3995126 4140077 4293384 4455303 4625292 4801767 4982643
50456D982643J82744J81405J76944J70600J63200J53592J39694J20889R8427P3538
$$ 4982643 5165387 5346792 5523736 5694336 5857536 6011128 6150822 6271711 6370138 6443676
50446F443676M6465J7698j0967l7527o1272q2369j00489j14913j25781j33894
$$ 6443676 6490141 6507839 6496872 6459345 6398073 6315704 6215215 6100302 5974521 5840627
50436E840627j39062j39659j34372j23678j09166r2174p3647n4579l5692j7297
$$ 5840627 5701565 5561906 5427534 5303856 5194690 5102516 5028869 4974290 4938598 4921301
50426D921301l09J3203K1597K5364K5793K2180J1864o365l0268n6168q1790j06380
$$ 4921301 4920992 4934195 4955792 4981156 5006949 5029129 5040993 5034628 5004360 4948192 4866402 4760022
50414D760022j29194j49097j65089j76264j81728j81617j77713j72040j65115
$$ 4760022 4630828 4481731 4316642 4140378 3958650 3777033 3599320 3427280 3262165
50405C262165j56528j46693j36748j26888j16364j05308r5065q6214p7623o8356
$$ 3262165 3105637 2958944 2822196 2695308 2578944 2473636 2378571 2292357 2214734 2146378
50395B146378n9282n1628m4853l7434k9281k1863j6078j1354p105l575o17L136
$$ 2146378 2087096 2035468 1990615 1953181 1923900 1902037 1885959 1874605 1867500 1863925 1863308 1866444
50383A866444Q771J5519K1723K6847L1286L4584L5441L3964L2635L4062L8321
$$ 1866444 1875215 1890734 1912457 1939304 1970590 2005174 2040615 2074579 2107214 2141276 2179597
50372B179597M3206M6551M7627M6822M5062M3500M2847M2716M2151M0780L8987
$$ 2179597 2222803 2269354 2316981 2363803 2408865 2452365 2495212 2537928 2580079 2620859 2659846
50361B659846L7056L4979L3208L2572L2957L2884L1106K8284K6446K7078L0172
$$ 2659846 2696902 2731881 2765089 2797661 2830618 2863502 2894608 2922892 2949338 2976416 3006588
50350C006588L4741L9588M3734M6968N0039N3898N8430O2201O3737O2987O1433
$$ 3006588 3041329 3080917 3124651 3171619 3221658 3275556 3333986 3396187 3459924 3522911 3584344
50339C584344O0623O0488N9170N4734M6986L7386K7374J7318O933m091j6118k9485
$$ 3584344 3644967 3705455 3764625 3819359 3866345 3903731 3931105 3948423 3955356 3951265 3935147 3905662
50327C905662m3861n8279p2076q5086r6534j04759j08865j09836j08979j06063
$$ 3905662 3861801 3803522 3731446 3646360 3549826 3445067 3336202 3226366 3117387 3011324
50317C011324j00134r1567q1787p1286n9490m6597l4020k2659j2135k183O375
$$ 3011324 2911190 2819623 2737836 2666550 2607060 2560463 2526443 2503784 2491649 2489466 2495841
50306B495841J2449J5394J4593R705J848o788j5361k5092l6749m8701n8610o5842
$$ 2495841 2508290 2523684 2538277 2547982 2549830 2543042 2527681 2502589 2465840 2417139 2358529 2292687
50294B292687p0812p3119p2164o9047o5878o3315o0280n6078n1226m6182m0842
$$ 2292687 2221875 2148756 2076592 2007545 1941667 1878352 1818072 1761994 1710768 1664586 1623744
50283A623744l5660l1804k9581k7781k5198k1893j8584j5702j3465j2005j0936
$$ 1623744 1588084 1556280 1526699 1498918 1473720 1451827 1433243 1417541 1404076 1392071 1381135
50272A381135r504p565n594l609j018K126M913P060R357J2077J4332J5890J8097
$$ 1381135 1371631 1364066 1358472 1354863 1353845 1355971 1360884 1367944 1377301 1389378 1403710 1419600 1437697
50259A437697K1623K4576K4803K3217K2823K4703K7014K7963K7715K7034K5904
$$ 1437697 1459320 1483896 1508699 1531916 1554739 1579442 1606456 1634419 1662134 1689168 1715072
50248A715072K4458K3644K3915K4244K3542K2035K0357J8291J5576J3054J1559
$$ 1715072 1739530 1763174 1787089 1811333 1834875 1856910 1877267 1895558 1911134 1924188 1935747
50237A935747J0283P846M687K678K126R50k427o742r722j1204j2979j5832j8410
$$ 1935747 1946030 1953876 1958563 1961241 1963367 1964317 1961890 1955148 1945426 1934222 1921243 1905411 1887001
50224A887001j9439j9817k1428k4530k7415k8744k9182l0109l1375l1316k9154
$$ 1887001 1867562 1847745 1826317 1801787 1774372 1745628 1716446 1686337 1654962 1623646 1594492
50213A594492k6468k5600k6865k8117k7207k4336k1583k0475k0609k0552j9515
$$ 1594492 1568024 1542424 1515559 1487442 1460235 1435899 1414316 1393841 1373232 1352680 1333165
50202A333165j7745j5650j3151j0135p275n830o279p387p312n777m519n016o305
$$ 1333165 1315420 1299770 1286619 1276484 1269209 1263379 1257100 1249713 1242401 1236624 1232105 1227089 1220784
50189A220784o121m000k007j906k970l528l647m699o762q174p926o961o547o598
$$ 1220784 1214663 1210663 1208656 1206750 1203780 1200252 1196605 1191906 1185144 1176970 1169044 1162083 1155536 1148938
50175A148938o503o534p322q453q759p702n771l690j923p10J4N12O55o6j335j605
$$ 1148938 1142435 1135901 1128579 1120126 1111367 1103665 1097894 1094204 1092281 1091571 1091585 1092097 1092752 1092686 1091351 1089746
50159A089746K2K063K219N29n38N99K704L669L126K170J451O73m25j647k797l784
$$ 1089746 1089768 1091831 1094050 1094579 1094041 1094640 1097344 1101013 1104139 1106309 1107760 1108433 1108008 1106361 1103564 1099780
50143A099780m327m177l663l563m294n544o743p710q666r764j0707j0975j0447
$$ 1099780 1095453 1091276 1087613 1084050 1079756 1074212 1067469 1059759 1051093 1041329 1030622 1019647 1009200
50130A009200r536q532p120n000k736j386j272j695j968k095k331k680l032l275
$$ 1009200 999664 991132 984012 979012 976276 974890 973618 971923 969955 967860 965529 962849 959817 956542
50116I56542l128k444j824k233l725n116n299m372l336l135m164n889o799n700
$$ 956542 953414 950970 949146 946913 943188 938072 932773 928401 925065 921930 917766 911877 905078 899378
50102H99378l439k361l528n520o704p510r257j1696j3220j3121j2151j1049r838
$$ 899378 895939 893578 890050 884530 877826 870316 861059 849363 836143 823022 810871 799822 789984
50089G89984q683q104q129q101p623o907o002m627k940j769j623k011j947q37
$$ 789984 781301 773197 765068 756967 749344 742437 736435 731808 728868 727099 725476 723465 721518 720681
50075G20681J064K702K870J539L05P60K540L923M107L866L990M344M808N817P417
$$ 720681 721745 724447 727317 728856 729161 729921 732461 736384 740491 744357 748347 752691 757499 763316 770733
50060G70733Q859R881J1289J3428J5010J4683J3133J2349J2996J3896J4129J4389
$$ 770733 779592 789473 800762 814190 829200 843883 857016 869365 882361 896257 910386 924775
50048I24775J5628J7326J8046J7478J6857J7091J7256J5763J2681R896Q708Q293
$$ 924775 940403 957729 975775 993253 1010110 1027201 1044457 1060220 1072901 1082797 1091505 1099798
50036A099798P316O141O145P229P612O310M417L308K816K130J555K120L771N127
$$ 1099798 1107114 1113255 1119400 1126629 1134241 1140551 1144968 1148276 1151092 1153222 1154777 1156897 1160668 1165795
50022A165795N164M292L677L943M817N711O443P433R137J1386J3508J5176J6728
$$ 1165795 1170959 1175251 1178928 1182871 1187688 1193399 1199842 1207275 1216412 1227798 1241306 1256482 1273210
50009A273210J8616K0940K3620K6426K8560K8964K7581K5835K5070K4998K4409
$$ 1273210 1291826 1312766 1336386 1362812 1391372 1420336 1447917 1473752 1498822 1523820 1548229
49998A548229K3146K2277K2283K2054K0364J7678J5575J4540J3199J0201O248
$$ 1548229 1571375 1593652 1615935 1637989 1658353 1676031 1691606 1706146 1719345 1729546 1735794
49987A735794L317J950M69k606o302q532r152j0177j2874j6153j8357j9437k0286
$$ 1735794 1739111 1741061 1741530 1738924 1732622 1724090 1714938 1704761 1691887 1675734 1657377 1637940 1617654
49974A617654k0991k0898j9994j9026j8440j8028j7484j6560j4897j2518j0438
$$ 1617654 1596663 1575765 1555771 1536745 1518305 1500277 1482793 1466233 1451336 1438818 1428380
49963A428380r702r873r332p344m996l676l336k885j824p67l94m60j29R70K337
$$ 1428380 1418678 1408805 1399473 1392129 1387133 1383457 1380121 1377236 1375412 1374645 1374251 1373791 1373662 1374632 1376969
49948A376969L278L679L912M189M315M056L442K753K491L163M724O469Q074J0451
$$ 1376969 1380247 1383926 1387838 1392027 1396342 1400398 1403840 1406593 1409084 1412247 1416971 1423440 1431514 1441965
49934A441965J4563J9468K2820K3771K4013K5246K6763K6607K4099K0001J5014
$$ 1441965 1456528 1475996 1498816 1522587 1546600 1571846 1598609 1625216 1649315 1669316 1684330
49923A684330R524M335K36k911n462o865o611n851o285p509p371n383m019n861
$$ 1684330 1693854 1698189 1698425 1695514 1690052 1683187 1676576 1670725 1664440 1656931 1649560 1644177 1640158 1634297
49909A634297j0916j7514k4453l1205l7157m1879m5605m8476m9833m9095m6827
$$ 1634297 1623381 1605867 1581414 1550209 1513052 1471173 1425568 1377092 1327259 1278164 1231337
49898A231337m4181m1651l9002l5963l2512k8948k6055k4564k3982k2759k0141
$$ 1231337 1187156 1145505 1106503 1070540 1038028 1009080 983025 958461 934479 911720 891579
49887H91579j7091j4737j2984j1479j0807j1424j2255j1850j0468r510r228q552
$$ 891579 874488 859751 846767 835288 824481 813057 800802 788952 778484 768974 759746 751194
$$ [...]
##END NTUPLES=NMR SPECTRUM
##END=
