
##TITLE=AC1111_Colombia_5835338_vh2UkRcLu9
##JCAMPDX= 6.0         $$ Bruker NMR JCAMP-DX V2.0
##DATA TYPE= NMR SPECTRUM
##DATA CLASS= NTUPLES
##ORIGIN= BRUKER
##OWNER= Administrator
$$ 1.72 TOPSPIN		Version 2.1
$$ 2012-04-10 11:08:21.046 -0500  Administrator@TOPSPIN
$$ Compression mode = diff/dup
##.OBSERVE FREQUENCY= 400.13188235
##.OBSERVE NUCLEUS= ^1H
##.ACQUISITION MODE= SIMULTANEOUS (DQD)
##.ACQUISITION SCHEME= undefined
##.AVERAGES= 64
##.DIGITISER RES= 22
##SPECTROMETER/DATA SYSTEM= spect
##.PULSE SEQUENCE= noesygpps1d.comp
##.SOLVENT NAME= COFFEE_meoh
##.SHIFT REFERENCE= INTERNAL, COFFEE_meoh, 1, 14.96831
##AUDIT TRAIL= $$ (NUMBER, WHEN, WHO, WHERE, PROCESS, VERSION, WHAT)
$$ ##TITLE= Audit trail, TOPSPIN		Version 2.1
$$ ##JCAMPDX= 5.01
$$ ##ORIGIN= Bruker BioSpin GmbH
$$ ##OWNER= Administrator
$$ $$ C:\Bruker\TOPSPIN/data/COFFEE/nmr/AC1111_Colombia_5835338_vh2UkRcLu9/22/pdata/1/auditp.txt
$$ ##AUDIT TRAIL=  $$ (NUMBER, WHEN, WHO, WHERE, PROCESS, VERSION, WHAT)
(   1,<2012-03-28 02:16:47.671 -0500>,<Administrator>,<TOPSPIN>,<go>,<TOPSPIN 2.1>,
      <created by zg
	started at 2012-03-28 02:05:15.250 -0500,
	POWCHK enabled, PULCHK disabled,
       configuration hash MD5:
       1A 1E CE 29 27 FD 77 03 67 4E F0 E3 C4 B2 CB 90
       data hash MD5: 64K
       04 05 F0 21 A8 41 14 CB E4 95 45 0E FD A6 FC 0A>)
(   2,<2012-03-28 02:16:52.265 -0500>,<Administrator>,<TOPSPIN>,<proc1d>,<TOPSPIN 2.1>,
      <Start of raw data processing
       efp LB = 0.3 FT_mod = 6 PKNL = 1 PHC0 = 0 PHC1 = 0 SI = 128K 
       data hash MD5: 128K
       33 60 D1 61 40 11 B5 35 88 D2 24 F2 29 8D 56 54>)
(   3,<2012-03-28 02:16:53.937 -0500>,<Administrator>,<TOPSPIN>,<proc1d>,<TOPSPIN 2.1>,
      <pk PHC0 = 33.11829 PHC1 = 0 
       data hash MD5: 128K
       F3 99 01 4F EC C0 F2 F7 4B 59 95 7D 90 1A C8 90>)
(   4,<2012-03-28 02:16:54.640 -0500>,<Administrator>,<TOPSPIN>,<proc1d>,<TOPSPIN 2.1>,
      <abs ABSG = 1 
       data hash MD5: 128K
       E0 95 E9 9F 5B 48 10 08 02 5D 9E C3 CB 0D B0 8E>)
(   5,<2012-03-28 02:16:54.875 -0500>,<Administrator>,<TOPSPIN>,<proc1d>,<TOPSPIN 2.1>,
      <abs ABSG = 2 
       data hash MD5: 128K
       DD 0B 5F 17 2A C4 73 E6 0C 32 C4 2A EE 41 D7 3F>)
(   6,<2012-03-28 02:16:54.937 -0500>,<Administrator>,<TOPSPIN>,<proc1d>,<TOPSPIN 2.1>,
      <abs ABSG = 3 
       data hash MD5: 128K
       CA 39 B6 02 6B 08 D5 9E 15 22 0E FB 1D 8F 9A 24>)
(   7,<2012-03-28 02:16:55.000 -0500>,<Administrator>,<TOPSPIN>,<proc1d>,<TOPSPIN 2.1>,
      <abs ABSG = 4 
       data hash MD5: 128K
       91 3D 3D 45 E9 08 08 49 D0 84 58 F4 4C D9 74 BA>)
(   8,<2012-03-28 02:16:55.062 -0500>,<Administrator>,<TOPSPIN>,<proc1d>,<TOPSPIN 2.1>,
      <abs ABSG = 5 
       data hash MD5: 128K
       50 D6 6E 9D B9 6A 0E 83 5F 24 F8 59 78 7A 45 69>)
(   9,<2012-03-28 02:16:55.765 -0500>,<Administrator>,<TOPSPIN>,<audit>,<TOPSPIN 2.1>,
      <user comment:
       ICON-NMR User ID: COFFEE
       data hash MD5: 128K
$$ [...]
##$TP07= 0
##$TPNAME0= <>
##$TPNAME1= <>
##$TPNAME2= <>
##$TPNAME3= <>
##$TPNAME4= <>
##$TPNAME5= <>
##$TPNAME6= <>
##$TPNAME7= <>
##$TPOAL= (0..7)
0.5 0.5 0.5 0.5 0.5 0.5 0.5 0.5
##$TPOFFS= (0..7)
0 0 0 0 0 0 0 0
##$TUNHIN= 0
##$TUNHOUT= 0
##$TUNXOUT= 0
##$USERA1= <user>
##$USERA2= <user>
##$USERA3= <user>
##$USERA4= <user>
##$USERA5= <user>
##$V9= 5
##$VALIST= <valist>
##$VCLIST= <CCCCCCCCCCCCCCC>
##$VD= 0
##$VDLIST= <DDDDDDDDDDDDDDD>
##$VPLIST= <PPPPPPPPPPPPPPP>
##$VTLIST= <TTTTTTTTTTTTTTT>
##$WBST= 2048
##$WBSW= 25
##$XGAIN= (0..3)
0 0 0 0
##$XL= 0
##$YL= 0
##$YMAX_a= 13497710
##$YMIN_a= -5817973
##$ZGOPTNS= <>
##$ZL1= 120
##$ZL2= 120
##$ZL3= 120
##$ZL4= 120
##$ABSF1= 14.96831
##$ABSF2= -5.58422
##$ABSG= 5
##$ABSL= 3
##$ALPHA= 0
##$AQORDER= 0
##$ASSFAC= 0
##$ASSFACI= 0
##$ASSFACX= 0
##$ASSWID= 0
##$AUNMP= <proc_prof1d_extract.lims>
##$AXLEFT= 0
##$AXNAME= <>
##$AXNUC= <1H>
##$AXRIGHT= 0
##$AXTYPE= 0
##$AXUNIT= <>
##$AZFE= 0.1
##$AZFW= 0.1
##$BCFW= 0
##$BC_mod= 0
##$BYTORDP= 0
##$COROFFS= 0
##$CY= 15
##$DATMOD= 1
##$DC= 0
##$DFILT= <>
##$DTYPP= 0
##$F1P= 0
##$F2P= 0
##$FCOR= 0.5
##$FTSIZE= 131072
##$FT_mod= 6
##$GAMMA= 0
##$GB= 0
##$INTBC= 1
##$INTSCL= 1
##$ISEN= 128
##$LB= 0.3
##$LEV0= 0
##$LPBIN= 0
##$MAXI= 10000
##$MC2= 0
##$MEAN= 0
##$ME_mod= 0
##$MI= 0
##$NCOEF= 0
##$NC_proc= -3
##$NLEV= 6
##$NOISF1= 0
##$NOISF2= 0
##$NSP= 0
##$NTH_PI= 0
##$NZP= 0
##$OFFSET= 14.96831
##$PC= 1
##$PHC0= 33.11829
##$PHC1= 0
##$PH_mod= 1
##$PKNL= yes
##$PPARMOD= 0
##$PPDIAG= 0
##$PPIPTYP= 0
##$PPMPNUM= 2147483647
##$PPRESOL= 1
##$PSCAL= 4
##$PSIGN= 0
##$PYNMP= <proc.py>
##$REVERSE= no
##$SF= 400.130004923386
##$SI= 131072
##$SIGF1= 0
##$SIGF2= 0
##$SINO= 400
##$SIOLD= 131072
##$SPECTYP= <>
##$SREGLST= <1H.CDCl3>
##$SSB= 0
##$STSI= 131072
##$STSR= 0
##$SW_p= 8223.68421052632
##$SYMM= 0
##$S_DEV= 0
##$TDeff= 65536
##$TDoff= 0
##$TI= <>
##$TILT= no
##$TM1= 0
##$TM2= 0
##$TOPLEV= 0
##$USERP1= <user>
##$USERP2= <user>
##$USERP3= <user>
##$USERP4= <user>
##$USERP5= <user>
##$WDW= 1
##$XDIM= 131072
##$YMAX_p= 461135544
##$YMIN_p= -323871375
##$CURPLOT= <Network HP LaserJet P1505>
##$CURPRIN= <$Network HP LaserJet P1505>
##$DFORMAT= <normdp>
##$LAYOUT= <+/1D_H.xwp>
##$LFORMAT= <normlp>
##$PFORMAT= <normpl>
##$SURQMSG= 1
$$ End of Bruker specific parameters
$$ ---------------------------------
##NTUPLES= NMR SPECTRUM
##VAR_NAME=  FREQUENCY,     SPECTRUM/REAL,   SPECTRUM/IMAG
##SYMBOL=    X,             R,               I
##VAR_TYPE=  INDEPENDENT,   DEPENDENT,       DEPENDENT
##VAR_FORM=  AFFN,          ASDF,            ASDF
##VAR_DIM=   131072,        131072,          131072
##UNITS=     HZ,            ARBITRARY UNITS, ARBITRARY UNITS
##FACTOR=    0.0627417313425165, 1,          1
##FIRST=     8223.62146879498, -1420,        -97678
##LAST=      0,             986,             -98453
##MIN=       0,             -323871375,      0
##MAX=       8223.62146879498, 461135544,    0
$$ Real data points
##PAGE= N=1
##DATA TABLE= (X++(R..R)), XYDATA
$$ [...]
60697A503896J7889J7513J6173J3846J1679J0704J0829J1122J0679R223P285N897
60685A646735N663O085O098N259L982K647J200l34j560k203k483k820l549m861
60671A659859o526p710p916q011r332j1486j2338j0849q939r314j1998j4254j3842
60658A527344j1257q551o851n675m268k755j813j503j039J49J659K748L262L273
60644A494723K269k17l308n144m865l365j951j140r06j008p78K75J176K17k404
60629A473574m077l010p73k69k144m607o040o234n609m907n413p866j1161j3468
60615A397996j4688j6348j8967k1043k1206k0034j8994j8423j7480j5590j3234
60604A201989j1372j0322r258p070l993j831j807k725k340m05J069Q26K33J418
$$ plain form
60697 1503896 1521785 1539298 1555471 1569317 1580996 1591700 1602529 1613651 1624330 1633553 1640838 1646735
60685 1646735 1652398 1658483 1664581 1669840 1673822 1676469 1677669 1677335 1675775 1673572 1671089 1668269 1664720 1659859
60671 1659859 1653333 1645623 1637707 1629696 1620364 1608878 1596540 1585691 1576752 1567438 1555440 1541186 1527344
60658 1527344 1516087 1507536 1500685 1495010 1490742 1487987 1486174 1484671 1483632 1483781 1485440 1488188 1491450 1494723
60644 1494723 1496992 1496775 1493467 1488323 1483458 1480093 1478142 1477002 1476096 1475088 1474310 1474585 1475761 1475978 1473574
60629 1473574 1469497 1466487 1465714 1465445 1463301 1458694 1452654 1446420 1440811 1435904 1430491 1422625 1411464 1397996
60615 1397996 1383308 1366960 1347993 1326950 1305744 1285710 1266716 1248293 1230813 1215223 1201989
60604 1201989 1190617 1180295 1171037 1163967 1159974 1158143 1156336 1153611 1151271 1150866 1151935 1152761 1152994 1154412
60590A154412M458P308Q046O452L806J811J505K688M212M954M494L033J145l44
60576A207980o93J77J625K936L838M457N106O103P458Q722R424R697J0216J1588
60562A288634J3960J6970J9739K1254K1337K1067K1757K3656K6054K8220K9694
60551A532342L0142K9895L0130L1404L2259L0659K6752K2760J9802J6369J0814
60540A813328L934k261p398j2812j9046k4710k8199k9452k9499k8915k7498k5214
60528A582258k2731k0664j8841j6825j4917j3818j3238j1763q745n492l795l767
60516A427662m106m050l873l648k908j752j101j339j584q98N34J970L234M666
60502A412807O348P860Q694Q786Q917J0389J3639J7227J9017J8451J6885J5690
$$ plain form
60590 1154412 1158870 1166178 1174224 1180676 1184482 1186293 1187798 1190486 1194698 1199652 1204146 1207179 1208324 1207980
60576 1207980 1207287 1207464 1209089 1212025 1215863 1220320 1225426 1231529 1238987 1247709 1257133 1266830 1277046 1288634
60562 1288634 1302594 1319564 1339303 1360557 1381894 1402961 1424718 1448374 1474428 1502648 1532342
60551 1532342 1562484 1592379 1622509 1653913 1686172 1716831 1743583 1766343 1786145 1802514 1813328
60540 1813328 1817262 1815001 1807603 1794791 1775745 1751035 1722836 1693384 1663885 1634970 1607472 1582258
60528 1582258 1559527 1538863 1520022 1503197 1488280 1474462 1461224 1449461 1440716 1435224 1431429 1427662
60516 1427662 1423556 1419506 1415633 1411985 1409077 1407325 1406224 1404885 1403301 1402403 1402937 1404907 1408141 1412807
60502 1412807 1419155 1427015 1435709 1444495 1453412 1463801 1477440 1494667 1513684 1532135 1549020 1564710
60490A564710J5136J5387J7103K0193K3053K4232K4255K4786K6493K8714L0878
60479A814940L3127L5639L8245M0734M2768M3511M2027L8214L2778K6214J8365
60468B206562R157o51r714j6801k1203k2793k2035j9860j7217j4493j1317p167
60456B052468k311K206N803R238J3569J8378K1938K3340K3606K4370K6248K9133
60444B247986L3298L9236M6811N5540O5595P7533R0935J04241J16558J29091J44123
60433C150947J62525J82754K02419K20671K38678K57961K78729L00222L22161
60424E317067L45028L68571L90126M04352M04533L84752L41989K76797J92159
60415H425374R2307j6638j25506k23607l02869l60427l97360m16002m19159m10616
$$ plain form
60490 1564710 1579846 1595233 1612336 1632529 1655582 1679814 1704069 1728855 1755348 1784062 1814940
60479 1814940 1848067 1883706 1921951 1962685 2005453 2048964 2090991 2129205 2161983 2188197 2206562
60468 2206562 2215719 2215068 2205354 2188553 2167350 2144557 2122522 2102662 2085445 2070952 2059635 2052468
60456 2052468 2050157 2052363 2058166 2067404 2080973 2099351 2121289 2144629 2168235 2192605 2218853 2247986
60444 2247986 2281284 2320520 2367331 2422871 2488466 2565999 2656934 2761175 2877733 3006824 3150947
60433 3150947 3313472 3496226 3698645 3919316 4157994 4415955 4694684 4994906 5317067
60424 5317067 5662095 6030666 6420792 6825144 7229677 7614429 7956418 8233215 8425374
60415 8425374 8517681 8501043 8375537 8151930 7849061 7488634 7091274 6675272 6256113 5845497
60405E845497l94553l74100l51079l26855l02597k78718k55051k31805k09821
60396C120918j89754j71643j55473j41449j29373j18244j07051r5760q5155p5850
60386A851166o7815o0733n4431m8843m3935l9826l6759l4638l2777l0499k7987
60375A372923k6097k5085k3908k1288j7323j3653j1877j2000j2591j2319j1274
60364A185508j0588j0864j1351j1006r918q807p412m762j425J66j216l341l018
60351A101966r3K705L592L537M160N675P423Q771Q864P019M299L325N329Q388
60337A174960R803R372R019R802J0716J0362Q640O576N225M974N488O239P099
60324A278275Q166Q970Q507O445L686J393k2n38L2J485K761K824J766N07j72N8
$$ plain form
60405 5845497 5450944 5076844 4725765 4398910 4096313 3817595 3562544 3330739 3120918
60396 3120918 2931164 2759521 2604048 2462599 2333226 2214982 2107931 2012171 1927016 1851166
60386 1851166 1783351 1722618 1668187 1619344 1575409 1535583 1498824 1464186 1431409 1400910 1372923
60375 1372923 1346826 1321741 1297833 1276545 1259222 1245569 1233692 1221692 1209101 1196782 1185508
60364 1185508 1174920 1164056 1152705 1141699 1131781 1122974 1115562 1110800 1109375 1109541 1108325 1104984 1101966
60351 1101966 1101873 1104578 1108170 1111707 1115867 1121542 1128965 1137736 1146600 1153619 1157918 1161243 1166572 1174960
60337 1174960 1184763 1194135 1203154 1212956 1223672 1234034 1242674 1249250 1254475 1259449 1264937 1271176 1278275
60324 1278275 1286441 1295411 1303918 1310363 1314049 1315442 1315420 1314882 1314914 1316399 1319160 1321984 1323750 1324257 1324085 1324143
60308A324143J087K039J593m60k486k611p73J523L081L879M447N365P079R388
60294A357294J1164J1401J0438R654R926J0951J1831J1924J1355J1113J2172J4099
60282A493322J5067J3866J1420R522Q742Q266P254N425K776j90k327k786j918
60269A568439m93J282L158M172L863L468M216N025L739M34k542m024n386p808
60255A577543j0132j0618r454q266q034q502q941q683p458n812m676m176l609
60242A479182k821k482k647k320j240o87j445k156j137J073K506K502K059J845
60228A472232J507R37O80P87N62M0M46K476M928O001N468M855N588P651J0032
60213A524190J1904J3109J3774J3945J3668J3274J3237J3722J4428J4970J5224
$$ plain form
60308 1324143 1325230 1327269 1328862 1328402 1325916 1323305 1322532 1324055 1327136 1331015 1335462 1340827 1347906 1357294
60294 1357294 1368458 1379859 1390297 1399951 1409877 1420828 1432659 1444583 1455938 1467051 1479223 1493322
60282 1493322 1508389 1522255 1533675 1543197 1551939 1560205 1567459 1572884 1575660 1575470 1573143 1570357 1568439
60269 1568439 1567946 1569228 1572386 1576558 1580421 1583889 1588105 1593130 1596869 1597303 1594761 1590737 1585351 1577543
60255 1577543 1567411 1556793 1547339 1539073 1531039 1522537 1513596 1504913 1497455 1491643 1486967 1482791 1479182
60242 1479182 1476361 1473879 1471232 1468912 1467672 1466985 1465540 1463384 1462247 1463320 1465826 1468328 1470387 1472232
60228 1472232 1473739 1474676 1475356 1476143 1476705 1476745 1477191 1479667 1484595 1490596 1496064 1500919 1506507 1514158 1524190
60213 1524190 1536094 1549203 1562977 1576922 1590590 1603864 1617101 1630823 1645251 1660221 1675445
60202A675445J5332J5647J6716J8897K1784K4443K6485K8500L1086L4015L6981
60191A945331M0660M6033N2608N8458O2456O5837P0897P8509Q7550R6400J04327
60180B709066J11414J17997J24626J32088J40706J49608J57099J62044J64642
60171C969290J65726J65576J63631J59122J51724J41772J30120J17546J03916
60162E268423Q8147O9679M9874L1323J5536K055r914j9896k6862l0973l3535l5193
60150E368664l5085l1907k5185j5282k945J0732K4480L7664N0768O4548P8911
60139E525363R3023J06445J19463J32174J43612J52088J56271J55925J51828J44981
60129F881173J35659J23200J06965Q7469O6088M3845K1137j260k1938m0393n7888
$$ plain form
60202 1675445 1690777 1706424 1723140 1742037 1763821 1788264 1814749 1843249 1874335 1908350 1945331
60191 1945331 1985991 2032024 2084632 2143090 2205546 2271383 2342280 2420789 2508339 2604739 2709066
60180 2709066 2820480 2938477 3063103 3195191 3335897 3485505 3642604 3804648 3969290
60171 3969290 4135016 4300592 4464223 4623345 4775069 4916841 5046961 5164507 5268423
60162 5268423 5356570 5426249 5476123 5507446 5522982 5525037 5515123 5495227 5468365 5437392 5403857 5368664
60150 5368664 5333579 5301672 5276487 5261205 5258260 5268992 5293472 5331136 5381904 5446452 5525363
60139 5525363 5618386 5724831 5844294 5976468 6120080 6272168 6428439 6584364 6736192 6881173
60129 6881173 7016832 7140032 7246997 7334466 7400554 7444399 7465536 7464276 7442338 7401945 7344057
60118G344057p5544r1850j03435j08533j08522j05586j00057r0974p8432o4102
60108F417022m9522l4785j8991j363J8052L8102N6819P2533Q4893R4447J01232
60097F778439J04362J03170R8068Q9983P9560O7519N5224M3960L3760K3865J4560
60086G492470P546L996L189M054P430J5319K7997M3477O0328P9426J01842J26388
60074G973462J50999J75712K02351K31484K61688K91981L22922L54634L85571
60065A0350804M14358M41253M66463M88269N04378N14152N17842N14424N02082
60056A4714025M80503M50998M14324L70105L18451K60581J97475J29485N7728
60047A7393675j5461q8112j59266k27198k88253l38726l77304m04778m22086m29587
$$ plain form
60118 7344057 7268513 7176663 7073228 6964695 6856173 6750587 6650530 6559556 6481124 6417022
60108 6417022 6367500 6332715 6313724 6312361 6330413 6368515 6425334 6497867 6582760 6677207 6778439
60097 6778439 6882801 6985971 7084039 7174022 7253582 7321101 7376325 7420285 7454045 7477910 7492470
60086 7492470 7500016 7504012 7507201 7511255 7518685 7534004 7562001 7605478 7665806 7745232 7847074 7973462
60074 7973462 8124461 8300173 8502524 8734008 8995696 9287677 9610599 9965233 10350804
60065 10350804 10765162 11206415 11672878 12161147 12665525 13179677 13697519 14211943 14714025
60056 14714025 15194528 15645526 16059850 16429955 16748406 17008987 17206462 17335947 17393675
60047 17393675 17378214 17290102 17130836 16903638 16615385 16276659 15899355 15494577 15072491 14642904
60037A4642904m27660m16855l97700l71221l39394l04173k66337k26195j85130
60028A1708239j45235j07387p0889l5549l098K4088M4921N9456O7491O8468O2694
60017A1673199N1774L7520K0810J671j9949m3532o7692r0488j10651j28682j46240
60006A1177740j64099j81188j95989k08090k17742k24566k27810k27644k25051
59997I305561k20323k12559k00990j85956j68321j48664j27450j05247q2334n8656
59987G795061l4563j0897J2057L4945N8134Q0761J01610J20127J35947J48091
59977H441273J55669J58698J57204J50071J36098J16065R2504O7313M0641J2336
59967I527872j6653m4864p1637r7217j21715j44156j62463j74693j80746j82549
$$ plain form
60037 14642904 14215244 13798389 13400689 13029468 12690074 12385901 12119564 11893369 11708239
60028 11708239 11563004 11455617 11384728 11349179 11346081 11370169 11415090 11474546 11542037 11610505 11673199
60017 11673199 11724973 11762493 11783303 11784974 11765025 11721493 11653801 11563313 11452662 11323980 11177740
60006 11177740 11013641 10832453 10636464 10428374 10210632 9986066 9758256 9530612 9305561
59997 9305561 9085238 8872679 8671689 8485733 8317412 8168748 8041298 7936051 7853717 7795061
59987 7795061 7760498 7749601 7761658 7796603 7854737 7935498 8037108 8157235 8293182 8441273
59977 8441273 8596942 8755640 8912844 9062915 9199013 9315078 9407582 9474895 9515536 9527872
59967 9527872 9511219 9466355 9394718 9297501 9175786 9031630 8869167 8694474 8513728 8331179
59957H331179j81852j78124j69536j55853j39139j21419j02697q1871n8703l4177
59947G107808r417J5082L9484O4316Q9795J15135J38941J60687J81281K01425
59937H104537K19713K33215K40042K40708K36605K27707K12556J90448J62851
59928A0068382J32096R9215O4003K6996r799m4681p7710j09365j38407j62117
59918I848613j78525j87386j89192j84493j74449j60896j44955j26179j03810
59909H398728p8628n2846k8109m108K0476M5775O9929R0754J07919J22890J36724
59898H829504J48689J57319J61947J62604J59331J52654J44279J35990J27884
59889A0180201J18784J08469R8515R0683Q5353Q2085Q1052Q3379R0319J02337
$$ plain form
59957 8331179 8149327 7971203 7801667 7645814 7506675 7385256 7282559 7200688 7141985 7107808
59947 7107808 7098391 7113473 7152957 7217273 7307068 7422203 7561144 7721831 7903112 8104537
59937 8104537 8324250 8557465 8797507 9038215 9274820 9502527 9715083 9905531 10068382
59928 10068382 10200478 10299693 10363696 10390692 10380893 10336212 10258502 10149137 10010730 9848613
59918 9848613 9670088 9482702 9293510 9109017 8934568 8773672 8628717 8502538 8398728
59909 8398728 8320100 8267254 8239145 8235037 8255513 8301288 8371217 8461971 8569890 8692780 8829504
59898 8829504 8978193 9135512 9297459 9460063 9619394 9772048 9916327 10052317 10180201
59889 10180201 10298985 10407454 10505969 10596652 10682005 10764090 10845142 10928521 11018840 11121177
59879A1121177J18895J39096J62677J90251K22269K57948K95578L33632L71111
59870A3212634M06948M39619M67229M87661M98890M99259M87043M59701M14847
59861A7373831L52764K76905J90918R6474m342j05730j99870k81876l50919m06688
59851A6941467m47397m72251m83495m84294m75987m58789m34077m04365l71517
59842A2909295l36004k97496k55576k10552j64375j19915p8548l9095Q6L8609
59832A1446429P4414J05732J31756J51965J65764J72480J70929J59336J36515
59823A2715320J02969O0456J0993m3205r9484j55346k08910k58180l00532l33990
59813A1490091l58721l76353l87864l92907l91152l83424l71291l56115l38756
$$ plain form
59879 11121177 11240072 11379168 11541845 11732096 11954365 12212313 12507891 12841523 13212634
59870 13212634 13619582 14059201 14526430 15014091 15512981 16012240 16499283 16958984 17373831
59861 17373831 17726595 18003500 18194418 18290892 18286550 18180820 17980950 17699074 17348155 16941467
59851 16941467 16494070 16021819 15538324 15054030 14578043 14119254 13685177 13280812 12909295
59842 12909295 12573291 12275795 12020219 11809667 11645292 11525377 11446829 11407734 11407820 11446429
59832 11446429 11520843 11626575 11758331 11910296 12076060 12248540 12419469 12578805 12715320
59823 12715320 12818289 12878745 12889738 12846533 12747049 12591703 12382793 12124613 11824081 11490091
59813 11490091 11131370 10755017 10367153 9974246 9583094 9199670 8828379 8472264 8133508
59804H133508l19809k99681k78533k56440k33744k11156j89166j67445j45441
59795F032093j23898j04948q9883p7446o5474n3862m4623l9078l6460l5406l5216
59784E325799l5130l3899l1159k8203k6370k5372k4111k2663k2559k5365l1305
59773E019663l8929m5891n0570n3150n4636n5162n4295n2664n1573n0785m8447
59762D463561m3904l8797l4384k9485k2392j3570n023J841O571R103J0521J3384
59750D317426J9566K8200L6994M4946N2452N9612O6024P1818P7272Q1727Q4217
59739D940254Q4884Q4444Q2574P8227P1347O3051N4375M6077L9481L6036L5893
59728E616643L7882M1076M5577N1890O0293P0783Q2999R6566J11959J30374J51998
$$ plain form
59804 8133508 7813699 7514018 7235485 6979045 6745301 6534145 6344979 6177534 6032093
59795 6032093 5908195 5803247 5713364 5635918 5570444 5516582 5471959 5432881 5396421 5361015 5325799
59784 5325799 5290669 5256770 5225611 5197408 5171038 5145666 5121555 5098892 5076333 5050968 5019663
59773 5019663 4980734 4934843 4884273 4831123 4776487 4721325 4667030 4614366 4562793 4512008 4463561
59762 4463561 4419657 4380860 4346476 4316991 4294599 4281029 4276006 4277847 4284418 4293521 4304042 4317426
59750 4317426 4336992 4365192 4402186 4447132 4499584 4559196 4625220 4697038 4774310 4856037 4940254
59739 4940254 5025138 5109582 5192156 5270383 5341730 5404781 5459156 5505233 5544714 5580750 5616643
59728 5616643 5654525 5695601 5741178 5793068 5853361 5924144 6007143 6103709 6215668 6346042 6498040
59717F498040J75238J98620K22615K48512K76369L05357L35336L66441L97637
59708I024165M27043M52913M72584M80807M70872M37441L77831K92476J87134
59699A2623266P4053l2355j22477j93504k45567k78745k94238k95484k86361k69514
59689A0679074k47067k21207j93097j62755j30919r9531o9466l9352p885K4008
59679I531803N4533Q3525J12218J41444J71328K02173K34323K67379L00594L34005
59669A1433325L68590M05297M44381M85520N28358N73032O20055O69430P20256
59660A6248244P71675Q23710Q76094R26807R73188J014145J049569J077490J093981
59651B4854903J096629J086530J066221J037516J002690R66033R32295R04125
$$ plain form
59717 6498040 6673278 6871898 7094513 7343025 7619394 7924751 8260087 8626528 9024165
59708 9024165 9451208 9904121 10376705 10857512 11328384 11765825 12143656 12436132 12623266
59699 12623266 12697319 12664964 12542487 12348983 12103416 11824671 11530433 11234949 10948588 10679074
59689 10679074 10432007 10210800 10017703 9854948 9724029 9624498 9555032 9515680 9507795 9531803
59679 9531803 9586336 9669861 9782079 9923523 10094851 10297024 10531347 10798726 11099320 11433325
59669 11433325 11801915 12207212 12651593 13137113 13665471 14238503 14858558 15527988 16248244
59660 16248244 17019919 17843629 18719723 19646530 20619718 21633863 22683432 23760922 24854903
59651 24854903 25951532 27038062 28104283 29141799 30144489 31110522 32042817 32946942
59643C2946942Q82089Q66036Q54876Q45662Q34654Q19136P96796P63717P14851
59634D0324759O47368N62917M66222L62093K54113J45682M1491n2541j31084j91065
59624D2429955k31569k52549k54362k38228k06074j59433r9277k7059N5048J45433
59614D1161885K43528L48327M57151N66642O74205P77488Q72835R55094J018637
59605D7075792J057841J066902J040202R72992Q61527P03404M99486K56416j3043
59596E3521519k92742n66728q21190j044784j229093j369945j467998j527093
59588D5201946j551395j544418j510625j456746j390482j318494j246661j181623
59580C4001502j130579j099203j090285j103239j132891j168764j198218j212309
$$ plain form
59643 32946942 33829031 34695067 35549943 36395605 37230259 38049395 38846191 39609908 40324759
59634 40324759 40972127 41535044 42001266 42363359 42617472 42763154 42804645 42752104 42621020 42429955
59624 42429955 42198386 41945837 41691475 41453247 41247173 41087740 40988463 40961404 41016452 41161885
59614 41161885 41405413 41753740 42210891 42777533 43451738 44229226 45102061 46057155 47075792
59605 47075792 48133633 49200535 50240737 51213729 52075256 52778660 53278146 53534562 53521519
59596 53521519 53228777 52662049 51840859 50796075 49566982 48197037 46729039 45201946
59588 45201946 43650551 42106133 40595508 39138762 37748280 36429786 35183125 34001502
59580 34001502 32870923 31771720 30681435 29578196 28445305 27276541 26078323 24866014
59572B4866014j208541j188257j153165j105221j047985r85995r22827q60539
59564A6393484q00267p42384o86452o32094n79759n30208m83706m40299m00369
59555A1097946l64220l31437l01254k73211k47123k22945k01033j82046j66293
59546H808384j53828j45317j41564j41642j42714j42758j42554j43926j46837
59537G507244j49437j50279j49167j46335j42111j37114j31501j24244j14346
59528F262710j02693r1474q1794p2949o4067n5078m5871l5997k5811j6779r528
59517E660669k495O266J6268K4913L0745L5240M0705M7260N3040N7069O0583O4971
59505F095234O9693P3437P6645Q1369Q8609R7234J06008J15426J26785J40309
$$ plain form
59572 24866014 23657473 22469216 21316051 20210830 19162845 18176850 17254023 16393484
59564 16393484 15593217 14850833 14164381 13532287 12952528 12422320 11938614 11498315 11097946
59555 11097946 10733726 10402289 10101035 9827824 9580701 9357756 9156723 8974677 8808384
59546 8808384 8654556 8509239 8367675 8226033 8083319 7940561 7798007 7654081 7507244
59537 7507244 7357807 7207528 7058361 6912026 6769915 6632801 6501300 6377056 6262710
59528 6262710 6160017 6068543 5986749 5913800 5849733 5794655 5748784 5712787 5686976 5670197 5660669
59517 5660669 5658174 5664440 5680708 5705621 5736366 5771606 5812311 5859571 5912611 5969680 6030263 6095234
59505 6095234 6164927 6238364 6315009 6396378 6484987 6582221 6688229 6803655 6930440 7070749
59495G070749J55217J70980J87572K04762K22059K39365K57033K75220K93609
59486I076566L11861L29942L47839L64879L79423L89538L94305L94275L90237
59477A2378865L81845L68114L49012L25616K98704K68235K34536J99168J64144
59468A4968239J30860R9968P1576M5454K1802J972j2271k0254k2201j7754o161
59457A5261230J1887L4174N9289Q7463J18253J48811J75397J95258K05902K04238
59447A6501902J88246J58713J17763O6210L894o7777j44792k21933k94487l59311
59437A5948428m15190m61698m97218n19176n26971n23343n11646m93115m68180
59428A1531891m38809m07411l74516l39897l05069k72141k40661k08359j74960
$$ plain form
59495 7070749 7225966 7396946 7584518 7789280 8011339 8250704 8507737 8782957 9076566
59486 9076566 9388427 9718369 10066208 10431087 10810510 11200048 11594353 11988628 12378865
59477 12378865 12760710 13128824 13477836 13803452 14102156 14370391 14604927 14804095 14968239
59468 14968239 15099099 15199067 15270643 15316097 15337899 15339871 15327600 15307346 15285145 15267391 15261230
59457 15261230 15273117 15307291 15366580 15454043 15572296 15721107 15896504 16091762 16297664 16501902
59447 16501902 16690148 16848861 16966624 17032834 17036728 16968951 16824159 16602226 16307739 15948428
59437 15948428 15533238 15071540 14574322 14055146 13528175 13004832 12493186 12000071 11531891
59428 11531891 11093082 10685671 10311155 9971258 9666189 9394048 9153387 8945028 8770068
59419H770068j42630j12278q2107n0706j9255J0585L9034O7108R4661J20946J46078
59408H841504J70738J95103K18759K40792K59417K72581K79724K81882K79225
59399A1039725K69546K50139K20475J82087J36756Q5840L0804k6741q5398j43456
59389A1959777j98268k46902k87503l19725l44054l61089l71354l75421l74144
59380I081317l68584l59417l46667l30630l12734k94598k76422k57443k37988
59371F296834k19655k03011j86643j69348j52086j36588j22910j09633r6024q2844
59361D818092p1104o0865n1262m1265l0547j9933j0567k524N135J2773J9815K6408
59349D594156L3847M1968M7454M6848M0998L4675L1817L2772L6268M1841M9423
$$ plain form
59419 8770068 8627438 8515160 8433053 8382347 8363092 8373677 8412711 8479819 8574480 8695426 8841504
59408 8841504 9012242 9207345 9426104 9666896 9926313 10198894 10478618 10760500 11039725
59399 11039725 11309271 11559410 11779885 11961972 12098728 12184568 12215372 12188631 12103233 11959777
59389 11959777 11761509 11514607 11227104 10907379 10563325 10202236 9830882 9455461 9081317
59380 9081317 8712733 8353316 8006649 7676019 7363285 7068687 6792265 6534822 6296834
59371 6296834 6077179 5874168 5687525 5518177 5366091 5229503 5106593 4996960 4900936 4818092
59361 4818092 4746988 4686123 4634861 4593596 4563049 4543116 4532549 4530025 4535160 4547933 4567748 4594156
59349 4594156 4628003 4669971 4717425 4764273 4805271 4839946 4871763 4904535 4940803 4982644 5032067
59338E032067N8258O7789P8534R0429J00959J06780J07504J06703J08827J16019
59328E973869J28108J44397J64142J85932K08092K30218K53685K80140L09790
59319G878373L41577L74618M08978M45236M83821N24782N67643O11308O54582
59310A2290918O96810P37522P74967Q05483Q24957Q31052Q23805Q04396P74037
59301A9363947P34121O86751O34498N79734N24384M70021M17537L66629L15966
59292B4093588K64096K10086J53179R2329K6459m4875j21370k02343k86559l71430
59282B3813160m52871n26822n91323o46940o94915p34895p64710p82435p88465
59273A7829784p85286p75442p60067p39404p13909o84354o51233o14898n76211
$$ plain form
59338 5032067 5090325 5158114 5236648 5327077 5428036 5534816 5642320 5749023 5857850 5973869
59328 5973869 6101977 6246374 6410516 6596448 6804540 7034758 7288443 7568583 7878373
59319 7878373 8219950 8594568 9003546 9448782 9932603 10457385 11025028 11636336 12290918
59310 12290918 12987728 13725250 14500217 15305700 16130657 16961709 17785514 18589910 19363947
59301 19363947 20098068 20784819 21419317 21999051 22523435 22993456 23410993 23777622 24093588
59292 24093588 24357684 24567770 24720949 24813278 24839737 24794862 24673492 24471149 24184590 23813160
59282 23813160 23360289 22833467 22242144 21595204 20900289 20165394 19400684 18618249 17829784
59273 17829784 17044498 16269056 15508989 14769585 14055676 13371322 12720089 12105191 11528980
59264A1528980n36491m96767m57612m19785l84234l51099l19344k87969k57384
59255H018295k28927k03244j79676j57325j36135j16690r9256q3489o8966n5457
59245F689130m2476k9053j4515N57J4742K7322L8851N0104O1147P1917Q2899R4398
59233G045023J05619J15396J23642J31090J37799J42858J45610J46257J45205
59224H238499J42751J39623J36898J34931J33103J30888J28673J27261J27146
59215I439773J28202J29370J28761J25058J18880J11767J03819R3603Q0429O5097
59205A0524759M8026K8323N595j8828m3507o8274r2789j15071j33022j46529j56481
59194I832202j62580j63767j60219j53243j43571j31250j16967j01933q6413o9781
$$ plain form
59264 11528980 10992489 10495722 10038110 9618325 9234091 8882992 8563648 8275679 8018295
59255 8018295 7789368 7586124 7406448 7249123 7112988 6996298 6897042 6813553 6744587 6689130
59245 6689130 6646654 6617601 6603086 6603643 6618385 6645707 6684558 6734662 6795809 6867726 6950625 7045023
59233 7045023 7150642 7266038 7389680 7520770 7658569 7801427 7947037 8093294 8238499
59224 8238499 8381250 8520873 8657771 8792702 8925805 9056693 9185366 9312627 9439773
59215 9439773 9567975 9697345 9826106 9951164 10070044 10181811 10285630 10379233 10459662 10524759
59205 10524759 10572785 10601108 10606703 10587875 10544368 10476094 10383305 10268234 10135212 9988683 9832202
59194 9832202 9669622 9505855 9345636 9192393 9048822 8917572 8800605 8698672 8612259 8542478
59184H542478n2153l4817j8818m105R819K3165L5754M6860N5394O1060O5092O9034
59172H798763P3137P6879Q0594Q5321R1282R7968J05683J15760J29035J45346
59162I799768J64723J87830K14778K44413K75182L06042L36261L65016L91220
59153A2285233M12916M26856M29543M18994L94707L56106L02188K33224J51819
59144A5411586O1715l3734j31405k27361l16814l95333m60204n10862n47989n72009
59134A2277590n82768n80993n69370n51305n28786n02343m72804m42045m11828
59125G635348l82824l54951l28062l02100k77136k53505k31591k11512j93250
59116E100417j76729j61429j46460j31639j17972j06344r6230q6479p6736o7263
$$ plain form
59184 8542478 8490325 8455508 8436690 8432585 8442404 8465569 8501323 8548183 8603577 8664637 8729729 8798763
59172 8798763 8871900 8948779 9029373 9114694 9205976 9303944 9409627 9525387 9654422 9799768
59162 9799768 9964491 10152321 10367099 10611512 10886694 11192736 11528997 11894013 12285233
59153 12285233 12698149 13125005 13554548 13973542 14368249 14724355 15026543 15259767 15411586
59144 15411586 15473301 15439567 15308162 15080801 14763987 14368654 13908450 13397588 12849599 12277590
59134 12277590 11694822 11113829 10544459 9993154 9464368 8962025 8489221 8047176 7635348
59125 7635348 7252524 6897573 6569511 6267411 5990275 5736770 5505179 5293667 5100417
59116 5100417 4923688 4762259 4615799 4484160 4366188 4259844 4163614 4077135 4000399 3933136
59106C933136n7973m8798m0434l3439k6999j9888j2280n319P58O644J2459J7823
59094C725690K3248K9732L6920M3260M8248N2976N8374O4301P0545P7113Q3303
59083D313710Q8221R2513R7942J04769J11252J16266J20628J25145J29129J31801
59073E431376J33400J33759J31469J26014J19333J13635J08532J02012R3497Q4385
59063F577412P6016O8609O2052N6433N1695M7741M5009M4286M5909M9661N5383
59052G180206O3163P2827Q3643R4623J05248J15992J28021J41931J56930J71668
59042H314252J85604J98911K11267K21685K29417K33990K34247K28429K15527
59033A0273329J95686J69166J35858R6183N1659M494m2506q5862j22630j52123
$$ plain form
59106 3933136 3875163 3826365 3785931 3752492 3725493 3705605 3693325 3688006 3688764 3695408 3707867 3725690
59094 3725690 3748938 3778670 3815590 3858850 3907098 3960074 4018448 4082749 4153294 4230407 4313710
59083 4313710 4401931 4494444 4592386 4697155 4808407 4924673 5045301 5170446 5299575 5431376
59073 5431376 5564776 5698535 5830004 5956018 6075351 6188986 6297518 6399530 6493027 6577412
59063 6577412 6653428 6722037 6784089 6840522 6892217 6939958 6984967 7029253 7075162 7124823 7180206
59052 7180206 7243369 7316196 7399839 7494462 7599710 7715702 7843723 7985654 8142584 8314252
59042 8314252 8499856 8698767 8910034 9131719 9361136 9595126 9829373 10057802 10273329
59033 10273329 10469015 10638181 10774039 10870222 10921881 10926375 10883869 10798007 10675377 10523254
59023A0523254j75497j93628k06621k15246k21051k24627k25549k24586k24136
59014H612313k25446k27154k27788k28099k29345k30665k30032k27085k23344
59005F563355k20013k17056k13976k10121k04462j96487j87413j79265j72594
58996D761968j66045j58364j49953j41938j34404j26257j16852j07177r8995r2979
58986C469004q8215q3666p9245p5056p0504o5207o0129n6649n4850n3790n2895
58975B728798n1830m9729m6194m2517l9941l7120l1671k4144j7943j4802j2897
58964B360010j0215p300n453m464l624l029k525j129J045K023O87j318j886j142
58950B321680k94N63J831L015L707M684O310P190O209M682M597N749O493O290
$$ plain form
59023 10523254 10347757 10154129 9947508 9732262 9511211 9286584 9061035 8836449 8612313
59014 8612313 8386867 8159713 7931925 7703826 7474481 7243816 7013784 6786699 6563355
59005 6563355 6343342 6126286 5912310 5702189 5497727 5301240 5113827 4934562 4761968
58996 4761968 4595923 4437559 4287606 4145668 4011264 3885007 3768155 3660978 3561983 3469004
58986 3469004 3380789 3297123 3217878 3142822 3072318 3007111 2946982 2890333 2835483 2781693 2728798
58975 2728798 2676968 2627239 2581045 2538528 2498587 2461467 2429796 2405652 2387709 2372907 2360010
58964 2360010 2349795 2342495 2337042 2332578 2328954 2325925 2323400 2322271 2323316 2325339 2326026 2324708 2322822 2321680
58950 2321680 2321386 2321949 2323780 2326795 2330502 2335186 2341496 2348686 2354895 2359577 2364174 2369923 2376416 2382706
58936B382706N613M267J894n16j460q53L38J689L129M159M796O277R139J1758
58922B432936J2687J3260J5552J8740K0047J8813J7156J6878J7925J9808K2293
58911B626095K4660K6293K7974L0742L3748L5295L5710L6846L8765L9547L8715
58900B994390L8412M0193M2889M4722M5815M7380M9776N2531N5451N8730O2510
58889C532799O6748P1090P4907P8110Q1652Q6297R1440R6316J01795J09211J17843
58878D508208J25634J32400J40123J49611J59195J67641J76391J87497K00826
58869E947526K14831K29040K44250K60903K78712K97791L19005L42883L68772
58860H503713L95459M22591M51242M82860N17664N54590N92873O32833O74687
$$ plain form
58936 2382706 2388319 2392586 2394480 2393964 2392504 2391651 2391989 2393678 2396807 2400966 2405762 2412039 2421178 2432936
58922 2432936 2445623 2458883 2474435 2493175 2513222 2532035 2549191 2566069 2583994 2603802 2626095
58911 2626095 2650755 2677048 2705022 2735764 2769512 2804807 2840517 2877363 2916128 2955675 2994390
58900 2994390 3032802 3072995 3115884 3160606 3206421 3253801 3303577 3356108 3411559 3470289 3532799
58889 3532799 3599547 3670637 3745544 3823654 3905306 3991603 4083043 4179359 4281154 4390365 4508208
58878 4508208 4633842 4766242 4906365 5055976 5215171 5382812 5559203 5746700 5947526
58869 5947526 6162357 6391397 6635647 6896550 7175262 7473053 7792058 8134941 8503713
58860 8503713 8899172 9321763 9773005 10255865 10773529 11328119 11920992 12553825 13228512
58851A3228512P17501P60047Q01796Q42015Q78844R10473R36363R55679R65110
58842B0996340R59900R36611Q93360Q28097P39053O27202M96344L50463J92877
58833B7020247K8436j35442k91166m33507n59350o66418p53181q19335q65599
58824B2524685q93559r05648r04418q91632q68809q38513q03978p67314p29143
58815A4921671o89907o50301o10559n70784n32275m97019m65564m36677m09483
58806A0059102l84384l61449l39496l17667k96529k76651k57298k37781k19146
58797G368701k03031j89180j75459j60414j44945j30868j18443j06053r2475p8634
58787E969199o6308n5529m4625l2949k1841j2094k148R647K2298L3585M3362N3442
$$ plain form
58851 13228512 13946013 14706060 15507856 16349871 17228715 18139188 19075551 20031230 20996340
58842 20996340 21956240 22892851 23786211 24614308 25353361 25980563 26476907 26827370 27020247
58833 27020247 27048683 26913241 26622075 26188568 25629218 24962800 24209619 23390284 22524685
58824 22524685 21631126 20725478 19821060 18929428 18060619 17222106 16418128 15650814 14921671
58815 14921671 14231764 13581463 12970904 12400120 11867845 11370826 10905262 10468585 10059102
58806 10059102 9674718 9313269 8973773 8656106 8359577 8082926 7825628 7587847 7368701
58797 7368701 7165670 6976490 6801031 6640617 6495672 6364804 6246361 6140308 6047833 5969199
58787 5969199 5902891 5847362 5802737 5769788 5747947 5735853 5733705 5743352 5765650 5799235 5842597 5896039
58775E896039O4740P6530Q8305J00374J12580J24229J35513J47431J60255J73585
58765G079581J87848K04071K22158K41006K60307K80634L01945L23913L47643
58756I449106L74863M05208M36514M68171N01908N38686N77197O16333O56910
58747A4024896O99539P42673P84090Q22646Q57216Q85351R04396R12530R07479
58738B1540816Q85491Q43114P79069O93247N85229M55607L08234J49761j2910
58729B6227658j73933l28074m70175n95254o99249p80541q40970q84152r12144
58720B0543166r24805r22790r09482q88852q62692q31305p95844p58423p20439
58711A2928534o82340o44727o08490n73847n40149n06738m73490m40722m09194
$$ plain form
58775 5896039 5960779 6037309 6125614 6225988 6338568 6462797 6598310 6745741 6905996 7079581
58765 7079581 7267429 7471500 7693658 7934664 8194971 8475605 8777550 9101463 9449106
58756 9449106 9823969 10229177 10665691 11133862 11635770 12174456 12751653 13367986 14024896
58747 14024896 14724435 15467108 16251198 17073844 17931060 18816411 19720807 20633337 21540816
58738 21540816 22426307 23269421 24048490 24741737 25326966 25782573 26090807 26240568 26227658
58729 26227658 26053725 25725651 25255476 24660222 23960973 23180432 22339462 21455310 20543166
58720 20543166 19618361 18695571 17786089 16897237 16034545 15203240 14407396 13648973 12928534
58711 12928534 12246194 11601467 10992977 10419130 9878981 9372243 8898753 8458031 8048837
58702H048837l79922l53551l29811l07944k87360k67792k49247k32074k16717
58693E424419k03020j90052j76826j63149j49717j37576j27298j18420j09969
58684D048392j01733r4515q8759q3669p8287p2651o7154o1728n6723n3468n2487
58673C237218n2013n0088m7313m5607m4917m3497m1100l9389l9008l8680l7827
58662B757779l7655l8832m0040m0010l9407l9690m1362m4104m7333m9949n0776
58651B288621n0013m9154m8993m8675m7132m4385m1271l8865l8101l8721l8732
58640A804579l6380l2486k9307k7385k5430k3086k1625k1727k2669k3897k5408
58629A515179k6381k5636k3673k2233k1683k1035k0355k0437k0169j7410j2966
$$ plain form
58702 8048837 7668915 7315364 6985553 6677609 6390249 6122457 5873210 5641136 5424419
58693 5424419 5221399 5031347 4854521 4691372 4541655 4404079 4276781 4158361 4048392
58684 4048392 3946659 3852144 3763385 3679716 3601429 3528778 3461624 3399896 3343173 3289705 3237218
58673 3237218 3185205 3135117 3087804 3042197 2997280 2953783 2912683 2873294 2834286 2795606 2757779
58662 2757779 2720124 2681292 2641252 2601242 2561835 2522145 2480783 2436679 2389346 2339397 2288621
58651 2288621 2238608 2189454 2140461 2091786 2044654 2000269 1958998 1920133 1882032 1843311 1804579
58640 1804579 1768199 1735713 1706406 1679021 1653591 1630505 1608880 1587153 1564484 1540587 1515179
58629 1515179 1488798 1463162 1439489 1417256 1395573 1374538 1354183 1333746 1313577 1296167 1283201
58618A283201j0278j0200r515n972j639O93J427K564M627P152J0032J2513J2958
58605A297563J1335R869R740R321P160M271J855p27l823n980o528p155q760r399
58591A308742p666n485m785l893l72M683Q345J0216J1963J3961J5448J6846J9175
58578A387178K2021K4554K7235L0373L2558L3083L4234L8311M3946M8337N1568
58567A773398N5584O0240O3964O7445P3107Q1395R0706J00475J11125J21450J29516
58556B728405J36121J44234J54849J66290J77688J90020K03326K15879K26900
58547D343712K37548K48382K57895K64367K67161K65387K56949K39752K12941
58538F594094J76837J32942Q3905L2334k0117p1461j18116j56781j87092k10609
$$ plain form
58618 1283201 1272923 1262723 1253208 1247236 1245597 1246290 1247717 1250281 1254908 1262060 1272092 1284605 1297563
58605 1297563 1308898 1318767 1328507 1337828 1344988 1349259 1351114 1350387 1346564 1340584 1334056 1326901 1318141 1308742
58591 1308742 1301076 1295591 1290806 1286913 1286541 1291224 1299569 1309785 1321748 1335709 1351157 1368003 1387178
58578 1387178 1409199 1433753 1460988 1491361 1523919 1557002 1591236 1629547 1673493 1721830 1773398
58567 1773398 1828982 1889222 1953186 2020631 2093738 2175133 2265839 2366314 2477439 2598889 2728405
58556 2728405 2864526 3008760 3163609 3329899 3507587 3697607 3900933 4116812 4343712
58547 4343712 4581260 4829642 5087537 5351904 5619065 5884452 6141401 6381153 6594094
58538 6594094 6770931 6903873 6987778 7020112 6999995 6928534 6810418 6653637 6466545 6255936
58528F255936k27801k37936k41526k40641k36775k30168k21244k10893j99308
58519D209644j86118j71716j57248j43416j30430j18574j07683r6802q5716p5893
58509B936048o8557o2863n7572n3176n0472m8245m4829m0953l8632l8059l7898
58498B394792l7993l9192m1017m1909m1466m0385l8786l6734l5557l6283l7548
58487A967922l7607l7427l9040m1577m2147m0240l8008l6450l4589l2538l1865
58476A556434l2365l1614k8679k5469k3532k2122k0379j8924j8176j7276j5753
58465A302145j4402j3610j2664j1476j1087j1574j1282r256o898o204p381q940
58453A177371r261p654m818k408j392r53J33J583K237J921J187l2j832l148l052
$$ plain form
58528 6255936 6028135 5790199 5548673 5308032 5071257 4841089 4619845 4408952 4209644
58519 4209644 4023526 3851810 3694562 3551146 3420716 3302142 3194459 3097657 3011941 2936048
58509 2936048 2867491 2804628 2747056 2693880 2643408 2595163 2550334 2509381 2470749 2432690 2394792
58498 2394792 2356799 2317607 2276590 2234681 2193215 2152830 2114044 2077310 2041753 2005470 1967922
58487 1967922 1930315 1892888 1853848 1812271 1770124 1729884 1691876 1655426 1620837 1588299 1556434
58476 1556434 1524069 1492455 1463776 1438307 1414775 1392653 1372274 1353350 1335174 1317898 1302145
58465 1302145 1287743 1274133 1261469 1249993 1238906 1227332 1216050 1206794 1199896 1193692 1186311 1177371
58453 1177371 1168110 1160456 1155638 1153230 1151838 1150885 1151018 1152601 1154838 1156759 1157946 1157914 1156082 1152934 1149882
58438A149882k615l452m997n468n070n830q248j0486j1078j0398r305q161p348
58425A057426p076o647n468m482m961o336o969o558o012n566m994m905n666n782
58411I76004l729q53K1j491l167l624l620m088n022o081o689o005m446m000n221
58396I17989n578l081L59J950K445M076O018O013N027N801P782Q225P736R653
58382I74415J3871J6256J4961J2793J2253J2497J2338J2154J1530Q729M007Q4
58370A105888j925l883o970r785j1143j1651j1679j0686r276q797q499o370l243
58357A001981k346m160n389m017j643J05J788L637M395M030M346N820O880P094
58343A022521P804R029R348R258J0804J3227J3250J0601Q873R720J0659R991R502
$$ plain form
58438 1149882 1147267 1143815 1138818 1133350 1128280 1122450 1114202 1103716 1092638 1082240 1072935 1064774 1057426
58425 1057426 1050350 1043703 1038235 1033753 1028792 1022456 1015487 1008929 1002917 997351 992357 987452 981786 976004
58411 976004 972275 971422 971443 969952 966785 963161 959541 955453 950431 944350 937661 931656 927210 923210 917989
58396 917989 912411 909330 909689 911639 914084 918160 924178 930191 935218 941019 948801 957026 964762 974415
58382 974415 988286 1004542 1019503 1032296 1044549 1057046 1069384 1081538 1093068 1101797 1105804 1105888
58370 1105888 1103963 1100080 1093110 1083325 1072182 1060531 1048852 1038166 1028890 1020093 1011594 1005224 1001981
58357 1001981 999635 995475 990086 986069 984426 984531 986319 989956 994351 998381 1002727 1008547 1015427 1022521
58343 1022521 1030325 1039354 1048702 1057960 1068764 1081991 1095241 1105842 1114715 1124435 1135094 1145085 1154587
58330A154587J0476J1287J0868J0564J0745R664P502P311R863J1760J0789R054
58318A274470Q520P686N281L272L183L113J349m63n86m39j613k674j719M17K034
58303A301831L147M137M295L662L749M941N803O111P367R347R803Q812R390J2268
58289A394663J4209J3270J1630J1307J1216J0404J0084J0504R878Q326Q450J0298
58277A524239J0443Q066O862Q618J0162R420R223J1777J4504J4883J4736J6110
58265A659043J7460J7582J8773K2352K5274K4893K3156K2695K2829K2648K3709
58254A900414K6393K7929K7177K6938K8503K8881K6666K5431K7589K9936K9217
58243B205074K7274K6795K6954K6848K8247L1240L2470L1296L2064L6559M0276
$$ plain form
58330 1154587 1165063 1176350 1187218 1197782 1208527 1218191 1225693 1233004 1242867 1254627 1265416 1274470
58318 1274470 1282990 1290676 1295957 1299229 1302412 1305525 1306874 1306411 1305825 1305386 1303773 1301099 1299380 1299797 1301831
58303 1301831 1304978 1309115 1313410 1317072 1320821 1325762 1331565 1337676 1345043 1354390 1364193 1373005 1382395 1394663
58289 1394663 1408872 1422142 1433772 1445079 1456295 1466699 1476783 1487287 1497165 1505491 1513941 1524239
58277 1524239 1534682 1542748 1549610 1558228 1568390 1577810 1587033 1598810 1613314 1628197 1642933 1659043
58265 1659043 1676503 1694085 1712858 1735210 1760484 1785377 1808533 1831228 1854057 1876705 1900414
58254 1900414 1926807 1954736 1981913 2008851 2037354 2066235 2092901 2118332 2145921 2175857 2205074
58243 2205074 2232348 2259143 2286097 2312945 2341192 2372432 2404902 2436198 2468262 2504821 2545097
58232B545097M0184L9779M2085M4289M4122M4700M7860M9582M7672M7001N1011
58221C043382N5183N5456N5991O1250O7316O9008O9206P2851P7678P9300P9963
58210C786584Q3721Q8078Q8910Q8795R2130R6803R8881J00830J06842J14676J20136
58199D866386J24986J32623J40940J47308J55205J67836J80865J89677J98047
58190F303873K11163K26278K38973K52182K69788K88039L02969L19490L43077
58181H755832L69366L92428M15955M45311M75944N01509N26172N56781N90268
58172A3029566O21276O54565O96623P42614P85176Q28331Q78800R32191R82620
58163B0151762J037248J105091J180119J252204J326015J411502J504872J598116
$$ plain form
58232 2545097 2585281 2625060 2667145 2711434 2755556 2800256 2848116 2897698 2945370 2992371 3043382
58221 3043382 3098565 3154021 3210012 3271262 3338578 3407586 3476792 3549643 3627321 3706621 3786584
58210 3786584 3870305 3958383 4047293 4136088 4228218 4325021 4423902 4524732 4631574 4746250 4866386
58199 4866386 4991372 5123995 5264935 5412243 5567448 5735284 5916149 6105826 6303873
58190 6303873 6515036 6741314 6980287 7232469 7502257 7790296 8093265 8412755 8755832
58181 8755832 9125198 9517626 9933581 10378892 10854836 11356345 11882517 12439298 13029566
58172 13029566 13650842 14305407 15002030 15744644 16529820 17358151 18236951 19169142 20151762
58163 20151762 21189010 22294101 23474220 24726424 26052439 27463941 28968813 30566929
58155C0566929J698608J819653J960139K113257K285533K486350K709356K947307
58147D8587132L214968L534243L908710M337256M838270N432902O120824O903583
58139H6877888P814300Q890402J0136588J1548364J3138604J4888494J6707181
58132A70001821J8517194K0376479K2472375K5029270K8227077L1966064L5354506
58125C51944786L6436073L2956015K3995232J1031962k755669j4382345k2439879
58118D16786175k7058486k9047648k9230328k8256314k6601698k4573634k2364971
58111B29653096k0137816j8035975j6139843j4457433j2957034j1583640j0264724
58104A26076631q944491p621285o338359n140797m045939l047401k156845j468305
$$ plain form
58155 30566929 32265537 34085190 36045329 38158586 40444119 42930469 45639825 48587132
58147 48587132 51802100 55336343 59245053 63582309 68420579 73853481 79974305 86877888
58139 86877888 94692188 103582590 113719178 125267542 138406146 153294640 170001821
58132 170001821 188519015 208895494 231367869 256397139 284624216 316590280 351944786
58125 351944786 388380859 421336874 445332106 456364068 453608399 439226054 416786175
58118 416786175 389727689 360680041 331449713 303193399 276591701 252018067 229653096
58111 229653096 209515280 191479305 175339462 160882029 147924995 136341355 126076631
58104 126076631 117132140 109510855 103172496 98031699 93985760 90938359 88781514 87313209
58096H7313209j165497j396512k101676k998477l773151m275107m523170m585449
58088F2494170m509842m338451m115336l863185l584304l289182k999546k725160
58080C3069164k463094k218866k004854j818808j646415j485151j345408j228409
58072A8858159j122821j024043r38559q67870q04560p45801o95625o52728o09922
58063A1396230n66564n28577m95865m62215m27575l98115l74105l49854l25694
58054G467666l08090k97407k86845k73979k62656k53135k40981k26396k14449
58045E103728k05495j94941j82891j74379j69614j63529j55627j50884j49801
58036C556567j46631j38985j30908j24907j18703j11126j04107r7693q9982q2525
$$ plain form
58096 87313209 86147712 84751200 82649524 79651047 75877896 71602789 67079619 62494170
58088 62494170 57984328 53645877 49530541 45667356 42083052 38793870 35794324 33069164
58080 33069164 30606070 28387204 26382350 24563542 22917127 21431976 20086568 18858159
58072 18858159 17735338 16711295 15772736 14904866 14100306 13354505 12658880 12006152 11396230
58063 11396230 10829666 10301089 9805224 9343009 8915434 8517319 8143214 7793360 7467666
58054 7467666 7159576 6862169 6575324 6301345 6038689 5785554 5544573 5318177 5103728
58045 5103728 4898233 4703292 4520401 4346022 4176408 4012879 3857252 3706368 3556567
58036 3556567 3409936 3270951 3140043 3015136 2896433 2785307 2681200 2583507 2493525 2411000
58026B411000p8969p7937p4178o7168o1669n9448n7391n4180n1965n0772m8010
58015A729313m4263m2945m3593m1879l7058l3056l1460k9758k7151k5850k5720
58004A346580k3834k0347j8763j9372j8468j5263j3528j4897j6209j5213j3647
57993A157039j3022j2348j1590j2506j4484j4226j1123q509q130p793n976m456
57981A032876m600n016m642m707o037p326p287o008l768j119Q5j282l030k417
57967I75722o35p37k102j591M33L36k456m415l889l252m166n285n746o756q467
57952I26994r166q607q587r449r673r406j0489j2420j2469j0479r429j0223j0089
57939G96508p408m225k515j649r44j223k376k523r31R84K303L385L507J262k126
$$ plain form
58026 2411000 2332031 2254094 2179916 2112748 2051079 1991631 1934240 1880060 1828095 1777323 1729313
58015 1729313 1685050 1642105 1598512 1556633 1519575 1486519 1455059 1425301 1398150 1372300 1346580
58004 1346580 1322746 1302399 1283636 1264264 1245796 1230533 1217005 1202108 1185899 1170686 1157039
57993 1157039 1144017 1131669 1120079 1107573 1093089 1078863 1067740 1059231 1051101 1043308 1037332 1032876
57981 1032876 1028276 1023260 1018618 1013911 1007874 1000548 993261 987253 983485 982366 982451 981169 978139 975722
57967 975722 975087 974350 972248 970657 971090 971426 968970 964555 960666 957414 953248 947963 942217 935461 926994
57952 926994 917828 909221 900634 891185 881512 872106 861617 849197 836728 826249 816820 806597 796508
57939 796508 789100 784875 782360 780711 779767 778544 776168 773645 772714 773698 776001 779386 782893 784155 782029
57924G82029l396j995q24j559k751l261l730l761j511K357M109J970j476l409
57910G62792m188n115n877n986o164o801p161p073p138o970n770m778n919p819
57896F76033o965l458j559l363n897o068m727l815l033j624n16m44l45N68J343
57881F36130J309J255J421Q02m02m48P58J002m65j532r72n17j554k749k852l099
57865F28087m847p206q821r766j0146r152p021n576n422m893l103j418o51M05
57851E50470K253L298K886K908M590O292O302N343M607L861L164L744N371N616
57837F10705L596J704J680J893O84o28o48q85k853m815m615l702m933p965j0002
57822E79216r964r047q100p035o103n557m800l618l244m429n671n064k801l72
$$ plain form
57924 782029 778633 776638 775814 774255 771504 768243 764513 760752 759241 761598 765707 767677 766201 762792
57910 762792 758604 753489 747612 741626 735462 728661 721500 714427 707289 700319 694549 689771 683852 676033
57896 676033 669068 665610 664051 660688 654791 648723 643996 640181 637148 635524 635008 634564 634219 634787 636130
57881 636130 637439 638694 640115 640917 640515 640067 640825 641827 641362 639830 638858 638341 636787 634038 631186 628087
57865 628087 623240 616034 607213 597447 587301 578149 571128 565552 560130 555237 552134 550716 550065 550470
57851 550470 552723 556021 558907 561815 566405 572697 578999 584342 588949 592810 595974 599718 605089 610705
57837 610705 614301 616005 617685 619578 620262 619634 618986 618101 615248 610433 605818 602116 597183 589218 579216
57822 579216 569252 560205 552105 545070 538967 533410 528610 524992 521748 517319 511648 506584 503783 503411
57808E03411J451K595L169M192O931J0214J0759P858N151N612P336O959M843L630
57794E84111L518K563M97j055j617k261l444m824o573q604r336p695n608n988
57780E33684q645j0652j0417r176q561q842r569j0134r663p819n687m788n447
57767D24284o973q706r894r687q315p192o895o450n657o130q420j0235r640q170
57753C11920q224r114q480o254m290l100j989j530k757m278l476n55J517J422
57739B60812J165K722N457P591Q248P345N166K747J339R93P16J36r2M77J630L092
57723C09544M530N243N006M687M770L967R13l288n974o140n180m690n169o576
57709C01643q448r507q719o904n992o684p869q172o969m318j180P22N91k46J1
$$ plain form
57808 503411 504862 507457 510626 514818 521749 531963 542722 550580 555731 561343 568679 575638 580481 584111
57794 584111 587629 590192 590689 589634 588017 585756 582312 577488 570915 562311 552975 545280 539672 533684
57780 533684 525039 514387 503970 494794 486233 477391 467822 457688 448025 440206 434519 429731 424284
57767 424284 417311 408605 398711 389024 380709 373517 366622 360172 354515 348385 339965 329730 320090 311920
57753 311920 303696 294582 286102 279848 275558 272458 270469 268939 266182 261904 258428 257873 259390 260812
57739 260812 261977 264699 270156 277747 285995 293340 298506 301253 302592 303585 304301 304437 304345 304822 306452 309544
57723 309544 314074 319317 324323 329010 333780 337747 338660 335372 329398 323258 318078 313388 308219 301643
57709 301643 293195 283688 274969 268065 262073 255389 247520 239348 232379 228061 226881 227603 228194 227948 227959
57694B27959J285K202K358K651L906O334R694J2729J3543J1954J0407J0816J1837
57681C27675J1247R638Q997Q822O959L864K602M191O070O033M989M712N255N768
57667D16822O082O311O408O955Q807J1246J2132J0820R376R847J1659J2807J2527
57654E41799J1806J1930J3374J5572J7321J7879J7858J8418J9725K0980K1794
57643G28456K2522K3444K4617K6429K9079L1812L3812L5518L7791M0291M2288
57632A076059M4574M8489N3395N7340O0330O4559P1043P8446Q5928R4676J05440
57621A840279J16824J27602J38960J52677J68437J84511K00166K15843K31780
57612C377079K47831K63943K79520K92663L00970L02390K94195K71910K31212
$$ plain form
57694 227959 229244 231446 233804 236455 240361 246695 256389 269118 282661 294615 305022 315838 327675
57681 327675 338922 348560 357557 366379 373338 377202 379804 383995 390065 396098 401087 405799 411054 416822
57667 416822 422904 429215 435623 442578 451385 462631 474763 485583 494959 504806 516465 529272 541799
57654 541799 553605 565535 578909 594481 611802 629681 647539 665957 685682 706662 728456
57643 728456 750978 774422 799039 825468 854547 886359 920171 955689 993480 1033771 1076059
57632 1076059 1120633 1169122 1222517 1279857 1340187 1404746 1475789 1554235 1640163 1734839 1840279
57621 1840279 1957103 2084705 2223665 2376342 2544779 2729290 2929456 3145299 3377079
57612 3377079 3624910 3888853 4168373 4461036 4762006 5064396 5358591 5630501 5861713
57603E861713J71731R8811K1535n0952j12325j60083j94860k18796k34140k42583
57593D940051k45183k42681k35948k25936k13206j98306j82850j69144j57777
57584C069020j46521j33075j18143j04301r2523q1688p1111o1334n2306m3077
57574B164941l3854k6218k0413j4310o421J759P989J2722J8679K7401L7664M7215
57562B217154N5113O2224O9887P8454Q7227R5972J05721J17306J29630J40616
57552C159304J49603J57376J63997J68157J68787J65561J57473J42694J20611
57543D553563R2529N9806K3072j5733n2521q4005j10402j33553j53352j67808
57533D011596j76197j80281j82155j82225j79746j74453j67021j58270j48599
$$ plain form
57603 5861713 6033444 6132255 6153790 6102838 5990513 5830430 5635570 5416774 5182634 4940051
57593 4940051 4694868 4452187 4216239 3990303 3777097 3578791 3395941 3226797 3069020
57584 3069020 2922499 2789424 2671281 2566980 2474457 2392769 2321658 2260324 2208018 2164941
57574 2164941 2131087 2104869 2084456 2070146 2063725 2065484 2073473 2086195 2104874 2132275 2169939 2217154
57562 2217154 2272267 2334491 2404378 2482832 2570059 2666031 2771752 2889058 3018688 3159304
57552 3159304 3308907 3466283 3630280 3798437 3967224 4132785 4290258 4432952 4553563
57543 4553563 4646092 4705898 4728970 4713237 4660716 4576711 4466309 4332756 4179404 4011596
57533 4011596 3835399 3655118 3472963 3290738 3110992 2936539 2769518 2611248 2462649
57524B462649j38387j28658j20583j14072j07534r9810r1699q4629p8462p1939
57514A426876o4897n8428n2866m7466m2306l8639l6701l4800l1588k7823k4932
57503I66430k2975k1053j8743j6216j3720j1741j0702r937p993m698j839q90j151
57490H24772r82J21J722L698O136Q781J1530J4792J8411K0986K1415K0537K0405
57477I72324K2332K6210L0988L5221L7965L9889M2776M7363N2643N7768O3295
57466A428774O9658P5953Q1499Q7395R4884J03190J10604J16859J22950J29194
57456B420960J34994J39829J42775J41604J34235J21016J04007Q4153O0698L3472
57446C517743M170k4876n1980p5964r5902j11519j23030j30433j33649j33330
$$ plain form
57524 2462649 2324262 2195604 2075021 1960949 1853415 1753605 1661906 1577277 1498815 1426876
57514 1426876 1361979 1303551 1250685 1203219 1160913 1122274 1085573 1050773 1019185 991362 966430
57503 966430 943455 922402 903659 887443 873723 861982 851280 841343 833350 828652 826813 825923 824772
57490 824772 823790 823911 825633 829331 835467 844248 855778 870570 888981 909967 931382 951919 972324
57477 972324 994656 1020866 1051854 1087075 1125040 1164929 1207705 1255068 1307711 1365479 1428774
57466 1428774 1498432 1574385 1655884 1743279 1838163 1941353 2051957 2168816 2291766 2420960
57456 2420960 2555954 2695783 2838558 2980162 3114397 3235413 3339420 3423573 3484271 3517743
57446 3517743 3521913 3497037 3445057 3369093 3273191 3161672 3038642 2908209 2774560 2641230
57436B641230j30700j26606j21338j15217j08623j01602r4239q7065q0368p3435
57426A602037o5544n7388n0397m4890l9906l4706k9322k3669j7394j0764m726
57415A223331J56M127P748J1730J6969K3612L0317L5680M0223M5671N2321N8682
57403A550567O4055O9813P7321Q5801R3335R9111J03795J08222J12508J16031
57393B480559J17602J15850J09937R9758Q5394O6718M3805J7416j0975l9353o5555
57382C021156q8147j06992j22368j33773j40355j42520j41954j39870j36136j30536
57372A738505j23781j16783j09817j03077r7206r2279q7044q0239p2420o5515
57362G90344o0572n6728n2514m7571m2802l9306l7307l5984l4256l1806k9292
$$ plain form
57436 2641230 2510530 2383924 2262586 2147369 2038746 1937144 1842905 1755840 1675472 1602037
57426 1602037 1536493 1479105 1428708 1383818 1343912 1309206 1279884 1256215 1238821 1228057 1223331
57415 1223331 1223487 1227614 1235362 1247092 1264061 1287673 1317990 1353670 1393893 1439564 1491885 1550567
57403 1550567 1614622 1684435 1761756 1847557 1940892 2040003 2143798 2252020 2364528 2480559
57393 2480559 2598161 2714011 2823948 2923706 3009100 3075818 3119623 3137039 3126064 3086711 3021156
57382 3021156 2933009 2826017 2703649 2569876 2429521 2287001 2145047 2005177 1869041 1738505
57372 1738505 1614724 1497941 1388124 1285047 1187841 1095562 1008518 928279 855859 790344
57362 790344 729772 673044 620530 572959 530157 490851 453544 417560 383304 351498 322206
57351C22206k7449k6207k4926k3324k1739k0479j9327j7911j6384j5341j5006
57340I4113j4746j3791j2318j1292j1032j0467q467n617B419b431p434r542r627
57327b9034p821n498l996l594l539l152k750l111m075m396l234j328k11n62j755
57312g8056k864l530l851l838l366k501j635j143r92p70k06M14M81j46p85o10
57296a03398K23N18n35k061k283p94P57P98kK66J959L410L467L042L317L690K785
57279h4841Q75k69K65J633K865M047N436O496O696O484O625P014O983O480O130
57264a7081O234d362B294O874P084P110P380Q759J1042J2509J1859J0038R021
57251I3970R189R317R145J0082J2706J5166J5483J4328J3943J5016J6471J7892
$$ plain form
57351 322206 294757 268550 243624 220300 198561 178082 158755 140844 124460 109119 94113
57340 94113 79367 65576 53258 41966 30934 20467 12000 6383 2419 -2431 -9865 -19407 -29034
57327 -29034 -36855 -42353 -46349 -49943 -53482 -56634 -59384 -62495 -66570 -70966 -74200 -75528 -75739 -76301 -78056
57312 -78056 -80920 -84450 -88301 -92139 -95505 -98006 -99641 -100784 -101776 -102546 -102752 -102338 -101857 -102003 -102788 -103398
57296 -103398 -103175 -102657 -103192 -105253 -107536 -108330 -107573 -106775 -106777 -106511 -104552 -101142 -97675 -94633 -91316 -87626 -84841
57279 -84841 -83966 -84235 -83970 -82337 -79472 -75425 -69989 -63493 -56797 -50313 -43688 -36674 -29691 -23211 -17081
57264 -17081 -10847 -4362 2294 9168 16252 23362 30742 39501 50543 63052 74911 84949 93970
57251 93970 103159 112476 121621 131703 144409 159575 175058 189386 203329 218345 234816 252708
57239B52708K0178K3481K6422K8054K9129L0588L2146L3290L4509L6307L7906
57228E84718L8257L7816L8149L9993M2656M5036M6455M6735M6271M5842M5710
57217A057638M5342M4552M4306M5361M6574M5782M2310L7568L3070K8785K3680
57206A494968J7168R791K954j951m628o150p836j0010j2177j3979j5274j5685
57194A437191j4982j3775j2939j2370j1190r156o923m711j725K514P041J0267
57182A369242J1675J2212J3207J5271J8055K0766K2730K3701K3910K4039K4899
57171A579707K6669K8446K9117K8741K8407K8698K9040K8940K8787K8843K8569
57160A893964K7874K7973K9782L2347L4313L6182L9272M2962M5063M5011M4637
$$ plain form
57239 252708 272886 296367 322789 350843 379972 410560 442706 475996 510505 546812 584718
57228 584718 622975 660791 698940 738933 781589 826625 873080 919815 966086 1011928 1057638
57217 1057638 1102980 1147532 1191838 1237199 1283773 1329555 1371865 1409433 1442503 1471288 1494968
57206 1494968 1512136 1521927 1524881 1522930 1518302 1512152 1504316 1494306 1482129 1468150 1452876 1437191
57194 1437191 1422209 1408434 1395495 1383125 1371935 1362779 1355856 1351145 1349420 1351934 1358975 1369242
57182 1369242 1380917 1393129 1406336 1421607 1439662 1460428 1483158 1506859 1530769 1554808 1579707
57171 1579707 1606376 1634822 1663939 1692680 1721087 1749785 1778825 1807765 1836552 1865395 1893964
57160 1893964 1921838 1949811 1979593 2011940 2046253 2082435 2121707 2164669 2209732 2254743 2299380
57149B299380M5283M6076M5888M5272M5212M5370M4995M4612M5325M7026M8509
57138B802948M9167M9410M9569M9483M9189M9153M9522M9626M8526M5804M1835
57127C334232L7537L3922L1611L0550L0134K9616K8715K7978K8149K8809K8124
57116C669377K4756J9717J5251J1905P918J879n309j1845j7165k1570k4690k5943
57104C644281k6251k7816l1714l6743m1021m4125m7165n1291n6593o2245o7352
57093C151965p1727p5929q0367q4446q6990q7708q7797q8697r0506r2141r2966
57082B212691r3551r4505r5182r4255r1490q8194q5755q4394q3911q5368r1331
57071A224755j04407j25599j53750j86060k19445A83066a03052l22973l64211
$$ plain form
57149 2299380 2344663 2390739 2436627 2481899 2527111 2572481 2617476 2662088 2707413 2754439 2802948
57138 2802948 2852115 2901525 2951094 3000577 3049766 3098919 3148441 3198067 3246593 3292397 3334232
57127 3334232 3371769 3405691 3437302 3467852 3497986 3527602 3556317 3584295 3612444 3641253 3669377
57116 3669377 3694133 3713850 3729101 3741006 3748924 3750803 3745494 3733649 3716484 3694914 3670224 3644281
57104 3644281 3618030 3590214 3558500 3521757 3480736 3436611 3389446 3338155 3281562 3219317 3151965
57093 3151965 3080238 3004309 2923942 2839496 2752506 2664798 2577001 2488304 2397798 2305657 2212691
57082 2212691 2119140 2024635 1929453 1835198 1743708 1655514 1569759 1485365 1401454 1316086 1224755
57071 1224755 1120348 994749 840999 654939 435494 183066 -103052 -426025 -790236
57062g90236m09051m56612n07853n64642o27350o94543p65130q39610r18870j003317
57052g577214j094367j195749j311673j444323j594791j766339j964950k196875
57044b0146281k467788k784803l157531l596907m115084m726407n444916o278278
57036e2717995p223515q265352r375388j0520638j1689388j2908787j4207701
57029a26908764j5532811j6711833j7542245j7942327j8002308j7867339j7572610
57022b48080237j6997767j5960695j4327609j2044427r118076n620631j721933
57015c23871375K306828O156847R584934J2487035J4887612J6851620J8390210
57008b43206289J9437701J9910241J9783073J9121489J8058266J6750704J5342205
$$ plain form
57062 -790236 -1199287 -1655899 -2163752 -2728394 -3355744 -4050287 -4815417 -5655027 -6573897 -7577214
57052 -7577214 -8671581 -9867330 -11179003 -12623326 -14218117 -15984456 -17949406 -20146281
57044 -20146281 -22614069 -25398872 -28556403 -32153310 -36268394 -40994801 -46439717 -52717995
57036 -52717995 -59941510 -68206862 -77582250 -88102888 -99792276 -112701063 -126908764
57029 -126908764 -142441575 -159153408 -176695653 -194637980 -212640288 -230507627 -248080237
57022 -248080237 -265078004 -281038699 -295366308 -307410735 -316528811 -322149442 -323871375
57015 -323871375 -321564547 -315407700 -305822766 -293335731 -278448119 -261596499 -243206289
57008 -243206289 -223768588 -203858347 -184075274 -164953785 -146895519 -130144815 -114802610
57001a14802610J3935442J2583837J1305493J0106202Q991501P965206P027363
56994d2887566O177213N414646M737449M140060L615832L158230K759745K412402
56986a0471989K109965J847677J619851J420024J243596J088199a91285F38797
56977A361067O27307N44489M73086M13527L66199L28851K97250K68718K43180
56968D923674K20647J99828J79645J60235J41709J23343J04463Q5076O5417M6153
56958F250190K8941J5349N150l262j0965j8225k5475l2769l8687m1537m1355l8921
56946F048434l3283k2349n669J5239L7872N6461N9218L3635k1776r2877j59710
56935E915195k10371k44989k69318k87578l00519l07100l06783l00788k91202
$$ plain form
57001 -114802610 -100867168 -88283331 -76977838 -66871636 -57880135 -49914929 -42887566
56994 -42887566 -36710353 -31295707 -26558258 -22418198 -18802366 -15644136 -12884391 -10471989
56986 -10471989 -8362024 -6514347 -4894496 -3474472 -2230876 -1142677 -191285 638797
56977 1361067 1988374 2532863 3005949 3419476 3785675 4114526 4411776 4680494 4923674
56968 4923674 5144321 5344149 5523794 5684029 5825738 5949081 6053544 6138620 6204037 6250190
56958 6250190 6279131 6294480 6299630 6296368 6285403 6267178 6241703 6208934 6170247 6128710 6087355 6048434
56946 6048434 6015151 5992802 5987133 6002372 6040244 6096705 6155923 6189558 6167782 6074905 5915195
56935 5915195 5704824 5459835 5190517 4902939 4602420 4295320 3988537 3687749 3396547
56926C396547k78844k62982k43668k23108k03884j86820j71493j57802j45842
56917A522104j35057j24740j14820j05251r5329q4684p4323o5520n8013n0345
56907F14022m1820l3083k4929j7390j0159l260K979Q354J3052J7463K1506K4319
56895E71054K4984K3507K0542J6330J0745M478q21l920m908m560l568k605k182
56882F49076j999j226L31K093L956O623J0210J3654J6131J8081K0184K2108K3031
56869G82253K2366J9354J2989L576o498j4685k0499k4784k7597k8256k7047k5300
56857F65872k3660k1588j8856j6347j4812j3754j2239j0234q467p315o438n417
56845E06745m179k819j380L7J235K229L295M512N450N736N724O100O923P694Q527
$$ plain form
56926 3396547 3117703 2854721 2611053 2387945 2184061 1997241 1825748 1667946 1522104
56917 1522104 1387047 1262307 1147487 1042236 946907 862223 787900 722380 664367 614022
56907 614022 572202 539119 514190 496800 486641 483381 486360 494714 507766 525229 546735 571054
56895 571054 596038 619545 640087 656417 667162 671640 670819 666899 661991 657431 653863 651258 649076
56882 649076 647077 645851 646182 648275 652231 658854 669064 682718 698849 716930 737114 759222 782253
56869 782253 804619 823973 836962 840538 834040 819355 798856 774072 746475 718219 691172 665872
56857 665872 642212 620624 601768 585421 570609 556855 544616 534382 525915 518600 512162 506745
56845 506745 502566 499747 498367 498404 499639 501868 505163 509675 515125 520861 526585 532685 539608 547302 555829
56830E55829J0259J3092J6110J8804K2076K6476L0212L0489K6754K1281J6408
56819G87790J2512Q983N890L865L102L158L475L705L831M144M847N795O922Q577
56805H66596J0884J3262J5387J8208K2882K8875L4109L6611L5019K8221J6543
56794A126597L241p360j3817j8027k1399k2785k1141j8037j5661j3689j0183m799
56782I62940O94M862Q136J1943J7331K4398L2228L9446M5278M9670N1994N0289
56770A299209M2670K9213J1959o354k2989l5569m2839m5166m3863m0365l6169
56759A109737l2598k9759k6343k1294j5256r651m844N5N846J2401J8854K4186
56747A031334K7863L0022L0448K7381J8629M651j0555k2650l0327l4746l6846
$$ plain form
56830 555829 566088 579180 595290 614094 636170 662646 692858 723347 750101 771382 787790
56819 787790 800302 809285 815175 819040 822142 825300 828775 832480 836311 840455 845302 851097 858019 866596
56805 866596 877480 890742 906129 924337 947219 976094 1010203 1046814 1081833 1110054 1126597
56794 1126597 1129838 1122478 1108661 1090634 1069235 1046450 1025309 1007272 991611 977922 967739 962940
56782 962940 963634 968496 976632 988575 1005906 1030304 1062532 1101978 1147256 1196926 1248920 1299209
56770 1299209 1341879 1371092 1383051 1376697 1353708 1318139 1275300 1230134 1186271 1145906 1109737
56759 1109737 1077139 1047380 1021037 999743 984487 974836 969992 970047 975893 988294 1007148 1031334
56747 1031334 1059197 1089219 1119667 1147048 1165677 1170328 1159773 1137123 1106796 1072050 1035204
56736A035204l6654l4594l1781k8878k5769k2355j8819j5216j1594q411n957l491
56724G91685J49M937R397J2137J3084J3006J2145R636M436l064j0578j5657j8021
56711H23292j9414k1133k2549k2450k0913j9076j7748j6937j6248j5093j2970
56700F18761j0158p803o908p482q776r724r198o899m252l276m065m499l076p45
56686E31900P27J034R28P27L61L9r9l04m45O1Q39M07j577l231k953j671j193j626
56668E23924k025k412l214l709l088k247k592l633l863l403l641m493m346k832
56654D78426j595j847k815l072k152n77N80K06j691l527l918l463l462l673l032
56639D44388j998k050l083l478k701j809j307o54r6p73k458l324k645j802j929
$$ plain form
56736 1035204 998550 963956 932175 903297 877528 855173 836354 821138 809544 801133 795176 791685
56724 791685 791834 796771 806168 818305 831389 844395 856540 866176 870612 867548 856970 841313 823292
56711 823292 803878 782745 760196 737746 716833 697757 680009 663072 646824 631731 618761
56700 618761 608603 600800 593892 586410 577634 567910 558712 551813 547561 544285 540220 535721 532645 531900
56686 531900 532627 533661 534589 535316 535677 535716 535617 535313 534868 534929 535768 536175 534598 531367 528414 526743 525550 523924
56668 523924 521899 519487 516273 512564 509476 507229 504637 501004 497141 493738 490097 485604 481258 478426
56654 478426 476831 474984 472169 469097 466945 466368 466948 467154 465463 461936 458018 454555 451093 447420 444388
56639 444388 442390 440340 437257 433779 431078 429269 427962 427308 427212 426439 423981 420657 418012 416210 414281
56624D14281k321k052j426q78M6J553K819L188L130L289L668M281N355O374O270
56609D47577N031L865L413L232L305M242N510N536M357M094N649P031O569N758
56595E15169O891R328J0448R442P972P513P982Q882J0024J1009J1245J0705R789
56582F36399Q489O559M292K266L95j850m446o781q511r772j0539j0540r878r193
56568E86890r078r501r803r155p375n428m754n652o722o299m304k406k322m049
56554E00042n834n973m619l412l227l142k016k46J025J542J644J177J89l8J568
56539D78680L733M004K119J96l86m03p91j301j647k036k064r16P15J023L5k4J674
56522D82611K952K013J89m13n3j16l81K11J319J884K161K986L865L811L477M414
$$ plain form
56624 414281 411960 409908 408482 407604 407650 409203 412022 415210 418340 421629 425297 429578 434933 441307 447577
56609 447577 452608 456473 459886 463118 466423 470665 476175 481711 486068 490162 495811 502842 509411 515169
56595 515169 522060 531388 541836 551278 559250 566763 574745 583627 593651 604660 615905 626610 636399
56582 636399 644888 651447 655739 658005 658400 656550 652104 645323 636812 627040 616501 605961 596083 586890
56568 586890 577812 568311 558508 549353 541978 536550 531796 526144 519422 513123 508819 506413 504091 500042
56554 500042 494208 488235 483616 480204 476977 473835 471819 471573 472598 474140 475784 476961 477150 477112 478680
56539 478680 482413 486417 488536 488732 488346 487943 487152 485851 484204 482168 480104 479188 479903 480926 480961 480937 482611
56522 482611 485563 487576 487765 487352 487299 487183 486802 487013 488332 490216 492377 495363 499228 503039 506516 510930
56506E10930O508Q005P958P140O608O740P629R217J1068J2784J4306J5291J5049
56493F39233J3884J3334J3897J3805J1501Q139N870M874M120L867M787N250K658
56480G45219k387o099o482n852p214j0160j2005j1493r758q359p866q139q863
56467F40542r662j0179j0188r618q661p775p213o665n774m914m848n636o432o458
56453E36519n874n495n896o686o758n591m204m061m990n268m105k784k597l019
56439D69191l011k925l542m271l954k874k209j935j052K67O56j43o97j1J197J864
56423D46551J993K071K153K144K189K400K683L064L544L595K614R71q4J95J436
56408D77519K872M009M633M962N699P215Q656Q829P938P425P929Q403P639N833
$$ plain form
56506 510930 517438 525443 533401 540541 547149 553889 561518 570735 581803 594587 608893 624184 639233
56493 639233 653117 666451 680348 694153 705654 713793 719663 724537 728657 732524 737311 742561 745219
56480 745219 742832 736733 730251 724399 717185 707025 695020 683527 673769 665410 657544 649405 640542
56467 640542 630880 620701 610513 600895 592234 584459 577246 570581 564807 559893 555045 549409 542977 536519
56453 536519 530645 525150 519254 512568 505810 500219 496015 491954 486964 481696 477591 474807 472210 469191
56439 469191 466180 463255 459713 455442 451488 448614 446405 444470 443418 443685 444341 444198 443501 443490 444687 446551
56423 446551 448544 450615 452768 454912 457101 459501 462184 465248 468792 472387 475001 475972 475888 476083 477519
56408 477519 480391 484400 489033 493995 499694 506909 515565 524394 532332 539757 547686 556089 563728 569561
56394E69561M216L738M431N565O121N554M305L263K691K096J063l02j631k530
56380F08141k667k114j522j459j772k040k374l155m276n314o140o717o719o131
56366E55741n754o125o266m809k251p95j651l692n079n154m258k753j091q3j35
56351E05845m25K48J726K324Q21j738k880j532O46J108q05l618n783o808o489
56336D82640m480j380R76J306L80j9Q33K120K599J645k51j586j021J181L544N399
56320D93886P496J0261J2708J3782J3597J2625J0861Q635O905N713L743O94j289
56307E99617j98K811M703M120K184L94n86n82J65J019J795L013M449M626K966
56292F30496J259J447K969L943L830L260K389J374J352K752L676K356L16M39K507
$$ plain form
56394 569561 573777 577515 581946 587511 593632 599186 603491 606754 609445 611541 612604 612302 610671 608141
56380 608141 605474 603360 601838 600379 598607 596567 594193 591038 586762 581448 575308 568591 561872 555741
56366 555741 549987 543862 537596 532787 530536 529741 528090 524398 519319 514165 509907 507154 506063 505980 505845
56351 505845 505420 505668 507394 509718 510539 508801 505921 504389 505035 506143 505338 501720 495937 489129 482640
56336 482640 478160 476780 477756 479062 479442 479423 480256 482376 484975 486620 486369 484783 483762 484943 488487 493886
56320 493886 501382 511643 524351 538133 551730 564355 575216 583851 590756 596469 600212 600906 599617
56307 599617 599419 602230 606933 611053 613237 613631 613045 612463 612628 613647 615442 618455 622904 627530 630496
56292 630496 631755 633202 636171 640114 643944 647204 649593 650967 652319 655071 658747 661103 661419 661858 664365
56277F64365L431J853l17j033k72J279L335N269O222O439O903P501P338O807P342
56262G26462R046J0556J1366J2263J3269J3248J1929J0470R709R544J0047J1247
56250H59156J1965J1117J0165J1791J5841J9030J9266J7896J6997J6798J6645
56239A026667J6406J5914J4843J3856J4146J5270J5368J3968J2559J1895J1103
56228A181995J0037J0093J1679J3239J4017J5524J8820K2473K4695K5852K7311
56217A375735K9465L2163L5688L9991M4275M8267N2621N7232O1026O4320O9488
56206A910271P7854Q7653R6368J03706J10967J19104J28813J40974J55202J69125
56196C100037J80759J90864K01614K13660K25723K36425K45250K51980K56088
$$ plain form
56277 664365 667796 669649 669332 668299 668027 669306 672641 677910 684132 690571 697474 704975 712313 719120 726462
56262 726462 735508 746064 757430 769693 782962 796210 808139 818609 828318 837862 847909 859156
56250 859156 871121 882238 892403 904194 920035 939065 958331 976227 993224 1010022 1026667
56239 1026667 1043073 1058987 1073830 1087686 1101832 1117102 1132470 1146438 1158997 1170892 1181995
56228 1181995 1192032 1202125 1213804 1227043 1241060 1256584 1275404 1297877 1322572 1348424 1375735
56217 1375735 1405200 1437363 1473051 1513042 1557317 1605584 1658205 1715437 1776463 1840783 1910271
56206 1910271 1988125 2075778 2172146 2275852 2386819 2505923 2634736 2775710 2930912 3100037
56196 3100037 3280796 3471660 3673274 3886934 4112657 4349082 4594332 4846312 5102400
56187E102400K56651K52703K43902K30710K13347J91109J63773J32964J00769
56178F888328O7735L4004J635k6729n1107p3438r3762j10136j22392j32834j42417
56167F238887j49436j53126j55660j59152j63279j67228j71369j75494j77789
56158D766354j77275j75311j73353j71201j68607j66321j64264j60906j55706
56149C253410j49968j44137j36803j27677j18914j11899j05264r7667q9949q2910
56139B088222p5568o7511o0396n5195n0539m5661m2180m0806l9116l5255l1052
56128A544943k8822k7490k4857k1363j8569j5977j2621r882r448r929q714n971
56116A351300l792k365l0L551O960R293J0625J0921J0380J0141J0954J2142J3229
$$ plain form
56187 5102400 5359051 5611754 5855656 6086366 6299713 6490822 6654595 6787559 6888328
56178 6888328 6956063 6990067 6991702 6964973 6913866 6840428 6746666 6636530 6514138 6381304 6238887
56167 6238887 6089451 5936325 5780665 5621513 5458234 5291006 5119637 4944143 4766354
56158 4766354 4589079 4413768 4240415 4069214 3900607 3734286 3570022 3409116 3253410
56149 3253410 3103442 2959305 2822502 2694825 2575911 2464012 2358748 2261081 2171132 2088222
56139 2088222 2012654 1945143 1884747 1829552 1779013 1733352 1691172 1650366 1611250 1575995 1544943
56128 1544943 1516121 1488631 1463774 1442411 1423842 1407865 1395244 1385362 1375914 1365985 1357271 1351300
56116 1351300 1347508 1345143 1345113 1348664 1355624 1364917 1375542 1386463 1396843 1406984 1417938 1430080 1443309
56103A443309J5017J7746K0024K1289K3191K6505K9079K9213K8813L0360L2843
56092A717389L3689L3005L2744L3192L3479L4259L6819M0391M3250M5595M8892
56081B132704N3372N8731O6162P7003R0239J03816J17435J31646J45151J55359
56071C131618J60736J60628J54172J41776J26671J12752J01701R3585Q8230Q3828
56061D355697P6226O2407M3641K3281L312j5021k9603l9563m7292n5854o5994
56050D311237p7738r2276j09322j24940j35253j40503j42603j41054j34693j25304
56040C087551j15786j06218r5239q3697p3654o5058n6484m7900m0132l3131k7073
56029B343179k2962k0045j5411q570l174j416n87J557K446l3k473j316P57k43
$$ plain form
56103 1443309 1458326 1476072 1496096 1517385 1540576 1567081 1596160 1625373 1654186 1684546 1717389
56092 1717389 1751078 1784083 1816827 1850019 1883498 1917757 1954576 1994967 2038217 2083812 2132704
56081 2132704 2186076 2244807 2310969 2387972 2478211 2582027 2699462 2831108 2976259 3131618
56071 3131618 3292354 3452982 3607154 3748930 3875601 3988353 4090054 4183639 4271869 4355697
56061 4355697 4431923 4494330 4537971 4561252 4564564 4549543 4519940 4480377 4433085 4377231 4311237
56050 4311237 4233499 4141223 4031901 3906961 3771708 3631205 3488602 3347548 3212855 3087551
56040 3087551 2971765 2865547 2770308 2686611 2612957 2547899 2491415 2443515 2403383 2370252 2343179
56029 2343179 2320217 2300172 2284761 2276191 2273017 2271601 2271014 2272571 2275017 2274984 2272511 2271195 2271952 2271709
56015B271709k034k0M161N196L168L007O065Q975J0296J2005J4602J6479J7981
56002B371590K0889K4421K6499K8096L1375L4836L5524L4693L5890L8673L9870
55991B722356L9732M1086M3547M4482M4604M6712M9882N0792M9896N0421N2362
55980C235872N3259N3854N6919O1542O4486O5980O8432P1021P1725P2750P7342
55969C953182Q3172Q5821Q6813R0940R7568J02386J05977J12541J21538J28876
55959D968814J34987J43556J53522J60780J66546J75539J87284J97881K08472
55950F497381K22760K37866K47834K54780K66457K83883L01690L19240L40496
55941H972387L64038L84720M04475M29908M59925M87392N12320N41260N74512
$$ plain form
56015 2271709 2269675 2269655 2273816 2279012 2282180 2285187 2291252 2300227 2310523 2322528 2337130 2353609 2371590
56002 2371590 2392479 2416900 2443399 2471495 2502870 2537706 2573230 2607923 2643813 2682486 2722356
55991 2722356 2762088 2803174 2846721 2891203 2935807 2982519 3032401 3083193 3133089 3183510 3235872
55980 3235872 3289131 3342985 3399904 3461446 3525932 3591912 3660344 3731365 3803090 3875840 3953182
55969 3953182 4036354 4122175 4208988 4299928 4397496 4499882 4605859 4718400 4839938 4968814
55959 4968814 5103801 5247357 5400879 5561659 5728205 5903744 6091028 6288909 6497381
55950 6497381 6720141 6958007 7205841 7460621 7727078 8010961 8312651 8631891 8972387
55941 8972387 9336425 9721145 10125620 10555528 11015453 11502845 12015165 12556425 13130937
55932A3130937O06472O37880O74847P16580P57160P98201Q45996Q98080R47678
55923B0013831R99356J063866J139298J214720J290565J376547J471395J565635
55915C0135213J663707J781312J920974K072962K239886K435508K659170K898864
55907D7807596L161485L472221L842789M270512M769898N371330O086348O910658
55899H5692837P862600Q975774J0249448J1652954J3184599J4876751J6743203
55892A69238166J8785606K1050494K3594513K6384279K9313272L2242889L4717685
55885C55326904L5482876L2636498K4865586J2823680q49294j3064590k1947550
55878D25274110k7260786k9707765l0152605k9317891k7754871k5823526k3718412
$$ plain form
55932 13130937 13737409 14375289 15050136 15766716 16523876 17322077 18168073 19066153 20013831
55923 20013831 21013187 22077053 23216351 24431071 25721636 27098183 28569578 30135213
55915 30135213 31798920 33580232 35501206 37574168 39814054 42249562 44908732 47807596
55907 47807596 50969081 54441302 58284091 62554603 67324501 72695831 78782179 85692837
55899 85692837 93555437 102531211 112780659 124433613 137618212 152494963 169238166
55892 169238166 188023772 209074266 232668779 259053058 288366330 320609219 355326904
55885 355326904 390809780 423446278 448311864 461135544 460286250 447221660 425274110
55878 425274110 398013324 368305559 338152954 308835063 281080192 255256666 231538254
55871B31538254k1573524j9519237j7641232j5954362j4446094j3105811j1902850
55864A17395144j0786685r732224q753553p861970p043187o285838n598954m987772
55856E6344961m439741l946255l513428l141028k813714k522802k275252k072164
55848C1620577j898554j743005j608605j496358j395803j300234j214460j139799
55840A9823759j067091r91976r22224q62832q07792p52954p03204o60647o19013
55831A2436026n76190n39381n11631m85542m56635m30884m12420l95240l73925
55822H254178l52236l34456l17778k99460k82582k69026k55186k39602k26401
55813E677451k16638k05026j89648j76155j67658j59382j48176j38541j33892
$$ plain form
55871 231538254 209964730 190445493 172804261 156849899 142403805 129297994 117395144
55864 117395144 106608459 96876235 88122682 80260712 73217525 66931687 61332733 56344961
55856 56344961 51905220 47958965 44445537 41304509 38490795 35967993 33692741 31620577
55848 31620577 29722023 27979018 26370413 24874055 23478252 22178018 20963558 19823759
55840 19823759 18756668 17764692 16842468 15979636 15171844 14418890 13715686 13055039 12436026
55831 12436026 11859836 11320455 10808824 10323282 9866647 9435763 9023343 8628103 8254178
55822 8254178 7901942 7567486 7249708 6950248 6667666 6398640 6143454 5903852 5677451
55813 5677451 5460813 5255787 5066139 4889984 4722326 4562944 4414768 4276227 4142335
55804D142335j30198j23805j17742j14698j11288j05067j00343j01342j05581
55795C132271j08993j11722j14107j13012j07022r9864r4429q8795q1789p6500
55785B136038p4210p0888o4027n7253n3912n1670m7717m3734m1344l8037l2051
55774A561195k6275k3002j9796j4729j0649r925r845p703n632o003o672n511n254
55761A410199q963j4546j8335k0628k3346k5782k6841k8057l0224l0514k7071
55750A155892k3257k3086k5393k6444k5424k3559k0765j7038j4491j4197j3531
55739I28707j0128n940l996l830l454l255m343n430m775l155j922l84K073L675
55725H83843L051J835J709J397m84k309k272j867l149m938n050m399n628r183
$$ plain form
55804 4142335 4012137 3888332 3770590 3655892 3544604 3439537 3339194 3237852 3132271
55795 3132271 3023278 2911556 2797449 2684437 2577415 2477551 2383122 2294327 2212538 2136038
55785 2136038 2061828 1990940 1926913 1869660 1815748 1764078 1716361 1672627 1631283 1593246 1561195
55774 1561195 1534920 1511918 1492122 1477393 1466744 1456819 1446974 1439271 1433639 1427636 1420964 1415453 1410199
55761 1410199 1401236 1386690 1368355 1347727 1324381 1298599 1271758 1243701 1213477 1182963 1155892
55750 1155892 1132635 1109549 1084156 1057712 1032288 1008729 987964 970926 956435 942238 928707
55739 928707 918579 912639 908643 904813 901359 898104 893761 888331 883556 880401 878479 878095 880168 883843
55725 883843 886894 888729 890438 891835 891351 889042 886770 884903 881754 876816 871766 867367 861739 852556
55711H52556j3407j6982j8981j8448j6192j4864j5254j4794j1757q167o308n440
55699F91962m561n290q776j2634j4386j5316j7492j9373j8215j4906j2684j2515
55687E35814j3122j4045j5363j5735j3954j1443j0324j0171r274p847p226p094
55675D00216o191m713l680k937j959j366j676j915j364j143k188l501m189n146
55661C58248o768p391o234n347o094o341m162j758k185m297m581k423J8J667K851
55646C05203L028J745P64J964L988M163K726J986K191J512n60k791m591n974n915
55631C09439l619p73L95N83K134M970O807O865O503O456O207N853O056O485O473
55616C70834O609P405P426N306K602J721J958O26k512n159o252o558n949l584
$$ plain form
55711 852556 839149 822167 803186 784738 768546 753682 738428 723634 711877 703710 697402 691962
55699 691962 687401 682111 673335 660701 646315 630999 613507 594134 575919 561013 548329 535814
55687 535814 522692 508647 493284 477549 463595 452152 441828 431657 422383 414536 407310 400216
55675 400216 394025 389312 385632 382695 380736 379370 377694 375779 374415 373272 371084 367583 363394 358248
55661 358248 351480 344089 337855 332508 326414 320073 315911 314153 311968 307671 303090 300667 300685 302352 305203
55646 305203 308231 309976 310740 312704 316692 320855 323581 325567 327758 329270 328710 325919 321328 315354 309439
55631 309439 305820 305047 305442 306025 308159 313129 319936 326801 333304 339760 345967 351820 357876 364361 370834
55616 370834 377443 384848 392274 397580 400182 401903 403861 404487 401975 396816 390564 384006 378057 374473
55602C74473p72j50j662k531j673r06j164q72P73J920J090l13j92J285K393K209
55586C73908J088j24o02j09M65J2j367k798m164n790o927o488n124m734n613n972
55570C25661m661k760j958k743m692p131r049r448q452p269o896p397q258q727
55556B36220q174o962o343o597o156l935j581j515l356m375l311j646r52q97m20
55541A80000N69J367J355M84n09m38R46K370K575J874J047k74k689n099n664m363
55525A73551l065l079m002m804m711l291j005N53K33j141k009k233k692l402l651
55510A35252l497l449l096j796k70K58J27N71J301Q20r96k575k983k673j797R6
55494A15293K275K740Q04j681k516j516q1N55J49p71j425j485j398j677k187k560
$$ plain form
55602 374473 373701 373551 371889 369358 367685 366779 365615 364743 365516 367436 368526 368213 368021 369306 371699 373908
55586 373908 374996 374872 374270 374161 374626 374638 373271 370473 366309 360519 353592 347104 341980 337246 331633 325661
55570 325661 321000 318240 316282 313539 308847 301716 292667 283219 274767 267498 260602 253205 244947 236220
55556 236220 228046 221084 214741 208144 201988 198053 196472 194957 191601 187226 183915 182269 181317 180420 180000
55541 180000 180569 181936 183291 183775 183266 182828 183774 186144 188719 190593 191640 191366 188677 183578 177914 173551
55525 173551 170486 167407 163405 158601 153890 150599 149594 150147 150380 149239 147230 144997 142305 138903 135252
55510 135252 131755 128306 125210 123414 123144 123402 123529 124100 125401 126221 125225 122650 119667 116994 115197 115293
55494 115293 117568 120308 121112 119431 116915 115399 115318 115873 116022 115251 113826 112341 110943 109266 107079 104519
55478A04519k705k405j256K44O25n73j716j284k9L87j90r31j731k578k323j96
55462H7858K237K837J868J013L51j184k898k811r79L89L50K57J033J951K708M273
55446I9253O725Q272P590N566L912L199K924K453J480M10J28M30n14l578o414
55431A31836n979k880o72r47j831j621j093j388k053k408k838l470l361k074p04
55416I8517k91n07o15m57LQ39J399Q05m37r01o11j101k646l385k085l8R16P26
55398I0131M79O97J256J920K153J326k15j210j078m50l4j4o10j720k059m10K097
55381I2259K861J390k6J42O77J11r23j267j383k218l065k310K50L067M501M150
55365I8216K957K361K833L229K322O44l58o90j589l040l525k511j261o95l81j94
$$ plain form
55478 104519 101814 99409 98153 98397 99022 98449 96733 95449 95420 95807 95617 94686 92955 90377 88054 87858
55462 87858 90095 92932 94800 95813 96164 94980 92082 89271 88292 88681 89031 89288 90321 92272 94980 99253
55446 99253 105978 114250 121840 127406 131318 134517 137441 139894 141374 141784 141912 142342 141828 138250 131836
55431 131836 125857 122977 122305 121358 119527 117906 116813 115425 113372 110964 108126 104656 101295 99221 98517
55416 98517 98226 97719 97104 96647 96650 97489 98888 99693 99256 98355 97744 96643 93997 90612 88527 88489 89405 90131
55398 90131 90610 91307 92563 94483 96636 97962 97747 96537 95459 95009 94975 94961 94351 92631 90572 90162 92259
55381 92259 95120 96510 96484 96626 97303 97414 96491 95224 93841 91623 88558 86248 86498 89565 94066 98216
55365 98216 101173 103534 106367 109596 111918 112562 112204 111514 109925 106885 103360 100849 99588 98893 98512 98318
55349I8318q66k133k494j696j467k537l114j726L40J153J013J374K197K351J656
55334I2369P64k17j408k066j372M7O56q0j251j661q57O58J719J563Q36P79J303
55317I1782J038l19j231n07J028J935J896J170l67k539m232m539l722k295j95
55302G8903K206L515K937J657J337J817J407q47m007o155n990l838j286M30J395
55287G3481K000J730K59j058p34K35m57k694l751k334k03Q67J278J717J590O96
55271G2622K60P65Q23l48j324q88L4L87Q47J790J607o68k899k451O0J981K263
55254G4861J735R29l1m16Pj36j786l331k795j060m60j044q61O06J877K076J700
55237G1871J042j8q08n83k16j049k351k196p35j10r82j557o39N75O45q4n29m91
$$ plain form
55349 98318 97452 95319 92825 91129 89662 87125 84011 82285 82625 83778 84791 86165 88362 90713 92369
55334 92369 93133 92916 91508 89442 88070 88117 88773 88693 87442 85781 84924 85582 87301 88864 89700 90479 91782
55317 91782 92820 92501 91270 90763 91791 93726 95622 96792 96425 93886 89654 85115 81393 79098 78903
55302 78903 81109 84624 87561 89218 90555 92372 93779 92932 88925 82770 76780 72942 71656 72086 73481
55287 73481 75481 77211 77470 76412 75678 75913 75456 72762 69011 66677 66474 67341 68619 70336 71926 72622
55271 72622 72882 73647 74470 74122 72798 71910 71944 72331 73178 74968 76575 75907 73008 70557 70617 72598 74861
55254 74861 76596 77525 77494 77078 77085 76949 75163 71832 69037 67977 67517 66473 65612 66218 68095 70171 71871
55237 71871 72913 72895 72087 71504 71288 70239 67888 65692 64957 64847 63865 62308 61669 62244 62889 62805 62276 61785
55219F1785k93mK65J92J0N04J832L141L763L931L996L688K682J315L40J09K29
55202H7485L5n00o13j0K82o29j513m04J903K190m74k955k602j026j006j996j727
55185G6440n12l60r19j99J258P71j675k826j197Q17J047M68M33M3j549k780k104
55168F7156q64j143k110j273J349K991K065J37n52K15J217J811K267K588K207
55153G8061J023J8J99J149J426M21r10j475j237m21J288L647M914L584O49j448
55137I0888j873j901k438k750k017o27O25J463J701J011k51r64n83K10O10O89
55121H3793R04J318J756J998J537p8k268l483k817j080J71K11n29j229j490j536
55105G7178j833k364k423j499j39O19N25K78M71R75J304J131M81k47n34l21l4
$$ plain form
55219 61785 61492 61488 61753 61945 61955 62459 64291 67432 71195 75126 79122 82810 85492 86807 87147 87256 87485
55202 87485 87520 87020 86407 86397 86679 86050 84537 84133 86036 88226 87752 84797 82195 81169 80163 78167 76440
55185 76440 75928 75568 74649 74450 75708 76479 74804 71978 70781 71598 72645 73113 73546 73589 72040 69260 67156
55168 67156 66292 65149 63039 61766 63115 66106 68171 68308 67756 67971 69188 70999 73266 75854 78061
55153 78061 79084 79102 79301 80450 81876 82297 81387 79912 78675 78254 79542 83189 88103 91687 92336 90888
55137 90888 89015 87114 84676 81926 79909 79282 79907 81370 83071 84082 83831 82867 82284 82494 83104 83793
55121 83793 84697 86015 87771 89769 91306 91228 88960 85477 82660 81580 81751 81962 81433 80204 78714 77178
55105 77178 75345 72981 70558 69059 68920 69539 70064 70342 70813 71788 73092 74223 74704 74457 73923 73602 73568
55088G3568J62N41R97Q56J3p01r02j197j594p62J688L628L017R59L9M92M93k78
55070H1019k49Q31J096l22j835k027j531j253p74K00O42p4p66j99J057J906K522
55053H0243L327L397J749n29j244R0J857K669K672K576K622K763K884K602J552
55038A09230J39n31K91K263M294N328M858L148J109k37m20J95P08L77p74k018
55022A27960k621k408j634o86p1k21q77j101l94O25J166J360J655J751J059r9
55006A25464q68j157j413j346k50J366J833N17j277k098k110k394l265l979l696
54991A05327k231k33J112R11n31j848j754j03K048L168K433N71p73q56n84j026
54975A05631j954k462k297j689n85R19K113K646L218M203M494L178J460J129J902
$$ plain form
55088 73568 73730 74271 75268 76124 76137 75436 74534 73337 71743 70981 72669 76297 79314 80273 80312 80804 81297 81019
55070 81019 80770 81601 82697 82375 80540 78513 76982 75729 74955 75155 75797 75723 74957 74758 75815 77721 80243
55053 80243 83570 86967 88716 88187 86943 87033 88890 91559 94231 96807 99429 102192 105076 107678 109230
55038 109230 109369 108838 109129 111392 115686 121014 125872 129020 130129 129892 129472 129667 130375 130752 129978 127960
55022 127960 125339 122931 121297 120611 120540 120319 119442 118341 117947 118572 119738 121098 122753 124504 125563 125464
55006 125464 124596 123439 122026 120680 120430 121796 123629 124146 122869 120771 118661 116267 113002 109023 105327
54991 105327 103096 102863 103975 104886 104355 102507 100753 100650 102698 105866 108299 108870 108097 107241 106657 105631
54975 105631 103677 101215 98918 97229 96644 97563 99676 102322 105540 109743 114237 117415 118875 120004 121906
54960A21906K246K162K795L684K982O29j190j249o39m75m98o18j469k452j616
54945A26198J279L658L545K174J662J969J891J500J552J581N68j141k293k561
54931A41582k579k620k462k176j926j517r31o75q31n71L87P95m32k292k713j080
54915A19959J313K956L305K650J627P16j69j212j716n65J893L705L654K629J835
54900A42580J067j05p13M38K675M069L782K630J687J471K173L650N235O243O541
54885A83423O336N966O108P344R155J0375J1076J2664J5405J7375J6969J5114
54873C17310J3624J2582J0837Q024M581N72l951q089j0979j2885j4191j4287j2927
54860B90221j1637j1920j2827j2251j0123q226p249o195m753m116m870n766n290
$$ plain form
54960 121906 124152 126314 129109 132793 135775 136404 135214 133965 133326 132851 132353 131735 130266 127814 126198
54945 126198 127477 131135 134680 136854 138516 140485 142376 143876 145428 147009 147577 146436 144143 141582
54931 141582 139003 136383 133921 131745 129819 128302 127371 126696 125865 125294 125681 126476 126044 123752 121039 119959
54915 119959 121272 124228 127533 130183 131810 132526 132357 131145 129429 128864 130757 134462 138116 140745 142580
54900 142580 143647 143542 142829 143267 145942 150011 153793 156423 158110 159581 161754 165404 170639 176882 183423
54885 183423 189759 195725 201833 209177 218332 228707 239783 252447 267852 285227 302196 317310
54873 317310 330934 343516 354353 362377 366958 367530 363579 355490 344511 331626 317435 303148 290221
54860 290221 278584 266664 253837 241586 231463 223237 215988 209793 205040 200924 196054 190288 184998
54847A84998l298o90J567K795L011L211M373O208P631Q333Q933R782J0773J2056
54833B59683J3784J5191J5184J3870J2339J0862Q424M268j097o409j0409j2234
54821C23456j2117j1678j2442j4149j5290j5041j3716j1659r127p069o658p798
54809A86712r135r556q744o704m013k173k129k671j942k81K96o05j271r82j123
54794A35679k247k423j74K760L536J883j50j181j361q96K56J220M64k141m635
54779A30590m935k999p63j93j483k900k533m59J266J060k74q60m52n75j864k721
54763A09905j479J092K693K569K166K556K739J482l70r37o4P07P79J233K490L131
54747A30692K174J003J478L122L807K747J289R50J960L606M913N056M176L701
$$ plain form
54847 184998 181700 181010 182577 185372 188383 191594 195967 202175 209806 218139 227072 236854 247627 259683
54833 259683 273467 288658 303842 317712 330051 340913 349337 353605 352508 346099 335690 323456
54821 323456 311339 299661 287219 273070 257780 242739 229023 217364 208237 201168 194510 186712
54809 186712 177577 168021 159277 152573 148560 146387 144258 141587 139645 139364 139660 139055 137784 136802 135679
54794 135679 133432 131009 130835 133595 137131 139014 138864 137683 136322 135426 135682 136902 137366 135225 130590
54779 130590 125655 122656 121893 121700 120217 117317 114784 114325 115591 116651 116377 115517 115065 114490 112626 109905
54763 109905 108426 109518 112211 114780 116946 119502 122241 123723 123353 122416 122352 123059 123838 125071 127561 130692
54747 130692 132866 133869 135347 138469 142276 145023 146312 147262 149222 152828 157741 162797 166973 170674
54733A70674M823O838P963P716P314P845R151J0609J1993J3288J4483J5637J6533
54720C04867J6407J4768J2324J0258Q787P314N546L415M21l499o895q178q050
54707C57485q763j0766j1864j0254o890m089l047l423m212m350l330j823q70l66
54693B83438O46K182L420M652P160J0555J2300J1152R247R289J1223J3446J5808
54680C94518J9132K2615K4134K3198K1641K0912K0126J7310J1655M156l248r001
54668E67148j2898j5843j8421k0202k0926k1520k2897k4245k3869k1559j8808
54657C45960j6726j4955j2960j1101r932r323q862q434p940p148o266n916o055
54644B20342n664m231k831k716l350l071j552l15m22r65o26J67r0j608k842k537
$$ plain form
54733 170674 175497 182335 190298 198014 205328 213173 222324 232933 244926 258214 272697 288334 304867
54720 304867 321274 336042 348366 358624 367411 374725 380271 383686 384107 380608 373713 365535 357485
54707 357485 348722 337956 326092 315838 308948 304859 301812 298389 294177 289827 286497 284674 283804 283438
54693 283438 284084 286266 289686 294338 301498 312053 324353 335505 344752 354041 365264 378710 394518
54680 394518 413650 436265 460399 483597 505238 526150 546276 563586 575241 579397 576149 567148
54668 567148 554250 538407 519986 499784 478858 457338 434441 410196 386327 364768 345960
54657 345960 329234 314279 301319 290218 280286 270963 262101 253667 245727 238579 232313 226397 220342
54644 220342 214678 210447 207616 204900 201550 198479 196927 196612 196190 195225 194599 194766 194676 193068 190226 187689
54628A87689j144R3O34P04O26O45R77J474J682J558J606J948J982J498J377K337
54612B05686L632L962L274K595K524K813L155L308K875K061K237M324O862P321
54598B56629N432L557L496M554N272N468N674N948O189O551O642N543L479K330
54584C26764L305N152N925N663N955P519R688J1823J3823J5406J6145J6324J6844
54571D60336J8254K0567K3663K6939K8898K8159K4860K0208J4825Q521J535n134
54559F71631j0781j5534j9614k2885k5158k6288k5864k3749k0881j8647j7312
54548D44918j6051j4595j3658j3262j2149r706p484p360q769r184p304m581l230
54535C17585l722m853n591n916o105o014n418m588m060l921l871m007n020p105
$$ plain form
54628 187689 186545 186638 187272 187976 188602 189247 190224 191698 193380 194938 196544 198492 200474 201972 203349 205686
54612 205686 209318 213280 216554 219149 221673 224486 227641 230949 233824 235885 238122 242446 249308 256629
54598 256629 262061 265618 269114 273668 278940 284408 290082 296030 302219 308770 315412 320955 324434 326764
54584 326764 330069 335221 341146 346809 352764 360283 369971 381794 395617 411023 427168 443492 460336
54571 460336 478590 499157 522820 549759 578657 606816 631676 651884 666709 675230 676765 671631
54559 671631 660850 645316 625702 602817 577659 551371 525507 501758 480877 462230 444918
54548 444918 428867 414272 400614 387352 375203 365497 358013 350653 341884 332700 325396 320815 317585
54535 317585 313863 309010 303419 297503 291398 285384 279966 275378 271318 267397 263526 259519 254499 247394
54521B47394q997q926o728m341l642m341m682l995l416l894m560l924k063n74
54507A83311n08j406k416l354m176m309l243j433K1M17k09j422k471k446r81J159
54491A56534K669K796J681rj359j502l20J302K374K752K856K832K617K404K327
54476A79954K080J645J900L508N536O396O054N984O882P776P762P401P681Q674
54462B59233R787J0554J0647R980R326R897J1587J2496J0958P378L351k21l315
54449C61658n877p899r941j2396j4435j4714j3163j1219j0136r805r341q274o874
54436B27584n706n105m928m726m206l435k608j811j072m28J53N89N56m0n40j81
54420A94096O60O89n56j965k356j858j238n21P87K593M153M894M655L405J516
$$ plain form
54521 247394 238397 229471 222743 218402 214760 210419 205737 201742 198326 194432 189872 185948 183885 183311
54507 183311 182803 181397 178981 175627 171451 167142 163899 162466 162487 162904 162695 161273 158802 156356 155375 156534
54491 156534 159203 161999 163680 163671 162312 160810 160490 161792 164166 166918 169774 172606 175223 177627 179954
54476 179954 182034 183679 185579 189087 194623 201019 207073 213057 219939 227715 235477 242878 250559 259233
54462 259233 269020 279574 290221 300201 309527 319424 331011 343507 354465 361843 365194 364973 361658
54449 361658 355781 347882 337941 325545 311110 296396 283233 272014 261878 252073 242732 234458 227584
54436 227584 221878 216773 211845 207119 202913 199478 196870 195059 193987 193559 193712 194301 194857 194817 194277 194096
54420 194096 194756 195445 194889 192924 190568 188710 187472 186951 187738 190331 194484 199378 204033 207438 208954
54405B08954N6P6J482L089L810L429K395J301N75L41M08N15M60P1o13j161j196
54388B23992j013j196j561j339n60k99j038j780j560r61j130j958k431k351k448
54373B02367k866k765j704n78o48k079l775m499m016l087k343j393M35K639L681
54358A79369K958J744J613K623L735M249M010K927J316K99O93J844K456K343K389
54343B14568L027L840M514N160N558N160M099L371L679M660N409N351M498L375
54329B76269K574K050J133k93j157o80l9j248m347o935o973n116l657l829m734
54314B43018m721l428k386l348n903p376n771k379l84j160l119m170l994l445
54300A91434k960k342j485o21j27l98j368k112j591p8R83Q50M65R69K132K923
$$ plain form
54405 208954 209010 209086 210568 213657 217467 220896 223291 224592 225167 225508 225916 226431 226891 226962 226349 225188 223992
54388 223992 222979 221783 220222 218883 218323 218024 216986 215206 213646 212685 211555 209597 207166 204815 202367
54373 202367 199501 196736 195032 194454 193806 191727 187952 183453 179437 176350 174007 172614 173049 175688 179369
54358 179369 182327 184071 185684 188307 192042 196291 200301 203228 204544 204843 205536 207380 209836 212179 214568
54343 214568 217595 221435 225949 231109 236667 241827 245926 249297 252976 257636 263045 268396 272894 276269
54329 276269 278843 280893 282026 281733 280576 279896 279857 278609 274262 267327 260354 255238 251581 247752 243018
54314 243018 238297 234869 232483 229135 223232 215856 210085 207706 207322 206162 203043 198873 194879 191434
54300 191434 188474 186132 184647 184026 183899 183501 182133 180021 178430 178352 179335 180185 180650 181619 183751 186674
54284A86674L022K841K508J858J305J674K962M068M209L976M317M859M165J864
54270B30302m19r79k90l44j865l496l926l583l422l256k485j654j856k963l817
54255A95947l985m031m127l803l146k853k894k549k121k974n139o389m919j869
54241A45148R8l8j063j593j351o83n4j4p31j433j150n4O68L32n01r68q71n57l10
54222A34875j83j01Q3L23J67p72k036k551j915r33m37m8J137K836L549K577J195
54205A37766J057K006K526K120J914K632L242K545J142N97J198J815J825J730
54191A64115J770J261j18j482j934j779j724j543n69Q58J470O27r06j905j884
54176A56257j193m08J22K87P0n06j218j487o44J310L289L788K172o32k749k735
$$ plain form
54284 186674 189696 192537 195045 196903 198208 199882 202844 206912 211121 215097 219414 224273 228438 230302
54270 230302 229883 228904 228614 228270 226405 222909 218983 215400 211978 208722 206237 204583 202727 199764 195947
54255 195947 191962 187931 183804 180001 176855 174002 171108 168559 166438 163464 158325 151936 147017 145148
54241 145148 145246 145208 144145 142552 141201 140518 140464 140450 139719 138286 137136 137082 137750 138082 137581 136613 135742 135185 134875
54222 134875 134692 134591 134674 134997 135164 134392 132356 129805 127890 126957 126520 126472 127609 130445 133994 136571 137766
54205 137766 138823 140829 143355 145475 147389 150021 153263 155808 156950 157547 158745 160560 162385 164115
54191 164115 165885 167146 167028 165546 163612 161833 160109 158566 157997 158855 160325 160952 160046 158141 156257
54176 156257 155064 154656 154778 155065 155135 154629 153411 151924 151280 152590 155879 159667 161839 161207 158458 155723
54160A55723o40K156M153M826M546L764K612J204p0q57j143j063n55M55J582J942
54144A78635Q77j175k729k492p51Q25R15r9p68l36N79P87l42k430m258m552l211
54127A59475j746j862l506m881m528k747p31Q91J995K211J224l14j126q38m05
54112A43112o17p40N19K899M295L075J00k121k045l12J511K407K102P15j048j977
54096A51875j487m73l62j427k649l175l209l374l734l720k790j067N56J042K26
54081A26232r56j495j342j084r91q87o62m46l59n35j070j521r23Q37K215J620
54065A18633l80j714j565j158j565k140j823p91J27Q40J664K176J486m06k338
54050A11046l106k419p38J208K794L619L489K356N59r48j167j86P68P94M19P37
$$ plain form
54160 155723 155083 157239 161392 166218 170764 174528 177140 178344 178274 177417 176274 175211 174656 175111 176693 178635
54144 178635 179512 178337 175608 173116 172365 173190 174105 174006 173238 172902 173481 174268 173926 171496 167238 162686 159475
54127 159475 157729 155867 152361 147480 142952 140205 139474 140365 142360 144571 145795 145481 144355 143517 143112
54112 143112 142495 141755 142274 145173 149468 152543 152643 150522 148477 148165 149676 152083 154185 154900 153852 151875
54096 151875 150388 149915 149553 148126 145477 142302 139093 135719 131985 128265 125475 124408 124964 126006 126232
54081 126232 125276 123781 122439 121355 120364 119477 118815 118369 118010 117475 116405 114884 113961 114798 117013 118633
54065 118633 118253 116539 114974 113816 112251 110111 108288 107497 107624 108464 110128 112304 113790 113384 111046
54050 111046 107940 105521 104783 105991 108785 112404 115893 118249 118808 117860 116693 116507 117275 118069 118488 119225
54034A19225J737K185J134r65k793l407k783j397L07J914K777K307O98r25j571
54019A18443j359j085r36l42R60K332L017K956K566K024J208K25m02j39R09J813
54003A32190J599L70o21m06N45J055P14R7k42p1R28K879M870N417M175K420J532
53986A57451J688K323L045L563L507K970K719L237L952L973L285K689K780L410
53972B00592M115M700N579P434J0241J2630J2800J0405P120N090N170O756Q634
53959C01266R630R042P118M945L535L251L924N019N528M584K604J052N60P8j394
53944C60742l045l326k398k204l815n844o160m657l424m087n818o568n810n111
53930B98475n760o897o809n226l322j964j238j418k797m479m808l460j857j072
$$ plain form
54034 119225 120962 123147 124281 123316 120523 117116 114333 112936 113243 115157 117934 120241 120939 120014 118443
54019 118443 117084 115999 115063 114721 115681 118013 121030 123986 126552 128576 129784 130009 129607 129468 130377 132190
54003 132190 133789 134159 133538 133132 133677 134732 135446 135543 135301 135230 136158 139037 143907 149324 153499 155919 157451
53986 157451 159139 161462 164507 168070 171577 174547 177266 180503 184455 188428 191713 194402 197182 200592
53972 200592 204707 209407 214986 222420 232661 245291 258091 268496 275616 280706 285876 292632 301266
53959 301266 310896 319938 327056 332001 335536 338787 342711 347730 353258 357842 360446 361498 362058 362136 360742
53944 360742 357697 354371 351973 349769 345954 340110 333950 329293 325869 321782 315964 309396 303586 298475
53930 298475 292715 285818 279009 273783 270461 268497 267259 265841 263044 258565 253757 250297 248440 247368
53916B47368n64L03R31O73K24O27J620K154J953J470Q91K62J21Q81J849J981J369
53899B64113R20Q52N65m8m40o48j560l431n058n052l414j294L79J426J858J568
53883B50736P92M24J241K960M519N378O019O835P241O526N176M495N107O547Q043
53868C22039Q888Q374O488M489L680L697L271K356K004K182J743Q53J272L318
53854C74654M758L946K189J492J835K528M327P729J0442R612O164M049M965O402
53840D45092N630L358K075K363K569J495l1n69j81m59k321m495n086m308m265
53825D40867n774p098o753n863o246p497p960p567p672q472q736q000p177o822
53811C39230o394n550m795m705n456p010q652q798o750m143l087l356l269k884
$$ plain form
53916 247368 246804 247107 248038 248711 248935 249562 251182 253336 255289 256759 257650 257912 258033 258914 260763 262744 264113
53899 264113 265033 265885 266450 266402 265962 265314 263754 260323 255265 250213 246799 245505 245884 247310 249168 250736
53883 250736 251528 251952 253193 256153 260672 266050 272069 278904 286145 292671 297847 302342 307449 313996 322039
53868 322039 330927 339301 345789 350278 353958 357655 360926 363282 365286 367468 369211 370064 371336 374654
53854 374654 379412 383358 385547 387039 388874 391402 395729 403458 413900 423512 429676 433725 438690 445092
53840 445092 450722 454080 456155 458518 461087 462582 462551 461982 461801 461342 459021 454526 449440 445132 440867
53825 440867 435093 427995 421242 415379 409133 401636 393676 386109 378437 369965 361229 353229 346052 339230
53811 339230 332836 327286 322491 317786 312330 305320 296668 287870 281120 276977 273890 270534 267265 264381
53797B64381l932o500q275p708n888m478l723l333l414l570k769j253q82k463
53783B06193m192m079k540j300q76o30l51l77o66r51j331j797j762r03J14M61
53767A85013J73k90p99j324j568j402r57n9J466K740K528J337J129K219K500R17
53751A93623l01J139L841M597K910J087N12M55M72J393L411N301O282O935P621
53736B39278P687O977O603P161P553O663N128M293M263M244M120M347M602L901
53722C16820K175O40K70P13J084J119J045Q94N48J82l4m91j689l202l781k862
53706C13431j373o90j157k127k932l310l210k786k447k248j613l24O89M78l12
53691B90069j99Q51J315N51k05J09O73K68o15n19O32J335N27j190k535k981k951
$$ plain form
53797 264381 260449 253949 245674 237966 232078 227600 223877 220544 217130 213560 210791 209538 208656 206193
53783 206193 202001 197922 195382 194082 193206 192576 192225 191848 191182 190231 188900 187103 185341 184438 184552 185013
53767 185013 185186 184896 184097 182773 181205 179803 178846 178787 180253 182993 185521 186858 187987 190206 192706 193623
53751 193623 193322 194461 198302 202899 205809 206896 207408 207863 208335 209728 213139 218440 224722 231657 239278
53736 239278 246965 253942 260545 267706 275259 281922 287050 291343 295606 299850 303970 308317 312919 316820
53722 316820 318995 319635 319905 320618 321702 322821 323866 324760 325308 325490 325456 324965 323276 320074 316293 313431
53706 313431 312058 311368 310211 308084 305152 301842 298632 295846 293399 291151 289538 289214 289903 290381 290069
53691 290069 289870 290721 292036 292587 292382 292491 293164 293432 292817 292298 292930 294265 294792 293602 291067 288086 285135
53674B85135l081l445l429k512j197o78j383k400k742k566k551k673k475k183
53660B51820k479l113k718m84K489M068L274J190l48p10o61p08j22J816M207N314
53644B62835M792L924L570L182K227J334J208J497J796K765N030P583Q586P645
53630C17974O168N509N747O240O469O077M863L107J561R18J347K427L366L590
53616C75363L305L118K881J581j089l742m686l915k809k187j607o40K00J37p45
53601C65165j560j557r29o19j241k250k496j720q80q57j459k095k649l097k904
53586C38852j714k07N32L81K35Q92K305L641L723J975n33j663m95J579K758L007
53570C55268L310L668L342K576K383K710K414J286O58J450K889L678L514K941
$$ plain form
53674 285135 282054 278609 275180 272668 271471 270793 269410 267010 264268 261702 259151 256478 254003 251820
53660 251820 249341 246228 243510 243026 245515 249583 252857 254047 253699 252989 252328 251620 251498 253314 257521 262835
53644 262835 267627 271551 275121 278303 280530 281864 283072 284569 286365 289130 294160 301743 310329 317974
53630 317974 324142 329651 335398 341638 348107 354184 359047 362154 363715 364633 365980 368407 371773 375363
53616 375363 378668 381786 384667 386248 385159 381417 376731 372816 370007 367820 366213 365573 365773 365910 365165
53601 365165 363605 362048 361119 360500 359259 357009 354513 352793 351913 351056 349597 347502 344853 341756 338852
53586 338852 337138 336931 337463 337844 338079 338971 341276 344917 348640 350615 350082 348419 347924 349503 352261 355268
53570 355268 358578 362246 365588 368164 370547 373257 375671 376957 377615 379065 381954 385632 389146 392087
53556C92087K476K410K749L120L259L652M871O263O458N386M549M891N635N948
53542D53754O360P456Q244P401N610N069O657Q807R498Q451O998O425O893P565
53528E55188P424O209M708L906L801L509K647K023K433L291L206J920P48O93J032
53513F02738M81p80j350o90K21N36O50J143J589J400J082J594K759L329K648J427
53497F18777P47R75J747K522K939K971K932L196L966N201O448O716N318L106K114
53482F69675L344N648P324Q005Q157P866P339P744R783J1908J1805R648Q072Q674
53468G84992J0247J1006J0854J0707J0921J1428J2361J3615J4612J5209J6085
53457I22037J7514J8794J9543K0571K2486K4495K5628K6265K7230K8189K8443
$$ plain form
53556 392087 394563 396973 399722 402842 406101 409753 414624 420887 427345 432731 437280 442171 447806 453754
53542 453754 460114 467570 475814 483215 488825 493894 500551 509358 518856 527307 534305 540730 547623 555188
53528 555188 562612 568821 573529 577435 581236 584745 587392 589415 591848 595139 598345 600265 601013 601706 602738
53513 602738 603219 602439 601089 600399 600620 601156 601806 602949 604538 605938 607020 608614 611373 614702 617350 618777
53497 618777 619524 620499 622246 624768 627707 630678 633610 636806 640772 645973 652421 659137 664455 667561 669675
53482 669675 673019 678667 685991 693996 702153 710019 717358 725102 734885 746793 758598 768246 776318 784992
53468 784992 795239 806245 817099 827806 838727 850155 862516 876131 890743 905952 922037
53457 922037 939551 958345 977888 998459 1020945 1045440 1071068 1097333 1124563 1152752 1181195
53446A181195K8679L0234L2798L4568L4893L5171L6573L8270L8921L8843L9443
53435A569588M1028M2450M2975M3329M4458M5943M6520M5720M4309M3118M2235
53424B051673M1667M1947M3422M5336M6427M6240M5200M3663M1796M0250L9824
53413B527445M0190L9992L8693L7402L7122L7176L6186L3984L1418K8676K5146
53402B913430K0833J6780J3657J0855P480L568k15l588o646r194j0849j1895j3355
53389B930861j5921j9170k2258k5045k7938l0821l2882l3797l4354l5355l6396
53378B616924l6529l5824l5417l5848l6249l5541l3878l2264l1102k9704k7360
53367B247208k4362k1687j9710j7712j4997j2166j0507j0038r072o336k762j51
$$ plain form
53446 1181195 1209874 1240108 1272906 1307474 1342367 1377538 1414111 1452381 1491302 1530145 1569588
53435 1569588 1610616 1653066 1696041 1739370 1783828 1829771 1876291 1922011 1966320 2009438 2051673
53424 2051673 2093340 2135287 2178709 2224045 2270472 2316712 2361912 2405575 2447371 2487621 2527445
53413 2527445 2567635 2607627 2646320 2683722 2720844 2758020 2794206 2828190 2859608 2888284 2913430
53402 2913430 2934263 2951043 2964700 2975555 2983035 2986603 2986388 2982800 2976154 2966960 2956111 2944216 2930861
53389 2930861 2914940 2895770 2873512 2848467 2820529 2789708 2756826 2723029 2688675 2653320 2616924
53378 2616924 2580395 2544571 2509154 2473306 2437057 2401516 2367638 2335374 2304272 2274568 2247208
53367 2247208 2222846 2201159 2181449 2163737 2148740 2136574 2126067 2116029 2106957 2100621 2097859 2097708
53355B097708J366L253O111Q745J0151J1219J3589J7490K1522K4333K5932K7469
53343B268888L0039L3571L6869L9000M0520M2827M6363N0130N3165N5632N8205
53332B755209O1028O3798O6333O8734P1443P5177P9999Q4247Q5548Q3654Q1364
53321C576534Q1673Q4568Q7492Q8500Q7859Q6861Q6097Q5106Q3077P9637P5259
53310D502663P0838O6797O2823N8514N3682M7843M0288L1306K2581J5546R795
53299D982676L939k531r079j5370k1630k8034l4653m1787m9313n6022o0724o3960
53287D603512o7441p1661p5293p7220p8019p8841p9831q0414q0372p9817p8567
53276C756036p6483p4158p2553p1953p1746p1276p0435o9317o7614o4673o0239
$$ plain form
53355 2097708 2099074 2102327 2108438 2117183 2127334 2138553 2152142 2169632 2191154 2215487 2241419 2268888
53343 2268888 2298927 2332498 2369367 2408367 2448887 2491714 2538077 2588207 2641372 2697004 2755209
53332 2755209 2816237 2880035 2946368 3015102 3086545 3161722 3241721 3325968 3411516 3495170 3576534
53321 3576534 3658207 3742775 3830267 3918767 4006626 4093487 4179584 4264690 4347767 4427404 4502663
53310 4502663 4573501 4640298 4703121 4761635 4815317 4863160 4903448 4934754 4957335 4972881 4982676
53299 4982676 4986615 4984084 4975005 4959635 4938005 4909971 4875318 4833531 4784218 4728196 4667472 4603512
53287 4603512 4536071 4464410 4389117 4311897 4233878 4155037 4075206 3994792 3914420 3834603 3756036
53276 3756036 3679553 3605395 3532842 3460889 3389143 3317867 3247432 3178115 3110501 3045828 2985589
53265B985589n4962n0026m6180m3227m0669l8500l6965l5807l4267l1952k9270
53254B543764k6888k5227k4500k4794k5600k5736k4189k1141j7830j5383j3924
53243B298552j2835j1541r828p629m979k291j64J416L366O369R771J2298J3832
53230B296337J5478J7797J9985K1417K2928K5711K9639L3613L7014L9782M1538
53219B601239M1871M1258M0500L9370L7145L4428L2940L3020L2603K9638K4561
53208B988573J9474J5659J2754R847O373K191k275o016q383j0050j2414j5893
53196B999840j9503k2302k4696k7792l1825l5746l8485m0002m0851m1222m1092
53185B636324m1191m2691m5423m7356m6827m4818m3834m4678m5625m4966m3154
$$ plain form
53265 2985589 2930627 2880601 2834421 2791194 2750525 2712025 2675060 2639253 2604986 2573034 2543764
53254 2543764 2516876 2491649 2467149 2442355 2416755 2391019 2366830 2345689 2327859 2312476 2298552
53243 2298552 2285717 2274176 2264348 2256719 2251740 2249449 2249285 2250701 2254067 2260436 2270207 2282505 2296337
53230 2296337 2311815 2329612 2349597 2371014 2393942 2419653 2449292 2482905 2519919 2559701 2601239
53219 2601239 2643110 2684368 2724868 2764238 2801383 2835811 2868751 2901771 2934374 2964012 2988573
53208 2988573 3008047 3023706 3036460 3046307 3052680 3054871 3052596 3046580 3038197 3028147 3015733 2999840
53196 2999840 2980337 2958035 2933339 2905547 2873722 2837976 2799491 2759489 2718638 2677416 2636324
53185 2636324 2595133 2552442 2507019 2459663 2412836 2368018 2324184 2279506 2233881 2188915 2145761
53174B145761m1707m1091m0551l9470l7947l6392l5168l4380l3373l0891k6478
53163A748313k1580j8488j8138j9432k0534k0229j8350j5602j3145j1745j1127
53152A559943j0513r752r472j0179j1753j3758j5671j6787j6560j5281j3828j2695
53140A403694j1819j1362j1804j2936j3632j3275j2729j3193j4590j5930j6809
53129A255615j7605j8398j8666j8242j7795j8038j9015k0281k1267k1419k0644
53118A044245j9737j9616j9959j9424j7670j6235j6654j8388j9575j9348j8286
53107H39353j6990j5468j3985j3304j3530j3789j3610j3844j5317j7199j7609
53096F74708j5803j3035j1183j0985j1736j2344j2373j2101j1655j0593q661o725
$$ plain form
53174 2145761 2104054 2062963 2022412 1982942 1944995 1908603 1873435 1839055 1805682 1774791 1748313
53163 1748313 1726733 1708245 1690107 1670675 1650141 1629912 1611562 1595960 1582815 1571070 1559943
53152 1559943 1549430 1539678 1530206 1520027 1508274 1494516 1478845 1462058 1445498 1430217 1416389 1403694
53140 1403694 1391875 1380513 1368709 1355773 1342141 1328866 1316137 1302944 1288354 1272424 1255615
53129 1255615 1238010 1219612 1200946 1182704 1164909 1146871 1127856 1107575 1086308 1064889 1044245
53118 1044245 1024508 1004892 984933 965509 947839 931604 914950 896562 876987 857639 839353
53107 839353 822363 806895 792910 779606 766076 752287 738677 724833 709516 692317 674708
53096 674708 658905 645870 634687 623702 611966 599622 587249 575148 563493 552900 544239 537514
53084E37514o136p042q069q103p589p510p741p285n884m428l792l943m325m514
53070D51153m464m524n143o204o746n950m248k905k574k863l277l765m198m153
53056C90139l510k787k612l186m338n559n997n133l595k570k236j674o58m22j962
53041C43900m455o253o742o253m822k271N83K181J852M36q88j657j939j872j628
53026C10172j268n20P74K029K457K290K537L318L537K738K216L269N075N549M048
53011C48221K128J372J602J639R92J14o00j267k048k801l374l833m196m181l570
52996C30198k717k379k916l853m366m086l330k800l170m644o418o883n042j907
52982B75687K11J41j016j640j840l015n358p005o161l390j058p04j719k554k535
$$ plain form
53084 537514 531378 524336 516267 508164 500575 493065 485324 478039 472155 467727 463935 459992 455667 451153
53070 451153 446689 442165 437022 430818 424072 418122 413874 410969 408395 405532 402255 398490 394292 390139
53056 390139 386629 383842 381230 378044 373706 368147 362150 357017 353422 350852 348616 346942 346284 345862 343900
53041 343900 339445 333192 326450 320197 315375 313104 313687 315868 317720 318156 317268 315611 313672 311800 310172
53026 310172 308904 308384 309158 311187 313644 315934 318471 321789 325326 328064 330280 333549 338624 344173 348221
53011 348221 350349 351721 353323 354962 355954 356068 355468 354201 352153 349352 345978 342145 337949 333768 330198
52996 330198 327481 325102 322186 318333 313967 309881 306551 303751 300581 295937 289519 282636 277594 275687
52982 275687 275898 276039 275023 273383 271543 268528 263170 256165 250004 246614 245556 244852 243133 240579 238044
52967B38044k044j571j244j296k096l330l770k619q31k51j364k741k969k326j889
52952B07703j700q01J114K945L323J927m09k448l364l142k375j519n95K38L45
52937B01242m71j166n07J219K566K899K825K601J516m69j793j083J009K808L666
52922B16862L944L572K149K59p86p20o61j316j958j699r30o51r10p32L91J635
52906B18449J807R20L22J052K389K740J849J161J653K269J553L4l06J231L162
52891B40285L804L080K029J379J115Q92M09k71p32p50o39m65N60K998N784P164
52875B66642P022O978P875Q655Q151O735N443M625M314M840N987O526N579L714
52861C53086J815j93k353l477k451k39J021O49k27p03j017j427j584j328j037
$$ plain form
52967 238044 236000 234429 233185 231889 229793 226463 222693 220074 219243 218992 217628 214887 211918 209592 207703
52952 207703 206003 205202 206316 209261 212584 214511 214102 211654 208290 205148 202773 201254 200659 200897 201242
52937 201242 200771 199605 199098 200317 202883 205782 208607 211208 212724 212255 210462 209379 210388 213196 216862
52922 216862 220806 224378 226527 226786 226000 225280 224619 223303 221345 219646 218716 218065 217155 216423 216814 218449
52906 218449 220256 221176 221498 222550 224939 227679 229528 230689 232342 234611 236164 236198 235892 237123 240285
52891 240285 244089 247169 249198 250577 251692 252584 252993 252722 251990 251240 250601 250136 250696 253694 259478 266642
52875 266642 273664 280642 288517 297172 305323 312058 317501 322126 326440 331280 337267 343793 349372 353086
52861 353086 354901 354708 352355 348878 346427 346188 347209 347858 347631 346928 345911 344484 342900 341572 340535
52846C40535q83p86j123k374l800l795j993n1L24p37j908k349k123j704j713k564
52830C12956l748l988k738r95l1J88N04J085J376J286J468K139K504J630l67k340
52814C10929l039k039q4J463J731J085N49N64O03J73k90J26J504K725K622J302
52798C19924J17K27J405K383K228J156K1o20o52P2J700L594M177K354r39l304
52782C33843l271j608P0J249K325L175L099K169J434J357J171L34k85M16K058
52767C47536L149K946K041J262Q51P61J043J626K046J716M30j325k521k409j342
52752C57810m88l76k88O29K043K889K716J978J266Q81R22J073N52j000k712l306
52736C64589k721k250k945m511n774n785m467k680j661j972l075m181n072n671
$$ plain form
52846 340535 339652 338866 337743 335369 331569 327774 325781 325730 326054 325317 323409 321060 318937 317233 315520 312956
52830 312956 309208 305220 302482 301487 301456 301644 302148 303233 304609 305895 307363 309502 312006 313636 313269 310929
52814 310929 307890 305851 305767 307230 308961 310046 310595 311159 311762 311935 311645 311771 313275 316000 318622 319924
52798 319924 320041 320268 321673 324056 326284 327440 327461 326841 326189 326261 327961 331555 335732 338086 337147 333843
52782 333843 330572 328964 329034 330283 332608 335783 338882 341051 342485 343842 345013 345347 345062 345478 347536
52767 347536 350685 353631 355672 356934 357785 358546 359589 361215 363261 364977 365407 364082 361561 359152 357810
52752 357810 357322 356946 356658 357287 359330 362219 364935 366913 368179 369060 369982 371055 371607 370607 367895 364589
52736 364589 361868 359618 356673 352162 346388 340603 336136 333456 331795 329823 326748 322567 317495 311824
52722C11824n491m488l827m556n771n495l414j375r58j907l321m903o296o475
52708B53547m930k720j403j422k223l257m048l983k911j652j124j244j353j261
52694B20016j237j337j542k168l288m038l398j743p39j479l247m472m399l583
52680A83346k962k802k626k035j256p17l44J55M60j89j796l207l287k085n95J37
52664A60197m81k211l710l466j652k98q58k317k643j524m19k27k90J27O94Q64
52648A41786Q59J051J023J44j158j615p66J69l42k089l034j623J238L153K993
52633A41789J898J366J381J027K05l02j54J06Lk01K9Q62J995K859L007K581K173
52616A60624J835P43j448l377l220j103R35J571J552J941K313J796Q95Q87J769
$$ plain form
52722 311824 306333 301845 298018 293462 287691 282196 278782 277407 276449 274542 271221 266318 260022 253547
52708 253547 248617 245897 244494 243072 240849 237592 233544 229561 226650 224998 223874 222630 221277 220016
52694 220016 218779 217442 215900 213732 210444 206406 203008 201265 200526 199047 195800 191328 186929 183346
52680 183346 180384 177582 174956 172921 171665 170948 170604 170759 171219 171030 169234 166027 162740 160655 160060 160197
52664 160197 159716 157505 153795 150329 148677 148379 147521 145204 142561 141037 140618 140391 140101 140228 140922 141786
52648 141786 142645 143696 144719 144863 143705 142090 141324 141493 141151 139062 136028 134405 135643 138796 141789
52633 141789 143687 145053 146434 147461 147666 147364 147210 147316 147319 147118 147147 148009 150004 152863 155870 158451 160624
52616 160624 162459 163202 161754 158377 155157 154054 154989 156560 158112 160053 162366 164162 165057 165944 167713
52601A67713K257J855J595K374L643M429M705M841M405K620l6j797j508J01J309
52586A98506J145o5j401k234k594k895l253l139k136q75n66j439k380k508k298
52571A71868k616l321l630l301k542j275M97J888J856O73l16m34j49N5J88rj035
52554A58397k489l066k262j103o16n07l1O81R85P63L43j08m88o27o33p74o70M58
52536A48253K185K640R14j204j190J128L616M494L659J793l86j854j650j1J636
52521A64023K238K031J800J827J869J647J184Q73J163J931K387J948Q02n97k036
52506A83090k940k156O16L699M923M083K713J777J006L59M47J049Q14o49j656
52491A97175n94J628K551J250o36r54O83K796L619K558M67j150j314k35J012J436
$$ plain form
52601 167713 169970 171825 173420 175794 179437 183866 188571 193412 197817 200437 200401 198604 197096 197197 198506
52586 198506 199651 199586 198185 195951 193357 190462 187209 184070 181934 181059 180493 179054 176674 174166 171868
52571 171868 169252 165931 162301 159000 156458 155183 155680 157568 159424 160097 159781 159347 159198 159253 159441 159432 158397
52554 158397 155908 152842 150580 149477 148861 148354 148323 149004 149989 150752 151095 150987 150499 149872 149239 148465 147795 148253
52536 148253 150438 153078 153992 152788 151598 152726 156342 160836 164495 166288 165902 164048 162398 162387 164023
52521 164023 166261 168292 170092 171919 173788 175435 176619 177492 178655 180586 182973 184921 185723 185126 183090
52506 183090 180150 177994 178610 182309 187232 191315 194028 195805 196811 197170 197617 198666 199480 198831 197175
52491 197175 196581 198209 200760 202010 201374 200420 201103 203899 207518 210076 210543 209393 208079 207844 208856 210292
52475B10292J058Q33J496K557K932K606K746L799M395L102N84j160j241l56P60
52460B34403J938K668K314J539J954L654M537K996O1k161l097l483l408k210m5
52445B41660J880K720K614J798J34k223m395n389m745k625J65K280K694J693N42
52430B38803Rj88l94k93L51R25P38J85L03J230J968J841J351J067N66p42k154
52413B45566k263r43L45O70R07K146L805M408L750K942K477J599j4j216p71R56
52397B64364K491L022K883K541J976J195O56P32J021O71n01j565j424o5J506K447
52381B81950K780K720K154J230Q82J760K915K626O62j269j693j015m79l85k42
52366B94596q7m84j241j240J29K141L602M019L404J655r27k938k834r15O69N23
$$ plain form
52475 210292 211350 212183 213679 216236 219168 221774 224520 228319 232714 235816 236400 235240 233999 233643 234403
52460 234403 236341 239009 241323 242862 244816 248470 253007 256003 256064 253903 250806 247323 243915 241705 241660
52445 241660 243540 246260 248874 250672 250806 248583 244188 238799 234054 231429 231594 233874 236568 238261 238803
52430 238803 238812 238624 238230 237937 238288 239213 239951 240136 240439 241669 243637 245478 246829 247896 248462 247720 245566
52413 245566 243303 242360 242705 243375 244282 246428 250233 254641 258391 261333 263810 265409 265395 264179 263408 264364
52397 264364 266855 269877 272760 275301 277277 278472 279128 279860 280881 281552 281051 279486 278062 277997 279503 281950
52381 281950 284730 287450 289604 290834 291716 293476 296391 299017 299679 298410 296717 295702 295223 294838 294596
52366 294596 294509 294025 292784 291544 291673 293814 297416 301435 304839 306494 305567 302629 299795 298880 299549 300072
52350C00072k68J62J741K758K509K051K088J763L31j263j657r54k18K44Q48J478
52334C11685J689J818K602L692L899L017K225K372K894K850K192J571J565K342
52320C46413L579M499M546M006L375K427Q07o69o20Q65K012J679O68K71N62Q67
52304C75287R73J076J185J318J703K256K436K094J813J964K146K117K362L150
52290D01880L829L786L472L676M284M641M600M516M596M865N345N739N531M860
52276D65620M599M932M839L894L541N223P941R143P933N942N040N454O301O825
52262E47227O726O124N678O171P639R296J0404J0845J0876J0844J1207J2361J4284
52249F69682J6552J8634K0068K0749K1300K2648K4729K6198K6140K5491K5896
$$ plain form
52350 300072 299804 299966 301707 304465 306974 309025 311113 312876 313207 311944 310287 309333 309115 309359 310207 311685
52334 311685 313374 315192 317794 321486 325385 328402 330627 332999 335893 338743 340935 342506 344071 346413
52320 346413 349992 354491 359037 363043 366418 368845 369652 368983 368363 369228 371240 372919 373587 373858 374420 375287
52304 375287 376260 377336 378521 379839 381542 383798 386234 388328 390141 392105 394251 396368 398730 401880
52290 401880 405709 409495 412967 416643 420927 425568 430168 434684 439280 444145 449490 455229 460760 465620
52276 465620 470219 475151 479990 483884 487425 492648 500589 509732 517665 523607 528647 534101 540402 547227
52262 547227 553953 560077 565755 571926 579565 588861 599265 610110 620986 631830 643037 655398 669682
52249 669682 686234 704868 724936 745685 766985 789633 814362 840560 866700 892191 918087
52238I18087K7533K9055K9366K8647K7792K7742K9174L1838L4275L5240L5150
52227A253899L5221L5331L4164L1524K9027K7885K7325K5957K3694K1453J9742
52216A565222J8470J7572J6834J5355J2245P893L875J395K64l58o13J03J763K956
52202A662976K208l8j742j827j407j720k065j144M38Q49N0K8J759L827N006O345
52186A673543R315J3257J6249J7714J8587J9386J9726J9575J9531J9750J9732
52175A866365J9345J9036J8853J8261J7129J5976J4957J3421J0931P987N306L009
52163B030576R04j052l024n460q390j1142j3318j5498j8087k0089k0280j9488
52151A895652k0280k3738k7643k8923k7297k5293k4881k5353k4917k3308k1856
$$ plain form
52238 918087 945620 974675 1004041 1032688 1060480 1088222 1117396 1149234 1183509 1218749 1253899
52227 1253899 1289120 1324451 1358615 1390139 1419166 1447051 1474376 1500333 1524027 1545480 1565222
52216 1565222 1583692 1601264 1618098 1633453 1645698 1653591 1657466 1658861 1659125 1658767 1658154 1658257 1660020 1662976
52202 1662976 1665184 1665146 1663404 1661577 1660170 1658450 1656385 1655241 1655679 1656528 1656578 1656606 1658365 1662192 1667198 1673543
52186 1673543 1682858 1696115 1712364 1730078 1748665 1768051 1787777 1807352 1826883 1846633 1866365
52175 1866365 1885710 1904746 1923599 1941860 1958989 1974965 1989922 2003343 2014274 2022261 2027567 2030576
52163 2030576 2031480 2030428 2027404 2021944 2013554 2002412 1989094 1973596 1955509 1935420 1915140 1895652
52151 1895652 1875372 1851634 1823991 1795068 1767771 1742478 1717597 1692244 1667327 1644019 1622163
52140A622163k1499k1713k1466k0405j8861j7189j5539j4049j2799j1655j0275
52129A436713q393o114m145l511m548o117o419n008l452l382m388m721l767k722
52115A370026k649l152l528m074n223o260o263n819o358p739q108o527m477l938
52101A295911n051o490p261p165o102m157k166j320k089l937n741o278m977k861
52087A230316j995l147m647m551l117j898j183j46R51P19r22k227k065j212o46
52072A204230j53N24P66K56k21k02m17j148j085P09K899L561K896K593L189L877
52056A222274M514N911Q107R997J0977J1703J2912J4562J6465J8673K0904K2512
52044A379511K3358K4098K5371K7204K9349L1544L3543L5334L7232L9227M0558
$$ plain form
52140 1622163 1600664 1578951 1557485 1537080 1518219 1501030 1485491 1471442 1458643 1446988 1436713
52129 1436713 1428320 1422206 1418061 1414550 1410002 1403885 1397466 1392458 1389006 1385624 1381236 1376515 1372748 1370026
52115 1370026 1367377 1364225 1360697 1356623 1351400 1345140 1338877 1333058 1326700 1318961 1310853 1304326 1299849 1295911
52101 1295911 1290860 1284370 1277109 1269944 1263842 1259685 1257519 1256199 1254110 1250173 1244432 1238154 1233177 1230316
52087 1230316 1228321 1225174 1220527 1215976 1212859 1210961 1209778 1209632 1210583 1211302 1210380 1208153 1206088 1204876 1204230
52072 1204230 1204077 1204601 1205367 1205623 1205402 1205200 1204783 1203635 1202550 1203259 1206158 1209719 1212615 1215208 1218397 1222274
52056 1222274 1226788 1232699 1240806 1250803 1261780 1273483 1286395 1300957 1317422 1336095 1356999 1379511
52044 1379511 1402869 1426967 1452338 1479542 1508891 1540435 1573978 1609312 1646544 1685771 1726329
52033A726329M0594L9823L9029L8001L5999L3263L0819K8907K6779K4077K1311
52022B084931J8886J6770J5122J4015J2504R379N177J944M63q65l573o886r061
52009B158806r936j0820j2508j4643j6708j8538j9832k0155j9588j8699j7738
51998A979641j6269j3846j0730p732n474l898k549j229j54O64J804L811O476R192
51984A939707J1792J4360J6324J6629J5100J3036J2008J2359J3073J2924J1619
51973B088931R939Q835Q349P632O062L842J300j760n446r117j1988j3997j5531
51960B077051j6893j8518k0899k3529k4981k5029k5519k7704l0051l0624l0516
51949A802788l2319l5876l8446l8912l8816l8901l7887l5624l4346l5210l6334
$$ plain form
52033 1726329 1766923 1806746 1845775 1883776 1919775 1953038 1983857 2012764 2039543 2063620 2084931
52022 2084931 2103817 2120587 2135709 2149724 2162228 2171607 2176784 2178728 2179191 2178326 2174753 2167867 2158806
52009 2158806 2148870 2138050 2125542 2110899 2094191 2075653 2055821 2035666 2016078 1997379 1979641
51998 1979641 1963372 1949526 1938796 1931064 1925590 1921692 1919143 1917914 1917760 1918424 1920228 1924039 1930515 1939707
51984 1939707 1951499 1965859 1982183 1998812 2013912 2026948 2038956 2051315 2064388 2077312 2088931
51973 2088931 2098870 2107705 2116054 2123686 2129748 2133590 2134890 2133130 2127684 2118567 2106579 2092582 2077051
51960 2077051 2060158 2041640 2020741 1997212 1972231 1947202 1921683 1893979 1863928 1833304 1802788
51949 1802788 1770469 1734593 1696147 1657235 1618419 1579518 1541631 1506007 1471661 1436451 1400117
51938A400117l6033l5423l5788l5823l4075l1943l1479l1806l0763k8898k8578
51927A039508k9810l0120k8477k6506k5532k5082k4684k4807k5252k4686k2549
51916G52003j9795j7308j5239j4205j5079j6877j6960j4480j1872j1581j2786
51905E85821j2946j1459r971r577r486q614p204o346o508p036o970o169n430n435
51891D72670n853n810n064m120l412k935k549k025j003L79R56l66k959m953n472
51876D27484n368n545n724n399m859m476l875k722j747j982l330m721n483n777
51862C66476n805n381m452l428k698k162j557j092j282k061k430j586k39j13j816
51847C30374l970m964m825m461l862k437r05j112l420n626n445l207j152o03q36
$$ plain form
51938 1400117 1364084 1328661 1292873 1257050 1222975 1191032 1159553 1127747 1096984 1068086 1039508
51927 1039508 1009698 979578 951101 924595 899063 873981 849297 824490 799238 774552 752003
51916 752003 732208 714900 699661 685456 670377 653500 636540 622060 610188 598607 585821
51905 585821 572875 561416 551445 541868 532382 523768 516564 510218 503710 496674 489704 483535 478105 472670
51891 472670 466817 461007 455943 451823 448411 445476 442927 440902 439899 440278 441234 440868 437909 432956 427484
51876 427484 422116 416571 410847 405448 400589 396113 392238 389516 387769 385787 382457 377736 372253 366476
51862 366476 360671 355290 350838 347410 344712 342550 340993 339901 338619 336558 334128 332542 332303 332190 330374
51847 330374 326404 321440 316615 312154 308292 305855 304950 303838 300418 294792 289347 286140 284988 284385 283549
51832B83549n90K42P34K82n99q93k87M86O57L22L1j41m92q85p92j01P17J230J265
51813B84735O61m09j009k64J351K480K679K762L094K842J482l3m66J67J057J886
51797C03015K687L033K447J338O24N58P17J001J689K569K863K299J613J609K171
51782C30233K548K323J647O74o30j908k169q92P98J007m83j643r62K20m58k794
51766C27511m101k932p46N96J069J147J35k282m137l110J23K508K628K073K494
51751C22976L243K916J727R18O72Q2j100k011k061j832k120k813l226l088k584
51736C11699j730m76N14J71j397k392j266J202K806K721K271K679L371L192K244
51721C25609J439Q91q6j624k967l479l134k059l75J279J936J276R9m66K9J098
$$ plain form
51832 283549 282959 283201 283935 284217 283618 282725 282438 282924 283581 283903 283934 283793 283301 282416 281624 281523 282240 283470 284735
51813 284735 285396 284987 283978 283714 285065 287545 290224 292986 296080 298922 300404 300371 299905 300072 301129 303015
51797 303015 305702 308735 311182 312520 313144 313702 314419 315420 317109 319678 322541 324840 326453 328062 330233
51782 330233 332781 335104 336751 337425 336795 334887 332718 331826 332624 333631 333148 331505 330543 330763 330305 327511
51766 327511 323410 320478 319732 320328 321397 322544 322679 320397 316260 313150 313273 315781 318409 320482 322976
51751 322976 326219 329135 330862 331780 332452 332534 331434 329423 327362 325530 323410 320597 317371 314283 311699
51736 311699 309969 309493 310007 310178 308781 306389 305123 306325 309131 311852 314123 316802 320173 323365 325609
51721 325609 327048 327939 327853 326229 323262 319783 316649 314590 314215 315494 317430 318706 318805 318339 318368 319466
51705C19466J710J083l47q79Q83M152O356N798L448J643J445J882J711J144J366
51690C50861K714M090M347L843L918N033O177O349N891N830O419P055P410P900
51676D27837R000J0649J2420J3816J4322J3573J1718R390P188N329L776K446J256
51663E42720J77q23j870l130m434n157m794l583k339j742j946k729l696m455m738
51648D97461m352l145j366K4J22o50q18J75J162J061N63R07J838K166J863J943
51632D98954K422K140Q78KM01J387K366L974O375P904P141N402N253O941Q155
51617E59695P396N761M854M475L451J759N50M45Q43R74Q44R41J482K298L195M048
51601F03011M543M144K478j80k957m907n564n177m538m513n455o956q233q773
$$ plain form
51705 319466 321176 322259 321912 321033 321916 326068 332424 338222 341670 343313 344758 346640 348351 349495 350861
51690 350861 353575 357665 362012 365855 369773 374806 380983 387332 393223 399053 405472 412527 419937 427837
51676 427837 436837 447486 459906 473722 488044 501617 513335 522725 529913 535242 539018 541464 542720
51663 542720 542897 542074 540204 537074 532640 527483 522689 519106 516767 515025 513079 510350 506654 502199 497461
51648 497461 493109 489964 488598 488622 488744 488094 487276 487451 488613 489674 490237 491144 492982 495148 497011 498954
51632 498954 501376 503516 504394 504396 504797 506184 508550 512524 518899 526803 533944 539346 544599 551540 559695
51617 559695 567091 572852 577706 582181 585632 587391 587941 588386 589229 590203 591047 591988 593470 595768 598963 603011
51601 603011 607554 611698 614176 613996 611039 606132 600568 595391 590853 586340 580885 573929 565696 556923
51587E56923q561p891p239p100p541p901p385o077m861m199l614k708k149k919
51573D76778m880o731p376o839n811m877m307m106l983l519k680j943j672j598
51559D16456j170m77m05j582l350m252l626k362j717j757j446j63J490K412K048
51544D00099O31r99j772j225k33k26j323j973j073M95J207J138J579K784L596
51529D02705L458L391M359N739O399O500P130Q433R220Q637P400O855P342P928
51515D95496P576O131M032J590j158l980o288p543p641o838n569m398l803l716
51501D63891l494k762k051k213l161l618k243R84M551O560O292M795L687L473
51487D74691L438L176L365M490N683N764M933M312M066L241J469l32j386k115
$$ plain form
51587 556923 548362 540471 533232 526132 518591 510690 503305 497228 492367 488168 484554 481846 479697 476778
51573 476778 471898 465167 457791 450952 445141 440264 435957 431851 427868 424349 421669 419726 418054 416456
51559 416456 415286 414809 414404 412822 409472 405220 401594 399232 397515 395758 394312 394149 395639 398051 400099
51544 400099 400730 399731 397959 396734 396501 396275 394952 392979 391906 392401 393608 394746 396325 399109 402705
51529 402705 406163 409554 413913 419652 426051 432551 439681 448114 457334 465971 473371 480226 487568 495496
51515 495496 503072 509203 513235 514825 513667 509687 503399 495856 488215 481377 475808 471410 467607 463891
51501 463891 460397 457635 455584 453371 450210 446592 444349 445333 449884 456444 462736 467531 471218 474691
51487 474691 478129 481305 484670 489160 494843 500607 505540 509852 513918 517159 518628 518296 516910 514795
51473E14795l224m541n368n324m380k608m37J273J999J997J728J302Q04N70P67
51458D99353J224K036L632N794P395P677P165O533N374K978j54k540l339k971
51444E40157k436k564l647n142o070o266o684p914r096r140q176o883n241l265
51430D57633k063k489l356k916j593j145j403m34J717K315J35k202j869L43J970
51415D44643K865M519O487O573M540L016L946O226P775Q338R086J0492J1776J1993
51401E42275J0888Q997P398O991P637Q369Q631Q791R076Q712O804L681P30r76
51387F38004j386j035n15l36p23j342j557j169o42m25l30J57J185K462L660M504
51371F40512M675M168L713M150N116N077L103K8k650m454n758o590o764o844p670
$$ plain form
51473 514795 511571 507030 501662 496338 491958 489350 488913 490186 492185 494182 495910 497212 498016 498586 499353
51458 499353 500577 502613 506245 512039 519434 527111 534276 540809 546183 549161 549007 546467 543128 540157
51444 540157 537721 535157 531510 526368 520298 514032 507348 499434 490338 481198 473022 466139 460898 457633
51430 457633 455570 453081 449725 446809 445216 444071 442668 442234 443951 446266 446401 444199 442330 442673 444643
51415 444643 447508 452027 458514 465087 469627 472643 476589 482815 490590 498928 508014 518506 530282 542275
51401 542275 553163 562160 569558 576549 584186 592555 601186 609977 619053 627765 634569 638250 638980 638004
51387 638004 636618 635583 635068 634732 634009 632667 631110 629941 629299 628874 628544 628701 629886 632348 636008 640512
51371 640512 645187 649355 653068 657218 662334 667411 670514 670542 667892 663438 657680 651090 644326 637482 629812
51356F29812q825q884p495n979n390n202m653m296m980o183o576n890n100m885
51342E45474m868m405l242j453O63K510L608M058M165L740K393N37m62N78L419
51327E56715O274O988M810J186j597k683l000l436l748l782m476o624r473j1697
51313E25457j3027j3768j3571j2166j0719j0757j1902j2306j1331j0091r268q180
51301C88371o534n438n775o834p447p400o975o106m814l675l048k553k005j985
51287C17782k733l342k939j843q33OO95N07j036k863l422k745k148k043j445Q0
51271B91678J383J256M6j050j589j903j895q92J157L144M027M160M601N362N248
51256C14733L845K624L266N363O930O920O123N616N538N744O435P410P641O474
$$ plain form
51356 629812 620987 612103 604608 598629 593239 588037 583384 579088 574108 567925 561349 555459 550359 545474
51342 545474 540606 536201 532959 531506 532169 534679 538287 542345 546510 550250 552643 553180 552718 553296 556715
51327 556715 562989 569977 574787 575973 574376 571693 568693 565257 561509 557727 553251 546627 537154 525457
51313 525457 512430 498662 485091 472925 462206 451449 439547 427241 415910 405819 396551 388371
51301 388371 381837 376399 370624 363790 356343 348943 341968 335862 331048 327373 324325 321772 319767 317782
51287 317782 315049 311707 308768 306925 306092 306098 306793 307300 306264 303401 299979 297234 295086 293043 291598 291678
51271 291678 293061 294317 294363 293313 291724 289821 287926 287034 288191 291335 295362 299522 304123 309485 314733
51256 314733 318578 321202 324468 329831 336761 343681 349804 355420 360958 366702 373137 380547 388188 394662
51242C94662M712L627L359K961J697l56k721m847o239o813p019p227p229o784
51228C61783o298o392o991p323o816n710m810m798n498n837m943l396k636k998
51214B87337l271k696k326l370n005n234l618j808j172j268r41m7O76P91N40K69
51198B58857ql30m21J54J316K196J880N08q03j232j031p58l57M79J512K137K158
51181B66257J843J329N50l97j225j777k058k057j804j492j285j249j485j983k252
51166B50915j713o67n2P4Q66K861M760M981L713K295J283L61l27j87N31Q15L75
51149B70884O3O19J857L125L788L400K269J612K046K277N96k294l656k251N4Q58
51133B85247j3j162j777j906j525n57N59J311J722J846J196m82k312l148l035
$$ plain form
51242 394662 399374 403001 406360 409321 411018 410662 407941 403094 396855 390042 383023 375796 368567 361783
51228 361783 355485 349093 342102 334779 327963 322253 317443 312645 307147 301310 296367 292971 290335 287337
51214 287337 284066 281370 279044 275674 270669 265435 261817 260009 258837 257569 256628 256581 257257 258048 258588 258857
51198 258857 258849 258519 258098 258252 259568 261764 263644 264152 263349 262117 261086 260328 259971 260450 261962 264099 266257
51181 266257 268100 269429 269979 269582 268357 266580 264522 262465 260661 259169 257884 256635 255150 253167 250915
51166 250915 249202 248535 248483 248557 249423 252284 257044 262025 265738 268033 269316 269677 269350 269163 269694 270509 270884
51149 270884 270947 271566 273423 276548 280336 283736 286005 287617 289663 291940 292536 290242 286586 284335 284389 285247
51133 285247 285234 284072 282295 280389 278864 278307 278866 280177 281899 283745 284941 284459 282147 278999 275964
51118B75964k846k735j927j75J474J762M76j599l521m619m469l083j153K60N95
51103B54404L24L69R69J478J389J074J113J302R61J13n36o58o60q28r96j240k090
51086B56488l507m403l929k783k470l375m193l448j199R30J369J58j168j266l12
51071B26892N15N08lk89K08J617L326M111L444K479K806M263N216M987M570M489
51055B69139L629J238j270j933r15m7l03j139j893k359k130r47J21n58k681l612
51039B54340j485K162L902K230j014k944k542j000K01Q87J690K574K611J336l08
51024B62640r42k58R54J938K518K710K469J942J405Q99L41r2j16K36Q36J789K794
51007B82063K608M08k250k381Q30M595N670L923J639K38o51j356j429r26p24r07
$$ plain form
51118 275964 273118 270383 268456 268281 269755 271517 271993 270394 266873 262254 257785 254702 253549 253809 254404
51103 254404 254728 255097 256066 257544 258933 260007 261120 262422 263383 263496 262960 262302 261642 260814 259818 258578 256488
51086 256488 252981 248578 244649 241866 239396 236021 231828 228380 227181 228111 229480 229638 228470 227204 226892
51071 226892 227407 227915 227912 227623 227831 229448 232774 236885 240329 242808 245614 249877 255093 260080 264650 269139
51055 269139 272768 274006 272736 270803 269888 269841 269538 268399 266506 264147 262017 261070 261191 260633 257952 254340
51039 254340 252855 255017 258919 261149 260135 257191 254649 253649 253850 254737 256427 259001 261612 262948 262640
51024 262640 261698 261440 262394 264332 266850 269560 272029 273971 275376 276275 276616 276524 276408 276644 277480 279269 282063
51007 282063 284671 285079 282829 280448 281278 285873 291543 295466 297105 297343 296692 295336 293907 292981 292257 291350
50991B91350l20J457K986K987K267K230K476J719N53J153L919O394O337M405K686
50976C32599J894J244L20l66l88J27Q50J356J204O89R70K572M187M048K173K14
50960C53693o56n41R8Q49J045L82j04Q05K476L079K461K414L568M148K981J869
50944C78567L184O384Q760Q947P852O654N702N309N969P480Q947R943J0786J1757
50930D86241J2834J4037J5172J5511J4816J4296J5392J7706J9584K0661K2284
50919F68534K5197K8412L0885L2860L4716L5918L6268L7152M0208M5301N0873
50908A066324N5793O0002O3845O7872P2977P9578Q6633R2380R6158R8872J01653
50897A942087J04730J07624J09774J10743J10130J07495J02308R4330Q4289P3598
$$ plain form
50991 291350 291030 292487 295473 298460 300727 302957 305433 307152 307705 308858 312777 319171 325508 329913 332599
50976 332599 334493 335737 336057 335691 335303 335430 336280 337636 338840 339529 340499 343071 347258 351306 353479 353693
50960 353693 353037 352496 352594 353443 354488 354870 354766 355571 358047 361126 363587 366001 369569 373717 376698 378567
50944 378567 381751 388135 396895 405842 413694 420348 426050 431359 437328 444808 453755 463698 474484 486241
50930 486241 499075 513112 528284 543795 558611 572907 588299 606005 625589 646250 668534
50919 668534 693731 722143 753028 785888 820604 856522 892790 929942 970150 1015451 1066324
50908 1066324 1122117 1182119 1245964 1313836 1386813 1466391 1553024 1645404 1741562 1840434 1942087
50897 1942087 2046817 2154441 2264215 2374958 2485088 2592583 2694891 2789221 2873510 2947108
50887B947108O2902N1434L8658K5889J4975N644m211j5384k6050l4254m0111m4433
50875B982167m6659m6000m3844m2922m4049m5438m5627m5522m6766m9418n2292
50864B473630n4811n7350o0125o2682o4525o5661o6566o7871o9804p1728p2472
50853A760035p1484o9159o5994o2173n8254n5175n2818m9694m5112m0712l8204
50842A151256l6456l2839k7230k2389j9946j8226j5168j1483r347r142r101p603
50830I32326m456m29L211N121N136M834N796P643Q940R614J0866J2719J3513J2463
50816A027297J1288J2176J5080J8129K0074K1212K2148K2924K3664K5120K7979
50805A247091L1916L5931L9485M2901M6588N0392N4086N8095O3177O9364P5969
$$ plain form
50887 2947108 3010010 3061444 3100102 3125991 3140966 3146610 3142399 3127015 3100965 3066711 3026600 2982167
50875 2982167 2935508 2889508 2845664 2802742 2758693 2713255 2667628 2622106 2575340 2525922 2473630
50864 2473630 2418819 2361469 2301344 2238662 2174137 2108476 2041910 1974039 1904235 1832507 1760035
50853 1760035 1688551 1619392 1553398 1491225 1432971 1377796 1324978 1275284 1230172 1189460 1151256
50842 1151256 1114800 1081961 1054731 1032342 1012396 994170 979002 967519 958172 949030 939929 932326
50830 932326 927870 927441 930652 935773 940909 945743 951539 959182 968122 977736 988602 1001321 1014834 1027297
50816 1027297 1038585 1050761 1065841 1083970 1104044 1125256 1147404 1170328 1193992 1219112 1247091
50805 1247091 1279007 1314938 1354423 1397324 1443912 1494304 1548390 1606485 1669662 1739026 1814995
50794A814995Q2780R0626J00260J11181J22189J32787J43412J54463J65857J77564
50784C096114J89747K02040K13276K22468K29810K36147K41501K44451K43181
50775E118735K36839K25666K09972J89576J64591J36312J06632P6563M5963J4980
50765F525829j4817m1222o3061q0629r4614j05038j11274j13037j11259j07858
50755E683020j04333j00752r6709r3113r2100r4743r9749j05164j10702j17481
50745D668174j25836j34477j41903j47917j53419j58946j63499j64950j61978
50736C315249j55722j48822j42536j35753j27309j18116j09781j02118r3639q4130
50726B097323p4997o7034n9426n1450m3670l6899l1102k6033k1941j8897j6253
$$ plain form
50794 1814995 1897775 1988401 2088661 2199842 2322031 2454818 2598230 2752693 2918550 3096114
50784 3096114 3285861 3487901 3701177 3923645 4153455 4389602 4631103 4875554 5118735
50775 5118735 5355574 5581240 5791212 5980788 6145379 6281691 6388323 6464886 6510849 6525829
50765 6525829 6511012 6469790 6406729 6326100 6231486 6126448 6015174 5902137 5790878 5683020
50755 5683020 5578687 5477935 5381226 5288113 5196013 5101270 5001521 4896357 4785655 4668174
50745 4668174 4542338 4407861 4265958 4118041 3964622 3805676 3642177 3477227 3315249
50736 3315249 3159527 3010705 2868169 2732416 2605107 2486991 2377210 2275092 2181453 2097323
50726 2097323 2022326 1955292 1895866 1844416 1800746 1763847 1732745 1706712 1684771 1665874 1649621
50715A649621j3555j1353j0340j0242j0198r865r424q909q193p528p597q927j1260
50702A522230j3406j3971j2651j0686r346q220n984k724o8J226K373M601P434
50689A460808R990J2710J6410K0593K4243K7757L2444L8395M4271M9171N3438
50678A790230N7650O2093O7350P4070Q1851Q9495R6627J04085J12378J21036J29695
50667B786560J38428J46368J51514J53004J52318J50878J47450J39826J28586
50658D094932J17119J07444R7611Q4064O5539M3716K0921j608k3331m3544o1277
50647D501586p5673q6170r2689r5886r6860r6135r3142q7299p9720p3076o9141
50636C555795o6950o4289o0888n9035o0699o5221p0592p5937q1412q6317q9159
$$ plain form
50715 1649621 1636066 1624713 1614373 1604131 1593933 1584068 1574644 1565735 1557542 1550014 1542417 1533490 1522230
50702 1522230 1508824 1494853 1482202 1471516 1462170 1453950 1447966 1445242 1445174 1446400 1448773 1453374 1460808
50689 1460808 1470798 1483508 1499918 1520511 1544754 1572511 1604955 1643350 1687621 1736792 1790230
50678 1790230 1847880 1909973 1977323 2051393 2133244 2222739 2319366 2423451 2535829 2656865 2786560
50667 2786560 2924988 3071356 3222870 3375874 3528192 3679070 3826520 3966346 4094932
50658 4094932 4212051 4319495 4417106 4501170 4566709 4610425 4631346 4629738 4606407 4562863 4501586
50647 4501586 4425913 4339743 4247054 4151168 4054308 3958173 3865031 3777732 3698012 3624936 3555795
50636 3555795 3488845 3424556 3363668 3304633 3243934 3178713 3108121 3032184 2950772 2864455 2775296
50625B775296q9789q9895r0717r1360r0153q6759q1919p5975o8711o0481n2369
50614A897168m5202l8928l2982k6770j9992j3008o748j776K358O467J0784J5121
50602A746492J9489K3791K7298K9248K9793K9656K9241K8844K9195L0625L1997
50591B055669L1869L0594K9940L0694L2179L4132L7288M1534M5330M8010N1076
50580B468315N5966O1774O6563P0060P3619P8134Q3134Q7548R0408R1309R1098
50569C317928R1300R1980R0872Q5863P7664O8811O0620N2475M3635L4298K5055
50558D040501J6519R468M220J70l211n297n311l777j589J595O366J1326J3832
50545D084812J2990J0150O392J358n062j1936j8888k6933l6838m7942n9289p0565
$$ plain form
50625 2775296 2685507 2595612 2504895 2413535 2323382 2236623 2154704 2078729 2010018 1949537 1897168
50614 1897168 1851966 1813038 1780056 1753286 1733294 1720286 1713538 1711762 1714120 1720587 1731371 1746492
50602 1746492 1765981 1789772 1817070 1846318 1876111 1905767 1935008 1963852 1993047 2023672 2055669
50591 2055669 2087538 2118132 2148072 2178766 2210945 2245077 2282365 2323899 2369229 2417239 2468315
50580 2468315 2524281 2586055 2652618 2722678 2796297 2874431 2957565 3045113 3135521 3226830 3317928
50569 3317928 3409228 3501208 3592080 3677943 3755607 3824418 3885038 3937513 3981148 4015446 4040501
50558 4040501 4057020 4066488 4070708 4070878 4067667 4062370 4057059 4053282 4051693 4053288 4059654 4070980 4084812
50545 4084812 4097802 4107952 4114344 4115702 4110640 4098704 4079816 4052883 4016045 3968103 3908814 3838249
50533C838249q1203q9934r6261j01291j06108j10240j12537j12751j11339j08593
50523B807992j04794j00560r6256r1593q6360q0879p5323o9409o3212n7376n2008
50512A930222m6348m0133l4180k8951k3725j8065j2950r299o286k397K488P263
50500A717639J1323J4944J8317K1292K3956K6660K9652L3162L7456M2180M6247
50489B022828M9010N1078N3376N5963N8387O0493O2229O3284O3587O3361O2301
50478B665897N9856N7091N6741O0015O4571O7426O8925P1932P7685Q4659R1515
50467C426313R8944J07959J17969J27404J35342J41953J48059J54593J61743J68390
50457D788669J72939J74711J73957J70648J64185J54249J41154J25216J06505
$$ plain form
50533 3838249 3757046 3667112 3570851 3469560 3363452 3253212 3140675 3027924 2916585 2807992
50523 2807992 2703198 2602638 2506382 2414789 2328429 2247550 2172227 2102818 2039606 1982230 1930222
50512 1930222 1883874 1843741 1809561 1780610 1756885 1738820 1725870 1716571 1710285 1707888 1710376 1717639
50500 1717639 1728962 1743906 1762223 1783515 1807471 1834131 1863783 1896945 1934401 1976581 2022828
50489 2022828 2071838 2122916 2176292 2232255 2290642 2351135 2413364 2476648 2540235 2603596 2665897
50478 2665897 2725753 2782844 2839585 2899600 2964171 3031597 3100522 3172454 3250139 3334798 3426313
50467 3426313 3525257 3633216 3751185 3878589 4013931 4155884 4303943 4458536 4620279 4788669
50457 4788669 4961608 5136319 5310276 5480924 5645109 5799358 5940512 6065728 6172233
50448F172233Q5240O1974L7480J2803j0915l3259n4514p4270r0878j03346j12768
50437E889780j20392j24982j24005j17058j06289r3596p9379o4188m9382l5535
50427D974974k2043r105J566Q779J2749J2975P072o491k5700m6755o7614q8208
50415D752199j07897j24859j38034j47990j55379j59850j61064j59796j57111
50406C440219j53068j47081j39365j31158j23159j14543j04345r3513q4412p7916
50396B271659p2104o4736n6105m8240m1829l5504k8178k0536j3771q058k879J970
50384A881689O405J0373J3797J6690J9578K3094K7039L0567L3487L6359L9225
50373B138303M1386M2733M4027M5369M5667M4370M2403M0640L8676L6249L4519
$$ plain form
50448 6172233 6257473 6319447 6356927 6369730 6358815 6325556 6271042 6196772 6105894 6002548 5889780
50437 5889780 5769388 5644406 5520401 5403343 5297054 5203458 5124079 5059891 5010509 4974974
50427 4974974 4952931 4943826 4945392 4954171 4966920 4979895 4986967 4980476 4954776 4908021 4840407 4752199
50415 4752199 4644302 4519443 4381409 4233419 4078040 3918190 3757126 3597330 3440219
50406 3440219 3287151 3140070 3000705 2869547 2746388 2631845 2527500 2433987 2349575 2271659
50396 2271659 2199555 2134819 2078714 2030474 1988645 1953141 1924963 1904427 1890656 1882598 1879719 1881689
50384 1881689 1888094 1898467 1912264 1928954 1948532 1971626 1998665 2029232 2062719 2099078 2138303
50373 2138303 2179689 2222422 2266449 2311818 2357485 2401855 2444258 2484898 2523574 2559823 2594342
50362B594342L4519L5224L4820L3271L1996L1426L0532K8840K7415K7451K9071
50351B938907L1743L5044L8670M2437M6383N0325N3496N5478N7179N9790O2748
50340C472200O3984O2392N8846N4387M8716M1306L2900K4678J6382O512n628j8921
50328C857754l1647m3248n4528o6318p8119q8133r4909r8625j00458j00645r8055
50317C003069r1966q3431p4074o4164n2946m0704k9203j9841j2391o133j241J700
50305B528675K768K284k90n861j4186k3695l2850m0871m7241n1593n4420n6856
50293B205864n9353o1301o2248o2377o1408n8366n3421m8654m5624m3075l8722
50282A611315l2727k7716k5449k5163k5211k4710k3196k0252j6227j2278r037
$$ plain form
50362 2594342 2628861 2664085 2698905 2732176 2764172 2795598 2826130 2854970 2882385 2909836 2938907
50351 2938907 2970650 3005694 3044364 3086801 3133184 3183509 3237005 3292483 3349662 3409452 3472200
50340 3472200 3536184 3598576 3657422 3711809 3760525 3801831 3834731 3859409 3875791 3882303 3876675 3857754
50328 3857754 3826107 3782859 3728331 3662013 3583894 3495761 3400852 3302227 3201769 3101124 3003069
50317 3003069 2911103 2827672 2753598 2689434 2636488 2595784 2566581 2546740 2534349 2528216 2526975 2528675
50305 2528675 2531443 2533727 2533437 2527576 2513390 2489695 2456845 2415974 2368733 2317140 2262720 2205864
50293 2205864 2146511 2085210 2022962 1960585 1899177 1840811 1787390 1738736 1693112 1650037 1611315
50282 1611315 1578588 1550872 1525423 1500260 1475049 1450339 1427143 1406891 1390664 1378386 1369349
50271A369349o138l291q31J320M020P524J0757J2657J3528J4287J5267J6370J7618
50258A472437J8911J9930K0846K2242K3842K4422K3729K3316K4345K5710K5693
50247A725423K4532K3701K3250K1859J9298J6988J5753J4679J2814J0699R323
50236A918319Q530P336N308K911P01j222l103n235p807j0799j3980j6947j9273
50223A864739k0891k2387k4575k7431k9896l0985l0802l0133k9468k8885k8402
50212A560884k7912k7057k5751k4554k3995k3776k3148k1664j9256j6165j3365
50201A314241j2243j2829j3108j1232p946n520m758m596m338m344m387l396j583
50188A223961j026k909n529o528o009n816o453o535n390m445n318p554r208r215
$$ plain form
50271 1369349 1363211 1359920 1359089 1360409 1364429 1371953 1382710 1395367 1408895 1423182 1438449 1454819 1472437
50258 1472437 1491348 1511278 1532124 1554366 1578208 1602630 1626359 1649675 1674020 1699730 1725423
50247 1725423 1749955 1773656 1796906 1818765 1838063 1855051 1870804 1885483 1898297 1908996 1918319
50236 1918319 1926849 1934185 1939493 1942404 1943105 1941883 1938780 1933545 1925738 1914939 1900959 1884012 1864739
50223 1864739 1843848 1821461 1796886 1769455 1739559 1708574 1677772 1647639 1618171 1589286 1560884
50212 1560884 1532972 1505915 1480164 1455610 1431615 1407839 1384691 1363027 1343771 1327606 1314241
50201 1314241 1301998 1289169 1276061 1264829 1256883 1251363 1246605 1242009 1237671 1233327 1228940 1225544 1223961
50188 1223961 1222935 1220026 1214497 1207969 1201960 1196144 1189691 1183156 1177766 1173321 1168003 1160449 1151241 1142026
50174A142026q342p822p749p305o227n338n291n376m268j897K35P48j55j247j728
50159A080264j634j122j5J808L910N410N751N230M618M143L188J297p70j696j288
50144A109094r63k218m997p811r202q975q110p693p907q102p833p458p420p410
50130A012995o864n931n271m956m451l609k874k446k092j922k366l166l390k945
50116I60712l060m499o192o591n734m816m220l209j515q6J4j268l234n172o668
50101I04462p620q291q941r342r028q179p729q359r663j0637j0751j0232r483
50088G86207q604p532o398n510m961m443l567k372j395j167j725k549k901k386
50074G30697j320m77j93N1Q32J851K466K985M425O649P859O763M554L686N110
$$ plain form
50174 1142026 1133684 1125862 1118113 1110808 1104581 1099243 1093952 1088576 1084308 1082411 1082646 1083394 1083239 1081992 1080264
50159 1080264 1078630 1077508 1077493 1079301 1083211 1088621 1094372 1099602 1104220 1108363 1111551 1112848 1112078 1110382 1109094
50144 1109094 1108131 1105913 1100916 1093105 1083903 1074928 1066818 1059125 1051218 1043116 1035283 1027825 1020405 1012995
50130 1012995 1006131 1000200 994929 989973 985522 981913 979039 976593 974501 972579 970213 967047 963657 960712
50116 960712 957652 953153 946961 940370 934636 929820 925600 922391 920876 920790 920804 919536 916302 911130 904462
50101 904462 896842 888551 879610 870268 861240 853061 845332 836973 827310 816673 805922 795690 786207
50088 786207 777603 770071 763673 758163 753202 748759 745192 742820 741425 740258 738533 735984 733083 730697
50074 730697 729377 728900 728707 728758 729590 731441 733907 736892 741317 747966 755825 762588 767142 770828 775938
50059G75938P718J0244J2472J4454J5722J5895J5361J4788J4444J4261J4175J3998
50047I39470J3487J2887J2860J3540J4199J4284J4025J3488J1932R166O806O644
50035A082788Q017Q409O994N830O770Q634Q838O884M635L626L629L856M083M171
50021A167164L714K829K508L519N494P520R217J0868J2865J5368J7985J9650J9575
50008A298276J8659J9092K1889K5554K7913K8572K8602K8479K7641K5867K3821
49997A574365K2038K0367J8728J7500J6757J5824J4024J1453Q741O432M723L361
49985A734313J644r62m081o791q793j0657j2727j4600j5970j7274j8935k0452
49973A604715k0874j9928j8234j6677j5933j6260j7121j7211j5561j2808j0815
$$ plain form
50059 775938 783656 793900 806372 820826 836548 852443 867804 882592 897036 911297 925472 939470
50047 939470 952957 965844 978704 992244 1006443 1020727 1034752 1048240 1060172 1069338 1076144 1082788
50035 1082788 1090805 1099214 1106208 1112038 1118808 1127442 1136280 1143164 1147799 1151425 1155054 1158910 1162993 1167164
50021 1167164 1170878 1173707 1176215 1179734 1185228 1192748 1201965 1212833 1225698 1241066 1259051 1278701 1298276
50008 1298276 1316935 1336027 1357916 1383470 1411383 1439955 1468557 1497036 1524677 1550544 1574365
49997 1574365 1596403 1616770 1635498 1652998 1669755 1685579 1699603 1711056 1719797 1726229 1730952 1734313
49985 1734313 1735957 1734995 1730914 1724123 1715330 1704673 1691946 1677346 1661376 1644102 1625167 1604715
49973 1604715 1583841 1563913 1545679 1529002 1513069 1496809 1479688 1462477 1446916 1434108 1423293
49962A423293j0641j1136r980o267j659J243J497L02q30j510j843j513l21J037
49948A381672J858K648M337O569P990Q156P830P511P099P236R337J3534J7984
49935A483761K1006K2684K3671K3746K2799K1898K1886K1721J9713J5792J1222
49924A709899O734K408j137l056l635l860l830l038k043k274m242p365j1566j7274
49910A655721k3674k8881l2419l5794l9786m2883m3573m2664m1904m1447m0239
49899A242457l8069l5792l4005l2896l2764l3199l2248k8177k2224j7974j7368
49888I17741j8576j8432j6017j2992j1149j0723j0903j1060j1065j0889j0289
49877G75646q990o949m506k373j460k266m025m899l714j416L4K02N46K003L469
$$ plain form
49962 1423293 1412652 1401516 1391536 1385269 1383610 1384853 1386350 1386652 1385822 1384312 1382469 1380956 1380635 1381672
49948 1381672 1383530 1386178 1390515 1397084 1405074 1413230 1421060 1428571 1435670 1442906 1452243 1465777 1483761
49935 1483761 1504767 1527451 1551122 1574868 1597667 1619565 1641451 1663172 1682885 1698677 1709899
49924 1709899 1716633 1719041 1717904 1714848 1711213 1707353 1703523 1700485 1698442 1696168 1691926 1684561 1672995 1655721
49910 1655721 1632047 1603166 1570747 1534953 1495167 1452284 1408711 1366047 1324143 1282696 1242457
49899 1242457 1204388 1168596 1134591 1101695 1068931 1035732 1003484 975307 953083 935109 917741
49888 917741 899165 880733 864716 851724 840575 829852 818949 807889 796824 785935 775646
49877 775646 766656 759707 755201 752828 751368 749102 745077 740178 736464 735048 735082 735284 735830 737833 741302
$$ [...]
##END NTUPLES=NMR SPECTRUM
##END=
