
##TITLE=AC1113_Huila1_5835735_E5EMHUawKj
##JCAMPDX= 6.0         $$ Bruker NMR JCAMP-DX V2.0
##DATA TYPE= NMR SPECTRUM
##DATA CLASS= NTUPLES
##ORIGIN= BRUKER
##OWNER= Administrator
$$ 1.72 TOPSPIN		Version 2.1
$$ 2012-03-28 11:05:32.484 -0500  Administrator@TOPSPIN
$$ Compression mode = diff/dup
##.OBSERVE FREQUENCY= 400.13188235
##.OBSERVE NUCLEUS= ^1H
##.ACQUISITION MODE= SIMULTANEOUS (DQD)
##.ACQUISITION SCHEME= undefined
##.AVERAGES= 8
##.DIGITISER RES= 22
##SPECTROMETER/DATA SYSTEM= spect
##.PULSE SEQUENCE= zg30
##.SOLVENT NAME= COFFEE_meoh
##.SHIFT REFERENCE= INTERNAL, COFFEE_meoh, 1, 14.98061
##AUDIT TRAIL= $$ (NUMBER, WHEN, WHO, WHERE, PROCESS, VERSION, WHAT)
$$ ##TITLE= Audit trail, TOPSPIN		Version 2.1
$$ ##JCAMPDX= 5.01
$$ ##ORIGIN= Bruker BioSpin GmbH
$$ ##OWNER= Administrator
$$ $$ C:\Bruker\TOPSPIN/data/COFFEE/nmr/AC1113_Huila1_5835735_E5EMHUawKj/10/pdata/1/auditp.txt
$$ ##AUDIT TRAIL=  $$ (NUMBER, WHEN, WHO, WHERE, PROCESS, VERSION, WHAT)
(   1,<2012-03-27 20:47:21.890 -0500>,<Administrator>,<TOPSPIN>,<go>,<TOPSPIN 2.1>,
      <created by zg
	started at 2012-03-27 20:46:15.281 -0500,
	POWCHK enabled, PULCHK disabled,
       configuration hash MD5:
       1A 1E CE 29 27 FD 77 03 67 4E F0 E3 C4 B2 CB 90
       data hash MD5: 64K
       41 2C F8 8D AC A8 2B 49 02 7A 29 BE 35 F6 A5 6A>)
(   2,<2012-03-27 20:47:25.375 -0500>,<Administrator>,<TOPSPIN>,<proc1d>,<TOPSPIN 2.1>,
      <Start of raw data processing
       efp LB = 0 FT_mod = 6 PKNL = 1 PHC0 = 0 PHC1 = 0 SI = 32K 
       data hash MD5: 32K
       55 6D 42 AC 78 24 8A 71 49 07 E2 9F 87 AB 06 60>)
(   3,<2012-03-27 20:47:25.765 -0500>,<Administrator>,<TOPSPIN>,<proc1d>,<TOPSPIN 2.1>,
      <pk PHC0 = 217.3535 PHC1 = 0 
       data hash MD5: 32K
       34 98 48 56 C5 DD 3E D1 7E A4 D3 84 B2 55 95 C7>)
(   4,<2012-03-27 20:47:25.828 -0500>,<Administrator>,<TOPSPIN>,<proc1d>,<TOPSPIN 2.1>,
      <abs ABSG = 1 
       data hash MD5: 32K
       26 A9 22 F2 0F 66 E2 B7 AA BD 22 78 2D 09 E5 5B>)
(   5,<2012-03-27 20:47:25.859 -0500>,<Administrator>,<TOPSPIN>,<proc1d>,<TOPSPIN 2.1>,
      <abs ABSG = 2 
       data hash MD5: 32K
       6B B4 DE DA 67 B8 AC 82 D6 6E 39 DE 4C 55 03 93>)
(   6,<2012-03-27 20:47:26.078 -0500>,<Administrator>,<TOPSPIN>,<proc1d>,<TOPSPIN 2.1>,
      <abs ABSG = 3 
       data hash MD5: 32K
       64 B4 20 08 D3 1D 2B D3 60 F5 8F BE B5 B8 95 F3>)
(   7,<2012-03-27 20:47:26.125 -0500>,<Administrator>,<TOPSPIN>,<proc1d>,<TOPSPIN 2.1>,
      <abs ABSG = 4 
       data hash MD5: 32K
       5B 2F F3 57 04 C8 98 19 CB 95 6D 43 98 BE 04 8C>)
(   8,<2012-03-27 20:47:26.156 -0500>,<Administrator>,<TOPSPIN>,<proc1d>,<TOPSPIN 2.1>,
      <abs ABSG = 5 
       data hash MD5: 32K
       D3 46 5E 04 54 5B 09 73 C0 13 2E 1D A5 17 14 AE>)
(   9,<2012-03-27 20:47:30.218 -0500>,<Administrator>,<TOPSPIN>,<audit>,<TOPSPIN 2.1>,
      <user comment:
       ICON-NMR User ID: COFFEE
       data hash MD5: 32K
       D3 46 5E 04 54 5B 09 73 C0 13 2E 1D A5 17 14 AE>)
$$ [...]
##$TP= (0..7)
150 150 150 150 150 150 150 150
##$TP07= 0
##$TPNAME0= <>
##$TPNAME1= <>
##$TPNAME2= <>
##$TPNAME3= <>
##$TPNAME4= <>
##$TPNAME5= <>
##$TPNAME6= <>
##$TPNAME7= <>
##$TPOAL= (0..7)
0.5 0.5 0.5 0.5 0.5 0.5 0.5 0.5
##$TPOFFS= (0..7)
0 0 0 0 0 0 0 0
##$TUNHIN= 0
##$TUNHOUT= 0
##$TUNXOUT= 0
##$USERA1= <user>
##$USERA2= <user>
##$USERA3= <user>
##$USERA4= <user>
##$USERA5= <user>
##$V9= 5
##$VALIST= <valist>
##$VCLIST= <CCCCCCCCCCCCCCC>
##$VD= 0
##$VDLIST= <DDDDDDDDDDDDDDD>
##$VPLIST= <PPPPPPPPPPPPPPP>
##$VTLIST= <TTTTTTTTTTTTTTT>
##$WBST= 2048
##$WBSW= 25
##$XGAIN= (0..3)
0 0 0 0
##$XL= 0
##$YL= 0
##$YMAX_a= 524079
##$YMIN_a= -618696
##$ZGOPTNS= <>
##$ZL1= 120
##$ZL2= 120
##$ZL3= 120
##$ZL4= 120
##$ABSF1= 14.98061
##$ABSF2= -5.57192
##$ABSG= 5
##$ABSL= 3
##$ALPHA= 0
##$AQORDER= 0
##$ASSFAC= 0
##$ASSFACI= 0
##$ASSFACX= 0
##$ASSWID= 0
##$AUNMP= <proc_prof1d_extract_pilot.lims>
##$AXLEFT= 0
##$AXNAME= <>
##$AXNUC= <1H>
##$AXRIGHT= 0
##$AXTYPE= 0
##$AXUNIT= <>
##$AZFE= 0.1
##$AZFW= 0.1
##$BCFW= 0
##$BC_mod= 0
##$BYTORDP= 0
##$COROFFS= 0
##$CY= 15
##$DATMOD= 1
##$DC= 0
##$DFILT= <>
##$DTYPP= 0
##$F1P= 0
##$F2P= 0
##$FCOR= 0.5
##$FTSIZE= 32768
##$FT_mod= 6
##$GAMMA= 0
##$GB= 0
##$INTBC= 1
##$INTSCL= 1
##$ISEN= 128
##$LB= 0
##$LEV0= 0
##$LPBIN= 0
##$MAXI= 10000
##$MC2= 0
##$MEAN= 0
##$ME_mod= 0
##$MI= 0
##$NCOEF= 0
##$NC_proc= -8
##$NLEV= 6
##$NOISF1= 0
##$NOISF2= 0
##$NSP= 0
##$NTH_PI= 0
##$NZP= 0
##$OFFSET= 14.98061
##$PC= 1
##$PHC0= 217.3535
##$PHC1= 0
##$PH_mod= 1
##$PKNL= yes
##$PPARMOD= 0
##$PPDIAG= 0
##$PPIPTYP= 0
##$PPMPNUM= 2147483647
##$PPRESOL= 1
##$PSCAL= 4
##$PSIGN= 0
##$PYNMP= <proc.py>
##$REVERSE= no
##$SF= 400.13
##$SI= 32768
##$SIGF1= 0
##$SIGF2= 0
##$SINO= 400
##$SIOLD= 32768
##$SPECTYP= <>
##$SREGLST= <1H.CDCl3>
##$SSB= 0
##$STSI= 32768
##$STSR= 0
##$SW_p= 8223.68421052632
##$SYMM= 0
##$S_DEV= 0
##$TDeff= 65536
##$TDoff= 0
##$TI= <>
##$TILT= no
##$TM1= 0
##$TM2= 0
##$TOPLEV= 0
##$USERP1= <user>
##$USERP2= <user>
##$USERP3= <user>
##$USERP4= <user>
##$USERP5= <user>
##$WDW= 1
##$XDIM= 32768
##$YMAX_p= 462853998
##$YMIN_p= -676898
##$CURPLOT= <Network HP LaserJet P1505>
##$CURPRIN= <$Network HP LaserJet P1505>
##$DFORMAT= <normdp>
##$LAYOUT= <+/1D_H.xwp>
##$LFORMAT= <normlp>
##$PFORMAT= <normpl>
##$SURQMSG= 1
$$ End of Bruker specific parameters
$$ ---------------------------------
##NTUPLES= NMR SPECTRUM
##VAR_NAME=  FREQUENCY,     SPECTRUM/REAL,   SPECTRUM/IMAG
##SYMBOL=    X,             R,               I
##VAR_TYPE=  INDEPENDENT,   DEPENDENT,       DEPENDENT
##VAR_FORM=  AFFN,          ASDF,            ASDF
##VAR_DIM=   32768,         32768,           32768
##UNITS=     HZ,            ARBITRARY UNITS, ARBITRARY UNITS
##FACTOR=    0.250966925370066, 1,           1
##FIRST=     8223.43324360095, -106930,      -35457
##LAST=      0,             -121865,         -80592
##MIN=       0,             -676898,         0
##MAX=       8223.43324360095, 462853998,    0
$$ Real data points
##PAGE= N=1
##DATA TABLE= (X++(R..R)), XYDATA
$$ [...]
19508a5234l11828a51062M2332L5183A99235b9199k34828c5365m94691J78902
19498c51154D5023b22990a02849m86A0562e1156C0466K5248f1648b1653n4819
19487g6472A00802a4956j7707n8166j51570k32303h2044n8493F4587a97650C07220
19475c086A30136D3474P0227b23313B8679b47109h408A72509E4876a615l48521
19464c50136P3576B53451o9134g1331k03307F0324K21683c96872A879a9478l1417
19453e0895A77527C4746a59868A892K31617c51904h4159A14104b29217a6427j23683
19442a40110B16146c93969B70969f3924B1191K30503C016c41579J37446h2492
19431f5895A85548C3331a49646J2954i275j74864f2486l30164i9923M9643j47444
$$ y = [-15234, -327062, -151062, -108730, -73547, 199235, -29199, -264027, -35365, -530056, -351154, 45023, -222990, -102849, -103335, 10562, -51156, 30466, 55714, -61648, -21653, -76472, 100802, -14956, -32663, -90829, -242399, -474702, -82044, -140537, 64587, -197650, 307220, -3086, 130136, 43474, 113701, -223313, 28679, -247109, -8408, 172509, 54876, -1615, -350136, -276560, 253451, 184317, -71331, -274638, 60324, 282007, -396872, 1879, -19478, -50895, 177527, 34746, -159868, 1892, 233509, -351904, -84159, 114104, -229217, -16427, -140110, 216146, -393969, 270969, -63924, 21191, 251694, 3016, -341579, -204133, -82492, -65895, 185548, 33331, -149646, -136692, -9275, -184139, -62486, -392650, -99923, -50280, -197724]
19420a97724A64733a23671m4167n3035R3486C360J92017b9809k52700J37555A29472
19408A69540a28195o4291L9687F6020b02209h2403j26750B44292i5215A32139
19397d69574A67553a15406r7340e2716j36785m1316E675J3799K7006c41629f9758
19385b01475C6786f6309G1348a53785a8425l29725a53541B73822f4322L0389o2869
19374i6802L8356k3849A02069b05072l2157D3780h1743A92600g6654H3778g2720
19362b03512A23721e3236n3086B09M3081i061p5569A66624m9578d15994a13562
19350D3640b04997A25850b58934k2248O7677b0447k9380J5667k17608e2223j45032
19339a97255L8694L3648n167l05945d9801q5323L2606F5121g1842A71046C2693
$$ y = [-197724, 164733, -123671, -167838, -220873, -127387, 3360, 195377, -29809, -282509, -144954, 129472, 169540, -128195, -192486, -152799, 66020, -202209, -82403, -209153, 244292, -95215, 132139, -469574, 167553, -115406, -212746, -52716, -189501, -230817, 5675, 19474, 46480, -341629, -69758, -201475, 36786, -66309, 71348, -153785, -18425, -348150, -153541, 273822, -64322, -33933, -96802, -58446, -82295, 102069, -205072, -237229, 43780, -81743, 192600, -76654, 83778, -72720, -203512, 123721, -53236, -106322, 209, 43290, -9061, -84630, 166624, 117046, -415994, -113562, 43640, -204997, 125850, -258934, -281182, -213505, -20447, -49827, -34160, -251768, -52223, -197255, -158561, -124913, -130080, -436025, -49801, -135124, -102518, 65121, -71842, 171046, 32693]
19327A80016e7477B4048a80611C2933a84368j49590i312j13449N6788H3934b32306
19315a26426A81345f0575l74348h6779F4995b50786l0128A99174q9270i4986A42993
19303i9654r2969n8376g5834D3145K5995J01410a6415o633A76789a82986P4787
19292a08199B44686d08919C1504b3301q534j49103M7223f4176j74936R9993B54522
19280E7499d10705c0041o4177F1108J1222a3904A44970l5712G716a70595F7707
19268A59589c5462r5858i706H0427K9645n38J0520c8898k17628M4292i0435k45022
19256c35457J34097B91845A1777N5412a08485d3950Q658l31398a68755l58094
19246e26849i172L173k64647A10838i8123p3304B70782h5144k38350H0281f3544
$$ y = [180016, -57477, 24048, -180611, 32933, -184368, -333958, -9312, -122761, -65973, 83934, -232306, -126426, 181345, -60575, -434923, -86779, 64995, -250786, -280914, 199174, 109904, -94986, 142993, -99654, -192623, -250999, -75834, 43145, 69140, 170550, -16415, -23048, 176789, -182986, -108199, 244686, -408919, 31504, -23301, -31835, -180938, -133715, -64176, -239112, -139119, 254522, 57499, -410705, -30041, -94218, 61108, 72330, -13904, 144970, 109258, 7716, -170595, 67707, 159589, -35462, -131320, -9706, 80427, 110072, 109534, 120054, -38898, -256526, -212234, -90435, -335457, -201360, 291845, 11777, 67189, -108485, -43950, -35292, -366690, -168755, -526849, -9172, -5999, -270646, 110838, -98123, -171427, 270782, -85144, -323494, 80281, -63544]
19234C6799a48973G0267m335b38911Q9050f6417A48627a46459F3363a29866q0650
19223b10516b3933k49389e1555k16690h5060p1018B47538b30236i2045A5577d28615
19211a55924L4648B44408E8012b19645R4045k81136a2373l0418I6981c50208h2653
19199A82723B7042L37363b62098A85832a36531q7058Q3726O9379A72291n4481
19189A17810J0555A6209d0830m9292H7960a33352j570j71837c8387e503j8171
19178b3674A52603b69796h0510l8242r9239R2778E366L6461a93167B70035A6189
19166f4034l84118F9041g9679F3239a91396D6124a04890j28036A40503B1830a3500
19154D0923O6962J82156a3166k48014C63870D0348K8370b14685A90632b30630
$$ y = [36799, -148973, 70267, 65932, -238911, -149861, -66417, 148627, -146459, 63363, -129866, -210516, -23933, -273322, -51555, -268245, -85060, -156078, 247538, -230236, -92045, 15577, -428615, -155924, -121276, 244408, 58012, -219645, -125600, -406736, -12373, -42791, 96981, -350208, -82653, 182723, 27042, 364405, -262098, 185832, -136531, -223589, -139863, -70484, 172291, 117810, 128365, 16209, -40830, -90122, 87960, -133352, -134922, -306759, -38387, -5503, -23674, 152603, -269796, -80510, -118752, -217991, -125213, 5366, 41827, -193167, 270035, 16189, -64034, -448152, 69041, -79679, 63239, -191396, 46124, -104890, -232926, 140503, 21830, -13500, 40923, 107885, 290041, -13166, -261180, 363870, 40348, 68718, -214685, 190632, -230630]
19143c47170C30854a09398K2954B1580L6328D499J64717B595b03411D2390r282
19132C3108b69122A44109h9885j36411C4850c5854a1038A08549d1504m6430j61277
19121b49211N2297e4033j29409c2771k020E6051d0225r9485D0276b57967D5696
19109d9888A90566G2364a37004C16285d510q0945l1133k16689c8822J5151j99293
19098b22964A55550p7051b17417P6559J8667o6843a1525p7846D0454J80749p6342
19087A44861a33560B02634a5881m1052j74980A60805d4450G724J81292K80868
19077D69884F4766d53013a55529O3463A089e5660j14844J7299A69075b3596D7570
19065B27428a37492A0104b41741a1469k31855J05845m204a1499n5481k21702a28178
$$ y = [-347170, 330854, -109398, -86444, 21580, 57908, 4499, 169216, 2595, -203411, 42390, 33108, -269122, 144109, -89885, -226296, 34850, -35854, -11038, 108549, -41504, -87934, -249211, -196914, -54033, -183442, -32771, -34791, 56051, -40225, -139710, 40276, -257967, 45696, -49888, 190566, 72364, -137004, 316285, -4510, -85455, -116588, -333277, -38822, -23671, -222964, 155550, 78499, -217417, -140858, -122191, -189034, -11525, -89371, 40454, 221203, 144861, -133560, 202634, -15881, -56933, -231913, 160805, -44450, 7724, 189016, 469884, 64766, -453013, -155529, -92066, 1089, -55660, -170504, -153205, 169075, -23596, 47570, 227428, -137492, 10104, -241741, -11469, -243324, -137479, -141683, -11499, -66980, -288682, -128178]
19053b53236j48166g4485j98452e1412q3112o2689A70157g9611r44j98752A75668
19041c97983J72879j67666R6266j33355i7718L7p5359k85324A39411d32248A33721
19029b85388f7413A35963a56108k8678A48926b34404j2545A73293O2724a32058
19018i1857c3770r3110A60356J7566A7572J17717J06141A2050K6620e3745G5782
19006A26166C1964a84020K295f864m8806B76380a75410f2179j07546C87506a64896
18994b80599M0894b3156C50016b4906A70423K62131I9098l3074b01304N8426M5753
18983i7125B36810o0958j3599H1115N0153E9739B2581K73369q1021h8040l68569
18972d56609O5288J84209D387b25660q1731B7585f1671A94991L5699b37673h9857
$$ y = [-253236, -401402, -74485, -272937, -51412, -134524, -197213, 170157, -79611, -80555, -279307, 175668, -397983, -225104, -392770, -296504, -429859, -97718, -97681, -173040, -458364, 139411, -432248, 133721, -285388, -67413, 135963, -156108, -184786, 148926, -234404, -246949, 173293, 236017, -132058, -91857, -33770, -126880, 160356, 177922, 17572, 135289, 241430, 12050, 38670, -53745, 75782, 126166, 31964, -184020, -181725, -6864, -55670, 276380, -175410, -62179, -169725, 387506, -164896, -280599, -239705, -23156, 350016, -24906, 170423, 432554, 99098, 66024, -201304, -142878, -97125, 236810, 175852, 162253, 81115, 131268, 59739, 22581, 295950, 214929, -88040, -456609, -391321, -207112, 4387, -225660, -307391, 27585, -61671, 194991, 230690, -237673, -89857]
18960b373B50852J62347N714A82435K39176G8563J792J0205A5396K69073N7895
18949C42364b86602J22630p3299j2028Q4122d6850A33913a84407h8699j00671
18939a89370D6103R8391a52813d0164l9134c6062k32907C8888d71062A22843G640
18927B68247a13997A56665i8826K2169G6714e6402l07073B6944j2607O5434f9728
18915a86630E7475a9493A05828a58557f6723C15084b6459n5053k32544c6966r8060
18904a35026A23733c32255A84158a13526H039c6059l14587A48351c2677I6584
18893E69222j48203I4602a94491D1228J69828G0216c40158G1717b24130Q6848
18883a37282k10263A28243Q3483a28678n302l7897d3937l1921r4045B328N8449
$$ y = [-2373, 250852, 413199, 418913, 182435, 421611, 78563, 80355, 90560, 15396, 284469, 342364, -286602, -163972, -237271, -249299, -165177, -46850, 133913, -184407, -88699, -189370, 46103, 144494, -152813, -40164, -79298, -36062, -268969, 38888, -471062, 122843, 7640, 268247, -113997, 156665, -98826, -76657, 76714, -56402, -363475, 26944, 14337, 79771, -69728, -186630, 57475, -19493, 105828, -158557, -66723, 315084, -26459, -81512, -314056, -36966, -135026, 123733, -332255, 184158, -113526, 8039, -36059, -350646, 148351, -32677, 96584, 569222, 421019, 94602, -194491, 41228, 211056, 70216, -340158, 71717, -224130, -137282, -347545, 128243, 211726, -128678, -133980, -171877, -43937, -75858, -169903, 2328, 60777]
18872F0777b93219J37491A21089N1758J73149a52718A39058e3687A71071a00275
18861b09942A9913c22915b7284j07355j41543A21373a24129I7703b49850i2755
18850B7579b16806c8381j74574B38051k3119F5988L9717a53733o1983G5480A7172
18838b83122A78569a05227m4132J7651I107b13680o4422g1660B147L2152a19267
18826a00703b8928j03145l6275Q890c082A21530e17289g7441J1557r0680L7609
18815a18955k07902a59251a0518n029A71049i7325J754j6028M8773k65897a16495
18803a86035d7488A4157F985a4693j14648L5376B21391A190K21181e3885H0165
18791d17020e4057J7956k06715d8446J1272k1017K0393C0793O6342d38873J42025
$$ y = [60777, -293219, -155728, 121089, 172847, 345996, -152718, 139058, -53687, 171071, -100275, -209942, 19913, -322915, -27284, -134639, -276182, 121373, -124129, 97703, -249850, -92755, 27579, -216806, -38381, -212955, 238051, 214932, 65988, 105705, -153733, -215716, 75480, 17172, -283122, 178569, -105227, -149359, -131708, 9107, -213680, -278102, -71660, 2147, 34299, -119267, -100703, -28928, -132073, -168348, -159458, -3082, 121530, -517289, -77441, -65884, -156564, -118955, -326857, -159251, -10518, -15547, 171049, -97325, -95571, -111599, -62826, -328723, -116495, -186035, -47488, 14157, 6985, -14693, -129341, -93965, 221391, 1190, 222371, -53885, 80165, -417020, -54057, -36101, -242816, -48446, -37174, -58191, -37798, 30793, 97135, -438873, -296848]
18780b96848b7971k2448B5565c80328a7864C28902E8530a32964k02276a03839
18769a84534h7578o388m5770a2662n2989B9380c20039C65119g3821F6445c54662
18757c28843G6977R7625f1523E7623g4677k6791J2949j92732O8131l914b8381
18745a45659k168j19227f0149p5200k95962Q4512h8183q4961G3280a98783C31376
18733A58517a35753B19256G9578c22156c1855j64436i0196A34930k4535f7040
18722d7137D48i0920q7192A99113F9165B3066g8194A13368e8524C528J85762G4592
18709b12994k87447K43551g6683G8036H815c9024k7934J931j76297D2698b31191
18697a81396n2008A47759D719i3072n9671B46449j05259B6036J20020C6637e5787
$$ y = [-296848, -27971, -50419, 25565, -380328, -17864, 328902, 58530, -132964, -335240, -103839, -184534, -87578, -93966, -139736, -12662, -65651, 29380, -320039, 365119, -73821, 66445, -354662, -328843, 76977, 174602, -61523, 57623, -74677, -101468, -88519, -281251, -213120, -217034, -28381, -145659, -147827, -267054, -60149, -135349, -431311, -346799, -88183, -173144, 73280, -198783, 331376, 158517, -135753, 219256, 79578, -322156, -31855, -196291, -90196, 134930, 110395, -67040, -47137, 448, -90920, -178112, 199113, 69165, 23066, -78194, 113368, -58524, 3528, 189290, 74592, -212994, -500441, -256890, -76683, 78036, 8815, -39024, -66958, -65027, -241324, 42698, -231191, -181396, -233404, 147759, 4719, -93072, -152743, 246449, 141190, 26036, 146056, 36637, -55787]
18685A2122K1940f579A1379J27696C2335a60037N1763B3198a45379F3438f7544
18673D6565a24605A8979c26961C0176O8466m3170f5169l4644b6477A02021a0608
18661e588l59347A70258D9128f1676k3695m5183A40975d52579J86482A4961M1590
18650E6551H062L72959a99792h2127l4193N0461m6609j76460J40855K3221L4705
18639i0147j4511j0962H8175j837k5084j6714e9026B69030g2499E7744j8507M8977
18627H8214l7261g0229k6967A12130B3337b868D6149c219k52769J05220k62631
18616d13399b2696A06771i6067K8423A43390a61966l0958H6040b92667A40010
18605d76416K25100H7535b6090l51062A79229m7024A1679c24722a08048b1434
$$ y = [12122, 34062, -6579, 11379, 139075, 32335, -160037, -108274, 23198, -145379, 63438, -67544, 46565, -124605, 18979, -326961, 30176, 98642, 55472, -65169, -99813, -26477, 102021, -10608, -5588, -364935, 170258, 49128, -61676, -85371, -130554, 140975, -452579, -266097, 14961, 56551, 8062, 381021, -199792, -82127, -116320, -65859, -112468, -288928, -148073, -124852, -90147, -104658, -115620, 88175, 86338, 61254, 44540, -59026, 269030, -72499, 57744, 39237, 88214, 50953, -70229, -97196, 112130, 23337, -2868, 46149, -3219, -255988, -150768, -413399, -22696, 106771, -96067, -67644, 143390, -161966, -192924, 86040, -292667, 140010, -476416, -251316, 87535, -26090, -377152, 179229, 132205, 11679, -324722, -108048, -21434]
18594a39822e8473j6788j93542j62491i2642L4694j90160D013b97853M3772r085
18583b63166A7703J92860b5819o8262c5384A34729b9611A38889l8501b35610g4773
18571a0231j14276j44110l4621A04465a95953h8347j41556H5524b41555A01679
18560a23892L5687A37730a38657A20553D3962a11667j62017j87040D13365A49978
18549a0241k85634E0588J45937d32449E4785d16371a83903A97751d8753m695l06119
18538c59567C76239b47725A37425a7895A40792P4939F3345c8044j10010N6023
18528i2031b0351P682A101a13645q7330h066j37121k40933a64075b6266j84388
18517b10654j50506e0741j81629H1523a05721j43492A96639b76484A6239M7195
$$ y = [-139822, -58473, -75261, -268803, -431294, -92642, -57948, -248108, 4013, -297853, -254081, -263166, 17703, 210563, -25819, -94081, -35384, 134729, -29611, 138889, 100388, -235610, -74773, -10231, -124507, -268617, -303238, 104465, -195953, -88347, -229903, 85524, -241555, 101679, -123892, -88205, 137730, -138657, 120553, 43962, -111667, -273684, -460724, 413365, 149978, -10241, -295875, 50588, 196525, -432449, 54785, -416371, -183903, 197751, -48753, -53448, -359567, 376239, -247725, 137425, -17895, 140792, 215731, 63345, -38044, -148054, -92031, -20351, -12669, 1101, -113645, -200975, -8066, -145187, -386120, -164075, -26266, -210654, -361160, -50741, -232370, 81523, -105721, -249213, 196639, -276484, 16239, 63434]
18507F3434b88169c8724n5927G8392F030a25351p7760n125D1312d0014g99k45286
18495b46085f9545G1830a83850B24277e0647o2007e1426j78036k1228C5547a47968
18483a66008j31543R1603A20295n9786b1050j21676B0320c82895Q8468A75191
18472a4454p1689j1541j89401A67455a48207a008j20922A50053a05989q745k28923
18461c43657F3884N1736I455a50056A23831M6172a05006j7025j36916a13323d1365
18449C22597d0818p5000j82335C94248A22781j2948i5504o2161C64421b48294
18438b45421g3970A60N3326K4372a08171L5514A59378A0800a71382A5372J38668
18427A54040C3842a86511D68827a6476k06710A38890f2179k19324a29096L1739
$$ y = [63434, -288169, -38724, -94651, 78392, 6030, -125351, -203111, -208236, 41312, -40014, -799, -246085, -69545, 71830, -183850, 224277, -50647, -112654, -51426, -229462, -250690, 35547, -147968, -166008, -297551, -205948, 120295, 60509, -21050, -142726, 20320, -382895, -294427, 175191, -14454, -86143, -97684, -287085, 167455, -148207, -1008, -121930, 150053, -105989, -114734, -343657, 63884, 115620, 9455, -150056, 123831, 170003, -105006, -122031, -258947, -113323, -41365, 322597, -40818, -115818, -298153, 394248, 122781, 109833, -95504, -157665, 364421, -248294, -245421, -73970, 160, 53486, 77858, -108171, -72657, 159378, 10800, -171382, 15372, 154040, 33842, -186511, 468827, -16476, -223186, 138890, -62179, -281503, -129096, -97357]
18417i7357q1140K6215m9119e554B4156b11800P6355o0851g5597k14338a37424
18405A07743C6940a95233C13206a33415A57285a57182B607L10613D0976a10039
18394C8237f2744l6380A71121d4140E5431a38786N7469b642m4927a7200H9597
18382C8243e21792A6167a69398c9405j52798J8534D4316m971a4945k82805J33606
18371a64144k0512A35016a52663C8435a62105d7963B36834a27785k6729G2094
18360e7548j24906d4065A40015h6539A80951D8247b14726D0179n523J74450C3134
18348B8067a66522A09254h6325A52017J76092a8242o58656g5412j18473K279K1278
18337a70328o9294a01320k55405f9643G1306O4019k217a30475B47765P5005C6579
$$ y = [-97357, -178497, -152282, -201401, -5554, 24156, -211800, -135445, -196296, -75597, -289935, -137424, 107743, 36940, -195233, 313206, -133415, 157285, -157182, 2607, 313220, 40976, -110039, 38237, -62744, -99124, 171121, -44140, 55431, -138786, -81317, -2642, -47569, -17200, 89597, 38243, -521792, 16167, -169398, -39405, -192203, -173669, 44316, 39345, -14945, -297750, -164144, -184656, 135016, -152663, 38435, -162105, -47963, 236834, -127785, -154514, 72094, -57548, -182454, -44065, 140015, -86539, 180951, 48247, -214726, 40179, 34656, 209106, 33134, 28067, -166522, 109254, -86325, 152017, 328109, -18242, -676898, -75412, -193885, -191606, -170328, -239622, -101320, -356725, -69643, 71306, 135325, 133108, -130475, 247765, 322770, 36579]
18325a33465i563B30220l8885a92078j7706H086b16709O5075I3903a89293k8354
18314b17647c204r5523D518R3227i1064j71P222j21170d435A38251a06662A56247
18301C74070a9810m20677G3508J08388D5810K5152a16245A50001D3877b75727
18290A37717N667C2848g8819j14691c7439l2183j2410E1852c3037r122k09306
18279b51465A33366F1538g5886k68048H1669a8529j00050H5764a30540l2473C679
18267d21530A28115c59730G8382L54531f4366A83086H2950J48734a95325A89280
18256h7305B48758a4442N851A09814b13577B29813c8056p9792j73746j09116J61800
18245b38910i2753m7327d8226j95900J14474N15C00578c6639B69516a58513A69744
$$ y = [-133465, -9563, 230220, 191335, -192078, -209784, 8086, -216709, -151634, 93903, -189293, -217647, -3204, -98727, 4518, 97745, -91064, -91235, -84013, -205183, -4435, 138251, -106662, 156247, 374070, -19810, -440487, 73508, 181896, 45810, 70962, -116245, 150001, 43877, -275727, 137717, 143384, 32848, -78819, -193510, -37439, -69622, -82032, 51852, -33037, -42159, -251465, 133366, 61538, -75886, -343934, 81669, -18529, -118579, 85764, -130540, -163013, 3679, -421530, 128115, -359730, 78382, 432913, -64366, 183086, 82950, 231684, -195325, 189280, -87305, 248758, -14442, -8591, 109814, -213577, 229813, -38056, -117848, -291594, -400710, -238910, -92753, -140080, -48226, -244126, -129652, -129137, 300578, -36639, 269516, -158513, 169744]
18233i2030b0594B87353A02393B0436h8410f932l86959n336G9776b05423A04889
18221b71076B36887R4460I9993a98400h7998L5732B1158c824j38980A33309a25902
18209B19944a156B16903g5013A38815a5530B0651J23036A3569g3671H2488b9395
18197A8347a64229K0798J7874B9287K67403a8153q1864q7176K6413G3383C3449
18185a5784j86827H8308a21698p471B1620b5749A75717A320a61960l0212E2997
18173g6773j60090F5624a25477j82974E0224L39958E0793L43080d14893d0547
18162b32002f9471B14106d2697k8562j9778j86931a9875j39936j8484Q6044c431
18150b19643j001E8361b90018B26353F4802b53238O3824F7046K1592C1043a82865
$$ y = [-92030, -20594, 287353, 102393, 20436, -88410, -6932, -393891, -399227, 79776, -205423, 104889, -271076, 236887, 331347, 99993, -198400, -87998, -52266, 21158, -3824, -142804, 133309, -125902, 219944, -1156, 216903, -75013, 138815, -15530, 20651, 143687, 13569, -73671, 82488, -29395, 18347, -164229, -143431, -125557, 29287, 296690, -18153, -100017, -187193, -160780, 73383, 33449, -15784, -202611, 88308, -121698, -129169, 21620, -25749, 175717, 1320, -161960, -192172, 52997, -76773, -236863, 65624, -125477, -308451, 50224, 390182, 50793, 393873, -414893, -40547, -232002, -69471, 214106, -42697, -71259, -91037, -277968, -19875, -159811, -178295, -92251, -3431, -219643, -220644, 58361, -290018, 226353, 64802, -253238, -189414, 67046, 88638, 31043, -182865]
18138e3111G7011J04506l1031O9925a96978h5706G126d6621q0168C15921C6960
18126E5065i0664A10038B0501f8567q4915N5510k2932M8664j19353h4101B4279
18114a78189I0060f4651p8099C2499g1181B01182b9704o1989B6557J68286G5075
18102A8626Q6452C3349a7936j83048B26005g1423k7562I4538c8804a3346j00861
18091a14207l61930a12404B77963D7635j3620N473g4606A11318a48877B02881
18080h4781C25294d7142B86070a17131h51q9782A6597L0769a5355k06451A41256
18068C032K39002e3381j5178G6008L11288q9092c34769J30918e642A8970b3570
18056C1032e5888B18b0440B99949C939O0662c27515B01126b2267e036j51449g5142
$$ y = [-53111, 77011, 181517, 150486, 220411, -196978, -85706, 7126, -46621, -126789, 315921, 36960, 55065, -90664, 110038, 20501, -68567, -153482, -97972, -120904, -72240, -191593, -84101, 24279, -178189, 90060, -64651, -142750, 32499, -71181, 201182, -29704, -91693, 26557, 194843, 75075, 18626, 105078, 33349, -17936, -200984, 226005, -71423, -98985, 94538, -38804, -13346, -114207, -476137, -112404, 277963, 47635, 34015, 39488, -74606, 111318, -148877, 202881, -84781, 325294, -47142, 286070, -117131, -851, -90633, 16597, 47366, -15355, -221806, 141256, 3032, 242034, -53381, -68559, 76008, 387296, 298204, -334769, -203851, -5642, 18970, -23570, 31032, -55888, 218, -20440, 299949, 3939, 64601, -327515, 201126, -22267, -5036, -156485, -75142]
18043A19865e3170k6374B31612A1308R6589f4979C5477J85812D096a0134C17858
18031b37661c7947A66439c11571f9990G8792a12181c3626l15624a02513A95820
18020a35800l5559A71180a64518m6789L7681a1636k05088L4417A52450b11077
18009C8301e9149C65765I5262a70398g1859A883d9418A61098c0485n7008o6119
17998a53612H5106O665a87803I3394Q8994e9925o6005N5921N390b5888q7719B61030
17985F274a32005A89426G362O8252l1574M17938b46446r9259B72941n5782a63081
17973i2950A06288M562c6444E7873h3903k9833j1704j58794D1279K5035O8580
17962A34894N4465a41832A56139Q2278p8605j3781D5995B1818J42126B471b39603
$$ y = [119865, -53170, -79544, 231612, 11308, 107897, -64979, 35477, 221289, 4096, -10134, 317858, -237661, -37947, 166439, -311571, -69990, 78792, -112181, -33626, -349250, -102513, 195820, -135800, -171359, 171180, -164518, -211307, -173626, -11636, -216724, -182307, 152450, -211077, 38301, -59149, 365765, 95262, -170398, -71859, 1883, -49418, 161098, -30485, -87493, -153612, 85106, 91771, -187803, 93394, 182388, -59925, -125930, -70009, -64619, -25888, -113607, 261030, 6274, -132005, 189426, 7362, 75614, 44040, 461978, -246446, -345705, 272941, 217159, -163081, -92950, 106288, 110850, -36444, 57873, -83903, -113736, -125440, -284234, 41279, 66314, 134894, 189359, -141832, 156139, 238417, 159812, 146031, 45995, 21818, 163944, 2471, -239603]
17950a83317P0445A38771J33791j24573a16221m2859H5984a22634M4240A84219
17939A48315N0357a78087B81257a24530b4795A35063b10342K8476B68564A9483
17928C13847b75507Q7492a2309A91435C8851h6284e655p2977B89713i9080A57392
17916A64296K11712a42526l10987B65395d74925a96860d3590C973K3169b09014
17905B52008C7231a31505a3381k25942A18467J41822c5586q4580l3785I6351J85627
17894B81978e9858a9282C3519f9842B24161a57717d6731j9983C27876l6704b54127
17882a37941a9742B8136b43513b1058j36384I8595M9480p0225b74131A59823b19571
17870A86680o7104J59846A2176b9311H619a15758G1564a45533A44720E5498K7236
$$ y = [-183317, -112872, 138771, 272562, 147989, -116221, -159080, 85984, -122634, -78394, 184219, 148315, 198672, -178087, 281257, -124530, -24795, 135063, -210342, -181866, 268564, 19483, 313847, -275507, -188015, -12309, 191435, 38851, -86284, -5655, -78632, 289713, -99080, 157392, 164296, 376008, -142526, -453513, 265395, -474925, -196860, -43590, 3973, 27142, -209014, 252008, 37231, -131505, -13381, -239323, 118467, 260289, -35586, -120166, -153951, 96351, 281978, -59858, -19282, 33519, -69842, 224161, -157717, -46731, -66714, 327876, 291172, -254127, -137941, -19742, 28136, -243513, -21058, -157442, 98595, 148075, 77850, -274131, 159823, -219571, 186680, 119576, 279422, 12176, -29311, 8619, -115758, 71564, -145533, 144720, 55498, 82734]
17859H2734a18927A64345L96719f3210D9034a63186J2493A20732k9998L7160b1768
17847C3302a54893l34A48579M0864q4964J99088j36451d3402G0941g3330k05714
17836b79044A13647e2467k95336A06924L86172h0241E6556H613J44286F8219b17708
17824A25080C6389a53762A4998a990D9278i8456B56752f4995l83593a66081E42179
17812I3361h5722b7497B68199a02490k1994q8858H8782b83709B25815a89191j49071
17801c38262A57782j1204g5686J168j1480c6948M264m1105B23204E2169M16160
17790D68329A93058l5041o4653B4971b5025l356n37j72687j75315J84762M5780
17779a46378B46377d5457A5440J72927G9876M13489b01498A54973n1821K39777
$$ y = [82734, -118927, 164345, 561064, -63210, 49034, -163186, -150693, 120732, 90734, 127894, -21768, 33302, -154893, -155227, 148579, 189443, 104479, 303567, 167116, -43402, 70941, -73330, -279044, 113647, -52467, -347803, 106924, 493096, -80241, 56556, 8613, 152899, 68219, -217708, 125080, 36389, -153762, 14998, -1990, 49278, -98456, 256752, -64995, -448588, -166081, 542179, 93361, -85722, -27497, 268199, -102490, -124484, -213342, 88782, -283709, 225815, -189191, -338262, 157782, 146578, -75686, -74518, -85998, -36948, -32684, -73789, 223204, 52169, 468329, 193058, 158017, 93364, 24971, -25025, -28381, -28918, -201605, -376920, -192158, -146378, 246377, -45457, 15440, 188367, 79876, 493365, -201498, 154973, 103152, 342929]
17769C42929a70138k503N8489C3551N3883J75856G2191a43876A80150E2701Q6695
17758A39396g6610A40177O878F3873J87277A3243K10706d3385D697M71988a35229
17746E1982a4871p8866r2600c9803o6133L5834A97008D7984a66118e4979l28575
17735c83554h2928A05777a63671H9241k7090J56667c3405j00857G201J30357n4296
17724H3262i4471C18732o5928A16893J22324a81413A63080K7281J50192A0524
17713C2567a21862L1893B21461b06976g7836A63464g3383I8169j4381K06065d54597
17701h0309B64450P5714c9167j11243E6139d18134b1070a228l02507N3476H333
17689A37334B4770R9428O1069J74834b26461a5104j35671A81449f3712j15233
$$ y = [342929, -170138, -172641, -114152, 33551, 87434, 263290, 72191, -143876, 180150, 52701, 139396, -76610, 140177, 147055, 63873, 251150, 13243, 223949, -43385, 4697, 476685, -135229, 51982, -14871, -93737, -186337, -39803, -105936, -70102, 197008, 47984, -166118, -54979, -383554, -82928, 105777, -163671, 89241, 62151, 218818, -33405, -134262, 7201, 137558, 83262, -94471, 318732, 252804, 116893, 239217, -181413, 163080, 190361, 340553, 10524, 32567, -121862, -89969, 221461, -206976, -77836, 163464, -73383, 98169, 83788, 289853, -454597, -80309, 264450, 340164, -39167, -150410, 56139, -418134, -21070, -1228, -303735, -250259, 8333, 137334, 24770, 124198, 185267, 360101, -226461, -15104, -150775, 181449, -63712, -178945]
17679a78945M0478B26862p3117k6192N869h9663l977A07830J0316Q8014B9308
17667B84582A32115J05481c2905B94985E7525g4257A09185l6345b17978A83666
17656A26570c3197D35355j52763j27576k9201c7474j6280b1945A36320a83403
17645A97005C0540Q3830J13393n8076a31253A39077P1695c1624J0189D8107r117
17634C8990f1453A33832c7367E3052L013K30117E0965c2243C45202c6779C46484
17622A40844B5075J00591K83D7610J14287D1337P2239h954A54950a72345G8018
17610B10143F0284a83509E2133Q0738k7437Q2593a23618B5749a33553A94531J18266
17599C12797D7895J41720r140b36413B55364a31490D64665f0628B15897D7057
$$ y = [-178945, -138467, 226862, 153745, 127553, 133422, -89663, -93640, 107830, 118146, 206160, 29308, 284582, 132115, 237596, -32905, 294985, 57525, -74257, 109185, 72840, -217978, 183666, 126570, -33197, 435355, 282592, 155016, 125815, -37474, -53754, -21945, 136320, -183403, 197005, 30540, 114370, 227763, 169687, -131253, 139077, 210772, -31624, -21435, 48107, 38990, -61453, 133832, -37367, 53052, 56065, 286182, 50965, -32243, 345202, -36779, 346484, 140844, 25075, 125666, 125949, 47610, 161897, 41337, 113576, -8954, 154950, -172345, 78018, 210143, 60284, -183509, 52133, 132871, 105434, 188027, -123618, 25749, -133553, 194531, 312797, 47895, 189615, 180475, -236413, 255364, -131490, 464665, -60628, 215897, 47057]
17588A44009i4992L6525C31431J27067h5038A78199n1527J1466b3661A94875i502
17576B10833k4849c8514A76398h611C9353J38670J08062R8246A53330K30516B9779
17564A40353a7056A88811p69n2406m5721a8331B76280d4632B38522i8861C38681
17552A31945b7092A45570k3655g5202A27774K73257c62260g0955B19003r2850
17542A26153R0829J21199b7071A03717f7799C84163A51324J1975a83442h3888
17531A05840J93780M4853J04317j89176G7763j7030K48359a65958C40733j38482
17521B02251a011D78612k16219P1615j12409K78811k10104A27033K70242Q6296
17511D83571j48918N45738J93490J50147m14645j56171J19316o9396B93292j42749
$$ y = [144009, -94992, -58467, 331431, 458498, -85038, 178199, 126672, 138138, -23661, 194875, -9502, 210833, 185984, -38514, 176398, -8611, 39353, 178023, 286085, 384331, 153330, 383846, 29779, 140353, -17056, 188811, 188042, 135636, 89915, -18331, 276280, -44632, 238522, -98861, 338681, 131945, -27092, 145570, 121915, -75202, 127774, 401031, -362260, -70955, 219003, 126153, 216982, 338181, -27071, 103717, -67799, 384163, 151324, 163299, -183442, -83888, 105840, 299620, 344473, 448790, 259614, 77763, 60733, 309092, -165958, 340733, 202251, -1011, 478612, 262393, 334008, 221599, 500410, 290306, 127033, 397275, 483571, 334653, 880391, 1073881, 1224028, 809383, 653212, 772528, 703132, 293292, 150543]
17501A50543M0442N1629L93396r8572R8943j88897J66519L17185o7287l8874L2734
17490H57761k06555J9190l23672q6319l9219m5934E0709M12429j85520L03883
17480E81501A94149R9139M6619J84551B5281K23388c4584C17361p1656l3150J78154
17469C90709l8600C7111c5507D31235N417A34983K66963A99923Q8066L40633a57955
17457C17204q8381J52070q1551I2342L70724j74538A15493J78159R6796J05664
17447D96112G9003M6968M8185e3614C50248A67278P92J08969q1561J6446K2129
17436B34053P8613L64A28920J25494P6544m1540j02241M9729m2492o4672J33667
17425B63409k1963K8774A04563K73842E6397J50831K18329A74580l8719M8249
$$ y = [150543, 190985, 242614, 636010, 537438, 636381, 447484, 614003, 931188, 863901, 825027, 857761, 651206, 670396, 346724, 260405, 221186, 175252, 50709, 463138, 277618, 581501, 194149, 293288, 339907, 524458, 25281, 248669, -34584, 317361, 245705, 212555, 390709, 352109, 37111, -35507, 431235, 436652, 134983, 401946, 199923, 287989, 628622, -157955, 317204, 228823, 380893, 299342, 92342, 463066, 288528, 115493, 293652, 390448, 496112, 79003, 125971, 174156, -53614, 350248, 167278, 168070, 277039, 195478, 211924, 234053, 312666, 313030, 128920, 254414, 330958, 289418, 187177, 236906, 194414, 129742, 263409, 241446, 270220, 104563, 378405, 56397, 207228, 425557, 174580, 135861, 184110]
17415A84110R3519j257L4474L8244J42901o5668j48992j20107N76701l24343j82077
17404B27505D1563O95522A95153m6385L56313A0112K65345l278J25122r0493Q9432
17393C96240j3638I2623M56424B46952A02281l0774J48451K86256k02042a59656
17382b991A85501o7898a07575D90774a956A58757g106C75259o4842q7061a81138
17370A49159e6454G9060P8055P1926N5949A12029K8905E9859L57469j66047m8305
17359B02976e067D69971A69556D5011L07311l4165o2863r7856C0694J14737o9992
17348G5439L74835j6091K6590J19624k29414B9017J93300J85276j75557A01495
17337B68323J78367A39107J00554o9208l482J42929K00860f4879A53536J38530
$$ y = [184110, 277629, 276372, 310846, 349090, 491991, 426323, 277331, 157224, 733925, 409582, 227505, 41563, 737085, 195153, 148768, 505081, 10112, 275457, 272179, 397301, 306808, 396240, 382602, 92623, 549047, 246952, 102281, 71507, 219958, 506214, 304172, -159656, -2991, 185501, 117603, -107575, 490774, -1956, 158757, -7106, 375259, 310417, 223356, -181138, 149159, -56454, 79060, 157115, 229041, 284990, 112029, 140934, 59859, 417328, 251281, 202976, -5067, 469971, 169556, 45011, 352322, 318157, 255294, 157438, 30694, 145431, 75439, 450274, 434183, 460773, 580397, 350983, 29017, 222317, 407593, 232036, 101495, 268323, 446690, 139107, 239661, 170453, 166971, 309900, 510760, -64879, 153536, 292066]
17327B92066J12887K21606B79932q1765N47368B83663A40808R995k084J06385
17317B55104I1716K39810A57340l1284K34795P5601n9226k4475j27921J59830
17307C84660J13204A86886M6668H9564L19129H8406J07075M15601f695C32361
17296C67947k5583j9046A36780d7362A61915k8995K8017R8923J5045q8572L53493
17285E39826C0977J83716L10171B16009r5710R4176J34499A0185J36422E3853
17274D31556P3523j18656p2949I5954L77099p2035b9944B22387H1876R2325J52930
17263C27131o5913j0081F6720J25085a6677E31200k12395A24214J09608J25362
17253C59184A71868G9366J89553L2257I9676M10329q0112H4320N25598j90195
$$ y = [292066, 404953, 626559, 279932, 198167, 745535, 283663, 140808, 150803, 148719, 255104, 91716, 331526, 157340, 126056, 360851, 436452, 377226, 352751, 224830, 384660, 497864, 186886, 233554, 89564, 408693, 88406, 195481, 611082, -6695, 332361, 367947, 342364, 323318, 136780, -47362, 161915, 132920, 160937, 259860, 274905, 186333, 539826, 30977, 214693, 524864, 216009, 120299, 214475, 348974, 10185, 146607, 53853, 431556, 505079, 386423, 313474, 95954, 473053, 401018, -29944, 222387, 81876, 174201, 327131, 261218, 251137, 66720, 191805, -16677, 531200, 318805, 124214, 233822, 359184, 171868, 79366, 268919, 301176, 99676, 510005, 429893, 84320, 609918, 419723]
17243D19723n1768M3355A62265L8537q3922O2940D528O94120k84118a6252j8862
17232c5114F60912B42905L8696K9085p4103N6463F2394K26455j41787P2638K76290
17221D95990A01590R4529M2373K70476J14521B37464M2074L78103k84727l219
17211C69695J53482B07789L28022B10012P086J0843a01629E15906B39181J41454
17201C80635n241A65065J53133J01R1583l4488Q3171B10814K17209A40009J26909
17190B66918J24804j76904K51964o0964j41434m312L15020k56656j8931j30058
17180A69447K5683J26516F1488J85009L10524J12422B77181L05825K269k10960
17170C74315J70876j85556L12485l04309K8644r1279A39019K39526N9775J14080
$$ y = [419723, 367955, 411310, 162265, 200802, 116880, 179820, 4528, 698648, 414530, -16252, -35114, 660912, 242905, 281601, 310686, 236583, 293046, 62394, 288849, 147062, 219700, 495990, 101590, 196119, 238492, 508968, 623489, 237464, 279538, 657641, 372914, 369695, 523177, 207789, 535811, 210012, 217098, 227941, -101629, 515906, 239181, 380635, 375394, 165065, 318198, 318299, 409882, 375394, 458565, 210814, 428023, 140009, 266918, 391722, 214818, 466782, 405818, 264384, 260072, 575092, 318436, 299505, 169447, 195130, 321646, 61488, 246497, 557021, 669443, 277181, 583006, 585275, 374315, 545191, 359635, 672120, 367811, 396455, 305176, 139019, 378545, 438320, 552400]
17160E52400m3968j02203o3058P1124o8999r5783J73910J48216B36650J01686
17150C38336J08324B07224K6979K76720j45978l4267L65758l00866J07990J32333
17140F35893n9078j45755k9782j05303M97664r4258A76370R4099j15195K22855
17130C78129J15063A07765M43561j15394n8540O5845K4442L42179l93708H7634
17119B62483K58714j2986j31045M1907q0334P8756M29869j18889k91881J28115
17109E64709j48694N1403J17234m2463J98180n9770k28239J33619k45189K78613
17099F19403k16263K50076q458K05650B51615R8932J07951J57755j19126n394
17089D91733K18926k00172N4004j92186J64922J51595J82274D22622J23790K34977
$$ y = [552400, 508432, 406229, 343171, 414295, 345296, 249513, 423423, 571639, 236650, 338336, 446660, 207224, 234203, 510923, 364945, 330678, 696436, 395570, 503560, 635893, 576815, 431060, 401278, 295975, 793639, 699381, 176370, 270469, 155274, 378129, 493192, 107765, 551326, 435932, 377392, 443237, 467679, 809858, 416150, 87634, 262483, 521197, 508211, 377166, 419073, 338739, 417495, 847364, 728475, 436594, 564709, 416015, 467418, 584652, 542189, 740369, 680599, 452360, 585979, 340790, 619403, 403140, 653216, 644758, 850408, 251615, 350547, 458498, 616253, 497127, 491733, 710659, 510487, 564491, 372305, 537227, 688822, 871096, 422622, 546412, 781389]
17079G81389k02507J28711q0337M6756K2977C45032Q2325M48241N5058m20187
17069E10469M0134K25799B76045M01291j41703P0110p3500j8756M0536R880j06524
17058D57379M40930j84269l7743k84798L28093K75971m57321K70440j45605P1443
17048G34520K34509Q026j98322j35919M07236m01999J01943k706j3890j14449
17038F18949J22603j20034J39778N7498k84697L26057j30442j2508Q812P0635
17028G96651J59071j11683k57844M6701K97700J76553m92299J65999p9780j06346
17018E94723L38528k46648N0042R9913J34123j97761K60680k4858j60525K62770
17008A110987l56509P1181K65071l50411L00512l48181K12107k19591L67551j27062
$$ y = [781389, 578882, 707593, 627256, 674012, 696989, 345032, 427357, 875598, 930656, 510469, 550603, 776402, 276045, 677336, 535633, 605743, 532243, 513487, 554023, 563903, 457379, 898309, 714040, 676297, 391499, 719592, 995563, 538242, 808682, 663077, 734520, 969029, 977055, 778733, 642814, 1050050, 648051, 749994, 747288, 733398, 618949, 741552, 621518, 761296, 818794, 534097, 860154, 729712, 717204, 726016, 796651, 955722, 844039, 586195, 632896, 930596, 1107149, 614850, 780849, 701069, 594723, 933251, 686603, 736645, 836558, 970681, 772920, 1033600, 1008742, 848217, 1110987, 754478, 825659, 1090730, 740319, 1040831, 692650, 904757, 685166, 1052717, 925655]
16998I25655r902l06876k7593L15692J071M4923K78349j87861k28102M02349r1168
16987A116537j72710N8803M87790j6380k91124j02447j61742J56971l14666J89887
16977I50919J69659O7676K83903n71301N37849k55233K0172P0437j43152J40524
16967A271453j61684M4043j80308L18259K7736P3645m7602j447r3255k87488M08886
16956A372238q0134o4719P2620k9736O6099J89759k71384M70687o97508K99658
16946A327580K86612j13028k26843J08870J46088k36346K58899j4686j78796K40593
16936A598943j09114r9179M772K83497o0554P2057k24225N35432o84952L97934
16926A714611m39925J98490O6464O7197J24179J91619j97753l4606J16464l14563
$$ y = [925655, 915753, 608877, 581284, 896976, 898047, 942970, 1221319, 1033458, 805356, 1207705, 1116537, 943827, 1002630, 1490420, 1474040, 1182916, 1080469, 918727, 1075698, 761032, 950919, 1120578, 1188254, 1472157, 900856, 1438705, 1183472, 1203644, 1274081, 1130929, 1271453, 1109769, 1153812, 973504, 1291763, 1319499, 1393144, 1345542, 1344095, 1250840, 963352, 1372238, 1292104, 1227385, 1300005, 1270269, 1336368, 1526127, 1254743, 1725430, 1027922, 1327580, 1614192, 1501164, 1274321, 1383191, 1529279, 1292933, 1551832, 1537146, 1358350, 1598943, 1489829, 1390650, 1395422, 1678919, 1618365, 1690422, 1466197, 2001629, 1316677, 1714611, 1274686, 1473176, 1539640, 1606837, 1731016, 1922635, 1724882, 1690276, 1806740, 1492177]
16916A492177M62862k46943M07127j08224j04848N221K2671P426R5937k45936
16906A787470K08968j00882J81882L8082P8707k06511K77808K13486m99776K52760
16896B231994j32943J45676Q454Q2597l42824j3805J67925M05758Q7385k79264
16886B360953j54396L63837j02293p6341M16324o2430K7282j98222J34062k46004
16876B462772J68813j14111M23208r0130N4077j38768L02188j09207P2277j45612
16866B885507M9055J75411J69202q7789j417L06833k54221j63191K92538L01594
16856C673522l47822K84948M6809k33701K17609Q1398J04859K41431l61597J26942
16846C834398M6544J54633k01908K84736K38521K71165k32415K8169J14577j16194
$$ y = [1492177, 1955039, 1708096, 2115223, 2006999, 1902151, 1907372, 1930043, 1937469, 2033406, 1787470, 1996438, 1895556, 2077438, 2115520, 2194227, 1987716, 2265524, 2479010, 1979234, 2231994, 2099051, 2244727, 2253181, 2335778, 1992954, 1979149, 2147074, 2552832, 2640217, 2360953, 2206557, 2570394, 2468101, 2391760, 2808084, 2745654, 2772936, 2574714, 2708776, 2462772, 2631585, 2517474, 2940682, 2850552, 2904629, 2765861, 3068049, 2958842, 3031119, 2885507, 2934562, 3109973, 3279175, 3191386, 3189969, 3496802, 3242581, 3079390, 3371928, 3673522, 3325700, 3610648, 3657457, 3423756, 3641365, 3722763, 3827622, 4069053, 3707456, 3834398, 3880942, 4035575, 3833667, 4118403, 4356924, 4628089, 4395674, 4423843, 4538420, 4422226]
16836D422226j14912M86067L0619K18630j78902J88747J08518N502k18641J89424
16826E137278J23761R8049l7687K82089L57412j03774M09658j69217J95434k62500
16816F030503J72072J60130K35066J80429Q2555K50413n38407M06672J84341L36834
16806G500608L34611r209m4867k3700M60496k24173N89147j10757M38918K16264
16796I127338j45733K63106J70192M24685M92060m41786Q21781K76418j5204N6276
16786A1029133M93213K46805M10551n8639P20245K4431N56833p2169M95765K58168
16776A4104336N29571M60924M39951L17368Q37222j38407N55602N79453O52094
16767A8338114K57579K95536P52054M33423P93491O22986O03549R31762L44467
$$ y = [4422226, 4307314, 4793381, 4824000, 5042630, 4863728, 5052475, 5160993, 5166495, 4947854, 5137278, 5261039, 5359088, 5321401, 5603490, 5960902, 5857128, 6266786, 6097569, 6293003, 6030503, 6202575, 6362705, 6597771, 6778200, 6860755, 7111168, 6572761, 6979433, 7163774, 7500608, 7835219, 7826010, 7781143, 7757443, 8217939, 7993766, 8582913, 8472156, 8911074, 9127338, 8981605, 9244711, 9414903, 9839588, 10331648, 9889862, 10711643, 10988061, 10972857, 11029133, 11522346, 11769151, 12179702, 12121063, 12841308, 12865739, 13422572, 13350403, 13846168, 14104336, 14633907, 15094831, 15534782, 15852150, 16689372, 16550965, 17106567, 17686020, 18338114, 18595693, 18891229, 19643283, 20076706, 20870197, 21493183, 22096732, 23028494, 23372961]
16758B3372961P06451J138156O04646J073474M96634R87662J080536R68647J088283
16749C1517450J091876J173575J179384J341127J475460J340603J359361J914059
16741D2392895J330503J517782J870053K015991K166675J820609K185160K163300
16733E7462968K797906K363797K702117K622661L103874K618940L200374K932720
16725G9805357L514761L219014L561849L332238L633448L530564L586653L624491
16717A07808375M051710K980314L743293L142862K947777L061500K669507K404768
16709A32810106J977981J648573R25369O38078O07163j95849n10539j149945j734249
16700A35016688j591684k126072k800623k591934l393496l081066l712589l179902
$$ y = [23372961, 24079412, 25217568, 25822214, 26895688, 27392322, 28379984, 29460520, 30429167, 31517450, 32609326, 33782901, 34962285, 36303412, 37778872, 39119475, 40478836, 42392895, 43723398, 45241180, 47111233, 49127224, 51293899, 53114508, 55299668, 57462968, 60260874, 62624671, 65326788, 67949449, 71053323, 73672263, 76872637, 79805357, 83320118, 86539132, 90100981, 93433219, 97066667, 100597231, 104183884, 107808375, 111860085, 114840399, 118583692, 121726554, 124674331, 127735831, 130405338, 132810106, 134788087, 136436660, 137362029, 138000107, 138607270, 138411421, 137900882, 136750937, 135016688, 133425004, 131298932, 128498309, 125906375, 122512879, 119431813, 115719224, 112539322]
16692A12539322l863614l845233l441730l828273l765664l567933l633605l276273
16684H3316997l516914l000563l543848k925243l003486k599221k945297k385068
16676E9397357k524944k351040k448437k005992j959562j694691k041809j878349
16668D2492533j300437j778957j759592j164762j514116r41139j492207j163115
16660C1378208r04119j361541p30599r97362o37443r57782j169234o96483j139515
16651B2784130m48982l13778r32331j079282j07397r07723k38561o99484n77084
16642A7479508l62126o55961k54183n04949p21195K11325o85402l61016n63104
16633A3582897j98350j29951m19671k70756p49501k12274p0324j46373n9369m54703
$$ y = [112539322, 108675708, 104830475, 101388745, 97560472, 93794808, 90226875, 86593270, 83316997, 79800083, 76799520, 73255672, 70330429, 67326943, 64727722, 61782425, 59397357, 56872413, 54521373, 52072936, 50066944, 48107382, 46412691, 44370882, 42492533, 41192096, 39413139, 37653547, 36488785, 34974669, 34033530, 32541323, 31378208, 30474089, 29112548, 28381949, 27384587, 26747144, 25789362, 24620128, 23923645, 22784130, 22335148, 22021370, 21089039, 20009757, 19902360, 18994637, 18756076, 18056592, 17479508, 17117382, 16461421, 16207238, 15702289, 14981094, 15192419, 14507017, 14146001, 13582897, 13384547, 13254596, 12834925, 12564169, 11814668, 11602394, 11532070, 11385697, 11326328, 10871625]
16623A0871625o31223j3008J33891k86652n23591l8025j07325q35244p0498K73025
16613H772975l06452j98042j83820k16843l43620K34295j67678j96818r1680k18258
16603G084059j80601k40407J38794q9176l92091L4264k23472R0750n10480J1899
16593E723539Q5700o4430k89678J37323l84159O7754r5798j40808J56622J1301
16583E207366l17171K91586m11943j54415k2758l16148M84712k70472m56818L66673
16573D400612R231l00535Q7873l12256J07244r1653K07586l98289o2609O7029
16563C714233K011j17301j8560k07674J01872J9525l9247K2350m01798r3098p9887
16552B902426K65143j02222l13025N22163j17596j59405j09321J97540l28267
$$ y = [10871625, 10240402, 10227394, 10361285, 10074633, 9551042, 9513017, 9405692, 8570448, 8499950, 8772975, 8466523, 8268481, 8084661, 7867818, 7524198, 7758493, 7590815, 7393997, 7302317, 7084059, 6903458, 6663051, 6801845, 6712669, 6320578, 6354842, 6131370, 6222120, 5711640, 5723539, 5809239, 5744809, 5455131, 5592454, 5208295, 5276049, 5180251, 5039443, 5196065, 5207366, 4890195, 5181781, 4769838, 4615423, 4592665, 4276517, 4761229, 4490757, 4033939, 4400612, 4409843, 4109308, 4197181, 3884925, 3992169, 3900516, 4108102, 3709813, 3647204, 3714233, 3716244, 3598943, 3580383, 3372709, 3474581, 3494106, 3454859, 3477209, 3075411, 2982313, 2902426, 3167569, 3065347, 2752322, 3274485, 3156889, 2997484, 2888163, 3085703, 2757436]
16543B757436J95037j16528j94097L41372m98362L39612j25749j97930p7084M41325
16533B865032m68135J55866m795m91514M15005j23179k10310K00900q4464j00417
16523B153989K3500k03033p470K91208l71608R1108k0437K24186r2231R5323n6331
16512B128204j12941Q0747k85951K14135J11582j14619q3192j38139K47278k88672
16502A758432k1915j18749O9639q9555Q2580q8997J89853j91040p4743K22920
16492A738425o84l1898N702j74724K35965k33807J04922k33677L5666k5535L43403
16481A763758m45855M79840k1299j91332k94363M8898R0805L120j16424k21094
16471A096054K43792L06994p1338M3253m59357K71049j45678N4993o9444J4383
$$ y = [2757436, 2952473, 2835945, 2641848, 2983220, 2484858, 2824470, 2698721, 2500791, 2423707, 2865032, 2396897, 2552763, 2547968, 2056454, 2471459, 2348280, 2137970, 2338870, 2254406, 2153989, 2177489, 1974456, 1966986, 2258194, 1886586, 1977694, 1957257, 2181443, 2089212, 2184535, 2128204, 2015263, 2096010, 1810059, 2024194, 2135776, 2021157, 1937965, 1799826, 2047104, 1758432, 1736517, 1617768, 1687407, 1597852, 1680432, 1591435, 1781288, 1590248, 1515505, 1738425, 1737741, 1705843, 1711545, 1536821, 1772786, 1538979, 1643901, 1410224, 1445890, 1420355, 1763758, 1317903, 1797743, 1776444, 1585112, 1290749, 1339647, 1430452, 1433572, 1317148, 1096054, 1339846, 1646840, 1575502, 1618755, 1159398, 1430447, 1284769, 1339762, 1270318, 1284701]
16461A284701j64225k83259R4280N18813j43701k86241K18316l02361j2867J32854
16451A056310K00737k10963J82057j78225J00982o6754m09997K45034K39791j00549
16441A058423j62427J43300K93061k05323j77258J06694j45027L10771j48442
16432A073772m5858P0897m05657J70668o2226K10211D70476L62916j44409K71447
16422I60430J32815n1700o2647j91166J7736k40168M50779k67678J92009Q9248
16412A029658l63792L94648j83517r3009K50196k69220O1074J00982k71007J3352
16402F69365l7432J28936k8079O9283L9483k45982J87628J49368l02503K6473
16392F56540J73959j43674K18215k15212Q2549P7890B14612L17365K26765k27879
$$ y = [1284701, 1120476, 837217, 931497, 1450310, 1306609, 1020368, 1238684, 936323, 923456, 1056310, 1257047, 1046084, 1228141, 1049916, 1150898, 1084144, 674147, 919181, 1158972, 1058423, 895996, 1039296, 1332357, 1127034, 949776, 1056470, 911443, 1222214, 1073772, 1027914, 1098811, 693154, 863822, 801596, 1011807, 470476, 833392, 688983, 960430, 1093245, 1041545, 978898, 787732, 805468, 565300, 1016079, 748401, 940410, 1029658, 665866, 1060514, 876997, 783988, 1034184, 764964, 826038, 927020, 656013, 669365, 631933, 760869, 732790, 802073, 841556, 595574, 783202, 932570, 630067, 656540, 830499, 686825, 905040, 689828, 772377, 850267, 214612, 531977, 758742, 530863]
16382E30863J96808o5073J83636j05444j66674k21080j1992O85781k67947K3621
16372G82499j2981k68949J29755M0571j22952j6284L81150l85799j58849R3415
16362D61576J90380R3467j249j43208J04006j30648k80058J56181K28511N4825
16352G33783m7084o1289q2143K15894j2716k71948K01230k31080K20335P2052
16342G37034M0278j83551j39496J77779J73011j67138P2604k14756K77453j57928
16332F15290l6538J19810k42613r2444M61850B91510K11864B24312M51183k65022
16322D10473j0073K10756k31568K80901J36846j88751l3506p9624N9976j49284
16312D06146K55077j66234j43803J9564K21732N04k54894N6258k9643N26518k48927
$$ y = [530863, 727671, 662598, 846234, 740790, 574116, 353036, 341044, 1026825, 758878, 782499, 769518, 500569, 630324, 670895, 547943, 531659, 912809, 527010, 368161, 461576, 651956, 745423, 744174, 600966, 704972, 574324, 294266, 450447, 678958, 733783, 686699, 625410, 543267, 759161, 746445, 474497, 675727, 444647, 664982, 737034, 777312, 593761, 454265, 632044, 805055, 637917, 710521, 495765, 773218, 615290, 578752, 698562, 455949, 363505, 825355, 291510, 503374, 224312, 675495, 410473, 400400, 611156, 379588, 660489, 797335, 608584, 575078, 495454, 555430, 406146, 661223, 494989, 351186, 370750, 592482, 592986, 338092, 394350, 364707, 891225, 642298]
16301F42298j56067j26609P0712j17738L8276L47933k08762k284j73758J57749
16291D71750j37210L98396C56670o3500J97321m0598m6748L0386j88924N69024
16281H13631l94891n1859L1382A81889J66869j5531j10208J1142H860J78591j4919
16270A72532J59903j0379J8772N30065C78622M8587n4292M57915B45457N94294
16260H39751l93815j24151L3611P9777k9854j79296J84588D6860L28575J35808
16250E11243q6712j44906L31764r8906n3606f0803C39454m7959j20512K3977K43275
16239D38235J09444B57980j09570M39432B45693R422J63912j31331J17107j80814
16229B23989G6680M1085K19105L632N1877m7735j14832m9245J56242n7873n9476
$$ y = [642298, 486231, 359622, 430334, 312596, 350872, 698805, 490043, 487759, 314001, 471750, 334540, 732936, 356670, 293170, 490491, 449893, 403145, 433531, 244607, 813631, 418740, 366881, 398263, 181889, 348758, 333227, 223019, 234161, 8860, 187451, 172532, 332435, 322056, 340828, 870893, 378622, 427209, 372917, 830832, 245457, 839751, 445936, 321785, 355396, 435173, 405319, 226023, 410611, 46860, 375435, 511243, 424531, 279625, 611389, 512483, 458877, -60803, 339454, 291495, 170983, 194960, 438235, 547679, 257980, 148410, 587842, 245693, 255115, 419027, 287696, 404803, 223989, 76680, 117765, 336870, 340502, 392379, 344644, 229812, 180567, 336809, 278936, 219460]
16218B19460m4060O852c993A39820O9202g4559A38973L2410J79457j44531K27803
16207D34112j79715B5561J33758O7191e1919c01D06468H3560M54141J04380A30989
16195b1229C57584A76471G8106J80073P6181b32193C61016A69237M1137k6808
16185A83566A3535Q0669L62062k4088j28649k0332j17229b9355B76004H0568a09896
16173B82887G0514K25862A05421J98408D3155a01379B03764K01029J69326k32203
16163C41916i5176G9846L50991n1145b64066C2297K81207C7665d1534B59370n0824
16152B08546F5258J20936N0158N1555p4743A302K10656j9314j2582r399f467C53970
16139c8973N719A7444E429J56687K03001j24732J03698A12360J2696k7684B5068
$$ y = [219460, 175400, 182252, -3993, 139820, 209022, -74559, 138973, 171383, 350840, 206309, 434112, 254397, 25561, 159319, 226510, -51919, -301, 406468, 83560, 537701, 642081, 130989, -21229, 357584, 176471, 78106, 258179, 334360, -232193, 361016, 169237, 210374, 183566, 13535, 94204, 456266, 432178, 303529, 283197, 165968, -29355, 276004, 80568, -109896, 282887, 70514, 296376, 105421, 303829, 43155, -101379, 203764, 404793, 574119, 341916, -95176, 79846, 430837, 379692, -264066, 32297, 313504, 37665, -41534, 259370, 208546, 65258, 186194, 236352, 287907, 213164, 1302, 211958, 192644, 180062, 170663, -6467, 353970, -38973, -33254, 17444, 5429, 162116, 365117, 240385, 344083, 112360, 125056, 97372, 25068]
16127E17566c87457g8853A42735A1503L42340a36466M357B04428r5864R7280k721
16116B03123K18865G8841R0196l01J90962A40014N2539N7731A3624b5854A66476
16104e1315D3502c2893n9208c5484J3964D4120a14479L8748J0362G1125N6739
16093A27864R7341f0511B15315C0491K39162c9328C37751h0650A19597B2307J32465
16082A54772E845R1700A3813M00625A80127q6585J22442L2385k076a91199e0292
16070B2942q573f3691C6409a8398C336K66447a32765B15971o474h6060K1300B416
16057C87591A0846O5378d2548G5888Q2080a53341G057K02333d0051C68759A22184
16045D65910A01603C2562K34702j5382A11145M40150A81881a12499C3798g337
$$ y = [517566, -387457, -78853, 142735, 11503, 353843, -136466, -132109, 204428, 108564, 205844, 203123, 421988, 78841, 169037, 168736, 359698, 140014, 192553, 250284, 13624, -25854, 166476, -51315, 43502, -32893, -92101, -35484, -21520, 44120, -114479, -75731, -65369, 71125, 127864, 225205, -60511, 215315, 30491, 269653, -39328, 337751, -80650, 119597, 22307, 154772, 5845, 97545, 13813, 414438, 180127, 93542, 215984, 248369, 246293, -191199, -50292, 22942, 14369, -63691, 36409, -18398, 3336, 269783, -132765, 215971, 209497, -86060, -64760, 2416, 387591, 10846, 76224, -42548, 75888, 157968, -153341, 7057, 209390, -40051, 368759, 122184, 465910, 101603, 32562, 267264, 251882, 111145, 551295, 181881, -112499, 33798, -7337]
16034B59449e7716a608j04897C10363c05314O6107A17889J26184a63094C32267
16023e1806D6591a10166B9171L38264H0139a49861G3057J43297G7230Q5565N7202
16012B19997k7151a60781A05681C0033J16462a54636C49646A20179E1863K8141
16002H0004c68977a12915K3193B29841a00805H3355e1307k61429h7334A80821
15991f7783A33186b2768j25155B50465J22076a32931B53266D5740G456a3508r4044
15980a07552j6725f0767H8551O4589J82768B8998M13546R0804J91879O8962L235
15969G97424K71540m85799J52510l13169o0397A17465K0499j7005j4744E0159
15958D9673r638d6513F7300L3123J46804J04270D276J86979j0370b96759A77127
$$ y = [259449, -57716, -1608, -106505, 310363, -305314, -239207, 117889, 244073, -163094, 332267, -51806, 46591, -110166, 29171, 367435, 80139, -149861, 73057, 216354, 77230, 162795, 219997, 192846, -160781, 105681, 30033, 146495, -154636, 349646, 120179, 51863, 80004, -368977, -112915, -89722, 229841, -100805, 83355, -51307, -312736, -87334, 180821, -67783, 133186, -22768, -147923, 250465, 372541, -132931, 253266, 45740, 7456, -13508, -107552, -124277, -60767, 88551, 153140, 335908, 28998, 442544, 533348, 725227, 794189, 797424, 1068964, 583165, 735675, 422506, 362109, 117465, 137964, 120959, 106215, 50159, 49673, 40035, -46513, 67300, 100423, 247227, 351497, 4276, 191255, 180885, -296759, 177127]
15946a19576b8905C5865J94866a75167B37455B1782b8142B5246b37867K5811G7362
15934E4964n205L3438J8975b04933L5417M7472j35309B98911f38A19924E2033
15922a99587h459D02664b5638B15912a11805b3755B90856A31801L1321D3629J3821
15911E7450c87889a27717C4376J54047a94538B43902j0014J98416A67167M1768
15901B08935p5151a28330A17884b64220n5042f062A84104C3298a61580B73678
15890a53468O7803A17767a23286R186A83497l475b23802Q3640f1408m3715F2799
15878A25512c2705r3390F7586a01708j8512l3725k3240g6992j55488D251c31091
15866A1729d12771R8972f7404r4985d3813n4401C85459A43529D8014P9429J08354
$$ y = [-119576, -28905, 35865, 230731, -175167, 237455, 21782, -28142, 25246, -237867, -212056, 77362, 54964, 49759, 83197, 102172, -204933, -169516, -122044, -257353, 298911, -638, 119924, 52033, -199587, -8459, 402664, -25638, 215912, -111805, -23755, 290856, 131801, 163122, 43629, 57450, -387889, -127717, 34376, 188423, -194538, 243902, 233888, 432304, 167167, 208935, 133784, -128330, 117884, -264220, -319262, -6062, 184104, 33298, -161580, 273678, -153468, -85665, 117767, -123286, -114100, 183497, 180022, -223802, -140162, -61408, -105123, 62799, 125512, -32705, -126095, 67586, -101708, -120220, -153945, -177185, -76992, -232480, 4251, -331091, 11729, -412771, -313799, -67404, -162389, -43813, -98214, 385459, 143529, 48014, 127443, 235797]
15855B35797k8336b25632l08E1615K74396c04540a16774E0836B4720N1404c56770
15843a92030j94792a65817c7717k99321J31202E8870R6817c9990m56519F8491
15832D3477j8867c5684j7701j08263a3803D2781J00614o136M4789d05042d5666
15820b58320C35979K5375a45318e3991G5467d9640b4716H3092e0243j18228b0844
15808A62659c063D7674b60487A35839B7187P0344b44112A51992l2790e9491a2771
15796i3773o3571D4488i064k0911l3173Q960q0500k111A12167c41081f8357j0954
15784g9311j7183E90J79020O6501e1260C8217J00593D873J61502b25019f7418
15772g698B0074c44940H4675e2606q1400A23818J26587D679J3542L4011b10251
$$ y = [235797, 207461, -225632, -225940, 51615, 326011, -304540, -116774, 50836, 24720, 76124, -356770, -192030, -386822, -165817, -37717, -337038, -205836, 58870, 155687, -39990, -496509, 68491, 43477, 24610, -35684, -53385, -161648, -13803, 42781, 143395, 137259, 182048, -405042, -45666, -258320, 335979, 361354, -145318, -53991, 75467, -49640, -24716, 83092, -50243, -168471, -20844, 162659, -3063, 47674, -260487, 135839, 27187, 97531, -244112, 151992, 119202, -59491, -12771, -93773, -157344, 44488, -9064, -29975, -63148, -54188, -134688, -136799, 112167, -341081, -68357, -79311, -96494, 590, 179610, 246111, -51260, 38217, 138810, 4873, 166375, -225019, -67418, -7698, 20074, -344940, 84675, -52606, -134006, 123818, 250405, 4679, 18221, 52232, -210251]
15760b83057p0526d2081I4709a30265B10097l3928a58515e4136k96415e8023a6117
15748b30364A03078a15617k2954F14916c50887F3581R6066m8765C4055A0091J8069
15737B8160c3047F2061L2191k1483a2258o6239j54345H3124g7977C848L7356c37349
15724I7208m3273h0540j05546N4242B40184a67658N3538n9005E6370a19450j85211
15713c04661J23070A18840l5652a51663D8422J12737B5637L23124D2561Q5112
15703A27673n3372l4175P7979E8418a62783O8923C41466b00159Q3146H7199a2172
15691a61319j20919O9621g9607B0286b69980a31709l27220A04349J1006a2914
15680D39318b10677j7547C26976A6881K97256h766D1216j8748d3584A48408b00706
$$ y = [-283057, -353583, -42081, 94709, -130265, 210097, 176169, -158515, -54136, -350551, -58023, -16117, -230364, 103078, -115617, -138571, 614916, -350887, 63581, 159647, 110882, 34055, 10091, 28160, -33047, 62061, 94252, 72769, -12258, -78497, -232842, 83124, -77977, 3848, 41204, -337349, 97208, 53935, -80540, -186086, -131844, 240184, -167658, -114120, -173125, 56370, -119450, -304661, -181591, 118840, 83188, -151663, 48422, 161159, 25637, 348761, 42561, 127673, 74301, 40126, 118105, 58418, -162783, -93860, 341466, -200159, -117013, 87199, -12172, -161319, -282238, -212617, -79607, 20286, -269980, -131709, -458929, 104349, 115355, -12914, 439318, -210677, -228224, 326976, 16881, 314137, -8766, 41216, 22468, -43584, 148408, -200706]
15668c6544o4585M4835F1301e7466D1232a25940c2469j25617A57784G2802j2434
15657F0368b29306N6743Q0309d4922l8193K4787I7218D2848a50899C14634A3628
15645A29951b7317r2835c0780e972A79203E7324e605F2128a89942C7606b65808
15633c20041A31482h7103L3593h210A2734f1113j57842A66215o5190a15646A32135
15621a05685d5673A25246m7773a21648A49148a11159j00586A57217a19230A19242
15610a86866k10398A62411F2351b31606H6250L5409J8299A1279b96876B5207c1911
15598F8407a52193C4471c10808I3964J07656b78355A80395a33472j0933C36799
15587b67723A64578j1854o2744c34047A89626j4320D6230c18643n2524B46296
$$ y = [-36544, -101129, -56294, 61301, -57466, 41232, -125940, -32469, -158086, 157784, 72802, 60368, -229306, -172563, -92254, -44922, -83115, -58328, 97218, 42848, -150899, 314634, 13628, 129951, -27317, -120152, -30780, -5972, 179203, 57324, -5605, 62128, -189942, 37606, -265808, -320041, 131482, -87103, -53510, -8210, 12734, -61113, -218955, 166215, 101025, -115646, 132135, -105685, -45673, 125246, 77473, -121648, 149148, -111159, -211745, 157217, -119230, 119242, -186866, -397264, 162411, 62351, -231606, 86250, 121659, 139958, 11279, -296876, 25207, -31911, 68407, -152193, 34471, -310808, 93964, 201620, -278355, 180395, -133472, -144405, 336799, -267723, 164578, 152724, 89980, -334047, 189626, 175306, 46230, -318643, -371167, 246296]
15576b26275A98104a0529D3008P0678C3757M7479J11339c37096a09010B7049a76556
15564h9998j40590D73141g15j46425I7079B6881R280g3406K8451J3863j0426m8221
15552h9739p5559O0263B27773E719h5294a3094A57924a54981B5643K73171I38
15540a81456C8615i7442c9677j34873m080k1408m2199f421k28787d2503D8248
15528A26859g0652j05628j89014E6281a27657m6080j3478C09010p9816m3570a24765
15516A16438D3711K95219G5125J90756a08836b1913G878J18743K8381G3342J71000
15505B44342C6568Q8412L330B0350d2108A59158k5193e6840q0571C08124j38455
15494A69669A4523K77579g9003A75025q919P679o2447l257a6248A90032E5986
$$ y = [-226275, 198104, -10529, 43008, 113686, 33757, 81236, 192575, -337096, -109010, 27049, -176556, -89998, -230588, 473141, -715, -147140, 97079, 26881, 36161, -73406, -44955, -31092, -41518, -89739, -165298, -105035, 227773, 5719, -85294, -13094, 157924, -154981, 25643, 298814, 938, -181456, 38615, -97442, -39677, -174550, -178630, -200038, -242237, -6421, -235208, -42503, 48248, 126859, -70652, -176280, -365294, 56281, -127657, -173737, -187215, 309010, 229194, 185624, -124765, 116438, 43711, 338930, 75125, 265881, -108836, -21913, 7878, 126621, 155002, 73342, 244342, 36568, 124980, 128310, 20350, -42108, 159158, 133965, -56840, -137411, 308124, 169669, 14523, 292102, -79003, 175025, 166106, 173785, 111338, 108081, -16248, 190032, 55986]
15482b9703C58444J811A68948K1635o9208p887b4224C29505A16541C0659b86321
15470A03893B7366Q5480J33184A13048k3220a14767B46045n765J64360j98372
15460B06268F8341J97446p1675J71253A63514K399O5519l9207F7399J87238H8083
15448A38180M6682F1116O4336b65191A06899k6842O5140Q6358C9968A5752b53835
15436A43287J61111b9331b428B89566I6923J26594E031a25789B48345N84416j45763
15425F86998J37859J96463m997l78839N3838A92266J63671c6887A11118j6321
15415I4797K0537J83009c42921D1803O8748K08456D3042b30549B18117A1492A123
15403e04483F019d2042A09376A5914a02753E2678h480B31841G1706a35040B65216
$$ y = [-29703, 358444, 360255, 168948, 190583, 121375, 113488, -24224, 329505, 116541, 30659, -286321, 103893, 27366, 112846, 246030, 113048, 89828, -114767, 246045, 240280, 404640, 206268, 68341, 265787, 194112, 365365, 163514, 165913, 231432, 192225, 67399, 254637, 88083, 138180, 184862, 61116, 125452, -265191, 106899, 80057, 145197, 231555, 39968, 15752, -253835, 143287, 304398, -29331, -2428, 289566, 96923, 223517, 5031, -125789, 248345, 832761, 686998, 824857, 1021320, 1016323, 637484, 691322, 192266, 355937, -36887, 111118, 94797, 115334, 298343, -342921, 41803, 110551, 319007, 43042, -230549, 218117, 11492, 1123, -504483, 6019, -42042, 109376, 15914, -102753, 52678, -8480, 231841, 71706, -135040, 265216]
15391f9399j06276L089N283O7902H9438d7254E1822a51969E9337b690k28249A50365
15378A80007a02789D4429c98096a74844B7679Q9235O6808j364b6187H6259K33832
15367C20091j54239J21202J05228I4001P8953a75547A55717J97019e8069C44488
15356C71990f039I1571K83898h0965E4038b1103L525B98653a73859B26144o2394
15345A63750A6758K19769F512K42093A06215D9363J36899D8147a68736D75182
15334b393j37109B18745n3370J83342l3186a4594A75321L0539J48342p2323j16328
15323A65551L3475J60123F1094a11604N0580A53284Q8935o5070D2165M90417A04521
15311d811m0324F3953a32253j72261F4745K57253a37186A23470C126d7973B09182
$$ y = [-69399, -175675, -172586, -167303, -99401, 89438, -47254, 51822, -151969, 59337, -2690, -230939, 150365, 180007, -102789, 44429, -398096, -174844, 27679, 116914, 183722, 182358, -26187, 86259, 320091, 165852, 287054, 392282, 94001, 172954, -175547, 155717, 352736, -58069, 344488, 371990, -6039, 91571, 375469, -80965, 54038, -21103, -17578, 298653, -173859, 226144, 163750, 16758, 236527, 6512, 248605, 106215, 49363, 186262, 48147, -168736, 475182, -2393, -139502, 218745, 165375, 348717, 315531, -14594, 175321, 205860, 354202, 281879, 165551, 199026, 359149, 61094, -111604, -61024, 153284, 242219, 177149, 42165, 532582, 104521, -4811, -45135, 63953, -132253, -304514, 64745, 321998, -137186, 123470, 3126, -47973, 209182]
15299A90961d3159A66210i6401A24685K70278j76357B3218R4389d380A48834c73039
15287b01445A28779J6860C766J46328O4454l1022n9719N9665D8358P9150Q4026
15276B11534a01901n6759m4147A15633O7536c57208A50746A6512a0419I9143d7403
15264A89924i3534L0308A53571A7994K8991k2393g2213E518J05736J09633c33053
15252C092J00794f2782K3858q8275A2211R5758P615d5629j1805J2041j69208A10408
15239G959i1824a8169I0400a2615q001B82146r564A00437N40053o2199O93317
15228A271608j80900J4978Q1599E93389j52814j92972p0511C8237r382K0377K40391
15217B89623A18692m1585M8759D8002e9071b2684A11804a55517F029a91338B42583
$$ y = [190961, -43159, 166210, -96401, 124685, 394963, 218606, 23218, 117607, -4380, 148834, -373039, -201445, 128779, 145639, 3766, 150094, 214548, 183526, 123807, 183472, 48358, 127508, 211534, -101901, -158660, -202807, 115633, 183169, -357208, 150746, 16512, -10419, 99143, -47403, 189924, -93534, -63226, 153571, 17994, 46985, 24592, -72213, 5518, 111254, 220887, -333053, 3092, 103886, -62782, -38924, -127199, 12211, 107969, 115584, -45629, -57434, -45393, -214601, 110408, 7959, -91824, -18169, 90400, -12615, -20616, 282146, 272582, 100437, 640490, 578291, 1271608, 1090708, 1105686, 1187285, 593389, 440575, 247603, 177092, 38237, 28855, 49232, 289623, 118692, 77107, 125866, 48002, -59071, -22684, 111804, -155517, 6029, -191338, 242583]
15205a05981p3803B271P6262J17637m23c59422B05443e1992k7241c0487B64190
15193I1912C4173a83556D6370J58550J61437b09449g6943G7762J05873a4547G1592
15181B59240b08721E3362L6974a04778b2914j4590H84M70471j17626q9116a77929
15169d0527D25302R0505A22973E5110L54879C9851K71672F2053d4350A40406n628
15158A34778J131Q2742G2608J28338b7569A56602M8209O1897G242K01233f802
15146A49518j9134J53190B5478b56537A21476J06892a43323C84196A30371p904
15136A22467i2438B28969C3575J36839D9193K26791b04411f8088k4514e871D8455
15124b577I9993a1797A6055J90169K00927b5369B91803l6907H8343d9048A48135
$$ y = [-105981, -179784, 2271, 78533, 196170, 195747, -359422, 205443, -51992, -79233, -30487, 264190, 91912, 34173, -183556, 46370, 204920, 366357, -209449, -76943, 77762, 183635, -14547, 71592, 259240, -208721, 53362, 90336, -104778, -22914, -37504, 884, 471355, 353729, 264613, -177929, -40527, 425302, 515807, 122973, 55110, 409989, 39851, 311523, 62053, -44350, 140406, 134778, 135909, 218651, 72608, 200946, -27569, 156602, 204811, 266708, 7242, 208475, -6802, 149518, 130384, 283574, 25478, -256537, 121476, 228368, -143323, 384196, 130371, 122467, -92438, 228969, 33575, 170414, 49193, 275984, -204411, -68088, -92602, -5871, 48455, -2577, 99993, -11797, 16055, 206224, 407151, -25369, 291803, 254896, 88343, -49048, 148135]
15112D77904b9876p1680B10600q3745J66582L1589j07421J80148A66518j2557
15102A53961R7807c4652C15955f1035B85369j03450d3133H2993d1720A2532b000
15090b48934C9539J03992O2795G6028d79946B44862A12962a50237A31331J77502
15080C08833a05416B3657J82159a959q3264G6081O9570D601e4677B12484H8468
15068A0693K72592A34314i2190m662B47557r0182i7322A24761L8998a6723B83632
15056E31858D6522L03820A03191K7636G699O4717J10045o9981a90766B34431f7592
15044f827A92150O9380I3786J95075I3954D921M14575j95543K80053B412L78749
15033C81161J07465j07385r2876L15681k04368j49704l2638m8131K07505j18746
$$ y = [477904, -29876, -101556, 210600, 126855, 293437, 325026, 217605, 397753, 166518, 153961, 251768, -34652, 315955, -61035, 285369, 181919, -43133, 82993, -41720, 12532, -2000, -248934, 39539, 143531, 206326, 76028, -479946, 244862, 112962, -150237, 131331, 308833, -105416, 23657, 205816, -1959, -85223, 76081, 145651, 4601, -54677, 212484, 88468, 10693, 283285, 134314, -92190, -96852, 247557, 157375, -97322, 124761, 163759, -16723, 283632, 531858, 46522, 350342, 103191, 130827, 7699, 72416, 182461, 112480, -190766, 234431, -67592, -6827, 192150, 261530, 93786, 288861, 93954, 4921, 419496, 223953, 504006, 2412, 381161, 488626, 381241, 288365, 604046, 399678, 249974, 217336, 169205, 376710, 257964]
15023B57964K71951j22937o0854j47347b7660C79207Q1050o5092L53805C45043
15012G41315k80904B11738K16675N8037K27306B31478M800M97815L0481C64922
15001C03817L65619k89715j48508K11456A76411K63831Q1730J77615C10353J34850
14991D45203j99775O489a5477j5174E33991j40168N7740j73529M44049j69154
14981E52929j78546K59616R8950A77863L83700j21531k2982J54606k74293p5627
14971B21736K10023p1398J24419A63775O66003q0013j71689J82966j90654j81713
14961C88675K81005B63867J59383M9154K86876Q881C38373L37966p4702I9831
14950C89537o9059m4144N1347j39992J40848R9701m6588m0908J16729M9409i704
$$ y = [257964, 529915, 406978, 346124, 198777, -27660, 379207, 460257, 395165, 748970, 345043, 741315, 460411, 211738, 428413, 486450, 713756, 231478, 236278, 734093, 764574, 364922, 303817, 669436, 379721, 231213, 442669, 176411, 440242, 521972, 699587, 310353, 445203, 245428, 251917, -15477, -30651, 533991, 393823, 451563, 278034, 722083, 552929, 374383, 633999, 732949, 177863, 561563, 440032, 417050, 571656, 297363, 221736, 431759, 360361, 484780, 163775, 829778, 749765, 578076, 761042, 570388, 388675, 669680, 263867, 423250, 472404, 759280, 768161, 338373, 676339, 601637, 99831, 389537, 320478, 276334, 327681, 187689, 328537, 428238, 381650, 340742, 457471, 506880, -9704]
14938B98387O2792j03337m1716j05439J47436A25916K40884A62698J14775L2523
14928C09996m4069L20216J72840l78967O7582n3205k6772J4570N9730j72532K63435
14917E32824p0887M40742n0699K7484K03816J93798M5049L170K98422l0952K94543
14906A887310I33370N83024j50572L7111K95565P5835p0060J38546l48134M11423
14896A906108o88743m01441Q6468j79314R8520j62865N1821C25714L87715A22595
14885D5246L17935K6975K1744O0520m2643O4082Q4791J27134k74641K66792C36121
14873D12887N61984l73137J01798O8289n1576K57945j96302k05848L02165j11740
14863G66465j5209K27973D02326M2283N21012l00680j79168M6648L1442k69244
$$ y = [298387, 361179, 257842, 216126, 110687, 258123, 125916, 366800, 162698, 277473, 309996, 265927, 586143, 758983, 380016, 447598, 394393, 367621, 382191, 441921, 269389, 532824, 461937, 902679, 851980, 879464, 1083280, 1277078, 1322127, 1325297, 1623719, 1592767, 1887310, 933370, 1516394, 1365822, 1402933, 1698498, 1774333, 1704273, 1842819, 1494685, 1906108, 1217365, 815924, 902392, 723078, 821598, 658733, 710554, 325714, 713429, 122595, 45246, 363181, 390156, 411900, 472420, 429777, 493859, 578650, 705784, 431143, 697935, 336121, 412887, 974871, 601734, 703532, 771821, 720245, 978190, 781888, 576040, 878205, 766465, 751256, 979229, 402326, 444609, 965621, 664941, 485773, 532421, 563863, 294619]
14853B94619J69186K12345j01663j82784N28776A85334M80164l00276K56005N7837
14843F79064C35856A24919M53149A32858P78754C38692R5258J64289k10575e0987
14832C82095P9123J41676n7327L90142k13221L8641J43109Q9684K31193k1134
14822A203981j34334K83398l15186q9319m11531J94159K23817k90945n5751B79623
14811G51079l12450J03750j66820N24781D14931R6152L5470O0641N2481K36902
14801H96577j74702R4534j99257k68852K85685M2364O0954j64415r7759L41668
14791H16797k44639J93298q9512M13512j22696j97162J4051K6558l89447Q4644
14781E05404o5431K94524R0065j84071k75868p1949L18301L9246C18985M05888
$$ y = [294619, 463805, 676150, 574487, 391703, 920479, 185334, 665498, 365222, 621227, 679064, 335856, 124919, 578068, 132858, 911612, 338692, 433950, 598239, 387664, -50987, 382095, 461218, 602894, 545567, 935709, 722488, 761129, 904238, 993922, 1225115, 1203981, 1069647, 1353045, 1037859, 948540, 537009, 731168, 954985, 664040, 608289, 279623, 751079, 438629, 542379, 375559, 900340, 414931, 511083, 546553, 607194, 659675, 896577, 721875, 816409, 617152, 348300, 633985, 676349, 737303, 572888, 475129, 816797, 572158, 765456, 675944, 1089456, 966760, 769598, 783649, 810207, 420760, 505404, 439973, 734497, 824562, 640491, 364623, 292674, 610975, 650221, 318985, 724873]
14771G24873l28047J51746K3845L8589J42253j60633p4843J14827K34502k89067
14761E78045K10715k83110K96090k39058o439j63937J34231K95453k49563P8386
14751F50813m2594p861K01383j05965j67950Q4135J09205j68912P1615L4744j14856
14740E43757J87882M8356J6276B53266O96669C77623K99022J87857l97392L59455
14730H26565L5576j3706k4174l54725J48136o4788K01072p3181M43900j41636
14720I83039l19775K08611m5578j84222K14494L35829q0298N9566M43358j05004
14710A510020O8161n7214R4954k59644j12888k18286J1906l74263L79413j27444
14700I14715j95160K76512k4524Q4721n18675J64200K89448l09725r9859K03943
$$ y = [724873, 396826, 548572, 572417, 611006, 753259, 592626, 517783, 632610, 867112, 578045, 788760, 505650, 801740, 562682, 556243, 392306, 526537, 821990, 572427, 650813, 608219, 600358, 801741, 695776, 527826, 611961, 721166, 552254, 623869, 658613, 543757, 731639, 779995, 796271, 253266, 949935, 377623, 676645, 864502, 467110, 826565, 862141, 848435, 824261, 469536, 617672, 552884, 753956, 680775, 1124675, 983039, 663264, 871875, 826297, 642075, 856569, 1192398, 1112100, 1171666, 1615024, 1510020, 1578181, 1520967, 1615921, 1356277, 1243389, 1025103, 1037009, 662746, 1042159, 914715, 719555, 996067, 971543, 1056264, 537589, 701789, 991237, 681512, 581653, 785596]
14690G85596K32862J38608q4363K52100O0443r0427N46859l52232j82982P7482
14680A383946j09227m9912j85637J30509k66830m33204K87624K02858J58296n4241
14670A064182q1503k33968j41763Q1757N55041E33397K55944l61794O37846m69020
14660E96373K11886K0034N4030K83519l57147K61133j44490K81567l26556M7568
14650I27917J10093j68609R2418j20238L65499k76506P7058P4131k74832L89917
14640A196848j16440K30747j08719n069M0488k34113J20180J83288k5297J12586
14630A394499k15103j76920K20150J06196n9408J62879j19440q0550J954L86777
14620A621034k13981p0668L9918k71160J83884J53283k05754K11648m76138K39055
$$ y = [785596, 1018458, 1157066, 1072703, 1324803, 1385246, 1294819, 1841678, 1489446, 1306464, 1383946, 1274719, 1224807, 1039170, 1169679, 902849, 469645, 757269, 960127, 1118423, 1064182, 982679, 748711, 606948, 688705, 1243746, 533397, 789341, 427547, 1065393, 596373, 808259, 828293, 882323, 1165842, 808695, 1069828, 925338, 1206905, 880349, 927917, 1038010, 869401, 961819, 841581, 1207080, 930574, 1007632, 1081763, 806931, 1196848, 1080408, 1311155, 1202436, 1197367, 1237855, 1003742, 1123922, 1307210, 1281913, 1394499, 1179396, 1002476, 1222626, 1328822, 1269414, 1432293, 1312853, 1232303, 1234257, 1621034, 1407053, 1336385, 1376303, 1105143, 1289027, 1442310, 1236556, 1448204, 972066, 1211121]
14610A211121L9394J87481j61914J04505j70069K09131q2346L55996j37994l96758
14600A158547L43119l95227K48330K22518j19787l49718J23282J57794l8390p0498
14590A279970J93599k4051j87888M49527j90412k45124J41455J74190R1573L6451
14580A719290k76676N11158j41488L2009k09131J85349J69925K19455k62647k11215
14570A736029r8080k8224J19575Q939j0550L28776r1512k74721L29291K18741
14560B238264m28711M26426k39696l8181Q4144m7003K68510o336j67971L9666
14550B129112N20779n9197j44095K24329M1365k2885K85348L42709k1617J92713
14540C488561L50258M52095L44985K48480J067218J484193K206712L229311O359934
$$ y = [1211121, 1250515, 1437996, 1276082, 1380587, 1210518, 1419649, 1337303, 1693299, 1555305, 1158547, 1501666, 1106439, 1354769, 1577287, 1457500, 1107782, 1231064, 1388858, 1350468, 1279970, 1473569, 1449518, 1261630, 1711157, 1520745, 1275621, 1417076, 1591266, 1682839, 1719290, 1442614, 1953772, 1812284, 1844293, 1635162, 1820511, 1990436, 2209891, 1947244, 1736029, 1637949, 1609725, 1729300, 1738239, 1727689, 2056465, 1964953, 1690232, 2019523, 2238264, 1809553, 2235979, 1996283, 1958102, 2042246, 1995243, 2263753, 2257417, 2089446, 2129112, 2649891, 2590694, 2446599, 2670928, 2712293, 2689408, 2974756, 3317465, 3295848, 3488561, 3838819, 4290914, 4635899, 4884379, 5951597, 7435790, 9642502, 12871813, 19231747]
14531A9231747J0005182L622286j3419567p607395m266061k217722q0867k2833
14523E244770j029492q56024n82154K6949o97925k46993J01552J46123J63428
14514B270234j02940m941m2306L83453m50013L89369P2072k34671P4488P4690
14504B429435l2066J30589l10268J22334K92282k59823L58998k56880M1322K0522
14494B536445q1869K65379J39951k11562K14620K49921j72948O9680m6541K75643
14484C238719k64174J12728M2071p3033J70523l7616R4536k92847N58504J39953
14474C689364l96782k43895O10004j09582K20402J30169k46103j92327L92277
14465C853527k2063j38168K34088O35J82808j10935Q2777L37415l06552Q5221
$$ y = [19231747, 29236929, 32859215, 19439648, 11832253, 7566192, 5348470, 5267603, 5244770, 4215278, 3359254, 2777100, 2804049, 2106124, 1859131, 1960683, 2106806, 2270234, 2167294, 2162353, 2120047, 2503500, 2053487, 2442856, 2514928, 2280257, 2354745, 2429435, 2397369, 2527958, 2217690, 2340024, 2632306, 2372483, 2731481, 2474601, 2515923, 2536445, 2454576, 2719955, 2859906, 2648344, 2862964, 3112885, 2939937, 3009617, 2963076, 3238719, 2974545, 3087273, 3129344, 3056311, 3226834, 3189218, 3283754, 2990907, 3549411, 3689364, 3292582, 3048687, 3658691, 3549109, 3769511, 3899680, 3653577, 3461250, 3853527, 3831464, 3693296, 3927384, 3928019, 4110827, 3999892, 4082669, 4420084, 4113532, 4198753]
14455D198753q9042K27853m7513L0250J9180L7512J74920l66049L36569j4673
14445D507760J5573K98092Q037J3204k90160R0149K10447Q8558P5151J53615n6910
14434E113516R6790K84319l90992L96166J19676k75881N92724k9484q6285n5931
14424E764618J42128M36453j5016j21023L49921k24535J62811M9210K61800q7946
14414F718421k15901M65470K19833j79642M66658K81584j89407N7373M63625l27586
14404G760428M06727Q4859K45316k2357N04799k41845M4688j03126L18062K33421
14394I230972k08630L66597j81228J63423M86217Q8094K55076J15301J31725M43917
14384A0891464l79063Q2952M67096J21646k64652O97944j77210L69466J4443K31236
$$ y = [4198753, 4109711, 4337564, 4290051, 4320301, 4339481, 4376993, 4551913, 4185864, 4522433, 4507760, 4523333, 4821425, 4829462, 4842666, 4552506, 4642655, 4853102, 4941660, 5016811, 5170426, 5113516, 5210306, 5494625, 5103633, 5499799, 5619475, 5343594, 5936318, 5906834, 5820549, 5764618, 5906746, 6343199, 6328183, 6207160, 6557081, 6332546, 6495357, 6544567, 6806367, 6718421, 6502520, 6967990, 7187823, 7008181, 7474839, 7756423, 7567016, 7624389, 8088014, 7760428, 8167155, 8252014, 8497330, 8474973, 8979772, 8737927, 8782615, 8679489, 8997551, 9230972, 9022342, 9388939, 9207711, 9371134, 9857351, 9945445, 10200521, 10315822, 10447547, 10891464, 10512401, 10595353, 11062449, 11184095, 10919443, 11617387, 11440177, 11809643, 11824086, 12055322]
14374A2055322M42648K8880L25328N42151q2861K88671R6501Q18893K6615J60755
14364A4702903J44395O36372K067O26877R4541K59776K29639J47177O80559M13565
14354A7937871j32148O55024M33042J12276P66002M1309Q91335J00300Q61698
14345B1666709J78022O15109J44317O60837Q62481K11426J008955L24164Q37980
14336B6510000J84659O47698J280331P74693P41755K01063J273602M51479J114639
14327C3179919N92729J471624O19789J135285R15642J132663R12492J726473N64710
14318D2251326J685599J501235J189989J347865J809173J277501J990509J542319
14310E4595516J757189K066181J700226K607300K090014K284200K656822K451768
$$ y = [12055322, 12497970, 12526850, 12852178, 13394329, 13311468, 13600139, 13696640, 14515533, 14542148, 14702903, 14847298, 15483670, 15485737, 16112614, 16207155, 16466931, 16696570, 16843747, 17524306, 17937871, 17805723, 18460747, 18893789, 19006065, 19772067, 19813376, 20704711, 20805011, 21666709, 21844731, 22459840, 22604157, 23264994, 24127475, 24338901, 25347856, 25672020, 26510000, 26694659, 27342357, 28622688, 29397381, 30139136, 30340199, 31613801, 32065280, 33179919, 33772648, 35244272, 35864061, 36999346, 37914988, 39047651, 39960143, 41686616, 42251326, 43936925, 45438160, 46628149, 47976014, 49785187, 51062688, 53053197, 54595516, 56352705, 58418886, 60119112, 62726412, 64816426, 67100626, 69757448, 72209216]
14302G2209216K753068K904301K959537K814101L925570L360552L605945M212804
14294I8745094L827903M688795M665169M843577N266641N789853N832011O340265
14286A39999308O666291O615975P865908P407852Q576857Q621985R602746R589526
14278B04946448J0648794J0459764J1875082J2013430J2170114J3233048J3355060
14271B88701740J4053386J3840794J3350164J4007053J3137688J3278704J2866350
14264C83235879J1679682J1360441J0759775J0195045R206420Q384673P291045
14257D52112960M064521K638064K755947J282506o268388m100255o445198q745919
14249D37294238r610827j0941226j2486447j2859905j3836365j3764278j3791400
$$ y = [72209216, 74962284, 77866585, 80826122, 83640223, 87565793, 90926345, 94532290, 98745094, 102572997, 107261792, 111926961, 116770538, 122037179, 127827032, 133659043, 139999308, 146665599, 153281574, 161147482, 168555334, 177132191, 185754176, 195356922, 204946448, 215595242, 226055006, 237930088, 249943518, 262113632, 275346680, 288701740, 302755126, 316595920, 329946084, 343953137, 357090825, 370369529, 383235879, 394915561, 406276002, 417035777, 427230822, 436437242, 444821915, 452112960, 456177481, 458815545, 461571492, 462853998, 456585610, 452485355, 446040157, 437294238, 427683411, 416742185, 404255738, 391395833, 377559468, 363795190, 350003790]
14242C50003790j4076776j3817624j4308850j3927345j3543091j2999489j3188465
14235B54142150j1300512j1973797j1813764j1580240j0637673j0168372q963449
14228A77704343q522628q610326p654965p459207o771119o123623n516329n721876
14220A21324270n717008m911111m702857m296075m142716l607692m184738l029059
14212H6733014l677501l087180l119051l035030k617519k183458k516430k327369
14204F4169476k377303j857122k152802j855902j574762j655290j217837j922260
14196D9556198j613880j778377j076077r46659j051096j212564j355519j222874
14188C9299152r91771j199147q31680r38398o15759j154877q64528j225080m62123
$$ y = [350003790, 335927014, 322109390, 307800540, 293873195, 280330104, 267330615, 254142150, 242841638, 230867841, 219054077, 207473837, 196836164, 186667792, 177704343, 169181715, 160571389, 152916424, 145457217, 138686098, 132562475, 127046146, 121324270, 115607262, 110696151, 105993294, 101697219, 97554503, 93946811, 89762073, 86733014, 83055513, 79968333, 76849282, 73814252, 71196733, 69013275, 66496845, 64169476, 61792173, 59935051, 57782249, 55926347, 54351585, 52696295, 51478458, 49556198, 47942318, 46163941, 45087864, 44141205, 43090109, 41877545, 40522026, 39299152, 38307381, 37108234, 36276554, 35338156, 34722397, 33567520, 32702992, 31477912, 31015789]
14179C1015789n65089m79507j069299j102208m16949l94173q08984n82341n43488
14170B5053751o94165k29958p43960n11808p26811k11660p53777l20814q7550
14161B0773248o54284j72555m13814n96327l73976m25860m45607J71403j75530
14152A7686698n89611l76301j21107p86588l7025l22069k01446M8715m17011m66687
14142A4417568j05178m10633l20235q7454J83327q62862K27755m41603j73416
14133A2427269j60884q4055k96651k27468N3195l64453l21765k2730k3027k97359
14123A0682072l76634j03676L591m06078R9586R8235l28000k74478J57427l02741
14113I249304l33434j34341K86952m46821J50469n1772o79956j11441K14061j28735
$$ y = [31015789, 30450700, 29971193, 28901894, 27799686, 27382737, 26988564, 26179580, 25597239, 25053751, 24359586, 24129628, 23385668, 22873860, 22147049, 21935389, 21181612, 20860798, 20773248, 20118964, 19946409, 19532595, 18936268, 18562292, 18136432, 17690825, 17862228, 17686698, 17097087, 16720786, 16599679, 15813091, 15776066, 15453997, 15252551, 15301266, 14884255, 14417568, 14312390, 13901757, 13581522, 13494068, 13677395, 12814533, 13042288, 12600685, 12427269, 12266385, 12182330, 11885679, 11658211, 11711406, 11346953, 11025188, 11002458, 10979431, 10682072, 10305438, 10201762, 10205353, 9799275, 9898861, 9997096, 9669096, 9394618, 9552045, 9249304, 8915870, 8781529, 9068481, 8621660, 8772129, 8720357, 8040401, 7928960, 8143021, 8014286]
14103H014286l2043k46705j28650K83275j80865l50609Q9761k51765M0208j13814
14093G123079j34020m73552K25292j44853r4873J44444k61385k77893m3867J497
14083F063869k51257K17322l06329L06665j11663K88667n45195N0819j06523k05135
14073E401240J91537j63394r1911j03268K07557k55527J75251P2209j00353l86724
14063D946617R2320m63495L64221o4344J91296l50055K4473J35242m84637j3037
14053D378601K03144j59667K21412j48421j08229Q7199L1413j91030P7560K11054
14043D603036p8527k63268l45268J96756J11705m44613o7902r2606M15711j04535
14033C930489l94467P7288j92542L6600M17210l16132m4812n8686k5208n6701
$$ y = [8014286, 7982243, 7735538, 7606888, 7890163, 7709298, 7358689, 7448450, 7196685, 7236893, 7123079, 6989059, 6515507, 6740799, 6595946, 6501073, 6645517, 6384132, 6106239, 6062372, 6063869, 5812612, 6029934, 5723605, 6030270, 5918607, 6207274, 5662079, 5712898, 5606375, 5401240, 5592777, 5429383, 5337472, 5234204, 5441761, 5186234, 5361485, 5433694, 5333341, 4946617, 5038937, 4575442, 4939663, 4875319, 5066615, 4716560, 4741033, 4876275, 4391638, 4378601, 4581745, 4422078, 4643490, 4495069, 4386840, 4474039, 4505452, 4314422, 4391982, 4603036, 4524509, 4261241, 3915973, 4112729, 4224434, 3779821, 3711919, 3619313, 4035024, 3930489, 3536022, 3613310, 3420768, 3457368, 3874578, 3558446, 3513634, 3454948, 3429740, 3373039]
14023C373039j01076J5047M0692J35499J09933k01985o3478J19259l24354J74430
14013C277006m79619N84615l04984J57775j90230k41555K14932n25981N10708
14004C002667k82688j06001M53972n36325K30863J70662j90014m7678p9309k14430
13994B401719J21387r0736m1922L9064j55209J95214K5442n0158o8193L39774
13984B716382J87151j29330r6372N0840K07156l6176M37045J2169M92858P82638
13974D624361J436887K997413N627406R956639R845380j0745707q048230n432546
13966A0261603k661994j440279j005413r05551k38372o31298J0791j87601K33673
13957C435559o69616J60750l13877j36381K23559k31162L4086j8126P1218k23665
$$ y = [3373039, 3271963, 3287010, 3327702, 3463201, 3573134, 3371149, 3307671, 3426930, 3102576, 3277006, 2797387, 3382002, 3077018, 3234793, 3044563, 2803008, 3017940, 2491959, 3002667, 2719979, 2613978, 3067950, 2531625, 2762488, 2933150, 2743136, 2695458, 2616149, 2401719, 2523106, 2432370, 2390448, 2429512, 2274303, 2469517, 2494959, 2444801, 2376608, 2716382, 2903533, 2774203, 2677831, 2728671, 2935827, 2899651, 3336696, 3348865, 3841723, 4624361, 6061248, 9058661, 14686067, 24642706, 34488086, 23742379, 15694149, 10261603, 7599609, 6159330, 5153917, 4248366, 4009994, 3378696, 3389487, 3201886, 3435559, 2765943, 2926693, 2612816, 2476435, 2699994, 2468832, 2502918, 2484792, 2556010, 2332345]
13947B332345j04786J83182j21367o8907j04138R2062J11049M8279l13954L2142
13937B085907j27223o5028K44869j37770K57682k70094J34256k22829N3525k4434
13927A928861J09768j65994O3572l53191M14397k40782o9067J48029L950k41571
13917A597972L8527p0054K41931j12314q5850j01235j67452m0768K14133L46508
13907A861398n06892K32552O7379L24771m02943j60088K55322l83827N87488m97879
13897A377281K44986q3196j05854J23636K24008m00767q1642L29634o7991J328
13887A561423L26322l68989o0282n3416J31053k03555L5463n4139J66586o2176
13877A418290l3867J13339m4815k74672J63710j43086M27658j06454k8390J7352
$$ y = [2332345, 2227559, 2410741, 2289374, 2220467, 2116329, 2208391, 2319440, 2367719, 2053765, 2085907, 1958684, 1893656, 2138525, 2000755, 2258437, 1988343, 2122599, 1899770, 1953295, 1928861, 2038629, 1872635, 1936207, 1583016, 1997413, 1756631, 1687564, 1835593, 1839543, 1597972, 1636499, 1566445, 1808376, 1696062, 1610212, 1508977, 1341525, 1300757, 1514890, 1861398, 1354506, 1587058, 1654437, 1979208, 1576265, 1416177, 1671499, 1287672, 1875160, 1377281, 1622267, 1539071, 1433217, 1556853, 1780861, 1380094, 1298452, 1628086, 1560095, 1561423, 1887745, 1518756, 1458474, 1405058, 1536111, 1332556, 1368019, 1313880, 1480466, 1418290, 1384423, 1497762, 1452947, 1178275, 1341985, 1198899, 1626557, 1520103, 1491713, 1509065]
13867A509065M914j58513K3993J96600k39671K17122p4724k19724j5996j55103
13857A087963K33032j56384J04934p5888j7322J4493L31491m84899N4392J4525
13847A106337K26710m23074L76042l86825M38017k8937m25391Q6393j28727M12717
13837A253262K5075k86357N09669o45646K66257P8036k36029k3739L4527K655
13827I77710M9731M6561l6410r9621k0362K26940K03587o08919Q2299K45222p7743
13816I88995k86205O2195K24679k81624J77246m13o7305j17658J77302K55276
13806A132488k23645J0348j43686J71420K96634k21754k77931R1385K14566j12402
13796I37423k80891K37092K5447J7986J05412j04036N8839l87474J40319j2005
$$ y = [1509065, 1513979, 1355466, 1379459, 1576059, 1336388, 1553510, 1478786, 1259062, 1243066, 1087963, 1320995, 1164611, 1269545, 1193657, 1176335, 1190828, 1522319, 1037420, 1091812, 1106337, 1333047, 909973, 1286015, 899190, 1337207, 1308270, 882879, 969272, 840545, 1253262, 1278337, 991980, 1501649, 856003, 1122260, 1200296, 964267, 940528, 975055, 977710, 1027441, 1074002, 1037592, 937971, 917609, 1144549, 1348136, 739217, 821516, 1066738, 988995, 702790, 764985, 989664, 708040, 885286, 884873, 817568, 699910, 877212, 1132488, 908843, 919191, 775505, 946925, 1243559, 1021805, 743874, 835259, 1049825, 937423, 656532, 893624, 919071, 937057, 1042469, 938433, 997272, 609798, 750117, 738112]
13786G38112J99152M0567j55681J08885k95508K06640J26505k00661J75625k4228
13776I19408K0453j05966Q5428j91975j66136K4041n3337K38758r3362j1124j74587
13765D91601O2528K70878J02675j21117j40537L01797j66499C91204N09110k59117
13755F41197k38796O14626l59638k09386K71360o5175j32854K89099j75297Q1301
13745G16437j04350L71649m45500j72714J86263k42436J83249L2424L86439p2032
13735H39429k51947J61869O0260j43163Q2975n2841l0272l1257J00092j1904l12667
13724D10574J92596L434J72508k08227K39741j04748j26435j34821J92200K35686
13714H72508k04185K07605C12372K46199l3848J61671j15027k4000k42908P5719
$$ y = [738112, 937264, 977831, 822150, 931035, 635527, 842167, 968672, 768011, 943636, 919408, 939861, 833895, 919323, 727348, 561212, 585253, 531916, 770674, 677312, 666188, 491601, 554129, 825007, 927682, 806565, 666028, 967825, 801326, 391204, 900314, 641197, 402401, 1017027, 657389, 448003, 719363, 654188, 521334, 810433, 635136, 716437, 612087, 983736, 538236, 365522, 551785, 309349, 492598, 525022, 911461, 839429, 587482, 749351, 809611, 666448, 749423, 696582, 666310, 635053, 735145, 723241, 410574, 603170, 606604, 779112, 570885, 810626, 705878, 579443, 444622, 636822, 872508, 668323, 875928, 312372, 558571, 524723, 686394, 571367, 547367, 304459, 380178]
13704C80178J30338j01710K04157R2504j7607A61867L04918q1272K34107k54915
13694C64705L2744L61630K4014R9701l24261J0165j76581o0683K07574j6302K77046
13683G99752k64257k14774J93996N2784R4919o4788N9486o065j45356r4174L02296
13672G13819k28378M226J09270p5523j31752J40030j39098L474j36260M56643
13662G16451C35837J04574J46088r1532K85581r3315p8599l9354j68118J74103
13652E75265M5324L22561m59922j19032K5539J52514K04546l31207Q240K6213
13642D50041K03843A81273L71071n3780K5049B18939L57668J70228l21244J01968
13632E27559L0222l4224L44623l64787r6462P6918j10524j7740o714N5601j44545
$$ y = [380178, 510516, 408806, 612963, 705467, 687860, 161867, 466785, 385513, 619620, 364705, 397449, 759079, 783093, 882794, 558533, 568698, 392117, 331434, 539008, 522706, 799752, 535495, 320721, 514717, 567501, 662420, 597632, 657118, 651053, 505697, 411523, 713819, 485441, 489667, 598937, 523414, 391662, 531692, 392594, 396068, 259808, 716451, 335837, 440411, 586499, 494967, 780548, 687233, 608634, 569280, 401162, 575265, 620589, 943150, 483228, 364196, 389735, 542249, 746795, 415588, 423828, 450041, 653884, 181273, 552344, 498564, 523613, 218939, 576607, 746835, 425591, 527559, 557781, 523557, 868180, 503393, 406931, 483849, 373325, 355585, 348871, 404472, 259927]
13621B59927J49238L41379A42611a9089B00597L03851K34630k51850J00070B50310
13610C04159J08839n0308J08673J18804k67141P8612N1497A87710L10622A82730
13599D54075j51552J91581k20436L8928K96568m7289P7453k51234j09258K2011
13589C00847J08880n1179j8306Q1831J14764A23235M56437k82481K02080k09625
13579B89646L69979l08075k187A42063K86619J62404J0186k86272J09312j55185
13569B69127l2690M07162j70143N2826k08889j6165J09322l6728n9319J49875
13559D64378A43139K44268m9038F5376K53448J0127L7935q7938J94869k23184
13549B50633m7349N7696L25460B64921L21189k46427m3972j20453J21090J60994
$$ y = [259927, 409165, 750544, 142611, -19089, 200597, 504448, 739078, 487228, 587298, 250310, 304159, 412998, 362690, 471363, 590167, 323026, 401638, 453135, 187710, 498332, 182730, 454075, 302523, 494104, 273668, 312596, 609164, 561875, 639328, 388094, 278836, 300847, 409727, 358548, 340242, 422073, 536837, 123235, 579672, 297191, 499271, 289646, 659625, 351550, 349363, 142063, 428682, 591086, 601272, 315000, 424312, 269127, 236437, 643599, 473456, 526282, 317393, 301228, 410550, 373822, 314503, 464378, 143139, 387407, 338369, 65376, 318824, 328951, 366886, 278948, 473817, 250633, 203284, 260980, 586440, 264921, 586110, 339683, 295711, 175258, 296348, 457342]
13539D57342j36681j7918K10526k40543p2761K18674O6722K12329B97254M25134
13529G22388l50132q4718k7683J71335B07302J481j5504J17451I7778L71288K0680
13518D89746j18796j29784K50386j80778A36764L54792j09686j6265R6338q9399
13508C72544j7095J80663A74460j40N5042P65j13029j6947J01765J37622K9795
13497C69333k2884I6316J65156a11638E34845B38312J23326m3500J69631k3885
13487D63884B17879L6520D9540J45864J6190K32879j37642K35760b8204D03804
13476B84765L31407j75288C8485K15202A14356b6598H8475O9287N0822A0883M84300
13465D95183Q5239k13535p7348K72299A38594M07154B70371j12824J52604m7983
$$ y = [457342, 320661, 302743, 513269, 272726, 199965, 418639, 485361, 697690, 297254, 722388, 372256, 287538, 259855, 431190, 207302, 208783, 193279, 310730, 97778, 469066, 489746, 370950, 241166, 491552, 310774, 136764, 491556, 381870, 365605, 461943, 372544, 355449, 536112, 174460, 174320, 229362, 230127, 117098, 100151, 201916, 339538, 369333, 346449, 96316, 261472, -111638, 534845, 238312, 361638, 318138, 487769, 463884, 217879, 254399, 49540, 195404, 211594, 444473, 306831, 542591, -28204, 403804, 284765, 616172, 440884, 38485, 253687, 114356, -26598, 88475, 157762, 208584, 10883, 495183, 580422, 366887, 289539, 561838, 138594, 545748, 270371, 157547, 310151, 262168]
13455B62168N8570A30688J41027L1710J5381r1079r4181J71431F3148M41675j65281
13444C39542Q1579A84585K0626K65266A190O06952k41555p5338j05040J15600
13434C01809m2897A29243n4439a2394D43785a05182A29823Q3318R9159j49167
13424A63133J41650A03673k7310K87352q4800M5436j58161K22737N0452A62131
13413B90912j11521j3813l6149K83282i2452d5703C85424j56181K10873A42768
13402A13112J63351g1205j32188A92080p516K78302A97155J9917p6271O9429a99679
13390c15185C29330j46988m9800Q4061m0534l4357K16628a32280B51060R0061
13380C41121A06272M564J77688r5135M7301J50191j42197a46150B21636J21386
$$ y = [262168, 320738, 130688, 271715, 303425, 318806, 227727, 133546, 304977, 63148, 504823, 339542, 421121, 184585, 205211, 470477, 1190, 608142, 366587, 291249, 186209, 301809, 258912, 129243, 74804, -12394, 443785, -105182, 129823, 213141, 312300, 163133, 304783, 103673, 76363, 363715, 278915, 324351, 166190, 388927, 439379, 162131, 290912, 179391, 165578, 129429, 412711, -92452, -45703, 385424, 229243, 440116, 142768, 113112, 276463, -71205, -203393, 192080, 184564, 462866, 197155, 217072, 140801, 210230, -199679, -315185, 329330, 182342, 132542, 216603, 176069, 141712, 358340, -132280, 251060, 341121, 106272, 110836, 288524, 193389, 240690, 390881, 248684, -146150, 221636, 343022]
13370C43022c31143B05944J416O0001j6312J0721E871L41310A03853L05893A13650
13358G6765L04106A68623K42787D6466N3856L03904L91166A75453l5988C8753
13347B69721l714F3772K42908J87092r875D8633K51072H8531J15277J17813D6704
13335A42645D1648L08067N5802j09450K15856B44887l095j07435K69280j68772
13325B34865h6320C95861A36971K53186d5988C4991K09264O1768A28190E0178
13314A03950K55138j25807a40283A21506n8124M83502A11443J0505P9732B2368
13303C597L06104C39L59029l8667j18289J60926g9002A63068d7892A87057Q5597
13292B72654q7317k6595o7685F769b0079A96023p4055L67a646C38520A16290A2364
$$ y = [343022, -331143, 205944, 207360, 267361, 251049, 261770, 5871, 347181, 103853, 409746, 113650, 76765, 380871, 168623, 411410, 46466, 100322, 404226, 795392, 175453, 139465, 38753, 269721, 266007, 63772, 306680, 493772, 483897, 48633, 299705, 88531, 203808, 321621, 46704, 142645, 41648, 349715, 405517, 296067, 511923, 244887, 241792, 134357, 403637, 234865, -86320, 395861, 136971, 390157, -45988, 34991, 244255, 306023, 128190, 50178, 103950, 359088, 233281, -140283, 121506, 63382, 546884, 111443, 121948, 201680, 22368, 3597, 309701, 339, 359368, 320701, 202412, 363338, -79002, 163068, -47892, 187057, 272654, 185337, 158742, 91057, 6769, -20079, 196023, 121968, 122335, -1646, 338520, 116290, 12364]
13279A39043R5985i2199B74805K87586e8290A80303c7472k01939D77511j84464
13269B93047a21336B29677R0754E4886K53696n234A32481K73680h5255D0514K18852
13258B59366k2073J89797A57506b06629B3378b14066E5197A3072M60938j53707
13248C20303D2703K48467A35232K15359A38510L5220H2346P4739a5928A21935
13237B16798r4208M6869P9847p2023j9231n5186e2983B43035K5499l9340B3799
13225i4108B3073L29960j31715K4848B5712Q4254m5169a06555G2255K8353P2202
13214A72810e8657B33141l1392a1075j02048C68288A00345d7549A64837g6640
13203b2894a625A40920m7946g6904E4840N60793B95463K38351I5520N7554C0352
$$ y = [139043, 235028, -92199, 274805, 562391, -58290, 180303, -37472, -239411, 477511, 293047, -121336, 229677, 320431, 54886, 308582, 303348, 132481, 406161, -85255, 40514, 259366, 237293, 427090, 157506, -206629, 23378, -214066, 55197, 13072, 474010, 320303, 42703, 291170, 135232, 350591, 138510, 173730, 82346, 157085, -15928, 121935, 216798, 122590, 169459, 249306, 177283, 158052, 102866, -52983, 243035, 268534, 229194, 23799, -94108, 23073, 353033, 221318, 246166, 25712, 109966, 64797, -106555, 72255, 100608, 172810, -58657, 233141, 201749, -11075, -113123, 368288, 100345, -47549, 164837, -76640, -22894, -1625, 140920, 92974, -76904, 54840, 615633, 295463, 533814, 95520, 153074, 30352]
13191B1493e766A80500p9191A5188L67391A53709F092M6731J43632J7930B3254
13179A57607L9187J10924f0169C2330M314b22317E1843J44730I4779p958c3922
13167a4954A25994D6003K20998K6290b34473B77523A10069a5827B92676a47567
13156I8478M2530D8013J72634K4435i46A62178O7287n1196K26843A15322a32362
13144I7509j3550L8191b5359A50103J10052m0041A24b01741H0528C3794a62051
13132G0495L3849K5418e8885B80689j34047c4265B11609b05382B64123a32078
13121B17541a17528A8305O0867K7616B9318K07463A17596R664M29432h4762b2680
13109D2213b1459C96369c47395A64777a89780B48958n6697M8846A19722D3687
$$ y = [21493, -5766, 180500, 101309, 15188, 382579, 153709, 6092, 52823, 196455, 214385, 23254, 157607, 196794, 307718, -60169, 32330, 36644, -222317, 51843, 196573, 94779, 86821, -33922, -14954, 125994, 46003, 267001, 293291, -234473, 277523, 110069, -15827, 292676, -147567, 98478, 141008, 48013, 220647, 245082, -946, 162178, 229465, 178269, 405112, 115322, -132362, 97509, 83959, 122150, -25359, 150103, 260155, 220114, 124, -201741, 80528, 33794, -162051, 70495, 104344, 129762, -58885, 280689, 146642, -34265, 211609, -205382, 264123, -132078, 217541, -117528, 18305, 79172, 106788, 29318, 236781, 117596, 127260, 556692, -84762, -22680, 42213, -21459, 396369, -347395, 164777, -189780, 248958, 192261, 241107, 119722, 43687]
13098a59271C03295j30607N1970m0619d7889n2948F2716K86864M2883A84580J44869
13087C29449d5760A8497J9164a12015A2620K07352G9107K56732H9178j910Q5492
13076A72760a8102j54796A16123R7428r9561D9169J58537a25496j78319J48687
13066a55128A46868b77213a30622d5233A56584a31040A81531a47776M7154A91433
13055C55286c6633A99371j807q0913P4711p19K12208A58043N7362H5680N374j7507
13043G3547b13176e2038D2863L21653q3142D9017J78154K15597n7310A69028F2893
13031B26376A06861J55263C666K57167a23299O0526B53771c10303A60640J43454
13021C04094b46999B64002C2834Q706J04072q556f6473r5680C77199a14295D835
$$ y = [-159271, 303295, 172688, 224658, 184039, -47889, -100837, 62716, 349580, 392463, 184580, 329449, -45760, 18497, 37661, -112015, 12620, 219972, 79107, 335839, 89178, 87268, 172760, -18102, -172898, 116123, 213551, 113990, 49169, 207706, -125496, -303815, -155128, 146868, -277213, -130622, -45233, 156584, -131040, 181531, -147776, -100622, 191433, 355286, -36633, 199371, 197564, 116651, 191362, 190643, 402851, 158043, 215405, 85680, 91054, 73547, -213176, -52038, 42863, 364516, 281374, 49017, 227171, 442768, 385458, 169028, 62893, 226376, 106861, 262124, 3666, 260833, -123299, -62773, 253771, -310303, 160640, 304094, -246999, 264002, 32834, 41540, 145612, 137056, -66473, -162153, 377199, -114295, 4835]
13009B17574K47617j87793A03394a47057A06967J93294c29082A33287e4532A59710
12998A25943b536C6513c0037a4335A56530a7508B67400p1524G9867C5378j2935
12987B2443l085a87202k2679b0491G2347J86655a06591E4161J04515h9354D2349
12975e2497B61955A14598M8960b14497H2221g4590m7965C9652K3968J19601c94049
12963A28418D254M5263K79979a8847C14164j15455J38702a70082m6635E946b75415
12951D33483a74766J7259E803J48116C1788O900i4889K3855B567a43522F1207
12939B06621b1932G4017J5094N3397D9109J33268a53177g4157H4554L0716Q4837
12928B00107b27692B3176M78015h63o2881o2292B1516a71038c5177A13534B043
$$ y = [217574, 465191, 277398, 103394, -147057, 106967, 300261, -329082, 133287, -54532, 159710, 125943, -2536, 36513, -30037, -14335, 156530, -17508, 267400, 195876, 79867, 35378, 22443, 19358, -187202, -209881, -20491, 72347, 259002, -106591, 54161, 158676, -89354, 42349, -52497, 261955, 114598, 163558, -214497, 82221, -74590, -122555, 39652, 63620, 183221, -394049, 128418, 4254, 49517, 329496, -18847, 314164, 198709, 337411, -170082, -216717, 5946, -275415, 433483, -174766, -157507, 5803, 153919, 31788, 38688, -94889, -71034, 2567, -143522, 61207, 206621, -21932, 74017, 89111, 142508, 49109, 182377, -153177, -74157, 84554, 115270, 200107, -227692, 23176, 501191, -863, -63744, -126036, 21516, -171038, -35177, 113534, 2043]
12916f4713l6945o3994A28329o2135B7218e8258A54179P1904o6192C2018K16242
12905B48260D3765f6580A86743a86213H7520b12387A39718e0381A04134e949A2222
12893A10946A2603a56918O1399p4904C99260c58158a04839G3871L18183h6285
12882a48093b1194B6129f6313b3262p4461A61711c4734D16157a32513I4164j4754
12871G9410a31446A18670d0904A24200C4263K11817q9750f4046A51440K33847
12861C85287c0334F7152a10687n0457A1119K33772j4838b9257D1836a8155A39312
12849B0700Q7903b01173P8122r0032A42181r35J89779a14934D09474C092L9582
12838D2674i209m38860c257I2836a34194O5553E825Q3915a1739j70741C40329
$$ y = [-64713, -101658, -165652, 128329, 66194, 27218, -58258, 154179, 226083, 159891, 32018, 248260, 43765, -66580, 186743, -186213, 87520, -212387, 139718, -50381, 104134, -5949, 12222, 110946, 12603, -156918, -95519, -170423, 399260, -358158, -104839, 73871, 392054, -86285, -148093, -21194, 26129, -66313, -23262, -97723, 161711, -34734, 416157, -132513, 94164, 79410, -131446, 118670, -40904, 124200, 34263, 246080, 156330, -64046, 151440, 385287, -30334, 67152, -110687, -161144, 11119, 244891, 230053, -29257, 41836, -18155, 139312, 20700, 108603, -201173, -123051, -213083, 142181, 141246, 331025, -114934, 409474, 3092, 42674, -9209, -448069, -3257, 92836, -134194, -68641, 5825, 89740, -11739, -182480, 340329]
12826b04750C11010h4084p5495A88557O3231F0268b43641B33067c5872j75491
12816b11363F2698Q4443D3149J22056R8914a1685j8706C21053A35648a17269C3022
12804A80422l4575A1435Q5979J16368D9707L7465f1918j81725g1269H8623G49
12792A52186o8699C2336P7281a06753B32654F70c33439J49800B15155H8938a89377
12780H8509K20817H0994M3148i1839F6477k6461K48592B4319K79642G3795K69772
12769C43567A61196K54671B1280J16804O6718p8184a55331F7631a89358G0546
12758F9848b36530a15863H6514b38156R4327e3010B01205b15270C11809a1633
12747b55503d7275j55263L8070L0649f2791H3914i928A48180l412k0589E6258
$$ y = [-204750, 311010, -84084, -159579, 188557, 251788, 60268, -243641, 233067, -35872, -211363, 62698, 147141, 43149, 165205, 264119, -11685, -30391, 321053, 135648, -117269, 33022, 180422, 145847, 11435, 97414, 213782, 49707, 87172, -61918, -243643, -71269, 88623, 749, 152186, 83487, 32336, 109617, -106753, 232654, 670, -333439, -183639, 215155, 88938, -189377, 88509, 309326, 80994, 124142, -91839, 66477, 40016, 288608, 24319, 303961, 73795, 343567, 161196, 415867, 21280, 138084, 204802, 126618, -155331, 67631, -189358, 70546, 69848, -236530, -115863, 86514, -238156, -143829, -53010, 201205, -215270, 311809, -11633, -255503, -47275, -202538, -164468, -133819, -62791, 83914, -9928, 148180, 144768, 124179, 56258]
12735F7908c5313A47539E3262Q5023k6586L7319a04755A41283J72310c8018j49297
12724a87315h2565F3686P3296g6636l3274A83967g0224R663j75045g6134r9073
12713a75207I271b34130B85223D4830J54163d21022A36691i5259C8926j7053a49270
12701G2300E07J51587b0834p6370j840M5826B48331q3545C3213K59316P7912j0897
12689C59544a09171B99084M638m1574j28221b30055B3805L7591a99874d3312F8899
12677A9432a41044a7724m0593A19970c11271B09671F5414g9739d506A48189B3058
12665F274L17677a58365B75504E3863L374a01487C08498a33065j42808H6078N4823
12654A40901D7593j3852O8440J27275G4160K90233A39674k0771i5575b0958B34854
$$ y = [67908, -35313, 147539, 53262, 138285, 111699, 149018, -104755, 141283, 313593, -38018, -187315, -82565, 63686, 136982, -76636, -109910, 183967, -70224, -60561, -235606, -76134, -175207, 9271, -234130, 285223, 44830, 198993, -421022, 136691, -95259, 38926, 21873, -149270, 72300, 507, 152094, -20834, -97204, -99044, -53218, 248331, 164786, 33213, 292529, 370441, 359544, -109171, 299084, 303722, 262148, 133927, -230055, 23805, 61396, -199874, -43312, 68899, 19432, -141044, -17724, -58317, 119970, -311271, 209671, 65414, -79739, -4506, 148189, 23058, 6274, 323951, -158365, 275504, 53863, 57237, -101487, 308498, -133065, -275873, 86078, 140901, 47593, 33741, 102181, 229456, 74160, 364393, 139674, 118903, -95575, -20958, 234854]
12642D65341A34415a82128B22700M7266n1828Q476r7498M1033J208j6603l6002
12631A18752m9479h3307k77242B03476d53261G3012a64794M0524l4626A03396
12620B8188J00944b25685o0163B07101J1129h5885D77463A54661m4181L67798
12610D78278D9096J75054I7951K80666d3761A80821A4108J95463o0986E2306c168
12598A55514O3274H2935b69374O5033D29682m8904B3865P601c09294E742c3818
12586a5111j85278D0608a53632D6695b78453G5432a64406K7575O2612h714A86322
12574D1442J39265K0195b5201j31390D4882h59E3229K55170j37225b9210q0982
12563a10192k3334G3707d5778n0899p5847e4112m434C80371r7044A11349P8888
$$ y = [465341, 134415, -182128, 222700, 269966, 218138, 226614, 129116, 170149, 171357, 154754, 118752, 69273, -83307, -360549, 203476, -453261, 73012, -164794, -124270, -158896, 103396, 28188, 129132, -225685, -285848, 207101, 218230, -85885, 477463, 154661, 110480, 478278, 49096, 224150, 97951, 378617, -43761, 180821, 14108, 209571, 148585, 52306, -3168, 155514, 218788, 82935, -269374, -204341, 429682, 380778, 23865, 31466, -309294, 5742, -33818, -15111, -200389, 40608, -153632, 46695, -278453, 75432, -164406, -136831, -74219, -8714, 186322, 41442, 180707, 200902, -25201, -156591, 44882, -859, 53229, 308399, 171174, -29210, -110192, -133526, 73707, -45778, -96677, -172524, -54112, -58546, 380371, 283327, 111349, 190237]
12552A90237a53327A66136c79351C9130h3584J8529O966j66126a0728B77215j22318
12541A54897N046F4068a53649C30525a18364B46437A06550R2158F6954P3806d85969
12529D832M4305e2203j2579A63674h1280o0114B95747b57031J11009b0333r3058
12518a13391A92642a11895n9812p1895P3354B9496i9102B8184j2255g8742K2208
12507e6534j37479A09091h9963a0420A199J23669b63746A06792b25199C26642
12496d4467A14549J09319b0762E187L54951A16908c316A23268E9380B5566L9085
12485F4651J06807a3342C07649b31655A85314E442h0711C5274a77975D00576A03
12473b59301A4945a21306J5955J371A96035m0743a15107n265d8371k36636a40930
$$ y = [190237, -153327, 166136, -379351, 39130, -83584, -65055, -58089, -224215, -10728, 277215, 154897, 159943, 64068, -153649, 330525, -118364, 246437, 106550, 198708, 66954, 140760, -485969, 4832, 49137, -52203, -64782, 163674, -81280, -141394, 295747, -257031, -146022, -20333, -113391, 192642, -111895, -171707, -243602, -170248, 29496, -99102, 28184, 15929, -78742, -56534, -194013, 109091, -89963, -10420, 1199, 124868, -263746, 106792, -225199, 326642, -44467, 114549, 223868, -20762, 5187, 360138, 116908, -3316, 123268, 59380, 25566, 64651, 171458, -13342, 307649, -231655, 185314, 5442, -80711, 35274, -177975, 400576, 103, -259301, 14945, -121306, -105351, -103980, 196035, 155292, -115107, -120372, -48371, -285007, -140930]
12461C27142E5423R4986b65559a24134C59543J26847h9067F5885a20457e2588
12450a54220J0561A5609a40106d9704D05279A4106a14321k5166B16704H1072J82116
12439B63188a0424o0705I854a80758B56443J67770c2643F9862q816b4047j2151
12428c6198j07353L2260C6820c77986B97598A33712a58690k8098C19503a02598
12417a12004d1586B45747i9707A03475b56476e9500K914A53577c1352C5164a28062
12405b60130j2312B06513J52495c90461a85083B79257j06234c38316E3447g665
12394b04344B1024a64464D0558b6798B30948a36487G9976r023a36250B1726a3276
12382a54720C01181h1227B07926l0311l9089f5699D2911K54769A19839i6980j26685
$$ y = [327142, 55423, 150409, -265559, -124134, 359543, 486390, -89067, 65885, -120457, -52588, -154220, -143659, 15609, -140106, -49704, 405279, 14106, -114321, -139487, 216704, 81072, 263188, -10424, -71129, 9854, -180758, 256443, 424213, -32643, 69862, 61046, -24047, -36198, -143551, -111291, 36820, -377986, 297598, 133712, -158690, -186788, 319503, -102598, -112004, -41586, 245747, -99707, 103475, -256476, -59500, -56586, 153577, -31352, 35164, -128062, -260130, -272442, 206513, 359008, -390461, -185083, 279257, 173023, -338316, 53447, -7665, -204344, 21024, -164464, 40558, -26798, 230948, -136487, 79976, 70953, -136250, 21726, -13276, -154720, 301181, -81227, 207926, 177615, 138526, -65699, 42911, 297680, 119839, -96980, -223665]
12371b23665d7843j3714H361L1717K10804a62940G7562Q0011a25821a2623C02106
12359H2334N07284g6990C32255G8843K59576c8660n735A34044J01607d1101A53048
12347c29987J15293g9619C0994f7412F6047K85270i921A39747a99565a9016j66503
12336a85519h0126C359c18126B12759b659A8226P9007j8871b76193h1248A33719
12324A63524Q3389J4311f8950K6130j2950k67884B82054b9536A87971J34207n0787
12313B71391G6628J46823E3834a70113C18290q959j23096f2112r6505A69232P5791
12302B45023P8908A05525R9310M6180E7102J56158h3588D25790j74479C9696Q8002
12291A27698M513a90139A1982K94537A18120P35a23356D9729J9982Q9521o5945
$$ y = [-223665, -47843, -61557, 8361, 40078, 250882, -162940, 77562, 157573, -125821, -12623, 302106, 82334, 589618, -76990, 332255, 78843, 338419, -38660, -44395, 134044, 235651, -41101, 153048, -329987, -214694, -79619, 30994, -67412, 66047, 351317, -9921, 139747, -199565, -19016, -185519, -80126, 3359, -318126, 212759, -2659, 18226, 97233, 78362, -276193, -81248, 133719, 163524, 246913, 261224, -68950, -42820, -55770, -323654, 282054, -29536, 187971, 322178, 271391, 76628, 223451, 53834, -170113, 318290, 309331, 186235, -62112, -158617, 169232, 245023, 323931, 105525, 204835, 251015, 57102, 213260, -83588, 425790, 251311, 39696, 127698, 132211, -190139, 11982, 306519, 118120, 118855, -123356, 49729, 69711, 159232, 93287]
12280I3287a59456J1823F6744d334B30275a80960Q1392M1594A24263d50058g3265
12268H07b7507O647C50507Q1935a01608A63539D2656L6857N0947O4149K19015
12257D13624j09439c06288j24298B98818H3568f5334I6693L4040J35304I374L49878
12246C59252A67259J27910C3854K6066J50315f3135A97140G8549J19894l6266
12236A62177g9060b3982A64688a01364A69313K14659E5754c8120J4404A78998
12225A14949L5302D354N6746J68611n5555K9571a83604D012b64847C69905a57850
12213C81681E5225b32332G160J4277b8696B40584H3162c6038q0390B89152F0767
12201C47311f1791A81803L5638K42810A09499N2893E5937j4827J289d5694B78731
$$ y = [93287, -159456, -147633, 66744, -4334, 230275, -180960, -99568, -57974, 124263, -450058, -73265, 807, -27507, -20860, 350507, 432442, -101608, 163539, 42656, 79513, 130460, 194609, 413624, 304185, -306288, -430586, 298818, 83568, -65334, 96693, 130733, 266037, 9374, 359252, 167259, 295169, 33854, 59920, 210235, -63135, 197140, 78549, 198443, 162177, -79060, -23982, 164688, -101364, 169313, 383972, 55754, -38120, -23716, 178998, 114949, 150251, 4354, 61100, 229711, 174156, 203727, -183604, 4012, -264847, 369905, -157850, 381681, 55225, -232332, 7160, 21437, -28696, 240584, 83162, -36038, -116428, 289152, 60767, 347311, -61791, 181803, 217441, 460251, 109499, 162392, 55937, 41110, 42399, -45694, 278731]
12189A72749Q7771Q6224q8191b1653D8439K20511A13523a99545A62489J15286
12179B77775f2885D91587j95975B4314J63666q7472J07743I4447K8265a63774
12168A99060m8247b69747e1846D5942a41115E1796J12341f219A54188l1231h0540
12156B67436q0433G7250O5893J39195j24123K71357A29861b39C03521N4451m0766
12145C17206A22460L71779F7783C1279Q7471A6396K68465q7846O4680N5038a4861
12133B3999j0917L59874L1982j94131a27352G1975J25417h8578G3531K27340q9230
12122B11641J30708k747a61719I7589j7325a86643C49729a38027j68635Q057B96919
12110b9049m9456a1275B08707K5060R9312M1427G2883b5161F5170L51617I1045
$$ y = [172749, 260520, 346744, 258553, -21653, 48439, 268950, 113523, -199545, 162489, 277775, -62885, 491587, 295612, 24314, 187980, 100508, 208251, 94447, 122712, -163774, 199060, 150813, -269747, -51846, 45942, -141115, 51796, 164137, -6219, 154188, 122957, -80540, 267436, 187003, 77250, 143143, 282338, 158215, 429572, 129861, -239, 303521, 357972, 317206, 122460, 494239, 67783, 31279, 118750, 16396, 284861, 197015, 261695, 316733, -14861, 23999, 13082, 372956, 404938, 210807, -127352, 71975, 197392, -88578, 73531, 300871, 211641, 342349, 339602, -161719, 97589, 80264, -186643, 349729, -138027, -306662, -298605, 296919, -29049, -78505, -11275, 208707, 233767, 333079, 374506, 72883, -25161, 65170, 416787, 91045]
12098B40711A10808N0401n6268m8805P6999a51111A08052a18337F4771J08931
12088A73702a56153B07699b6901l5695j1093b738A49258l40h9960j13787B96441
12076A21699A5170K19398k2078N8296l5686F8242b35367I9454j0852J35438E4676
12064F2908a75481G58507A05752b1117B953a3949B62584K2995h8656k2201C20397
12052A10485a37168D08623l4542F6700J514J69444j11818K23996c9483A58821
12041A38563K94200j66216f671j06885F0215b8508D1565a0770A23211B9379g2301
12029a51299A6742R5693a09862a0171n4132M727m9452j12655H2054b16455a8528
12017a19796A99859J67272a62979A42342J09648J37438a56353l18473a88227B76870
$$ y = [240711, 110808, 161209, 104941, 56136, 133135, -151111, 108052, -118337, 64771, 173702, -156153, 207699, -26901, -62596, -73689, -2738, 149258, 148918, -89960, -203747, 296441, 121699, 15170, 234568, 212490, 270786, 235100, 68242, -235367, 99454, 88602, 224040, 54676, 62908, -175481, 758507, 105752, -21117, 2953, -13949, 262584, 285579, -88656, -110857, 320397, 110485, -137168, 408623, 374081, 66700, 68214, 237658, 125840, 349836, -39483, 158821, 138563, 432763, 266547, -6671, -113556, 60215, -28508, 41565, -10770, 123211, 29379, -72301, -151299, 16742, 112435, -109862, -10171, -64303, -59576, -109028, -221683, 82054, -216455, -18528, -119796, 199859, 367131, -162979, 142342, 251990, 389428, -156353, -474826, -188227, 276870]
12006a48278d365j05219C32031F3766K1165K27361Q8907P3331a97476C00049A2172
11994b43568I1934h3945p7423F1253P135b82634B35254b3732l175B6428b73035
11982i5554L0836B53156a70226C14083a6556j28798A13326L7805e7827B3758R3490
11971A17248J02256F4175a30288q5026B444f2107B1663b39275N0238C78613g8365
11959A01654b02337d5894E2895L7831Q3867a37202A9959R5137a11720b9356q2784
11948a12140q1155E0200a38621B69138D4944J5734a2979j53732k25697J46401
11938b46007a06868A4945e0880a0938F1247f604B16426i1736G433g0162l2694
11927a02856A60510a90804B5452J22958P8145A08868h0372b7364n7211B31778
$$ y = [-148278, -4365, -109584, 332031, 63766, 84931, 312292, 401199, 474530, -197476, 300049, 12172, -243568, 91934, -83945, -161368, 61253, 68388, -282634, 235254, -23732, -26907, 26428, -273035, -95554, -64718, 253156, -170226, 314083, -16556, -145354, 113326, 151131, -57827, 23758, 117248, 219504, 64175, -130288, -215314, 2444, -62107, 21663, -239275, -189037, 378613, -78365, 101654, -202337, -45894, 52895, 90726, 174593, -137202, 19959, 115096, -111720, -29356, -112140, -193295, 50200, -138621, 269138, 44944, 60678, -12979, -166711, -392408, -246007, -106868, 14945, -50880, -10938, 61247, -6604, 216426, -91736, 7433, -70162, -102856, 160510, -190804, 25452, 148410, 226555, 108868, -80372, -27364, -84575, 231778]
11916c2363B72875F6597a0413A58638a59234B74183b3405j41715A05338B2075
11905g4738l7503B08400f5950C34281H2925M4595K4813K50720c40786C38028j23380
11894B14648c01676D1697J09460C9210J92693a2355A28231M0225d7459A39178
11883A07855b10036C28155a29730j78214k32604B23740a32545A81463a26926e5948
11872c09771B0863a44218A32320a97355A80204H2682d7882l7927D4108J15167
11862A59275a81115f9011G1711b72838B28748d2191D9613a743A20436i8086j33599
11851b31685C4770e6132C9177c14010A22295a97304j1880b0965j34480P7689j7668
11840i5424D6359b40481o9792M728A56361p4586d59785C34306i9042A05099m6890
$$ y = [-32363, 272875, 66597, -10413, 158638, -159234, 274183, -23405, -165120, 105338, 22075, -74738, -112241, 208400, -65950, 334281, 82925, 127520, 152333, 403053, -340786, 338028, 214648, -301676, 41697, 151157, 39210, 231903, -12355, 128231, 168456, -47459, 139178, 107855, -210036, 328155, -129730, -307944, -540548, 223740, -132545, 181463, -126926, -55948, -309771, 20863, -144218, 132320, -197355, 180204, 82682, -47882, -85809, 44108, 159275, -181115, -69011, 71711, -272838, 228748, -42191, 49613, -1743, 120436, -98086, -231685, 34770, -56132, 39177, -314010, 122295, -197304, -209184, -20965, -155445, -77756, -95424, 46359, -240481, -310273, -305545, 156361, 81775, -459785, 334306, -99042, 105099, 58209]
11829E8209a83660A64918m4964a93591D33677b85755h7629k29687g2559n8267
11819a30826K9024I9719c47125C6692J77596G1107J11049c75537B76193a35314
11808b24380F52b7055A37875d2434a3805k86866j94579A39186b35783B3435N7804
11797H1239d44995j35948e5749A71665a33013m169F7849L1394K56389a16252j32559
11786b48811r3065a27865g360o3638j88144h6015B7561q002a28261j06203B04989
11774B61705a29450N1620L7253k48596i9374k9883d0383B80936A38227j1715A304
11762B52668o2054a00648G0297A21h8144C13604A03043D3029J26340a50191d9190
11750I9792a64469C94827A1037b04079g0736D1181j6163P7495a20104c8142I078
$$ y = [58209, -183660, 164918, 119954, -193591, 433677, -285755, -87629, -317316, -72559, -130826, -101802, 99719, -347125, 36692, 214288, 71107, 182156, -375537, 276193, -135314, -224380, 652, -27055, 137875, -42434, -13805, -300671, -495250, 139186, -235783, 23435, 81239, -444995, -580943, -55749, 171665, -133013, -137182, 67849, 99243, 355632, -116252, -248811, -341876, -127865, -7360, -70998, -259142, -86015, 27561, 19559, -128261, -234464, 204989, 261705, -129450, -77830, -40577, -289173, -99374, -129257, -40383, 280936, 138227, 126512, 1304, 252668, 190614, -100648, 70297, 121, -88144, 313604, 103043, 43029, 169369, -150191, -49190, 99792, -164469, 394827, 11037, -204079, -70736, 41181, 25018, 102513, -120104, -38142, 9078]
11738A24191C0341b23615C20628A40774e3551l50681E0272K32338F630f2342G4043
11726e6259k80749a43847B10464d43269a30400O004r1729B3353J63022a28290
11715i7898c603j23366C383b58826A21602K3471k0907a22085B1986J6380b12257
11703A5719e4427B94454e2476j38583B26421n4935D5473j225b2235j50123c1274
11691A36767o6008d7345j03512M581N3529d0307F2010a09102N2966k7506p3339
11680a56981A61150g5509m8851C97984i3995j46079Q5470A13692m6748L48430
11670D15374c17686B22481b4296J0433E0368a87959B8226L49947j11756B2548
11659a5872A55327F4718o506d231j72971b1235m4849B50861a17458A64449g3772
$$ y = [124191, 30341, -223615, 320628, 140774, -53551, -404232, 50272, 282610, 6630, -62342, 74043, -56259, -337008, -143847, 210464, -443269, -130400, -124396, -216125, 23353, 186375, -128290, -97898, -3603, -126969, 3383, -258826, 121602, 145073, 124166, -122085, 21986, 38366, -212257, 15719, -54427, 294454, -52476, -191059, 226421, 171486, 45473, 44248, -22235, -172358, -31274, 136767, 70759, -47345, -150857, -146276, -92747, -40307, 62010, -109102, -56136, -83642, -156981, 161150, -75509, -124360, 397984, -93995, -240074, -154604, 113692, 66944, 415374, -317686, 222481, -24296, -13863, 50368, -187959, 28226, 378173, 266417, 22548, -15872, 155327, 64718, 58212, -4231, -177202, -21235, -66084, 250861, -117458, 164449, -73772]
11647a56423b4830C5368M6317b64658e7035H0123O8981a02340B2350K11848j04979
11636A29219h0008m6037B60288o8444a51129I4714R7540c04930d6950F776J63003
11625A69779b10387C8378e0201a4516n603m80469I6034b28526E2394J12911a10417
11613B5034K07530B0000a33858A27961m2918B2613b45742n6707a9136B48824f8327
11601A64537a15274C0851g0334k2926b8151j78016I3667J21567a14859E5573J02427
11590A58000a18772E4459b79623A61233E3695a54598C31739j21843J41971A31345
11579A14489M2950b01908h4207A66256a25389E7201J4320a50621I3874A1280a8535
11567C32378p7337A14663K12740C946a42460M8427C77937a9665C72486j61137
$$ y = [-156423, -24830, 35368, 81685, -264658, -57035, 80123, 149104, -102340, 22350, 234198, 129219, -80008, -126045, 260288, 191844, -151129, 94714, 192254, -304930, -46950, 6776, 169779, -210387, 38378, -50201, -14516, -20119, -500588, 96034, -228526, 52394, 165305, -110417, 25034, 232564, 20000, -133858, 127961, 85043, 22613, -245742, -302449, -19136, 248824, -68327, 164537, -115274, 30851, -70334, -93260, -28151, -206167, 93667, 215234, -114859, 55573, 158000, -118772, 54459, -279623, 161233, 53695, -154598, 331739, 209896, 351867, 131345, 114489, 157439, -201908, -84207, 166256, -125389, 57201, 71521, -150621, 93874, 11280, -18535, 332378, 255041, 114663, 327403, 3946, -142460, -94033, 377937, -19665, 372486, 211349]
11557B11349m9522a50472C31422A29172n5925c734C28755f3661R792O29o068j02404
11545a61712h0275n1187C42464N6432c53943f2620a4522j3346F4354a20686n0532
11534a71218B16673K64154B6304N6124c89200J64138A59989a44317N4023r8291
11524a88585n8541C90344b25506A13499e3093A0168N8595P7228a25168B30005
11513b46121L4931A42652J94145j32026D5138a24896k54980A09694L19383I2429
11502d1961B37246a21401n5130B91296K057c670B22772b48177B35145b3386A60979
11490B58923a00920j33372A76694K52935D8818Q042J35506K1572G0252L13211
11480C83463a36594j57004C34125C406J90733a44674C5932K42256b69241b5131
$$ y = [211349, 161827, -150472, 331422, 129172, 73247, -3734, 328755, -63661, -53869, -53240, -59308, -161712, -80275, -131462, 342464, 398896, -353943, -62620, -14522, -27868, 64354, -120686, -171218, 216673, 480827, 26304, 82428, -389200, -225062, 159989, -144317, -90294, -188585, -247126, 390344, -225506, 113499, -53093, 10168, 68763, 145991, -125168, 230005, -246121, -211190, 142652, 336797, 204771, 45138, -124896, -379876, 109694, 429077, 92429, -41961, 237246, -121401, -176531, 291296, 293353, -3670, 222772, -248177, 235145, -23386, 160979, 258923, -100920, -234292, 176694, 429629, 48818, 56860, 192366, 213938, 70252, 383463, -136594, -293598, 334125, 3406, 194139, -144674, 35932, 278188, -269241, -25131]
11469B44222A08158J36389G9601a4391m821A58616J42052j5308r1186R4320A00438
11457F7924K984R9221b5813B41125J38098O6550D8546a54292B34822k8225p7153
11446A29444n254B7873J96116O613a35811C42696C7251n969J13460K44463A69681
11434A81285N5235j00582M393J25963C2564J726e6635A36977J7938L9635M2986
11423B37536K56652D6843a6932l45503F4090g6304K6116B29713q2521k330L3400
11412A78262D5936a98438B7714a50019B11513G4279A6880h8421H884d5641F9226
11400a41777j4751D0039a23523C7077a59276d923m0412g445j49305o4466a7129
11388i2220F9254B8405r330R3218h2257B48706b41210C7066a62871j46939A7022
$$ y = [244222, 108158, 244547, 79601, -14391, -19212, 158616, 300668, 285360, 194174, 288494, 100438, 67924, 70908, 170129, -25813, 241125, 379223, 445773, 48546, -154292, 234822, 206597, 129444, 124190, 27873, 223989, 230602, -135811, 342696, 37251, 31282, 144742, 389205, 169681, 181285, 236520, 135938, 140331, 266294, 32564, 34290, -56635, 136977, 154915, 194550, 237536, 494188, 46843, -16932, -362435, 64090, -76304, -50188, 229713, 147192, 144862, 178262, 45936, -198438, 27714, -150019, 211513, 74279, 16880, -88421, 8884, -45641, 69226, -141777, -156528, 40039, -123523, 37077, -159276, -4923, -45335, -7445, -156750, -221216, -17129, -92220, 69254, 28405, 19075, 112293, -82257, 248706, -241210, 37066, -162871, -309810, 17022]
11376A23587J79217E4031a3666E5554R8737a58020P6965k4152H3081a25332l2270
11365a57602A5802l194a07066B2252K01575g4746K6033B12293b98349O3456H9517
11353c50340a258j16084j30355a03758B94260h8772A57006c50369A23810C1923
11342d2809o637k71635i525j25490k5537m1658Q8929k60909I4305B1709h852n5009
11330f3861p3450n0726C5178J7095a15424J4972n2527J7257A35048k0612a73019
11318b34632A89815a07863N1200B1268J9633a57309K1142a5182A14087b38713
11307C06677A37784l2392a10392j07963A5769b22896R6458K8081j34062d8078
11296A06405l6159e42003E119J88986a01028C3714a45497B2196P4832b1981B21026
$$ y = [123587, 302804, 54031, -13666, 55554, 154291, -158020, -81055, -105207, 83081, -125332, -157602, 15802, 12608, -107066, 22252, 223827, -74746, -48713, 212293, -298349, -234893, 89517, -350340, -1258, -117342, -247697, -103758, 294260, -88772, 157006, -350369, 123810, 31923, -42809, -49446, -321081, -9525, -135015, -160552, -202210, -113281, -374190, 94305, 21709, -8852, -63861, -137311, -188037, 35178, 52273, -115424, -100452, -152979, -135722, 135048, 114436, -173019, -234632, 189815, -107863, -56663, 21268, 40901, -157309, -136167, -15182, 114087, -238713, 306677, 137784, 105392, -110392, -218355, 15769, -222896, -126438, -98357, -232419, -48078, 106405, 70246, -542003, 5119, 194105, -101028, 33714, -145497, 22196, 97028, -21981, 221026]
11284a3300j41058a0669B2757K37904a95892O1625J6483i643k17097B62333b72618
11272a60398o2202O044L8725K9080F8853L7848J39673p5582C4326a47514b2104
11260h1024j2002F4218f3415p7782O1678A4518b78119k4813a806k16471D3129
11248B02010j00380a02909B34851h6046j45427H0602a15571A43852J34852f8031
11237D41354k08641A6884J53049a79235A00400k9164i5424O243G4595a37468l1365
11226a68833A212J31442J12545b97908A54671D735J70291O0124g2082A18350h9884
11214b69048b1744j83093h5546D7814a61666P4477L1520j72475j99086a19731
11203A61522b4470j46515G5478J47438a71066F6366b54002m2934a00060A35444
$$ y = [-13300, -154358, -10669, 22757, 260661, -195892, -134267, -117784, -9643, -226740, 262333, -272618, -160398, -222600, -216556, -177831, -148751, 68853, 106701, 246374, 170792, 34326, -147514, -22104, -81024, -93026, 64218, -63415, -141197, -79519, 14518, -278119, -302932, -1806, -218277, 43129, 202010, 101630, -102909, 234851, -86046, -231473, 80602, -115571, 143852, 278704, -68031, 441354, 232713, 16884, 169933, -179235, 100400, 71236, -95424, -89181, 74595, -137468, -168833, 1212, 132654, 245199, -297908, 154671, 4735, 175026, 235150, -72082, 118350, -89884, -269048, -21744, -204837, -85546, 47814, -161666, -87189, -55669, -228144, -427230, -119731, 161522, -24470, -170985, 75478, 222916, -171066, 66366, -254002, -296936, -100060, 135444]
11192c5077A28568b51824C62194F0472a73448C2110L6704c7159A5235e5187H3593
11180e0285B1923b77617D46118A01970A2751N2977b71034g7081p7956E9521a13297
11168B80137d9143j82054C17489a52027k20915A56390b37372I3860f0086C11458
11157b32933Q3399O8581j24773N7092a5378q7052j18861B41788P6545b09896B39514
11145G9707A6485R5555a23373j52403R9241a7418j5378B73933A20079e6537B39206
11133A61948b2102D621N7481a0122k376F6140N4183d79767I3015C2729e24l79851
11121c80375H1579R9163J32732I9514e41821a37263E0007f5524I5596a71150C9958
11109B14588a33489Q020H5515J89212j29646Q4973a73991I3848b08993E912N0563
$$ y = [-35077, 128568, -251824, 362194, 60472, -173448, 32110, 68814, -37159, 15235, -55187, 83593, -50285, 21923, -277617, 446118, 101970, 12751, 65728, -271034, -77081, -155037, 59521, -113297, 280137, -49143, -231197, 317489, -152027, -372942, 156390, -237372, 93860, -60086, 311458, -232933, -149534, -80953, -205726, -148634, -15378, -102430, -221291, 241788, 318333, -209896, 239514, 79707, 16485, 112040, -123373, -275776, -176535, -17418, -32796, 273933, 120079, -56537, 239206, 161948, -22102, 4621, 62102, -10122, -12498, 66140, 120323, -479767, 93015, 32729, -524, -380375, 81579, 180742, 313474, 99514, -541821, -137263, 50007, -65524, 95596, -171150, 39958, 214588, -133489, -125469, 85515, 274727, 145081, 230054, -173991, 93848, -208993, 5912, 56475]
11098E6475a44142k2254E1217a33976B34044p4966c7812a4060j76043A85496l4083
11087A51413K81363C021a77928f3414C04184H7397J23212k6327J86455A24091
11076a59987A17059j7190a99862C85289A1154K28770G8851P7184P8887o4387K30069
11065D00604G041a70868I2561a8072B4129g6116C69565q9916G5374J20026R6987
11054B92387F7171K31880I6871L8802M5944P8760L24357A98012n508L57687k01734
11043C48457j5798J49566K20276o7016j25119j4556J34719j51475J18752L4908
11033F32714C11191K78331J59536k99344K96345m1032l49228J26146O4221j12216
11023D33950K78335B89262N08066Q9725j84037j65252K3028k41962L13647j43386
$$ y = [56475, -144142, -166396, 51217, -133976, 234044, 159078, -37812, -14060, -190103, 185496, 151413, 432776, 3021, -177928, -63414, 304184, 87397, 210609, 184282, 370737, 124091, -159987, 117059, 99869, -199862, 385289, 11154, 239924, 78851, 156035, 234922, 170535, 400604, 7041, -170868, 92561, -18072, 24129, -76116, 369565, 279649, 75374, 195400, 292387, 67171, 299051, 96871, 135673, 181617, 260377, 584734, 198012, 192504, 550191, 348457, 332659, 482225, 702501, 635485, 510366, 495810, 630529, 479054, 597806, 632714, 311191, 589522, 749058, 449714, 746059, 705027, 355799, 481945, 546166, 433950, 712285, 289262, 797328, 887053, 703016, 537764, 560792, 318830, 632477, 489091]
11013D89091J28071j63138m9907P2214M21147m21902j46353L64126j31098J07221
11003F69472j54619K7298j71821R8971P4743j78866J79776k9713A88562M74308
10993F62870K30583B26527K86070k17230K10774j5728j84300P2006l6539J99358
10983E40938B28634M11778n6456k34973P5395O4084j02673J33776K20779j56176
10973E84168j1415r9082K73847j85748K9135N65613C86064M44977j3902p0600
10963G46539L92096l23299O35033k56285J72189j42031K92411J16820n2882L15887
10953A896478n1571K78762l95324J23245r4686k505l09093R838k93507Q6525L1604
10942A279766P9891k43344K38939R4365J47513k30960k19263j38382J6312p9739
$$ y = [489091, 617162, 454024, 404117, 476331, 897478, 475576, 329223, 693349, 562251, 669472, 514853, 542151, 370330, 469301, 544044, 365178, 544954, 515241, 188562, 662870, 893453, 226527, 512597, 295367, 506141, 490413, 306113, 378119, 341580, 540938, 228634, 640412, 583956, 348983, 424378, 488462, 385789, 519565, 740344, 584168, 572753, 473671, 747518, 561770, 590905, 1156518, 386064, 831041, 817139, 746539, 1138635, 815336, 1450369, 1194084, 1366273, 1224242, 1516653, 1633473, 1580591, 1896478, 1844907, 2123669, 1728345, 1851590, 1756904, 1754399, 1445306, 1455144, 1161637, 1248162, 1279766, 1359657, 1116313, 1355252, 1449617, 1597130, 1366170, 1146907, 1008525, 1024837, 945098]
10932I45098k87826K47568l60039J67367l27414L7749p6426L8321j54013n3836
10922A76549a0870H6854P5897M0857J1835p7862J9472n15k7706A2054a50249q1545
10910b31794h2162m0383A63790i9311F4734b49596f081j58623P686B9536K4612
10899E4148A3611a40305n3043m8106j02292C02565q0407d7301D98221c35904B24423
10887h0115L8599B73574b16325O6164k343A66635b59530A44876a58723B2776h7792
10875C6458O3671d1572j95422H8093a15713n7950f1721F5929M5990J50217j23468
10864A38668a27621A7094a27577l7576B13547d1532C19372A1803J48369b28335
10853d71264b6274C24229f3947k13877a2056j76909e9658K0357B0924J3239e7132
$$ y = [945098, 657272, 904840, 544801, 712168, 384754, 422503, 346077, 384398, 230385, 176549, -10870, 86854, 162751, 203608, 215443, 137581, 157053, 156538, 128832, 12054, -150249, -231794, -82162, -122545, 163790, -99311, 64734, -249596, -6081, -164704, -157018, 29536, 54148, 13611, -140305, -193348, -241454, -343746, 302565, 222158, -47301, 498221, -335904, 224423, -80115, -41516, 273574, -216325, -150161, -152504, 166635, -259530, 144876, -158723, 22776, -87792, 36458, 100129, -41572, -236994, 88093, -115713, -173663, -61721, 65929, 111919, 262136, 138668, -127621, 17094, -127577, -165153, 213547, -41532, 319372, 11803, 160172, -228335, -471264, -26274, 324229, -63947, -277824, -12056, -188965, -59658, -39301, 20924, 34163, -57132]
10841b03130a0400j6223q0277C1163a58645H7823a34173O7057A74035b84022e2635
10829B82285C98R0152L8225o3774J8260d8987C6651a18568r6825I5184a01589
10817I4219b56487N4293h1429l9444j5369B61785m1409b08522C23632c78522A15998
10805e6017l31861J41056h2151F7700e253b386k11924J00944E9162k5608q073
10794B5481b36025N202F3492J44373E3769j0348J63423p8576J01141i6023k14170
10783c10193B4930j1246d9991I1024M850a70905C186J17506a90247A31569c36769
10771A09017a33696B714a46855K7790j58333J09524A04522c95053D6570J27506
10761A74076J3801b91889i1951A37996a00361m36621I9015J37324k4475b31206
$$ y = [-203130, -10400, -26623, -106900, 31163, -158645, 87823, -134173, -67116, 174035, -284022, -52635, 282285, 398, 90550, 128775, 65001, 83261, -48987, 36651, -118568, -215393, 95184, -101589, 94219, -256487, -202194, -81429, -120873, -136242, 261785, 220376, -208522, 323632, -378522, 115998, -56017, -387878, -246822, -82151, 67700, -5253, -2386, -214310, -113366, 59162, 33554, 25481, -236025, -230823, 63492, 207865, 53769, 43421, 206844, 128268, 229409, -96023, -310193, 24930, 13684, -49991, 91024, 95874, -170905, 3186, 120692, -190247, 131569, -336769, 109017, -133696, 2714, -146855, -119065, -277398, -167874, 104522, -395053, 46570, 174076, 187877, -291889, -91951, 137996, -100361, -536982, 99015, 236339, 211864, -231206]
10750A74331a60461P1247j3061j43888j5730A79314C2644c3613q5974n0663M147
10739a66103K9225j32826B66845j17957B5363e5879C2155b7728m3176p4584d3020
10727B41798p2653a72209h0602p0851E8123e9554H5948a89684A0775g0381j14978
10716a85359f2469k20671q2767B23994n3499b08026L8138l7675e9502A04438j6726
10705H7712h0059I3438b72116j5321a03036N0247k0249a2658n6864C2638O3750
10694I6388a30202d5252h955j33956c2620n8507p9248A36139c38828R8352h9819
10682H5254a89388D4690c07812A66464b18554l6420C3962d6725j84009l4483a16405
10670g1944q6646F7508a26710i846j10349K0521n4499k37494e095p678C9344h824
$$ y = [174331, -160461, -89214, -102275, -246163, -261893, 179314, 32644, -33613, -119587, -170250, -166103, -136878, -269704, 266845, 148888, 25363, -55879, 32155, -27728, -70904, -145488, -43020, 241798, 169145, -172209, -80602, -151453, 58123, -59554, 85948, -189684, 10775, -70381, -185359, -62469, -283140, -365907, 223994, 170495, -208026, -169888, -207563, -59502, 104438, 87712, -80059, 93438, -272116, -287437, -103036, -52789, -73038, -12658, -69522, 32638, 96388, -130202, -45252, -8955, -142911, -32620, -91127, -170375, 136139, -338828, -240476, -89819, 85254, -189388, 44690, -307812, 166464, -218554, -254974, 33962, -46725, -230734, -265217, -116405, -71944, -158590, 67508, -126710, -9846, -120195, -99674, -154173, -391667, -5095, -12773, 39344, -8824]
10657A3496a09660L1650o1815L4576k52276A25571a7709j89771O4336B8629k801
10646B5828q217J00573c0442k21039j2330A09426a50710h008k49699h800A3549
10634b68122a30749j13213g8544B6665L9877J14948h1729k3972j67125p444J28922
10623a51348J4842L5088j76334J37584E8135b32319a12072E095a48716q6155A8774
10611b06125A05714a66012M163d7969k87815b5289A58190n32G1665a30918k13778
10600c44696h8834C1021A4149L0742b9342e149j28135l9489c3674j64097b0418
10588d33097b021j08625a6045p8152A9043D985L1798O3172D5604F493J02762J75992
10576B85247a55001B6166b55566J8476J9941B4051r945Q1638D0173N696K8355
$$ y = [13496, -109660, -78010, -139825, -105249, -357525, 125571, -17709, -207480, -143144, 28629, 25828, 17611, 118184, -30442, -251481, -263811, 109426, -150710, -8008, -257707, -8800, 13549, -268122, -130749, -243962, -78544, 26665, 66542, 181490, -81729, -105701, -272826, -280270, -151348, -136506, -101418, -277752, -140168, 58135, -232319, -112072, 5095, -148716, -234871, 18774, -206125, 105714, -166012, -161849, -47969, -335784, -25289, 158190, 157658, 71665, -130918, -344696, -88834, 31021, 14149, 44891, -29342, -5149, -133284, -172773, -33674, -197771, -20418, -433097, -2021, -110646, -16045, -94197, 19043, 4985, 36783, 99955, 45604, 6493, 109255, 285247, -155001, 26166, -255566, -237090, -217149, 24051, 14106, 95744, 40173, 45869, 74224]
10565G4224f1330l9319F7275a1295C52495E2852g2125A33708a83260h1327J6179
10554f5148F1031R4935d6305B77122b60133O7261A30743a27900H2969A3591K95051
10543C08642o1550p3468a31435j1024j9927D40039B15575a00953m3840c3272O674
10532b6598j37568r2019C8514a251k60402B1529a3130q5276A0693a37259j78240
10521c15499a41214j13167a15268j57905g1667A32867a58377e5314j55063q2293
10511b92670N8692R5992a194A66107l3585b87418J26330m1413P4878A26378M6427
10500A72805e8435j66427E9478K4855d06511B31005c8589B04009a74382N2008
10490a22374m6640l4364k0355N9250g7110j89469D7867c86014i6271k06061B0498
$$ y = [74224, -61330, -100649, 67275, -11295, 352495, 52852, -72125, 133708, -183260, -81327, -65148, 61031, 155966, -46305, 277122, -260133, -192872, 130743, -127900, 82969, 13591, 308642, 247092, 173624, -131435, -142459, -162386, 440039, 215575, -100953, -144793, -33272, -26598, -164166, -256185, 38514, -1251, -261653, 21529, -13130, -98406, 10693, -137259, -315499, -141214, -254381, -115268, -273173, -71667, 132867, -158377, -55314, -210377, -292670, -233978, -137986, -1194, 166107, 132522, -287418, -161088, -202501, -127623, 126378, 172805, -58435, -224862, 59478, 84333, -406511, 231005, -38589, 204009, -174382, -122374, -169014, -203378, -223733, -164483, -77110, -266579, 47867, -386014, -96271, -302332, 20498]
10478A97895p7549a66889p4318f1325K6009D9334h7510F2940r621Q8052a22395
10466E132L30289a15770B60087A26982a91577D04130J49050o4578j76050q5256
10456B27296K8382B5598b7558G8607N10e9513J7741A90585e7542j60524Q822B36075
10443B37195a66600p1158j25192H2647a48289a4607k16719g7463q688l74709I4301
10431B59635A0791K56977C0028b0936A22011R5065K8048p3991K6152b8102A07198
10419A82900f7174C0844a38216k5132c8249l97207g9980o0811A93068b36589a10541
10407c7035B33965A7484b25913J0388O3146j75347Q4535A11652c1942o3903A2388
10395a0740m9050J4230B8435N837a0783B05962c8656j34343M9150A66764J06722
$$ y = [197895, 120346, -166889, -241207, -61325, -35316, 49334, -87510, 62940, 53319, 141371, -122395, 5132, 335421, -115770, 260087, 126982, -191577, 404130, 553180, 488602, 312552, 227296, 255678, 25598, -27558, 78607, 79117, -59513, -41772, 190585, -57542, -218066, -209244, 236075, 237195, -166600, -237758, -362950, 82647, -148289, -14607, -231326, -77463, -86151, -460860, 94301, 259635, 10791, 267768, 30028, -20936, 122011, 217076, 245124, 171133, 197285, -28102, 107198, 182900, -67174, 30844, -138216, -163348, -38249, -435456, -79980, -140791, 193068, -236589, -110541, -37035, 233965, 17484, -225913, -215525, -152379, -327726, -243191, 111652, -31942, -95845, 12388, -10740, -59790, -45560, 28435, 34272, -10783, 205962, -38656, -172999, -123849, 166764, 273486]
10384B73486c35573F1735J40071e9751j93817B18410i8312A6323i6970A31709
10373E25888f9301I3601a19501c0117A35537J16329K1144A28002c5020a5968D8999
10361A83163J26486a88186J8800A41591a14507D02486j23886B6976g1155D39313
10350E69233I4589P2302j7529M3784L6562C867M00036J289G8943K57344J09039
10339D45326A38459m4700K07449K753A10224L59815m2518j43638J70397A31702
10328H8361J44347J46537j82791Q839P6173k7853C8712J84004J8179K4029G9449
10316B94720a02307B23263a18873A1197K9872b64378B80989j22326m5746c7318
10305I2256J62224j13093Q3349C5020K10150a41471a0951j10513A31774c4424
$$ y = [273486, -335573, 61735, 201806, -59751, -253568, 218410, -98312, 16323, -96970, 131709, 525888, -69301, 93601, -119501, -30117, 135537, 251866, 273010, 128002, -35020, -15968, 48999, 183163, 309649, -188186, -169386, 141591, -114507, 402486, 278600, 26976, -71155, 439313, 569233, 94589, 166891, 149362, 193146, 229708, 3867, 403903, 405192, 78943, 336287, 445326, 138459, 93759, 301208, 303961, 110224, 470039, 427521, 283883, 454280, 131702, 88361, 232708, 379245, 196454, 205293, 281466, 253613, 38712, 222716, 240895, 264924, 79449, 294720, -102307, 223263, -118873, 11197, 41069, -264378, 280989, 158663, 112917, -37318, 92256, 254480, 141387, 224736, 35020, 245170, -141471, -10951, -121464, 131774, -34424]
10294E8029O1981a55436A98097a20588B11119f3016C60982A3408i7200l49282
10284d46482a56866A03934j584b56943E8559a7737n0757J2110H3600a51342c248
10272A8320a51215A70a05997A76176b84815B47124c80153p8998N4882A46704J5059
10261A61763G4187e2219j85649R5884N4898C48117b68473a9863m4282m54067A35608
10249b60147l1056J41849g4585j02160K6774A78423b20634F4156b0048D43898
10238D97464B18044B457a03253G0859J58697L0846d16959A28305e9548B10470
10227a51806J1917J8463B90217b59093g3968j26017A29627a03209j09305B44726
10216C50678b90053A40270a83765K1214B98092e9505K246k47467f1098G3622a92986
$$ y = [58029, 120010, -155436, 198097, -120588, 211119, -63016, 360982, 13408, -97200, -446482, -156866, 103934, 102350, -256943, 58559, -17737, -68494, -56384, 83600, -151342, -3248, 18320, -151215, 170, -105997, 176176, -284815, 247124, -380153, -459151, -404269, 146704, 161763, 74187, -52219, -237868, -141984, -87086, 348117, -268473, -19863, -64145, -518212, 135608, -260147, -291203, -149354, -74585, -176745, -149971, 178423, -220634, 64156, -20048, 443898, 497464, 218044, 2457, -103253, 70859, 229556, 260402, -416959, 128305, -59548, 210470, -151806, -139889, -121426, 290217, -259093, -73968, -199985, 129627, -103209, -212514, 244726, 350678, -290053, 140270, -183765, -162551, 298092, -59505, -57259, -304726, -61098, 73622, -192986]
10204f9158a0593k9277a5406j98545i0908q407d5644k48235E0194a90724C7556
10192A82003b17846r6390H4186a15876N3567k58292F4200g914E870a03602n716
10181a09318B27437h0957B35548a51583p3717F7529J19912G0584Q6397b52984
10170c2031E3049i6657A25303D6425M5578f9189B92446d55752J84182H4139c5889
10158A0484Q7755a9191k67074D9469h4968D9042J29899i6763j50870B67333a43075
10146a52602a4392o9836j16016j11225d7479k21094A08721b50650J698k5604f8388
10134b74293A80674a83233B13239D3250c46650a17833L4369n5292l18112A53327
10123a82568A8466a03765C6044J8615c36216B5912b51506M9499g5092j209k25090
$$ y = [-69158, -10593, -39870, -15406, -213951, -90908, -99315, -45644, -293879, 50194, -190724, 37556, 182003, -217846, -314236, 84186, -115876, -62309, -320601, 64200, -7914, 5870, -103602, -109318, 227437, -80957, 235548, -151583, -225300, 67529, 187441, 70584, 156981, -252984, -32031, 53049, -96657, 125303, 46425, 92003, -69189, 292446, -455752, -271570, 84139, -35889, 10484, 98239, -19191, -286265, 49469, -84968, 49042, 178941, -96763, -247633, 267333, -143075, -152602, -14392, -84228, -200244, -311469, -47479, -268573, 108721, -250650, -248952, -274556, -68388, -274293, 180674, -183233, 213239, 43250, -346650, -117833, -83464, -138756, -456868, 153327, -182568, 18466, -103765, 36044, 54659, -336216, 25912, -251506, -202007, -75092, -76301, -301391]
10112c01391A89348b48166i5970E5236b38080I2509d65664A03374C7042a20519
10101c26388I0295i7447A33082d4486E5410Q2398a9496k01391D6788b95545C7490
10089E6548L2248L2760c60661D6146a89331B3870c04709a6890H7912a22012b7201
10077a55293k22517B94731a72886L9513e7912B4983a16124n0461C55958a27611
10066C98772a71854m6382a9018F1595f725k08201B41836a92336K1386B01393c63550
10054b9673A54317M2975m503b16625B4299j2009b18071J00296I2637e4171l5037
10043h9208D87165a54776A39252e20803a69183B1455c2306k06897P1179C21049
10032h1102J5899H5190b06913B6849J1857E030d6508B51566a45144K361c6246
$$ y = [-301391, 189348, -248166, -95970, 55236, -238080, 92509, -465664, 103374, 37042, -120519, -326388, 90295, -97447, 133082, -44486, 55410, 137808, -19496, -220887, 46788, -295545, 37490, 56548, 88796, 121556, -360661, 46146, -189331, 23870, -304709, -16890, 87912, -122012, -27201, -155293, -377810, 294731, -172886, -133373, -57912, 24983, -116124, -166585, 355958, -127611, 398772, -171854, -218236, -19018, 61595, -6725, -214926, 241836, -192336, -170950, 201393, -363550, -29673, 154317, 197292, 192789, -216625, 24299, 12290, -218071, -117775, 92637, -54171, -89208, 487165, -154776, 139252, -520803, -169183, 21455, -32306, -239203, -168024, 321049, -81102, -65203, 85190, -206913, 26849, 38706, 5030, -46508, 251566, -145144, -142783, -36246]
10020A26282a8034p0796j19365a01102n5386k8850N0763M5989K9819l2644m8478
10009a39889d4531q2247j054q0307K7045F5472a39667q6524a8385k07398Q1551
9998a44232A63763i1057j02584R3235A43542b21272K6478M8559r9232H5341b73557
9986b8042C5152e8748m3013m3091f6598b5257A29566c92189C1560J88476B4639
9974a01312A62791a42942A660a59256b0406C11228n5707j12300D9789c31332a11932
9962B70391B435g3607G2234a54158N7417j52942P2318b5347j53785P2472o3919
9951a70579n9168b1285j16355d6963k02682Q8255f3091b3758k01739i000m25938
9940d34938E4143j9989a50335A10965j2751F553e5329q003j12241b3057l8004
$$ y = [126282, -18034, -88830, -208195, -101102, -156488, -185338, -134575, -88586, -58767, -91411, -139889, -44531, -126778, -127832, -208139, -181094, 65472, -139667, -226191, -18385, -225783, -144232, 163763, -91057, -193641, -100406, 143542, -221272, -194794, -146235, -245467, 85341, -273557, -28042, 35152, -58748, -101761, -144852, -66598, -25257, 129566, -392189, 31560, 220036, 24639, -101312, 162791, -142942, 1660, -159256, -20406, 311228, 255521, 143221, 49789, -331332, -111932, 270391, 2435, -73607, 72234, -154158, -96741, -249683, -177365, -25347, -179132, -106660, -170579, -229747, -21285, -137640, -46963, -249645, -161390, -63091, -23758, -225497, -9000, -434938, 54143, 34154, -150335, 110965, 98214, 6553, -55329, -63332, -175573, -23057, -61061]
9929f1061B69664c95106f7668k4759A96246I2294b1372j49744A18994R5685a16166
9917e0515j32976A40080b9617j79554A5944a88784A3118b2941A11574l9942J68997
9906B40629i8958A45944K3876g3630k0389k74308a29902e0515m8590D602a07682
9894D2833J64949g2779d19D3969b7932H824b3233k09782I1980J30222b37289G9108
9881a25994C4962J9214J98707p1069k4639b84131H9603c2075n9832k00416g4980
9869A10258l7655J12247A4973J21058B5833d8893k01520g7477k06240f4480H1885
9857E3a33954b5728k42469e764A0676a1036j69768A24662g6722C3688c4501B72800
9844i7117b6810A1011b96391h1240k42878A22838b21496A48826J73454i5526J9087
$$ y = [-61061, 269664, -395106, -67668, -92427, 196246, 92294, -21372, -171116, 118994, 214679, -116166, -50515, -183491, 140080, -29617, -209171, 15944, -188784, 13118, -22941, 111574, 71632, 240629, -98958, 145944, 169820, -73630, -94019, -368327, -129902, -50515, -99105, 4602, -107682, 42833, 207782, -72779, -419, 43969, -27932, 8824, -23233, -233015, 91980, 222202, -237289, 79108, -125994, 34962, 54176, 252883, 181814, 157175, -284131, 89603, -32075, -91907, -292323, -74980, 110258, 72603, 184850, 14973, 136031, 25833, -48893, -250413, -77477, -283717, -64480, 81885, 53, -133954, -25728, -268197, -5764, 10676, -11036, -180804, 124662, -76722, 33688, -34501, 272800, -97117, -26810, 11011, -296391, -81240, -324118, 122838, -221496, 148826, 322280, -95526, -76439]
9833g6439a9532j0876C5690k192K11857c15643J18021j30027N4488e1681I7348
9821a41003q6552l05095A02961K11426H273f3195A46606d31201A6155a02389A19921
9809b35650A4564L5243e4187j31025c2860r2732k11312a43448B84839C5826M239
9798D0065b06944L9926o2590D5326g0426b0234A83284b18985e6067B13229b83056
9786I0769a11671B6252a37407C84369a6420k47382k5440k01995b16890Q8751C2730
9774a04140G320J7991M2277b54604M1763A62682a07823m66094b62359g8764L8235
9763d0529L767A47548b63981G7392b78261J04392j86127g7682l791j2623r0231
9752a84327l55077J92090b3654A753a29541k7231d9163j14629k51587a81611A54298
$$ y = [-76439, -19532, -30408, 35690, 33498, 245355, -315643, -197622, -327649, -273161, -51681, 97348, -141003, -227555, -532650, 102961, 314387, 8273, -63195, 146606, -431201, 16155, -102389, 119921, -235650, 14564, 49807, -54187, -185212, -32860, -125592, -336904, -143448, 284839, 35826, 40065, -206944, -167018, -229608, 45326, -70426, -20234, 183284, -218985, -56067, 213229, -283056, 90769, -111671, 26252, -137407, 384369, -16420, -263802, -289242, -491237, -216890, -128139, 32730, -104140, 7320, 25311, 67588, -254604, -212841, 162682, -107823, -573917, -262359, -78764, -40529, -36762, 147548, -263981, 77392, -278261, -173869, -359996, -77682, -81473, -94096, -184327, -539404, -347314, -23654, 1753, -129541, -156772, -49163, -163792, -415379, -181611, 154298]
9740A43416J64452a34219m022J9099A87345b0693p9150l04288J30755J31222B51786
9728a94526C7902M42896a17045j99686J00583P9881J0540c082p7574j284b249
9716B8391b43425A2834E736a71127d8328o3502M2642C3803i1068B3358a39788
9704a11501j20786E3086O4260h5377c0986g180A58173a24266R419j91167f4233
9692g7359b5409r2654n7947k62970D0059q985K97267a83755O6714I7388a7969
9680A39963b0948l9680E7402b04260i8312J6719j8189n631A06079K4994a05072
9668a95904J903A16903D9267a99448B49311a86247g2109J5016j197g1m961j65994
9656a71026D0697b84164A63808E3763K42252f816l07513J26684h3379A4407e5218
$$ y = [143416, 307868, -134219, -138241, -119142, 187345, -20693, -99843, -404131, -273376, -142154, 251786, -194526, 37902, 480798, -117045, -316731, -216148, -136267, -125727, -3082, -80656, -81940, -2249, 28391, -243425, 12834, 5736, -171127, -48328, -111830, -69188, 33803, -91068, 23358, -139788, -111501, -232287, 53086, 117346, -85377, -30986, -7180, 158173, -124266, -114847, -306014, -64233, -77359, -25409, -118063, -176010, -438980, 40059, 31074, 328341, -183755, -117041, 97388, -17969, 139963, -20948, -60628, 57402, -204260, -98312, -81593, -99782, -105413, 106079, 131073, -105072, -195904, -194001, 116903, 49267, -199448, 249311, -186247, -72109, -57093, -58290, -71, -5032, -171026, 40697, -284164, 163808, 53763, 296015, -6816, -314329, -187645, -83379, 14407, -55218]
9644i4189o7337N1009M8961B36665f6130a1164q4784K2009B99313j03757e9006
9632b25213Q6214l5569L0496e3784a0122j04298H1995K45270j40840a66063j07562
9621b73625I4540a75093A36153D6902d9310n391j11019L4250q542m8666K4787
9610a63891E2055Q2244f7628C9561Q5296a06983A29407C9899Q0442f5222j29110
9599a94332I7804a13664n0260b866A4628d6855r5994j99437Q5493a19457e0683
9587b42976d2174j58192j05682A68811a0253j44906A03008A1057c3005j11103
9577a44108B25494c96163A53957b1205j72655l1514a3888A82620c32785c9973
9566c03992b6747k30511O3258e5522F9273a73463H6398a45471M1349J5149F7818
$$ y = [-94189, -161526, -110517, -61556, 236665, -66130, -11164, -95948, -73939, 299313, 195556, -59006, -225213, -138999, -174568, -144072, -53784, -10122, -114420, 81995, 327265, 186425, -166063, -273625, 94540, -175093, 136153, 46902, -49310, -54701, -165720, -131470, -140012, -188678, -163891, 52055, 134299, -67628, 39561, 124857, -106983, 129407, 39899, 120341, -65222, -194332, 97804, -113664, -163924, -2866, 14628, -46855, -142849, -342286, -256793, -119457, -50683, -242976, -42174, -200366, -306048, 168811, -10253, -155159, 103008, 11057, -33005, -144108, 225494, -396163, 153957, -21205, -193860, -225374, -13888, 182620, -332785, -39973, -303992, -26747, -257258, -194000, -55522, 69273, -173463, 86398, -145471, -104122, -88973, 67818]
9554f1376A23323a57280j21316K9996R3860l0233e7201j55161d3525j93851l4916
9543b72292e5494j25090O0198C6535f8203K4148l58683A34051i0276B39604a95784
9531A14777b34884H8198O8815o7958C2209K17264F4550c6103k37701C7696j1910
9520B5786a58350b789k21161h9234B88639A40197a15869p9471C30038c71937e2216
9508I1736c2323k11160i2504H7611L13014D5010a21016H6862a48172B1528i4701
9496A8327a74370C225J03146a88324j25001a14879k39322M6700h5235k39676H117
9484A25703a28420M9337F1064J22870J50640h4382B7305b97658A42976N8396a61991
9472B0822e8707B81019d7607A58878c5438G3818J17349B4963L14933c75487R1917
$$ y = [-61376, 123323, -157280, -278596, -248600, -154740, -184973, -57201, -212362, -43525, -237376, -272292, -55494, -180584, -120386, 36535, -68203, -44055, -402738, 134051, -90276, 239604, -195784, 114777, -234884, 88198, 157013, 89055, 32209, 249473, 64550, -36103, -273804, 37696, 25786, -158350, -2789, -223950, -89234, 288639, 140197, -115869, -195340, 330038, -371937, -52216, 91736, -32323, -243483, -92504, 87611, 400625, 45010, -121016, 86862, -148172, 21528, -94701, 18327, -174370, 3225, 106371, -188324, -313325, -114879, -354201, -307501, -85235, -324911, 8117, 125703, -128420, -79083, 61064, 183934, 334574, -84382, 27305, -297658, 142976, 201372, -161991, 20822, -58707, 281019, -47607, 158878, -35438, 73818, 191167, 24963, 339896, -375487, -283570]
9461b83570a17257b9676E6049K40165A3824K17722f2183j47362Q1746M0542r907
9450i7164I8480l2454P4893p0189a50025c4613j09885A97859b35348l7241J07320
9439a65269j5515P8664B69063h1904B52385a55534J0673j64619a39258m4757c9732
9427b29539l8583e9697j74495J06465H2329a30436H3541B048O8593a59543m3931
9416b03474I0897c34285d446q8500j37557F4959a56450A70347a66356R40h0007
9404I9845c9055q3491D68487a29977D08427c5953l26751a05367F4018D680b10275
9392c29891D9480c26590A49592m1890a66816b9096p3102p0268G1940b49786H7608
9380c46374B00068b50176l9805A6384b45489F7690i7406j76468J34554a3618C01545
$$ y = [-283570, -117257, -29676, 56049, 296214, 13824, 231546, -62183, -209545, -127799, -87257, -97164, 98480, 66026, 140919, 70730, -150025, -34613, -144498, 197859, -235348, -272589, -165269, -180784, -102120, 269063, -81904, 252385, -155534, -144861, -309480, -139258, -184015, -39732, -229539, -268122, -59697, -234192, -127727, 82329, -130436, 83541, 2048, 70641, -159543, -203474, 90897, -334285, -4446, -92946, -230503, 64959, -156450, 170347, -166356, -165416, -80007, 99845, -39055, -122546, 468487, -129977, 408427, -35953, -362704, -105367, 64018, 4680, -210275, -329891, 49480, -326590, 149592, 107702, -166816, -29096, -102198, -172466, 71940, -249786, 87608, -346374, 200068, -250176, -289981, 16384, -245489, 67690, -97406, -273874, -139320, -13618, 301545]
9368b6854k1025I3459D2022a59687j312C1546b10800M9885A73366l7519a1736
9356F1943a93209d8402A27900i3615c1322k13189P9536j19399g7061B59269a43089
9344b03535A76356b62027B42059a29725A29744b81910M4950c2936j45288A87852
9333H7791b68683k74454a84346n0753d2239j17853A93496a7979C52178a06407
9322a79415j87715B37300b49268d3081j71153O396P2410k43397g7895A22391b99136
9310D7775c19596R0078e6054A13570a27121C14455b09394O3444A19597a40048
9299a25240A30560a22142C0749d1438a9536A01980c7026m7634m9424c9670k21671
9288b61341O3987a0829A7443Q5117c46907G7107c32714J10874d7769j53347j76570
$$ y = [-26854, -47879, 93459, 42022, -159687, -160999, 31546, -210800, -160915, 173366, 135847, -11736, 61943, -193209, -48402, 127900, -93615, -31322, -244511, -164975, -284374, -77061, 259269, -143089, -203535, 176356, -262027, 242059, -129725, 129744, -281910, -236960, -32936, -178224, 187852, 87791, -268683, -543137, -184346, -235099, -42239, -160092, 193496, -17979, 352178, -106407, -179415, -367130, 237300, -249268, -43081, -214234, -207838, -135428, -378825, -77895, 122391, -299136, 47775, -319596, -229518, -56054, 113570, -127121, 314455, -209394, -145950, 119597, -140048, -125240, 130560, -122142, 30749, -41438, -19536, 101980, -37026, -84660, -134084, -39670, -261341, -197354, -10829, 17443, 102560, -346907, 77107, -332714, -221840, -47769, -201116, -377686]
9277c77686e2417j05738G5043K32711A7199i4778L2430k63577J0603B37964a33474
9265b40085M4869A79758b05929j52145F7443k4604K46129j14113G1384a60299
9254f7861A08063c17488J07322j35425a00454q8558A949b63146d2523j06871B084
9242a41853D6602a75828N9236A82138g9796A4167f183j54831j83943a30762a1476
9230C6404L3952k2717M0473Q37b42344J13960A34133A1749c63415A34972E2080
9218A39261d8206B6802b38175j35108d7988F8779a03789l53d6947k43272B25115
9206B9924c03356d5861k7069j71273e6890j56027M6167j53601f740A05407a4730
9194a37146A0894d9918l04546a37797F9300C1418f6818p8052I5560a27075C09419
$$ y = [-377686, -52417, -158155, 75043, 307754, 17199, -94778, -62348, -325925, -315322, 237964, -133474, -240085, -195216, 179758, -205929, -358074, 67443, 42839, 288968, 174855, 71384, -160299, -67861, 108063, -317488, -210166, -345591, -100454, -189012, 1949, -263146, -42523, -149394, 2084, -141853, 46602, -175828, -116592, 182138, -79796, 14167, -6183, -161014, -344957, -130762, -11476, 36404, 70356, 47639, 88112, 88949, -242344, -128384, 134133, 11749, -363415, 134972, 52080, 139261, -48206, 26802, -238175, -373283, -47988, 68779, -103789, -104142, -46947, -290219, 225115, 29924, -303356, -45861, -72930, -244203, -56890, -212917, -166750, -320351, -6740, 105407, -14730, -137146, 10894, -49918, -354464, -137797, 69300, 31418, -66818, -144870, 95560, -127075, 309419]
9182A06487g1881L2653l11621a53603A64692b62534h9416B42530j7505A12110
9171B9669i2247n12802b03174P9773B68126d66368f2138k38445Q1281B15547l0704
9160A84843e59108e6306B01199b71193g6042A14797a19958a1350j29423p7294
9150b18067G2958c9068j54175D172f1817N649j51359R0510j67706J06300h6860
9138a71192f9188A5222a00741k53540a40923F98h9192k19150A29354K8506b62649
9126A13903f1575A42489g5387j95398c3219A63986k6594c38772M2318C8505e8712
9114G5094i8588D755d2866A24130b76452C09175D6601j5781h248j20771o7256
9103a96275m551o7309k68194B2503c12626B91083j27253J62079b10846o7797f43
$$ y = [106487, -71881, -39228, -350849, -153603, 164692, -262534, -89416, 242530, 225025, 112110, 29669, -92247, -605049, -203174, -123401, 268126, -466368, -62138, -300583, -219302, 215547, 184843, -559108, -56306, 201199, -271193, -76042, 114797, -119958, -11350, -140773, -218067, 72958, -39068, -193243, 4172, -61817, -56168, -207527, -117017, -284723, -178423, -86860, -171192, -69188, 15222, -100741, -354281, -140923, 698, -89192, -308342, 129354, 157860, -262649, 113903, -61575, 142489, -75387, -270785, -33219, 163986, 137392, -338772, -296454, 38505, -58712, 75094, -98588, 4755, -42866, 124130, -276452, 309175, 46601, 30820, -8248, -129019, -196275, -200826, -268135, -536329, 22503, -312626, 291083, 163830, 325909, -210846, -278643, -643]
9091A9680O0714J00664j7263C4537J27554a1854j78810g9434D0728c58620B02139
9079e7933k73502B08436h4585A71284o3280e1994j77718C1442c12332H1905b90822
9067a64759N7476k28365a02114j1237A4358i863o3870g050C24760a18726j23170
9056b41896A63113b13766B85875r8455A971J51406E9270J0601G865i2540j83775
9045b76315E2714J66443a11299B002a47034b7004E4728d20654J13722J8956C41067
9033c14459B08078b1783r9414B50295E9406n566a20721G2398C2928g0764H9582
9021C3419a85907e2215l2488A51378e4234J52D55169h0790j30059P1799A02289
9009a41233B3914a14988B373L31226c39573a13187K4716E6010c08623C8367a41442
$$ y = [19680, 80394, 181058, 163795, 34537, 162091, -11854, -190664, -79434, 40728, -358620, 202139, -57933, -331435, 208436, -84585, 171284, 108004, -51994, -229712, 31442, -312332, 81905, -290822, -164759, -107283, -335648, -102114, -113351, 14358, -9863, -73733, -7050, 324760, -118726, -241896, 163113, -213766, 285875, 187420, 1971, 153377, 59270, 69871, 7865, -92540, -276315, 52714, 219157, -111299, 2002, -147034, -27004, 54728, -420654, -306932, -287976, 341067, -314459, 208078, -21783, -121197, 250295, 59406, 53840, -120721, 72398, 32928, -70764, 89582, 33419, -185907, -52215, -84703, 151378, -54234, -54082, 455169, -80790, -210849, -139050, 102289, -141233, 23914, -114988, 2373, 333599, -339573, -113187, -88471, 56010, -308623, 38367, -141442]
8997B57128c68536g1159j91065A48105F7358k8743a58336m671R943A24490a58147
8985b06129p7223q3375a71569k54143R2539Q963J29967Q7335A45208k1638a8639
8973c7038n0127j309M1479A3875d1168J1916a705k12503P6081e3174j25572A88164
8960A09297J2371b62757h8887K9576j3500A77046b35491d8312j73371C7011J4033
8949E1044K6809M6920a25366e8098E1247a50726m9595D1859K01592f550l02414
8938c08964f7764J808G3685g3824j78194j84929h0026A03529a4428n2404k14941
8927b81773f4239h691C843J03544O6744a30191k30699B07999E1999N178k3093
8916C4084M08251A64500f7070a3433G1646Q1614K67851J91295K10770K07190M09582
$$ y = [257128, -368536, -71159, -262224, 148105, 67358, 38615, -158336, -163007, -153064, 124490, -158147, -206129, -283352, -366727, -171569, -425712, -333173, -324210, -194243, -106908, 145208, 123570, -18639, -37038, -87165, -88474, -46995, 13875, -41168, -29252, -1705, -214208, -138127, -53174, -178746, 188164, 109297, 121668, -262757, -88887, -59311, -72811, 177046, -235491, -48312, -221683, 37011, 51044, 77853, 124773, -125366, -58098, 51247, -150726, -200321, 41859, 243451, -6550, -308964, -67764, -65956, 73685, -73824, -252018, -436947, -80026, 103529, -14428, -66832, -281773, -64239, -8691, 3843, 107387, 174131, -130191, -360890, 207999, 51999, 57177, 34084, 442335, 164500, -67070, -13433, 71646, 153260, 421111, 612406, 823176, 1030366, 1439948]
8905A439948J315528K140221M067029D222429k022230r05499E02186L6060k21349
8896C16897j3068a16337b6975F9825k3438L00768B9864K44775M0479b0563A83187
8884B15455c9831J3731J1019A71322b5012G9415c40074B0365c4389D3371c68196
8872a54578J4022G3901a85455D63189D5753b05335P8974B79042b38591m3890N5256
8861b27225h5879K4383D4763a36029l8906c6234A25389n6811J46286d22127a04304
$$ y = [1439948, 2755476, 4895697, 8962726, 4222429, 2200199, 1294700, 502186, 538246, 316897, 303829, -116337, -26975, 69825, 46387, 347155, 29864, 274639, 315118, -20563, 183187, 215455, -39831, -26100, -15081, 171322, -25012, 79415, -340074, 20365, -34389, 43371, -368196, -154578, -140556, 73901, -185455, 463189, 45753, -205335, -126361, 279042, -238591, -282481, -227225, -85879, -61496, 44763, -136029, -174935, -36234, 125389, 68578, 214864, -422127, -104304]
$$ [...]
##END NTUPLES=NMR SPECTRUM
##END=
