
##TITLE=AC1113_Huila1_5835735_E5EMHUawKj
##JCAMPDX= 6.0         $$ Bruker NMR JCAMP-DX V2.0
##DATA TYPE= NMR SPECTRUM
##DATA CLASS= NTUPLES
##ORIGIN= BRUKER
##OWNER= Administrator
$$ 1.72 TOPSPIN		Version 2.1
$$ 2012-04-16 19:07:09.296 -0500  Administrator@TOPSPIN
$$ Compression mode = diff/dup
##.OBSERVE FREQUENCY= 400.13188235
##.OBSERVE NUCLEUS= ^1H
##.ACQUISITION MODE= SIMULTANEOUS (DQD)
##.ACQUISITION SCHEME= undefined
##.AVERAGES= 64
##.DIGITISER RES= 22
##SPECTROMETER/DATA SYSTEM= spect
##.PULSE SEQUENCE= noesygpps1d.comp
##.SOLVENT NAME= COFFEE_meoh
##.SHIFT REFERENCE= INTERNAL, COFFEE_meoh, 1, 14.96848
##AUDIT TRAIL= $$ (NUMBER, WHEN, WHO, WHERE, PROCESS, VERSION, WHAT)
$$ ##TITLE= Audit trail, TOPSPIN		Version 2.1
$$ ##JCAMPDX= 5.01
$$ ##ORIGIN= Bruker BioSpin GmbH
$$ ##OWNER= Administrator
$$ $$ C:\Bruker\TOPSPIN/data/COFFEE/nmr/AC1113_Huila1_5835735_E5EMHUawKj/22/pdata/1/auditp.txt
$$ ##AUDIT TRAIL=  $$ (NUMBER, WHEN, WHO, WHERE, PROCESS, VERSION, WHAT)
(   1,<2012-04-15 18:10:12.406 -0500>,<Administrator>,<TOPSPIN>,<go>,<TOPSPIN 2.1>,
      <created by zg
	started at 2012-04-15 17:58:40.171 -0500,
	POWCHK enabled, PULCHK disabled,
       configuration hash MD5:
       1A 1E CE 29 27 FD 77 03 67 4E F0 E3 C4 B2 CB 90
       data hash MD5: 64K
       F9 D6 B9 30 79 FF 7D D1 19 A0 6B B5 8A 40 C6 79>)
(   2,<2012-04-15 18:10:15.171 -0500>,<Administrator>,<TOPSPIN>,<proc1d>,<TOPSPIN 2.1>,
      <Start of raw data processing
       efp LB = 0.3 FT_mod = 6 PKNL = 1 PHC0 = 0 PHC1 = 0 SI = 128K 
       data hash MD5: 128K
       3B 40 A1 8B 30 0E 76 27 90 E0 C7 BB F7 BC E4 AB>)
(   3,<2012-04-15 18:10:16.406 -0500>,<Administrator>,<TOPSPIN>,<proc1d>,<TOPSPIN 2.1>,
      <pk PHC0 = 36.03516 PHC1 = 0 
       data hash MD5: 128K
       9F 1E C9 13 15 4B 9A 8B C5 41 01 C7 36 A1 44 F1>)
(   4,<2012-04-15 18:10:16.640 -0500>,<Administrator>,<TOPSPIN>,<proc1d>,<TOPSPIN 2.1>,
      <abs ABSG = 1 
       data hash MD5: 128K
       12 93 0E 64 15 FE 13 B6 A5 FF 7E 4C 49 F6 AC 41>)
(   5,<2012-04-15 18:10:16.703 -0500>,<Administrator>,<TOPSPIN>,<proc1d>,<TOPSPIN 2.1>,
      <abs ABSG = 2 
       data hash MD5: 128K
       15 71 05 20 15 82 FD 70 F7 36 43 7E B4 A4 03 91>)
(   6,<2012-04-15 18:10:16.859 -0500>,<Administrator>,<TOPSPIN>,<proc1d>,<TOPSPIN 2.1>,
      <abs ABSG = 3 
       data hash MD5: 128K
       14 F9 95 11 39 8D 14 5C F6 34 02 78 97 1B F0 1F>)
(   7,<2012-04-15 18:10:17.015 -0500>,<Administrator>,<TOPSPIN>,<proc1d>,<TOPSPIN 2.1>,
      <abs ABSG = 4 
       data hash MD5: 128K
       30 86 25 44 0B 01 1E 3B 1D EE B2 A0 27 71 16 50>)
(   8,<2012-04-15 18:10:17.078 -0500>,<Administrator>,<TOPSPIN>,<proc1d>,<TOPSPIN 2.1>,
      <abs ABSG = 5 
       data hash MD5: 128K
       16 FA 25 0B CA A1 58 69 36 DD 7A DB 8D 01 28 B8>)
(   9,<2012-04-15 18:10:17.312 -0500>,<Administrator>,<TOPSPIN>,<audit>,<TOPSPIN 2.1>,
      <user comment:
       ICON-NMR User ID: COFFEE
       data hash MD5: 128K
$$ [...]
##$TP07= 0
##$TPNAME0= <>
##$TPNAME1= <>
##$TPNAME2= <>
##$TPNAME3= <>
##$TPNAME4= <>
##$TPNAME5= <>
##$TPNAME6= <>
##$TPNAME7= <>
##$TPOAL= (0..7)
0.5 0.5 0.5 0.5 0.5 0.5 0.5 0.5
##$TPOFFS= (0..7)
0 0 0 0 0 0 0 0
##$TUNHIN= 0
##$TUNHOUT= 0
##$TUNXOUT= 0
##$USERA1= <user>
##$USERA2= <user>
##$USERA3= <user>
##$USERA4= <user>
##$USERA5= <user>
##$V9= 5
##$VALIST= <valist>
##$VCLIST= <CCCCCCCCCCCCCCC>
##$VD= 0
##$VDLIST= <DDDDDDDDDDDDDDD>
##$VPLIST= <PPPPPPPPPPPPPPP>
##$VTLIST= <TTTTTTTTTTTTTTT>
##$WBST= 2048
##$WBSW= 25
##$XGAIN= (0..3)
0 0 0 0
##$XL= 0
##$YL= 0
##$YMAX_a= 11095558
##$YMIN_a= -6730953
##$ZGOPTNS= <>
##$ZL1= 120
##$ZL2= 120
##$ZL3= 120
##$ZL4= 120
##$ABSF1= 14.96848
##$ABSF2= -5.58405
##$ABSG= 5
##$ABSL= 3
##$ALPHA= 0
##$AQORDER= 0
##$ASSFAC= 0
##$ASSFACI= 0
##$ASSFACX= 0
##$ASSWID= 0
##$AUNMP= <proc_prof1d_extract.lims>
##$AXLEFT= 0
##$AXNAME= <>
##$AXNUC= <1H>
##$AXRIGHT= 0
##$AXTYPE= 0
##$AXUNIT= <>
##$AZFE= 0.1
##$AZFW= 0.1
##$BCFW= 0
##$BC_mod= 0
##$BYTORDP= 0
##$COROFFS= 0
##$CY= 15
##$DATMOD= 1
##$DC= 0
##$DFILT= <>
##$DTYPP= 0
##$F1P= 0
##$F2P= 0
##$FCOR= 0.5
##$FTSIZE= 131072
##$FT_mod= 6
##$GAMMA= 0
##$GB= 0
##$INTBC= 1
##$INTSCL= 1
##$ISEN= 128
##$LB= 0.3
##$LEV0= 0
##$LPBIN= 0
##$MAXI= 10000
##$MC2= 0
##$MEAN= 0
##$ME_mod= 0
##$MI= 0
##$NCOEF= 0
##$NC_proc= -2
##$NLEV= 6
##$NOISF1= 0
##$NOISF2= 0
##$NSP= 0
##$NTH_PI= 0
##$NZP= 0
##$OFFSET= 14.96848
##$PC= 1
##$PHC0= 36.03516
##$PHC1= 0
##$PH_mod= 1
##$PKNL= yes
##$PPARMOD= 0
##$PPDIAG= 0
##$PPIPTYP= 0
##$PPMPNUM= 2147483647
##$PPRESOL= 1
##$PSCAL= 4
##$PSIGN= 0
##$PYNMP= <proc.py>
##$REVERSE= no
##$SF= 400.130004855742
##$SI= 131072
##$SIGF1= 0
##$SIGF2= 0
##$SINO= 400
##$SIOLD= 131072
##$SPECTYP= <>
##$SREGLST= <1H.CDCl3>
##$SSB= 0
##$STSI= 131072
##$STSR= 0
##$SW_p= 8223.68421052632
##$SYMM= 0
##$S_DEV= 0
##$TDeff= 65536
##$TDoff= 0
##$TI= <>
##$TILT= no
##$TM1= 0
##$TM2= 0
##$TOPLEV= 0
##$USERP1= <user>
##$USERP2= <user>
##$USERP3= <user>
##$USERP4= <user>
##$USERP5= <user>
##$WDW= 1
##$XDIM= 131072
##$YMAX_p= 230686334
##$YMIN_p= -346802073
##$CURPLOT= <Network HP LaserJet P1505>
##$CURPRIN= <$Network HP LaserJet P1505>
##$DFORMAT= <normdp>
##$LAYOUT= <+/1D_H.xwp>
##$LFORMAT= <normlp>
##$PFORMAT= <normpl>
##$SURQMSG= 1
$$ End of Bruker specific parameters
$$ ---------------------------------
##NTUPLES= NMR SPECTRUM
##VAR_NAME=  FREQUENCY,     SPECTRUM/REAL,   SPECTRUM/IMAG
##SYMBOL=    X,             R,               I
##VAR_TYPE=  INDEPENDENT,   DEPENDENT,       DEPENDENT
##VAR_FORM=  AFFN,          ASDF,            ASDF
##VAR_DIM=   131072,        131072,          131072
##UNITS=     HZ,            ARBITRARY UNITS, ARBITRARY UNITS
##FACTOR=    0.0627417313425165, 1,          1
##FIRST=     8223.62146879498, -1557,        -40679
##LAST=      0,             275,             -40828
##MIN=       0,             -346802073,      0
##MAX=       8223.62146879498, 230686334,    0
$$ Real data points
##PAGE= N=1
##DATA TABLE= (X++(R..R)), XYDATA
$$ [...]
62041A128891J9664K2250K4642K6384K7490K7888K7459K6548K5845K5583K5354
62030A407998K4974K4930K5647K6729K7519K8011K8503K8756K8290K7495K7440
62019A706292K8465K9728L0496L1043L1775L2294L2105L1682L1977L3148L4547
62008B053552L5749L6774L7481L7558L7253L7247L7603L7481L6183L3936L1347
61997B452164K8702K6100K3781K1837J9996J8030J6105J4419J2831J1141R445
61986B654551P878O412N208M867N783P529R246J0465J1191J1469J1407J1371J1662
61973B769039J2102J2425J2889J3855J4907J5054J3988J2487J1396J0752J0120
61962B909014R332Q493P578O422M940L192J445J66l17l17n52j275j964k025j467
$$ y = [1128891, 1148555, 1170805, 1195447, 1221831, 1249321, 1277209, 1304668, 1331216, 1357061, 1382644, 1407998, 1432972, 1457902, 1483549, 1510278, 1537797, 1565808, 1594311, 1623067, 1651357, 1678852, 1706292, 1734757, 1764485, 1794981, 1826024, 1857799, 1890093, 1922198, 1953880, 1985857, 2019005, 2053552, 2089301, 2126075, 2163556, 2201114, 2238367, 2275614, 2313217, 2350698, 2386881, 2420817, 2452164, 2480866, 2506966, 2530747, 2552584, 2572580, 2590610, 2606715, 2621134, 2633965, 2645106, 2654551, 2662429, 2668841, 2674049, 2678916, 2684699, 2692228, 2701474, 2711939, 2723130, 2734599, 2746006, 2757377, 2769039, 2781141, 2793566, 2806455, 2820310, 2835217, 2850271, 2864259, 2876746, 2888142, 2898894, 2909014, 2918346, 2926839, 2934417, 2940839, 2945779, 2948971, 2950416, 2950582, 2950265, 2949948, 2949396, 2948121, 2946157, 2944132, 2942665]
61947B942665o93j04n5o41j233q09P16K068K175J619J703K563L231L302L280L234
61931B963021K393O08r96j516j521j984k788l296l718m671n739n823m991m678
61917B924301n710p157p781p668p761q406r265j0220j1498j2970j4101j4673j5013
61904B792078j5345j5548j5633j6052j7111j8397j9149j9075j8501j7799j7067
61893B602401j6395j6033j6036j5941j5234j4010j2866j2049j1109r600p763o183
61881B449182n022l937k683j302J42J674L256M871O730Q999J1362J3340J5091
61868B501703J7294K0117K2908K5174K7319K9995L3251L6840M0928M5816N1232
61857B852577N6593O1894O7818P4962Q3416R3093J03942J15813J28595J42662
$$ y = [2942665, 2941972, 2941868, 2941813, 2941172, 2939939, 2939130, 2939846, 2941914, 2944089, 2945708, 2947411, 2949974, 2953205, 2956507, 2959787, 2963021, 2965414, 2966022, 2965026, 2963510, 2961989, 2960005, 2957217, 2953921, 2950203, 2945532, 2939793, 2933970, 2928979, 2924301, 2918591, 2911434, 2903653, 2895985, 2888224, 2879818, 2870553, 2860333, 2848835, 2835865, 2821764, 2807091, 2792078, 2776733, 2761185, 2745552, 2729500, 2712389, 2693992, 2674843, 2655768, 2637267, 2619468, 2602401, 2586006, 2569973, 2553937, 2537996, 2522762, 2508752, 2495886, 2483837, 2472728, 2463128, 2455365, 2449182, 2444160, 2440223, 2437540, 2436238, 2436380, 2438054, 2441310, 2446181, 2452911, 2461910, 2473272, 2486612, 2501703, 2518997, 2539114, 2562022, 2587196, 2614515, 2644510, 2677761, 2714601, 2755529, 2801345, 2852577, 2909170, 2971064, 3038882, 3113844, 3197260, 3290353, 3394295, 3510108, 3638703, 3781365]
61847C781365J58658J76754J96396K16993K38509K61217K85173L10139L35692
61838E960896L61045L84707M04534M18039M22489M14732L91196L48712K86014
61829I392364K04958J10340Q593r3364j88647k71253l37568l87061m20950m40362
61819G577050m46298m40959m27805m09744l87873l62576l35293l08353k83239
61810D174910k59775k37323k16155j97169j80465j65034j50092j36235j24555
61801B508107j14817j05344r4987q4524p5596o8800o3448n8762n4477n0351m6039
61790A690962m1502l7074l2937k9074k5721k3242k1440j9677j7785j6283j5397
61779A410830j4535j3099j1289r679q455p474o622n696m297k296j98J392K449
$$ y = [3781365, 3940023, 4116777, 4313173, 4530166, 4768675, 5029892, 5315065, 5625204, 5960896, 6321941, 6706648, 7111182, 7529221, 7951710, 8366442, 8757638, 9106350, 9392364, 9597322, 9707662, 9716255, 9622891, 9434244, 9162991, 8825423, 8438362, 8017412, 7577050, 7130752, 6689793, 6261988, 5852244, 5464371, 5101795, 4766502, 4458149, 4174910, 3915135, 3677812, 3461657, 3264488, 3084023, 2918989, 2768897, 2632662, 2508107, 2393290, 2287946, 2192959, 2108435, 2032839, 1964039, 1900591, 1841829, 1787352, 1737001, 1690962, 1649460, 1612386, 1579449, 1550375, 1524654, 1501412, 1479972, 1460295, 1442510, 1426227, 1410830, 1396295, 1383196, 1371907, 1362228, 1353773, 1346299, 1339677, 1333981, 1329684, 1327388, 1327190, 1328582, 1331031]
61766A331031L321M103M605M796M890N090N534O336P468Q747J0071J1521J3051
61753A420564J4467J5877J7810K0501K3456K6076K8481L1204L4369L7602M0662
61742A711069M3690M6894N0377N4228N8515O3149O8044P3288P8958Q4931R1105
61731B424248R7669J04834J12513J20583J29297J39103J50167J62418J75945J91024
61721C807801K07864K26666K47809K71613K97994L26701L57831L91738M28491
61712F564508M67711N08945N51851N95896O40019O82512P20975P52249P72393
61703A2257059P76501P58603P12365O32832N18348L71712K00511J6506j66526
61694A6077911l36025m82937o01823o90158p48304p79450p88182p78718p54742
$$ y = [1331031, 1334352, 1338455, 1343060, 1347856, 1352746, 1357836, 1363370, 1369706, 1377174, 1385921, 1395992, 1407513, 1420564, 1435031, 1450908, 1468718, 1489219, 1512675, 1538751, 1567232, 1598436, 1632805, 1670407, 1711069, 1754759, 1801653, 1852030, 1906258, 1964773, 2027922, 2095966, 2169254, 2248212, 2333143, 2424248, 2521917, 2626751, 2739264, 2859847, 2989144, 3128247, 3278414, 3440832, 3616777, 3807801, 4015665, 4242331, 4490140, 4761753, 5059747, 5386448, 5744279, 6136017, 6564508, 7032219, 7541164, 8093015, 8688911, 9328930, 10011442, 10732417, 11484666, 12257059, 13033560, 13792163, 14504528, 15137360, 15655708, 16027420, 16227931, 16244437, 16077911, 15741886, 15258949, 14657126, 13966968, 13218664, 12439214, 11651032, 10872314, 10117572]
61685A0117572p20297o79640o35967n90979n45714n01132m57938m16688l78362
61676E190855l44026l13680k86154k60564k37259k16840j98847j82042j65750
61667B985693j50365j36661j24965j14908j05797r7210q9335q2491p6517p0947
61657A936497o5794o1498n8008n4512n0456m6267m2633l9531l6527l3678l1473
61646A416120l0000k8690k7036k5236k3986k3727k4100k4105k3011k1082j9285
61635A145862j8216j7684j7354j7307j7660j8121j8305j8206j7959j7403j6330
61624I51317j5033j4102j3754j3641j3297j2495j1299j0005r014q437p996p408
61612H14836o698n969n146m271l687l555l487l123k837l184l848l919l189k467
$$ y = [10117572, 9397275, 8717635, 8081668, 7490689, 6944975, 6443843, 5985905, 5569217, 5190855, 4846829, 4533149, 4246995, 3986431, 3749172, 3532332, 3333485, 3151443, 2985693, 2835328, 2698667, 2573702, 2458794, 2352997, 2255787, 2166452, 2083961, 2007444, 1936497, 1870703, 1809205, 1751197, 1696685, 1646229, 1599962, 1557329, 1517798, 1481271, 1447593, 1416120, 1386120, 1357430, 1330394, 1305158, 1281172, 1257445, 1233345, 1209240, 1186229, 1165147, 1145862, 1127646, 1109962, 1092608, 1075301, 1057641, 1039520, 1021215, 1003009, 985050, 967647, 951317, 936284, 922182, 908428, 894787, 881490, 868995, 857696, 847691, 838677, 830240, 822244, 814836, 808138, 802169, 797023, 792752, 789065, 785510, 782023, 778900, 776063, 772879, 769031, 765112, 761923, 759456]
61598G59456k395k615k531k233k192k482k796k992l055k775j999j179j088j818
61584G27306k533k389j440m01J46J28k21n24l75K98R90J055N56L29R58J915K126
61567G27924J362O43J075K574L990M399L930L304K845K238J181o6q92j002o59
61552G52846l45l41o69j170j585j718j753k232l429m789n286m486l134k519l224
61537G16166m557n257m758l671k967k832k578j689n47J20K44M72J328K649L867
61522F95990M606M992N538O717Q486J0287J1629J2502J3082J3412J3639J4291
61510H15171J5722J7527J9044K0333K1915K3658K4724K4815K4608K4679K4724
61499A056920K4334K3777K3381K2829K1779K0692K0198J9978J9198J7805J6415
$$ y = [759456, 757061, 754446, 751915, 749682, 747490, 745008, 742212, 739220, 736165, 733390, 731391, 730212, 729124, 727306, 724773, 722384, 720944, 720543, 720689, 720817, 720596, 720072, 719697, 719995, 720985, 722040, 722596, 722925, 723883, 725798, 727924, 729286, 729929, 731004, 733578, 737568, 741967, 745897, 749201, 752046, 754284, 755465, 755399, 754507, 753505, 752846, 752501, 752160, 751491, 750321, 748736, 747018, 745265, 743033, 739604, 734815, 729529, 725043, 721909, 719390, 716166, 711609, 706352, 701594, 697923, 694956, 692124, 689546, 687857, 687310, 687430, 687674, 688146, 689474, 692123, 695990, 700596, 705588, 711126, 717843, 726329, 736616, 748245, 760747, 773829, 787241, 800880, 815171, 830893, 848420, 867464, 887797, 909712, 933370, 958094, 982909, 1007517, 1032196, 1056920, 1081254, 1105031, 1128412, 1151241, 1173020, 1193712, 1213910, 1233888, 1253086, 1270891, 1287306]
61488A287306J5034J2925J0024P440N997N033L332P66j669l158l821m298n100
61475A329811o387p849q795q663p580o159m738l160j333M00J787L221N400Q418
61461A294373J1613J4429J7114K0305K4145K8138L1913L5725M0091M5172N0815
61450A613833N7018O3900P1207P8330Q5024R1880R9698J08556J17889J27329J36919
61439B651583J46354J54567J60504J63876J64610J61822J54079J40692J22225
61430D020312R9594P3436M4620J4859j3773l9702o2004q0158r4163j04536j11641
61419C746844j15195j14986j11763j06906j01237r4756q7309p8997o9981o0602
61409B805112n1614m3636l6276k8508j9993j1385l275M380J1517J7623K2577K7073
$$ y = [1287306, 1302340, 1315265, 1325289, 1332729, 1338726, 1343759, 1347091, 1347857, 1346188, 1343030, 1339209, 1334911, 1329811, 1323424, 1315575, 1306780, 1298117, 1290537, 1284378, 1279640, 1276480, 1275147, 1275547, 1277334, 1280555, 1285955, 1294373, 1305986, 1320415, 1337529, 1357834, 1381979, 1410117, 1442030, 1477755, 1517846, 1563018, 1613833, 1670851, 1734751, 1805958, 1884288, 1969312, 2061192, 2160890, 2269446, 2387335, 2514664, 2651583, 2797937, 2952504, 3113008, 3276884, 3441494, 3603316, 3757395, 3898087, 4020312, 4119906, 4193342, 4237962, 4252821, 4239048, 4199346, 4137342, 4057184, 3963021, 3858485, 3746844, 3631649, 3516663, 3404900, 3297994, 3196757, 3102001, 3014692, 2935695, 2865714, 2805112, 2753498, 2709862, 2673586, 2645078, 2625085, 2613700, 2610425, 2614805, 2626322, 2643945, 2666522, 2693595]
61397B693595L1571L5466L7985L9424M0723M2146M3099M3098M2230M0860L9362
61386C129559L8124L7278L6498L5491L4503L3938L3611L2945L1728L0253K8750
61375C502678K7198K5544K3602K0874J7069J2795R061O032K868r30m726p653r797
61362C624615j1947j4459j6915j8852k0277k1334k1768k1126j9404j7213j5147
61351C426173j3227j1197r150p462o194n090m254m252n218o464p340q118r415
61338C328792j1058j2104j1874j0442q162n173j326L725J0296J8159K6528L4897
61326C362258M3721N3780O5051P6806Q8623J00691J13181J25842J38232J49764
61316D317949J59578J66977J71976J74758J74519J69574J58752J42132J20408
$$ y = [2693595, 2725166, 2760632, 2798617, 2838041, 2878764, 2920910, 2964009, 3007107, 3049337, 3090197, 3129559, 3167683, 3204961, 3241459, 3276950, 3311453, 3345391, 3379002, 3411947, 3443675, 3473928, 3502678, 3529876, 3555420, 3579022, 3599896, 3616965, 3629760, 3638821, 3644853, 3647721, 3646791, 3642065, 3634412, 3624615, 3612668, 3598209, 3581294, 3562442, 3542165, 3520831, 3499063, 3477937, 3458533, 3441320, 3426173, 3412946, 3401749, 3392599, 3385137, 3378943, 3373853, 3369599, 3365347, 3360129, 3353665, 3346325, 3338207, 3328792, 3317734, 3305630, 3293756, 3283314, 3275152, 3269979, 3268653, 3272378, 3282674, 3300833, 3327361, 3362258, 3405979, 3459759, 3524810, 3601616, 3690239, 3790930, 3904111, 4029953, 4168185, 4317949, 4477527, 4644504, 4816480, 4991238, 5165757, 5335331, 5494083, 5636215, 5756623]
61307E756623R4351O5183L4634M119k5598n3595p8488r9566j17635j33918j48386
61296E297724j59888j67804j72763j75693j76717j75255j70949j64289j56442
61287C777924j48448j40521j32124j22753j12554j02136r2044q2548p3634o5004
61277B706158n6245m7201l8201k9826k2469j6061j0041l685L240J0125J6101K0918
61265B532813K4952K8437L1159L2923L3834L4023L3591L2875L2235L1413K9757
61254B878012K7193K4382K1664J8739J5662J3269J1853J0254P241L231m08l370
61242C027722o560j0414j4259j7568k0767k4282k7623k9980l1343l2388l3583
61231B778955l4816l5827l6626l7370l7955l7836l6473l4054l1465k9359k7490
$$ y = [5756623, 5850974, 5916157, 5950791, 5954910, 5929312, 5875717, 5797229, 5697663, 5580028, 5446110, 5297724, 5137836, 4970032, 4797269, 4621576, 4444859, 4269604, 4098655, 3934366, 3777924, 3629476, 3488955, 3356831, 3234078, 3121524, 3019388, 2927344, 2844796, 2771162, 2706158, 2649913, 2602712, 2564511, 2534685, 2512216, 2496155, 2486114, 2482429, 2485669, 2495794, 2511895, 2532813, 2557765, 2586202, 2617361, 2650284, 2684118, 2718141, 2751732, 2784607, 2816842, 2848255, 2878012, 2905205, 2929587, 2951251, 2969990, 2985652, 2998921, 3010774, 3021028, 3028269, 3031500, 3031092, 3027722, 3021162, 3010748, 2996489, 2978921, 2958154, 2933872, 2906249, 2876269, 2844926, 2812538, 2778955, 2744139, 2708312, 2671686, 2634316, 2596361, 2558525, 2522052, 2487998, 2456533, 2427174, 2399684]
61220B399684k5308k2871k0682j8829j7031j5381j4353j3981j3719j3377j3443
61209B210709j4128j4706j4405j3530j3052j3160j2802j0733o844k266J574M175
61197B100832O306R246J3680J9281K5230L0936L6370M2003M8341N5245O1729O6811
61185B516010P0486P3318P5098P4613P1052O4826N6469M5314L0216J1457q929
61174C079930k8802m7254o4121p8841r0318r7866j01822j03151j02554j00082
61164B265119r5725r0143q4458p9223p3962o8043o1730n5914n0971m6415m1703
61153A516832l6960l2704k9242k6430k3850k1069j7980j4914j2261r932p532n001
61141A278957k726q71R30K999N066O631P560P958P693O530M648K644R67m27j796
$$ y = [2399684, 2374376, 2351505, 2330823, 2311994, 2294963, 2279582, 2265229, 2251248, 2237529, 2224152, 2210709, 2196581, 2181875, 2167470, 2153940, 2140888, 2127728, 2114926, 2104193, 2097349, 2095083, 2096657, 2100832, 2107138, 2116384, 2130064, 2149345, 2174575, 2205511, 2241881, 2283884, 2332225, 2387470, 2449199, 2516010, 2586496, 2659814, 2734912, 2809525, 2880577, 2945403, 3001872, 3047186, 3077402, 3088859, 3079930, 3051128, 3003874, 2939753, 2860912, 2770594, 2672728, 2570906, 2467755, 2365201, 2265119, 2169394, 2079251, 1994793, 1915570, 1841608, 1773565, 1711835, 1655921, 1604950, 1558535, 1516832, 1479872, 1447168, 1417926, 1391496, 1367646, 1346577, 1328597, 1313683, 1301422, 1291490, 1283958, 1278957, 1276231, 1275360, 1276290, 1279289, 1284355, 1290986, 1298546, 1306504, 1314197, 1320727, 1325375, 1328019, 1328986, 1328559, 1326763]
61126A326763l255m737o124p401q680j0048j1332j2292j3092j4241j5826j7101
61114A202634j7332j6808j6492j6781j7175j7155j6858j6780j7258j8315j9574
61103A012106k0283k0000j9315j9310k0086k0563k0009j8979j8235j7572j6506
61092H01248j5484j5337j5844j5992j5590j5522j6200j6784j6426j5467j4794
61081F27808j4528j3988j2654j0716q787p473o974o822o155m551k493q23O1L02
61067E32207K35K09N87J513K741L931M962N832O412O625O696O903P168P148O696
61052E99865O060N654N733O212O613O377N458M468M014M005L871L308K434J313
61038F65385k00j979l394l819l302k505k070k168k554k920l118l117k912k582
$$ y = [1326763, 1323508, 1318771, 1312647, 1305246, 1296566, 1286518, 1275186, 1262894, 1249802, 1235561, 1219735, 1202634, 1185302, 1168494, 1152002, 1135221, 1118046, 1100891, 1084033, 1067253, 1049995, 1031680, 1012106, 991823, 971823, 952508, 933198, 913112, 892549, 872540, 853561, 835326, 817754, 801248, 785764, 770427, 754583, 738591, 723001, 707479, 691279, 674495, 658069, 642602, 627808, 613280, 599292, 586638, 575922, 567135, 559662, 552688, 545866, 539711, 535160, 532667, 531844, 531905, 532207, 532442, 532651, 533238, 534751, 537492, 541423, 546385, 552217, 558629, 565254, 571950, 578853, 586021, 593169, 599865, 605925, 611579, 617312, 623524, 630137, 636514, 641972, 646440, 650454, 654459, 658330, 661638, 664072, 665385, 665185, 663206, 659812, 655993, 652691, 650186, 648116, 645948, 643394, 640474, 637356, 634239, 631327, 628745]
61024F28745k371k539l063l616l937m015l937l672l231k863k838l073l269l336
61010E82985l477l737l784l323k584k165k368k869l088k768k022r68L80J787K687
60995E54686K741K355K268K647L006L057L176L843N009O273P383Q212Q568Q460
60981F21684Q384Q889R879J0713J0987J0914J0996J1642J3076J5093J6917J7786
60969G66960J7933J8490K0130K2180K3556K4238K5279K7376L0074L2533L4594
60958A043343L6665L8864M0871M2599M4552M7304N0845N4705N8587O2622O6953
60947A587910P1343P5366P8942Q2576Q7008R2666R9545J07582J16951J27860J40225
60936B667974J53864J68989J86307K06658K30868K59733K93610L32104L74782
$$ y = [628745, 626374, 623835, 620772, 617156, 613219, 609204, 605267, 601595, 598364, 595501, 592663, 589590, 586321, 582985, 579508, 575771, 571987, 568664, 566080, 563915, 561547, 558678, 555590, 552822, 550800, 549832, 550212, 551999, 554686, 557427, 559782, 562050, 564697, 567703, 570760, 573936, 577779, 582788, 589061, 596444, 604656, 613224, 621684, 630068, 638957, 648836, 659549, 670536, 681450, 692446, 704088, 717164, 732257, 749174, 766960, 784893, 803383, 823513, 845693, 869249, 893487, 918766, 946142, 976216, 1008749, 1043343, 1080008, 1118872, 1159743, 1202342, 1246894, 1294198, 1345043, 1399748, 1458335, 1520957, 1587910, 1659253, 1734619, 1813561, 1896137, 1983145, 2075811, 2175356, 2282938, 2399889, 2527749, 2667974, 2821838, 2990827, 3177134, 3383792, 3614660, 3874393, 4168003, 4500107, 4874889]
60927D874889M22428M76856N39549O11522O94629P91162R01371J023575J157505
60918A1493486J301272J435541J510253J460438J252018R18806N50673K40738
60910B0163225M0877m1297k2360O2927J51328J57943J7471k70342o36073r83224
60900A8640475j239740j380140j415650j374568j288457j183819j076631r72287
60892H709183q71234p74201o82562n96878n17628m46630l85931l35634k94084
60883C804401k59716k31531k08137j87779j69481j53173j38784j26041j15016
60874B214743j05885r8150r1038q4655p9807p6584p3998p1180o8098o4976o1861
60863A338511n8904n6281n3629n0361m6743m3753m1669l9672l7239l4937l3242
$$ y = [4874889, 5297317, 5774173, 6313722, 6925244, 7619873, 8411035, 9312406, 10335981, 11493486, 12794758, 14230299, 15740552, 17200990, 18453008, 19371814, 19922487, 20163225, 20204102, 20162805, 20140445, 20203372, 20354700, 20512643, 20530114, 20259772, 19623699, 18640475, 17400735, 16020595, 14604945, 13230377, 11941920, 10758101, 9681470, 8709183, 7837949, 7063748, 6381186, 5784308, 5266680, 4820050, 4434119, 4098485, 3804401, 3544685, 3313154, 3105017, 2917238, 2747757, 2594584, 2455800, 2329759, 2214743, 2108858, 2010708, 1919670, 1835015, 1755208, 1678624, 1604626, 1533446, 1465348, 1400372, 1338511, 1279607, 1223326, 1169697, 1119336, 1072593, 1028840, 987171, 947499, 910260, 875323, 842081]
60852H42081l1471k8766k5559k3090k1821k1081k0187j9169j8250j7245j5729
60841E99713j3709j1869j1005j1157j1452j1049j0053r180q697q221p416o334
60829D79571n053l664k617k361k513k167j148k20K03O18J405K153K500K820L373
60814D72900L601L036K287K289L045L902M537M938M822L962K801J932J292N53
60800E15897k2j6K19m7p34j068p48j62M13R72J270J052Q27J420K722L750M078
60783E29823M227M486M412L822L324L330L419L252L298L973M744M884M589M509
60769E86092M580M148L120K176J897K258K959L676L984L635L053L044L874M908
60755F33404N402N258M845M344L618K623J641J038Q72Q54O06o3j079k242l339
$$ y = [842081, 810610, 781844, 756285, 733195, 711374, 690293, 670106, 650937, 632687, 615442, 599713, 586004, 574135, 563130, 551973, 540521, 529472, 519419, 510239, 501542, 493321, 485905, 479571, 474518, 470854, 468237, 465876, 463363, 461196, 460048, 459828, 460031, 460649, 462054, 464207, 466707, 469527, 472900, 476501, 479537, 481824, 484113, 487158, 491060, 495597, 500535, 505357, 509319, 512120, 514052, 515344, 515897, 515875, 515859, 516078, 516031, 515297, 514229, 513481, 513319, 513732, 514704, 515974, 517026, 517853, 519273, 521995, 525745, 529823, 534050, 538536, 542948, 546770, 550094, 553424, 556843, 560095, 563393, 567366, 572110, 576994, 581583, 586092, 590672, 594820, 597940, 600116, 602013, 604271, 607230, 610906, 614890, 618525, 621578, 624622, 628496, 633404, 638806, 644064, 648909, 653253, 656871, 659494, 661135, 662173, 663045, 663899, 664505, 664442, 663363, 661121, 657782]
60740F57782m192m727n020n246n500n688n655n467n475o008o818p105o351n042
60726E79488m193m069l809k591p67N67Q70N78M32Q39J748K722L165K956K835L686
60710E84457N435P098P988Q355Q780R428J0143J0750J1017J0668R763Q783Q072
60697G00737P463O671N758M992M492M221M047L660K786J683J096J397K165K802
60683G53970L229L565L581L000K035J102J96r04j999k633k815k995l317l474l345
60668G49196l244l354l480l531l812m504n232n490n180m477l469k252j145m29
60654F99597o2Q0j16o89j218j252j031j195j750j936j403r05j358k523l265k999
60638F77975k282j934k144k672l379m053m075k962j216q8j82p30o00K43P98M78
$$ y = [657782, 653590, 648863, 643843, 638597, 633097, 627409, 621754, 616287, 610812, 604804, 597986, 590881, 584530, 579488, 575295, 571226, 567417, 564826, 564059, 564626, 565496, 566074, 566506, 567345, 569093, 571815, 574980, 577936, 580771, 584457, 589892, 596990, 604978, 613333, 622113, 631541, 641684, 652434, 663451, 674119, 683882, 692665, 700737, 708200, 714871, 720629, 725621, 730113, 734334, 738381, 742041, 744827, 746510, 747606, 749003, 751168, 753970, 757199, 760764, 764345, 767345, 769380, 770482, 770678, 769774, 767775, 765142, 762327, 759332, 756015, 752541, 749196, 745952, 742598, 739118, 735587, 731775, 727271, 722039, 716549, 711369, 706892, 703423, 701171, 700026, 699597, 699535, 699615, 699499, 698810, 697592, 696340, 695309, 694114, 692364, 690428, 689025, 688120, 686762, 684239, 680974, 677975, 675693, 673759, 671615, 668943, 665564, 661511, 657436, 654474, 653258, 653170, 652988, 652258, 651658, 651901, 652699, 653177]
60622F53177j36k69j76q03k319l775m409m757n831p590q929r111q540p958p555
60607E81019p136o680o202n493m421l281k408j682q28L9O10Q94J031Q17Nr62j228
60590E44094n45M90J227J454J133L49l13j41O85J119O41k4p2J72j03p79r32j53
60572E48302R56J651J850J973K386L116L834M151M032L923M285N197O549Q255
60558F00460J0022J1239J1659J1824J2364J3134J3577J3693J3940J4276J4128
60547G40316J3373J2644J2329J1884J0464P811M294M82l018n699p515q897j0162
60534G78306j1162j1639j1637j1269j0489r339q176p309o660o073n708n714n702
60521F67429n049l686k292j535j378j281q96m30l58q27j466j787j674j377j119
$$ y = [653177, 653041, 652772, 652596, 651793, 649474, 645699, 641290, 636533, 630702, 623112, 614183, 605072, 596532, 588574, 581019, 573883, 567203, 561001, 555508, 551087, 547806, 545398, 543716, 542888, 542927, 543537, 544431, 545462, 546279, 546284, 545322, 544094, 543549, 544039, 545266, 546720, 547853, 548202, 547889, 547748, 548433, 549552, 550193, 550169, 550097, 550269, 550166, 549387, 548455, 548302, 549258, 550909, 552759, 554732, 557118, 560234, 564068, 568219, 572251, 576174, 580459, 585656, 592205, 600460, 610482, 621721, 633380, 645204, 657568, 670702, 684279, 697972, 711912, 726188, 740316, 753689, 766333, 778662, 790546, 801010, 808821, 813115, 813597, 810579, 804880, 797365, 788468, 778306, 767144, 755505, 743868, 732599, 722110, 712771, 704595, 697286, 690626, 684553, 678845, 673131, 667429, 662380, 658694, 656402, 654867, 653489, 652208, 651312, 650882, 650524, 649697, 648231, 646444, 644770, 643393, 642274]
60506F42274r08o70k41O60K117L628M388M213L846M157N251O585P711Q613R473
60491G01097J0310J0865J0793J0186R809J0430J1794J2827J3015J3122J4138J6008
60479H44394J7912J9400K0564K1278K0975J9243J6204J2275P932L634l94m236
60467I99181p783j0353j1349j1170j0819j0655j0087q606o404l883j154J696M414
60454I13028O891R196J1075J2056J2355J3043J4817J7165J9247K1120K3448K6510
60442A099951L0218L4806M0644M7454N4515O1671O9464P8149Q7312R6588J06144
60431A806916J16135J26289J36452J47061J58600J70804J82603J92473J98361
60422C235694J97492J86977J64900J30972Q6531L4368k1494p6356j25580j65259
$$ y = [642274, 641366, 640696, 640455, 641115, 643232, 646860, 651248, 655461, 659307, 663464, 668715, 675300, 683011, 691624, 701097, 711407, 722272, 733065, 743251, 753060, 763490, 775284, 788111, 801126, 814248, 828386, 844394, 862306, 881706, 902270, 923548, 944523, 963766, 979970, 992245, 1000177, 1003811, 1003417, 999181, 991398, 981045, 969696, 958526, 947707, 937052, 926965, 918359, 911955, 908072, 906918, 908614, 913028, 919919, 929115, 940190, 952246, 964601, 977644, 992461, 1009626, 1028873, 1049993, 1073441, 1099951, 1130169, 1164975, 1205619, 1253073, 1307588, 1369259, 1438723, 1516872, 1604184, 1700772, 1806916, 1923051, 2049340, 2185792, 2332853, 2491453, 2662257, 2844860, 3037333, 3235694, 3433186, 3620163, 3785063, 3916035, 4002566, 4036934, 4015440, 3939084, 3813504, 3648245]
60412C648245j92957k08557k14308k13359k07827j98328j85259j69952j54290
60403A903408j39511j25863j13182j01372r0420q0363p1412o3736n7094n0986
60393A009469m5329m0650l7281l4693l1986k8949k6159k4081k2463k0796j8962
60382F78120j7183j5535j3863j2145j0672r773r455r369r124q625q048p501o860
60369E39967o053n354n125n277n314m895m138l288k435j637j037o61l42l4J26
60354D94503K05N88J372J998J936J511J524K226L125L795M257M503M252L457K678
60339E31930K553L113L876M433M650M448L814L070K842L509M693N511N403M683
60325E88528M065L755L291K356J376R82J187J439J388J123P41J59n36j013j126
$$ y = [3648245, 3455288, 3246731, 3032423, 2819064, 2611237, 2412909, 2227650, 2057698, 1903408, 1763897, 1638034, 1524852, 1423480, 1333060, 1252697, 1181285, 1117549, 1060455, 1009469, 964140, 923490, 886209, 851516, 819530, 790581, 764422, 740341, 717878, 697082, 678120, 660937, 645402, 631539, 619394, 608722, 598949, 589494, 580125, 571001, 562376, 554328, 546827, 539967, 533914, 528560, 523435, 518158, 512844, 507949, 503811, 500523, 498088, 496451, 495414, 494753, 494411, 494377, 494503, 494708, 495296, 496668, 498666, 500602, 502113, 503637, 505863, 508988, 512783, 517040, 521543, 525795, 529252, 531930, 534483, 537596, 541472, 545905, 550555, 555003, 558817, 561887, 564729, 568238, 572931, 578442, 583845, 588528, 592593, 596348, 599639, 601995, 603371, 604353, 605540, 606979, 608367, 609490, 610231, 610390, 609854, 608841, 607715]
60310F07715j128j214j216r04m09k3K16N26J042J684K355L075L881M631N034M937
60294F30202M632M650N152N727O017O246O782P403P544P220P076P396P580O889
60280G20516N343L634K403J774J352N81o30j591j504m53P49J700K740M002M866
60265G45482M839M337L996L673K750J037j124l327n083n808n535n269n844o636
60251G27488o369n037m073m397n217n207m113k733j833j598j812k050j828r28
60237F80293M47J940L269M132M144L199J725M34j80p3M22Q30R19R10J213J895
60221G05519K610L038L163L183L340L882M845N837O271N941N253M899N393O711
60207G69885Q119Q575P810O893P202Q816J0541J1519J2156J3249J4901J6746J8660
$$ y = [607715, 606587, 605373, 604157, 603253, 602844, 602821, 603037, 603563, 604605, 606289, 608644, 611719, 615600, 620231, 625265, 630202, 634834, 639484, 644636, 650363, 656380, 662626, 669408, 676811, 684355, 691575, 698651, 706047, 713627, 720516, 725859, 729493, 731896, 733670, 735022, 735603, 734973, 733382, 731878, 731425, 732174, 733874, 736614, 740616, 745482, 750321, 754658, 758654, 762327, 765077, 766114, 764990, 761663, 756580, 750772, 745237, 739968, 734124, 727488, 721119, 716082, 712009, 707612, 702395, 697188, 693075, 690342, 688509, 686911, 685099, 683049, 681221, 680293, 680740, 682680, 685949, 690081, 694225, 697424, 699149, 699583, 699403, 699330, 699752, 700582, 701501, 702411, 703624, 705519, 708129, 711167, 714330, 717513, 720853, 724735, 729580, 735417, 741688, 747629, 752882, 757781, 763174, 769885, 778004, 786579, 794389, 801282, 808484, 817300, 827841, 839360, 851516, 864765, 879666, 896412, 915072]
60194I15072K0689K2673K4534K6657K9420L2531L5375L7907M0659M3944M7563
60183A277024N1361N5530O0123O4677O8731P2454P6394Q0592Q4257Q6580Q7651
60172B065374Q8240Q8600Q7882Q5126Q0475P4929O8873O1595N2458M2067L1724
60161B827343K2140J3143M503l469j0222j5421j9025k1147k1946k1456j9531j6074
60149B718838j1372o024m45N487J2246K0071K8593L7053M4960N2434N9746O6684
60137C028271P2669P7459Q1262Q4042Q5096Q3713P9811P3700O5489N5260M3641
60126C830413L1631J9799P942m345j6968k9147l9763m7964n3690n7573o0137o1134
60114C519064n9875n6016m9844m1946l2987k3675j4504n423L924J3621K3306L2581
$$ y = [915072, 935761, 958434, 982968, 1009625, 1039045, 1071576, 1106951, 1144858, 1185517, 1229461, 1277024, 1328385, 1383915, 1444038, 1508715, 1577446, 1649900, 1726294, 1806886, 1891143, 1977723, 2065374, 2153614, 2242214, 2330096, 2415222, 2495697, 2570626, 2639499, 2701094, 2753552, 2795619, 2827343, 2849483, 2862626, 2867129, 2863660, 2853438, 2838017, 2818992, 2797845, 2775899, 2754443, 2734912, 2718838, 2707466, 2701442, 2700997, 2706484, 2718730, 2738801, 2767394, 2804447, 2849407, 2901841, 2961587, 3028271, 3100940, 3178399, 3259661, 3343703, 3428799, 3512512, 3592323, 3666023, 3731512, 3786772, 3830413, 3862044, 3881843, 3889785, 3885440, 3868472, 3839325, 3799562, 3751598, 3697908, 3640335, 3580198, 3519064, 3459189, 3403173, 3353329, 3311383, 3278396, 3254721, 3240217, 3234794, 3238718, 3252339, 3275645, 3308226]
60102C308226M1198M8788N4717N8330N9242N7481N3548M8349M2572L6218K8976
60091C837645K1131J3611P151J827k336m896n486m383j936K231Q889J8014K8518
60078C919980L9335N0358O2142P5013Q8831J03362J18479J33971J49552J65134
60068D906157J80910J96962K12912K28076K41824K53649K62956K69130K71784
60059G024360K70712K65583K55975K41802K23420K01069J74620J44170J10646
60050H912357P5317L8822J254l6850p4169j09421j41945j71132j95821k14808
60040H083604k27676k34629k35714k30907k20893k07087j90592j71607j50159
60031F214340j27008j03372q0071n7442l5903j6082J727J7685L1673M2789M9927
$$ y = [3308226, 3349424, 3398212, 3452929, 3511259, 3570501, 3627982, 3681530, 3729879, 3772451, 3808669, 3837645, 3858776, 3872387, 3879538, 3881365, 3879029, 3874133, 3868647, 3864264, 3862328, 3864559, 3873448, 3891462, 3919980, 3959315, 4009673, 4071815, 4146828, 4235659, 4339021, 4457500, 4591471, 4741023, 4906157, 5087067, 5284029, 5496941, 5725017, 5966841, 6220490, 6483446, 6752576, 7024360, 7295072, 7560655, 7816630, 8058432, 8281852, 8482921, 8657541, 8801711, 8912357, 8987674, 9026496, 9027750, 8990900, 8916731, 8807310, 8665365, 8494233, 8298412, 8083604, 7855928, 7621299, 7385585, 7154678, 6933785, 6726698, 6536106, 6364499, 6214340, 6087332, 5983960, 5903889, 5846447, 5810544, 5794462, 5796189, 5813874, 5845547, 5888336, 5938263]
60020E938263N2738N1753M7638M0693L1117J9434O419p336k1586l6111n0412o3829
60008F008781p6005q7062r7197j06224j13734j19637j24198j27426j28745j27581
59998D900972j24051j18753j11999j03635r3585q2237p0221n8031m5805l3265
59988D059390j9948n918P872K0387L1728M2909N4258O4655P2726P8182Q1482Q2653
59976D570376Q1215P6964P0125O0800M8974L5086J9937L983j2689k9576m5623
59965D879572o0090p2861q3685r1817r6901r9551j00407r9135r5135q8836q1301
59954C909853p2748o2470n0346l7471k4847j2283Q44J4390K7678M0482N3003O5107
59942C851192P6445Q7247R8156J09043J18621J25545J29404J30292J27923J21744
$$ y = [5938263, 5991001, 6042754, 6090392, 6131085, 6162202, 6181636, 6188055, 6180719, 6159133, 6123022, 6072610, 6008781, 5932776, 5845714, 5748517, 5642293, 5528559, 5408922, 5284724, 5157298, 5028553, 4900972, 4776921, 4658168, 4546169, 4442534, 4348949, 4266712, 4196491, 4138460, 4092655, 4059390, 4039442, 4033524, 4041396, 4061783, 4093511, 4136420, 4190678, 4255333, 4328059, 4406241, 4487723, 4570376, 4651591, 4728555, 4798680, 4859480, 4908454, 4943540, 4963477, 4967460, 4954771, 4925195, 4879572, 4819482, 4746621, 4662936, 4571119, 4474218, 4374667, 4274260, 4175125, 4079990, 3991154, 3909853, 3837105, 3774635, 3724289, 3686818, 3661971, 3649688, 3650532, 3664922, 3692600, 3733082, 3786085, 3851192, 3927637, 4014884, 4113040, 4222083, 4340704, 4466249, 4595653, 4725945, 4853868, 4975612]
59932D975612J11709R8533Q3145O6195M7977K8543P919j3465l4556n4058p0982
59921E246572q4807r5231j02102j05503j05615j02529r6411q7851p7751o6704
59911D322068n4621m1093k6118j0521M395J7738K9676M1011N2057O2108P0194
59900D466894P6081Q0241Q3105Q4691Q4870Q3598Q0847P6603P0977O4252N6900
59889E309059M9691M3431L8363L4225L1164L0136L1782L5473M0351M7008N7008
59878E747691P0752Q6924J04229J22609J42373J63163J84408K05847K26839K45899
59868G300734K61678K73733K81523K83283K76819K61046K35918K01468J58133
59859I534335J07879N3798j537n6520j09284j57174j97777k29839k52957k67196
$$ y = [4975612, 5087321, 5185854, 5268999, 5335194, 5383171, 5411714, 5419633, 5406168, 5371612, 5317554, 5246572, 5161765, 5066534, 4964432, 4858929, 4753314, 4650785, 4554374, 4466523, 4388772, 4322068, 4267447, 4226354, 4200236, 4189715, 4194110, 4211848, 4241524, 4282535, 4334592, 4396700, 4466894, 4542975, 4623216, 4706321, 4791012, 4875882, 4959480, 5040327, 5116930, 5187907, 5252159, 5309059, 5358750, 5402181, 5440544, 5474769, 5505933, 5536069, 5567851, 5603324, 5643675, 5690683, 5747691, 5818443, 5905367, 6009596, 6132205, 6274578, 6437741, 6622149, 6827996, 7054835, 7300734, 7562412, 7836145, 8117668, 8400951, 8677770, 8938816, 9174734, 9376202, 9534335, 9642214, 9696012, 9694475, 9637955, 9528671, 9371497, 9173720, 8943881, 8690924, 8423728]
59849H423728k73373k73032k67468k57100k42083k23136k01466j78162j54015
59840F353893j29629j05326q1144n7159l3739j1307R910K9772M8022O4324P8280
59829F165897Q9270R6517R9497R8011R1704P9745O1441L7204Q693k2117n3826
59818F752036q5550j16192j44167j68043j87212k01692k11472k16468k17063k14171
59808D990006k08551k00490j90279j78570j65901j52391j38270j24306j11269
59799C519979r9279q8109p7725o8106n8994n0510m3608l9124l6561l4650l2921
59788B890392l1868l1528l0904k9104k6387k3764k1949k0914k0047j8707j7039
59777B618181j6114j6847j8884k1213k3572k6328k9104l0657l0430k9190k7801
$$ y = [8423728, 8150355, 7877323, 7609855, 7352755, 7110672, 6887536, 6686070, 6507908, 6353893, 6224264, 6118938, 6037794, 5980635, 5946896, 5935589, 5945499, 5975271, 6023293, 6087617, 6165897, 6255167, 6351684, 6451181, 6549192, 6640896, 6720641, 6782082, 6819286, 6827979, 6805862, 6752036, 6666486, 6550294, 6406127, 6238084, 6050872, 5849180, 5637708, 5421240, 5204177, 4990006, 4781455, 4580965, 4390686, 4212116, 4046215, 3893824, 3755554, 3631248, 3519979, 3420700, 3332591, 3254866, 3186760, 3127766, 3077256, 3033648, 2994524, 2957963, 2923313, 2890392, 2858524, 2826996, 2796092, 2766988, 2740601, 2716837, 2694888, 2673974, 2653927, 2635220, 2618181, 2602067, 2585220, 2566336, 2545123, 2521551, 2495223, 2466119, 2435462, 2405032, 2375842, 2348041]
59766B348041k6287k4478k2615k0738j8331j5193j1921q853n377j048L375O888
59754B203463R688J2672J5984J9096K2045K5533K9767L4151L8138M1696M4769
59743B497002M6921M7710M7038M5098M2328L9307L6256L2804K8690K4553K1418
59732B909125J9612J8713J8546J9567K2144K6088L1087L7155M4527N3389O3800
59721C263753P5530Q7972J00608J13601J27600J42927J59360J76596J94445K12438
59711D654830K29655K44972K56917K63028K59829K43944K13444J68545J11934
59702F647098M8849j3807o9570j14414j47162j68355j79046j80490j74409j62982
59692E485712j48269j31609j13577r4552p5144n6033l7658k0170l613J2091K7237
$$ y = [2348041, 2321754, 2297276, 2274661, 2253923, 2235592, 2220399, 2208478, 2199625, 2194248, 2193200, 2196575, 2203463, 2213151, 2225823, 2241807, 2260903, 2282948, 2308481, 2338248, 2372399, 2410537, 2452233, 2497002, 2543923, 2591633, 2638671, 2683769, 2726097, 2765404, 2801660, 2834464, 2863154, 2887707, 2909125, 2928737, 2947450, 2965996, 2985563, 3007707, 3033795, 3064882, 3102037, 3146564, 3199953, 3263753, 3339283, 3427255, 3527863, 3641464, 3769064, 3911991, 4071351, 4247947, 4442392, 4654830, 4884485, 5129457, 5386374, 5649402, 5909231, 6153175, 6366619, 6535164, 6647098, 6695947, 6682140, 6612570, 6498156, 6350994, 6182639, 6003593, 5823103, 5648694, 5485712, 5337443, 5205834, 5092257, 4997705, 4922561, 4866528, 4828870, 4808700, 4805087, 4817178, 4844415]
59681D844415M2206N7223P2303Q7323J02137J16864J32153J48752J66612J84812
59671E954800K02763K21134K41034K62551K84794L07315L30753L55833L82334
59662H543311M09352M36141M62220M87038N09903N30081N46539N57667N61755
59653A3044007N58046N47324N31447N12417M92007M72012M54440M41013M32448
59644A7485161M28392M27976M30081M33001M34297M31359M22127M05112L79147
59635B1276653L43524K98458K45282J86299J24640O3921P523m2017q2931j13798
59625B2307554j33503j41477j37768j22976r8323o5472k5910J9523P0251J25409
59615B1797308J83865K44529L06158L67080M25534M80048N28868N69081N96850
$$ y = [4844415, 4886621, 4943844, 5016147, 5103470, 5205607, 5322471, 5454624, 5603376, 5769988, 5954800, 6157563, 6378697, 6619731, 6882282, 7167076, 7474391, 7805144, 8160977, 8543311, 8952663, 9388804, 9851024, 10338062, 10847965, 11378046, 11924585, 12482252, 13044007, 13602053, 14149377, 14680824, 15193241, 15685248, 16157260, 16611700, 17052713, 17485161, 17913553, 18341529, 18771610, 19204611, 19638908, 20070267, 20492394, 20897506, 21276653, 21620177, 21918635, 22163917, 22350216, 22474856, 22538777, 22546300, 22504283, 22421352, 22307554, 22174051, 22032574, 21894806, 21771830, 21673507, 21608035, 21582125, 21601648, 21671899, 21797308, 21981173, 22225702, 22531860, 22898940, 23324474, 23804522, 24333390, 24902471, 25499321]
59606B5499321O08468O00669N70135N13762M30048L20091J87341L7144j23115
59597B8643864k84196m36405n71484o83742p70197q30187q64719q75876q66742
59588B2460316q41599q05492p63208p18778o76086o39581o13841o02124o04891
59579A6194716o19139o39071o58077o70955o74880o68934o53408o29605n99569
59570A0381078n65402n28823m91400m54636m19423l85728l53246l22218k93338
59561F566864k67018k43079k21060k00559j81354j63460j47091j32455j19648
59552D891140j08713r9532r1579q4227p7461p2096o8851o7557o7518o8406p0254
59541D014946p2737p5075p6789p8019p8940p9172p8147p5868p2945o9853o6366
$$ y = [25499321, 26107789, 26708458, 27278593, 27792355, 28222403, 28542494, 28729835, 28766979, 28643864, 28359668, 27923263, 27351779, 26668037, 25897840, 25067653, 24202934, 23327058, 22460316, 21618717, 20813225, 20050017, 19331239, 18655153, 18015572, 17401731, 16799607, 16194716, 15575577, 14936506, 14278429, 13607474, 12932594, 12263660, 11610252, 10980647, 10381078, 9815676, 9286853, 8795453, 8340817, 7921394, 7535666, 7182420, 6860202, 6566864, 6299846, 6056767, 5835707, 5635148, 5453794, 5290334, 5143243, 5010788, 4891140, 4782427, 4682895, 4591316, 4507089, 4429628, 4357532, 4288681, 4221124, 4153606, 4085200, 4014946, 3942209, 3867134, 3790345, 3712326, 3633386, 3554214, 3476067, 3400199, 3327254, 3257401, 3191035]
59530C191035o1829n5973m9319m2773l6839l1340k5829k0105j4296q633l367J212
59518B841944M957Q068J1044J4266J7709K1091K4187K6943K9328L1344L3247L5520
59506C099648L8362M1278M3604M5478M7956N1966N7465O3841P0784P8365Q6504
59495C725251R4936J03598J12609J21928J31433J41290J51774J62668J73375J83582
59485E102444J93325K02254K09485K14454K17379K18535K17453K13329K05927
59476F994585J95663J82957J67917J50650J31608J11719R2179P3922N7198M1918
59466H200316K8481J7815J0393N774L461L822P654J5096K5470L7893N1535O5380
59454H473090P8238Q8861R5684R6700R0347P6493N6094K9901j877l8542p8305
$$ y = [3191035, 3129206, 3073233, 3023914, 2981141, 2944302, 2912962, 2887133, 2867028, 2852732, 2844099, 2840732, 2841944, 2846901, 2854969, 2866013, 2880279, 2897988, 2919079, 2943266, 2970209, 2999537, 3030881, 3064128, 3099648, 3138010, 3179288, 3222892, 3268370, 3316326, 3368292, 3425757, 3489598, 3560382, 3638747, 3725251, 3820187, 3923785, 4036394, 4158322, 4289755, 4431045, 4582819, 4745487, 4918862, 5102444, 5295769, 5498023, 5707508, 5921962, 6139341, 6357876, 6575329, 6788658, 6994585, 7190248, 7373205, 7541122, 7691772, 7823380, 7935099, 8027278, 8101200, 8158398, 8200316, 8228797, 8246612, 8257005, 8262779, 8266240, 8270062, 8277716, 8292812, 8318282, 8356175, 8407710, 8473090, 8551328, 8640189, 8735873, 8832573, 8922920, 8999413, 9055507, 9085408, 9083531, 9044989, 8966684]
59443H966684j18946j58649j95879k28968k56376k77193k91079k97849k97592
59434F844153k91221k80445k66933k51460k33985k14540j93937j73452j53896
59425D784284j35270j17334j00176q3883o8044n2115l6208k0978o681P162K1057
59414D191814L4989M8800O2599P6406Q9777J02275J14024J25365J36061J45331
59404E127441J52514J57251J59015J56987J50550J39510J23770J03206P8069M9191
59394F397504J7617j5635m9215q1385j10776j36973j59838j78514j91846j99817
59384E291122k03884k05483k04681k00766j93756j84786j75086j65120j54779
59375C602781j43984j32896j21803j11074j01092r2006q3554p5242o6857n8742
$$ y = [8966684, 8847738, 8689089, 8493210, 8264242, 8007866, 7730673, 7439594, 7141745, 6844153, 6552932, 6272487, 6005554, 5754094, 5520109, 5305569, 5111632, 4938180, 4784284, 4649014, 4531680, 4431504, 4347621, 4279577, 4227462, 4191254, 4170276, 4163595, 4170757, 4191814, 4226803, 4275603, 4338202, 4414608, 4504385, 4606660, 4720684, 4846049, 4982110, 5127441, 5279955, 5437206, 5596221, 5753208, 5903758, 6043268, 6167038, 6270244, 6348313, 6397504, 6415121, 6399486, 6350271, 6268886, 6158110, 6021137, 5861299, 5682785, 5490939, 5291122, 5087238, 4881755, 4677074, 4476308, 4282552, 4097766, 3922680, 3757560, 3602781, 3458797, 3325901, 3204098, 3093024, 2991932, 2899926, 2816372, 2741130, 2674273, 2615531]
59365B615531n1498m5255l9381l3085k6407k0281j5451j1581p743l546O75M639
59353B366617Q615J2965J7616K1999K5235K6312K4742K1408J8379J7406J8677
59342B579971K1331K4848K9413L5122M1459M7734N3499N8428O2213O5005O7686
59331C086709P1365P6628Q3536R2049J02207J13928J27004J41265J56602J72860
59321D224153J90048K08528K28632K50081K72191K94708L17890L41578L64736
59312F692545L86261M05631M22146M34033M39269M37175M28381M13307L91753
59303A0450501L64329L33302L01332K69853K39171K09401J80578J52251J23834
59294A2624552R5176O6185L6118L948l0619o7061j04749j43082j80942k16849
$$ y = [2615531, 2564033, 2518778, 2479397, 2446312, 2419905, 2399624, 2384173, 2372592, 2364849, 2361303, 2361978, 2366617, 2375232, 2388197, 2405813, 2427812, 2453047, 2479359, 2504101, 2525509, 2543888, 2561294, 2579971, 2601302, 2626150, 2655563, 2690685, 2732144, 2779878, 2833377, 2891805, 2954018, 3019023, 3086709, 3158074, 3234702, 3318238, 3410287, 3512494, 3626422, 3753426, 3894691, 4051293, 4224153, 4414201, 4622729, 4851361, 5101442, 5373633, 5668341, 5986231, 6327809, 6692545, 7078806, 7484437, 7906583, 8340616, 8779885, 9217060, 9645441, 10058748, 10450501, 10814830, 11148132, 11449464, 11719317, 11958488, 12167889, 12348467, 12500718, 12624552, 12719728, 12785913, 12822031, 12825979, 12795360, 12728299, 12623550, 12480468, 12299526, 12082677]
59284A2082677k49811k79597l06093l28935l47850l62878l74188l82044l86888
59275I064393l88906l87570l82261l73313l61797l48240l32348l14204k94903
59266E880851k75548k56331k37080k18101j99954j82843j66673j51392j36852
59257D056077j22743j09124r6655q5802p6137o6834n7563m8469l9635l1086k3080
59246C298949j5891r447l450K329Q259J4831K2030K8988L4918M0119M5537N1491
59234C518663N7480O2999O7956P2341P6151P9619Q2924Q5655Q7203Q7666Q7708
59223D366365Q7482Q6465Q4577Q2681Q1478Q0622P9430P7994P6737P5198P2174
59212E251203O7209O1208N5277M9398M2676L4476K4850J4019K030j0947k4484
$$ y = [12082677, 11832866, 11553269, 11247176, 10918241, 10570391, 10207513, 9833325, 9451281, 9064393, 8675487, 8287917, 7905656, 7532343, 7170546, 6822306, 6489958, 6175754, 5880851, 5605303, 5348972, 5111892, 4893791, 4693837, 4510994, 4344321, 4192929, 4056077, 3933334, 3824210, 3727555, 3641753, 3565616, 3498782, 3441219, 3392750, 3353115, 3322029, 3298949, 3283058, 3273611, 3270161, 3272490, 3280749, 3295580, 3317610, 3346598, 3381516, 3421635, 3467172, 3518663, 3576143, 3639142, 3707098, 3779439, 3855590, 3935209, 4018133, 4103788, 4190991, 4278657, 4366365, 4453847, 4540312, 4624889, 4707570, 4789048, 4869670, 4949100, 5027094, 5103831, 5179029, 5251203, 5318412, 5379620, 5434897, 5484295, 5526971, 5561447, 5586297, 5600316, 5602346, 5591399, 5566915]
59201E566915l8153n1665o4488p5690q4485r0710r4440r5411r3373q8833q2850
59190D706817p5975o7853n8078m7088l5960k5615j6346p786Q08R929J9224K7741
59178D429818L4875M0861M6336N1782N7328O2604O6724O9080P0478P2869P7543
59167E080298Q4052R1257R8945J07796J18314J30498J44239J59243J74639J89309
59157F378590K02555K13872K22046K25098K21314K09923J90672J63288J27763
59148H155121Q5017L6944j4335o7129j19962j70720k16532k54977k85309l07946
59138F840172l22916l29669l28488l21156l09697k95247k78614k61022k43335
59129D150028k25270k06417j87694j70754j56149j43042j30645j19028j08473
$$ y = [5566915, 5528762, 5477097, 5412609, 5336919, 5252434, 5161724, 5067284, 4971873, 4878500, 4789667, 4706817, 4630842, 4562989, 4504911, 4457823, 4421863, 4396248, 4379902, 4372116, 4372924, 4382853, 4402077, 4429818, 4464693, 4505554, 4551890, 4603672, 4661000, 4723604, 4790328, 4859408, 4929886, 5002755, 5080298, 5164350, 5255607, 5354552, 5462348, 5580662, 5711160, 5855399, 6014642, 6189281, 6378590, 6581145, 6795017, 7017063, 7242161, 7463475, 7673398, 7864070, 8027358, 8155121, 8240138, 8277082, 8262747, 8195618, 8075656, 7904936, 7688404, 7433427, 7148118, 6840172, 6517256, 6187587, 5859099, 5537943, 5228246, 4932999, 4654385, 4393363, 4150028, 3924758, 3718341, 3530647, 3359893, 3203744, 3060702, 2930057, 2811029, 2702556]
59120B702556r8900r0164q2238p5031o8464o2623n7378n2096m6396m0924l6573
59109A991769l3171k9794k6154k2709j9499j6049j2478r491p035m130m73L010
59097A813796N703Q354J1800J5584J8744K1316K4070K7238L0393L3263L5986L8686
59085B084933M1404M4259M7271N0254N3256N6638O0336O3467O5311O6304O7418
59074B700851O8838O9935P0311P0151O9636O8615O6941O4618O1605N7845N3512
59063C422858M8870M4030L9209L5086L2340L0888L0088K9759L0501L2866L6592
59052C813087M0961M5629N0842N6945O3914P1367P8900Q6323R3623J00743J07493
59041D609827J13576J18529J21659J22214J19654J13558J03353Q8508O9174M6370
$$ y = [2702556, 2603656, 2513492, 2431254, 2356223, 2287759, 2225136, 2167758, 2115662, 2069266, 2028342, 1991769, 1958598, 1928804, 1902650, 1879941, 1860442, 1844393, 1831915, 1822424, 1815389, 1811259, 1810786, 1813796, 1819499, 1827853, 1839653, 1855237, 1873981, 1895297, 1919367, 1946605, 1976998, 2010261, 2046247, 2084933, 2126337, 2170596, 2217867, 2268121, 2321377, 2378015, 2438351, 2501818, 2567129, 2633433, 2700851, 2769689, 2839624, 2909935, 2980086, 3049722, 3118337, 3185278, 3249896, 3311501, 3369346, 3422858, 3471728, 3515758, 3554967, 3590053, 3622393, 3653281, 3683369, 3713128, 3743629, 3776495, 3813087, 3854048, 3899677, 3950519, 4007464, 4071378, 4142745, 4221645, 4307968, 4401591, 4502334, 4609827, 4723403, 4841932, 4963591, 5085805, 5205459, 5319017, 5422370, 5510878, 5580052, 5626422]
59031E626422K1476m225k9465n2830p3108q9658j02391j11623j17966j21912j23381
59020D821339j22105j18673j14579j10872j07387j03838j01046j00076j00593
59011C842170j01176j01277j01745j03121j04464j04535j03452j02331j01687
59002B918382j00957r9436r6932r3509q9300q4791q0762p7556p4688p1444o7700
58991A981307o3815o0016n6168n2191m8343m5018m2352m0078l7734l5170l2868
58980A467554l1495l1048l0698k9761k8473k7340k6071k3877k0788j7840j5761
58969A184402j4177j2445j0634r124p805o272m489k746j226j01K94j18p84j109
58955A113666j152j291j435j162m42L17Q62J180J251J203J493K329L173L454L521
$$ y = [5626422, 5647898, 5643673, 5614208, 5561378, 5488270, 5398612, 5296221, 5184598, 5066632, 4944720, 4821339, 4699234, 4580561, 4465982, 4355110, 4247723, 4143885, 4042839, 3942763, 3842170, 3740994, 3639717, 3537972, 3434851, 3330387, 3225852, 3122400, 3020069, 2918382, 2817425, 2717989, 2621057, 2527548, 2438248, 2353457, 2272695, 2195139, 2120451, 2049007, 1981307, 1917492, 1857476, 1801308, 1749117, 1700774, 1655756, 1613404, 1573326, 1535592, 1500422, 1467554, 1436059, 1405011, 1374313, 1344552, 1316079, 1288739, 1262668, 1238791, 1218003, 1200163, 1184402, 1170225, 1157780, 1147146, 1138022, 1130217, 1123945, 1119456, 1116710, 1115484, 1115383, 1115677, 1115559, 1114775, 1113666, 1112514, 1111223, 1109788, 1108626, 1108184, 1108501, 1109363, 1110543, 1111794, 1112997, 1114490, 1116819, 1119992, 1123446, 1126967]
58940A126967M160N345O252O445O203N712M876L962L565L770M052M165M321M506
58926A194301M476M577N567P371Q995R956J0864J2079J2872J2617J1930J1873
58914A307478J2607J3654J4802J6012J6847J6968J6935J7765J9682K1842K3285
58903A497877K3850K4258K5360K7137K8566K8878K8779K9592L1246L2273L2162
58892A809978L2422L4500L7639L9983M1098M2204M4264M7020M9912N2970N6500
58881B288490O0544O4886O9334P3851P8534Q3403Q8220R2922R8167J04856J12979
58870C216186J21618J30291J39475J49487J59797J70098J81158J93889K08208
58861D670207K23533K39701K56757K74592K93584L14690L37931L61663L84415
$$ y = [1126967, 1131127, 1136472, 1142724, 1149169, 1155372, 1161084, 1165960, 1169922, 1173487, 1177257, 1181309, 1185474, 1189795, 1194301, 1198777, 1203354, 1208921, 1216292, 1225287, 1235243, 1246107, 1258186, 1271058, 1283675, 1295605, 1307478, 1320085, 1333739, 1348541, 1364553, 1381400, 1398368, 1415303, 1433068, 1452750, 1474592, 1497877, 1521727, 1545985, 1571345, 1598482, 1627048, 1655926, 1684705, 1714297, 1745543, 1777816, 1809978, 1842400, 1876900, 1914539, 1954522, 1995620, 2037824, 2082088, 2129108, 2179020, 2231990, 2288490, 2349034, 2413920, 2483254, 2557105, 2635639, 2719042, 2807262, 2900184, 2998351, 3103207, 3216186, 3337804, 3468095, 3607570, 3757057, 3916854, 4086952, 4268110, 4461999, 4670207, 4893740, 5133441, 5390198, 5664790, 5958374, 6273064, 6610995, 6972658, 7357073]
58852G357073M06655M29544M52618M74118M92998N09001N21048N27112N25617
58843A1695784N15558M95223M62376M15964L56645K85609K04254J15232K2475
58834A4569120p0251j59858k43064l16545l78551m29196m68637m96093n11333
58825A1495592n16046n12803n03313m88416m69092m46667m22311l97005l71690
58816G368249l47110l23661l01557k80839k61301k42930k26340k12025j99280
58807D973206j86783j74332j62876j52660j42573j31898j21504j12432j04271
58798C683877r5938q7416p9645p2995o6882o0674n4208m7504m0637l3911k7673
58787C016394k1918j6323j0608m660J430P292J2599J7614K3043K9092L5202M0983
$$ y = [7357073, 7763728, 8193272, 8645890, 9120008, 9613006, 10122007, 10643055, 11170167, 11695784, 12211342, 12706565, 13168941, 13584905, 13941550, 14227159, 14431413, 14546645, 14569120, 14498869, 14339011, 14095947, 13779402, 13400851, 12971655, 12503018, 12006925, 11495592, 10979546, 10466743, 9963430, 9475014, 9005922, 8559255, 8136944, 7739939, 7368249, 7021139, 6697478, 6395921, 6115082, 5853781, 5610851, 5384511, 5172486, 4973206, 4786423, 4612091, 4449215, 4296555, 4153982, 4022084, 3900580, 3788148, 3683877, 3587939, 3500523, 3420878, 3347883, 3281001, 3220327, 3166119, 3118615, 3077978, 3044067, 3016394, 2994476, 2978153, 2967545, 2962885, 2964315, 2971607, 2984206, 3001820, 3024863, 3053955, 3089157, 3130140]
58775C130140M6845N3264O0008O6603P3115P9864Q6738R3542J00698J08924J18236
58764D017977J27900J37500J47564J58955J71916J85814J99830K13928K29109
58755E590493K46422K65709K85795L06062L27249L50249L74653L99087M22592
58746H568311M44881M65321M82442M94679N00965N00208M90630M70181M37532
58737A2855150L92341L34652K64717J83799R4987K600q9304j77582k59402l31867
58727A3270091l92895m41977m79489n05599n20484n25289n21955n12048m96537
58718H873818m76717m54499m31401m07955l84340l61003l38331l16354k95237
58709E407981k75563k57724k41429k26230k12074j98947j86386j73903j61632
$$ y = [3130140, 3176985, 3230249, 3290257, 3356860, 3429975, 3509839, 3596577, 3690119, 3790817, 3899741, 4017977, 4145877, 4283377, 4430941, 4589896, 4761812, 4947626, 5147456, 5361384, 5590493, 5836915, 6102624, 6388419, 6694481, 7021730, 7371979, 7746632, 8145719, 8568311, 9013192, 9478513, 9960955, 10455634, 10956599, 11456807, 11947437, 12417618, 12855150, 13247491, 13582143, 13846860, 14030659, 14125646, 14128246, 14038942, 13861360, 13601958, 13270091, 12877196, 12435219, 11955730, 11450131, 10929647, 10404358, 9882403, 9370355, 8873818, 8397101, 7942602, 7511201, 7103246, 6718906, 6357903, 6019572, 5703218, 5407981, 5132418, 4874694, 4633265, 4407035, 4194961, 3996014, 3809628, 3635725, 3474093]
58700C474093j50159j39854j30679j22431j14834j07477j00027r2506q5281p8778
58690B352067p3151o8064o2915n7535n2570m8722m5815m3085m0278l7787l5709
58679A786436l3588l1265k9268k8008k7176k6307k5322k4251k3023k1836k1194
58668A495198k1155k1123k0713k0252k0075j9976j9778j9892k0667k1760k2592
58657A267215k3045k3267k3315k3368k3779k4436k4653k4158k3543k3245k2758
58646A007648k1547k0048j8930j7964j6581j5086j4299j4220j4058j3422j2633
58635H28860j1932j1280j0869j1017j1439j1385j0656r822r349r074q655q011
58623G05371p208o368n706n240m500l027j165J67N56N18Q35J864L436M963N694
$$ y = [3474093, 3323934, 3184080, 3053401, 2930970, 2816136, 2708659, 2608632, 2516126, 2430845, 2352067, 2278916, 2210852, 2147937, 2090402, 2037832, 1989110, 1943295, 1900210, 1859932, 1822145, 1786436, 1752848, 1721583, 1692315, 1664307, 1637131, 1610824, 1585502, 1561251, 1538228, 1516392, 1495198, 1474043, 1452920, 1432207, 1411955, 1391880, 1371904, 1352126, 1332234, 1311567, 1289807, 1267215, 1244170, 1220903, 1197588, 1174220, 1150441, 1126005, 1101352, 1077194, 1053651, 1030406, 1007648, 986101, 966053, 947123, 929159, 912578, 897492, 883193, 868973, 854915, 841493, 828860, 816928, 805648, 794779, 783762, 772323, 760938, 750282, 740460, 731111, 722037, 713382, 705371, 698163, 691795, 686089, 680849, 676349, 673322, 672157, 672324, 672880, 673398, 674233, 676097, 679533, 684496, 690190]
58608F90190N295M211L125K232J405P99O60O85L27l69r16j354k199l339l909l511
58592F93332k779k227j402K43K267L835M974O339Q025R422J0247J0905J1635J2131
58578G66947J2422J3399J5726J8652K0732K1650K2534K4300K6560K8523L0228
58567A001673L2225L4533L6827L9335M2765M7281N2311N7380O2472O7537P2410
58556A546749P7411Q3310R0375R8091J06072J14485J23227J31413J38255J43836
58546B653224J48342J50956J50224J45213J35779J21907J03436Q0410N3483K4035
58536C767009o031l4972o1888q6292j07002j22269j31490j36053j37870j37594
58526B805548j34966j30218j24166j17207j09225j00457r1702q3526p5892o8585
$$ y = [690190, 695485, 699696, 702821, 705053, 706458, 707257, 707917, 708602, 708929, 708560, 707644, 706290, 704091, 700752, 696843, 693332, 690553, 688326, 686924, 687167, 689434, 693269, 698243, 704582, 712607, 722029, 732276, 743181, 754816, 766947, 779369, 792768, 808494, 827146, 847878, 869528, 892062, 916362, 942922, 971445, 1001673, 1033898, 1068431, 1105258, 1144593, 1187358, 1234639, 1286950, 1344330, 1406802, 1474339, 1546749, 1624160, 1707470, 1797845, 1895936, 2002008, 2116493, 2239720, 2371133, 2509388, 2653224, 2801566, 2952522, 3102746, 3247959, 3383738, 3505645, 3609081, 3689491, 3742974, 3767009, 3760978, 3726006, 3664118, 3577826, 3470824, 3348555, 3217065, 3081012, 2943142, 2805548, 2670582, 2540364, 2416198, 2298991, 2189766, 2089309, 1997607, 1914081, 1838189, 1769604]
58516A769604o1580n4962m8884m3556l9067l5249l2010k9544k7939k6796k5602
58505A344415k4242k2939k1974k1606k1850k2111k1640k0596j9975k0131k0169
58494A107182j9441j8757j9239k0656k1871k2386k2463k2182k1426k0533j9894
58483H78334j9192j7968j6697j6188j6166j5585j4273j3120j2539j1889j0680
58472G14037r292q230p414o620n966n589n425n401n418n108m222l174k569k284
58458F37325j768j103r46j360j651j487j296j339j220o78j09nl81j106k116l117
58442F17643l650l715l844m320m832n026m921m654m341m254m644n204n241m514
58428E54483l511k882k945l623m367m360l398k355k117k364k247j946k380l438
$$ y = [1769604, 1708024, 1653062, 1604178, 1560622, 1521555, 1486306, 1454296, 1424752, 1396813, 1370017, 1344415, 1320173, 1297234, 1275260, 1253654, 1231804, 1209693, 1188053, 1167457, 1147482, 1127351, 1107182, 1087741, 1068984, 1049745, 1029089, 1007218, 984832, 962369, 940187, 918761, 898228, 878334, 859142, 841174, 824477, 808289, 792123, 776538, 762265, 749145, 736606, 724717, 714037, 704745, 696515, 689101, 682481, 676515, 670926, 665501, 660100, 654682, 649574, 645352, 642178, 639609, 637325, 635557, 634454, 633508, 632148, 630497, 629010, 627714, 626375, 625155, 624477, 624368, 624363, 623982, 622876, 620760, 617643, 613993, 610278, 606434, 602114, 597282, 592256, 587335, 582681, 578340, 574086, 569442, 564238, 558997, 554483, 550972, 548090, 545145, 541522, 537155, 532795, 529397, 527042, 524925, 522561, 520314, 518368, 515988, 512550]
58414E12550l779k735j249m64l37j96J38L81L38n0o77j045o20K99P40L45j93k89
58396E03157k19k83j1J088K601L718M284M749N288N647N740N885O339O816O659
58381E61458N569M106L216L147L101K274P84p48k116l424m508n172n665o198o356
58366E49468n776n029m925n276n322n019m795m357l075j397m70l49N6J158K225
58351E07117K894L680M627M946M440L994M134M390M550N116N966O057N297N168
58337E72376O466P799P622O534O192O859P501P634P608P477O965O390O462P044
58323F70929P055N768L600J558K71l78j025k106l367m270m748n054n023m246l009
58308F55955k147j841j448p05j11J53O37J571K439L006L670M317L957K289N96
$$ y = [512550, 508771, 506036, 504787, 504323, 503986, 503790, 503928, 504309, 504647, 504597, 503920, 502875, 502255, 502554, 503294, 503639, 503446, 503157, 502938, 502655, 502644, 503732, 506333, 510051, 514335, 519084, 524372, 530019, 535759, 541644, 547983, 554799, 561458, 567027, 571133, 574349, 577496, 580597, 582871, 583655, 582907, 580791, 577367, 572859, 567687, 562022, 555824, 549468, 543692, 538663, 533738, 528462, 523140, 518121, 513326, 508969, 505894, 504497, 504027, 503678, 503734, 504892, 507117, 510011, 513691, 518318, 523264, 527704, 531698, 535832, 540222, 544772, 549888, 555854, 561911, 567208, 572376, 578842, 586641, 594263, 600797, 606989, 613848, 621349, 628983, 636591, 644068, 651033, 657423, 663885, 670929, 677984, 683752, 687352, 688910, 689181, 688803, 687778, 685672, 682305, 678035, 673287, 668233, 663210, 658964, 655955, 653808, 651967, 650519, 649814, 649703, 649856, 650493, 652064, 654503, 657509, 661179, 665496, 669453, 671742, 672338]
58293F72338K53J107K053K516K650K765L102L621L705K805J551J245J970K505
58279G04186K352K529L642M756M945M711M858N226N509O103P143P783P539P172
58265G78454P282P275O822O996Q528J0183J0453R844R838J0460J0625J0254J0310
58252H97324J1041J1759J2157J2521J2740J2337J1426J0692J0564J1115J2398
58241A026074J4114J5425J5854J5940J6354J6929J7204J7242J7270J7284J7615
58230A207305J8928K0928K2150K1921K1506K2359K4289K6313K8226L0216L1942
58219A476083L3139L4238L5453L6248L6561L7395L9178M0909M1954M3284M5721
58208A900163M8416N0424N2334N4935N7706O0074O2732O6094O9023P0799P2854
$$ y = [672338, 672591, 673698, 675751, 678267, 680917, 683682, 686784, 690405, 694110, 696915, 698466, 699711, 701681, 704186, 706538, 709067, 712709, 717465, 722410, 727121, 731979, 737205, 742714, 748817, 755960, 763743, 771282, 778454, 785736, 793011, 799833, 806829, 815357, 825540, 835993, 845837, 855675, 866135, 876760, 887014, 897324, 908365, 920124, 932281, 944802, 957542, 969879, 981305, 991997, 1002561, 1013676, 1026074, 1040188, 1055613, 1071467, 1087407, 1103761, 1120690, 1137894, 1155136, 1172406, 1189690, 1207305, 1226233, 1247161, 1269311, 1291232, 1312738, 1335097, 1359386, 1385699, 1413925, 1444141, 1476083, 1509222, 1543460, 1578913, 1615161, 1651722, 1689117, 1728295, 1769204, 1811158, 1854442, 1900163, 1948579, 1999003, 2051337, 2106272, 2163978, 2224052, 2286784, 2352878, 2421901, 2492700, 2565554]
58197B565554P6742Q1747Q6371R0723R5541J00231J04042J07907J13040J18849
58187C540747J24319J30232J37955J47087J56313J65412J74617J83298J91248
58178D951228J99913K10451K22061K34058K47806K64572K83382L03050L24226
58169G240747L47124L69669L90529M11661M35085M59699M84273N10976N42304
58160A1192067N77013O12785O50680O93277P40722P92263Q49090R11965R78941
58151A7998803J049452J127572J217075J316924J426240J549910J694598J864095
58143B9244669K064482K308496K607158K961155L367386L829426M354985M949654
58135E5687411N620502O376479P214769Q117013R074085J0111919J1292813J2709486
$$ y = [2565554, 2642296, 2724043, 2810414, 2901137, 2996678, 3096909, 3200951, 3308858, 3421898, 3540747, 3665066, 3795298, 3933253, 4080340, 4236653, 4402065, 4576682, 4759980, 4951228, 5151141, 5361592, 5583653, 5817711, 6065517, 6330089, 6613471, 6916521, 7240747, 7587871, 7957540, 8348069, 8759730, 9194815, 9654514, 10138787, 10649763, 11192067, 11769080, 12381865, 13032545, 13725822, 14466544, 15258807, 16107897, 17019862, 17998803, 19048255, 20175827, 21392902, 22709826, 24136066, 25685976, 27380574, 29244669, 31309151, 33617647, 36224805, 39185960, 42553346, 46382772, 50737757, 55687411, 61307913, 67684392, 74899161, 83016174, 92090259, 102202178, 113494991, 126204477]
58127A26204477J4454276J6467932J8274108J8881483J7175838J2675389O026142
58120B30159645j259515p620274j2141455j4693572j5648218j5539284j4853279
58113A48404048j3927983j2925747j1881857j0789823r656651q508979p380487
58106G3332521o302176n295129m369540l533213k796960k168885j653114j263428
58098D5950076j031163r86729j130010j418777j779094k124592k380716k510308
58090C2588687k521363k446174k313886k143936j954975j766001j588270j424255
58082A6429827j274853j141542j022611r14438q17095p33466o63079o01931n48133
58073H712679n02663m64709m31222m01100l75308l52723l30225l07202k85886
$$ y = [126204477, 140658753, 157126685, 175400793, 194282276, 211458114, 224133503, 230159645, 228900130, 221279856, 209138401, 194444829, 178796611, 163257327, 148404048, 134476065, 121550318, 109668461, 98878638, 89221987, 80713008, 73332521, 67030345, 61735216, 57365676, 53832463, 51035503, 48866618, 47213504, 45950076, 44918913, 43932184, 42802174, 41383397, 39604303, 37479711, 35098995, 32588687, 30067324, 27621150, 25307264, 23163328, 21208353, 19442352, 17854082, 16429827, 15154974, 14013432, 12990821, 12076383, 11259288, 10525822, 9862743, 9260812, 8712679, 8210016, 7745307, 7314085, 6912985, 6537677, 6184954, 5854729, 5547527, 5261641]
58064E261641k67026k49005k31481k16030k02668j89349j75630j63702j55141
58055C411609j49351j45466j43092j40938j37409j32833j28610j24226j17783
58046B191901j09482j01744r5539q9368q2272p5287o9354o4130n9468n5904n3149
58035A336204n0052m6480m3449m1125l8547l5545l3058l1322k9552k7644k6394
58024I33036k5817k5011k3861k3192k3046k2482k1268k0153j9340j8262j6991
58013F93613j6222j5802j4863j3464j2533j2104j1322j0178r557r380q540o902
58001E52746n684n516n727n809o079o483o267n257m202l618l442l797m759n458
57987D80648m980m048m184n198n400m368l553l753m031l740l651m195m315l150
$$ y = [5261641, 4994615, 4745610, 4514129, 4298099, 4095431, 3906082, 3730452, 3566750, 3411609, 3262258, 3116792, 2973700, 2832762, 2695353, 2562520, 2433910, 2309684, 2191901, 2082419, 1980675, 1885136, 1795768, 1713496, 1638209, 1568855, 1504725, 1445257, 1389353, 1336204, 1286152, 1239672, 1196223, 1155098, 1116551, 1081006, 1047948, 1016626, 987074, 959430, 933036, 907219, 882208, 858347, 835155, 812109, 789627, 768359, 748206, 728866, 710604, 693613, 677391, 661589, 646726, 633262, 620729, 608625, 597303, 587125, 577568, 568188, 559648, 552746, 547062, 541546, 535819, 530010, 523931, 517448, 511181, 505924, 501722, 498104, 494662, 490865, 486106, 480648, 475668, 471620, 467436, 462238, 456838, 452470, 448917, 445164, 441133, 437393, 433742, 429547, 425232, 422082]
57973D22082j494n18k22m5N7j6MJ59N3l14l77j74o07j966l279l680l499l376l290
57954C99498l144l344m112m953n354n462n574n669n732n848n783n199m463m267
57940C30594m413m035l215l034l696l985l161k117j826j875j511j106j437k159
57926B93024k106p54J310L107L917L626K830K276J932J219K59KP64J532J345N33
57910C14816l9k86p31j584k600l522m126m223l944l666l422k909k281k152k573
57895B76758k728k127j303r31r41r82j089j307j304r47o77p85q13k88M63P20K89
57878B62008m37r49q66j55N91N89j32p63r29j146j793k426k633k756l188l621
57862B41394l609l342l176k977k543k162k104j985j339l77M17J013J587J930J853
$$ y = [422082, 420588, 420070, 419848, 419803, 419860, 419844, 419848, 420007, 420060, 419746, 419369, 419195, 418588, 416622, 413343, 409663, 406164, 402788, 399498, 396354, 393010, 388898, 383945, 378591, 373129, 367555, 361886, 356154, 350306, 344523, 339324, 334861, 330594, 326181, 322146, 318931, 315897, 312201, 308216, 305055, 302938, 301112, 299237, 297726, 296620, 295183, 293024, 290918, 290164, 291474, 294581, 298498, 302124, 304954, 307230, 309162, 310381, 310640, 310642, 311406, 312938, 314283, 314816, 314777, 314491, 313760, 312176, 309576, 306054, 301928, 297705, 293761, 290095, 286673, 283764, 281483, 279331, 276758, 274030, 271903, 270600, 269669, 268728, 267746, 266657, 265350, 264046, 263099, 262422, 261637, 260824, 260536, 260999, 261719, 262008, 261571, 260622, 259756, 259601, 260192, 260781, 260649, 259886, 258957, 257811, 256018, 253592, 250959, 248203, 245015, 241394, 237785, 234443, 231267, 228290, 225747, 223585, 221481, 219496, 218157, 217780, 218197, 219210, 220797, 222727, 224580]
57847B24580J770K200K907L230L089L012L212L285K849K032J238P20M70L21J06
57832B55021k10n83j019j491j825j951k117k554l040l280l486m010m455m029k761
57817B18210j636j265j287j268j365j671j730j221m30L95J523L038M293M606M031
57802B24223L036J975J266J444K476L466L556K750J550K86p71j300j340j338j511
57787B39768j663j942k886m306n025m361l170k708l073l529l723l760l539k899
57773A93184k139j750j816k136k586l005l140l094l288l661l597l056k943l767
57759A53206m805n216n199n191m851l786k583k056k002j753j390j392j514j081
57745A10387o6J010J842K191J626L63k61O41J988K106J054K47J54j3m85m93J48
$$ y = [224580, 226350, 228550, 231457, 234687, 237776, 240788, 244000, 247285, 250134, 252166, 253404, 254124, 254594, 254915, 255021, 254811, 254228, 253209, 251718, 249893, 247942, 245825, 243271, 240231, 236951, 233465, 229455, 225000, 220971, 218210, 216574, 215309, 214022, 212754, 211389, 209718, 207988, 206767, 206337, 206732, 208255, 211293, 215586, 220192, 224223, 227259, 229234, 230500, 231944, 234420, 237886, 241442, 244192, 245742, 246028, 245257, 243957, 242617, 241279, 239768, 238105, 236163, 233277, 228971, 223946, 219585, 216415, 213707, 210634, 207105, 203382, 199622, 196083, 193184, 191045, 189295, 187479, 185343, 182757, 179752, 176612, 173518, 170230, 166569, 162972, 159916, 156973, 153206, 148401, 143185, 137986, 132795, 127944, 124158, 121575, 119519, 117517, 115764, 114374, 112982, 111468, 110387, 110321, 111331, 113173, 115364, 116990, 117353, 117092, 117733, 119721, 121827, 122881, 123128, 123282, 123269, 122784, 122291, 122439]
57728A22439N59K65n9K17Q53J471K131K759K850K173J080k8r40j340j119r54j574
57711A30783k447k333j253o22j220k111k136j333l57M89J008Q24O2l97Q9J235
57695A20281K489L596M142L561K183J352J810K748L201L456M127M720M352L340
57681A65358K853L156L377K990K503K562L096L663L979L980L808L800M123M486
57667B13734M598M744N348O099O256N821N661O221O831O764O436O894Q382J0007
57653C03796J0827J0736J0289J0053J0381J1359J2738J4036J5022J5926J6963
57642D42126J7932J8585J9207K0300K1845K3405K4932K6841K9115L1089L2524
57631G07901L4197L6999M0830M4988M9252N3937N9196O4872P0915P7442Q4508
$$ y = [122439, 122998, 123263, 123204, 123421, 124274, 125745, 127876, 130635, 133485, 135658, 136738, 136710, 135770, 134430, 133311, 132357, 130783, 128336, 126003, 124750, 124128, 122908, 120797, 118661, 117328, 116971, 117460, 118468, 119292, 119354, 118957, 119046, 120281, 122770, 126366, 130508, 134069, 136252, 137604, 139414, 142162, 145363, 148819, 152946, 157666, 162018, 165358, 168211, 171367, 174744, 177734, 180237, 182799, 185895, 189558, 193537, 197517, 201325, 205125, 209248, 213734, 218332, 223076, 228424, 234523, 240779, 246600, 252261, 258482, 265313, 272077, 278513, 285407, 293789, 303796, 314623, 325359, 335648, 345701, 356082, 367441, 380179, 394215, 409237, 425163, 442126, 460058, 478643, 497850, 518150, 539995, 563400, 588332, 615173, 644288, 675377, 707901, 742098, 779097, 819927, 864915, 914167, 968104, 1027300, 1092172, 1163087, 1240529, 1325037]
57620A325037R2198J00741J10045J19356J27893J35566J42609J48819J53654J56607
57610B612525J56910J53220J44443J30405J10843Q4441N0312J0519l0318o8114
57600C355186j00948j27563j46184j55909j58212j55790j50408j42592j32893
57591B084687j22301j11594j01080r1001q1591p2807o4449n6654m9878m4308l9507
57580A249517l4678k9312k3598j8175j3348q775m173P8L540O692J0460J4924J9266
57567A172418K3067K6815L0974L5432M0207M5756N2107N8488O4328O9974P5870
57556A695436Q1686Q6871R1346R5031R7193R6965R4004Q8048P8310O4158M6137
57545B615185K5662L957j8136l9673n9571p6903r0811j00554j06188j08813j09588
$$ y = [1325037, 1417235, 1517976, 1628021, 1747377, 1875270, 2010836, 2153445, 2302264, 2455918, 2612525, 2769435, 2922655, 3067098, 3197503, 3308346, 3392787, 3443099, 3453618, 3423300, 3355186, 3254238, 3126675, 2980491, 2824582, 2666370, 2510580, 2360172, 2217580, 2084687, 1962386, 1850792, 1749712, 1658711, 1577120, 1504313, 1439864, 1383210, 1333332, 1289024, 1249517, 1214839, 1185527, 1161929, 1143754, 1130406, 1121631, 1117458, 1117536, 1121076, 1127768, 1138228, 1153152, 1172418, 1195485, 1222300, 1253274, 1288706, 1328913, 1374669, 1426776, 1485264, 1549592, 1619566, 1695436, 1777122, 1863993, 1955339, 2050370, 2147563, 2244528, 2338532, 2426580, 2504890, 2569048, 2615185, 2640847, 2644804, 2626668, 2586995, 2527424, 2450521, 2359710, 2259156, 2152968, 2044155, 1934567]
57534A934567j08812j06446j02919r8673r3453q7088q0495p4880p0106o5023n9379
57523I87293n4204n0085m6275m2036l7912l4869l2856l0929k8519k5869k3428
57512E80311k1331j9503j7812j6126j4405j2785j1368j0026q564p106o052n593
57500D29640n339m571k967j001M85J119J323J791K776L970M925N486N900O599
57486D50136P812R310J0625J1509J2122J2816J3887J5505J7666K0164K2724K5090
57474F29366K6917K7945K8613L0159L3408L7665M1504M4622M8032N2338N6838
57463A057407O0788O4540O8762P3199P6944P9401Q0168P8538P3992O6898N7965
57452A838602M7170L3977J8409J352j6072l2700m7234n8770o7471p4003p8425
$$ y = [1934567, 1825755, 1719309, 1616390, 1517717, 1424264, 1337176, 1256681, 1181801, 1111695, 1046672, 987293, 933089, 883004, 836729, 794693, 756781, 721912, 689056, 658127, 629608, 603739, 580311, 558980, 539477, 521665, 505539, 491134, 478349, 466981, 456955, 448391, 441285, 435233, 429640, 424301, 419730, 416763, 415762, 416247, 417366, 418689, 420480, 423256, 427226, 432151, 437637, 443537, 450136, 457948, 467258, 477883, 489392, 501514, 514330, 528217, 543722, 561388, 581552, 604276, 629366, 656283, 684228, 712841, 743000, 776408, 814073, 855577, 900199, 948231, 1000569, 1057407, 1118195, 1182735, 1251497, 1324696, 1401640, 1481041, 1561209, 1639747, 1713739, 1780637, 1838602, 1885772, 1919749, 1938158, 1939510, 1923438, 1890738, 1843504, 1784734, 1717263, 1643260, 1564835]
57441A564835q0257p9579p7320p4316p0749o6580o1919n6862n1449m5987m0940
57430H58877l6465l2419k8804k5648k2600j9229j5745j2766j0323p794m938k247
57418F39899l9K112M622P293R854J2559J5690J8975K2091K5303K8982L2857L6440
57405H56638M0041M4590N0317N6259O1260O5003O7838P0002P1388P1725P0527
57394A525588O6955O0172N0008L7039K1977N322j2259k9554m5279n8786o9973
57383A551210p8600q4134q6497q6539q5483q3992q1865p8511p3704o8041o2645
57372F81199n8158n4143m9826m5312m1501l8762l6447l3889l1184k8595k5969
57361B37413k3342k1438k0697k0249j8836j6540j4674j3933j3593j2713j1362
$$ y = [1564835, 1484578, 1404999, 1327679, 1253363, 1182614, 1116034, 1054115, 997253, 945804, 899817, 858877, 822412, 789993, 761189, 735541, 712941, 693712, 677967, 665201, 654878, 647084, 642146, 639899, 639860, 641972, 646594, 653887, 663741, 676300, 691990, 710965, 733056, 758359, 787341, 820198, 856638, 896679, 941269, 991586, 1047845, 1109105, 1174108, 1241946, 1311948, 1383336, 1455061, 1525588, 1592543, 1652715, 1702723, 1739762, 1761739, 1767061, 1754802, 1725248, 1679969, 1621183, 1551210, 1472610, 1388476, 1301979, 1215440, 1129957, 1045965, 964100, 885589, 811885, 743844, 681199, 623041, 568898, 519072, 473760, 432259, 393497, 357050, 323161, 291977, 263382, 237413, 214071, 192633, 171936, 151687, 132851, 116311, 101637, 87704, 74111, 61398, 50036]
57350E0036j0232r598r177q746C796d887r268r694r442q578p697p216o999o809
57336g0590o704o731o647o325o035n829n160l710k230j739k126k356j967j464
57322a29613j239j018o76o90j419k446l090l140k792k293j953k117k714l160l052
57307a61412k773l101m213n367n603m756l707l483m090m519m099l334l012k930
57293b16399k253r12J91L97K3l17m93o44p15n34q4M83R15Q75K32o49j236j472
57275b22592j691j967j993j654j256j068j027j010j038j105j144j171j173r32
57261b40821l42J94J86k12l82j45N6q7l78n86p21p50n09l3M47R58J697K548L172
57242b35708L579M068M565M696M614N027O183P431Q121Q336Q489Q757R225J0062
$$ y = [50036, 39804, 30206, 21029, 12283, 3796, -4887, -14155, -23849, -33291, -41869, -49566, -56782, -63781, -70590, -77294, -84025, -90672, -96997, -103032, -108861, -114021, -117731, -119961, -121700, -123826, -126182, -128149, -129613, -130852, -131870, -132546, -133236, -134655, -137101, -140191, -143331, -146123, -148416, -150369, -152486, -155200, -158360, -161412, -164185, -167286, -171499, -176866, -182469, -187225, -190932, -194415, -198505, -203024, -207123, -210457, -213469, -216399, -218652, -219564, -219373, -218976, -218953, -219270, -219763, -220407, -221122, -221656, -221740, -221257, -220342, -219467, -219235, -219884, -221120, -222592, -224283, -226250, -228243, -229897, -231153, -232221, -233248, -234258, -235296, -236401, -237545, -238716, -239889, -240821, -241163, -240969, -240783, -240995, -241377, -241522, -241466, -241553, -241931, -242517, -243238, -243988, -244497, -244530, -244083, -243125, -241428, -238880, -235708, -232129, -228061, -223496, -218800, -214186, -209159, -202976, -195545, -187424, -179088, -170599, -161842, -152617, -142555]
57228a42555J1143J1909J2023J1873J2126J2973J4032J4738J4764a2707A108J3792
57216A4900J3823J3199J1677R535P067M414J824n59l039n963r122j2154j5275
57203C0327A1534a0511k3836k3900k3168k2456k1861k1461k1504k1590k0743j8680
57191b29710j6264j4380j3183j2595j2553j2459j1428r573q038p412p017o228
57179c60840n331m565l430j784n71n38j030r14N4J471L143M859O042O584P361
57164c49489R108J1246J2733J3492J4262J5468J7008J8643J9866J9923J8756J7447
57152a61537J6957J6905J6366J5337J4613J4531J4731J4882J4965g245G834J5325
57140B3159J5510J5140J4290J3830J4309J5177J5671J5833J6081J6388J6453J6230
$$ y = [-142555, -131412, -119503, -107480, -95607, -83481, -70508, -56476, -41738, -26974, -12707, 1108, 14900, 28723, 41922, 53599, 63134, 70201, 74615, 76439, 75880, 72841, 66878, 57756, 45602, 30327, 11534, -10511, -34347, -58247, -81415, -103871, -125732, -147193, -168697, -190287, -211030, -229710, -245974, -260354, -273537, -286132, -298685, -311144, -322572, -332145, -340183, -347595, -354612, -360840, -366171, -370736, -374166, -375950, -376521, -377059, -378089, -379003, -378949, -377478, -374335, -369476, -363434, -356850, -349489, -340381, -329135, -316402, -302910, -288648, -273180, -256172, -237529, -217663, -197740, -178984, -161537, -144580, -127675, -111309, -95972, -81359, -66828, -52097, -37215, -22250, -7245, 7834, 23159, 38669, 53809, 68099, 81929, 96238, 111415, 127086, 142919, 159000, 175388, 191841, 208071]
57128B08071J5705J4740J3583J2926J2994J3197J3048J2646J2038J1081J0335
57117C50364J0838J2425J3538J3401J3064J3466J3860J3292J2323J1948J1992
57106D90511J1813J1528J1298J0513Q951P609O963N718K810o16l060n317r333
57093E49388j5263k1661k7849l4085m0042m5183n0208n6313o3282p0017D9027
57081c4299r0629r7993j06033j15464j25619j35597j46099j58177j70936j82576
57071a363422j93115k03991k15648k27684k40712k55952k73623k93946l18865
57062c586958l50196l86834m26371m68864n16382n69557o27555o90762p60649
57053h384128q37493r21230j013971j118757j236556j367669j515109j683206
$$ y = [208071, 223776, 238516, 252099, 265025, 278019, 291216, 304264, 316910, 328948, 340029, 350364, 361202, 373627, 387165, 400566, 413630, 427096, 440956, 454248, 466571, 478519, 490511, 502324, 513852, 525150, 535663, 544614, 552223, 559186, 564904, 567714, 567098, 564038, 558721, 549388, 534125, 512464, 484615, 450530, 410488, 365305, 315097, 258784, 195502, 125485, 49027, -34299, -124928, -222921, -328954, -444418, -570037, -705634, -851733, -1009910, -1180846, -1363422, -1556537, -1760528, -1976176, -2203860, -2444572, -2700524, -2974147, -3268093, -3586958, -3937154, -4323988, -4750359, -5219223, -5735605, -6305162, -6932717, -7623479, -8384128, -9221621, -10142851, -11156822, -12275579, -13512135, -14879804, -16394913, -18078119]
57045a8078119j873939k088537k331717k610516k930514l298018l724798m225571
57037d1161729m811957n493741o282964p188276q204877r315918j0501603j1740139
57029a04701204j3004809j4270759j5516870j6703954j7764622j8656793j9433281
57022b20052292k0191399k0872461k1100021k0279469j7935246j4016769q944212
57015c43391869l410204J888783O453712J0073949J2806980J4867269J6483644
57008b84227736J7797915J8837250J9545312J9843023J9690046J9115225J8200741
57001a51198224J7042332J5723413J4313811J2875043J1459117J0106135Q845780
56994f0832593P698397O673817N772474M989364M315994L740098L247759K827285
$$ y = [-18078119, -19952058, -22040595, -24372312, -26982828, -29913342, -33211360, -36936158, -41161729, -45973686, -51467427, -57750391, -64938667, -73143544, -82459462, -92961065, -104701204, -117706013, -131976772, -147493642, -164197596, -181962218, -200619011, -220052292, -240243691, -261116152, -282216173, -302495642, -320430888, -334447657, -343391869, -346802073, -344913290, -338459578, -328385629, -315578649, -300711380, -284227736, -266429821, -247592571, -228047259, -208204236, -188514190, -169398965, -151198224, -134155892, -118432479, -104118668, -91243625, -79784508, -69678373, -60832593, -53134196, -46460379, -40687905, -35698541, -31382547, -27642449, -24394690, -21567405]
56986b1567405K469589K165583J906029J683764J493575J329932J187308J062443
56978h269182R53799Q58899P74504O99082O32491N73291N18979M68866M24167
56969b365104L84930L49424L16805K87900K62676K39382K17042a10294F8733J63305
56959B32038J48377J34233J20850J07510R4160Q2001P1810O2839N4261M6319L9176
56948A193574L1802K3213J4105O250O27l630r121j9044l4790n3757p0437q0486
56936I98306q3453q1622p7375p2264o7243o2526n7592n2155m6773m2059l7838
56925C17406l3709k9874k6785k4423k2529k1311k1251k2389k4194k6025k7424
56914C7492I375a8604k6905k4663k1343j7798j5118j3462j1854r434o477l813
$$ y = [-21567405, -19097816, -16932233, -15026204, -13342440, -11848865, -10518933, -9331625, -8269182, -7315383, -6456484, -5681980, -4982898, -4350407, -3777116, -3258137, -2789271, -2365104, -1980174, -1630750, -1313945, -1026045, -763369, -523987, -306945, -110294, 68733, 232038, 380415, 514648, 635498, 743008, 837168, 919169, 990979, 1053818, 1108079, 1154398, 1193574, 1225376, 1248589, 1262694, 1268944, 1269571, 1265941, 1256820, 1237776, 1202986, 1149229, 1078792, 998306, 914853, 833231, 755856, 683592, 616349, 553823, 496231, 444076, 397303, 355244, 317406, 283697, 253823, 227038, 202615, 180086, 158775, 137524, 115135, 90941, 64916, 37492, 9375, -18604, -45509, -70172, -91515, -109313, -124431, -137893, -149747, -159181, -165658, -169471]
56902a69471j677M57L086O076Q854J1000J2632J4091J5183J5112J3458J0889Q411
56889e1899O224M067K336J823K373K813K559K368L029M142M857N140d547B009
56874I717Q886J0112J1321J2450J3665J4976J5638J4372J0465M602j387n759q032
56861A11026r028r692j0073r752q846p924p047n780m236l240l070k862j808k85
56847B7383Q68J625K561L746M661N055N202N427N913O826Q101R160R475R377R799
56832A15179J1121J2747J3909J4536J5196J6426J8216J9960K0923K0772J9488
56821B98473J6802J2311O466Q95k984n268o914q197q730q663q662q619p535n134
56807B64241k504n69J194L704O719R253J1064J2837J4972J6981J7910J6886J3463
$$ y = [-169471, -171148, -170691, -167605, -161529, -152675, -141675, -129043, -114952, -99769, -84657, -71199, -60310, -51899, -45675, -41608, -39272, -37449, -35076, -32263, -29704, -27336, -24307, -20165, -15308, -10168, -4547, 2009, 9717, 18603, 28715, 40036, 52486, 66151, 81127, 96765, 111137, 121602, 126204, 124817, 119058, 111026, 101998, 92306, 82233, 72481, 63635, 55711, 48664, 42884, 38648, 35408, 32338, 29476, 27668, 27383, 28251, 29876, 32437, 36183, 40844, 45899, 51101, 56528, 62441, 69267, 77368, 86528, 96003, 105380, 115179, 126300, 139047, 152956, 167492, 182688, 199114, 217330, 237290, 258213, 278985, 298473, 315275, 327586, 334052, 334947, 331963, 326695, 319781, 311584, 302854, 294191, 285529, 276910, 269375, 264241, 261737, 261168, 262362, 266066, 272785, 282038, 293102, 305939, 320911, 337892, 355802, 372688, 386151]
56794C86151Q160K463k351o243r615j1939j2220j0788r316q727q060o049k893
56781C08573K86L066N894R019J2245J5525J9031K2579K5553K7507K8243K7313
56769E04834K3992J8061J0289K026n435j1200j4977j7151j8406j9074j9008j8118
56757D35833j6646j4739j2094q385l910M36L934O577Q798J0846J2638J4150J5513
56744D52951J6478J6045J3183P917J332n435j1697j6716j9621k0279j9649j8737
56732C95772j7664j6218j4660j3228j1397q601n355k693p06J307L399M884N733
56719C20573O831Q368R114P845M671M39m320r104j2910j4906j5265j4742j3798
56706B72796j2702j1924j1698j1510j0709r374q050o947n965n174m637m060l250
$$ y = [386151, 394311, 396774, 394423, 388180, 378565, 366626, 354406, 343618, 334302, 325575, 317515, 311466, 308573, 308859, 311925, 317819, 326838, 339083, 354608, 373639, 396218, 421771, 449278, 477521, 504834, 528826, 546887, 557176, 559202, 553767, 542567, 527590, 510439, 492033, 472959, 453951, 435833, 419187, 404448, 392354, 383969, 380059, 380495, 384429, 391006, 399804, 410650, 423288, 437438, 452951, 469429, 485474, 498657, 506574, 507906, 502471, 490774, 474058, 454437, 434158, 414509, 395772, 378108, 361890, 347230, 334002, 322605, 314004, 308649, 305956, 305250, 306557, 309956, 314840, 320573, 327404, 335772, 344886, 352731, 357402, 357841, 353521, 344417, 331507, 316601, 301336, 286594, 272796, 260094, 248170, 236472, 224962, 214253, 204879, 196829, 189882, 183917, 178743, 174106, 170046, 166796]
56693A66796k585k448k414j792p35l1Q7J79O02J016J052Q24N75K35l41j036j495
56676A58489j375o17L80R61Q58M03n0n42j016r89l11K09k68j305j738j322r21
56659A50846j097j432j463j341j284j168r92j087j480j656j336q60n11r1M94Q20
56643A36362N91J36j66l83n21j72P07J241O42o20j417j464j386j508j436r80o36
56626A28990q53j388j732j820j881j806j111L66J940K532J760M67j60J16M88K94
56610A26202j73k98l8K46M66P78J084J165J179J452J805J728J234R92J352J751
56594A40925J458N28l05n31k94p8k06o38j081j279j278j310j466j567j466j322
56578A30090j390j653j789j531r79m87l13l24j54K98O55M59k34q53r26n20n6J80
$$ y = [166796, 164211, 161763, 159349, 157557, 156822, 156791, 156878, 157057, 157659, 158675, 159727, 160551, 161126, 161361, 161020, 159984, 158489, 157114, 156497, 156877, 157838, 158696, 159099, 159049, 158507, 157491, 156502, 156191, 156400, 156132, 154827, 153089, 151767, 150846, 149749, 148317, 146854, 145513, 144229, 143061, 142069, 140982, 139502, 137846, 136510, 135650, 135139, 135048, 135542, 136362, 136953, 137089, 136923, 136540, 136019, 135847, 136554, 137795, 138437, 137817, 136400, 134936, 133550, 132042, 130606, 129626, 128990, 128137, 126749, 125017, 123197, 121316, 119510, 118399, 118765, 120705, 123237, 124997, 125464, 125304, 125420, 125908, 126202, 126029, 125731, 125693, 125939, 126405, 127183, 128267, 129432, 130611, 132063, 133868, 135596, 136830, 137822, 139174, 140925, 142383, 142911, 142606, 142075, 141781, 141703, 141497, 140859, 139778, 138499, 137221, 135911, 134445, 132878, 131412, 130090, 128700, 127047, 125258, 123727, 122748, 122261, 121948, 121624, 121470, 121768, 122423, 122882, 122648, 121795, 120869, 120349, 120293, 120473]
56560A20473J90J21J19K65N52Q64R90P35J08n24o67k39K66L76L10O39J374J856
56542A27808J647J083P00N68N51P29J065J060L70l84k01Q97J726J421M99Q6N73
56525A40198J382J777J490Q37M46P22J330J452Q12R6M7M63N98L12K01O66J355
56508A54184J740J771J741J781J768J614J450J507J866K301K462K273K009J939
56494A80406K062K308K798L498L880L324J905M04m55n34j15M17O74M27j69o98
56478B00132r28r57r16q03o24m70m40n88r66j524k014k165j872j156j73N62M44
56461A85542l76q49l13M82L38p35j635j792j627j455j025m07k43p29j205j264
56445A72707j387j912k248j781q47j16L62P46P35J21n30n94m09o28j002p22K71
$$ y = [120473, 120663, 120784, 120903, 121168, 121720, 122584, 123574, 124309, 124417, 123893, 123226, 122987, 123253, 123629, 123939, 124578, 125952, 127808, 129455, 130538, 131238, 131806, 132357, 133086, 134151, 135211, 135581, 135197, 134996, 135893, 137619, 139040, 139539, 139625, 140198, 141580, 143357, 144847, 145684, 146130, 146852, 148182, 149634, 150446, 150542, 150589, 151052, 151650, 151962, 152163, 152829, 154184, 155924, 157695, 159436, 161217, 162985, 164599, 166049, 167556, 169422, 171723, 174185, 176458, 178467, 180406, 182468, 184776, 187574, 191072, 194952, 198276, 200181, 200585, 200130, 199596, 199481, 199898, 200572, 200999, 200830, 200132, 199204, 198247, 197331, 196528, 195904, 195434, 194994, 194406, 193440, 191916, 189902, 187737, 185865, 184709, 184536, 185098, 185542, 185166, 184317, 184004, 184486, 184824, 184089, 182454, 180662, 179035, 177580, 176555, 176148, 175905, 175176, 173971, 172707, 171320, 169408, 167160, 165379, 164532, 164416, 164778, 165524, 166259, 166380, 165850, 165256, 164847, 164219, 163217, 162495, 162766]
56428A62766J179J501J398J091O09J65k6k01o53r76m82O53J467J518J352J538
56412A72899J923K075J868J405Q40M63N57J033J583K161K852L369L277K723K349
56397B01377K362K319J977J758K110K847L318K957J687J39o63l19L68M25L0J08
56381B22800P03R11L99j09k25n74j526k255j971j239j079j393j288o57l16o72
56365B11509j245j631k005k454k496j790p73j86j45j84p9j30n60j017j006o28
56349A95180m82p37p85p3J028J588J200K88n13q29n28K52J015J241R57O46N79
56332B00027O66Q44J129J258Q39P4k76J29P49R23O49L52L12O40J355K105K224
56315B13999J444L57k41j56K58O85R37P75J21n67n70M13J957L241L596K954J952
$$ y = [162766, 163945, 165446, 166844, 167935, 168544, 168709, 168683, 168482, 167829, 166853, 166371, 167024, 168491, 170009, 171361, 172899, 174822, 176897, 178765, 180170, 181010, 181473, 182030, 183063, 184646, 186807, 189659, 193028, 196305, 199028, 201377, 203739, 206058, 208035, 209793, 211903, 214750, 218068, 221025, 222712, 222851, 222188, 221869, 222237, 222662, 222692, 222800, 223503, 224414, 224813, 224704, 224479, 223905, 222379, 220124, 218153, 216914, 215835, 214442, 213154, 212497, 212181, 211509, 210264, 208633, 206628, 204174, 201678, 199888, 199115, 198929, 198784, 198600, 198521, 198391, 197831, 196814, 195808, 195180, 194698, 193961, 193176, 193103, 194131, 195719, 196919, 197207, 196694, 195865, 195337, 195589, 196604, 197845, 198802, 199448, 200027, 200693, 201537, 202666, 203924, 204763, 204837, 204561, 204690, 205439, 206362, 207011, 207363, 207675, 208315, 209670, 211775, 213999, 215443, 215800, 215559, 215403, 215661, 216346, 217283, 218058, 218179, 217612, 217042, 217455, 219412, 222653, 226249, 229203, 231155]
56298B31155J427J663K198K447K181J461M89k54j96O44J472J627J359J377J849
56283B50899K341K570K742L045L280L126K543J732Q94K45J49R37K416L764M117
56268B84800L414K397J797J758K161K952L924M518M479M377M887N735O024N570
56254C38793N164N423O090O731P407Q255Q936Q942Q295P523P132P228P426P087
56240D40432N930M506L725L871M355M555M398M115L852L754M050M827N900O977
56226E05247P785Q176Q393R042J0353J1783J2867J4064J5931J7858J8813J9180
56214F59492K0515K3257K6084K7972K9530L1676L4225L6808L9949M4165M8778
56203A022451N2900N6909O1731O7197P2383P7275Q2843Q9415R6118J02124J07525
$$ y = [231155, 232582, 234245, 236443, 238890, 241071, 242532, 243021, 242767, 242571, 243215, 244687, 246314, 247673, 249050, 250899, 253240, 255810, 258552, 261597, 264877, 268003, 270546, 272278, 273172, 273417, 273566, 274503, 276919, 280683, 284800, 288214, 290611, 292408, 294166, 296327, 299279, 303203, 307721, 312200, 316577, 321464, 327199, 333223, 338793, 343957, 349380, 355470, 362201, 369608, 377863, 386799, 395741, 404036, 411559, 418691, 425919, 433345, 440432, 446362, 450868, 454593, 458464, 462819, 467374, 471772, 475887, 479739, 483493, 487543, 492370, 498270, 505247, 513032, 521208, 529601, 538643, 548996, 560779, 573646, 587710, 603641, 621499, 640312, 659492, 680007, 703264, 729348, 757320, 786850, 818526, 852751, 889559, 929508, 973673, 1022451, 1075351, 1132260, 1193991, 1261188, 1333571, 1410846, 1493689, 1583104, 1679222, 1781346, 1888871]
56192A888871J12733J17609J21534J23906J24421J23052J19761J14126J05581
56183B951594R4234Q1030O6738N1290L4568J7402J102j3590k6601l7949m7780
56172C172038n6510o4263p0373p4166p5996p6976p7863p8842q0019q1371q2446
56161B353213q2869q3027q3551q4285q4398q3460q1727p9578p7315p5268p3369
56150A464366p0788o6840o2128n8004n4859n1875m8436m4815m1280l7544l3589
56139H94208l0218k8144k6947k5555k3462k1048j8844j6946j5131j3321j1764
56128F62828j0780j0359j0105r595q692p463o091m902m173l707k908j499J04J443
56114E84101K597L828N044N960O521O794O836O952P635Q827R725R835R723J0184
$$ y = [1888871, 2001604, 2119213, 2240747, 2364653, 2489074, 2612126, 2731887, 2846013, 2951594, 3045828, 3126858, 3193596, 3244886, 3279454, 3296856, 3297958, 3284368, 3257767, 3219818, 3172038, 3115528, 3051265, 2980892, 2906726, 2830730, 2753754, 2675891, 2597049, 2517030, 2435659, 2353213, 2270344, 2187317, 2103766, 2019481, 1935083, 1851623, 1769896, 1690318, 1613003, 1537735, 1464366, 1393578, 1326738, 1264610, 1206606, 1151747, 1099872, 1051436, 1006621, 965341, 927797, 894208, 863990, 835846, 808899, 783344, 759882, 738834, 719990, 703044, 687913, 674592, 662828, 652048, 641689, 631584, 621989, 613297, 605834, 599743, 594841, 590668, 586961, 584053, 582554, 582658, 584101, 586698, 590526, 595570, 601530, 608051, 614845, 621681, 628633, 636268, 645095, 654820, 664655, 674378, 684562]
56100F84562J1105J1793J2048J2112J1914J1132R850Q492P279O317N943O305O879
56087H05731P165P610R033J1310J3493J5311J7594K1040K5258K9345L2939L6359
56075A032188M0045M4134M8347N2140N4838N5689N4123N0406M5901M2050L9001
56064A558862L5903L2502K9344K6251K1848J5405P964Q17o022j2740j8268k1496
56052A670370k3250k5627k9688l5037m1050m7037n1574n3331n2543n0498m7747
56041A212988m4122m0101l6516l2997k8375k2824j7967j4561j1699q761o527n578
56029I42960n026l865k562k244k932l582l509k971k568k596k878k910k294j133
56015I01890J15J163K057K951L979N170O209O636O561O700P386Q199Q993J0434
$$ y = [684562, 695667, 707460, 719508, 731620, 743534, 754666, 764516, 773008, 780287, 786604, 792547, 798852, 805731, 812896, 820506, 829539, 840849, 854342, 869653, 887247, 908287, 933545, 962890, 995829, 1032188, 1072233, 1116367, 1164714, 1216854, 1271692, 1327381, 1381504, 1431910, 1477811, 1519861, 1558862, 1594765, 1627267, 1656611, 1682862, 1704710, 1720115, 1728079, 1728896, 1722874, 1710134, 1691866, 1670370, 1647120, 1621493, 1591805, 1556768, 1515718, 1468681, 1417107, 1363776, 1311233, 1260735, 1212988, 1168866, 1128765, 1092249, 1059252, 1030877, 1008053, 990086, 975525, 963826, 955065, 948538, 942960, 937934, 934069, 931507, 929263, 926331, 922749, 919240, 916269, 913701, 911105, 908227, 905317, 903023, 901890, 902005, 903168, 905225, 908176, 912155, 917325, 923534, 930170, 936731, 943431, 950817, 959016, 968009, 978443]
56001I78443J2701J4643J5210J5034J5386J6226J6564J6208J5822J5674J5705
55990A147616J6370J8032J9820K0574K0660K1446K3216K4986K6257K7447K8728
55979A395152K9821L0946L2631L4577L5975L6768L7534L8363L9107M0228M2104
55968A793206M4038M5442M7336N0924N5361N8833O1398O4573O8503P1764P3894
55957B435272P5994P8764Q1982Q5833R0767R6025J00367J04126J08655J13936
55947C371721J18935J23988J30493J38368J46216J53805J62024J70574J78336
55938D694460J85823J94677K04972K15768K27865K42969K60360K77696K94952
55929F799542L14121L35126L55685L75388L96274M19155M43093M68643M97802
$$ y = [978443, 991144, 1005787, 1020997, 1036031, 1051417, 1067643, 1084207, 1100415, 1116237, 1131911, 1147616, 1163986, 1182018, 1201838, 1222412, 1243072, 1264518, 1287734, 1312720, 1338977, 1366424, 1395152, 1424973, 1455919, 1488550, 1523127, 1559102, 1595870, 1633404, 1671767, 1710874, 1751102, 1793206, 1837244, 1882686, 1930022, 1980946, 2036307, 2095140, 2156538, 2221111, 2289614, 2361378, 2435272, 2511266, 2590030, 2672012, 2757845, 2848612, 2944637, 3045004, 3149130, 3257785, 3371721, 3490656, 3614644, 3745137, 3883505, 4029721, 4183526, 4345550, 4516124, 4694460, 4880283, 5074960, 5279932, 5495700, 5723565, 5966534, 6226894, 6504590, 6799542, 7113663, 7448789, 7804474, 8179862, 8576136, 8995291, 9438384, 9907027, 10404829]
55920A0404829N30491N64920O01461O42112O86483P32882P83004Q40406R04596
55911A6691184R72476J045469J128962J224494J329552J445789J580572J740159
55903B7158657J929442K158757K440990K779355L166733L599186M081452M619577
55895E1934149N221188N905936O703297P637860Q728218R994827J1445248J3051604
55887A20622327J4761777J6493147J7998656J8677581J7643668J4224299Q558142
55880B28979597J706737m888787j0137748j3640349j5538671j6201341j6018934
55873A54260504j5322177j4342902j3210479j1995624j0757769r552744q419088
55866G0659721p377967o442598n618525m900910m280651l750600l302113k921358
$$ y = [10404829, 10935320, 11500240, 12101701, 12743813, 13430296, 14163178, 14946182, 15786588, 16691184, 17663660, 18709129, 19838091, 21062585, 22392137, 23837926, 25418498, 27158657, 29088099, 31246856, 33687846, 36467201, 39633934, 43233120, 47314572, 51934149, 57155337, 63061273, 69764570, 77402430, 86130648, 96125475, 107570723, 120622327, 135384104, 151877251, 169875907, 188553488, 206197156, 220421455, 228979597, 230686334, 225797547, 215659799, 202019450, 186480779, 170279438, 154260504, 138938327, 124595425, 111384946, 99389322, 88631553, 79078809, 70659721, 63281754, 56839156, 51220631, 46319721, 42039070, 38288470, 34986357, 32064999]
55858C2064999k594588k313444k071705j861499j676326j513903j372597j248345
55850A7412592j137483j039058r52059q73612q01922p37741o81265o30743n85434
55841I973275n46302n12380m80124m48158m18933l93938l70812l47244l24377
55832F131007l03993k85399k67449k51002k36969k24111k11037j98423j87302
55823C965322j76983j66510j56477j47731j39855j32365j25890j20849j16387
55814B682275j11791j07444j03515r9360r5103r1885q9571q6084q0243p3467o7522
55803A676290o2304n7073n2121m7906m4132m0961l9572m0223m1190m0937l9891
55792A169980l8889l7398l4731l1715k9600k8272k6892k5339k3808k1923j9474
$$ y = [32064999, 29470411, 27156967, 25085262, 23223763, 21547437, 20033534, 18660937, 17412592, 16275109, 15236051, 14283992, 13410380, 12608458, 11870717, 11189452, 10558709, 9973275, 9426973, 8914593, 8434469, 7986311, 7567378, 7173440, 6802628, 6455384, 6131007, 5827014, 5541615, 5274166, 5023164, 4786195, 4562084, 4351047, 4152624, 3965322, 3788339, 3621829, 3465352, 3317621, 3177766, 3045401, 2919511, 2798662, 2682275, 2570484, 2463040, 2359525, 2260165, 2165062, 2073177, 1983606, 1897522, 1817279, 1743812, 1676290, 1613986, 1556913, 1504792, 1456886, 1412754, 1371793, 1332221, 1291998, 1250808, 1209871, 1169980, 1131091, 1093693, 1058962, 1027247, 997647, 969375, 942483, 917144, 893336, 871413, 851939]
55781H51939j7230j5921j5126j4080j2745j1280r482p579o560o691o757n773m487
55768G18228m077m282m089l510l453m261n535p016q774j0658j2371j3785j4751
55755F21666j4975j4522j3988j3683j3233j2323j1209j0204r254q382p812p391
55743D84690o648n679n143n009m367k884j443q11o69n12m87p15p46m55n65j575
55727D46982k925l897m514m942m883m328m036m436m807m334l304k512k251k610
55713C93203m009o458q925j0332j0693j0593j0102r037p809p072o811o538o097
55700B88727n746n667n879o279o471o020n249n143o030o980p064o526o222o396
55686B03055o684o695o102m612k534q83m14q56j475j884j970j648j094p36o76
$$ y = [851939, 834709, 818788, 803662, 789582, 776837, 765557, 756075, 748496, 741936, 735245, 728488, 722715, 718228, 714151, 709869, 705780, 702270, 698817, 694556, 689021, 682005, 673231, 662573, 650202, 636417, 621666, 606691, 592169, 578181, 564498, 551265, 538942, 527733, 517529, 508275, 499893, 492081, 484690, 478042, 472363, 467220, 462211, 457844, 454960, 453517, 452706, 452037, 451525, 451038, 450323, 449577, 449122, 448557, 446982, 444057, 440160, 435646, 430704, 425821, 421493, 417457, 413021, 408214, 403880, 400576, 398064, 395813, 393203, 389194, 382736, 373811, 363479, 352786, 342193, 332091, 323054, 315245, 308173, 301362, 294824, 288727, 282981, 277314, 271435, 265156, 258685, 252665, 247416, 242273, 236243, 229263, 222199, 215673, 209451, 203055, 196371, 189676, 183574, 178962, 176428, 175545, 175131, 174275, 172800, 170916, 168946, 167298, 166204, 165468, 164792]
55671A64792o08n58q64j339j310q23p77j436j920j756j711k390l137l253l178
55656A39732l455l463k484j132m89m24q0N62Q76R46J388K159K590K554K535K643
55640A44458K444J680M94r01k098k451j840j077q61q20l64K00L63O12J715L205
55624A44759L875L562L236L452L825M024M132L982L270K281J636J200K96r77j706
55609A80847j646j646k264k888k727j889j017m27l5L20P82J363J797J840J689
55594A74099J735J919J897J736J825K031J765R24J50j22k32o26j149j399j437
55579A83116j772k726l944m577m077k933k333k834l695l978l853m162m982n443
55565A31807m985m011l218k887k992l417l770l529k647j715j338j494j652j320
$$ y = [164792, 164184, 163626, 162762, 161423, 160113, 159290, 158513, 157077, 155157, 153401, 151690, 149300, 146163, 142910, 139732, 136277, 132814, 130330, 129198, 128709, 128285, 128205, 128767, 129643, 130589, 131977, 134136, 136726, 139280, 141815, 144458, 146902, 148582, 149076, 148175, 146077, 143626, 141786, 140709, 139848, 139028, 138664, 138864, 139227, 139839, 141554, 144759, 148634, 152196, 155432, 158884, 162709, 166733, 170865, 174847, 178117, 180398, 182034, 183234, 183530, 182553, 180847, 179201, 177555, 175291, 172403, 169676, 167787, 166770, 166343, 166308, 166628, 167410, 168773, 170570, 172410, 174099, 175834, 177753, 179650, 181386, 183211, 185242, 187007, 187931, 188081, 187959, 187727, 187101, 185952, 184553, 183116, 181344, 178618, 174674, 170097, 166020, 163087, 160754, 157920, 154225, 150247, 146394, 142232, 137250, 131807, 126822, 122811, 119593, 116706, 113714, 110297, 106527, 102998, 100351, 98636, 97298, 95804, 94152, 92832]
55551I2832n68r6n88j826k763k739k220j932j743j038Q9Q37P75K45k50m80l89
55534G8146r3L2k35n53m90j31J81M29N73J36j044k048j873r43n09p60p51j92J03
55515F9978j42j2R73J806J428L54j37K68Q21R02M77k27q00o52L01J243J276N02
55497G8359k88p23j042j379j514j380j241j271j334j245r87n92j26K05J68j88
55481F5422n14n20k33J52N15Q77J268J581J574J136N48L44Q33J822K753L058K459
55464H3075J168j14o46k52N45J079J148J044J061J134R17J78r55k071k728k674
55448H1909k031j371j381k151k878k689j718r51r75j351j414j107q38r08j378
55433E8768k095k588k378j726j487j909k155j538n92j91k65k24j74o60j458j668
$$ y = [92832, 92264, 92168, 91580, 89754, 86991, 84252, 82032, 80100, 78357, 77319, 77408, 78245, 79020, 79265, 79015, 78535, 78146, 78053, 78085, 77850, 77297, 76807, 76676, 76857, 77286, 77859, 77995, 76951, 74903, 73030, 72087, 71578, 70818, 70067, 69875, 69978, 69836, 69824, 70797, 72603, 74031, 74385, 74248, 74516, 75337, 76239, 76716, 76489, 75689, 75037, 75338, 76581, 77857, 78359, 78071, 77348, 76306, 74927, 73413, 72033, 70792, 69521, 68187, 66942, 65955, 65363, 65237, 65442, 65610, 65422, 64908, 64388, 64155, 64307, 64822, 65699, 66967, 68548, 70122, 71258, 71806, 72150, 72983, 74805, 77558, 80616, 83075, 84243, 84129, 83483, 83231, 83776, 84855, 86003, 87047, 88108, 89242, 90159, 90337, 89382, 87311, 84583, 81909, 79878, 78507, 77126, 74975, 72097, 69408, 67690, 66739, 65764, 64413, 62999, 61892, 61054, 60146, 58768, 56673, 54085, 51707, 49981, 48494, 46585, 44430, 42892, 42300, 42109, 41844, 41620, 41446, 40786, 39328, 37660]
55417C7660j091n07n01p51p32m03l2J18j63p81j156q38k54j68n49p17n51o82j297
55398B6605j689j343o79l57m18m87l37O5O23R73P69K50L3K31L90L45M78Q43Q34
55379B7129Q6r23j532j634j352o34L78J059R67M84L77Q84J532J625Q58k80p44
55362B8280o6Q12N33q08j652j059J21N98K56k46o58j099j351j053l31M14J082
55345B3773J634J674Q88k82j009r43l06N84J407J758J477R33M92l6r21j814k062
55328B7247j570q36k20K67N15K37n57j295j277l10R90J648J252M67K66O55P39
55311B8218P2p83j323j800k362k277r51Q65J804J497O50j64q40j087n50L46N41
55294B1856l07j316j528r93m24k40l16l38j11L09O39O30L98K90M19N10K58l19
$$ y = [37660, 36569, 36062, 35561, 34810, 34078, 33675, 33643, 33761, 33598, 32817, 31661, 30823, 30569, 30401, 29852, 29135, 28584, 27902, 26605, 24916, 23573, 22894, 22537, 22119, 21632, 21295, 21360, 21983, 22956, 23725, 23975, 24008, 24239, 24629, 24974, 25452, 26295, 27129, 27215, 26292, 24760, 23126, 21774, 21140, 21518, 22577, 23544, 24028, 24405, 25289, 26821, 28446, 29304, 29024, 28280, 28214, 29026, 29559, 28751, 27099, 26040, 26161, 26759, 27015, 26769, 26111, 25012, 23661, 22608, 22277, 22691, 23773, 25407, 27081, 27969, 27687, 26678, 25735, 25429, 26013, 27420, 29178, 30655, 31588, 32080, 32044, 31123, 29309, 27247, 25677, 24841, 24621, 24888, 25403, 25640, 25083, 23788, 22511, 22201, 23191, 24839, 26091, 26558, 26824, 27479, 28218, 28290, 27507, 26184, 24384, 22022, 19745, 18794, 19659, 21463, 22960, 23610, 23446, 22606, 21519, 20969, 21315, 21856, 21549, 20233, 18705, 17712, 17288, 17048, 16732, 16394, 16283, 16592, 17231, 17861, 18259, 18549, 18968, 19478, 19736, 19417]
55276A9417q41p95L9J237J910J519N09j47L3N86O92Q8o40p18k01l9q71k003k254
55257A7521j622j189j284q65P44K505K999K309J546J086M04o13j402j747j964
55242A8428k000j293K19J669K207J757P28m34j255j371r11l15K88J062J822K040
55226B2641J588R46N26K84Q7p0k79o35q00k97O65J229R51K31m46j011j351j043
55208B3216q0P37O64n0n62m80p8K32K70J05k1P6J84m8m33k57P21J720J839J162
55188B8917M43K2m06r86j352j190p30m57m97n56l80j20j13m16o65n18n7M07P65
55169B2111J079J289J213R19O62M71J10m09o59l34K64M99Q1o47j001o05K29P85
55151B6057P61N90P40J043J082R07Q37P54L38j94l37j90k92n15j40P52J019P2
$$ y = [19417, 18576, 17781, 17820, 19057, 20967, 22486, 22995, 22848, 22881, 23467, 24159, 24247, 23607, 22889, 22688, 22649, 21778, 19775, 17521, 15899, 14710, 13426, 12561, 13305, 15810, 18809, 21118, 22664, 23750, 24154, 23541, 22139, 20392, 18428, 16428, 15135, 15354, 17023, 19230, 20987, 21715, 21281, 20026, 18655, 17744, 17429, 17717, 18779, 20601, 22641, 24229, 25175, 25701, 25985, 26072, 26002, 25723, 25088, 24288, 23991, 24656, 25885, 26836, 27067, 26621, 25610, 24259, 23216, 23136, 23873, 24537, 24487, 23925, 23445, 23367, 23599, 23869, 23974, 23953, 24029, 24213, 24165, 23732, 23475, 24196, 25916, 27755, 28917, 29360, 29382, 28976, 27990, 26638, 25448, 24718, 24261, 23764, 23208, 22828, 22708, 22595, 22179, 21514, 20996, 20939, 21346, 22111, 23190, 24479, 25692, 26611, 27273, 27744, 27854, 27445, 26786, 26452, 26716, 27215, 27296, 26649, 25648, 25043, 25272, 26057, 26818, 27408, 28148, 29191, 30273, 31180, 32017, 32771, 33109, 32915, 32578, 32388, 32096, 31581, 31441, 32193, 33212, 33284]
55133C3284j158j570j256q27k03Q17J476Q93l53p09K02J127J053M48K07L13K21
55116C3965j21l76n54r38j420j515j088n70l92m39l08Q8L44P5n58r93r12n63k99
55097B3426o5L46P14N06l11r60p25J17N76J32o25p15J29J184J570J071J85m28
55079B6127m40k6K21k26j175j660r65M02J181Q76K82K68O77P96N09K88K64M3m91
55060B6951p77k49R18J957K255J792J015M22J61Jk80m97k25O15J522J876J525
55043C8982Q41K85n7m78j145j616j172K18J547J742R00Q3k2K32K42O7J39M56N62
55024D1806K54j39k13J10O50J187J477J351R20N04K00k12q11j186q71l0O92R57
55006D6646J023J128J076O11p9o31j024j456j803j651q68J76R45J078M89n10j225
$$ y = [33284, 32126, 30556, 29300, 28473, 28270, 29087, 30563, 31456, 31103, 30394, 30596, 31723, 32776, 33224, 33431, 33744, 33965, 33844, 33468, 32914, 31976, 30556, 29041, 27953, 27383, 26991, 26552, 26244, 26332, 26676, 26751, 26193, 25200, 24288, 23725, 23426, 23361, 23707, 24421, 24927, 24616, 23656, 22931, 23048, 23624, 23756, 23131, 22416, 22545, 23729, 25299, 26370, 26555, 26127, 25687, 25661, 25882, 25656, 24481, 22821, 21856, 22258, 23439, 24315, 24597, 24865, 25542, 26338, 26847, 27135, 27399, 27442, 26951, 26174, 25925, 26843, 28800, 31055, 32847, 33862, 34284, 34445, 34446, 34166, 33669, 33444, 34059, 35581, 37457, 38982, 39823, 40108, 40051, 39573, 38428, 36812, 35640, 35858, 37405, 39147, 40047, 40130, 40108, 40340, 40582, 40649, 40788, 41244, 41806, 42060, 41921, 41708, 41818, 42468, 43655, 45132, 46483, 47403, 47907, 48107, 47895, 47084, 45898, 45027, 44997, 45689, 46646, 47669, 48797, 49873, 50484, 50405, 49774, 48750, 47294, 45491, 43840, 42972, 43148, 44093, 45171, 45660, 45150, 43925]
54989D3925j157o16l84p25j121j104q20n31j38L90N88P7o76q12j15Q11J345J289
54971D0226O56l88j291j393o83P6K71J65M35J200J814J632P25j35k57L05Q61Q90
54953D5109N40K78K08J28QJ22O12J288J900K289K204J387%j299j946j981j766
54936D9081j452r85m38j5K20L74M89N08M34L62L24K53J45J16J84J67j27n58o70
54917D8412j31P66J232P49k68p72j44J115J904J707J061Q16J061J047K68p28r30
54900E7165j36Q13J148J080J207J543J645J496J606K256L169M064M985N892O408
54885I4341O307N906N663N727O049O624P314P755P715P259O336M653K353K03j372
54870A72833l000n301p562q435p849p144p139p156o402n305m707m505l996l152
$$ y = [43925, 42768, 42152, 41768, 41043, 39922, 38818, 37998, 37467, 37329, 37719, 38307, 38384, 37708, 36896, 36781, 37592, 38937, 40226, 40882, 40494, 39203, 37810, 37127, 37203, 37474, 37639, 38074, 39274, 41088, 42720, 43445, 43310, 43053, 43358, 44219, 45109, 45649, 45927, 46135, 46263, 46271, 46393, 47005, 48293, 50193, 52482, 54686, 56073, 56073, 54774, 52828, 50847, 49081, 47629, 46644, 46206, 46191, 46411, 46785, 47274, 47782, 48216, 48578, 48902, 49155, 49300, 49416, 49600, 49767, 49640, 49082, 48412, 48281, 49047, 50279, 51028, 50760, 49988, 49844, 50959, 52863, 54570, 55631, 56447, 57508, 58555, 58823, 58095, 57165, 57029, 57842, 58990, 60070, 61277, 62820, 64465, 65961, 67567, 69823, 72992, 77056, 82041, 87933, 94341, 100648, 106554, 112217, 117944, 123993, 130617, 137931, 145686, 153401, 160660, 166996, 171649, 174002, 174205, 172833, 169833, 164532, 156970, 148535, 140686, 133542, 126403, 119247, 112845, 107540, 102833, 98328, 94332, 91180]
54856I1180k586k420k090j322n33p6K52P35J308J882K571L298L614L408L360M176
54840A06757N511O300O123N623N538N858O192O407O391N565L410M02k227l880
54826A63970n129o615p979q425p933p254o890o781o860p141p193o329m664l299
54812G1478k968l096k734j874j163q07n26l49n64j011j143q50m65l1O99J425J375
54795E7396M75l32l28J17L98N45P30N48l92j616k306k321k034j469m91M06L93
54778D9719n19j416j659j445j091n60N7K98j1m18n83p88j291j662j321m53K82
54761C7139P27J287K029K402K040J426J302J675J819J268M69J97N63R73J026R69
54745E7311J078J121Q44O26J030J851K332K286K301K745L279L590L915M451M942
$$ y = [91180, 88594, 86174, 84084, 82762, 82229, 82153, 82405, 83140, 84448, 86330, 88901, 92199, 95813, 99221, 102581, 106757, 112268, 118568, 124691, 130314, 135852, 141710, 147902, 154309, 160700, 166265, 169675, 170077, 167850, 163970, 158841, 152226, 144247, 135822, 127889, 120635, 113745, 106964, 100104, 92963, 85770, 79441, 74777, 71478, 68510, 65414, 62680, 60806, 59643, 58836, 58310, 57961, 57397, 56386, 55243, 54393, 53928, 53897, 54596, 56021, 57396, 57871, 57539, 57211, 57328, 57726, 58271, 59001, 59549, 59157, 57541, 55235, 52914, 50880, 49411, 48920, 49326, 49719, 49200, 47784, 46125, 44680, 43589, 43029, 43086, 43384, 43373, 42955, 42372, 41584, 40293, 38631, 37310, 36857, 37139, 37866, 39153, 41182, 43584, 45624, 47050, 48352, 50027, 51846, 53114, 53583, 53780, 54343, 55316, 56342, 57311, 58389, 59510, 60354, 60980, 62010, 63861, 66193, 68479, 70780, 73525, 76804, 80394, 84309, 88760, 93702]
54730I3702N313O036P245Q104P895P284P509Q514Q923P915O137M527L128J462
54716A83694o02k819m834o096o110n285m895n586o425o136m839l719l279k898
54702A20171k153j504j349j270p40J4M67O64J036J642K173K572L078L729M387
54687A32917N154O223P296P746P544P461Q037Q811Q965Q338P343O127M415K109
54673B28486l91k634m506o112p484q510r094r283r347r571r847r601q422o711
54659A26973n375m836m697m412l964l657l504l217k681k188k060k245k347k093
54645G9697j630j293j129q66m37k04m44q31q43o05p73j464j828j046N55J802J953
54628G0614J314O45L61M07N79O87N04j00q50j100m20Q37J777J871J403R40O36
$$ y = [93702, 99015, 105051, 112296, 120400, 128295, 135579, 143088, 151602, 160525, 168440, 174577, 179104, 182232, 183694, 183092, 180273, 175439, 169343, 163233, 157948, 153053, 147467, 141042, 134906, 130067, 126348, 123069, 120171, 118018, 116514, 115165, 113895, 113155, 113169, 113636, 114300, 115336, 116978, 119151, 121723, 124801, 128530, 132917, 138071, 144294, 151590, 159336, 166880, 174341, 182378, 191189, 200154, 208492, 215835, 221962, 226377, 228486, 228095, 225461, 220955, 214843, 207359, 198849, 189755, 180472, 171125, 161554, 151707, 142106, 133684, 126973, 121598, 116762, 112065, 107653, 103689, 100032, 96528, 93311, 90630, 88442, 86382, 84137, 81790, 79697, 78067, 76774, 75645, 74779, 74342, 74138, 73694, 72863, 72020, 71415, 70642, 69178, 67350, 66304, 66859, 68661, 70614, 71928, 72573, 72934, 73341, 73920, 74607, 75111, 75011, 74161, 73061, 72641, 73478, 75255, 77126, 78529, 79469, 80105]
54611H0105L47J34K72Q03J474K076K515K628K340J964J876J885J435N68J35P05
54595A01262J762K317K004J257O78N99R24J135P12j48n77j04P45J285J672K412
54579A17935L292L599L260L020L365L972M356M548M857N401O101O820P296P201
54565A85023O436N177L607J852J55j263k574m133n812o920o999o431n950n829
54551A56339n771n407m704l977l585l536l392k749j792j123j028j211j304j289
54537A15471j311j425j624j884k028j865j553j443j494j279p98p33j501k477k710
54522I1346k138j561j544j909k311k681k924k654j627l04L69j53j405k295k137
54507F6072j304p26p94r83o93n2L63L90L79N04M26j70r93j402j073l13L15M82
$$ y = [80105, 80452, 80586, 80858, 81661, 83135, 85211, 87726, 90354, 92694, 94658, 96534, 98419, 99854, 100422, 100557, 101262, 103024, 105341, 107345, 108602, 109280, 109879, 110803, 111938, 112650, 112502, 111925, 111821, 112566, 113851, 115523, 117935, 121227, 124826, 128086, 131106, 134471, 138443, 142799, 147347, 152204, 157605, 163706, 170526, 177822, 185023, 191459, 196636, 200243, 202095, 202250, 200987, 198413, 194280, 188468, 181548, 174549, 168118, 162168, 156339, 150568, 145161, 140457, 136480, 132895, 129359, 125967, 123218, 121426, 120303, 119275, 118064, 116760, 115471, 114160, 112735, 111111, 109227, 107199, 105334, 103781, 102338, 100844, 99565, 98767, 98034, 96533, 94056, 91346, 89208, 87647, 86103, 84194, 81883, 79202, 76278, 73624, 71997, 71693, 72062, 71909, 70504, 68209, 66072, 64768, 64042, 63248, 62265, 61572, 61520, 61883, 62273, 62652, 63156, 63582, 63412, 62419, 61017, 59944, 59631, 59946, 60428]
54489F0428K45j18l42l01q4J7k78q49j160q06n3M53M70L92O06R94J227J267J298
54470F3406J374J427J501J731K138K624L046L170K787K140J908K523L551M162
54456I7488M013L345K401J271K40k97m29p50j611k625l196l232l113l191l513
54441H6801l884l997l604k749j787j087q26r47j161j040m72Mk48r73j119j94J002
54424F3719J383Q98L08O9Q9L52R34J389R66k84j274j156l44K57M88Q37J378J607
54406G1616J345J098J282J574J380O72m1l48k38J47O75J170J381J193O98P0n09
54389H3165q30p52m44l60p74j431j776j526r34n55p53j430k063k113j522q25n91
54372F4486q30j067r56n98k64p3j2L6L44J112J960K020R41m51r52l46N10Q99R38
$$ y = [60428, 60673, 60555, 60213, 59912, 59828, 59845, 59567, 58718, 57558, 56752, 56699, 57152, 57622, 58014, 58620, 59614, 60841, 62108, 63406, 64780, 66207, 67708, 69439, 71577, 74201, 77247, 80417, 83204, 85344, 87252, 89775, 93326, 97488, 101501, 104846, 107247, 108518, 108758, 108461, 108032, 107282, 105671, 103046, 99850, 96618, 93505, 90314, 86801, 82917, 78920, 75316, 72567, 70780, 69693, 68867, 67920, 66759, 65719, 65247, 65251, 65003, 64030, 62911, 62717, 63719, 65102, 66000, 66308, 66377, 66466, 66818, 67752, 69141, 70107, 69823, 68549, 67393, 67049, 67306, 67794, 68631, 70009, 71616, 72961, 74059, 75341, 76915, 78295, 78967, 78926, 78578, 78340, 78487, 79162, 80332, 81713, 82906, 83604, 83674, 83165, 82335, 81583, 81139, 80779, 80005, 78574, 76798, 75272, 74338, 73783, 73030, 71600, 69537, 67424, 65902, 65077, 64486, 63656, 62589, 61633, 61035, 60771, 60698, 60686, 60722, 61066, 62178, 64138, 66158, 67099, 66648, 65696, 65350, 65860, 66759, 67697]
54353F7697R70R01N67K58L52P30R95J164J556K082K164J541P38N13J067J903K378
54336H7576K210J631J110R11R48J076J361J863K309K334J926J339O40k13r30j095
54320A04996q34p65j054j181q88p94j494k544l007k684k162j813j456r91o45n13
54304H2171m23m19q24j577k047j782j046l44J99N86N54p6q29q98n4J090J752J671
54286G7704J148O59N41Q26J294J674J847J843J727J554J363J146R71J053J510
54271I6860J899J384k71k115k836k188j134n84m85l68k33m18q77j188j275j528
54255H4643k089k498k352j972j934k239k356k101j865j940k096k017j775j498
54241E5911r77l5Q98J075L22p82j601j984j982j549p57n7R4j83k75J99Q92J176
$$ y = [67697, 68667, 69568, 70135, 70393, 70745, 71475, 72470, 73634, 75190, 77272, 79436, 80977, 81715, 82228, 83295, 85198, 87576, 89786, 91417, 92527, 93438, 94386, 95462, 96823, 98686, 100995, 103329, 105255, 106594, 107234, 107021, 106091, 104996, 104162, 103397, 102343, 101162, 100274, 99480, 97986, 95442, 92435, 89751, 87589, 85776, 84320, 83329, 82684, 82171, 81748, 81329, 80505, 78928, 76881, 75099, 74053, 73709, 73908, 74494, 75048, 74972, 74143, 73245, 73191, 74281, 76033, 77704, 78852, 79511, 80052, 80878, 82172, 83846, 85693, 87536, 89263, 90817, 92180, 93326, 94297, 95350, 96860, 98759, 100143, 99872, 97757, 94921, 92733, 91599, 91015, 90530, 90162, 89929, 89511, 88634, 87446, 86171, 84643, 82554, 80056, 77704, 75732, 73798, 71559, 69203, 67102, 65237, 63297, 61201, 59184, 57409, 55911, 54934, 54899, 55797, 56872, 57194, 56412, 54811, 52827, 50845, 49296, 48539, 48482, 48576, 48393, 48118, 48317, 49209, 50385]
54223E0385Q66L85J61J19o0l56l78O1O47Q93O17K6m33l11M53J300J550J268J181
54204E8374J563J799J408R30J066J465J151j8j176j688j738j611j203n29nO7j33
54187E9722l18l92k43J48L50j39j048j520j294r18o64j86M31L87m18p49K64J617
54169E5030J761P63J2K02Q06J257J468J284N30k90m09O4K56j44n84p30q42q74
54151E9560l23P36J395J127M54nl06n52l82L03Q21O46J79l8k99j143k274k888
54133E7011k717k119j380o93m67r00j402j182l23M26P80J096J466J454R43M37
54117E2430K69O6n44j168j095k55O96J134R82N00p0n52p34m98p7O4k49n76l52
54098D9971L09O92M01j06k32j05l18r54j343q53L41J398J587R11M2l56k43j00
$$ y = [50385, 51251, 51636, 51797, 51916, 51856, 51500, 51122, 51183, 51830, 52723, 53340, 53366, 52933, 52622, 53075, 54375, 55925, 57193, 58374, 59937, 61736, 63144, 64074, 65140, 66605, 67756, 67738, 66562, 64874, 63136, 61525, 60322, 59793, 59788, 59855, 59722, 59404, 59012, 58769, 58917, 59267, 59128, 58080, 56560, 55266, 54348, 53684, 53498, 53929, 54316, 53898, 53149, 53413, 55030, 56791, 57554, 57566, 57768, 58574, 59831, 61299, 62583, 63113, 62823, 62414, 62478, 62734, 62590, 62006, 61276, 60434, 59560, 59237, 59973, 61368, 62495, 62949, 62944, 62638, 62086, 61704, 62007, 62828, 63474, 63653, 63615, 63316, 62173, 59899, 57011, 54294, 52175, 50795, 50102, 49635, 48735, 47333, 46151, 45828, 46254, 47034, 48130, 49596, 51050, 51993, 52430, 52699, 52765, 52221, 51053, 49958, 49703, 50399, 51533, 52515, 53015, 52945, 52393, 51659, 51161, 51084, 51148, 50899, 50323, 49971, 50280, 50972, 51373, 51267, 51035, 50930, 50612, 49658, 48315, 47462, 47803, 49201, 50788, 51699, 51741, 51385, 51142, 51042]
54080E1042k70n86p09n55l15k39m78r11j083o73l0J90J4J46P95J196P38j06n93
54061D7573p67r96r96k78P97J394J377J164O50n40j861k114j184l19l28o26m75
54044D2471j14PJ32N74R42Q75P87J117J390R73K25o9J6j70n70m85J59O52O23M22
54024D9957K24k81j057j391q16K03R01J071R74Q65R04J133J263Q40m8o61m45L24
54006E3960J044J515J778J625Q87L9m4Q50J876J984J017j91p13l72L42R87J550
53989F8134K083K236J551J25j286j921j604p48J32Q12J522K587L807M433M048
53974H5911L309L250L954M474M153L357K694K217J845J966K927M191M725M179
53960A33152L187K573K691L414M283M573L740K050M53k81j62K81N63M76O9m56
$$ y = [51042, 50772, 50186, 49477, 48922, 48607, 48368, 47890, 46979, 45896, 45223, 45193, 45383, 45397, 45543, 46338, 47534, 48272, 48166, 47573, 46806, 45810, 44814, 44536, 45333, 46727, 48104, 49268, 49918, 49378, 47517, 45403, 44219, 43900, 43572, 42946, 42471, 42357, 42364, 42496, 43070, 44012, 44887, 45674, 46791, 48181, 49154, 49379, 49310, 49326, 49156, 48586, 48101, 48260, 48912, 49535, 49957, 50181, 49900, 48843, 47452, 46636, 46839, 47740, 48811, 49785, 50650, 51554, 52687, 53950, 54790, 54742, 54081, 53636, 53960, 55004, 56519, 58297, 59922, 60809, 60848, 60804, 61654, 63530, 65514, 66531, 66340, 65627, 65255, 65597, 66584, 68134, 70217, 72453, 74004, 74129, 72843, 70922, 69318, 68570, 68702, 69514, 71036, 73623, 77430, 81863, 85911, 89220, 92470, 96424, 100898, 105051, 108408, 111102, 113319, 115164, 117130, 120057, 124248, 128973, 133152, 136339, 138912, 141603, 145017, 149300, 153873, 157613, 159663, 160116, 159835, 159673, 159954, 160517, 160993, 161062, 160606]
53944A60606r81j647k564l429l690l200k431j934j916k397l337m324m489l310
53930A20957j441k28l25j092j538j468j451j858k331k265j544o55k08m09r58j310
53914A01876j092l99L34O90N51Q0m13o18l70J75O89J042J384J740J781J261M87
53897A09198L1kNj59k38KL42M26K40N3Q5L41O81Q86Q46P25P70R28R25Q23J054
53876A17962J735K327K321J997K073K822L823M471M371L473K176J214J097J596
53862A53458K054K035J554Q81M79Q10J845K844L108K776K490K470K440K339K448
53847A84031K808L085L135L171L286L320L291L354L233K386R71m4j76j88r43k063
53831B12657k480k003j479j516j841k025k158k470k848l152l652m661n824o281
$$ y = [160606, 159625, 157978, 155414, 151985, 148295, 145095, 142664, 140730, 138814, 136417, 133080, 128756, 124267, 120957, 119516, 119288, 118963, 117871, 116333, 114865, 113414, 111556, 109225, 106960, 105416, 104761, 104553, 104144, 103186, 101876, 100784, 100385, 100719, 101409, 101960, 102040, 101627, 101009, 100639, 100814, 101503, 102545, 103929, 105669, 107450, 108711, 109198, 109229, 109227, 109232, 109073, 108835, 108837, 109179, 109605, 109845, 109898, 109983, 110324, 111005, 111891, 112737, 113462, 114232, 115160, 116085, 116908, 117962, 119697, 122024, 124345, 126342, 128415, 131237, 135060, 139531, 143902, 147375, 149551, 150765, 151862, 153458, 155512, 157547, 159101, 159982, 160461, 161271, 163116, 165960, 169068, 171844, 174334, 176804, 179244, 181583, 184031, 186839, 189924, 193059, 196230, 199516, 202836, 206127, 209481, 212714, 215100, 216071, 216027, 215851, 215663, 214720, 212657, 210177, 208174, 206695, 205179, 203338, 201313, 199155, 196685, 193837, 190685, 187033, 182372, 176548, 170267]
53817A70267n646m507l767l686l855l942m015m097l874l163k418k288k792l332
53803A18885l416l034k389j660j114r89j175j269j105r67j181j750k399k741k446
53788I1250j565o51k07q2J71M41J63o93j453j659j518j282q87n16o83j349j655
53771G7825j106l28K4L53J239K090J769L74p22n82L93J261J468R50J16k30L62
53754H5256J196J147K50k55K62R44Q60M45P56J783K470K216J566J304J540J976
53738A03716K553L368M094M082L177K148J907K467L058L131K797K237J387M73
53724A40595K19R05J667J463M53k92k71Kl2l22o53j002j241j102p29o77j123j553
53706A36307j456r76n92n46q44j400j931k078j853j640j568j297o60o4P7p5j94
$$ y = [170267, 164621, 160114, 156347, 152661, 148806, 144864, 140849, 136752, 132878, 129715, 127297, 125009, 122217, 118885, 115469, 112435, 110046, 108386, 107272, 106283, 105108, 103839, 102734, 101767, 100586, 98836, 96437, 93696, 91250, 89685, 89034, 88827, 88745, 88916, 89357, 89520, 88827, 87374, 85715, 84197, 82915, 82028, 81512, 80829, 79480, 77825, 76719, 76391, 76415, 76768, 78007, 80097, 81866, 82240, 81518, 80936, 81329, 82590, 84058, 85008, 85124, 84894, 85256, 86452, 87599, 87849, 87594, 87856, 88800, 89660, 90105, 90861, 92644, 95114, 97330, 98896, 100200, 101740, 103716, 106269, 109637, 113731, 117813, 120990, 123138, 125045, 127512, 130570, 133701, 136498, 138735, 140122, 140595, 140814, 141719, 143386, 144849, 145302, 145010, 144739, 144741, 144709, 144387, 143734, 142732, 141491, 140389, 139660, 138983, 137860, 136307, 134851, 133875, 133283, 132737, 131893, 130493, 128562, 126484, 124631, 122991, 121423, 120126, 119466, 119402, 119479, 119404, 119210]
53689A19210l83r33j664j934j303PJ296J900J707J183P78L56m26j268j397o80
53673A16449L6L0l84n21l23k09k94l91n05p45q99o85l06l10p88j202j049m22J73
53654A07655L45J37j0K60P75J024R10R17J310J596J178K84k42J01J055J944K130
53637A21369J366K33j43P26J950K341J982J902K395K642K183J749K048K565K339
53622A47647J481R86J266J681J635J383J411J549J239M60j70j98R6J35k56p08
53606A59637p92m52n6p0n88j118j066n11k17o57j326j461j127j038j408j698j556
53589A44496j326j327j264p47K1N65P78Q21P19M84L64N92R92J236J239J090Q22
53572A49555N49N10O31M37j82n25Q9J332K293K644K739K801K708K459K212J843
$$ y = [119210, 118827, 117894, 116230, 114296, 112993, 113000, 114296, 116196, 117903, 119086, 119864, 120220, 119794, 118526, 117129, 116449, 116485, 116515, 116131, 115610, 115287, 115078, 114784, 114393, 113888, 113143, 112244, 111559, 111253, 110943, 110155, 108953, 107904, 107482, 107655, 108000, 108137, 108127, 108387, 109162, 110186, 111096, 112013, 113323, 114919, 116097, 116381, 116139, 116240, 117295, 119239, 121369, 122735, 122968, 122825, 123551, 125501, 127842, 129824, 131726, 134121, 136763, 138946, 140695, 142743, 145308, 147647, 149128, 150114, 151380, 153061, 154696, 156079, 157490, 159039, 160278, 160738, 160568, 160370, 160466, 160601, 160345, 159637, 158845, 158393, 158337, 158267, 157679, 156561, 155495, 154984, 154767, 154110, 152784, 151323, 150196, 149158, 147750, 146052, 144496, 143170, 141843, 140579, 139832, 139853, 140418, 141196, 142017, 142736, 143220, 143584, 144176, 145168, 146404, 147643, 148733, 149555, 150104, 150614, 151245, 151682, 151500, 150975, 151064, 152396, 154689, 157333, 160072, 162873, 165581, 168040, 170252, 172095]
53556A72095J163M88L88Q38J302J665K298L119L367K695J788J474J730K006K140
53541A98556K413K985L642M069M116L900L680L503L037K095J166R63J427J788
53527B37340J694J630K001K460K528K268J899J325N81K15N58J009P73K4l56r3
53511B55856J87J9k54j11M52J094J615J940J902J423P87N03P96J394J794J738
53495B71135J444J326J534J789J740J344R36R02J356K005K380K234J799J498J521
53480B94943J834K416L157L645L527L149L284M055M658M521M113M221M781N155
53466C47459N192N343N775O070N898N471N229N452O252P527Q772R430R511R589
53452D42970J0064J0812J1587J2306J2809J2828J2503J2458J3067J3968J4699
$$ y = [172095, 173258, 173746, 174134, 174972, 176274, 177939, 180237, 183356, 186723, 189418, 191206, 192680, 194410, 196416, 198556, 200969, 203954, 207596, 211665, 215781, 219681, 223361, 226864, 229901, 231996, 233162, 234125, 235552, 237340, 239034, 240664, 242665, 245125, 247653, 249921, 251820, 253145, 253726, 253941, 254499, 255508, 256281, 256305, 255949, 255856, 256043, 256062, 255808, 255697, 256149, 257243, 258858, 260798, 262700, 264123, 264910, 265413, 266209, 267603, 269397, 271135, 272579, 273905, 275439, 277228, 278968, 280312, 281248, 282150, 283506, 285511, 287891, 290125, 291924, 293422, 294943, 296777, 299193, 302350, 305995, 309522, 312671, 315955, 320010, 324668, 329189, 333302, 337523, 342304, 347459, 352651, 357994, 363769, 369839, 375737, 381208, 386437, 391889, 398141, 405668, 414440, 423870, 433381, 442970, 453034, 463846, 475433, 487739, 500548, 513376, 525879, 538337, 551404, 565372, 580071]
53441E80071J5381J6318J7255J7612J7313J6864J6640J6744J7389J8786K0388
53430G70761K1031K0254J8975J8391J8535J8544J8053J7625J7729J8022J7943
53419I75863J7568J7440J7734J7979J7608J6653J5774J5601J5978J6006J5037
53408A159241J3545J2614J2602J2729J2103J0711R048P312N429L592K161J042
53396A262129k73k011l839n325o349p062p751q770j0203j1555j2189j2123j2020
53383A162659j2307j2759j3144j3689j4574j5339j5369j4733j4103j3931j4082
53372A008629j4209j4110j3686j2870j1804j0785r922r004p805o425n162m109
53360H88738l097j981q66J23J104K221L243L714L679L819M647N838O828P759R217
$$ y = [580071, 595452, 611770, 629025, 646637, 663950, 680814, 697454, 714198, 731587, 750373, 770761, 791792, 812046, 831021, 849412, 867947, 886491, 904544, 922169, 939898, 957920, 975863, 993431, 1010871, 1028605, 1046584, 1064192, 1080845, 1096619, 1112220, 1128198, 1144204, 1159241, 1172786, 1185400, 1198002, 1210731, 1222834, 1233545, 1242593, 1249905, 1255334, 1258926, 1261087, 1262129, 1261856, 1259845, 1256006, 1250681, 1244332, 1237270, 1229519, 1220749, 1210546, 1198991, 1186802, 1174679, 1162659, 1150352, 1137593, 1124449, 1110760, 1096186, 1080847, 1065478, 1050745, 1036642, 1022711, 1008629, 994420, 980310, 966624, 953754, 941950, 931165, 921243, 912239, 904434, 898009, 892847, 888738, 885641, 883660, 882794, 882917, 884021, 886242, 889485, 893199, 896878, 900697, 905344, 911182, 918010, 925769, 934986]
53345I34986J1121J2603J3202J3579J4621J6310J7920J9037J9975K1189K2710
53334A117253K4134K5012K5286K5444K6136K7553K9296L0934L2432L3898L5238
53323A432616L6273L6977L7361L7341L6945L6489L6248L6136L5918L5474L4715
53312A832493L3512L1998L0645K9627K8384K6277K3478K0689J8108J5253J1825
53301B102289Q153M611J160k289n439p995j0214j2730j5795j8994k1734k3840
53289A997183k5548k7058k8287k9143k9904l1036l2520l3676l3827l3084l2240
53278A660860l1909l1975l1883l1323l0521k9866k9385k8721k7719k6785k6336
53267A334437k6035k5112k3489k1992k1181k0467j8977j6818j4913j3813j3266
$$ y = [934986, 946107, 958710, 971912, 985491, 1000112, 1016422, 1034342, 1053379, 1073354, 1094543, 1117253, 1141387, 1166399, 1191685, 1217129, 1243265, 1270818, 1300114, 1331048, 1363480, 1397378, 1432616, 1468889, 1505866, 1543227, 1580568, 1617513, 1654002, 1690250, 1726386, 1762304, 1797778, 1832493, 1866005, 1898003, 1928648, 1958275, 1986659, 2012936, 2036414, 2057103, 2075211, 2090464, 2102289, 2110442, 2115053, 2116213, 2113924, 2108485, 2100490, 2090276, 2077546, 2061751, 2042757, 2021023, 1997183, 1971635, 1944577, 1916290, 1887147, 1857243, 1826207, 1793687, 1760011, 1726184, 1693100, 1660860, 1628951, 1596976, 1565093, 1533770, 1503249, 1473383, 1443998, 1415277, 1387558, 1360773, 1334437, 1308402, 1283290, 1259801, 1237809, 1216628, 1196161, 1177184, 1160366, 1145453, 1131640, 1118374]
53256A118374j2801j2137j1122r904r162r589j0891j1868j1682j0609r321p942
53244I91346o239m389l093k790l024k738j303P26K072K154J871K595M522O537
53230I88247P640Q003Q443R379J0614J1794J2696J3316J3893J4710J5711J6502
53218A130948J6871J7011J7063J6796J6013J4996J4186J3577J2755J1419R649
53207A291284P677N681L785K058N32p90k011l427n209o950p903p946p982r020
53193A259779j1046j3197j4792j5788j6379j6644j6715j6805j6930j6936j6913
53182A087634j7243j8009j8675j8670j8146j7816j8077j8521j8400j7408j5886
53171H90783j4425j3383j2790j2523j2433j2322j1961j1242j0296r347q559q033
$$ y = [1118374, 1105573, 1093436, 1082314, 1072410, 1063248, 1053659, 1042768, 1030900, 1019218, 1008609, 999288, 991346, 985107, 980718, 977625, 974835, 971811, 969073, 967770, 968496, 970568, 972722, 974593, 977188, 981710, 988247, 995887, 1003890, 1012333, 1021712, 1032326, 1044120, 1056816, 1070132, 1084025, 1098735, 1114446, 1130948, 1147819, 1164830, 1181893, 1198689, 1214702, 1229698, 1243884, 1257461, 1270216, 1281635, 1291284, 1298961, 1304642, 1308427, 1310485, 1311017, 1310227, 1308216, 1304789, 1299580, 1292630, 1284727, 1276781, 1268799, 1259779, 1248733, 1235536, 1220744, 1204956, 1188577, 1171933, 1155218, 1138413, 1121483, 1104547, 1087634, 1070391, 1052382, 1033707, 1015037, 996891, 979075, 960998, 942477, 924077, 906669, 890783, 876358, 862975, 850185, 837662, 825229, 812907, 800946, 789704, 779408, 770061, 761502, 753469]
53159G53469p942q353q955r091q305o818n370m579m565n090n815o425o732o928
53145F58501p480q520r430r413q482p522p270p590p936q091q103p848p239o777
53131E46800p210q483r577r697r200q997r262r311q730q063q087q705r016q495
53117D23967p675p459p990q591q679q344p919p418o719o021n726n918o227o247
53103C23034n912n479n210n114m900m421m092m543n676o578o591o025n409m608
53089B48476l381k364k517l690m597m381l374k288j496j299j953k963l258k539
53075B08376j767j730j948j704j316j505k003j980j434j121j237j228r55r98j610
53060A85840k270k557k659k706k366j554q57p29q16o16l66o07j218j475j013k68
$$ y = [753469, 745527, 737174, 728219, 719128, 710823, 704005, 698635, 694056, 689491, 684401, 678586, 672161, 665429, 658501, 651021, 642501, 633071, 623658, 615176, 607654, 600384, 592794, 584858, 576767, 568664, 560816, 553577, 546800, 539590, 531107, 521530, 511833, 502633, 493636, 484374, 475063, 466333, 458270, 450183, 441478, 432462, 423967, 416292, 408833, 400843, 392252, 383573, 375229, 367310, 359892, 353173, 347152, 341426, 335508, 329281, 323034, 317122, 311643, 306433, 301319, 296419, 291998, 287906, 283363, 277687, 271109, 264518, 258493, 253084, 248476, 245095, 242731, 240214, 236524, 231927, 227546, 224172, 221884, 220388, 219089, 217136, 214173, 210915, 208376, 206609, 204879, 202931, 201227, 199911, 198406, 196403, 194423, 192989, 191868, 190631, 189403, 188448, 187450, 185840, 183570, 181013, 178354, 175648, 173282, 171728, 170871, 170142, 169326, 168710, 168344, 167737, 166519, 165044, 164031, 163763]
53044A63763N6m06j481k513k718j844n42K30J78j57k33j51l56q85j208q76m0Q23
53026A51640J549K363L218L524K842J631Q27O65M27n23j900k882l075k784k520
53011A55002k503k556k361j883j502j537j687j397p96p22j513k347k243j339o34
52996A29982p23j359k035k331j909q53Nj71j045j473j085o82p96p79m3O89L19
52979A15711q79j592j362j073j383j758j513r74r17j300j370p44J77P92Q18K51
52963A02884o40j271j204p03m50o33p49m98l50p77j346j125L8J263J696J365P90
52946I8290K31l28p33p27m03j72j76j18K13N89P14P07Q91J230J296Q19N0m54k85
52927A01634M95J316J447O72m06r09n91J9K92O1m92j087j295p07M94J378J127
$$ y = [163763, 163819, 163413, 161932, 159419, 156701, 154857, 154315, 154545, 154723, 154566, 154333, 154182, 153826, 152941, 151733, 150857, 150817, 151640, 153189, 155552, 158770, 162294, 165136, 166767, 167594, 168259, 168686, 168163, 166263, 163381, 160306, 157522, 155002, 152499, 149943, 147582, 145699, 144197, 142660, 140973, 139576, 138780, 138058, 136545, 134198, 131955, 130616, 129982, 129259, 127900, 125865, 123534, 121625, 120772, 120777, 120606, 119561, 118088, 117003, 116321, 115525, 114746, 114703, 115392, 115711, 114832, 113240, 111878, 110805, 109422, 107664, 106151, 105177, 104260, 102960, 101590, 100846, 101023, 101815, 102633, 102884, 102244, 100973, 99769, 99066, 98616, 97983, 97234, 96736, 96386, 95609, 94263, 93138, 93176, 94439, 96135, 97500, 98290, 98521, 98193, 97460, 96733, 96330, 96158, 95982, 95864, 96077, 96666, 97380, 98087, 98978, 100208, 101504, 102323, 102373, 101919, 101634, 102129, 103445, 104892, 105564, 105158, 104249, 103658, 103677, 103969, 104030, 103538, 102451, 101156, 100449, 100943, 102321, 103448]
52910A03448k2j034j159m68O04J739K652K942K463J602R42O96P16R17J357J869
52894A19264J982J515R95J056J558J742J310Q77J063J585J790J735K042K774L221
52879A44509K958K409K060J708J022K66m1Q3K53L92O82R71Q70L70p4j60o2j36
52861A58080n93j368k034k060j472j015j222j619j413p10k53j98nM05L93k53q32
52844A43831p85m41k78j29K95O81N61O2l36m54l60l7L88M87Q7l03j83J82K62J23
52824A43653K32N94Q04P43O21M20n5n97p30m23j14L1L30R45J520J661J396R63
52806A51994M74n6n49q54q52o16n25r50j623j710q41K33N40Q9l54l73q4N13J430
52787A45886K051J601M16j86L32R88P80J01k6N51J180J496J686J863J885J753
$$ y = [103448, 103426, 102392, 101233, 100765, 101369, 103108, 105760, 108702, 111165, 112767, 113709, 114405, 115121, 116038, 117395, 119264, 121246, 122761, 123756, 124812, 126370, 128112, 129422, 130299, 131362, 132947, 134737, 136472, 138514, 141288, 144509, 147467, 149876, 151936, 153644, 154666, 154932, 154891, 154974, 155227, 155619, 156301, 157272, 158142, 158512, 158438, 158278, 158216, 158080, 157487, 156119, 154085, 152025, 150553, 149538, 148316, 146697, 145284, 144574, 144321, 144123, 144118, 144523, 144916, 144663, 143831, 143046, 142605, 142327, 142198, 142493, 143174, 143735, 143797, 143461, 143007, 142647, 142610, 142998, 143485, 143572, 143269, 143086, 143268, 143530, 143653, 143885, 144479, 145283, 146026, 146647, 147067, 147012, 146415, 145685, 145262, 145148, 145179, 145509, 146454, 147974, 149635, 151031, 151994, 152468, 152412, 151863, 151009, 150157, 149541, 149016, 148066, 146443, 144733, 143892, 144125, 144665, 144754, 144400, 144027, 143943, 144456, 145886, 147937, 149538, 149954, 149768, 150100, 151088, 151868, 151969, 151943, 152494, 153674, 155170, 156856, 158719, 160604, 162357]
52771A62357J593J342Q58L13L4N2J58L22O55J037J230J294J378J219L66r44j647
52754A71617r95M96J550J428N06l17n36l84m78j138k009k424k158j755j918k684
52738A58801l427l602l279k802k259j566r15p09r37j065p58m48p52j511j952j799
52722A31020j708k288l083l006j712j23M90k45j604k600k805k411j818j274q68
52707A05965o09m44k95j90k89o91j202j433j138m85J9k2n11r63j078j071j260
52690I4303j546j614j530j635j842j658j041o58r03j252j124q62j129j700j683
52675G4126q92j26l1m18q75j342j727j607p67K67P30M12k66p81q53n03K1M10N22
52656F6300L61m3n55q51p62n86o74q18n79j44k03q46j360j259q45m68N1P72J180
$$ y = [162357, 163950, 165292, 166150, 166463, 166497, 166549, 166707, 167029, 167684, 168721, 169951, 171245, 172623, 173842, 174208, 173264, 171617, 170622, 171118, 172668, 174096, 174602, 174285, 173749, 173365, 172887, 171749, 169740, 167316, 165158, 163403, 161485, 158801, 155374, 151772, 148493, 145691, 143432, 141866, 140951, 140242, 139305, 138240, 137482, 137034, 136282, 134771, 132819, 131020, 129312, 127024, 123941, 120935, 119223, 119100, 119590, 119345, 117741, 115141, 112336, 109925, 108107, 106833, 105965, 105356, 104912, 104617, 104427, 104138, 103447, 102245, 100812, 99674, 99189, 99208, 99186, 98675, 97712, 96634, 95563, 94303, 92757, 91143, 89613, 87978, 86136, 84478, 83437, 82779, 81876, 80624, 79500, 78638, 77509, 75809, 74126, 73234, 73108, 73077, 72659, 71784, 70442, 68715, 67108, 66341, 66608, 67338, 67750, 67484, 66703, 65850, 65347, 65368, 65778, 66300, 66661, 66618, 66063, 65212, 64450, 63864, 63190, 62372, 61793, 61649, 61446, 60600, 59240, 57981, 57136, 56668, 56719, 57491, 58671]
52637E8671R55O17P45R98O89p3n80n94m94m22q5N57J053J100R11Q23R25J120J288
52618F8204J262J013Q11R61J381J742J909J954J886J660J390J170Q46L77J84O15
52602H7365J187J041J81m25j83L18J58o82j456j618j283q21m54l03n37j282k329
52585G8877l036k756j552l50j22r09j875k176j613n15N77J156J019M42j30n28
52569F6509q20r56q42o74p11p28k67M90P37J99l22l9O59P84J29n53p23o31o42
52550F1599n94j84L98P05O51N14L54r9q42j312j032k71L03N17P51J119J130M62
52532F4169l18l00O85J846K293J835R89L86K29K13N3q3J18M54M26J58M12J334
52514G4899J920J435O51P34J362J150j68j303j309p28l53OP53J358J008k2n77
$$ y = [58671, 59626, 60243, 60988, 61986, 62675, 62602, 62022, 61428, 60934, 60512, 60427, 60984, 62037, 63137, 64048, 64871, 65796, 66916, 68204, 69466, 70479, 71290, 72251, 73632, 75374, 77283, 79237, 81123, 82783, 84173, 85343, 86189, 86566, 86750, 87365, 88552, 89593, 89774, 89349, 89166, 89484, 89642, 88960, 87504, 85886, 84603, 83782, 83328, 83025, 82488, 81206, 78877, 75841, 73085, 71533, 71183, 71061, 70152, 68277, 66101, 64488, 63973, 64550, 65706, 66725, 67167, 67037, 66509, 65689, 64733, 63891, 63217, 62506, 61778, 61511, 62001, 62738, 62937, 62615, 62576, 63235, 64019, 64148, 63595, 62872, 62241, 61599, 61005, 60821, 61219, 61924, 62575, 63089, 63443, 63344, 62502, 61190, 60158, 59887, 60190, 60707, 61458, 62577, 63707, 64169, 63851, 63551, 64236, 66082, 68375, 70210, 71199, 71585, 71814, 72027, 72080, 71997, 72115, 72569, 72995, 73153, 73565, 74899, 76819, 78254, 78905, 79639, 81001, 82151, 81983, 80680, 79371, 78643, 78290, 78296, 79049, 80407, 81415, 81393, 80816]
52497H0816m0J060J796J668Q37k1j57N12J254J364R96Q27J191J843K361K339J542
52480A00188L24l39J43J182J720J553J305J204Q16P6k60L06J082J014J16n47k40
52463A09643N89R85O12m4l88l34j09J87N89R57J027Q16O04M76J90k94n86m82l79
52444A14059o68j020q02m7N90P57O82O08M97L87M86P14O20K7o96j135j259j092
52426A12708m58N85J500J814J643J347R75M18j37l43j79R5K90K79j18q35j335
52409A18249j151n24o0J28L71O41N52K04L12J055J565J103K18L9P30J401J433
52392A26266J188J214J459J524J212N48l45j124j252n89L28Q76J003R86Q42M19
52376A34555l9l7M20O84K52o29j344j548j225m93L84R34Q24K30l35n11k50L73
$$ y = [80816, 80776, 81836, 83632, 85300, 86137, 86116, 85959, 86471, 87725, 89089, 90085, 90912, 92103, 93946, 96307, 98646, 100188, 100512, 100173, 100316, 101498, 103218, 104771, 106076, 107280, 108096, 108172, 107912, 108218, 109300, 110314, 110430, 109883, 109643, 110232, 111217, 111829, 111785, 111397, 111063, 110954, 111141, 111730, 112687, 113714, 114530, 115134, 115610, 115800, 115506, 114920, 114438, 114059, 113391, 112371, 111569, 111522, 112112, 112869, 113551, 114159, 114656, 115043, 115529, 116243, 116863, 116890, 116194, 115059, 113800, 112708, 112250, 112835, 114335, 116149, 117792, 119139, 120114, 120532, 120395, 120052, 119873, 119968, 120258, 120537, 120419, 119584, 118249, 117098, 116574, 116514, 116642, 117013, 117654, 118206, 118410, 118722, 119777, 121342, 122445, 122663, 122702, 123432, 124833, 126266, 127454, 128668, 130127, 131651, 132863, 133411, 133066, 131942, 130690, 130101, 130429, 131305, 132308, 133294, 134136, 134555, 134516, 134479, 134899, 135583, 135835, 135206, 133862, 132314, 131089, 130596, 130980, 131914, 132738, 132968, 132633, 132122, 131872, 132245]
52358A32245J158J643J316K05r35j264p21m5P6j75n3P30J569J661R46O2l89k33
52340A37796M65J450K093J783P63J23N36J374J546R12K87K48N82Q90J109J228
52324A53185J070N91P7k24l04r8O03J623K179J648L73o52q08k97K70L94l2n75
52306A59023n41K59J096J118M62Q5M66J052J172R24Q19R93J262J629K148K526
52290A74493K383J876J520J416J182P67P27J424K389K866K688K282K064K223K826
52275B03126L716M375M336L725L051K529J998J424J105J280J931K960M112M779
52261B44447M445L533L219M085N348N857N467M973N013N554O341P211P989Q506
52247C21988Q835R236R828J0582J1490J2381J2691J1930J0526R728J0407J2120
$$ y = [132245, 133403, 135046, 136362, 136567, 135632, 134368, 133647, 133602, 133678, 133503, 133450, 134180, 135749, 137410, 138356, 138418, 138029, 137796, 138261, 139711, 141804, 143587, 144350, 144473, 145009, 146383, 147929, 148841, 149128, 149376, 149958, 150848, 151957, 153185, 154255, 154846, 154923, 154699, 154395, 154297, 154900, 156523, 158702, 160350, 160723, 160071, 159263, 158966, 159236, 159630, 159598, 159023, 158482, 158741, 159837, 160955, 161417, 161502, 161968, 163020, 164192, 165116, 165935, 166928, 168190, 169819, 171967, 174493, 176876, 178752, 180272, 181688, 182870, 183637, 184364, 185788, 188177, 191043, 193731, 196013, 198077, 200300, 203126, 206842, 211217, 215553, 219278, 222329, 224858, 226856, 228280, 229385, 230665, 232596, 235556, 239668, 244447, 248892, 252425, 255644, 259729, 265077, 270934, 276401, 281374, 286387, 291941, 298282, 305493, 313482, 321988, 330823, 340059, 349887, 360469, 371959, 384340, 397031, 408961, 419487, 429215, 439622, 451742]
52235D51742J3566J3820J3080J2394J2656J3750J4671J4627J3915J3388J3273
52224F00882J3015J2278J1407J0748J0067R087Q128P715P744P576O788N555M310
52211G15300L358K734K201J492O93K08K21M30N34O30Q02P15Q2p03r48n68q5K36
52193G27332O30J262J956K597L298M038M582M937N407O124O939P859R053J0210
52179G96224J0640J0263R908J0158J0490J0156R342Q679Q131P247O200N664N597
52166I08699N179M036K648J294m19k530m157m609m485m863n848o775p460q327
52152H72383r358r917r780r557r774j0115j0039r610r294r222r130q824q317p638
52138G41808o841o069n419m790m166l806l855l912l419k467j743j627j804j877
$$ y = [451742, 465308, 479128, 492208, 504602, 517258, 531008, 545679, 560306, 574221, 587609, 600882, 613897, 626175, 637582, 648330, 658397, 667484, 675612, 683327, 691071, 698647, 705435, 710990, 715300, 718658, 721392, 723593, 725085, 725778, 725986, 726207, 726637, 727171, 727801, 728603, 729318, 729400, 728697, 727749, 727181, 727096, 727332, 727962, 729224, 731180, 733777, 737075, 741113, 745695, 750632, 756039, 762163, 769102, 776961, 786014, 796224, 806864, 817127, 827035, 837193, 847683, 857839, 867181, 875860, 883991, 891238, 897438, 903102, 908699, 913878, 917914, 920562, 921856, 921437, 918907, 914750, 910141, 905656, 900793, 894945, 888170, 880710, 872383, 863025, 853108, 843328, 833771, 823997, 813882, 803843, 794233, 784939, 775717, 766587, 757763, 749446, 741808, 734967, 728898, 723479, 718689, 714523, 710717, 706862, 702950, 699531, 697064, 695321, 693694, 691890, 690013]
52124F90013j964k314k718k677k120j596j642k162k550k348j732j299j388j728
52110F61775j879j913k275k996l461l248k770k693k933k805k052j254j113j755
52096F28628k784l575l509k398r59l96j123k302k929k991l059l164k778j783q10
52081E94068m31o17j024j435j685j596j247r85r58r72q84q60r85r60n17J11M55
52064E79478M00K15J16J20J78K65M11Q19J766L119M262M743M856N149N617N845
52048F17359N863O220P166Q319R291J0139J0928J1399J1472J1719J2765J4363
52036G37003J5538J5727J5346J5260J5879J6867J7430J6891J5263J3423J2469
52025I07096J2626J2980J2427J0789Q766P008N603M398L370K395J154m06j718
$$ y = [690013, 688049, 685735, 683017, 680340, 678220, 676624, 674982, 672820, 670270, 667922, 666190, 664891, 663503, 661775, 659896, 657983, 655708, 652712, 649251, 646003, 643233, 640540, 637607, 634802, 632750, 631496, 630383, 628628, 625844, 622269, 618760, 616362, 615403, 615007, 613884, 611582, 608653, 605662, 602603, 599439, 596661, 594878, 594068, 593637, 593020, 591996, 590561, 588876, 587280, 586033, 585048, 584090, 583118, 582234, 581374, 580389, 579429, 578912, 579023, 579478, 579878, 580093, 580209, 580329, 580507, 580772, 581183, 582002, 583768, 586887, 591149, 595892, 600748, 605897, 611514, 617359, 623222, 629442, 636608, 644927, 654218, 664357, 675285, 686684, 698156, 709875, 722640, 737003, 752541, 768268, 783614, 798874, 814753, 831620, 849050, 865941, 881204, 894627, 907096, 919722, 932702, 945129, 955918, 964684, 971692, 977295, 981693, 985063, 987458, 988612, 988206, 986488]
52012I86488k194k059k091k654l482m418n671p098p887p548o679o215o228o094
51998I16170n552m914m402l937l550l323k916j838k53J149K183L315M593N268
51984I01993M893M097L758L929M172M379M625M663M236L657L463L625L705L495
51970I58690L000K057N79j000k154k981l862m673n075n405o378p897r082r639
51956I06180j0253j1313j2176j2272j2156j2742j3947j4905j5162j5072j5128
51945G61054j5491j6069j6565j6584j6044j5383j5057j4960j4744j4465j4436
51934E91256j4532j4218j3347j2470j2196j2579j3223j3773j4125j4309j4353
51923D42131j4166j3610j2713j1732j0882j0146r506r132r049q808p926o663n889
$$ y = [986488, 984294, 982235, 980144, 977490, 974008, 969590, 963919, 956821, 948934, 941386, 934707, 928492, 922264, 916170, 910618, 905704, 901302, 897365, 893815, 890492, 887576, 885738, 885485, 886634, 888817, 892132, 896725, 901993, 906886, 910983, 914741, 918670, 922842, 927221, 931846, 936509, 940745, 944402, 947865, 951490, 955195, 958690, 961690, 963747, 964326, 963326, 961172, 958191, 954329, 949656, 944581, 939176, 932798, 924901, 915819, 906180, 895927, 884614, 872438, 860166, 848010, 835268, 821321, 806416, 791254, 776182, 761054, 745563, 729494, 712929, 696345, 680301, 664918, 649861, 634901, 620157, 605692, 591256, 576724, 562506, 549159, 536689, 524493, 511914, 498691, 484918, 470793, 456484, 442131, 427965, 414355, 401642, 389910, 379028, 368882, 359376, 350244, 341195, 332387, 324461, 317798, 311909]
51910C11909o074o737p079o825o255n638m990m324l844l743l893l881l486l018
51896B42122k980l346l453k844j958j607j881k104j890j714k152k984l397k945
51882B06867j974j220j184j787k437k493j850j088q70j249j700j763j521j369
51868A84362j459j457r66j12M56L38o6p1K91L03l70j148j367j209j367k037k769
51851A71352l092k870k189j404j141j728k567k652j860j125j185j688j905j775
51837A44171j729j761j371m20M52M73l51j146j043j95K31o15k023k301q03J184
51821A32753J994J459O17N4n27j221j436q81k34k80q63j200r12k58M11R29J156
51804A31561R68N05J06oJ41M05O37O72M66K50M25J189K275L004K767J638M83J95
$$ y = [311909, 305835, 299098, 292019, 285194, 278939, 273301, 268311, 263987, 260143, 256400, 252507, 248626, 245140, 242122, 239142, 235796, 232343, 229499, 227541, 225934, 224053, 221949, 220059, 218345, 216193, 213209, 209812, 206867, 204893, 203673, 202489, 200702, 198265, 195772, 193922, 192834, 191964, 190715, 189015, 187252, 185731, 184362, 182903, 181446, 180480, 180368, 180824, 181162, 181096, 181025, 181316, 181619, 181249, 180101, 178734, 177525, 176158, 174121, 171352, 168260, 165390, 163201, 161797, 160656, 158928, 156361, 153709, 151849, 150724, 149539, 147851, 145946, 144171, 142442, 140681, 139310, 138890, 139342, 139815, 139464, 138318, 137275, 137080, 137311, 136696, 134673, 132372, 131569, 132753, 134747, 136206, 136823, 136877, 136350, 135129, 133693, 132812, 132578, 132298, 131435, 130235, 129323, 129065, 129476, 130405, 131561, 132529, 133034, 133140, 133134, 133275, 133680, 134317, 134989, 135455, 135705, 136130, 137319, 139594, 142598, 145365, 147003, 147486, 147681]
51786A47681P85J434J536J319J304J557J785J803J593J110M44m9j61j94m73p28
51770A60746n27j17j95p85j082o50r5j56o24p98o01n87r17j045n73J85P47J175
51752A54101J740K201K010J203N18L71K57l71j069r08O9P17K87o39j098r89q54
51735A57546q47o78l21m5K13P69J491J710J099Q1p62j268j500j413j040o07k19
51718A54209K62P96R94P06L92N67J033J118N89o4k22K05P66R62P05K78n9l07m54
51699A62476k22O00J634K224K210J994J772J330P64P16J449K251K305J764J401
51684A84668J495J679J734J883K284K763L123L353L493L620L920M464M975N178
51670B28632N289N713O308O415N719M601L575K713J782O50n53j483j778j474j152
$$ y = [147681, 148466, 149900, 151436, 152755, 154059, 155616, 157401, 159204, 160797, 161907, 162351, 162302, 162141, 161947, 161474, 160746, 160219, 160102, 159907, 159122, 158040, 157390, 157295, 157139, 156515, 155717, 155116, 154529, 153612, 152567, 151994, 152179, 152926, 154101, 155841, 158042, 160052, 161255, 161773, 162144, 162401, 162030, 160961, 160053, 160122, 160839, 161126, 160487, 159389, 158400, 157546, 156699, 156021, 155700, 155655, 155868, 156637, 158128, 159838, 160937, 161018, 160256, 158988, 157488, 156075, 155035, 154428, 154209, 154471, 155267, 156261, 156967, 157359, 157926, 158959, 160077, 160666, 160602, 160380, 160585, 161351, 162313, 163018, 163296, 163237, 162930, 162476, 162254, 162854, 164488, 166712, 168922, 170916, 172688, 174018, 174782, 175498, 176947, 179198, 181503, 183267, 184668, 186163, 187842, 189576, 191459, 193743, 196506, 199629, 202982, 206475, 210095, 214015, 218479, 223454, 228632, 233921, 239634, 245942, 252357, 258076, 262677, 266252, 268965, 270747, 271397, 270844, 269361, 267583, 266109, 264957]
51655B64957j361j902k093j774j535j836k347k520k344k201k205k084j623r44
51641B38188l95k94o67j097j007l00M14M67q3n77n68k76j23j11K00J065K110K612
51623B39558K259J520J192J597K312K598K107J184N36N27Q08Q03N17N22J105J760
51607B60905J840J324O86K79K52P25J526K032J806J263J074J169R76N02L21M61
51591B77141K36n71j307j590k022l161m493n136m998m568m045l420l037l292l979
51576B31758m545m774m673m020k788j705j528j899j818j201r93j635k384k546
51562A95249k449k616k729k200j306r50j378j840j601q03j84k18p07j103j026
51547A74139m91K89J103J677J684J085L40l8n9n6j09p3j05n06r76p10N32J979
$$ y = [264957, 263596, 261694, 259601, 257827, 256292, 254456, 252109, 249589, 247245, 245044, 242839, 240755, 239132, 238188, 237793, 237499, 236832, 235735, 234728, 234428, 234842, 235309, 235226, 234649, 234081, 233805, 233682, 233571, 233771, 234836, 236946, 239558, 241817, 243337, 244529, 246126, 248438, 251036, 253143, 254327, 254863, 255390, 256198, 257001, 257518, 258040, 259145, 260905, 262745, 264069, 264755, 265034, 265286, 266011, 267537, 269569, 271375, 272638, 273712, 274881, 275857, 276359, 276680, 277141, 277377, 276806, 275499, 273909, 271887, 268726, 264233, 259097, 254099, 249531, 245486, 242066, 239029, 235737, 231758, 227213, 222439, 217766, 213746, 210958, 209253, 207725, 205826, 204008, 202807, 201814, 200179, 197795, 195249, 192800, 190184, 187455, 185255, 183949, 182999, 181621, 179781, 178180, 177377, 177193, 176975, 176268, 175165, 174139, 173648, 173937, 175040, 176717, 178401, 179486, 179826, 179788, 179729, 179673, 179564, 179491, 179386, 178880, 177904, 177194, 177726, 179705]
51529A79705K841L127L135K816K181J889K551L752M521M670M856N353N584N046
51515B32027M067L245K706K268J929J790J733J549J183O41j35j044j681j778j618
51500B46882j714k181k680k877k741k356j786j114m39J65O48R45J130J458K017
51485B35357K459K408K138K463L749N283N946N348M146L215K773K357J484K07
51471B79333r66j556j466r51l82r2k68p86j265j438j469j633j736j232k5J156
51455B65224J545J198P85O92Q04J015J459K020K166J542M91l60q13j086j228j028
51439B74426n47l79j053k353l440l674l205k675k521k607k586k455k547k960l222
51424B38202k793j815j061j041j362j208l72N23Q05O00O58J425K595L552M041
$$ y = [179705, 182546, 185673, 188808, 191624, 193805, 195694, 198245, 201997, 206518, 211188, 216044, 221397, 226981, 232027, 236094, 239339, 242045, 244313, 246242, 248032, 249765, 251314, 252497, 253138, 253003, 251959, 250278, 248500, 246882, 245168, 242987, 240307, 237430, 234689, 232333, 230547, 229433, 228994, 229159, 229807, 230752, 231882, 233340, 235357, 237816, 240224, 242362, 244825, 248574, 253857, 259803, 265151, 269297, 272512, 275285, 277642, 279126, 279333, 278367, 276811, 275345, 274394, 274012, 273920, 273652, 272866, 271601, 270163, 268694, 267061, 265325, 264093, 264068, 265224, 266769, 267967, 268752, 269444, 270248, 271263, 272722, 274742, 276908, 278450, 278941, 278581, 277768, 276682, 275454, 274426, 273879, 273500, 272447, 270094, 266654, 262980, 259775, 257100, 254579, 251972, 249386, 246931, 244384, 241424, 238202, 235409, 233594, 232533, 231492, 230130, 228922, 228550, 229073, 229878, 230478, 231136, 232561, 235156, 238708, 242749]
51409B42749M194M088L640K946K454K525L025L506L756L971M405N029N529N542
51395B97359M939L976L181K920L084L260L177K803K096R67l44j159r94k30J85
51380C25220k13r59j347j364j551k113k511k122j048NN21O11P10J061J564J919
51364C18383J793J024j64j167j414q78j65l2p34j782k464k691l111m164n248n338
51348B91848m405l536l438l493k956k362k835m175m797l772j985p87l39L4N08
51333B53510O89O11Q15J402J747J391O46R1j08j15m9K6O2J57M59P59N13m78j681
51314B60447k456k778l032l386l797m336n052n634n772n782o182o726o539n443
51300A93532m369m037l902l124k046j784k600l571l911l792l567l075k148j218
$$ y = [242749, 246943, 251031, 254671, 257617, 260071, 262596, 265621, 269127, 272883, 276854, 281259, 286288, 291817, 297359, 302298, 306274, 309455, 312375, 315459, 318719, 321896, 324699, 326795, 327762, 327418, 326259, 325265, 325035, 325220, 325007, 324048, 322701, 321337, 319786, 317673, 315162, 313040, 311992, 311997, 312518, 313129, 313839, 314900, 316464, 318383, 320176, 321200, 321036, 319869, 318455, 317577, 317412, 317380, 316646, 314864, 312400, 309709, 306598, 302434, 297186, 291848, 287443, 283907, 280469, 276976, 274020, 271658, 268823, 264648, 259851, 256079, 254094, 253307, 252968, 253002, 253510, 254199, 254810, 255625, 257027, 258774, 260165, 260811, 260902, 260794, 260679, 260630, 260656, 260718, 260875, 261334, 262093, 262606, 262128, 260447, 257991, 255213, 252181, 248795, 244998, 240662, 235610, 229976, 224204, 218422, 212240, 205514, 198975, 193532, 189163, 185126, 181224, 178100, 176054, 174270, 171670, 168099, 164188, 160396, 156829, 153754, 151606, 150388]
51286A50388p95p50o70o31j020j751k244k177j749j210o35j99k36p90j401j501
51270A32629q43L52J408J489M55o68n92O96J930K227J987J851J610Q34J6M3Q70
51253A46294J598J822J980K278K291J905J850K676L810M221L751L163L131L579
51239A84349L975L826L002J877J116J011J106O97m05j788k947l609l769l686l747
51224A81008m017m048l508k823k753l416m168m454m269l753k874j789r94q09j018
51209A36315j326j814k581l282l428k941k084j028O8P49N64k79j015j125p50k95
51193A15748lM8j23l70n18n43m53q2N66Q97K99q01j088J4J493K001J418N98K1
51174A19122m80q55o81N2O96P90N23K27m3j43K25Q55Q95m7j114j185l72K19M6
$$ y = [150388, 149593, 148843, 148173, 147542, 146522, 144771, 142527, 140350, 138601, 137391, 136756, 136557, 136321, 135531, 134130, 132629, 131786, 132138, 133546, 135035, 135490, 134822, 134230, 134926, 136856, 139083, 141070, 142921, 144531, 145365, 145381, 145424, 146294, 147892, 149714, 151694, 153972, 156263, 158168, 160018, 162694, 166504, 170725, 174476, 177639, 180770, 184349, 188324, 192150, 195152, 197029, 198145, 199156, 200262, 200959, 200554, 198766, 195819, 192210, 188441, 184755, 181008, 176991, 172943, 169435, 166612, 163859, 160443, 156275, 151821, 147552, 143799, 140925, 139136, 138142, 137333, 136315, 134989, 133175, 130594, 127312, 123884, 120943, 118859, 117831, 117899, 118648, 119212, 118933, 117918, 116793, 116043, 115748, 115745, 115793, 115670, 115300, 114782, 114239, 113786, 113704, 114270, 115167, 115466, 114665, 113577, 113591, 115084, 117085, 118503, 119101, 119122, 118642, 117787, 117106, 117158, 117854, 118644, 119167, 119394, 119351, 119208, 119433, 120288, 121183, 121136, 120022, 118837, 118465, 118684, 118730]
51155A18730k61N8Q85J509J491R72M38L16O31R61R25P14Q18J203J271P08n1m98
51137A30820p21j083j512j628j319q16l46l2j13p37j612k143k023j427o69L5M61
51120A15135M31P1k61m03m94o34p25p76r43j144j006m98j57l42n83k02O17J026
51102A09112P11K80L14N78N50K65J63L60N49N14L58J50j92o38r47r93r43j001
51084A09190j194j511k032k606k704j883m46O46O62k40j215j486q78J85J078J401
51068I6967J179P22L11L4j47k11m8M51J229J979K336K174J745J433J443J749K229
51051A15575K686K829K442J637P84J72k10n49r32j205j054m03K85L29l59j032
51035A20995j053p47q64j388j572j155o45k82M25J584K230J554K08n00m54o36
$$ y = [118730, 118469, 118527, 119412, 120921, 122412, 123384, 123822, 124138, 124769, 125730, 126655, 127369, 128187, 129390, 130661, 131369, 131318, 130820, 130099, 129016, 127504, 125876, 124557, 123741, 123395, 123363, 123250, 122513, 120901, 118758, 116735, 115308, 114639, 114674, 115135, 115566, 115637, 115376, 114973, 114479, 113845, 113120, 112344, 111401, 110257, 109251, 108753, 108596, 108254, 107671, 107469, 108086, 109112, 109823, 110103, 110417, 110995, 111545, 111810, 111973, 112333, 112882, 113396, 113754, 113904, 113712, 113074, 112127, 111134, 110191, 109190, 107996, 106485, 104453, 101847, 99143, 97260, 96814, 97460, 98122, 97882, 96667, 95181, 94303, 94488, 95566, 96967, 98146, 98868, 99179, 99213, 99066, 98855, 98807, 99258, 100487, 102466, 104802, 106976, 108721, 110154, 111597, 113346, 115575, 118261, 121090, 123532, 125169, 125953, 126125, 125915, 125366, 124434, 123229, 122175, 121772, 122057, 122386, 122027, 120995, 119942, 119195, 118331, 116943, 115371, 114216, 113571, 113289, 113714, 115298, 117528, 119082, 119290, 118790, 118336, 117700]
51019A17700j376j755j001M09J446J725J505J128Q50Q92J170J292J131J059J270
51004A27445J245M18r05j751j511m46P35J389J170J65j054j790j675q43K29R30
50988A23751Q50J98k55KO13Q12L68j64j03P18J883K683K610J818J069J003J431
50971A39287J687J542J445J811K411K665K286J526Q07L89L28O15J136J502J217
50956A60654L21l63q3Q07J232Q46M11M83N90K47R6J042K695L675L402K643K252
50939A80950K253K369K614K973L184L289L846N107O399O840O421O013O417P640
50925B46315Q973R596R313Q778Q814R537J0438J1238J2180J3453J4899J6413J8068
50912C98015J9701K0946K1998K3667K6293K9094L1177L2613L4151L6184L8524
$$ y = [117700, 116324, 114569, 113568, 113977, 115423, 117148, 118653, 119781, 120631, 121523, 122693, 123985, 125116, 126175, 127445, 128690, 129108, 128203, 126452, 124941, 124495, 125230, 126619, 127789, 127954, 126900, 125110, 123435, 122592, 122821, 123751, 124601, 124799, 124544, 124546, 125159, 125971, 126339, 126175, 126072, 126790, 128673, 131356, 133966, 135784, 136853, 137856, 139287, 140974, 142516, 143961, 145772, 148183, 150848, 153134, 154660, 155467, 155856, 156184, 156799, 157935, 159437, 160654, 160975, 160612, 160529, 161336, 162568, 163414, 163825, 164308, 164898, 165145, 165241, 166283, 168978, 172653, 176055, 178698, 180950, 183203, 185572, 188186, 191159, 194343, 197632, 201478, 206585, 212984, 219824, 226245, 232258, 238675, 246315, 255288, 264884, 274197, 282975, 291789, 301326, 311764, 323002, 335182, 348635, 363534, 379947, 398015, 417716, 438662, 460660, 484327, 510620, 539714, 570891, 603504, 637655, 673839, 712363]
50901G12363M0819M2756M4102M4958M5656M6135M5855M4662M3135M1580L9304
50890A191325L5592L0848K6010K1291J6371J1407O915K906r31m362o924q903j0987
50877A310558j2980j3960j3791j3424j3477j3647j3778j4399j5769j7317j8666
50866A149350k0246k2345k4400k5995k7686l0011l2410l4022l5018l6057l6910
50855H24250l6663l5096l2968l0963k9164k7503k5955k4311k2434k0708j9517
50844E18968j8409j6503j3826j1381r843q873p928p051o409n781m849l607k125
50831D02383l91J289K227K099J422R20P73R30J643L080M656N491N483N346N569
50816D42920N938O226O703P634Q725R553J0246J1248J2545J3656J4433J5362J6880
$$ y = [712363, 753182, 795938, 840040, 884998, 930654, 976789, 1022644, 1067306, 1110441, 1152021, 1191325, 1226917, 1257765, 1283775, 1305066, 1321437, 1332844, 1339759, 1342665, 1341734, 1337372, 1330448, 1321545, 1310558, 1297578, 1283618, 1269827, 1256403, 1242926, 1229279, 1215501, 1201102, 1185333, 1168016, 1149350, 1129104, 1106759, 1082359, 1056364, 1028678, 998667, 966257, 932235, 897217, 861160, 824250, 787587, 752491, 719523, 688560, 659396, 631893, 605938, 581627, 559193, 538485, 518968, 500559, 484056, 470230, 458849, 449006, 440133, 432205, 425154, 418745, 412964, 408115, 404508, 402383, 401992, 403281, 405508, 407607, 409029, 409949, 410722, 411652, 413295, 416375, 421031, 426522, 432005, 437351, 442920, 448858, 455084, 461787, 469421, 478146, 487699, 497945, 509193, 521738, 535394, 549827, 565189, 582069]
50803E82069J8766K0487K1926K3432K5344K7753L0657L3970L7401M0629M3718
50792I06152M7080N0979N5352O0117O5400P1188P7119Q2760Q7976R2749R6891
50781A693763J00130J02350J03459J03164J01145R7429R2283Q5799P7730O7806
50771B625058N6100M3173K9936J7250N522n174j4570k2110k7599l1585l4663l6663
50759B604675l6938l5370l2662k9786k7580k6698k7368k9129l1441l4582l9371
50748B253750m5771n2492n8289o3203o7983p2693p6510p8751p9575p9617p9242
50737A499624p8274p6227p2752o7980o2467n6871n1679m7173m3380l9920l6233
50726H66668l2078k7713k3549j9846j6828j4711j3386j2307j0977r388p832o534
$$ y = [582069, 600835, 621322, 643248, 666680, 692024, 719777, 750434, 784404, 821805, 862434, 906152, 953232, 1004211, 1059563, 1119680, 1185080, 1256268, 1333387, 1416147, 1504123, 1596872, 1693763, 1793893, 1896243, 1999702, 2102866, 2204011, 2301440, 2393723, 2479522, 2557252, 2625058, 2681158, 2724331, 2754267, 2771517, 2777039, 2771865, 2757295, 2735185, 2707586, 2676001, 2641338, 2604675, 2567737, 2532367, 2499705, 2469919, 2442339, 2415641, 2388273, 2359144, 2327703, 2293121, 2253750, 2207979, 2155487, 2097198, 2033995, 1966012, 1893319, 1816809, 1738058, 1658483, 1578866, 1499624, 1421350, 1345123, 1272371, 1204391, 1141924, 1085053, 1033374, 986201, 942821, 902901, 866668, 834590, 806877, 783328, 763482, 746654, 731943, 718557, 706250, 695273, 685885, 678053, 671519]
50714F71519n609n154n066n021m884m884n132n265m930m385m100l981l477k448
50700F07183j474j143j419j753j611q71J62J070J811K757M162N848P599R496J1562
50685F43379J3390J4738J6105J8134K0616K2848K4860K7406L0651L3786L6260
50674I02173L8595M1485M4823M8132N1391N4790N8027O0546O2248O3444O4222
50663A489876O4378O3730O2011N8697N3501M7010M0304L3858K7145J9348J0179
50652A970037J01r874j8644k5584l0774l4538l6912l7732l7058l5196l2510k9493
50640A641823k6761k4603k2678k0673j9031j8618j9831k2481k6283l0834l5291
50629A374739l8839m1536m3964m6024m6879m6269m5030m3943m2765m0864l8144
$$ y = [671519, 665910, 660756, 655690, 650669, 645785, 640901, 635769, 630504, 625574, 621189, 617089, 613108, 609631, 607183, 605709, 604566, 603147, 601394, 599783, 598912, 599074, 600144, 601955, 604712, 608874, 614722, 622321, 631817, 643379, 656769, 671507, 687612, 705746, 726362, 749210, 774070, 801476, 832127, 865913, 902173, 940768, 982253, 1027076, 1075208, 1126599, 1181389, 1239416, 1299962, 1362210, 1425654, 1489876, 1554254, 1617984, 1679995, 1738692, 1792193, 1839203, 1879507, 1913365, 1940510, 1959858, 1970037, 1970138, 1960264, 1941620, 1916036, 1885262, 1850724, 1813812, 1776080, 1739022, 1703826, 1671316, 1641823, 1615062, 1590459, 1567781, 1547108, 1528077, 1509459, 1489628, 1467147, 1440864, 1410030, 1374739, 1335900, 1294364, 1250400, 1204376, 1157497, 1111228, 1066198, 1022255, 979490, 938626, 900482]
50618I00482l4871l1169k7345k4142k1908j9860j6953j3289r943p501n514l402
$$ y = [900482, 865611, 834442, 807097, 782955, 761047, 741187, 724234, 710945, 701002, 693501, 687987, 684585]
$$ [...]
##END NTUPLES=NMR SPECTRUM
##END=
