
##TITLE=AC1114_Huila2_5835470_OSrS25wEln
##JCAMPDX= 6.0         $$ Bruker NMR JCAMP-DX V2.0
##DATA TYPE= NMR SPECTRUM
##DATA CLASS= NTUPLES
##ORIGIN= BRUKER
##OWNER= Administrator
$$ 1.72 TOPSPIN		Version 2.1
$$ 2012-03-26 22:20:46.812 -0500  Administrator@TOPSPIN
$$ Compression mode = diff/dup
##.OBSERVE FREQUENCY= 400.13188235
##.OBSERVE NUCLEUS= ^1H
##.ACQUISITION MODE= SIMULTANEOUS (DQD)
##.ACQUISITION SCHEME= undefined
##.AVERAGES= 8
##.DIGITISER RES= 22
##SPECTROMETER/DATA SYSTEM= spect
##.PULSE SEQUENCE= zg30
##.SOLVENT NAME= COFFEE_meoh
##.SHIFT REFERENCE= INTERNAL, COFFEE_meoh, 1, 14.98061
##AUDIT TRAIL= $$ (NUMBER, WHEN, WHO, WHERE, PROCESS, VERSION, WHAT)
$$ ##TITLE= Audit trail, TOPSPIN		Version 2.1
$$ ##JCAMPDX= 5.01
$$ ##ORIGIN= Bruker BioSpin GmbH
$$ ##OWNER= Administrator
$$ $$ C:\Bruker\TOPSPIN/data/COFFEE/nmr/AC1114_Huila2_5835470_OSrS25wEln/10/pdata/1/auditp.txt
$$ ##AUDIT TRAIL=  $$ (NUMBER, WHEN, WHO, WHERE, PROCESS, VERSION, WHAT)
(   1,<2012-03-26 22:20:39.968 -0500>,<Administrator>,<TOPSPIN>,<go>,<TOPSPIN 2.1>,
      <created by zg
	started at 2012-03-26 22:19:33.359 -0500,
	POWCHK enabled, PULCHK disabled,
       configuration hash MD5:
       1A 1E CE 29 27 FD 77 03 67 4E F0 E3 C4 B2 CB 90
       data hash MD5: 64K
       EB 79 56 55 5C C8 FF 6C 69 01 46 2D 9A 11 E4 80>)
(   2,<2012-03-26 22:20:42.687 -0500>,<Administrator>,<TOPSPIN>,<proc1d>,<TOPSPIN 2.1>,
      <Start of raw data processing
       efp LB = 0 FT_mod = 6 PKNL = 1 PHC0 = 0 PHC1 = 0 SI = 32K 
       data hash MD5: 32K
       9C 42 63 76 19 2C 90 1E 40 10 47 D1 7E 95 4A 1B>)
(   3,<2012-03-26 22:20:43.062 -0500>,<Administrator>,<TOPSPIN>,<proc1d>,<TOPSPIN 2.1>,
      <pk PHC0 = 209.2126 PHC1 = 0 
       data hash MD5: 32K
       0E 62 98 1F 3F F8 51 83 27 59 F1 29 1E 3B 81 20>)
(   4,<2012-03-26 22:20:43.140 -0500>,<Administrator>,<TOPSPIN>,<proc1d>,<TOPSPIN 2.1>,
      <abs ABSG = 1 
       data hash MD5: 32K
       0C 24 AA 93 66 DA 0A B2 FB 1D 77 C7 4D F6 7C 39>)
(   5,<2012-03-26 22:20:43.171 -0500>,<Administrator>,<TOPSPIN>,<proc1d>,<TOPSPIN 2.1>,
      <abs ABSG = 2 
       data hash MD5: 32K
       9F B6 AC E3 51 3C CE 54 50 BE 2A 3E 12 EA A8 06>)
(   6,<2012-03-26 22:20:43.203 -0500>,<Administrator>,<TOPSPIN>,<proc1d>,<TOPSPIN 2.1>,
      <abs ABSG = 3 
       data hash MD5: 32K
       1A 9A 51 B7 AA 01 1D 84 89 9F 69 39 DB 91 E8 D8>)
(   7,<2012-03-26 22:20:43.234 -0500>,<Administrator>,<TOPSPIN>,<proc1d>,<TOPSPIN 2.1>,
      <abs ABSG = 4 
       data hash MD5: 32K
       9C 5F A1 8C D5 E2 C1 9E 1D 89 E7 EC 07 9E 98 77>)
(   8,<2012-03-26 22:20:43.250 -0500>,<Administrator>,<TOPSPIN>,<proc1d>,<TOPSPIN 2.1>,
      <abs ABSG = 5 
       data hash MD5: 32K
       A9 2E D1 3C 5B 92 7C 78 F4 B4 B6 AB 78 25 3A 95>)
$$ ##END=
$$ 
$$ $$ hash MD5
$$ $$ FC 1A C7 94 9C 38 88 CA 0F 9D 1F 6D 05 0B E5 5A
##$RELAX= 
##$RELAX= 
##$RELAX= 
##$RELAX= 
##$RELAX= 
##$RELAX= 
##$RELAX= 
$$ Bruker specific parameters
$$ --------------------------
$$ [...]
##$TP= (0..7)
150 150 150 150 150 150 150 150
##$TP07= 0
##$TPNAME0= <>
##$TPNAME1= <>
##$TPNAME2= <>
##$TPNAME3= <>
##$TPNAME4= <>
##$TPNAME5= <>
##$TPNAME6= <>
##$TPNAME7= <>
##$TPOAL= (0..7)
0.5 0.5 0.5 0.5 0.5 0.5 0.5 0.5
##$TPOFFS= (0..7)
0 0 0 0 0 0 0 0
##$TUNHIN= 0
##$TUNHOUT= 0
##$TUNXOUT= 0
##$USERA1= <user>
##$USERA2= <user>
##$USERA3= <user>
##$USERA4= <user>
##$USERA5= <user>
##$V9= 5
##$VALIST= <valist>
##$VCLIST= <CCCCCCCCCCCCCCC>
##$VD= 0
##$VDLIST= <DDDDDDDDDDDDDDD>
##$VPLIST= <PPPPPPPPPPPPPPP>
##$VTLIST= <TTTTTTTTTTTTTTT>
##$WBST= 1024
##$WBSW= 4
##$XGAIN= (0..3)
0 0 0 0
##$XL= 0
##$YL= 0
##$YMAX_a= 532191
##$YMIN_a= -661505
##$ZGOPTNS= <>
##$ZL1= 120
##$ZL2= 120
##$ZL3= 120
##$ZL4= 120
##$ABSF1= 14.98061
##$ABSF2= -5.57192
##$ABSG= 5
##$ABSL= 3
##$ALPHA= 0
##$AQORDER= 0
##$ASSFAC= 0
##$ASSFACI= 0
##$ASSFACX= 0
##$ASSWID= 0
##$AUNMP= <proc_prof1d_extract_pilot.lims>
##$AXLEFT= 0
##$AXNAME= <>
##$AXNUC= <1H>
##$AXRIGHT= 0
##$AXTYPE= 0
##$AXUNIT= <>
##$AZFE= 0.1
##$AZFW= 0.1
##$BCFW= 0
##$BC_mod= 0
##$BYTORDP= 0
##$COROFFS= 0
##$CY= 15
##$DATMOD= 1
##$DC= 0
##$DFILT= <>
##$DTYPP= 0
##$F1P= 0
##$F2P= 0
##$FCOR= 0.5
##$FTSIZE= 32768
##$FT_mod= 6
##$GAMMA= 0
##$GB= 0
##$INTBC= 1
##$INTSCL= 1
##$ISEN= 128
##$LB= 0
##$LEV0= 0
##$LPBIN= 0
##$MAXI= 10000
##$MC2= 0
##$MEAN= 0
##$ME_mod= 0
##$MI= 0
##$NCOEF= 0
##$NC_proc= -8
##$NLEV= 6
##$NOISF1= 0
##$NOISF2= 0
##$NSP= 0
##$NTH_PI= 0
##$NZP= 0
##$OFFSET= 14.98061
##$PC= 1
##$PHC0= 209.2126
##$PHC1= 0
##$PH_mod= 1
##$PKNL= yes
##$PPARMOD= 0
##$PPDIAG= 0
##$PPIPTYP= 0
##$PPMPNUM= 2147483647
##$PPRESOL= 1
##$PSCAL= 4
##$PSIGN= 0
##$PYNMP= <proc.py>
##$REVERSE= no
##$SF= 400.13
##$SI= 32768
##$SIGF1= 0
##$SIGF2= 0
##$SINO= 400
##$SIOLD= 32768
##$SPECTYP= <>
##$SREGLST= <1H.CDCl3>
##$SSB= 0
##$STSI= 32768
##$STSR= 0
##$SW_p= 8223.68421052632
##$SYMM= 0
##$S_DEV= 0
##$TDeff= 65536
##$TDoff= 0
##$TI= <>
##$TILT= no
##$TM1= 0
##$TM2= 0
##$TOPLEV= 0
##$USERP1= <user>
##$USERP2= <user>
##$USERP3= <user>
##$USERP4= <user>
##$USERP5= <user>
##$WDW= 1
##$XDIM= 32768
##$YMAX_p= 468448535
##$YMIN_p= -713319
##$CURPLOT= <Network HP LaserJet P1505>
##$CURPRIN= <$Network HP LaserJet P1505>
##$DFORMAT= <normdp>
##$LAYOUT= <+/1D_H.xwp>
##$LFORMAT= <normlp>
##$PFORMAT= <normpl>
##$SURQMSG= 1
$$ End of Bruker specific parameters
$$ ---------------------------------
##NTUPLES= NMR SPECTRUM
##VAR_NAME=  FREQUENCY,     SPECTRUM/REAL,   SPECTRUM/IMAG
##SYMBOL=    X,             R,               I
##VAR_TYPE=  INDEPENDENT,   DEPENDENT,       DEPENDENT
##VAR_FORM=  AFFN,          ASDF,            ASDF
##VAR_DIM=   32768,         32768,           32768
##UNITS=     HZ,            ARBITRARY UNITS, ARBITRARY UNITS
##FACTOR=    0.250966925370066, 1,           1
##FIRST=     8223.43324360095, -133844,      -163641
##LAST=      0,             -97238,          96557
##MIN=       0,             -713319,         0
##MAX=       8223.43324360095, 468448535,    0
$$ Real data points
##PAGE= N=1
##DATA TABLE= (X++(R..R)), XYDATA
$$ [...]
23745 399496 -101270 179532 -90521 151640 -50344 -164626 -158237 -169295 251570 149524
23735 149524 -225155 -255142 79809 -35188 -92157 -247581 -99891 92337 178148 154621 -119021
23723 290923 336727 -228107 9649 -95182 247030 36562 203831 -160559 204033 -217705
23712 71696 -175370 -82120 283367 73800 96812 -156121 -229815 -67526 -191103 -275278 40859
23700 50087 522408 -147483 -86229 230869 -21408 -125067 -131761 12888 -150151 -113475 -19871
23688 -92046 153030 -175314 15064 86975 -371886 -105067 -47160 55943 14535 47078 79017
23677 79017 -162959 -195713 87222 -275412 142881 -289462 -237431 441417 43735 349086
23667 349086 -228172 -325342 -153158 107527 127724 267228 36620 68100 -369910 199978
23656 -262939 27824 80235 26778 228262 127319 -49505 248006 -257438 -258524 213615 129194
23645 129194 -287969 -133354 67412 -205259 -201688 284107 29283 -85604 109875 54382 127980
23634 127980 106966 -46565 28309 168374 38942 233734 246351 39212 162478 88827 8466
23622 68458 303529 150941 -166016 -182033 105341 234928 -213594 13432 63634 185712
23612 185712 -124766 266591 144991 -235804 -43821 152204 -56261 -229737 147296 -141076
23601 -565 96945 207784 89840 230514 -145608 -128770 -169311 7797 310331 -375394 23020
23589 110764 -47028 -109039 -178528 50107 196766 176902 326484 367155 -230155 -59920 -129798
23578 -129798 273794 -61928 106431 132674 166714 36890 107542 159282 14772 182127 351819
23567 351819 -49144 -3773 -239834 -204070 28531 -217875 270331 109702 -93011 -38938 -141149
23556 -141149 -273129 -36900 187848 119744 4264 135931 -360436 -336189 159002 -288778
23545 -642 -267315 158193 -132011 -51444 327604 -49205 -41279 -37857 -88093 177114 -73262
23533 -34877 -138591 -167388 41277 120748 -112192 42966 28979 -248752 -85242 -97769 268861
23521 100578 -425 -79685 150340 -178856 12142 -187484 -171386 22490 -194642 -320 -209064
23510 -209064 177017 6341 46751 58689 -115721 57029 -28031 -253984 -160635 -84491 141666
23498 -340219 -495070 22538 224739 -70483 85132 -57853 135578 -330771 193066 -346308
23487 142518 103932 -239839 -84181 -194654 -57139 202139 266294 -305244 74501 -44598 190315
23475 -42609 -193664 215367 207653 98091 -408731 -240044 -123235 218294 -12251 -34571 139728
23463 -15694 126743 241487 -26278 138667 34638 204236 36941 -29822 -110228 -74700 -83307
23452 -83307 396834 69477 -215597 -23670 127209 -9250 -198574 11813 33445 -30755 27004
23440 -82766 -128769 -360690 -94476 181008 -61649 -103630 143578 10116 58649 -156506 -392314
23429 -392314 91340 19890 13515 -68113 -69751 29114 -113588 79986 124243 8772 -302029 -28238
23416 -244703 90157 -160365 -77004 -236888 471272 -317999 -174172 193136 -257466 234390
23405 72966 101581 -15369 -63865 184678 398697 -328942 121432 123946 -132227 78050 279636
23394 279636 94428 52290 147223 123699 62754 -44606 -334720 -95018 -197012 251172 -256382
23382 -60719 -455137 183124 101004 -72013 224452 -315500 47516 -160185 53594 102157 -86683
23370 147526 -198722 252839 166446 -61929 288015 -32918 -315339 -29116 -103030 -75712 -10245
23358 -331859 -278549 -274513 -272140 -18634 -205020 -50257 5062 -102938 -222301 -106542 32608
23346 -64035 -127881 -536306 165163 119117 -21611 -107409 -68681 129504 175650 142891 -127220
23334 192722 -133055 -102595 -213918 17008 -72931 -40880 121784 -114283 -7122 72575 -174394
23322 258200 -184186 82805 -80140 120007 -136590 169419 -295484 -130187 207023 -271992
23311 -179913 -7140 -233261 -143508 61531 -324686 -373421 27332 -47177 264551 -245621 -55117
23299 -21458 -257949 -138966 54062 130438 -23144 -2619 80483 20007 185932 -231305 -177729
23288 -177729 -121823 107350 -339797 -25512 -171606 -51658 -173160 26840 61548 254091
23278 254091 -20511 -21556 -9240 58459 -68363 -157226 -151222 95931 252177 -296491 93914 227112
23266 227112 -106837 124840 -81013 -173065 -562 -379012 240837 -91707 62628 137673 211783
23255 211783 -117831 83179 131808 285856 -232592 179837 -140375 141072 -267165 -67875
23244 -79462 -446767 118233 -445220 -249711 -138806 -68420 470834 76404 -153111 -280504
23234 -280504 68543 245927 183953 182640 -204454 33456 -361771 140690 -36767 -92841 -313734
23223 -313734 20427 -123878 -85996 24797 -102275 -146758 -153099 -172545 -117849 166266 -136982
23211 -207544 -149109 -98325 -9542 114244 -306598 -238446 113503 6621 118087 182150 -76304
23199 122210 -43407 32913 -69785 -181513 -261473 -306425 -265036 -296692 -36487 234154 69648
23187 -250743 282894 176410 -37374 -183535 -209813 88106 137264 -171114 -20972 -7559 228255
23175 103845 48622 -63311 96367 -245841 -275650 -7329 -233302 108507 121670 -26429 -90269
23164 -90269 24627 -413844 -152859 -187824 -51164 130495 178034 60634 97061 132360 176074
23153 176074 -43026 143856 -218493 -10211 -9846 -119801 -39662 -283009 -426934 -47672 9110
23141 116052 -81360 -9117 -87793 -11046 -151889 -48212 -75428 71573 83820 -356444 209117
23129 -40015 97307 299441 178067 66687 85368 -89959 -51099 99200 -312 72537 288119
23118 288119 184552 -223128 231064 327989 130066 166650 -278842 51205 206757 -185577
23107 158188 46614 -206789 -121887 47417 5410 97419 -175553 -379276 -8190 89670 129735
23096 129735 597070 368327 147149 230802 89292 -207831 -8315 -232976 -129699 197531
23085 96732 17637 275242 33533 103791 207410 20934 177902 44019 15883 -111110 47064
23073 245924 -187938 18063 -277444 -142606 67090 17348 465517 33563 -164360 -7487 202470
23061 -367594 -3685 14825 -34744 -369447 -26990 -77893 -137731 -46471 238905 39774 84964
23050 84964 -359589 201803 -163351 -182971 127121 182402 91264 202077 -119329 -104581
23040 -104581 -46870 122646 87352 -210775 -53803 -204206 144520 -210951 75777 -140219
23029 175006 225290 75852 36966 -190929 -162149 -62970 300539 -41624 122843 -136496 -109778
23018 -109778 -24599 -103198 304120 318276 -4743 -78116 39264 -275425 260975 16606 -941
23006 -231152 -274872 -282829 -37474 15958 165807 103089 -145145 -153418 63637 4497 -168551
22994 139668 121484 -49763 121311 -98838 -106115 -323103 -110154 -79326 -85447 -368464 -5746
22982 -54366 -84958 -25984 38557 -49175 -63622 -88644 254822 172861 64989 -47215 140255
22970 295266 -324855 253179 245422 164153 -124470 -356331 26389 228022 28061 -361102
22959 -234636 -94996 95605 23926 -77289 -102137 -67735 -218733 -153129 48003 -300029 -151046
22948 -151046 812 -46610 -33993 370708 44735 -177205 -212038 -5568 83709 25528 -367877
22936 18463 82765 21008 -269151 -121448 -223256 -61253 -83506 -248462 -5773 -77803 59958
22924 -297263 -218695 -89664 -330680 -180005 -34709 18984 -67186 186243 10157 172920 -136562
22912 143581 -55955 -263075 81317 -58060 -153772 -7600 173866 -107536 -152022 130041 108026
22901 108026 -38068 12594 -80852 -48620 34252 -95647 110698 -351819 -101945 -80905 -360835
22890 -360835 -126541 164418 40385 81229 -259107 -66514 -21572 209383 -46572 -21170 -6130
22878 -5736 -46888 226612 -239988 -14153 104245 -237958 121584 -167875 2082 48835 -160072
22866 -345865 -191862 -71205 -35170 159039 12016 -53959 -62320 -145897 43747 53774 83110
22855 83110 115850 3385 149447 -47162 297131 76124 -167825 -5903 173137 -53068 53433
22843 -304494 -206565 114038 -267462 391448 70656 -201547 -85296 80641 -29140 -117657 -16769
22831 -105412 -280264 41262 310364 -175078 253555 -203698 -34636 -206348 -27014 2954
22820 -198534 -37678 -208962 -180254 -106812 -238150 171083 -41247 -129794 105246 217697
22810 217697 -124050 231147 95679 199489 -290058 275080 -60149 -102270 81540 -295671
22799 140371 105605 80606 -8318 -266684 -45580 192437 -81689 -60759 146732 280643 -44889
22787 -14195 -132386 70092 -91047 -41725 118138 -86096 -58936 -46937 -231740 6014 -401372
22775 -267032 -103388 -60541 -29823 258401 -15775 -201687 -237639 -130275 -236493 135472
22764 168748 -297315 33342 207334 -84788 -57301 375236 115842 109034 -56855 -86082 306102
22752 -370892 -217080 299020 -167916 -27181 -142895 542 -372722 -92779 3175 -175867 268948
22740 293744 38137 -12754 72229 237900 -164194 -82582 -282494 -142665 -13644 -42508 29643
22728 -338810 -389464 -32628 99938 38561 -187186 -330223 -259021 -291831 -102827 345880 198670
22717 198670 -99410 -188729 89168 68291 -125548 -92091 -44564 -9455 57662 93538 199505
22706 199505 288104 22122 -38040 -152807 198378 -322590 -88056 134976 189854 -103787
22695 -204827 -9524 100458 140583 36336 224506 -326993 338685 -85021 210432 144156 68175
22683 -206261 123483 -194152 112231 -1521 52599 -241581 61910 227040 43932 140233 -1092
22671 9276 -18409 172956 -139080 -52664 224215 -432046 2696 72861 -163622 -77380 -103554
22660 -103554 126757 -190756 -329180 -89370 -248748 -332632 -81302 137889 -39641 -387 186081
22648 -45684 -32113 218737 -155987 -125221 -67963 133711 -32051 -54564 184304 61567 -56286
22636 93273 -247045 -159335 -174469 244759 -314622 8123 50905 4327 18716 -107838 -233044
22625 -233044 92021 152393 -303714 -207682 146221 -53264 54883 -28315 83296 -245211 156266
22613 -246189 124130 234582 -74844 -302815 -47922 119672 1934 -23591 198768 -232594
22602 -246384 -329624 -166220 -361898 -79082 -64349 -98098 -25959 -218576 88252 131900 -11494
22590 -55113 -181692 -56847 147370 -83371 -165071 -82516 223715 -10577 -22964 -53736 -153160
22579 -153160 -43840 166867 54439 -130859 -393765 44292 -207637 -168092 -254880 232580
22568 244287 11503 150583 -223177 160419 -111458 -227615 -215731 39881 -114343 -57250
22558 -57250 101998 -396986 -358426 183897 -246840 -139254 101293 35409 -63493 -195527
22548 -195527 -42869 166765 305293 -132745 129322 -190205 -372324 -25270 -174704 -66426
22537 58458 -125156 72739 -492941 242268 67954 15855 -452974 -35720 -72407 -212004 101398
22525 -100020 47426 78150 -569812 200234 -211624 18151 -63206 -167318 44312 -261554
22514 22695 39147 -86542 -235624 -391824 -407268 13956 -240350 139703 -141328 -7030 -56949
22503 -56949 -375543 -191331 -80914 -44435 -17314 60565 -143115 129630 -192796 256497
22492 229512 187622 -291956 44526 86804 -172379 -187706 96531 126579 -348819 -82185 -19363
22480 -221707 246201 146246 -84074 -213911 -266324 135725 457 107219 -32687 15296 -30384
22468 87363 270076 100385 175432 -108417 -11980 -213724 -165975 493560 71309 30727 307993
22457 307993 -77335 18196 199997 404018 -3522 209536 -97579 -223632 -148846 -56082 -269567
22446 -269567 -70608 152241 241830 257266 51966 -171040 46960 -111632 -142197 -118829 -19179
22434 -84064 -17403 -281748 -330577 -151014 -101755 -24187 -279436 235088 -14688 -293876 -337327
22423 -337327 -26939 -156554 -400993 133505 1784 -127109 -60900 110265 1952 108392 86301
22412 86301 -95246 -16847 -251388 -53862 213947 -100002 27167 206115 -25587 -113563 -217790
22401 -217790 -113640 165023 -24414 -120649 83481 -111521 1994 275317 144037 -146637
22390 -185370 31361 -231 -106724 -130949 -91713 -92446 -19935 -129829 -114936 -64337 38275 285479
22378 285479 -353247 47427 -26525 23461 11457 31400 -14890 -126374 -70004 -247477 -173366
22367 -173366 56185 80809 -52452 54097 -72148 7920 -31540 -204228 38427 128553 -132691
22355 75996 -371218 -89986 -161990 -111308 -297953 132532 19987 -111873 130205 277983
22345 277983 -104287 127593 -6102 372077 5486 -185192 59659 126516 73512 90311 110036
22334 110036 42262 -14407 -220676 36558 -192967 -224286 -254826 -11305 213773 170803 -152371
22322 -66159 -407996 -428895 65015 -30993 -105151 -64931 446626 -151262 173170 263520 -164520
22310 -316955 -68584 95490 -16506 -264567 -270053 -45049 -225956 -32833 46556 91102 -88417
22298 36428 182979 228219 244502 -17234 -154392 -165673 -58579 -160565 -4154 361640 -174140
22286 -170014 146140 124378 -157793 103148 150803 -307696 259950 -31211 90735 -15937
22275 50760 82909 -216551 -4790 -138502 -133125 -17137 -145124 41342 -125941 156705 -71275
22263 -4016 184972 -4262 167883 -107373 -43312 -308737 -188619 227838 -97035 -196185 14320
22251 -33099 -198433 -66720 -388095 67313 -176349 89757 83299 -123615 33887 120461 19152
22239 -204322 166407 -129367 -222226 96044 50346 168396 -199639 -173052 -72070 137834
22228 -64869 -324984 67758 -82937 6007 158361 -216140 46525 -114716 -376114 200144 42334
22216 -56293 -118209 194483 -106501 -122631 93042 32033 240323 -4318 -63357 -51886 -119742
22205 -119742 91878 108373 77960 -135302 -204130 -280539 132543 -128272 109768 -93928 -51520
22194 -51520 -159340 -114036 -59326 236539 180756 -55293 361103 -102511 -84435 -43930 -62527
22183 -62527 -124136 -48886 -288643 -220563 -235541 -402904 4695 -100299 57052 -150856 -33397
22171 -142082 -118353 -68469 -77274 205190 -246156 7700 -352658 -14377 -241133 -221479 -51269
22159 -388687 -182359 -58221 -81291 -105839 25474 12475 -177841 -118611 -201917 142359 64159
22147 60131 -64115 72347 -113432 42201 -17406 -265507 -218020 -286707 -14619 -152864 -181204
22136 -181204 -165033 -273130 148818 58303 114061 -120042 -106430 -59234 232332 -123707
22125 182344 4178 162849 -135237 -178505 51427 -226156 -2633 289211 58474 256237 -168392
22113 198093 -5691 -260600 147142 -251820 160956 -37219 -161220 72580 -186449 145422
22102 -12740 -206343 -35913 -336163 -280551 -291514 -132894 -191558 -373487 -97740 -64161 -104838
22091 -104838 -5242 -99271 -188773 -334627 75141 134436 207963 -74797 84924 -17112 -58952
22080 -58952 159544 -105092 -106730 -230611 -151523 107566 9534 -284458 -30065 -150805 -22199
22068 -31377 122418 207009 13558 -174099 -159880 -228728 101874 73895 74613 112413 -135388
22056 -19477 -3238 18629 -7140 -291707 54815 -54780 -115449 130749 -7908 -560665 516540
22044 -32284 -17744 106265 -101959 -338392 -367378 63965 144638 147675 -113007 290928 -95844
22032 322475 261517 -247609 -457886 -367767 191764 -196877 271171 -159069 -123533 -120093
22022 -120093 -77015 -166560 96857 63524 43677 -68384 -13822 109717 175039 130500 96473
22011 96473 -161876 -7888 466794 -122868 68581 -181145 12589 -395845 92806 -121901 -32727
21999 -49726 -288524 157275 -154241 168186 42192 -9516 5742 -339569 247277 225261 -14610
21987 -12159 102894 -165535 -123771 29252 -24466 267035 28434 269059 -252577 417510
21976 -80739 34505 -203927 71875 -229318 -30613 94462 -90763 28481 -81894 416039 -157575
21964 -30923 -18973 38862 13964 -41484 -61987 -25861 59912 145807 -146819 272976 258719
21953 258719 92493 -42818 124887 90574 194441 199513 -187685 -70930 -8892 28129 -324686
21941 -191717 -200390 44539 -173949 -190563 -38781 -92656 -87175 192555 -108508 -118283 -183617
21930 -183617 -98439 -1650 11816 -19113 -160682 -94804 -190709 223413 13119 -283197 86231
21918 -313779 122394 -50888 -51414 93367 -60486 -126982 -382904 -80055 -47712 42763 12519
21906 92888 -13585 37182 -212520 -132360 90384 -209993 50896 -5198 260421 19118 -93671
21894 -9673 -146105 -2665 129476 -174283 56996 255048 -11852 36841 21455 -55947 -195815
21883 -195815 17913 -246719 -42908 34115 -199861 120983 -314587 14007 61496 -165629
21872 -441556 -267003 133990 -98169 60528 87751 -207737 420094 -315427 4093 54568 -179511
21860 -1791 -102406 73198 -467820 -322663 -142503 -229611 -53833 -78602 71269 -116597 -276285
21849 -276285 62305 177775 141986 139900 174654 -314144 -190932 146443 34542 -62809 -9571
21837 -165186 -195507 -248344 -101668 -44592 84119 -43500 109355 -35061 -62676 4465 -218019
21825 5278 -133333 -8702 -34964 -419424 -177460 -110424 100506 -115793 -33437 -152913 -350943
21814 -350943 76339 -91950 113654 -162635 -65110 -310940 -191669 -346441 -55607 20349
21803 232741 -365570 230917 53194 -84293 127738 -351570 -112632 -39414 -45862 59117 -165936
21791 -136112 -110214 -256309 22689 -279793 -20487 73502 176346 113742 71412 72071 -254431
21779 -61470 -27126 -175415 95582 -59848 26902 -165935 50551 61062 -167850 194864 -257108
21767 -178594 -4685 -83927 -318076 395554 -120952 -99822 156366 -101957 -100154 -142064 -410239
21756 -410239 124783 33053 -12479 -32824 39985 201220 -146114 -227185 136298 273877
21746 273877 29547 -105624 -38320 -65067 50695 -273436 -101632 364474 235024 6397 -119547
21734 -149335 163372 -162944 -76140 -108423 -215012 -105508 329634 -97768 171529 -154998
21723 221840 91688 198969 8385 212307 24276 122397 32344 -290758 109544 -19717 2447
21711 154002 -191889 274171 -98537 -215062 151289 233549 -98362 -1174 -275834 31917 -348204
21699 -13414 -108843 198433 7071 -12822 -213266 175661 -227001 -78317 31049 -96222 -145604
21688 -145604 198665 -245702 -92309 43080 -193350 -87733 253352 219163 184457 -210676
21677 -307772 -249496 143221 365278 -25950 -35085 -120989 241335 32735 -118971 -128800 -73554
21666 -73554 87586 -429536 -19970 -114717 111060 12447 121902 -245393 177991 26383 -91361
21654 -66315 116808 -282765 105934 -85122 263862 -9863 238678 171426 48096 436659 -107019
21642 -202886 -85395 -317789 -185076 56724 -143651 -40222 -262389 -301461 -8837 -20338 52263
21630 64284 -241767 114023 -197540 179992 -70700 -343687 -83814 41145 -103688 -268515
21620 -268515 -123840 35659 -45690 86372 108134 145882 111717 101638 63906 -201096 -99686
21608 -409991 1864 -79769 -34810 -2924 -117385 -106762 -58964 66146 -265863 -17573 -92624
21597 -92624 -154856 -211592 56877 56202 127640 -35731 -401789 -123346 -324374 55244 36756
21586 36756 -353015 -119693 219417 45329 217222 -345291 20745 -91029 -274483 25346
21575 -449391 -30808 -281056 -111339 -51114 -214011 -115013 -16616 -57660 -45515 -226844 -36750
21563 216494 -380197 -143987 63185 166212 -146478 -178407 -180074 -24241 84082 -108037 -263876
21552 -263876 173610 -238754 -65 170523 441527 -260576 -211888 -118340 -121402 34788 263860
21541 263860 12195 -284666 -194097 -304455 -100308 -60543 345531 -235214 -73456 -162970
21531 -162970 -116695 -158680 29772 -20205 -279477 -215381 -239136 289647 -100569 214258 -159559
21519 4303 -51699 -137650 290286 -54255 118565 141577 -53107 -149856 49458 -112530 -47452
21507 -115600 -323603 183737 11597 -43991 -50700 71160 -122436 -366216 -401888 -95755 -138132
21496 -138132 66073 100742 -313378 -204736 -143088 -241020 -215441 -158514 -159482 -336276 141586
21484 -338575 12568 -531139 -8651 7225 -294688 -84598 -164642 -153751 219632 140489 -209030
21472 114499 59434 -11247 -336962 90707 419494 -112846 133351 58344 -70459 95350 -156850
21460 266484 149381 -147393 -250854 80016 65454 -227647 -21607 259656 -1990 105377
21449 -417519 -80700 -114079 -80924 72732 23610 109387 -89565 -131488 -102532 39894 248042
21438 248042 -75123 147479 76156 -75050 87843 -38110 -186190 171022 79173 -176929 15982
21426 62255 42757 440326 202174 361420 222713 305068 64797 245360 4887 130504 -90673
21414 52320 -427445 304403 -10192 -195467 -98816 112189 -19187 -194465 -63245 -110929 83609
21402 -113949 -39586 90076 -283308 -237958 26221 -127378 -15226 110873 -132317 115993
21391 -180402 75648 -105800 -159592 246283 -77653 -143080 13802 6242 236869 152374 -229863
21379 67427 7169 -441296 -228952 94878 -34803 3168 62421 159740 -190019 -114581 -332601
21368 -332601 -48248 26887 -284730 8660 85458 -236370 328791 -208416 222879 -99341 70377
21356 -272350 110128 52108 -8522 87040 -8913 -150050 58135 -165484 -202539 68867 -114228
21344 -186572 -6494 225347 -21318 -253840 -78864 30360 -153486 -180993 -345676 -181193 -247433
21333 -247433 21091 147020 -230747 -67394 18751 167512 134472 58624 210975 4315 -25393
21321 -35652 -310726 -65777 110490 -200993 -99188 -181329 -165648 127030 75366 26693 89357
21310 89357 -165893 -243903 -80728 52147 -65265 184540 -300662 -50340 -103744 261238 -197049
21298 -213388 87674 -104673 -180701 -86047 -79410 5203 -21565 -96833 -7008 173961 -74923 -147108
21286 -147108 -347359 92243 -178314 -10216 136835 -211112 -401829 168341 -105537 -181329
21276 -181329 -343135 48992 -234255 83064 39162 -211084 -348419 36840 35035 -34154 -122694
21265 -122694 -59409 -162702 -430798 32382 -73317 213877 40911 -189442 56966 -200658
21254 -89819 -139315 31446 176575 90812 40381 -153897 -60751 -126508 -15803 22536 -78764
21242 -221721 83823 96104 53694 -96132 -340592 86186 69067 44270 -510403 104126 151889
21231 151889 -9740 -165874 -112080 -96656 -208621 -204114 -77551 245262 27110 -152985 -149463
21220 -149463 -23109 88799 -185925 138807 -306162 46636 -64353 -233154 -198746 297603
21209 85645 137558 -36695 -49748 -283200 -261175 -6381 -194961 -94743 -179718 -9924 139571
21197 -547037 -18015 108076 -106058 -217518 -272100 -119221 -347311 -187696 -24391 -27866
21187 -27866 -377345 46615 -293017 -404356 37131 -182533 -58713 37229 -157651 14761 181786
21176 181786 91739 -383966 -402473 202703 -113745 290623 -131410 -173797 24315 56047
21166 56047 54416 243387 -58470 -147844 -221441 152580 -100220 -129200 -134797 -332985 -68015
21154 29953 -138556 -52097 -152819 208973 164706 59394 -64406 22922 -263972 134248 -219160
21142 -109922 -203886 225510 -97342 -293959 -48018 -120319 94248 -25679 197908 60109 -3533
21130 -344847 271317 24846 -287454 234485 -20084 -3225 3729 72927 -164392 147227 -195527
21118 3354 -224619 -155383 26897 -27452 -107254 213083 64643 169363 -108255 -55951 75763
21106 -214950 156656 199042 96171 166152 -394705 -93651 -75902 16237 155550 37004 -232143
21094 -74039 62152 -16892 -295739 226497 -174615 -226918 108522 -117381 -113836 -235653 122667
21082 62245 -68441 -141185 127882 175786 96422 34036 -73998 78909 141493 -98073 -79865
21071 -79865 -239428 -101321 157539 -279419 25108 -121809 -257947 92705 145128 36083
21060 -506 -154215 -21965 333582 151239 -368018 -288229 -233529 114583 -15937 -215750 -178211
21049 -178211 -330691 -172625 -105418 -199635 -42272 -169724 8256 -103541 -71183 -28667 -126300
21038 -126300 -85643 418453 -51211 136936 -38146 116644 39939 5278 -240038 127774 -88180
21026 183734 103020 -108818 -243124 67998 -51757 -57284 -66243 58281 43807 109764 -230962
21014 -50622 83450 117182 142883 -139348 184537 -34803 -228385 -316260 -55543 -154554 -84883
21003 -84883 200660 -272082 -106421 -35763 -477463 62379 648561 61817 375231 229625
20993 229625 441782 173630 599138 376089 191778 -81639 -54588 80722 -199348 128430
20982 27841 -213064 -16878 -409399 155472 205576 -279613 -343358 -49951 -147638 -82416 -89051
20971 -89051 33612 -182659 -265143 -96419 -75019 -168396 41366 -219399 13728 359442 130095
20959 167093 27016 -27124 -220114 -111692 -127651 -185797 -69941 63591 70768 -184575 206607
20947 -24449 -65878 -4937 120869 -337450 -19006 -114833 -90964 -66331 -518188 -13822 138777
20935 -49405 21276 184020 -11452 313663 176661 314995 321580 163094 205845 110874 260122
20924 260122 -162238 16162 73083 -60762 9499 -76133 248814 -52474 44816 -25485 -187618
20913 -187618 -79581 -170862 225203 -128800 27426 17160 112717 -135950 145506 -220775
20902 213703 -192893 -112277 -19052 -99964 31780 -49011 -194411 -244568 -147404 -89796 9123
20890 -14705 -131643 273062 -18895 -234886 -279242 -235134 -54527 -72444 22225 -549647 -304257
20879 -304257 5908 12566 102128 -130076 23126 32599 -855 12116 -131796 138609 -69290 -9859
20866 -397975 80528 -205120 -19874 -29329 135841 -210406 -155921 -230725 -44029 -90216 -42801
20854 -189481 -63144 -39870 -348440 203613 -22099 287621 149314 -278950 -38339 -150379
20844 -150379 -171352 -190180 -168671 -176060 35121 -251724 -306751 113462 155867 -89351 -140147
20833 -140147 38324 133555 20717 24815 -48573 6029 -76220 -84931 -230833 -209196 99752 86981
20821 86981 -231736 -123996 -111088 -47642 -275610 138701 -254351 -69896 134432 -94466
20810 -418960 -156560 151515 -157085 -226833 -149281 316965 -368960 11103 37204 -172208
20799 -86976 -299793 31765 215708 -162124 146404 382366 -334044 -46169 -37888 -126936 147146
20787 42471 96646 -102196 -124010 -116391 -91356 -207223 -99468 146664 -350508 -19546 126748
20775 -102376 -68740 109390 -154564 75849 23759 -64455 84610 128139 -188092 6952 -190337
20763 -33417 249866 -140248 -264108 -13404 -160963 -186626 -334189 -167714 166996 -333802
20752 23347 199023 78112 -142334 -90687 226956 -197370 -35945 -81401 357050 -176124
20741 -115752 66653 -59360 105485 -20022 -128288 96363 204171 25810 -44958 200512 -161400
20729 -97771 15707 -13265 -289543 -17428 173770 55566 96091 -18451 -146364 -274724 183578
20717 -4933 -89798 -109901 -314926 -306619 183866 212486 46701 64772 55609 44924 161313 101974
20705 101974 -210745 -62142 -92448 -282654 -210764 -281163 -75647 -423192 -193547 -68178 110439
20693 281634 -147472 -418737 41403 152122 -292802 -233189 310393 -175267 -20425 -161183
20683 -161183 -112070 32021 -50043 140285 9877 -281619 -8414 -171895 -3765 -10047 106801
20671 -122070 30223 177451 -84990 -211940 -280131 -10343 -106649 -90774 174969 -128082 -251711
20660 -251711 115003 -104572 -198539 -340495 69569 -442533 -165131 -279263 144265 7329
20649 -308399 304528 77531 50443 -160922 -89956 -145983 32906 -250111 -57717 125755 -352506
20637 205117 -129494 174689 -184518 -327843 -203335 -249416 73812 95775 21553 73179
20627 73179 -259762 -85968 -73589 255526 -22316 -54672 163123 -114872 -574 83104 -47227
20615 -202742 14062 -100279 -43146 -193574 -52934 -178030 249296 125984 -21655 233862
20604 -270673 -160723 -36611 -176366 -343784 -3368 1035 -134472 -196666 -143696 -197474 -44537
20592 -140307 -141737 -124445 -71022 -139907 149593 -219612 -70794 -322506 -138964 9471 -121653
20580 95151 448 -109026 95221 143879 -213042 115482 251914 140016 104279 31864 118474
20569 118474 -90037 88513 -39107 192586 -166465 68507 -93425 -215744 -125409 115474 48182
20557 -125009 -53343 9452 -196648 -62589 -274160 -349802 100129 237030 -310407 -32301 -290356
20546 -290356 -117558 45318 209968 132553 25305 -156100 -38107 96034 -445451 153616
20535 3028 -27538 187796 -110098 -130773 -65700 -192973 5344 -97032 105733 182248 -393624
20523 235526 110770 -139503 -91432 -129121 -408674 -28259 19955 -62775 -11937 265009 186131
20512 186131 -404836 -52014 26592 -114590 212519 203306 -27797 212643 -69050 -132329 -71645
20501 -71645 -121129 -169581 -9862 110657 179320 -295488 201746 146372 48662 341632 544147
20490 544147 107836 -46078 -119247 -15139 -78396 -375634 -226722 -31057 -50641 -158330 -216179
20479 -216179 435434 -135196 37103 -442756 -112287 -197658 -168412 168570 -127028 -102553
20469 -102553 -253002 138443 -357635 -37920 -296330 119698 -384236 70092 -170990 -51587
20458 -142416 -301108 -88311 30421 98540 -282680 71339 -11737 -46679 -390769 70960 -260758
20446 -211483 187288 -292522 201946 99849 -347149 104650 48868 -98778 -21093 25596
20435 220039 129823 -96399 -380100 -39420 -8289 -4829 -13222 -37681 2968 52209 11901 247123
20423 247123 1478 84188 15520 21256 44622 337135 -273025 -150454 42710 -117009 286585
20411 -148537 -214676 -65106 -50115 68565 -243250 -349367 136771 -354486 -135262 -150700
20401 -150700 -236261 -63388 -337405 54288 -321282 -88193 -337018 -43449 -151516 -48080 69100
20389 -220371 -4559 -239544 -196252 -548594 -505440 -344399 151389 251386 -162763 196846
20378 -405320 -494596 224990 -164160 109489 74717 -11074 409113 -84186 240708 -408299
20367 160173 -264280 56728 -133812 140785 270307 -223877 -250197 158053 133553 -45066
20356 -181517 168035 252789 29059 -79927 -88521 288890 -119975 -212891 -144270 12548 -158929
20344 -52292 -13705 -275690 -105134 8474 -79576 -41266 6655 76781 -166876 -13876 78196
20332 -317951 -119485 79352 -179534 -87738 -51313 -98420 -75540 -398330 -82472 107479 -57719
20320 -37749 7465 142017 -153713 -366530 -284714 -132862 -13057 236276 -89430 -256162 -252504
20309 -252504 76937 -206078 -385827 133094 40523 -368536 36241 -364879 257779 -135540
20298 233282 48213 -215279 -258843 -260641 -8014 -57399 -124431 -198305 44538 -335692 9421 58952
20286 58952 -489612 -160442 -397197 -139478 46880 -61063 -72300 -198432 94337 -182873
20275 -137132 -245196 92470 15110 91834 235248 -7138 33006 146103 55463 139714 -259845
20263 -26206 361583 -422710 -181921 63691 53315 -97338 -49094 -203641 179933 134286 -206470
20251 -48916 -457989 73751 -189121 -27876 57093 48859 -64828 -42964 115875 114540 -109389
20239 -48099 96375 -211998 234788 247959 102331 -30822 -107555 181940 -291131 -84867 38006
20227 -100462 -62445 23166 113649 74338 -172478 -279374 -119919 -158436 86549 -216210 78485
20215 -99191 -14332 52399 -35077 -218523 102195 -92268 -155854 -98269 -142356 -64229 -307016
20204 -307016 -390398 -19262 -261029 -101323 -149786 -200089 -9553 -51868 -88727 -75416 -64968
20193 -64968 -87526 204507 -132506 -182653 284648 130111 144039 221603 212276 9124 -10876
20181 -137535 -3753 -351498 -196927 -186456 -152567 227476 -349519 81254 -210500 168231
20170 -176304 320163 80003 191709 178560 -45833 300390 -172088 -237643 70467 -213174
20159 -419574 239858 211034 -221105 -106256 -127976 -36047 400677 72520 -31900 195135
20148 -137400 104884 108017 406128 -186185 133524 114710 -48224 -21689 11243 -22921 183490
20136 -362498 -172477 -106340 131028 404160 470159 79678 157816 265421 173089 -181398
20125 210647 353105 331839 254201 126804 37204 -175179 -6298 -101159 45079 -414355 52909
20113 159651 164547 -188826 94420 -15247 -339479 -263430 60979 17033 -4916 -302649 -349174
20102 -349174 -88312 299568 152719 -131921 -199093 380994 43417 229755 -155359 73823
20091 -434825 -4770 -183830 -51420 215258 -66455 -312052 -433332 -92721 90078 88978 -465912
20079 -432315 -332218 167588 163959 -177275 -14558 -151553 -24311 -76012 -259106 -178068 4624
20067 -306659 36289 -31624 -189072 45558 -217144 54010 107329 17481 -137665 37441 -231134
20055 -165366 -248729 61287 112473 -126939 -210872 36771 -140288 -300507 104770 70298 140976
20044 140976 -95750 -463233 72626 -153686 -287247 320949 -111107 38108 -200403 -341437
20034 -341437 -182922 -10753 -162220 130320 -118332 187616 -2217 39748 -406700 143951
20023 -116754 3054 -29110 -181302 -254774 -126668 5204 227032 -117847 97461 -87255 -65945
20012 -65945 -117788 352339 -25968 70092 225940 -166871 -384002 -128335 -231779 237907
20001 -390468 -79496 247747 -184687 -24572 -296858 43486 82440 -250245 44956 -58563 144585
19989 -202042 -305102 -14819 42015 -77875 -117408 -7276 -57712 -53451 122909 86447 114093
19978 114093 -254792 117311 9789 -116441 95955 294020 10120 49863 218899 36925 106719
19967 106719 -247872 -89559 -128739 -107191 -96918 59052 -60779 -110626 27044 130403 99234
19956 99234 -120700 115279 60754 -13944 62962 63561 137980 -32495 293627 75739 462030
19945 462030 -85913 323282 215902 17073 72181 172840 42633 33704 134643 13044 -115479
19933 -51255 76791 -68391 -385364 76082 188196 -238651 -29050 226255 -314956 -20117 -255379
19922 -255379 -273335 236633 72524 176862 56082 -37635 26692 -97332 249080 -268835 -58016
19910 127119 -255897 -97761 -117445 48649 256246 222348 71225 124 -159888 -235674 -563982
19899 -563982 19502 -206068 -148599 -165561 419281 92850 -39314 9870 -203741 68699 240533
19888 240533 248755 -43897 -79799 304443 -70591 -294353 37921 78922 -227776 79570 -264689
19876 37728 -86137 -132943 206680 -134007 19338 -188718 -205794 -165657 79329 -93076 -98498
19865 -98498 -14759 -295402 232336 -213671 -130726 -259825 134355 -90440 -176061 113021
19854 77641 -73186 254385 -112988 15123 -216174 263994 -244026 9458 157729 -267933
19843 84182 135224 117862 -285769 -138771 -80264 158840 -157804 -83238 264243 18579 64132
19832 64132 -44979 -182126 62458 126701 13894 -179954 24711 162650 -148491 -293986 -55640
19820 -95281 -13990 -37016 -31299 482145 -172444 30748 -103585 54593 -376931 -262902 276183
19808 -6062 2400 -32339 -43102 226069 -304062 166299 83559 148506 225057 68852 -209269
19796 -130444 -482204 -122435 55189 307277 -422182 -31570 17867 -233315 -41938 -183184
19786 -183184 -142745 235813 -129418 -353305 -24220 53918 -146954 -14242 101155 27796
19775 58337 -169819 -289330 -336693 43106 2578 189207 -49711 -67099 -284665 -294019 -58700
19763 40552 235326 -309892 -176102 -111512 -118500 -98296 -18313 -96707 63055 -118691 -336353
19752 -336353 -141097 78453 -222568 260228 34093 -158193 14508 -219945 -176989 -94812
19742 -94812 -33121 -121363 -15242 -103197 40567 70537 -151209 -220450 -98718 -47910 61833
19730 81874 -111386 6595 6336 -260555 -109474 -85440 331990 352906 -263849 79889 311848
19719 311848 196740 84877 44901 310173 527810 235525 587524 -63569 42722 199071
19709 199071 -12349 370378 290486 -6373 -81058 -13586 230878 -356576 -16778 -27378 114969
19697 -383159 -138190 27182 -155359 -25424 -118849 -75462 177087 83930 -159827 107990
19686 144444 74842 106974 240493 57713 104001 173055 449683 19342 122916 -202659 -318717
19675 -318717 75973 -74645 -65111 -84153 -194255 172106 -97735 -231316 187060 14669 35813
19664 35813 10155 127548 -83266 -261412 36630 -108582 164049 -83572 -478 -33539 -146007
19653 -146007 -172215 -200529 -630 -270906 5209 55748 40916 -53212 -105350 -1449 231653 -23508
19640 -131954 -444604 -221789 -168045 -134961 -152614 74671 175625 -86774 -174363 -72035 -118735
19629 -118735 -380453 272944 -68460 -223570 -434081 112933 9337 32210 -207964 194707
19618 -142952 78469 10709 89511 175493 56912 -152235 312561 102906 246582 84259 -170084
19606 -145667 53397 205342 116119 -46859 -52813 -177648 111388 15608 -92640 104485 52033
19594 53014 4054 -105650 -77369 189657 -182008 108618 71817 -398530 -122307 -200129 -71798
19582 130385 -292823 126317 109058 52052 -93426 -329361 -169273 63306 -47856 95609 -139383
19570 166204 78798 -196726 -211392 -352544 -230371 -149938 -66138 -195972 -273643 273196
19559 104479 113162 -30991 -142223 -106460 -159351 -125983 -173549 95202 148043 -73101 -329980
19548 -329980 -187583 -135000 464261 -277630 -308511 250347 -236191 -205079 200699 -180927
19537 -95284 -175026 -139613 -213913 -30461 -83872 -270002 -366238 449284 -114855 -296301 138350
19525 -346966 -153079 -50598 -66708 -102678 -249191 -30382 -121073 157554 -62268 -44326 -223046
19514 -223046 72223 -95950 -4967 -390391 -146436 33678 13476 111253 141827 166726 -10613
19502 162577 109942 -144958 -60059 -37486 -207244 -90691 -118655 -49766 -338303 -101202 -51093
19491 -51093 -132583 -29205 -319544 -320418 -87653 -8457 244774 117799 -244084 -207089 49347
19479 99808 -89728 73446 -174789 -201330 7197 -12710 2826 248071 148486 373767 -222677
19467 -69202 -66610 -352 -75583 -185768 -152750 -176176 98342 210821 269183 316974 -96608 -27475
19454 -123092 60173 -44956 -157450 -117684 -103169 -151528 52648 124511 15667 -222298 148564
19442 -89580 -39892 -275576 52462 -274569 129722 -15555 -158660 47239 -151927 128015
19431 108300 -235524 -134368 153737 -184955 -368209 -199768 -373172 90438 -192867 -251584
19421 -251584 -116655 40736 209602 -221582 -313873 -313506 -25879 -241699 -329972 -54178 -35009
19410 -35009 118039 -191481 -345632 -210768 -41109 74102 65212 -5717 -184110 77686 42104
19399 42104 155246 -78115 -111766 -6620 -37972 -232772 -32442 -105193 -152633 -341593 190550
19387 -228625 105715 244020 -274490 -115408 -51683 70586 -203004 -231830 227475 -327199
19376 80114 -365137 -167733 81964 -24601 280670 -457051 -112458 -152628 -196070 -79883 -118683
19365 -118683 -266217 -267828 -405629 165250 -63957 75164 -32310 -103925 -285563 -331365 -213584
19354 -213584 30984 -30351 -81638 200473 -18609 38492 -184168 -60872 227964 -27069 -24774
19343 -24774 -50745 -143016 -255324 -243810 115972 -108465 -201835 -351331 263289 -234871
19332 -354410 -120512 -528151 141423 -83977 127797 -151236 41234 -418329 23435 -233066
19321 -36379 39694 -69132 -4992 -49550 -71066 -374284 11405 171813 -152656 -59279 -124272
19310 -124272 59453 -239612 -101264 -168324 -169108 -282198 -250392 164810 -9290 -335507 -266638
19299 -266638 -36538 12810 121200 -153232 -1403 -68270 -226775 -79847 -56853 -148819 -149421
19288 -149421 -421145 -53836 393814 11815 -251628 -259134 171756 -268684 -111740 -69623
19278 -69623 288472 -272050 -19375 76776 -107111 -115260 54310 13935 70 -369440 185584
19266 -108073 -82563 46140 -25868 -191080 -319968 132556 -118893 54318 17506 292517
19256 292517 -211031 303084 135622 -177355 173058 -209970 -310850 -242403 -161949 -353939
19246 -353939 -57797 95961 -295251 -11659 -222263 -37565 -29812 121460 31010 297959 -68304
19234 25049 -197873 -162481 -225870 -64271 -76404 -178255 -27344 -76725 -42629 103991 -16620
19222 97148 29188 -221475 -103212 -33149 170780 -185003 30150 -95973 121165 301098
19212 301098 -174164 -170048 -204209 -374406 -89770 15742 -183288 -118813 316744 -248303 -23795
19200 -255207 -182813 -162563 74264 156600 55375 29285 -285326 -187744 49995 -303124 -44321
19188 76909 284281 -190120 144983 -83394 -151252 220004 61940 110408 -64668 -171039 -121182
19177 -121182 -72856 -197053 -15155 -502278 183094 262132 -45639 -335293 -408744 -157520
19166 11627 -215582 266819 89615 25660 -57477 96397 135964 -176797 264937 -48448 -61181
19155 -61181 72435 -187511 -1814 -82419 -141084 -36504 -55 -311612 -42453 -367236 64519 60208
19143 60208 -19586 -146734 -297487 68607 26099 -103599 -264286 -114292 -87838 -536480
19133 -536480 54110 -76219 38807 1311 -408279 26472 -254544 96847 -40714 -367888 -238756
19122 -238756 -304674 -42070 -324138 -186465 -286286 37440 62818 -76665 -9534 -87599 4905
19110 96066 356145 -75370 22115 140973 211005 -118702 62892 -255288 132475 21709 6970
19098 289128 -5431 -127340 -160856 -275257 -291058 89143 238941 138759 -192196 158010
19087 85685 -345315 -46264 137588 339314 173043 -209021 -49760 77256 -163396 -17776
19076 -199655 -176468 -281845 -230439 59573 -154076 28411 -223417 287097 -97784 -270675
19066 -270675 -50645 -221320 -58603 -143128 -91908 -293425 -108168 125587 -22266 -270922
19056 -270922 -196277 -52892 -17020 276339 102053 254794 -74114 -60117 -213899 -154380 -29391
19044 -116820 -327834 -68467 -155711 59999 334901 -65974 -226899 101404 -250595 157071
19033 -93476 -76307 88971 223973 -122006 126202 17757 -279034 -383411 -156790 101382
19022 -66990 -125360 268375 -15106 -232057 -44153 -51515 -74770 64403 62606 80968 369051
19011 369051 179907 -26939 -281456 -291809 177840 -28466 203707 -211283 347134 106853
19000 78510 36702 364589 -292338 -85366 149362 -116953 2108 -116462 161243 -304266
18989 45291 157447 29716 13510 -128020 137151 -206445 -171300 252762 -229405 331478
18978 -281485 184557 385093 5225 -56816 -63793 5237 74821 -126302 -129910 123319 -224706
18966 -9732 -207031 8418 -367488 15469 322480 -75107 11120 310771 362424 389055 488319
18955 488319 19507 -30526 54964 -163097 -18793 -300313 -30898 -263275 -169248 -75685 293027
18943 -25583 136390 -222762 -36220 171985 -92504 -322539 83421 152345 -270164 -124981
18932 218359 -176843 -207075 -259137 -481287 -46419 -30053 -69243 140701 -50725 169255 -203056
18920 20855 255484 97073 -97756 -104802 41571 45262 155679 -42449 -185580 -290160 -271914
18909 -271914 -52650 -307220 -60545 57323 129076 31360 132094 -233989 69744 -23267 52044
18897 84787 252912 165285 313573 309096 462990 293469 47198 136772 12185 -211238 18011
18885 -99119 -275472 -78635 -190916 50382 -137245 142949 318116 225189 99806 -261811
18874 -192504 166314 -73917 -202552 -299037 -100961 -133411 -93764 24410 -24086 71101 256684
18863 256684 252577 -345315 -97369 -252458 64873 238251 -30248 -19374 372373 111472 294678
18852 294678 -210086 -341293 -94398 98160 -255621 -203192 -94231 174999 -6217 -27308 -115629
18841 -115629 21624 95125 -22981 -289162 233665 -68601 144463 -128289 -36927 -161451
18831 -161451 -110685 234214 -154618 207337 -206713 41000 281007 221104 -237568 -239455
18821 -239455 10203 -287775 -188 -194387 108472 197683 -219227 27196 104069 -281792 -25172
18809 101153 45391 -184261 -43638 -327865 6355 183522 -288514 99813 -141070 -338453
18799 -338453 283052 -74047 103678 3034 220244 -868 110682 -7561 5590 -8498 -311008 -16563
18786 352732 -20295 15093 214271 3882 18739 -205469 73708 8221 -264355 -111512 -307189
18775 -307189 -24633 -29240 -138828 -175319 137744 -234780 17110 -109224 192743 39038 -43621
18763 -97179 69830 -140623 -115246 140129 -132117 -109466 167666 49927 -17954 -31732 -189756
18752 -189756 -79457 -47465 -213346 -22549 86617 -265084 133625 67616 61534 341786 187483
18741 187483 157532 -27665 -107396 151180 -99534 -177988 28476 48410 -273131 -351459 -242040
18730 -242040 84363 162699 250474 53646 -108732 132887 -176587 151884 -75184 -191023
18720 -191023 -144759 -112685 272020 -61750 -145545 -271809 190118 -8393 -471331 -58613 -39804
18709 -39804 -72027 -102625 44039 -167761 -205137 21021 -256437 116920 -118289 -262725 -43456
18697 -187137 229142 -425200 22494 -33720 -163560 15899 91706 -143493 41983 -115649
18686 -164121 -162804 379880 133763 -198883 -411806 -365083 4208 298551 -407396 -22608 -143610
18675 -143610 166596 -194524 -42143 -101563 -143928 68405 15469 196433 -199745 7501 34993
18664 34993 66646 68879 112594 25071 -84791 61845 174322 -148650 -245722 -139841 32934
18652 1030 -177157 -99327 -40689 -173992 -103075 199971 -316077 105469 -85513 248153 -197761
18640 -237641 233936 -38894 185919 196096 -12845 295999 -178318 72080 -193956 -71694
18629 81410 -11304 268532 201705 -28892 -125765 -370526 -199704 -249957 262265 48821 -52899
18617 -95651 -63066 -201654 -5147 -286184 88627 -144495 -177346 255493 -248197 -265512 -468230
18606 -468230 -65106 16360 -1596 -220746 20086 173094 -45001 -155319 82505 -125836 -188817
18595 -188817 -55438 163117 -253910 -98202 -232163 111570 -191175 -137809 89510 184102
18585 184102 -174708 74990 6224 -144839 -24092 -227334 -202136 -13220 91420 -171742 -298003
18574 -298003 -65765 -90833 65884 -180742 95284 -6643 -44499 29099 -256857 -3972 28882
18562 -408183 -23336 -285864 -139539 80325 -196336 139935 -79314 -44202 43501 342012
18552 342012 -277486 107613 -321513 158565 -217124 -228405 373144 307819 -216599 -20449
18541 35053 -564034 61660 -110678 79104 -219047 154310 96028 -205434 -46889 -63816 104431
18529 -59091 -355119 -158065 -517430 64591 108841 84459 -231968 171963 146473 -211226
18518 -115160 -373708 76920 99187 52467 -50009 -170948 -98344 140797 -284229 -227367 139528
18506 -436600 84879 106404 -379272 -7515 252713 -297798 2377 81777 -398645 -137128 42319
18494 89848 140881 63620 -73190 -66705 -132425 146388 -117490 152983 165296 92511 69456
18483 69456 57207 -15343 -192505 -118408 -144387 49099 216868 -99656 153749 88809 82625
18472 82625 52244 -211442 -251972 -247123 66908 -166658 -37064 103018 -60106 84320 -42598
18460 -147819 47758 238987 65605 151862 258918 -177704 -56097 -299246 305040 96211
18449 51093 3792 -100819 -16552 -263558 -199351 82611 216569 293198 -1846 282092 -244711
18437 -159190 -88563 -4650 -4784 208505 -212026 -97472 -269390 -329477 -152619 -122724 -14889
18425 -394403 85160 53369 306977 209280 -223296 102157 149805 -36242 -79039 -171462 -34541
18413 -289710 -111827 -52660 266210 175945 -170645 10165 -97191 200422 -28739 -123745 184573
18401 -134260 -447248 -136709 -162962 -233100 35056 -103061 86070 -156434 -282351 384858
18390 -423573 70844 -96507 215374 -289835 95187 -99080 262020 -4518 102442 71826 -258014
18378 -140248 -34795 -191735 -7 -65476 121771 -202119 149207 -10699 -13150 -215527 -44526
18366 200491 -84195 151553 -279818 -108972 -81842 171479 -126167 -46997 -276112 304390
18355 -210278 75329 1706 -26201 80271 29272 -41225 187815 -105549 63740 -78115 97364
18343 48199 -212490 -279264 38546 -442153 -129070 -140401 48887 -56071 13704 -82785 49853
18331 -16120 -94011 -88897 -43738 72372 185301 40294 -120331 -33624 -69388 13777 -298023
18319 195625 83677 -8921 -75536 -165269 307442 -51681 83570 148209 -6470 135816 -138597
18307 -208895 -1182 56906 207470 129363 -62914 -141599 82713 96141 22021 -22129 -55511
18296 -55511 -20703 -45286 173407 -506041 -74778 -74483 -86450 -147586 92891 -145114 187423
18284 -21545 -128383 -167213 -98646 151623 -104483 -148770 -16724 35468 107296 -105689 -50152
18272 84034 -44500 -27 -85309 189670 112693 219017 187833 -152519 -173687 16332 -203407
18260 282188 -97817 -287452 356301 238822 58843 -36880 171824 -79394 -107542 104303
18249 -1118 108891 62474 -143240 103935 43841 -66668 -315401 59885 415295 -180564 -41098
18237 -100581 -231331 -114950 -80380 143111 -119359 -161909 -288021 51706 18038 5530 -25636
18225 -196806 -196789 -52364 -162157 -97106 304350 -71051 -42810 199084 -349629 161536 -352228
18213 147990 -144068 -102770 -363539 -136570 -31866 -118671 -61837 -290095 71215 -52528 204809
18201 -3887 389620 -2749 102915 -9634 -22985 167064 -80610 146166 -278256 -294766 -334723
18190 -334723 -78199 -297409 174992 58048 70085 -28279 -13882 -745 -325008 -111245 -91735
18179 -91735 -282009 62908 -331656 42123 -241693 -12692 -32707 274060 -242654 348111
18168 -231801 -32317 441906 -117871 -478 -35331 -171095 188225 -125050 -224925 -120768 -101292
18157 -101292 -35474 188995 104558 -194754 -68456 -47629 -30832 -149327 624 149564 90834
18146 90834 141895 -209334 281511 65358 31127 -50873 49934 -284550 148222 -63241 105804
18134 -342458 -24945 215702 -191275 -11231 173201 66060 384404 14055 -125130 -485401
18124 -485401 -1575 -47717 190014 -201203 7816 86396 -29540 121161 27257 -93908 70420
18112 -131 217209 -206244 96935 -86603 391991 -111859 -213992 -62104 -2162 128016 -78245
18100 3238 -32340 34486 194784 -83231 -172032 -122234 361805 -250944 51747 -118305 98472
18088 136202 94388 287436 -125259 408197 95600 -25493 -370003 294097 -155977 -198333
18078 -198333 -9377 207593 -59406 -132308 -141810 79537 58001 -108792 145900 -65694 129571
18066 -155680 -22006 18124 5923 -239722 69670 -181875 56518 286697 -337334 -202569 -12179
18054 -205852 192613 -205202 16226 -109516 -203624 -11057 -278815 -108440 -138783 -48958
18043 128014 262175 124875 -64978 -24276 235134 -143602 63126 -109366 -130020 18595
18032 153708 -22430 -133859 22111 -281654 211881 37482 -43678 109368 338202 304151
18022 304151 -193611 -220330 -90319 -9262 -5147 -11876 187855 -128355 -260858 160607 -295313
18010 80290 121216 -170692 -92931 96609 -6572 -436877 85936 218 -253467 169628 93597
17999 93597 30090 99734 318334 17536 -173229 79482 157945 79826 14660 -153937 -41928
17987 213952 -81655 164824 -95289 18807 170785 -201301 113127 -34123 -210882 -63054
17976 86556 -166930 226646 381919 -151201 -40255 -271000 214037 -21442 -219938 -159276
17966 -159276 75976 -269747 173547 354945 -174339 223045 255253 -104510 204543 77020
17955 -397782 -33087 -286680 107450 49121 114578 52383 143196 151413 168666 164857 5542 -7446
17942 -21191 262238 -640856 -128475 93512 9913 -81375 97057 62956 53430 -116651 214941
17930 414593 -64157 -10327 -99179 -197266 -98297 136802 391008 237687 -18540 -22447 157931
17918 -220014 -65454 99066 149753 182563 174070 335385 -86318 89345 241141 -87957 -21440
17906 110705 217662 35361 -95755 97067 -111662 -192182 -55482 -114760 60961 472678 57585
17894 110709 40530 -56461 102726 -25559 92784 -126631 86805 77865 -26993 47758 -75366
17882 250931 127705 -157154 11129 -169680 -75012 215133 137656 112306 174288 179230 226819
17871 226819 -25500 189904 72341 -64094 -186083 57771 -26432 69646 -151710 329549 59908
17859 71134 84770 158007 99181 -30422 8161 -136621 -66802 195383 96734 133870 113434
17848 113434 -210525 -139412 -100149 443088 76658 -121492 -70412 158956 -420992 -66293
17837 393878 -188908 25674 157582 138969 341097 -132946 193585 165497 -404593 130937
17826 -172015 85284 408492 -44280 -213054 -119050 95664 -10449 -54461 385028 177402 396758
17815 396758 261836 158156 185643 -16389 189851 261006 19233 -298074 81174 119778 -143737
17803 -10601 241246 44226 90212 -46316 149666 260761 8876 -127251 -130379 -135195 342839
17791 -302152 -68285 -326710 172041 163163 -44078 211032 -262107 -112149 -191248 14580 -99760
17779 -74736 251945 -45101 -55520 -87042 23575 91938 437868 152983 36595 -115518 29709
17767 69628 228408 66852 216900 -38044 -12779 189259 -195808 -123634 -36201 -341394 72544
17755 -440964 -62846 80436 -136656 464074 33278 191364 133530 -119767 -31742 116462
17744 57714 -124979 10876 145877 60745 158425 -164253 -15660 -174788 6469 91301 183386
17733 183386 152516 92679 -63511 -421318 43344 -70537 -182823 142947 135260 38737 8102
17721 424487 35864 194552 135709 213257 217564 -203564 15879 153209 126726 -285468 43697
17709 -132928 244589 78708 241609 90811 45743 113904 140232 -3703 125616 145811 -95240
17697 -333381 262519 -75505 -113536 47276 -119848 22349 -132869 113831 -32359 107883
17686 86431 72005 183057 123179 46085 117548 71215 -30092 -8718 -42672 -130925 97561 202426
17674 202426 135157 114686 -142172 -133089 -287742 284687 77295 -196791 17690 107865 155999
17663 155999 136322 -134931 -161566 25334 -27673 62667 -105789 -93897 19413 140137 -23381
17651 218543 168927 -60508 281211 269949 234520 -938 140368 156409 -50320 85184 114796
17640 114796 154430 77041 133509 55325 -198104 -21269 80068 300134 160235 -361526 222551
17628 -49870 -22792 169963 32233 48068 67715 105987 116397 125614 167704 -17737 -44435 112173
17615 199814 215550 -11761 46074 28462 41475 172269 58156 293540 54789 -212185 240023
17603 -88326 15172 36872 495397 112327 28768 44880 539624 31307 -4681 170184 216326
17592 216326 -326166 271075 6090 208277 122351 -132818 58550 102975 -261312 69619 350465
17581 350465 170947 265772 318242 310861 345347 259753 81095 -50439 121713 365273 172425
17569 463993 40672 497343 64540 23938 187307 72344 -21380 319401 2666 60748 216430
17558 216430 -131884 77859 303358 40804 126775 -165829 440348 143971 346366 -388429
17547 -102346 125255 -171570 135454 -38458 180288 307802 -167831 437968 75623 201281
17537 201281 -24300 359264 74381 164226 170489 198176 56762 545905 -52194 260020 109861
17525 228559 58863 111661 562638 -25816 -153632 434466 632252 378449 308600 391050
17515 391050 210072 10028 566705 494475 335260 561408 707123 981314 998426 839301
17505 839301 447535 657088 431626 -5957 109043 585496 447919 392898 563437 815807
17495 815807 884424 561572 883840 978555 788291 697011 532148 521652 210822 193664
17485 193664 367852 331475 288676 129046 100647 521735 66909 306758 -113325 227964
17474 201587 462406 322402 183438 320147 89980 114853 546285 214782 -10823 373521
17463 -55609 123047 204362 216914 398157 549775 -35367 51085 144457 99212 453266 -93599
17451 518203 201022 257898 240168 210520 74865 184275 77861 426302 301300 271421 103733
17439 239712 574787 342747 218930 367615 193566 324246 263033 296030 135899 679944
17429 679944 245116 397006 115630 615094 419376 412678 263177 420946 314470 350563
17419 350563 -29761 412734 439594 643418 -182871 189135 203022 118132 79541 313568
17409 313568 457215 89940 227658 110121 189666 228552 501556 285928 148488 404466
17399 404466 258796 369672 -124157 320288 415125 205570 499484 -86941 263509 222921
17389 222921 184877 379424 -20809 107859 88459 -9879 242903 335141 208273 446399 252615
17378 252615 87750 93512 387102 146055 197004 469724 -90129 497835 86585 69727 403237
17367 403237 306543 646342 544292 249765 471844 32206 515676 196757 143426 -124850
17356 153935 51855 437023 244860 175982 61493 174487 135737 97158 136012 259696 171411
17345 171411 208358 130644 45591 -45990 198757 378900 386510 332266 187888 192824 -41661
17333 132977 249673 6222 338654 437259 115904 336709 463279 363334 87047 145452 396704
17322 396704 106868 170062 292654 172862 399233 35869 84847 126846 171983 462128
17312 462128 139643 356927 80432 183091 115750 94922 416795 320830 138998 260785
17302 260785 105260 356728 298399 303300 505342 448016 232115 457795 157286 51243
17291 99459 200645 240290 89172 152710 412897 112720 251444 461158 4065 141606 359232
17280 359232 241076 406144 348554 226521 434981 237791 459150 435666 235480 209566
17270 209566 216823 341911 303003 -58045 181807 416637 553462 444362 528859 -139501
17259 563715 239562 481802 118274 240038 -17688 140451 471606 534209 99270 317496
17249 317496 291982 276317 182929 485719 602778 261452 147511 330737 264261 383347
17239 383347 352276 626246 296263 452023 391251 483664 305137 583215 202736 421768
17229 421768 642660 302853 267623 247334 169538 631152 381219 357199 252027 506717
17219 506717 211697 138175 541126 296152 745019 185394 345411 509183 227992 162234
17209 162234 614752 445885 421087 145448 372398 71527 212553 280838 518702 421671
17199 421671 475452 532498 377079 557503 426841 282014 1116770 354217 176048 301179
17189 301179 375953 237162 605139 367707 525471 605883 294594 58861 592098 310974
17179 310974 49121 574796 374724 716025 419784 602019 434727 553711 476338 606672
17169 606672 334816 493185 167902 205677 546573 35978 515905 691772 449636 576971
17159 576971 556337 426315 530148 383183 358507 423829 470686 353346 188687 594941
17149 594941 578367 562391 733102 722438 710193 405580 343156 491770 376355 513708
17139 513708 513330 282029 388609 273081 383687 278586 555587 741591 323033 459901
17129 459901 468824 519064 369716 484438 504206 518746 374379 354120 493354 668958 576756
17118 576756 405394 518862 783267 396430 585116 811894 727457 549238 342846 682032
17108 682032 687751 300256 509206 427630 568751 275099 642624 620173 452963 661224
17098 661224 561393 439704 779133 419018 459819 590019 332783 581007 844474 767555
17088 767555 472093 480198 679719 461385 928841 458174 694215 675498 397164 866475
17078 866475 630238 782020 532420 718634 767678 786373 708012 834667 595331 1009078
17068 1009078 602134 816249 683084 642355 661270 633022 344956 603392 620676 853084
17058 853084 503869 910429 1107594 780142 994812 755341 760738 683704 594870 837480
17048 837480 661027 673306 867638 982616 644140 1032128 797827 967060 754841 770303
17038 770303 1089588 789615 657765 823679 933793 761409 703125 600290 839518 845571
17028 845571 766633 825223 644836 720085 983461 786182 727198 666103 1000008 1008073 613504
17017 613504 830115 776288 636224 944930 962325 674565 960687 895703 835566 715062
17007 715062 957356 753745 1078593 1087907 942454 650277 989445 896300 943462 954599
16997 954599 1017407 1060590 614646 1182437 1227668 1090326 1017252 1178672 1169750 956675 834485
16986 834485 1290120 1194496 948100 1165259 1261605 1079191 1032803 1147008 1125461 1057585
16976 1057585 1244888 1352296 1070728 1054073 1225334 971837 1427703 1124621 1398639 1202830
16966 1202830 1268747 1214939 1415863 1146336 1036863 933121 1241120 1286892 1580874 1365212
16956 1365212 1153261 1406600 1502935 1871523 1608460 1546788 1328104 1239008 1564575 1462857
16946 1462857 1741855 1747150 1716832 1389233 1552520 1498896 1505597 1473648 1262204 1635722 1331784
16935 1331784 1511989 1624598 1628809 1847587 1584319 1744944 1881829 1912364 1957768 1618209
16925 1618209 1362415 2105388 1569088 1659589 1750828 1673641 1880157 1814645 1904477 2111656
16915 2111656 1955241 1470893 1837514 1831266 1912683 2054626 2044250 1795582 2108020 2099411
16905 2099411 1800418 2209768 2339085 2027258 2426845 2201346 2176252 2078282 2402641 2280898
16895 2280898 2427756 2445760 2197112 2516404 2724918 2255780 2451484 2687687 2352719 2576864
16885 2576864 2417743 2482063 2363882 2408762 2837507 2763603 2645661 2715063 2678809 3038960
16875 3038960 3135242 3095516 2807463 3086805 2557704 3123129 3057525 3048227 3130523 3091381 3305288
16864 3305288 3091874 3247150 3353945 3520517 3291237 3449335 3256393 3321389 3764797 4080127
16854 4080127 3849450 3501744 3955410 3787994 4152602 3799389 4221098 4142423 4109592 4527317
16844 4527317 4105525 4266565 4405487 4283109 4603672 4391882 4679407 5002152 4626024
16835 4626024 4769618 4849548 4765401 4839419 5387200 5193437 4934425 5253320 5344387 5215856
16825 5215856 5450892 5326867 5691818 5942630 5799776 5835927 6168440 6067390 6234416 6687665
16815 6687665 6306196 6124993 6790634 6716462 7228218 7057813 7361742 7157737 7479211 7793668
16805 7793668 7633593 8077860 8157630 8366926 8567045 8848463 8780371 9174087 9012522 9253778
16795 9253778 9462779 9715965 10152548 10268132 10345278 10929075 10768014 10882800 11355980 11571168
16785 11571168 11958820 12474048 12699940 12644843 13005205 13240474 13836849 14065657 14582802
16776 14582802 14691837 15472352 15676112 15614205 16436425 16974857 17283710 18106606 18448240
16767 18448240 18805731 19799338 20052020 20376104 21145139 21854414 22969228 23487748 23946078
16758 23946078 24464234 25481539 26529664 27424103 28678953 29452894 30337939 31523779 32836426
16749 32836426 33945677 35244287 36209105 37704343 39482217 40953805 42437172 43984639
16741 43984639 45825583 47871806 49631932 52057156 53760008 56113285 58523725 60962547
16733 60962547 63606774 66418401 69549329 72472549 75318142 79014350 82434963 86100777
16725 86100777 89503591 93180408 97169469 101093074 105194225 109378830 113237352 116994242
16717 116994242 121031169 124737416 128736319 131921223 135138357 138209936 140551061 142669701
16709 142669701 144289038 145789588 146506250 146916393 146640415 145799283 144749710 142664475
16701 142664475 140557362 137975470 134929303 131565963 128145618 124424191 120416422 116725746
16693 116725746 112362053 108547833 104223199 100380112 96536729 92384237 88538430 84933902
16685 84933902 80902175 77522142 74078624 70970935 68135106 65226280 62340145 59890797
16677 59890797 57460120 54614697 52384395 49922155 48148321 46154406 44087525 42578279
16669 42578279 40863900 39377097 37589003 35838569 35047749 33713150 32233089 31201879
16661 31201879 30098237 29018800 28018599 26971738 25877268 25037428 23963348 23480603
16653 23480603 22544249 21850908 21140885 20586363 20200576 19461629 18640061 18224402 17709220
16644 17709220 17154551 16590912 15770811 15564972 15230181 14727286 14487834 14182024 13493524
16635 13493524 13438371 13055236 12791112 12865055 12005077 12052491 11600245 11426899 11115478 10708072
16625 10708072 10467040 10299529 9982184 10016767 9458336 9178717 9008039 9205957 8427400
16616 8427400 8481293 8323086 8130394 8124342 7761150 8024936 7448499 7170266 6990724 7475031
16606 7475031 6897685 6710620 6650322 6623199 6581927 6221987 6007747 6220975 6034906 5852587
16596 5852587 5557693 5969515 5484973 5517130 5173238 5097772 4948140 5089612 4999643 4854040
16586 4854040 4959009 4675853 4402918 4690930 4714153 4109836 4411556 4366040 3877192 4395987
16576 4395987 3700962 3896958 4085521 3848326 3764826 3884832 3965609 3538202 3831863 3697912
16566 3697912 3140105 3397478 3585931 3331225 3589848 3297295 3196351 3220180 3427308 3071550
16556 3071550 3108890 3014553 3161939 2801528 3084619 2803870 2756194 2952591 3151852 2331192
16546 2331192 2726152 2484988 2428668 2546182 2534406 2942761 2461991 2324596 2460299 2587852
16536 2587852 2510714 2723566 2364177 2119237 2347272 2052855 2405200 2195587 2182615 2028899
16526 2028899 2009928 1932009 2027967 1969019 2063072 1827458 1973848 1903229 2018478 1919574 1730312
16515 1730312 2024465 1869329 1681824 1659546 1704412 1819473 1742115 1720613 1810522 2030835
16505 2030835 1525707 1854139 1529135 1645339 1695220 1558274 1614244 1539258 1701187 1740514
16495 1740514 1437486 1511607 1108189 1573565 1509971 1475950 1174314 1242088 1567882 1737547
16485 1737547 1383244 1161980 1492737 1201296 1463397 1235662 1341319 1208609 1215300 1203625
16475 1203625 1133443 1270724 1416689 1143259 1199754 1359989 1167186 1230777 1226158 1343254
16465 1343254 1345818 1202596 1272491 1186404 1332258 1156008 1202409 1187390 1156081 997456 1018963
16454 1018963 1184337 1124217 836031 1255363 1157671 1332557 1134067 867758 1029484 1060924
16444 1060924 1331435 1058616 942153 910511 835166 1090639 880675 624423 1014637 721728
16434 721728 913765 789989 1007379 1065781 992096 551033 731922 879426 785469 959954
16424 959954 926694 944221 616732 1070550 1053404 786645 644018 951683 622418 653968
16414 653968 937991 769208 615082 677258 596818 489721 273905 668182 725144 549444
16404 549444 544612 699602 713681 868758 618487 695311 658859 907045 970407 925599 768179
16393 768179 683418 686292 741219 619878 1015141 458572 772193 293875 469935 636523
16383 636523 693798 829199 454581 729990 835304 340254 620273 644128 495895 604836
16373 604836 456926 518122 463046 460249 603443 749408 761405 460545 846436 307385
16362 884887 426319 832422 714779 847444 517441 854358 408318 548989 368249 466729
16352 466729 209988 643360 399805 638003 557034 468512 480723 623097 308010 342600
16342 342600 638711 669976 446618 579865 221424 283309 679251 805708 215738 645905
16332 645905 435483 833283 443607 496157 516899 175646 550953 255512 500002 234330
16321 637711 536594 9086 597726 533051 418255 -37588 228840 247435 765354 408798
16311 408798 565614 298076 635138 689629 563602 459591 621791 240678 451509 352432
16301 352432 398515 261850 357961 305144 431185 427579 183258 296430 481496 489091 238353
16289 166346 220517 388178 240919 366849 396915 382793 173784 466684 513774 356522
16279 356522 372228 310869 400517 352243 451854 356742 553878 632310 538026 -95880 450694
16267 46346 116025 224501 381118 405093 344051 476751 497381 251699 646501 433116
16257 433116 223968 659466 473119 338521 602412 347320 364838 601972 408599 323956
16247 323956 350603 411966 131210 220175 484937 761119 401933 341538 341293 329213 620708
16236 620708 326893 214995 311147 204849 519340 159847 242367 316584 272648 314843
16226 314843 58619 315825 415783 339098 100905 104886 22657 426901 -241117 441034 -22584
16214 124213 283579 207834 161363 488003 286842 309010 163049 260915 313109 -455008
16203 39426 89452 314342 92502 -54002 192346 -18927 203069 605726 139849 -187978
16192 129923 154313 99605 341962 -260648 227049 71641 368711 193994 711040 257961
16181 261901 146441 161811 187912 236247 218107 38 100227 244360 -68904 286430 183653
16170 183653 171978 80992 274617 216862 416899 248138 274029 302907 -52799 29239 2215
16158 322258 140332 -150455 31692 16648 227046 151871 86049 144847 18314 -61590 -100701
16147 -100701 22021 -111092 259685 -282203 178830 -128594 116507 382437 83906 49895
16137 49895 61019 -121890 466253 23664 21253 276608 229964 55274 34165 -95916 -34237
16125 18975 -51038 49450 335268 104358 205244 -161002 -19878 47611 -165073 405578
16114 118410 -7564 45419 163123 38649 70411 62533 152112 21679 -25865 -125679 100866
16102 403585 -69263 274929 139506 284017 -157182 3548 104362 92614 113323 245780
16092 245780 274245 -88658 -7226 125465 25938 32867 -87349 307402 -111991 236031 262151
16081 262151 140009 343299 25299 42111 276851 -2598 -103499 -128895 87634 -266020 145353
16069 -151869 40812 157802 -67329 28658 136317 262753 174460 233759 148178 -247819 -158828
16058 -158828 190136 188667 89174 219315 344023 -251132 -50889 106175 221470 -217330
16047 203358 320580 -112854 206028 -8868 188409 -93937 221917 -16980 170718 90837
16037 90837 193413 -229214 42082 223583 236325 -22158 29664 300034 163405 -240447
16026 -176604 29516 67555 -95253 370493 134617 260080 85346 321710 208167 100518
16015 -76587 267828 -10936 119272 95880 -211488 -150758 63228 23746 -238387 -18982 -113365
16004 -113365 53631 288202 -122683 55613 -7445 86643 32256 -211681 -293194 -120866 100470
15992 -129511 -138947 -119887 -312895 -215130 170253 -144767 -73105 -100963 -4 204381 156439 55325
15979 -120392 -229954 266295 -143425 66207 185608 149080 472545 353439 518078 838267
15969 838267 836569 612617 625842 319116 621088 252152 -184233 136904 -33813 170866
15958 35869 122771 -52035 -237318 -46145 -172466 78842 -61074 -222908 -148009 282984 -31290
15946 -199352 152306 393578 -84381 -28004 7136 179548 -53197 58209 59420 106180 -127753
15934 -98532 195387 -370474 44969 -408687 -139124 -307360 16364 -24099 105750 94263
15924 94263 59710 -152730 -38385 270904 -48262 31860 187455 290519 333486 -226259 -65439
15912 -282661 -64704 -117861 -131657 -77231 1948 115530 -167292 -204867 7920 3522 84952 -158055
15899 100438 -89870 -104282 112678 -78947 2185 -43136 204220 209449 -82784 -43325 -154231
15888 -154231 -403618 -34972 32351 -53933 -106954 -154134 -261680 35409 343898 -206730 -50439
15876 -351930 -185754 -153816 -119143 -7649 176461 -147028 -4879 -88072 139411 182588 47962
15864 -128538 -89674 55855 172521 89762 -161196 60595 -447005 42423 284134 -245147
15853 31798 -40606 -230326 97636 -154301 -1193 3399 -311462 226190 152799 -205466 -186119
15842 -186119 -141094 -126685 83890 194377 -136256 108539 -240644 -197624 -37955 -46515 -107940
15831 -107940 -321912 115082 274573 208007 187170 -165850 70488 -119013 51292 32235
15821 32235 352284 -44955 -113928 194842 133649 -128924 -74733 45586 66823 -240326 -25526
15809 -332325 -5619 241734 -331796 -236024 -589186 140163 173170 -63512 -371271 -139939
15798 -37842 5152 50260 92963 -66471 167420 59059 38134 -182542 -57153 184413 143418
15787 143418 132596 369775 171037 -100037 278821 -167840 -137213 31805 191570 -39822
15776 -395683 363503 -222002 92016 -196072 119283 -19642 103275 -409625 -338086 55434
15765 -36964 64932 94579 -77053 101835 319573 100581 -19926 79326 114377 -244536 21615
15753 -272832 267423 -293335 -91459 -116367 198065 158674 46367 142335 230815 -188206 150915
15741 -51391 200546 -16902 -141165 42966 -55992 50514 -39513 -88058 107079 335847 -139070
15729 233768 -231825 -49935 371403 -211069 44547 340575 54852 -272220 30460 -109443
15718 -61935 -414026 -217961 -310260 42986 -437940 -26090 -190916 106648 52290 -136043
15707 57182 -202045 62508 -202079 -54601 70056 72157 -272681 -51418 44872 -152101 -113912
15696 -113912 -263110 -68721 -70858 213521 191549 -243006 -69023 127170 -20460 134658 93276
15685 93276 49657 -132498 -62649 -483225 86708 -65133 151693 -166303 -154803 71988 366102
15674 366102 -119525 -472589 209088 -43766 105378 -3795 225300 -7730 -194327 269451
15663 187302 -135487 12172 -141458 -89580 -131872 19679 -267621 32496 -70237 240996 142348
15652 142348 -73684 189321 -157596 16365 -165090 -225995 -12061 253860 159224 -147426
15641 -301900 -434112 131181 -96899 -245115 130268 277648 204810 -50709 11496 -354108
15630 -268992 -149352 84585 101400 345762 -129206 -45419 15117 -206436 -133168 -91583 -142065
15619 -142065 -372518 68007 -174453 43296 -7431 -443985 -142518 -94668 -265590 31335 46840
15608 46840 191481 -219043 -28966 -51407 -383114 -286625 110402 -45905 -139670 -135587 381969
15596 -81629 -360423 -394690 89642 187345 81515 -41931 47683 24119 -423548 -46422 -323405
15585 -323405 -189201 18372 135182 -334618 -4310 -398095 116411 -32897 -268988 -76505
15574 90812 40994 92330 3280 -151374 41878 219814 -202693 -49599 -215701 28760 -270653
15562 -229854 32274 11922 90567 74753 -302480 22282 -10296 382859 192985 177467 106649
15551 106649 266561 24054 103068 -41554 129548 52641 -8507 67888 -367055 15520 201
15539 -351991 131032 -151118 72760 265418 44124 99751 78220 87342 -212970 -229719 -134886
15528 -134886 -116897 -271328 -227423 -4860 -173246 -43995 224729 347103 402689 -61653 -54365
15517 -54365 9695 70232 -210367 -54684 35940 -148206 60070 152219 -146560 271635 19317
15505 220915 41995 7261 -87454 4238 -187995 29388 206945 69766 162989 121005 117024 94057
15493 94057 196885 -120942 129240 224829 3658 66421 130442 117906 -56756 248554 210537
15482 210537 -116342 450068 202333 248411 410745 101365 38803 16042 294535 142724
15471 -5519 327859 184124 368725 197063 103905 -137967 -148282 -171761 289078 23737 -67312
15459 442000 150672 515791 670097 817732 344764 137177 101112 -122818 443381 -104307
15448 271175 -99278 243946 26952 172156 135354 239107 134754 -9622 -96446 33703 -44599
15436 -53719 155287 9413 10473 -89061 132872 286851 341414 187850 571626 248155 646250
15425 646250 710065 818042 831940 895097 295231 243868 144169 -15334 100730 135085 330741
15414 330741 273225 -408590 116814 208513 131267 -169377 -2811 30114 -46524 -149437 -176635
15403 -176635 -3638 -246231 -275071 -209445 -289855 265674 -107786 -45356 186800 -161408 4455
15391 190186 79976 205544 -91784 -276898 -171200 -232277 -43753 -163524 -139477 -138695 56952
15379 61945 55755 151639 -49947 315694 -364638 -68182 -402433 -70261 -106879 138296 -242988
15367 114923 93988 62267 -61379 111967 -2729 174641 112432 -150953 84413 198162 314205
15356 314205 -70175 160246 -174154 266185 -95349 -45173 167131 148204 -120595 -38748
15345 119512 188594 357488 4333 -120468 231565 148860 215312 -27630 115566 175940 -1509
15333 -224031 78398 362502 252278 359562 243861 268540 -259408 387446 42005 237440
15323 237440 -53996 118027 40663 179382 -79034 -199495 73675 -153828 46845 528829
15313 528829 -87121 217967 367349 56363 -588 -191937 54455 77212 32735 35764 206041
15302 206041 345045 1300 214260 163957 -168586 28500 -7237 14537 195307 -26674 -87779
15291 -87779 90722 99881 -285725 -183589 251659 91543 150503 -66751 93714 54323 63322
15280 63322 230856 133117 23052 138116 17007 -64168 445615 41652 -11713 30087 72251
15269 72251 276043 107512 209005 219927 386183 136251 352681 120587 -198163 269934
15258 238300 -271773 2429 161817 -122657 475226 -130513 98543 -5364 -95389 -163573 118744
15246 53042 -22471 311664 203256 49391 25039 192088 -11861 -7775 25811 156089 219127
15235 219127 143980 -118067 -39774 479836 313151 631958 1118470 1619743 1181615 1178703
15225 1178703 1166078 707059 634728 79215 143275 -329162 134066 290709 -97189 -80911
15215 -80911 31891 146090 -122779 -103049 146784 220889 -261575 -1195 -62502 226841 375763
15204 375763 25535 211657 311331 289881 39009 -5069 30862 47699 164376 34792 -12491
15192 99360 152615 397639 235087 275410 153546 2377 -112113 -12691 400341 -84469 -202279
15181 -202279 193847 190486 -188424 223828 -68608 7481 -62902 1215 209164 -269658 214037
15169 247057 216348 137612 425022 371975 248322 -298000 55639 24641 16119 17461 183558
15158 183558 30953 94678 163213 169416 -140225 258764 357347 69285 412646 256059 -115278
15146 172043 62616 20619 216570 174915 -77193 220774 364890 12797 421678 66804 -119821
15134 97647 -68711 67610 161152 -40099 56332 -25894 -6164 204091 280052 -6590 432645 -119469
15121 428804 -220993 531541 -26681 167182 395249 397699 309579 122889 164098 349913
15111 349913 121121 396174 495675 115011 454952 171838 177297 304157 378837 303698
15101 303698 353856 398652 207430 310833 427654 184020 -85154 97750 298572 35870
15090 131250 227013 470844 -197030 56778 40744 213404 152588 102242 -28548 -109922 189403
15078 473616 67876 140301 -85961 35029 279062 126689 -149810 97563 240608 61884 80088
15067 80088 186503 133532 250285 125323 -19173 420183 171532 241636 24178 74321 362953
15056 362953 259287 263625 236290 326310 -453 344659 492843 68775 98614 93768 -46142 258178
15043 151046 174537 95972 281241 147011 352778 69949 276012 543244 98306 414908
15033 414908 317870 507044 345633 111232 171530 191925 212603 311639 418725 343931 284279
15022 284279 654776 287754 519269 360386 15455 307451 330651 727876 530688 702321
15012 702321 607994 511878 215034 262010 324007 418835 315109 577650 536181 287871 269124
15001 269124 302963 418507 464978 84894 491661 603291 497173 220495 463324 430523
14991 430523 488530 575366 204813 453600 278593 117271 480155 590185 207470 539279
14981 539279 757504 293765 412518 343309 399047 598282 538582 477940 476085 147003 582643
14970 582643 421162 484745 719313 498966 680622 615914 608718 824305 487442 328434
14960 328434 364950 762077 914943 610657 500112 703893 467032 242188 183832 521475
14950 521475 276332 2467 531733 217598 266286 201453 365870 251238 230800 313731 301448
14939 301448 419363 435094 163317 412340 347314 70574 825234 373470 510456 406597
14929 406597 920145 888892 305356 728787 692601 892987 714609 380770 770340 568256
14919 568256 502626 560791 386619 564002 853911 913530 953582 1340159 1154538 1503493
14909 1503493 1211496 1465216 1567545 1504951 1290456 1265486 1550995 1734439 1475445 1957000
14899 1957000 1870229 1715135 1323052 1240142 1189130 1118917 715815 452098 591743 397659
14889 397659 563590 651694 39972 339510 603372 584564 364545 384746 736952 494941
14879 494941 582984 652779 233597 708569 370214 505531 772473 382832 664834 520430
14869 520430 982912 536081 901956 692651 1028955 716967 570463 785826 945576 684823
14859 684823 580251 290174 291592 664274 267915 881820 544245 613792 654498 575940
14849 575940 925573 325018 723292 566192 498331 288844 568536 608117 307726 471894
14839 471894 687740 766119 488440 661307 405583 284101 586060 413264 324114 483056
14829 483056 674477 468620 1087454 845220 814579 905186 1170824 853526 1039955 562372
14819 562372 1008245 655039 1046680 488758 689390 348557 588964 826955 990325 732087
14809 732087 457673 603541 601791 648963 763267 616827 743394 836911 871319 488064
14799 488064 806698 594057 825651 889519 790969 722374 749084 985416 764925 929844
14789 929844 633358 481382 736569 927138 682694 1096874 790081 808248 692608 556590
14779 556590 570522 523249 782417 582814 585260 545442 500540 685302 421214 289905 481833
14768 481833 631564 467410 1022024 622374 1104801 852917 898007 848146 813332 759789
14758 759789 870900 875715 886990 908973 924721 923220 964750 625947 624157 717298 757625 744840
14746 744840 999255 713455 591967 647703 601586 317032 564934 830092 897521 997860
14736 997860 286715 610509 471433 592455 804165 694257 997401 864269 614377 831020
14726 831020 782515 878999 768092 1162562 1238875 520771 906901 1050613 1065158 896037
14716 896037 1028121 1089051 1311917 1170906 1214037 1527237 1510594 1961142 1442705 1350468
14706 1350468 1149062 1482527 1037874 1198450 994359 925431 1003212 1036545 608319 609362
14696 609362 875792 1041911 1097812 765786 1073249 1171294 960965 1120299 1014551 1192742
14686 1192742 1441251 1504009 1671552 1918828 1822344 1249094 1336395 874796 1183354 938567
14676 938567 975922 850853 1081221 833974 981193 980131 1083542 941988 1131798 1127946
14666 1127946 792597 746854 1343750 1052364 805788 1123130 1108466 1135093 1019506 654679
14656 654679 1088250 1190133 1080330 1130663 1220374 920575 1087171 1240223 1009634 818605
14646 818605 1342274 1023231 947883 850995 1121494 1515726 968852 1279249 1362355 1094003
14636 1094003 1383586 1454197 1166771 1466826 1473467 1465550 1227246 1528445 1394236 1492224
14626 1492224 1147524 1139464 1193153 1279692 1192874 1310730 1173185 1359620 1502254 1295756
14616 1295756 1547566 1082968 1376562 1512926 1354384 1343219 1809884 1142230 1217105 1440930
14606 1440930 1333810 1409810 1327825 1710436 1473961 1422526 1458813 1595362 1544229 1517532
14596 1517532 1219549 1485247 1400892 1828029 1454434 1537566 1665343 1463618 1843412 1921765
14586 1921765 1571124 1339226 1987646 1594934 1505171 1657265 1606111 1733512 1990391 1538017
14576 1538017 1974161 2050451 1990581 1926428 1833603 1940552 1760393 2379892 1877195 2101013
14566 2101013 1948434 2161488 2312019 1772557 2247772 2236711 2327042 1955326 2169298 2179787
14556 2179787 2258526 2312058 2587428 2411848 2432613 2339041 2450480 2556820 2903895 2676065
14546 2676065 2835443 2839012 2739993 3374388 3832306 3762321 3862028 4245313 4564446 5134952
14536 5134952 5961619 7635051 10284119 14301109 20878927 32086114 32883185 19552002
14528 19552002 11428286 7140006 5269716 5237395 5754582 4271788 3866652 2830438 2217702
14519 2217702 2612304 2307740 2580066 2372006 2337857 2467618 2420562 2204372 2159853 2610581
14509 2610581 2601387 2312126 2460449 2697231 2696078 2399282 2568601 2941463 2843655 2819542
14499 2819542 2823130 2960836 2673278 2799804 2981682 3209215 3082426 3026722 3324544 2908489
14489 2908489 3059419 3097211 2844012 2786890 3161526 3480761 3238035 3467940 3724136 3201510
14479 3201510 3612103 3300848 3613053 3486009 3261168 3507068 3456432 3589589 3924250 4013523
14469 4013523 3642468 3640388 3787485 3733834 3899974 3983710 4055981 4001448 4290339 4157240
14459 4157240 4306232 4035292 4650647 4320435 4572044 4411905 4425953 4450876 4931320 4987125
14449 4987125 4575224 5141049 4542888 5096187 4772521 5284332 5101508 5165803 5341145 5399154
14439 5399154 5084135 5518389 5543008 5577993 5457049 5943921 5864946 5707880 6056536 5939215
14429 5939215 5830553 5988115 5972402 6295970 6042687 6296529 6427960 6633454 6416110 6801487
14419 6801487 6703830 6989966 6850869 6704062 7108230 7419393 7309445 7555068 7525362 7630214
14409 7630214 7811296 8339185 8211233 8305564 8038569 8710239 8769953 8921215 8913425 9155161
14399 9155161 9145393 9117708 9303198 9343746 9611721 9666607 10182674 9985323 10242697 10418720
14389 10418720 10576107 10671909 10955856 10854508 11220875 11481396 11590283 11760320 11870269
14380 11870269 11911824 11966541 12590951 12525766 12818114 12975245 12964707 13348531 13939221 13796683
14370 13796683 14261123 14587172 14783651 15139934 15369066 15680667 16023074 16296306 16831046
14361 16831046 17057651 17132117 17448341 17644597 18070878 18702967 18783277 19028398 19654061 19999143
14351 19999143 20406996 21034835 21265544 21968801 22459257 22611792 23071575 23867145 24050193
14342 24050193 24463607 25060225 26166443 26567654 27029809 27749519 28506054 29024568 29653032
14333 29653032 30504321 31366604 32178827 33060007 34206537 34829566 35921196 36468007 37839499
14324 37839499 39213287 40061077 41032260 42861087 43608072 44898918 46398495 47591570
14316 47591570 49342007 50833594 52696375 54320471 56132591 57942913 60516647 62227660
14308 62227660 64497919 66986133 69159011 72053600 74365165 77296153 80071508 83068068
14300 83068068 86501389 89805002 93609748 97707055 101733060 106054343 110241413 115388261
14292 115388261 120525045 126276575 132277777 138682232 144809854 151812271 159563163 167390582
14284 167390582 175516997 184223117 193966084 203723023 214358324 224916727 236457744
14277 236457744 249021419 261416508 275089912 289021554 303520946 317989986 332403450
14270 332403450 347053403 361568746 376128495 389830607 402952387 415111201 426686485
14263 426686485 437307807 446947215 455169205 461784605 466708720 467763924 467887764 468312702
14255 468312702 468448535 464555459 456727993 450848270 441784181 429686560 416830376 403396140
14247 403396140 389502724 375944316 361756657 346940457 332728708 318453292 304558683
14240 304558683 290750875 277330539 265026482 252381807 241075786 229892521 219016493
14233 219016493 207728434 196852601 186605249 177443305 168793622 160709882 152996997
14226 152996997 145752565 138746590 132655837 126948927 121144802 115752404 110917716 106068416
14218 106068416 101581891 97765166 94097609 90280210 86949180 83098258 80022762 76956606
14210 76956606 74340242 71516794 68973162 66440077 64538068 62307937 60350612 58256635
14202 58256635 56388972 54319073 52910072 51123954 49853302 48409143 46533075 45184124
14194 45184124 44211840 43035881 41838278 41053077 39511416 38188674 37497553 36441944
14186 36441944 35238387 34748642 33623170 33123528 32299153 30987601 30220041 30048930 29201825
14177 29201825 28177348 27743397 26826127 26288494 25705381 25290981 24505097 23968292 23449921
14168 23449921 22973143 22432294 22040986 21547873 20836723 20650006 20180843 19961640 19668723
14159 19668723 18830290 18627075 18599940 17657910 17575635 16864815 17063556 16385843 16100150 16104138
14149 16104138 15741820 15322768 15063747 14993488 14663644 14092697 14169256 13824037 13704422 13308470
14139 13308470 13025371 13102217 12678110 12640201 12083238 11956319 11824115 11846176 11597498 11528494
14129 11528494 11396272 10969836 10965146 10819852 10638996 10306686 9971602 9911992 9558884 9699698
14119 9699698 9697236 9185917 9309767 9108979 9004279 8924022 8843563 9039821 8724266 8509000
14109 8509000 8451363 8203507 8469187 7917484 7976989 7494297 7730185 7679132 7724838 7399799
14099 7399799 7178252 7013941 6835296 6981528 7127035 7272152 6742503 6668387 6687993 6812512
14089 6812512 6441237 6560516 6366558 5999741 6219707 6291259 6177382 5998944 5741277 5672494
14079 5672494 5911786 5814533 6005696 5600832 5321745 5279450 5437596 5668893 5208781 5231641
14069 5231641 5432111 5074679 4985500 4728484 5057282 5194195 4565062 4873080 4600803 4402661
14059 4402661 4560648 4643470 4640117 4684277 4424354 4557474 4134200 4679990 4317878 4271826
14049 4271826 3940482 4202373 4276943 4108171 4036362 4505416 4090904 4272441 3994355 3917665
14039 3917665 4123655 3914211 3833399 3980689 3831556 3456060 3597527 3277742 3590252 3596841
14029 3596841 3544876 3378506 3378594 3092569 2946629 2845148 3263936 3050570 3082355 3418008
14019 3418008 3293452 3236026 3082406 3004205 2934277 3433499 3173252 3222926 2696079 2900552
14009 2900552 2905666 2849198 2968350 2530922 3045308 2635484 2187898 3053862 2775623 2487132
13999 2487132 2883060 2496142 2710013 2422170 2541978 2520735 2396014 2177931 2525784 2374543
13989 2374543 2557300 2294791 2649445 2510982 2464686 2236811 2240660 2451140 2652231 2602169
13979 2602169 2614300 3020657 3224327 3649425 4510355 6901719 9700306 15495917 26710194
13970 26710194 34184438 23128169 14998387 9780233 7290823 5961611 5092348 4302977
13962 4302977 3849916 3817774 3257145 3327223 3296549 3041852 2809512 2653101 2767341 2822865
13952 2822865 2544542 2570435 2327316 2304277 2314931 2095564 2349027 1627913 2061674 2234649
13942 2234649 1965585 2180918 2192424 2231167 2110540 1996771 1826829 1946694 1876990 2032505
13932 2032505 2157224 1907023 1672978 2005237 1818654 1817608 1815252 1727555 1563946 1830037
13922 1830037 1582790 1690483 2051657 1867778 1630363 1780043 2023917 1838423 1718069
13913 1718069 1664357 1347176 1650637 1549702 1891457 1660704 1347235 1783524 1621342 1424934
13903 1424934 1457696 1386792 1814259 1482488 1581975 1621756 1585265 1368148 1471319 1457581
13893 1457581 1379363 1610303 1141378 1686487 1507180 1282719 1165348 1395932 1252277 1612711
13883 1612711 1426953 1426896 1294319 1210838 1351037 1437865 1350352 1148338 1209284 1488899 1122445
13872 1122445 1051727 1211674 1089688 1035140 1237539 1249826 1593517 1159954 991728 1021336
13862 1021336 1101176 823558 1180707 1094831 1179158 1100249 1406550 1176784 1104548 1292302
13852 1292302 962078 1259744 1025821 954495 1069376 945200 1164793 938520 966078 916686
13842 916686 1090471 1316361 1131717 920183 1073607 825811 1174241 1085106 989679 1167166
13832 1167166 1069571 714488 872703 791486 1085196 1233579 901700 879720 1127256 1033071
13822 1033071 816988 971695 990824 643267 842104 1098426 983378 818385 1112667 928366
13812 928366 1028077 918502 995899 851838 855954 632660 1077153 936971 776430 931575
13802 931575 698552 750283 666480 846852 1001009 926164 834623 732800 1077782 998616
13792 998616 906460 509454 834274 629372 917061 950867 654314 858424 773690 944719
13782 944719 939826 758742 810897 906648 854727 589868 713239 691866 973605 620595 553779
13771 553779 609496 831730 1164614 798368 804871 997226 561031 908620 626380 642487
13761 642487 753809 468997 834901 356555 695420 908726 648304 936589 814653 640449
13751 640449 480578 447555 461636 537649 650742 546678 517490 513103 988359 617608 602724
13740 602724 748599 633738 710782 494298 557195 378640 459522 556045 756217 863845
13730 863845 564595 605912 668933 573238 690832 519199 728864 757965 545347 625308
13720 625308 629414 859671 403995 709558 376175 754489 315730 711166 537250 437147
13710 437147 710223 629708 501969 454181 863521 712634 282741 208191 594717 527230
13700 527230 618241 721680 548970 455819 421181 560651 747843 637732 286591 511018
13690 511018 1001520 609871 466355 680258 384809 552801 622269 711443 775523 469790
13680 469790 752290 573276 640882 613246 455579 663460 212833 393920 611371 528344
13670 528344 600855 477021 693265 165468 255209 418900 456353 394489 425961 486176 427144
13659 427144 520771 984584 509351 380998 859611 567861 481600 50596 388547 497680
13649 497680 442922 498202 269142 587608 386242 495120 476734 539017 249541 544871
13639 544871 414439 338377 281467 455892 462305 365226 349302 522268 571643 519316 311784
13628 311784 751539 624028 126426 451883 354320 338193 397416 403474 320774 154036 671320
13617 671320 631959 497091 551497 590610 336516 476641 252168 249877 369495 523752
13607 523752 157721 216230 313259 371710 422616 346946 436321 684196 413846 373035 459147
13596 459147 353003 605604 230393 424367 137076 244073 341373 95971 461247 334134
13586 334134 485505 325266 889735 479499 319623 345419 300992 -63151 201512 -101652
13575 195401 360293 424954 382179 -17596 591799 558864 304235 308891 441481 427997 292027
13564 292027 569449 290940 223880 173093 25591 642908 180615 350096 19763 53959
13554 53959 270596 268852 899084 262204 300138 417989 185629 504058 455820 352137
13544 352137 326033 315182 440025 115030 612804 372767 652191 271967 40046 192025
13534 192025 338993 108114 139708 265059 8849 243097 140865 396227 70673 309720
13524 309720 324262 149329 409697 289794 279620 85746 373802 302183 684442 81696
13513 276717 154769 429762 518834 402102 408687 -150495 519514 116413 248165 535532
13503 535532 94257 192488 222111 307559 273008 273259 320096 508965 -57863 276061 154630
13492 154630 256934 638139 -62262 516936 284008 164992 339893 524189 368562 230889
13482 230889 435278 335549 368236 310795 496555 -305 -159090 159517 46195 295860 -28701
13470 245128 268216 257398 377062 425923 606237 91328 108302 326956 -105882 288164
13459 211844 -374848 317483 -29106 204385 74531 419220 121418 128231 414495 -36703
13448 262540 362819 220001 559767 -8161 571806 707456 264133 485075 370785 296162
13438 296162 439701 330627 427586 241898 156141 194366 86826 132791 102077 40919 410708
13427 410708 223689 74862 579792 221616 101509 -70915 111291 59831 105938 -260596
13416 188774 395788 33339 163375 361277 223591 198957 74979 130211 392731 208054
13406 208054 211891 157100 242640 -39090 484437 345400 211835 322037 196332 59662 214209
13395 214209 515935 328376 290465 149910 346253 163642 -115334 573574 269192 418224
13385 418224 351210 31223 131060 193269 271088 225268 42780 343681 327109 696254 319638
13373 294858 154358 127370 68009 99642 88321 327255 362173 307427 72143 -154515 134304
13361 53815 -90460 244309 119153 274113 151511 97512 -35677 -23179 139367 181526 159932
13350 159932 145739 263063 292515 327717 234547 205753 35787 -13693 375590 116065 -26877
13338 54438 345986 139921 396169 20599 90761 166762 -32373 181067 356542 447969 132174
13326 381187 35774 469880 259594 487944 163272 297805 -5021 91006 150040 35368 218146
13315 218146 -24345 430332 153920 316891 346298 330748 395372 235034 -219877 231820
13304 -217200 184331 -76934 484559 45330 285752 -109098 290587 227649 -79324 436358
13293 523505 29398 219779 151240 -135304 122781 456227 16935 97899 66721 215372
13283 215372 182706 -135497 638302 -62428 107284 19342 269279 208786 305076 97628 162714
13272 162714 243769 383606 174206 284028 241550 180694 -133800 -234876 170365 -74816
13261 159062 -149818 184109 -142074 353742 202637 -77593 -103917 88046 125699 95248
13251 95248 52744 -17474 110968 -52129 136572 300895 20966 244704 129991 -71883 111626
13239 209687 304367 -31698 213118 225640 87949 -131573 321732 310186 456015 39410 -10959
13227 101499 158105 -92775 98164 54829 121819 150367 213280 -58887 123395 98211 39278
13215 168661 -5938 23482 -26527 -116803 -39782 -189309 39725 322252 174748 53654 209916
13204 209916 -103107 557845 -40875 118571 124164 186345 -176642 40477 -34069 76533 13992
13192 83430 145414 190147 111678 -176264 -184118 190183 216882 449055 65401 -162098 -154046
13181 -154046 -81892 -163335 51143 273549 241423 168090 237540 106569 21365 -40755 -8983
13169 -139125 -182092 -101922 73309 23847 -141209 304657 118722 97734 75556 159139 60563
13157 -41829 246266 -43749 461494 -94786 -49355 437503 410862 37982 58122 124572 7846
13145 135823 33340 -152407 75740 426184 2781 -93816 -168371 74131 -65468 114438 -113225
13133 -103372 197269 -115036 -112147 120740 -90735 188605 -249084 -49823 260848 326747
13123 326747 -373918 -22723 -177406 168466 100619 113071 -211357 106499 104083 145225 -16940
13111 -29266 64904 161028 54611 -49588 -59911 -36097 177272 -56718 -94634 -311868 -121276
13099 211989 138407 1240 106469 -111881 103923 3041 77065 368627 244600 181520 220204
13088 220204 332605 382927 -236653 139825 448135 93648 104307 -59428 103429 166643
13078 166643 154431 52655 429957 129095 -89032 42288 110355 -61286 7027 326774 101429
13066 97752 -91260 39524 125391 -24970 189478 -58794 7343 245228 11390 236284 -253150
13054 339463 -140794 -128715 207502 146839 -10029 43571 162886 162967 82329 149424 -176113
13042 128415 -40626 -281354 -11529 236416 248117 113198 170190 23504 152263 10275 204910
13031 204910 281892 -240118 -203827 171321 27719 228146 -93449 180865 -45656 32029 -102492
13019 -22294 137572 35378 43174 -146966 88376 -59493 373888 -92614 45506 20767 -143822
13007 39548 -33768 281745 56369 203574 226303 179678 9491 -54548 98639 -77251 258389
12995 -69523 -78044 192152 307869 11897 312680 100905 39980 -150524 3009 25341 63715
12984 63715 -49296 30756 183695 -182259 205074 -108558 150944 63632 -109841 -56950
12974 -56950 161003 197901 159204 -100864 31534 94078 209945 613 98928 -161250 -40545
12962 275665 130109 339103 319424 86847 -56851 194609 66634 423096 75620 220010
12952 220010 312650 95240 174981 -149355 25860 -139579 -430310 96138 83714 129636 221260
12941 221260 72602 17298 -193410 72824 29791 16716 189446 221499 145036 38827 73188
12930 73188 69073 -181167 -6085 415157 -80276 123 130981 179779 -87322 93255 -256363 -280265
12918 -280265 127092 -180188 32490 -197731 100362 -267460 -10718 -268861 -89859 -145802
12908 -145802 151204 -239731 140867 275574 -330406 -6136 222996 89622 117202 28246
12897 82200 11979 -130809 30957 -53006 101042 91159 338870 -160745 5106 90336 -14876
12885 56088 -36217 -11930 -332160 26243 -54080 116125 -268344 114589 -36985 32288 141107
12874 141107 -125483 -105521 -152613 179696 125868 217536 121730 68426 -332566 194168 -94463
12862 -8845 -39317 261852 -183796 5254 175891 182927 -325685 68209 -181664 171843 -212295
12850 39990 196402 458058 -67822 -35622 17371 -259244 47497 7905 -92647 -91456 -302692
12839 -302692 61633 348193 102987 101723 -67249 197460 25992 -430983 -38186 -219149 223449
12827 97026 -110444 144739 -64827 -713319 457232 116843 79389 141432 -159323 299806
12816 -307604 31502 -181237 -159162 198588 -123953 78945 58528 128735 -165574 -4001 -102204
12805 -102204 -335863 206167 -135494 73829 236410 111931 -88809 -101128 266427 -119203
12794 -103456 -151528 104925 -172918 11304 254853 52171 221963 -88091 2112 -44898 98077
12782 11197 4468 -14799 -91635 -156114 -7521 -48028 -129033 -23509 205395 -191923 144679
12770 7968 -154508 -139129 40844 29176 139743 283434 1283 -11498 -153430 290691 -154199
12758 -67376 235187 -174099 236936 91087 96679 -43669 -19794 -3962 78384 -169124 44577
12746 7912 145825 -80639 197262 -37755 -267360 235274 -293091 224916 52704 -26407 224813
12734 -153823 -258926 -115397 89172 -22953 94630 142730 -67019 -14100 215445 -236918 -62717
12722 -96413 307235 -110790 253714 -267315 207303 237831 -50162 -68527 166800 -138341
12711 -148302 -1720 202567 261082 -54111 -54649 57140 -115597 100188 -130402 -123291 131491
12699 45530 -90812 -67177 353243 -13974 -102603 200458 211315 -17140 442976 -78942 244021
12687 245629 -272116 -96524 50650 85079 -30205 180975 -70670 119720 -154078 -174260 -77457
12675 -136378 59862 -26900 -98262 -47035 -171912 214511 -49912 -48256 17900 -295099 301637
12663 230698 -103805 49373 61395 123893 368732 -72996 -124633 111326 65113 222122 -107273
12651 -112989 -409159 195576 -168443 -184714 272093 6398 91319 186986 -72337 412470 -73021
12639 61394 187843 -204792 78711 221744 -19580 267888 231114 173833 -231302 175914
12628 -136585 -292761 -189448 209883 -52829 -203002 82530 20211 282514 51586 328151
12618 328151 57302 326005 114100 295089 -70699 417307 121512 141847 254300 24797
12607 94872 74938 308310 -42494 190764 72886 257464 101077 -557120 -65002 95830 -58122
12595 242716 -19515 44037 -10299 -125928 346119 -170207 226788 340209 -323219 272214
12584 -81350 -1036 142913 -252856 167826 54934 -133693 -138402 163700 332432 37313 258328
12573 258328 -218638 25872 17311 75483 56767 40189 162269 -236294 -213520 73494 26167
12561 46289 -91839 -149276 192557 -71653 -110268 -124046 12588 166706 -54225 96338 328042
12550 328042 -185285 -241406 -178658 123205 162100 -116592 340147 21914 -140769 -178593
12540 -178593 145818 215095 -126213 -331183 314763 173827 -64646 44246 34035 206150
12530 206150 -6681 6766 -41828 113898 -266328 283729 3418 -135361 -73601 55610 181022
12519 181022 -23776 76679 -209857 7855 272634 -237203 30650 20027 -69692 208553 49303
12507 51540 -95374 180293 -413618 52917 196109 200150 187841 -7740 69080 -160769 187080
12495 -157605 258262 -60240 -11745 214920 -153944 279514 -3018 135901 159294 -111917
12484 -70745 -126395 152856 231795 15942 92947 -291337 -132648 -199070 100626 275854 -8235
12472 -217404 141727 -428239 81893 -847 67350 197015 -220434 -165469 -187878 -176576 -202138
12461 -202138 -274833 -25117 92658 18844 -274777 -88561 -34399 -37740 -184234 -57049 -99121
12450 -99121 -231466 -40971 127898 -182425 126805 43841 -2510 25017 -31680 305796 -64675
12438 128890 44029 -196882 -115668 -304430 169403 -40053 -124746 274939 31738 146169
12428 146169 127953 -137983 -118561 115900 33723 90715 153501 66068 -234974 -266005 -223873
12417 -223873 -97841 -139184 82452 180241 5083 133889 295704 -380284 -39704 143230 -39378
12405 -130664 -371330 161157 -171685 -153642 -4304 -10048 -49993 221294 206395 21946 150902
12394 150902 -341772 -336622 163645 -201335 -219305 166410 201940 146683 -93658 147839 29744
12382 -30840 -6272 205188 -116206 -126143 146272 -41404 -52336 82849 49640 320738 90543
12370 -269604 149066 496409 -54271 260309 287498 86303 -144670 172341 221434 183814
12360 183814 252632 5926 315073 -130215 89466 410406 52230 153983 104482 235431 -125401
12348 113972 -61899 26788 15756 164491 -4972 -105334 -139171 -141471 -168710 -310292 -97293
12336 -115512 51060 125745 -179117 -71556 92085 165047 239371 235939 -236496 -101587 262772
12324 -194659 147702 -242667 -174884 -219308 -23431 94364 -43321 343905 313021 163853 262398
12313 262398 92637 58601 140777 10220 -109517 43842 138198 79305 -174675 60882 95398
12302 95398 344522 -171771 -5100 405664 -29038 334934 -101667 353350 78788 -51315 133387
12290 35222 414801 56339 177500 -261394 371906 -136768 -311109 -86848 108472 4864
12279 -216058 35661 193524 29693 230998 443463 53958 62701 265269 -235821 168239
12268 14098 214098 -300 473846 372673 251735 79306 5386 208894 232572 301020 160714
12257 160714 131031 126846 142460 275432 85457 327721 148120 -75725 224481 85803 303709
12246 303709 270547 -53033 -68380 414513 251832 -56449 65148 -118134 4352 126439 113153
12235 113153 112150 260819 485796 187373 254080 -66543 -120829 261094 -30491 -2896 -69607
12224 -69607 -128701 227852 -52847 -268267 -87198 -120391 21187 206882 343164 1523 189380
12213 189380 -53487 95370 336777 308697 118285 179026 443379 100467 499831 138525
12202 -130487 143103 39414 139716 87270 148644 31762 66680 52546 55799 126675 12656
12190 325624 -135717 77870 -150291 7305 177588 126163 265474 262598 275858 -14897 249769
12178 192029 73090 199779 6099 16641 -39968 582518 85362 132285 132437 219359 201391 121997
12166 121997 368949 21135 -24634 43339 39947 349020 207517 44490 250840 -278605 80100
12154 40462 388388 -187536 -15433 -69269 221897 168416 75313 50014 189436 259587 40308
12142 397837 195772 31758 221726 -54222 282123 180270 -135788 -125267 121491 63629
12132 63629 -19609 -201022 -121092 -142353 6348 69243 72878 104568 87880 -97821 243968 -113185
12119 169698 -146394 149027 57457 -47455 423272 110438 396756 212727 72654 42030
12109 42030 -34262 162055 221644 133060 249458 205455 115525 549323 123313 108899 251510
12098 251510 358531 -76645 -105714 -148265 77463 -111060 -95069 292313 155573 29607 149597
12087 149597 156601 82139 102722 57035 30901 240308 216700 31320 240602 509408 267207
12076 267207 51558 104541 -75065 70571 200365 17830 -277925 294706 70081 204827 148835
12065 148835 29375 -183481 178433 237663 103609 535580 -264707 391629 -64908 135503
12054 313172 -187864 -108902 19166 189011 -60461 -59140 353480 288562 194064 168442 376445
12043 376445 252241 -135354 144579 201085 -80209 154442 25436 153528 109669 -39184
12032 173488 90474 -91527 -263611 -9028 57189 204094 -273803 -7461 95981 191606 370564
12021 370564 61483 258801 -144598 -64841 -165789 -69235 213785 -43520 -199084 -200800 97949
12009 103929 60166 279557 -74811 -89662 81377 -46125 -27963 -112797 -71653 223751 200741
11998 200741 159672 -14075 160722 -90402 408014 -391313 142293 -71455 -302275 246363
11987 207351 -5600 -12297 272652 136784 -475277 13544 133955 -30594 -126346 -69176 -207960
11976 -207960 -43667 -41875 157836 -192452 -143085 214235 23997 130922 27182 -460250 219303
11964 -138947 -139701 -106575 60290 -130126 35084 -123308 -287690 -305913 266613 106814 -423491
11952 182768 -32719 -252831 493236 -107555 -52148 -233418 150365 -155810 60111 -329625
11941 -334895 -207990 168886 -34991 -23277 -187817 -290123 -29995 33588 86329 -6427 302227
11929 -238112 -150279 -142304 29608 -235852 86286 -58229 -78660 33726 62286 -180756 169293
11917 -284298 66864 -208720 -293270 37170 -105156 99035 101224 -63728 293885 360964 78334
11905 -52490 2638 -268024 -35594 -90476 181718 -346668 152078 -355074 158017 -56110 117299
11893 -3402 3181 53912 -97580 318144 -181063 -20981 -314613 184436 80857 304301 -50162
11881 -197712 -178292 179018 2286 -244847 172691 -107041 -40451 -83911 -184206 -163885 20718
11869 8471 -214262 -201128 3779 -119764 67936 -97805 85598 -112565 -184 90079 -105399 30869
11856 -80394 167684 -50106 -79430 -113940 201509 -49586 -171157 104798 -137643 -144214 -378155
11845 -378155 95371 -124499 -166811 -119205 129606 186818 -10874 92396 -136891 138917 61500
11833 -45597 165055 -35582 211220 -97810 -106865 -67852 97986 86784 -200246 -75307 202803
11821 -77533 -331090 -97156 189636 -63436 79193 -27683 236787 -421217 -98069 -96172 5772
11809 55142 -126792 -145328 23786 1958 -255307 277639 269299 -197061 -388246 -16989 35719
11797 -161699 -295499 -15605 -206143 25438 -282997 42895 64164 -288879 -76742 183940
11786 56184 151654 28013 -38012 201344 -231210 -309593 -389048 -329266 -260708 -24684 -62191
11775 -62191 414765 105436 -81604 44058 99436 -177218 651067 -194907 51075 -112448
11764 78696 22307 -95464 47880 -40751 340518 -112015 -50267 322131 -38427 -125421 -120398
11753 -120398 -220796 -136701 -9014 4433 -436007 -318165 -138126 -7570 37936 -104082 -89741
11742 -89741 -90097 -69858 -35816 -283325 382307 283042 -215485 -30515 161931 -63327 8634
11730 -96993 88460 9071 -178795 1054 1879 -146678 -40860 3875 -51061 -139150 -145100 -71511
11717 -201209 270273 -39707 153765 49822 -2903 10448 -127212 124204 -39027 124614 -211759
11705 88925 -55545 265901 -114718 -321490 -155746 361106 56620 -35742 -134551 -37887 -193643
11694 -193643 186015 11660 146348 42199 55643 43383 -161959 32710 229581 -88818 -8824
11682 5136 -75810 119462 -15264 199808 117699 90275 234476 79823 159653 212938 -278876
11670 -37752 83840 78544 215375 -73159 238403 48492 -65031 171438 24847 46591 -73178
11658 215597 -36876 156478 -2221 -14750 -127815 58227 122583 241815 66150 303567 -70135
11646 -308190 189800 21174 -115920 53569 221033 190358 135897 43382 -209742 -207468 176346
11634 217150 140827 -46009 119839 -305 -112072 23849 65673 -1519 -340889 -121549 -44673
11622 -211201 -309157 -151127 -203467 -31011 326116 30065 -52759 -22224 207390 163087 -47311
11610 -83248 -113862 -331100 254519 -24710 -158432 -184525 -275042 -207254 19355 -130472 -112746
11599 -112746 98568 -311448 130438 -116877 186339 126649 333052 57502 135101 79458
11589 79458 188045 334399 50012 116156 259566 377477 269341 154495 196377 45078
11578 -10699 169366 198727 16935 126880 204601 -128727 55294 369288 -227758 91456 -122553
11566 82826 135225 232373 92961 10695 135684 -156162 -29895 203955 -220886 -46363 262235
11554 15996 139932 63391 48415 119129 -275789 -123645 90835 184770 65193 98335 -55223
11542 162129 12726 -207427 48736 -120863 188168 35680 -2563 -126001 91117 236497 58423
11530 483697 -50634 -25561 469984 -170601 -41865 -192196 -132738 -177821 333312 52937 -191897
11518 -5850 221626 -99869 196419 311995 228438 76797 26376 165925 -102226 -60511 -61147
11507 -61147 337317 144331 23457 20309 128802 -115254 113006 -35847 -122075 -107311 198824
11495 84683 121248 -80264 15342 68346 217614 -246530 -350968 -72162 283962 116942 -18363
11483 -159356 19877 265313 155496 68861 -11743 97818 -218881 -81635 66496 87150 183265
11472 183265 358113 -188473 -110743 112188 237789 263331 58275 209675 190360 298741
11462 298741 124215 263248 -118111 164491 139312 86471 136359 -50599 125309 58915
11451 -73785 352948 33006 333002 233663 160451 -25163 106050 167542 170178 190184 -155858
11439 69230 378638 42450 92362 257974 -42782 237582 -116345 170953 238390 205890 -162690
11427 -265501 143047 200543 43579 278043 -1626 -165039 238718 87290 -69281 -145789 53660
11415 246803 -70289 -138742 -210283 150863 -139855 -115509 -89238 -77312 -129522 -108355 -77607
11404 -77607 229412 -32265 -112810 -49474 105085 -301066 -89307 -248341 -176191 -46237 -19452
11392 32846 -330141 192572 12952 -1369 124858 -77108 -278215 -96659 78405 123028 87168
11381 87168 -50738 -87345 141313 116959 -211892 -242490 -168335 -297543 -63706 -87882 123425
11369 16236 -163540 -384563 7432 -34964 -12047 263678 -32075 -132300 145302 241477 -230495
11357 -97616 1001 -200373 -53330 -36802 215317 -20167 -143621 -68003 -62303 13706 -23354
11345 20697 193040 67579 -90674 238086 -121772 196767 -3454 76791 301871 -457734 38311
11333 -630772 -171519 -31111 19132 75685 -112875 -291660 -255753 151546 -24601 -49896 -172807
11322 -172807 257869 -282277 164986 -135666 -19754 -70024 92975 155564 -220214 -105790
11311 185730 -158661 -184740 -214240 -133509 132786 -56543 -147095 -178847 -62271 -31167 90454
11299 353414 -13772 77640 74745 5916 -338339 -25687 -390651 -64714 -70624 -229650 255894
11287 -130315 -90282 52088 175469 251123 157591 -371661 137065 100851 156950 -390993 87954
11275 30406 57059 -108751 177648 -266004 113560 317790 -73486 156136 -341899 11679
11264 -267098 -318240 -209432 -107618 -192611 -221889 104597 109022 -159391 -92967 -234401 65627
11252 -80586 -201788 50906 -157293 38634 -5569 282095 76614 -76346 260504 -26006 292354
11240 -171404 -236239 -348114 214366 -411726 83072 -148933 -10159 -325717 -84038 -138791
11230 -138791 137799 2448 -216606 62671 141405 -8051 74057 -131696 -58955 38951 -304659
11218 177848 230430 -250457 206298 180390 -295698 120508 292784 -182073 -68111 62769
11207 -83431 -19310 125508 -167453 -19824 -374910 -25504 7801 -308801 -167527 -11365 196737
11195 -279287 178971 -201886 -31495 -38920 -438737 -295195 -178702 150593 -112089 152515
11184 -2310 53675 -38014 -133115 52649 401631 158527 224321 96450 -139417 -153422 132325
11172 19422 18948 -131755 -153239 -310317 -118194 36259 -139934 -222734 -90745 -293145 -202903
11161 -202903 -122961 -287237 -276061 -148642 -23387 142816 69738 -96164 30507 -62650 -26719
11149 115876 42367 119402 -17288 16673 -50903 -28541 21189 -196670 -58081 209005 355986
11138 355986 113347 -131756 190149 -90814 70779 -351989 109336 -175049 -135067 102367
11127 -213854 34093 61472 -162331 -89494 -94819 81064 -257188 83613 -15001 -262865 -88118
11115 58436 301615 -514327 -201945 -11534 108236 -128656 331743 82774 -106314 -8472
11104 144571 34322 78858 157920 -360351 205739 130501 -215823 98035 -81399 -154206 97144
11092 -123870 262605 214364 4979 133292 62885 133218 310899 255191 211570 20245 321862
11081 321862 191945 195932 331612 192946 223035 164154 174189 38583 181866 175937 -275484
11069 159856 305358 -151812 168656 304429 382948 279626 124814 282704 335781 325416
11059 325416 436256 190616 -276896 323265 234537 -43097 163954 60484 -144164 318932
11048 196921 46463 267086 515347 432437 218999 414344 536458 363033 329811 510737
11038 510737 361864 443016 402985 446080 626534 624467 625467 886195 347937 391491 513276
11027 513276 486128 904419 364318 651027 660078 538911 600922 553540 467541 518945 273172
11016 273172 370620 640151 543807 205914 767784 485331 384541 714149 497612 730347
11006 730347 446224 411708 552610 362400 393580 360624 516658 441039 486507 305377
10996 305377 569248 522323 368750 373209 691806 505137 491457 584901 506393 485356 441110
10985 441110 570593 470990 529481 370554 724466 631122 625102 677542 344948 578277 733608
10974 733608 412658 442525 462826 283830 625007 1149630 891724 989202 778236 631058
10964 631058 715043 971923 810687 1384448 1480772 1294095 1439204 1480157 1615625 2037940
10954 2037940 2183481 2054501 1927668 1984622 1926880 1730577 1865254 1676553 1441238 1508345
10944 1508345 1293394 1461319 1314318 1198949 1600469 1576609 1097058 1379076 1223753 1225862
10934 1225862 1344449 955223 760083 669514 541522 580682 436788 302270 229716 346199
10924 346199 126515 423957 -5893 225443 243845 295041 -129164 -28549 221527 133456 99544
10913 99544 113580 120612 -47980 -51948 14954 133738 -445528 112226 204316 -75813 -6543 25573
10900 -576714 107411 -95815 13379 65822 -7534 33448 -178856 -22763 -76881 -149649 119252
10888 330549 116781 160798 -242705 153968 63606 -29105 175845 35692 136479 50444
10877 69542 -150823 -189883 9250 150586 -359170 -121372 -149737 -393265 182464 -242592
10866 -201165 7808 -185258 -123228 -8152 349902 50821 -148814 -218710 232606 -40559 -156830
10855 -156830 169304 -114023 122738 47062 -76915 92795 -102719 -180136 30385 33287 55880
10844 55880 -249690 -89757 -151978 256905 14832 -71934 83836 231303 120690 64803 -75064
10832 4694 -207250 -111326 -31214 -31403 95187 -299280 151068 255121 -160475 278966 -137125
10820 -212682 -193215 -137208 25779 -105325 218487 -215932 114491 65637 -107646 -36013
10809 -70327 -242401 -5030 -141224 -194193 119711 58568 -7911 -43375 20843 -14996 2651 -14624
10796 173603 -168012 -144596 106723 -233811 -318846 -61447 -188368 -218031 268241 -5708 -226375
10785 -226375 -102370 -60580 -110175 335140 -2994 -70436 -22322 -204358 -93264 -176245 -100484
10774 -100484 173714 -142276 25268 -177309 201914 -249771 -103408 -203176 148030 4309
10763 23322 -351735 27083 -24772 127465 -206068 255850 194546 -309225 196702 -362565
10752 137182 344346 -171365 -300753 -236886 -94729 -318084 242282 -200085 -103109 135399
10741 -123543 -24710 106898 232468 285806 -50877 -423487 -20079 -160248 -24301 -248948
10731 -248948 -7258 93002 114870 83891 -40494 -157614 60278 -102607 -77300 -96528 -106510
10720 -106510 95282 -98375 -9374 -19757 -33811 199262 -306583 -286582 -320751 49756 -36707
10708 -104 171718 185973 289641 227041 -1452 20153 -253201 94029 329460 5462 -181729
10696 71913 -293622 1015 177451 115227 -91388 48980 -75298 -47903 98890 -117945 442303
10684 -29199 -37519 -28339 54163 382975 195382 167622 73168 -158168 66312 -64836 -258082
10673 -258082 -89333 -384258 -158829 -33396 -4831 73536 34263 -45036 -260631 -280758 -68738
10661 117763 269687 55980 -197697 15308 -3287 -148264 -51044 -25026 152875 138794 -332201
10649 -97201 -131707 -40914 -176330 28465 -152676 8770 37828 42349 14744 -285751 19586
10637 22601 -195302 -43364 155106 154615 -347292 -188800 3511 -28039 -229239 -40497 -188207
10626 -188207 47971 -268447 48279 143081 33775 -224964 38137 -21340 46585 -319518 -160141
10615 -160141 -126047 -254703 -156962 -366671 -203742 -73800 -333511 -241561 -226658 54839 -131972
10603 -99107 32444 -223551 134160 195819 15476 -82994 129911 90827 34225 -308837 -220900
10592 -220900 175037 -126669 64662 -206311 218695 -44818 28917 -62109 -377272 -249873
10582 -249873 -3406 71827 -463543 -46707 253018 51396 217425 -126911 -118032 38614 -242789
10570 -79381 158262 -216135 162748 -322134 265424 6300 -261852 72075 -229016 11123
10559 19252 87231 75514 -57477 -63886 -519264 -50302 -256344 71007 -77486 42780 -335338
10547 -403031 129531 -252857 -63285 231138 10102 126879 54536 -296002 -24141 222640
10536 -78428 -24376 -38090 80067 -29969 -330178 32847 -224274 -300938 -260575 10778 39641
10525 39641 -87275 70684 -171786 142625 228556 -96795 -278760 -61070 -51257 -63791 -15309
10513 255229 -161541 52499 142211 -106092 238858 -274142 -116637 24011 -346928 209742
10502 -103725 75369 -18561 65062 -6837 241718 1134 -140921 34439 -389230 -65078 -54582
10491 -54582 -72725 -11999 -32333 40036 8537 205339 -200909 -11264 -86625 -52710 -231456
10480 -231456 -360419 71400 -100257 139302 91413 205033 -66532 36558 18135 129602
10470 129602 217940 -29814 -94653 -8408 -337917 -197052 87199 317966 245382 193468 229541
10459 229541 476989 18537 43360 119324 110342 -456114 -236666 -86800 260949 -343250 107741
10447 -176458 -168034 168805 37486 -218486 -29811 -129631 24152 174984 131663 -193802 -303304
10436 -303304 -351372 -136316 -153627 12422 79620 -21818 -199383 120401 112742 -110012 -28077
10424 -308498 -131157 -167028 -108470 -335576 134811 -558016 212922 85564 96625 317605
10414 317605 423823 -313624 207284 66390 -181081 -5600 -82314 -88462 116306 133396 614
10402 -233087 -159383 -111278 39847 82457 112337 -104466 361357 -329105 350204 2034 6831
10391 6831 -135741 -191632 181725 -146458 -153849 35152 -163567 8778 240156 -80948 -104357
10380 -104357 -74851 -203173 -30947 193819 231797 -213909 299903 213895 -64537 -301293
10370 -301293 110262 192698 265582 38944 52374 83448 17141 66843 -1792 -232789 121664
10358 222635 74438 -32796 73110 -53474 88808 190129 138124 188171 371759 251185 363436
10347 363436 533464 -167435 224024 422808 59632 367148 114549 222889 75074 191212
10337 191212 -153424 411882 89625 298023 201838 606129 369538 315269 293420 398664
10327 398664 500613 264408 228798 -128852 52934 -51690 194113 351779 402338 107956
10316 169147 38086 270150 251448 -15481 88168 172922 -74912 404121 63478 81128 -73198
10304 185980 93087 189002 78113 204208 260861 86247 -131456 40010 182435 -124497 -178751
10293 -178751 17258 -62024 -150379 135939 -14037 -35200 7546 -24652 16021 -25046 -249426
10282 -249426 -64689 108338 141417 91391 119065 519 371056 -65360 -478649 76762 109669
10271 109669 -386945 -30466 172301 -110183 -45559 -59067 -281706 -112168 -121137 -77727 -114112
10260 -114112 -124509 150534 -131229 -223701 153581 -12690 -160188 229765 -50286 89616
10249 32574 131633 -103908 -180813 131116 157807 209534 -139279 -116263 88292 16605 327838
10238 327838 280044 237473 325142 140721 15474 -184807 119349 -162084 -5019 -219178 77942
10226 5451 -139116 -56721 131176 281767 -137061 -187987 78779 -137151 4057 173326 -46615
10214 -24750 -364654 -64694 -188639 -319520 -160846 9513 176629 -248149 -85478 -109776 -77281
10203 -77281 -351393 7680 -304576 -117085 167014 -335787 374561 -505911 147941 54199
10192 217525 72368 -206586 -40544 -142081 94717 -309157 293728 -32357 91539 146991 -19911
10180 -15633 -21005 19467 -50990 -269119 -189968 186121 -57310 -150141 103866 -70937 -166642
10169 -166642 -286604 -42091 -247712 -435932 -47018 92878 -73065 -143414 -193338 -3669 -35024
10158 -35024 -205990 -56224 -324759 34759 -219331 -312848 -195880 17661 -163603 -243666 -39197
10146 16365 -275287 -144460 -184752 -66755 -307015 -230174 -214228 249257 222102 -85891 231885
10134 162008 40790 393916 75583 96647 27082 45394 -151772 -86281 -183611 -102543 -184472
10123 -184472 -25827 -126085 -87558 49628 69875 -116533 -107319 -26155 -182920 -198879 82011
10111 23704 163316 194187 -253210 -12405 -128074 -113783 -273761 139054 30968 -83591 -231998
10100 -231998 -154323 208266 31973 -244367 -28821 45533 106946 -167573 -260111 -148812 -477835
10089 -477835 -68876 -108202 -176471 -84851 -5341 -337069 10360 42585 -48435 6471 73518 -183317
10076 -145738 -53261 -129196 116830 44155 -484831 119055 -252914 -270639 -192031 152103
10065 -132491 -102670 90736 -258794 -172170 37562 -146767 -118316 -231012 44211 -21513 -218600
10054 -218600 -196793 -83228 -20980 -127321 -98930 202378 252724 36723 -124922 234686 5550
10042 -430444 -114345 -115644 -311374 -91364 -65678 -42783 125918 -28091 213566 -52371 -264757
10031 -264757 -305777 -3052 130074 -333074 59090 187891 -183295 106067 -246119 34211
10020 11290 -6046 107019 -122130 -198922 -149025 2627 -72087 -431694 39546 -410581 132170
10008 -150285 72031 -7557 253357 -67933 -133962 46922 38574 2437 -351788 -11433 -78350 31437
9995 67301 -249495 -163514 -158314 -1549 34896 217939 -56195 32816 45862 -26768 -275080 49360
9982 -76630 -394192 141172 -174471 -469000 -128287 -88840 -162602 -127681 40608 -431274 -69400
9970 -479766 -9234 -63102 58607 24865 132242 198831 -16224 -49733 -298583 -71182 -388592
9959 -388592 51058 211103 -72045 -181436 -95797 -96393 -222630 -102996 234618 75928 -10964
9947 54441 -237080 107561 33008 -15288 23979 235513 -57878 33173 -268511 -227509 -43744
9935 -38248 -251539 63407 -259236 -322799 -135941 -187934 40540 484 207021 113187 -85546
9923 5083 -392438 171530 -50071 178338 60654 147120 -164056 -86742 -102491 -70128 52802
9911 -154579 -244001 -104586 -55351 -222628 -40382 4309 323721 191034 38067 178897 -21769
9899 -163610 64961 -333519 -55088 263597 -94126 -185804 285124 -240522 -437243 -36652 -136427
9888 -136427 -193905 -203319 -95257 -165886 75956 -42450 -172398 -37348 -161519 -212656 40722
9876 127714 -208433 -353355 -255921 -35303 -135661 -187927 23930 -4951 -279732 -44466 -173231
9865 -173231 -83971 87544 190232 -83971 -374553 5619 46382 -159697 -7208 175699 -372169
9853 -11218 -84258 -110084 11000 -144417 -128759 -118445 395383 -27480 265101 -279078 -169803
9842 -169803 -268432 -245797 -29301 198927 -83372 -117259 -126061 -8678 27813 42924 103202 -213253
9829 -314625 -42631 -133724 57568 -137694 -188203 -192596 -169005 -248019 155640 -154384 31339
9817 -425890 38169 50536 -92697 -274779 7804 -89260 135809 239555 -373123 -313942 -244556
9806 -244556 -91056 -19969 -111116 208981 -171140 -231770 -104192 2879 -87676 -199337 114878
9794 75096 61677 -145266 208688 -378933 90329 -103122 253676 -26567 325025 -192274
9783 -166356 139088 -179596 -157321 -200169 296491 22787 93614 -112426 -122253 30175 -75938
9771 2117 -43478 -295108 -181218 -138438 119244 -129442 -190382 -191696 -85814 260752 -74873
9759 274486 -19687 -66927 -219053 -339978 -219029 -307036 260700 -113959 -294327 -47403
9748 -151950 -159732 177192 -9540 -200129 21972 -478957 64804 48302 -41240 81639 -127562
9736 -30906 56360 87845 197034 -404489 26159 -162464 -168023 -65220 27829 82405 -111696
9724 -120674 195928 -93878 -5453 -143263 -173576 -26133 -248948 162305 345792 130244 -129134
9712 -115161 -340718 -133243 -262556 -55736 -75597 -30953 -182457 80629 -281683 130425
9701 -161092 52059 65596 -260014 -100373 -48896 -188162 44850 -164307 -69064 -15620 -240056
9690 -240056 -6219 -226769 49595 -272517 -29613 83591 -80784 190175 3148 -146888 -185668
9679 -185668 -121140 124281 -232445 64061 -360181 -10692 131553 -3932 358416 43781 84120
9668 84120 -194241 -52519 2653 72709 -93255 107964 -176974 -68403 -39019 -142451 153295
9656 -234544 166846 -32535 92712 160168 2391 -405038 -161708 -62467 -9873 -204560 -145038
9645 -145038 139857 14138 -182365 241055 -83255 -261106 -3916 44850 -262358 -175876 -74941
9633 33087 -214821 -106065 -51963 106496 -112224 96130 -391062 -228757 -203091 113321
9622 68366 -126990 21838 321475 64006 3411 -121887 204014 70257 76146 95307 -87798
9610 31191 -104053 36693 20932 -198075 -193455 -214878 -357207 317906 -46076 15842 144478
9599 144478 -128223 73094 -130584 339849 -42407 -247791 81298 -47978 -5808 -12070 112021
9587 -133981 -98085 -94347 -29294 -193116 -46364 11418 42316 -232440 -102831 -174742 -345161
9576 -345161 -101827 -103404 -376770 -196871 -144003 -96926 -185529 -93225 74644 -47172 -38791
9565 -38791 -22690 152034 -136008 34397 21257 -81619 -244667 -548307 113651 -3832 31714
9553 2773 -102468 -85758 18225 -183160 -213917 -182419 -113687 -375200 -211580 198631 -436826
9541 -154174 -76599 -287685 -68635 -328907 206082 145134 -131960 -249447 -93294 -234796
9531 -234796 -59457 34650 -43633 115445 -61599 -315659 -462186 -90528 -173039 -163600 -228359
9520 -228359 -291736 -214410 152417 -25545 -34357 -21298 -30395 70568 -245513 -178547 34039 -159113
9507 131795 -82538 -245572 273049 -36487 -190562 -311054 147085 21191 120883 -17250 -136342
9496 -136342 -155648 97667 -99704 66758 -123524 -411140 297060 -248281 173571 -153445
9485 45935 -28712 -298192 -18636 -47384 -118379 -52020 -349918 -249573 -213636 -1464 -82627
9474 -82627 38472 218131 129016 11301 -151577 35827 -288968 -188101 190916 3523 -191310
9462 -266875 73754 -149611 -61433 28506 -152116 70140 -302747 169603 -96980 -162131 121331
9450 -137120 -122193 239059 -31935 -338292 -135773 17909 -167749 184665 125117 -148681
9439 221820 -150385 -227421 30443 -91745 121364 47980 272659 -156961 -288108 -314815 60386
9427 -27029 372827 -285307 -311350 -69493 -87061 -120943 -179218 56413 -142355 198135 -191458
9415 -116962 2352 61300 -46858 -238701 181232 -77435 180496 -70603 159610 -286953 134972
9403 -415007 -62178 -12880 87818 -178448 -328061 7651 -297803 -394332 -250162 -356687 145408
9391 118706 -139604 59081 -219475 7232 -190726 48719 -173401 -101641 -402033 71573 -41782
9379 129799 -155492 -44330 41992 -432946 -237537 -336164 -187781 210884 -36737 -91197 65687
9367 363224 -209074 142394 -27009 -71095 134830 87359 -73680 304824 11875 -242609 -116846
9355 -82288 -107838 -77491 148728 -6795 489 -56832 -220470 -38136 -248544 -226627 -376473 -26148
9342 -92878 -44437 42532 -229029 -80979 116452 -224090 127872 -160452 183937 72137 85732
9331 85732 -129903 248430 -8499 -36982 -584466 92755 -3211 -7873 63539 140726 82133 -209044
9318 -287601 -3915 -188414 -241601 32475 -80609 142450 101633 269457 -71316 -213413 -209662
9307 -209662 -228652 -196929 42590 34444 -216928 -13035 69815 140718 13249 -56778 260364
9295 -187764 80736 -104125 -140617 -352018 -249580 -176086 -45981 116979 -147120 323101
9284 -54930 150418 46588 -212184 352386 46209 29254 -142344 -397527 29857 149914 -257386
9272 202233 -155595 -24833 -138726 -151849 -353746 32162 -160264 -62089 160597 -257070
9261 78735 26610 -388655 -15934 -184841 -271476 167230 92565 -42367 -68684 -110944 -84556
9250 -84556 245346 15533 73681 -128542 -49299 -124359 -245383 -402689 26586 -115252 -78704
9239 -78704 -6000 -79792 209833 -100353 -246991 -26569 231954 26240 -212243 -48567 -142188
9228 -142188 -19909 -256615 -114493 -248385 -14134 -176452 16594 63555 -182203 -196695 28584
9216 -119652 -15921 201233 -48483 -170715 -306026 -136492 -54002 -151255 -100846 17481 -59579
9204 -83927 -295047 -317792 192165 366940 -196518 53036 -59530 87654 99634 -147701 -144852
9193 -144852 -61772 -145677 234186 84005 -9054 20270 -230485 -51530 60450 -53729 -3391 -72834
9181 -72834 -437473 -181365 349 -182616 307274 67048 -140689 -273767 118793 250868 129131
9170 129131 -17780 -241208 -324505 23845 355206 10277 -275605 133733 -35968 40142 -257244
9158 193244 -229367 -67376 90589 -217317 -20276 -35000 170457 3888 -110108 407311 301411
9147 301411 -205961 -310788 54296 189340 -147165 120115 -155767 -239368 -21804 -241389
9137 -241389 77049 -201722 116874 237328 -375468 29828 -278453 -287689 58648 -176900 20233
9125 -112099 -148042 -92320 -345991 154295 -44879 -121712 -352841 -76853 -7379 -163100 -19 80898
9112 139248 -34410 -82720 -58557 7306 -72853 -203327 -105240 3743 -26522 41262 -97215 -37504
9099 -13241 -231642 -27958 233654 -205702 72608 -274053 -336425 260814 -125352 -116235 13261
9087 -35056 -73850 -205399 151338 8495 3249 16038 -141028 572400 -84408 286949 359396
9076 359396 -149402 -68273 -87520 162993 -210193 -9126 157060 90607 14284 84880 -171410
9064 -409600 -109638 5690 353715 -45206 3837 81830 -57280 11214 -327060 96925 24641
9052 -137794 -130493 -175686 66352 -227067 -5651 -115104 -67509 -121377 -32671 -189743 -35912
9040 -97592 -259163 190894 -232376 -161520 -276372 57978 19977 224623 -120770 61296 160164
9029 160164 -68286 -83738 154422 -23716 -233149 -48741 -123119 -220521 -153825 -221863 201119
9017 -356302 -36145 111515 126698 -84382 -308218 -191257 -177013 140355 43858 -203817 -233312
9006 -233312 -75243 -11256 -273570 -348940 -121073 -169 -143108 -115392 -72128 -193768 14288
8994 -139617 -353907 40398 -115614 -252322 -169923 -300754 30423 58192 -177717 -140775 152330
8982 193452 223754 -214697 -204516 -227918 -53226 -111967 371500 -367989 12493 -92265 -296412
8971 -296412 -245225 -149209 -60558 190362 51558 -110608 -123320 -129474 -272180 -185177 289 -227975
8958 117183 -137951 333889 62625 110090 49878 11726 -101741 -229753 -13300 120948 -133290
8946 -242786 -85464 -144935 217071 -307632 273564 119185 -167009 -144179 133021 43234
8935 -192493 -215423 -178428 -114300 -311738 -79423 -350698 -64294 -244333 90831 215387 41625
8923 -414510 -179360 -359493 -1056 -353685 -216139 122871 278115 -74138 389203 -77749
8912 -105531 277765 446624 174000 276651 891243 975586 1537260 3188632 5792023 8103781
8902 8103781 3818674 1979165 1314804 717964 471445 421827 298216 208910 -23071 141015
8891 184825 373654 413006 195140 -72630 -313560 12009 106066 120387 117536 -6065 -168835
8880 -168835 381638 173193 -69983 6547 -133191 195489 -102338 211451 186572 -50748 -72599
8869 -72599 53825 -187111 51877 -200868 109447 -154050 119737 -128990 164630 -112392
8858 3542 -84806 -11318 -329452 -55484 -31571 -86621 -90050 50104 -97351 -10437 -197715 -182854
8846 -182854 -102058 -179780 88656 -68727 -112650 176686 95292 -467106 -374844 -339552 340161
8834 -182948 -106050 -53082 -173087 -27944 -193573 438764 -301388 -50373 -206373 -207788 114376
8822 -270781 -87969 -32346 120067 80482 3378 70486 -96649 -342178 -440044 292792 -178507
8810 157421 -56214 -105148 -208391 120563 182030 533478 -316273 76780 49333 -218708 -1660
8798 4907 -163934 -113756 86527 -47963 246185 -184403 -39713 -102783 1706 38803 -130045
8786 31840 281839 29793 25920 122344 322478 193433 -321874 168450 18891 -41537 72277
8774 -344874 139437 -35883 307598 71069 -84231 49985 -527771 -175851 147802 237668 -65208
8762 -69625 235537 -220204 -110055 -129808 -73598 -67678 34307 -136679 120164 -14512 -244925
8751 -244925 -57378 -143313 75571 -406 -63734 120167 101173 -272148 -269932 -3606 -177324 -47815
8738 39334 -23872 -221378 -364718 -260757 -375157 -375017 -359635 -154224 -181970 -103231 32323
8726 -451324 -93301 43534 111395 236911 225749 -100636 31499 118004 -298822 123277 -194518
8714 23429 295143 -16793 -154050 -219158 -233574 -13242 -256594 -34246 57969 -65469 -118342
8703 -118342 -44803 -146811 221257 -23620 198940 -118308 6151 93514 -332951 -256321 -287430
8692 -287430 -87219 -251391 -100167 -147317 -157489 -187500 102497 -244904 -34812 -414122 -18712
8680 153019 -51194 8789 -119491 37284 141151 34723 -171421 -79942 -31842 -69953 53894
8668 -70309 21369 124294 -339246 -127514 20187 -10778 133127 146751 -111982 -157813 -458963
8657 -458963 148452 145404 291938 21957 46956 -99683 -44087 25241 -252963 134122 -187713
8645 -219288 -52994 -36454 -77578 56370 -94136 -213766 8810 4496 -329697 15190 50503 -172542
8632 -368446 -30742 123403 -48428 -409548 -283118 16185 131139 229834 134545 -194221 -175782
8621 -175782 -80402 13775 104931 -94176 -481850 -353796 -186512 -192128 340722 -209344 99117
8609 -53821 -122764 -174060 152798 -39415 282462 -109644 -30334 50088 48423 162925 433466
8598 433466 25433 -151826 42375 -378927 -373155 65575 -915 335955 -152996 -305430 -141015
8586 255734 -193040 -131289 128894 -217407 -195637 -355716 -392414 -88088 -308525 -88509 -103077
8575 -103077 -142819 -142433 -187785 64277 329336 -82114 -317946 183561 -622671 -124041 -60256
8563 5745 -65018 -117707 354372 -75971 -14390 -189446 -91391 -100357 -300070 393803 -147734
8551 -303187 45732 7022 33599 -130383 -19221 134709 -116306 -187864 -117699 -144588 -2423
8539 -261611 -39730 -89656 -35555 -39243 61379 -354714 110291 28363 193240 -224599 -216984
8528 -216984 -38074 -230154 22919 -252789 -33479 89818 111068 -88584 -30590 -252394 -100970
8516 89022 -237170 138129 153891 -372190 195047 23081 83928 72087 -212869 13127 -144368
8504 -120459 -136260 236782 124458 -190658 -78295 32925 -187996 -305 -281797 525068 23319
8492 -26087 -257415 354726 173469 20994 -331239 1666 205406 16313 66572 121279 -239554
8480 -96914 -182976 -258193 -141648 46764 -346829 -107849 -48801 -188169 -157590 -251927 -154246
8469 -154246 -77431 -95139 20144 121348 144885 15445 273038 -257812 -81460 -333224 -164339
8457 -33035 -109407 69608 -61190 -91245 -180014 78494 254695 -171036 86136 254785 -61743
8445 -71439 -275941 108433 -136530 82548 -51514 -21442 -165668 21751 -177515 -20813 -45234
8434 -45234 -19516 -236132 -36347 -175605 -135280 -89403 -60396 -56286 -222713 -41823 -51534 265184
8421 61261 -68932 37362 203727 -111757 -197552 -76495 -1418 5805 -294912 -68941 -55046 150039
8408 177238 30744 93292 -71102 -37443 -3868 89080 -122095 157033 -115578 350967 19277
8396 60011 -168590 -19194 -210378 -7948 38309 573318 -81566 56555 35467 86057 -54719
8384 16860 -146180 162110 -318555 62633 -138960 33993 -157167 -152460 -130831 125316 -177806
8372 -296482 126264 -181063 7897 -156814 -64675 -18221 -109694 -17061 60414 -202017 -10482
8360 -116755 36168 57714 -218052 -184045 -297676 36805 -147512 -112111 -67461 -132993 -202548
8349 -202548 -106996 -66505 13741 -228019 79553 76975 73302 -57233 135699 44624 46708 -415907
8336 172183 -2745 10641 95925 -136458 -31203 -11734 7977 240321 197906 135210 -117385
8324 134245 -34625 85323 320394 -152234 -20202 123940 -83380 -22048 -4311 147949 -169610
8312 -100539 226215 94825 -376923 -14317 143687 -584764 26233 62821 17579 48682 218636
8301 218636 -52158 -139601 186877 158833 -289469 213664 523775 -200349 -27907 155900
8290 -135796 937 205630 239484 -139728 7205 -79716 -297396 -130691 130325 -94821 3314
8278 263250 -80977 -24910 29462 -4903 -247371 -86837 123932 73853 72574 -121497 -258668
8267 -258668 321073 -82623 80677 83845 -49776 123317 54347 -56943 165126 23182 -34221
8255 -134455 1697 25789 -123975 18047 -17298 176632 -157878 181315 -23781 -303388 3608
8243 -93491 -328022 161642 -77110 -21989 -92865 -17374 -23334 -341214 -335578 16390 -73466 112769
8230 -182442 -126315 -126628 203128 -230456 -13316 -138492 -190291 57391 96665 -48516 -45872 -14109
8217 -87827 4389 -100406 13321 -78954 107498 -102326 -26465 -29177 363159 341537 -48711
8205 -37979 82605 -62427 -71412 -199712 -207258 -154458 -105616 -192625 275560 -216075 -59660 -162076
8193 -162076 -96043 -168325 -158580 -107612 -14367 -49868 -74453 73241 56155 -96192 -39495 168317
8180 248158 147699 -179694 -393347 -234542 -129640 147631 -160725 249224 -42027 -211081
8170 -211081 -103723 -54884 137985 51273 48893 -101072 372432 -36455 -143431 92782 39223
8158 -128986 -12602 -216050 129594 -36782 -98378 48079 20427 -151005 -116817 -310683 -3901
8146 -224836 173958 -48005 -48298 21329 -30012 -157175 -195252 -221814 -81131 19800 -71102 108747
8133 295798 -57981 178116 -302511 -227428 256239 29081 135240 -263136 -78238 -28844 36828
8121 11321 28668 -32706 -116423 -195337 173710 44644 329242 -256635 7646 -157691 76320
8109 130722 14817 49609 -263196 -177684 -457623 -256298 -405168 166599 -105244 -156657
8099 -156657 26140 -211545 -169968 -152628 -97796 -198067 -92039 -335359 78404 -232234 68339
8087 183115 193042 -28369 -343359 151703 -103047 -52393 -386741 -198188 204879 123945 60090
8075 51481 20460 398088 121936 -50717 -245415 -50359 -23497 -34396 45562 67386 -518219
8063 -213238 -56837 -100344 -6820 37342 -166260 13002 -11814 -124666 96489 -29231 -372335
8052 -372335 -159269 94305 35582 40238 201826 260611 80232 -130906 -374486 -180171 -78156
8040 165917 -190807 -12972 128763 -347028 176406 154089 -102904 140613 -130004 -345084
8030 -345084 -88423 -92726 44413 150106 -15106 -333343 132858 74569 165017 193323 -309230
8018 -68018 16569 -196861 167547 -122423 84652 163712 -182747 -167821 -38207 -218896 -243645
8007 -243645 -233403 79720 196186 37353 174588 -331196 -174532 145696 -163290 15381
7996 -209514 -375590 66684 79169 180443 -221618 -314794 247799 -16712 185191 64585 119419
7985 119419 195383 -137203 -149128 -269923 206480 113941 -113373 -168916 -5805 -302978 -379719
7974 -379719 -213591 -381413 -228555 -152118 25375 -56286 -97536 -222460 -25522 247923 -124023
7962 -343471 -354263 -105727 220990 143843 -291977 114358 52236 -406847 94126 21807 -343203
7950 4805 68213 32642 -14783 114377 -131295 -83080 1371 -55333 -525041 -97962 -50061 -148642
7938 -148642 -53418 48829 265116 -288489 -100801 157060 135079 -59799 101555 -24031 -66899
7927 -66899 -46563 -65621 -317479 -89983 -133560 -367712 125076 112924 43113 -13889 160694
7915 152772 -98043 120888 151041 -119993 -209745 -67683 -11042 231541 323469 -409442 41629
7903 500877 -155453 146816 -92485 51361 -3369 -200609 -97038 -80685 246968 65964 222603
7892 222603 -55015 74450 352164 93083 234744 -244770 -382891 -234880 -82214 -38704 407701
7880 -213849 -335557 39395 -196217 -30292 -143058 82577 -22206 265183 -134639 294645
7869 -156508 -86060 75227 169965 129601 -72262 -5208 44138 -164260 -18986 -126265 -121075 -147928
7857 -147928 119032 271296 -360662 144626 -164476 -290257 235060 -260262 27574 -20703
7846 -73990 -176954 -113628 149205 -10710 137090 -31083 182047 236548 64242 53896 -69304
7834 155874 16115 -36653 -48549 -40899 -304316 18436 -199509 16381 -211643 153530 12629
7822 -174183 -81527 305193 127680 -22503 -87009 -10205 -21455 -284218 291405 81887 -350325
7810 -124427 -191755 51636 32305 -87207 -152514 -51057 -203161 -69814 108573 46550 -326023
7798 -149993 -98932 147803 -94440 -246379 147884 422436 168022 -19851 -130057 90792
7787 29612 -86315 84390 108485 79815 -44318 -151817 -61792 -42412 -215884 -153527 -87633
7776 -87633 138141 -12052 33115 -60591 172136 336242 -44292 -47596 -342040 96387 221563
7765 221563 328888 -24357 -265845 -101328 -143802 62469 -55987 -143864 -90429 26998 60676
7754 60676 61689 735 -195360 -186461 -65901 86319 11490 -195374 -103494 -9049 62299 -162974
7741 184298 120527 85187 -149848 -116574 -24890 40290 10132 114202 -239058 -163667 -8644
7729 13721 40045 -76429 -98853 33894 -141258 -84354 15424 -145110 99920 96891 -43025 -124180
7717 -124180 -154481 -170989 -142396 38259 344607 -231398 -342361 -110272 -52240 -3225 6553
7705 19708 93160 -313759 -177799 92273 -63548 -137885 -77095 -48108 -69753 86627 -169890
7693 200178 146008 73191 352403 42731 -27997 54455 163130 300274 36763 91594 -200229
7681 -98275 24510 153902 115410 79370 -129224 201605 -84781 -66075 -266132 -31892 -162457
7670 -162457 -174147 -7117 41389 138582 120496 157324 -436613 -345371 -122848 127008 6778
7658 14926 -279487 50986 241855 -185881 -264570 -144898 -28445 94306 -235480 -91110 171344
7646 30186 -81888 -45883 -283032 -108371 165005 87470 -43928 -165775 -118863 -216894 261197
7634 233457 -213959 -415256 -270048 178607 -12581 625 -263163 160012 -45286 -63829 -66147
7623 -66147 -224308 -36457 152355 48934 92738 164473 -87144 88584 -458 21041 141913 -92799
7610 116192 64891 159210 -273378 198487 -180854 3247 54524 -77052 213435 69141 282544
7599 282544 398976 118245 -41719 -7258 200582 -334639 130062 -287214 -127839 255704
7588 8107 38704 -13568 129355 -140849 -222580 -155244 -190686 127893 11098 -54996 106537
7576 -245043 68725 153790 114533 -99345 75894 -183161 -25648 3493 12558 41502 -161358 -72014
7563 -160592 258248 21592 2266 60275 -396708 30005 150757 -369815 35786 83893 -53000
7551 182875 27421 -262455 12499 -56631 110331 -189518 -72222 148595 -41734 270301 -79081
7539 159280 -377542 205589 -46845 7066 -4404 5064 -64899 399614 119335 76547 -115966
7527 -110208 147951 254110 45035 93801 -32066 -70927 -313263 -21103 182286 -78991 -25379
7515 -284344 -178162 124422 -220954 -10413 -77494 -33486 -5968 7577 -106152 -89149 -271524
7504 -271524 261639 -72245 -102702 -267411 -176649 -86701 172655 -294235 -292264 -226595 7911
7492 123519 4701 -377244 -79029 -137602 -42602 -101944 39758 -53673 -228046 -36432 -116642
7481 -116642 174955 -217832 -162770 91084 136996 33398 -519736 -6970 135689 254831 -26665
7469 105013 -40371 219239 111637 -32701 81707 -284149 98912 -150952 -275700 -23908 -187380
7458 -187380 -185197 385859 -30354 -89391 158224 135284 -72299 -23594 -27047 61203 -315418
7446 255995 -104019 51986 -35428 -402902 -313293 143617 -96630 -540037 279265 150411
7436 150411 -165802 88650 -151451 125827 -268058 -66688 104237 231744 -17941 -62716
7426 -62716 -246178 12829 -184757 -72730 47351 122515 -99646 -209700 -15550 -86705 7064
7414 -33402 148610 -242228 91011 -275605 123792 -28146 -26947 -286664 59636 -64264 -229366
7403 -229366 81468 184087 -144881 75893 232878 34991 12376 152565 -87597 188644 -408786
7391 -128434 -73874 -137882 -373128 -251569 82407 62343 174558 -230896 107877 -16169 107517
7379 -115126 -127840 93681 98450 126050 -42028 -143939 -188032 -177019 -29588 110889 -230587
7367 164139 -63992 -60593 106031 -84747 35283 -91708 -151695 -18258 243407 -140797 -93429
7356 -93429 12585 -46861 285802 -115209 -238895 15538 -24825 -4617 -115581 279813 5880
7344 -127808 93700 -152900 200713 144893 -237261 161101 198141 -97128 -483975 -223 133620
7332 -104282 -95568 -54301 -43234 332273 71720 -582312 153905 -117664 135112 -188660 103460
7320 129507 86510 -94832 -269763 -211015 -50619 -3641 -213991 350303 -74487 -239392 -23678
7308 -64743 -119769 -85664 -10906 237106 146968 103690 -120223 -236305 -307847 37960 -215825
7296 -86596 -109920 90108 -102856 113102 -79955 -418608 222456 -109879 32754 -20055 103513
7284 -125724 -135299 -318249 276263 55628 197302 90617 -317819 316425 119309 -217797
7273 -92088 183272 69572 -210069 -80861 -98680 180374 -222148 -163227 -104507 285534 -14160
7261 -95045 -44534 152335 -77866 36142 -33871 244731 302873 309851 76937 153558 -109868
7249 74431 34394 106753 247339 -73538 73416 -45280 -23552 57200 -29202 -61735 139980
7237 -62656 -100154 -124279 226797 145622 -42634 -137846 -383409 -133218 -37845 -182058 -88669
7225 65714 3540 80433 -160359 108962 -57446 -173936 -94704 -26576 -56308 -230491 -145332
7214 -145332 -119001 -260967 -92348 172101 -50250 -100889 -87975 -181111 -173147 122348 222294
7203 222294 127096 -73098 74095 108162 -105415 -30635 65561 145673 -83774 -257447 64579
7191 -14005 -5951 83198 -94466 73782 95890 -313157 -34053 186498 -25689 352621 -148467
7179 -13326 -275970 -146633 -167200 -236057 -58586 81611 -90790 164295 -64550 251279 -146546
7167 -68959 -340 96774 -27241 -136551 -159044 -57892 -23023 67241 194786 -34748 55378 -91460
7154 -57615 -326916 -260154 -71250 -74285 155460 42205 -166962 -93903 61022 -118891 15149
7142 225651 -24094 110166 103291 -70106 -359046 155552 -46773 88876 370775 21582 160478
7131 160478 -267067 -23881 84391 109624 37136 203556 -262313 115376 -111074 85963 -126709
7119 -203184 141896 -297056 -7636 -13670 164397 364934 -112898 306786 -62592 -99128 82573
7107 -163021 -320750 293593 17301 135842 -298852 -159410 106528 -57255 -7559 255338
7096 44753 -309872 20708 87035 -466979 121625 86075 214270 25822 -52448 -197314 167363
7084 -207148 301539 -160727 -98267 -341012 66675 112125 -144397 -282942 -59474 147772
7073 -303349 35866 211599 -74399 212849 11108 145205 112496 96900 -168745 166963 73193
7061 -205899 17259 20102 -314973 -193728 1329 -42998 3831 228934 -81186 -76030 84326 94473
7049 94473 66142 6465 94927 -259613 -239587 -252335 -45447 -432946 9949 -43467 -224549 64211
7036 123846 -81248 -164994 -58541 132417 -62357 -86347 -189942 -149675 -128009 -8288 130976
7024 21178 -204903 17231 88538 64290 36787 -189919 -192638 -165061 -150147 38541 -90982 71734
7011 -50390 208702 11636 -127709 -193204 66009 -144138 -297414 -30280 -237234 -36909 -30963
7000 -30963 248821 -176195 226266 -171621 -111354 -74416 -50870 -131645 147844 24483 58674
6989 58674 -236985 -81926 -2015 141038 -209766 206497 57248 37468 20248 155491 3832
6977 3780 285605 238418 -162997 -19057 398549 13131 25063 69496 -413404 82874 -211431
6965 -183433 230041 30937 -64062 -411467 -137112 81321 -90848 152083 -346788 -35159 366571
6953 -70928 89713 148669 -222447 -317695 -131847 -260359 -135090 -30817 -278941 173579 94755
6942 94755 -100393 219513 51209 -173683 80924 195903 32318 200073 -227987 -136315 -22683
6930 -114651 -14523 396510 -82871 434682 73773 316969 -196047 -2808 183394 -124328 -98610
6919 -98610 -22896 440409 17304 66018 -2562 378250 256004 155922 -147362 258208 22466
6907 64063 343173 63334 -61997 40098 -227747 -51139 -103655 -35853 -100743 65804 -298609
6895 34854 -29111 -126467 404240 -135122 113044 -46376 -92304 -159910 383565 -34622 63990
6883 -122294 63820 -61446 -113601 8572 13221 -74837 -92583 278875 166648 118644 347584
6872 347584 6867 -124622 143899 -167133 -352443 -113742 -235454 159731 -41012 -285680
6862 -285680 -52365 116080 -46666 67854 225647 172533 -76033 -10566 -110981 187827 293311
6851 293311 -102262 -147276 -112775 96735 -307313 -65615 173091 -21295 -62230 -85186 106978
6839 44657 -66690 62354 -217543 -120672 189910 -153634 53459 -245047 171065 120645 -4279
6827 -68626 -159429 138789 -153881 -110939 -86520 -193563 -94638 -324625 -271989 -39767 183140
6815 108434 -36933 40131 99523 171892 -181469 -147098 -24305 -143009 -8191 -52935 -160771
6804 -160771 273330 -45021 -139747 -159223 -236491 41935 30270 -87471 -24023 -149829 27623
6792 173085 188559 190354 -26951 314023 -286428 -130679 131714 -312699 -249257 -338832 6155
6780 46187 33027 340207 -6101 -42982 125997 111225 -124234 207224 -25480 48975 73480
6769 73480 -27340 -217779 90111 -111532 -57791 -90372 131352 -239229 412162 158562 19878
6757 -153772 -11432 -152092 86500 136448 424885 -106850 -119053 119798 -136308 278650
6746 215111 -329375 -24562 37103 -91353 221199 155684 149494 38926 -40785 45759 -21721
6734 -124743 -275447 -99999 159360 -1486 68128 173988 83492 -244878 105042 -82657 26532
6722 -254357 8426 34864 -184432 76013 3841 -230936 104076 -17745 58799 -99171 -2078 -76998
6710 -76998 92110 -38740 -4526 27535 -95453 -150805 -88982 -177596 -13326 33559 -201679 249922
6697 -92145 331875 -60092 -169804 -80151 -84768 -358820 6705 -164879 102354 -30156 -19199
6686 -19199 -50179 18024 -138213 -36349 -206866 -235990 -341223 -7093 -174461 -220847 -66281
6674 193307 -103646 -20185 55607 27875 402103 -79302 -86091 297520 205366 -41459 -250781
6663 -250781 3743 58703 200939 -42723 33495 -61031 -180850 -181571 144251 -144032 111451
6651 -66652 623 -124104 -55523 208981 -40639 48647 -101948 231439 -244992 275830 181945
6640 181945 -56201 72473 86279 162607 16899 -63178 78513 -66705 254089 372367 -202514
6628 -310964 76376 55727 -122209 -167468 -57653 -235907 80327 -116116 111836 -100846 -328623
6617 -328623 -135654 -246419 -181377 53264 -115785 118524 61401 2499 -143758 84786 -115592
6605 -189086 -275810 -347643 -19530 -118372 127261 -299153 -21293 -160707 119984 22237 -31979
6593 -51078 64680 -196591 178615 143304 25690 142654 -21616 -203325 21181 9847 14767
6582 14767 -244687 -185933 -97451 140955 70687 -57079 -17441 79924 148651 -44153 -164642
6571 -164642 -171088 -247889 -255898 -135679 58187 305969 -24882 -17777 -17128 -88515 206909 -41843
6558 113093 77230 -255580 -177085 245743 277681 63025 -17769 64839 -280133 283934 -203515
6546 111394 115614 296363 80333 -64187 -141770 75388 -1881 -46628 286797 -41444 114273
6534 167896 -181561 -215072 247643 66460 -148925 -11473 199579 280792 -191616 -7994 91650
6522 -141639 -99026 111102 -114376 141280 -15093 -121363 -191808 55790 24777 -112467 199199
6510 -165408 -97550 352892 7727 -50890 -36310 158330 105307 164554 50890 -85404 138536
6498 158476 59116 -175774 -173646 61002 -14430 245252 -80370 -256194 66746 139130 166032
6487 166032 3212 53199 346382 -52330 -11283 125922 -128748 -90809 -229895 189238 -207518
6475 -152210 -156184 230629 -160352 -116890 35653 23977 -30562 32642 -314096 -134902 11248
6463 -162010 293771 171077 -240165 71779 17964 92973 -38855 49148 -87695 115946 375182
6452 375182 -107843 -233733 -121061 -255760 184967 -29884 -125672 -47099 -39792 202145 208860
6441 208860 161516 -186622 -294630 137622 -60612 292648 174039 -6162 -74511 28345 -8850
6429 94523 -311966 217473 -195869 66780 104954 -197744 71781 76931 16580 43224 -64834
6417 -198263 172867 4700 -138140 -63437 -34290 -66478 174215 -69008 316288 57407 -87963
6405 168377 159312 44343 5834 263030 -202579 128980 -283360 -122677 227646 -200203 -200620
6394 -200620 249691 149990 127186 375143 41757 58705 151696 69017 88225 -278209 -8612
6382 160534 123090 -94294 -18428 -263858 252797 -136072 -127203 127443 -144640 -43353 -68975
6371 -68975 -276565 168059 -329349 -172966 110620 -64546 -115556 -163231 20413 -131881 134859
6359 201831 34649 166237 -77217 -121371 15750 187875 -219844 -55937 -193925 -179075 135727
6347 166054 147645 -21917 119703 54696 140377 -1294 190488 109021 -37043 -97414 -300011
6336 -300011 43623 -176805 -220529 46470 101327 -341594 -49247 135407 -139642 414596 162979
6324 -159360 -1943 -169535 -176185 -112461 129120 89037 -220260 -24946 -98368 -251948 37077
6312 -159272 -271328 -194538 311258 207610 -5271 227857 76081 6585 52337 -384239 -139043
6300 32387 137699 109009 -119074 78065 110537 -222049 -50509 48069 -261019 26154 298050
6289 298050 43691 -100493 31964 196874 34688 -9506 103462 17185 -251425 -57738 -3342
6277 -243261 -28668 -41886 311610 52646 -36255 308095 -160852 -134244 -20859 -24161 -50065
6266 -50065 131692 -164128 -71753 -485173 156056 -316604 18629 -99250 -67672 192101 -100217
6254 -71235 188735 47721 71421 69600 105858 240992 261660 26883 10436 103425 123927 213899
6242 213899 -112859 91290 -217783 96689 58614 -36357 -163724 -73139 105971 -162768 -185925
6231 -185925 -60622 -148492 184052 141800 -15609 -61228 65195 -373163 102829 252756 157115
6220 157115 -127464 257583 140846 -3202 92466 128714 -37898 178395 20920 101945 -483819
6208 230546 67725 -192753 55347 -82578 126862 -379603 295611 350615 113843 83135 -182048
6196 24025 345651 354837 -183320 -174496 -165778 201461 184010 -207975 -262139 -166959 -102090 -137363
6184 -137363 66513 -21184 -254092 -69409 93481 243960 -71693 -6571 19349 -145686 516059
6172 137931 359822 80246 156859 92477 -198536 -80690 277886 200215 85675 12386 142142
6161 142142 -25181 -107793 -249887 241498 86131 -106071 176700 -95588 -63667 190809 307816
6150 307816 91978 -380284 -138689 -116905 -64682 336903 -159150 63822 130598 -204433 -286457
6139 -286457 52670 -298566 -61870 -266566 39154 -345230 -261272 57119 -4712 -99356 -131969
6128 -131969 -232837 23880 -305159 45473 -24547 213575 148781 -123173 227706 -459959
6117 -223385 -291237 -18745 227726 80219 -103508 -458893 153463 -10795 318995 -116577
6106 -2553 156056 -151021 13893 11402 -49414 -23645 -65398 -211537 -224646 -190867 2790 -213156
6093 -151578 27152 236125 165022 244370 -111172 -147903 223045 275326 -34268 -221305 -106121
6081 -211104 119059 -42839 26308 93578 -41336 146579 363308 -118217 -40990 -94242 -85546
6070 -85546 284605 130110 -448590 -222574 97951 -285949 7993 4709 57278 262054 -139184
6058 -283127 -173694 -63092 -51201 261059 149477 -82247 -36946 83752 106633 8082 30427
6047 30427 99931 145113 219663 225103 -207290 -397065 -177648 99184 52775 33367 -200878
6035 260919 -355138 -164326 -354563 261625 -160111 241278 -46405 -104311 3579 95440 12288
6023 -219804 -124349 -191618 137086 -103862 -512529 -254770 33408 -163367 182855 -130654
6012 -20555 51110 43834 176647 -283961 -13000 -328524 13727 59246 214570 97083 -323933
6000 -82484 62859 101963 -29563 -80161 -168655 37807 187201 -264377 -11709 133320 -34484
5988 209615 82073 66950 214010 247289 -151016 -228588 -314127 169869 157995 -322377 391809
5976 -70538 -179304 182985 252924 145841 -6265 -247137 142316 -52778 214916 282712 -298796
5964 -135620 -39321 -266215 138235 137464 -60948 36190 -32780 -193661 -116038 -87010 226934
5952 181608 16729 -143877 77788 79408 -177746 75421 58207 380071 72567 30039 159198
5941 159198 -207641 353631 436512 66664 -133300 32508 119641 63492 -108169 -145036 -104454
5930 -104454 21561 -52356 -204530 -198552 -170399 -10854 57027 -70305 156082 -185278 48852
5918 126480 205044 -101410 -149518 166991 -7497 -33633 -212463 69924 66784 -145494 21135
5906 -97392 -3659 -384341 29528 70374 151392 131292 -299589 86673 -133529 73729 123522
5895 123522 -255503 -138748 140302 72726 -13081 128835 -219302 -244343 -28863 153784
5884 -87192 245329 -7757 120617 -143490 -117267 213536 106898 91190 41841 -217839 -375543
5873 -375543 16636 -244851 5738 23247 -225498 106201 24674 209512 -37733 164823 59730
5861 333014 -107968 -8973 -13231 -41566 -79750 -59261 214161 -67714 -67630 86571 393659 162634
5848 -152229 -21421 -32010 224577 62312 -139425 128409 -65170 19185 -21770 -204527 -129892
5837 -129892 44632 153152 -89441 -154084 302393 62476 40080 -138294 2772 159528 17949
5825 -31997 381939 176667 34143 -377480 415414 -90229 28613 204213 275401 53971 -191299
5813 -150942 -232032 49264 112466 27098 -210365 162152 -259240 166597 -148318 -134997 -305073
5802 -305073 -257235 -50573 -92637 198219 68026 -108179 69439 65080 -246816 -191654 31090
5790 -94119 -67228 -81141 97362 -316684 11278 -188948 -165801 79988 -310979 376431 -132315
5778 29959 -89632 26237 363958 -210097 -9305 189767 -82348 -19536 -7808 76167 352794
5767 352794 -214453 -217943 -178303 69297 -164469 210164 -192368 -184167 -16054 -210821 113777
5755 213162 24659 -231497 56731 -158586 -166186 -197572 -245193 89175 144954 -115559 65101
5743 109502 -307505 -56722 129737 30878 175428 184793 -190427 -80366 71065 79014 206244
5732 206244 106095 32261 74808 147154 -11107 -129786 -327230 16091 -210137 -113104 -117231
5721 -117231 34918 215288 -198386 -98642 138566 49153 -94567 288661 242748 -151248 103383
5709 107822 33529 -364862 -205616 305147 202853 91118 191025 241116 263004 -73251 26394
5697 -144538 108475 36848 -20884 -49317 -53716 -340480 130235 190385 -134152 -215837 80652
5685 -32893 150710 -143338 -225977 -301208 24725 420876 -198285 276881 -31445 308779 -28227
5673 -2175 -89003 4036 -16133 -32131 -315634 -400680 241001 -35588 -142086 -102215 -285072
5662 -285072 -138002 -198711 -162857 -179999 506 -117258 -102557 11342 -70714 252057 310002
5651 310002 -378113 290631 17859 61340 16249 173568 -299805 100077 141996 -276014
5640 -64762 -115461 -58766 133466 -139069 -49428 -289165 77995 296991 242178 284830 -118448
5628 33051 109239 64823 76910 -332726 -302285 56792 86570 356398 -241038 -143051 -283558
5617 -283558 -52233 -28111 258594 -225299 149505 -17635 -276913 63653 -218903 356392
5606 -96124 -73812 37700 232212 151483 -306479 -146837 102341 -122486 186554 143619 -91882
5594 -37102 20960 60101 -267037 -87250 -124199 208555 -320016 -44868 173123 -84486 -4828
5582 -155152 112621 -96781 -70247 -193862 -75436 -239510 -7678 24199 50778 149663 -97346
5570 245495 -32177 -174922 148771 -82597 -46196 -145913 -69226 221256 -301484 -35104 221229
5558 -27374 -142292 -67609 13670 -418334 -92419 308243 -55231 -342100 1599 -22063 -203941
5547 -203941 82406 291582 -166604 145072 9490 353080 -134979 -146319 -125969 315857 -165314
5535 -49995 -22007 -38797 209417 -216323 59065 -117957 -25694 -51540 -324729 -307498 67222
5523 44878 15536 26369 -61320 138867 141482 -97689 -77133 425538 85282 117332 -5490 -40581
5511 -40581 58913 132163 -36513 -381428 -39445 137784 -124406 67291 -382709 295300 -102879
5499 -361277 252987 -173136 -26916 -133416 212603 -51723 -157002 -31098 147471 -253286
5488 76539 -17450 325687 20730 -39553 15774 109609 -145590 66300 148343 -39029 96669
5476 186655 331312 85554 52985 -189014 155449 -67540 2159 111637 208694 92513 124069
5465 124069 110114 156386 -234574 31013 47349 25209 98633 135073 417348 170167 234636
5454 234636 -112603 150200 8244 199994 -174182 111978 -103343 -9508 289132 167013
5444 167013 -230636 177888 349614 15612 196917 -381302 -87066 -79309 -17599 90224 20215
5432 163142 -106192 -61415 -165700 81896 102185 81937 -238680 -193101 106504 -414888 -373
5420 -10580 -236422 -266746 139511 -186455 -85735 192886 -28346 -29198 81412 27160 107923
5409 107923 -98903 -239318 51223 -93197 228010 134827 -38988 190407 267497 -229775 -385244
5398 -385244 -102057 -17007 -234417 164581 205168 -96591 -13537 -17241 -145372 43689 371260
5387 371260 79543 76863 -336794 13609 23513 -100496 -89709 -20479 -240354 13999 31045
5376 31045 175423 255324 68684 91254 71366 -68825 301168 46667 337365 -51225 113768
5364 52504 248075 20616 -107776 146148 259579 144207 215949 -145413 128187 -63266
5353 -102325 -55151 12968 -44904 -57586 -141761 -232964 150612 -133175 -290953 34189 -27874
5341 -436259 49822 -276312 8805 142442 -285940 -49749 -232018 217963 -245314 218794
5330 -860 143984 24010 170479 -169464 275026 442641 38719 125666 122492 42848 163672
5319 163672 56755 -51984 -23373 -253128 95454 4904 -29097 202705 -317840 150938 -17953
5307 -71111 100380 -43186 -380638 108219 70449 -74644 -127985 -350475 -57120 -29818 104780
5295 156366 383281 305438 -34113 -185627 -116202 38516 -164048 -116344 -105168 51173 -187526
5283 134138 76374 13730 -162227 -34329 28311 -222880 -337540 -32922 -274357 -301735 128286
5271 -145505 122658 411009 35326 -49834 -268957 -39705 -248960 198385 33558 29537 292057
5260 292057 -231755 165198 295674 -424978 207127 8704 205555 -68595 10214 10834 78413
5249 78413 -159075 -163131 -279179 174540 -103488 103456 -162779 -106808 78122 45883 300415
5238 300415 256729 -77801 -269041 -185684 -67796 143738 -71152 -86670 -78032 115102 -71493
5226 18612 -195972 199197 -201811 -282626 92474 -256603 134792 197056 -158324 -76858 154796
5214 -43088 893 -63442 -300889 11275 -3009 -40243 22387 311008 397278 -117079 63343 44501
5202 44501 -99633 -103845 12158 197513 -169920 36767 2454 286892 98897 52912 -34546 -352789
5190 -352789 135336 -107940 197063 -212850 79818 -249170 43483 240819 86060 208686
5180 208686 311233 77134 86111 307836 49742 2976 169183 166261 133451 47191 -36996 106344
5167 216058 -270945 285544 -81216 97870 191464 72341 -248104 506062 73488 -143551 36670
5155 88446 3581 -101781 -51267 140294 -265361 -41866 270878 68324 -67463 -370936 -160158
5143 85229 153410 -392014 118653 23722 -18764 144802 -128281 -284140 -22571 -144740 181264
5131 25557 13139 226023 137088 -9247 127392 167941 -187796 115414 -89060 134420 -96743
5119 -105359 195360 -429974 50136 -127499 -264056 -59464 279044 -39298 281285 -182880
5108 174632 -92035 88684 -6056 70304 158416 47962 464971 565 -273218 359679 -393356
5096 72037 -181789 180795 -132743 -282128 -444085 23169 193513 140783 132628 181006 -161821
5084 -115407 196262 -195260 107764 53094 115781 -83939 16640 -32789 57283 -39766 136501
5072 -201932 129941 -155261 101512 -41379 137915 143074 -509069 47004 35904 -202624 151050
5060 64383 -278853 71042 -40113 -65069 124241 -21196 102109 192861 256481 -363903 -8891
5048 -169948 334822 -327123 16396 257137 138870 -13029 237325 347503 -223886 313876
5037 218313 -237376 -44087 9324 -117414 84604 -82967 -184147 182117 -319144 -393447 -181300
5025 298559 23626 -119976 -127246 -76773 58935 96164 -37705 10745 34039 -293111 166811
5013 195988 -237306 -77205 80680 -72729 -85016 59563 242801 7807 -65505 -109735 -34667
5001 -152811 73049 67425 -118999 139933 -217439 43812 -36236 88178 35758 210863 -55124
4989 -37356 -108198 -93751 -251468 62164 10328 -285326 52352 53488 326223 -100689 -178891
4978 -178891 134893 -236592 -51791 206023 -140166 7423 -20533 156564 -404021 -233547
4968 -233547 140245 56781 -217172 198414 134505 -65175 -526093 293261 -174164 82367
4957 -227948 29989 61711 -197892 -162116 -43960 -3421 -251477 -63 17191 -133732 -127912 354145
4944 -40462 -321715 45293 -121758 91234 54137 11438 150660 168054 -42183 -148588 -35384
4932 113202 -266432 306962 54065 83101 -75095 80623 -55447 228163 -155683 41183 -100270
4920 -1906 133504 65287 51829 -49737 97929 -321693 130105 -206794 -2305 213258 -144850
4908 4399 -32229 55281 223771 60100 201559 10008 -99023 38789 102695 -70545 91808 47974
4896 47974 230357 167345 30704 -243381 67668 -3924 -15915 -33261 -180491 99638 -185745
4884 217780 176457 292864 75087 118105 348369 -48017 -303827 -246320 66926 164263 18953
4872 -917 -110559 -176391 118902 -28177 166472 113306 -165344 -109941 -54098 209873 -31594
4860 33796 383978 -191050 -94878 68403 -73247 -189118 202967 60134 -161104 112362 201137
4849 201137 137094 -83210 -99189 177644 -117070 236209 102851 -149446 -43222 258553
4838 -141819 -134669 40738 -30707 -65951 37946 -281571 -172251 18897 215584 -143453 -78663
4827 -78663 25320 -21566 252020 -144879 -117693 -166388 29499 -2331 163746 95684 74290
4816 74290 -97888 185752 21010 83297 52964 326334 -172075 -104288 -36347 3182 447206
4805 447206 131208 -187956 273459 -309197 -78489 105465 169852 -121263 218989 176379
4795 176379 -282702 -34919 217616 -22686 126250 88271 -120193 -117489 141613 243695 21007
4783 139358 17295 80343 86888 -256178 -164555 -137511 -143801 34370 76763 -181711 -64357 375672
4770 191043 -81929 66956 -188922 -251115 324302 164445 60685 24452 63819 -146792 58715
4758 -58231 -144723 -388123 -164641 359709 329832 -119643 -8998 -26988 247565 -9612 243727
4746 11843 -166557 163387 -3847 77608 -125702 14515 377146 62287 82421 17876 137913
4735 137913 -88868 15449 -101709 -12094 240040 -351709 -281627 304960 170082 82874 -75247
4723 -85064 28389 95158 -59530 253762 81841 -171697 -146553 159245 -253153 -176749 -147655
4712 -147655 241689 -110924 -10814 39656 319103 -239037 -299600 32176 153152 116171 -100477
4700 -21507 38005 162921 49555 93085 148748 262330 -183122 -97180 125313 -130298 111121
4688 -215395 -91541 -216975 -50351 -144700 -147671 -27989 71492 -373997 -39902 -28449 147238
4676 -112342 206952 -201075 -162291 331009 152324 233967 150586 97465 -219621 91069 -88906
4664 -31455 22251 -33755 322589 83714 3774 -225428 116026 -165142 25930 80836 -172558
4652 -39456 291156 21403 6774 3290 -175663 172061 -215937 23733 246812 -386 -260614
4641 -260614 -382599 113392 338657 -53350 60735 248437 107723 -196641 115788 56446
4630 104498 112452 171700 136768 -158703 117021 -140615 180130 198442 -42196 399697 -160346
4618 -190993 244256 273801 -246625 356424 -65632 242409 -116036 -230344 -405764 -167423
4607 -329634 -55799 71949 -153690 227258 -136517 154722 110396 14872 -98489 208134 -28402
4595 -45332 158738 -28353 4221 -272322 124800 -91453 -493 163382 74922 280768 47972
4583 -203177 -104689 115823 92316 -118032 332286 48024 -205645 -58798 -45496 -151904 -17714
4571 -124167 50464 -45373 -80948 -67961 142449 -223743 95340 -29376 325070 114322 -100282
4559 -230081 1815 55563 -371790 -72361 109240 177126 -145604 -41029 37163 265665 37876
4547 139223 147374 110443 -171178 146182 81245 -111904 -97328 34017 65410 217032 -12408
4535 -123253 179197 -25626 -184993 202203 -214916 -242362 -85802 -217349 -13296 103181
4524 -137155 -11760 397301 -106755 -222749 -199283 -66386 83042 -93626 -249759 -2508 98201
4512 91135 226110 118736 215778 -10795 -120326 4959 -158038 242631 194528 -95521 510574
4500 85248 224512 -14603 -39087 -18261 -80920 -515151 -58548 1822 -208554 -312233 -378484
4489 -378484 -124454 -736 -273227 -166903 -2124 12368 -31985 129911 -3530 52086 165773
4478 165773 -24647 108111 27374 102022 194984 115371 11790 13553 -128110 -122620 32130 -12761
4465 93291 256811 85115 1198 51239 177320 -19813 -135305 23098 -76412 -149985 322203
4453 -7273 209490 -121296 31103 -49611 230755 -162272 310856 242410 -71014 -52626 159535
4441 -82936 -194694 149118 -37500 55161 -114299 208346 -9719 192779 165274 35038 -197725
$$ [...]
##END NTUPLES=NMR SPECTRUM
##END=
