
##TITLE=AC1130_Calarca-Quindio-La_5898268_e3OA3m1I9C
##JCAMPDX= 6.0         $$ Bruker NMR JCAMP-DX V2.0
##DATA TYPE= NMR SPECTRUM
##DATA CLASS= NTUPLES
##ORIGIN= BRUKER
##OWNER= Administrator
$$ 1.72 TOPSPIN		Version 2.1
$$ 2012-04-03 15:25:34.515 -0500  Administrator@TOPSPIN
$$ Compression mode = diff/dup
##.OBSERVE FREQUENCY= 400.13188235
##.OBSERVE NUCLEUS= ^1H
##.ACQUISITION MODE= SIMULTANEOUS (DQD)
##.ACQUISITION SCHEME= undefined
##.AVERAGES= 8
##.DIGITISER RES= 22
##SPECTROMETER/DATA SYSTEM= spect
##.PULSE SEQUENCE= zg30
##.SOLVENT NAME= COFFEE_meoh
##.SHIFT REFERENCE= INTERNAL, COFFEE_meoh, 1, 14.98061
##AUDIT TRAIL= $$ (NUMBER, WHEN, WHO, WHERE, PROCESS, VERSION, WHAT)
$$ ##TITLE= Audit trail, TOPSPIN		Version 2.1
$$ ##JCAMPDX= 5.01
$$ ##ORIGIN= Bruker BioSpin GmbH
$$ ##OWNER= Administrator
$$ $$ C:\Bruker\TOPSPIN/data/COFFEE/nmr/AC1130_Calarca-Quindio-La_5898268_e3OA3m1I9C/10/pdata/1/auditp.txt
$$ ##AUDIT TRAIL=  $$ (NUMBER, WHEN, WHO, WHERE, PROCESS, VERSION, WHAT)
(   1,<2012-04-03 15:25:26.921 -0500>,<Administrator>,<TOPSPIN>,<go>,<TOPSPIN 2.1>,
      <created by zg
	started at 2012-04-03 15:24:20.109 -0500,
	POWCHK enabled, PULCHK disabled,
       configuration hash MD5:
       1A 1E CE 29 27 FD 77 03 67 4E F0 E3 C4 B2 CB 90
       data hash MD5: 64K
       1A 29 80 00 42 EF 88 F4 0B 86 63 FF D7 64 53 CE>)
(   2,<2012-04-03 15:25:30.031 -0500>,<Administrator>,<TOPSPIN>,<proc1d>,<TOPSPIN 2.1>,
      <Start of raw data processing
       efp LB = 0 FT_mod = 6 PKNL = 1 PHC0 = 0 PHC1 = 0 SI = 32K 
       data hash MD5: 32K
       B7 05 58 57 03 5B 57 9C A3 9B CA 3D EB C6 9A AB>)
(   3,<2012-04-03 15:25:30.328 -0500>,<Administrator>,<TOPSPIN>,<proc1d>,<TOPSPIN 2.1>,
      <pk PHC0 = 212.113 PHC1 = 0 
       data hash MD5: 32K
       E4 7D 3F 94 58 05 6A CB A1 C9 0F E9 48 44 DB 26>)
(   4,<2012-04-03 15:25:30.390 -0500>,<Administrator>,<TOPSPIN>,<proc1d>,<TOPSPIN 2.1>,
      <abs ABSG = 1 
       data hash MD5: 32K
       13 6B 30 BB E2 4F 3E 80 EC 18 02 5E 75 85 E2 CC>)
(   5,<2012-04-03 15:25:30.437 -0500>,<Administrator>,<TOPSPIN>,<proc1d>,<TOPSPIN 2.1>,
      <abs ABSG = 2 
       data hash MD5: 32K
       79 EE 3F 16 FF 00 C6 87 88 FC 00 63 10 E8 58 2C>)
(   6,<2012-04-03 15:25:30.578 -0500>,<Administrator>,<TOPSPIN>,<proc1d>,<TOPSPIN 2.1>,
      <abs ABSG = 3 
       data hash MD5: 32K
       4E 42 2A 51 70 6B F4 32 61 C4 8B 80 05 E7 6C DA>)
(   7,<2012-04-03 15:25:30.765 -0500>,<Administrator>,<TOPSPIN>,<proc1d>,<TOPSPIN 2.1>,
      <abs ABSG = 4 
       data hash MD5: 32K
       7D 27 4B 8E B1 42 C8 70 33 BD 4D 6A B8 B9 B3 36>)
(   8,<2012-04-03 15:25:30.812 -0500>,<Administrator>,<TOPSPIN>,<proc1d>,<TOPSPIN 2.1>,
      <abs ABSG = 5 
       data hash MD5: 32K
       BB FE EC B9 53 AF F9 EA 76 1E 27 E3 0E 89 4E 30>)
$$ ##END=
$$ 
$$ $$ hash MD5
$$ $$ 33 D6 40 1B F9 48 61 CF B7 42 24 10 AD 00 C5 81
##$RELAX= 
##$RELAX= 
##$RELAX= 
##$RELAX= 
##$RELAX= 
##$RELAX= 
##$RELAX= 
$$ Bruker specific parameters
$$ [...]
##$TP= (0..7)
150 150 150 150 150 150 150 150
##$TP07= 0
##$TPNAME0= <>
##$TPNAME1= <>
##$TPNAME2= <>
##$TPNAME3= <>
##$TPNAME4= <>
##$TPNAME5= <>
##$TPNAME6= <>
##$TPNAME7= <>
##$TPOAL= (0..7)
0.5 0.5 0.5 0.5 0.5 0.5 0.5 0.5
##$TPOFFS= (0..7)
0 0 0 0 0 0 0 0
##$TUNHIN= 0
##$TUNHOUT= 0
##$TUNXOUT= 0
##$USERA1= <user>
##$USERA2= <user>
##$USERA3= <user>
##$USERA4= <user>
##$USERA5= <user>
##$V9= 5
##$VALIST= <valist>
##$VCLIST= <CCCCCCCCCCCCCCC>
##$VD= 0
##$VDLIST= <DDDDDDDDDDDDDDD>
##$VPLIST= <PPPPPPPPPPPPPPP>
##$VTLIST= <TTTTTTTTTTTTTTT>
##$WBST= 2048
##$WBSW= 25
##$XGAIN= (0..3)
0 0 0 0
##$XL= 0
##$YL= 0
##$YMAX_a= 529645
##$YMIN_a= -650895
##$ZGOPTNS= <>
##$ZL1= 120
##$ZL2= 120
##$ZL3= 120
##$ZL4= 120
##$ABSF1= 14.98061
##$ABSF2= -5.57192
##$ABSG= 5
##$ABSL= 3
##$ALPHA= 0
##$AQORDER= 0
##$ASSFAC= 0
##$ASSFACI= 0
##$ASSFACX= 0
##$ASSWID= 0
##$AUNMP= <proc_prof1d_extract_pilot.lims>
##$AXLEFT= 0
##$AXNAME= <>
##$AXNUC= <1H>
##$AXRIGHT= 0
##$AXTYPE= 0
##$AXUNIT= <>
##$AZFE= 0.1
##$AZFW= 0.1
##$BCFW= 0
##$BC_mod= 0
##$BYTORDP= 0
##$COROFFS= 0
##$CY= 15
##$DATMOD= 1
##$DC= 0
##$DFILT= <>
##$DTYPP= 0
##$F1P= 0
##$F2P= 0
##$FCOR= 0.5
##$FTSIZE= 32768
##$FT_mod= 6
##$GAMMA= 0
##$GB= 0
##$INTBC= 1
##$INTSCL= 1
##$ISEN= 128
##$LB= 0
##$LEV0= 0
##$LPBIN= 0
##$MAXI= 10000
##$MC2= 0
##$MEAN= 0
##$ME_mod= 0
##$MI= 0
##$NCOEF= 0
##$NC_proc= -8
##$NLEV= 6
##$NOISF1= 0
##$NOISF2= 0
##$NSP= 0
##$NTH_PI= 0
##$NZP= 0
##$OFFSET= 14.98061
##$PC= 1
##$PHC0= 212.113
##$PHC1= 0
##$PH_mod= 1
##$PKNL= yes
##$PPARMOD= 0
##$PPDIAG= 0
##$PPIPTYP= 0
##$PPMPNUM= 2147483647
##$PPRESOL= 1
##$PSCAL= 4
##$PSIGN= 0
##$PYNMP= <proc.py>
##$REVERSE= no
##$SF= 400.13
##$SI= 32768
##$SIGF1= 0
##$SIGF2= 0
##$SINO= 400
##$SIOLD= 32768
##$SPECTYP= <>
##$SREGLST= <1H.CDCl3>
##$SSB= 0
##$STSI= 32768
##$STSR= 0
##$SW_p= 8223.68421052632
##$SYMM= 0
##$S_DEV= 0
##$TDeff= 65536
##$TDoff= 0
##$TI= <>
##$TILT= no
##$TM1= 0
##$TM2= 0
##$TOPLEV= 0
##$USERP1= <user>
##$USERP2= <user>
##$USERP3= <user>
##$USERP4= <user>
##$USERP5= <user>
##$WDW= 1
##$XDIM= 32768
##$YMAX_p= 467126846
##$YMIN_p= -715684
##$CURPLOT= <Network HP LaserJet P1505>
##$CURPRIN= <$Network HP LaserJet P1505>
##$DFORMAT= <normdp>
##$LAYOUT= <+/1D_H.xwp>
##$LFORMAT= <normlp>
##$PFORMAT= <normpl>
##$SURQMSG= 1
$$ End of Bruker specific parameters
$$ ---------------------------------
##NTUPLES= NMR SPECTRUM
##VAR_NAME=  FREQUENCY,     SPECTRUM/REAL,   SPECTRUM/IMAG
##SYMBOL=    X,             R,               I
##VAR_TYPE=  INDEPENDENT,   DEPENDENT,       DEPENDENT
##VAR_FORM=  AFFN,          ASDF,            ASDF
##VAR_DIM=   32768,         32768,           32768
##UNITS=     HZ,            ARBITRARY UNITS, ARBITRARY UNITS
##FACTOR=    0.250966925370066, 1,           1
##FIRST=     8223.43324360095, -58449,       24638
##LAST=      0,             -7062,           213176
##MIN=       0,             -715684,         0
##MAX=       8223.43324360095, 467126846,    0
$$ Real data points
##PAGE= N=1
##DATA TABLE= (X++(R..R)), XYDATA
$$ [...]
$$ plain form
19443 264733 98381 93239 -2961 12610 -84391 -11233 202961 -75697 -279684 -415035 -347326
19432 -347326 10249 -77581 -251212 -201736 127616 93901 -50300 -252891 176069 187585 315180
19421 315180 -446898 122516 -31991 -15977 92651 -125156 -110281 -12966 211402 -199544
19410 -43555 268061 131348 357689 51660 -55191 -232929 -241841 -189274 10426 -34814 -25457
19399 -25457 -173383 -61147 77166 -109826 115804 100816 82850 -182709 143141 -165722
19388 327080 -160195 -206448 -208032 -55106 100068 -383397 72669 -163648 -472209 -11088 -14791
19377 -14791 -60821 117645 23932 44868 -15885 46313 -122259 65648 -97111 -204315 -114488
19366 -114488 55162 -361001 -101663 -90492 153443 -203487 67864 199403 109917 9266 -214437
$$ packed form
19443B64733I8381n142b961A2610h4391a1233B02961g5697k03987j35351O7709
19432c47326A0249g7581j73631M9476A27616l3715e0300k02591A76069J1516J27595
19421C15180d46898A22516c1991a5977I2651a25156J4875a2966B11402a99544
19410d3555B68061A31348K26341E1660e5191j77738q912N2567A0426c4814R357
19399b5457j47926f1147G7166a09826A15804j4988j7966a82709A43141a65722
19388C27080a60195m6253j584e5106A00068c83397G2669a63648l08561a1088l703
19377a4791m6030A17645B3932K0936a5885D6313a22259F5648i7111j07204Q9827
19366a14488E5162c61001a01663J1171A53443b03487F7864J31539q9486I266b14437
$$ plain form
19354 101724 43883 134841 65974 -165300 -250100 -192131 102862 -249424 218146 45068 -78296
19342 85519 -120055 114426 89444 230710 -302698 279518 -283886 107831 -138215 -129700
19332 -129700 -135233 81743 -306763 -234651 -223984 -103555 -198595 103986 -382070 -14542 103344
19320 -91761 -48041 -114674 -136563 138168 -195978 -336378 -78593 156581 178315 -267012 -169794
19309 -169794 124432 -277000 188122 -179489 -97900 -89517 -161714 -313845 -134778 -286207
19299 -286207 -58802 87166 83990 23325 56670 -201032 -46563 11352 -61450 -237175 -187345
19288 -187345 -201590 -179939 -2642 -136246 -186138 -237824 -323338 332867 -115529 -113309 -281567
19277 -281567 122562 -188812 -33052 29980 -59060 -472927 -38188 62231 -117151 -113884 43452
$$ packed form
19354A01724D3883R0958F5974a65300q4800N7969A02862b49424B18146D5068g8296
19342H5519a20055A14426k4982J41266c02698B79518b83886A07831a38215Q515
19332a29700n533H1743c06763P2112J0667a03555r5040A03986c82070a4542A03344
19320i1761M3720o6633k1889A38168a95978j40400g8593A56581K1734b67012R7218
19309a69794A24432b77000A88122a79489Q1589Q383p2197j52131a34778j51429
19299b86207e8802H7166l176B3325L3345b01032d6563A1352f1450j75725M9830
19288a87345j4245K1651b642j33604m9892n1686q5514C32867a15529K220j68258
19277b81567A22562a88812c3052B9980e9060m13867c8188F2231a17151L267D3452
$$ plain form
19265 96681 -30321 -218101 -53884 -355542 -59472 -77299 -150846 155671 -486043 4725 25479
19254 25479 78657 -224653 -351357 -221684 -370881 172177 -42817 -11729 61993 207060
19244 207060 -92648 -7256 150989 -177513 -14213 -175906 -159432 -149972 -454616 -30046 78747
19232 -290401 -232583 -72942 -68567 -195833 -335966 -40652 -95537 185338 216970 22244 -240762
19220 2652 298877 -247985 -208499 67641 -278701 -67833 92925 153695 -117116 -17628 125634
19208 -189754 -128557 -306140 -83437 -242320 -90332 -201138 -228064 180677 -259565 326702
19197 -120877 -182914 153486 -123294 42544 54323 28001 -20755 -1866 -292608 45979 -96201
19185 17937 -60136 -67524 -137211 -20250 146961 -222510 32970 -3273 -18971 74326 -208993
$$ packed form
19265I6681c0321j87780e3884l01658e9472j7827p3547A55671d86043D725K0754
19254B5479N3178b24653j26704J29673j49197A72177d2817a1729F1993J45067
19244B07060i2648g256A50989a77513a4213j61693J6474R460l04644c0046G8747
19232b90401N7818g2942M375j27266j40133d0652n4885A85338L1632B2244b40762
19220B652K96225b47985L9486F7641b78701f7833I2925O0770a17116a7628A25634
19208a89754O1197j77583h3437j58883i0332j10806k6926A80677b59565C26702
19197a20877o2037A53486a23294D2544J1779k6322b0755a866k90742D5979i6201
19185A7937f0136p388o9687b0250A46961b22510C2970c273j5698G4326b08993
$$ plain form
19173 -119811 -54658 94651 -20434 -272743 38527 -94966 -107978 -108700 -12825 83744 -373661
19161 138942 263276 -28614 229117 -216845 253048 32627 -300004 -106169 -216818 -211751
19151 -211751 -306018 -269025 -134333 -115647 -128254 -114698 -146462 -99261 85155 3131 -35692
19139 961 -242807 -126943 196865 17968 -6142 -305853 144020 56627 104266 8755 -134735
19127 -364446 100039 -50231 -24079 -71271 24310 -124794 -248098 -23426 213904 215434 22388
19115 142575 -94408 -59012 25079 150081 -256690 -79815 -239146 -104682 -95726 83391 -99628
19103 -93797 50793 -281165 -92374 -130697 12962 312973 88246 121142 -89124 -226211 -266831
19092 -266831 -161037 34812 5406 -342399 -218882 236589 -388129 -93034 46640 231888
$$ packed form
19173a19811e4658I4651b0434k52309C8527i4966j3012p22a2825H3744c73661
19161A38942J24334b8614B29117b16845B53048C2627c00004a06169j10649N067
19151b11751r4267L6993a34333J8686j2607J3556l1764M7201H5155C131c5692
19139I61b42807J15864A96865A7968f142k99711A44020E6627M7639H755a34735
19127c64446A00039e0231b4079m7192B4310a24794j23304b3426B13904J530B2388
19115A42575i4408L5396B5079J25002b56690g9815j59331a04682Q956H3391i9628
19103i3797E0793b81165i2374l8323A2962L00011H8246L2896h9124j37087m0620
19092b66831J05794C4812E406c42399J23517B36589c88129i3034D6640J85248
$$ plain form
19082 231888 121473 -35536 -243511 -86323 -116213 267408 -1447 -82330 -330066 96867 78642
19071 78642 -174241 -36667 19953 -175619 142142 -45012 4560 122808 -306024 -42183 -71294
19060 -71294 -309601 -41225 -128036 -69766 -148211 213257 -8974 -46848 -181653 146482 -91006
19048 147035 -18217 205020 99712 -44453 -205556 252838 15599 -127541 -85132 -159331 136600
19036 -229685 -140834 -233810 -218411 -10051 -335037 140993 -61089 -85162 132834 164726 77188
19024 -3364 -80048 -19853 -130047 72447 -257585 -101158 65637 -23997 17909 -12128 -31948
19013 -31948 -104046 148300 -98284 20711 130798 148774 230164 20271 69629 -41589 218069
19001 -110910 135102 -275163 207384 254745 -79901 227807 219222 27865 -34605 -194225 -97685
$$ packed form
19082B31888j10415c5536k07975h6323k9890B67408a447q0883k47736I6867j8225
19071G8642a74241c6667A9953a75619A42142d5012D560J18248c06024d2183k9111
19060g1294k38307d1225q6811N8270p8445B13257h974l7874j34805A46482i1006
19048A47035a8217B05020I9712d4453j61103B52838A5599a27541M2409p4199A36600
19036b29685Q8851r2976J5399a0051l24986A40993f1089k4073A32834L1892G7188
19024c364p6684a9853j10194G2447b57585a01158F5637b3997A7909a2128j9820
19013c1948p2098A48300i8284B0711J10087J7976Q1390B0271M9358d1589B18069
19001a10910A35102b75163B07384M7361g9901B27807q585B7865c4605j59620R6540
$$ plain form
18990 -97685 202866 59923 161243 162993 163925 -62999 106277 -189866 -33808 61693 -327891
18978 -14572 -203960 131447 67655 63005 -148006 -30395 -19193 -248463 -88535 148316 -37043
18966 33165 -164687 -265513 -53949 -53038 -18836 63591 19395 213296 132346 70677 459752
18955 459752 356323 -16178 -98045 -165220 -282765 310740 -76905 -116047 160329 101555 143934
18944 143934 -110083 -35442 -585028 240676 143091 163191 -104733 -161434 24207 46757 50266
18933 50266 -297239 -295850 36981 -138656 -116119 424859 306743 95853 251058 116090 65999
18922 65999 -190281 36394 -60796 -532467 9979 -191006 175624 202529 -88940 -47602 31848
18910 190216 48186 -195729 -323692 -167879 207190 358391 77504 -125315 -102435 -265234
$$ packed form
18990i7685B02866E9923J01320J750R32f2999A06277a89866c3808F1693c27891
18978a4572j89388A31447o3792m650a48006c0395J1202k29270h8535A48316c7043
18966C3165a64687j00826e3949R11a8836F3591A9395J93901q0950o1669L89075
18955D59752j03429a6178q1867o7175j17545C10740g6905l9142A60329n8774M2379
18944A43934a10083c5442n49586B40676r7585K0100a04733n6701B4207K2550L509
18933E0266b97239J389C6981a38656K2537D24859j18116I5853J55205A16090n0091
18922F5999a90281C6394f0796m71671I979a91006A75624K6905h8940M1338C1848
18910A90216D8186a95729j27963J55813B07190J51201G7504a25315K2880j62799
$$ plain form
18900 -265234 8305 246839 158911 172626 266750 253206 529574 283583 650709 -114168 359174
18888 249439 -69288 -46944 40847 -223106 -234367 198631 14919 -75656 -114580 44957 -271805
18876 -136208 -163634 -331522 -6239 -155292 -19042 96661 133324 128364 49014 -160835 -68460
18864 -46071 63647 -40160 30836 -122490 -487619 16655 -85853 -363894 83945 29568 25128
18853 25128 -327268 -191554 -149570 -58849 -37157 -212846 -57440 -163119 -379073 46255 256642
18842 256642 -189637 -340423 -92067 -95245 247489 101150 21761 -200080 199097 -361058
18831 271471 -192918 -19023 -100146 90735 40176 -99919 -59194 33584 184745 -295341 -265263
18820 -265263 -17726 149270 -51136 17572 -13376 -213331 30732 -56767 -13786 -105428 195733
$$ packed form
18900b65234H305K38534q7928J3715R4124j3544K76368k45991L67126a14168C59174
18888B49439f9288K2344D0847b23106j1261A98631A4919g5656l8924D4957b71805
18876a36208k7426j67888f239j49053a9042I6661L6663m960D9014a60835f8460
18864d6071F3647d0160C0836a22490l65129A6655h5853k78041H3945B9568m440
18853B5128c27268J35714M1984e8849K1692j75689e7440j05679k15954D6255K10387
18842B56642a89637j50786i2067l178B47489A01150B1761b00080A99097c61058
18831B71471a92918a9023q1123I0735D0176i9919M0725C3584J51161b95341L0078
18820b65263a7726A49270e1136A7572a3376j99955C0732e6767a3786r1642A95733
$$ plain form
18808 74482 -265625 -296190 -17121 -266324 -19285 -307278 79165 -115222 -9292 15066 -67660
18796 -45612 112842 -30368 198970 170291 62940 94749 40324 34439 -242191 -78296 95180
18784 -218590 -42391 -33892 27752 -224075 126411 -149722 11374 -295006 -228996 -165799 -74568
18772 -102168 -159777 191277 -290393 -80810 28691 -84335 -85337 -222594 -216473 22459 99407
18761 99407 204699 -298068 -224750 77951 -148522 103275 -270734 -299271 -92553 -71609 265765
18749 -173157 -35999 109121 -176668 -354628 -148744 115044 -288575 -77438 -88916 11632
18738 -158147 124997 6342 107616 -627 -280711 -16265 122465 -544221 -143904 -156443 -183107
18727 -183107 135995 -26982 19172 68740 -219477 4465 -129699 -350083 -5066 -67558 -159607
$$ packed form
18808G4482b65625l0565a7121k49203a9285k87993G9165a15222i292A5066f7660
18796d5612A12842c0368A98970k8679F2940L1809D0324n885b42191g8296I5180
18784b18590d2391Q499B7752b24075A26411a49722A1374b95006O6010O3197g4568
18772a02168n7609A91277b90393h0810B8691h4335j002j37257O121B2459P6948
18761I9407J05292b98068P3318G7951a48522A03275b70734k8537i2553K0944B65765
18749a73157c5999A09121a76668j77960a48744A15044b88575g7438j1478A1632
18738a58147A24997F342J01274f27k80084a6265A22465e44221a43904j2539k6664
18727a83107A35995b6982A9172M9568b19477D465a29699k20384e066o2492r2049
$$ plain form
18716 -159607 -128193 61590 -34046 272226 -149947 -49684 -218546 83197 10765 -17065 95011
18704 -162234 -35505 185040 -118677 -57496 -1886 -51294 -369478 137406 -104796 86307 -166891
18692 -36029 185334 276986 192480 82052 -228147 -7064 -34672 140603 295216 62360 -177201
18680 103280 88346 -17068 -314634 -511452 -181422 -98439 191413 -212915 41472 52790
18670 52790 -80425 -112658 -11474 117505 49307 362518 6907 -40612 -44960 -71402 -127605 -185183
18658 -185183 -347525 -30748 219106 -125562 -120113 -107970 58605 -210459 -167033 111999 150230
18647 150230 93713 16433 34373 -114637 41718 -188386 -47276 46717 -53143 -366002 11539
18635 96998 -201268 -3342 -168312 -26679 64486 46929 -296054 25807 46141 -180487 15151
$$ packed form
18716a59607L1414F1590c4046B72226a49947d9684j68862H3197A0765a7065I5011
18704a62234c5505A85040a18677e7496a886m9408l18184A37406a04796H6307a66891
18692c6029A85334R1652q4506H2052b28147g064k7608A40603J54613F2360a77201
18680A03280j4934a7068k97566j96818a81422Q2983A91413b12915D1472J1318
18670E2790h0425l2233a1474A17505D9307L13211F907d0612m348k6442n6203n7578
18658a85183j62342c0748B19106a25562N449J2143E8605b10459M3426A11999L8231
18647A50230n6517A6433J7940a14637D1718a88386d7276D6717e3143l12859A1539
18635I6998b01268c342j64970b6679F4486j7557b96054B5807K0334a80487A5151
$$ plain form
18623 -242226 261325 -26407 -221428 77802 -211573 -68602 203777 -28023 -91984 -68371 -71664
18612 -71664 259345 20923 -10338 -130412 235534 166612 -8466 -230963 -121999 -109502 -324189
18601 -324189 -88338 -148724 269187 -306849 -125404 -185236 -114816 -194591 -125034 -233022 -7562
18589 71399 -228244 -1099 -198216 -57470 34300 -87459 5635 -2404 -354768 -475712 -106903
18577 72595 112492 66414 -105683 58253 -207116 5885 -96846 -71694 -313038 116875 -34425
18565 -184764 -187484 -347180 55915 224548 209188 -356732 -381710 -206951 50419 43474 164504
18554 164504 79374 126050 -57385 -50945 -8387 149187 -271547 -3585 -104699 37001 -144799
18542 -333237 -1504 -152373 300955 41838 -23537 -182273 -154603 -150282 146856 111257 -469389
$$ packed form
18623b42226B61325b6407j95021G7802b11573f8602B03777b8023o3961K3613l293
18612g1664B59345B0923a0338j20074B35534o8922h466k22497J08964J2497k14687
18601c24189h8338o0386B69187c06849a25404n9832P0420p9775O9557j07988g562
18589G1399b28244a099j97117e7470C4300h7459E635b404l52364j20944a06903
18577G2595L9897m6078a05683E8253b07116E885i6846K5152k41344A16875c4425
18565a84764k720j59696E5915J68633j5360c56732k4978J74759E0419o945J21030
18554A64504G9374M6676e7385O440h387A49187b71547c585j01114C7001a44799
18542c33237a504j50869C00955D1838b3537j58736K7670M321A46856l5599d69389
$$ plain form
18530 -338765 -58714 257257 -81313 402795 -45020 10142 -194697 -3899 -301136 -114552 81842
18518 -224448 -78960 -309982 70805 104049 40098 4136 -292535 -83728 -78988 35410 -243493
18506 -33348 -149937 66673 -70022 -28545 -309549 -25378 -82208 -151204 -119412 -150523 -340009
18495 -340009 -151783 -207717 -66222 130776 -252431 -80693 28915 56449 73411 41502 -140490
18483 -166634 76051 306060 145275 -93685 -175311 176390 -84419 -174353 -89753 -15735 -199564
18472 -199564 77051 -125159 -103353 162035 -18089 11216 -199954 -200913 -55217 86403 -158487
18460 -13825 -12256 -9750 7331 208534 218125 -86285 -137688 -567983 -589849 -49354 -320621 79090
18447 -309538 -219474 37533 -80163 224353 -92628 -92658 -173465 -372719 54811 85769 179021 -243697
$$ packed form
18530c38765e8714B57257h1313D02795d5020A0142a94697c899k97237a14552H1842
18518b24448g8960k31022G0805L3244D0098D136b92535h3728M740C5410b43493
18506c3348j16589F6673g0022b8545k81004b5378n6830o8996L1792l1111j89486
18495c40009a51783n5934f6222A30776b52431h0693B8915K7534J6962l1909a40490
18483a66634G6051K30009A45275i3685q1626A76390h4419q9934Q4600a5735j83829
18472a99564G7051a25159K1806A62035a8089A1216a99954r59e5217H6403a58487
18460a3825J569K506G331K01203R591h6285n1403m30295k1866d9354k71267G9090
18447c09538R0064C7533h0163B24353i2628l0q0807j99254E4811L0958R3252b43697
$$ plain form
18434 6642 -487137 -18411 -265053 157997 85814 -160468 70431 -165247 -59301 486215 -242948
18422 -129283 42323 -155710 -269050 -160784 -314266 3083 114669 71894 -109763 -248524
18412 -248524 -373102 193304 -523846 70357 13742 91451 -184723 184711 -25151 86124
18401 -96668 80858 -24286 139755 -90425 38856 272018 110905 -125446 -137263 -85587 61784
18389 269275 -119455 183274 -413069 -268072 -396806 -50845 3448 -82502 -149573 55180 84728
18378 84728 -252216 -113871 -273981 -112005 -3061 -195210 44312 -161652 168738 127957
18368 127957 48700 271195 81334 -262819 -176264 -389859 128032 -208007 -197067 -183101
18358 -183101 -81876 -106479 135855 274731 128131 -154347 109047 126507 191264 -41002
$$ packed form
18434F642d87137a8411k46642A57997p2183a60468G0431a65247e9301D86215b42948
18422a29283D2323a55710j13340J08266j53482C083J11586m2775a09763j38761
18412b48524j24578A93304e23846G0357A3742P7709a84723A84711b5151H6124
18401i6668H0858b4286A39755i0425C8856K33162A10905a25446j1817N1676F1784
18389B69275a19455A83274d13069J44997j28734e0845C448h2502o7071E5180K9548
18378H4728b52216a13871j60110a12005c061j92149D4312a61652A68738m0781
18368A27957D8700K22495H1334b62819Q6555k13595A28032b08007J0940J3966
18358a83101h1876k4603A35855J38876A28131a54347A09047J7460O4757d1002
$$ plain form
18347 230238 -127631 152946 124218 -300374 -199572 -197341 -172857 122639 61102 -119994
18336 -106014 92014 -36953 118310 119573 -270246 -22968 319163 -223452 -23508 83629 38319
18324 8033 -110815 -138593 -237160 -216929 284208 248726 40426 10992 -298635 253672 54299
18312 315938 -18480 -285572 -89615 -336353 -14793 -230762 62710 314829 -273174 -296566
18302 -296566 -148939 -68619 -17441 -172215 -800 -225148 222483 -44062 -182608 116936 -266870
18290 -88964 143896 134500 82603 -70213 421598 -79921 -109496 -246709 -34553 -50399 209066
18278 83375 21098 -144082 -62421 -147078 -180689 -260236 147193 -6984 -134802 -220061 227086
18266 -52280 106619 218198 -541300 -145493 -4883 -12173 75677 169966 -58334 -18523 39951
$$ packed form
18347B30238a27631A52946k8728c00374J00802K231K4484A22639F1102a19994
18336a06014I2014c6953A18310J263b70246b2968C19163b23452b3508H3629C8319
18324H033a10815k7778r8567K0231B84208l5482D0426A0992b98635B53672E4299
18312C15938a8480k67092h9615k46738a4793k15969F2710K52119b73174k3392
18302b96566J47627f8619a7441j54774h00k24348B22483d4062j38546A16936b66870
18290h8964A43896r396n1897g0213D21598g9921k9575j37213c4553j5846B09066
18278H3375B1098a44082f2421q4657l3611p9547A47193f984j27818q5259B27086
18266e2280A06619J11579e41300a45493d883p290G5677R4289e8334a8523C9951
$$ plain form
18254 -95629 -186574 1496 63680 -196892 105685 -287925 -184521 37613 97106 -67251 -160894
18243 -160894 -6320 149304 196237 135980 21360 40582 43865 42456 112732 12205 -259570 -192146
18231 -192146 -241758 -234440 -75236 -208159 52210 -103675 101954 44019 31182 159753 -150061
18219 -259524 -79013 -258020 -269136 -333163 212934 -80094 -173235 -236360 -44338 -150060 132513
18207 -110746 9138 138575 2903 129952 -76500 -30404 36564 -5553 102980 71979 28587
18195 38899 123174 186007 -321793 243476 339950 37163 -65614 -73958 -217846 139568 -107787
18183 -233250 -25144 147151 -234135 -436817 -14621 -40480 -305384 268683 93692 -236737
18172 10348 11950 58998 32687 -81900 -95068 -200910 -163775 261599 390569 -161064 -4593
$$ packed form
18254i5629r0945A496O2184a96892A05685b87925J03404C7613N9493f7251r3643
18243a60894f320A49304M6933o0257B1360J9222L283j409P0276A2205b59570O7424
18231a92146m9612P318g5236j32923E2210a03675A01954D4019j2837J28571a50061
18219b59524g9013j79007j1116o4027B12934h0094r3141o3125d4338j05722A32513
18207a10746I138J29437B903J27049g6500c0404C6564e553A02980l1001B8587
18195C8899Q4275O2833c21793B43476R6474C7163f5614q344j43888A39568a07787
18183b33250b5144A47151b34135k02682a4621k5859k64904B68683I3692b36737
18172A0348J602M7048k6311h1900j3168j05842L7135B61599J28970a61064d593
$$ plain form
18160 212243 40454 -89321 49462 66522 -4596 -277154 190330 326258 -13164 -95578 197627
18148 -76272 299893 115516 167157 -91973 -45941 -144130 -126584 -49722 -270727 -132798 -180342
18137 -180342 -99189 62176 -219022 -95120 -49024 -264386 109109 75297 387248 -183119
18126 -351095 -57027 -110088 -141471 -89962 91701 204708 -85707 83496 49790 161767 88219
18115 88219 214635 42044 15572 -144566 -339685 18994 131738 -138803 -112177 -307024
18105 -307024 -155351 -24912 107432 20354 -143938 148421 -267775 -95214 205503 205439 -100161
18093 74892 73589 -100088 -72698 -395221 264439 250903 -185522 -221375 103277 -27749 -165599
18082 -165599 -333534 108374 138257 61966 57340 -261142 32425 165288 -302684 -400796 -35689
$$ packed form
18160B12243D0454h9321D9462J7060d596k72558A90330J35928a3164q2414A97627
18148g6272B99893A15516N1641i1973d5941r8189J7546d9722k21005a32798m7544
18137a80342Q1153F2176b19022i5120M6096k15362A09109l3812L11951a83119
18126c51095e7027n3061l1383N1509I1701J13007h5707H3496l3706J11977p3548
18115H8219J26416D2044A5572a44566j95119A8994J12744a38803K6626j94847
18105c07024J51673b4912A07432B0354a43938A48421b67775i5214B05503o4a00161
18093G4892j303a00088K7390l22523B64439j3536a85522l5853A03277b7749j37850
18082a65599j67935A08374K9883F1966m626b61142C2425J32863c02684r8112c5689
$$ plain form
18070 -10604 163959 -51042 32066 -36409 -118337 -250597 -140340 51376 -270228 195392 161487
18059 161487 -212559 1516 45270 567664 58863 354036 -117871 306385 54475 234046
18049 234046 -66538 355812 223446 -109793 -4867 156538 129592 226612 60131 -141062 36178
18037 -334599 -401155 88091 -285369 -29016 26992 364447 16354 -100908 -144275 -35451 -102595
18026 -102595 215936 146068 -91087 -427870 -68579 158493 -239551 112773 73034 105257
18016 105257 12056 -41442 90096 -25074 -452863 30402 207423 6238 -253855 -101428 -291332
18005 -291332 -98979 -307892 -1204 205436 20234 368098 -175521 -27839 78123 -122442 -140465
17994 -140465 -114971 29328 -318786 -227982 195517 -327535 -113117 -116784 -91517 -197266 -85711
$$ packed form
18070a0604A63959e1042C2066c6409q1928j32260J10257E1376b70228A95392l3905
18059A61487b12559A516M3754N22394E8863K95173a17871C06385E4475J79571
18049B34046f6538C55812j32366a09793d867A56538k6946R7020F0131a41062C6178
18037c34599o6556H8091b85369b9016B6992L37455A6354a00908m3367c5451o7144
18026a02595B15936o9868i1087l36783f8579A58493b39551A12773l9739L2223
18016A05257A2056d1442I0096b5074m27789C0402J77021F238b53855a01428j89904
18005b91332i8979k08913a204B05436B0234L47864a75521b7839G8123a22442j8023
17994a40465K5494B9328c18786R0804A95517c27535a13117l667K5267j05749h5711
$$ plain form
17982 116728 55938 -136057 -102434 212560 -38198 85505 27686 -188593 438676 -70560 -25998
17970 -217935 80222 -179520 -14585 244950 142516 -161249 -107671 -332885 174478 -50057
17959 -210014 60002 241397 -302948 71464 -611 9778 164252 -18847 -48331 -122238 -164638
17948 -164638 -185071 -46590 393595 53405 113390 360170 173821 -123874 115191 182068
17938 182068 -223375 -131291 -96695 -260921 99718 39170 -100875 -133498 106993 271911
17928 271911 -114251 -279272 -48082 151508 -45045 76648 -196163 -144369 87608 132573 190752
17917 190752 124995 25675 158709 208917 155621 -230842 84532 9967 -70247 89341 356765
17906 356765 130354 -114989 444396 86369 147542 3737 42682 59910 99154 -124224 1929
$$ packed form
17982A16728E5938a36057L3623B12560c8198H5505B7686a88593D38676g0560b5998
17970b17935H0222a79520a4585B44950j02434a61249N3578k25214A74478e0057
17959b10014F0002J81395c02948G1464f11I778J54474a8847k9484p3907m2400
17948a64638k0433d6590C93595E3405N9985K46780A73821a23874A15191O6877
17938A82068b23375R2084L4596j64226I9718C9170a00875l2623A06993J64918
17928B71911a14251j65021d8082A51508d5045G6648a96163N1794H7608M4965N8179
17917A90752o5757B5675J33034N0208n3296b30842H4532I967g0247H9341K67424
17906C56765A30354a14989D44396H6369O1173C737L8945J7228L9244a24224A929
$$ plain form
17894 41232 -7597 -287690 123656 -41490 -199426 273865 235525 -61288 213886 371751 17807
17882 159374 -52971 175589 270517 134370 100827 -10622 -194181 -4024 29666 -304394 -164666
17871 -164666 39932 -62765 49655 -261904 -27192 -57530 116615 97445 -18905 320222 -116552
17859 -245773 -74268 334076 -20463 101582 -34837 -57928 144814 -114614 -82671 278209
17848 -119045 108432 193741 90669 297683 -67347 149886 144417 325754 -258386 220782
17837 -78602 112887 -6145 203998 140799 -184212 172966 234653 -189065 273282 148848
17827 148848 61639 -160409 161184 -264707 -17588 95547 -39745 84682 -173157 -179369 8790
17815 46264 -62160 171254 373642 -37206 -31352 301858 -137937 104592 46883 47099 182832
$$ packed form
17894D1232g597k80093A23656d1490j57936B73865l8340f1288B13886J57865A7807
17882A59374e2971A75589R4928A34370l3543a0622j83559d024B9666c04394J39728
17871a64666C9932f2765D9655b61904b7192l0338A16615j9170a8905C20222a16552
17859b45773g4268C34076b0463A01582c4837k3091A44814a14614L1943B78209
17848a19045A08432Q5309I0669K07014f7347A49886n469J81337b58386B20782
17837g8602A12887f145B03998o3199a84212A72966O1687a89065B73282j24434
17827A48848F1639a60409A61184b64707a7588I5547c9745H4682a73157o212H790
17815D6264f2160A71254K02388c7206N854C01858a37937A04592D6883K16J35733
$$ plain form
17804 182832 -219193 28564 -159029 -4395 182717 -127053 -16197 208680 -19873 -137919
17794 -137919 81991 155094 -292671 -211633 -32998 134851 115168 -292106 -165559 -158485 27803
17782 62986 -5495 68527 127459 -254322 -48138 87402 40788 130153 97258 392790 -238135
17770 70491 -65283 -162657 259836 273857 168855 155141 145562 56901 97558 -29249 -68813
17759 -68813 176124 65068 -68354 310784 242113 -74214 310924 169119 92194 -323055 -63025
17747 122601 -57041 209333 -87185 132760 -65669 159869 20544 -353580 326401 56815
17736 -91058 -7091 145481 300460 39856 -31286 282240 -9417 188218 206752 310483 -24109
17724 332548 66841 -1125 -34565 76304 41259 42681 -198843 226788 482450 63593 209118
$$ packed form
17804A82832b19193B8564a59029d395A82717a27053a6197B08680a9873j18046
17794a37919H1991P3103b92671Q1038c2998A34851j9683b92106J26547P074B7803
17782F2986e495F8527N8932b54322d8138H7402D0788Q9365l2895K95532b38135
17770G0491f5283r7374B59836J4021j05002j3714r579E6901M0657b9249l9564
17759f8813A76124F5068f8354C10784o8671g4214C10924j41805p6925c23055f3025
17747A22601e7041B09333h7185A32760f5669A59869B0544c53580C26401E6815
17736i1058g091A45481J54979C9856c1286B82240i417A88218J8534J03731b4109
17724C32548F6841a125l3440G6304l5045J422a98843B26788K55662F3593J45525
$$ plain form
17713 209118 49315 21356 -110298 188579 218371 -37686 198191 130996 42617 168969 -300301
17701 6271 -407061 185329 -188127 -97569 51507 174805 -131671 23833 154756 -18977 -75626
17690 -75626 535608 170975 -7655 233335 110143 262835 21538 -457294 -26037 -126611
17680 -126611 140616 -27042 -47462 334974 322291 76303 -201294 175689 27168 -285748
17669 220174 241321 -104076 44566 127946 72814 -124481 -114090 185928 -163751 -69041 -85754
17658 -85754 -98299 389359 -54115 -109200 -103014 212640 -303154 121925 335955 110967 33792
17646 140434 207782 431742 17296 226250 -235635 373165 230006 277832 321705 100214
17635 -102631 36082 68808 -55043 26000 -49432 -248519 74850 -154255 37938 403269 415882
$$ packed form
17713B09118D9315B1356a10298A88579K9792c7686A98191o7195D2617J26352c00301
17701F271d07061A85329a88127R0558E1507J23298a31671B3833J30923a8977n6649
17690g5626E35608A70975g655B33335A10143J52692B1538d57294b6037j00574
17680a26611A40616b7042k0420C34974j2683G6303b01294A75689B7168b85748
17669B20174K1147a04076D4566Q3380n5132a24481J0391A85928a63751f9041j6713
17658h5754j2545C89359e4115n5085O186B12640c03154A21925K14030A10967C3792
17646A40434O7348K23960A7296K08954b35635C73165j43159M7826M3873A00214
17635a02631C6082L2726e5043B6000d9432j99087G4850a54255C7938L65331J2613
$$ plain form
17624 415882 157237 57681 48340 212053 -6849 427083 106386 34003 84431 205173 -118643
17612 -87282 1156 414256 2972 110116 -294025 316671 201833 -59887 -31329 169203 17260
17600 -30463 116397 300346 59335 -86316 240584 26676 78663 -149404 268464 178021 81593
17588 129268 403894 202749 61344 188204 -288320 8666 -78056 -15020 256497 -156162
17577 63961 127891 -11507 89802 26798 245361 206103 273650 214888 180446 141259 79685
17566 79685 468750 -32682 302514 231940 271278 263392 92456 237223 270540 10298 50801
17555 50801 -141049 309442 378136 -8783 311893 439390 380512 79255 337377 262251 -123805
17543 45181 257206 536963 -210334 141687 392797 340690 58742 204866 328847 -111395
$$ packed form
17624D15882A57237E7681r341J63713f849D27083A06386C4003N0428J20742a18643
17612h7282A156M13100B972J07144b94025C16671j14838e9887K8558A69203A7260
17600c0463A16397J83949E9335h6316B40584B6676N1987a49404B68464r0443H1593
17588A29268K74626k01145F1344J26860b88320H666g8056a5020B56497a56162
17577F3961O3930a1507H9802B6798K18563l9258O7547n8762l4442l9187o1574
17566G9685L89065c2682C02514p0574L9338p886I2456J44767L3317A0298M0503
17555E0801a41049C09442O8694h783C11893J27497n8878G9255K58122p5126a23805
17543D5181K12025K79757b10334A41687K51110n2107E8742J46124J23981a11395
$$ plain form
17532 220155 207793 96482 202636 332425 222705 246030 353204 229651 295206 302363 51019
17520 158325 184645 473352 147391 344536 90348 51091 428478 459672 358599 581325
17510 581325 941131 927456 1058592 857254 479609 579348 446120 113347 684049 174547
17499 411924 570118 95364 532114 531564 473214 1056263 999019 1154657 508238 448479 358752
17488 358752 488314 343024 78985 368239 417993 512830 451608 505787 136549 480572
17478 480572 278555 403965 294903 66883 41283 384312 526454 74514 748353 227042
17467 160953 398268 270013 12897 484750 121816 219879 123257 427127 587353 439599
17457 439599 275382 181399 283039 16464 371924 278214 190425 56823 353852 9100 107117
$$ packed form
17532B20155j2362I6482J06154J29789j09720K3325J07174j23553O5555P157E1019
17520A58325K6320K88707A47391J97145I0348l9257L77387L1194j01073K22726
17510E81325L59806j3675J31136k01338l77645R9739j33228A13347N70702A74547
17499D11924J58194I5364M36750n50n8350N83049n7244J55638E08238n9759q9727
17488C58752J29562j45290G8985K89254M9754R4837o1222N4179A36549L44023
17478D80572k02017J25410j09062F6883k5600L43029J42142G4514O73839B27042
17467A60953K37315j28255A2897M71853A21816R8063r6622L03870J60226j47754
17457D39599j64217r3983J01640A6464L55460r3710q7789E6823K97029I100R8017
$$ plain form
17446 107117 483818 279266 240132 304019 204721 101608 19451 407685 46183 114535 682588
17435 682588 396570 351468 247383 192171 487995 312408 360662 -19856 227242 386434
17425 386434 650975 546522 297468 604766 390944 455243 -38968 462147 533621 377048
17415 377048 337705 267121 26766 48336 -22295 312453 323832 221445 359956 218613 696948
17404 696948 315025 241366 346459 321194 397487 417323 227801 296909 483339 236496
17393 374779 265666 374213 445679 196971 405383 213691 213329 129868 159030 423929 241951
17382 241951 342427 438697 -41053 231814 211255 18681 260593 358948 39375 239766 102200
17370 158371 162701 406006 259524 290007 296585 -131801 78378 337155 365204 35786 240013
$$ packed form
17446A07117L76701k04552l9134O3887r9298A01608A9451L88234D6183O8352N68053
17435F82588k86018m5102j04085n5212K95824j75587M8254a9856B27242J59192
17425C86434K64541j04453k49054L07298k13822O4299c8968D62147P1474j56573
17415C77048l9343p0584B6766K1570b2295C12453J1379j02387J38511j41343M78335
17404F96948C15025p3659J05093k5265P6293J9836j89522O9108J86430B36496
17393C74779j09113J08547P1466A96971K08412j91692l62q3461K9162K64899j81978
17382B41951J00476R6270d1053B31814k0559A8681K41912R8355C9375K00391A02200
17370A58371M330K43305j46482L0483O578a31801G8378K58777K8049C5786K04227
$$ plain form
17359 240013 348775 676373 -95436 296408 85792 210644 180763 328911 324944 371526 243635
17348 243635 381588 18160 263063 212432 432220 301723 223891 91716 125897 308449
17338 308449 179344 96915 250188 -51369 195716 24787 398176 507691 112207 184157
17328 184157 295350 567579 496903 574470 246614 513842 509638 145531 204659 362085
17318 362085 -117765 584161 282165 373477 216248 64903 440283 198255 191637 257711
17308 257711 35915 143897 447063 176197 88215 316842 228535 307533 197839 325895
17298 325895 638894 116125 107788 261278 451125 654806 272649 495535 -58185 78808
17287 128998 596015 211530 253675 161993 141605 167621 466987 395466 520150 -155425
$$ packed form
17359B40013J08762L27598i5436B96408H5792J24852k9881J48148l967M6582j27891
17348B43635J37953A8160K44903n0631K19788j30497p7832I1716L4181J82552
17338C08449j29105q2429J53273e1369A95716B4787L73389J09515A12207P1950
17328A84157J11193K72229p0676P7567B46614K67228m204A45531N9128J57426
17318C62085a17765E84161B82165R1312j57229F4903L75380A98255o618O6074
17308B57711C5915J07982L03166A76197q7982K28627q8307P8998j09694J28056
17298C25895L12999A16125q337J53490J89847K03681B72649K22886e8185G8808
17287A28998M67017B11530M2145r1682k0388K6016K99366p1521J24684a55425
$$ plain form
17276 191230 395219 232988 184025 246223 314890 494220 204432 498722 176551 308377
17266 308377 121295 551706 105822 154923 -36255 350146 399117 9192 272449 372729
17256 372729 6401 345763 125994 253836 223903 456120 331889 200345 390803 205545
17246 205545 143855 636925 326073 270444 613098 165410 337234 310972 358477 369442
17236 369442 240289 312184 460309 32601 354616 84920 342046 285774 217758 122174 336378
17225 336378 452006 475795 391967 527372 465662 554589 753181 105903 243442 266213
17215 266213 499177 226133 429873 435592 317493 391508 616974 423110 374560 638513
17205 638513 328959 469986 314275 554907 309491 472899 343657 414692 264572 526246
$$ packed form
17276A91230K03989j62231m8963O2198O8667J79330B04432K94290A76551J31826
17266C08377A21295M30411A05822M9101c6255C50146M8971I192K63257J00280
17256C72729F401L39362A25994J27842k9933K32217j24231j31544J90458j85258
17246B05545o1690M93070l10852n5629L42654A65410J71824k6262M7505J0965
17236C69442j29153P1895J48125C2601L22015H4920K57126n6272o8016r5584K14204
17225C36378J15628K3789q3828J35405o1710Q8927J98592A05903J37539K2771
17215B66213K32964B26133K03740N719j18099P4015K25466j93864m8550K63953
17205F38513l09554J41027j55711K40632k45416J63408j29242P1035j50120K61674
$$ plain form
17195 526246 358460 572588 -77794 102855 659423 392518 88842 148365 500825 327676
17185 327676 378266 392192 426816 429984 335768 500203 642735 416795 531723 -8804 211501
17173 372611 523001 447129 345489 537249 267774 728537 784978 529014 525905 402622
17163 402622 277004 518688 256447 387919 475973 434281 278969 544379 410642 400894
17153 400894 717872 348706 566293 277340 430107 170908 423229 496286 433091 734128
17143 734128 664847 434584 535707 336000 719772 613415 446783 393363 247794 498983
17133 498983 754845 501916 419503 534319 687187 334652 876198 521530 440194 524019
17123 524019 539627 618505 403529 299704 573026 788132 792895 637969 775918 453570
$$ packed form
17195E26246j67786K14128g7794A02855N56568k66905H8842N9523L52460j73149
17185C27676N0590J3926L4624L168r4216J64435J42532k25940J14928h804B11501
17173C72611J50390p5872j01640J91760B67774M60763N6441k55964l109j23283
17163D02622j25618K41684B56447J31472Q8054m1692j55312K65410j33737r748
17153D00894L16978C48706K17587B77340J52767A70908K52321P3057o3195L01037
17143G34128o9281k30263J01123j99707L83772j06357j66632n3420j45569K51189
17133D98983K55862k52929q2413J14816J52868C34652N41546l54668q1336Q3825
17123E24019J5608P8878k14976j03825K73322K15106M763j54926J37949l22348
$$ plain form
17113 453570 483430 503232 787726 770095 294389 650560 799180 592262 804671 570250
17103 570250 853996 785232 760293 471889 335548 483517 882258 715611 322621 1027181
17093 1027181 530849 722029 812818 873231 720545 576557 530583 228696 712847 335463
17082 958488 871071 537098 672077 515949 962342 760961 845986 730416 424229 599212
17072 599212 690799 617493 639307 705115 663253 543011 589138 473812 546059 658217 445490
17061 445490 673871 529804 759399 912248 801708 972571 563630 827024 646847 800528
17051 800528 889878 367914 1062559 819900 1058139 577023 846630 846883 715387 654886
17041 654886 653000 1059365 822102 872211 880394 1014271 818343 1127494 486258 923616
$$ packed form
17113D53570K9860J9802K84494j7631B94389L56171J48620k06918K12409k34421
17103E70250K83746o8764k4939k88404j36341J47969L98741j66647C22621P04560
17093A027181m96332J91180R0789O0413j52686j43988m5974B28696M84151C35463
17082I58488q7417l33973J34979j56128M46393k01381Q5025j15570l06187J74983
17072E99212R1587p3306K1814O5808m1862j20242M6127j15326P2247J12158k12727
17061D45490K28381j44067K29595J52849j10540J70863m08941K63394j80177J53681
17051H00528Q9350C67914O94645k42659K38239m81116K69607K53j31496o0501
17041F54886j886M06365k37263N0109Q183J33877j95928L09151D86258M37358
$$ plain form
17031 923616 512270 722359 915298 709749 843412 885099 1050841 1098802 1041592 1083446
17021 1083446 975025 789569 1135146 654816 730211 1060362 1023771 1101193 938297 932700
17011 932700 999640 517440 804158 1005845 1037391 1135917 984695 1082520 1301492 1212337
17001 1212337 1391760 1144670 1106255 1141688 1347171 940970 991721 1202839 1263657 1298328
16991 1298328 1114221 1108409 1155594 998686 1054892 1001574 1033277 1396392 960824 1247778
16981 1247778 967806 1169989 1402133 1469253 1166048 1282759 973587 1608662 1430326 1282023
16971 1282023 1368101 908335 1102583 1360376 1450540 1145888 1265498 1362753 1233441 1335722
16961 1335722 1425133 1453338 1523152 1215852 1600064 1433037 1559317 1678822 1430845 1634982
$$ packed form
17031I23616m11346K10089J92939k05549J33663M1687J65742M7961n7210M1854
17021A083446j08421j85456L45577m80330P5395L30151l6591P7422j62896n597
17011I32700O6940m82200K86718K01687L1546R8526j51222R7825K18972q9155
17001A212337J79423k47090l8415L5433K05483m06201N0751K11118O0818L4671
16991A298328j84107n812M7185j56908N6206n3318L1703L63115m35568K86954
16981A247778k79972K02183K32144O7120l03205J16711l09172O35075j78336j48303
16971A282023Q6078m59766J94248K57793R0164l04652J19610R7255j29312J02281
16961A335722Q9411K8205O9814l07300L84212j67027J26280J19505k47977K04137
$$ plain form
16951 1634982 1415812 1779680 1739345 1672662 1748108 1620716 1598416 1553866 2079573 1573784
16941 1573784 1651483 1869681 1442153 1946597 1810483 1646839 1658934 1481714 1802386 1805000
16931 1805000 1727447 1810292 2013498 1859344 1794516 1896153 2203990 2026035 2215773 1972674
16921 1972674 2018143 1687224 2171710 1844317 2260734 1809538 1849681 2084589 2056257 2184384
16911 2184384 2024753 2043160 2459531 2296953 2230083 2394680 2294543 2277714 2198841 2272689
16901 2272689 2392158 2268772 2469189 2431048 2254203 2377676 2392443 2626191 2352996 2822114
16891 2822114 2775631 2881276 2978363 2751507 2712358 2662084 2815205 2897815 2971841 2844052
16881 2844052 2786925 2824666 3027544 3297253 3082405 2824471 3429756 3172658 3034374 3254415
$$ packed form
16951A634982k19170L63868m0335o6683P5446j27392k2300m4550N25707n05789
16941A573784P7699K18198m27528N04444j36114j63644J2095j77220L20672K614
16931A805000p7553Q2845K03206j54154o4828J01637L07837j77955J89738k43099
16921A972674M5469l30919M84486l27393M16417m51196M0143K34908k8332J28127
16911B184384j59631J8407M16371j62578o6870J64597j00137j6829p8873P3848
16901B272689J19469j23386K00417l8141j76845J23473J4767K33748k73195M69118
16891B822114m6483J05645R7087k26856l9149n0274J53121Q2610P4026j27789
16881B844052n7127L7741K02878K69709k14848k57934O05285k57098j38284K20041
$$ plain form
16871 3254415 3599358 3210012 3592880 3302805 3492305 3431127 3854534 3491944 3625215 3633182
16861 3633182 3975751 3593222 4037162 3681185 3868796 4315419 4314445 4105287 4202287 4036426
16851 4036426 4104025 4438384 4409968 4801632 4692619 4415176 4227189 4742319 4725311 4701671
16841 4701671 4903717 4782543 4955877 5015233 5028807 5388367 5434909 5591962 5546415 5789430
16831 5789430 5697284 5796930 5960050 6022656 6196688 6268861 6240661 6403407 6183668 6522091
16821 6522091 6724828 6558096 6766901 7053391 7208938 7176663 7283766 7876883 7456601 7369827
16811 7369827 7983053 7946775 8013734 8404813 8736882 8386952 8759287 8912365 9281411 9268486
16801 9268486 9288315 9231291 10020444 10091559 10530773 10627973 11057010 11243120 11429155 11343525
$$ packed form
16871C254415L44943l89346L82868k90075J89500o1178M23407l62590J33271P967
16861C633182L42569l82529M43940l55977J87611M46623r74k09158R7000j65861
16851D036426O7599L34359k8416L91664j09013k77443j87987N15130j7008k3640
16841D701671K02046j21174J73334N9356J3574L59560M6542J57053m5547K43015
16831E789430r2146R9646J63120O2606J74032P2173k8200J62746k19739L38423
16821F522091K02737j66732K08805K86490J55547l2275J07103N93117m20282q6774
16811G369827O13226l6278O6959L91079L32069l49930L72335J53078L69046j2925
16801I268486J9829n7024P89153P1115M39214R7200M29037J86110J86035q5630
$$ plain form
16791 11343525 11558602 12102034 12075954 12556824 12879106 12794911 13415690 13711578 14186558 14388677
16781 14388677 14786370 15110698 15454479 15610878 15789198 16607824 17055219 17500265 17809724
16772 17809724 17999931 18832203 18952597 19918325 20815739 20847730 21626814 21997115 22959108
16763 22959108 23532002 24007563 24869204 26009807 26114911 27415055 28266226 29002472 30009218
16754 30009218 30856310 31990507 32847644 34061502 35431962 36343802 37833872 39060963
16746 39060963 40707800 42037705 43244778 44695346 46762250 48400984 49748307 51978237
16738 51978237 53732845 55495645 57782846 60266094 62504689 64535082 66922546 69826145
16730 69826145 72557770 74851971 77690807 80711016 83456497 86496170 89250381 92320081
$$ packed form
16791A1343525K15077N43432k6080M80870L22282q4195O20779K95888M74980K02119
16781A4388677L97693L24328L43781J56399J78320Q18626M47395M45046L09459
16772A7809724J90207Q32272J20394R65728Q97414L1991P79084L70301R61993
16763B2959108N72894M75561Q61641J140603J05104J300144Q51171P36246J006746
16754C0009218Q47092J134197Q57137J213858J370460R11840J490070J227091
16746C9060963J646837J329905J207073J450568K066904J638734J347323K229930
16738E1978237J754608J762800K287201K483248K238595K030393K387464K903599
16730F9826145K731625K294201K838836L020209K745481L039673K754211L069700
$$ plain form
16722 92320081 95241033 98366469 101491425 104440045 107276927 110125103 113128991 115390522
16714 115390522 117823657 119964246 121941911 123785947 124803873 126322047 127015998 127717610
16706 127717610 127737035 127380170 126753444 126115366 124669853 123507154 121670942 119862916 117560101
16697 117560101 115198587 112661880 109712754 106730051 103784486 100837868 97938473 94872742
16689 94872742 92002513 88640244 86027364 82949281 79969151 76867880 74493266 71231276
16681 71231276 68847878 66059302 63918660 61564868 59247025 57173208 54738796 52676880
16673 52676880 50771171 49246064 47243035 45564820 43883157 42481203 41002818 39815470
16665 39815470 38278320 37201784 35748379 34330119 33328492 32042972 31220997 30219181
$$ packed form
16722I2320081K920952L125436L124956K948620K836882K848176L003888K261531
16714A15390522K433135K140589J977665J844036J017926J518174O93951P01612
16706A27717610J9425l56865o26726o38078j445513j162699j836212j808026k302815
16697A17560101k361514k536707k949126k982703k945565k946618k899395l065731
16689I4872742k870229l362269k612880l078083k980130l101271k374614l261990
16681G1231276k383398k788576k140642k353792k317843k073817k434412k061916
16673E2676880j905709j525107k003029j678215j681663j401954j478385j187348
16665C9815470j537150j076536j453405j418260j001627j285520q21975j001816
$$ plain form
16657 30219181 29461588 28362911 27757669 26777627 25883273 25146158 24348620 23652057 22868845
16648 22868845 22560025 21504758 21021416 20443481 20096580 19437737 18813510 18611809 17850923
16639 17850923 17661943 17081136 16693545 16291139 15795265 15447330 15016906 14866617 14271246
16630 14271246 14036103 13343249 12945745 12992241 12668755 11823692 12019367 11577860 11553498 11368640
16620 11368640 10939146 10552079 10542262 10395696 10290936 10128104 9867871 9899546 9292889 9413206
16610 9413206 9102730 8881311 8628545 8593524 8390546 7997298 8115391 8016417 7493311 7382544
16600 7382544 7881919 7358466 7351350 7142444 6522769 6768399 6437623 6684805 6510063 6315821
16590 6315821 6607676 6116208 6176660 6159408 5403504 5795555 5486197 5385353 5351906 5777588
$$ packed form
16657C0219181p57593j098677o05242r80042q94354p37115p97538o96563p83212
16648B2868845l08820j055267m83342n77935l46901o58843o24227k01701p60886
16639A7850923j88980n80807l87591m02406m95874l47935m30424j50289n95371
16630A4271246k35143o92854l97504M6496l23486q45063J95675m41507k4362j84858
16620A1368640m29494l87067r817j46566j04760j62832k60233L1675o06657J20317
16610I413206l10476k21419k52766l5021k02978l93248J18093r8974n23106j10767
16600G382544M99375n23453p116k08906o19675K45630l30776K47182j74742j94242
16590F315821K91855m91468O0452j7252p55904L92051l09358j00844l3447M25682
$$ plain form
16580 5777588 5304518 5234057 5203799 5150341 5092793 4835858 5066368 4756758 5197670 4704684
16570 4704684 4696070 4715742 4594437 4520962 4286742 4551558 4221810 4123143 4211705 4378265
16560 4378265 4367848 4095771 4114630 3754086 3793815 4013886 3690632 3596706 3801465 3790706
16550 3790706 3192736 3588898 3273439 3572209 3205444 3245140 3351783 3288749 3361667 3162594
16540 3162594 3176999 3116483 3260933 3037278 3059702 2993135 2797215 3110629 3286873 2879426
16530 2879426 3170674 2703770 2428341 2837973 2758446 2988672 2473160 2536981 2425977 2577934
16520 2577934 2538643 2363977 2633555 2239618 2647922 2292937 2390631 2390171 2087827 1991963
16510 1991963 2304543 2182767 2376256 2232020 2259659 2403050 1936036 2213070 1835062 1919957
$$ packed form
16580E777588m73070p0461l0258n3458n7548k56935K30510l09610M40912m92986
16570D704684q614J9672j21305p3475k34220K64816l29748r8667Q8562J66560
16560D378265j0417k72077J8859l60544L9729K20071l23254r3926K04759j0759
16550C790706n97970L96162l15459K98770l66765L9696J06643o3034P2918j99073
16540C162594J4405o0516J44450k23655K2424o6567j95920L13414J76244m07447
16530B879426K91248m66904k75429M09632p9527K30226n15512O3821j11004J51957
16520B577934l9291j74666K69578l93937M08304l54985R7694m60l02344r5864
16510A991963L12580j21776J93489j44236K7639J43391m67014K77034l78008Q4895
$$ plain form
16500 1919957 2020660 1993587 1942537 1767208 2170870 1861649 1988759 1823982 2040822 1600654
16490 1600654 1945435 1963382 1688898 1584028 1729362 2024731 1737893 1559618 1882340 1933773
16480 1933773 1729067 1433825 1861917 1583907 2086227 1484228 1336813 1617520 1592549 1901571
16470 1901571 1544987 1645820 1762678 1510348 1423556 1678164 1458777 1586842 1406322 1264941
16460 1264941 1773002 1294126 1412932 1394552 1172664 1386003 1606938 1350873 1340565 1346092
16450 1346092 1193120 1131721 1368338 1392062 1484137 1255190 1055824 1214096 1578124 1531707
16440 1531707 902482 934659 1451311 1270812 1143083 1106882 1626413 1212024 1440206 1186737
16430 1186737 1187802 1085956 934317 1203980 1038228 1059635 1320017 1384640 1208422 1419515
$$ packed form
16500A919957J00703k7073n1050j75329M03662l09221J27110j64777K16840m40168
16490A600654L44781J7947k74484j04870J45334K95369k86838j78275L22722N1433
16480A933773k04706k95242M28092k78010N02320o01999j47415K80707k4971L09022
16470A901571l56584J00833J16858k52330q6792K54608k19387J28065j80520j41381
16460A264941N08061m78876J18806j8380k21888K13339K20935k56065j0308N527
16450A346092j52972o1399K36617K3724R2075k28947j99366J58272L64028m6417
16440A531707o29225L2177N16652j80499j27729l6201N19531m14389K28182k53469
16430A186737J065j01846j51639K69663j65752K1407K60382O4623j76218K11093
$$ plain form
16420 1419515 1047102 918621 728143 918049 914565 863102 668450 1192701 904563 827656
16410 827656 882945 732999 1272071 866027 957662 1204266 661321 1052326 882418 920564
16400 920564 1088449 832612 874127 876519 1087881 877713 834851 872347 714195 831705
16390 831705 1080193 811339 1088357 987843 842627 920698 1038805 939751 690721 888617
16380 888617 1356585 805180 971864 918846 702106 1083894 952096 1001767 876448 644389
16370 644389 757319 690086 1020575 587402 762306 780195 972397 685610 627647 935114
16360 935114 951012 911739 576760 605692 521755 709190 667130 524338 748095 777413 619026
16349 619026 733952 576687 649362 349025 656987 647061 381353 659407 521862 712602
$$ packed form
16420A419515l72413j28481j90478J89906l484n1463j94652N24251k88138p6907
16410H27656N5289j49946N39072m06044R1635K46604n42945L91005j69908L8146
16400I20564J67885k55837M1515K392K11362k10168m2862L7496j58152J17510
16390H31705K48488k68854K77018j00514j45216P8071J18107r9054k49030J97896
16380H88617M67968n51405J66684n3018k16740L81788j31798M9671j25319k32059
16370F44389J12930o7233L30489m33173J74904J7889J92202k86787n7963L07467
16360I35114J5898l9273l34979K8932q3937J87435m2060j42792K23757K9318j58387
16349F19026J14926j57265P2675l00337L07962r926k65708K78054j37545J90740
$$ plain form
16339 712602 590559 460350 694013 436180 683095 712126 723360 430278 472393 771295
16329 771295 376411 670905 595956 598305 760174 789786 666664 601577 602046 535678 624654
16318 624654 465776 516693 899788 367582 656839 339777 672489 633980 549409 484893
16308 484893 440015 466533 684109 540254 474937 553313 532720 424469 424120 247507 426302
16297 426302 478070 698713 580777 263481 430183 532288 471270 630252 596352 327270
16287 327270 587335 689904 218052 720671 351004 256913 369217 436458 459028 906773
16277 906773 440998 526668 172368 430396 401278 385514 609801 325429 297720 502498
16267 502498 474536 373667 277748 438418 266079 415079 283008 517194 417462 247498
$$ packed form
16339G12602j22043j30209K33663k57833K46915K9031J1234k93082M2115K98902
16329G71295C76411K94494p4949K349J61869K9612j23122o5087M69o6368Q8976
16318F24654j58878N0917L83095C67582K89257l17062L32712l8509q4571o4516
16308D84893m4878K6518K17576j43855o5317P8376k0593j08251l49j76613J78795
16297D26302N1768K20643j17936B63481J66702J02105o1018J58982l3900k69082
16287C27270K60065J02569B18052N02619C51004r4091J12304O7241K2570M47745
16277I06773D40998Q5670A72368K58028k9118j5764K24287k84372k7709K04778
16267E02498k7962j00869r5919J60670j72339J49000j32071K34186r9732j69964
$$ plain form
16257 247498 435362 151574 299107 570929 646004 454311 395671 551713 758329 185471
16246 245756 526649 143045 448328 436391 238686 143709 542431 310147 656680 363672
16236 363672 352532 260874 541247 705514 705149 -60114 177306 232216 191494 433746 393234
16225 393234 199919 521253 555072 -136662 555485 293796 384428 186203 349628 117148
16214 257599 614565 44407 204564 148596 96184 266298 560665 367352 77589 347509
16204 347509 467079 161212 129645 267545 510819 463195 392996 308197 453110 195967
16193 383000 123547 159989 239812 145181 351722 145633 13094 35613 571440 348342
16183 348342 -71441 427032 425226 182278 327745 426825 446742 96085 400616 -564 -144815
$$ packed form
16257B47498J87864A51574J47533K71822P5075j91693n8640J56042K06616A85471
16246B45756K80893A43045L05283j1937j97705r4977L98722k32284L46533k93008
16236C63672j1140r1658K80373J64267l65f0114A77306N4910m0722K42252m0512
16225C93234j93315L21334L3819a36662E55485k61689R0632A86203J63425A17148
16214B57599L56966D4407J60157n5968n2412J70114K94367j93313G7589K69920
16204C47509J19570A61212l1567J37900K43274m7624p0199q4799J44913A95967
16193C83000A23547L6442P9823r4631K06541A45633A3094K2519N35827k23098
16183C48342g1441D27032j806A82278J45467R9080J9917I6085L04531e64j44251
$$ plain form
16172 -144815 -29870 359367 269060 -109528 206630 139885 107548 81328 492172 134767
16161 92236 74112 379083 142000 237264 162906 106466 455242 275148 -45448 331770 -34614
16149 130298 -112980 294005 391466 263608 142334 91448 -119904 229038 68704 18303
16138 -238052 -28564 119207 -203592 36078 -129074 242227 -173719 488951 -86923 126450
16127 113007 -45851 47419 243590 215672 87010 508199 78199 173624 138772 212717 185718
16116 185718 134334 82830 230150 153633 290222 222692 334622 -444902 259614 585007
16106 585007 200760 30185 74746 166046 460127 -63431 -108438 246607 177590 316097 175435
16095 175435 20167 284435 252422 381436 339703 10387 207792 161090 16066 -21395 275851
$$ packed form
16172a44815b9870C59367r0307a09528B06630o6745l2337k6220M10844A34767
16161I2236j8124L04971A42000R5264p4358n6440L48776j80094d5448C31770c4614
16149A30298a12980B94005R7461j27858j21274n0886a19904B29038F8704A8303
16138b38052b8564A19207b03592C6078a29074B42227a73719D88951h6923A26450
16127A13007d5851D7419J96171k7918H7010M21189G8199R5425l4852P3945k6999
16116A85718n1384n1504J47320p6517J36589o7530J11930d44902B59614L25393
16106E85007B00760C0185M4561R1300K94081f3431m5007B46607o9017J38507j40662
16095A75435B0167K64268l2013J29014m1733A0387J97405m6702A6066b1395B75851
$$ plain form
16083 75763 144052 38031 200376 107529 -52426 170796 232981 -162484 -191194 57802 73345
16072 73345 135221 267775 229726 40109 136023 151269 23890 227313 -20742 155881 -440927
16060 -103945 158504 191372 120940 44394 123226 -39379 -161858 59396 -192633 32111 358446
16049 358446 -63639 91943 228851 116281 247696 65867 100549 -77897 250704 186634 356481
16038 356481 257529 57673 325398 270895 -118384 88091 -174571 280183 320867 -89846 -236539
16027 -236539 15583 41596 -153988 154532 -93887 173154 156231 -103969 -100509 27641 333151
16016 333151 -267077 384395 190386 228560 63580 169986 -114378 61773 210192 -78236
16005 97152 16409 166867 146814 220932 -9582 20121 133842 -245618 50561 53587 -124617
$$ packed form
16083G5763O8289C8031J62345r2847e2426A70796O2185a62484k8710E7802J5543
16072G3345O1876J32554l8049D0109R5914J5246B3890K03423b0742A55881d40927
16060a03945A58504L2868p0432D4394P8832c9379j22479E9396a92633C2111L26335
16049C58446f3639I1943J36908j12570J31415F5867L4682g7897B50704o4070J69847
16038C56481r8952E7673K67725n4503a18384H8091a74571B80183M0684h9846j46693
16027b36539A5583K6013a53988A54532i3887A73154j6923a03969L460B7641L05510
16016C33151b67077C84395A90386L8174F3580J06406a14378F1773J48419g8236
16005I7152A6409J50458k0053P4118i582B0121J13721b45618E0561L026a24617
$$ plain form
15993 -101452 120618 62799 225566 125013 60311 149132 -55666 206569 39842 233840
15983 233840 -3611 43848 307603 -86043 328152 109980 124082 -140036 159411 191702 243907
15972 243907 317609 788887 1210761 790416 850224 614485 467667 751157 431527 163123
15961 73583 210379 348017 -77072 186207 151726 -47744 342471 -79545 280595 120783
15950 -143476 -37039 -354151 214 30750 -40692 21031 -577330 -142714 -250454 202902 -283279
15938 -1284 -37695 -381605 -233198 -66013 -151572 -29925 -225916 129547 54307 -150890 -26888
15926 -106579 -40188 -21829 322949 -49263 67235 51090 -7163 295241 174314 -54083 271312
15914 -263650 -249863 182225 56377 129935 -315678 226241 -249240 -64587 96233 -19997 -12135
$$ packed form
15993a01452A20618n7819J62767j00553F0311Q8821e5666B06569C9842J93998
15983B33840c611D3848K63755h6043C28152A09980J4102a40036A59411L2291N2205
15972B43907P3702M71278M21874m20345N9808k35739j46818K83490l19630A63123
15961G3583J36796J37638g7072A86207l4481d7744C42471g9545B80595A20783
15950a43476c7039l17112B14L0536d0692B1031e77330a42714j07740B02902b83279
15938a284l6411l43910J48407f6013q5559b9925j95991A29547E4307a50890b6888
15926a06579d0188J8359C22949d9263F7235j6145g163B95241j20927e4083B71312
15914b63650J3787A82225E6377P3558c15678B26241b49240f4587I6233a9997P862
$$ plain form
15903 -12135 -53653 -5720 -78462 145454 168862 -141131 162549 272520 84189 -285781 67697
15891 -426903 -81572 12124 -341301 122789 96177 292324 -248920 -92262 33790 79652 -124474
15879 77596 -191857 -53118 -158558 142925 217501 -70137 143413 -421977 113831 -320972
15868 34582 285157 46577 -16400 -102788 185728 -142422 153134 151602 5916 -107231 274580
15856 -104411 126523 92965 -83995 21840 -134424 17619 57886 233802 -169434 72085 -217430
15844 -121673 34859 95739 60207 -181120 36076 -128971 398100 9603 62263 -21978 -92325
15833 -92325 144050 -250138 -83721 -278605 51700 -242688 160947 -130451 327795 281574
15823 281574 -261632 323654 -131757 226423 -230368 -177639 -126591 121042 -73387 -456620
$$ packed form
15903a2135m1518e720p2742A45454K3408a41131A62549J09971H4189b85781F7697
15891d26903h1572A2124c41301A22789k6612J96147b48920i2262C3790M5862a24474
15879G7596a91857e3118j05440A42925P4576g0137A43413d21977A13831c20972
15868C4582K50575D6577a6400q6388A85728a42422A53134j532E916a07231B74580
15856a04411A26523l3558h3995B1840a34424A7619M0267J75916a69434G2085b17430
15844a21673C4859O0880l5532a81120C6076a28971C98100I603N2660b1978p0347
15833i2325A44050b50138h3721j94884E1700b42688A60947a30451C27795m6221
15823B81574b61632C23654a31757B26423b30368N2729N1048A21042g3387l83233
$$ plain form
15813 -456620 -89134 123377 32995 183841 97294 111668 68508 -69811 166425 51068 -350602
15801 111332 -18176 -279646 75610 -287915 86875 -69940 -81090 -41503 -388262 -252106 40032
15789 134179 -324765 -39414 -46953 280791 359839 28914 -278334 -290715 30693 -62984 -121045
15778 -121045 23615 38851 278326 205614 27311 -95869 10493 6869 -204278 -134904 -87878
15767 -87878 -88196 -148078 -357541 -220091 107578 194374 70330 95101 -39065 -146468 194031
15755 -113989 -220521 -97587 -3013 -266619 -58633 -87307 -238283 -102771 156906 154449 373331
15744 373331 31500 248394 27353 8424 -72276 138638 -5257 500931 133617 104847 -55965
15732 31205 409253 -310085 96715 143934 22131 -156167 64179 88245 -74981 274991 220451
$$ packed form
15813d56620h9134A23377C2995J50846q6547J4374m3160f9811A66425E1068c50602
15801A11332a8176k61470G5610b87915H6875f9940j1150L9587l46759J36156D0032
15789A34179c24765c9414p539B80791P9048B8914b78334j2381C0693f2984n8061
15778a21045B3615J5236K39475p2712B7311i5869A0493l624b04278O9374M7026
15767h7878l18n9882k09463J37450A07578Q6796G0330K4771c9065j07403A94031
15755a13989j06532i7587c013k63606e8633k8674j50976a02771A56906k457K18882
15744C73331C1500K16894B7353H424g2276A38638e257E00931A33617k8770e5965
15732C1205L78048c10085I6715M7219B2131a56167F4179K4066g4981B74991n4540
$$ plain form
15721 220451 -228766 6235 -51177 -52112 114994 -493345 185120 258389 -234258 121122 183632
15710 183632 -239218 -46822 -99815 -43723 -129954 -121269 -19102 -75001 -105508 -4110 -111769
15699 -111769 161544 148088 -325067 -29921 -105414 -275295 -148637 115725 -81617 221066
15688 44762 -293460 61824 26007 -355429 28296 38081 218004 324214 -23733 -83836 -140090
15677 -140090 60533 282067 127282 -138105 235052 43145 111554 -274870 -86118 86876
15666 262537 -170904 -154114 -91934 20681 -44774 -11517 15889 139329 105323 -85101 130051
15654 -126306 49066 -531054 -273300 -48503 154480 -136959 119657 -10856 138596 113992
15644 113992 -41653 -232653 297893 -93698 -118219 -185968 231983 -365168 -256491 -134802
$$ packed form
15721B20451b28766F235e1177r35A14994d93345A85120P3269b34258A21122O2510
15710A83632b39218d6822n2993d3723q6231Q685a9102n5899l0507d110j07659
15699a11769A61544j3456c25067b9921p5493j69881J26658A15725h1617B21066
15688D4762b93460F1824B6007c55429B8296R785J79923J06210b3733o0103n6254
15677a40090F0533K21534A27282a38105B35052D3145O8409b74870h6118H6876
15666B62537a70904J6790O2180B0681d4774a1517A5889J23440l4006h5101A30051
15654a26306D9066e31054K57754d8503A54480a36959A19657a0856A38596k4604
15644A13992d1653j91000B97893i3698k4521o7749B31983c65168J08677J21689
$$ plain form
15634 -134802 -322006 -274281 346450 -159812 -147924 -4947 -179447 -116353 -505288 -291212
15624 -291212 -262698 52559 122237 -40414 -24916 57152 14689 -76483 -64678 28153 130057
15613 130057 -79051 124287 -7942 110834 120794 -283408 548523 -3911 24281 -279960 64871
15601 -119933 122347 -33162 -228245 64244 94963 104388 33025 24938 -35636 -260535 -28246
15589 -265619 -94224 82327 271109 -99155 -181506 29848 -66567 -307755 -24714 52394 -161429
15577 34706 -162837 -363311 -1307 243393 216201 -28551 66127 103615 -42864 -192524 228547
15565 -117403 -57703 -135848 -190424 -272811 -161221 83035 -140038 200261 -150527 -197720 -15298
15553 -262997 124746 -311667 -177272 63914 616 220341 -14767 -15017 -36440 -260591 93083
$$ packed form
15634a34802j87204M7725C46450a59812J1888d947j74500O3094l88935K14076
15624b91212K8514E2559O9678d0414J5498E7152A4689g6483J1805B8153J01904
15613A30057g9051A24287g942A10834R960b83408E48523c911B4281b79960F4871
15601a19933A22347c3162j95083F4244L0719R425C3025q087c5636k24899b8246
15589b65619i4224H2327J88782i9155q2351B9848f6567k41188b4714E2394a61429
15577C4706a62837k00474a307B43393k7192b8551F6127L7488d2864j49660B28547
15565a17403e7703p8145n4576q2387J11590H3035a40038B00261a50527m7193a5298
15553b62997A24746c11667J34395F3914F16K19725a4767k50k1423k24151I3083
$$ plain form
15541 -351528 81691 310610 -138634 -84465 -268422 -88478 159540 -250853 148142 106314
15531 106314 85578 196157 23693 -16594 -13965 277227 94073 119870 -394060 -333633 -130574
15519 -139602 -72845 90892 100882 -327745 -91921 147248 265863 -229053 -185457 -107264 309126
15507 -27063 197897 -54238 264727 314107 52492 117638 42103 -73700 178749 -122284 69132
15495 -33426 285774 -26095 -98915 -197590 -121579 64720 189724 -210188 114748 142453 259472
15484 259472 161247 -61201 66981 -1141 -152109 -7460 -22179 36573 -75126 -30208 297445
15472 122257 -40789 510961 152256 -58109 -79688 23083 209492 143761 94489 262777 74981
15460 17735 470305 406273 840479 113928 512817 340582 504072 194651 298890 205666
$$ packed form
15541c51528H1691K28919a38634N4169j83957h8478A59540b50853A48142m1828
15531A06314k0736J10579B3693a6594K629B77227I4073K5797c94060O0427a30574
15519a39602O6757I0892R990c27745i1921A47248J18615b29053M3596P8193C09126
15507b7063A97897e4238B64727M9380E2492O5146D2103g3700A78749a22284F9132
15495c3426B85774b6095p2820r8675P6011F4720J25004b10188A14748K7705J17019
15484B59472r8225f1201F6981a141j50968g460j4719C6573g5126c0208B97445
15472A22257d0789E10961A52256e8109k1579B3083J86409o5731m9272J68288G4981
15460A7735M52570o4032M34206A13928L98889j72235J63490A94651J04239r3224
$$ plain form
15450 205666 163478 35740 132930 44086 26895 98629 4307 -178300 89397 -282691 -73602
15438 136956 498559 -129943 -87777 884 127448 199562 419272 527207 320906 193454
15428 193454 367167 683945 861795 708731 900040 760726 613296 333739 326509 143414
15417 218671 171112 -158310 214785 31141 241237 209721 244654 234573 -183030 129469
15406 193280 -85192 -30870 62443 280291 10308 190061 175151 58722 -71183 22244 -108158
15394 -2776 226848 94670 -179005 -94317 -354629 150951 -124422 -41035 -196001 135208
15383 168879 199500 236302 -106400 -312916 -12925 83038 232401 212453 -255806 -223183 -146706
15372 -146706 303534 94656 325680 -82245 36633 -119131 114270 -359005 380782 -119431
$$ packed form
15450B05666m2188C5740R7190D4086j7191P1734D307a78300H9397b82691g3602
15438A36956L61603a29943M2166H84J26564P2114K19710J07935k06301j27452
15428A93454J73713L16778J77850j53064J91309j39314j47430k79557p230A43414
15417B18671m7559a58310B14785C1141K10096l1516L4933j0081a83030A29469
15406A93280h5192c0870F2443K17848A0308J79753j4910E8722g1183B2244a08158
15394b776B26848I4670a79005Q4688k60312A50951a24422d1035j54966A35208
15383A68879L0621L6802a06400k06516a2925H3038J49363j9948b55806L2623P6477
15372a46706C03534I4656K31024h2245C6633a19131A14270c59005C80782a19431
$$ plain form
15361 62247 287898 258690 145475 170523 216341 365284 242125 130006 137256 101776 -78518
15349 2337 397046 138559 284280 137525 146910 270147 165019 -76925 123430 284592
15339 284592 412910 242657 349085 203898 128984 52946 242633 -47827 392634 130003
15328 364414 580108 387945 475600 176791 280468 525992 75888 61482 340927 78984
15317 -303390 -16916 262018 290054 241638 -101425 71094 54389 233624 113786 -18542 257551
15305 247375 150704 466274 363116 239313 -183722 -139987 94179 120278 122675 60485 220622
15294 220622 -35277 241495 420520 217049 130701 40006 -411589 27056 120740 183140 30489
15282 5844 4579 276089 -165095 40724 104157 -269111 148772 -109395 -297511 -70981 -327186
$$ packed form
15361F2247K25651k9208j13215K5048M5818J48943j23159j12119P250l5480g8518
15349B337L94709A38559J45721A37525R385J23237j05128g6925A23430J61162
15339B84592J28318j70253J06428j45187p4914E2946J89687d7827C92634A30003
15328C64414K15694j92163Q7655A76791J03677K45524G5888j4406K79445G8984
15317c03390a6916B62018K8036m8416a01425G1094j6705J79235A13786a8542B57551
15305B47375r6671L15570j03158j23803a83722M3735I4179K6099K397F0485J60137
15294B20622c5277B41495J79025k03471q6348D0006d11589B7056R3684O2400C0489
15282E844j265K71510a65095D0724O3433b69111A48772a09395j88116g0981k56205
$$ plain form
15271 -327186 323795 101528 -112314 -130127 -87686 73646 -64632 -3789 203676 -34677 -11183
15259 146056 248256 -32214 117041 -1291 315643 5648 -221111 -216002 -169797 148834 -284600
15247 17731 -2852 -118070 70512 -252379 -192586 69494 120026 -9166 -30200 136948 286923
15236 286923 399564 -115234 48697 70894 52634 162661 573882 733852 1488651 1642308
15226 1642308 1415957 1035061 943718 488615 329003 273557 153071 -3972 52303 170158
15216 170158 70873 245905 42281 138403 115905 31019 -43025 -57010 23980 -141495 -131423
15205 -131423 -62292 -120528 46627 273643 369779 -1983 -63402 -271143 -43839 115367 223551
15194 223551 156477 -97785 127200 199056 -126618 145456 72144 -101432 38247 -92435 -51633
$$ packed form
15271c27186C23795A01528a12314j7813M2441G3646f4632c789B03676c4677a1183
15259A46056J02200c2214A17041a291C15643E648b21111N109M6205A48834b84600
15247A7731b852j15218G0512b52379N9793F9494N0532i166k1034A36948J49975
15236B86923J12641a15234D8697K2197j8260J10027M11221J59970P54799J53657
15226A642308k26351l80896r1343m55103j59612n5446j20486c972E2303J17855
15216A70158G0873J75032D2281R6122k2498C1019d3025j3985B3980a41495J0072
15205a31423f2292n8236D6627K27016R6136a983o1419k07741d3839A15367J08184
15194B23551o7074i7785A27200P1856a26618A45456G2144a01432C8247i2435M0802
$$ plain form
15183 -51633 227422 16768 -218027 192084 53601 66131 237975 -207472 142778 523499
15173 523499 -43932 22112 203345 8481 -34744 -244335 303893 252074 43991 127366 -8494
15161 -79943 -79149 190351 140099 101791 278377 -195364 -55480 128526 -74199 -173882 137219
15149 311081 242062 -46319 -262881 42382 383593 -62744 164165 -27501 402426 442827 205799
15137 302665 124709 126554 -24791 123167 14865 204709 -264447 142694 99940 -91337 289973
15125 -238649 -136273 10699 192663 160587 267185 140758 184479 394950 -4626 112181
15114 -74763 -22661 90222 -37460 22644 103563 48301 545045 286477 209540 435064 621644
15103 621644 213407 -113383 289013 9934 -138547 -143942 -57471 300626 -46633 -85519 104206
$$ packed form
15183e1633B27422A6768b18027A92084E3601J2530J71844b07472A42778L80721
15173E23499d3932B2112J81233H481c4744k09591C03893n1819D3991Q3375h494
15161g9943P94A90351n0252l8308J76586a95364e5480A28526g4199r9683A37219
15149C11081o9019d6319k16562D2382L41211f2744A64165b7501D02426M0401B05799
15137C02665A24709J845b4791A23167A4865J89844b64447A42694m2754i1337B89973
15125b38649J02376A0699J81964l2076J06598j26427M3721K10471d626A12181
15114g4763b2661I0222c7460B2644Q0919D8301M96744k58568p6937K25524J86580
15103F21644B13407a13383B89013I934a38547n395e7471C00626d6633l8886A04206
$$ plain form
15091 -50028 -176666 20523 319190 322579 221761 245861 49618 181832 -238219 -87423 121852
15079 195719 316832 55713 -48694 238857 -65030 278073 231426 298769 218641 -131876 318889
15067 33284 112673 300103 -16588 115914 144272 216554 295329 133462 112519 261331 348697
15056 348697 406167 -268820 181852 45281 134654 345908 -282514 -33456 -57243 183121
15045 -49986 -35400 515872 141860 279997 107279 449150 436198 353746 -138581 182135
15034 193607 408627 340132 490441 178690 334755 353658 -38422 31029 131915 340631
15024 340631 608079 388014 425067 450655 400591 387862 513847 594529 430990 577751
15014 577751 535666 654049 593730 603634 514356 413303 225295 670013 347350 632386
$$ packed form
15091e0028j26638B0523K98667L389j00818K4100D9618J32214b38219h7423A21852
15079A95719J21113E5713d8694B38857f5030B78073m6647O7343q0128a31876C18889
15067C3284P9389J87430a6588A15914K8358P2282P8775A33462k0943J48812Q7366
15056C48697N7470b68820A81852D5281Q9373K11254b82514c3456k3787A83121
15045d9986J4586E15872A41860J38137A07279L41871j2952q2452a38581A82135
15034A93607K15020o8495J50309A78690J56065J8903c8422C1029J00886K08716
15024C40631K67448k20065L7053K5588n0064j2729J25985Q0682j63539J46761
15014E77751m2085J18383o0319R904q9278j01053j88008M44718l22663K85036
$$ plain form
15004 632386 113050 1008025 458058 306621 331630 199977 381477 634386 287443 350025
14994 350025 442569 335713 551911 245798 159885 277472 539960 260855 566143 260126
14983 549981 581797 725417 389817 411574 635507 485267 267398 510733 492386 259501
14973 259501 336752 370010 305267 463187 541191 644204 741355 941817 1062634 840078
14963 840078 623427 599228 607073 655034 429148 566688 185154 571365 562729 546081 613086
14952 613086 313420 222867 140428 353427 447529 410810 371187 186106 138221 472776 447593
14941 447593 337073 725955 361307 330960 536145 397442 551808 236243 515716 452959
14931 452959 249859 448036 328852 557829 683360 434514 359066 245817 449572 754974
$$ packed form
15004F32386A13050Q94975D58058j51437K5009j31653J81500K52909B87443O2582
14994C50025R2544j06856K16198B45798q5913J17587K62488B60855L05288B60126
14983E49981L1816J43620l35600K1757K23933j50240k17869K43335j8347k32885
14973B59501P7251L3258o4743J57920P8004J03013R7151K00462J20817k22556
14963H40078k16651k4199P845M7961k25886J37540A85154L86211q636j6648O7005
14952F13086k99666r0553q2439K12999R4102l6719l9623j85081m7885L34555k5183
14941D47593j10520L88882C61307l0347K05185j38703J54366B36243K79473o2757
14931D52959k03100J98177j19184K28977J25531k48846p5448j13249K03755L05402
$$ plain form
14921 754974 362627 582981 258515 805450 514228 981433 812223 1186539 1108264 1189934
14911 1189934 1216199 1588019 1764181 1580716 1476297 1381896 1484357 1581701 1665251 1630462
14901 1630462 1817038 2145966 1925005 1401927 1406486 1099916 1084006 869025 828275 941509
14891 941509 602937 472123 306838 275753 584359 454810 396367 414409 470430 332395
14881 332395 474387 333538 414809 685165 610418 671022 361199 167177 475598 616767
14871 616767 641745 428817 428299 773295 737566 920243 725161 760323 982997 844764 600376
14860 600376 733863 626159 562574 359099 435155 435551 856938 278803 441995 591462
14850 591462 645141 885636 864461 681804 476771 806513 442881 489717 640023 675019
$$ packed form
14921G54974C62627K20354B58515N46935k91222M67205j69210L74316p8275Q1670
14911A189934K6265L71820J76162j83465j04419r4401J02461R7344Q3550l4789
14901A630462J86576L28928k20961n23078M559l06570j5910k14981m0750J13234
14891I41509l38572j30814j65285l1085L08606j29549n8443J8042N6021j38035
14881C32395J41992j40849Q1271K70356p4747O0604l09823A67177L08421J41169
14871F16767K4978k12928n18L44996l5729J82677j95082L5162K22674j38233k44388
14860F00376J33487j07704o3585k03475P6056L96M21387B78803J63192J49467
14850E91462N3679K40495k1175j82657k05033L29742l63632M6836J50306L4996
$$ plain form
14840 675019 339530 295689 374748 570713 226886 411578 536947 329235 645519 638827
14830 638827 643167 943383 470760 529407 895858 878282 916603 1036859 974595 719161 1104057
14819 1104057 676618 996396 636960 527101 729820 503446 540831 343638 480504 753542
14809 753542 790571 518191 554485 603106 639511 809334 874572 893146 744889 644765 668369
14798 668369 777576 555916 800613 745076 558613 852649 980407 1013053 329706 1113765
14788 1113765 814684 971643 871320 1019779 771894 733420 346710 367463 559147 418132
14778 418132 762641 823864 704385 844922 354314 425944 728972 578015 746850 646630
14768 646630 628643 806041 584562 549567 581564 580026 683177 665747 945783 842677 958328
$$ packed form
14840F75019l35489m3841P9059J95965B26886J84692J25369k07712L16284o692
14830F38827M340L00216D70760N8647L66451j7576L8321J20256o2264k55434L84896
14819A104057m27439L19778l59436j09859K02719k26374L7385j97193J36866K73038
14809G53542L7029k72380L6294M8621L6405J69823O5238J8574j48257j00124K3604
14798F68369J09207k21660K44697n5537j86463K94036J27758L2646C29706P84059
14788A113765k99081J56959j00323J48459k47885l8474C46710K0753J91684j41015
14778D18132L44509O1223j19479J40537C54314P1630L03028j50957J68835j00220
14768F46630j7987J77398k21479l4995L1997j538J03151j7430K80036j03106J15651
$$ plain form
14757 958328 504326 1109409 546195 792212 542010 509629 732687 457720 853933 954797
14747 954797 774232 556396 583796 434221 761706 823556 713777 651914 786260 797889
14737 797889 280244 749541 435775 940095 771225 746078 701908 1067980 540573 839170
14727 839170 484630 658933 692805 699990 519396 671040 950277 669979 925605 771657
14717 771657 701428 1066380 1367522 1120322 1012149 1324209 1471002 1552957 1571276 1594789
14707 1594789 1479383 1331968 1122868 1348795 831272 748972 1154107 1028061 949695 910169
14697 910169 790522 985287 797019 616642 1061075 1230950 1223691 1147335 1280431 1187503
14687 1187503 1154072 1443512 1826521 1793828 1761257 1834846 1092886 1379930 961678 877170
$$ packed form
14757I58328m54002O05083E46195K46017k50202l2381K23058k74967L96213J00864
14747I54797j80565k17836K7400j49575L27485O1850j09779o1863J34346J1629
14737G97889B80244M69297l13766N04320j68870k5147m4170L66072n27407K98597
14727H39170l54540J74303L3872P185j80594J51644K79237k80298K55626j53948
14717G71657p0229L64952L01142k47200j08173L12060J46793Q1955J8319K3513
14707A594789j15406j47415k09100K25927n17523q2300M05135j26046p8366l9526
14697I10169j19647J94765j88268j80377M44433J69875p259p6356J33096r2928
14687A187503l3431K89440L83009l2693l2571P3589p41960K87044m18252q4508
$$ plain form
14677 877170 1076994 987536 824811 1050992 398132 745499 687322 1023717 1033582 822741
14667 822741 1093892 803182 1283641 878978 807296 804499 792347 1012196 901393 1180543
14657 1180543 1059036 1136604 1007534 945052 1001911 902158 964191 1106467 1022243 822608
14647 822608 1007473 954933 797052 1219228 1226772 1177254 1504545 1335822 985898 1206147
14637 1206147 1254343 1001776 1583445 1248936 1221528 1220980 1157888 1243851 1191890 946181 1089041
14626 1089041 1284293 1478973 1069897 1239636 1472220 822643 995889 1235905 1289474 1314249
14616 1314249 1343909 1387633 1205274 1097089 1263281 1464473 1754042 1076739 1199320 1419255
14606 1419255 1348947 1587024 1588291 1151266 1420365 1601747 1619179 1604848 1445372 1419174
$$ packed form
14677H77170J99824q9458j62725K26181C98132L47367n8177L36395R865k10841
14667H22741K71151k90710M80459m04663p1682k797j2152K19849j10803K79150
14657A180543j21507P7568j29070o2482N6859r9753O2033J42276q4224j99635
14647H22608J84865n2540j57881M22176P544m9518L27291j68723l49924K20249
14637A206147M8196k52567N81669l34509k7408n48o3092Q5963n1961k45709J42860
14626A089041J95252J94680m09076J69739K32584o49577J73246K40016N3569K4775
14616A314249K9660M3724j82359j08185J66192K01192K89569o77303J22581K19935
14606A419255p0308K38077J267m37025K69099J81382J7432j4331j59476k6198
$$ plain form
14596 1419174 1646233 1440008 1768821 1394420 1619403 1277183 1334596 1631924 1727698 1693372
14586 1693372 1828704 1744666 1746774 1421486 1459607 1709553 1803508 1647272 1596932 1824687
14576 1824687 1912604 1566083 1485090 1554866 1631264 1681845 1804533 2165107 1816747 1787829
14566 1787829 1738883 1997063 1870659 2432480 2120136 2172123 1680735 1775751 2295842 2377092
14556 2377092 2084064 2218193 2204063 2223466 2232357 2278656 2699196 2181435 2534646 2667800
14546 2667800 2503067 3159817 3003513 3029128 3301753 3879631 3835222 3847933 4481445 5173158
14536 5173158 5952695 6897999 9032694 13088624 19669503 29775659 32887784 19794870
14528 19794870 12054774 7832978 5709212 5355179 5022799 4804870 3622942 3339274 2639284
$$ packed form
14596A419174K27059k06225L28813l74401K24983l42220N7413K97328R5774l4326
14586A693372J35332q4038K108l25288L8121K49946R3955j56236n0340K27755
14576A824687Q7917l46521q0993O9776P6398N0581J22688L60574l48360k8918
14566A787829m8946K58180j26404N61821l12344N1987m91388R5016N20091Q1250
14556B377092k93028J34129j4130J9403Q891M6299M20540n17761L53211J33154
14546B667800j64733O56750j56304K5615K72625N77878m4409J2711O33512O91713
14536E173158P79537R45304K134695M055930O580879J0106156L112125j3092914
14528A9794870p740096m221796k123766l54033l32380k17929j181928k83668o99990
$$ plain form
14519 2639284 2721995 2330182 2312671 2650218 2421499 2499435 2405647 2207745 2341793 2475895
14509 2475895 2258172 2418255 2121521 2791821 2484613 2186130 2464959 2618452 2847851
14500 2847851 3071268 2531637 2990542 2620995 2743556 2986405 2780248 3188927 3119768 2930879
14490 2930879 2810105 3073717 3288027 3056771 2886437 3239394 3114678 3229860 3093724
14481 3093724 3278942 3061478 3298261 3470745 3517021 3429071 3543828 3552879 3468105 3295798
14471 3295798 3804003 3424328 3919602 3417105 3903418 3836545 3869147 4087061 4082789 4238944
14461 4238944 4114093 4193916 4019073 4251568 4157557 4603490 4374223 4466485 4292175 4158867
14451 4158867 4384527 4749458 4613028 4964851 4465036 4927287 4688071 4997449 4961103 4961996
$$ packed form
14519B639284Q2711l91813j7511L37547k28719P7936r3788j97902J34048J34102
14509B475895k17723J60083k96734O70300l07208k98483K78829J53493K29399
14500B847851K23417n39631M58905l69547J22561K42849k06157M08679o9159j88889
14490B930879j20774K63612K14310k31256j70334L52957j24716J15182j36136
14481C093724J85218k17464K36783J72484M6276q7950J14757R051q4774j72307
14471C295798N08205l79675M95274n02497M86313o6873L2602K17914m272J56155
14461D238944j24851P9823j74843K32495r4011M45933k29267R2262j74310j33308
14451D158867K25660L64931j36430L51823m99815M62251k39216L09378l6346Q93
$$ plain form
14441 4961996 5232047 4905242 5165178 5340186 5282715 5451051 5381021 5303441 5443074 5786479
14431 5786479 5745703 6014643 5925162 6097201 6055099 6234511 6053250 6182224 6438134 6774895
14421 6774895 6471400 6762284 6853380 6991344 6871742 6648389 7001174 6820610 6964243 7136818
14411 7136818 7517891 7664570 7599118 7896858 8093405 8094644 8326030 8668767 8397836 8415384
14401 8415384 9091148 8929898 8935791 8792569 8892867 8919603 9192518 9435672 9667263 9770046
14391 9770046 9826770 10179889 10358542 10678186 10875294 11104830 11131278 11020981 10960804 11055043
14381 11055043 11458827 11818334 11749653 11988899 12207769 12356798 12654623 13079421 13195569
14372 13195569 13469388 13808593 13959386 14422526 14481043 14904001 15349001 15625215 15537429 15969975
$$ packed form
14441D961996K70051l26805K59936J75008n7471J68336p0030p7580J39633L43405
14431E786479m0776K68940q9481J72039m2102J79412j81261J28974K55910L36761
14421F774895l03495K90884R1096J37964j19602k23353L52785j80564J43633J72575
14411G136818L81073J46679o5452K97740J96547J239K31386L42737k70931J7548
14401H415384O75764j61250N893j43222J00298K6736K72915K43154K31591J02783
14391I770046N6724L53119J78653L19644J97108K29536K6448j10297o0177R4239
14381A1055043M03784L59507o8681K39246K18870J49029K97825M24798J16148
14372A3195569K73819L39205J50793M63140N8517M22958M45000K76214q7786M32546
$$ plain form
14362 15969975 16360644 16377398 16846816 16898278 17403743 17809909 17983142 18237020 18733384 18907635
14352 18907635 19742611 19891679 20519933 20954995 21495282 21863852 22025724 22384588 23038286
14343 23038286 23383161 23941936 24696189 25143047 25754957 26337310 26982120 27722841 28403397
14334 28403397 29124490 29830830 30720015 31398242 32198827 32730311 33885162 34671114 36248448
14325 36248448 36830073 38259052 39162828 40397618 41359255 42049899 43913642 45308124 46872720
14316 46872720 48070824 49509495 51275223 52954793 54630334 56479531 58661496 60375261
14308 60375261 62683114 64936630 67455252 69667507 72429339 74918177 77763265 80715382
14300 80715382 83966174 87271453 90764249 94783549 98366407 102786971 107075859 111562661
$$ packed form
14362A5969975L90669J6754M69418N1462N05465M06166J73233K53878M96364J74251
14352A8907635Q34976J49068O28254M35062N40287L68570J61872L58864O53698
14343B3038286L44875N58775P54253M46858O11910N82353O44810P40721O80556
14334B8403397P21093P06340Q89185O78227Q00585N31484J154851P85952J577334
14325C6248448N81625J428979R03776J234790R61637O90644J863743J394482J564596
14316D6872720J198104J438671J765728J679570J675541J849197K181965J713765
14308F0375261K307853K253516K518622K212255K761832K488838K845088K952117
14300H0715382L250792L305279L492796M019300L582858M420564M288888M486802
$$ plain form
14292 111562661 116575355 122113823 127854502 133553673 139693762 146484551 153251436 160811280
14284 160811280 168708443 176811859 185791881 195347498 205301447 215680302 226534112 237839223
14276 237839223 250144499 262791777 276181734 289868036 304485771 319553368 333918835
14269 333918835 348510795 362941283 376819991 390502935 403338831 415449782 426001405
14262 426001405 435686801 444526962 452595489 459420503 464966208 467126846 466763249 467012173
14254 467012173 464309681 456113046 449534440 442298161 432179149 422386681 409850002 397365014
14246 397365014 384321031 369922268 356137865 341102689 327392994 313507522 299562016
14239 299562016 285709019 272671099 260105300 248122320 236465595 225630008 214052686
$$ packed form
14292A11562661N012694N538468N740679N699171O140089O790789O766885P559844
14284A60811280P897163Q103416Q980022R555617R953949J0378855J0853810J1305111
14276B37839223J2305276J2647278J3389957J3686302J4617735J5067597J4365467
14269C33918835J4591960J4430488J3878708J3682944J2835896J2110951J0551623
14262D26001405R685396Q840161Q068527O825014N545705K160638l63597K48924
14254D67012173k702492q196635o578606p236279j0119012r792468j2536679j2484988
14246C97365014j3043983j4398763j3784403j5035176j3709695j3885472j3945506
14239B99562016j3852997j3037920j2565799j1982980j1656725j0835587j1577322
$$ plain form
14232 214052686 202820264 192064670 182172192 173688161 164920228 156691292 149450399 142115563
14224 142115563 135673260 129495335 123954529 118816145 113463980 108650655 104080837 99643186
14216 99643186 95921025 92079419 88684218 84956026 81935406 78614615 75575564 72771955
14208 72771955 70591870 68002125 65262926 63436288 61129798 58977368 57142656 55148337
14200 55148337 53576560 52004852 50607905 49135653 47641204 46178279 44704259 43445575
14192 43445575 42561617 41723488 40106558 38807076 37894999 36841413 36065326 35125239 34473056
14183 34473056 33597213 32561055 31710604 30954258 30353149 29157062 28566144 28040152 27284100
14174 27284100 26958195 25840011 25231837 24605203 24216908 23608637 23477901 22923801 22088117
$$ packed form
14232B14052686j1232422j0755594r892478q484031q767933q228936p240893p334836
14224A42115563o442303o177925n540806n138384n352165m813325m569818m437651
14216I9643186l722161l841606l395201l728192l020620l320791l039051k803609
14208G2771955k180085k589745k739199j826638k306490k152430j834712j994319
14200E5148337j571777j571708j396947j472252j494449j462925j474020j258684
14192D3445575q83958q38129j616930j299482r12077j053586p76087r40087o52183
14183C4473056q75843j036158q50451p56346o01109j196087n90918n25992p56052
14174B7284100l25905j118184o08174o26634l88295o08271j30736n54100q35684
$$ plain form
14165 22088117 21585320 21138172 20883681 20307582 20378524 19454396 19449394 18958159 18356531 17889721
14155 17889721 17804774 17410074 17148740 16970861 16677047 16174503 15639645 15250298 15433948
14146 15433948 15111144 14660696 14387237 14030732 13828242 13467392 13117678 13074447 12987220 12723823
14136 12723823 12552548 12412866 12558531 12334817 11909528 11753513 11579852 11442035 11346935
14127 11346935 10814418 10778749 10592426 10337390 10305236 10340892 10121807 9909676 9796281 9591608
14117 9591608 9532572 9303871 9185015 9201782 9105467 8797023 8581506 8435617 8196728 8222044
14107 8222044 8421164 8369652 7841141 8075745 7927151 7881716 7403371 7527246 7382249 7353761
14097 7353761 7156264 7213664 7235229 6944705 6679846 6916745 6644679 6876617 6643163 6578728
$$ packed form
14165B2088117n02797m47148k54491n76099P0942r24128n002m91235o01628m66810
14155A7889721q4947l94700k61334j77879k93814n02544n34858l89347J83650
14146A5433948l22804m50448k73459l56505k02490l60850l49714m3231q7227k63397
14136A2723823j71275j39682J45665k23714m25289j56015j73661j37817r5100
14127A1346935n32517l5669j86323k55036l2154L5656k19085k12131j13395k04673
14117I591608n9036k28701j18856J6767r6315l08444k15517j45889k38889K5316
14107H222044J99120n1512n28511K34604j48594m5435m78345J23875j44997k8488
14097G353761j97497N7400K1565k90524k64859K36899k72066K31938k33454o4435
$$ plain form
14087 6578728 6502368 6098488 6121361 6003539 5946537 6040296 6236102 6340057 5880889 5733861
14077 5733861 5518064 5299344 5902947 5183062 5542718 5143333 5399579 5314515 5290088 5167779
14067 5167779 5400569 5254046 4983232 5131041 5109076 4902044 4881436 5092844 4532223 4686107
14057 4686107 4615186 4751642 4071909 4675186 4458365 4673393 4224558 4259112 4482168 4605663
14047 4605663 4317897 4314623 4212848 4395699 4037775 4257531 4302430 3967869 4206845 3846264
14037 3846264 3723974 3811611 3789901 3775471 3432245 3783010 3528214 3558170 3534585 3185921
14027 3185921 3453262 3332851 3634605 3281960 3385445 3251721 3187598 3441027 2934319 3363475
14017 3363475 3383540 2994822 3108817 3319339 3194925 3158504 2965456 2891462 2635915 2982790
$$ packed form
14087F578728p6360m03880K2873j17822n7002R3759J95806J03955m59168j47028
14077E733861k15797k18720O03603p19885L59656l99385K56246q5064k4427j22309
14067E167779K32790j46523k70814J47809k1965k07032k0608K11408n60621J53884
14057D686107p0921J36456o79733O03277k16821K15028m48835L4554K23056J23495
14047D605663k87766l274j01775J82851l57924K19756M4899l34561K38976l60581
14037C846264j22290Q7637k1710j4430l43226L50765k54796K9956k3585l48664
14027C185921K67341j20411L01754l52645J03485j33724o4123K53429n06708M29156
14017C363475K0065l88718J13995K10522j24414l6421j93048p3994k55547L46875
$$ plain form
14007 2982790 2888676 2530775 2883217 3108587 2859315 2607836 2555527 2515865 2740046 2525092
13997 2525092 2498738 2635116 2758429 2450289 2342778 2706979 2386523 2417231 2424281 2216014
13987 2216014 2568572 2329206 2283759 2360970 2633077 2554100 2724695 2673074 2832541 2953875
13977 2953875 3017240 3463048 4448560 5329078 8570357 14292947 24447846 33512389 23753017
13968 23753017 16342722 11302712 8605943 6430249 5476793 4697959 4280190 3601793 3862799
13959 3862799 3663094 3447988 3056405 2472262 2621501 2740756 2286972 2754051 2635365
13950 2635365 2446751 2579847 2218210 2200778 2485660 2126606 2314366 2039619 2414644 1972341
13940 1972341 1707175 1853000 2205735 1949465 1783123 2001934 1812873 1916789 1951436 1828708
$$ packed form
14007B982790r4114l57901L52442K25370k49272k51479n2309l9662K24181k14954
13997B525092k6354J36378J23313l08140j07511L64201l20456L0708P050k08267
13987B216014L52558k39366m5447P7211K72107p8977J70595n1621J59467J21334
13977B953875O3365M45808R85512Q80518L241279N722590J0154899R064543r759372
13968B3753017p410295n040010k696769k175694r53456p78834m17769o78397K61006
13959C862799j99705k15106l91583n84143J49239J19255m53784M67079j18686
13950B635365j88614J33096l61637j7432K84882l59054J87760k74747L75025m42303
13940A972341k65166J45825L52735k56270j66342K18811j89061J03916L4647j22728
$$ plain form
13930 1828708 1762114 1823050 1986278 2017011 1774621 1768429 1791418 1695795 1799505 1682881 1687211
13919 1687211 1655376 1742015 1678465 1726517 1921759 1718452 1879472 1527802 1726236 1575545
13909 1575545 1331159 1513260 1672816 1658370 1347162 1744561 1778554 1830584 1606549 1563366
13899 1563366 1556552 1581540 1469118 1729558 1359594 1232458 1406049 1493716 1581719 1244927
13889 1244927 1505121 1068535 1340224 1439561 1500815 1222746 1572221 1345269 1764080 1712584
13879 1712584 1181064 1108484 1254738 1299303 872472 1625375 1597886 1504655 1285529 1426019
13869 1426019 1313302 1315297 1302864 1412936 1394188 1372230 1202124 1609713 1072754 1083709
13859 1083709 1346249 1388822 1395235 1115100 1101780 1227583 1255637 1157585 939528 1270665
$$ packed form
13930A828708o6594O0936J63228L0733k42390o192K2989r5623J03710j16624M330
13919A687211l1835Q6639o3550M8052J95242k03307J61020l51670J98434j50691
13909A575545k44386J82101J59556j4446l11208L97399L3993N2030k24035m3183
13899A563366o814K4988j12422K60440l69964j27136J73591Q7667Q8003l36792
13889A244927K60194m36586K71689R9337O1254k78069L49475k26952M18811n1496
13879A712584n31520p2580J46254M4565m26831P52903k7489r3231k19126J40490
13869A426019j12717J995j2433J10072j8748k1958j70106M07589n36959J0955
13859A083709K62540M2573O413k80135j3320J25803K8054r8052k18057L31137
$$ plain form
13849 1270665 1233545 1003492 964916 1163692 1157841 1096859 1187686 847361 1189413 1234065 1074215
13838 1074215 1277911 687223 1110302 1042608 1078692 1198412 998642 888986 998215 750888
13828 750888 1037858 1107182 1030450 1198453 817734 909784 1195830 1405952 973062 891544
13818 891544 1335946 921493 889236 1126073 794484 991678 1036006 959964 948368 1051617
13808 1051617 1058310 1106490 926552 1193696 898347 745076 761055 1194853 922704 1080155
13798 1080155 992442 811897 885871 1031517 1001573 640948 635967 1025700 930272 955239 670978
13787 670978 870078 859591 705801 403715 699917 734375 1254340 817102 794262 823785
13777 823785 852569 886998 1042016 1080347 610946 838254 849083 809968 781041 882414 1225194
$$ packed form
13849A270665l7120k30053l8576J98776n851o0982R0827l40325L42052M4652j59850
13838A074215K03696n90688M23079o7694L6084J19720j99770j09656J09229k47327
13828G50888K86970O9324p6732J68003l80719R2050K86046K10122m32890q1518
13818H91544M44402m14453l2257K36837l31589J97194M4328p6042j1596J03249
13808A051617O693M8180j79938K67144k95349j53271J5979M33798k72149J57451
13798A080155q7713j80545P3974J45646k9944l60625m981L89733r5428K4967k84261
13787F70978J99100j0487j53790l02086K96202L4458N19965m37238k2840K9523
13777H23785K8784L4429J55018L8331m69401K27308J0829l9115k8927J01373L42780
$$ plain form
13766 1225194 791207 578143 590814 575751 748063 634566 1132016 550387 808142 1000760
13756 1000760 942455 955077 767489 876172 708390 565981 454300 513732 895731 549121
13746 549121 787967 521008 843332 525778 493057 964470 823673 719552 558530 909168
13736 909168 754950 519623 777298 657017 664294 576162 582739 491494 730419 1090102 554035
13725 554035 554488 492170 692413 604601 587716 941842 511982 595595 385651 696655 410039
13714 410039 476002 560620 773966 422057 820075 421060 270522 616188 747316 341788
13703 711961 350819 565684 589932 607836 477718 818823 815623 743879 707994 520156 551967
13692 551967 713994 386839 671966 859434 464563 373858 757325 312733 441643 645551
$$ packed form
13766A225194m33987k13064J2671j5063J72312j13497M97450E50387K57755J92618
13756A000760n8305J2622j87588J08683j67782j42409j11681N9432L81999l46610
13746E49121K38846k66959L22324l17554l2721M71413j40797j04121j61022L50638
13736I09168j54218k35327K57675j20281P277q8132O577r1245K38925L59683n36067
13725E54035M53o2318K00243q7812j6885L54126m29860Q3613k09944L11004k86616
13714D10039O5963Q4618K13346l51909L98018l99015j50538L45666J31128C41788
13703G11961C50819K14865K4248J7904j30118L41105l200p1744l5885j87838L1811
13692E51967J62027l27155K85127J87468l94871r0705L83467C12733J28910K03908
$$ plain form
13682 645551 381556 562454 494867 379773 448857 620814 627368 563793 587936 323175 619176
13671 619176 535933 563938 623255 569248 522945 326628 549878 426793 774727 641899
13661 641899 150273 550290 367459 93252 502010 491595 475590 985100 432524 474671
13651 474671 402185 339609 375121 625853 311303 596976 279312 597942 941611 529284
13641 529284 470470 428134 473005 476417 411085 501532 471058 689392 536779 539913 207543
13629 410625 740804 359281 461046 527442 91606 608116 509629 806457 286311 488934
13619 488934 142739 477710 477006 389479 109736 556680 198200 482295 408019 484536 828870
13608 828870 217777 330349 420516 232112 417406 376371 225699 253652 181028 613155
$$ packed form
13682F45551k63995J80898o7587j15094O9084J71957O554o3575K4143k64761K96001
13671F19176q3243K8005N9317n4007m6303j96317K23250j23085L47934j32828
13661F41899A50273M00017j82831I3252M08758j0415j6005N09510D32524M2147
13651D74671p2486o2576L5512K50732C11303K85673B79312L18630L43669m12327
13641E29284n8814m2336M4871L412o5332R0447l0474K18334j52613L134B07543
13629D10625L30179C59281J01765O6396I1606N16510r8487K96828B86311K02623
13619D88934A42739L34971p04q7527A09736M46944A98200K84095p4276P6517L44334
13608H28870B17777J12572R0167j88404J85294m1035j50672K7953p2624M32127
$$ plain form
13598 613155 451853 330597 450636 427916 359567 494097 379536 312816 126879 626128
13588 626128 524232 612605 363019 417775 341814 265112 362420 529766 495465 570993 374619
13577 374619 292835 615293 164505 380620 162475 240784 554436 446173 269325 186965
13567 186965 473662 270834 241886 277673 219982 638077 253855 232222 300719 -70119 328065
13555 217254 706845 334684 524769 453046 510737 431890 386878 658944 527268 217245
13544 492224 341926 714984 246958 511646 286717 322174 31862 354217 193217 417395
13534 417395 204956 502933 173969 128714 282328 104082 311280 181329 301771 -16039
13523 164191 185571 496650 190488 466555 202911 319441 443517 196393 329313 465201
$$ packed form
13598F13155j61302j21256J20039k2720o8349J34530j14561o6720A26879M99249
13588F26128j01896Q8373k49586N4756p5961p6702R7308J67346l4301P5528j96374
13577C74619q1784L22458A64505K16115A62475P8309L13652j08263j76848q2360
13567A86965K86697k02828k8948L5787n7691M18095B53855k1633O8497g0119C28065
13555B17254M89591C34684J90085p1723N7691p8847m5012K72066j31676B17245
13544D92224j50298L73058B46958K64688k24929L5457C1862L22355j61000K24178
13534D17395B04956K97977A73969m5255J53614A04082K07198j29951J20442a6039
13523A64191K1380L11079A90488K76067B02911J16530J24076A96393J32920J35888
$$ plain form
13513 465201 314932 545793 161264 95426 -125016 23084 69541 282094 347797 414774
13503 414774 371585 134344 327398 133606 460284 190102 518292 369433 267501 310380
13493 310380 263907 356784 179622 141217 401575 394661 369396 400041 108338 443953 327321
13482 327321 343143 241534 173341 131336 146208 559602 242960 83503 46981 193623 196851
13471 196851 289012 193372 326625 470729 431878 -83377 214531 397871 237952 405029
13461 405029 462436 501809 81082 -122586 304161 448207 392527 70054 581239 138076
13450 482729 135057 230300 273006 109405 148444 50876 178243 191801 461582 148032
13439 261562 363812 41092 74787 264289 685900 264706 386670 307136 114242 38204
$$ packed form
13513D65201j50269K30861A61264o5838a25016B3084M6457K12553O5703O6977
13503D14774m3189A34344J93054A33606L26678A90102L28190j48859j01932M2879
13493C10380m6473R2877j77162l8405K60358o914k5265L0645A08338L35615j16632
13482C27321J5822j01609o8193m2005J4872M13394B42960H3503l6522J46642L228
13471A96851R2161r5640J33253J44104l8851h3377B14531J83340j59919J67077
13461D05029N7407L9373H1082a22586C04161J44046n5680G0054N11185A38076
13450D82729A35057R5243M2706A09405L9039E0876J27367J3558K69781A48032
13439B61562J02250D1092L3695J89502M21611B64706J21964p9534A14242C8204
$$ plain form
13428 79110 336418 472910 -42263 424738 127893 286118 -148144 436275 204980 225451
13418 225451 -120066 322211 60844 19928 89989 -18952 409183 334318 110550 80899 318613
13407 318613 218224 144407 -30777 159767 120136 79399 428845 229699 -127170 193115
13396 561798 17964 147690 -14556 127272 475863 199356 107982 44034 277424 504695
13386 504695 93325 485725 607780 142545 195670 168708 405770 191540 397500 118131
13375 78440 305521 -49148 -166748 312283 285677 250129 238667 244544 200490 120309 163369
13364 163369 181547 53505 196894 -33446 106846 238103 280762 115308 585348 363495
13354 363495 264536 541578 137046 67901 188555 701903 446485 446383 -22576 273932 390210
$$ packed form
13428G9110K57308J36492d2263D24738A27893J58225a48144D36275B04980K0471
13418B25451a20066C22211F0844A9928P0061a8952D09183p4865A10550k9651K37714
13407C18613j00389p3817c0777A59767l9631m0737L49446j99146a27170A93115
13396E61798A7964J29726a4556A27272L48591A99356r1374D4034K33390K27271
13386E04695I3325L92400J22055A42545N3125k6962K37062A91540K05960A18131
13375G8440K27081d9148j17600C12283k6606l5548j1462N877m4054q0181M3060
13364A63369J8178E3505J43389c3446A06846J31257M2659A15308M70040k21853
13354C63495r8959K77042A37046F7901J20654N13348k55418j02b2576B73932J16278
$$ plain form
13343 390210 142972 294011 494502 180633 29246 253696 -38786 173500 199863 256997
13333 256997 18266 241660 232096 114179 -42721 271830 123099 147426 -31652 285796 190263
13322 190263 636104 470272 324732 310123 134090 18852 151968 346377 308779 6075
13311 177039 439620 171918 203756 -37363 227796 198647 431837 205152 -33475 332645
13300 186623 306113 275761 -41360 477600 242063 85118 29992 450462 399117 410504 185761
13288 603814 248970 -73389 267122 358064 408089 -93156 -101508 -48952 335033 -11419 252573
13276 -78743 -96096 141476 383911 327427 105939 211435 594228 490648 30839 418631
13266 418631 278492 -122098 459815 161739 196706 -3401 240113 -24359 242914 463306
$$ packed form
13343C90210A42972J51039K00491A80633B9246K24450c8786A73500K6363N7134
13333B56997A8266K23394r564A14179d2721B71830A23099K4327c1652B85796r5533
13322A90263M45841j65832j45540j4609A34090A8852J33116J94409l7598F075
13311A77039K62581A71918L1838c7363B27796k9149K33190B05152c3475C32645
13300A86623J19490l0352d1360D77600k35537H5118B9992M20470n1345J1387A85761
13288F03814B48970g3389B67122R0942N0025i3156q352d8952C35033a1419B52573
13276g8743j7353A41476K42435n6484A05939J05496L82793j03580C0839L87792
13266D18631j40139a22098D59815A61739L4967c401B40113b4359B42914K20392
$$ plain form
13256 463306 -18309 -41026 5359 -209501 121179 191013 -251526 259389 -36949 234274 -143090
13244 158349 127940 191161 -143597 -25180 532991 108745 155199 190923 274614 28876 -64197
13232 -314973 96296 275898 -57061 44632 184021 -599 315616 29031 11416 297401 -64108
13220 435696 94797 -87472 -119375 379846 -60841 -48319 290531 -139161 218047 153990 -402570
13208 61621 163385 342136 -26788 -3465 227612 32464 40412 -74165 197587 38501 133233
13197 133233 -21743 -14184 11694 294987 131294 -118612 -153527 -23297 -51003 180265 -146876
13185 24886 304839 324245 14090 9856 94780 104827 144148 168948 102758 110739 21154 146503
13173 146503 173661 184889 -34556 187784 205984 -285892 -29060 -19950 305027 -47904 -118508
$$ packed form
13256D63306a8309k2717E359b09501A21179O9834b51526B59389c6949B34274a43090
13244A58349l0409O3221a43597b5180E32991A08745M6454L5724Q3691B8876f4197
13232c14973I6296J79602e7061D4632J39389e99C15616B9031A1416K85985f4108
13220D35696I4797h7472l1903C79846f0841J2522B90531a39161B18047o4057d02570
13208F1621J01764J78751b6788c465B27612C2464P948g4165A97587C8501R4732
13197A33233b1743P559A1694K83293A31294a18612l4915b3297k7706A80265a46876
13185B4886K79953J9406A4090m234Q4924J0047L9321K4800o6190P981B1154J25349
13173A46503K7158J1228c4556A87784J8200b85892b9060R110C05027d7904p0604
$$ plain form
13162 -118508 196961 -55446 200464 400960 83604 117287 216186 25272 79850 395280 -100227
13150 294559 -88237 135989 -93557 198746 333958 67766 122907 -68119 224893 -43871 231502
13138 192490 96257 -30428 -50724 -120515 -49619 279158 -80876 18936 185788 411063 191725
13126 269672 -109149 347255 206999 -12953 408277 181236 51175 -25914 -15589 135180
13115 187701 8477 24171 -61616 23532 -96851 -69315 52671 -4844 -23767 -75964 132235 81900
13103 81900 16970 58907 80250 124710 103921 224619 463074 57202 318877 -172075 -109493
13092 -109493 92184 300222 89818 150480 -96595 189668 197405 112109 353248 39170 42753
13081 42753 -106184 -56610 -84701 -228428 -194956 38795 -164124 -4350 376783 -98144 79816
$$ packed form
13162a18508A96961e5446B00464K00496H3604L3683R8899B5272N4578L15430a00227
13150B94559h8237A35989i3557A98746J35212F7766N5141f8119B24893d3871B31502
13138A92490r6233c0428k0296o9791d9619B79158h0876A8936J66852K25275A91725
13126B69672a09149C47255j40256a2953D08277A81236E1175b5914J0325A35180
13115A87701H477J5694f1616B3532i6851K7536E2671d844j8923n2197A32235n0335
13103H1900A6970M1937K1343M4460k0789J20698K38455E7202K61675a72075O2582
13092a09493I2184K08038H9818O0662i6595A89668P737q5296K41139C9170L583
13081D2753a06184M9574k8091j43727L3472C8795a64124d350C76783i8144G9816
$$ plain form
13069 135189 207344 227961 -170072 -209694 -186074 99217 124392 169928 210768 -52516 -124441
13058 -124441 -156734 -202644 41125 119550 239150 148885 199776 24442 307323 137283 -127112
13046 513621 26871 -76005 -101821 -95065 179098 197260 463063 391385 101690 236701 -28269
13034 -103747 106934 -256626 252564 173499 160170 415365 361587 141543 193657 -292675
13023 55252 58324 249017 58709 50654 28333 -27925 23217 -51053 -33738 121015 255078
13012 255078 34231 -120868 127826 -38343 231005 -57161 -34667 -129278 -31279 265020 210438
13001 210438 -143258 -206008 6676 -120951 111679 204225 -150429 -305669 296488 -190235
12990 36590 -153904 75911 316605 -69606 96308 -184536 67539 142323 -6484 178397 257312
$$ packed form
13069A35189P2155K0617a70072l9622K3620I9217K5175M5536M0840e2516p1925
13058a24441l2293m5910D1125P8425J19600r0265N0891B4442K82881A37283a27112
13046E13621B6871g6005k5816O756A79098J8162K65803p1678A01690J35011b8269
13034a03747A06934b56626B52564p9065j3329K55195n3778A41543N2114b92675
13023E5252L072J90693E8709q055k2321b7925B3217e1053J7315A21015J34063
13012B55078C4231a20868A27826c8343B31005e7161K2494r4611c1279B65020n4582
13001B10438a43258o2750F676a20951A11679R2546a50429j55240B96488a90235
12990C6590a53904G5911K40694f9606I6308a84536F7539P4784f484A78397P8915
$$ plain form
12979 257312 -113607 431145 -79709 6690 -118766 55788 142816 207262 265649 -27048 -114528
12968 -114528 -118426 -132831 -258022 38261 -8514 -197843 349303 -167941 -217373 255877 -379285
12956 97019 -50254 2991 211855 60575 34029 57625 89751 322455 244684 22878 114936
12945 114936 285899 269464 406584 209598 9116 288939 -239575 -23440 -174196 124486
12934 -10038 -220738 95430 153887 -159811 -161229 83755 -94189 -132096 -241007 32941 -62129
12922 -63191 121265 76993 19847 190504 28354 200232 -272908 -49340 -18951 -25614 206284
12910 300265 52827 -210467 174819 442540 -28175 218191 129981 -451179 -17682 -27098 -73252
12899 -73252 39192 -351261 215183 144953 325668 87102 15594 -7179 -245624 98137 209263
$$ packed form
12979B57312a13607D31145g9709F690a18766E5788Q7028O4446N8387b7048q7480
12968a14528l898j4405j25191C8261h514j89329C49303a67941m9432B55877c79285
12956I7019e0254B991K08864F0575k6546K3596L2126K32704p7771B2878R2058
12945A14936J70963j6435J37120j96986I116K79823b39575b3440j50756A24486
12934a0038k10700I5430N8457a59811j418H3755i4189l7907j08911C2941f2129
12922f3191A21265m4272A9847J70657B8354J71878b72908d9340a8951o663B06284
12910C00265E2827b10467A74819K67721b8175B18191q8210d51179a7682r416m6154
12899g3252C9192c51261B15183p0230J80715H7102A5594g179k38445I8137J11126
$$ plain form
12888 209263 -59704 -262398 317332 25952 241673 -11529 -19290 317815 61346 206882 -157191
12876 135918 167673 207101 49992 -71676 188828 150546 48245 145803 -116765 322055 -17445
12864 -239321 -110364 83591 -107277 148474 121720 120869 -318190 311533 -73314 90710 -59053
12852 -26699 320896 192124 -39433 60081 -98399 415890 -242121 118426 -24348 -197762
12842 -197762 -78614 -71717 -72556 187476 354453 178064 171224 -57296 173022 -139782 301088
12830 1101 52134 105706 351242 -223886 203580 73594 661754 -194805 -235282 161303 -93984
12818 126190 -133903 -110283 229124 109720 -304332 50311 116006 178102 -118090 327390
12807 126407 -89464 -203140 -113054 900 -40902 64525 -264081 33563 -47485 155459 176943
$$ packed form
12888B09263e9704k02694C17332B5952K15721a1529p761C17815F1346J45536a57191
12876A35918L1755L9428D9992g1676A88828l8282D8245R7558a16765C22055a7445
12864b39321a10364H3591a07277A48474k6754q51c18190C11533g3314I0710e9053
12852b6699C20896j28772c9433F0081i8399D15890b42121A18426b4348j73414
12842a97762g8614O897q39A87476J66977j76389o840e7296A73022a39782C01088
12830A101N1033N3572K45536b23886B03580G3594N88160a94805m0477A61303i3984
12818A26190a33903K3620B29124A09720c04332E0311O5695O2096a18090C27390
12807A26407h9464j13676R0086I00d0902F4525b64081C3563d7485A55459K1484
$$ plain form
12796 176943 102162 419333 -209826 -131261 -50147 -5228 -87679 -100332 174797 234314 -47361
12784 -216163 96916 -189182 -4745 -126297 -369984 -12364 -295140 139715 372743 -34213
12773 -22067 88718 150897 50294 432458 133062 -378615 -108552 -137177 19937 142414 295678
12762 295678 -14825 51281 -170834 184927 306 -127706 209144 -92114 116373 102700 -212685
12750 72556 -285065 78481 -110847 -473481 163517 -221624 145546 55884 247080 159697
12740 159697 -70858 63425 -38395 29300 38778 373518 45826 -160129 35269 106112 -268769
12728 134986 -192846 -104962 88675 -40590 -329481 -48039 227759 289213 141971 43657 -115740
12716 -166597 -12477 161373 171620 73864 143091 -31049 -62252 -102386 99647 7002 -10266
$$ packed form
12796A76943p4781L17171b09826P8565e0147e228q2451j2653A74797N9517d7361
12784b16163I6916a89182d745j21552k43687a2364k82776A39715K33028c4213
12773b2067H8718O2179E0294L82164A33062c78615a08552k8625A9937J22477J53264
12762B95678a4825E1281a70834A84927C06a27706B09144i2114A16373j3673b12685
12750G2556b85065G8481a10847l62634A63517b21624A45546E5884J91196q7383
12740A59697g0858F3425c8395B9300R478L34740D5826a60129C5269P0843b68769
12728A34986a92846Q7884H8675d0590k88891d8039B27759O1454A41971D3657a15740
12716a66597a2477A61373J0247G3864O9227c1049l1203m0134I9647G002a0266
$$ plain form
12704 -63162 -110617 -230880 99982 -4224 371299 207960 -70273 -72673 -24211 161430 132386
12693 132386 -5605 146687 185419 184466 45184 -102512 153566 62187 109897 259838 -27823
12681 4585 82280 329850 46850 -49182 289475 475527 -38479 208744 79460 -238534 14575
12669 221066 112185 -205132 -155417 439298 -2426 55521 -5719 347168 27608 -292492 -187556
12658 -187556 395652 -204302 -17010 49122 122235 240492 140799 171433 -150324 -218849 194329
12646 -128365 -25325 472242 221988 131734 49911 69190 -225267 252169 -15925 43029 -38207
12634 76099 -27334 -112102 190022 -60634 -37853 128975 -179858 173605 247976 167769 96178
12623 96178 243885 -18681 133479 -38928 313757 276141 35653 -38023 -281114 194158 38862
$$ packed form
12704f3162m7455j20263I9982d224C71299j63339g0273k400b4211A61430k9044
12693A32386e605A46687L8732r53D5184a02512A53566F2187M7710J49941b7823
12681D585P7695K47570D6850d9182B89475J86052c8479B08744G9460b38534A4575
12669B21066j08881b05132M9715D39298b426E5521e719C47168B7608b92492J04936
12658a87556C95652b04302a7010D9122P3113J18257r9693L0634a50324o8525A94329
12646a28365b5325D72242B21988r0254D9911J9279b25267B52169a5925D3029c8207
12634G6099b7334q4768A90022f0634K2781A28975a79858A73605P4371q0207p1591
12623I6178J47707a8681A33479c8928C13757l7616C5653c8023k43091A94158C8862
$$ plain form
12611 13841 -11665 -21996 17885 -71620 -227681 175038 182772 79817 -40244 -91309 5664 132677
12599 132677 21645 -35882 54382 298995 -1092 29537 -16124 -93343 -13156 -53748 220377
12587 80266 186169 88212 -266184 83259 310001 42515 24936 -168731 256109 -63335 308963
12575 301760 -195082 -110338 -303939 152257 216473 -145432 342059 23414 -55354 199731
12564 242947 -138266 48361 -257518 -243733 186472 -344960 122753 -83680 131881 298976
12554 298976 203852 -8076 277291 -89660 282574 103664 -46257 95772 32843 12798 302616
12543 302616 81259 -69660 165744 136101 -43477 -20705 140576 -97966 -66269 179994 25231
12531 -222025 73149 -124541 -116198 -502640 159684 -302520 320207 199642 162515 -292819
$$ packed form
12611A3841a1665j0331A7885g1620j56061A75038P734G9817d0244n1065E664J27013
12599A32677B1645c5882E4382K44613a092B9537a6124p7219a3156m0592B20377
12587H0266J05903H8212b66184H3259K26742D2515j7579a68731B56109f3335C08963
12575C01760a95082Q4744j93601A52257O4216a45432C42059B3414e5354A99731
12564B42947a38266D8361b57518J3785A86472c44960A22753h3680A31881J67095
12554B98976r5124h076B77291h9660B82574A03664d6257I5772C2843A2798K89818
12543C02616H1259f9660A65744k9643d3477b0705A40576i7966L1697A79994B5231
12531b22025G3149a24541Q343l86442A59684c02520C20207j20565l7127b92819
$$ plain form
12520 254471 -369506 -15896 -69958 -31886 -21725 161087 -25404 -400911 105884 271387
12510 271387 48311 64201 -159520 -171137 47518 -546472 55026 -203646 -142781 230634 42094
12498 -202133 264851 -131584 -46993 64862 274394 -162649 -78154 79449 42273 -93075 -104578
12487 -104578 107986 211261 -232500 310331 -137302 433500 -155476 262807 -80891 169131
12476 169956 -146205 -264318 294510 32683 17784 -239049 74823 211299 -80895 21034
12465 247686 197823 -253830 290926 204120 80685 174718 -137930 -100738 -57433 190878 51797
12453 -42119 -219350 15492 329604 -292923 163538 379193 -246803 265887 198067 1151
12442 209144 -202396 -125966 83326 -118106 -234318 -280186 238782 268308 -114994 314238
$$ packed form
12520B54471c69506a5896n4062c1886J0161A61087b5404l75507A05884J65503
12510B71387D8311J5890a59520j1617D7518e46472E5026b03646O0865B30634D2094
12498b02133B64851a31584d6993F4862K09532a62649g8154G9449l7176i3075j1503
12487a04578A07986J03275b32500C10331a37302D33500a55476B62807h0891A69131
12476A69956a46205j18113B94510C2683j4899b39049G4823J36476h0895B1034
12465B47686m9863b53830B90926q6806H0685R4033a37930L7192M3305A90878E1797
12453d2119j77231A5492L14112b92923A63538K15655b46803B65887o7820A151
12442B09144b02396P6430H3326a18106j16212m5868B38782K9526a14994C14238
$$ plain form
12431 -147276 -7547 -22000 40712 -31798 117032 18338 -58561 340869 -439520 -64817 139784
12419 -399253 114916 -25308 92192 42653 132756 47607 -51264 -212946 237432 -169910 -244820
12408 -244820 278532 -294559 99629 -59227 136916 -54358 -183551 -91887 -108017 63053 -3814
12396 157278 120387 -115392 -21003 -17143 -237821 10606 -101717 52993 -182867 93545 -27520
12384 -77130 82974 135807 89502 186252 3878 -44134 -2730 -60667 -342547 -164881 305470
12372 236044 278452 26531 -88337 101360 20099 47934 33131 187776 201836 304228 150966
12360 -36911 123528 53536 235987 -41836 141066 90575 245900 -54262 -115077 -89846 -64104
12349 -64104 -201432 -132374 -100709 187888 -164024 -424673 -45907 -185444 -348195 -198472
$$ packed form
12431a47276g547j4453D0712c1798A17032A8338e8561C40869d39520f4817A39784
12419c99253A14916b5308I2192D2653R0103D7607e1264j61682B37432a69910p4910
12408b44820B78532b94559I9629e9227A36916e4358j29193R1664j6130F3053c814
12396A57278l6891a15392b1003L860k20678A0606a01717E2993a82867I3545b7520
12384g7130H2974N2833m6305R6750C878d4134b730n7937k81880a64881C05470
12372B36044M2408B6531h8337A01360B0099K7835j4803J54645J4060J02392A50966
12360c6911A23528E3536J82451d1836A41066n0491J55325e4262o0815K5231K5742
12349f4104j37328O9058L1665A87888a64024k60649d5907j39537j62751J49723
$$ plain form
12339 -198472 -19950 -38959 -261523 -795 44862 7905 285546 51109 -62525 113743 -102840
12327 151808 -109360 240604 144480 99871 54192 -182094 390013 171902 341062 113708
12316 -21301 321176 312747 119846 -3186 -19693 137965 184453 177766 -81730 157082 420064
12305 420064 398603 85190 202448 193525 733509 141817 22624 244583 131463 86030 -288319
12293 269790 57964 109805 108237 73840 -29548 -101089 -82206 -38443 128235 -42294 -29361
12282 -29361 109280 208642 203431 7171 303633 -95774 199705 257951 20455 211058 -213978
12270 60299 -269036 154262 309390 132563 -27917 105020 99402 540566 50148 -111667
12259 -78524 -68553 156110 91318 -12609 222892 332890 302583 223508 74093 206779 -299464
$$ packed form
12339a98472a9950j9009k22564g95D4862G905K77641E1109f2525A13743a02840
12327A51808a09360B40604r6124m4609m5679a82094C90013A71902J69160A13708
12316b1301C21176q429A19846c186j6507A37965M6488o687h1730A57082K62982
12305D20064k1461H5190J17258q923N39984A41817B2624K21959j13120m5433b88319
12293B69790E7964N1841j568l4397b9548p1541J8883c8443A28235d2294J2933
12282b9361A09280R9362n211G171K96462i5774A99705N8246B0455J90603b13978
12270F0299b69036A54262J55128A32563b7917A05020n618M41164E0148a11667
12259g8524R971A56110o4792a2609B22892J09998l0307p9075G4093J32686b99464
$$ plain form
12247 64380 219057 59222 441874 271251 408131 -134905 251735 217120 -166475 282147
12236 115577 372972 366310 83836 260184 41228 200348 49308 47975 138924 329655 -103768
12224 414656 70431 5819 165793 -129404 -399467 51764 341186 189489 391317 112651
12213 -131007 467054 321005 16278 -59729 92020 55947 -77792 265580 54031 62315 114450
12202 114450 490216 165048 282122 174016 497964 139853 133951 38601 -56564 81057
12191 452635 162410 -113169 50684 162753 106935 211618 -326828 -64313 64698 233681
12181 233681 336973 1087 -94322 262882 325865 -13383 41506 273356 52355 75710 27415
12169 370092 121524 -67411 353444 -23511 42478 -74063 361033 -90007 129300 123173 470928
$$ packed form
12247F4380J54677E9222L82652j70623J36880a34905B51735l4615a66475B82147
12236A15577K57395o662H3836J76348D1228J59120D9308j333R0949J90731a03768
12224D14656G0431E819J59974a29404k70063E1764K89422j51697K01828A12651
12213a31007D67054j46049A6278e9729I2020l6073g7792B65580E4031Q284N2135
12202A14450L75766A65048J17074j08106L23948A39853n902C8601e6564H1057
12191D52635A62410a13169E0684J12069n5818J04683c26828f4313F4698J68983
12181B33681J03292A087i4322B62882O2983a3383D1506K31850E2355K3355B7415
12169C70092A21524f7411C53444b3511D2478g4063C61033i0007A29300o127L47755
$$ plain form
12158 470928 -2616 52132 144311 60490 477723 318512 364279 508793 426719 288089 328085
12147 328085 -143242 248431 420633 302009 192262 191024 415217 68800 295424 210609
12137 210609 227177 -86450 130560 308113 397247 246201 77387 28997 -121464 135532
12126 151624 26438 429696 -176761 266698 -148967 59370 64333 23976 181928 262651 282250
12115 282250 7467 -164056 -230862 97867 -120892 -97167 117287 348251 -103506 73396 30981
12103 124681 103233 -263584 320073 109600 125523 32084 156676 -32639 88044 177853 24516
12091 97761 130918 280692 58416 351206 230212 -131050 -130069 -73397 344231 197002 92736
12079 290720 224277 47192 -178356 -122887 74838 91996 -30023 138765 23701 68051 504532
$$ packed form
12158D70928b616E2132R2179F0490M17233j59211M5767J44514q2074j38630L9996
12147C28085a43242B48431J72202j18624j09747j238K24193F8800K26624q4815
12137B10609J6568h6450A30560J77553Q9134j51046G7387B8997a21464A35532
12126A51624B6438M03258a76761B66698a48967E9370M963B3976J57952Q0723J9599
12115B82250G467a64056o6806I7867a20892K3725A17287K30964a03506G3396C0981
12103A24681k1448b63584C20073A09600J5923C2084J24592c2639H8044Q9809B4516
12091I7761L3157J49774E8416K92790j20994a31050R81N6672C44231j47229I2736
12079B90720o6443D7192a78356N5469G4838J7158c0023A38765B3701M4350M36481
$$ plain form
12068 504532 -192227 -55055 92747 440992 32044 293444 -16128 383940 -16398 -133050
12058 -133050 75831 258779 2455 58410 224540 107677 387315 7841 124741 169066 403899
12047 403899 -105136 -42491 570777 -94217 166818 202734 112309 237171 120173 -90599
12036 -14383 79873 6512 -94053 -228390 -281889 -385865 -32063 81848 -145392 -45619 -45398 -137529
12024 -137529 -16008 -584417 -77094 53161 76436 82294 211998 -88371 -16038 -44702 73635
12012 -72568 97540 147590 11555 -95526 -114645 -16703 -245376 -176793 154246 -121236 -148541
12001 -148541 101661 296523 57056 108462 372609 113985 479597 -166368 18797 239611
11991 239611 -172673 47232 -214954 84021 47729 19342 -93596 -54092 71175 72402 -58869
$$ packed form
12068E04532a92227e5055I2747L48245C2044K61400a6128C83940a6398j16652
12058a33050G5831J82948B455N5955J66130A07677K79638G841J16900M4325K34833
12047D03899a05136d2491E70777i4217A66818L5916r0425J24862j16998i0599
12036a4383G9873F512i4053j34337n3499j03976c2063H1848a45392d5619K21r2131
12024a37529a6008n68409g7094E3161K3275N858J29704h8371a6038k8664G3635
12012g2568I7540N0050A1555i5526j9119a6703k28673O8583A54246a21236k7305
12001a48541A01661J94862E7056N1406K64147A13985L65612a66368A8797K20814
11991B39611a72673D7232b14954H4021l6292A9342i3596L9504G1175J227e8869
$$ plain form
11979 119527 -180447 -139660 307679 64481 -21521 167456 -73209 15701 -77184 73789 -188988
11967 -222779 24757 4925 -32855 90021 119685 1865 30650 213207 -311363 -152440 163105
11955 -16288 -108863 -71991 378676 171255 110876 -38520 188568 -107178 214784 -148392
11944 142222 19951 30052 265138 45707 149771 -13849 200745 -601 -225848 -149607 -34168
11932 164166 155812 -117696 26864 49478 13390 -190244 -55446 -240889 -37201 168733 -161835
11920 104990 -220994 -78066 -27321 -113386 189551 71844 76018 -71878 277006 -61497 -468131
11909 -468131 40982 54032 -110674 -327075 65582 302697 -85332 260550 88668 -403646
11898 -57737 160527 180733 19457 226003 -152332 -103206 -74278 430137 128188 154761 -184519
$$ packed form
11979A19527a80447M0787C07679F4481b1521A67456g3209A5701g7184G3789a88988
11967b22779B4757D925c2855I0021K9664A865K8785J82557c11363a52440A63105
11955a6288r2575L6872C78676A71255o0379c8520A88568a07178B14784a48392
11944A42222A9951J0101K35086D5707J04064a3849B00745f01k25247P6241c4168
11932A64166q354a17696B6864K2614A3390a90244e5446j85443c7201A68733a61835
11920A04990b20994g8066b7321q6065A89551G1844M174g1878B77006f1497m06634
11909d68131D0982J3050a10674k16401F5582K37115h5332B60550H8668d03646
11898e7737A60527K0206A9457K06546a52332M9126K8928D30137A28188K6573a84519
$$ plain form
11886 26907 -132209 -255765 51376 299369 -108590 46423 69243 -1347 442878 189134 -14210
11874 -217596 -320589 103602 -21138 -136889 -77071 105097 232070 101217 63462 122042
11864 122042 -110013 -111708 -30237 -103109 -175284 -32716 -158503 -12607 -272292 26857 -303822
11852 -126568 -129283 145475 -35787 -325957 -135413 -183638 -261503 276473 -43326 -29610 269271
11840 59918 -80549 -105453 313930 -51873 -309657 189197 -144667 23189 188177 -112619
11829 59647 132845 -35636 -299011 -184836 328377 -255680 -194435 -38820 -24127 -194410 121708
11817 233002 52871 -62920 -265936 4797 38711 116249 51256 -157120 218428 -106324 1474
11805 -291057 209623 -246184 -274264 98496 -309714 221245 -55589 -161218 130949 199949
$$ packed form
11886B6907a32209j23556E1376K47993a08590D6423K2820a347D42878A89134a4210
11874b17596j02993A03602b1138j15751N9818A05097J26973A01217l7755N8580
11864A22042a10013j695c0237p2872p2175c2716j25787a2607k59685B6857c03822
11852a26568k715A45475c5787k90170a35413m8225p7865B76473d3326J3716B69271
11840E9918h0549k4904C13930e1873k57784A89197a44667B3189J64988a12619
11829E9647P3198c5636k63375J14175C28377b55680O1245c8820J4693j70283A21708
11817B33002E2871f2920k03016D797L3914P7538E1256a57120B18428a06324A474
11805b91057B09623b46184k8080I8496c09714B21245e5589j05629A30949O9000
$$ plain form
11795 199949 -329288 -175436 204758 -116110 28915 93922 287592 -301480 -72558 -348390
11785 -348390 262289 -43391 -99525 222699 3438 -59468 130329 -28907 -57038 -90660 -69566
11774 -69566 -177790 -334894 62120 -169930 20043 52643 -129965 -50684 382938 -113899
11763 60775 -98930 -200009 371367 319750 -70418 183493 -297527 -362029 -13195 -74070 -117573
11752 -117573 -215093 -9162 163028 -90708 245521 45201 -8351 -67897 10741 -42099 111361
11740 -11893 -125572 -206381 -130661 59387 -134478 202525 -327986 -37626 -11060 -104764 169950
11728 65961 -170933 -192475 76843 -211463 104587 -268691 162872 -50443 -639418 -146276
11717 163864 -233266 -48418 -147589 -67055 -54151 -5435 194417 222960 -239399 -277814 -152125
$$ packed form
11795A99949c29288J53852B04758a16110B8915O5007J93670c01480g2558k75832
11785c48390B62289d3391n6134B22699C438e9468A30329b8907k8131l3622K1094
11774f9566j08224j57104F2120a69930B0043L2600a29965e0684C82938a13899
11763F0775i8930j01079C71367n1617g0418A83493b97527o4502a3195o0875m3503
11752a17573r7520i162A63028i0708B45521D5201h351n9546A0741d2099A11361
11740a1893j13679q0809P5720E9387a34478B02525c27986c7626a1060r3704A69950
11728F5961a70933k1542G6843b11463A04587b68691A62872e0443n88975a46276
11717A63864b33266d8418r9171f7055J2904e435A94417K8543b39399l8415J25689
$$ plain form
11706 -152125 181448 277619 13935 -142399 25567 -237422 87578 -79081 207284 -98716 125182
11694 -31167 308001 -222920 -29552 18173 -116910 -331362 303768 2834 -223884 10055 259408
11683 259408 4454 280198 24950 100796 -219150 69284 331594 138679 76197 -69030 31876
11671 -22012 211577 4631 51940 11102 117271 -118226 44667 -116937 -114264 -156556 273824
11659 -185465 199378 26382 -80797 54002 21903 -3391 -52785 -3995 90009 128865 -199836
11647 2596 -176298 111540 -54671 285538 24193 -93501 34941 -80890 83079 87982 -46451
11635 -209470 17731 -167680 327147 201547 -74885 61335 191302 101246 106151 56273 382483
11624 382483 8329 91377 52257 -7151 17764 -26684 12731 252089 -2672 29644 -114472 1776
$$ packed form
11706a52125A81448R6171A3935a42399B5567b37422H7578g9081B07284i8716A25182
11694c1167C08001b22920b9552A8173a16910k14452C03768B834b23884A0055K49353
11683B59408D454K75744B4950P5846b19150F9284K62310A38679o2482f9030C1876
11671b2012B11577D631M7309A1102J06169a18226D4667a16937K673m2292B73824
11659a85465A99378B6382h0797E4002B1903c391m9394c995I0009L8856a99836
11647B596a76298A11540e4671B85538B4193i3501C4941h0890H3079M903d6451
11635b09470A7731a67680C27147j25600g4885F1335J29967r0056M905m9878L26210
11624C82483H329Q3048l9120g151A7764b6684A2731K39358b672B9644a14472A776
$$ plain form
11611 -36651 127268 -19094 273226 -3498 -67742 98977 -28944 143271 133912 100717 -231497
11599 29640 40192 -27494 -74015 -32048 4430 141163 -305841 162332 30214 120547 -92841
11587 64589 -70866 45198 -12742 -75473 148484 -213340 -65527 318849 25111 121245 164542
11576 164542 -220366 26403 217794 -21888 -3347 479341 -131174 150060 61748 98179 38172
11564 193214 -27533 301784 253011 -166061 975 49632 -142349 375661 -156037 171595 -53337
11552 -45965 117741 148333 106096 -120837 -2921 25135 231761 -6700 68359 -14024 175824
11540 -89818 -58087 119657 135080 211044 -79837 9685 107926 -77115 -26071 127249 -28767
11528 -15901 105429 -28962 53748 -13054 102079 194501 -93763 145789 165910 -272105 -157249
$$ packed form
11611c6651A27268a9094B73226c498o4244I8977b8944A43271r359l3195b31497
11599B9640J0552b7494m6521c2048D430J36733c05841A62332C0214R0333i2841
11587F4589g0866D5198a2742o2731A48484b13340f5527C18849B5111R6134M3297
11576A64542b20366B6403J91391b1888c347D79341a31174A50060F1748L6431C8172
11564A93214b7533C01784m8773a66061I75M8657a42349C75661a56037A71595e3337
11552d5965A17741L0592m2237a20837b921B5135K06626f700F8359a4024A75824
11540h9818L1731A19657J5423P5964g9837I685R8241g7115b6071A27249b8767
11528a5901A05429b8962E3748a3054A02079R2422i3763A45789K0121b72105J14856
$$ plain form
11517 -157249 -101502 -149556 138375 115601 88734 162006 148229 89521 -1306 202883 -298875
11505 329937 -122363 319437 312282 -202311 105139 289504 208455 63228 273200 49073
11494 -96033 82882 15493 183863 4015 10806 63596 446452 320987 -11777 182527 81054
11482 166500 -213248 322814 -186652 225392 137820 329806 466521 -11494 182420 129531
11472 129531 237228 -11091 110486 -83780 295865 -80210 -86128 103547 216145 223885 236488
11461 236488 -858 -186166 -36939 189709 -30403 293675 220252 240977 -38081 61146 127727
11450 127727 219377 536475 54100 114439 -394882 43067 108734 161566 72264 250911 482894
11439 482894 -185813 90418 -51348 228921 -106588 571204 -81312 52552 96382 -129884
$$ packed form
11517a57249N5747m8054A38375k2774k6867P3272j3777n8708a306B02883b98875
11505C29937a22363C19437p155b02311A05139J84365q1049F3228K09972D9073
11494i6033H2882A5493J68370D015O791N2790L82856j25465a1777A82527H1054
11482A66500b13248C22814a86652B25392q7572J91986J36715a1494A82420n2889
11472A29531J07697a1091A10486h3780B95865h0210n918A03547J12598P740J2603
11461B36488h58j85308c6939A89709c0403B93675p3423K0725c8081F1146O6581
11450A27727R1650L17098E4100O0339c94882D3067O5667N2832G2264J78647K31983
11439D82894a85813I0418e1348B28921a06588E71204h1312E2552M3830a29884
$$ plain form
11428 -57470 195059 171415 269623 442424 42298 -107820 236198 320625 -170732 47802 90259
11417 90259 267222 47177 -50830 -227248 -222635 -12546 -88625 310365 263657 -53358 -115356
11406 -115356 82177 -45719 280848 182846 7273 -135819 167136 245140 -3057 177579 354836
11395 354836 -146709 129962 -33581 178628 -508455 85840 63828 -416730 -127268 -4577
11384 -29165 65748 59986 74013 193054 344439 -110074 -264436 113954 -168956 -136929 2689
11372 4988 316889 78626 -26189 -248185 111968 -40585 -115195 -317904 226384 53371 -14432
11360 96693 -74228 -145770 53631 199776 -82475 -125754 63800 391349 -129066 26918 -163865
11348 -93692 -215515 11649 -177351 122358 20169 -405112 -72258 -49633 -246582 111194
$$ packed form
11428e7470A95059k3644R8208J72801D2298a07820B36198Q4427a70732D7802M2457
11417I0259J76963D7177e0830j76418M613a2546p6079C10365m6708e3358o1998
11406a15356H2177d5719B80848r8002G273a35819A67136P8004c057A77579J77257
11395C54836a46709A29962c3581A78628e08455H5840k2012d16730a27268d577
11384b9165F5748n762J4027J19041J51385a10074j54362A13954a68956L2027B689
11372D988L11901G8626b6189k21996A11968d0585p4610k02709B26384E3371a4432
11360I6693g4228p1542E3631J46145h2475m3279F3800L27549a29066B6918a63865
11348i3692j21823A1649a77351A22358B0169d05112g2258K2625j96949A11194
$$ plain form
11337 -112900 62863 -167595 -71070 -140152 -49590 2116 258203 -95637 231144 -74428 266501
11325 55520 -110502 205106 -101832 -93079 -821 42027 -236453 -52298 -50840 26171 293881
11314 293881 168978 278310 -123868 -128072 -301587 23295 -96302 54908 -138411 89689 -74635
11302 -154709 -249590 86195 90467 -128087 82361 -45415 -97348 147202 -262993 112635 14839
11290 237984 -70323 -99084 -122008 -230054 -4248 -4301 -114298 -472100 -75258 59096 208950
11279 208950 -224934 174035 145340 32290 -213469 -298440 323564 144585 86016 221364
11269 221364 -161068 314015 85339 -324031 -292093 64315 -415710 -29552 195939 -96029
11258 209183 50679 -65261 -111024 -102753 109227 -7772 95740 -93313 -202435 166013 -78888
$$ packed form
11337a12900F2863a67595g1070o9082d9590B116K56087i5637B31144g4428B66501
11325E5520a10502B05106a01832Q753h21D2027b36453e2298J458B6171K67710
11314B93881j24903J09332a23868m204j73515B3295i6302E4908a38411H9689g4635
11302a54709r4881H6195M272a28087H2361d5415n1933A47202b62993A12635A4839
11290B37984g0323k8761k2924j08046d248n3j09997l57802g5258E9096J49854
11279B08950b24934A74035k8695C2290b13469q4971C23564A44585n8569J35348
11269B21364a61068C14015H5339c24031L1938F4315d15710b9552A95939i6029
11258B09183E0679f5261m5763Q271A09227g772I5740i3313j09122A66013g8888
$$ plain form
11246 164889 -217681 134918 -74912 -337128 96097 -150173 -9168 147535 -18326 74832 -367528
11234 64616 53257 129301 110972 145891 137826 -17168 55162 -195193 -367073 -158727 158246
11222 -302864 188241 -205301 -3 -175329 -117042 31914 245206 -103622 161228 -290802 -67776
11210 -181541 -63759 -62791 -237835 -21962 251889 -219049 -15168 43504 -242508 -116538 -233972
11199 -233972 -352775 -39060 84105 -8142 -327341 222504 -195477 -144273 53268 382085 -326684
11187 11112 394065 -20848 -184367 112705 189072 -60308 -25396 154495 175076 142472 -73729
11175 -109369 41190 174434 -61745 -115867 -186637 89028 -116023 -194517 -194065 -21308 46562
11163 -57470 -220495 -140666 -294588 224414 -121372 -395770 -21510 165681 -72867 -26255
$$ packed form
11246A64889b17681A34918g4912k62216I6097a50173i168A47535a8326G4832c67528
11234F4616j1359P6044j8329L4919q065a7168E5162a95193j71880a58727A58246
11222c02864A88241b05301cj75326N8287C1914K13292a03622A61228b90802f7776
11210a81541f3759R68j75044b1962B51889b19049a5168D3504b42508a16538j17434
11199b33972j18803c9060H4105h142l19199B22504a95477N1204E3268L28817c26684
11187A1112L82953b0848j63519A12705P6367f0308b5396A54495K0581l2604g3729
11175a09369D1190J33244f1745n4122p0770H9028a16023p8494M52b1308D6562
11163e7470j63025P9829j53922B24414a21372k74398b1510A65681g2867b6255
$$ plain form
11152 111427 -236673 -40637 218230 143968 -14853 -689529 -74475 301988 122644 15592
11141 155313 -164735 -165159 -21094 203260 -127178 33764 -105710 81646 79574 -112597 -77595
11130 -77595 121157 -32630 181363 12313 126054 220241 -148756 151501 369419 2195 193812
11119 193812 149896 -183223 -228478 21583 -155533 -66546 -18207 39497 -239716 156375 157092
11108 157092 145528 -63060 229623 -110791 32959 265698 18866 23908 169501 187249 361586
11097 361586 -295518 -47496 213156 89591 200827 139276 12054 8993 -230830 144034 224617
11086 224617 147474 83120 171130 20729 -71768 71492 143017 96040 -35100 56395 37011
11075 37011 102431 145084 30766 226055 -74590 172767 -66381 128794 75055 227556 312044
$$ packed form
11152A11427b36673d0637B18230p4262a4853o74676g4475C01988A22644A5592
11141A55313a64735m24b1094B03260a27178C3764a05710H1646k072a12597L5002
11130g7595A21157c2630A81363A2313J13741R4187a48756A51501K17918B195J91617
11119A93812m3916a83223m5255B1583a55533f6546a8207C9497b39716A56375P17
11108A57092j1564f3060B29623a10791C2959K32739A8866N042J45593J7748J74337
11097C61586b95518d7496B13156H9591J11236o1551A2054l061b30830A44034Q0583
11086B24617p7143o4354Q8010B0729g1768G1492P1525m6977c5100E6395j9384
11075C7011O5420M2653C0766J95289g4590A72767f6381A28794n3739J52501Q4488
$$ plain form
11064 312044 335808 202440 106376 321680 199387 43370 208258 101354 -6484 136123
11053 179946 61172 501970 454907 383151 452480 252583 433080 566268 538522 590300 730433
11042 730433 554625 568382 457142 704645 725135 645244 494457 648130 846584 506419
11032 506419 1008682 742788 871279 409378 626912 861473 692348 695197 971622 719221
11022 719221 1021172 491106 600651 515138 738462 829354 857975 971577 727593 674791
11012 674791 740795 614955 711834 647823 564162 624083 499770 590694 630856 776247 746776
11001 746776 508569 666223 653783 497044 512101 665206 542204 607303 438541 561500
10991 561500 698286 842874 582866 361739 623888 527607 785729 59416 541181 512584
$$ packed form
11064C12044K3764j33368r6064K15304j22293D3370J64888A01354f484A36123
11053A79946F1172M40798m7063p1756O9329j99897J80497J33188k7746N1778J40133
11042G30433j75808J3757j11240K47503K0490p9891j50787J53673J98454l40165
11032E06419N02263k65894J28491D09378K17534K34561j69125K849K76425k52401
11022G19221L01951D91106J09545q5513K23324R0892K8621J13602k43984n2802
11012F74791O6004j25840R6879o4011q3661N9921j24313R0924M0162J45391k9471
11001G46776k38207J57654j2440j56739J5057J53105j23002O5099j68762J22959
10991E61500J36786J44588k60008k21127K62149r6281K58122E9416M81765k8597
$$ plain form
10981 512584 583857 698554 269770 749561 574108 809526 445074 615868 1017758 555657
10971 555657 562563 566993 973862 1066782 819790 776079 890796 1190459 1224815 1021999 1369076
10960 1369076 967589 1251021 1405792 1599752 1739390 1995826 2137335 2546827 2431991
10951 2431991 2432333 2503754 2621777 2596967 2497896 1792039 1569232 1872514 1594088 1858643
10941 1858643 1740714 1333037 1299613 1395740 1473340 1374639 1496505 1400477 1036975 1155456
10931 1155456 918267 863026 623639 594257 156904 345773 347208 475219 273687 46645
10920 308915 136595 248076 245222 320867 -21289 90567 -109764 -16458 -68390 -159060 -60718
10908 -81867 109674 177721 355673 17264 4143 -113126 -84655 52438 -9073 9773 5372 44321
$$ packed form
10981E12584P1273J14697B69770M79791j75453K35418l64452J70794M01890m62101
10971E55657O906M430M06869R2920k46992m3711J14717K99663L4356k02816L47077
10960A369076m01487K83432J54771J93960J39638K56436J41509M09492j14836
10951B431991L42P1421J18023k4810r9071p05857k22807L03282k78426K64555
10941A858643j17929m07677l3424R6127P7600r8701J21866r6028l63502J18481
10931A155456k37189n5241k39387k9382A56904J88869J435J28011k01532D6645
10920C08915A36595J11481k854P5645b1289I0567a09764a6458n1932r0670f0718
10908h1867A09674O8047J77952A7264D143a13126K8471E2438i073I773m401L8949
$$ plain form
10896 44321 220944 -202712 165543 54885 -307113 -147844 137378 99007 -137654 -24112
10885 -75706 -152866 -58734 115033 -419904 103533 -111180 8541 170484 -445866 112445
10874 108183 -184034 -96826 40003 111828 33874 13817 49441 -78291 -265997 -112852 -155808
10863 -155808 75227 -3994 -272835 193816 84214 -158289 -273944 -7517 -210940 -128825 -41959
10851 -20602 118147 -2907 -46720 -75252 -93605 259112 -227985 -203944 118654 -208405 219225
10839 75899 21724 -318001 107244 -193166 -125604 2922 -10955 -33102 -170580 -26775 172892
10827 131456 -515 -71919 -111968 -74151 -72983 172161 -12584 -2005 -116606 -37585 115530 -14847
10814 -212162 93435 -239294 147754 -62799 -8502 83528 -219524 152100 -59814 -190016 -272624
$$ packed form
10896D4321J76623b02712A65543E4885c07113a47844A37378l8371a37654b4112
10885g5706p7160e8734A15033d19904A03533a11180H541J61943d45866A12445
10874A08183a84034Q7208D0003P1825C3874A3817L5624g8291j87706a12852m2956
10863a55808G5227c994k68841A93816H4214a58289j15655g517k03423Q2115d1959
10851b0602A18147b907m3813k8532j8353B59112b27985K4041A18654b08405B19225
10839G5899B1724c18001A07244a93166O7562B922a0955k2147j37478b6775A72892
10827A31456e15p1404m0049L7817J168A72161a2584b005j14601c7585A15530a4847
10814b12162I3435b39294A47754f2799h502H3528b19524A52100e9814j30202q2608
$$ plain form
10803 -272624 115993 160665 -35790 92387 52400 -162593 -35652 99084 -130181 -198811 4518
10791 227152 -53177 -6350 68392 214746 -150017 -188035 -236185 -46161 124416 -172408 -32327
10779 64672 10408 69522 -407937 -40450 -21557 -122812 38576 -34933 -15047 -162506 -100156
10768 -100156 -132396 46240 -352401 126235 -288425 -205445 -58332 -427204 -164704 -396947
10758 -396947 309855 -11169 -96720 -4230 -38209 95989 -32076 -77149 -171330 25060 -425672
10746 -214928 -20885 386852 -127846 99663 -6565 89646 54923 -53669 87408 -177063 -103127
10735 -103127 -78502 138843 52505 -113070 -171134 386385 -10313 124359 -75388 -170574 -198131
10724 -198131 -214473 -47490 237914 -276561 25371 -150527 277889 -27480 -76839 22870 -48048
$$ packed form
10803b72624A15993M4672c5790I2387l9987a62593c5652I9084a30181o8630D518
10791B27152e3177f350F8392J46354a50017l8018m8150d6161A24416a72408c2327
10779F4672A0408N9114d07937d0450J8893j01255C8576c4933a5047j47459O2350
10768a00156l2240D6240c52401A26235b88425Q2980e8332l68872a64704k32243
10758c96947C09855a1169q5551d230l3979I5989c2076m5073r4181B5060d25672
10746b14928b0885C86852a27846I9663f565H9646l4723e3669H7408a77063P3936
10735a03127K4625A38843E2505a13070n8064C86385a0313A24359g5388r5186k7557
10724a98131j6342d7490B37914b76561B5371a50527B77889b7480m9359B2870d8048
$$ plain form
10712 -278776 -82113 -374801 -157556 -40316 -166194 30599 -161159 -227058 27342 -75293 -269885
10701 -269885 81998 -84998 -360010 -26861 -269752 -129796 -3312 -269012 146910 -115979
10690 -37057 -3612 -19043 -25744 -101463 -101377 68395 -28098 79252 -223531 -132360 303876 -45221
10677 -176719 99617 -375007 -176519 34933 -122083 7756 -230417 -158893 106503 4259 -233103
10665 140624 -451894 -238135 12588 -307798 37514 -167596 139048 -197804 151910 -30397
10654 -43871 83490 128864 -104556 -22003 111615 -57723 -195719 -364779 345827 -110679
10643 102958 -79461 -169915 -111128 -228289 90257 -13765 37021 11923 -215669 -313912 231765
10631 -38287 -134781 -302340 -358019 -273544 48111 113572 -292585 -73575 99725 -186803 -101951
$$ packed form
10712b78776h2113k92688a57556d0316j25878C0599a61159o5899B7342g5293j94592
10701b69885H1998h4998k75012b6861k42891a29796c312k65700A46910a15979
10690c7057c612j5431o701p5719Q6F8395b8098G9252b23531R1171C03876d5221
10677a76719I9617c75007a76519C4933a22083G756b30417P1524A06503D259b33103
10665A40624d51894K13759A2588c07798C7514a67596A39048a97804A51910c0397
10654d3871H3490M5374a04556b2003A11615e7723j37996j69060C45827a10679
10643A02958g9461r0454N8787j17161I0257a3765C7021A1923b15669r8243B31765
10631c8287r6494j67559n5679Q4475D8111O5461b92585g3575I9725a86803Q4852
$$ plain form
10620 -101951 309746 -36435 -77621 258095 -183065 122157 -236092 -75306 131556 -11802
10609 -199796 -20967 -307416 24112 -203138 -40205 -314735 218646 26565 24575 -88970 149245
10597 148112 -128697 -4111 -18308 123141 -205310 -14955 46498 146819 -260585 -49910 -64982
10586 -64982 30380 -147413 26160 -96006 -32447 -65199 -50730 212318 70183 -118458 -84483
10575 -84483 -81279 95294 -26579 -36895 20363 -103693 120426 279762 62940 96631 -178434
10563 10855 -120669 -90497 -237673 -165256 103588 11000 -230101 -10696 -118591 -2545 -10896
10552 -10896 116339 -147662 27429 187934 47462 -57892 491167 -86126 -249467 -39883 286664
10540 -114569 -47142 -362636 -158474 139145 546053 -13433 -44239 214367 -399507 -224037
$$ packed form
10620a01951C09746c6435m1186B58095a83065A22157b36092g5306A31556a1802
10609a99796b0967k86449B4112b03138d0205k74530B18646B6565j990h8970A49245
10597A48112a28697d111j4197A23141b05310a4955D6498J00321b60585d9910j5072
10586f4982C0380a47413B6160i6006c2447l2752J4469B12318G0183a18458L3975
10575h4483L204I5294b6579j0316B0363a03693A20426J59336F2940L3691a78434
10563A0855a20669L0172j47176P2417A03588A1000b30101a0696j07895b545q351
10552a0896A16339a47662B7429J60505D7462e7892D91167h6126j63341c9883B86664
10540a14569d7142l15494a58474A39145M06908a3433l0806B14367c99507J75470
$$ plain form
10530 -224037 -86024 93900 61013 -197511 75071 -131017 70319 1013 -31365 233569 -97814
10518 -118912 -261283 128747 -300250 -92375 65 31909 247792 -374175 -374202 -190832 -233185
10507 -233185 -279712 113008 -328881 -59575 11717 -130850 -125735 61256 326242 175790 -95455
10495 -189674 131285 -265864 75827 7225 33440 -50430 -194866 -78290 -106715 83502 -20818
10483 -294913 -149985 122740 -119951 -111900 61849 437764 87656 65534 155043 -264175 -49213
10471 -31172 -174045 18362 -493395 228885 115892 27058 -321099 307072 243703 -185345
10460 327459 603686 433970 531304 105761 26362 58222 -77599 19976 -185664 35940 111141
10449 111141 -35875 126654 -96011 166516 -59060 -128855 -171138 120581 179703 139388 701
$$ packed form
10530b24037h6024I3900l2887a97511G5071a31017G0319A013c1365B33569i7814
10518a18912j42371A28747c00250i2375F5L1844K15883c74175k7J83370m2353
10507b33185m6527A13008c28881e9575A1717a30850N115F1256K64986j50452i5455
10495a89674A31285b65864G5827G225K6215e0430j44436g8290k8425H3502b0818
10483b94913J44928A22740a19951Q051F1849L75915H7656k2122Q9509b64175d9213
10471c1172j42873A8362d93395B28885j12993B7058c21099C07072o3369a85345
10460C27459K76227j69716R7334A05761B6362L1860g7599A9976a85664C5940P5201
10449A11141c5875A26654i6011A66516e9060o9795m2283A20581N9122m0315G01
$$ plain form
10437 62755 -49723 -153302 -40576 78357 -102908 3497 -103884 223813 -226185 -108892 60554
10425 -83059 -125491 -199150 110240 -294269 -154037 -168991 269608 -218638 -57349 186054
10414 -149841 -102636 12276 -151351 92388 311334 -142285 -314364 186632 -297415 64282
10403 -170643 70373 -319844 -22542 235868 -125318 68386 80025 488711 -55222 -102580 141809
10391 -75702 -112359 -131446 430685 125714 192369 242578 242584 -167674 -100409 -226762 5414 65412
10379 65412 -19917 -67876 -127162 -67124 -301394 126973 8794 -164904 -219893 379931 118148
10367 67420 181012 88029 132501 -208587 -47148 67171 -39001 285029 157885 320965 252632
10356 252632 338430 204403 122333 192003 135024 94360 192528 -19042 450729 631478 277707
$$ packed form
10437F2755d9723j03579d0576G8357a02908C497a03884B23813b26185a08892F0554
10425h3059m2432p3659A10240b94269J40232j4954B69608b18638e7349A86054
10414a49841M7205A2276a51351I2388K18946a42285j72079A86632b97415F4282
10403a70643G0373c19844b2542B35868a25318F8386J1639M08686e5222m7358A41809
10391g5702l6657j9087D30685A25714O6655N0209Oa67674O7265j26353E414N9998
10379F5412a9917m7959n9286O0038k34270A26973H794a64904n4989C79931A18148
10367F7420J13592H8029M4472b08587d7148F7171c9001B85029j27144J63080o8333
10356B52632Q5798j34027q2070O9670n6979m0664R8168a9042D50729J80749B77707
$$ plain form
10344 432870 707546 303402 158015 317264 168041 -190681 109367 378250 444275 253834
10334 253834 385895 55693 192447 147246 127573 358375 340472 233187 213053 556492
10324 556492 245212 598569 238590 310121 108944 -174607 177988 87243 225891 169136
10314 169136 87549 75034 241570 271759 -72037 -10503 235926 44561 -140681 -131276 -36784
10302 -14326 16107 14787 336590 6162 137682 -37897 72132 3060 167772 29682 278849
10291 278849 1612 -100656 -231422 -172601 141923 -142398 -182207 -93552 94608 -16909 -1228
10279 269802 -207839 -138164 148755 78574 -180292 64031 64647 221550 95628 100189 86037
10268 86037 30571 124653 -142324 -241843 -237393 33496 -448188 -354040 -2808 -21648 262350
$$ packed form
10344D32870K74676C03402j45387J59249j49223a90681A09367K68883O6025j90441
10334B53834J32061E5693J36754m5201j9673K30802j7903j07285k0134L43439
10324E56492B45212L53357B38590P1531A08944a74607A77988H7243J38648n6755
10314A69136q1587j2515J66536L0189g2037a0503B35926D4561a40681R405c6784
10302a4326A6107j320L21803F162J31520c7897G2132C060J64712B9682K49167
10291B78849A612a00656j30766N8821A41923a42398l9809Q8655I4608a6909a228
10279B69802b07839O9675A48755p0181a80292F4031O16J56903I5628M561j4152
10268H6037C0571R4082a42324r9519M450C3496d48188R4148b808j8840B62350
$$ plain form
10256 -70418 211103 46671 210017 -62680 101122 215899 -301569 134238 -85076 88710
10245 323229 -44060 362321 -76421 118571 -19571 103681 73608 -144798 336376 266208
10235 266208 223357 108261 -185397 213183 -203070 88644 156809 285664 -241781 -57322
10224 -231961 209951 -113383 47061 64926 -41561 -33372 -331323 -82907 4859 -328793 -78491
10212 14395 -281554 40778 44857 -532628 435936 -8512 -59244 73691 82851 230857 -9061 161393
10199 54268 120224 -57604 12945 -127342 -104342 -60447 -265923 -91720 162395 -374002 -45703
10187 -14698 -333990 -176544 -267024 -93176 -277112 159861 139930 -657365 -341518 -106438
10176 242589 70758 47977 -135847 -147170 129209 155884 -201599 -102143 -45024 101075 -234331
$$ packed form
10256g0418B11103D6671J63346f2680A01122J14777c01569A34238h5076H8710
10245C23229d4060C62321g6421A18571a9571A03681l0073a44798C36376p0168
10235B66208m2851A08261a85397B13183b03070H8644O8165J28855b41781e7322
10224b31961B09951a13383D7061J7865d1561Q189k97951h2907D859c28793g8491
10212A4395b81554D0778M079e32628D35936h512n0732G3691R160J48006i061A61393
10199E4268O5956e7604A2945a27342K3000M3895k05476i1720A62395c74002d5703
10187a4698l19292J57446r0480i3176j83936A59861j9931f57365L15847a06438
10176B42589G0758k2781a35847j1323A29209K6675b01599R9456d5024A01075b34331
$$ plain form
10164 -34763 -27172 253056 -191435 -305020 -117704 -309711 57905 -212322 -59016 -206245
10154 -206245 -290784 -79514 133820 -55094 89295 -134466 109693 104555 49055 -70255 -156116
10143 -156116 131842 -45687 -194143 109479 96042 -181311 -17681 -140641 -30017 33828
10132 -9637 -159203 -125128 -55687 155067 -194670 151498 -176760 -113336 -183425 -244828 -139590
10121 -139590 -189930 66123 -91202 -193299 -50220 -104221 -315593 36135 -29770 -59772 190990
10109 -93634 -57381 -189055 87817 -395314 -143653 -260756 65224 -75470 -67439 -237663 -223157
10098 -223157 -462409 1180 -146919 -396336 -462571 -56482 93501 -51937 -274027 55958 -87136
10086 162354 -273808 -24281 99429 -154067 -1539 -77886 -10766 -189569 -82365 -249678 14139
$$ packed form
10164c4763P591B53056a91435j13585a17704j92007E7905b12322e9016j47229
10154b06245q4539g9514A33820e5094H9295a34466A09693n138D9055g0255q5861
10143a56116A31842d5687j48456A09479j3437a81311a7681j22960c0017C3828
10132i637j49566L4075e5687A55067a94670A51498a76760O3424p0089o1403J05238
10121a39590n0340F6123i1202j02097e0220n4001k11372C6135b9770l0002A90990
10109i3634L6253j31674H7817c95314a43653j17103F5224g5470Q031j70224J4506
10098b23157k39252A180a46919k49417o6235e6482I3501e1937k22090E5958h7136
10086A62354b73808b4281I9429a54067a539p6347a0766j78803h2365j67313A4139
$$ plain form
10074 -80162 258868 -76566 84987 -5466 -135184 -129041 -30958 -66765 -93476 25366 32980 -296964
10061 192242 338428 4894 -125900 -10814 60470 284739 -596285 53150 -73586 189367 126894
10050 126894 -18347 -39895 244387 -77877 10204 -154 115039 116440 -185431 75228 20738
10038 -471386 -27583 -115845 -143522 128542 -139345 -354039 -320941 94362 -104920 113632
10027 -122220 134136 21572 -274640 98442 284015 -208522 66719 -113508 18192 -43204
10016 -157676 -66544 -55366 -169653 -250744 -17858 41882 236589 -194909 -91265 -3309 -107748
10005 -107748 -182039 -132267 -114237 9173 -226812 -77970 224821 183031 31473 -31024 -3791
9993 97835 163832 -116620 -190939 296609 53078 -304490 -80275 60520 -233160 -60100 -69241
$$ packed form
10074h0162B58868g6566H4987e466j29718O143c0958l5807k6711B5366P614b96964
10061A92242J46186D894a25900a0814F0470K24269e96285E3150g3586A89367o2473
10050A26894a8347k1548B44387g7877A0204a54A15039J401a85431G5228B0738
10038d71386b7583q8262k7677A28542a39345k14694L3098I4362a04920A13632
10027a22220A34136B1572b74640I8442J85573b08522F6719a13508A8192d3204
10016a57676f6544J1178j14287q1091a7858D1882J94707a94909i1265c309j04439
10005a07748p4291M9772J8030I173b26812g7970B24821m1790C1473c1024c791
9993I7835O5997a16620p4319B96609E3078c04490h0275F0520b33160f0100r141
$$ plain form
9982 -69241 -275087 -190181 102191 -86728 -337283 -70690 -47685 192417 -120509 184795 4653
9970 -195190 -14296 -106951 -54419 -315881 169921 -233453 -146516 -5395 217917 -88944 199101
9958 -122794 -248847 -2147 -183588 207777 -277143 -365160 12758 75949 -42897 -12178 -60781
9947 -60781 -149236 102790 -274003 295858 -166109 -89689 -220004 -160348 99037 -33396 121236
9935 -251016 -169558 174156 -74775 -248928 -327590 -18889 275549 47638 -68868 131561 35015
9923 -286835 -83294 114106 9081 -411124 -376909 -26913 71589 -2098 -425437 -76116 -214302
9912 -214302 43753 -184924 102917 -169339 -272305 -45440 -237225 -86410 -283805 -199659
9902 -199659 -167963 -42701 74464 -223707 -110766 3962 -156155 -5912 -338159 -100067 85499
$$ packed form
9982f9241k05846Q4906A02191h6728k50555g0690K3005A92417a20509A84795D653
9970a95190a4296r2655N2532k61462A69921b33453Q6937e395B17917h8944A99101
9958a22794j26053b147j81441B07777b77143q8017A2758O3191d2897a2178m8603
9947f0781q8455A02790b74003B95858a66109P6420j30315N9656I9037c3396A21236
9935b51016Q1458A74156g4775j74153p8662a8889B75549D7638f8868A31561C5015
9923b86835h3294A14106I081d11124L4215b6913G1589b098m23339g6116j38186
9912b14302D3753a84924A02917a69339j02966d5440j91785h6410j97395Q4146
9902a99659L1696d2701G4464b23707a10766C962a56155e912l32247a00067H5499
$$ plain form
9890 -116385 -28321 111221 63338 -69685 -253512 -32785 -101508 21978 318369 29062 -43756
9878 94360 67006 -58807 -36359 -97564 -164347 45266 -263600 -249567 233959 -90280 340362
9866 253202 -49444 71724 -56249 106732 -344399 -251918 -39930 309875 -301388 -7097 133578
9854 4772 -53461 198323 -107118 -213134 -415942 -149012 -176045 -224690 -64679 -301458 -245964
9843 -245964 -117934 -296048 72617 -202785 -104226 78277 -187639 -344335 -277373 -147452
9833 -147452 -131220 -81164 -276360 -261439 -95066 77735 -134921 -144299 162191 -115291 -202510
9822 -202510 -39963 -228546 180947 187869 -24826 -89904 44744 -219407 38183 57641 18421
9810 45536 -202824 29544 26172 73828 -11265 191810 -30803 161497 123498 -131721 223857
$$ packed form
9890a16385b8321A11221m7883f9685j83827c2785o8723B1978K96391B9062d3756
9878I4360k7354e8807K2448o1205o6783D5266b63600J4033B33959i0280C40362
9866B53202d9444G1724e6249A06732c44399R2481c9930C09875c01388g097A33578
9854D772e3461A98323a07118j06016k02808a49012k7033m8645f4679k36779N5494
9843b45964a17934j78114G2617b02785R8559G8277a87639j56696O6962J29921
9833a47452J6232N0056j95196J4921i5066G7735a34921r378A62191a15291q7219
9822b02510c9963j88583A80947O922b4826o5078D4744b19407C8183J9458A8421
9810D5536b02824B9544l372M7656a1265A91810c0803A61497l7999a31721B23857
$$ plain form
9798 -145217 -82541 -42649 76400 -178230 66196 -136301 -1529 83407 -128357 -320443 -85133
9786 -96437 -83315 160402 9608 -79570 216706 -319145 -189290 158767 -246017 -58175 -131921
9775 -131921 2913 -300911 -148687 -325510 -134694 -114892 -145438 -96991 61394 -182388 52024
9763 172790 -209318 -73372 38979 -172984 -158027 -80115 1334 -30794 38290 30699 -118267
9751 -219810 -218446 17045 -19568 9206 -73223 -337061 141495 -493529 -186999 -303545 -103942
9739 282645 -212846 -27541 250661 67931 128062 -172340 -133056 -197759 -151816 326090 -202058
9727 291484 -80684 -131612 -120746 -40911 -137513 12184 82171 187933 -315531 -450942 -302717
9716 -302717 -140012 123394 -32495 -165606 -111396 160879 -152502 86454 87780 -10880 108533
$$ packed form
9798a45217O2676L9892G6400a78230F6196a36301a529H3407a28357j92086h5133
9786i6437J3122A60402I608g9570B16706c19145J29855A58767b46017e8175p3746
9775a31921B913c00911a48687j76823a34694J9802l0546M8447F1394a82388E2024
9763A72790b09318g3372C8979a72984J4957P7912A334c0794C8290p591a18267
9751b19810J364A7045a9568I206g3223k63838A41495d93529a86999j16546a03942
9739B82645b12846b7541B50661F7931O0131a72340L9284o4703M5943C26090b02058
9727B91484h0684n0928J0866d0911r6602A2184O9987J05762c15531j35411J48225
9716c02717a40012A23394c2495j33111N4210A60879a52502H6454J326a0880A08533
$$ plain form
9704 -12944 -121133 -94811 -81839 143549 -310359 -307084 31776 9952 125358 199765 -35912
9692 -319351 -121491 -2926 160819 -125122 -3104 -420821 -368965 -191127 -58696 386410 -63772
9680 -173171 -339608 -52909 -34425 -115851 -111842 21183 -200997 130366 209042 -49391 -469014
9669 -469014 55308 -196246 -276068 -5298 89129 -269303 -49625 -68536 -183407 -176072 -19918
9657 -201897 74595 -77996 -59520 -59314 -118577 9958 -44634 -42337 -21496 -52884 -292992 64167
9644 284897 -61407 -237306 -103388 21357 -94553 -203971 379948 -76198 -333492 -81550 97023
9632 -140869 138643 -186068 -3095 -234363 -230008 -73333 -194001 -96 -288132 233650 -82972
9620 -72991 -63796 -317040 33689 -244313 -39302 -67984 -236599 -114557 -57859 -141067 -18639
$$ packed form
9704a2944j08189K6322J2972A43549c10359L275C1776I952J15406P4407c5912
9692c19351a21491b926A60819a25122c104m17717N1856J77838e8696C86410f3772
9680a73171j66437e2909J8484q1426M009B1183b00997A30366P8676d9391m19623
9669d69014E5308a96246p9822e298H9129b69303d9625j8911j14871P335a9918
9657b01897G4595g7996J8476K06n9263I958d4634K297K0841l1388k40108F4167
9644B84897f1407j75899a03388B1357i4553j09418C79948g6198k57294h1550I7023
9632a40869A38643a86068c095k31268M355g3333j20668i6k88036B33650h2972
9620g2991R195k53244C3689b44313c9302k8682j68615a14557N6698q3208a8639
$$ plain form
9608 -137709 -89093 -227662 -2970 -29774 -114932 -158080 -376224 139773 -319751 -60662 30043
9596 139419 -140896 64451 -157823 121740 -227230 64439 188398 -178609 -325861 133644
9585 -127711 -266504 -257277 -179697 364864 -574067 -95921 136362 94131 -219877 95273 -231943
9573 175163 49560 19865 -191465 -193209 -50996 -135072 77926 -208459 177121 -390072 -337012
9562 -337012 -4263 -27011 -127394 40811 135855 87411 133861 -292617 10042 54580 -100235
9550 163128 12179 41937 -122611 -72437 52185 9274 -181968 210605 -48732 -58276 -1591 47696
9537 -9553 -299208 -55587 21388 129483 24480 -231947 -295095 -9993 -163479 -156278 3170 -48139
9524 -568396 -85279 -85541 184788 -366095 -156820 -141710 -207971 -211973 -138838 7701 84916 -84246
$$ packed form
9608a37709M8616j38569b970k6804q5158m3148k18144A39773c19751f0662C0043
9596A39419a40896F4451a57823A21740b27230F4439J23959a78609j47252A33644
9585a27711j38793R227P7580C64864e74067i5921A36362m2231b19877I5273b31943
9573A75163D9560A9865a91465j744e0996q4076G7926b08459A77121c90072N3060
9562c37012d263k2748j00383D0811R5044m8444M6450b92617A0042M4538a00235
9550A63128A2179K9758a22611N0174E2185I274a81968B10605d8732r544a591D7696
9537i553k89655e5587B1388J08095B4480b31947o3148i993j53486P201C170d8139
9524e68396h5279k62A84788c66095a56820J5110o6261m002P3135G701P7215h4246
$$ plain form
9511 -337779 -83648 -75924 -42947 -14156 28158 -410380 -38144 45270 -280954 -135933 -38423
9499 -130150 93273 -144272 -12561 171664 20157 -140320 -103841 -416634 -29792 71203 271181
9488 271181 203232 -370900 -180089 -312162 -229794 -238075 126976 89120 -50429 -112894 -98583
9477 -98583 -229666 -9875 -197820 -246456 -56307 -221311 -49269 122217 -81630 3765 -161916
9465 103205 113458 -61850 -197600 -50426 232498 161542 -40447 -78121 -50440 56755 -178068
9453 -228208 85122 14285 106548 -32991 92486 -47162 217783 146284 46077 -24916 -439404
9442 -439404 -260864 156631 -151767 -106696 -316772 74300 114983 26459 -108910 -253654
9432 -253654 -72901 63876 189052 -42973 -106949 -41701 -92909 -37987 507762 -246697 88711
$$ packed form
9511c37779h3648P724L2977a4156B8158d10380c8144D5270b80954a35933c8423
9499a30150I3273a44272a2561A71664B0157a40320L6479l12793b9792G1203J99978
9488B71181o7949c70900a80089j32073Q2368q281A26976l7856e0429o2465J4311
9477i8583j31083i875j87945m8636e6307j65004d9269A22217h1630C765a61916
9465A03205J0253f1850j35750e0426B32498p0956d0447l7674K7681E6755a78068
9453b28208H5122A4285R2263c2991I2486d7162B17783p1499D6077b4916m14488
9442d39404J78540A56631a51767M5071k10076G4300M0683B6459a08910j44744
9432b53654g2901F3876J25176d2973o3976d1701n1208c7987E07762b46697H8711
$$ plain form
9420 205 147261 -81422 -18244 -540940 -318464 -262937 66608 -195993 -95261 126286 -193963
9408 -295366 -362099 -84963 -287199 -291078 -390977 -328058 -115254 -89150 30169 -176088 -76427
9396 -340375 80352 -94911 -163831 -26532 55154 -467536 370497 206154 -216450 100939 -47756
9384 -430573 -60223 -20268 51056 -146868 -464 -383296 -124244 -29394 222256 -111702 101551
9372 14743 -57297 -262516 94547 -241855 106478 -112288 -68851 -288148 -25286 -452924 -266299
9361 -266299 -154408 149114 -26170 62966 238806 -65991 -59865 -254168 29785 -21538 -9941
9349 -63289 -128935 16547 -298157 -81922 -233718 70847 -244324 -52183 81010 -120470 -90582
9338 -90582 267466 -50121 84191 -155895 -77448 133411 26629 -76582 -222283 -120188 325928
$$ packed form
9420B05J47056h1422a8244n22696K22476N5527F6608a95993i5261A26286a93963
9408b95366o6733h4963k02236l879r9899O2919a15254K6104C0169a76088g6427
9396c40375H0352i4911o8920b6532E5154d67536C70497j64343b16450A00939d7756
9384d30573f0223b0268E1056a46868d64l82832a24244b9394B22256a11702A01551
9372A4743e7297k05219I4547b41855A06478a12288M3437k19297b5286m27638J86625
9361b66299J11891A49114b6170F2966J75840f5991O126j94303B9785b1538i941
9349f3289o5646A6547b98157h1922j51796G0847b44324e2183H1010a20470K9888
9338i0582B67466e0121H4191a55895g7448A33411B6629g6582j45701J02095C25928
$$ plain form
9326 119056 -405622 53723 -169487 -160374 -285202 -5898 -88127 -89866 -138775 -164374 124730
9314 -299313 -273024 -32233 186903 -26975 -165889 74365 134357 178373 137916 16753 -289596
9302 222701 -35566 337102 -130746 -172551 30340 52575 -84939 -59895 -104215 -164328 -301730
9291 -301730 -96381 134534 -156091 86943 -173993 221917 98098 -239737 44779 -35187 -288381
9280 -288381 -146180 -261926 -36905 19078 -152242 -162845 -234882 6746 -54951 -105889 4769
9268 -268906 -362193 157498 -146767 -41547 81126 -71301 231003 -181416 -214048 -130887 241352
9256 140089 43893 -29329 176763 -199501 25332 -14378 -108338 22806 96649 44509 -392383
9244 -25852 183606 -65730 84902 74873 -249928 -438288 -37272 -153457 -15329 -248715 -21112
$$ packed form
9326A19056d05622E3723a69487R113j24828e898q2229j739m8909k5599A24730
9314b99313K6289c2233A86903b6975j38914G4365N9992M4016m0457A6753b89596
9302B22701c5566C37102a30746m1805C0340K2235h4939K5044m4320o0113j37402
9291c01730i6381A34534a56091H6943a73993B21917I8098b39737D4779c5187k53194
9280b88381J42201j15746c6905A9078a52242j0603p2037F746e4951n0938D769
9268b68906r3287A57498a46767d1547H1126g1301B31003a81416l2632Q3161B41352
9256A40089D3893b9329A76763a99501B5332a4378r3960B2806P3843D4509c92383
9244b5852A83606f5730H4902j0029b49928j88360c7272j16185a5329k33386b1112
$$ plain form
9232 -199369 -105650 228486 -21935 183649 3604 155485 160415 -339515 187381 64557 43754
9221 43754 35111 -161499 -124093 -164273 61168 -154371 -173228 -220960 -12370 -236827 132890
9209 -188565 -133662 152774 -206246 -341572 20163 -217037 -31844 -74305 102454 -5218 214594
9197 -417686 298005 -59392 -198734 -7843 83829 285964 -93314 -137086 234139 26181 -201531
9185 69259 -7546 -67157 229156 -351238 -98605 -47023 -321647 28653 146933 -231720 -88257
9173 -382095 101053 -8659 -8617 107232 -62943 -393230 -71813 -161957 -48287 -8596 -257437 65725
9160 -286098 -120369 -60563 -101248 222935 63304 198954 32246 -160643 -116791 -100227 -198710
9149 -198710 -177853 33488 -72141 63256 -57190 195719 -269287 -235254 -155773 -394548 82451
$$ packed form
9232a99369R3719B28486b1935A83649C604J51881M930c39515A87381F4557k0803
9221D3754q643a61499L7406m0180F1168a54371j8857m7732a2370k24457A32890
9209a88565N4903A52774b06246j35326B0163b17037c1844m2461A02454e218B14594
9197d17686B98005e9392j39342g843H3829K02135i3314m3772B34139B6181b01531
9185F9259g546n9611B29156c51238i8605d7023k74624B8653J18280b31720h8257
9173c82095A01053h659M2A07232f2943l30287g1813r0144d8287h596k48841F5725
9160b86098a20369N9806m0685B22935F3304J35650C2246a60643M3852J6564r8483
9149a98710K0857C3488g2141F3256e7190A95719b69287L4033P9481k38775H2451
$$ plain form
9137 -70873 268680 -84949 77496 74304 -411737 -205272 6778 189205 -171399 -210708 -247503
9126 -247503 -159992 -335583 288455 -345055 148586 -34052 40827 -74802 -223919 101361
9115 37679 -106363 60921 -193896 -52997 248182 -171521 -224837 -195919 33342 -40239 -158378
9104 -158378 54293 -401623 105469 -168005 22987 -32562 -30400 -133565 275649 233515 -188907
9092 -28002 33091 185330 36012 104390 -322434 1722 -394395 -283597 -232657 -34858 -113114
9081 -113114 340351 123828 9156 -247671 -357344 -4792 173875 -285044 -294149 -29772 -52695
9070 -52695 -191778 281848 363382 -80976 -235593 225267 -211438 -155519 -472879 72496 -139663
9058 -78977 -191561 -54509 -73511 -152119 -22044 -283767 327700 225597 195219 160098 16205
$$ packed form
9137g0873B68680h4949G7496l192d11737b05272F778J82427a71399l9309l6795
9126b47503Q7511j75591B88455c45055A48586c4052D0827g4802j49117A01361
9115C7679a06363F0921a93896e2997B48182a71521n3316K8918C3342d0239j18139
9104a58378E4293d01623A05469a68005B2987c2562K162j03165B75649m2134a88907
9092b8002C3091J52239C6012O8378c22434A722c94395J10798N0940c4858p8256
9081a13114C40351A23828I156b47671j09673d792A73875b85044r105b9772k2923
9070e2695j39083B81848Q1534h0976j54617B25267b11438N5919l17360G2496a39663
9058g8977j12584e4509j9002p8608b2044k61723C27700j02103l0378l5121A6205
$$ plain form
9046 9132 65665 147629 -185436 -100763 51915 -183249 254839 -129141 -281979 -194318 93368
9034 -226020 55340 -384846 -30617 -185980 -371370 61319 192826 -194717 357450 -13739
9023 -168182 15572 -39405 -21119 -310034 -6112 30954 2597 -23653 -255876 89265 24344 4893
9010 128594 -38576 156864 -233111 -163035 -6648 2964 -134524 -8976 -53011 7784 -67680 361385
8997 -251726 22333 17736 -308537 191734 -22647 -228586 4968 41273 -120496 -216053 2690
8985 -59063 -68880 51570 7164 -98929 48374 -60823 -228154 -196013 73437 195737 -200943 -191666
8973 -191666 -181804 -20576 -69593 26198 145068 133672 14062 -81541 -64198 -323951 58611
8961 191673 -83991 74265 -71454 124164 -277096 -69881 61526 47082 54468 44735 -169352
$$ packed form
9046I132N6533Q1964a85436Q4673E1915a83249B54839a29141j52838Q7661I3368
9034b26020E5340c84846c0617j55363j85390F1319J31507a94717C57450a3739
9023a68182A5572c9405J8286k88915f112C0954B597b3653k32223H9265B4344D893
9010A28594c8576A56864b33111P0076f648B964a34524h976m4035G784f7680C61385
8997b51726B2333m597c08537A91734b2647k05939D968L6305a20496r5557B690
8985e9063r817E1570G164i8929D8374f0823j67331L2141G3437J22300b00943R277
8973a91666R862b0576m9017B6198J18870j1396A4062h1541J7343k59753E8611
8961A91673h3991G4265g1454A24164b77096f9881F1526j4444P386r733a69352
$$ plain form
8949 74803 -92604 -5938 -339929 -118484 119773 65535 331786 -51931 -249769 94527 60846
8938 60846 -50152 -159532 13499 -159229 167812 27358 -297264 -160651 -175354 161250 -215891
8926 -179591 175682 114021 135269 195653 341063 -108693 3061 100413 -190996 -103591 274512
8914 125824 120518 483185 -136681 118762 291164 421955 239221 883450 1199380 1629552
8904 1629552 3304227 6849729 5472019 2614356 1212136 1117027 628181 617366 236246
8894 74157 360954 7471 5808 111874 -20758 687222 -115438 144242 -62026 -42133 131823
8882 79199 -149713 -83982 -272571 163897 -212911 281391 -65975 -193731 -362576 -59811
8871 111729 -58759 -76761 62655 79660 -400363 -256925 23334 -50075 -129263 -161057 198892
$$ packed form
8949G4803i2604e938l33991a18484A19773n4238K66251e1931j97838I4527l3681
8938F0846e0152j09380A3499a59229A67812B7358b97264J36613j4703A61250b15891
8926a79591A75682o1661K1248O0384J45410a08693C061R7352a90996Q7405B74512
8914A25824n306L62667a36681A18762J72402J30791j82734O44229L15930M30172
8904A629552J674675L545502j377710B614356A212136r5109m88846j0815B36246
8894G4157K86797G471j663J06066b0758F87222a15438A44242f2026J9893A31823
8882G9199a49713O5731j88589A63897b12911B81391f5975j27756j68845e9811
8871A11729e8759j8002F2655J7005d00363J43438B3334e0075p9188l1794A98892
$$ plain form
8859 78964 7120 197966 -90162 -122321 -116844 2565 124837 209382 -44282 35864 37174 55077
8847 55077 -399803 -485090 -27024 -86232 -12270 -98908 -155076 -6743 -175058 -12776 98338 95211
8835 95211 -166722 -181422 45847 61003 -56281 208925 206104 -144488 -293149 -183632 -86133
8823 74479 -76533 117424 -156746 -61186 -317862 -8004 -221662 90052 -20322 -245931 -208537
$$ packed form
8859G8964G120J90846i0162l2159N477B565J22272Q4545d4282C5864J310J7903
8847E5077c99803q5287b7024n9208a2270q6638n6168f743j68315a2776I8338l127
8835I5211a66722j4700D5847J5156e6281B08925k821a44488j48661J09517h6133
8823G4479g6533A17424a56746f1186k56676h004k13658I0052b0322k25609L7394
$$ [...]
##END NTUPLES=NMR SPECTRUM
##END=
