
##TITLE=AC1130_Calarca-Quindio-La_5898268_e3OA3m1I9C
##JCAMPDX= 6.0         $$ Bruker NMR JCAMP-DX V2.0
##DATA TYPE= NMR SPECTRUM
##DATA CLASS= NTUPLES
##ORIGIN= BRUKER
##OWNER= Administrator
$$ 1.72 TOPSPIN		Version 2.1
$$ 2012-04-03 15:39:08.500 -0500  Administrator@TOPSPIN
$$ Compression mode = diff/dup
##.OBSERVE FREQUENCY= 400.13188235
##.OBSERVE NUCLEUS= ^1H
##.ACQUISITION MODE= SIMULTANEOUS (DQD)
##.ACQUISITION SCHEME= undefined
##.AVERAGES= 64
##.DIGITISER RES= 22
##SPECTROMETER/DATA SYSTEM= spect
##.PULSE SEQUENCE= noesygpps1d.comp
##.SOLVENT NAME= COFFEE_meoh
##.SHIFT REFERENCE= INTERNAL, COFFEE_meoh, 1, 14.96855
##AUDIT TRAIL= $$ (NUMBER, WHEN, WHO, WHERE, PROCESS, VERSION, WHAT)
$$ ##TITLE= Audit trail, TOPSPIN		Version 2.1
$$ ##JCAMPDX= 5.01
$$ ##ORIGIN= Bruker BioSpin GmbH
$$ ##OWNER= Administrator
$$ $$ C:\Bruker\TOPSPIN/data/COFFEE/nmr/AC1130_Calarca-Quindio-La_5898268_e3OA3m1I9C/12/pdata/1/auditp.txt
$$ ##AUDIT TRAIL=  $$ (NUMBER, WHEN, WHO, WHERE, PROCESS, VERSION, WHAT)
(   1,<2012-04-03 15:39:03.718 -0500>,<Administrator>,<TOPSPIN>,<go>,<TOPSPIN 2.1>,
      <created by zg
	started at 2012-04-03 15:27:31.953 -0500,
	POWCHK enabled, PULCHK disabled,
       configuration hash MD5:
       1A 1E CE 29 27 FD 77 03 67 4E F0 E3 C4 B2 CB 90
       data hash MD5: 64K
       B0 D5 09 DE 1E 80 E7 B4 9A 29 31 99 CE EC AC E2>)
(   2,<2012-04-03 15:39:06.609 -0500>,<Administrator>,<TOPSPIN>,<proc1d>,<TOPSPIN 2.1>,
      <Start of raw data processing
       efp LB = 0.3 FT_mod = 6 PKNL = 1 PHC0 = 0 PHC1 = 0 SI = 128K 
       data hash MD5: 128K
       BC E1 3C 5D 14 0E 75 2C 4D 9A F9 F0 CE D2 19 B5>)
(   3,<2012-04-03 15:39:07.750 -0500>,<Administrator>,<TOPSPIN>,<proc1d>,<TOPSPIN 2.1>,
      <pk PHC0 = 33.71704 PHC1 = 0 
       data hash MD5: 128K
       E2 CA 93 E1 45 77 09 48 31 BC 74 E2 52 B8 16 3A>)
(   4,<2012-04-03 15:39:08.187 -0500>,<Administrator>,<TOPSPIN>,<proc1d>,<TOPSPIN 2.1>,
      <abs ABSG = 1 
       data hash MD5: 128K
       3F 18 07 B9 00 8A 3B BE 5A 08 AC DA 4E 76 0A B9>)
(   5,<2012-04-03 15:39:08.265 -0500>,<Administrator>,<TOPSPIN>,<proc1d>,<TOPSPIN 2.1>,
      <abs ABSG = 2 
       data hash MD5: 128K
       DE 6A 98 5B 2C 5A 92 54 3D 8B 64 A9 44 37 64 02>)
(   6,<2012-04-03 15:39:08.312 -0500>,<Administrator>,<TOPSPIN>,<proc1d>,<TOPSPIN 2.1>,
      <abs ABSG = 3 
       data hash MD5: 128K
       24 CC 32 2D 12 9A 79 91 21 DC 65 E1 09 26 59 23>)
(   7,<2012-04-03 15:39:08.375 -0500>,<Administrator>,<TOPSPIN>,<proc1d>,<TOPSPIN 2.1>,
      <abs ABSG = 4 
       data hash MD5: 128K
       D9 7B 8D E2 34 0C C6 45 55 14 79 9C D5 C2 CB 86>)
(   8,<2012-04-03 15:39:08.421 -0500>,<Administrator>,<TOPSPIN>,<proc1d>,<TOPSPIN 2.1>,
      <abs ABSG = 5 
       data hash MD5: 128K
       90 96 77 46 A6 76 85 75 FB 55 E8 4A 8C B6 35 25>)
$$ ##END=
$$ 
$$ $$ hash MD5
$$ $$ A1 4B 10 BD 8B C0 0A 95 A2 4F 81 4B 16 CF B6 8B
##$RELAX= 
##$RELAX= 
##$RELAX= 
##$RELAX= 
##$RELAX= 
##$RELAX= 
##$RELAX= 
##$RELAX= 
$$ [...]
##$TP07= 0
##$TPNAME0= <>
##$TPNAME1= <>
##$TPNAME2= <>
##$TPNAME3= <>
##$TPNAME4= <>
##$TPNAME5= <>
##$TPNAME6= <>
##$TPNAME7= <>
##$TPOAL= (0..7)
0.5 0.5 0.5 0.5 0.5 0.5 0.5 0.5
##$TPOFFS= (0..7)
0 0 0 0 0 0 0 0
##$TUNHIN= 0
##$TUNHOUT= 0
##$TUNXOUT= 0
##$USERA1= <user>
##$USERA2= <user>
##$USERA3= <user>
##$USERA4= <user>
##$USERA5= <user>
##$V9= 5
##$VALIST= <valist>
##$VCLIST= <CCCCCCCCCCCCCCC>
##$VD= 0
##$VDLIST= <DDDDDDDDDDDDDDD>
##$VPLIST= <PPPPPPPPPPPPPPP>
##$VTLIST= <TTTTTTTTTTTTTTT>
##$WBST= 2048
##$WBSW= 25
##$XGAIN= (0..3)
0 0 0 0
##$XL= 0
##$YL= 0
##$YMAX_a= 13705556
##$YMIN_a= -6594404
##$ZGOPTNS= <>
##$ZL1= 120
##$ZL2= 120
##$ZL3= 120
##$ZL4= 120
##$ABSF1= 14.96855
##$ABSF2= -5.583981
##$ABSG= 5
##$ABSL= 3
##$ALPHA= 0
##$AQORDER= 0
##$ASSFAC= 0
##$ASSFACI= 0
##$ASSFACX= 0
##$ASSWID= 0
##$AUNMP= <proc_prof1d_extract.lims>
##$AXLEFT= 0
##$AXNAME= <>
##$AXNUC= <1H>
##$AXRIGHT= 0
##$AXTYPE= 0
##$AXUNIT= <>
##$AZFE= 0.1
##$AZFW= 0.1
##$BCFW= 0
##$BC_mod= 0
##$BYTORDP= 0
##$COROFFS= 0
##$CY= 15
##$DATMOD= 1
##$DC= 0
##$DFILT= <>
##$DTYPP= 0
##$F1P= 0
##$F2P= 0
##$FCOR= 0.5
##$FTSIZE= 131072
##$FT_mod= 6
##$GAMMA= 0
##$GB= 0
##$INTBC= 1
##$INTSCL= 1
##$ISEN= 128
##$LB= 0.3
##$LEV0= 0
##$LPBIN= 0
##$MAXI= 10000
##$MC2= 0
##$MEAN= 0
##$ME_mod= 0
##$MI= 0
##$NCOEF= 0
##$NC_proc= -3
##$NLEV= 6
##$NOISF1= 0
##$NOISF2= 0
##$NSP= 0
##$NTH_PI= 0
##$NZP= 0
##$OFFSET= 14.96855
##$PC= 1
##$PHC0= 33.71704
##$PHC1= 0
##$PH_mod= 1
##$PKNL= yes
##$PPARMOD= 0
##$PPDIAG= 0
##$PPIPTYP= 0
##$PPMPNUM= 2147483647
##$PPRESOL= 1
##$PSCAL= 4
##$PSIGN= 0
##$PYNMP= <proc.py>
##$REVERSE= no
##$SF= 400.130004826332
##$SI= 131072
##$SIGF1= 0
##$SIGF2= 0
##$SINO= 400
##$SIOLD= 131072
##$SPECTYP= <>
##$SREGLST= <1H.CDCl3>
##$SSB= 0
##$STSI= 131072
##$STSR= 0
##$SW_p= 8223.68421052632
##$SYMM= 0
##$S_DEV= 0
##$TDeff= 65536
##$TDoff= 0
##$TI= <>
##$TILT= no
##$TM1= 0
##$TM2= 0
##$TOPLEV= 0
##$USERP1= <user>
##$USERP2= <user>
##$USERP3= <user>
##$USERP4= <user>
##$USERP5= <user>
##$WDW= 1
##$XDIM= 131072
##$YMAX_p= 495430661
##$YMIN_p= -487455942
##$CURPLOT= <Network HP LaserJet P1505>
##$CURPRIN= <$Network HP LaserJet P1505>
##$DFORMAT= <normdp>
##$LAYOUT= <+/1D_H.xwp>
##$LFORMAT= <normlp>
##$PFORMAT= <normpl>
##$SURQMSG= 1
$$ End of Bruker specific parameters
$$ ---------------------------------
##NTUPLES= NMR SPECTRUM
##VAR_NAME=  FREQUENCY,     SPECTRUM/REAL,   SPECTRUM/IMAG
##SYMBOL=    X,             R,               I
##VAR_TYPE=  INDEPENDENT,   DEPENDENT,       DEPENDENT
##VAR_FORM=  AFFN,          ASDF,            ASDF
##VAR_DIM=   131072,        131072,          131072
##UNITS=     HZ,            ARBITRARY UNITS, ARBITRARY UNITS
##FACTOR=    0.0627417313425165, 1,          1
##FIRST=     8223.62146879498, 7269,         -97012
##LAST=      0,             6584,            -96435
##MIN=       0,             -487455942,      0
##MAX=       8223.62146879498, 495430661,    0
$$ Real data points
##PAGE= N=1
##DATA TABLE= (X++(R..R)), XYDATA
$$ [...]
61718A2340683Q19481Q99187R85740J079067J177424J278058J377789J472510
61710B1429939J556724J623888J666334J674346J636169J540054J377258J144581
61702C3649293Q46548M97069J18823k60875o15999r26535j180339j372737j504856
61693B9250392j581801j611391j603204j567005j510717j439756j358423j271437
61685A7306658j183524j097853j015720r37770q64641p96222p31310o68970o09928
61676I400720n55920n07751m64777m26064l91108l59076l28551k99042k72080
61667E796351k49540k30937k13697j96259j79704j65651j53854j43037j33222
61658D130450j25498j19660j13767j06672r9574r4034q9448q3843p6801p0177
$$ plain form
61718 12340683 13160164 14059351 15045091 16124158 17301582 18579640 19957429 21429939
61710 21429939 22986663 24610551 26276885 27951231 29587400 31127454 32504712 33649293
61702 33649293 34495841 34992910 35111733 34850858 34234859 33308324 32127985 30755248 29250392
61693 29250392 27668591 26057200 24453996 22886991 21376274 19936518 18578095 17306658
61685 17306658 16123134 15025281 14009561 13071791 12207150 11410928 10679618 10010648 9400720
61676 9400720 8844800 8337049 7872272 7446208 7055100 6696024 6367473 6068431 5796351
61667 5796351 5546811 5315874 5102177 4905918 4726214 4560563 4406709 4263672 4130450
61658 4130450 4004952 3885292 3771525 3664853 3565279 3471245 3381797 3297954 3221153 3150976
61648C150976o5683o2932o0468n7806n5515n3775n1990m9848m7846m6373m5059
61637B553681m3553m2308m1845m1581m0256l7619l4853l3193l2595l2135l1188
61626B142555k9885k8729k8014k7456k6296k4160k1765k0222j9368j7615j4004
61615A885041r838p399p327q164q242p210n634m105l305m084o655r795j1601j1329
61601A780353j0124r768j0767j1980j2006j0591q629p116o473o563o834o505n180
61588A667817l341j791p22J26M63l19j685j908k28J888K560J865J238J256J406
61573A668625J848L683P090J0484J2203J2214J1564J0902J0233R543Q881Q010
61561A775280O528M379K017M5j345k691m842p953j1073j3156j4127j4519j4414
$$ plain form
61648 3150976 3085293 3022361 2961893 2904087 2848572 2794797 2742807 2692959 2645113 2598740 2553681
61637 2553681 2510128 2467820 2425975 2384394 2344138 2306519 2271666 2238473 2205878 2173743 2142555
61626 2142555 2112670 2083941 2055927 2028471 2002175 1978015 1956250 1936028 1916660 1899045 1885041
61615 1885041 1875203 1867804 1860477 1852313 1844071 1836861 1831227 1827122 1823817 1819733 1813078 1803283 1791682 1780353
61601 1780353 1770229 1760461 1749694 1737714 1725708 1715117 1706488 1699372 1692899 1686336 1679502 1672997 1667817
61588 1667817 1664476 1662685 1661963 1662089 1662552 1662233 1660548 1658640 1658412 1660300 1662860 1664725 1665963 1667219 1668625
61573 1668625 1670473 1674156 1681246 1691730 1703933 1716147 1727711 1738613 1748846 1758389 1767270 1775280
61561 1775280 1781808 1786187 1788204 1788249 1786904 1784213 1779371 1771418 1760345 1747189 1733062 1718543 1704129
61548A704129j3699j3056j3495j4692j4913j3119j0233p945p022p306q412r710
61536A570527j0230r430p675n577l425j582n26J18J666M530P144P900P556Q419
61522A569415J1378J5033J7680J9014J9781K0943K3437K7672L2808L7219M0116
61511A834496M2110M3969M5689M7244M9387N2818N6686N8884N8071N5141N2324
61500B396819N0908N0146M8493M5601M2551M0198L8090L5413L2329K9712K7996
61489B838256K6891K5845K4148K1001J6329J1303P209M006P07l108p154j1433
61477B954000j5990j9676k0618j8449j5003j2175j0087p794m897j654J730N222
61465B834609R004J3849K0622K8754L6199M1914M7538N5443O5642P6038Q5392
$$ plain form
61548 1704129 1690430 1677374 1663879 1649187 1634274 1621155 1610922 1602977 1595955 1588649 1580237 1570527
61536 1570527 1560297 1550867 1543192 1537615 1534190 1532608 1532082 1532200 1533866 1538396 1545540 1553440 1560996 1569415
61522 1569415 1580793 1595826 1613506 1632520 1652301 1673244 1696681 1724353 1757161 1794380 1834496
61511 1834496 1876606 1920575 1966264 2013508 2062895 2115713 2172399 2231283 2289354 2344495 2396819
61500 2396819 2447727 2497873 2546366 2591967 2634518 2674716 2712806 2748219 2780548 2810260 2838256
61489 2838256 2865147 2890992 2915140 2936141 2952470 2963773 2970982 2974988 2975695 2972587 2965433 2954000
61477 2954000 2938010 2918334 2897716 2879267 2864264 2852089 2842002 2834208 2829311 2827657 2829387 2834609
61465 2834609 2843613 2857462 2878084 2906838 2943037 2984951 3032489 3087932 3153574 3229612 3315004
61454C315004R4609J05002J16682J29223J42769J57688J73757J90542K08262K27560
61444D861098K48398K69657K90035L09035L26770L42676L54597L59347L54302
61435G715915L38366L11578K74385K27724J73676J15451N6389j019n5159j04383
61425I052923j46436j79294k02749k18644k28901k33725k32438k25591k15101
61416G170044k02324j87479j71116j54547j38040j20278j00923q2251o6389n1968
61406E894729l5815j7547o5J4627K7654M0542N2423O1552O8062P3468P8257Q1641
61394F339528Q3378Q4262Q4783Q4430Q2743Q0214P7912P6674P6805P8014P9393
61383G228136P9861P8953P7185P5419P3974P2275O9353O4700N8574N1520M3837
$$ plain form
61454 3315004 3409613 3514615 3631297 3760520 3903289 4060977 4234734 4425276 4633538 4861098
61444 4861098 5109496 5379153 5669188 5978223 6304993 6647669 7002266 7361613 7715915
61435 7715915 8054281 8365859 8640244 8867968 9041644 9157095 9213484 9212465 9157306 9052923
61425 9052923 8906487 8727193 8524444 8305800 8076899 7843174 7610736 7385145 7170044
61416 7170044 6967720 6780241 6609125 6454578 6316538 6196260 6095337 6013086 5946697 5894729
61406 5894729 5858914 5841367 5841302 5855929 5883583 5924125 5976548 6038100 6106162 6179630 6257887 6339528
61394 6339528 6422906 6507168 6591951 6676381 6759124 6839338 6917250 6993924 7070729 7148743 7228136
61383 7228136 7307997 7386950 7464135 7539554 7613528 7685803 7755156 7819856 7878430 7929950 7973787
61372G973787L5717K7522J9354J0603O93r688j8937k6355l2800l9189m5178m9841
61360G845688n2824n4072n3211n0136m5784m1267l6593l1292k5976k1877j8779
61349G413877j4918r619m929l478n321p960r312r550r874j0573j1128j1543j2322
61336G293350j2876j0935m441O342J9242L2596M6620O2576Q1397J03269J27696
61325G744836J53701J80439K07792K35678K62798K87235L08771L29201L49342
61316A0059793L66662L77002L77849L68653L48858L17598K75336K24203J66483
61307A2882437J04165M0183k1571p8412j30180j77782k21193k59397k91505l17223
61297A1529522l36712l50467l58949l62263l60721l55585l48293l38894l26344
$$ plain form
61372 7973787 8009504 8037026 8056380 8066983 8067676 8057988 8039051 8012696 7979896 7940707 7895529 7845688
61360 7845688 7792864 7738792 7685581 7635445 7589661 7548394 7511801 7480509 7454533 7432656 7413877
61349 7413877 7398959 7389340 7384411 7380933 7375612 7367652 7358340 7348790 7338916 7328343 7317215 7305672 7293350
61336 7293350 7280474 7269539 7265098 7271440 7290682 7323278 7369898 7432474 7513871 7617140 7744836
61325 7744836 7898537 8078976 8286768 8522446 8785244 9072479 9381250 9710451 10059793
61316 10059793 10426455 10803457 11181306 11549959 11898817 12216415 12491751 12715954 12882437
61307 12882437 12986602 13026785 13005214 12926802 12796622 12618840 12397647 12138250 11846745 11529522
61297 11529522 11192810 10842343 10483394 10121131 9760410 9404825 9056532 8717638 8391294
61288H391294l10580k93038k74855k55893k36137k16586j97836j79087j59639
61279F267643j40185j21492j03023q4168o5779m9004l3509j8508m557P436J8136
61268E672990K8751L8677M6405N2312N8083O3420O5959O4972O2637O0761N8658
61257F273625N5422N1952M9115M5908M1406L6863L3739L0900K6065J9204J2245
61246F676444N947o38p811j4632k0922k7782l5541m2971m9302n5453o2282o8865
61234F296192p3683p6687p9096q1574q3482q3745q1947p8612p4666p0461o5425
61223E446814n9107n2334m6431m1380l5950l0022k5445k3683k3631k2930k0843
61212E065058j8618j7458j7428j8249j9747k1095k0721j7824j3402r081n368j642
$$ plain form
61288 8391294 8080714 7787676 7512821 7256928 7020791 6804205 6606369 6427282 6267643
61279 6267643 6127458 6005966 5902943 5818775 5752996 5703992 5670483 5651975 5647418 5654854 5672990
61268 5672990 5701741 5740418 5786823 5839135 5897218 5960638 6026597 6091569 6154206 6214967 6273625
61257 6273625 6329047 6380999 6430114 6476022 6517428 6554291 6588030 6618930 6644995 6664199 6676444
61246 6676444 6682391 6681753 6673942 6659310 6638388 6610606 6575065 6532094 6482792 6427339 6365057 6296192
61234 6296192 6222509 6145822 6066726 5985152 5901670 5817925 5735978 5657366 5582700 5512239 5446814
61223 5446814 5387707 5335373 5288942 5247562 5211612 5181590 5156145 5132462 5108831 5085901 5065058
61212 5065058 5046440 5028982 5011554 4993305 4973558 4952463 4931742 4913918 4900516 4891435 4886067 4884425
61200D884425K446O589J0987J6997K5935L7520N0254O3285P7116R2270J07832
61189E375656J22008J33677J42871J49853J54322J55378J51669J41663J24460
61180F651557J00415P0528L5415m305m6592q7910j24987j56074j80384j97414
61170F060249k07538k12387k13628k11692k06375j98207j88351j77465j65524
61161D279082j52661j39455j26515j14485j04309r6534r0233q3556p5710o7794
61151C227830o1163n5351m8298l8705k7854j8678j2835q938m215K166Q226J2000
61139B974185J4143J6719K0036K2057K0952J7134J2444Q278M872J782j463m761
61127C106378p446r239j1140j4638j9908k5444k9651l2251l4026l5922l8414m1048
$$ plain form
61200 4884425 4886871 4893460 4904447 4921444 4947379 4984899 5035153 5098438 5175554 5267824 5375656
61189 5375656 5497664 5631341 5774212 5924065 6078387 6233765 6385434 6527097 6651557
61180 6651557 6751972 6822500 6857915 6853610 6807018 6719108 6594121 6438047 6257663 6060249
61170 6060249 5852711 5640324 5426696 5215004 5008629 4810422 4622071 4444606 4279082
61161 4279082 4126421 3986966 3860451 3745966 3641657 3545123 3454890 3371334 3295624 3227830
61151 3227830 3166667 3111316 3063018 3024313 2996459 2977781 2964946 2956008 2951793 2953959 2962185 2974185
61139 2974185 2988328 3005047 3025083 3047140 3068092 3085226 3097670 3105948 3110820 3112602 3111139 3106378
61127 3106378 3098932 3089693 3078553 3063915 3044007 3018563 2988912 2956661 2922635 2886713 2848299 2807251
61115B807251m2570m2289m1392m1814m3684m5141m4992m4154m3870m4001m4143
61104B329201m4966m6835m8165m7071m4088m1489m0185l9082l7413l5757l4503
61093A869647l3187l2050l2461l4700l6741l6650l5157l4354l4600l4340l2720
61082A492687l0545k8460k5805k2105j8455j6188j4848j2792r647o814n197l666
61070A298165p07L139N777O358O365P493R533J1116J1882J2818J4662J6884J8519
61057A422004J9338J9791K0119J9965J8975J7503J6474J6312J6323J5474J3598
61046A615876J1311Q825N726K098j122l407n452p914j0141j1051j0741j0129r560
61033A574319q878q510r086j0184j0800j1077j2080j3729j4537j3956j3419j4174
$$ plain form
61115 2807251 2764681 2722392 2681000 2639186 2595502 2550361 2505369 2461215 2417345 2373344 2329201
61104 2329201 2284235 2237400 2189235 2142164 2098076 2056587 2016402 1977320 1939907 1904150 1869647
61093 1869647 1836460 1804410 1771949 1737249 1700508 1663858 1628701 1594347 1559747 1525407 1492687
61082 1492687 1462142 1433682 1407877 1385772 1367317 1351129 1336281 1323489 1313842 1307028 1301831 1298165
61070 1298165 1297458 1300597 1306374 1312732 1319097 1326590 1336123 1347239 1359121 1371939 1386601 1403485 1422004
61057 1422004 1441342 1461133 1481252 1501217 1520192 1537695 1554169 1570481 1586804 1602278 1615876
61046 1615876 1627187 1636012 1641738 1643836 1642714 1639307 1633855 1625941 1615800 1604749 1594008 1583879 1574319
61033 1574319 1565441 1556931 1547845 1537661 1526861 1515784 1503704 1489975 1475438 1461482 1448063 1433889
61021A433889j5262j4902j2981j1042j0280j0602j1309j1803j1722j1077j0173
61010A302736r104p647n934m593l804k999j972j374j340n70J897M847O240O025
60996A282408O037P269Q823R724J0120J0321J0119R841J0713J3026J5094J5268
60984A408763J4382J4796J7321K0312K1870K1834K1456K2039K4245K7816L1505
60973A646339L3959L5228L6923M0230M4350M7581M9560N1432N3978N6792N9419
60962B155791O2209O5356O8105O9857P1428P4226P8612Q4013R0226R7414J05064
60951C022301J12295J19352J27598J37666J48633J59318J69336J78711J87723
60942D362933J97717K10776K27713K47541K69583K94838L24081L56046L89123
$$ plain form
61021 1433889 1418627 1403725 1390744 1379702 1369422 1358820 1347511 1335708 1323986 1312909 1302736
61010 1302736 1293632 1285985 1280051 1275458 1271654 1268655 1266683 1265309 1263969 1263399 1265296 1270143 1276383 1282408
60996 1282408 1288445 1295714 1304537 1314261 1324381 1334702 1344821 1354662 1365375 1378401 1393495 1408763
60984 1408763 1423145 1437941 1455262 1475574 1497444 1519278 1540734 1562773 1587018 1614834 1646339
60973 1646339 1680298 1715526 1752449 1792679 1837029 1884610 1934170 1985602 2039580 2096372 2155791
60962 2155791 2218000 2283356 2351461 2421318 2492746 2566972 2645584 2729597 2819823 2917237 3022301
60951 3022301 3134596 3253948 3381546 3519212 3667845 3827163 3996499 4175210 4362933
60942 4362933 4560650 4771426 4999139 5246680 5516263 5811101 6135182 6491228 6880351
60933F880351M24070M63511N09813N65435O34666P22442Q31038R59612J107157
60924A3098095J273882J459054J659465J871823K097329K344184K622459K925049
60916B9351340L199265L336454L211863K766696K069875J297575O40313K15048
60908D6088429M3670Q1184K36369L71017L21725k7326o65807j449596k181281
60899D2818384k713312k997252l064694k981238k812399k607756k395292k184076
60891B1062365j974667j768972j572075j389025j223530j078608r55485q51759
60883A0248244p62673o84454o15356n54128m99449m50982m09270l74012l43406
60874E554514l15509k89381k64870k42365k22880k07238j94755j83587j72738
$$ plain form
60933 6880351 7304421 7767932 8277745 8843180 9477846 10200288 11031326 11990938 13098095
60924 13098095 14371977 15831031 17490496 19362319 21459648 23803832 26426291 29351340
60916 29351340 32550605 35887059 39098922 41865618 43935493 45233068 45873381 46088429
60908 46088429 46132099 46213283 46449652 46820669 47142394 47115068 46449261 44999665 42818384
60899 42818384 40105072 37107820 34043126 31061888 28249489 25641733 23246441 21062365
60891 21062365 19087698 17318726 15746651 14357626 13134096 12055488 11100003 10248244
60883 10248244 9485571 8801117 8185761 7631633 7132184 6681202 6271932 5897920 5554514
60874 5554514 5239005 4949624 4684754 4442389 4219509 4012271 3817516 3633929 3461191
60865C461191j62823j54484j46986j39113j30732j22607j14974j07192r8861r0743
60855B192676q4146p9491p5737p1372o5890n9961n4332m9222m4988m2417m1493
60844A523627m0566l7960l4100l0850k8854k6985k4557k2505k1577k0726j8434
60833A216513j4840j1437r233q216q022p946o746l770j84K080K652K837L456L861
60819A161005L357K274J047m39j818j780J85K446K904J377q68l254n917q050q205
60804A144264o558n074m897n030m322l243k627k114j152l86l72J30K644O309Q688
60789A126260R277J0150J2757J5920J7768J8142J8050J7883J7359J6423J5237
60778A295226J3803J2461J2124J3151J4464J4674J3692J2473J1642J1168J0958
$$ plain form
60865 3461191 3298368 3143884 2996898 2857785 2727053 2604446 2489472 2382280 2283419 2192676
60855 2192676 2108530 2029039 1953302 1881930 1816040 1756079 1701747 1652525 1607537 1565120 1523627
60844 1523627 1483061 1445101 1411001 1380151 1351297 1324312 1299755 1277250 1255673 1234947 1216513
60833 1216513 1201673 1190236 1181003 1172787 1164765 1156819 1150073 1146303 1146119 1148199 1150851 1153688 1157144 1161005
60819 1161005 1164362 1166636 1167683 1167244 1165426 1163646 1163831 1166277 1169181 1170558 1169690 1166436 1160519 1152469 1144264
60804 1144264 1137706 1132632 1127735 1122705 1118383 1115140 1112513 1110399 1109247 1108861 1108489 1108619 1111263 1117572 1126260
60789 1126260 1135537 1145687 1158444 1174364 1192132 1210274 1228324 1246207 1263566 1279989 1295226
60778 1295226 1309029 1321490 1333614 1346765 1361229 1375903 1389595 1402068 1413710 1424878 1435836
60767A435836J0842J0174Q419O108M428L903M123M628N169N198M120K340J142
60754A506430J009P26j119m155o546p318p601r084j1691j3544j3352j2012j1425
60741A410318j2291j3770j4844j4983j3838j1681j0122j0789j2726j2688r110
60730A273476m433k134k454k692r37K225N338P542Q394P919P275P942R840J1409
60716A328710J1837J1975J2547J2882J2235J1258J1169J2161J3477J4561J5305
60705A468117J5642J5646J5633J5507J4422J1808Q549O349N982O624O951O446
60693A597676N612N252N694O570P184P102O439N649N057M442L089O44k044l490
60679A654876l346k911l471m799o053p248q664r529q896p521p202q221r093r058
$$ plain form
60767 1435836 1446678 1456852 1465271 1471379 1475807 1479710 1483833 1488461 1493630 1498828 1502948 1505288 1506430
60754 1506430 1507439 1508165 1507046 1502891 1496345 1489027 1481426 1472342 1460651 1447107 1433755 1421743 1410318
60741 1410318 1398027 1384257 1369413 1354430 1340592 1328911 1318789 1308000 1295274 1282586 1273476
60730 1273476 1269043 1266909 1264455 1261763 1260826 1263051 1268389 1275931 1284325 1292244 1299519 1307461 1317301 1328710
60716 1328710 1340547 1352522 1365069 1377951 1390186 1401444 1412613 1424774 1438251 1452812 1468117
60705 1468117 1483759 1499405 1515038 1530545 1544967 1556775 1565324 1571673 1577655 1584279 1591230 1597676
60693 1597676 1603288 1608540 1614234 1620804 1627988 1635090 1641529 1647178 1652235 1656677 1659766 1660410 1658366 1654876
60679 1654876 1651530 1648619 1645148 1640349 1634296 1627048 1618384 1608855 1599959 1592438 1585236 1577015 1567922 1558864
60665A558864q994r406r293p866n945m654m106m213n331p050p826p141o598p487
60651A462954q628q426p702q293r782j0097q927q086q393q547p579o265n305m041
60637A352883k005j89M75P20J712L027L156J564q04k928m667o243p558q318q645
60622A322180r125j0132j1254j1844j2103j2938j4437j5286j4476j2856j1918
60611A185811j1680j0915r158p137n331l501j620M5J883M538P326Q495P525N886
60597A172167M981M714M543M559M732M472L800L706M420M666L774L262M758P283
60583A235837Q242O628L776J424L32N63J719K958L808M881O858R102J0369J0553
60569A307050J0690J1381J2352J3347J4364J5161J5651J6511J8192J9548J9004
$$ plain form
60665 1558864 1549870 1540464 1531171 1523305 1517360 1512706 1508600 1504387 1499056 1492006 1484180 1477039 1470441 1462954
60651 1462954 1454326 1445900 1438198 1429905 1420123 1410026 1401099 1393013 1384620 1376073 1368494 1362229 1356924 1352883
60637 1352883 1350878 1350689 1351164 1351884 1353596 1356623 1359779 1361343 1360539 1357611 1352944 1346701 1339143 1330825 1322180
60622 1322180 1313055 1302923 1291669 1279825 1267722 1254784 1240347 1225061 1210585 1197729 1185811
60611 1185811 1174131 1163216 1154058 1146921 1141590 1138089 1136469 1136514 1138397 1142935 1150261 1158756 1166281 1172167
60597 1172167 1177148 1181862 1186405 1190964 1195696 1200168 1203968 1207674 1212094 1216760 1220534 1223796 1228554 1235837
60583 1235837 1244079 1250707 1254483 1255907 1256239 1256802 1258521 1261479 1265287 1270168 1277026 1286128 1296497 1307050
60569 1307050 1317740 1329121 1341473 1354820 1369184 1384345 1399996 1416507 1434699 1454247 1473251
60558A473251J6975J5511J5365J5115J3723J2120J1283J0349Q085N142L138K159
60546A602216P88j487l451m084m216n536q512j2011j4662j6106j6747j6880j6474
60533A482838j5661j4790j3816j2198r782p271n291l505j392O46J895K659L692
60520A408024M526L842J739J47L39J311J421N05n19j156j267l29J987M863P007
60505A432440P952P893O803M787K852K144K554L102L513M272N224N342M244K960
60491A496082K918M843Q663J3586J8094K0951K2618K4887K8763L3467L7880M2034
60479A754786M6561N1397N5725N8621N9225N6757N1086M2918L2989K1391Q307
60468B239763n069j6850k5547l0515l1796l0126k6730k2461j7362j1512n834j223
$$ plain form
60558 1473251 1490226 1505737 1521102 1536217 1549940 1562060 1573343 1583692 1591777 1596919 1600057 1602216
60546 1602216 1603004 1601517 1598066 1593982 1589766 1584230 1575718 1563707 1549045 1532939 1516192 1499312 1482838
60533 1482838 1467177 1452387 1438571 1426373 1416591 1409320 1404029 1400524 1399132 1399778 1401673 1404332 1408024
60520 1408024 1412550 1416392 1418131 1418278 1418617 1419928 1421349 1421854 1421335 1420179 1418912 1418583 1420570 1425433 1432440
60505 1432440 1440392 1448285 1455088 1459875 1462727 1464871 1467425 1470527 1474040 1478312 1483536 1488878 1493122 1496082
60491 1496082 1499000 1503843 1512506 1526092 1544186 1565137 1587755 1612642 1641405 1674872 1712752 1754786
60479 1754786 1801347 1852744 1908469 1967090 2026315 2083072 2134158 2177076 2210065 2231456 2239763
60468 2239763 2234694 2217844 2192297 2161782 2129986 2099860 2073130 2050669 2033307 2021795 2015961 2014738
60456B014738K741P275J2607J7611K1315K3965K6405K9286L3160L8427M4587N0270
60444B322387N4864N9697O6764P6545Q7971J00294J13907J28998J44642J60124
60434C316193J76441J95331K16909K39359K61132K82501L04468L27045L49436
60425E668815L71134L91344M06976M12090L99986L65918L08269K28463J30804
60416H683799K2121q9244j94816k86908l59378m08754m35214m42251m34961m18187
60406E636207l95672l70165l43648l17309k91550k66432k42170k19102j97345
60397B992814j77051j58966j44019j31903j20790j09181r7559q7377p8853p0982
60387A816133o3426n7054n2397m8808m5540m2436l9262l5592l1933k9506k8107
$$ plain form
60456 2014738 2017479 2024754 2037361 2054972 2076287 2100252 2126657 2155943 2189103 2227530 2272117 2322387
60444 2322387 2377251 2436948 2503712 2580257 2668228 2768522 2882429 3011427 3156069 3316193
60434 3316193 3492634 3687965 3904874 4144233 4405365 4687866 4992334 5319379 5668815
60425 5668815 6039949 6431293 6838269 7250359 7650345 8016263 8324532 8552995 8683799
60416 8683799 8705920 8616676 8421860 8134952 7775574 7366820 6931606 6489355 6054394 5636207
60406 5636207 5240535 4870370 4526722 4209413 3917863 3651431 3409261 3190159 2992814
60397 2992814 2815763 2656797 2512778 2380875 2260085 2150904 2053345 1965968 1887115 1816133
60387 1816133 1752707 1695653 1643256 1594448 1548908 1506472 1467210 1431618 1399685 1370179 1342072
60376A342072k5816k1969j8836j8500j9444j8486j5423j3182j3420j4432j3970
60365A148594j2044r948q305p188o830o999o592m953k904j707j640k115k352j489
60351A073528R76M047N663N104L977L937M606M825M794N356O083N930N281N491
60337A139598O570P107O618O288O906P699P726P215O753O302N820N871O711P426
60323A234610O877N052K770M69j902m060n256n093l991k702j643p12K97J259J762
60308A227737J705J618K037K751L132L173L515M390N272N918O994R014J1062J1428
60294A299746R712P736P868J0493J3441J4270J2941J1670J2165J3748J4747J4813
60282A443350J4747J4573J3204J0321P296N711N767O611P456P900P899Q036R186
$$ plain form
60376 1342072 1316256 1294287 1275451 1256951 1237507 1219021 1203598 1190416 1176996 1162564 1148594
60365 1148594 1136550 1126602 1118297 1111109 1104279 1097280 1090688 1085735 1082831 1081124 1079484 1077369 1075017 1073528
60351 1073528 1074504 1078551 1084214 1089318 1093295 1097232 1101838 1106663 1111457 1116813 1122896 1128826 1134107 1139598
60337 1139598 1146168 1153275 1159893 1166181 1173087 1180786 1188512 1195727 1202480 1208782 1214602 1220473 1227184 1234610
60323 1234610 1241487 1246539 1249309 1249778 1247876 1243816 1238560 1233467 1229476 1226774 1225131 1224419 1224716 1225975 1227737
60308 1227737 1229442 1231060 1233097 1235848 1238980 1242153 1245668 1250058 1255330 1261248 1268242 1277256 1288318 1299746
60294 1299746 1309458 1317194 1325062 1335555 1348996 1363266 1376207 1387877 1400042 1413790 1428537 1443350
60282 1443350 1458097 1472670 1485874 1496195 1503491 1509202 1514969 1521580 1529036 1536936 1544835 1552871 1562057
60269A562057J1354J3419J4518J5043J5614J5805J4658J1920P926K799l274r235
60257A672604j3663j6099j7174j7555j7426j6901j6163j5194j3969j2804j1897
60246A503759j0633q191m912k246j262j745k795l674l969l617k980k373j519j13
60232A453730J173J265L90J65J417L029L623L603M386O237Q108R502J1150J3445
60218A521223J5225J5049J3301J2145J3167J5553J7025J6469J5045J4624J5588
60207A684414J6789J7436J8223K0333K3891K7835L1117L3699L6432M0104M4451
60196A994724M8214N0643N2906N7217O4185P1873P8217Q3613Q9978R7683J05014
60185B794267J10957J16930J24745J33962J42733J50719J59479J69660J79312
$$ plain form
60269 1562057 1573411 1586830 1601348 1616391 1632005 1647810 1662468 1674388 1682314 1685113 1681839 1672604
60257 1672604 1658941 1642842 1625668 1608113 1590687 1573786 1557623 1542429 1528460 1515656 1503759
60246 1503759 1493126 1484935 1480023 1477777 1476515 1474770 1471975 1468301 1464332 1460715 1457735 1455362 1453843 1453730
60232 1453730 1454903 1456168 1456558 1456723 1458140 1461169 1464792 1468395 1472781 1479018 1487126 1496628 1507778 1521223
60218 1521223 1536448 1551497 1564798 1576943 1590110 1605663 1622688 1639157 1654202 1668826 1684414
60207 1684414 1701203 1718639 1736862 1757195 1781086 1808921 1840038 1873737 1910169 1950273 1994724
60196 1994724 2042938 2093581 2146487 2203704 2267889 2339762 2417979 2501592 2591570 2689253 2794267
60185 2794267 2905224 3022154 3146899 3280861 3423594 3574313 3733792 3903452 4082764
60176D082764J85996J89552J91523J92315J90394J84507J75344J64252J51291
60167E707938J35679J17724R8960Q0401O1664M2327K3257N938q982k1762l2379
60156F210765m0080m4223m5032m3218l8957l1647k0794p128P557K1965L6541N2583
60144F058332P0235Q8043J04725J20586J36464J51860J64971J74319J79532J80572
60134G429639J77198J69492J58198J43988J26797J06226Q2389N6164K8906K046
60124H481043k3439m7344o9665q9578j05498j16425j22720j25098j23441j17177
60114G540658j06468r2314p5612n6846l6624j5861M731K4874M4415O3140Q0832
60103G374925R6937J10181J19105J23138J22707J18265J09901R8094Q4185O9638
$$ plain form
60176 4082764 4268760 4458312 4649835 4842150 5032544 5217051 5392395 5556647 5707938
60167 5707938 5843617 5961341 6060301 6140702 6202366 6244693 6267950 6273888 6264906 6243144 6210765
60156 6210765 6170685 6126462 6081430 6038212 5999255 5967608 5946814 5939686 5947243 5969208 6005749 6058332
60144 6058332 6128567 6216610 6321335 6441921 6578385 6730245 6895216 7069535 7249067 7429639
60134 7429639 7606837 7776329 7934527 8078515 8205312 8311538 8393927 8450091 8478997 8481043
60124 8481043 8457604 8410260 8340595 8251017 8145519 8029094 7906374 7781276 7657835 7540658
60114 7540658 7434190 7341876 7266264 7209418 7172794 7156933 7161664 7186538 7230953 7294093 7374925
60103 7374925 7471862 7582043 7701148 7824286 7946993 8065258 8175159 8273253 8357438 8427076
60093H427076N5214M1196K7966J6129O437p7k474p35M266J2080K3358L8650N7237
60080H706323P7937J00534J25349J51839J78890K06549K36153K68370L02164L36291
60070A0690399L70865M06514M42587M77168N08710N36671N60401N78085N87497
60061A5158897N87613N78946N62134N36621N01287M56215M02966L42900K76117
60052A9403696K02841J25034M5428l4533j14337j92056k64011l27289l81287m25940
60042A8037546m59651m80199m86976m81416m65626m41445m10287l73004l30256
60033A4108686k83719k36218j89732j43912r7858n2933j2461K1314M8565P0101
60023A3231833Q5616R4248R5794R0693P9520O3000M2015J7185j0988m1188p1050
$$ plain form
60093 8427076 8482290 8523486 8551452 8567581 8574018 8573941 8571467 8570732 8574998 8587078 8610436 8649086 8706323
60080 8706323 8784260 8884794 9010143 9161982 9340872 9547421 9783574 10051944 10354108 10690399
60070 10690399 11061264 11467778 11910365 12387533 12896243 13432914 13993315 14571400 15158897
60061 15158897 15746510 16325456 16887590 17424211 17925498 18381713 18784679 19127579 19403696
60052 19403696 19606537 19731571 19776999 19742466 19628129 19436073 19172062 18844773 18463486 18037546
60042 18037546 17577895 17097696 16610720 16129304 15663678 15222233 14811946 14438942 14108686
60033 14108686 13824967 13588749 13399017 13255105 13157247 13104314 13091853 13113167 13161732 13231833
60023 13231833 13317449 13411697 13507491 13598184 13677704 13740704 13782719 13799904 13788916 13747728 13676678
60012A3676678r8464j23064j46177j69323j92652k14600k33250k48144k60268
60003A1990736k69799k74838k73434k66287k55949k43573k28147k09031j87409
59994I782269j64625j40747j15690r0180o4432l7346q399K0776M8258P4176R9436
59983I403496J22838J41587J54510J62767J67155J66545J59614J46691J29033
59974A0754236J07388Q2034N3484K2319j1060m5827q0238j12220j40259j63508
59964A0466349j81581j94624k03089k07016k05841j99216j87712j72373j53987
59955H760910j33163j10766q7768o4602m0958j6284R571L6172O2935Q9717J16682
59944H622446J43567J69529J94067K17419K39211K57175K68347K71524K67518
$$ plain form
60012 13676678 13578214 13455150 13308973 13139650 12946998 12732398 12499148 12251004 11990736
60003 11990736 11720937 11446099 11172665 10906378 10650429 10406856 10178709 9969678 9782269
59994 9782269 9617644 9476897 9361207 9271027 9206595 9169249 9160850 9181626 9229884 9304060 9403496
59983 9403496 9526334 9667921 9822431 9985198 10152353 10318898 10478512 10625203 10754236
59974 10754236 10861624 10943658 10997142 11019461 11008401 10962574 10882336 10770116 10629857 10466349
59964 10466349 10284768 10090144 9887055 9680039 9474198 9274982 9087270 8914897 8760910
59955 8760910 8627747 8516981 8429213 8364611 8323653 8307369 8316940 8353112 8416047 8505764 8622446
59944 8622446 8766013 8935542 9129609 9347028 9586239 9843414 10111761 10383285 10650803
59935A0650803K56953K39200K14053J83232J49133J12844P4355L4133o636m6975
59925A1861095q6074j22208j52921j76692j93701k04567k08990k06185j96217
59916A0313540j80248j59655j35536j09018q1402n3529k5371L263L1613N8062
59906I661719Q1411J01728J19782J35997J50168J61722J69776J73460J72857J69290
59896A1097910J63963J56550J46026J32755J18622J04983R1760P9012O8223O1139
59886A2220943N8255N9359O4803P5166R0311J10044J35250J66975K04455K45395
59876A3430956K88428L34007L82518M32463M81084N25772N64303N94535O14661
59867A7648727O23109O17487N94233N50280M85113M00733L00298J87657O7963
$$ plain form
59935 10650803 10907756 11146956 11361009 11544241 11693374 11806218 11880573 11914706 11908070 11861095
59925 11861095 11775021 11652813 11499892 11323200 11129499 10924932 10715942 10509757 10313540
59916 10313540 10133292 9973637 9838101 9729083 9647681 9594152 9568781 9572044 9603657 9661719
59906 9661719 9743130 9844858 9964640 10100637 10250805 10412527 10582303 10755763 10928620 11097910
59896 11097910 11261873 11418423 11564449 11697204 11815826 11920809 12012569 12091581 12159804 12220943
59886 12220943 12279198 12338557 12403360 12478526 12568837 12678881 12814131 12981106 13185561 13430956
59876 13430956 13719384 14053391 14435909 14868372 15349456 15875228 16439531 17034066 17648727
59867 17648727 18271836 18889323 19483556 20033836 20518949 20919682 21219980 21407637 21475600
59858B1475600n2528j67802k72993l64355m39334m97029n37876n62531n71697
59849A8009455n67156n51923n28311m96463m55985m08791l59022l09780k61116
59840A4070908k11803j61929j12597o3939j5215L2930P7799J16818J49378J75762
59830A4058112J95230K06199K07680J99205J79449J46435R9795M2185k2080q9245
59820A5222965j56730k22215k83156l37234l82790m18693m44134m58796m63125
59811A2056092m58477m46927m30630m10946l88109l62084l33785l05249k78419
59802H641466k53908k31139k09537j89256j70799j54437j40375j29118j21040
59793G041857j15463j10803j05902j00875r6158r1118q4303p5135o4869n5682
$$ plain form
59858 21475600 21423072 21255270 20982277 20617922 20178588 19681559 19143683 18581152 18009455
59849 18009455 17442299 16890376 16362065 15865602 15409617 15000826 14641804 14332024 14070908
59840 14070908 13859105 13697176 13584579 13520640 13505425 13538355 13616154 13732972 13882350 14058112
59830 14058112 14253342 14459541 14667221 14866426 15045875 15192310 15292105 15334290 15312210 15222965
59820 15222965 15066235 14844020 14560864 14223630 13840840 13422147 12978013 12519217 12056092
59811 12056092 11597615 11150688 10720058 10309112 9921003 9558919 9225134 8919885 8641466
59802 8641466 8387558 8156419 7946882 7757626 7586827 7432390 7292015 7162897 7041857
59793 7041857 6926394 6815591 6709689 6608814 6512656 6421538 6337235 6262100 6197231 6141549
59783F141549m9154m5630m4535m5013m6563m9389n3983o0130o6486p1395p3930
59772E535341p3937p1472o6669o0130n2815m5265l7376k9223k1699j5765j1000
59761E049990n617J726J0518J9342K8012L7826M9353O0773O9413P4748P8959Q4233
59749E559276R0307R5163R7354R6946R4488R0260Q4621P8274P1617O4348N6247
59738F478901M8076M1275L6912L5363L6789M1326M8755N8530P0392Q4619J01524
59727G082462J21006J42827J66990J93564K22483K53794K87857L24834L64151
59718I159968M04761M45665M85506N21649N50063N66146N65174N42255M92944
59709A3734131M15072L10663J86897N5757o8281j72887k52280l07363l41421l56482
$$ plain form
59783 6141549 6092395 6046765 6002230 5957217 5910654 5861265 5807282 5747152 5680666 5609271 5535341
59772 5535341 5461404 5389932 5323263 5263133 5210318 5165053 5127677 5098454 5076755 5060990 5049990
59761 5049990 5044373 5046099 5056617 5075959 5103971 5141797 5191150 5251923 5321336 5396084 5475043 5559276
59749 5559276 5649583 5744746 5842100 5939046 6033534 6123794 6208415 6286689 6358306 6422654 6478901
59738 6478901 6526977 6568252 6605164 6640527 6677316 6718642 6767397 6825927 6896319 6980938 7082462
59727 7082462 7203468 7346295 7513285 7706849 7929332 8183126 8470983 8795817 9159968
59718 9159968 9564729 10010394 10495900 11017549 11567612 12133758 12698932 13241187 13734131
59709 13734131 14149203 14459866 14646763 14702520 14634239 14461352 14209072 13901709 13560288 13203806
59699A3203806l54243l38735l15727k89177k59728k27009j91987j56429j21247
59690A0949524q6542n2623j9896J2024M4051P6397J08326J39403J70304K02145
59680A1543113K35281K69210L03528L38677L75659M15091M56756N00109N45168
59671A4982592N92713O43597O97911P54762Q12556Q69593R24605R77031J026576
59662B2281936J072289J111821J141541J157669J157979J143090J116151J081093
59654C1263569J041233R99631R60210R27573R05481Q95667Q97729R09270R26111
59645C9726474R43336R56725R62776R57367R35494Q93286Q29866P46682O45865
59636D7597871N30253M04797K76508J52525L8646o0291j39702j95929k27593k35641
$$ plain form
59699 13203806 12849563 12510828 12195101 11905924 11646196 11419187 11227200 11070771 10949524
59690 10949524 10862982 10810359 10790463 10802487 10846538 10922935 11031261 11170664 11340968 11543113
59680 11543113 11778394 12047604 12351132 12689809 13065468 13480559 13937315 14437424 14982592
59671 14982592 15575305 16218902 16916813 17671575 18484131 19353724 20278329 21255360 22281936
59662 22281936 23354225 24466046 25607587 26765256 27923235 29066325 30182476 31263569
59654 31263569 32304802 33304433 34264643 35192216 36097697 36993364 37891093 38800363 39726474
59645 39726474 40669810 41626535 42589311 43546678 44482172 45375458 46205324 46952006 47597871
59636 47597871 48128124 48532921 48809429 48961954 49000600 48940309 48800607 48604678 48377085 48141444
59626D8141444k21781j86971j31653n7330L2631J34223K44737L63075M88249O18143
59616D9424767P49675Q79170J001996J112469J204645J272722J310014J308189
59608E8263647J258666J155107R94700P78346N11413K04730j26061m62760p86669
59599F1791119j080176j329001j524668j664942j752033j790805j788240j752917
59591D9108337j693928j620463j542565j471244j416891j387117j385032j407812
59583C7183285j446285j487558j519996j536437j533458j509679j466189j407297
59575B5276386j338600j263993j185510j105468j026913r51696q79735q10775
59567A6713696p45622o84992o28397n75228n25940m81084m39808m00649l63481
$$ plain form
59626 48141444 47919663 47732692 47601039 47543709 47576340 47710563 47955300 48318375 48806624 49424767
59616 49424767 50174442 51053612 52055608 53168077 54372722 55645444 56955458 58263647
59608 58263647 59522313 60677420 61672120 62450466 62961879 63166609 63040548 62577788 61791119
59599 61791119 60710943 59381942 57857274 56192332 54440299 52649494 50861254 49108337
59591 49108337 47414409 45793946 44251381 42780137 41363246 39976129 38591097 37183285
59583 37183285 35737000 34249442 32729446 31193009 29659551 28149872 26683683 25276386
59575 25276386 23937786 22673793 21488283 20382815 19355902 18404206 17524471 16713696
59567 16713696 15968074 15283082 14654685 14079457 13553517 13072433 12632625 12231976 11868495
59558A1868495l29410k98908k71263k46023k23828k05293j89995j77168j66902
59549I759705j60022j57155j58194j62247j67588j72246j75275j77159j78453
59540H251366j78402j75663j70094j62931j55206j46850j37439j26939j15411
59531F882431j02880q9912p7645o6563n5812m4256l1875j9518p787L130J2915
59520F402228K1126K7818L3486L8474M2812M6537M9815N2903N6355O0884O6543
59509F898981P2503P8394Q5428R5203J07576J20752J33506J46271J59904J74566
59499H073084J90305K07700K27146K48158K70050K92744L16303L40159L63515
59490A0529164L86154M08122M28836M47054M61607M71683M76567M75610M68578
$$ plain form
59558 11868495 11539085 11240177 10968914 10722891 10499063 10293770 10103775 9926607 9759705
59549 9759705 9599683 9442528 9284334 9122087 8954499 8782253 8606978 8429819 8251366
59540 8251366 8072964 7897301 7727207 7564276 7409070 7262220 7124781 6997842 6882431
59531 6882431 6779551 6689639 6611994 6545431 6489619 6445363 6413488 6393970 6386183 6389313 6402228
59520 6402228 6423354 6451172 6484658 6523132 6565944 6612481 6662296 6715199 6771554 6832438 6898981
59509 6898981 6971484 7049878 7135306 7230509 7338085 7458837 7592343 7738614 7898518 8073084
59499 8073084 8263389 8471089 8698235 8946393 9216443 9509187 9825490 10165649 10529164
59490 10529164 10915318 11323440 11752276 12199330 12660937 13132620 13609187 14084797 14553375
59481A4553375M55796M38058M16438L91792L64115L32607K96737K57254K16216
59472A7722388J76267J39822J08355Q2223O1476M6892L9634L9951M6975O0004
59462A8523987P8911J02828J29330J55539J79105J97152K05407J99937J79647
59453A9951843J45855R9732M1343k8665j07723j91947k77311l60009m36536n03996
59443A8332586n60084o02793o30730o43863o43463o31341o09498n80321n46336
59434A2884157n09547m71231m32152l92444l51827l10779k71155k34550k00249
59425I710223j66086j31412r7892o6934l7567p670K3550N5149Q5960J15688J44800
59414I627809J73833K02724K30647K56840K81405L04557L24900L39450L45876
$$ plain form
59481 14553375 15009171 15447229 15863667 16255459 16619574 16952181 17248918 17506172 17722388
59472 17722388 17898655 18038477 18146832 18229055 18290531 18337423 18377057 18417008 18463983 18523987
59462 18523987 18602898 18705726 18835056 18990595 19169700 19366852 19572259 19772196 19951843
59453 19951843 20097698 20197430 20238773 20210108 20102385 19910438 19633127 19273118 18836582 18332586
59443 18332586 17772502 17169709 16538979 15895116 15251653 14620312 14010814 13430493 12884157
59434 12884157 12374610 11903379 11471227 11078783 10726956 10416177 10145022 9910472 9710223
59425 9710223 9544137 9412725 9314833 9247899 9210332 9202662 9226212 9281361 9367321 9483009 9627809
59414 9627809 9801642 10004366 10235013 10491853 10773258 11077815 11402715 11742165 12088041
59405A2088041L43968L34427L16880K89748K51604K02206J42882P6637P360o1905
59395A3991848j29792j95401k56653l10459l54281l87222m09956m24055m31058
59386A1092971m31808m26819m17179m04369l89034l70866l50152l28432l06915
59377G667397k85260k62862k40498k19479j99817j80609j61875j44650j29239
59368E843108j14605r9614q4048o8422n3767m1438l1929k3674j4303l503O402
59357E314207J3416J8543K4645L3273M3360N2671N9590O3431O3888O1190N6983
59346E805197N4388N6195O2670P1700Q1510R2523J05995J21551J37022J50335
59336F739086J60654J68327J75215J84883K00663K22803K48550K75543L04096
$$ plain form
59405 12088041 12432009 12766436 13083316 13373064 13624668 13826874 13969756 14046393 14053753 13991848
59395 13991848 13862056 13666655 13410002 13099543 12745262 12358040 11948084 11524029 11092971
59386 11092971 10661163 10234344 9817165 9412796 9023762 8652896 8302744 7974312 7667397
59377 7667397 7382137 7119275 6878777 6659298 6459481 6278872 6116997 5972347 5843108
59368 5843108 5728503 5628889 5544841 5476419 5422652 5381214 5349285 5325611 5311308 5307805 5314207
59357 5314207 5327623 5346166 5370811 5404084 5447444 5500115 5559705 5623136 5687024 5748214 5805197
59346 5805197 5859585 5915780 5978450 6050150 6131660 6224183 6330178 6451729 6588751 6739086
59336 6739086 6899740 7068067 7243282 7428165 7628828 7851631 8100181 8375724 8679820
59327H679820L35715L70688M08216M48098M91107N37928N88430O41672O96010
59318A3197684P49441Q00399Q47855Q90102R23913R45669R53249R46440R25820
59309B1180572Q91970Q45836P89353P25600O58281N90674N24623M60581L98446
59300B7065936L37896K77864K16552J52544Q5270J4055o2337j44010k28242l10673
59290B7404855l88310m60507n27059n86496o36874o77770p10812p38296p61434
59281B1917297p79829p92424p98716p98923p93029p80342p60422p34193p03675
59272A4975744o70661o35867n99128n60274n20012m80176m42507m07005l72112
59263A0288002l37145l03661k73439k45843k18659j91334j65680j43047j22355
$$ plain form
59327 8679820 9015535 9386223 9794439 10242537 10733644 11271572 11860002 12501674 13197684
59318 13197684 13947125 14747524 15595379 16485481 17409394 18355063 19308312 20254752 21180572
59309 21180572 22072542 22918378 23707731 24433331 25091612 25682286 26206909 26667490 27065936
59300 27065936 27403832 27681696 27898248 28050792 28136062 28150117 28087780 27943770 27715528 27404855
59290 27404855 27016545 26556038 26028979 25442483 24805609 24127839 23417027 22678731 21917297
59281 21917297 21137468 20345044 19546328 18747405 17954376 17174034 16413612 15679419 14975744
59272 14975744 14305083 13669216 13070088 12509814 11989802 11509626 11067119 10660114 10288002
59263 10288002 9950857 9647196 9373757 9127914 8909255 8717921 8552241 8409194 8286839
59254H286839j01887q1872o4030m9061l5696k2097p371Q291K4061L8869N1916
59243H047962O3212P3443Q3034R1473R7728J01309J02791J03180J02848J01203
59233H968183R7448R1512Q4301P7227P1607O8206O7014O7693P0405P5887Q4348
59222I823831R4697J05426J16040J27130J39227J52148J64971J75766J81566J79919
59212A1260721J70686J55484J35351J10278Q1200N0681K0505j0030m1883p3261
59202A1859732j00446j21258j36153j46188j51613j52691j50188j44365j34681
59193A0622149j21360j06332r1705p7903o4018m9633l5496k2769j2263m257J531
59182A0037944N813R300J2553J6381K1872K9589L9091M9762O1861P6332R3920
$$ plain form
59254 8286839 8184952 8103080 8039050 7989989 7954293 7932196 7924825 7933116 7957177 7996046 8047962
59243 8047962 8111174 8184617 8267651 8359124 8456852 8558161 8660952 8764132 8866980 8968183
59233 8968183 9065631 9157143 9241444 9318671 9390278 9458484 9525498 9593191 9663596 9739483 9823831
59222 9823831 9918528 10023954 10139994 10267124 10406351 10558499 10723470 10899236 11080802 11260721
59212 11260721 11431407 11586891 11722242 11832520 11913720 11964401 11984906 11974876 11932993 11859732
59202 11859732 11759286 11638028 11501875 11355687 11204074 11051383 10901195 10756830 10622149
59193 10622149 10500789 10394457 10302752 10224849 10160831 10111198 10075702 10052933 10040670 10036413 10037944
59182 10037944 10043757 10053057 10065610 10081991 10103863 10133452 10172543 10222305 10284166 10360498 10454418
59171A0454418J15102J40543J70865K05801K44134K84553L26075L67665M08056
59162A2717212M46026M80253N08599N27861N34474N25291M97914M51237L86097
59153A7074964L04964K10569J05235q097j24834k39425l46983m43711n26159n91240
59143A5415283o37385o65218o76721o74042o59368o35484o05686n72781n38269
59134I750329n02633m66463m31052l97654l66371l36295l07035k79574k55110
59125F408142k33415k13186j94006j76930j62793j50589j38369j25296j12082
59116D901476r9544q7604p5956o5045n5665m7784m0364l2569k4719j7672j1397
59105D343157m798K903J1127J8779K5773L3046M1126M9339N6630O2667O7954P3296
$$ plain form
59171 10454418 10569520 10710063 10880928 11086729 11330863 11615416 11941491 12309156 12717212
59162 12717212 13163238 13643491 14152090 14679951 15214425 15739716 16237630 16688867 17074964
59153 17074964 17379928 17590497 17695732 17687635 17562801 17323376 16976393 16532682 16006523 15415283
59143 15415283 14777898 14112680 13435959 12761917 12102549 11467065 10861379 10288598 9750329
59134 9750329 9247696 8781233 8350181 7952527 7586156 7249861 6942826 6663252 6408142
59125 6408142 6174727 5961541 5767535 5590605 5427812 5277223 5138854 5013558 4901476
59116 4901476 4801932 4714328 4638372 4573327 4517662 4469878 4429514 4396945 4372226 4354554 4343157
59105 4343157 4338359 4341262 4352389 4371168 4396941 4429987 4471113 4520452 4577082 4639749 4707703 4780999
59093D780999P9326Q6163R3241R9864J06007J12064J17771J22196J25079J27362
59083E850072J29699J31226J30479J26875J20508J11382J00064Q8376P7905O8021
59073F934607N6926M4555L2860K3133J4942Q242M581N009Q288J2671J8342K6636
59061G190792L7609N0070O3498P8313R4402J10918J27637J45220J63780J82301
59051H244540J99903K16815K33806K51272K68998K86025L00689L11581L18585
59042A0632214L22093L21043L12794K95425K69256K35692J95483J48797R6378
59033A2829175L9887j8401p5729j29235j77056k18842k54826k84798l08385l25947
59023A1075843l38575l47408l53242l56418l56765l54075l48821l41889l33286
$$ plain form
59093 4780999 4860325 4946488 5039729 5139593 5245600 5357664 5475435 5597631 5722710 5850072
59083 5850072 5979771 6110997 6241476 6368351 6488859 6600241 6700305 6788681 6866586 6934607
59073 6934607 6991533 7036088 7068948 7092081 7107023 7115265 7119846 7124855 7133143 7145814 7164156 7190792
59061 7190792 7228401 7278471 7341969 7420282 7514684 7625602 7753239 7898459 8062239 8244540
59051 8244540 8444443 8661258 8895064 9146336 9415334 9701359 10002048 10313629 10632214
59042 10632214 10954307 11275350 11588144 11883569 12152825 12388517 12584000 12732797 12829175
59033 12829175 12869062 12850661 12774932 12645697 12468641 12249799 11994973 11710175 11401790 11075843
59023 11075843 10737268 10389860 10036618 9680200 9323435 8969360 8620539 8278650 7945364
59014G945364l22145l08582k94615k82144k70753k58704k45569k32466k19998
59005E510388k07545j94752j82185j70113j57843j45048j32706j21958j12793
58996D085445j04543r6859q9474q1665p3117o4921n8740n4977n2592n0747m9853
58985C307957n0678n2906n5089n5802n4652n2160m8917m5206m1436l8410l6479
58974B776222l4497l0598k4480j8210j3981j1527q602l867J566N638P598Q262
58962B653524Q508Q186O600L689M57j745k225j223N10K105K859K739K652L604
58948B690240N478P244Q586J0385J3024J5079J4786J2276R242O654M090J256j119
58935B797221k400k884l000k571j531n83l65m83l3J431L972P667J2056J5751J7614
$$ plain form
59014 7945364 7623219 7314637 7020022 6737878 6467125 6208421 5962852 5730386 5510388
59005 5510388 5302843 5108091 4925906 4755793 4597950 4452902 4320196 4198238 4085445
58996 4085445 3980902 3884043 3794569 3712904 3639787 3574866 3516126 3461149 3408557 3357810 3307957
58985 3307957 3257279 3204373 3149284 3093482 3038830 2986670 2937753 2892547 2851111 2812701 2776222
58974 2776222 2741725 2711127 2686647 2668437 2654456 2642929 2634327 2630460 2632026 2637664 2645262 2653524
58962 2653524 2662032 2670218 2676818 2680507 2680964 2679219 2676994 2675771 2676281 2678386 2681245 2683984 2686636 2690240
58948 2690240 2695718 2702962 2711548 2721933 2734957 2750036 2764822 2777098 2786340 2792994 2797084 2798340 2797221
58935 2797221 2794821 2791937 2788937 2786366 2784835 2784252 2783887 2783404 2783371 2784802 2788774 2796441 2808497 2824248 2841862
58920B841862J8173J9031K0958K3375K5661K8079L1064L4347L7200L9258M0786
58909C159794M2387M4490M7087M9933N3177N7334O2266O6538O8648O8913O9360
58898C789927P1530P4866P7522P8447P8389P9167Q2125Q7056R2665R8008J03241
58887D712943J08722J14147J19318J25212J33076J42619J52412J62115J72991
58878E943555J85849J99827K13947K28601K44541K61419K78432K95747L14227
58869H166145L34395L56634L81725M09987M40385M71758N04513N39969N78374
58860A2183885O18932O61596P07257P56016Q06595Q57781R09136R59815J007736
58851A9468749J050538J086480J113853J130102J131965J115925J078452J016626
$$ plain form
58920 2841862 2860035 2879066 2900024 2923399 2949060 2977139 3008203 3042550 3079750 3119008 3159794
58909 3159794 3202181 3246671 3293758 3343691 3396868 3454202 3516468 3583006 3651654 3720567 3789927
58898 3789927 3861457 3936323 4013845 4092292 4170681 4249848 4331973 4419029 4511694 4609702 4712943
58887 4712943 4821665 4935812 5055130 5180342 5313418 5456037 5608449 5770564 5943555
58878 5943555 6129404 6329231 6543178 6771779 7016320 7277739 7556171 7851918 8166145
58869 8166145 8500540 8857174 9238899 9648886 10089271 10561029 11065542 11605511 12183885
58860 12183885 12802817 13464413 14171670 14927686 15734281 16592062 17501198 18461013 19468749
58851 19468749 20519287 21605767 22719620 23849722 24981687 26097612 27176064 28192690
58843B8192690R28901Q14886O74944N11382L30032J39067n4241k44295m24683
58834C0868683n87360p26001q38927r27409r92377j034358j055440j059057j048103
58825B2599651j024864r92309r53574r10306q63185q14047p65716p19485o74644
58816A4881521o30976n90022n53148n19824m88827m59901m33137m07825l83132
58807A0414729l59263l36809l15441k94351k73534k53606k34579k15807j97103
58798G934236j79047j62110j46186j31009j16349j01860q7434p3812o1980n1620
58788F822829m0811k7919j3349J137J4560K7549M1107N5316O9564Q3481R7194
58777G130658J10980J25164J40127J55860J71672J86980K02312K18813K36699
$$ plain form
58843 28192690 29121591 29936477 30611421 31122803 31452835 31591902 31537661 31293366 30868683
58834 30868683 30281323 29555322 28716395 27788986 26796609 25762251 24706811 23647754 22599651
58825 22599651 21574787 20582478 19628904 18718598 17855413 17041366 16275650 15556165 14881521
58816 14881521 14250545 13660523 13107375 12587551 12098724 11638823 11205686 10797861 10414729
58807 10414729 10055466 9718657 9403216 9108865 8835331 8581725 8347146 8131339 7934236
58798 7934236 7755189 7593079 7446893 7315884 7199535 7097675 7010241 6936429 6874449 6822829
58788 6822829 6782018 6754099 6740750 6741887 6756447 6783996 6825103 6880419 6949983 7033464 7130658
58777 7130658 7241638 7366802 7506929 7662789 7834461 8021441 8223753 8442566 8679265
58768H679265K55141K73974K94519L18010L44038L71389L99701M29310M60169
58759A1825516M92350N27194N66450O10094O56365P04184P54119Q06336Q59001
58750A7801609R09629R57003J000396J037416J063817J075538J070101J045924
58742B5961433J000812R31551Q35111P10673N60891L91242K08174J8067j72391
58733C0445563l55851n25124o74467q00265r01200r77967j032297j065754j079758
58724B3032880j076763j060525j034745j001875r63580r21621q77730q33107p88599
58715A4474335p44979p02537o60911o19911n80325n43396n09682m78754m49693
58706I184147m21678l94494l68739l45074l23217l02322k82339k63876k46534
$$ plain form
58768 8679265 8934406 9208380 9502899 9820909 10164947 10536336 10936037 11365347 11825516
58759 11825516 12317866 12845060 13411510 14021604 14677969 15382153 16136272 16942608 17801609
58750 17801609 18711238 19668241 20668637 21706053 22769870 23845408 24915509 25961433
58742 25961433 26962245 27893796 28728907 29439580 30000471 30391713 30599887 30617954 30445563
58733 30445563 30089712 29564588 28890121 28089856 27188656 26210689 25178392 24112638 23032880
58724 23032880 21956117 20895592 19860847 18858972 17895392 16973771 16096041 15262934 14474335
58715 14474335 13729356 13026819 12365908 11745997 11165672 10622276 10112594 9633840 9184147
58706 9184147 8762469 8367975 7999236 7654162 7330945 7028623 6746284 6482408 6235874
58697F235874k28799k10452j93550j79761j67916j55870j43816j33725j25866
58688D696119j18172j09331j00538r3466q7988q2883p7682p2796o8446o4456o0746
58677C759615n7439n4684n2625n1270n0209m8880m7302m6051m5366m4766m3854
58666C217169m3062m3225m4628m6660m8337m9177m9781n1321n4114n6861n7894
58655B672109n7103n5992n5828n6197n5562n2823m8317m3534l9829l7208l4692
58644B135024l2099l0745l1641l3686l4699l3885l2205l0537k8898k7461k6897
58633A792271k7171k7165k6043k4187k2328k0595j8842j7119j5314j3059j0464
58622A569984q248o742n372l609j840q73r89j825k810l558m187n122o145o083
$$ plain form
58697 6235874 6007075 5796623 5603073 5423312 5255396 5099526 4955710 4821985 4696119
58688 4696119 4577947 4468616 4368078 4274612 4186624 4103741 4026059 3953263 3884817 3820361 3759615
58677 3759615 3702176 3647492 3594867 3543597 3493388 3444508 3397206 3351155 3305789 3261023 3217169
58666 3217169 3174107 3130882 3086254 3039594 2991257 2942080 2892299 2840978 2786864 2730003 2672109
58655 2672109 2615006 2559014 2503186 2446989 2391427 2338604 2290287 2246753 2206924 2169716 2135024
58644 2135024 2102925 2072180 2040539 2006853 1972154 1938269 1906064 1875527 1846629 1819168 1792271
58633 1792271 1765100 1737935 1711892 1687705 1665377 1644782 1625940 1608821 1593507 1580448 1569984
58622 1569984 1561736 1554994 1549622 1546013 1544173 1543300 1542311 1540486 1537676 1534118 1529931 1524809 1518664 1512581
58608A512581m400k655k881m615n239l516j054L31Q44J286J243K53n19M52K902
58593A495013N333P049Q244Q822Q758R136J1164J4346J7133J9365K2469K7061
58581A653893L1782L5055L6976L8828M1492M4953M8930N3357N8220O3206O7777
58570B174469P1844P6212Q1867Q8790R6186J03888J12523J22104J31818J41825
58560C201526J53810J68595J84547J99837K15188K32443K51223K69121K84827
58551E161117K98857L11014L19303L21921L18444L08169K88915K58743K17976
58542G804459J68723J13238N3586p815o8091j24058j72290k10153k37491k56520
58532G063588k69374k76356k77052k72275k63898k53283k40989k27686k14369
$$ plain form
58608 1512581 1508181 1505526 1502645 1498030 1492791 1489275 1488221 1488552 1489396 1490682 1491925 1492178 1491659 1492111 1495013
58593 1495013 1500346 1507395 1515639 1524461 1533219 1542355 1553519 1567865 1584998 1604363 1626832 1653893
58581 1653893 1685675 1720730 1757706 1796534 1838026 1882979 1931909 1985266 2043486 2106692 2174469
58570 2174469 2246313 2322525 2404392 2493182 2589368 2693256 2805779 2927883 3059701 3201526
58560 3201526 3355336 3523931 3708478 3908315 4123503 4355946 4607169 4876290 5161117
58551 5161117 5459974 5770988 6090291 6412212 6730656 7038825 7327740 7586483 7804459
58542 7804459 7973182 8086420 8140006 8132191 8064100 7940042 7767752 7557599 7320108 7063588
58532 7063588 6794214 6517858 6240806 5968531 5704633 5451350 5210361 4982675 4768306
58523D768306k01402j88136j73872j58954j44631j31907j20753j10519j00930
58514C437202r2324q4889p8221p2054o6944o3592o1636n9783n7038n3351m9324
58503B698046m6023m4761m6024m8490n0082n0219n0246n1308n2760n3168n2046
58492B152919m9877m7067m3728m0358l7833l6441l5349l3332l0040k6328k3298
58481A749268k1160j9340j7610j6405j5924j5545j4663j3539j2696j2066j1378
58470A578942j0855j0782j0953j1326j2583j4979j7326j8434j8966k0256k1828
58459A410654k1987k0669j9573j9187j8104j5952j4681j5439j6217j4506j0989
58448A223350q525q243q561p743n737l473j813j343k105l177l235j761O50K940
$$ plain form
58523 4768306 4566904 4378768 4204896 4045942 3901311 3769404 3648651 3538132 3437202
58514 3437202 3344878 3259989 3181768 3109714 3042770 2979178 2917542 2857759 2800721 2747370 2698046
58503 2698046 2652023 2607262 2561238 2512748 2462666 2412447 2362201 2310893 2258133 2204965 2152919
58492 2152919 2103042 2055975 2012247 1971889 1934056 1897615 1862266 1828934 1798894 1772566 1749268
58481 1749268 1728108 1708768 1691158 1674753 1658829 1643284 1628621 1615082 1602386 1590320 1578942
58470 1578942 1568087 1557305 1546352 1535026 1522443 1507464 1490138 1471704 1452738 1432482 1410654
58459 1410654 1388667 1367998 1348425 1329238 1311134 1295182 1280501 1265062 1248845 1234339 1223350
58448 1223350 1214825 1206582 1198021 1190278 1184541 1181068 1179255 1177912 1175807 1172630 1169395 1167634 1168284 1171224
58434A171224M125L742K470J859K527L022J488j639l749k956m7K679L682L017
58420A191444J611L61k78k68K55J143K141K893L283L617M290N261O012N906M586
58405A232257K375K64r36j535k594m455o338p585q531r541j0057r433q280p843
58391A157768q116p614n281k042M1j35j782l303l980m263m407l540q20K787N009
58376A120322M922M118M716O864Q968R673Q765O523L326kk253k677j553Q1J120
58361A172913J114O18P04J779L103L809M112N046P223J0307J3621J6606J8648
58348A259603J9163J8339J7503J7894J9046J9026J6761J3435J0730Q211M022j799
58336A421934o549q242q123q474r473r948r896r891q948n870k387j781l976m981
$$ plain form
58434 1171224 1175349 1179091 1181561 1183420 1185947 1188969 1190457 1188818 1185069 1182113 1182066 1184745 1188427 1191444
58420 1191444 1193055 1193416 1193138 1192870 1193125 1194268 1196409 1199302 1202585 1206202 1210492 1215753 1221765 1227671 1232257
58405 1232257 1234632 1234896 1233960 1232425 1229831 1225376 1219038 1211453 1202922 1193381 1183324 1173891 1165611 1157768
58391 1157768 1149652 1142038 1136757 1134715 1134756 1134621 1132839 1129536 1125556 1121293 1116886 1113346 1112526 1115313 1120322
58376 1120322 1125244 1129362 1134078 1140942 1149910 1159583 1168348 1174871 1178197 1178195 1175942 1173265 1171712 1171793 1172913
58361 1172913 1174027 1174645 1175349 1177128 1180231 1184040 1188152 1193198 1200421 1210728 1224349 1240955 1259603
58348 1259603 1278766 1297105 1314608 1332502 1351548 1370574 1387335 1400770 1411500 1419711 1423733 1421934
58336 1421934 1415385 1407143 1399020 1390546 1381073 1371125 1361229 1351338 1342390 1336520 1334133 1332352 1328376 1323395
58322A323395k321J719L614K899J232m17j458m64L176P410R650R925J0068J0636
58308A379064J0676R926R229R060R376J0574J2864J5007J5363J4109J3053J3273
58296A521574J4160J4616J4063J2568J0944J0359J0910J1264J0609R936J0219
58285A651222J0507R414P467O176N716N423N665P020Q400Q415P977R151J1660
58272A754213J3251J3358J3761J5400J7133J8192J9329K0909K2153K3113K5046
58261A955858K7891K9655K9287K8262K8104K8334K8102K7956K8547K9214K9342
58250B270552K9638L0519L0581K8483K5361K3634K4008K5082K5586K5644K6062
58239B565150K7339K9418L1756L3732L5197L6392L7362L8078L9100M1206M4229
$$ plain form
58322 1323395 1321074 1322793 1326407 1329306 1330538 1330121 1328663 1328199 1331375 1338785 1348435 1358360 1368428 1379064
58308 1379064 1389740 1399666 1408895 1417955 1427331 1437905 1450769 1465776 1481139 1495248 1508301 1521574
58296 1521574 1535734 1550350 1564413 1576981 1587925 1598284 1609194 1620458 1631067 1641003 1651222
58285 1651222 1661729 1671143 1678610 1684786 1690502 1695925 1701590 1708610 1717010 1725425 1733402 1742553 1754213
58272 1754213 1767464 1780822 1794583 1809983 1827116 1845308 1864637 1885546 1907699 1930812 1955858
58261 1955858 1983749 2013404 2042691 2070953 2099057 2127391 2155493 2183449 2211996 2241210 2270552
58250 2270552 2300190 2330709 2361290 2389773 2415134 2438768 2462776 2487858 2513444 2539088 2565150
58239 2565150 2592489 2621907 2653663 2687395 2722592 2758984 2796346 2834424 2873524 2914730 2958959
58228B958959M7178M9520N1353N2431N2518N2682N4506N7562N9534N9706O0435
58217C556384O4057O9826P5387P9901Q4108Q8321R2143R5733R9718J04024J08058
58206D517660J11896J16213J20976J25310J28883J32634J37649J43806J50088
58197E685115J56134J63012J72203J84250J98833K15771K34816K54487K72471
58188G537092K87807L01505L14526L26668L38527L52709L71158L92427M13550
58179A0635969M33800M54908M78465N05095N35052N67612O00645O33175O67534
58170A5512255P06838P51374P99827Q52756R11705R75769J042697J113006J189645
58161B3855872J273520J362581J455384J552618J655403J765236J885254K017873
$$ plain form
58228 2958959 3006137 3055657 3107010 3159441 3211959 3264641 3319147 3376709 3436243 3495949 3556384
58217 3556384 3620441 3690267 3765654 3845555 3929663 4017984 4110127 4205860 4305578 4409602 4517660
58206 4517660 4629556 4745769 4866745 4992055 5120938 5253572 5391221 5535027 5685115
58197 5685115 5841249 6004261 6176464 6360714 6559547 6775318 7010134 7264621 7537092
58188 7537092 7824899 8126404 8440930 8767598 9106125 9458834 9829992 10222419 10635969
58179 10635969 11069769 11524677 12003142 12508237 13043289 13610901 14211546 14844721 15512255
58170 15512255 16219093 16970467 17770294 18623050 19534755 20510524 21553221 22666227 23855872
58161 23855872 25129392 26491973 27947357 29499975 31155378 32920614 34805868 36823741
58153C6823741K161297K312082K471723K647897K849482L083220L354248L666252
58145E9369942M022031M428201M899445N455546O116301O902998P842599Q966653
58137A08003716J0308734J1904436J3783812J5949953J8358458K0914515K3497354
58130B22720978K6035710K8624622L1526691L4827800L7821831L8723928L5345050
58123D55626610K6535258J3268793j645561j5045041k4882390l0696913l3134163
58116C90026593l3217795l1886430k9826617k7452239k4960987k2440203j9957575
58109B00284747j7588038j5396002j3415615j1645190j0054620q602477p252086
58102A16330719n978004m771715l655175k688685j959381j560454j569305k008674
$$ plain form
58153 36823741 38985038 41297120 43768843 46416740 49266222 52349442 55703690 59369942
58145 59369942 63391973 67820174 72719619 78175165 84291466 91194464 99037063 108003716
58137 108003716 118312450 130216886 144000698 159950651 178309109 199223624 222720978
58130 222720978 248756688 277381310 308908001 343735801 381557632 420281560 455626610
58123 455626610 482161868 495430661 493785100 478740059 453857669 423160756 390026593
58116 390026593 356808798 324922368 295095751 267643512 242682525 220242322 200284747
58109 200284747 182696709 167300707 153885092 142239902 132185282 123582805 116330719
58102 116330719 110352715 105581000 101925825 99237140 97277759 95717305 94148000 92139326
58094I2139326k793751l721657m548036n102146n341690n318586n116900m817781
58086E5378779m484505m149196l813421l470972l128039k799578k496668k225635
58078B8810765j992205j797402j633173j489062j360575j246718j144081j049395
58070A7098154r64463q92648q32531p79481p31038o86433o43216n98930n54714
58061A0414700n13525m76119m41612m10162l82339l57716l36819l22128l14237
58052F860043l09167l02463k93957k85535k76519k64797k50771k36561k22543
58043D417730k07987j94039j82609j72902j62214j50023j38600j29687j22761
58034B956908j16439j09598j01580r3074q6324q2666q0472p7276p3079o9603o7156
$$ plain form
58094 92139326 89345575 85623918 81075882 75973736 70632046 65313460 60196560 55378779
58086 55378779 50894274 46745078 42931657 39460685 36332646 33533068 31036400 28810765
58078 28810765 26818560 25021158 23387985 21898923 20538348 19291630 18147549 17098154
58070 17098154 16133691 15241043 14408512 13629031 12897993 12211560 11568344 10969414 10414700
58061 10414700 9901175 9425056 8983444 8573282 8190943 7833227 7496408 7174280 6860043
58052 6860043 6550876 6248413 5954456 5668921 5392402 5127605 4876834 4640273 4417730
58043 4417730 4209743 4015704 3833095 3660193 3497979 3347956 3209356 3079669 2956908
58034 2956908 2840469 2730871 2629291 2536217 2449893 2367227 2286755 2209479 2136400 2066797 1999641
58023A999641o4533o1529n9205n7736n6059n3751n1466m9353m6704m3380m0151
58012A415774l7395l4534l1031k7131k3658k1614k1478k2194k1611j8937j5952
58001A140239j4705j4860j4753j4144j4124j4790j4987j4368j3943j4231j4354
57990I80980j3537j2332j1772j1914j1817j0607q438o536o129p073p947p798p109
57977H57971o618n978m439k263m03P58J581K307K782K693J657l67k248k278n07
57962H44648M58j635n575p956p150m786l331l632m983o349p060p070o996p467
57948G71116q332q788q279p015n760n304n787o334n874m548l599l508l316k401
57934F92271j775k491l770m077l383k876k826k344j227n99j339k911m061l984
$$ plain form
58023 1999641 1935108 1873579 1814374 1756638 1700579 1646828 1595362 1546009 1499305 1455925 1415774
58012 1415774 1378379 1343845 1312814 1285683 1262025 1240411 1218933 1196739 1175128 1156191 1140239
58001 1140239 1125534 1110674 1095921 1081777 1067653 1052863 1037876 1023508 1009565 995334 980980
57990 980980 967443 955111 943339 931425 919608 909001 900563 894027 887898 880825 872878 865080 857971
57977 857971 851353 845375 840936 838673 838270 839028 840609 842916 845698 848391 850048 849681 847433 845155 844648
57962 844648 845106 843471 837896 829940 822790 818004 814673 811041 806058 799709 792649 785579 778583 771116
57948 771116 762784 753996 745717 738702 732942 727638 721851 715517 709643 705095 701496 697988 694672 692271
57934 692271 690496 688005 684235 680158 676775 673899 671073 668729 667502 666903 665564 662653 658592 654608
57920F54608k701r35L77R31J334J966K090Q45j192k537k659k345k320k466k483
57905F42513k412k371k438k845l640m288m259l984m478o047p834q664p946o032
57891E75275m157l510l800l301j040J693K920K404J382N32l50r94o60M05R39M30
57875E68168j81M0P69R39k44k844o029q411r349r745j0740j1979j2284j1699j1373
57860D75038j1432j0594q224n358l107j327N65K502M092N219N920O330O941Q045
57846D74610Q963Q904Q448Q843R813R760Q362P110O765O310N200M598M961M490
57832E77137J757j778l999n438p965j1099j2346j0988r008q030p544o700n858
57819D88141n402m760l636k939l390m156l859k231N6K488M709O139O557O701P274
$$ plain form
57920 654608 651907 650972 651349 652280 653614 655580 657670 658515 657323 654786 652127 649782 647462 644996 642513
57905 642513 640101 637730 635292 632447 628807 624519 620260 616276 611798 605751 597917 589253 581307 575275
57891 575275 571118 567608 563808 560507 559467 561160 564080 566484 567866 568398 568048 567054 566394 566799 567738 568168
57875 568168 567987 568027 568796 569735 569491 566647 560618 552207 542858 533113 522373 510394 498110 486411 475038
57860 475038 463606 453012 444788 439430 436323 434996 435561 438063 442155 447374 453294 459624 466565 474610
57846 474610 483573 492477 500925 509768 519581 529341 537703 544813 551578 557888 563088 567686 572647 577137
57832 577137 578894 577116 573117 567679 559714 548615 536269 525281 516273 508243 500699 493999 488141
57819 488141 482739 477979 474343 471404 468014 463858 459999 457768 457824 460312 465021 471160 477717 484418 491692
57804D91692P688O750M560K879L337N780Q437R252P172K913j354l572l538k804
57790E39192k831l713m764n664o442o970p160p312p583p427o404n346n641p230
57776D54705q387p935o653n998o268o793p202p508p558p292p189p578p943p805
57762C52596p726q376r124q984q604r552j1560j2355j0801q532p466p239o394
57749B35883m978m282m560m541l177p39J841L764M515M114L479L789N270P038
57735B47416Q159Q343P605N966L864K364K411L811N271N521M457L107K501K701
57721C13497L089L229L133K711J609k72k461m277n241n153m261l400l354l946
57707B94903m261l927l492l306k816j417O14K548L966M673M497L670K884K477
$$ plain form
57804 491692 499380 506130 510690 513569 516906 522686 531123 540375 547547 550460 549106 545534 541996 539192
57790 539192 536361 532648 527884 522220 515778 508808 501648 494336 486753 479326 472922 467576 461935 454705
57776 454705 446318 438383 431730 425732 419464 412671 405469 397961 390403 383111 375922 368344 360401 352596
57762 352596 344870 336494 327370 318386 309782 300230 288670 276315 265514 256982 249516 242277 235883
57749 235883 230905 226623 222063 217522 214345 213606 215447 219211 223726 227840 231319 235108 240378 247416
57735 247416 255575 263918 271523 277489 281353 283717 286128 289939 295210 300731 305188 308295 310796 313497
57721 313497 316586 319815 322948 325659 327268 326996 324535 320258 315017 309864 305603 302203 298849 294903
57707 294903 290642 286715 283223 279917 277101 275684 276298 278846 282812 287485 291982 295652 298536 301013
57693C01013K158K004K769M507N909O016N815O805Q667R927J0426J1393J2998
57680C90407J3718J2712J1355J1468J3045J4654J5334J5255J4995J4985J5348
57669E43276J5716J5442J4480J3684J3860J4769J5607J6211J7290J9449K2388
57658G22172K5179K7198K8645L0106L1664L2853L3534L4233L5114L5313L4395
57647A070406L4026L6696M2552M8946N3676N7322O1514O6302P0730P5041Q0328
57636A697539Q6260R1049R4069R6950J01367J07151J13639J21741J33098J47543
57626B790406J62988J78123J93917K11718K30714K48473K63555K76404K87267
57617D843565K94301K94525K86130K69009K43442K09580J68741J24289Q0317L9297
$$ plain form
57693 301013 303171 305175 307944 312451 318360 324376 330191 336996 345663 355590 366016 377409 390407
57680 390407 404125 416837 428192 439660 452705 467359 482693 497948 512943 527928 543276
57669 543276 558992 574434 588914 602598 616458 631227 646834 663045 680335 699784 722172
57658 722172 747351 774549 803194 833300 864964 897817 931351 965584 1000698 1036011 1070406
57647 1070406 1104432 1141128 1183680 1232626 1286302 1343624 1405138 1471440 1542170 1617211 1697539
57636 1697539 1783799 1874848 1968917 2065867 2167234 2274385 2388024 2509765 2642863 2790406
57626 2790406 2953394 3131517 3325434 3537152 3767866 4016339 4279894 4556298 4843565
57617 4843565 5137866 5432391 5718521 5987530 6230972 6440552 6609293 6733582 6813899 6853196
57607F853196Q94l7536p9279j25883j75065k21105k58059k82776k94847k94869
57597E084671k84354k66979k47759k29785k12578j94309j74808j55539j37659
57588C180901j21465j07230r5016q3624p1254n7708m4869l4319k5444j6654p609
57577B515709R12Q878J7411K7250L7781M8027N7911O8107P9134R1074J03858J17288
57565C173340J30796J43703J55906J68042J80695J93416K04647K12564K15831
57556D778940K13465K04422J87715J62940J30264R0117M3710n926n4337r8024
57546E653286j36112j68990j95858k14914k25884k30981k32551k30779k24740
57537C792477k15075k04283j94322j84982j75050j64250j53301j42552j31550
$$ plain form
57607 6853196 6854090 6816554 6737275 6611392 6436327 6215222 5957163 5674387 5379540 5084671
57597 5084671 4800317 4533338 4285579 4055794 3843216 3648907 3474099 3318560 3180901
57588 3180901 3059436 2952206 2857190 2773566 2702312 2644604 2599735 2565416 2539972 2523318 2515709
57577 2515709 2516621 2525499 2542910 2570160 2607941 2655968 2713879 2781986 2861120 2952194 3056052 3173340
57565 3173340 3304136 3447839 3603745 3771787 3952482 4145898 4350545 4563109 4778940
57556 4778940 4992405 5196827 5384542 5547482 5677746 5767863 5811573 5805647 5751310 5653286
57546 5653286 5517174 5348184 5152326 4937412 4711528 4480547 4247996 4017217 3792477
57537 3792477 3577402 3373119 3178797 2993815 2818765 2654515 2501214 2358662 2227112
57528B227112j20224j09732j01432r5152q9214q2386p5305o9465o5191o1220n6275
57517A301516n0397m4574l9539l5284l1446k7794k4431k1673j9638j8010j6413
57506I72317j5033j4336j4058j2952j0052n820j608J830M699P205R042J0133J1270
57493I42637J3306J6005J8416K0454K3209K7194L1047L3037L3615L5201L9138
57482A233259M4139M8386N2043N6501O2045O7726P3256P9385Q6358R3474J00536
57471A997108J08467J17767J27494J36547J45082J53809J62419J69394J73007
57462C291094J72041J66004J55007J39070J17470Q9577N6426K0468j6343n2857
57452D137957q6800j14566j34259j47499j56727j62004j62285j58571j53389j47658
$$ plain form
57528 2227112 2106888 1997156 1895724 1800572 1711358 1628972 1553667 1484202 1419011 1357791 1301516
57517 1301516 1251119 1206545 1167006 1131722 1100276 1072482 1048051 1026378 1006740 988730 972317
57506 972317 957284 942948 928890 915938 905886 900066 898458 900288 904987 912192 921234 931367 942637
57493 942637 955943 971948 990364 1010818 1034027 1061221 1092268 1125305 1158920 1194121 1233259
57482 1233259 1277398 1325784 1377827 1434328 1496373 1564099 1637355 1716740 1803098 1896572 1997108
57471 1997108 2105575 2223342 2350836 2487383 2632465 2786274 2948693 3118087 3291094
57462 3291094 3463135 3629139 3784146 3923216 4040686 4130263 4186689 4207157 4190814 4137957
57452 4137957 4051157 3936591 3802332 3654833 3498106 3336102 3173817 3015246 2861857 2714199
57442B714199j40436j31663j22842j14617j05970r6488q7384p9395p1421o2556
57432A701427n3928m7115m1866l6819l1651k6950k2447j6883r730k024M717R898
57420A426629J4187J8895K4984L2338M0071M7669N5445O3793P2640Q1907R1896
57409A970454J02626J13351J23331J32620J41541J49689J55986J59355J58858
57400C207811J53481J42307J24859J01074P1464L7594J867l3707o8080j00190
57390C638480j28147j50175j65881j76000j81370j82850j81579j78221j72324
57381B121933j63508j53037j43104j34594j26659j18424j10000j01629r3156q4873
57371H92949p7803p2407o7816o3056n8348n4338n0775m6914m2866l9449l6837
$$ plain form
57442 2714199 2573763 2442100 2319258 2204641 2098671 2002183 1914799 1835404 1763983 1701427
57432 1701427 1647499 1600384 1558518 1521699 1490048 1463098 1440651 1423768 1414038 1412014 1416731 1426629
57420 1426629 1440816 1459711 1484695 1517033 1557104 1604773 1660218 1724011 1796651 1878558 1970454
57409 1970454 2073080 2186431 2309762 2442382 2583923 2733612 2889598 3048953 3207811
57400 3207811 3361292 3503599 3628458 3729532 3800996 3838590 3840457 3806750 3738670 3638480
57390 3638480 3510333 3360158 3194277 3018277 2836907 2654057 2472478 2294257 2121933
57381 2121933 1958425 1805388 1662284 1527690 1401031 1282607 1172607 1070978 977822 892949
57371 892949 815146 742739 674923 611867 553519 499181 448406 401492 358626 319177 282340
57360B82340l4404l1995l0266k9326k8054k5480k2349k0357k0018A9977F52a7037
57347c3258j5548j5402j5058j3961j2164j0437r697r969j0155r235p545o424o581
57334a75434p301p365o383n031m198m124m358m403m303m470n059n852o674p491
57320b52446p993p744o960o442o276n478l621j975j843k483k143p89p9o57j260
57305c08189r43m11l50j47O00P25p51k448j927J193M763O568O265N092M744O338
57289b78878R422J2021J2485J1271J0122R836R725R026P752O229M887M502N530
57276a66070P021P376O492O128P616J0119J1736J1653J0586R700R754J0841J2259
57263d4789J2942J2518g561D102J2265J2937J3387J3805J4163J4019J3153J1989
$$ plain form
57360 282340 247936 215941 185675 156349 128295 102815 80466 60109 40091 19977 652 -17037
57347 -33258 -48806 -64208 -79266 -93227 -105391 -115828 -125525 -135494 -145649 -154884 -162429 -168853 -175434
57334 -175434 -182735 -190100 -196483 -201514 -205712 -209836 -214194 -218597 -222900 -227370 -232429 -238281 -244955 -252446
57320 -252446 -260439 -268183 -275143 -281585 -287861 -293339 -296960 -298935 -300778 -303261 -305404 -306193 -306272 -306929 -308189
57305 -308189 -309132 -309543 -309893 -310040 -309440 -308715 -309466 -311914 -313841 -312648 -307885 -301317 -295052 -289960 -285216 -278878
57289 -278878 -269456 -257435 -244950 -233679 -223557 -213721 -203996 -194970 -187218 -180989 -176102 -171600 -166070
57276 -166070 -159049 -151673 -145181 -139053 -131437 -121318 -109582 -97929 -87343 -77643 -67889 -57048 -44789
57263 -44789 -31847 -19329 -7561 4102 16367 29304 42691 56496 70659 84678 97831 109820
57251A09820J1228J1281J2174J3621J5022J5666J5383J4873J5026J5855J6548
57240B66497J6708J6985J8035J9362J9975K0013K0900K3651K7718L1755L4938
57229E16537L7277L9270M1493M4056M6167M6852M6245M5439M4790M3395M0727
57218I92248L7710L5305L2916K9310K4415J9090J3776Q551L966L80l242q250j4018
57205A172157j8229j9803k0241k1431k3245k4018k2752k0032j7087j4513j1997
57194I58809r228o824n795n801m937j977K023N549R058J3847J9115K2560K3990
57181A020389K5779K8851L0534K8163K3062J9011J7688J7717J7632J7740J8837
57170A265403K0835K3302K6185K9315L1971L3669L5004L6938L9333M0856M0629
$$ plain form
57251 109820 121048 132329 144503 158124 173146 188812 204195 219068 234094 249949 266497
57240 266497 283205 300190 318225 337587 357562 377575 398475 422126 449844 481599 516537
57229 516537 553814 593084 634577 678633 724800 771652 817897 863336 908126 951521 992248
57218 992248 1029958 1065263 1098179 1127489 1151904 1170994 1184770 1193321 1197287 1197667 1194425 1186175 1172157
57205 1172157 1153928 1134125 1113884 1092453 1069208 1045190 1022438 1002406 985319 970806 958809
57194 958809 949581 942757 936962 931161 926224 924247 926270 931819 940877 954724 973839 996399 1020389
57181 1020389 1046168 1075019 1105553 1133716 1156778 1175789 1193477 1211194 1228826 1246566 1265403
57170 1265403 1286238 1309540 1335725 1365040 1397011 1430680 1465684 1502622 1541955 1582811 1623440
57159A623440L9611L9731M1610M3948M5498M6858M9351N2578N4448N3750N1610
57148B142433M9949M9446M9472M9194M8146M6261M3935M1833M0339L9463L9187
57137B639658L9235L8580L6231L2795L0226K9507K9498K8782K7648K7366K8167
57126B987693K9078K9445K9756L0814L2678L4495L5304L5080L4953L5991L7831
57115C353118L9090L8967L7644L5109L0771K4585J7614J0975N037r2m378q602
57103C579838j4007k0469k6141k9801l2596l6490m1865m7619n2811n7146o0428
57092C160465o2499o3381o2738n9893n5034m9716m5484m2910m2655m6320n5019
57081B574816o7901q3111r9562j16873j34544j52464j71477j92223k14010k35811
$$ plain form
57159 1623440 1663051 1702782 1744392 1788340 1833838 1880696 1930047 1982625 2037073 2090823 2142433
57148 2142433 2192382 2241828 2291300 2340494 2388640 2434901 2478836 2520669 2561008 2600471 2639658
57137 2639658 2678893 2717473 2753704 2786499 2816725 2846232 2875730 2904512 2932160 2959526 2987693
57126 2987693 3016771 3046216 3075972 3106786 3139464 3173959 3209263 3244343 3279296 3315287 3353118
57115 3353118 3392208 3431175 3468819 3503928 3534699 3559284 3576898 3587873 3592910 3592818 3588440 3579838
57103 3579838 3565831 3545362 3519221 3489420 3456824 3420334 3378469 3330850 3278039 3220893 3160465
57092 3160465 3097966 3034585 2971847 2911954 2856920 2807204 2761720 2718810 2676155 2629835 2574816
57081 2574816 2506915 2423804 2324242 2207369 2072825 1920361 1748884 1556661 1342651 1106840
57071A106840k57739k80641B63133g0046l66218m04869m46743m89289n33029n80720
57061b890914o34306o94506p62700q41082r31010j032580j145568j269702j404981
57052a1607349j553332j719206j907131k119651k359193k630658k940130l292652
57044c0129302l694155m154937m688721n309136o029786o866724p836839q952793
57036g7662393j0221426j1645931j3224032j4938478j6747122j8584323k0379334
57029a83403039k2080291k3654661k5048995k6143715k6773162k6823889k6317516
57022c60245268k5371168k4054546k2281187j9831547j6469710j2059919o646003
57015d86959348m96594N914099J2026524J7371284K1686606K4916644K7135477
$$ plain form
57071 1106840 849101 568460 263133 -70046 -436264 -841133 -1287876 -1777165 -2310194 -2890914
57061 -2890914 -3525220 -4219726 -4982426 -5823508 -6754518 -7787098 -8932666 -10202368 -11607349
57052 -11607349 -13160681 -14879887 -16787018 -18906669 -21265862 -23896520 -26836650 -30129302
57044 -30129302 -33823457 -37978394 -42667115 -47976251 -54006037 -60872761 -68709600 -77662393
57036 -77662393 -87883819 -99529750 -112753782 -127692260 -144439382 -163023705 -183403039
57029 -183403039 -205483330 -229137991 -254186986 -280330701 -307103863 -333927752 -360245268
57022 -360245268 -385616436 -409670982 -431952169 -451783716 -468253426 -480313345 -486959348
57015 -486959348 -487455942 -481541843 -469515319 -452144035 -430457429 -405540785 -378405308
57008c78405308K8470316K9047011K8953169K8233778K6932540K5146833K3042837
57001a88578824K0818124J8647683J6649848J4878956J3336234J1991399J0805346
56994h1451234R742697Q773484P873583P028635O235930N500349M828622M226314
56986b7241620L696215L236366K839691K496410K197072J934182J702908J500901
56978g637875J326556J176995J048267R37041Q40879P56887O81462b58052B88373
56968G73793M29589L81027L41491L09870K82237K55274K28972K05322J85174J67425
56958C560174J50758J35071J20985J08694R7623Q6777P4992O1268M5644K9962
56948D471948J6834O992j831j2205k3220l0984l3990l7353n0629q1162j28978
$$ plain form
57008 -378405308 -349934992 -320887981 -291934812 -263701034 -236768494 -211621661 -188578824
57001 -188578824 -167760700 -149113017 -132463169 -117584213 -104247979 -92256580 -81451234
56994 -81451234 -71708537 -62935053 -55061470 -48032835 -41796905 -36296556 -31467934 -27241620
56986 -27241620 -23545405 -20309039 -17469348 -14972938 -12775866 -10841684 -9138776 -7637875
56978 -7637875 -6311319 -5134324 -4086057 -3149016 -2308137 -1551250 -869788 -258052 288373
56968 773793 1203382 1584409 1925900 2235770 2518007 2773281 3002253 3207575 3392749 3560174
56958 3560174 3710932 3846003 3966988 4075682 4173305 4260082 4335074 4396342 4441986 4471948
56948 4471948 4488782 4495774 4493943 4481738 4458518 4427534 4393544 4356191 4305562 4224400 4095422
56937D095422j86463k41699k83461l05859l10089l01840k86817k68327k47863
56928A663004k26293k04119j81659j59651j39220j20985j04629q9878p7519o8849
56918B90202o4070o1606n9123E0258G46d1862l4660k6025j7767j1070o058j644
56906a39086L232Q674J4159J9173K3280K6139a6477A3007L1252L2915L3792L3393
56894A44359L1203K6644J9918J2452N937J139k040l976n277o567p521o684l337
56881B06250J092M476O585Q923J2239J5603J8109K0151K2431K4859K7005K8652
56869C96375K9117K6823K0735J1931K973m320r897j4416j7851j9456j8889j6959
56857C86166j5033j3667j2174r717o571l825k021o67Q18K247L021K967K701L166
$$ plain form
56937 4095422 3908959 3667260 3383799 3077940 2767851 2466011 2179194 1910867 1663004
56928 1663004 1436711 1232592 1050933 891282 752062 631077 526448 436570 359051 290202
56918 290202 226132 164526 105403 50258 746 -41862 -76522 -102547 -120314 -131384 -137442 -139086
56906 -139086 -135854 -127180 -113021 -93848 -70568 -44429 -16477 13007 44259 77174 110966 144359
56894 144359 175562 202206 222124 234576 240513 241652 239612 235636 230359 223792 216271 209587 206250
56881 206250 207342 211818 218403 227326 239565 255168 273277 293428 315859 340718 367723 396375
56869 396375 425492 452315 473050 484981 487954 483634 473737 459321 441470 422014 403125 386166
56857 386166 371133 357466 345292 335575 329004 325179 323158 322491 323309 325556 328577 331544 334245 337411
56843C37411M782O881Q255Q556Q720R576J0576J0746J0446J0915J2134J2603J1702
56830D63303J0918J1910J4355J6673J8142J9228K0165K0254J8582J5000J0552
56819F39082P155O294P403Q148O941M741L707M597O405Q066R373J0385J1096J1904
56805G45297J3632J6734K0971K5774L0348L3701L5320L5647L4985L2092K5127
56794A049628J4206K045q309j5443j9251k0077j8840j6745j3936r406l229K365
56782I43008N589P928J2534K0060K7953L4048L9010M4466N0235N4540N5873N3415
56770A348659M6324L4107J7800o4j6716k9940l8223m1294m0749l9060l7450l5230
56758A168164l1405k6220k0684j5184r338k876L922J0600J6687K1664K5319K8049
$$ plain form
56843 337411 342193 349074 357329 365885 374605 384181 394757 405503 415949 426864 438998 451601 463303
56830 463303 474221 486131 500486 517159 535301 554529 574694 594948 613530 628530 639082
56819 639082 646237 652531 659934 668082 675023 679764 683471 688068 694473 702539 711912 722297 733393 745297
56805 745297 758929 775663 796634 822408 852756 886457 921777 957424 992409 1024501 1049628
56794 1049628 1063834 1065879 1057570 1042127 1022876 1002799 983959 967214 953278 943872 940643 943008
56782 943008 948597 956525 969059 989119 1017072 1051120 1090130 1134596 1184831 1239371 1295244 1348659
56770 1348659 1394983 1429090 1446890 1446826 1430110 1400170 1361947 1320653 1279904 1240844 1203394 1168164
56758 1168164 1136759 1110539 1089855 1074671 1065333 1062457 1066379 1076979 1093666 1115330 1140649 1168698
56746A168698L0067L0110K5665J5247L39j5313k8243l7026m1948m3724m2923m0261
56734A020688l6884l3898l1501k8757k4579j9056j3530r155n681k086J842N240
56722H22643P630R829J2711J5371J5418J1383M429k729q192j1841j4345j6009
56710H46298j6756j6665j6021j5176j4639j5024j6350j7466j6849j4203j0899
56699F76250q623p884q026q217q061p461o487n385m448l761l203k647k064j614
56685E98369j739k840m567n728n410m012k597j459q5J421J841L70k091l868m417
56670E63188m553m981n379n027l771k044m18O36Q10J32j005k166l192m169n145
56655E22916n929o008m868k648m44M86j2q60j058p05m90o72j130k073l752n494
$$ plain form
56746 1168698 1198765 1228875 1254540 1269787 1270126 1254813 1226570 1189544 1147596 1103872 1060949 1020688
56734 1020688 983804 949906 918405 889648 865069 846013 832483 823328 817647 815561 817403 822643
56722 822643 830273 840102 852813 868184 883602 894985 899414 896685 888493 876652 862307 846298
56710 846298 829542 812877 796856 781680 767041 752017 735667 718201 701352 687149 676250
56699 676250 667627 659743 651717 643500 635439 627978 621491 616106 611658 607897 604694 602047 599983 598369
56685 598369 596630 593790 589223 583495 578085 574073 571476 570017 569932 571353 573194 573564 571473 567605 563188
56670 563188 558635 553654 548275 543248 539477 537433 537015 537651 538461 538593 537588 535422 532230 528061 522916
56655 522916 516987 510979 506111 503463 503019 503505 503493 502633 501575 500870 500380 499708 498578 496505 492753 487259
56639D87259n846m209j855p83j768l811n235n051l631k394k561l749m136k605
56625D39625l46L95r64k778l310k467j201k03J72m03j724k781k775k068j437p84
56609D16951N84K628M435N341N374M785L902L414L794M353L778J940K36j87J34
56594D61462j31j408k855l350k536j285j135k737m803n374m208k875k339j731
56580D24695j95J461K031J810J869K183J931J219R33J049N43q51k119k420k036
56565D32103j522r30k94K6j19m46p85j136j014L19K616M422M634L582K212Q80
56549D44548n21j869k809l016k278p55O72J138J050J656K928L133J317q75j134
56534D43185M50J589P33j363k925k860j213J068K631K673J664N61l62j324j921
$$ plain form
56639 487259 481413 477204 475349 474566 472798 468987 463752 458701 455070 452676 450115 446366 442230 439625
56625 439625 439279 439674 438710 435932 432622 430155 428954 428751 428923 428520 426796 424015 421240 419172 417735 416951
56609 416951 417535 420163 424598 429939 435313 440098 444000 447414 451208 455561 459339 461279 461515 461328 461462
56594 461462 461331 459923 457068 453718 451182 449897 448762 446025 441222 435848 431640 428765 426426 424695
56580 424695 424500 425961 427992 429802 431671 433854 435785 437004 437937 438986 439529 438678 436559 434139 432103
56565 432103 430581 429651 429357 429383 429264 428818 428033 426897 425883 426202 428818 433240 437874 441456 443668 444548
56549 444548 444027 442158 439349 436333 434055 433300 433972 435110 436160 437816 440744 443877 445194 444319 443185
56534 443185 443635 445224 445957 444594 441669 438809 437596 438664 441295 443968 445632 446193 445831 444507 442586
56519D42586j339L26J931K694K933L187L525L961M689N543O063O348O929P426
56505D96802O557M240K486K999M855O009O320P247Q839R203P569N900O242P760
56491E83028Q001O320M489M126M983N809N665M112J347j281k008q04j04k267o607
56476F14809r938j0076p912n831m931m520l841l317l726m872n774o056o272o620
56462E31123o247m651l103l368n177o316n495l776k540j492J97J818J932O98j91
56447D93412K9K27p91k613l787l391j596O38K094K056R10k80p82n57O0N86N75
56430D86790K75O01J806K661K054Q17N78J279J444Q32P61J595J993J345R52J722
56414E07505K443J762M12qO72J608K547L539L932L265K431K522L148L308L218
$$ plain form
56519 442586 441247 441573 443504 446198 449131 452318 455843 459804 464493 470036 476099 482447 489376 496802
56505 496802 503359 507599 510085 513084 517939 523948 530268 537515 546354 555557 563126 569026 575268 583028
56491 583028 591029 597349 601838 605964 610947 616756 622421 626533 627880 626599 624591 623787 623683 621416 614809
56476 614809 604871 594795 586883 581052 576121 571601 567760 564443 560717 555845 550071 544015 537743 531123
56462 531123 524876 520225 517122 513754 508577 502261 496766 492990 490450 488958 489155 490973 492905 493603 493412
56447 493412 493441 493668 492877 490264 486477 483086 481490 482128 484222 486278 487188 486908 486126 485569 485629 486215 486790
56430 486790 487065 487666 489472 492133 494187 495004 495582 496861 498305 499137 499898 501493 503486 504831 505783 507505
56414 507505 509948 511710 512122 512114 512786 514394 516941 520480 524412 527677 530108 532630 535778 539086 542304
56399E42304L747M581M639L882L143K492J395K43L5O58J081J225J986L277L776
56384E78464K900J509K54j149k512k635j108O13R02p7r21q72m22m57j357k639
56368E70493l306k794j586n66r3j90j085k595l501k902j839k155l820m904m302
56353E34855k959k187k178k559k990k912j968r83j064j689j390m30o45k053k128
56338E06720K59K508J792r36k520j853l19R78K081K771K466J644J608K648L737
56323E23584M143M088L812L151K184J418J098J035J055J037P00K1l93L9J139K390
56307E50501L560M377M345L679L645M945O441O622N626M615L792K564J231R22
56293F06865J862L105L946M330L963K546R25O10J749K799K611J685J143J472K637
$$ plain form
56399 542304 546051 550632 555271 559153 562296 564788 566183 566426 566461 567119 568200 569425 571411 574688 578464
56384 578464 581364 582873 583127 581978 579466 576831 575723 576336 577238 577161 576240 575368 574946 574489 573132 570493
56368 570493 567187 564393 562807 562241 562148 561958 560873 558278 554777 551875 550036 547881 544061 539157 534855
56353 534855 531896 529709 527531 524972 521982 519070 517102 516119 515055 513366 511976 511546 510901 508848 506720
56338 506720 506979 509487 511279 510343 507823 505970 505651 506629 508710 511481 513947 515591 517199 519847 523584
56323 523584 527727 531815 535627 538778 540962 542380 543478 544513 545568 546605 547305 547326 546933 546972 548111 550501
56307 550501 554061 558438 562783 566462 570107 575052 581493 588115 593741 598356 602148 604712 605943 606865
56293 606865 608727 611832 615778 620108 624071 626617 627542 628152 629901 632700 635311 636996 638139 639611 642248
56278F42248M306N553N379M146L583M836P167Q928R221Q287P096O819P975R726
56264G35270J0768J1084J1814J3078J3234J1252Q826Q713J1371J4446J5628J4929
56252H80413J3785J2867J1645R801Q103P444P602P608P118O608O136N019L180
56239I87329J872K190L533M619N462P123R707J1941J2909J3092J3420J4254J5599
56226A103050J7440J9459K1151K2611K4574K7307L0228L2896L5666L8844M1874
56215A415100M4050M5705M8022N1739N6476O1355O6108P1376P7879Q5310R2541
56204B115661R9245J06751J16609J28578J40978J52808J64508J76427J87700J97324
56194C586589K05644K13909K22516K30112K34467K34078K28981K20165K08204
$$ plain form
56278 642248 646554 652107 657486 661632 665215 670051 677218 686146 695367 703654 710750 717569 725544 735270
56264 735270 746038 757122 768936 782014 795248 806500 815326 824039 835410 849856 865484 880413
56252 880413 894198 907065 918710 928511 936614 944058 951660 959268 966386 972994 979130 984149 987329
56239 987329 989201 991391 994924 999543 1005005 1012128 1021835 1033776 1046685 1059777 1073197 1087451 1103050
56226 1103050 1120490 1139949 1161100 1183711 1208285 1235592 1265820 1298716 1334382 1373226 1415100
56215 1415100 1459150 1504855 1552877 1604616 1661092 1722447 1788555 1859931 1937810 2023120 2115661
56204 2115661 2214906 2321657 2438266 2566844 2707822 2860630 3025138 3201565 3389265 3586589
56194 3586589 3792233 4006142 4228658 4458770 4693237 4927315 5156296 5376461 5584665
56185E584665J92681J73019J49437J22824R4201O4852L6435J0052j4426l7295
56175F376445n7698p4396q7587r8691j08309j15759j20925j25136j29587j33971
56165E324386j37529j40681j44624j49686j54870j58840j60991j61720j61907
56156C953538j61973j61389j59308j55497j50279j43840j36364j28642j21582
56147B634664j15097j08376j01286r4563q8482q2412p5987o9724o4109n8993n4227
56136A721408m9942m5846m1313l6539l2603k9965k7920k5879k4014k2084j9163
56125A366140j5337j2211j0632r161o258k797q27n90m57P21K763N224P726R437
56111A333741R858J0127J2007J5412J8291J9224J8865J8469J8308J8118J8031
$$ plain form
56185 5584665 5777346 5950365 6099802 6222626 6316827 6381679 6418114 6428166 6413740 6376445
56175 6376445 6318747 6244351 6156764 6058073 5949764 5834005 5713080 5587944 5458357 5324386
56165 5324386 5186857 5046176 4901552 4751866 4596996 4438156 4277165 4115445 3953538
56156 3953538 3791565 3630176 3470868 3315371 3165092 3021252 2884888 2756246 2634664
56147 2634664 2519567 2411191 2309905 2215342 2126860 2044448 1968461 1898737 1834628 1775635 1721408
56136 1721408 1671466 1625620 1584307 1547768 1515165 1485200 1457280 1431401 1407387 1385303 1366140
56125 1366140 1350803 1338592 1327960 1318799 1312541 1309744 1308917 1308327 1307870 1308591 1311354 1316578 1324304 1333741
56111 1333741 1343599 1353726 1365733 1381145 1399436 1418660 1437525 1455994 1474302 1492420 1510451
56100A510451J8300J8779J9240J9699K0074K0064J9704J9569K0230K1896K4547
56089A732553K7800L0795L3180L6107M1104M7752N3943N9039O5227P4622Q6333
56078B288455R8017J09377J22117J36664J50931J62700J71610J78023J81369J80758
56068C780021J76518J70167J63251J56738J50978J45521J39093J29791J14970
56059E127048R1558N8417J9302j8233m8403p0993q8842j03491j15302j26259j39126
56048D585676j53574j65932j73315j75895j74646j69537j60986j50676j39447
56039C121668j26374j11406r6824q4456p3454o2794n3973m8718m5573m1714l7135
56028B339247l4161l3253l2183k9442k5952k3009k0577j8113j5381j2129q377
$$ plain form
56100 1510451 1528751 1547530 1566770 1586469 1606543 1626607 1646311 1665880 1686110 1708006 1732553
56089 1732553 1760353 1791148 1824328 1860435 1901539 1949291 2003234 2062273 2127500 2202122 2288455
56078 2288455 2386472 2495849 2617966 2754630 2905561 3068261 3239871 3417894 3599263 3780021
56068 3780021 3956539 4126706 4289957 4446695 4597673 4743194 4882287 5012078 5127048
56059 5127048 5218606 5277023 5296325 5278092 5229689 5158696 5069854 4966363 4851061 4724802 4585676
56048 4585676 4432102 4266170 4092855 3916960 3742314 3572777 3411791 3261115 3121668
56039 3121668 2995294 2883888 2787064 2702608 2629154 2566360 2512387 2463669 2418096 2376382 2339247
56028 2339247 2305086 2271833 2239650 2210208 2184256 2161247 2140670 2122557 2107176 2095047 2086670
56017B086670n022k789q33K138N663Q143R240R918J0504J0759J1540J4180J8190
56004B178301K1647K3766K5179K6009K6008K6303K8334L1095L2224L1888L2494
55993B483248L4316L4937L3852L4034L7236M1016M2561M2641M3403M4662M5002
55982B916908M4722M5178M6478M8017N0203N3574N7179N9664O1313O3515O7018
55971C513769P1765P7520Q3469Q8341R2014R6147J02230J09952J18024J25351
55961D478582J30924J34240J36579J40258J45876J51982J58017J65568J75962
55952E817988J88688K02946K18394K33603K46373K56837K67772K80734K94393
55943H007728L07787L22217L38489L55348L72491L92043M15115M39755M64405
$$ plain form
56017 2086670 2081648 2078859 2078026 2080164 2085827 2093970 2103210 2113128 2123632 2134391 2145931 2160111 2178301
56004 2178301 2199948 2223714 2248893 2274902 2300910 2327213 2355547 2386642 2418866 2450754 2483248
55993 2483248 2517564 2552501 2586353 2620387 2657623 2698639 2741200 2783841 2827244 2871906 2916908
55982 2916908 2961630 3006808 3053286 3101303 3151506 3205080 3262259 3321923 3383236 3446751 3513769
55971 3513769 3585534 3663054 3746523 3834864 3926878 4023025 4125255 4235207 4353231 4478582
55961 4478582 4609506 4743746 4880325 5020583 5166459 5318441 5476458 5642026 5817988
55952 5817988 6006676 6209622 6428016 6661619 6907992 7164829 7432601 7713335 8007728
55943 8007728 8315515 8637732 8976221 9331569 9704060 10096103 10511218 10950973 11415378
55934A1415378M90440N19040N48606N77814O08580O43511O82967P26689P75359
55925A6988384Q28345Q83279R40313J003279J073922J148672J224200J302527
55917B5392921J387453J479798J579656J689387J810190J939454K075962K224828
55909C9579649K393714K587594K810582L068796L367705L711227M107638M572189
55901F6199094N120847N767311O530380P438506Q523454R815150J1342973J3129059
55893A33866774J5173153J7451625J9935089K2603950K5460355K8528710L1747414
55886B94767070L4659927L6100521L4364587K8102020J7403186M117796q984040
55879D40531067j9560835k6544395l0085755l0993292l0208145k8515416k6430898
$$ plain form
55934 11415378 11905818 12424858 12973464 13551278 14159858 14803369 15486336 16213025 16988384
55925 16988384 17816729 18700008 19640321 20643600 21717522 22866194 24090394 25392921
55917 25392921 26780374 28260172 29839828 31529215 33339405 35278859 37354821 39579649
55909 39579649 41973363 44560957 47371539 50440335 53808040 57519267 61626905 66199094
55901 66199094 71319941 77087252 83617632 91056138 99579592 109394742 120737715 133866774
55893 133866774 149039927 166491552 186426641 209030591 234490946 263019656 294767070
55886 294767070 329426997 365527518 399892105 427994125 445397311 449515107 440531067
55879 440531067 420970232 394425837 364340082 333346790 303138645 274623229 248192331
55872B48192331k4209411k1949936j9715392j7580048j5611575j3851430j2315849
55865A22958690j0997519r865524q878127q000817p210653o490969n832158n235000
55857F0447923m704290m238813l831167l473615l158487k875697k616044k376300
55849C3173510k157769j961767j789068j640420j513800j403191j302842j210504
55841B0194149j124956j044198r68626r01949q45584p95364p46759o99864o56287
55832A2410562o14792n73770n34836n00174m68870m39229m12234l89271l68813
55823H108573l48663l29201l11452k94360k77123k61746k49912k39556k27983
55814E568577k16159k06553j98800j91182j84331j79515j74870j67563j58643
$$ plain form
55872 248192331 223982920 202032984 182317592 164737544 149125969 135274539 122958690
55865 122958690 111961171 102095647 93217520 85216703 78006050 71515081 65682923 60447923
55857 60447923 55743633 51504820 47673653 44200038 41041551 38165854 35549810 33173510
55849 33173510 31015741 29053974 27264906 25624486 24110686 22707495 21404653 20194149
55841 20194149 19069193 18024995 17056369 16154420 15308836 14513472 13766713 13066849 12410562
55832 12410562 11795770 11222000 10687164 10186990 9718120 9278891 8866657 8477386 8108573
55823 8108573 7759910 7430709 7119257 6824897 6547774 6286028 6036116 5796560 5568577
55814 5568577 5352418 5145865 4947065 4755883 4571552 4392037 4217167 4049604 3890961
55805C890961j51579j46581j40190j30524j19335j08781r9345r1458q6380q4454
55795B732334q4395q4714q4443q2673p9057p4626p0577o6575o1668n6307n1758
55784A935541m8033m4166m0095l6623l3849l1174k8516k6168k3946k1806k0569
55773A580596k0597k0647j9721j9144k0753k3711k5342k4934k4471k5479k7166
55762A328631k8194k8555k8913k9288k9176k8353k7040k5549k3994k2216k0178
55751A037175j8405j7474j6994j5919j4037j2125j0322p633l785k99J143M98j155
55738I20668k709l103j790%p1k594n615p541q970j0586j1453j1088j1145j2801
55724H31202j4215j3040j0160q301p987p524o359n793o591q219j0371j3196j6020
$$ plain form
55805 3890961 3739382 3592801 3452611 3322087 3202752 3093971 2994626 2903168 2816788 2732334
55795 2732334 2647939 2563225 2478782 2396109 2317052 2242426 2171849 2105274 2043606 1987299 1935541
55784 1935541 1887508 1843342 1803247 1766624 1732775 1701601 1673085 1646917 1622971 1601165 1580596
55773 1580596 1559999 1539352 1519631 1500487 1479734 1456023 1430681 1405747 1381276 1355797 1328631
55762 1328631 1300437 1271882 1242969 1213681 1184505 1156152 1129112 1103563 1079569 1057353 1037175
55751 1037175 1018770 1001296 984302 968383 954346 942221 931899 924266 920481 920182 921325 921823 920668
55738 920668 917959 914856 913066 913066 912995 910401 904786 897245 888275 877689 866236 855148 844003 831202
55724 831202 816987 803947 793787 785486 777499 769975 763616 757823 751232 743013 732642 719446 703426
55711G03426j7749j8520j9240j9658j8591j5948j2976j0565q771p736p609p906
55699E38157q231r085j0628j1504j0633r166q721q623p181m942l976m416m574
55686D36477m282n232p561r040q430p218p020p420p274o356m812k828j411j723
55672C55870k985k993j369k39q94j969k060j917k535l083k486j529j586k475l242
55657C24508l869m578m534l117j592j568k360j791O01K934L716L549L683M274
55643C19856M721M839M863M703L861K183L52n01J89J804L146L603L605L868M531
55628C65623N104N066M463L909L847L751K659P66l32L39J528J252o72k780m196
55613C90327n190n689m982l336k312k715l376k796r76J041K582L501L712L261
$$ plain form
55711 703426 685677 667157 647917 628259 609668 593720 580744 570179 561408 553672 546063 538157
55699 538157 529926 520841 510213 498709 488076 478910 470189 461566 454385 449443 445467 441051 436477
55686 436477 432195 426963 419402 410362 401932 394714 387694 380274 373000 366644 361832 359004 357593 355870
55672 355870 352885 349892 348523 348284 347390 345421 343361 341444 338909 335826 333340 331811 330225 327750 324508
55657 324508 320639 316061 311527 308410 306818 305250 302890 301099 301700 304634 308350 311899 315582 319856
55643 319856 324577 329416 334279 338982 342843 345026 345378 344877 345066 346870 350016 353619 357224 361092 365623
55628 365623 370727 375793 380256 384165 388012 391763 394422 395188 394856 395195 396723 397975 397303 394523 390327
55613 390327 385137 379448 374466 371130 368818 366103 362727 359931 358955 359996 362578 366079 369791 373052
55599C73052K481J615P92N36J415K940L764L416K859K861K878K185R85m34k473
55584C98872n113o954o739n321m769n802p211p746p544p505q070q798q856p936
55570C00508o844o802p841q509p718o207n348n164m698l971m104n270n834m411
55556B17787k000j061k631n085n981m684k710j739j854j995j539p93j05N67J119
55541A87296J116O05L87R27J485J111L0o29l26M74J282K070K662K517J626R73
55525B03606J452K610L239L137L477N173P481Q797Q575P889Q206J0008J2687J5261
55511C01598J7136J8485K0024K2220K4631K6411K7244K7234K6001K2727J7392
55500E51103J1165N115p24o603j2110j6719k0610k4135k6863k7933k7116k4848
$$ plain form
55599 373052 375533 377148 377940 378476 379891 382831 386595 390011 392870 395731 398609 400794 401779 401345 398872
55584 398872 393759 386805 380066 374745 369976 364174 356963 349217 341673 334168 326098 317300 308444 300508
55570 300508 293664 286862 279021 270512 262794 256587 251239 246075 241377 237406 233302 228032 222198 217787
55556 217787 215787 214726 212095 207010 201029 196345 193635 191896 190042 188047 186508 185715 185610 186177 187296
55541 187296 188412 189017 189404 190331 191816 192927 192957 192328 192002 192476 193758 195828 198490 201007 202633 203606
55525 203606 205058 207668 210907 214044 217521 222694 230175 238972 247547 255436 263642 273650 286337 301598
55511 301598 318734 337219 357243 379463 404094 430505 457749 484983 510984 533711 551103
55500 551103 562268 567383 566659 560056 547946 531227 510617 486482 459619 431686 404570 379722
55488C79722k1641j8090j5103j3302j2408j1811j1354j1012j0237q585o606n292
55476B34281m880m860m723m089k618p20L11j30q93p13n5J2K3J201K852K853R52
55459B18804p10q37p63k005l762m203l074j768j441k082l012l676m131m926o089
55444A76325o470n064k810j837k812m339n144n400n472n001l914l024k808k707
55430A19523k311k127k562l215l733m198m194k925q27M10J90k30l5j12r56j237
55414I1461q5J056O50k95M6J211J327J94q23j387k286l200k746r71K70p6r98j246
55396H2102r19p41r08j218j367q70M63J806J991R97j15o97r00p00J78J196J181
55379H1479K0r84r36n12p09j218r05N37K067K413J379Q7k14L94N36o54k277k721
$$ plain form
55488 379722 358081 339991 324888 311586 299178 287367 276013 265001 254764 246179 239573 234281
55476 234281 229401 224541 219818 215729 213111 212391 212702 212572 211679 210966 210911 210923 210946 212147 214999 217852 218804
55459 218804 218094 217257 216494 214489 210727 206524 203450 201682 200241 198159 195147 191471 187340 182414 176325
55444 176325 169855 164791 161981 160144 157332 152993 147849 142449 136977 131976 128062 125038 122230 119523
55430 119523 117212 115085 112523 109308 105575 101377 97183 94258 93431 93841 94031 93801 93766 93654 92698 91461
55414 91461 91376 92432 93082 92787 92833 94044 95371 95565 94742 93355 91069 87869 85123 84152 84422 84346 83348 82102
55396 82102 81183 80442 79534 78316 76949 76079 76542 78348 80339 81336 81221 80524 79624 78924 79102 80298 81479
55379 81479 81499 80515 79579 79067 78358 77140 76235 76772 78839 81252 82631 82718 82504 82898 83434 82780 80503 77782
55361G7782j517N24K455L579L167J068j433k597k161j421j277j227m97P68J868
55346G9081K397K344J953J735K110K786K917K059O06o95j362j412j352j732k332
55331H9103k198j015J28J81j74N72K439L776L443K010P03K29P81K013K735J765
55315A06491m61k104k106j322j002j246j544j897k504l031l082l002l429m209
55301G5552m428l479j702o6O61N38L91Q59J480J218k8r84m42J266K636K644J657
55284G7773Q34Q38J142P05o85k024k302j756j387j559j697j302n12M02J428K465
55268G2363L052K743J486l48k057k825k316j026K65J197J662J386L33q14j395
55253G3706j712k345k825k114l65R87J204J194J932K899K760J083j271l059l575
$$ plain form
55361 77782 76265 76789 79244 82823 85990 87058 85625 83028 80867 79446 78169 76942 76445 77213 79081
55346 79081 81478 83822 85775 87510 89620 92406 95323 97382 97988 97293 95931 94519 93167 91435 89103
55331 89103 86905 85890 86018 86199 86025 86597 89036 92812 96255 98265 98968 99197 99978 101991 104726 106491
55315 106491 106030 103926 101820 100498 99496 98250 96706 94809 92305 89274 86192 83190 79761 75552
55301 75552 71124 67645 65943 65877 66538 67076 67467 68326 69806 71024 70996 70012 69570 70836 73472 76116 77773
55284 77773 78607 79445 80587 81292 80607 78583 76281 74525 73138 71579 69882 68580 68068 68470 69898 72363
55268 72363 75415 78158 79644 79296 77239 74414 72098 71072 71337 72534 74196 75582 75915 75101 73706
55253 73706 71994 69649 66824 64710 64345 65332 66536 67730 69662 72561 75321 76404 75133 72074 68499
55238F8499k910j727p31k71m67j282k151k042o42R61J558J446J773K641L056K609
55222G0320J822Q36o86k131k076m66Q24N05m04m09J27j24j090j328j71J477K472
55205F9498K607K294J755R02k52j229j351n42K88J78o28r98m76K25L81P7l57p99
55187G1573r45l26Q22J499J136J53r74k180k987k334J3K614L702K803N75j951
55171G3193l404k414Q64M186N187L668J335j93n18j86j9l90p27j90J048J942K130
55154H5512K204K152J127n79j115K42J522Q70o13p65J54J91q46j187k44M81l5
55137H9071r31j108n99K48J440K485K313P58r19j645j731j959k369k481j993r13
55121G9667K74N53n91j983j760J56J771J586K65q00j302j580j417m62P97J454
$$ plain form
55238 68499 65589 63862 63131 62860 62393 61111 58960 56918 56276 57237 58795 60241 62014 64655 67711 70320
55222 70320 72142 72978 72292 70161 68085 67619 68443 68948 68544 68135 68262 68138 67048 65720 65549 67026 69498
55205 69498 72105 74399 76154 77056 76804 75575 74224 73682 73970 74148 73520 72522 72046 72271 72652 72729 72372 71573
55187 71573 70628 70302 71124 72623 73759 73912 72938 70758 67771 65437 65450 68064 71766 74569 75144 73193
55171 73193 69789 67375 68239 72425 77612 81280 82615 82422 81904 81718 81699 81309 80582 80392 81440 83382 85512
55154 85512 87716 89868 90995 90416 89301 89543 91065 91935 91322 90557 90711 90902 90056 88869 88625 89106 89071
55137 89071 88140 87032 86433 86681 88121 90606 92919 93677 92758 91113 89382 87423 85054 82573 80580 79667
55121 79667 79941 80494 79903 77920 76160 76316 78087 79673 79938 79138 77836 76256 74839 74377 75174 76628
55105G6628J319R45P72P34N10j95j301k082j725l86P61P93j25j239j870j471Q2
55088G2150J921K677K029J003M10j02q88j341r84n93j034j527n25J866L642L295
55072H1999J437k79j056j256j342j173l68R54K002K041J333J000J744K906L278
55057I3220K649K034K250K743K241M25j440j820o27O79Q31J23k56J58P28Q00M00
55040A05138j13m32j22J159K947M103M122L759L770L602K218j00j698j496k71
55025A26586M51K44oM75J355J858J846J688J295J32j496k103o93J706L079K731
55009A39148J623O10m57j622k099j367j83L39K9n20r64j266j250q75p14j362k473
54992A26597l036k526j286J42J356J836J105n66j998k076p72Q55J611J210M88
$$ plain form
55105 76628 77947 78892 79664 80398 80908 80713 79412 77330 75605 75219 75980 76773 76648 75409 73539 72068 72150
55088 72150 74071 76748 78777 79780 80190 80088 79200 77859 76875 76282 75248 73721 73196 75062 78704 81999
55072 81999 83436 83157 82101 80845 79503 78330 77962 78916 80918 82959 84292 85292 87036 89942 93220
55057 93220 95869 97903 100153 102896 105137 105562 104122 102302 101675 102354 103185 103308 103052 103210 103938 104738 105138
55040 105138 105025 104593 104471 105630 108577 112680 116802 120561 124331 127933 130151 130051 128353 126857 126586
55025 126586 127037 127281 127275 127750 129105 130963 132809 134497 135792 135924 134428 132325 131632 133338 136417 139148
55009 139148 140771 141381 140924 139302 137203 135836 135653 135992 136021 135501 134537 133271 132021 131146 130432 129070 126597
54992 126597 123561 121035 119749 119891 121247 123083 124188 123622 121624 119548 118776 119631 121242 122452 122940
54977A22940N23J452K315K134R56k84o87j30O80P64j28j081r98j01K58n18j362
54960A26733r14Q46K817L849L116L81l178n146m135j432O69J665K664L844L969
54945A35748K581J021M99N19N9p67j185j099r90r77p91m30r2J97L14r4r22j213
54927A32378k97J000J222K47n00K3J060J135Q1o58J34J805K572J809R16J372K596
54910A46895K730J491P28J738L227L039J160l03J99K096L876M740M823M509M046
54895A84994L622L575M459O602R358J1353J1989J2223J3154J4284J4277J3030
54883C02920J1735J0921R768P724N384L107Q9m172q429j1000j1912j2605j3726
54870B89804j4460j3895j2088r642p194n530n367o562q037q754q380o909m326
$$ plain form
54977 122940 123463 124915 127230 129364 130320 130036 129349 129219 129899 130663 130535 129454 128456 128355 128613 128095 126733
54960 126733 125819 126665 129482 133331 136447 136828 133650 128504 124369 122937 123606 125271 127935 131779 135748
54945 135748 138329 139350 139849 140368 140427 139660 138475 137376 136386 135409 134618 134188 134096 134293 134607 134513 133591 132378
54927 132378 132081 133081 134303 134550 134050 134073 135133 136268 136349 135691 135825 137630 140202 142011 142927 144299 146895
54910 146895 149625 151116 151844 153582 156809 159848 161008 160705 160904 163000 166876 171616 176439 180948 184994
54895 184994 188616 192191 196650 203252 212610 223963 235952 248175 261329 275613 289890 302920
54883 302920 314655 325576 335344 343068 348452 351559 351648 347476 339047 328047 316135 303530 289804
54870 289804 275344 261449 249361 239719 232525 226995 221628 215066 207029 198275 189895 182986 178660
54857A78660j080J641K767K404J720J773K720M075N492O980Q482R544R837R800
54843B44815J0212J0927J0844R603Q565R028R911Q619M392n60l876n843q329j1813
54829B96495j4764j5722j4773j2863j0761r041q176q045p893p252o513o068n435
54816A69189l907j936r91j886l732m854m380k784j141j70J91N17J084J406Q47
54801A47453j97m69M99J455J033k24n54M75J395J185P62J273J976J313n98k040
54785A54737k172j962k400l155l588l886m357m458l557k128j148o07L56J813K546
54770A26034J507p67k604k796j521M6Q56P62M66O66J353J879J691Q82J32P4P43
54753A29403J654K492L500M822N769N398L871K522K234K528K710L186M679O721
$$ plain form
54857 178660 177580 179221 181988 184392 186112 187885 190605 194680 200172 207152 215634 225178 235015 244815
54843 244815 255027 265954 276798 286401 294966 303994 313905 322524 326916 326356 322480 316637 308308 296495
54829 296495 281731 266009 251236 238373 227612 218571 210395 202350 194457 187205 180692 174624 169189
54816 169189 165282 163346 162355 160469 156737 151883 147503 144719 143578 143408 143599 144116 145200 146606 147453
54801 147453 147256 146787 147286 148741 149774 149550 148996 149471 150866 152051 152813 154086 156062 157375 156777 154737
54785 154737 152565 150603 148203 145048 141460 137574 133217 128759 125202 123074 121926 121319 121675 123488 126034
54770 126034 127541 126774 124170 121374 119853 119899 120755 121517 121983 122649 124002 125881 127572 128454 128586 128660 129403
54753 129403 131057 133549 137049 141871 147640 153038 156909 159431 161665 164193 166903 170089 174768 181489
54739A81489P983Q065P913Q347R160R988J1113J2692J3858J3558J2086J0963J1128
54726C18343J1806J1472R478O350K780j072n047q330r950r849q950q046p144o075
54712B95766n109m539m222m103m710o181p173n998k955l56K54q2M79K014L222
54697B56307L843N155P831J0564J1602J0896J0022J0289J1627J3162J4171J4419
54685C79888J4059J3583J3537J3946J3932J2098P516P02o283j1124j3101j3663
54673D25090j4723j6557j7880j7853j7032j6088j4734j2701j0943j0565j1037
54662B64977j0856r899r565j0302j0473q593n500l218k434k277k031j740j376
54649A86713p52l30r78k521l496k812r90P12J760K385K663K323J412N58L42N66
$$ plain form
54739 181489 189472 197537 205450 213797 222957 232945 244058 256750 270608 284166 296252 307215 318343
54726 318343 330149 341621 351099 357449 360229 359157 354110 345780 335830 325981 317031 308985 301841 295766
54712 295766 290657 286118 281896 277793 273083 266902 259729 253731 250776 250420 250674 250592 251071 253085 256307
54697 256307 260150 265305 273136 283700 295302 306198 316220 326509 338136 351298 365469 379888
54685 379888 393947 407530 421067 435013 448945 461043 468559 469261 462978 451854 438753 425090
54673 425090 410367 393810 375930 358077 341045 324957 310223 297522 286579 276014 264977
54662 264977 254121 244222 234657 224355 213882 205289 199789 196571 194137 191860 189829 188089 186713
54649 186713 185961 185631 184653 182132 178636 175824 174834 175546 177306 179691 182354 184677 186089 186647 186989 187555
54633A87555M36m92j689k203j744q74q2P73J799K497K402J874J535J273O72J09
54617A93841M92J822L068L571L754M115M427M345M026L739L501L611M670O553
54603B45535P984P894O684N560N089M999M842M174K605O08l76M25J778J944J139
54588C00884J111K388L517L505L425M645O659P961Q302Q752R892J1157J1968J2447
54574C96613J2841J3110J3188J2968J1882R317N613J819j774n904j0636j4386
54562D44651j5616j4763j3498j2519j1204r339p848p551q079q392p773o141m078
54549C17850k730k938m147m884m476l571k761j743m25K11o43k199k882k247j333
54534B81082j409k972n529p691q075o862n856o185o766o134m930m856n695n405
$$ plain form
54633 187555 187991 187499 185810 183607 181863 180989 180907 181680 183479 185976 188378 190252 191787 193060 193732 193841
54617 193841 194333 196155 199223 202794 206548 210663 215090 219435 223461 227200 230701 234312 238982 245535
54603 245535 253519 261413 268097 273657 278746 283745 288587 292761 295366 295974 295598 296023 297801 299745 300884
54588 300884 301995 304383 307900 311405 314830 319475 326134 334095 342397 351149 361041 372198 384166 396613
54574 396613 409454 422564 435752 448720 460602 469919 475532 477351 475577 469673 459037 444651
54562 444651 429035 414272 400774 388255 377051 367712 359864 352313 344234 335842 328069 321928 317850
54549 317850 315120 312182 308035 303151 298675 295104 292343 290600 290175 290386 289743 287544 284662 282415 281082
54534 281082 279673 276701 271172 263481 255406 248544 242688 236503 229737 223603 218673 213817 208122 202717
54520B02717l337j373j208k111k403j828j382j621k245k862l326l641l957m323
54506A67100m211k935q52O85R36O21P53J420K167K621K280O32j786l387l271k157
54490A60616j043j0R09R97J43l61K72O68p41k872l071o67K414M401N239N373M904
54473A77171M276M181M251L453K253K770N838R369J0746R782Q094O531M625K193
54459B55533Q7q08o52m86j312l194n158o182o356o538o947o819n786m691m515
54444A96176n079n343m580k867j013k60j357l365m236l097j282m11l23J39J086
54429A64188J598J392J190J455J856K085K260K427K408K262K213K125J725J310
54415A90494J456K055K436K471K661L071L115K661K290K171J677O38PM97J340
$$ plain form
54520 202717 199380 198007 196799 194688 192285 190457 189075 187454 185209 182347 179021 175380 171423 167100
54506 167100 162889 159954 159102 159787 160723 161344 162097 163517 165684 168305 170585 171217 169431 166044 162773 160616
54490 160616 159573 159563 160472 161469 161612 161251 161523 162191 161450 158578 155507 154840 157254 161655 166894 172267 177171
54473 177171 181447 185628 189879 193332 195585 198355 204193 213562 224308 234090 242184 248715 253340 255533
54459 255533 255620 254812 254160 253674 252362 249168 244010 237828 231472 224934 217987 211168 205382 200691 196176
54444 196176 191097 185754 181174 178307 177294 177034 175677 172312 168076 164979 163697 163286 162963 163102 164188
54429 164188 165786 167178 168368 169823 171679 173764 176024 178451 180859 183121 185334 187459 189184 190494
54415 190494 191950 194005 196441 198912 201573 204644 207759 210420 212710 214881 216558 217196 217203 217700 219040
54400B19040J303L73m47o54n89m89j35N25J015Q28j46j657l265m457m942m805
54384B01498m174l018j488j26O43Q51N84l56j852l113l470l085k297r36Q28J798
54368A82287J222M25J289L324M065K581O64KR5oK22J417K516K204J105O94P44
54351B04850k5j200p65J788M416N219M624M201M649N633O548O671N505L669K644
54336B58427L002L674L538K834K465K689L283M093M587L620P35k759m956n353
54322B79879n006m969n380n809n818n243m387l771l488l235l178l908n089n253
54308B15345l797k127j675j794j244q13k241m754n223k371J226K526J674Q51Q60
54293A96443P19J8j98Q79K503L238K519J198Q75K505N175O513N042K050L32J213
$$ plain form
54400 219040 220343 220716 220269 219615 219026 218537 218402 218927 219942 220770 220624 218967 215702 211245 206303 201498
54384 201498 197324 194306 192818 192692 193335 194186 194770 194414 192562 189449 185979 182894 180597 179661 180489 182287
54368 182287 183509 183934 185223 188547 192612 195193 195857 195859 195954 195948 196170 197587 200103 202307 203412 204106 204850
54351 204850 204825 203625 202860 204648 209064 214283 218907 223108 227757 233390 239938 246609 252114 255783 258427
54336 258427 261429 265103 268641 271475 273940 276629 279912 284005 288592 292212 292947 290188 285232 279879
54322 279879 274873 269904 264524 258715 252897 247654 243267 239496 236008 232773 229595 225687 220598 215345
54308 215345 211548 209421 207746 205952 204708 203895 201654 196900 191677 189306 190532 193058 194732 195583 196443
54293 196443 197162 197180 196982 197861 200364 203602 206121 207319 208194 210699 215874 222387 227429 229479 229811 231024
54277B31024L529N501O460O346M735J500k001l735l162j857j617k626l832m520
54263B35745m849n099n222n196n216n301n141m644m259m389m787m964m970n179
54249A66529n299m254j529J747L626L323J883O89k50j962m584o564o277m045j929
54234A41104j582k734l781l420j589P17K276K582K065J411P48j32r89j219p10
54219A34747MO33J378K063J881O25n38l71Q11J578J187J72o86j014n86O83K213
54202A44780K909K303J189P46J296K113K300J645P47L79P41J303J389P45m32j724
54186A62429k598k667k087j455j049n60P2J77p79k096k411j237O61K333L403L779
54170A55915L385K486J722J364R02k60j842k732k097k95J375J849J153P8p30j121
$$ plain form
54277 231024 234553 240054 246514 252860 257595 259095 257094 253359 250197 248340 246723 244097 240265 235745
54263 235745 230896 225797 220575 215379 210163 204862 199721 195077 190818 186429 181642 176678 171708 166529
54249 166529 161230 156976 155447 157194 160820 164143 166026 166715 166465 164503 159919 153355 147078 143033 141104
54234 141104 139522 136788 133007 129587 127998 128715 130991 133573 135638 137049 137797 137665 136676 135457 134747
54219 134747 134751 135384 136762 138825 140706 141331 140793 140422 141233 142811 143998 144170 143484 142470 141884 142567 144780
54202 144780 147689 149992 151181 151927 153223 155336 157636 159281 160028 160407 161148 162451 163840 164585 164153 162429
54186 162429 159831 157164 155077 153622 152573 152013 152085 152262 151483 149387 146976 145739 146400 148733 152136 155915
54170 155915 159300 161786 163508 164872 165774 165514 163672 160940 158843 158548 159923 161772 162925 163003 162273 161152
54154A61152j120p78l90k37j05M63J304J738J634J541J519P80r09k419k659j975
54138A59539j343r30l49K19K57k09q63j688k443k216o27J117J577R22J56p15k151
54121A50253l326k961j678j501k712l237j616J146L283M150L792K288M46l80k
54106A47945K63k63n90QN46m1j163j720j706j506q44K17L88j079k639k230k19
54089A35367J053L37j385k557k448j170M18R59n4j318j219j6O87L48o9N2J51k82
54071A28854j023j874k872l409k437j83J530J373N4r53j344j674j867j160M90
54056A13505K018K475K035J519J290J108P90N43M77K42n25j635k555l033l063
54041A15191k510j363j78M88J064K378L919L890J645r63j544P6J985K481J432
$$ plain form
54154 161152 160032 159254 158864 158627 158522 158985 160289 162027 163661 165202 166721 167501 166592 164173 161514 159539
54138 159539 158196 157266 156917 157136 157393 157184 156321 154633 152190 149974 149347 150464 152041 152963 153119 152404 150253
54121 150253 146927 143966 142288 140787 138075 134838 133222 134368 137651 141801 145593 147881 148327 147947 147945
54106 147945 148208 147945 147355 147363 147909 147868 146705 144985 143279 141773 140929 141146 141534 140455 137816 135586 135367
54089 135367 136420 136757 135372 132815 130367 129197 129615 130574 130520 129202 127983 127967 128654 129002 128933 128985 129136 128854
54071 128854 127831 125957 123085 119676 117239 117056 118586 119959 120013 119060 117716 116042 114175 113015 113505
54056 113505 115523 117998 120033 121552 122842 123950 124740 125283 125760 126002 125477 123842 121287 118254 115191
54041 115191 112681 111318 111140 111628 112692 115070 118989 122879 124524 123561 122017 122093 124078 126559 127991
54026A27991k55j550j810j151l05K36N91Q25N85r0l09N14J700K307K430K579K454
54009A36742J543M02R0N42Q26P38Q47J062O12l71o54L46J739K554K897L191L186
53992A56292K417J121J90M89K255M691O113N345L077J224Q54J440K254L480N425
53977A96667P420Q261P544O140N427O048P358Q190Q356Q866J0264J1425J0976
53964C02942R311Q009P589P224O598O381O643O364N166M132M059M081L047J288
53950C82834n6p30j355k220l057l781m589n510o356o882o722n610m116l497m218
53935C24135n196n104m032l113l078l880n269o754p311o143l836j983j568k255
53921B64613l170l672l362k116m57P00J062J314K128L143L388K570J451Q53O55
$$ plain form
54026 127991 127736 126186 124376 123225 122920 123156 123747 124572 125157 125067 124758 125272 126972 129279 131709 134288 136742
54009 136742 138285 138687 138777 139319 140145 140883 141730 142792 143404 143033 142379 142725 144464 147018 149915 153106 156292
53992 156292 158709 159830 160020 160509 162764 167455 173568 178913 181990 183214 184068 185508 187762 191242 196667
53977 196667 204087 212348 219892 226032 231459 237507 244865 253055 261411 270277 280541 291966 302942
53964 302942 312253 320262 327851 335075 341673 348054 354697 361061 366227 370359 374418 378499 381546 382834
53950 382834 382778 382048 380693 378473 375416 371635 367046 361536 355180 348298 341576 335966 331850 328353 324135
53935 324135 318939 313835 309803 306690 303612 299732 294463 287709 280398 274255 270419 268436 266868 264613
53921 264613 261443 257771 254409 252293 251836 252536 253598 254912 257040 260183 263571 266141 267592 268445 269100
53906B69100J73p39j348r51K55J387J727J172J74m97k60O43J325J353J231J356
53890B76101J064l64k141k615j475k00M5r0P02K483M151M940N179N634O597P521
53874C07532P472O006L752J953J460K260L677M658M321K915J943K521L818M184
53860C58472L536L334M149M814M565M475N781P870R130R070Q495Q087P862P746
53846D47386P811P997Q124Q003P316N891M342L654L678L000J092n25l33P90O67
53831E08893j210l376m781n922p447r036j0112j0539j0199q915p343o943q226
53818D14844r784r953q967q450q960r151p756n553m523n423p086q184q659q874
53804C03521q277o202l594k537l758n740o788o910o849o392m867k794j681k165
$$ plain form
53906 269100 269273 268534 267186 266235 266490 267877 269604 270776 270950 270453 270193 270836 272161 273514 274745 276101
53890 276101 277165 276801 274660 272045 270570 270370 270415 270325 271027 273510 277661 282601 287780 293414 300011 307532
53874 307532 315004 321010 324762 326715 328175 330435 334112 338770 343091 346006 347949 350470 354288 358472
53860 358472 362008 365342 369491 374305 378870 383345 389126 396996 406126 415196 423691 431778 439640 447386
53846 447386 455197 463194 471318 479321 486637 492528 496870 500524 504202 507202 508294 507769 507436 508226 508893
53831 508893 507683 504307 499526 493604 486157 477121 467009 456470 446271 437356 430013 423070 414844
53818 414844 405060 395107 386140 377690 368730 359579 351823 346270 341747 336324 329238 321054 312395 303521
53804 303521 295244 289042 285448 282911 279153 273413 266625 259715 252866 246474 241607 238813 237132 234967
53790B34967l290l882l836l790m039m173l568k079k54J146J824J920J416J53j458
53775B11057k347j916q48k74m28n59R4J542K955L134J528r13k400k180j168m45
53759B06832M2P07J122O25m12q55j67J227K607L332L041K233K268L905O119P142
53743B39768O473N079L991L498L509L872M463N452P191R306J0611J0555J0026
53730C23794R785R067O996M545L397L505L558L412M039N113M885K900Q55J01L5
53715C85987k10k65K65N62j99j526k513l040l237k874k294k698m300n382m528
53700C53748k815k286k982l262k567k089k667l603l958l737l445l286l267l371
53686C10413l328k833k158k011k597l301l500l223k848k584k457k513k778l138
$$ plain form
53790 234967 231677 227795 223959 220169 216130 211957 208389 206310 206056 207202 209026 210946 212362 212515 211057
53775 211057 208710 206794 205946 205672 205244 204685 204779 206321 209276 212410 213938 213025 210625 208445 207277 206832
53759 206832 206874 207581 208703 209328 208916 208061 207894 209121 211728 215060 218101 220334 222602 226507 232626 239768
53743 239768 246241 251320 255311 258809 262318 266190 270653 276105 283296 292602 303213 313768 323794
53730 323794 333579 342646 349642 354187 357584 361089 364647 368059 372098 377211 382096 384996 385851 385952 385987
53715 385987 385777 385512 385777 386339 386140 384614 382101 379061 375824 372950 370656 367958 363658 358276 353748
53700 353748 350933 348647 345665 342403 339836 337747 335080 331477 327519 323782 320337 317051 313784 310413
53686 310413 307085 304252 302094 300083 297486 294185 290685 287462 284614 282030 279573 277060 274282 271144
53672B71144l352l192k681k179k050k192k230k133k098j757l45J859L071J947
53658B53812m35j516j30K319L607K865R83m66l78J198L226M509M581L781K736
53643B80692K105K446L783N283N830N181M227L968M416M605L790K553K395L973
53629C35247N981O465N116L466K755K715K817L389M635N545N093L800K872K386
53615C92282J669R19R52J515J536R52O69N93m18k266l106j988k94M23M87P43O73
53598C95341n36k123k752k645k989l787m011l546l258l153k229k58J729K993L614
53583C72390L416J918j37r62r9Q23N57q1l6Rr36j942j244J012K901L460L569M006
53565C88624M236L664K881K856L517L897L363K312J772K431L889N030N290N264
$$ plain form
53672 271144 267792 264600 261919 259740 257690 255498 253268 251135 249037 247280 246935 248794 251865 253812
53658 253812 253377 251861 251731 254050 257657 260522 261505 261039 260661 261859 265085 269594 274175 277956 280692
53643 280692 282797 285243 289026 294309 300139 305320 309547 313515 317931 322536 326326 328879 331274 335247
53629 335247 341228 347693 352809 356275 359030 361745 364562 367951 372586 378131 383224 387024 389896 392282
53615 392282 393951 394870 395822 397337 398873 399825 400494 401087 400669 398403 395297 393309 393015 393438 393925 394668 395341
53598 395341 394805 392682 389930 387285 384296 380509 376498 372952 369694 366541 364312 364054 365783 368776 372390
53583 372390 375806 377724 377587 376625 376526 377349 377906 377825 377789 377798 376862 374920 373676 374688 377589 381049 384618 388624
53565 388624 392860 396524 399405 402261 405778 409675 413038 415350 417122 419553 423442 428472 433762 439026
53551D39026N564N636M568K856K302L956O896R345J0233R580Q108O862O600P153
53537E28685P757Q066Q401Q945R381R422R146Q682Q178Q059Q634R344R250Q248
53523F50198O986N679M153L080L610N319O052M696K695J780J589Q74j91o06n11
53508F95403p64j068l95J004J671J097K42j41k10L4R50K000J818J55j398j308
53492F99090K58K087L249L223J844j36j268r51p4M10P67J554K302K120J181N96
53476G16252J004K018L017L782M445N351O951R328J1741J2976J2373J0467Q662
53463H08367Q217R262J0719J1409J1270J1399J2863J5736J9150K1847K2882K2352
53451I85473K1583K2052K3975K6304K8013K8932K9412K9867L0677L1923L3138
$$ plain form
53551 439026 444590 450226 454794 457650 459952 463908 470804 480149 490382 499962 508070 514932 521532 528685
53537 528685 536442 544508 552909 561854 571235 580657 589803 598485 606663 614722 623356 632700 641950 650198
53523 650198 657184 662863 667016 670096 673706 679025 685077 689773 692468 694248 695837 696711 696520 695914 695403
53508 695403 694639 693571 693176 694180 695851 696948 697190 697049 696839 696873 697823 699823 701641 701796 700398 699090
53492 699090 699348 701435 704684 707907 709751 709615 708347 707396 707322 707732 708499 710053 712355 714475 715656 716252
53476 716252 717256 719274 722291 726073 730518 735869 742820 752148 763889 776865 789238 799705 808367
53463 808367 816584 825846 836565 847974 859244 870643 883506 899242 918392 940239 963121 985473
53451 985473 1007056 1029108 1053083 1079387 1107400 1136332 1165744 1195611 1226288 1258211 1291349
53440A291349L3998L5126L7339M0100M1818M1921M1442M1234M0920M0318M0572
53429A726137M2566M5129M6172M5198M3540M2478M2330M2968M4012M4563M3982
53418B209075M3018M3100M4260M4800M3408M0704L8236L6681L5628L4540L3250
53407B646700L1844L0612K9923K9596K8550K5700K1361J7285J4985J4218J3389
53396B904163J1288Q027M389R11k162m661o856r646j3593j7916k1175k2943k4055
53383B805771k5308k6891k9224l2992l7682m1138m1624l9768l7534l5894l4535
53372B423181l3365l3005l3642l4495l4587l3465l1134k8091k5483k4356k4367
53361B087191k3837k1459j7494j3146r298o238m115l019k612k013k06L239P616
$$ plain form
53440 1291349 1325347 1360473 1397812 1437912 1479730 1521651 1563093 1604327 1645247 1685565 1726137
53429 1726137 1768703 1813832 1860004 1905202 1948742 1991220 2033550 2076518 2120530 2165093 2209075
53418 2209075 2252093 2295193 2339453 2384253 2427661 2468365 2506601 2543282 2578910 2613450 2646700
53407 2646700 2678544 2709156 2739079 2768675 2797225 2822925 2844286 2861571 2876556 2890774 2904163
53396 2904163 2915451 2923478 2927867 2928778 2926616 2921955 2915099 2905453 2891860 2873944 2852769 2829826 2805771
53383 2805771 2780463 2753572 2724348 2691356 2653674 2612536 2570912 2531144 2493610 2457716 2423181
53372 2423181 2389816 2356811 2323169 2288674 2254087 2220622 2189488 2161397 2135914 2111558 2087191
53361 2087191 2063354 2041895 2024401 2011255 2001957 1995719 1991604 1988585 1985973 1983960 1983754 1986993 1994609
53348A994609J1489J4123J6435J9916K4584K8678L0740L1327L2138L4069L6867
53337B274975M0256M4236M8171N0864N2212N3944N7618O2274O5300O5740O5601
53326B881191O7304P0865P4499P7252P9747Q2575Q5328Q7639Q9977R2762R5287
53315C784426R6395R5765R3994R1615Q8822Q5983Q3722Q2126Q0244P6770P1296
53304D731158O4742N8462N2987M7825M2386L6647L0651K3978J6335Q312Q25o059
53292E108249j2833j9284k4617k9008l3896m0169m7066n3502n9604o5993p2294
53281D649983p7417q1052q3840q6142q7462q7208q5577q3511q2108q1926q2517
53270C731223q2688q1514p9115p6364p4143p2814p1947p0411o7310o3163n9544
$$ plain form
53348 1994609 2006098 2020221 2036656 2056572 2081156 2109834 2140574 2171901 2204039 2238108 2274975
53337 2274975 2315231 2359467 2407638 2458502 2510714 2564658 2622276 2684550 2749850 2815590 2881191
53326 2881191 2948495 3019360 3093859 3171111 3250858 3333433 3418761 3506400 3596377 3689139 3784426
53315 3784426 3880821 3976586 4070580 4162195 4251017 4337000 4420722 4502848 4583092 4659862 4731158
53304 4731158 4795900 4854362 4907349 4955174 4997560 5034207 5064858 5088836 5105171 5113483 5114308 5108249
53292 5108249 5095416 5076132 5051515 5022507 4988611 4948442 4901376 4847874 4788270 4722277 4649983
53281 4649983 4572566 4491514 4407674 4321532 4234070 4146862 4061285 3977774 3895666 3813740 3731223
53270 3731223 3648535 3567021 3487906 3411542 3337399 3264585 3192638 3122227 3054917 2991754 2932210
53259B932210n7259n5518n3260n0418m7328m3767l9619l5889l3853l3357l2917
53248B449025l1482k9320k7199k5365k3400k0638j6875j3003j0445r411q346n954
53236B227587l056j364q87K6K181M641O588Q672J1732J5221J7881J9518K1280
53223B330020K4215K8046L1327L2872L3081L3653L5621L7909L8568L7370L6273
53212B698955L7043L9122M0318L9070L5655L1506K7888K5154K2851K0309J7163
53201C035034J3546J0092P651O453N312K322l114r335j4049j6596j8017j9491
53189B999808k1527k4366k8090l2173l5769l8615m1088m3429m5481m7167m8496
53178B593607m9145m8728m7503m6179m5078m4224m4002m4739m5644m5354m3748
$$ plain form
53259 2932210 2874951 2819433 2766173 2715755 2668427 2624660 2585041 2549152 2515299 2481942 2449025
53248 2449025 2417543 2388223 2361024 2335659 2312259 2291621 2274746 2261743 2251298 2241887 2233541 2227587
53236 2227587 2224531 2223167 2222280 2222306 2224487 2229128 2235716 2244388 2256120 2271341 2289222 2308740 2330020
53223 2330020 2354235 2382281 2413608 2446480 2479561 2513214 2548835 2586744 2625312 2662682 2698955
53212 2698955 2735998 2775120 2815438 2854508 2890163 2921669 2949557 2974711 2997562 3017871 3035034
53201 3035034 3048580 3058672 3066323 3072776 3078088 3080410 3077296 3067961 3053912 3037316 3019299 2999808
53189 2999808 2978281 2953915 2925825 2893652 2857883 2819268 2778180 2734751 2689270 2642103 2593607
53178 2593607 2544462 2495734 2448231 2402052 2356974 2312750 2268748 2224009 2178365 2133011 2089263
53167B089263m2168m1455m0771l9073l6744l4954l4011l3330l2614l2103l1672
53156A690368l0616k8661k6674k5887k6362k6683k5461k2969k0927k0582k1595
53145A413951k2920k4018k4755k4830k4206k3600k3591k3565k2530k0796j9704
53134A159436j9716j9891j9474j8959j9128j9906k0583k0660k0080j9183j8536
53123I43320j8473j8653j8654j8722j9227j9589j8766j6903j5355j4940j5186
53112G48852j5464j5723j5702j4751j3082j2045j2306j2716j1945j0338r096q381
53100E97303p583o971p580r339j0625j0242q961q376q780r002q227p063o439o232
53086D81883n799n398n838o668o150l695j130n08j638k939l787m485m751m076
$$ plain form
53167 2089263 2047095 2005640 1964869 1925796 1889052 1854098 1820087 1786757 1754143 1722040 1690368
53156 1690368 1659752 1631091 1604417 1578530 1552168 1525485 1500024 1477055 1456128 1435546 1413951
53145 1413951 1391031 1367013 1342258 1317428 1293222 1269622 1246031 1222466 1199936 1179140 1159436
53134 1159436 1139720 1119829 1100355 1081396 1062268 1042362 1021779 1001119 981039 961856 943320
53123 943320 924847 906194 887540 868818 849591 830002 811236 794333 778978 764038 748852
53112 748852 733388 717665 701963 687212 674130 662085 649779 637063 625118 614780 605684 597303
53100 597303 589720 582749 575169 565830 555205 544963 536002 527626 518846 509844 501617 494554 488115 481883
53086 481883 476084 470686 464848 458180 452030 448335 447205 446697 445059 442120 438333 433848 429097 425021
53072D25021l329l978n563n799l596m50J599J917Q89q71k254k187j194j067k341
53057C96797l453l156k267k023k080j403n7J074J587J575J090M31K13M63N43M83
53041C89817J163K538L146K377J698K381L518L746L488L586K965M6m212o892o727
53026D02638n249m288m102m202m436m776n123n626o392o847o319n165m361m107
53012C31645l844l607m101n262n836m931l259k351k888m067m508l674k396j860
52998B79061k182k538k465k205j767q70n8m47j855k613k023j457j993k605k107
52983B51876j274j379j922j698r85p49o64N2Q08O37J10J18k40k027l764l170j049
52966B34680l04j386j974j303j298k595k940j009J174J409M47M7J10j81l05L85
$$ plain form
53072 425021 421692 417714 412151 406352 402756 402306 403905 405822 406711 405840 403586 401399 400205 399138 396797
53057 396797 393344 390188 387921 385898 383818 382415 382358 383432 385019 386594 387684 388115 388328 388791 389334 389817
53041 389817 390980 393518 396664 399041 400739 403120 406638 410384 413872 417458 420423 420469 416257 409365 402638
53026 402638 397389 393101 388999 384797 380361 375585 370462 364836 358444 351597 345278 340113 335752 331645
53012 331645 327801 324194 320093 314831 308995 304064 300805 298454 295566 291499 286991 283317 280921 279061
52998 279061 276879 274341 271876 269671 267904 267034 266976 266529 264674 262061 260038 258581 256588 253983 251876
52983 251876 250602 249223 247301 245603 244618 243869 243205 243257 244065 244702 244812 244930 244690 242663 238899 235729 234680
52966 234680 234376 232990 231016 229713 228415 225820 222880 221871 223045 224454 224901 224948 225058 224877 224572 224957
52950B24957Q70J0j336j657j224j248j513q23P92K107K580K635K389J687J122
52935B31348J447J987J151j249l432l772k634j485r65m07Q91K403K737J363l55
52920B29028m61J402L612M482L808K497J478J196J527J864J841J851K312K638
52906B59075K123J521K221L821M330L139K013K310L152L456L937N526P264P662
52892C11550P149P301Q283Q825Q230O871N108L238K248K883M181M330L015J420
52878C84632O9j642l522m000k412n19n40k431m229m662m327m181l978k964j517
52863C43777r96j784k437j555K85J450J492J132M39j251l439m434l841l283l698
52848C21857l609j487J627L468L422K385P71j386l066k952j363J93J187K174K956
$$ plain form
52950 224957 225827 225837 224501 222844 221620 220372 218859 218036 218828 220935 223515 226150 228539 230226 231348
52935 231348 232795 234782 235933 234684 231252 227480 224846 223361 222396 221989 222880 225283 228020 229383 229028
52920 229028 228567 229969 233581 238063 241871 244368 245846 247042 248569 250433 252274 254125 256437 259075
52906 259075 261198 262719 264940 268761 273091 276230 278243 280553 283705 287161 291098 296624 303888 311550
52892 311550 318699 326000 334283 343108 351338 358209 363317 366555 368803 371686 375867 380197 383212 384632
52878 384632 384701 383059 379537 375537 373125 372606 372066 369635 365406 360744 356417 352236 348258 345294 343777
52863 343777 342781 340997 338560 337005 337290 338740 340232 341364 341803 340552 337113 332679 328838 325555 321857
52848 321857 318248 316761 318388 321856 325278 327663 328434 327048 323982 321030 319667 319860 321047 323221 326177
52833C26177K502Q48n47q33o86q76j164j117q25k64R09K381L009K255J089Q03
52817C33661J605K733L460L496L026K614K637K550J362r22k947l363k147l61R00
52802C48304J125N53K8M00J711L232M186M247L525K490J749J326M79j120k299
52787C69936j491J082L363L838L087K606K929L425L410K867K274K061K165K151
52773D03703J942K035K698L295L115K504K348K601K387J498P72P47Q75L39j036
52758D29823k809m201m321l063j722j731k818l591l919n070p124q093o642m149
52744C70570k794k839l321m217n983p620p296m959k637j875k263k802l249l493
52730C15222k920j378J6J0j290k725l534l789l771l641l600l748l813l510l147
$$ plain form
52833 326177 328679 329527 328980 328147 327461 326585 325421 324304 323479 323215 324124 326505 329514 331769 332858 333661
52817 333661 335266 337999 341459 344955 347981 350595 353232 355782 357144 356222 353275 349912 347765 347404 348304
52802 348304 349429 349982 350010 350410 352121 355353 359539 363786 367311 369801 371550 372876 373355 372235 369936
52787 369936 368445 369527 372890 376728 379815 382421 385350 388775 392185 395052 397326 399387 401552 403703
52773 403703 405645 407680 410378 413673 416788 419292 421640 424241 426628 428126 428898 429645 430520 430859 429823
52758 429823 427014 422813 418492 415429 413707 411976 409158 405567 401648 396578 389454 381361 374719 370570
52744 370570 367776 364937 361616 357399 351416 343796 336500 331541 328904 327029 324766 321964 318715 315222
52730 315222 312302 310924 310940 310950 309660 306935 303401 299612 295841 292200 288600 284852 281039 277529 274382
52715B74382l267l677l429k088n85l58j833l997n299m773k628j45J163P79l83
52700B43862j123j289j590k209k447j981j565j954k696k737j932j263j543k572
52686B16961l555l902l574l026k808k990k988k337j439j069j250j228o44j65n74
52671A85412j564j906q19J107K426K271J111P3k85k75l05l80n27j110k267l390
52655A79572l694l111k338k051k223k049o79J545K808J684o61j452O3J489P21
52640A69624r87j079M27J300P73L58J026J826J909J798J795J115k39m63J588M258
52624A85029N076M035L179L540M160L998L293K751K582K626K719K639K272J855
52610B29754J627J252J47j658l464m627m881m215l003k193k606l943m986m849
$$ plain form
52715 274382 271115 267438 264009 261921 261336 260978 259145 255148 249849 245076 242448 242303 243466 244245 243862
52700 243862 242739 241450 239860 237651 235204 233223 231658 229704 227008 224271 222339 221076 219533 216961
52686 216961 213406 209504 205930 202904 200096 197106 194118 191781 190342 189273 188023 186795 186151 185986 185412
52671 185412 183848 181942 181123 182230 184656 186927 188038 188111 187826 187551 187246 186866 186339 185229 182962 179572
52655 179572 175878 172767 170429 168378 166155 164106 163427 164972 167780 169464 168803 167351 167414 168903 169624
52640 169624 168637 167558 167985 169285 170058 170416 171442 173268 175177 176975 178770 179885 179646 179183 180771 185029
52624 185029 190105 194140 197319 200859 205019 209017 212310 215061 217643 220269 222988 225627 227899 229754
52610 229754 231381 232633 232780 231122 227658 223031 218150 213935 210932 208739 206133 202190 197204 192355
52596A92355l641k001n84n3q82k686m163m106k476l72R82J129M23o23j801k965
52580A68536l621l241k042r79o16m20M31J854K943L005K095O10j044k323k678
52565A62510k047r97j81L20R70K078L138L024J189j348k703k092p48m26j387k419
52549A58881k628k345k244k307k095j446m33J026K792M055L949K665J371Q21P07
52534A62769O33R68K005K859K324P59q5O09J572J288J11l78N10J905K545J761
52518A82155l07k546l257j690Q35K317K463K675L732M745M672L620K116L68j033
52503B00865q08J402L825M239K646J259J826L759N006M261K111L54K54J393K283
52488B34675K087J272N86J23k27j38N62J186R66L43O37K286M053M253K464p7j621
$$ plain form
52596 192355 188714 186713 186129 186076 185194 182508 178345 174239 171763 171391 172373 173502 173925 173302 171501 168536
52580 168536 164915 161674 159632 158653 158037 157617 158048 159902 162845 165850 167945 168555 167511 165188 162510
52565 162510 160463 159466 159285 159605 160575 162653 165791 168815 170004 168656 165953 163861 163113 162687 161300 158881
52549 158881 156253 153908 151664 149357 147262 145816 145383 146409 149201 153256 157205 159870 161241 162062 162769
52534 162769 163402 164370 166375 169234 171558 172317 172232 172841 174413 175701 175812 175434 175944 177849 180394 182155
52518 182155 181848 179302 176045 174355 175190 177507 179970 182645 186377 191122 195794 199414 201530 201898 200865
52503 200865 200057 201459 205284 209523 212169 213428 215254 219013 224019 228280 230391 230745 230999 232392 234675
52488 234675 236762 238034 238620 238743 238516 238378 238940 240126 241092 241435 242072 244358 248411 252664 255128 255051 253430
52471B53430j385j50O59N04J45M36J093J101J71p81p16K87J151J077M64L39J024
52454B58849J809K056J997J960J456r7k058l084k848k239j886j563j206j188j252
52439B50706m73J068J881J164J20J68R24J166Q67Q88J267J242O17l1l04r6P94
52422B61968K135K796J955M61k20JJ19o6J75R00J307J201J147J042K9j694k460
52405B70796j245R65K537K892K340J329N83J001K460L473K842J113k57o57n94
52390B89578p10j183j711j646o00Q12J422J041Q23J524K311K075J161O66N49j78
52374B95934j478j924p61P33P30q01k091j838p12k76r22j561j336p40m86k7J746
52357B84190M467O207N831M433L747L906L643K312O38m19o80m73q7J21l11j356
$$ plain form
52471 253430 252045 251895 252554 253058 253203 253639 254732 255833 256004 255223 254507 254794 255945 257022 257486 257825 258849
52454 258849 260658 262714 264711 266671 268127 268030 265972 262888 260040 257801 255915 254352 253146 251958 250706
52439 250706 250233 251301 253182 254346 254466 254634 255558 256724 257591 258479 259746 260988 261605 261574 261270 261174 261968
52422 261968 264103 266899 268854 269315 269095 269096 269215 269149 269324 270224 271531 272732 273879 274921 274950 273256 270796
52405 270796 269551 270516 273053 275945 278285 279614 280197 281198 283658 287131 289973 291086 290829 290172 289578
52390 289578 288868 287685 285974 284328 283728 284540 285962 287003 287826 289350 291661 293736 294897 295563 296112 295934
52374 295934 294456 292532 291771 292504 293234 292433 290342 288504 287792 287516 286594 285033 283697 282957 282471 282444 284190
52357 284190 288657 294864 300695 305128 308875 312781 316424 318736 319374 318955 318275 317802 317715 317836 317525 316169
52341C16169k135j687j02J457J952J341J46j301k798l739l442k067n61N23J509
52326C05265K612L258K968K191J527P87j64l10J354L749M462K770N81k07J26M04
52310C31373O31J518K754L261K926K803L468M184M065L293K793L086L962M907
52296C75024N548N686N274M429L436K552J875J532J857L059M635N594N625N564
52282D31690O128O745O395N238M356M076L651K820K317K445K436J981K253M247
52268D86778O878Q032P184N835N448N988O608O800O581O103N582N302N484O213
52254E74816P412Q680R416R437R390J0096J1543J2947J3815J4581J5984J8017
52242G16134J9719K0091J9265J8566J9139K0677K1868K2078K2012K2600K3908
$$ plain form
52341 316169 314034 312347 312245 313702 315654 316995 317141 315840 313042 309303 305861 303794 303233 303756 305265
52326 305265 307877 311135 314103 316294 317821 318608 318444 318134 319488 323237 327699 330469 331050 330843 330969 331373
52310 331373 332004 333522 336276 339537 342463 345266 348734 352918 356983 360276 363069 366155 370117 375024
52296 375024 380572 386258 391532 395961 399397 401949 403824 405356 407213 410272 414907 420501 426126 431690
52282 431690 437818 444563 450958 456196 460552 464628 468279 471099 473416 475861 478297 480278 482531 486778
52268 486778 493656 501688 508872 514707 520155 526143 532751 539551 546132 552235 557817 563119 568603 574816
52254 574816 582228 590908 600324 609761 619151 629247 640790 653737 667552 682133 698117 716134
52242 716134 735853 755944 775209 793775 812914 833591 855459 877537 899549 922149 946057
52231I46057K5484K7156K8878L0153L0266K9132K7637K6984K7667K8822K8795
52220A257031K6905K4523K3613K4187K4254K2515J9866J7728J6167J4681J3599
52209A485069J3255J2672J0651P768N705M861M241L500L362L754L396J846M15
52196A560495O8j79j619l536l941k170M34K345L396M419N983P776Q955R018Q422
52181A599866Q189Q939J0549J2653J4912J6603J6816J5539J4114J3929J4904J5727
52169A762740J5392J4104J2829J2258J2058J1038Q335M695K006J209J186L36j345
52156A856841k577l043m110o997j0955j3917j4694j4135j4086j5550j7938j9931
52144A718908k0803k0664j9839j8582j7504j7414j8278j8811j7846j5740j3767
$$ plain form
52231 946057 971541 998697 1027575 1057728 1087994 1117126 1144763 1171747 1199414 1228236 1257031
52220 1257031 1283936 1308459 1332072 1356259 1380513 1403028 1422894 1440622 1456789 1471470 1485069
52209 1485069 1498324 1510996 1521647 1529415 1535120 1539981 1544222 1547722 1551084 1554838 1558234 1560080 1560495
52196 1560495 1560563 1560384 1558765 1555229 1551288 1549118 1549552 1551897 1555293 1559712 1565695 1573471 1582426 1591444 1599866
52181 1599866 1608055 1616994 1627543 1640196 1655108 1671711 1688527 1704066 1718180 1732109 1747013 1762740
52169 1762740 1778132 1792236 1805065 1817323 1829381 1840419 1848754 1853449 1855455 1856664 1857850 1858186 1856841
52156 1856841 1854264 1851221 1847111 1840114 1829159 1815242 1800548 1786413 1772327 1756777 1738839 1718908
52144 1718908 1698105 1677441 1657602 1639020 1621516 1604102 1585824 1567013 1549167 1533427 1519660
52133A519660j2453j1311j0040q949q219p684p520q087q745p980n487l130k839
52120A417216m227n363n381n040m999m937m574m356m619m963m925m585m166l733
52106A351348l551m046n031n719n749n460m879l552j872j364k674m423n053m845
52092A293130m755m405l015j591j920l486l729j787J22n4j442j974j436j280k312
52077A260066l931n194n579n069m341m325m973n111m176l271l507m277m346l914
52063A198052m020m408l738j882m48n37j199p64J172L584N244N624N128M841N752
52048A212401P886J0392J2425J3733J4456J4882J5428J6602J8745K1746K4833
52037A383529K6774K6973K6444K6968K8886L0677L1216L1350L2322L3711L4190
$$ plain form
52133 1519660 1507207 1495896 1485856 1476907 1468688 1461004 1453484 1445397 1436652 1428672 1423185 1420055 1417216
52120 1417216 1412989 1407626 1402245 1397205 1392206 1387269 1382695 1378339 1373720 1368757 1363832 1359247 1355081 1351348
52106 1351348 1347797 1343751 1338720 1333001 1327252 1321792 1316913 1313361 1311489 1310125 1307451 1303028 1297975 1293130
52092 1293130 1288375 1283970 1280955 1279364 1277444 1273958 1270229 1268442 1268564 1268510 1267068 1265094 1263658 1262378 1260066
52077 1260066 1256135 1250941 1245362 1240293 1235952 1231627 1226654 1221543 1217367 1214096 1210589 1206312 1201966 1198052
52063 1198052 1194032 1189624 1185886 1184004 1183556 1183019 1181820 1181056 1182228 1185812 1191056 1196680 1201808 1206649 1212401
52048 1212401 1220287 1230679 1243104 1256837 1271293 1286175 1301603 1318205 1336950 1358696 1383529
52037 1383529 1410303 1437276 1463720 1490688 1519574 1550251 1581467 1612817 1645139 1678850 1713040
52026A713040L3577L2657L1588L0047K8480K7531K6458K3900K0094J6620J3996
52015A997988J1419Q876P348O460M276L48l108m399m766o162q254r484r809j0428
52001A980305j1606j2609j3262j3899j4142j3299j1749j0493r535q040n981m286
51989A851404l370k645j581k54J182K660L869M551N053N818O653P228P957R363
51975A897888J0993J2015J2465J2698J2057R687O492M499M098L481J296j657l961
51962A982051n350o220o689p103q428j1106j4210j6601j8167j9323k0152k0862
51950A827840k2203k4364k6174k6497k6016k6493k8557l1165l3048l3808l3659
51939A515856l3000l2333l1960l1671l1160l0616l0407l0410l0248k9981k9875
$$ plain form
52026 1713040 1746617 1779274 1810862 1840909 1869389 1896920 1923378 1947278 1967372 1983992 1997988
52015 1997988 2009407 2018283 2025631 2032091 2036367 2036715 2033607 2029208 2024442 2018280 2010026 2000542 1990733 1980305
52001 1980305 1968699 1956090 1942828 1928929 1914787 1901488 1889739 1879246 1869711 1861671 1855690 1851404
51989 1851404 1848034 1845389 1843808 1843554 1844736 1847396 1851265 1855816 1860869 1866687 1873340 1880568 1888525 1897888
51975 1897888 1908881 1920896 1933361 1946059 1958116 1967803 1974295 1978794 1982892 1986373 1987669 1986012 1982051
51962 1982051 1976701 1970481 1963792 1956689 1948261 1937155 1922945 1906344 1888177 1868854 1848702 1827840
51950 1827840 1805637 1781273 1755099 1728602 1702586 1676093 1647536 1616371 1583323 1549515 1515856
51939 1515856 1482856 1450523 1418563 1386892 1355732 1325116 1294709 1264299 1234051 1204070 1174195
51928A174195k9660k8827k7597k6816k6821k7057k6931k6404k5626k4696k3941
51917H79819k3725k3704k2898k1007j9024j8032j7815j7360j6427j5828j6122
51906F67877j6669j6344j4858j2934j1400j0490j0115j0314j0942j1162r978p564
51894E25107n600n620p167q061o654l492p17j11j753m264o163p051p503p845p488
51879D45618n925l930k856k842k647j609p23j181k645l800m012l501k457j168
51865D06322o41j739l617m415l720l028l229l134j629Nn09l180n498n332k938
51850C63718j57J228L28k290m586m693l020j751j981k572k290j684j870k545k558
51835C33277j700o79J69Q03P03m06j307m89J310J466j065m030m556k474j6R41
$$ plain form
51928 1174195 1144535 1115708 1088111 1061295 1034474 1007417 980486 954082 928456 903760 879819
51917 879819 856094 832390 809492 788485 769461 751429 733614 716254 699827 683999 667877
51906 667877 651208 634864 620006 607072 595672 585182 575067 564753 553811 542649 532671 525107
51894 525107 519507 513887 506720 498659 492005 488513 487796 487685 485932 481668 475505 468454 460951 453106 445618
51879 445618 439693 435763 432907 430065 427418 425809 425086 423905 421260 417460 413448 409947 407490 406322
51865 406322 405681 403942 400325 395910 392190 389162 385933 382799 381170 381175 380666 377486 371988 366656 363718
51850 363718 363561 364789 365117 362827 358241 353548 350528 348777 346796 344224 341934 340250 338380 335835 333277
51835 333277 331577 330898 331067 331870 332573 332167 330860 330371 331681 333147 332082 328052 323496 321022 321006 321947
51819C21947L16q50j389o02J163K544K453J248J09m00m98j02J222L159M317L654
51803C38291J758K11m9O53J491J961J910J316M72J16Q49K257L121K853K314K676
51787C62200L754M211L367J936Q86L61R4Qj07p26j745k246j885j677k319k514
51771C63598n45K789M581L398R69k56J88J276K332L258L734L503K944K400J421
51756C95590l55j959j999o22O24R13R82J575K163J768L34j316k445k827k657k416
51740C87353k441k344j330N31K036K365K198K546K912J896m65k218j868j77J146
51725C92140J719K356L143L094J873N53N9j51r44j846j658l56Q68J395J753K253
51709D06251K408K175K462L473L730K017m95j479l91J256K339L230M349N220N534
$$ plain form
51819 321947 322263 321413 320024 319422 320585 323129 325582 326830 326939 326539 326041 325939 327161 330320 334637 338291
51803 338291 340049 340260 340211 340864 342355 344316 346226 347542 348014 348130 348979 351236 354357 357210 359524 362200
51787 362200 365954 370165 373532 375468 376354 376715 376809 376817 376710 375984 374239 371993 370108 368431 366112 363598
51771 363598 363053 365842 370423 373821 374790 374534 374722 375998 378330 381588 385322 388825 391769 394169 395590
51756 395590 395235 393276 391277 390655 391279 392192 393174 394749 396912 398680 399014 397698 395253 392426 389769 387353
51740 387353 384912 382568 381238 381769 383805 386170 388368 390914 393826 395722 395257 393039 391171 390994 392140
51725 392140 393859 396215 399358 402452 404325 404878 404937 404786 403842 401996 400338 399982 400850 402245 403998 406251
51709 406251 408659 410834 413296 416769 420499 422516 422021 420542 420151 421407 423746 426976 431325 436545 442079
51694D42079N819O247N991M690L590M154O052P583P717O888O060N769N829N420
51680E23888L761J248o33j129j259k165l207l009j801j137j451j639j245j300
51666E08922k301k949j959l4J191J254P83l2j507l209l963l366k398k267l152
51651D85013m277m832m613m056l661l267k209m22R98R16l99j615k004k042k264
51636D51266k408k061j494j223j090n30M03J009J089J357K253K966K523J529J719
51621D57308L618N754O683O678O499N651L437J006L30J214J369q2j172j47J853
51606D99999K617J841O59o39k405l851l611j982p96r92j848k741l933n404o430
51591D70484o809p140p441o819n108l492k854k688k381k316k907l665m089m455
$$ plain form
51694 442079 447898 454145 460136 464826 468416 472570 478622 486205 493922 500810 506870 512639 518468 523888
51680 523888 527649 528897 528264 527135 525876 523711 520504 517495 515694 514557 513106 511467 510222 508922
51666 508922 506621 503672 501713 501679 502870 504124 504907 504875 503368 500159 496196 492830 490432 488165 485013
51651 485013 480736 475904 471291 467235 463574 460307 458098 457676 458674 459590 459191 457576 455572 453530 451266
51636 451266 448858 446797 445303 444080 442990 442460 442863 443872 444961 446318 448571 451537 454060 455589 457308
51621 457308 460926 466680 473363 480041 486540 492191 495628 496634 496964 498178 499547 499465 498293 498146 499999
51606 499999 502616 504457 505116 504477 502072 498221 494610 492628 491832 490840 488992 486251 482318 476914 470484
51591 470484 463675 456535 449094 442275 437167 433675 430821 428133 425752 423436 420529 416864 412775 408320
51577D08320m918m856l984l051k607k237j950k826m862n683l404J95J573k6k138
51562C67546k894k859k939k790k069j311o63N71K231K764J493K7R5J144J489R19
51546C62754P04J544K937M251N204N478M822L609K494J648R47O35J124K295L607
51531D04053M648N080M610L688L655N268P468Q559Q224P445O846O315N974O133
51517D87966O271N374L470J714P22k8r60j751k178k348j882l10J245N58k565n191
51501D90107m692k016L6O80J362K774L861L880L497L376L243L043L593N238O793
51486E24775O822N383L767K909K751K757K401J414J8j092j341p41L17J454K314
51471E53908K532K023J197P36J154K347L341K837O00j849k652j711o17n62j279
$$ plain form
51577 408320 403402 398546 394562 391511 388904 386667 384717 381891 377029 371346 367942 368137 369710 369684 367546
51562 367546 364652 361793 358854 356064 353995 352684 352021 352592 354823 357587 359080 359107 359202 360346 361835 362754
51546 362754 363458 365002 367939 372190 377394 382872 387694 391303 393797 395445 396392 397027 398151 400446 404053
51531 404053 408701 413781 418391 422079 425734 431002 438470 447029 455253 462698 469544 475859 481833 487966
51517 487966 494237 499611 503081 504795 505517 505489 504529 502778 500600 498252 496370 496060 497305 497863 495298 490107
51501 490107 485415 483399 483435 484115 485477 488251 492112 495992 499489 502865 506108 509151 512744 517982 524775
51486 524775 531597 536980 540747 543656 546407 549164 551565 552979 552997 551905 550564 549823 550140 551594 553908
51471 553908 556440 558463 559660 560396 561550 563897 567238 570075 570675 568826 566174 564463 563846 563284 562005
51456E62005k120k972l632l510k719k474l418m416m130l137l178m663o180o365
51442E09091n229l697k775k980l707l351j267P29J79k652m746m047j646K11P52
51427D74865M00o45k074k707j600M43J818K264K898M327N844O605O533O000N490
51412E10461N601O432O959O026M146L312M629P015Q704R123Q700P699O188M692
51398E99687L920L979M431M917N130M438K325o57k964l404k266j055j103k253
51384F15125k888j631Q20K255J640M57N05J267Q07j065k418k291k341m382p582
51369E98278r625r839r551r633r346p923n976m760m771n677o896p801p799o823
51355D91858n465m230l046j786q19n58p26o03O9Q56J271J379J679K524L603M145
$$ plain form
51456 562005 559885 556913 553281 549771 547052 544578 541160 536744 532614 529477 526299 521636 515456 509091
51442 509091 503862 500165 497390 494410 490703 487352 486085 486814 486993 484341 479595 475548 473902 474113 474865
51427 474865 475265 474620 472546 469839 468239 468682 470500 472764 475662 479989 485833 492438 498971 504971 510461
51412 510461 516062 522494 529453 535479 539625 542937 547566 554581 563285 572408 581108 588807 594995 599687
51398 599687 603607 607586 612017 616934 622064 626502 628827 628170 625206 621802 619536 618481 617378 615125
51384 615125 612237 610606 611426 613681 615321 615778 616283 617550 618357 617292 614874 612583 610242 605860 598278
51369 598278 588653 578814 569263 559630 550284 542361 536385 531625 526854 521177 514281 506480 498681 491858
51355 491858 486393 482163 479117 477331 476512 475954 475228 474625 474694 475550 476821 478200 479879 482403 486006 490151
51339D90151L815L229L134L208K449Q31m74r53j829m289p410r099q806p983p943
51324D58031q367q285p459o361n587n697o869q290q555p257n619n066n690o635
51310C62294p341p689p413o281m783l841l748l922l737l180k665k620l214m054
51296B97806m268l334j878j129j458j968j710p89O0O02J168J759J751P55n67j077
51280B85723n42rn38j767k203r46J221K656K583J820J875L369N266N673L762R46
51264C08889k36J413M578O948P484O791N759M588L293K398K571L724M866M878
51250C67944L362Q99j355k438k263j733k027l596n736p144o974n414l472k309
51236C27744k556l935n497o469o863o981o575n111k963j419j118j357j456j912
$$ plain form
51339 490151 493966 497195 500329 503537 505986 506817 506343 505390 503561 499272 491862 482763 473957 465974 458031
51324 458031 449664 441379 433920 427559 421972 416275 409406 401116 392561 385304 379685 374619 368929 362294
51310 362294 354953 347264 339851 333570 328787 324946 321198 317276 313539 310359 307694 305074 301860 297806
51296 297806 293538 290204 288326 287197 285739 283771 282061 281272 281332 281934 283102 284861 286612 287367 286800 285723
51280 285723 285181 285172 284634 282867 280664 279718 280939 283595 286178 287998 289873 293242 298508 304181 307943 308889
51264 308889 308653 310066 314644 321592 329076 335867 341626 346214 349507 351905 354476 358200 363066 367944
51250 367944 371306 372205 370850 368412 366149 364416 362389 358793 353057 345913 338939 333525 330053 327744
51236 327744 325188 321253 315756 309287 302424 295443 288868 283757 280794 279375 278257 276900 275444 273532
51222B73532l089l836k942j375j208k333k467q00N80q5j552j777j104j240k121
51207B48183k098p64M89P71O87Q39R42P43M67l0j233k733l239k276p07O99J967
51190B42707K835K401O49q95r79j46L38K07j6p5J7L24N07j50j358j485K48K046
51172B47175J544r30k707k318j118r73j737j814m67J327K198K045K155L614N721
51157B53715O417M597J499o46r25j13Q13J512J782J296K09n55j94J077K161K087
51141B74732Q89l49n14L22R39M90m49p52j73O45J177J298Q40j71r84o38Q15K233
51123B80350K603J852N23o03q01j16K06j085l531n292n278m020k343l53J718K832
51107B66662K153J85j867l278l852l511k609k076k348k534j517M04J798J842R33
$$ plain form
51222 273532 270443 266607 263665 262290 261082 258749 256282 255482 256062 255977 254425 252648 251544 250304 248183
51207 248183 246085 245321 245810 246581 247268 248107 249049 249792 250259 250229 248996 246263 243024 240748 240041 240740 242707
51190 242707 245542 247943 248592 247697 246718 246572 246910 247117 247101 247026 247043 247367 247874 247724 246366 244881 245129 247175
51172 247175 248719 247789 245082 242764 241646 240673 238936 237122 236655 237982 240180 242225 244380 247994 253715
51157 253715 260132 264729 266228 265582 264657 264544 265357 266869 268651 269947 270156 269601 269407 270484 272645 274732
51141 274732 275621 275272 274758 275080 276019 276509 276060 275308 275135 275780 276957 278255 279095 278924 277940 277302 278117 280350
51123 280350 282953 284805 285328 284725 283924 283808 284014 282929 279398 274106 268828 264808 262465 262112 263830 266662
51107 266662 268815 269000 267133 263855 260003 256492 253883 251807 249459 246925 245408 245812 247610 249452 250385
51092B50385l21j757l007l155j629Q45K711K961J889N61k75o28p50n36K79J380
51076B48953J905J467P14N28J037J811K625L337L284J692j017l067l039j494m03
51061B58333r37k258k619j391K59O40p61k806l743k657k75J523J362j76j102l67
51045B43025Q43P33n75j205r6J822L304M340N255N330L552L77k375l268k211M6
51029B58897K460L839L499K073J033J104J644J791J554J453J529J214J43j216
51015B81017j814r39R79K646L118K607J884J203L36n15n94N33K370L906M285L174
50999C04196J039q38j295n09K47K95L56J273K615L221K761J843Q66l30j489j614
50983C12637j74J908L132L022K279J561Q64J38k01K03J047J726J900J457M16o53
$$ plain form
51092 250385 250064 248307 245300 242145 240516 241361 244072 247033 248922 249483 249208 248580 247830 247294 247573 248953
51076 248953 250858 252325 253039 253567 254604 256415 259040 262377 265661 267353 266336 263269 260230 258736 258333
51061 258333 257396 255138 252519 251128 251387 252027 251266 248460 244717 242060 241785 243308 244670 244494 243392 243025
51045 243025 243868 244601 244026 242821 242725 244547 247851 252191 257446 262776 266328 266705 264330 261062 258851 258897
51029 258897 261357 265196 268695 270768 271801 272905 274549 276340 277894 279347 280876 282090 282233 281017
51015 281017 279203 278264 279243 281889 285007 287614 289498 290701 291037 290522 289928 290461 292831 296737 301022 304196
50999 304196 305235 304397 303102 302593 302840 303135 303491 304764 307379 310600 313361 315204 316070 315740 314251 312637
50983 312637 312463 314371 317503 320525 322804 324365 325229 325367 325166 325369 326416 328142 330042 331499 331915 331262
$$ [...]
##END NTUPLES=NMR SPECTRUM
##END=
