
##TITLE=AC1139_castillo_5906744_Dp2oC3caZU
##JCAMPDX= 6.0         $$ Bruker NMR JCAMP-DX V2.0
##DATA TYPE= NMR SPECTRUM
##DATA CLASS= NTUPLES
##ORIGIN= BRUKER
##OWNER= Administrator
$$ 1.72 TOPSPIN		Version 2.1
$$ 2012-04-10 10:14:02.750 -0500  Administrator@TOPSPIN
$$ Compression mode = diff/dup
##.OBSERVE FREQUENCY= 400.13188235
##.OBSERVE NUCLEUS= ^1H
##.ACQUISITION MODE= SIMULTANEOUS (DQD)
##.ACQUISITION SCHEME= undefined
##.AVERAGES= 8
##.DIGITISER RES= 22
##SPECTROMETER/DATA SYSTEM= spect
##.PULSE SEQUENCE= zg30
##.SOLVENT NAME= COFFEE_meoh
##.SHIFT REFERENCE= INTERNAL, COFFEE_meoh, 1, 14.98061
##AUDIT TRAIL= $$ (NUMBER, WHEN, WHO, WHERE, PROCESS, VERSION, WHAT)
$$ ##TITLE= Audit trail, TOPSPIN		Version 2.1
$$ ##JCAMPDX= 5.01
$$ ##ORIGIN= Bruker BioSpin GmbH
$$ ##OWNER= Administrator
$$ $$ C:\Bruker\TOPSPIN/data/COFFEE/nmr/AC1139_castillo_5906744_Dp2oC3caZU/10/pdata/1/auditp.txt
$$ ##AUDIT TRAIL=  $$ (NUMBER, WHEN, WHO, WHERE, PROCESS, VERSION, WHAT)
(   1,<2012-04-04 16:25:05.593 -0500>,<Administrator>,<TOPSPIN>,<go>,<TOPSPIN 2.1>,
      <created by zg
	started at 2012-04-04 16:23:59.031 -0500,
	POWCHK enabled, PULCHK disabled,
       configuration hash MD5:
       1A 1E CE 29 27 FD 77 03 67 4E F0 E3 C4 B2 CB 90
       data hash MD5: 64K
       3F DC 5F 04 3C 93 2A 74 76 10 14 59 BF 9D 3B 8B>)
(   2,<2012-04-04 16:25:08.890 -0500>,<Administrator>,<TOPSPIN>,<proc1d>,<TOPSPIN 2.1>,
      <Start of raw data processing
       efp LB = 0 FT_mod = 6 PKNL = 1 PHC0 = 0 PHC1 = 0 SI = 32K 
       data hash MD5: 32K
       7B E4 3E 94 A7 8F 38 D9 2C E8 73 0A 7F 7F 70 CB>)
(   3,<2012-04-04 16:25:09.218 -0500>,<Administrator>,<TOPSPIN>,<proc1d>,<TOPSPIN 2.1>,
      <pk PHC0 = 215.3101 PHC1 = 0 
       data hash MD5: 32K
       51 23 EB C2 00 E8 E8 6E FB F1 3A E5 88 61 D7 73>)
(   4,<2012-04-04 16:25:09.421 -0500>,<Administrator>,<TOPSPIN>,<proc1d>,<TOPSPIN 2.1>,
      <abs ABSG = 1 
       data hash MD5: 32K
       66 34 25 EF C2 A9 9C 13 CD 01 37 97 6E 34 C5 7E>)
(   5,<2012-04-04 16:25:09.515 -0500>,<Administrator>,<TOPSPIN>,<proc1d>,<TOPSPIN 2.1>,
      <abs ABSG = 2 
       data hash MD5: 32K
       03 AB 36 DD 90 67 A1 D0 2C BB 0D EB 30 AF E3 8D>)
(   6,<2012-04-04 16:25:09.546 -0500>,<Administrator>,<TOPSPIN>,<proc1d>,<TOPSPIN 2.1>,
      <abs ABSG = 3 
       data hash MD5: 32K
       6E 6C 55 A0 76 9A A7 B7 D5 E4 C4 8B D7 6F D6 56>)
(   7,<2012-04-04 16:25:09.578 -0500>,<Administrator>,<TOPSPIN>,<proc1d>,<TOPSPIN 2.1>,
      <abs ABSG = 4 
       data hash MD5: 32K
       14 1D B8 92 67 79 A6 BD 74 42 92 B3 38 6C B0 8B>)
(   8,<2012-04-04 16:25:09.609 -0500>,<Administrator>,<TOPSPIN>,<proc1d>,<TOPSPIN 2.1>,
      <abs ABSG = 5 
       data hash MD5: 32K
       73 62 B0 AF F1 AA 34 6E 4E 02 D3 A4 6F D3 40 FA>)
(   9,<2012-04-04 16:25:13.687 -0500>,<Administrator>,<TOPSPIN>,<audit>,<TOPSPIN 2.1>,
      <user comment:
       ICON-NMR User ID: COFFEE
       data hash MD5: 32K
       73 62 B0 AF F1 AA 34 6E 4E 02 D3 A4 6F D3 40 FA>)
$$ ##END=
$$ 
$$ [...]
150 150 150 150 150 150 150 150
##$TP07= 0
##$TPNAME0= <>
##$TPNAME1= <>
##$TPNAME2= <>
##$TPNAME3= <>
##$TPNAME4= <>
##$TPNAME5= <>
##$TPNAME6= <>
##$TPNAME7= <>
##$TPOAL= (0..7)
0.5 0.5 0.5 0.5 0.5 0.5 0.5 0.5
##$TPOFFS= (0..7)
0 0 0 0 0 0 0 0
##$TUNHIN= 0
##$TUNHOUT= 0
##$TUNXOUT= 0
##$USERA1= <user>
##$USERA2= <user>
##$USERA3= <user>
##$USERA4= <user>
##$USERA5= <user>
##$V9= 5
##$VALIST= <valist>
##$VCLIST= <CCCCCCCCCCCCCCC>
##$VD= 0
##$VDLIST= <DDDDDDDDDDDDDDD>
##$VPLIST= <PPPPPPPPPPPPPPP>
##$VTLIST= <TTTTTTTTTTTTTTT>
##$WBST= 2048
##$WBSW= 25
##$XGAIN= (0..3)
0 0 0 0
##$XL= 0
##$YL= 0
##$YMAX_a= 541222
##$YMIN_a= -647567
##$ZGOPTNS= <>
##$ZL1= 120
##$ZL2= 120
##$ZL3= 120
##$ZL4= 120
##$ABSF1= 14.98061
##$ABSF2= -5.57192
##$ABSG= 5
##$ABSL= 3
##$ALPHA= 0
##$AQORDER= 0
##$ASSFAC= 0
##$ASSFACI= 0
##$ASSFACX= 0
##$ASSWID= 0
##$AUNMP= <proc_prof1d_extract_pilot.lims>
##$AXLEFT= 0
##$AXNAME= <>
##$AXNUC= <1H>
##$AXRIGHT= 0
##$AXTYPE= 0
##$AXUNIT= <>
##$AZFE= 0.1
##$AZFW= 0.1
##$BCFW= 0
##$BC_mod= 0
##$BYTORDP= 0
##$COROFFS= 0
##$CY= 15
##$DATMOD= 1
##$DC= 0
##$DFILT= <>
##$DTYPP= 0
##$F1P= 0
##$F2P= 0
##$FCOR= 0.5
##$FTSIZE= 32768
##$FT_mod= 6
##$GAMMA= 0
##$GB= 0
##$INTBC= 1
##$INTSCL= 1
##$ISEN= 128
##$LB= 0
##$LEV0= 0
##$LPBIN= 0
##$MAXI= 10000
##$MC2= 0
##$MEAN= 0
##$ME_mod= 0
##$MI= 0
##$NCOEF= 0
##$NC_proc= -8
##$NLEV= 6
##$NOISF1= 0
##$NOISF2= 0
##$NSP= 0
##$NTH_PI= 0
##$NZP= 0
##$OFFSET= 14.98061
##$PC= 1
##$PHC0= 215.3101
##$PHC1= 0
##$PH_mod= 1
##$PKNL= yes
##$PPARMOD= 0
##$PPDIAG= 0
##$PPIPTYP= 0
##$PPMPNUM= 2147483647
##$PPRESOL= 1
##$PSCAL= 4
##$PSIGN= 0
##$PYNMP= <proc.py>
##$REVERSE= no
##$SF= 400.13
##$SI= 32768
##$SIGF1= 0
##$SIGF2= 0
##$SINO= 400
##$SIOLD= 32768
##$SPECTYP= <>
##$SREGLST= <1H.CDCl3>
##$SSB= 0
##$STSI= 32768
##$STSR= 0
##$SW_p= 8223.68421052632
##$SYMM= 0
##$S_DEV= 0
##$TDeff= 65536
##$TDoff= 0
##$TI= <>
##$TILT= no
##$TM1= 0
##$TM2= 0
##$TOPLEV= 0
##$USERP1= <user>
##$USERP2= <user>
##$USERP3= <user>
##$USERP4= <user>
##$USERP5= <user>
##$WDW= 1
##$XDIM= 32768
##$YMAX_p= 467403250
##$YMIN_p= -670836
##$CURPLOT= <Network HP LaserJet P1505>
##$CURPRIN= <$Network HP LaserJet P1505>
##$DFORMAT= <normdp>
##$LAYOUT= <+/1D_H.xwp>
##$LFORMAT= <normlp>
##$PFORMAT= <normpl>
##$SURQMSG= 1
$$ End of Bruker specific parameters
$$ ---------------------------------
##NTUPLES= NMR SPECTRUM
##VAR_NAME=  FREQUENCY,     SPECTRUM/REAL,   SPECTRUM/IMAG
##SYMBOL=    X,             R,               I
##VAR_TYPE=  INDEPENDENT,   DEPENDENT,       DEPENDENT
##VAR_FORM=  AFFN,          ASDF,            ASDF
##VAR_DIM=   32768,         32768,           32768
##UNITS=     HZ,            ARBITRARY UNITS, ARBITRARY UNITS
##FACTOR=    0.250966925370066, 1,           1
##FIRST=     8223.43324360095, -44463,       -50444
##LAST=      0,             167738,          -311485
##MIN=       0,             -670836,         0
##MAX=       8223.43324360095, 467403250,    0
$$ Real data points
##PAGE= N=1
##DATA TABLE= (X++(R..R)), XYDATA
$$ [...]
19453b35462J01323a8341o253I2342D4659A3964L31252A19871b41613a02441p3934
19442a76375L8102G5738b4030l7003j54069r8348J23873n9564J1300r9274G0524
19430A89852a34962k27835c38C402i6723J9815a6247j16277j69278A21948L839
19419A25787a36526O1515D4907J88257a39388l7587j08467G896b5274k2698p2405
19408a20377c3622D8779E399a1139j08893B40308k9815M7759a29367A67022E7144
19396e18362A89354b47173e5835B5948h3084n8878I9402q857a60219e1495G3508
19384h1342H8340c6643A9319c25454c1450A26257A6720a78712C6386e14860D5198
19372A49797F4251a02626r9771R2350r0970B254R8797a70035f6100G4060L48923
$$ y = [-235462, -134139, -18341, -24594, 92342, 44659, 13964, 345216, 119871, -241613, -102441, -176375, -138273, 75738, -24030, -61033, -215102, -313450, -189577, -249141, -237841, -337115, 70524, 189852, -134962, -362797, -338, 3402, -96723, -76908, -16247, -132524, -301802, 121948, 125787, -136526, -75011, 44907, 233164, -139388, -176975, -285442, 7896, -25274, -47972, -120377, -33622, 48779, 5399, -11139, -120032, 240308, 210493, 258252, -129367, 167022, 57144, -518362, 189354, -247173, -55835, 25948, -83084, -141962, 99402, 90545, -160219, -51495, 73508, -81342, 88340, -36643, 19319, -325454, -31450, 126257, 16720, -178712, 36386, -514860, 45198, 149797, 64251, -102626, -202397, -110047, -201017, 2254, 101051, -170035, -66100, 74060, 422983]
19361D22983f5716K4841o1633j13272f1032k22953J27880A50342a53349j19938
19351b73287j518J09824b5307B0932M8916g0737A20628i8125D591a30762I705
19339a77198g7343r798p0349G3044a14300A76865h5247P281j22398j16715f5280
19327b0812j31949i895m227D9024d47728a63060j72034E0466a37146E6777B7763
19315A297h0431B3444e6324k68724E9424J05666d66538E3699a73685B7702b38628
19303B5785J28323a86530j32080L6010J390A9457J58961a69790B19237a90071
19292a8111j38763j59969b3460j9936o3543B01853E4633a25349A44657b40087
19281a80352a2115k75997B5482b56677j6671h0827F5211b65152d3803l18161a45581
$$ y = [422983, -65716, -40875, -102508, -215780, -61032, -283985, -156105, 150342, -153349, -273287, -274805, -164981, -25307, 20932, 69848, -70737, 120628, -98125, 4591, -130762, 9705, -177198, -77343, -87141, -157490, 73044, -114300, 176865, -85247, -77966, -200364, -317079, -65280, -20812, -152761, -9895, -14122, 49024, -447728, -163060, -335094, 50466, -137146, 56777, 27763, 1297, -80431, 23444, -56324, -325048, 59424, 165090, -466538, 53699, -173685, 27702, -238628, 25785, 154108, -186530, -318610, -282600, -281210, 19457, 178418, -169790, 219237, -190071, -18111, -156874, -316843, -23460, -43396, -106939, 201853, 54633, -125349, 144657, -240087, -180352, -12115, -288112, 25482, -256677, -273348, -80827, 65211, -265152, -43803, -361964, -145581]
19269A24158B055a01899A84469a69554B88786D5595K31292b33061A25751c20972
19258h0276a0868F9256Q041a40003C49198f6706m14872A4802f7541C39578k9100
19247C10478a05230j14339K1306F6498a94075A71362a19141a6085C02465a32969
19236i5433k9600c1713j13649r1421e6691k3092G206b94891I0204g6184E646J68143
19224A73789d37186C2614J08022c0032E1455b7834j97740j11232a67621I3415
19213e92062K70243e2273B09095b21534A74413a9318l2977R582B32013A12080
19202b2384j4272j27651E1486C032i7030d6626a9586r5018I8850e2424j79530
19191b31954j06801a43840M9570j38206A79129c23350a27020N8535B11657G3705
$$ y = [124158, 2055, -101899, 184469, -169554, 288786, 45595, 276887, -233061, 125751, -320972, -80276, -10868, 69256, 77297, -140003, 349198, -66706, -481578, 14802, -67541, 339578, 310478, -105230, -219569, -198263, 66498, -194075, 171362, -119141, -16085, 302465, -132969, -95433, -125033, -31713, -145362, -236783, -56691, -79783, 7206, -294891, 90204, -76184, 5646, 173789, -437186, 32614, 140636, -30032, 51455, -27834, -225574, -336806, -167621, 93415, -592062, -321819, -52273, 209095, -221534, 174413, -19318, -52295, -42713, 232013, 112080, -22384, -36656, -164307, 51486, 3032, -97030, -46626, -19586, -114604, 98850, -52424, -231954, -338755, -143840, -94270, -232476, 179129, -323350, -127020, -68485, 211657, 73705]
19180A40980a5436k33304J11140a1112j49344j82712a42884j912A60109G9871
19169A51397D8587j9629a79634A58608c1346D2803L6081b63147f9726o9253l2423
19158a71402m0789M8546E503c25032g0945j17093k42030J34234A38189B3924c50744
19146H1193J19331C9649b32671D5760K02146F4446g0633b0476A6638K2269a07798
19134a7024j28946k16821C729a98977B1559M584J80206A9908J38914i8316d1933
19122g6179p7639A04302h1894r3022D1874F279a95832Q5235K4417j44021F6210
19110G5365J07019e08764a79950O9718j65571a7402j12843B02730a16414A03016
19099c27428J36887C8927a69533B64239b9598n1766A23745a62675A24218D4523
$$ y = [140980, -15436, -248740, -137600, -11112, -160456, -343168, -142884, -144796, 160109, 79871, 151397, 48587, 28958, -179634, 158608, -31346, 42803, 78884, -263147, -69726, -138979, -171402, -212191, -163645, 5503, -325032, -70945, -188038, -430068, -295834, 138189, 23924, -350744, 81193, 200524, 39649, -232671, 45760, 247906, 64446, -70633, -20476, 16638, 38907, -107798, -17024, -145970, -362791, 3729, -198977, 21559, 26143, 206349, 19908, 158822, -98316, -41933, -76179, -153818, 104302, -81894, -174916, 41874, 6279, -195832, -110597, -86180, -230201, 66210, 75365, 182384, -508764, -179950, -110232, -275803, -17402, -130245, 202730, -116414, 103016, -327428, -190541, 38927, -169533, 264239, -29598, -81364, 123745, -162675, 124218, 44523]
19088H4969a61183j09385h6608k90744A80120d6273C06564A16112h010n4655j73953
19077b36618B38400r8033c08688Q0218A17819a21150n1609e9311j63667j2365
19067b35343a8042k88009J06774q6328A59104b75315d6353j4831C6157J6836J27709
19056A80702l842a07699A9842J33935R8045a24899o1148j50933B7006L23538A73799
19044D589a1805D968a52459n1366A38409a95038p9414B9570e1047l3997k2626
19033a07670D9403g8987j28899g853j95847E3345K5780e8551E9702a55061f4345
19021B71033b17886B1184O9849J25406a97808E3939B3355P3947a80220j50839
19011c31059a59724C49474A18050b03597b5803j4219b760l60121A85649J03481
$$ y = [84969, -161183, -270568, -86608, -377352, 180120, -46273, 306564, 116112, -8010, -62665, -236618, 238400, 140367, -308688, -228470, 117819, -121150, -172759, -59311, -222978, -235343, -18042, -306051, -199277, -285605, 159104, -275315, -46353, -61184, 36157, 52993, 180702, 176860, -107699, 19842, 153777, 251822, -124899, -186047, -336980, 27006, 350544, 173799, 4589, -11805, 4968, -152459, -203825, 138409, -195038, -274452, 29570, -51047, -85044, -107670, 49403, -78987, -207886, -7853, -203700, 53345, 79125, -58551, 59702, -155061, -64345, 271033, -217886, 21184, 91033, 216439, -197808, 53939, 23355, 97302, -180220, -331059, -159724, 349474, 118050, -203597, -25803, -40022, -2760, -362881, 185649, 289130]
19001B89130a55628L5661j06143j99744b1753B64330A06447b43545I8891a23577
18990A0210J80283a35459A31173n5686J0944b30127p932E26018H7973J21035a19377
18978H2308b16259f7808q5851J4211a2620j39663k27376J35849a02926c1461j31847
18967a63308D265c10059J24654A27817D1540b42676C34752A42100K69781A60163
18956a40581D84323A67263J77260f2053F4075K14711q5572J13787j38419a90775
18945B38515a53960j34594a35600G9886b64105J25995R681A53036j1034e6934
18934a38767c5762l2448A24122P6781L1215a50263a254C2688d0670A4761c80476
18922B56706c08012a08057a7378m46267A94488C6418P183a89377A14858b68826
$$ y = [289130, -155628, -119967, -226110, -425854, -21753, 264330, 106447, -243545, 98891, -123577, 10210, 190493, -135459, 131173, 75487, 86431, -230127, -238059, 526018, 87973, 209008, -119377, 82308, -216259, -67808, -153659, -139448, -12620, -152283, -379659, -243810, -102926, -31461, -163308, 4265, -310059, -185405, 127817, 41540, -242676, 334752, 142100, 411881, 160163, -140581, 484323, 167263, 344523, -62053, 64075, 278786, 193214, 307001, 168582, -190775, 238515, -153960, -288554, -135600, 79886, -264105, -138110, -128429, 153036, 142002, -56934, -138767, -35762, -68210, 124122, 200903, 232118, -150263, -1254, 32688, -40670, 14761, -380476, 256706, -308012, -108057, -17378, -463645, 194488, 36418, 43601, -189377, 114858, -268826]
18911A02755a65667j43956A71674f6966A36681e8735a7868A5086a4698j02611
18901a17309B77500b63401d8491G5010h4218c628G4732J68977a77916A20289Q2869
18890B03158C5752J09798n0055c51828A20485n9891a63940K053a0252j45166e6526
18878c33141J2030i2844i990j67141B25925a2562m09912b0353j02333k09568B5498
18866A67103d50204F4841J18531a98713N1656O8619k30514e9972k4331A59296
18855i2380m86711A30511a80803l36985b1618A57997b0174A1668K52060b56298
18844I2580c51014J57630j26806A21914b16422C057J73224H5924K9769J46356
18834B62049a77554f0129A51436e7785B94743B3578J2313a6941j2966g895m60736
$$ y = [102755, -165667, -309623, 171674, -66966, 136681, -58735, -17868, 15086, -14698, -117309, 277500, -263401, -48491, 75010, -84218, -3628, 74732, 243709, -177916, 120289, 203158, 35752, 145550, 95495, -351828, 120485, 60594, -163940, -161887, -10252, -155418, -56526, -333141, -321111, -92844, -9990, -177131, 225925, -12562, -422474, -20353, -122686, -332254, 25498, 167103, -450204, 64841, 183372, -198713, -147057, -78438, -308952, -59972, -84303, 159296, -92380, -579091, 130511, -180803, -517788, -21618, 157997, -20174, 11668, 263728, -256298, 92580, -351014, -193384, -320190, 121914, -216422, 3057, 176281, 85924, 115693, 262049, -177554, -60129, 151436, -57785, 294743, 23578, 35891, -16941, -29907, -7895, -468631]
18823d68631E0563d3796k0631A10406D0977C890a36640H161e6273A27307c48674
18811c29025B40410A17395c54088d9899K0870j21440b4408j23145B2424f9677
18800a64135B33001g5323j11204n9510r5892e11j61234H7983b51462R7081K4705
18789a29676A62561J46212a77809O5851L5841r3706j52516C65931A57749b25550
18778G1939pP3325a49651b7348B10390A6809b04427j74710e0216b0603D2799a06621
18765H3095k4072q424K19203h2628n7594E1580a38000f6327B73219b20821L7122
18754a83699O8370A37696A3382b52769I4370d2578A18757K69665A23498b11366
18743F14b2454n2209j08659D1951J81531a04544A51536a86486g0915j47802N7404
$$ y = [-468631, 50563, -43796, -64427, 110406, 40977, 3890, -136640, 8161, -56273, 127307, -348674, -329025, 240410, 117395, -354088, -49899, -29029, -150469, -24408, -147553, 22424, -69677, -164135, 233001, -75323, -186527, -246037, -341929, -511, -161745, 87983, -251462, -154381, -129676, 162561, 308773, -177809, -111958, -76117, -169823, -322339, 365931, 157749, -225550, 71939, 71932, 145257, -149651, -27348, 210390, 16809, -204427, -379137, -50216, -20603, 42799, -106621, 83095, 59023, 50599, 269802, -82628, -140222, 51580, -138000, -66327, 273219, -220821, -183699, -115329, 137696, 13382, -252769, 94370, -42578, 118757, 388422, 123498, -211366, 614, -22454, -74663, -183322, 41951, 223482, -104544, 151536, -186486, -70915, -218717, -161313]
18732a61313K7707m287B37916A9455J14864c31395a23917F5341d6165F3136c60279
18720i6942A8527K51640a1469A5613a15180q4823A3004P464f3502j8224m8811
18709a30537a3680A61028b46734K1040r1037A00825a09565j0480m80945a18863
18698I6663h9707r6257j00643A62464F1008b92751A47350d1631A2847b3823l501
18687b7324A35390F6844k7315b21803Q5678B761Q9252b02105R1530A70868a43451
18675h3334j53711A86169d69805a35270E8431b81743a04382j18218f1718n9871
18665a21589I5711f9825B5770c87045a75408G7247J04389n3201a98042o9994a10084
18653b7599E4000e49412K51384a48443k77818Q4783G7026M7649b96102G7989L7317
$$ y = [-161313, -133606, -137893, 237916, 19455, 134319, -331395, -123917, 65341, -46165, 63136, -360279, -96942, 18527, 270167, -11469, 15613, -115180, -200003, 13004, 20468, -63502, -81726, -130537, -13680, 161028, -246734, -225694, -316731, 100825, -109565, -120045, -600990, -118863, 96663, -89707, -185964, -286607, 162464, 61008, -292751, 147350, -41631, 12847, -23823, -27324, 135390, 66844, 39529, -221803, -136125, 2761, 92013, -202105, -110575, 170868, -143451, -83334, -237045, 186169, -469805, -135270, 58431, -281743, -104382, -222600, -61718, -121589, 95711, -69825, 25770, -387045, -175408, 77247, 181636, 128435, -198042, -268036, -110084, -27599, 54000, -549412, -298028, -148443, -426261, -341478, 77026, 124675, -296102, 77989, 115306]
18642A15306J59291a56984r5254A64321E5273i830E4169b76222J29377B9475a49641
18630H4520c12081L3589I9057b1777n1377A23740c8198D2320i5594I6380L3393
18619A29773b64908k8527i4385q6755O7784d8067b3486G2921c13985G0355G852
18607E8034a63144j9455d6474l4067B15055a15702D7601R9545a32239j88518B09922
18595A04070a26926j21073e2346A37709c22806B56401a51170c5648j11844A44454
18584b66981D3410J147b59931B14910h3350A14839c12481K2350A07179b07996
18573b17803n8288B3600a39521b2126C95127j67900F8251e8804A25130d240A82424
18561c4112A36175K29383c14994a18653j09740B19339d19205I1817c04583E7016
$$ y = [115306, 274597, -156984, -252238, 164321, 55273, -9830, 54169, -276222, -146845, 29475, -149641, 84520, -312081, -278492, 99057, -21777, -73154, 123740, -38198, 42320, -95594, 96380, 129773, -264908, -293435, -94385, -181140, -113356, -48067, -23486, 72921, -313985, 70355, 7852, 58034, -163144, -182599, -46474, -80541, 215055, -115702, 47601, 147146, -132239, -320757, 209922, 104070, -126926, -247999, -52346, 137709, -322806, 256401, -151170, -35648, -147492, 144454, -266981, 43410, 44557, -259931, 214910, -83350, 114839, -312481, -290131, 107179, -207996, -217803, -276091, 23600, -139521, -22126, 395127, 227227, 68251, -58804, 125130, -4240, 182424, -34112, 136175, 365558, -314994, -118653, -228393, 219339, -419205, 91817, -304583, 57016]
18550b75453N2655O8822b5181F9376b63275H7244g9346C4885c5912M290F6657
18538A5904Q5189a00533D4898c0535B92257k0712c48186J43504B28793b06390
18527b5991A61795a55643e5617l6521K5380o1261H4886B2224b1685A05841D1579
18515f8943a0843k80378g3319A17467g0566M832r3668K2131A23638A7078M3578
18504F0656b91440a33407a8310A5308N879b97415A3579d54543A8173h6102J5412
18493g0690r8971j22193h0299k59746i9155C16285a24174j06264O2514D504a34125
18481c7501j18033e0674k03349B31770E0162L7760a72346K393A8410c6158h827
18469B3837i7155A65881a80115H7741N5284o2688b62937I2619d4033H1351J07399
$$ y = [-275453, -222798, -153976, -25181, 69376, -263275, 87244, -79346, 34885, -35912, -31622, 66657, 15904, 101093, -100533, 44898, -30535, 292257, 271545, -348186, -204682, 228793, -206390, -25991, 161795, -155643, -55617, -92138, -66758, -128019, 84886, 22224, -21685, 105841, 41579, -68943, -10843, -291221, -73319, 117467, -70566, -65734, -159402, -137271, 123638, 17078, 60656, -291440, -133407, -18310, 15308, 21187, -297415, 13579, -454543, 18173, -86102, -70690, -169661, -291854, -80299, -340045, -99155, 316285, -124174, -230438, -167924, 4504, -134125, -37501, -155534, -50674, -254023, 231770, 50162, 87922, -172346, -169953, 18410, -36158, -8827, 23837, -97155, 165881, -180115, 87741, 143025, 80337, -262937, 92619, -44033, 81351, 188750]
18458A88750p2625h2655C25867L7011b77377B23815a19023A24007a23292j7798
18448a41090A8913e0475r0381L1469H269i5479A6865a73666A32777P6355b68718
18436E4996a18869c9364o3811B34718c8419I1646A0348g6018I4752m0823r276
18425D4653J80417I0575a09143C01164A40655K6731q2733a42500H1213h2259D3126
18413H9855D4767q379i84A13695a30494K9270F0602a25072k1884o8349P1468R995
18401a33842k9274N6864A68077N4506j08948e2932B8654b9076j36971K346a3125
18389D4386J35204H1411P6705J18375N0333a45388n3779A59905a50816e701C20345
18377A92773K5787a46989E9965h596n7927g577q4655I0810Q4022J08468b2437
$$ y = [188750, 116125, -82655, 325867, 362878, -277377, 223815, -119023, 124007, -123292, -141090, 18913, -50475, -140856, -109387, 8269, -95479, 16865, -173666, 132777, 209132, -268718, 54996, -118869, -39364, -103175, 234718, -38419, 91646, 10348, -76018, 94752, 53929, 44653, 225070, 90575, -109143, 301164, 140655, 167386, 84653, -142500, 81213, -82259, 43126, 89855, 44767, 36388, -984, 113695, -130494, -101224, 60602, -125072, -146956, -215305, -143837, -133842, -163116, -106252, 168077, 222583, 113635, -52932, 28654, -29076, -166047, -163701, -13125, 44386, 179590, 81411, 158116, 276491, 326824, -145388, -199167, 159905, -150816, -5701, 320345, 192773, 218560, -146989, 59965, -8596, -66523, -7577, -92232, 90810, 174832, 283300, -22437]
18365c45260a37871B9513a41261j09537c5846k3906p3945r5010k2512A1486a89700
18353C4020a60016a5930A45463C3285a18632C10306f2312A04992j8481e63445
18342b43734a6548l13866d869B56747b9606k85219D19008h7851c5716B13472B2826
18330A28423E6587b17219a05403A52857G6328d9453A03464b42717B1306d1591
18319D2542K1180k3809L36990d86193a08174b038m8325D6123N1819f8180B5419
18307B4320g7044j66434D44547a844A31700c40214F5739b08475h2811F2728h8941
18295b32095C4035a88372g362k44599h7383k77612A50995d2826a0516A39235a52102
18283F3714d7485A1389L13812a20219A90407K8969i1495A13802A9720a23818m7231
$$ y = [-345260, -137871, 29513, -141261, -250798, -35846, -59752, -133697, -228707, -251219, 11486, -189700, 34020, -160016, -15930, 145463, 33285, -118632, 310306, -62312, 104992, 86511, -563445, -243734, -16548, -330414, -4869, 256747, -29606, -314825, 419008, -87851, -35716, 213472, 22826, 128423, 56587, -217219, -105403, 152857, 76328, -49453, 103464, -242717, 21306, -41591, 42542, 63722, 39913, 376903, -486193, -108174, -2038, -50363, 46123, 97942, -68180, 25419, 24320, -77044, -243478, 444547, -1844, 131700, -340214, 65739, -208475, -82811, 62728, -88941, -232095, 34035, -188372, -7362, -251961, -87383, -364995, 150995, -42826, -10516, 139235, -152102, 63714, -47485, 11389, 325201, -120219, 190407, 219376, -91495, 113802, 19720, -123818, -171049]
18272a71049B2227a42954j62007a44168O7255b9542J075B87024e3679k1859A94259
18260A2283a20584k13575B89308r9726K4902I7336a16800e4067l0263e223n7415
18249f2638k72057B10371A6219n770a24219A03780M0678d2458B24812H1501c43214
18237a88750f2862j78408r784D0260a31471k8315A35316A4085a41259B79844q2020
18226A97824i362A34677e90414h0279o4668B643Q6376a0735j43362P0839A2845
18214f5214m2472C42235c4914B11025a18064j46995A74568a0697B6199O7138a60011
18202I843L20051G3389a02012j39912k8260B18755b44909A97744g2641A02997
18191g3536b9330o7198B27805a28518k1319k11237i9425G1608c36422c8750n9693
$$ y = [-171049, 22227, -142954, -304961, -144168, -76913, -29542, -28467, 287024, -53679, -75538, 194259, 12283, -120584, -334159, 289308, 189582, 214484, 97336, -116800, -54067, -84330, -5223, -62638, -334695, 210371, 16219, 10449, -124219, 103780, 144458, -42458, 224812, 81501, -343214, -188750, -62862, -241270, -251054, 40260, -131471, -159786, 135316, 14085, -141259, 279844, 197824, -9362, 134677, -590414, -80279, -144947, 2643, 89019, -10735, -154097, -83258, 12845, -65214, -107686, 342235, -34914, 211025, -118064, -265059, 174568, -10697, 26199, 93337, -160011, 9843, 329894, 73389, -102012, -241924, -270184, 218755, -244909, 197744, -72641, 102997, -73536, -29330, -96528, 227805, -128518, -149837, -361074, -99425, 71608, -336422, -38750, -98443]
18180i8443K2319A25867c82n2671a9858o6384J1531j41083p8473J30177A41352
18168h7937k91594O5386f4536I5920a67310C222d8338n8649F2400i3434G7172
18156B10077l7536g3047k9489n6534c5340A69418j1309c2106F8624a21819B02357
18144b35300I2769b95646i2321n2302C0174L3136B9205Q3054N0574d35231E0493
18132a72796c2589I9841M8142D2008b32968H7570a81224N597D0522e9830K7330
18121c2500B11332i8390A96766L0946F2040c2120G8396F944h0525a9783j44355
18110a64138A98864a71642I4762J95696h7201A05134g8450j09825A20601m2458
18100G8143a283A18675b77331a1156C8296J22318R0192D9019O4166P8568G6426
$$ y = [-98443, -76124, 125867, -382, -53053, -19858, -86242, -74711, -215794, -294267, -164090, 141352, -87937, -379531, -314145, -64536, 95920, -167310, 3222, -48338, -106987, 62400, -93434, 77172, 210077, 172541, -73047, -102536, -159070, -35340, 169418, 158109, -32106, 68624, -121819, 202357, -235300, 92769, -295646, -92321, -144623, 30174, 63310, 29205, 112259, 162833, -435231, 50493, -172796, -32589, 99841, 147983, 42008, -232968, 87570, -181224, -175627, 40522, -59830, -32500, 211332, -98390, 196766, 227712, 62040, -32120, 78396, 6944, -80525, -19783, -164138, 198864, -171642, 94762, 290458, -87201, 105134, -78450, -188275, 120601, 78143, -1283, 118675, -277331, -11156, 38296, 160614, 250806, 49019, 113185, 191753, 76426]
18088b76375i9622H9578O1561n4795K00500g5840A18043B4239r983h9994j45235
18077b35229I773a32469c7492k13912I1345a1249j97327M0227C288P715R9847
18066A10850B9099a31727c4715o7662j34532g7037a1565A59348O2608h3043o0457
18055a43500L0760D6272a17793q2308R6940D03J83950a53493d6083j48148A52331
18043E8860K13808a36910N6279H6647J77704B3329c88230J71468F1423a63080
18032I92a04249A61288b1513A92783b87547e4469A12409c45230D527J1261K72283
18021B88071b4854C06485a29168C69696a82810k8045C63470b14133A06520J5253
18011A21773J17050m9950c74821C6537a52536q9605A03835L7052a33036i357k44906
$$ y = [-276375, -99622, 89578, 151139, 96344, 296844, -75840, 118043, 24239, 14256, -89994, -235229, 9773, -132469, -37492, -251404, 91345, -11249, -208576, -168349, 3288, 11003, 110850, 29099, -131727, -34715, -102377, -236909, -77037, -11565, 159348, 221956, -83043, -143500, -112740, 46272, -117793, -200101, -103161, 403, 184353, -153493, -46083, -194231, 152331, 58860, 272668, -136910, -80631, 86647, 264351, 23329, -388230, -216762, 61423, -163080, 992, -104249, 161288, -21513, 192783, -287547, -54469, 112409, -345230, 4527, 15788, 288071, -24854, 306485, -129168, 369696, -182810, -210855, 363470, -214133, 106520, 121773, 238823, 188873, -374821, 36537, -152536, -242141, 103835, 140887, -133036, -9357, -254263]
18000b54263P6478i295A97145M4228G5183k6517M1155R0494a92598h913k7182
17989c6095j09486D16743a47519j9509B3745e4037p3507B83713f4790C7831b32298
17977E2249j3313a79407e1181k03410B08380E4272J13322N1520p7171M0150B1071
17965B6286a10598D3859J4006Q5706c4452B08093a40834A29024E2548a24280A5572
17953e1506H8961d46953d3680J0166j21434B7757b1238C90047F9863a58189L9925
17942a18264A33454c11317J55401I6431B1698b3202B17296C8788h3536o3790F0520
17930g6446G6324b25204O2508C7211b34103G9774a20697b9029C42326b63144B14868
17918D90645H7971d9313j17940C1763a11607M8543B03691E5717b37844B0013N7766
$$ y = [-254263, -177785, -9295, 197145, 241373, 75183, 48666, 89821, 180315, -192598, -8913, -36095, -145581, 416743, -147519, -167028, 23745, -54037, -127544, 283713, -64790, 37831, -232298, 52249, 38936, -179407, -51181, -254591, 208380, 54272, 167594, 219114, 141943, 182093, 21071, 26286, -110598, 43859, 57865, 143571, -34452, 208093, -140834, 129024, 52548, -124280, 15572, -51506, 88961, -446953, -43680, -33514, -154948, 27757, -21238, 390047, 69863, -158189, -118264, 133454, -311317, -155916, 96431, 21698, -23202, 217296, 38788, -83536, -147326, 60520, -76446, 76324, -225204, -162696, 37211, -234103, 79774, -120697, -29029, 342326, -263144, 214868, 490645, 87971, -49313, -167253, 31763, -111607, -63064, 203691, 55717, -237844, 20013, 77779]
17907G7779e2945a2381j7376A38182K847e7762q7852E71532a24127C05501a68493
17895g5696A6552J71080g1856A8757J2581R8251c12753A25720R7412g3782K3210
17884e0572A42809F5799M37818H1579a00893q4362C3555J2355a05519G8330J72164
17873B50494A20154c1131A87208h9651A25811N0406J17927o7161A04166K6876
17863A31042h1085B18839J46835A72454B3736g9453B79901f8445A75027b3654
17852B7077R8719b06083A56236a82977r2206a0882A36071J93356b7737l00950
17842c28687B01021h7204j82590E5713L78269a44106A05778Q3980a84994I5796
17831c28360B02336J11001g933k515k2630A05052J5315a78078A44466B0524L4731
$$ y = [77779, -52945, -12381, -29757, 138182, 141029, -57762, -145614, 571532, -124127, 305501, -168493, -75696, 16552, 187632, -71856, 18757, 31338, 129589, -312753, 125720, 223132, -73782, -50572, 142809, 65799, 503617, 81579, -100893, -185255, 33555, 45910, -105519, 78330, 250494, 120154, -31131, 187208, -89651, 125811, 176217, 294144, 226983, 104166, 131042, -81085, 218839, 365674, 172454, 23736, -79453, 279901, -68445, 175027, -23654, 27077, 125796, -206083, 156236, -182977, -275183, -10882, 136071, 329427, -27737, -328687, 201021, -87204, -269794, 55713, 433982, -144106, 105778, 189758, -184994, 95796, -328360, 202336, 313337, -7933, -10448, -33078, 105052, 120367, -178078, 144466, 20524, 55255]
17820E5255K52329A13480d9720k01918a4513A74057b03065j61556a13589e6047
17809b04391A8037L8280Q997d8471C56116j20171j0560e9514A72773G5368J75080
17798B50448a7970A70449P7435J0918B9421g6884F7566J04585n1585J97682j19049
17787A99199a61383O4316C45005E3681b08893A37214K57255a45645j42620B09801
17776B04039a14239C0630K93166A08421e440j62062P5937D8336L45706A34491
17765A6163K0383N1337M9962J11305f199o8697A82722P7947Q0349B105K16837
17754B18942g4365l2251H4176Q2230J83177j61159b0176A02422a7456k80140A15426
17742C10155a43485B48039F0901a81188F443Q7249R9884R7827M74A29519J29798
$$ y = [55255, 307584, 113480, -49720, -251638, -14513, 174057, -203065, -364621, -113589, -56047, -204391, 18037, 56317, 65314, -48471, 356116, 235945, 225385, -59514, 172773, 75368, 250448, -17970, 170449, 247884, 258802, 29421, -76884, 67566, 172151, 120566, 318248, 199199, -161383, -97067, 345005, 53681, -208893, 137214, 394469, -145645, -288265, 209801, 204039, -114239, 30630, 323796, 108421, -5440, -167502, -91565, 48336, 394042, 134491, 16163, 36546, 87883, 137845, 249150, -6199, -74896, 182722, 260669, 341018, 2105, 218942, -74365, -106616, 84176, 166406, 349583, 188424, -20176, 102422, -17456, -297596, 115426, 310155, -143485, 248039, 60901, -181188, 6443, 93692, 193576, 291403, 291877, 129519, 259317]
17731B59317j7017j20288k8857N9575C0666a99082d0660C51457c04468d789E39585
17719A20253c48068f7561D06337c7616A32039M0984m6498a87548c3547E0096K30849
17708B80945A30930k0412C4932L08682d0400j48246N0789N4712c0943q1156k2760
17697a34859A28798K20473r2709E2457J21897o2007a10387D86856A97794I7081
17686A53719J51300h4489k7883F0853K15237n9084F8741b7029A1489R1822K1705
17675A25016j9964N2828P416L694l434l1029J08389j06733P0040I4254i1738B84892
17662b41527A56172O571k8037c02558f6717B96013q4066F3555h5757E2801J35554
17651A88355J17779j52645B6118a06377A08981a11991A03133J35372c73563B1208
$$ y = [259317, 242300, 122012, 93155, 152730, 30666, -199082, -40660, 351457, -304468, -4789, 539585, 120253, -348068, -67561, 406337, -37616, 132039, 173023, 126525, -187548, -33547, 50096, 280945, 130930, 110518, 34932, 343614, -40400, -188646, -137857, -83145, -30943, -112099, -134859, 128798, 349271, 256562, 52457, 174354, 112347, -110387, 486856, 197794, 97081, 153719, 305019, -84489, -112372, 60853, 276090, 217006, 68741, -27029, 11489, 103311, 125016, 105052, 157880, 165296, 168990, 165556, 134527, 242916, 136183, 206223, 94254, -91738, 284892, -241527, 156172, 162743, 134706, -302558, -66717, 296013, 211947, 63555, -85757, 52801, 188355, 306134, 153489, 26118, -106377, 108981, -111991, 103133, 238505, -373563, 21208]
17640A82998g4258k4510B34807a12945e5037B61259c01149e5532A55134o9720
17630H5414q917J54287J40677A58115O9079a6283k56591B48834d424A6359J60473
17619A76832C9097d2239l3463G4076c887B56165I2199J91079c2195E579J66737
17608A72316n4084l9940J86691k2806E1955K78199A30755l2964J74378K09025
17598D81194A01866A0432a15889D3986J71723c6363H6000c3557A62127a20491
17587a0087B42505D6675K28850D7439L31644G1473L42863A91487H3851h0083H3367
17575C60761C0721a07908B71562f3912B19005a41378A39426a4729D77723j57787
17565C19936r2052m6709L09259A95496J76785k8224k2305A22807R6824j4112F5457
$$ y = [182998, -74258, -98768, 234807, -112945, -55037, 261259, -301149, -55532, 155134, 85414, 76497, 230784, 371461, 158115, 227194, -16283, -272874, 248834, -4424, 16359, 176832, 39097, -42239, -75702, 74076, -3887, 256165, 92199, 283278, -32195, 5579, 172316, 118232, 78292, 264983, 242177, 51955, 330154, 130755, 97791, 272169, 481194, 101866, 10432, -115889, 43986, 215709, -36363, 86000, -33557, 162127, -120491, -10087, 242505, 46675, 275525, 47439, 379083, 71473, 414336, 191487, 83851, -80083, 83367, 360761, 30721, -107908, 271562, -63912, 219005, -141378, 139426, -14729, 477723, 319936, 227884, 181175, 490434, 195496, 372281, 344057, 321752, 122807, 219631, 205519, 65457]
17553B10955O8362m0625o5083i3933C8751J59081D3283R5494D4209b15815A3495
17541B55390E6003N3681K38707j02013A13505K16496j24536r4307a98833F6630
17530A18013d3539C12328l3165G3221J59143L47059f4285b6257A96635o7301E6785
17518C44916a66185B41611C8391J78902K37061A91456L42116B26939O39763j7282
17508H49420N7562Q5151p2210l39520q2771J15612k62048r1569J66776R2497J55066
17497F73966j25872A64304O52902k14707N3052K75004l96823J89547k27075J736
17487D97940J23228A5603K36876K86554j44206j791j47990J3408A00440L54415
17477D54855A55932O4448G4861J05867k3441K41556J69649A95074m6711N3825
$$ y = [210955, 279317, 238692, 173609, -93933, 38751, 197832, 43283, 138777, 44209, -215815, 13495, 255390, 56003, 109684, 348391, 246378, 113505, 330001, 205465, 111158, -198833, 66630, 118013, -43539, 312328, 279163, 73221, 232364, 579423, -64285, -26257, 196635, 129334, 56785, 344916, -166185, 241611, 38391, 217293, 454354, 191456, 533572, 226939, 866702, 849420, 906982, 992133, 919923, 580403, 497632, 613244, 351196, 259627, 426403, 518900, 673966, 548094, 164304, 817206, 602499, 655551, 930555, 533732, 723279, 496204, 497940, 621168, 15603, 252479, 539033, 394827, 393036, 245046, 258454, 100440, 454855, 155932, 220380, 74861, 180728, 157287, 398843, 568492, 195074, 148363, 202188]
17467B02188K67423j58456j26421q4371K45310m484L4362Q6410I2656K90574c0084
17455C96223j67067N4075A37316J65980A45376L55542n5648A50185J55224e5914
17444A29700K95410A68337L04008A04335M77619h933C56506L3344J13596B45427
17433C29296n7814J07980R5318L40370C06681K09323L0219c1808C19844j9708
17423C00136A40175K16820J08698J1360j38065O7639A19652i1882A76582k4707
17413A51875N5632J85013j02175j14721L70939j75308J30208j08882K54487j10331
17403E36737p728m3503A22613K70898O6721B24521K40497j5849A96273J97269
17393C93542k6266A79849j3686K18113A12879m5660K95532e4999A80509f5360
$$ y = [202188, 469611, 311155, 184734, 100363, 345673, 341189, 375551, 461961, 92656, 383230, -30084, 396223, 229156, 283231, 137316, 303296, 145376, 500918, 445270, 150185, 305409, -55914, 129700, 425110, 168337, 472345, 104335, 581954, -8933, 356506, 389850, 503446, 245427, 329296, 271482, 379462, 474780, 815150, 306681, 516004, 546223, -31808, 319844, 300136, 140175, 356995, 465693, 477053, 338988, 406627, 119652, -91882, 176582, 151875, 207507, 392520, 290345, 175624, 546563, 371255, 501463, 392581, 647068, 536737, 529009, 485506, 122613, 393511, 460232, 224521, 465018, 449169, 196273, 393542, 367276, 179849, 166163, 384276, 112879, 67219, 362751, -54999, 180509, -65360]
17382A35382J26827J23561J2373h9486B34309i3243A97937D2186M43926j29616
17372C56496A78042o4078K1949P0640O7776j32064K85702j99622J8009o3823O4162
17361B46693A06680N6800J35602L3493o5848j09924K80191J96113l4910B85760
17350A21782M12375j2917d1486A83981L77989k10294K70913C09172j3768N7864
17340C53268J28181H0836L24237j03533m0135n3140F9882Q9611J74270j08753
17330B25010J02492H8767J19382l4071L79575j16974A4588L4657J31586O9766
17320B50597J03175q8509P6670E1451b9371C76234q5446N8626q9480m0410Q396
17309B27920G9168J35019J64533a47997A26837K02189k8215l8883m8664J01181
$$ y = [135382, 262209, 385770, 398143, -89486, 234309, -93243, 197937, 42186, 486112, 356496, 178042, 113964, 135913, 206553, 274329, 142265, 427967, 228345, 246354, 182531, 246693, 106680, 163480, 299082, 332575, 266727, 156803, 436994, 633107, 598197, 285760, 121782, 534157, 521240, -41486, 183981, 561970, 351676, 622589, 309172, 295404, 353268, 481449, 80836, 405073, 301540, 261405, 208265, 69882, 159493, 333763, 225010, 327502, 88767, 208149, 174078, 553653, 436679, 14588, 49245, 180831, 250597, 353772, 265263, 341933, 51451, -29371, 376234, 290788, 349414, 259934, 219524, 227920, 79168, 214187, 378720, -147997, 126837, 329026, 300811, 261928, 213264, 314445]
17299C14445G5052B9750M76651A39952J81292e2612A11954J37757A14780P5859
17289A90639A8130L77791A94764J33855O8986j17321b2876a873D01534h8569A02594
17277C42398O4507j31720K2138j09351C6181M50780D9079O94697A62336K23113
17267C85449r2577L12418H1042M0680p53J02615J79053L8931j34213m7680J38804
17256C98479r9254o6203I0975L54779j62279H3953C0467L37107j35691r7411K20160
17245C54632j121j15808M7827A10054L62783A02890J25896M4365J99213B26519
17234D24232J6849n4726A81327M54317C02736J91292D8115j7108L27877r96m6698
17223C11190p5304R3523j49189K30952J6707M3672j14655j602Q9283A21502J91871
$$ y = [314445, 75052, 29750, 506401, 139952, 321244, -52612, 111954, 249711, 114780, 190639, 18130, 395921, 194764, 328619, 397605, 280284, -22876, -1873, 401534, -88569, 102594, 342398, 406905, 275185, 297323, 187972, 36181, 486961, 49079, 743776, 162336, 385449, 292872, 605290, 81042, 121722, 120969, 223584, 402637, 441568, 307355, 259675, 398479, 299225, 233022, 90975, 445754, 283475, 83953, 30467, 367574, 231883, 134472, 354632, 353511, 237703, 285530, 110054, 472837, 102890, 228786, 273151, 472364, 226519, 424232, 441081, 386355, 181327, 635644, 302736, 494028, 48115, 31007, 358884, 357888, 311190, 235886, 329409, 180220, 411172, 427879, 471551, 356896, 355294, 444577, 121502, 313373]
17212C13373J10015j20444j00520d4003E38124A03819J67525k2489J48754k7272
17202C70337O7112j20309H2049N8638a03959C64100l8819K95234N6980a33406
17191B27630I4167L62896A71680b09481D17039l5797A15653L15326P5945O6552
17181E73476j62417J66102k37121K96000B32690J72607A45203J79330J49307K7624
17171E01464Q102J579j36664J2173O0628j49639A41427K52976J57186k64126O2189
17160C49652K50436B88140K69125B52650K97076k67273J57859j12400K30520B24242
17149C33487m5405p006K31461J06857A67152J55605J92581A5794N16058k4626
17139E07226O0486j7865L8652k56312K83998K5343C09379K14942L8027j86945
$$ y = [313373, 423388, 302944, 202424, -44003, 538124, 103819, 271344, 248855, 397609, 370337, 437449, 317140, 82049, 140687, -103959, 364100, 325281, 620515, 677495, -133406, 227630, 94167, 457063, 171680, -209481, 417039, 381242, 115653, 430979, 506924, 573476, 411059, 577161, 340040, 636040, 232690, 405297, 145203, 324533, 473840, 501464, 509566, 511145, 374481, 386654, 447282, 297643, 141427, 394403, 551589, 287463, 349652, 600088, 288140, 557265, 252650, 549726, 282453, 440312, 327912, 558432, 224242, 333487, 288082, 281076, 512537, 619394, 167152, 322757, 515338, 15794, 531852, 507226, 567712, 549847, 588499, 332187, 616185, 641528, 309379, 524321, 562348, 375403]
17129C75403J37166K9343j9914A51115L20367j6011J76635k71834O6667j20968
17119C05971K93796J22644f3224E98473l1658k55292P2330J33316K31313m0709
17109G07773B04700L92233Q1420k89050J66160k28296L58326n0510B50487L53148
17099F03635o478j86240L07253j08037o906Q7848r8593O4930o1801l5409k06442
17088C53760O5458J13409J25952m3036B32517N19283R5825J3909j75998j45189
17078E40347P4989B96265M44616R4272l50779j75619M86959j61132O8231J72256
17068H75069j3373m15823L36934C66545R1219q460P0550J06863j02962J1663o3956
17057D71462J88447k98079K84825J93417j3883o6922k11730j8491j18273L30576
$$ y = [375403, 512569, 541912, 521998, 151115, 471482, 455471, 632106, 360272, 426939, 305971, 599767, 722411, -63224, 598473, 566815, 311523, 383853, 517169, 748482, 707773, 204700, 596933, 678353, 389303, 555463, 327167, 685493, 634983, 250487, 603635, 597157, 410917, 718170, 610133, 603227, 691075, 592482, 657412, 595611, 560202, 353760, 419218, 532627, 658579, 615543, 232517, 751800, 847625, 861534, 685536, 540347, 615336, 296265, 740881, 835153, 484374, 308755, 795714, 634582, 702813, 875069, 861696, 445873, 782807, 366545, 457764, 449304, 519854, 626717, 523755, 535418, 471462, 659909, 361830, 646655, 840072, 826189, 759267, 547537, 529046, 410773, 741349]
17047G41349L4861o2978P9464p7886J61628k01738j7159P5131K30039k68567q9884
17036F04260K17826J7128r0972n2392j52102n582Q7794K86067O983k84886k6383
17025F07741L16140k93966K66099k99944R9427J47289k36764L30953k98865n8764
17015E79346M65346q487C42027N57879Q8295o3067k63851L59382n292k13484K32467
17004A034356j60174K78701j40683J72508m60433M23229l57438J43146J61526
16995A094738j61218N3404j32405N4246o6516J10237j74708N74691m08100k00284
16985G44085L29623j09437J44987j67924J82190K9989K01622j40264j04880o6439
16975A043552k14218r6131L32788n2727j50362M03548r0767j7840j66616K89811
$$ y = [741349, 776210, 713232, 792696, 714810, 876438, 674700, 657541, 732672, 962711, 694144, 604260, 822086, 839214, 748242, 695850, 543748, 538166, 625960, 912027, 919010, 634124, 607741, 923881, 629915, 896014, 596070, 695497, 842786, 606022, 936975, 638110, 579346, 1044692, 1036205, 342027, 899906, 988201, 925134, 661283, 1020665, 1015373, 801889, 1034356, 874182, 1152883, 1012200, 1184708, 724275, 1147504, 790066, 933212, 1094738, 933520, 986924, 854519, 908765, 842249, 952486, 777778, 1352469, 944369, 744085, 1073708, 964271, 1109258, 941334, 1123524, 1153513, 1355135, 1214871, 1109991, 1043552, 829334, 733203, 1065991, 1013264, 862902, 1266450, 1175683, 1157843, 991227, 1281038]
16965A281038K64531q1364j9745p7892j18333o7131P2206R9884k01698J25607
16955A277103O5336l19060L29722P5625j45248j36192K28720k34692K32711r450
16945A364575K78762m45278L1773q9471k8854L84913K08632l25041J47194o0394
16935A466811o396J49888m9224j19370j76337M38347l59539M64774l72049M91009
16925A927914m82307K35159J139J4403n02738M80537J19448q4512P4775j28637
16915A655181J25514R6197L2288m5428J43732j68751P8567j43129L98723m39382
16905A733512K01884J28242m83090N01940m4905M0836J29976k03040q5619J45181
16895B064917J55463J82832J09885l58132n3948R8401J37648L7302r9150L00952
$$ y = [1281038, 1545569, 1464205, 1444460, 1366568, 1248235, 1181104, 1253310, 1353194, 1151496, 1277103, 1342439, 1023379, 1353101, 1428726, 1283478, 1147286, 1376006, 1141314, 1374025, 1364575, 1643337, 1198059, 1229832, 1140361, 1111507, 1496420, 1705052, 1380011, 1527205, 1466811, 1460415, 1610303, 1561079, 1441709, 1265372, 1703719, 1344180, 1808954, 1436905, 1927914, 1445607, 1680766, 1681905, 1696308, 1193570, 1674107, 1793555, 1709043, 1783818, 1655181, 1780695, 1876892, 1909180, 1863752, 2007484, 1838733, 1917300, 1774171, 2172894, 1733512, 1935396, 2063638, 1580548, 2082488, 2037583, 2078419, 2208395, 2005355, 1919736, 2064917, 2220380, 2403212, 2513097, 2154965, 2101017, 2199418, 2337066, 2374368, 2275218, 2576170]
16885B576170l8756l43935L13075l06418L14100L00216l16837k5513j10620L06416
16875B667898N7109j75620K44610j98410J42430j62905M47362K75183k96330j41859
16865B859468J73387K29508J6245o5752p9737J41927m0783k66720L94409N4021
16855C415973P3712j2331o9409p8958J14133P0556N65497o59400M02229j17505
16845C704497K37350O9354O6873k20640M07091J5786k0089j46075N99754n06316
16835D207585M33724q9637J79372J24408m2729J35259P0782P3170j64112L19588
16825E247410M9396L9160M8952J91400K91996l23836K99199N2042K06809m08997
16815E693531P00896k48667L49797J38580J86866J1708J08506J87884o9423R0580
$$ y = [2576170, 2537414, 2193479, 2506554, 2200136, 2514236, 2814452, 2497615, 2472102, 2361482, 2667898, 2725007, 2549387, 2793997, 2595587, 2738017, 2575112, 3022474, 3297657, 3001327, 2859468, 3032855, 3262363, 3278608, 3212856, 3133119, 3275046, 3234263, 2967543, 3361952, 3415973, 3489685, 3477354, 3407945, 3328987, 3443120, 3513676, 4079173, 3419773, 3822002, 3704497, 3941847, 4011201, 4078074, 3857434, 4264525, 4280311, 4260222, 4114147, 4713901, 4207585, 4641309, 4551672, 4731044, 4855452, 4812723, 4947982, 5018764, 5091934, 4927822, 5247410, 5296806, 5335966, 5384918, 5576318, 5868314, 5544478, 5843677, 5895719, 6102528, 5693531, 6394427, 6145760, 6495557, 6634137, 6821003, 6832711, 6941217, 7129101, 7059678, 7150258]
16805G150258N29254k14212J64408M42020O2029l77905N18141J30029K07183L66095
16795H977300K13414k37204L48593K64117J49355N55470j56638L68910Q6849N97974
16785A1168140P1339j71117M18529N81506q9667Q70302K05508Q772L24772P69730
16775A4157814Q3137M62119L55738P08678J72872M05188N66138N34086M62993
16766A7908763N72810J03408O00661J020370O03061O84052N92075N92271P36084
16757B3413555N68564Q76842Q02775Q64137J380015Q93648Q17147R26851J155714
16748C1699248J170724J223530J500415J041179J645657J515156J705969J370992
16740D2872870J972183J976884J822744J885152K204751K210296K516012K358258
$$ y = [7150258, 7679512, 7465300, 7629708, 8071728, 8133757, 7755852, 8273993, 8404022, 8611205, 8977300, 9190714, 8953510, 9302103, 9566220, 9715575, 10271045, 10114407, 10483317, 10570166, 11168140, 11239479, 11068362, 11486891, 12068397, 11978730, 12849032, 13054540, 13063312, 13388084, 14157814, 14240951, 14703070, 15058808, 15767486, 15940358, 16345546, 16911684, 17445770, 17908763, 18481573, 18584981, 19185642, 20206012, 20809073, 21493125, 22085200, 22677471, 23413555, 23982119, 24858961, 25661736, 26525873, 27905888, 28799536, 29616683, 30543534, 31699248, 32869972, 34093502, 35593917, 36635096, 38280753, 39795909, 41501878, 42872870, 44845053, 46821937, 48644681, 50529833, 52734584, 54944880, 57460892, 59819150]
16732E9819150K877662K384257L500458K831499L405053L040282M092677L123906
16724H5074944L796854L875704M253766L797176M214683M208659M669311M071786
16716A17962883M318521M253370M180026M021853L311060L812000K721635K478931
16708A47060279K259324J438659J373969M47081m19247m96979q42785j636621
16700A49183680k256685k580085k757247l753577l512001l962095m486833l845698
16692A22029459m151771m546338m151865m204911m558726l996997l881448m192546
16684H8344857l724050l500727m002528k999376l384256l564990k807651k825517
16676F1535762k487999k541314k074373k764589k175850k093488k070025j561410
$$ y = [59819150, 62696812, 65081069, 68581527, 71413026, 74818079, 77858361, 81951038, 85074944, 88871798, 92747502, 97001268, 100798444, 105013127, 109221786, 113891097, 117962883, 122281404, 126534774, 130714800, 134736653, 138047713, 141859713, 144581348, 147060279, 149319603, 150758262, 152132231, 152579312, 152160065, 151663086, 150820301, 149183680, 146926995, 144346910, 141589663, 137836086, 134324085, 130361990, 125875157, 122029459, 117877688, 113331350, 109179485, 104974574, 100415848, 96418851, 92537403, 88344857, 84620807, 81120080, 77117552, 74118176, 70733920, 67168930, 64361279, 61535762, 59047763, 56506449, 54432076, 51667487, 49491637, 47398149, 45328124, 43766714]
16668D3766714j886075j405514k085804j442942j487608j206739j465030j175445
16660C1611557r89830j312470n63349j428062q93871p80945p33568q39007q50841
16651B3219614r38280p57992p62291k42884j022590j98934p15836o27013n82950
16642A7370844j31892q42537n91410n07430J85342q57414k48131k84669o57286
16633A3435417m25019r0502o22932k65206k20672j7275m37074l39347k24877p4935
16623A0717578k93688l16479j02115m28917o5157m78392r4748k35998J36861j62357
16613H676588m17634j86799k23258R8478k28394k62423r0193j78073j28456k5666
16603G034170l10886m368j00085k52384r0742J83012o65497J8580O3872J54888
$$ y = [43766714, 41880639, 40475125, 38389321, 36946379, 35458771, 34252032, 32787002, 31611557, 30621727, 29309257, 28745908, 27317846, 26423975, 25643030, 24909462, 24070455, 23219614, 22281334, 21523342, 20761051, 20518167, 19495577, 19296643, 18580807, 17953794, 17370844, 17238952, 16396415, 15805005, 15297575, 15482917, 14625503, 14377372, 14092703, 13435417, 13010398, 12919896, 12296964, 12031758, 11811086, 11793811, 11356737, 11017390, 10792513, 10717578, 10423890, 10107411, 10005296, 9576379, 9511222, 9032830, 8938082, 8702084, 8838945, 8676588, 8258954, 8072155, 7848897, 7947375, 7718981, 7456558, 7366365, 7188292, 7059836, 7034170, 6723284, 6718916, 6618831, 6366447, 6275705, 6458717, 5793220, 5811800, 5875672, 6030560]
16593F030560n15287J44382k09421l24731L00810k17036q3817k47028k58622O03406
16583E223216p28194j45138O9094k0132j66302L15517l4723k45856N7653j41836
16573D183299N266R7385k58902m28919M06104k24897m22565L37177m49938L16710
16563C560720p1677L5014j92378Q689L2039J49782k96798j13292o1510K2206Q2916
16552C155711j5902k44071M1708k44985q4507L22435j47426K43758l35699J95073
16542B886095j38543l597j38103N941J72929k58660J52560k43877o2115J16539
16532B489169J0321N0692k63152M0775o872O3039m94405N24726j70002n48264
16522A696027K24255J93228k8113P3577j84525j25990J41572r4114J26382j70347
$$ y = [6030560, 5515273, 5659655, 5450234, 5125503, 5426313, 5209277, 5125460, 4878432, 4619810, 5223216, 4495022, 4349884, 4418978, 4398846, 4232544, 4548061, 4513338, 4267482, 4325135, 4183299, 4188565, 4285950, 4027048, 3598129, 4004233, 3779336, 3356771, 3693948, 3244010, 3560720, 3489043, 3524057, 3331679, 3340368, 3372407, 3522189, 3225391, 3112099, 3050589, 3072795, 3155711, 3139809, 2895738, 2937446, 2692461, 2607954, 2930389, 2782963, 3026721, 2691022, 2886095, 2747552, 2743955, 2605852, 2611793, 2784722, 2526062, 2678622, 2434745, 2372630, 2489169, 2499490, 2550182, 2287030, 2327805, 2320933, 2383972, 1889567, 2414293, 2244291, 1696027, 1920282, 2113510, 2085397, 2158974, 1974449, 1848459, 1990031, 1895917, 2022299, 1851952]
16512A851952l19372M22952j89706L87026k66580j91828J87193j78133J38217
16503A841721n98205M04187N142j312K8095J22895j49825k0378m17440L07375
16493A522255l6311K85686m78313M06489j13769K03958l41130j157K1169p1421
16483A397456l15908N22908j77788J11951L0715l21332N9714k76876K78935j1477
16473A298298o0279j08778J87802m73380L42892J79854j10136j29542J4391K04212
16463A345334o7955L5391Q1392j42892J01990J50205l70042j16047K29376N3502
16453A300254J71997k01473J08590m13733L38052k22977j58650L73802k06224
16444A089638n09175L24678K19233m50760L85905j03414J04361N1459q7023J78365
$$ y = [1851952, 1532580, 1955532, 1765826, 2152852, 1886272, 1694444, 1881637, 1703504, 1841721, 1243516, 1647703, 1652845, 1651533, 1679628, 1802523, 1652698, 1632320, 1214880, 1522255, 1485944, 1771630, 1293317, 1699806, 1586037, 1789995, 1448865, 1447708, 1468877, 1397456, 1081548, 1604456, 1426668, 1538619, 1569334, 1248002, 1307716, 1030840, 1309775, 1298298, 1238019, 1129241, 1317043, 843663, 1186555, 1366409, 1256273, 1126731, 1141122, 1345334, 1277379, 1312770, 1394162, 1251270, 1353260, 1503465, 1133423, 1017376, 1246752, 1300254, 1472251, 1270778, 1379368, 965635, 1303687, 1080710, 922060, 1295862, 1089638, 580463, 905141, 1124374, 673614, 1059519, 956105, 1060466, 1111925, 1024902, 1203267]
16434A203267l58428J44374k61708K11985j73211J3319K18298o3897j23703J2324
16424H22620K73919k41166M49263m61829k47608M30464k52600J07310J2704O8874
16414I61951m00139J60485K48306Q839l08372j0390K90203J19134m78722K15824
16404H07119k16161M04176k58575Q8267j53821R730j77460Q9295K63425K20636
16394A076631D83746L17776n8032q0963P4560p4206n9249o346R3305K24956j66008
16383G49539J49970o2902k02329K69035j76162r3238j84440p6225K45206J41017
16373G59471j32798j49377J39191J36875q4939R6558K49516C03836N01870j35307
16363F70399r6529K8530j78733M50467l26092L96018k85779q4579n0136K63706
$$ y = [1203267, 844839, 989213, 727505, 939490, 766279, 779598, 997896, 933999, 810296, 822620, 1096539, 855373, 1304636, 842807, 595199, 1025663, 773063, 880373, 893077, 961951, 561812, 722297, 970603, 979442, 671070, 660680, 950883, 1070017, 591295, 807119, 590958, 995134, 736559, 824826, 671005, 680735, 503275, 592570, 855995, 1076631, 483746, 801522, 743490, 662527, 737087, 662881, 603632, 597286, 690591, 915547, 749539, 899509, 836607, 634278, 903313, 727151, 633913, 449473, 373248, 618454, 759471, 626673, 477296, 616487, 753362, 668423, 764981, 1014497, 303836, 805706, 670399, 573870, 602400, 423667, 874134, 548042, 944060, 658281, 573702, 523566, 787272]
16353G87272k28052P3264L36619D51602K9964L06590r1563B94091K59021P7405
16343F30517L7084l13256O3323k7015K63739R9039l32783J8755J30237j71805
16333C97835J44352L9894j04527J67154Q4544J0223j29250j27902q5217r2905
16323C04201J35192K97686k5638k89598K71629B03380M58513j97419r7865K20988
16313E87597j48971B07286K32054A96673Q2384L83489j08980B58139J00487J14762
16303D73388j28523M84700C51146p5724j29110M87826B15332L99052r9801J9745
16293E34328p7205J14853j45621m470j20961r2902K62474j06084J4213p3479J50332
16282D55478j36055O8085N2088j35083L49388A06177L02862R365p0435L33615
$$ y = [787272, 559220, 632484, 969103, 451602, 481566, 788156, 696593, 294091, 553112, 630517, 667601, 354345, 417668, 390653, 654392, 753431, 420648, 439403, 569640, 397835, 542187, 582081, 477554, 644708, 729252, 739475, 610225, 482323, 397106, 304201, 439393, 737079, 711441, 421843, 693472, 203380, 661893, 464474, 366609, 587597, 438626, 207286, 439340, 196673, 279057, 662546, 553566, 258139, 358626, 473388, 344865, 829565, 351146, 275422, 146312, 634138, 215332, 614384, 514583, 534328, 457123, 571976, 426355, 421885, 300924, 208022, 470496, 364412, 378625, 305146, 455478, 319423, 387508, 439596, 304513, 653901, 106177, 409039, 418404, 347969, 681584]
16272F81584k97712A86052M82494k74946K5843r6561M0752J4176J00066j43831
16262C34045A36912M33432C8186L88547j67279M27469j64736L1823k50577r3836
16252B09597N0587p6341o525J81422r8576d0827A84309L25067B31380M8084L08813
16241E88277m8868B22879L30010k48722N1943j5192J64746j16457n6525J09542
16231D42224A38957K10828n066K4516k1970A60465B945N11658j75233q8214J66478
16220D17634E9559K95788M8282J61521F353L64987A56929N1388J399J82666h704
16208A80170P5786L59382B01646p6608J39024c819A94092K35421j91089K4819
16198B63243D7757L02432A44154K91355B06962M844K09453A98227K68751A88446
$$ y = [681584, 383872, 186052, 668546, 393600, 419443, 322882, 363634, 377810, 477876, 334045, 136912, 570344, 38186, 426733, 259454, 686923, 522187, 554010, 303433, 209597, 260184, 183843, 177318, 358740, 260164, -40827, 184309, 509376, 231380, 279464, 588277, 539409, 222879, 552889, 304167, 356110, 340918, 505664, 389207, 332682, 442224, 138957, 349785, 344719, 369235, 347265, 160465, 2945, 514603, 339370, 251156, 417634, 59559, 355347, 403629, 565150, 6353, 371340, 156929, 208317, 209716, 392382, -8704, 180170, 255956, 615338, 201646, 125038, 264062, -3819, 194092, 429513, 238424, 263243, 47757, 350189, 144154, 435509, 206962, 211806, 421259, 198227, 466978, 188446]
16187C07188J16043j66726K6880Q1421k3209a10239B08410a10778A63457K73017
16177D36474A11230m9232a5906A50095L12252A51625P2725q0984B0480J01958
16167A22438L10866A00494K98558j77045q9030j8692J21630a1198B4442K73038
16157B97480h5344C18489Q7891E8164K09485E1330K40140p1863o9277l582i5447
16145D38983G0883O8239L68490A50554a6823B20046H1515J66231J14602C6338
16134E4030L31607A41517o2629A3255R7992M12422g6855A4013c4918J7182C67178
16122C16026q2264A07178K72608f5835C20441P039J8058a65119A46601F8053J80020
16111B48073H6484J3793J22198a67423a6735A07241E645e8602B72220a72773C50040
$$ y = [307188, 423231, 256505, 283385, 364806, 341597, -110239, 208410, -110778, 163457, 436474, 111230, 61998, -15906, 150095, 462347, 151625, 224350, 143366, 20480, 122438, 433304, 100494, 399052, 222007, 132977, 114285, 235915, -11198, 24442, 297480, -85344, 318489, 406380, 58164, 267649, 51330, 291470, 219607, 150330, 146748, -95447, 438983, 70883, 139122, 507612, 150554, -16823, 220046, 81515, 247746, 362348, 36338, 54030, 385637, 141517, 78888, 13255, 111247, 523669, -76855, 14013, -34918, -17736, 367178, 316026, 233762, 107178, 379786, -65835, 320441, 327480, 345538, -165119, 146601, 68053, 248073, 86484, 100277, 222475, -167423, -16735, 107241, 5645, -58602, 272220, -172773, 350040]
16099a94547n382L2258B10068P3983A26662f0550B00973d2095b408B68734A30823
16087b347A56924J80118d3166C1284L431q28K54058j22468L648J03354A4175K08126
16075B22301b20248j31641A01390a16952j91162A01345C8100j4163K04763m9667
16065A79033b9838B26920H9080N2c47332a22422l7453B83258d4082l0967c3222
16053F432b7426j22155E4008o476Q1546j9263r372K315a9726F7243K03002n1503
16041B18742c2845j16338j8004A67873N7664G1091J27639b82300A46938b39390
16030i6717I0416O9520A3563K17874b299j54681D4935a30177n1799E27895b50456
16018I8795g0249j93099A0431R3014a2850D02495b26271H90a6856E5982J08407
$$ y = [-194547, -199929, -167671, 210068, 284051, 126662, -60550, 200973, -42095, -2408, 268734, 130823, -2347, 156924, 337042, -43166, 31284, 34715, 33887, 287945, 165477, 169125, 272479, 14175, 222301, -220248, -351889, 101390, -116952, -308114, 101345, 38100, 23937, 228700, 179033, -29838, 226920, 89080, 89132, -347332, -122422, -159875, 283258, -44082, -75049, -33222, 6432, -27426, -149581, 54008, 47532, 129078, 109815, 100443, 102758, -19726, 67243, 270245, 218742, -32845, -149183, -167187, 167873, 225537, 71091, 198730, -282300, 146938, -239390, -96717, 90416, 159936, 13563, 231437, -2299, -156980, 44935, -130177, -181976, 527895, -250456, 98795, -70249, -263348, 10431, 103445, -12850, 402495, -226271, 890, -16856, 55982, 164389]
16007A64389c11276D6190b7097H2347c9286H5001a16781B9430f5086B37481c2250
15995A11653d2596e649A71049a84506o2760A47904b36291B29751I2379d0087j68691
15984b08778f6133A32140a34107O010B3549K65409b68116A43667a11957L4945
15974g7012I4021J33334r9012L86777K04366j58327L5150K1584J82471l03365
15964D96999J5338A15579j7260l2873B1875c1191H5067J33870m3548f2381A28351
15952b0182F2987J851M9653O2525l8830b26323b0189k22403a10818o8311O9086
15941a10043E373N395K34004d34704f0809p7884A07892c574k54959G0926a61560
15929A2670d9204j38413C412K59581g9537p5247a8259C1030b39538A77376a05787
$$ y = [164389, -311276, 46190, -27097, 82347, -39286, 85001, -116781, 29430, -65086, 237481, -32250, 111653, -42596, -5649, 171049, -184506, -247266, 147904, -236291, 229751, 92379, -40087, -208778, -66133, 132140, -134107, -128097, 23549, 288958, -268116, 143667, -111957, -77012, 94021, 227355, 128343, 515120, 719486, 561159, 596309, 617893, 800364, 496999, 512337, 115579, 98319, 65446, 21875, -31191, 85067, 218937, 175389, -62381, 128351, -20182, 62987, 64838, 114491, 177016, 138186, -226323, -20189, -242592, -110818, -179129, -110043, 5373, 10768, 244772, -434704, -60809, -138693, 107892, -3574, -258533, 70926, -161560, 12670, -49204, -187617, 3412, 262993, -79537, -154784, -18259, 31030, -239538, 177376, -105787]
15917B9981a10505L9782o6253l58078a25633A04596a9564k1852r3123I1537K97789
15906C89326f7484l58153a9329q0647A16677a31483K3756k97855A33552e2820
15895A57754L1266p7666k7331J10739m6114J33252A28592h4498A70828b858k75114
15884b77972F0541a70320k06986a05541C7206N6872a34985A09466b96078h753
15873b3526l1915a5315j37718D7590b6793D6225P1918b76781J37895m0804c4908
15861C0573J1514b43966H3024a08627j48992g4982l14652B51012c04088B07837
15850c4968A62296a50377a4455j3372F2181b91599a26780F5197Q4466h3750o953
15839i0703j55001C92986b88031l5871R484a40165B8295m88a36674F221O2898
$$ y = [29981, -110505, -70723, -136976, -495054, -125633, 104596, -19564, -41416, -134539, 91537, 389326, -67484, -425637, -19329, -99976, 116677, -131483, -107727, -405582, 133552, -52820, 157754, 189020, 111354, 84023, 194762, 148648, 281900, 128592, -84498, 170828, -2858, -277972, 60541, -170320, -377306, -105541, 37206, 94078, -134985, 109466, -296078, -8753, -23526, -55441, -15315, -153033, 47590, -26793, 46225, 118143, -276781, -138886, -179690, -34908, 30573, 42087, -243966, 83024, -108627, -257619, -74982, -389634, 251012, -304088, 207837, -34968, 162296, -150377, -14455, -27827, 62181, -291599, -126780, 65197, 149663, -83750, -90703, -245704, 392986, -288031, -323902, -314418, -140165, 28295, 27807, -136674, 6221, 69119]
15828F9119c63959A07362l0092L37495c7171l4035j2686A37640b0070A62322Q866
15817A71188b41735A85890H5303J86845j11751e15430a49003A22831b5957k31588
15807b57545d7129A2910d08893J80408C9096j4454J82630a72662B60200b10309
15796a1555l9384k8068A03872e1989j07386p5270J3274j02325J59427A85063a27504
15784B45274b29429n9896B2100c56863A07254a50624A33799b83211A86483a02483
15773d60131g47A13634b67915H0607h4865j63046j09095f1248B7727K59527m4492
15762B42762c13899a23130c8518l86946B06689N1428H2151E254i2439A46597g0609
15750a00535k71172b9294B83470b09950A62382f0913C19776h5521A64666b33607
$$ y = [69119, -363959, 107362, 77270, 414765, -37171, -71206, -83892, 137640, -20070, 162322, 171188, -241735, 185890, 85303, 272148, 160397, -515430, -149003, 122831, -25957, -257545, -47129, 12910, -408893, -228485, 39096, 24642, 207272, -172662, 260200, -210309, -11555, -50939, -79007, 103872, -51989, -159375, -234645, -221371, -323696, -164269, 185063, -127504, 245274, -229429, -289325, 22100, -356863, 107254, -150624, 133799, -283211, 186483, -102483, -460131, -747, 113634, -267915, 80607, -84865, -247911, -357006, -61248, 27727, 287254, 242762, -313899, -123130, -38518, -425464, 206689, 258117, 82151, 5254, -92439, 146597, -70609, -100535, -371707, -29294, 283470, -209950, 162382, -60913, 319776, -85521, 164666, -233607]
15739f6538B52162A07504J03867L4681c614G9685a82048C03898o7766i3599A71899
15727d4001q3201l38197B56766b35399c7290E7367d8496C6124d8767B30739b21544
15715A16457D1305c0559c120D5139a41216C0337b15232A14297a18328A41988l2652
15704A09336a6007l52632g3013j28124l08702K16744q4837f4394J050F5608a85837
15692c2748L030B67379e0649J4407j10629r3003I2282M1480d6695C1309J23845
15681A55154a89102g2055B07227E9233P9073k2137o702K8079M9411a26961A42266
15669A86643e74197a99304B10529a83062C04870a05747l9927L9846K0614B56611
15658H8518j437p734P832a47721k15315E4830f6684K449C392a48522j80584e5222
$$ y = [-66538, 252162, 107504, 211371, 246052, -3614, 79685, -182048, 303898, 236132, -93599, 171899, -44001, -127202, -465399, 256766, -235399, -37290, 57367, -48496, 36124, -48767, 230739, -221544, 116457, 41305, -30559, -3120, 45139, -141216, 30337, -215232, 114297, -118328, 141988, 109336, -16007, -368639, -73013, -201137, -509839, -293095, -377932, -64394, -63344, 65608, -185837, -32748, -29718, 267379, -50649, -36242, -146871, -239874, 92282, 133762, -46695, 31309, 155154, -189102, -72055, 207227, 59233, 138306, 116169, 109467, 137546, 186957, -126961, 142266, 186643, -574197, -199304, 210529, -183062, 304870, -105747, -145674, -105828, -85214, 256611, 88518, 87081, 79347, 87179, -147721, -363036, 54830, -66684, -64235, 3392, -148522, -329106, -55222]
15645A25754L4621b01324F0793b05268A2296i7732A50535b63472B09291q8948
15635A20343b04064B47666c27926G407i9339I249c7588A7429J00469A3483J48594
15624A62077B6681E278J71591d3675B38765b85065Q2574E9844K75355c00782f8198
15612c43368h1976B67736a67586B26365F2104a81208C69339A50468a37904j4549
15602a52453c2969k00858G610N6821B8537K19289H029a53353b6498k087n4244
15591h2829B3543a2932k85997b6905r1782N985B41607b22829N8729p5340j25178
15580c64618A35385d9280q0964M5452j30172O3910B0211c43737J48430g8618j55201
15569b33819a6195g891p5397F4043g0115B7358i9878k8348L632j03576N446E5780
$$ y = [125754, 160375, -201324, 60793, -205268, 12296, -97732, 150535, -263472, 209291, 120343, -204064, 247666, -327926, 7407, -99339, 9249, -37588, 17429, 117898, 13483, 162077, 26681, 5278, 176869, -43675, 238765, -285065, -202491, 59844, 335199, -300782, -68198, -343368, -81976, 267736, -167586, 226365, 62104, -181208, 369339, 150468, -137904, -152453, -32969, -233827, 7610, 64431, 28537, 247826, 8029, -153353, -26498, -28585, -82829, 23543, -12932, -298929, -26905, -118687, -112702, 241607, -222829, -164100, -239440, -364618, 135385, -49280, -130244, -84792, -214964, -151054, 20211, -343737, -195307, -78618, -233819, -16195, -7891, -83288, 64043, -70115, 27358, -99878, -128226, -124594, -228170, -222724, 55780]
15556b4878A72025a36808h614j42174m6544K9838e265H1114b33385A86847a24791
15544A1509d6443B66981g0051E571a56000A18742J84298c1375j7872j47268F0510
15532d1433C19960H2991j198a6165D0367a83528C4753a96372a2261D33121A73544
15520E3924K91364r8689f351A7640Q1393c0821D8469K01158h3438p9745L4258
15509a28925a1772A96706K21806A62032G8245a48146B20683C0807L33028m0642
15499C23193E0649a17403L127G7504N9182o4850J36609j00891b06180D19646B4128
15487a75705g0326C60278a73132A09286j1184J37176C495R0595f2325G3357a48226
15475B14903A07321f6616C6907b49328F9116e4561A2735e2008j36861g741B29575
$$ y = [-24878, 172025, -136808, -8614, -150788, -197332, -167494, -5265, 81114, -233385, 186847, -124791, 11509, -46443, 266981, -70051, 5571, -156000, 118742, 303040, -31375, -49247, -196515, 60510, -41433, 319960, 82991, 81793, -16165, 40367, -183528, 34753, -196372, -12261, 433121, 173544, 53924, 345288, 246599, -6351, 17640, 99033, -30821, 48469, 249627, -83438, -163183, -128925, -11772, 196706, 418512, 162032, 78245, -148146, 220683, 30807, 363835, 323193, 50649, -117403, -114276, 77504, 136686, 71836, 208445, 107554, -206180, 419646, 24128, -175705, -70326, 360278, -173132, 109286, 98102, 235278, 3495, 94090, -62325, 73357, -148226, 214903, 107321, -66616, 36907, -249328, 69116, -54561, 12735, -52008, -188869, -7741, 229575]
15463a18360A88977P0130J5630N1500E802L03767J4735m2159L8869j00384N6256
15452B76886j26643d3615D03756A29757J10887q1627h2556A46334R2588a68201
15441B5714a3549E3307K5769R4842p9823N4770n6233J83074a70945o8064G3009
15429A44626Q1289J15213J86511l784j10275O28609D47973J50234J32956k49980
15419D81183B09973a06164A6299g4533A0746a38486B8703b17799b2335j49686
15409a72021c1522B3571J07565M0684d796C59719A66176j4790k9210L9999e139
15397c85977H8173b11320n4824F1754P6031g6691j19290A99977J18694j19920
15387A98751j8453c6554p2203B28712R328i1271o9121D8133a20784N0305j707
$$ y = [-118360, 188977, 259107, 274737, 326237, 5802, 309569, 324304, 282145, 321014, 220630, 276886, 150243, -43615, 403756, 129757, 240644, 159017, -82556, 146334, 238922, -168201, 25714, -13549, 53307, 79076, 173918, 94095, 148865, 92632, 275706, -170945, -239009, 73009, 144626, 225915, 341128, 527639, 523855, 413580, 1042189, 447973, 598207, 731163, 481183, 209973, -106164, 16299, -74533, 10746, -138486, 28703, -217799, -22335, -172021, -31522, 23571, 131136, 171820, -4796, 359719, 166176, 151386, 122176, 162175, -5139, -385977, 88173, -211320, -266144, 61754, 137785, -76691, -195981, 199977, 318671, 198751, 180298, -36554, -108757, 228712, 238040, -91271, -160392, 48133, -120784, -70479, -72186]
15376g2186q0137J9948j3298l8201P0442C6542j2018b48368B95874a7982A10568
15364f3011r7045j74789I4661J5086J73182r4139f3652B99679O3226F2097b0703
15352A03445B8056J9060O4066h2007K0930A04673a38954A07529L68911k14065
15342B62375E7419k6919J05193C6200a65428D6528i0615D38197i4450E6905K43233
15331C00138o0041m1379p1401J63145i5877C03506h3996a2834A06449N2011P3079
15320B31539L6164j7263m7070E9617O2458J01431r4710J38694J13541m7497J45394
15309D78928b14584C50510A71856p9898K65877j16584a35359A62320R7942I0929
15298B01597L87573M1821k84134d9953A05236L7060J93735g8269D5305K22064
$$ y = [-72186, -152323, -132375, -145673, -183874, -113432, 36542, 24524, -248368, 295874, -17982, 110568, -63011, -160056, -334845, 94661, 109747, 282929, 188790, -63652, 299679, 362905, 62097, -20703, 103445, 28056, 47116, 111182, -82007, -61077, 104673, -138954, 107529, 476440, 262375, 57419, 30500, 135693, 36200, -165428, 46528, -90615, 438197, -94450, 56905, 300138, 240097, 198718, 127317, 290462, -95877, 303506, -83996, -12834, 106449, 158460, 231539, 267703, 250440, 203370, 59617, 122075, 223506, 128796, 267490, 381031, 333534, 478928, -214584, 350510, 171856, 91958, 357835, 241251, -135359, 162320, 260262, 90929, 201597, 589170, 630991, 346857, -49953, 105236, 142296, 336031, -78269, 45305, 267369]
15288B67369g3089o0709C37723A3425J94837b82189a31887B32011G813b79614
15277A41415J5752e9242C65745c04121C2535d5552j3046k30387B97267r7110N6718
15266B56875o3241H1672a41072n1073B09688L49664B55260A2909J3818b68525
15255b82294J02477D7328M13597I8256O2763b14300C28799c5466l4054B79108
15244b16776A50536m3144a8172k03932b6821B75427L0752a06384B98414A15269
15233d3460B11522n6541D1137M21908O73739j57871O08494m57282K82263k99939
15223A112449n12454B90904n778j9928A16310L76755F6898b4608k3424A8126K14445
15212B32571d76062A26514J24428f0351l9323E4581J28426L32104F1667L00775
$$ y = [267369, -73089, -133798, 337723, 13425, 208262, -282189, -131887, 232011, 7813, -279614, 141415, 157167, -59242, 365745, -304121, 32535, -45552, -58598, -288985, 297267, 200157, 256875, 193634, 81672, -141072, -192145, 209688, 559352, 255260, 12909, 26727, -268525, -282294, -179817, 47328, 460925, 98256, 161019, -214300, 328799, -35466, -69520, 279108, -216776, 150536, 107392, -18172, -222104, -26821, 275427, 306179, -106384, 298414, 115269, -43460, 211522, 154981, 41137, 463045, 1136784, 978913, 1587407, 1130125, 1412388, 1112449, 599995, 290904, 285126, 265198, 116310, 493065, 66898, -24608, -48032, 18126, 232571, -476062, 126514, 250942, -60351, -99674, 54581, 183007, 515111, 61667, 362442]
15202C62442e5565K3508J3807A59529J69705H2787f5816E9539P3713b0762H6888
15190A8754L8556K47117C8778K55017L62291b964A61768B7477R9106a970B22415
15178A11181A0148K9540J19654h8244o024j14847R5948G7620B2732O8188K4845
15167A15765D6337K07133A07871a49574a9142D5567L71116a67407D37281c4915
15156f569B0498b3464m1603b0020B79731K5130j25796i1725H5734l0063L12187
15145C67858A05462J42655N4916A1076a0141D28590j29437a08199j10409A30139
15134f3455A43961F1802j832P1059K68670j51108j627k8571M7347k06a4214A85657
15121e5718D39459f7378J3503A10939L6120p1832M2045M7808J53126c25190B66817
$$ y = [362442, -55565, -32057, -18250, 159529, 329234, 82787, -65816, 59539, 133252, -20762, 86888, 18754, 57310, 304427, 38778, 293795, 656086, -2964, 161768, 27477, 126583, -1970, 222415, 111181, 10148, 39688, 159342, -88244, -94268, -209115, -113167, 77620, 22732, 90920, 115765, 46337, 253470, 107871, -149574, -19142, 45567, 416683, -167407, 437281, -34915, -6569, 20498, -23464, -65067, -20020, 279731, 304861, 179065, -91725, 85734, 55671, 367858, 105462, 248117, 303033, 11076, -10141, 428590, 299153, -108199, -218608, 130139, -63455, 143961, 61802, 59970, 131029, 399699, 248591, 246964, 218393, 265740, 265534, -14214, 185657, -55718, 439459, -67378, -53875, 110939, 147059, 75227, 117272, 165080, 318206, -325190, 266817]
15109A23157a95684B71160p1158m6385n2685L73013D4402J46817q6050K85779
15099C90948j43353M5217i3243j0122A18010k2341K50005l9295K1603b6571k305
15088b8876A10698P1489A0737g2585C12077J698H1725h6974A22101l9672O3312
15077A45741K2844g757A34506d5958j27010B64468c6983j14630B1001a23233C25168
15065a03932F0898h9217l4167B38655I1909c2672B45334d9990A27269i4672A27768
15053B41855g7112B8386a02525A84698i9914E0389c68449A41736Q8786G3494J45299
15042B18793H624J12799J18423J09011L32643B51744j5518K05201j43863n0570
15032B46994A21345L61947l994k20817J35780j53476K7186c1352F40804A94697
$$ y = [123157, -195684, 271160, 200002, 153617, 100932, 473945, 44402, 191219, 105169, 390948, 247595, 292812, -93243, -103365, 118010, 95669, 345674, 306379, 327982, -26571, -28876, 110698, 182187, 10737, -72585, 312077, 313775, 81725, -86974, 122101, 82429, 145741, 168585, -7757, 134506, -45958, -172968, 264468, -36983, -151613, 21001, -123233, 325168, -103932, 60898, -89217, -123384, 238655, 91909, -32672, 245334, -49990, 127269, -94672, 127768, 241855, -77112, 28386, -102525, 184698, -99914, 50389, -368449, 141736, 230522, 73494, 218793, 8624, 121423, 239846, 348857, 681500, 251744, 236226, 441427, 297564, 246994, 121345, 483292, 479298, 258481, 394261, 240785, 267971, -31352, 640804, 194697]
15021F38593C13017A53959M80833B20304L13989k50991P8843k7951M07193K08323
15011I49710j24568k30554r7923J29958B88911o6686K18227K53085k88619K63978
15001F68896j93593J3999J24263B99209J04834j55670M0127J79467j5870j66928
14991B85169L98035j08737l593k42812r8369A07010J06585J3605A06108M72855
14981E78963K4854j96692j49230C1416N84902B46512J08324p5652K62174j98414
14971C42944K54772k80641J67980j58500K45662J52960j28623k2715J52865l41597
14961C85107L06388j58093B8676L95527K80142j36165K84539B45254L37218m9999
14951E32473r0409p1528A56633l2330k4166K42746K7945L1959r1783K09645K4078
$$ y = [638593, 313017, 153959, 634792, 220304, 534293, 283302, 362145, 334194, 741387, 949710, 825142, 594588, 496665, 626623, 288911, 222225, 440452, 693537, 404918, 668896, 475303, 489302, 613565, 299209, 404043, 248373, 288500, 467967, 452097, 285169, 683204, 574467, 570874, 328062, 229693, 107010, 213595, 227200, 106108, 578963, 603817, 407125, 257895, 31416, 616318, 246512, 354836, 279184, 541358, 342944, 597716, 317075, 485055, 326555, 572217, 725177, 596554, 573839, 726704, 385107, 691495, 533402, 28676, 424203, 704345, 568180, 852719, 245254, 582472, 532473, 442064, 370536, 156633, 124303, 100137, 342883, 370828, 402787, 311004, 520649, 544727]
14940E44727l125A19568O45862l79988J8751J38634k00114o9317L04657k46646
14930C31407p592K2688r0178M02638O9912k45694R1346N2883p9631J56369k32366
14919D71782B2970L71595J20318K00987J07826p7961K53223J69712K28094l29712
14909A067052K03871q8163L43517l21669P244M7762L9794K63069K523N4340K43878
14898A863218j38992n32497k70987K33782K604j34651q3533P033k53129m6945
14888F45903o364j9431p7554L23413C36663J29180J70452O9173q0394M5170j75343
14877D94901L26548q1508B33052J30281J91905j18306J86456J70081l02906L29737
14867H20300C72996J80973M9181J84761k45778j31808K7223L95515k18668K07814
$$ y = [544727, 541602, 119568, 765430, 385442, 404193, 542827, 342713, 273396, 578053, 331407, 323815, 346503, 256325, 658963, 728875, 483181, 574527, 627410, 547779, 704148, 471782, 22970, 394565, 514883, 715870, 823696, 745735, 998958, 1168670, 1396764, 1067052, 1270923, 1182760, 1526277, 1204608, 1211852, 1259614, 1299408, 1562477, 1565000, 1619340, 1863218, 1724226, 1191729, 920742, 1154524, 1157128, 1022477, 938944, 945977, 692848, 645903, 639539, 620108, 542554, 865967, 336663, 465843, 636295, 705468, 625074, 670244, 494901, 821449, 739941, 233052, 363333, 555238, 436932, 623388, 793469, 490563, 820300, 372996, 553969, 603150, 787911, 542133, 410325, 437548, 833063, 614395, 822209]
14857H22209l77215J37412j17292J53540j5888m171r7429J58767P05L95515D70368
14845H56573j96426j53343M4537K13367K8436e3695D54168L9098R9286p2300A14388
14833H34065l10250J94330M5224B90526R9661K21978l3953J09214J76986K15998
14823A080410k77146J43357J68067j41549k55773K69510j87109l50755j6142J86996
14813F19866K08367j07430j54294J18678j24754J94708J39958P1612l83049L71870
14803I55532k21485K35121k35987J01607k46454N9527j88686J04813j24365K20800
14793F60423k16199K92808l8627k2514J40261j69329J10983J58627l80606L32532
14783H68359l09064L82842m32B82801O00633l35451K8584m0599P6213q4771R2778
$$ y = [822209, 444994, 582406, 465114, 618654, 602766, 598595, 501166, 659933, 660638, 1056153, 470368, 856573, 660147, 506804, 551341, 764708, 793144, -53695, 454168, 493266, 592552, 520252, 114388, 834065, 523815, 718145, 763369, 290526, 390187, 612165, 578212, 687426, 864412, 1080410, 803264, 946621, 1114688, 973139, 717366, 986876, 799767, 449012, 432870, 619866, 828233, 720803, 566509, 685187, 560433, 755141, 895099, 966711, 583662, 955532, 734047, 969168, 733181, 834788, 588334, 647861, 459175, 563988, 439623, 660423, 444224, 737032, 698405, 675891, 816152, 646823, 757806, 916433, 535827, 868359, 559295, 942137, 941705, 282801, 883434, 547983, 576567, 535968, 612181, 527410, 620188]
14772F20188P7450R8591k24425K04624P3804m4785C75484L97058k4835J89253
14762I36960k82202k85197L19471J13307l49170M33576j56845j05664q49L75072
14752I98459J00232m86343j75228J62576q5850L06425l95803K75784J26727D02098
14741F21547M9756P5762K71549l23186J29624j35013K31128l92711K55760J0848
14731G95064j31774q413J07673J63488j93203q8420L07680j00114j3835L74927
14721A213073q0089j36682k11785M1039J31301k96287L74241J74150o5718j84248
14711I58995O04520m39610L38436L63291k42319j93967J95213k94943j58980M1678
14701A172314k04299J54463k26896L54143k43610o8120r3253K16219j77903J71387
$$ y = [620188, 697638, 796229, 571804, 776428, 850232, 805447, 375484, 772542, 747707, 936960, 654758, 369561, 689032, 802339, 453169, 886745, 729900, 624236, 623387, 998459, 1098691, 612348, 437120, 599696, 513846, 820271, 424468, 700252, 826979, 402098, 621547, 671303, 747065, 1018614, 695428, 825052, 690039, 921167, 528456, 784216, 795064, 663290, 654877, 762550, 926038, 732835, 644415, 952095, 851981, 838146, 1213073, 1132984, 996302, 784517, 825556, 956857, 660570, 1034811, 1208961, 1143243, 958995, 1563515, 1123905, 1462341, 1825632, 1583313, 1389346, 1584559, 1289616, 1130636, 1172314, 968015, 1122478, 895582, 1249725, 1006115, 937995, 844742, 1060961, 883058, 1054445]
14691A054445K79052o23345O8507M45388j89205J91642P197K08092J86680k20833
14681A407620J75944R3346n77223J73271k88054K04275K00015k13860J32660l03251
14671A004743l0438K84380j38668o8241P055j56996n9614L23041Q4822k21856
14661A028228j08751J38466K81481l98003K12842p4687l79571N97574k53282k6129
14651A018168o3129J45854J69602p1809l05051Q9831K57991j21055l3356j47091
14641I39955L71371k89706M9237r8789l5020L63628j02228J25365j38262j45736
14631A039815L02886J42029j42859j99664R5462K91816M0370l21363K5002j12369
14621A161125J31059J78740j68954Q8772J28475n1691l01712Q7350j11308J39334
$$ y = [1054445, 1333497, 710152, 778659, 1224047, 1034842, 1226484, 1233681, 1441773, 1628453, 1407620, 1583564, 1676910, 1099687, 1272958, 984904, 1189179, 1389194, 1175334, 1307994, 1004743, 974305, 1258685, 1120017, 1051776, 1058831, 901835, 842221, 1165262, 1250084, 1028228, 919477, 1057943, 1339424, 941421, 1154263, 1079576, 700005, 1297579, 1044297, 1018168, 955039, 1100893, 1270495, 1198686, 893635, 983466, 1241457, 1120402, 1087046, 939955, 1311326, 1021620, 1070857, 972068, 937048, 1300676, 1198448, 1323813, 1185551, 1039815, 1342701, 1484730, 1341871, 1142207, 1237669, 1529485, 1569855, 1248492, 1273494, 1161125, 1292184, 1470924, 1301970, 1390742, 1519217, 1467526, 1165814, 1253164, 1141856, 1281190]
14611A281190R2548n7957j61488M01297k0409o7115j7363J66591k29738M98090
14601A885646m63267O4390o5395L8265J58245J01616j03316o0323J90743m00800
14591A345804L53052k49026K1092J82169L72844l40119r2159K54768l54109L49128
14581A843444l9367P4754J06897J47517k86836j44049M39162k83275j06506j03311
14571A648430j4342N5893M96617j98071m1017K91210j66290j13545J00197N80148
14561B639230n17156m5131N3897n4251L89482j90098K03943k9935q1031j24051
14551B244899J55197N34084l19209K39302k25829K17957K22498M0110n3195L58190
14541C414004M03036O5597N02909N36177L54392J220391J363861K467140L624405
$$ y = [1281190, 1373738, 1315781, 1154293, 1555590, 1535181, 1468066, 1450703, 1617294, 1387556, 1885646, 1422379, 1486769, 1421374, 1459639, 1617884, 1719500, 1616184, 1555861, 1746604, 1345804, 1698856, 1449830, 1470922, 1653091, 2025935, 1685816, 1593657, 1848425, 1494316, 1843444, 1804077, 1878831, 1985728, 2133245, 1846409, 1702360, 2141522, 1858247, 1751741, 1648430, 1634088, 1689981, 2186598, 1988527, 1947510, 2238720, 2072430, 1958885, 2059082, 2639230, 2122074, 2076943, 2130840, 2076589, 2466071, 2275973, 2479916, 2449981, 2368950, 2244899, 2400096, 2934180, 2614971, 2854273, 2628444, 2846401, 3068899, 3109009, 3055814, 3414004, 3817040, 3882637, 4385546, 4921723, 5276115, 6496506, 7860367, 10327507, 13951912]
14532A3951912O064700R921573L198985j3549143p783300m752568j540812m70833
14524E040514J36080M48258j543205n91684n15420m46016K06554j81180J35533
14515B689434n2761m4060j09678M3794N0037k16234L18105K8089l43990J92053
14505B554789J35438K60840q5032m153n1411j37562J19607j21818M4065J67510
14495B882273l8497J36281o3318M70559n9029m24359L86360j93028J01938m1799
14485C157381N8272j7292L79324n7066j70405O5433N8064K69384J3717L9295O5260
14474C861367k71938K21894K55198p40729K27644L12222J93693J19903L09869
14465D489123k20656k31935o7052L95865k49787Q5693J70969k27306N68618j79348
$$ y = [13951912, 20016612, 29938185, 33137170, 19588027, 11804727, 7052159, 5511347, 5040514, 5176594, 5624852, 4081647, 3489963, 2974543, 2528527, 2735081, 2553901, 2689434, 2636673, 2592613, 2482935, 2526729, 2576766, 2360532, 2678637, 2706726, 2362736, 2554789, 2690227, 2951067, 2866035, 2861882, 2810471, 2672909, 2792516, 2670698, 2714763, 2882273, 2843776, 2980057, 2916739, 3387298, 3328269, 2903910, 3290270, 3097242, 3199180, 3157381, 3215653, 3198361, 3577685, 3520619, 3350214, 3415647, 3473711, 3743095, 3756812, 3796107, 3861367, 3589429, 3811323, 4066521, 3325792, 3553436, 3865658, 4059351, 4179254, 4489123, 4268467, 4036532, 3969480, 4365345, 4115558, 4201251, 4372220, 4144914, 4713532, 4534184]
14455D534184P0941N9604J18536K7192L9132m815j72067N02106l2526j72384L53323
14444E323226l2799n5881k1008L78615k37522J59707L0854l97171O54867J30082
14434E932970j77704P8234J96759j10938J79447J56979o9275L3705J37327j39637
14424F217867L88771K22436J8769N4646M47293m74367M54218p0581M85337l53884
14414G390505K7668K25998j88767M62118j88677M76612N6517k31141M75937J22329
14404H629099p402O47583k92126M09036M08558k46521j13979J78878J79617K8120
14394I820863M6945K84080K46277j45264P054M66535K69624j02377O81184j78222
14384A1396699K51965J95512n16786O17554M62422p8218r4398P3908L20016O67078
$$ y = [4534184, 4605125, 4664729, 4783265, 4810457, 4849589, 4844774, 4672707, 5174813, 5142287, 4969903, 5323226, 5290427, 5234546, 5213538, 5592153, 5354631, 5514338, 5545192, 5148021, 5802888, 5932970, 5755266, 5833500, 6030259, 5919321, 6098768, 6255747, 6186472, 6220177, 6357504, 6217867, 6606638, 6829074, 6847843, 6902489, 7349782, 6875415, 7329633, 7259052, 7744389, 7390505, 7418173, 7644171, 7455404, 7917522, 7728845, 8205457, 8261974, 8030833, 8506770, 8629099, 8621697, 9269280, 8977154, 9386190, 9794748, 9548227, 9434248, 9613126, 9792743, 9820863, 9867808, 10151888, 10398165, 10252901, 10259955, 10726490, 10996114, 10893737, 11574921, 11396699, 11648664, 11844176, 11327390, 11944944, 12407366, 12329148, 12234750, 12308658, 12628674, 13295752]
14374A3295752P0215K92064R0445L32305n1270L00930L57138P38632J49569K38035
14364A5813815N54274K88067k08855P90795N0116K97899K50229J69351K66430
14355A8272121J96148O83472M72708O35014J92544M81477O15842N69440M08427
14346B2527193L55662O45974O22094j36230R72719K51400J057957L16631R44988
14337B7558388R8082O71425J014684P93843L75520Q78409R30889N71343J181229
14328C4073812R61708R62935J059582J001031M86228J231275J494298Q96250J412811
14319D3579930J059012J346485J509509J477703J630828J776224J649849J707746
14311E5737286J855827K111374J784160J683880K795617K334884K183222K939878
$$ y = [13295752, 13365967, 13658031, 13748476, 14080781, 14029511, 14330441, 14687579, 15426211, 15575780, 15813815, 16368089, 16656156, 16447301, 17238096, 17288212, 17586111, 17836340, 18005691, 18272121, 18468269, 19151741, 19624449, 20259463, 20452007, 20933484, 21549326, 22118766, 22527193, 22882855, 23528829, 24150923, 24014693, 24987412, 25238812, 26296769, 26613400, 27558388, 27656470, 28327895, 29342579, 30136422, 30511942, 31390351, 32321240, 32892583, 34073812, 35035520, 35998455, 37058037, 38059068, 38545296, 39776571, 41270869, 42167119, 43579930, 44638942, 45985427, 47494936, 48972639, 50603467, 52379691, 54029540, 55737286, 57593113, 59704487, 61488647, 63172527, 65968144, 68303028, 70486250, 73426128]
14303G3426128K923139K310869K938692L470729K886430L650979L670777L673297
14295I8951040M574946M238495M477188M825880M921871N356967O058114O215164
14287A39619665O405054O684642P031936P577360P721762Q989925Q915802R151578
14279B02097724J0341927J0362698J0909134J2167698J2199478J3049586J3191460
14272B84319705J4042759J4466341J4594916J5274724J5145452J4623013J4017448
14265C86484358J3458921J2309783J0618223J0202985R333408Q192443O710396
14258D57310517L884017J615265K484754K108697l1893n568075n803131o556155
14250D49443996r511072j1884587j1711317j1882326j3397026j3526949j3027801
$$ y = [73426128, 76349267, 78660136, 81598828, 85069557, 87955987, 91606966, 95277743, 98951040, 103525986, 107764481, 112241669, 117067549, 121989420, 127346387, 133404501, 139619665, 146024719, 152709361, 159741297, 167318657, 175040419, 184030344, 192946146, 202097724, 212439651, 222802349, 233711483, 245879181, 258078659, 271128245, 284319705, 298362464, 312828805, 327423721, 342698445, 357843897, 372466910, 386484358, 399943279, 412253062, 422871285, 433074270, 442407678, 450600121, 457310517, 461194534, 462809799, 465294553, 467403250, 467371357, 461803282, 456000151, 449443996, 439932924, 428048337, 416337020, 404454694, 391057668, 377530719, 364502918]
14243C64502918j3288809j3436866j3847514j3250765j2321436j2669857j2184727
14236B73502944j2269032j2166684j0368281j1406823j1590303j1406146j0328695
14229A93966980r637577q685117q809207p938438p535347p118740o303551n940485
14221A31998518o098666n115604n311737m950300m469311l759883m425581l611221
14213I4256215l893222l527525l662713k981424k582773l055446k840025k173119
14205F9539968k540720j906713k216581j881907k201569k092834j391483j664695
14197E3643466j427180j907542j463638j436007j245319p56901j245385j635998
14189D2525496j218100q79120j741638n12064j090185p45266j234460q09276j149270
$$ y = [364502918, 351214109, 337777243, 323929729, 310678964, 298357528, 285687671, 273502944, 261233912, 249067228, 238698947, 227292124, 215701821, 204295675, 193966980, 184329403, 175644286, 166835079, 158896641, 151361294, 144242554, 137939003, 131998518, 125899852, 120784248, 115472511, 110522211, 106052900, 102293017, 97867436, 94256215, 90362993, 86835468, 83172755, 80191331, 77608558, 74553112, 71713087, 69539968, 66999248, 65092535, 62875954, 60994047, 58792478, 56699644, 55308161, 53643466, 52216286, 50308744, 48845106, 47409099, 46163780, 45406879, 44161494, 42525496, 41307396, 40428276, 38686638, 38174574, 37084389, 36339123, 35104663, 34295387, 33146117]
14180C3146117l09065j039715q79534n45072o27193j233058k15059q81168o75566
14171B6740687n76180p48820J08026j410265j04685m55841o39404o02864j67984
14162B2142670p15717j92693o92784r1164n77622m14809k60473n37008J41986
14153A8802386o95418l85162l26200l20138J76748q03546l90543k64498q6584
14144A5707045l46770j91119m61481j14109k22306j23624m31869r6022j66012
14135A3553733n64244j4671k12818m9836m16491l50261l04246j49588K19194k65597
14125A1445175o45489M95197n15636n7065l32388J9179k6684l84739L7637j70072
14115I865115j68168q7762n91563N5041r0702k71630j26993K60906l83394J21045
$$ y = [33146117, 32837052, 31797337, 30917803, 30372731, 29745538, 28512480, 28297421, 27416253, 26740687, 26164507, 25415687, 25523713, 24113448, 24008763, 23552922, 22913518, 22310654, 22142670, 21426953, 21234260, 20541476, 20450312, 19872690, 19457881, 19197408, 18660400, 18802386, 18106968, 17721806, 17395606, 17075468, 17252216, 16448670, 16058127, 15793629, 15707045, 15360275, 15169156, 14707675, 14593566, 14371260, 14247636, 13815767, 13719745, 13553733, 12989489, 12974818, 12762000, 12712164, 12295673, 11945412, 11641166, 11491578, 11710772, 11445175, 10799686, 11294883, 10779247, 10722182, 10389794, 10408973, 10382289, 9997550, 10035187, 9865115, 9696947, 9609185, 9017622, 9072663, 8981961, 8710331, 8583338, 8844244, 8460850, 8581895]
14105H581895q8478k38192J25483m01553P6770j72300J58866m21857Q8087l17243
14095G391478q010J670q6533n6615k01823j48723m6651K08404n16118j0357J11685
14084F638407R0041l72092k52670J86007O5027j28568k45670k54754J39279n5534
14074E809473j94355J99028J01024n97900L3933K1309j58169P6426k70254M1581
14064E062096l2068L21074m02165J61279l45486J58740j45820J16938o9547K4658
14054D849699J14814l18436P8612o71321M49318k79009J30679J71863J62525o5694
14044D623050l06233N4540J20933l46529j40619L66288m81040p2903P4026j70538
14034C720975K53938j32308j38323J49094J6363j53158L8283m1361k70743K37315
$$ y = [8581895, 8493417, 8255225, 8380708, 7979155, 8055925, 7883625, 8042491, 7620634, 7708721, 7391478, 7383468, 7385138, 7298605, 7241990, 7040167, 6891444, 6844793, 7053197, 6537079, 6526722, 6638407, 6728448, 6356356, 6103686, 6289693, 6354720, 6226152, 5980482, 5725728, 5865007, 5809473, 5615118, 5814146, 5915170, 5317270, 5351203, 5372512, 5214343, 5290769, 5020515, 5062096, 5030028, 5351102, 4948937, 5110216, 4764730, 4923470, 4777650, 4894588, 4825041, 4849699, 4964513, 4646077, 4724689, 4053368, 4502686, 4223677, 4354356, 4526219, 4688744, 4623050, 4316817, 4371357, 4492290, 4145761, 4005142, 4371430, 3890390, 3817487, 3891513, 3720975, 3974913, 3842605, 3704282, 3853376, 3869739, 3716581, 3754864, 3713503, 3442760, 3680075]
14024C680075k86741j80566K36736k17205R2346K14479k72049J08216P4527J13463
14014C563281k48107m11768M87057J46763n44520o8986K02566l34609K34115l7561
14004B988231k86259J9369m7810l656K25799J69196n83672j26060M10907j63207
13994B602838J75018k81224L96080j84613k18325K66377j24453m14524J77590
13985B394764J02065l75292L28968j59080K04181L03909J53000M06363P5879N30789
13975C965546N99416K270889L178114N243408R381121R243475j0008877q268533
13967A5604559n037136k518930j635961j221911k39325n31481n13453j45737m63703
13958C296922K7798k30112O8802m7622m01426J30265n48744N17655j92637l54618
$$ y = [3680075, 3393334, 3212768, 3449504, 3232299, 3324645, 3539124, 3267075, 3375291, 3449818, 3563281, 3315174, 2903406, 3390463, 3537226, 2992706, 2923720, 3126286, 2791677, 3025792, 2988231, 2701972, 2721341, 2673531, 2669875, 2895674, 3064870, 2481198, 2355138, 2766045, 2602838, 2777856, 2496632, 2892712, 2708099, 2489774, 2756151, 2631698, 2217174, 2394764, 2496829, 2121537, 2450505, 2291425, 2495606, 2799515, 2952515, 3358878, 3434757, 3965546, 4564962, 6835851, 10013965, 15257373, 24638494, 33881969, 23873092, 15604559, 10567423, 8048493, 6412532, 5190621, 4951296, 4419815, 3906362, 3760625, 3296922, 3324720, 3094608, 3163410, 3115788, 2714362, 2844627, 2295883, 2813538, 2620901, 2266283]
13948B266283J72423j49213L5708j95952j11572K03587k30342O5107R7784o6254
13938B087559J43560m32273M72275k17619J85468p4287P0221l8490k89468K85024
13928B191970k35660l43280J22178L24453k79948K80282L298k36452j27508K4421
13918A723754K60041k3651j28246l96995K19085j47105J20028M43450l34789j9834
13908A715738k170j85138J90328k0269J2667j48701J38446l60809K42220j30565
13898A451747K84748l54956j6317K85947j62139N9197j05076K34510l76339L18345
13888A619667j55825K31578o67673M89424p5752L2883n3871J79678n821l49036
13878A245252L61137o3951j65014n6429P2128l2313K40730k47916J9109Q4781
$$ y = [2266283, 2438706, 2289493, 2325201, 2129249, 2017677, 2221264, 1990922, 2056029, 2153813, 2087559, 2231119, 1798846, 2271121, 2053502, 2238970, 2164683, 2234904, 2196414, 1906946, 2191970, 1956310, 1613030, 1735208, 2059661, 1779713, 2059995, 2063293, 1826841, 1699333, 1723754, 1983795, 1960144, 1831898, 1434903, 1653988, 1506883, 1626911, 2070361, 1735572, 1715738, 1713568, 1528430, 1718758, 1698489, 1711156, 1562455, 1700901, 1340092, 1582312, 1451747, 1736495, 1381539, 1365222, 1651169, 1489030, 1548227, 1443151, 1677661, 1301322, 1619667, 1463842, 1695420, 1027747, 1517171, 1441419, 1474302, 1420431, 1600109, 1594288, 1245252, 1606389, 1542438, 1377424, 1320995, 1393123, 1360810, 1601540, 1353624, 1372733, 1457514]
13868A457514J11006k72658j67417L04402j83460n2207j23798L87324j0363j72039
13858A278304l13827O01162o12956K01819J83829M9416k34383l7634k7211q0171
13848A008348K12513l2106J1638P8772j20909q2168p5700J68638J13858j56451
13838A126433m45009R1278J68422K17180p2984j9034k14383K03926l3724j48035
13828H74070O39794n52616p7487n1411L32526l1643o7606m3363p1869K09219k54898
13817I04716J17158l57226M22485j62733r5785K85356m06107M55713m09652K20693
13807I74618O8760J23097j90773j50182J18253M258k01471p9576L24477m56961
13797E34500L71983O1522k85686L09424K43626j28077l96739J68393r4754J98690
$$ y = [1457514, 1568520, 1295862, 1128445, 1432847, 1249387, 1197180, 1073382, 1460706, 1450343, 1278304, 964477, 1565639, 952683, 1154502, 1338331, 1387747, 1153364, 1115730, 1088519, 1008348, 1220861, 1188755, 1200393, 1279165, 1158256, 1076088, 1000388, 1169026, 1282884, 1126433, 681424, 772702, 941124, 1158304, 1085320, 1066286, 851903, 1055829, 1022105, 874070, 1513864, 961248, 883761, 832350, 1164876, 1133233, 1065627, 1022264, 950395, 1159614, 904716, 1021874, 664648, 1087133, 924400, 828615, 1113971, 707864, 1163577, 753925, 974618, 1043378, 1166475, 975702, 825520, 943773, 948031, 746560, 666984, 991461, 534500, 906483, 968005, 682319, 991743, 1235369, 1107292, 710553, 878946, 784192, 982882]
13787I82882J2002j08140j03827q7372M96570n17000J80655j50575j29673L9753
13777F15275K1906R0345j72750M02470j72650k9118J70059k71248N5980q8560
13767F21709K4318L64063q6942k60120J73249k69864J5422M82012k29682j9593
13757H14572K15421j71557j60657R0766K0789O4567l87963M80532k34382j32414
13747E99674L8625K42478o5207k80531M21607j39668j09929k81883K12091N2145
13737F89402j54281K59156l83523J83745Q2492o8587O9070B66914M97320o5423
13727F98811k57781L83549B75426O81666C74198L59160j47086K85389n2165j37049
13717F82447k10821K81762R918K29691l99609K5816K16297j30384j83576j38729
$$ y = [982882, 994884, 886744, 782917, 695545, 1192115, 675115, 855770, 705195, 575522, 615275, 637181, 727526, 554776, 957246, 784596, 755478, 925537, 654289, 710269, 621709, 646027, 1010090, 923148, 663028, 836277, 566413, 581835, 1063847, 834165, 814572, 1029993, 858436, 697779, 788545, 809334, 873901, 485938, 966470, 732088, 599674, 638299, 880777, 815570, 535039, 956646, 816978, 707049, 425166, 637257, 689402, 535121, 794277, 410754, 594499, 676991, 608404, 677474, 266914, 764234, 698811, 441030, 824579, 275426, 957092, 374198, 733358, 586272, 871661, 819496, 682447, 471626, 753388, 763306, 992997, 593388, 619204, 835501, 705117, 521541, 382812]
13707C82812j3823M3873L83001k54249J61632Q2012J07117C64063L62664j9259
13697G07468K9282k03896J41329l23543K63922P2845k99300O3519p4526r898J60592
13686E27794M2743j15984K17648N0871j09691Q7230j15708q8766P772N89J98673
13675G03171k7952j89958N0493A49225N23239Q5524k67926J75234j87589K95281
13665G72988l23971o8183L7386r8988K43650j11545K10640j60496m8691j07564
13655C45226L17826j25225J3848O1550j99421M26709j90425o3498k71644K31286
13645E46232j53630r5212J05007J65531k07391J10570N6169j23647O4318L0658
13635D98605k19165K23571r9019l1050L5830K72817j40046j73835L8796A29842
$$ y = [382812, 368989, 412862, 795863, 541614, 703246, 785258, 892375, 364063, 726727, 707468, 736750, 532854, 674183, 350640, 614562, 687407, 388107, 451626, 377100, 367202, 527794, 570537, 454553, 672201, 723072, 613381, 700611, 584903, 496137, 503909, 504498, 703171, 675219, 485261, 535754, 149225, 672464, 757988, 490062, 665296, 477707, 772988, 449017, 380834, 418220, 319232, 562882, 451337, 661977, 501481, 452790, 345226, 663052, 537827, 551675, 613225, 413804, 840513, 650088, 586590, 314946, 546232, 392602, 297390, 402397, 567928, 360537, 471107, 527276, 403629, 467947, 498605, 279440, 503011, 403992, 372942, 408772, 681589, 541543, 367708, 406504, 129842]
13624B67929K81455r0222A30263J73027J88941q6152j50138N54873A92870J53164
13614C46034J89893K13639j99642j57423M04739j81482Q3599q268B61093N1741
13604C12834K0095j5239A01877N87460B32479j6082J04399O2803K5764n4986o6614
13593B87763r4507L43275q2821j08420K0039K28367k6132k62126K0951J55581
13583D81970l6212K280n3657r5135q3542N0386r0847k3770o8995N39127k55674
13572C65931J41331L9085l6192j382j26563K5931K9475k06356k3820J49230L8391
13561C95061j79276J50088R0363j66137C0742M12024m9096j14891J35616n5237
13551C59158C5332J75433L26936e0155E19301j87583F5532M18589j51637A32868
$$ y = [267929, 549384, 459162, 130263, 303290, 492231, 406079, 255941, 810814, 192870, 346034, 535927, 749566, 549924, 392501, 797240, 615758, 699357, 691089, 261093, 312834, 332929, 317690, 101877, 689337, 232479, 216397, 320796, 383599, 409363, 354377, 287763, 193256, 536531, 453710, 345290, 365329, 593696, 567564, 305438, 326389, 481970, 445758, 448038, 394381, 299246, 215704, 266090, 175243, 151473, 82478, 621605, 365931, 507262, 546347, 510155, 508773, 382210, 408141, 437616, 231260, 207440, 356670, 395061, 215785, 365873, 456236, 290099, 30742, 442766, 393670, 278779, 414395, 359158, 35332, 210765, 537701, -50155, 519301, 331718, 65532, 484121, 332484, 132868]
13540A68126J7389C3536K74141m6870n5023K16018L0491J2708J08612A72477e6879
13528D46026G4750J88811q9791k0497J81885J60618k41897P4340j2034A57133
13517A06773k2165J77651j4126m7580k1885K02413J4803j32075J25184r0288N4500
13506C53205j23684J15527L5841n782L39881B01882N3188L55483l01442J09905
13496D19016j12132A39606D5711M16594K1973l7936q4939K1612C0124a96A92017
13484D03569A8394K35036m8109K89299j52289J0665F8276M22014J29988B34609
13473b28389C72768O5398L1725m9734B3427J66172P1522R294k299R3719J02915
13462D64750r6934q8189r1552O0915R3214h3892C31730A25310Q4809K24058j58353
$$ y = [168126, 185515, 33536, 307677, 260807, 205784, 421802, 452293, 465001, 573613, 172477, -56879, 446026, 74750, 263561, 173770, 153273, 335158, 495776, 253879, 328219, 316185, 157133, 106773, 84608, 262259, 248133, 200553, 178668, 381081, 395884, 263809, 388993, 298705, 353205, 229521, 345048, 380889, 375107, 714988, 201882, 255070, 610553, 309111, 419016, 306884, 139606, 45711, 462305, 484278, 446342, 361403, 383015, 30124, -196, 192017, 403569, 18394, 253430, 205321, 494620, 342331, 352996, 68276, 490290, 620278, 234609, -228389, 372768, 438166, 469891, 420157, 23427, 189599, 261121, 270415, 268116, 361835, 464750, 367816, 279627, 188075, 248990, 342204, -83892, 331730, 125310, 210119, 434177, 275824]
13451B75824p7894p5082M05906B29008r2593J54913J48939r2627j5162A02060
13440C65205A70879p0322K70842j49222N3551J19333j29110r3181P1606k6377
13430B17999A04532C0434J21616R0666G6334K34724j32292l7581N0932J97879
13420C89996H5671b2682A58467M20232q5369E6314K15331n1151A7093J00466K6323
13409A43882K34431j81976a39512E02957k32268K5479J05869j47703j5997H8747
13398B36033M9831O2116a08616D5994P8191K1996K69347j73567O1990o8577B5082
13386A20937a04441B86343b4151A86825b65919D54215b1381A26616L14896k15359
13376B26153o8484K17194A1978c04559i5282B41245O0642E9304J67868O8681i017
$$ y = [275824, 197930, 122848, 528754, 229008, 136415, 291328, 440267, 347640, 332478, 102060, 365205, 170879, 100557, 371399, 222177, 275728, 395061, 265951, 172770, 244376, 217999, 104532, 30434, 152050, 242716, 76334, 311058, 178766, 141185, 192117, 389996, 85671, -22682, 158467, 578699, 493330, 56314, 271645, 220494, 17093, 117559, 143882, 378313, 196337, -139512, 502957, 270689, 296168, 402037, 254334, 238337, 88747, 236033, 285864, 347980, -108616, 45994, 124185, 146181, 415528, 241961, 303951, 235374, 25082, 120937, -104441, 286343, -24151, 186825, -265919, 454215, -21381, 126616, 441512, 226153, 157669, 374863, 11978, -304559, -95282, 241245, 301887, 59304, 227172, 295853, -9017]
13364B92772P1895L1561A37290J74916a48273B01993a46178H4643L09663j11018
13354B83288J82797E5573K8805P810J43713j15361K22908G9867a12330i753B36219
13342C11782j06416j4262a40013B15727E4414J50070e5449C61328j0614A52485
13331B41861p1196M69518k63232A39094J2801N2857L3125m0641J66120j74262
13321A89094J47539L8431A31409L48682k35688Q2271k4676l8427b1177G9555L90739
13310D70294A67071C9384M7448K269K35467E1613L48537A01641J33044p2891J72140
13299C33934K90114b33232J11516E18913A20051J23917a2994A84488C813L14570
13289C18383j11704A0479K6837K02288k0639m6835c6365F0396K27824m9280N9009
$$ y = [292772, 364667, 396228, 137290, 312206, -148273, 201993, -146178, 84643, 394306, 283288, 466085, 55573, 84378, 92188, 235901, 120540, 343448, 79867, -112330, -9753, 236219, 311782, 205366, 191104, -140013, 215727, 54414, 204484, -55449, 361328, 350714, 152485, 241861, 170665, 640183, 376951, 139094, 151895, 204752, 237877, 197236, 363356, 189094, 336633, 375064, 131409, 480091, 244403, 326674, 301998, 263571, -21177, 79555, 470294, 167071, 39384, 86832, 89101, 324568, 51613, 400150, 101641, 234685, 161794, 333934, 624048, -233232, -121716, 518913, 120051, 243968, -12994, 184488, 3813, 318383, 206679, 10479, 37316, 239604, 218965, 172130, -36365, 60396, 288220, 238940, 297949]
13278B97949d7450B36354l1232M0545j22416K22594b51504A47265m0363J81547
13268B88449c3235p9959A97997K36180h5441C2647b6208D3883f6196A73826n5301
13257A18525J97404p7268J47300F915M9399A3366R5844K7940n2194d0903A26151
13245B12386c3444D2248a36505p212b9800C5440J34216b2983G5047g0113H3534
13233g1817A10176J73308m7502q3533a56005D33406a41436e7772A4238a5252B60273
13221B73725q3722Q9177k9079D363a56281d5738J9711H4198N8686K33195b920
13209a7249A34167J84529r4297a4174B62886e7350a5272A22622J71005m5507J33814
13198C81934p6401p0094j03089J82677A4455L1137a0293H4868j1815A7773L55809
$$ y = [297949, -47450, 236354, 205122, 245667, 123251, 345845, -251504, 147265, 106902, 288449, -33235, -113194, 197997, 434177, -85441, 32647, -26208, 43883, -66196, 173826, 118525, 315929, 238661, 385961, 6915, 56314, 13366, 109210, 137150, 84956, -40903, 126151, 212386, -33444, 42248, -136505, -143717, -29800, 35440, 169656, -22983, 75047, -70113, 83534, -71817, 110176, 283484, 235982, 152449, -156005, 433406, -141436, -57772, 14238, -15252, 260273, 273725, 190003, 279180, 250101, 4363, -156281, -45738, -26027, 84198, 142884, 376079, -2920, -17249, 134167, 318696, 224399, -14174, 262886, -57350, -15272, 122622, 293627, 248120, 381934, 305533, 235439, 132350, 315027, 14455, 45592, -10293, 84868, 73053, 17773, 373582]
13187C73582d4801A7086a64423I8417L11711H6623g7098H3113O1680K82263k04269
13176B22787b74105h3181D6264b5723j1522B11275a02992A45966E7946K63090
13166C21036a62596A82968O4656q0898e2907B80046K7791I4993K7976a42997I7819
13154C95700j89333c6746C96522l213G2846J71950M27946a18481A48491J94252
13144C42743j5843C9767H015a86287D7338g5584r7439F8642a24232D5855a55985
13132B15565A3643c4415C48115A40269J61522a4903A66997b1309G45005l13349
13122D31656I7028c9615C7982Q2704c46566J37728F6395k2254b48972j10620h8898
13110b5802A36744N4645K82695j89536A37170J80333a90768C85331A52659a58027
$$ y = [373582, -44801, 17086, -164423, 98417, 410128, 86623, -77098, 83113, 144793, 427056, 222787, -274105, -83181, 46264, -25723, -37245, 211275, -102992, 145966, 57946, 321036, -162596, 182968, 247624, 166726, -52907, 280046, 307837, 94993, 122969, -142997, 97819, 395700, 206367, -36746, 396522, 393309, 72846, 244796, 672742, -118481, 148491, 342743, 326900, 39767, 8015, -186287, 47338, -75584, -173023, 68642, -124232, 45855, -155985, 215565, 13643, -34415, 348115, 140269, 301791, -14903, 166997, -21309, 745005, 431656, 97028, -39615, 37982, 120686, -346566, -208838, 66395, 44141, -248972, -359592, -88898, -25802, 136744, 191389, 474084, 284548, 137170, 317503, -190768, 385331, 152659, -158027]
13099B53040r7299B7985j0044J07634f4028K0749a2643B16829a16910a8566B54331
13087e4027A44013l3020J27152h2016r7880M4225A41809J0979a01976A24907a52289
13075B03969D1523c8807A90051b7083C74969A06690A9028a00520A63299b89684
13064A29421E5114g4514A28732J32950j28574O052m6738J26550F6438M2517J7758
13053A26713b09099i4989a2411l7333B95260H6739J80335h1550A22606K79958
13043D02564B5899J98750D4006Q6465a61623A45899o4389O7589P768K15703f8762
13031A17770J07689B7691J23848m0451k5673L3111J87014g7414p9705C55118a26046
13019d1293H6835R5488h0483j89187E1723L81073A28440K41098A05213M470J6630
$$ y = [253040, 155741, 27985, 17941, 125575, -64028, -43279, -12643, 216829, -116910, -18566, 254331, -54027, 144013, 110993, 238145, -82016, -179896, -135671, 141809, 152788, -101976, 124907, -152289, 203969, 41523, -38807, 190051, -27083, 374969, 106690, 19028, -100520, 163299, -289684, 129421, 55114, -74514, 128732, 261682, 133108, 139160, 92422, 218972, 66438, 108955, 126713, -209099, -94989, -12411, -49744, 295260, 86739, 267074, -81550, 122606, 402564, 25899, 224649, 44006, 130471, -161623, 145899, 81510, 149099, 156867, 372570, -68762, 117770, 225459, 27691, 151539, 111088, 85415, 118526, 305540, -77414, -157119, 355118, -126046, -41293, 86835, 182323, -80483, -269670, 51723, 432796, 128440, 369538, 105213, 109683, 126313]
13008A26313n6613N54106B30791e4924k8616I7323i3147j01629B63720a29787
12997A95791a48838M0872A59604a65580B9022a62049A62769b14637I3766d8873
12986A98081o5908c5693q0397A83794H9398J60536A11596J48896j14337J90566
12976C36721a24924H3412b68770A23075a90121C63513f8154J5981A49771O8374
12966B18145h6365A88470J43938H879K82084q8751c2537k4486A26463a22229E8794
12954B39778c3911r34B2426N1217J60546b88741b4545j02125O0988A63807o7808
12943I5999J59782l4652K37733a21509N9296B30265a98225F8156O1000d0946o1156
12932a02102D9409B1299J29300a66957A92975D0516A8163Q2300j9363K64828a91023
$$ y = [126313, 69700, 623806, 230791, -54924, -83540, 97323, -93147, -194776, 263720, -129787, 195791, -148838, -107966, 159604, -165580, 29022, -162049, 162769, -214637, 93766, -48873, 198081, 132173, -35693, -116090, 183794, 89398, 249934, 111596, 260492, 146155, 336721, -124924, 83412, -268770, 123075, -190121, 363513, -68154, -52173, 149771, 218145, -86365, 188470, 332408, 8879, 290963, 202212, -32537, -57023, 126463, -122229, 58794, 239778, -33911, -34845, 22426, 73643, 234189, -288741, -24545, -126670, -65682, 163807, 95999, 255781, 221129, 458862, -121509, -62213, 230265, -198225, 68156, 129156, -40946, -102102, 49409, 21299, 150599, -166957, 192975, 40516, 18163, 100463, 81100, 345928, -191023]
12920a8593e998j17174K5384m4153b2803l2501l58936a47128B01889b89749J6567
12909b73182B97207B7400a89824g2684A00507e4239E9095a19951b6522r5489j51302
12898b73313N1701A54720A0703b0450A07701J68032a02035E0918a02698a6940
12887A90067H901N4082d3177C0709h3210o6372j50011C6659o259J42394d4988
12875a63179A38650a09157l7698I7551J30550I4663c79396b367B66008H9281a05316
12863a43275A70608O3174d6101e462A06917a70344G3995J74073a45207A88843
12852A30326b1127B2422M4147b54523H8666R4679Q9855j354b9479B47919a03206
12840A95582k2695E2839Q2802K84069A78651a76312A74233n018K9557A3996J07708
$$ y = [-18593, -5998, -123172, -97788, -141941, -22803, -55304, -414240, -147128, 201889, -289749, -273182, 297207, 27400, -189824, -72684, 100507, -54239, 59095, -119951, -26522, -122011, -273313, -221612, 154720, 10703, -20450, 107701, 275733, -102035, 50918, -102698, -16940, 190067, 8901, 62983, -43177, 30709, -83210, -149582, -299593, 36659, 30400, 172794, -44988, -163179, 138650, -109157, -146855, 97551, 228101, 94663, -379396, -2367, 266008, 89281, -105316, -143275, 170608, 233782, -46101, -5462, 106917, -170344, 73995, 248068, -145207, 188843, 130326, -21127, 22422, 66569, -254523, 88666, 183345, 273200, 271846, -29479, 247919, -103206, 195582, 172887, 52839, 135641, 419710, 178651, -176312, 174233, 169215, 198772, 13996, 121704]
12829A21704a32241B9440O5077L2150a57965a5498D047J37083d5970A22994d4518
12817A97023a36521p6354A92039a19974c1862A45664c64831Q8386B45549j18922
12807A26627n2030a95683P5902A75399l4221c71779A66386k6070m9004a23254
12796F593a50932N6561C2630P5536d4442D9611N0549a42195j10097C0022J48547
12785A78569e377A5335R0510J64854d6375j18378C59980g2445A04434L31523A21751
12773a08380j4095r652q0882j83833B58018g9510L0084B42609k568c36095B06051
12761i5505a4967I0575d5866l5059A19016n88a11023B54056C9814a92186c0693
12749c32800B7668a39843k55428a09833o2537C57387j05355D8286P0957K97309
$$ y = [121704, -132241, 29440, 94517, 126667, -157965, -15498, 4047, 141130, -45970, 122994, -44518, 197023, -136521, -212875, 192039, -119974, -31862, 145664, -364831, -276445, 245549, 126627, 74597, -195683, -119781, 175399, 141178, -371779, 166386, 140316, 91312, -123254, 6593, -150932, -94371, 32630, 108166, -44442, 49611, 100160, -142195, -252292, 30022, 178569, -5377, 15335, 105845, 270699, -46375, -164753, 359980, -72445, 104434, 435957, 121751, -108380, -122475, -132127, -213009, -396842, 258018, -79510, -49426, 242609, 240041, -336095, 206051, -95505, -14967, 90575, -45866, -80925, 119016, 118428, -111023, 254056, 39814, -192186, -30693, -332800, 27668, -139843, -395271, -109833, -172370, 357387, 252032, 48286, 119243, 416552]
12739D16552E6683e3270l05617a44570q8878i0714b2934j58195A8921a06756c5792
12727a52811J382A52774b8192k23777O388Q193d9478r4093F0299b11852A11170
12715a47109C46306j11850d4250j46632c5064A2166a80299p8034a4459B25215
12704A15742m2048R2073B5009a78150K6789M2260a0915j07421B06328F7208M1479
12693A08687O4783b9967B43267L7247E1014A1978L29174a84165B8047P5081N3082
12682A56210J84101A00890a6687l0849o9533C1073M7140d3266G6338D171Q1609
12671H5780D1895J16165A8881L22302b72973B05903a18762B33572A9467K85784
12661C05251A10455L3305b23932A54742P6444h2643b9634g132o4303c5401A47173
$$ y = [416552, 56683, -53270, -358887, -144570, -233448, -90714, -22934, -181129, 18921, -106756, -35792, -152811, -151429, 152774, -28192, -251969, -245581, -237388, -49478, -143571, 60299, -211852, 111170, -147109, 346306, 234456, -44250, -190882, -35064, 12166, -180299, -258333, -14459, 225215, 115742, 73694, 165767, 25009, -178150, -151361, -109101, -10915, -118336, 206328, 67208, 108687, 173470, -29967, 243267, 280514, 51014, 11978, 341152, -184165, 28047, 103128, 156210, 340311, 100890, -16687, -47536, -117069, 31073, 78213, -43266, 76338, 4171, 85780, 41895, 158060, 18881, 341183, -272973, 205903, -118762, 233572, 19467, 305251, 110455, 143760, -223932, 154742, 231186, -82643, -29634, -7132, -71435, -35401, 147173]
12649h3773d0617A43232b48764g6065A58282o3579c28224B32012i4168G0898a54931
12637B00152O1000b64431A62862R7517M1722q7243k6760e0204k48953o8212A91220
12625A70168a82713h4840k25546P1123A15902k570D2278J19368C3746J02406j4855
12614A21297J04216A01896J49496a91986g6061B41068j13911J42428A13535m0384
12604G3151J32684q6738a17155b0076A60430e8822j01185N1142b1446O952A45479
12592A99884q5546J6738K75537a66319N7926q8409B49165A13201a41967A42704
12581F7465e1838B30693M037I8012J49724G6338K14439d53784b15713H1221e2767
12569a43266J2053M1351G5424O3546b62408A01043c86957A83934J24476J9923
$$ y = [-83773, -40617, 143232, -248764, -76065, 158282, 94703, -328224, 232012, -94168, 70898, -154931, 200152, 261152, -264431, 162862, 260379, 302101, 214858, 188098, -50204, -299157, -367369, 191220, 170168, -182713, -84840, -310386, -239263, 115902, 113332, 42278, 161646, 33746, 136152, 121297, 225513, 101896, 251392, -191986, -76061, 241068, 127157, 269585, 113535, 73151, 205835, 119097, -117155, -20076, 160430, -58822, -160007, -108865, -21446, -14494, 145479, 199884, 114338, 131076, 406613, -166319, -108393, -196802, 249165, 113201, -141967, 142704, 67465, -51838, 230693, 234730, 98012, 247736, 76338, 290777, -453784, -215713, 81221, -52767, -143266, -131213, -89862, 75424, 138970, -262408, 101043, -386957, 183934, 308410, 328333]
12559C28333A36283k0085C1618Q0580f6045K5222A6798J09905E3874K47252c1119
12547h2072A52357K21777j49341d441m47406b16409a4930A46070m1759K5939L9928
12536A70178J91246a22108d1315Q710E7156b32906A55381a61782B68554a63213
12525i9424b164k24388C53587b57571L7657M2851A40492l4917L0522c6148A44053
12513A71725c26850M5505a27043M9664k00274q6671R9133b7581l6627c0970C66805
12501g8534j13653A30903i7229r7851B7030h0716B37297b15449d2089a9239j59559
12490a78798A85348a13987J6454L0367A35662c2599A79797a03154d1379r56o4033
12479a06368c4320j91476a9577H6431e7698j11266G909c09578d6909p1395a7816
$$ y = [328333, 136283, 116198, 31618, 112198, -66045, -40823, 16798, 126703, 53874, 301126, -31119, -82072, 152357, 374134, 224793, -4441, -451847, -216409, -14930, 146070, 104311, 130250, 170178, 361424, -122108, -41315, -32605, 57156, -232906, 155381, -161782, 268554, -163213, -99424, -2164, -226552, 353587, -257571, -219914, -177063, 140492, 105575, 136097, -36148, 144053, 171725, -326850, -281345, -127043, -77379, -277653, -364324, -265191, -27581, -64208, -30970, 366805, -78534, -192187, 130903, -97229, -195080, 27030, -80716, 237297, -215449, -42089, -19239, -178798, 185348, -113987, -97533, -67166, 135662, -32599, 179797, -103154, -41379, -42335, -106368, -34320, -225796, -19577, 86431, -57698, -168964, 7909, -309578, -46909, -118304, -17816]
12467B32132b29887A5035K19323D0513a49198a9579A68591D2812K25730q3831
12457A84711a00625K1561h74C3292a82366B33992b78326a09600A34968k8457a91128
12445G9700l2456c21733A24897a76441g4248B74156a10200r2899B3432f1831j80074
12434b41905A29982D8952J75533H8704K30384a90528G6285i0833E8476L8553J0039
12423A07068B9151J73274g1680A9367a50018p0321F5673J13115B8553f4457A7859
12411A39753b8515j16389J1362e9386j60880B31839b29820i8256r8736L5952k179
12400a63219A43032M8951G2119g9212C26333a58688q0315H6528e8702j5493l8607
12389a12802B41462H1211J40323J3019M7852d437C04427j30502O9310g3762G463
$$ y = [232132, -229887, 15035, 234358, 40513, -149198, -19579, 168591, 42812, 268542, 184711, -100625, -79064, -874, 33292, -182366, 233992, -278326, -109600, 134968, 106511, -191128, 79700, 47244, -321733, 124897, -176441, -74248, 274156, -110200, -203099, 23432, -61831, -241905, 129982, 48952, 224485, 88704, 319088, -190528, 76285, -90833, 58476, 97029, 107068, 29151, 202425, -71680, 19367, -150018, -220339, 65673, 178788, 28553, -64457, 17859, 139753, -28515, -144904, -133542, -59386, -220266, 231839, -229820, -98256, -196992, -161040, -163219, 143032, 191983, 72119, -79212, 326333, -158688, -239003, 86528, -58702, -74195, -112802, 241462, 81211, 221534, 234553, 282405, -4437, 304427, 173925, 243235, -73762, 7463]
12377b6122B8839i0963A5792K19763j15215a30783E1771c97265D559b02243C49014
12365B76967a01937A66598d09618D21768j20503E8214b5094j47280B27489A10728
12354B4002J58334C2896L6901K21087A36118J56042A44253j6294b1233A49215
12343a1634o3268C51096B1820J64270j8723c11288B59131e6353A89883j8976D0746
12331a8176j71024B5671a72988j34323c212A23025P4268q6764b70998a9332A77380
12319A99459a39418b1691A79172B8155J06249A6924K81237F540g9796A79826H2966
12307B07445C4515M03117B16479k8362R0131n1681K3343L2556N763E8200D992
12295C41026j52649F1096a14224H809L16041g9001A97583b94934H0758N7809J9353
$$ y = [-26122, 28839, -90963, 15792, 235555, 120340, -130783, 51771, -397265, 4559, -202243, 349014, 276967, -101937, 166598, -409618, 421768, 301265, 58214, -25094, -172374, 227489, 110728, 24002, 182336, 32896, 69797, 290884, 136118, 292160, 144253, 127959, -21233, 149215, -11634, -74902, 351096, 21820, 186090, 167367, -311288, 259131, -56353, 189883, 170907, 40746, -18176, -189200, 25671, -172988, -307311, -3212, 123025, 197293, 110529, -270998, -19332, 177380, 199459, -139418, -21691, 179172, 28155, 134404, 16924, 298161, 6540, -79796, 179826, 82966, 207445, 34515, 437632, 216479, 188117, 278248, 226567, 249910, 282466, 288229, 58200, 4992, 341026, 188377, 61096, -114224, 8809, 324850, -79001, 197583, -294934, 80758, 138567, 157920]
12284A57920Q1451j04034E4555M10761I40J47975E9896c11810C9835q052R6784
12273A28567E4806a1351o6225A99414r8466b08303Q5358D34630o4584m6468A01209
12261A81223n0030F0059b65657E0321b741B97161A37594i6524B57835a91837A84826
12249C07435a99026C43649a89046A27760d6363B29083E1818f1248B04009A9535
12238A01750P4571p8196i9641A53153n9593c0831l3458J5283A38744J51998D884
12226D7764e3582J1752K0248J0783A0876e2273I2891J31651E7496R3057d504j55688
12214a60192p9046A66772O5933p0233J82489N4607F0792J02893C8862K75L18384
12203C57521j11743G9801K43388A09568j4013d7167B39908H7113b06922E20813
$$ y = [157920, 239371, 135337, 54555, 465316, 940, 148915, 59896, -311810, 39835, 31783, 128567, 54806, -11351, -77576, 199414, 100948, -208303, -122945, 434630, 370046, 323578, 101209, 181223, 131193, 60059, -265657, 50321, -2741, 297161, 137594, -96524, 257835, -191837, 184826, 307435, -199026, 343649, -189046, 127760, -46363, 229083, 51818, -61248, 204009, 19535, 101750, 176321, 98125, -99641, 153153, 93560, -30831, -64289, -49006, 138744, 290742, 4884, 47764, -53582, -41830, -21582, -10799, 10876, -52273, 92891, 224542, 57496, 150553, -4504, -160192, -239238, 166772, 232705, 162472, 344961, 399568, 60792, 163685, 38862, 39137, 357521, 245778, 79801, 323189, 109568, 95555, -47167, 239908, 87113, -206922, 520813]
12192C46952e824A37734E9119n775K12312E4726e8872B57919p6335K0227a9066
12180G5971K95430q5417a1572B21175K04687j7958j05078A11699N1792P7296b22669
12168A51930O4133b39276A41179Q7767o2453B2731m240M27553a55202B5429K78880
12157C04309a16650B22230O249b50107E8503j6178g665A96071K56383L0949c6183
12145I5271J35054G6110A008L47977H8811K89115j15131a10567K2215B66633c2600
12133D7809e9049j07415H2401a63528K6187a3731r30l71506A5424a11433A55748
12121B38623F6652a15604B78179Q467e4723j30944G2022L48713f8179i482j76080
12110a85562A80607Q939a53607B28669J20723D2388R145K04907j17186j5299R2117
$$ y = [346952, -5824, 137734, 59119, 53344, 265656, 54726, -58872, 257919, 181584, 201811, -19066, 75971, 371401, 285984, -11572, 221175, 425862, 407904, 302826, 111699, 163491, 240787, -222669, 151930, 216063, -239276, 141179, 228946, 166493, 22731, 18491, 446044, -155202, 25429, 304309, -116650, 222230, 228479, -250107, 58503, 42325, -7665, 196071, 452454, 483403, -36183, 95271, 230325, 76110, 1008, 348985, 88811, 377926, 262795, -110567, -88352, 266633, -32600, 47809, -59049, -166464, 82401, -163528, -137341, -13731, -14661, -386167, 15424, -111433, 155748, 238623, 66652, -115604, 278179, 286646, -54723, -185667, 72022, 420735, -68179, -9482, -185562, 180607, 189546, -153607, 228669, 349392, 42388, 51533, 256440, 139254, 123955, 216072]
12099B16072D2048J61464M5404f2768A90256e544j18775A95849J02508a30496
12088G2600L8215K0478o940J23831p8470C5615P7840j5195A8638J11308c8071
12076b06939H923O8702d3459A29635d1995a3761B17052A05188a55999A88950b58467
12064B06920D3824J41058a68048C08658C6011K60369A24167J47761j34766M1131
12054A78293G6077F552K17032L7482A17061C6221e82A28904Q9307h4055j09985
12043a94040K8414E2985b49613D22656a04646B920J98909a42A15523a0886C59412
12031H7460H934g437C7005J89559a48606B81442m5417d6816B0080J54714b11683
12019F9539b6747j55236D2030b30256h6581I948J9092Q2746c4491l1138B9903
$$ y = [216072, 42048, 203512, 248916, -62768, 190256, -5544, -124319, 195849, 298357, -130496, 72600, 110815, 131293, 124353, 248184, 169714, 35615, 113455, 98260, 18638, 129946, -38071, -206939, 8923, 77625, -43459, 129635, -41995, -13761, 217052, 105188, -155999, 188950, -258467, 206920, 43824, 184882, -168048, 308658, 36011, 296380, 124167, 271928, 137162, 178293, 76077, 6552, 223584, 261066, 117061, 36221, -582, 128904, 218211, -84055, -194040, -165626, 52985, -249613, 422656, -104646, 2920, 201829, -142, 115523, -10886, 359412, 87460, 8934, -7437, 37005, 226564, -148606, 281442, 236025, -46816, 20080, 174794, -211683, 69539, -26747, -181983, 42030, -230256, -86581, 9948, 29040, 111786, -34491, -65629, 29903]
12007b22686B51056N2747i857C02978f369k02004I5144g5708B70786a63886G3341
11995I9509m8412J06864a0382C36075a30793j71270B4999Q9962q350a64867D3429
11983d1757m3555p6002I8713a49184C03916B0741D944N5781a68485P3539o8337
11972a63283k15071B19966o7880b69324B31304G3923l2207h4520d1475k52752
11962b94227J13460O8334B2218h0514A11593b3864j27628C3127c3259D35437e2885
11950B7049K17455r2228a24080j63513j33773I0670i8822c8112k0725E3794g5045
11938H9699J25504I195P8372a73026b189j14306A893K85443b3516k35834G2810
11926h1637l5374D1904a88009o2266A87312a98917B14540g5834p3112A8994a48566
$$ y = [-222686, 251056, 303803, -9857, 302978, -6369, -208373, 95144, -75708, 270786, -163886, 73341, 99509, 51097, 157961, -10382, 336075, -130793, -302063, 24999, 114961, 106611, -164867, 43429, -41757, -85312, -161314, 98713, -149184, 303916, 20741, 4944, 60725, -168485, -94946, -163283, -378354, 219966, 152086, -269324, 231304, 73923, 41716, -84520, -41475, -294227, -180767, -112433, 22218, -80514, 111593, -23864, -151492, 33127, -33259, 435437, -52885, 27049, 244504, 152276, -124080, -287593, -421366, 90670, -98822, -38112, -58837, 53794, -75045, 89699, 215203, 9195, 87567, -173026, -2189, -116495, 1893, 287336, -23516, -259350, 72810, -81637, -117011, 41904, -188009, -250275, 187312, -198917, 214540, -75834, -148946, 18994, -148566]
11914A47345k7263b40100A29939b08085A84614p9580h98k12662O4655a6034A47698
11902i3139I1588c8851j78868A99739p6207a68776M7031H785h4392C8985J1557
11891E0542m059J96978b08916D67174a89033g054k04075i5510j46829e1054q2230
11880a33284B54346a43408l28B2022a47476N4289j40007C1219p811a89297i823
11868f4463A2760i0903F8829b37453A62011b24850a00392A28366a57037j5977
11858a73014N701M976P4312o6977l6659H0908g8630F9282k9646J1491j423h1573
11845a75943K4652b9009q9682l549e4789o299A78157a47037f9420F4026e9371
11833C8457d05120J84652P8672c7898A74987n2566f3787A36072n9880k2611b46303
$$ y = [147345, 120082, -240100, 129939, -208085, 184614, 105034, -898, -213560, -148905, -16034, 147698, -93139, 91588, -38851, -217719, 199739, 123532, -168776, -121745, 8785, -84392, 38985, 50542, 46483, 243461, -208916, 467174, -189033, -7054, -211129, -95510, -242339, -51054, -133284, 254346, -143408, -143736, 22022, -147476, -93187, -233194, 31219, 23408, -189297, -9823, -64463, 12760, -90903, 68829, -237453, 162011, -224850, -100392, 128366, -157037, -173014, -167313, -162337, -88025, -155002, -191661, 80908, -78630, 69282, 39636, 51127, 49704, -81573, -175943, -151291, -29009, -118691, -122240, -54789, -61088, 178157, -147037, -69420, 64026, -59371, 38457, -405120, -220468, -141796, -37898, 174987, 122421, -63787, 136072, 76192, 53581, -246303]
11821b9760C0630K33358a10747k84116I3769a69767A75207b48031k22599a28356
11810I7247b4663C15853b37490h725A57795R4255a02527c8612r1929k32364J74788
11799a88117A16838a98591B93111a09011A49929c40544A40028n0541b75901d9619
11788C4575a87108D5262b20598D9365a58295k55528a52907j75157G9737j4300
11778F5437c92615h1634k54013P1354g2392A40169e1558C9763J13650a98991D1981
11766a26530M3010l7721e6878A3014o154b13111g8256r7033A02830a00965k15984
11755c16949R9248a05527p5777A93175q5908a0815o287l4948F7923b06259C20776
11743B30024E2588d0431j48799A90800f8415a7834D5026a68137j17629D782J4700
$$ y = [-29760, 30630, 263988, -110747, -394863, 93769, -169767, 175207, -248031, -470630, -128356, 97247, -24663, 315853, -237490, -8725, 157795, 252050, -102527, -38612, -130541, -362905, -188117, 116838, -198591, 293111, -109011, 149929, -340544, 140028, 89487, -275901, -49619, 34575, -187108, 45262, -220598, 49365, -158295, -413823, -152907, -328064, 79737, 65437, -392615, -81634, -335647, -264293, -72392, 140169, -51558, 39763, 153413, -198991, 41981, -126530, -83520, -121241, -56878, 13014, 6860, -213111, -78256, -175289, 102830, -100965, -316949, -217701, -105527, -181304, 193175, 107267, -10815, -17102, -52050, 67923, -206259, 320776, 230024, 52588, -40431, -189230, 190800, -68415, -17834, 45026, -168137, -285766, 4782, 19482]
11732A9482J47324a6951j32189L100H9978J03798d55138a03909F2964d294l17631
11721c21925C7921e7366q3422A57431a30133c1990j72143c0810j5542C2111J91889
11710B24000h3220F2447h3078F7941b44955B12247C756d46791b38H3562b79213
11698E739J33670K4617b03803C77352g3559A30351h4181F134J56112p7727P4557
11687A59076a95935C8769a06298n3949C83526D0607J84845j02090K25150a84971
11676I58K50790a59822b9368n3861K6307A25348J53418F4285h7708b6482l3904
11665f0386B05989a97088b3533o72j85573A22680O2415E2462R9063c4845C42553
11653d070m73342A15256c56487E5641a94829A54269K3674h1344j50243B16270
$$ y = [19482, 166806, -16951, -149140, -146040, 89978, 193776, -455138, -103909, 62964, -4294, -321925, 37921, -57366, -140788, 157431, -130133, -31990, -204133, -30810, -46352, 32111, 224000, -83220, 62447, -83078, 67941, -244955, 212247, 3756, -446791, -238, 83562, -279213, 5739, 139409, 164026, -203803, 377352, -73559, 130351, -84181, 6134, 162246, 84519, 159076, -195935, 38769, -106298, -160247, 383526, 40607, 225452, 123362, 348512, -184971, 958, 251748, -159822, -29368, -83229, -56922, 125348, 278766, 64285, -87708, -26482, -60386, 205989, -197088, -23533, -24205, -209778, 122680, 185095, 52462, 151525, -34845, 342553, -4070, -477412, 115256, -356487, 55641, -194829, 154269, 177943, -81344, -231587, 216270]
11642E31659b8715A21238b93547c2394A5996J29284d39664a01137A2916L2639
11632D5555J70831L7800k978B7566P9706e30203B40391f8927I8172i8867K2508
11621g6359a6972j77321a5378n0954k5890j7803m4001B459a34708d560k02311
11610b06871Q7663F485J67c31244H7624A3984e5634I8629A7853E875K22386A02588
11597A15889C6349d9146G9870J26114b5574j26347G041J2486K5584O3187c89484
11585c03930D06734b45749R5092K85L9975G2634R0197a01871K1931A45398h9162
11573B20179J28816A63791h7053k08250J35936i415B24114o3588a59671A33424
11562C1248b17673l6851A67649a54049A06589K769h8511D8902c5303D16741b96576
$$ y = [531659, -28715, 121238, -293547, -32394, 15996, 145280, -439664, -101137, 12916, 45555, 216386, 254186, 251208, 27566, 107272, -530203, 240391, -68927, 98172, -98867, -76359, -16972, -194293, -15378, -66332, -92222, -110025, -154026, 2459, -134708, -4560, -206871, -119208, 6485, 6652, -331244, 87624, 13984, -55634, 98629, 17853, 5875, 228261, 102588, 115889, 36349, -49146, 79870, 205984, -25574, -151921, 7041, 19527, 45111, 108298, -389484, -303930, 406734, -245749, -150657, -150372, -110397, 72634, 162831, -101871, -79940, 145398, -89162, 220179, 348995, 163791, -87053, -295303, -159367, -9415, 224114, 160526, -159671, 133424, 31248, -217673, -254524, 167649, -154049, 106589, 109358, -88511, 48902, -35303, 416741, -296576]
11550B28142j4403a09346A7794b30173m8386A75432I987J19988h0641j63921G1423
11538C10549H5807c54986C91506A4471J38267g4306A92756J3950J99802A10256
11527f8148E7390F138g2928K0097A96141g452m03048A78704d9334B22953J38432
11516C61385e4029A00797L37330I5667c1550B63865a25484o9275B78798C0239
11505b5365O275j84471B15283D9804K18141a33443B6664d9989C4367n739c9857
11493d9142j18294C83917A23638l0635a29487C1954a13404E702J9844A1219a44057
11481B35J2561J52422i2025H8954a7706D19329b07474A78170N1796L0058n3823
11470B06201D3037a8719j25111k9774C43707E957a14916B14213R8535b7685A77928
$$ y = [228142, 213739, -109346, 17794, -230173, -278559, 175432, 9987, 129975, -80641, -244562, 71423, 310549, 85807, -354986, 391506, 14471, 152738, -74306, 192756, 206706, 406508, 110256, -68148, 57390, 6138, -72928, -52831, 196141, -7452, -410500, 178704, -49334, 222953, 361385, -54029, 100797, 438127, 95667, -31550, 263865, -125484, -194759, 278798, 30239, -25365, -19090, -203561, 215283, 49804, 267945, -133443, 26664, -49989, 34367, 28628, -39857, -49142, -167436, 383917, 123638, 93003, -129487, 31954, -113404, 5702, 25546, 11219, -144057, 235, 12796, 165218, -92025, 88954, -17706, 419329, -207474, 178170, 229966, 260024, 206201, 43037, -18719, -143830, -173604, 343707, 5957, -114916, 214213, 312748, -27685, 177928]
11458b94381A37966H753d8873r5420D44174a5921G5921C420b51069A20353a06647
11446f8813D23817h9643A16171A6528J04885l2545C7910J28893d5289B68613K24907
11435D93520b6147A71283a2982K656B45111A11432B3810b2899A9507f3457B05791
11423g400A88573a02683j87388B1924K26586I1647d4648A34759e9594k8563k88483
11412c76640g3364k0859a425l14274D5060c2846l19105J18272A16359K15084B4059
11400B1920J55072c37911C23409A54370J03047b64795B51365b103A1186K66607
11390B77793c17239l7094O4596I5203e1207m6627j60979b411n7666B74620c96486
11378C61413F1921B9410b32112A13635k3437a40792F2429d6362k2688m7185d6467
$$ y = [-294381, 137966, 8753, -48873, -144293, 444174, -15921, 75921, 3420, -251069, 120353, -106647, -68813, 423817, -89643, 116171, 16528, 121413, 88868, 37910, 166803, -45289, 268613, 493520, -26147, 171283, -12982, -10326, 245111, 111432, 23810, -22899, 19507, -63457, 205791, -7400, 188573, -102683, -290071, 21924, 248510, 91647, -44648, 134759, -59594, -88157, -376640, -73364, -94223, -1425, -315699, 45060, -32846, -351951, -233679, 116359, 331443, 24059, 21920, 176992, -337911, 323409, 154370, 257417, -264795, 251365, -2103, 11186, 277793, -317239, -354333, -289737, 95203, -51207, -97834, -258813, -2411, -60077, 274620, -396486, 361413, 61921, 29410, -232112, 113635, 90198, -140792, 62429, -46362, -69050, -116235, -46467]
11366a1792j1967B4284J40296b09981B05073l9119F2262k8712a96214Q3783j81648
11355b94079d0172A35331c92298a1573H3976b69128F7927b29401d8000I7142K66361
11344C63503a97165A03163C0684e17559A72879a42598G1873c09212B4474J10837
11334A35311J65052b33260A3526g8877n1784k33115g0725B32029A13680J11048
11324B24728d81829G9870c60952A19619m7693g4326G6949N5010c93327a44650
11313D14707a5344A61637d77676a66115B69682A28826c26194e4576I3640a93577
11302B33076e8048l99376a7209G5981c4491A78717d2409k69345N2691n452C7056
11290b81583G617J03662c01682C60569a30599B21553r1942m7582R8466c60620
$$ y = [-11792, -23759, 24284, 164580, -209981, 205073, 165954, 62262, 33550, -196214, -112431, -294079, -40172, 135331, -392298, -11573, 83976, -269128, 67927, -229401, -48000, 97142, 363503, -197165, 103163, 30684, -517559, 172879, -142598, 71873, -309212, 24474, 135311, 300363, -233260, 13526, -78877, -130661, -363776, -70725, 232029, 113680, 224728, -481829, 79870, -360952, 119619, 71926, -74326, 76949, 131959, -393327, -144650, 414707, -15344, 161637, -477676, -166115, 269682, 128826, -326194, -54576, 93640, -193577, 233076, -58048, -457424, -17209, 75981, -34491, 178717, -42409, -311754, -259063, -264515, 37056, -281583, 7617, 111279, -301682, 360569, -130599, 221553, 129611, 82029, 180495, -360620]
11279b55031a6142G1402Q1104a08846q9437A32183n5601k183c12633l8125C4550
11267c928A69455j2530a28917f2913E9083b27639E4472a9005j28162n290g3777
11255F5287b32955d7421k36189a3575A6133J94093a37319p777k18340J37314d2935
11243B13567a22655A17590c31722B10086B9670F64a0832H46R8115j1462P1929
11232A59428b81080J29949e6719A15179J89492D428c3454j36455I879i8582A14919
11220c62109a41415F8790d3173l1493r1631A57058c93598E9771c09441R2864P7167
11209a39410A12301J01656j06734a23137q4791r467c2436F1253K76424G3262A2299
11197a86681L284b9504E8877K29534c2408A2944J54532a78466B0995b57822A09039
$$ y = [-255031, -16142, 71402, 152506, -108846, -198283, 132183, 76582, 74399, -312633, -350758, 34550, -3928, 169455, 156925, -128917, -62913, 59083, -227639, 54472, -19005, -147167, -152457, -73777, 65287, -232955, -47421, -283610, -13575, 16133, 210226, -137319, -145096, -363436, -226122, -42935, 213567, -122655, 117590, -331722, 210086, 29670, 664, -10832, 846, 98961, 87499, 159428, -281080, -151131, -56719, 115179, 304671, 4428, -33454, -169909, 9879, -98582, 114919, -362109, -141415, 68790, -43173, -74666, -166297, 157058, -393598, 59771, -309441, -216577, -139410, 112301, 213957, 107223, -123137, -207928, -217395, -32436, 61253, 337677, 73262, 12299, -186681, -183397, -29504, 58877, 288411, -32408, 12944, 167476, -178466, 20995, -257822, 109039]
11185B87537B5891b32943Q0108C6975d39619a63578B69059d4329k6507A45147
11174H7886N5209d1034l0707c5066j02001B13022N680a97730A50722a87719c7645
11162e7701m9107I5052a21839o1849F500R5039J7726c17287d4107l9391k17079
11151c00577m618H6691e2897j68118L2562K8505k0345O6874C8466a16865j91231
11140c08096f6506d240F9121A1276P9536c3491k30067B89254q6684b82685J28013
11129a54672H7136b5736j89349A60937F0191B5936M9713d6803j74747J09572K5036
11118h6942C01031A0283a60455a0779E1724J00253b86313G2521a93552B09615
11107B5729b8569j40800j11880A84976i6732K2029j21509A4580L85376E0926b29983
$$ y = [287537, 25891, -232943, -152835, 36975, -439619, -163578, 269059, -44329, -70836, 145147, 87886, 143095, -41034, -71741, -35066, -137067, 213022, 218702, -197730, 150722, -187719, -37645, -57701, -106808, 95052, -121839, -183688, 6500, 101539, 119265, -317287, -44107, -83498, -300577, -305195, 86691, -52897, -221015, -188453, -159948, -180293, -113419, 38466, -116865, -308096, -66506, -4240, 69121, 11276, 90812, -33491, -263558, 289254, 202570, -282685, -154672, 87136, -25736, -215085, 160937, 60191, 25936, 75649, -46803, -221550, -111978, -86942, 301031, 10283, -160455, -10779, 51724, 151977, -286313, 72521, -193552, 209615, 25729, -28569, -169369, -281249, 184976, -96732, -74703, -196212, 14580, 399956, 50926, -229983]
11095a66433B28296f0546I1998J09876m8011e2871B02843a26726A48759a23469
11084g373B0828K37487F8050L653j4499K66207c7500j72184A84872n2601M1403
11073A73674D3822d3856B03531o1158J02735J63555k00246J17577O740C803M29824
11062D33627j91679L67686c0060B02646K705j3175Q0981H3381c9375A31480Q1007
11051B12487a64584B57608P72n0856Q7380J2011H6156K53650J30547A15868N43761
11040F59629k50042J51689j10191p5713L2963J40842Q2359j62049K26384A69010
11029F07997Q8347k44398M6046k9619j61382O33663l38892p9264R0359q2787k32654
11018B97416M20008o3904l22247L6778M13653k32526k24348M5174r5093L43943
$$ y = [-166433, 228296, -60546, 91998, 201874, 153863, -52871, 202843, -126726, 148759, -123469, -7373, 20828, 258315, 68050, 71703, 57204, 323411, -37500, -209684, 184872, 132271, 173674, 43822, -43856, 203531, 142373, 245108, 408663, 208417, 325994, 332734, 3803, 433627, 241948, 609634, -30060, 202646, 205351, 192176, 273157, 83381, -39375, 131480, 212487, -164584, 257608, 258380, 207524, 294904, 306915, 86156, 339806, 470353, 115868, 659629, 409587, 561276, 451085, 375372, 408335, 549177, 631536, 469487, 695871, 169010, 607997, 696344, 451946, 497992, 468373, 306991, 940654, 601762, 522498, 612857, 530070, 297416, 717424, 653520, 331273, 368051, 781704, 549178, 324830, 370004, 274911, 618854]
11008F18854J1570r9959J63212k89251M6718j14608L41556q7639m1446A26642
10997C99666K46815N1421C20179J60128J15800k18306J98751j23339o8888j18662
10987B65663l050K59728B15052q785J37233L39628C24503M99173k30424P672n3813
10976E47111j28575K28409k93498K40804J06362l4119j63373j71888L63586J49913
10966H44732j64049L55431l73564L26483L04775M3279j00424j4088J49897K21197
10956A593669j16851J37512L56592K98013P4039n39720J86223j99356l5115k20094
10946A534912k03752j41176K39564o4194l4017J59482j53209N9065k81911N62894
10936A677658j29599m20387j20084l31455K00521l35771q0566j54039J56460J63217
$$ y = [618854, 630424, 530465, 693677, 404426, 451144, 336536, 678092, 590453, 549007, 126642, 399666, 646481, 697902, 320179, 480307, 596107, 377801, 576552, 453213, 384325, 265663, 262613, 522341, 215052, 206267, 343500, 683128, 324503, 823676, 593252, 600924, 547111, 418536, 646945, 353447, 594251, 700613, 666494, 503121, 331233, 694819, 844732, 680683, 1036114, 662550, 989033, 1293808, 1337087, 1236663, 1222575, 1372472, 1593669, 1476818, 1614330, 1970922, 2268935, 2342974, 1803254, 1989477, 1790121, 1755006, 1534912, 1331160, 1189984, 1429548, 1365354, 1331337, 1490819, 1337610, 1396675, 1114764, 1677658, 1548059, 1127672, 1007588, 676133, 876654, 540883, 460317, 306278, 462738, 625955]
10926F25955B03048M06150k25099j86878K19555J33738i904A93436D6209a75118
10915A93108a07001b0890C69548A16664A3982c52624A64957a96940A69437g7142
10904A63222a72358F3571c29867A56309i0893q8223k97681d5346D6963Q4602d0753
10892h3314A32549e07j81848K3541j09541C8a60977n3924A42283A5228N46O5385
10880H1159d22443e7679D6750b96882A04925a54592B08734m0364E756K4207K1659
10869E1622K33183C5040J65450A055K05774c2164A61511G0823b99009B29274A8044
10857a93016M7502D0653b6961j26928E4122R5078a58505e6846j10956A85585a03935
10845a82956e4938l9514A4759a9228p4489B9297K49064a20113k03646J28560R3552
$$ y = [625955, 203048, 609198, 384099, 197221, 416776, 550514, -9904, 193436, 46209, -175118, 193108, -107001, -20890, 369548, 116664, 13982, -352624, 164957, -196940, 169437, -77142, 163222, -172358, 63571, -329867, 156309, -90893, -179116, -476797, -45346, 46963, 131565, -40753, -83314, 132549, -507, -182355, -158814, -268355, 38, -160977, -214901, 142283, 15228, 15774, 81159, -422443, -57679, 46750, -296882, 104925, -154592, 208734, 168370, 5756, 29963, 51622, 284805, 35040, 200490, 1055, 206829, -32164, 161511, 70823, -299009, 229274, 18044, -193016, -145514, 40653, -26961, -153889, 54122, 149200, -158505, -56846, -167802, 185585, -103935, -182956, -54938, -94452, 14759, -19228, -93717, 29297, 278361, -120113, -323759, -195199, -101647]
10834a01647I4572g6133j29841e4644r1751l4747K1270A51042c31568A29647g6975
10822a60615A59592b8069C8280c4871B24228a56323j71865J18763i1569n38324
10812f29893i3931C694a58591O6823A80339c01558B57185g0335C48297j56215
10802A92082h9275q5941n7514A92739a0598o6799A10786b03674D7161a34014D4272
10790A6725b01184F4052M3865L5673a37921B69705b84188B22737a31097j6298
10780a47395k0295a9031r1729G9077a911o7520r2246B26835G0519c3550n0943
10769h4493A44983M1011D2554b71408I5333a14780j23641C6972a43066o2972H0745
10757a04990j09413A15248h3101A40696J3897e74065i265B21147H6488G77N5128
$$ y = [-101647, 94572, -76133, -205974, -54644, -146395, -181142, -159872, 151042, -331568, 129647, -76975, -160615, 159592, -28069, 38280, -34871, 224228, -156323, -328188, -209425, -91569, -629893, -93931, 3694, -158591, -91768, 180339, -301558, 257185, -70335, 348297, 192082, -89275, -175216, -232730, 192739, -10598, -77397, 110786, -203674, 47161, -134014, 44272, 16725, -201184, 64052, 107917, 143590, -137921, 269705, -284188, 222737, -131097, -147395, -167690, -19031, -110760, 79077, -1911, -69431, -161677, 226835, 70519, -33550, -84493, 144983, 185994, 42554, -271408, 95333, -114780, -238421, 36972, -143066, -206038, 80745, -104990, -214403, 115248, -83101, 140696, 154593, -574065, -9265, 221147, 86488, 777, 55905]
10746E5905a67635f4955I3996a0054j93973A44222m0709a09341b8035k58151J36273
10735a49913N5736A08423b47652k47797I9998a35301j3457A33995J53639b15030
10724D5010K29441a10818k2605f148D39354C8661b41933J09693B5881K9336a74052
10712a32360A57501a1378A33095c91120H0058L7751J05133b15078k56981A10034
10701h1612k6054p9477j08471b1872I482P4754c23467d1108j12285q2289J08038
10690a27644h920n34249A28256n3262a6467A18043K9118d7672A52104m6998d6264
10678b85952B73877a13328k04876a10208k90811G6686B6461g8283K4868F1423
10667g2010B13498f8266j0331k63826A74601a57858g2409K0892j40125A05972
$$ y = [55905, -167635, -64955, 93996, -10054, -204027, 144222, 103513, -109341, -28035, -286186, -149913, -94177, 108423, -247652, -495449, 99998, -135301, -148758, 133995, 287634, -215030, 45010, 274451, -110818, -133423, -6148, 439354, 38661, -241933, -132240, 25881, 55217, -174052, -132360, 157501, -11378, 133095, -391120, 80058, 117809, 222942, -215078, -472059, 110034, -81612, -107666, -187143, -295614, -21872, 9482, 84236, -323467, -41108, -153393, -235682, -127644, -8920, -543169, 128256, 74994, -16467, 118043, 147161, -47672, 152104, 105106, -46264, -285952, 273877, -113328, -318204, -110208, -401019, 76686, 26461, -78283, -53415, 61423, -72010, 213498, -68266, -78597, -342423, 174601, -157858, -72409, -51517, -191642, 105972]
10656b19897b808m1005E5672c1485o924j04163L98H3496a1150j68021b1464k15114
10644b36578e2416A74396a27491q175I3284r148K2590i5211C9892b49364N1097
10633a98267F0647b61209h1373n0973B93273b4815l00365A5502a53365m6966h4464
10621B5187a81075A95506a28258e3519q7879K7019A25363a22721C33516a2295
10610A28821Q0124d63254c7667l46822B2164a30212A44581b06036E977d5872a0456
10598d70769D5403J4857e8385L761b3433G3851a14691H7965h9083A11128J4914
10587A26042f7042B77892a11142I2787M6061c41023a5547F7180R1479f8509j2169
10576h0678G169Q5012b96776g9182o3058A90980a87131f4430a3683A83590Q0552
$$ y = [-219897, -2808, -43813, 55672, -31485, -38409, -142572, -142174, 83496, -11150, -179171, -21464, -236578, -52416, 174396, -127491, -135666, 93284, 84136, 106726, -95211, 39892, -249364, -198267, 60647, -261209, -81373, -132346, 293273, -24815, -325180, 15502, -153365, -200331, -84464, 25187, -181075, 195506, -128258, -53519, -141398, -114379, 125363, -122721, 333516, -12295, 128821, 208945, -463254, -37667, -384489, 22164, -130212, 144581, -206036, 5977, -45872, -10456, -470769, 45403, 60260, -58385, -54624, -23433, 73851, -114691, 87965, -89083, 111128, 126042, -67042, 277892, -111142, 92787, 138848, -341023, -15547, 67180, 158659, -68509, -80678, 7169, 92181, -296776, -79182, -142240, 190980, -187131, -64430, -13683, 183590, 264142]
10565B64142j24712i6424l03162B57942A05558K08743j12459l4378D6279j4634
10555C1645a61117H3692f737j08639B84407I7988i8144j46364j20784G9191P4517
10544A53708l8112K8058b33253C4529j6881J6994e4983A88577o5727J40798a79691
10532f2680B00691J22941a99663J2944P0540B72672B4670f1779m6095N2814A2822
10520A81485b05273l999A35547i4614A28120a78568A99196c12395B59880a57525
10509c26260B34607n9456b93447a31717N6160I1792P2504l2202a92391i1277k22998
10498c14275H247c22026d0695j52413F8355B270i4605j69346C4276d32546B27810
10486b86868Q3639A85537a22419c7998q7201j07475L2893k67084b03200d8297
$$ y = [264142, 139430, -96424, -399586, 257942, 105558, 314301, 201842, 167464, 46279, 31645, -161117, 83692, -6737, -115376, 284407, 97988, -98144, -244508, -365292, 79191, 153708, 115596, 143654, -233253, 34529, 17648, 34642, -54983, 188577, 122850, 263648, -179691, -62680, 200691, 323632, -199663, -186719, -116179, 272672, 24670, -61779, -107874, -55060, 12822, 181485, -205273, -209272, 135547, -94614, 128120, -178568, 199196, -312395, 259880, -157525, -326260, 234607, 175151, -293447, -131717, -75557, 91792, 164296, 132094, -192391, -91277, -314275, 8247, -322026, -40695, -193108, 68355, 2270, -94605, -263951, 34276, -432546, 227810, -286868, -203229, 185537, -122419, -37998, -125199, -232674, -199781, -466865, -203200, -48297]
10475a66347J110A04908b5806n0883F7397O9193a15069F9744l1653J69033j275
10464B05849R7146M8671b39478E0657N296N97513A35083b81362B30980p3554N537
10453A62963e0704j12554D141g4281j47248B77933C671b21868f1101j81649Q0603
10442a62147B24946D6945M4154N6806a72562N3120q6130A93111B1244e03253A24075
10430c4809C6709a00065e984j71927A82724b00581D23366b30027B5068a11904
10419b15177O6704e8164p8268n9165h2267j86192a29928B04789j1118D855J8218
10408B3073J8443a38524J2448O2064C59585D9775b37710d9643j06223j19255E21851
10396I9596b15069A56282a54248A49754l049c67248C13208j34679j24p3229a22832
$$ y = [-166347, -165237, 104908, -25806, -76689, 67397, 136590, -115069, 69744, 38091, 207124, 205849, 302995, 351666, -239478, 50657, 55953, 653466, 135083, -281362, 230980, 157426, 162963, -50704, -163258, 4141, -74281, -221529, 277933, 3671, -221868, -61101, -242750, -162147, 224946, 46945, 91099, 147905, -172562, -119442, -205572, 193111, 21244, -503253, 124075, -34809, 36709, -100065, -5984, -177911, 182724, -200581, 423366, -230027, 25068, -111904, -215177, -148473, -58164, -136432, -195597, -82267, -268459, -129928, 204789, 193671, 4855, 23073, 41516, -138524, -126076, -64012, 359585, 49775, -237710, -49643, -155866, -275121, 521851, 99596, -215069, 156282, -154248, 149754, 146705, -367248, 313208, 178529, 178405, 105176, -122832]
10384C51947e8119J8968I5997b5376j12495l9993Q16j55313H0523J60903A2949
10372C12813h8592D0548J18692c4041D51269f3734C3429J67244o7628C7803K8544
10361F6347K8329D1636J31752J87671I7767J10560m359J36978J09520a70405B34775
10349A27656M06073B05336J42748o9931q8005L8651I3152a20949A43121K40072
10339C83193A73608K47577A62660J22368K5464K9558n346i366B06491o5062h0659
10327B32929A14612Q7641J92112j68903k8016e582D74033F1134h796C77294H2677
10315h5440A40944c2072C06372j31027L0970J01559i8655B94313f5631B69732
10304B23776b08333A05603J87436A34293R2165a10732j16408A68020a46500A40206
$$ y = [351947, -58119, -39151, 95997, -25376, -137871, -177864, -177048, -332361, 80523, 241426, 12949, 312813, -88592, 40548, 159240, -34041, 451269, -63734, 33429, 200673, 133045, 37803, 66347, 94676, 41636, 173388, 361059, 97767, 208327, 203968, 340946, 450466, -170405, 234775, 127656, 533729, 205336, 348084, 278153, 190148, 228799, 93152, -120949, 143121, 383193, 173608, 421185, 162660, 285028, 310492, 340050, 334704, -9366, 206491, 141429, -80659, 232929, 114612, 202253, 394365, 225462, 197446, -5582, 474033, 61134, -8796, 377294, 82677, -85440, 140944, -32072, 306372, 175345, 206315, 307874, -98655, 294313, -65631, 269732, 223776, -208333, 105603, 293039, 134293, 226458, -110732, -227140, 168020, -146500, 140206]
10293A93495J05863g1751A27004N9201h486q9150C19288F6553b61199c3653E5945
10281a08635j24866g8933A73560i6589M5053j4848k09806a21453B1774J58050
10271A79824E513c43825G5685b05087B75655c2151k6859b1272r9408J8532L7534
10260f4614I7559a18128h896k44611J8273C67084i6349I675Q8014a60920B25332
10248a06641j4235k43749A18789a41799I7931D7176b85882A3380a69223D31330
10237a71887B19312G5486a40692B79279e5378o0773l97004K53933a24686j65119
10227b89805R1248d9724K1277j95022j20298N4494h9910k7514A7744a41307H7430
10215B53655a41273p1864d9400A76245a61113m1429p0630J33631J7951c7593j02981
$$ y = [193495, 299358, -71751, 127004, 186205, -8486, -97636, 319288, 66553, -261199, -33653, 55945, -108635, -233501, -78933, 173560, -96589, -51536, -66384, -276190, -121453, 21774, 179824, 5513, -343825, 75685, -205087, 275655, -32151, -59010, -21272, -120680, -102148, -64614, 97559, -118128, -8896, -253507, -235234, 367084, -96349, 9675, 97689, -160920, 225332, -106641, -120876, -364625, 118789, -141799, 97931, 47176, -285882, 13380, -169223, 431330, -171887, 219312, 75486, -140692, 279279, -55378, -116151, -513155, -259222, -124686, -289805, -198557, -49724, -28447, -223469, -343767, -289273, -89910, -117424, 17744, -141307, 87430, 253655, -141273, -213137, -49400, 176245, -161113, -202542, -273172, -139541, -121590, -37593, -140574]
10204a40574n2777j21284B03245d12940a21234A78394e7901E0841a72677o1318
10194b33995G8216a51186j8999b5955h449k27061f4828A91698a93650a0773m3120
10183e3893H0058b27781a4671K651j34456a1982j66880M6433e2815H1144a36536
10171b00574c1727j34797j38829m2096d3498j22904B26337b31998I5354a40558
10160A75808b31396R3886k54396J72128c4523j37588A54417m978C2897K67680
10150C00577b44130b3147j54629I7152d2623A62636F2875a50370C92020a95472
10139f3135r1678M497A40298a84551r618j70436I0272i0732K786C1305b07146
10127b64606J11129G9255a4656j21305M3716Q739n6092l273e7863b4707E3981
$$ y = [-140574, -193351, -314635, 203245, -412940, -121234, 178394, -57901, 50841, -172677, -233995, 78216, -151186, -170185, -25955, -8449, -235510, -64828, 191698, -193650, -10773, -53893, 80058, -227781, -14671, -12020, -146476, -11982, -178862, -132429, -52815, 81144, -136536, -200574, -31727, -166524, -305353, -347449, -43498, -166402, 226337, -231998, 95354, -140558, 175808, -231396, -137510, -391906, -219778, -34523, -172111, 154417, 149439, 32897, 300577, -244130, -23147, -177776, 97152, -42623, 162636, 62875, -150370, 392020, -195472, -63135, -154813, -150316, 140298, -184551, -194169, -364605, 90272, -90732, -87946, 31305, -207146, -264606, -153477, 79255, -14656, -135961, -92245, -83506, -139598, -142871, -57863, -24707, 53981]
10115d995m1976a2643m7397j3149k73697a30076N7624m28813a18020L3582G182
10103b36587i3647A25501L8070d4365D26418a52873r4809A7887Q7920b96259D3462
10091D9546L287i3491j82037a28621j59675J43819o6236i0895b583F7457a16136
10079c50045J2512j14888D7134c72542D5679d6168r5589H8825L5092c97196J27826
10068b69370G1250b94171a09080m4807N9685j95032j08652C6565a03937b5445
10057d33738c4032D5655o148b09895o2987h2431A02270a06713J7951H4713b46463
10045g606C7377r275J0410c57012f8812a8997j76353Q9844D1588A4611f1764B50092
10032a5112B68065j21970j3176F0370b200k1870k07637C4022h5513F2938a72146
$$ y = [-4995, -46971, -12643, -60040, -73189, -346886, -130076, -72452, -501265, -118020, -84438, 7182, -236587, -93647, 125501, 163571, -44365, 426418, -152873, -247682, 17887, 105807, -296259, 43462, 49546, 52833, -93491, -275528, -128621, -288296, -144477, -210713, -90895, -2583, 67457, -116136, -350045, -337533, -452421, 47134, -372542, 45679, -46168, -141757, 88825, 123917, -397196, -269370, 71250, -294171, -109080, -153887, -94202, -289234, -397886, 36565, -103937, -25445, -433738, -34032, 45655, 39507, -209895, -272882, -82431, 102270, -106713, -88762, 84713, -246463, -7606, 37377, 28102, 38512, -357012, -68812, -18997, -195350, -105506, 41588, 14611, -61764, 250092, -15112, 268065, 146095, 132919, 60370, -2200, -24070, -231707, 34022, -85513, 62938, -172146]
10020B18076G6007c8243H3722J2478b56093a24799m42287a78052j78128a0720
10009B18614a69376l1688Q0777E8712b02610E630d0076B28553a59968a6799o7530
9998h4329n940l6870b9411j18187J3223M3825c3862B32548B5437b2093A76560
9986a10378f770j41303C1083b3597k51419A07241C9084J0109a27705A35874M7076
9975A82950E7890O8379a43368e3813k53251c1559j04321A85600c31227A33698
9964a12681C6785b30404G4100b94800f6469D3167J05316c00101J28378j00031
9954b71754j46603A42997d6624F0201a70742G8358a39834E9377J95201k6750J28527
9943C56355d22537H7576P7860b62724B75204a7624m27696g3068A987K02114a41486
$$ y = [218076, 76007, -38243, 83722, 96200, -256093, -124799, -567086, -178052, -356180, -10720, 218614, -169376, -201064, -120287, 58712, -202610, 5630, -40076, 228553, -159968, -16799, -84329, -90269, -127139, -29411, -147598, -134375, -90550, -33862, 232548, 25437, -22093, 176560, -110378, -6770, -148073, 31083, -23597, -275016, 107241, 39084, 49193, -127705, 135874, 182950, 57890, 126269, -143368, -53813, -307064, -31559, -135880, 185600, -331227, 133698, -112681, 36785, -230404, 74100, -294800, -66469, 43167, 148483, -300101, -171723, -271754, -418357, 142997, -46624, 60201, -170742, 78358, -139834, 59377, 254578, 227828, 356355, -422537, 87576, 165436, -262724, 275204, -17624, -445320, -73068, 1987, 204101, -141486]
9931A69993Q3357a61508B29913i0972B37121a22507k09461B04639i873l2044B3449
9919A80698k3525F5548b8906o8242M0068E289a52283B36252b01009Q849e0961
9907c37109j50063h2400E820e6960n1569j53670j05112E5929M8964d0134B12522
9895b40901J15067C7352a67923A77913R2436a14289j75851B55468e9043I5755
9884A5778c27222E8545L9626a49434g3060n3221d7924j63467K0251p9281O3703
9873b06718A68705a18766F0311a61940p4773j06367a19268r7494B5128K5867d36359
9861B90697a66121l58891D9961c23708A91501a23188J8007a9479l69989f9684
9850D7178a53789K2350B9471b67405a13625A68457B237b07624E2795B6159a48513
$$ y = [169993, 253350, -161508, 229913, -90972, 237121, -122507, -331968, 204639, -9873, -41917, 23449, 180698, 157173, 65548, -28906, -97148, -57080, 5289, -152283, 236252, -201009, -192160, -50961, -337109, -487172, -82400, 5820, -56960, -108529, -262199, -367311, 55929, 104893, -40134, 212522, -240901, -125834, 37352, -167923, 177913, 270349, -114289, -290140, 255468, -59043, 95755, 15778, -327222, 58545, 98171, -149434, -73060, -126281, -47924, -211391, -191140, -270421, -206718, 168705, -118766, 60311, -161940, -236713, -343080, -119268, -216762, 25128, 50995, -436359, 290697, -166121, -525012, 49961, -323708, 191501, -123188, -105181, -19479, -389468, -69684, 47178, -153789, -131439, 29471, -267405, -113625, 168457, 2237, -207624, 52795, 26159, -148513]
9838f81A24778d2331l9323j85651c6833m7283A9908a66625o6625B21848B4401
9826b20155I1736c30258A60262a18997A21758a22479j30474A51133a61243f2634
9815C24893H5110g5601j51212h6297L4631j12375M9847j77629R1508b7958D5855
9803A94084a73283A49506b69k62084M1056h85k03523Q4078J4132A00090R4936
9792A95026a51409j59993J00602g4880A95074h9190J9227a711j40260A10470b08684
9780g603p1592E7628f0948o9630k41619K1010B4914R5297b2045A70981b86347
9768c58979E7138l270b82124a26689r4969j47632b1655n17428b25259a3491j32801
9757a46292B0398P2872J3045B0618a34695C21835a26664L1176G5270k7256b28103
$$ y = [-681, 124778, -42331, -81654, -267305, -36833, -84116, 19908, -166625, -233250, 221848, 24401, -220155, 91736, -330258, 160262, -118997, 121758, -122479, -252953, 151133, -161243, -62634, 324893, 85110, -75601, -226813, -86297, -51666, -164041, -114194, -291823, -200315, -27958, 45855, 194084, -173283, 149506, -269, -262353, -221297, -885, -204408, -120330, -106198, 100090, 195026, -151409, -311402, -210800, -74880, 195074, -89190, -69963, -1711, -141971, 110470, -208684, -7603, -79195, 57628, -60948, -130578, -372197, -351187, 24914, 120211, -22045, 170981, -286347, -358979, 57138, 53868, -282124, -126689, -221658, -369290, -21655, -539083, -225259, -13491, -146292, 20398, 93270, 106315, 20618, -134695, 321835, -126664, -95488, 75270, 48014, -228103]
9745b12666l2812B73104a6325C8260a36258k1582k1601A03169Q6709b65109J10698
9734a54411A28675J28877f4269j93701a12793M7733m856c4475p2917l5388A53075
9722a16177b8462k30513j84482e0000A33857K03872A05159j5773b22959J03723
9712a19236l1671C9018M4404i2503l30179D3879f8619k01505A06975c1248r4154
9701a25402B59223a10084l45168I423J70887E1830d44367a18182O621I9807K28001
9690C27808a33989a0334p6324A55857e9028j35434c534p9751j59561J04093A3083
9678f3393p4726A0399a29050a2725k28218a16116C74739a19926A80387g489k96983
9667c04472h3203o0738K1936d5353j49335m3958H6096h0556k28008A46722a13776
$$ y = [-212666, -245478, 273104, -16325, 38260, -136258, -157840, -179441, 103169, 189878, -265109, -154411, 128675, 257552, -64269, -257970, -112793, -65060, -69916, -34475, -107392, -142780, 153075, -116177, -28462, -258975, -443457, -50000, 133857, 337729, 105159, 89386, -222959, -119236, -150907, 39018, 83422, -92503, -422682, 43879, -68619, -270124, 106975, -31248, -125402, 259223, -110084, -455252, 9423, 180310, 51830, -444367, -118182, -111561, 99807, 327808, -133989, -10334, -86658, 155857, -59028, -194462, -3534, -83285, -242846, -138753, 13083, -63393, -138119, 10399, -129050, -12725, -240943, -116116, 374739, -119926, 180387, -7489, -304472, -83203, -143941, -122005, -45353, -194688, -238646, 86096, -80556, -308564, 146722, -113776]
9655c13751g2289B105N6551b1881o8434k72177f984A55400J4338i4104j87880
9644b81984h33j21279j78613d4549k39307F2178l902i1761k49032P6110h5555
9632c0334q5593B07002E7610A270b49879O5677A33582b5352H5500c34765B1402
9620d7251A11947c51792g1878A57946a69030A67280c57248J49968b355A3971a15807
9608I1594C4757a08614F6758O2292L4377f801m0201r5479r5522B93644A31094
9596d28673a24199A4072b21991B74544a58539K7427D2256K08535b9997j42894
9586a72891p9639Q3283j07720A43156D0531R4911d16066h634r9063q5279j7999
9575b10975f6460k68229A50004P2308k67a67621O1591g913p4926l41531a53087
$$ y = [-313751, -72289, 2105, 58656, -21881, -90315, -362492, -6984, 155400, 169738, -94104, -281984, -833, -122112, -300725, -44549, -283856, 62178, 58276, -91761, -340793, -264683, -85555, -30334, -115927, 207002, 57610, 1270, -249879, -184202, 133582, -25352, 85500, -334765, 21402, -47251, 111947, -351792, -71878, 157946, -169030, 167280, -357248, -207280, -2355, 13971, -115807, 91594, 34757, -108614, 66758, 129050, 163427, -6801, -47002, -142481, -238003, 293644, 131094, -428673, -124199, 14072, -221991, 274544, -158539, -131112, 42256, 250791, -29997, -172891, -252530, -169247, -276967, 143156, 40531, 135442, -416066, -8634, -107697, -192976, -210975, -66460, -334689, 150004, 222312, 222045, -167621, -106030, -7913, -82839, -424370, -153087]
9563b2399k4658j62118A40267c19214B51407c07276e6163R814A13769b41979N8865
9552a83114m0818j45798O5255j631m7657A66056b4414l2105n4190d5217j12779
9541a57996A16174a00688K9261l5381C09837a11666j00545E8010N6592c59720
9530A05136a52900n7631O9507k2737a0430C80157a33908A92172O07e6958F266
9518a57057k66294A58870b94986C5247J1363a38087i074j87260b7730n1727C0374
9506A25306K51222B088J14970k2786M27918b46898j72354a01728J4010j62126
9496b49844e6277C42922c13291a39829q318j90993E8987a52994l221g5428F3277
9484a36446A91842b27618c427l25426h412j13995q1964b1711I7395b35839h463
$$ y = [-22399, -47057, -209175, 140267, -319214, 251407, -307276, -56163, -46349, 113769, -241979, -183114, -223932, -369730, -304475, -306106, -353763, 166056, -24414, -56519, -110709, -45217, -157996, 116174, -100688, -71427, -106808, 309837, -111666, -212211, 58010, 114602, -359720, 105136, -152900, -210531, -141024, -163761, -10430, 380157, -133908, 192172, 192779, -56958, 6266, -157057, -423351, 158870, -294986, 35247, 46610, -138087, -9074, -196334, -27730, -79457, 30374, 125306, 376528, 2088, 117058, 94272, 522190, -246898, -419252, -101728, -87718, -249844, -56277, 342922, -313291, -139829, -148147, -339140, 58987, -152994, -156215, -75428, 63277, -136446, 191842, -227618, -3427, -328853, -8412, -122407, -204371, -21711, 97395, -235839, -8463]
9472E3030h6395k0281J9882j76180N1234B00537a11997k1367M9143j19376K8219
9461a75378l776K8562c6937k4710B46827g3962C66345C7478b8058k62560a19190
9449a6375j09250k2528K3718p4286C05129a98320M7620B9124L9223i660B0001
9437b52652E5958J20574b48322H7231N0080b94466a39601O3699j10855B15709
9426i903j21215e9050j5521D4476f8870k18762H4208a96823C90194a82599G9331
9414G9281a2543o2076n6717H7923e4509A3465K75570d2676j56576P478A85733
9402C10113b31381A27370B5900a34417j00140P9602L3855m5819F4563a76031p3330
9391b49361A90179d9820B18425b1244l9537k0420p2182K7706L9965A8132c5360
$$ y = [53030, -86395, -106676, -86794, -262974, -211740, 200537, -111997, -133364, -84221, -203597, -175378, -179154, -150592, -36937, -61647, 246827, -73962, 366345, 37478, -28058, -290618, -119190, -16375, -125625, -148153, -124435, -198721, 305129, -198320, -150700, 29124, 68347, -9660, 20001, -252652, 55958, 176532, -248322, 87231, 137311, -294466, -139601, -75902, -186757, 215709, -9903, -131118, -59050, -74571, 44476, -68870, -287632, 84208, -196823, 390194, -182599, 79331, 79281, -12543, -74619, -131336, 87923, -54509, 13465, 289035, -42676, -199252, -191774, 185733, 310113, -231381, 127370, 25900, -134417, -234557, -154955, -121100, -166919, 64563, -176031, -249361, 190179, -49820, 218425, -21244, -60781, -81201, -153383, -125677, -85712, 18132, -35360]
9379E3791c1599A5472K0600e67194K64102a28404E8443a07990j41300b9275j09624
9368a38899p3560N5631A39640c46259n3704g9118J4998L0900j10631k9065e4696
9356d64194I5955c4936A98914b67342J26549j64209O9331r5320J22709n6338g3589
9344b01106b4371A3833M5115g3066l7969B31475g8720j60162e0901A73412r902
9333A63510d2890p0527A07187J44448a21994n197B94270h7018f275K021o2544
9322f6798q4759K2619A61419a67819L4367l3821m3255O360d408C1603M836a42806
9309c24833A95641a16300p0234g7529D56196I2086b73677g8022A75652i0492k1039
9298a11531M2868n6155E9722B1891b52252B92592n3830d5848j98533C4655a88414
$$ y = [53791, -31599, 15472, 36072, -567194, -303092, -128404, 58443, -107990, -249290, -29275, -138899, -212459, -156828, 139640, -346259, -399963, -79118, -64120, -33220, -143851, -172916, -54696, -464194, 95955, -34936, 198914, -267342, -140793, -305002, -235671, -330991, -208282, -264620, -73589, -201106, -24371, 13833, 58948, -73066, -111035, 231475, -78720, -238882, -50901, 173412, 163510, -42890, -113417, 107187, 251635, -121994, -127191, 294270, -87018, -6275, -4254, -66798, -151557, -128938, 161419, -167819, -133452, -167273, -210528, -204168, -4408, 31603, 36439, -142806, -324833, 195641, -116300, -186534, -77529, 456196, 92086, -273677, -78022, 175652, -90492, -111531, -68663, -124818, 59722, 21891, -252252, 292592, 238762, -45848, -244381, 34655, -188414]
9286C2121a93757C2618a12387n6894A75979B0806J51455q3084b0316l0274A36669
9274f8327D4702a39371i268l54776h0582p0074c0087A06465h7048B38267a56355
9262A14288h4359d0003b594A69853g4194j50597a04933N2301k4730a5159k33008
9251b48167J01680L4467A22144h8344k73209C6797c30222a14841B5667h0779I1822
9239E2895a55015I5538m3533j281b17880R0934K3921o4524A17274b33040f2850
9227d4979A87717b42364D8795c4970k70871B11783c24166B2734g747A03547d33733
9215A53745b09847J00342j67193a33382j57040H7622a95900d4403o117k06087
9205b56607d9038m9619L9395j16980M3681A6922c60443e8312C16933e7899k9846
$$ y = [32121, -193757, 32618, -112387, -169281, 175979, 20806, 172261, 89177, -20316, -50590, 136669, -68327, 44702, -139371, -9268, -364044, -80582, -150656, -30087, 106465, -87048, 238267, -156355, 114288, -84359, -40003, -2594, 169853, -74194, -224791, -104933, -52632, -77362, -15159, -248167, -146487, -112020, 122144, -88344, -361553, 36797, -330222, -114841, 25667, -80779, 91822, 52895, -155015, 95538, 52005, 50724, -217880, -126946, -103025, -167549, 117274, -233040, -62850, -44979, 187717, -242364, 48795, -34970, -305841, 211783, -324166, 22734, -7747, 103547, -433733, 153745, -209847, -109505, -276698, -133382, -290422, 87622, -195900, -44403, -50520, -256607, -49038, -98657, -59262, -176242, -132561, 16922, -360443, -58312, 316933, -57899, -87745]
9194h7745r4205I1544J13290b57184B19255a25213k15925a5267A09965a33501
9183b96032a20758j2083j55256J14454A9297Q5759b72741j66855B5768b797k9975
9172c2772B6003J18327c87948J29278h2079B5131J32663b34684K0540m8267m7912
9161c10323g2781B9519e5862j53919a4653n5416D501b5098A75598D8413P5672
9150A24085J70899A2390c0489D62508g3891E9759a69092L0012O0804q4171D9084
9138E9641a12034b347C19934d07436a44291B84320b32536p7835g1816A66039i9143
9126e8555D89065g2874j1544D9619K04192a54286B8085O8987a86319H2535c43418
9114a01666B6229b16177C4759e8696j24935A52145b64248k9637a41662c9259B69285
$$ y = [-87745, -181950, 91544, 204834, -257184, 219255, -125213, -341138, -15267, 109965, -133501, -296032, -120758, -132841, -288097, -173643, 19297, 105056, -272741, -439596, 25768, -2797, -32772, 26003, 144330, -387948, -258670, -82079, 25131, 157794, -234684, -214144, -262411, -310323, -72781, 29519, -55862, -209781, -14653, -70069, 4501, -25098, 175598, 48413, 124085, 294984, 12390, -30489, 462508, -73891, 59759, -169092, -139080, -78276, -162447, 49084, 59641, -112034, -2347, 319934, -407436, -144291, 284320, -232536, -310371, -71816, 166039, -99143, -58555, 489065, -72874, -84418, 49619, 253811, -154286, 28085, 97072, -186319, 82535, -343418, -101666, 26229, -216177, 34759, -58696, -183631, 152145, -264248, -293885, -141662, -39259, 269285]
9102b37317A60205P0556A08836h330j09096D9278a48387I8941C4238h2677o7739
9091a50416B1520J41187j5799a50271f3994j87687a7201l1642l00083E1549f09107
9079a18292C27208a39464J2494J2332m1964K5950h059D4442R0711f6479A64940
9067a79280Q2049A85780h3785F627a78218F4622b50797O202A7595J10585b2525
9055f3306A37466a01239B8771a65068B24565K1943j21770d20732i6930K2987L5561
9044c8382C81506b59339b7961k13957B3684b99453D2447A6021f651m7909j19212
9033a73772e7856n3221j12007K2722d3155F0250h1729A6336a8025k18768a01820
9021h0419B90701c91851B70321A01011B3941O2188a31525n2769A57380a98744
$$ y = [-237317, 160205, 230761, 108836, -8330, -117426, 49278, -148387, 98941, 34238, -82677, -150416, 21520, 162707, 146908, -150271, -63994, -251681, -17201, -48843, -348926, 51549, -609107, -118292, 327208, -139464, -126970, -114638, -156602, -130652, -8059, 44442, 135153, -66479, 164940, -179280, -97231, 185780, -83785, 6627, -178218, 64622, -250797, -244595, 17595, 128180, -22525, -63306, 137466, -101239, 28771, -165068, 224565, 246508, 124738, -420732, -96930, -73943, -38382, 381506, -259339, -27961, -241918, 23684, -299453, 42447, 16021, -6651, -54560, -173772, -57856, -111077, -223084, -200362, -43155, 60250, -81729, 16336, -18025, -236793, -101820, -80419, 290701, -391851, 270321, 101011, 23941, 86129, -131525, -184294, 157380, -198744]
9010B13978a29076I692a2976j39450b0240j79480R5366A04843N8990p1980J2808
8999A04661a48257B37110a65124N9831o7845k195I6815m5015l739F204M4112N5468
8987A05784K8217a91763K3483F3681i5273L697l5702p0684f8432r8940k05057
8976c72429C08103A20769j070i8631C52106f8045B78270b89692H1512a1397k40690
8965b52087B57040a23342n0743E0427a58001a1693j26099H9800L4621J925m0702
8954H5644a6339j68162O1617D1532a34707j38817i7190A98743C9140h467F4564
8942c75881f0337F0988a3503j40031G5860a65036d433k55838O1997i0881A3462
8930c93960a03487j93763B00705b19582B49816p7823a828A20585a54232C841N5751
$$ y = [213978, -129076, 9692, -12976, -152426, -20240, -199720, -104354, 104843, 163833, 91853, 104661, -148257, 237110, -165124, -105293, -173138, -175333, 96815, 51800, 48061, 6204, 50316, 105784, 134001, -191763, -168280, 63681, -95273, -91576, -127278, -197962, -68432, -167372, -372429, 308103, 120769, 119699, -98631, 352106, -68045, 278270, -289692, 81512, -11397, -252087, 257040, -123342, -174085, 50427, -158001, -11693, -137792, 89800, 124421, 126346, 85644, -16339, -184501, -122884, 41532, -134707, -273524, -97190, 198743, 39140, -8467, 64564, -375881, -60337, 60988, -13503, -153534, 75860, -165036, -4433, -260271, -198274, -90881, 13462, -393960, -103487, -297250, 200705, -219582, 249816, 171993, -1828, 120585, -154232, 3841, 59592]
8919E9592J75647a55704D11845E4064P3387E1936a28240B16535q1592n929R5746
8908B24760K03651J75929Q26273N42471J640684M380525C208101j356996q42070
8899A009035D84999j10669J61758E6056L6005J80712D7846K937K1268j1757J46390
8888B06684P169b87078h977C43J65355a90484Q6214d1308l1896C01728j39407
8877A62321c1466l00749E9943g7075N597F7549a95959f3052I0805a25502l9000
$$ y = [59592, 235239, -155704, 411845, 54064, 127451, 51936, -128240, 216535, 134943, 129014, 224760, 428411, 604340, 1430613, 1973084, 3613768, 7994293, 3208101, 1851105, 1009035, 484999, 374330, 536088, 56056, 92061, 272773, 47846, 50783, 72051, 60294, 206684, 213853, -287078, -8977, 343, 165698, -190484, -104270, -41308, -73204, 301728, 162321, -31466, -332215, 59943, -77075, -71478, 67549, -195959, -63052, 90805, -125502, -164502]
$$ [...]
##END NTUPLES=NMR SPECTRUM
##END=
