
##TITLE=AC1141_Costa_5906611_ch5y19DHjk
##JCAMPDX= 6.0         $$ Bruker NMR JCAMP-DX V2.0
##DATA TYPE= NMR SPECTRUM
##DATA CLASS= NTUPLES
##ORIGIN= BRUKER
##OWNER= Administrator
$$ 1.72 TOPSPIN		Version 2.1
$$ 2012-04-10 10:15:00.312 -0500  Administrator@TOPSPIN
$$ Compression mode = diff/dup
##.OBSERVE FREQUENCY= 400.13188235
##.OBSERVE NUCLEUS= ^1H
##.ACQUISITION MODE= SIMULTANEOUS (DQD)
##.ACQUISITION SCHEME= undefined
##.AVERAGES= 64
##.DIGITISER RES= 22
##SPECTROMETER/DATA SYSTEM= spect
##.PULSE SEQUENCE= noesygpps1d.comp
##.SOLVENT NAME= COFFEE_meoh
##.SHIFT REFERENCE= INTERNAL, COFFEE_meoh, 1, 14.9688
##AUDIT TRAIL= $$ (NUMBER, WHEN, WHO, WHERE, PROCESS, VERSION, WHAT)
$$ ##TITLE= Audit trail, TOPSPIN		Version 2.1
$$ ##JCAMPDX= 5.01
$$ ##ORIGIN= Bruker BioSpin GmbH
$$ ##OWNER= Administrator
$$ $$ C:\Bruker\TOPSPIN/data/COFFEE/nmr/AC1141_Costa_5906611_ch5y19DHjk/12/pdata/1/auditp.txt
$$ ##AUDIT TRAIL=  $$ (NUMBER, WHEN, WHO, WHERE, PROCESS, VERSION, WHAT)
(   1,<2012-04-04 17:18:05.000 -0500>,<Administrator>,<TOPSPIN>,<go>,<TOPSPIN 2.1>,
      <created by zg
	started at 2012-04-04 17:06:33.359 -0500,
	POWCHK enabled, PULCHK disabled,
       configuration hash MD5:
       1A 1E CE 29 27 FD 77 03 67 4E F0 E3 C4 B2 CB 90
       data hash MD5: 64K
       FA 74 E4 AA 38 86 B3 08 CD 14 5F BE 65 A7 AA 8C>)
(   2,<2012-04-04 17:18:07.953 -0500>,<Administrator>,<TOPSPIN>,<proc1d>,<TOPSPIN 2.1>,
      <Start of raw data processing
       efp LB = 0.3 FT_mod = 6 PKNL = 1 PHC0 = 0 PHC1 = 0 SI = 128K 
       data hash MD5: 128K
       13 A8 7A D6 CB A9 77 0A 20 5E B8 AE 41 1E 0A 45>)
(   3,<2012-04-04 17:18:09.093 -0500>,<Administrator>,<TOPSPIN>,<proc1d>,<TOPSPIN 2.1>,
      <pk PHC0 = 31.38245 PHC1 = 0 
       data hash MD5: 128K
       49 10 01 C3 62 8F 99 8D 6F 62 87 4C 24 66 BE B2>)
(   4,<2012-04-04 17:18:09.593 -0500>,<Administrator>,<TOPSPIN>,<proc1d>,<TOPSPIN 2.1>,
      <abs ABSG = 1 
       data hash MD5: 128K
       7E AB BF 9E 44 0A 54 47 C8 78 31 BF 0E FD 93 5A>)
(   5,<2012-04-04 17:18:09.671 -0500>,<Administrator>,<TOPSPIN>,<proc1d>,<TOPSPIN 2.1>,
      <abs ABSG = 2 
       data hash MD5: 128K
       D5 09 34 CF 6D 44 00 0F 11 13 36 77 C7 8E 76 8D>)
(   6,<2012-04-04 17:18:09.718 -0500>,<Administrator>,<TOPSPIN>,<proc1d>,<TOPSPIN 2.1>,
      <abs ABSG = 3 
       data hash MD5: 128K
       C0 6A E2 E3 FB CE D6 60 3D CE 3F 99 6A 91 8D EE>)
(   7,<2012-04-04 17:18:09.796 -0500>,<Administrator>,<TOPSPIN>,<proc1d>,<TOPSPIN 2.1>,
      <abs ABSG = 4 
       data hash MD5: 128K
       2B 25 42 34 7B E9 48 30 C3 8E EE 0F AB C1 ED EE>)
(   8,<2012-04-04 17:18:09.843 -0500>,<Administrator>,<TOPSPIN>,<proc1d>,<TOPSPIN 2.1>,
      <abs ABSG = 5 
       data hash MD5: 128K
       CA 0B 20 B7 ED C3 7E 4B 36 F2 C2 07 5F 7E 7A 00>)
(   9,<2012-04-04 17:18:10.062 -0500>,<Administrator>,<TOPSPIN>,<audit>,<TOPSPIN 2.1>,
      <user comment:
       ICON-NMR User ID: COFFEE
       data hash MD5: 128K
$$ [...]
##$TP07= 0
##$TPNAME0= <>
##$TPNAME1= <>
##$TPNAME2= <>
##$TPNAME3= <>
##$TPNAME4= <>
##$TPNAME5= <>
##$TPNAME6= <>
##$TPNAME7= <>
##$TPOAL= (0..7)
0.5 0.5 0.5 0.5 0.5 0.5 0.5 0.5
##$TPOFFS= (0..7)
0 0 0 0 0 0 0 0
##$TUNHIN= 0
##$TUNHOUT= 0
##$TUNXOUT= 0
##$USERA1= <user>
##$USERA2= <user>
##$USERA3= <user>
##$USERA4= <user>
##$USERA5= <user>
##$V9= 5
##$VALIST= <valist>
##$VCLIST= <CCCCCCCCCCCCCCC>
##$VD= 0
##$VDLIST= <DDDDDDDDDDDDDDD>
##$VPLIST= <PPPPPPPPPPPPPPP>
##$VTLIST= <TTTTTTTTTTTTTTT>
##$WBST= 2048
##$WBSW= 25
##$XGAIN= (0..3)
0 0 0 0
##$XL= 0
##$YL= 0
##$YMAX_a= 15047460
##$YMIN_a= -6732921
##$ZGOPTNS= <>
##$ZL1= 120
##$ZL2= 120
##$ZL3= 120
##$ZL4= 120
##$ABSF1= 14.9688
##$ABSF2= -5.583731
##$ABSG= 5
##$ABSL= 3
##$ALPHA= 0
##$AQORDER= 0
##$ASSFAC= 0
##$ASSFACI= 0
##$ASSFACX= 0
##$ASSWID= 0
##$AUNMP= <proc_prof1d_extract.lims>
##$AXLEFT= 0
##$AXNAME= <>
##$AXNUC= <1H>
##$AXRIGHT= 0
##$AXTYPE= 0
##$AXUNIT= <>
##$AZFE= 0.1
##$AZFW= 0.1
##$BCFW= 0
##$BC_mod= 0
##$BYTORDP= 0
##$COROFFS= 0
##$CY= 15
##$DATMOD= 1
##$DC= 0
##$DFILT= <>
##$DTYPP= 0
##$F1P= 0
##$F2P= 0
##$FCOR= 0.5
##$FTSIZE= 131072
##$FT_mod= 6
##$GAMMA= 0
##$GB= 0
##$INTBC= 1
##$INTSCL= 1
##$ISEN= 128
##$LB= 0.3
##$LEV0= 0
##$LPBIN= 0
##$MAXI= 10000
##$MC2= 0
##$MEAN= 0
##$ME_mod= 0
##$MI= 0
##$NCOEF= 0
##$NC_proc= -3
##$NLEV= 6
##$NOISF1= 0
##$NOISF2= 0
##$NSP= 0
##$NTH_PI= 0
##$NZP= 0
##$OFFSET= 14.9688
##$PC= 1
##$PHC0= 31.38245
##$PHC1= 0
##$PH_mod= 1
##$PKNL= yes
##$PPARMOD= 0
##$PPDIAG= 0
##$PPIPTYP= 0
##$PPMPNUM= 2147483647
##$PPRESOL= 1
##$PSCAL= 4
##$PSIGN= 0
##$PYNMP= <proc.py>
##$REVERSE= no
##$SF= 400.130004725357
##$SI= 131072
##$SIGF1= 0
##$SIGF2= 0
##$SINO= 400
##$SIOLD= 131072
##$SPECTYP= <>
##$SREGLST= <1H.CDCl3>
##$SSB= 0
##$STSI= 131072
##$STSR= 0
##$SW_p= 8223.68421052632
##$SYMM= 0
##$S_DEV= 0
##$TDeff= 65536
##$TDoff= 0
##$TI= <>
##$TILT= no
##$TM1= 0
##$TM2= 0
##$TOPLEV= 0
##$USERP1= <user>
##$USERP2= <user>
##$USERP3= <user>
##$USERP4= <user>
##$USERP5= <user>
##$WDW= 1
##$XDIM= 131072
##$YMAX_p= 508405334
##$YMIN_p= -363946568
##$CURPLOT= <Network HP LaserJet P1505>
##$CURPRIN= <$Network HP LaserJet P1505>
##$DFORMAT= <normdp>
##$LAYOUT= <+/1D_H.xwp>
##$LFORMAT= <normlp>
##$PFORMAT= <normpl>
##$SURQMSG= 1
$$ End of Bruker specific parameters
$$ ---------------------------------
##NTUPLES= NMR SPECTRUM
##VAR_NAME=  FREQUENCY,     SPECTRUM/REAL,   SPECTRUM/IMAG
##SYMBOL=    X,             R,               I
##VAR_TYPE=  INDEPENDENT,   DEPENDENT,       DEPENDENT
##VAR_FORM=  AFFN,          ASDF,            ASDF
##VAR_DIM=   131072,        131072,          131072
##UNITS=     HZ,            ARBITRARY UNITS, ARBITRARY UNITS
##FACTOR=    0.0627417313425165, 1,          1
##FIRST=     8223.62146879498, 4438,         -101184
##LAST=      0,             6720,            -100700
##MIN=       0,             -363946568,      0
##MAX=       8223.62146879498, 508405334,    0
$$ Real data points
##PAGE= N=1
##DATA TABLE= (X++(R..R)), XYDATA
$$ [...]
60628A611309R646J1386J2689J2913J1147P833N061M153L692J396k687o526r214
$$ 1611309 1620955 1632341 1645030 1657943 1669090 1676923 1681984 1686137 1689829 1691225 1688538 1682012 1672798
60615A672798j1683j4333j6169j6843j7589j9128k0410k0465j9942j9555j8401
$$ 1672798 1661115 1646782 1630613 1613770 1596181 1577053 1556643 1536178 1516236 1496681 1478280
60604A478280j5361j1254q239p608q965j0912j1781j0704q748q036q996r669q532
$$ 1478280 1462919 1451665 1443426 1435818 1426853 1415941 1404160 1393456 1384708 1376672 1367676 1358007 1349475
60591A349475o662n900o248o456o056n261l921k107r83j424k483k790k642l092
$$ 1349475 1342813 1336913 1330665 1324209 1318153 1312892 1308971 1306864 1305881 1304457 1301974 1299184 1296542 1293450
60577A293450l572k384O86L959O001O719O519N934O061P885J0959J3910J6253
$$ 1293450 1289878 1287494 1288180 1292139 1298140 1304859 1311378 1317312 1323373 1331258 1342217 1356127 1372380
60564A372380J8622K1228K3407K4850K6112K7693K9508L1448L3641L6082L8666
$$ 1372380 1391002 1412230 1435637 1460487 1486599 1514292 1543800 1575248 1608889 1644971 1683637
60553A683637M1433M4117M5687M5232M3185M0861L8835L6488L3029K8238K2290
$$ 1683637 1725070 1769187 1814874 1860106 1903291 1944152 1982987 2019475 2052504 2080742 2103032
60542B103032J5377P565j129j0194j8231k4002k7965l1552l4638l5449l3560l0958
$$ 2103032 2118409 2125974 2124845 2114651 2096420 2072418 2044453 2012901 1978263 1942814 1909254 1878296
60530A878296k8927k6122k1596j7643j6859j7860j7019j3625j0237q418p361o691
$$ 1878296 1849369 1823247 1801651 1784008 1767149 1749289 1732270 1718645 1708408 1699990 1692629 1685938
60518A685938p290q664q689p090o375p866r322q254n518l536k569r26K099N495
$$ 1685938 1678648 1669984 1661295 1654205 1647830 1639964 1630642 1622388 1616870 1613334 1610765 1609839 1611938 1617433
60504A617433Q328J0583J2328J3364J3772J4003J4399J5090J6293J8210K0805
$$ 1617433 1625761 1636344 1648672 1662036 1675808 1689811 1704210 1719300 1735593 1753803 1774608
60493A774608K3813K6811K9207L0712L1880L3808L7117M1583M6602N1560N6022
$$ 1774608 1798421 1825232 1854439 1885151 1917031 1950839 1987956 2029539 2076141 2127701 2183723
60482B183723O0217O5079P1033P7014Q1394Q3354Q2307P6675O4993M8140K8899
$$ 2183723 2243940 2309019 2380052 2457066 2538460 2621814 2704121 2780796 2845789 2893929 2922828
60471B922828R279j0134k8062m1879n0023n3591n4477n3055m8669m1410l2421
$$ 2922828 2932107 2921973 2893911 2852032 2802009 2748418 2693941 2640886 2592217 2550807 2518386
60460B518386k2976j3930n534K735J1558K0504K8099L3482L7316M0786M4515M8923
$$ 2518386 2495410 2481480 2475946 2478681 2490239 2510743 2538842 2572324 2609640 2650426 2694941 2743864
60448B743864N4674O2113P0824Q0247R0386J01829J15675J33351J55420J80393
$$ 2743864 2798538 2860651 2931475 3011722 3102108 3203937 3319612 3452963 3608383 3788776
60438C788776K05828K30996K57451K86642L17978L49608L79910M07658M31924
$$ 3788776 3994604 4225600 4483051 4769693 5087671 5437279 5817189 6224847 6656771
60429F656771M52723M70533M83833M87221M72835M33789L66734K72626J56392
$$ 6656771 7109494 7580027 8063860 8551081 9023916 9457705 9824439 10097065 10253457
60420A0253457K5901j09288k38820l52522m42475n05007n40527n51623n42208
$$ 10253457 10279358 10170070 9931250 9578728 9136253 8631246 8090719 7539096 6996888
60411F996888n17840m84868m48242m10800l74527l40930l09824k79696k50278
$$ 6996888 6479048 5994180 5545938 5135138 4760611 4419681 4109857 3830161 3579883
60402C579883k23444k00585j80541j61491j43700j28750j16747j05942r5100q4904
$$ 3579883 3356439 3155854 2975313 2813822 2670122 2541372 2424625 2318683 2223583 2138679
60392B138679p6793p1082o6487o1317n5224m9764m6714m5875m5312m3759m1639
$$ 2138679 2061886 1990804 1924317 1863000 1807776 1758012 1711298 1665423 1620111 1576352 1534713
60381A534713l9534l7011l3680l0239k7488k5254k3078k1079j9391j7659j5963
$$ 1534713 1495179 1458168 1424488 1394249 1366761 1341507 1318429 1297350 1277959 1260300 1244337
60370A244337j5163j5334j4892j2605r590p970q041q090o687l850l58K852M772
$$ 1244337 1229174 1213840 1198948 1186343 1176753 1168783 1160742 1152652 1145965 1142115 1141757 1144609 1149381
60357A149381N049M656M884N832O653P070P510P941P825P320P426Q541R756R912
$$ 1149381 1154430 1159086 1163970 1169802 1176455 1183525 1191035 1198976 1206801 1214121 1221547 1230088 1239844 1249756
60343A249756Q736O679M414K890L069M852O637O806N600M840N597O858P077O446
$$ 1249756 1258492 1265171 1269585 1272475 1275544 1280396 1287033 1293839 1299439 1304279 1309876 1316734 1323811 1330257
60329A330257O563P891Q883Q287P043O823P455P285N629L326J058j268l310m108
$$ 1330257 1336820 1344711 1353594 1361881 1368924 1375747 1383202 1390487 1396116 1399442 1400500 1399232 1395922 1391814
60315A391814l520k570j884j152m08l00m67N78L026M881M762M152N226P584Q918
$$ 1391814 1388294 1385724 1383840 1382688 1382280 1381980 1381513 1382091 1385117 1389998 1394760 1398912 1404138 1411722 1420640
60300A420640Q365P341P273P983Q524Q526Q470R139J0763J2433J2921J2358J2296
$$ 1420640 1429005 1436346 1443619 1451602 1460126 1468652 1477122 1486261 1497024 1509457 1522378 1534736 1547032
60287A547032J3460J4520J4064J2652J1664J1014R662P824O874P148P480P169
$$ 1547032 1560492 1575012 1589076 1601728 1613392 1624406 1634068 1641892 1648766 1655914 1663394 1670563
60275A670563O928P411Q052Q069P812Q373J0176J2413J3845J3954J3353J2953
$$ 1670563 1677491 1684902 1692954 1701023 1708835 1717208 1727384 1739797 1753642 1767596 1780949 1793902
60263A793902J2750J1751R261N719K014j506m937q266j1293j3697j4969j4844
$$ 1793902 1806652 1818403 1827664 1833383 1835397 1833891 1828954 1820688 1809395 1795698 1780729 1765885
60251A765885j3941j3120j2039r604o175l797l311k912j021R35N95j556k777j892
$$ 1765885 1751944 1738824 1726785 1717181 1711006 1707209 1703898 1700986 1699965 1700900 1701495 1699939 1697162 1695270
60237A695270k53J004K379M223N606N805N370M955M363L493K971K963K517J133
$$ 1695270 1695017 1696021 1698400 1702623 1708229 1714034 1719404 1724359 1728722 1732215 1735186 1738149 1740666 1741799
60223A741799R6J096L983O962Q766R713J0680J1908J3063J4012J5156J7048J9904
$$ 1741799 1741895 1742991 1746974 1753936 1762702 1772415 1783095 1795003 1808066 1822078 1837234 1854282 1874186
60210A874186K3524K7501L1322L4347L6154L7171L8609M1427M5522N0119N4684
$$ 1874186 1897710 1925211 1956533 1990880 2027034 2064205 2102814 2144241 2189763 2239882 2294566
60199B294566N9161O3668O8367P3525P9333Q5750R2574R9525J06246J12765J19993
$$ 2294566 2353727 2417395 2485762 2559287 2638620 2724370 2816944 2916469 3022715 3135480 3255473
60188C255473J29080J40046J51788J63648J76028J88907K00855K10465K18053
$$ 3255473 3384553 3524599 3676387 3840035 4016063 4204970 4405825 4616290 4834343
60179D834343K24897K31209K35759K37047K34087K26574K15204K01476J86291
$$ 4834343 5059240 5290449 5526208 5763255 5997342 6223916 6439120 6640596 6826887
60170F826887J69143J49357J27541J04861Q1574N7447L3229J0547r437k6210l9162
$$ 6826887 6996030 7145387 7272928 7377789 7459363 7516810 7550039 7560586 7551149 7524939 7485777
60159G485777m7893n2900n4819n3191m7229l7512k5521j1693M612K3256M3034
$$ 7485777 7437884 7384984 7330165 7276974 7229745 7192233 7166712 7155019 7159631 7182887 7225921
60148G225921O3337Q4590J06652J28245J48543J67900J86404K02828K15657K24024
$$ 7225921 7289258 7373848 7480500 7608745 7757288 7925188 8111592 8314420 8530077 8754101
60138H754101K27038K23533K13432J98398J80020J58169J32167J02883P2292M1316
$$ 8754101 8981139 9204672 9418104 9616502 9796522 9954691 10086858 10189741 10262033 10303349
60128A0303349R422k3513n5880q5275j10063j29618j43673j52128j55363j54045
$$ 10303349 10312771 10289258 10233378 10148103 10038040 9908422 9764749 9612621 9457258 9303213
60118I303213j48204j36930j19611r7417p2951m8214k3371K379K9336N6925Q3875
$$ 9303213 9155009 9018079 8898468 8801051 8728100 8679886 8656515 8658894 8688230 8745155 8829030
60107H829030J08287J28135J42467J51615J55811J54396J47163J35494J21098
$$ 8829030 8937317 9065452 9207919 9359534 9515345 9669741 9816904 9952398 10073496
60098A0073496J04334Q5150O4972M6088K9540J5175L593l834o934o730k886O927
$$ 10073496 10177830 10262980 10327952 10374040 10403580 10418755 10422348 10418514 10411580 10404850 10401964 10408891
60086A0408891K4022M6384P0690R5747J22699J52553J84775K18244K52552K88039
$$ 10408891 10432913 10479297 10549987 10645734 10768433 10920986 11105761 11324005 11576557 11864596
60076A1864596L25106L63725M03581M44639M87213N31074N74635O15449O51388
$$ 11864596 12189702 12553427 12957008 13401647 13888860 14419934 14994569 15610018 16261406
60067A6261406O80896P02571P15518P19911P15995P02282O75923O35470N82319
$$ 16261406 16942302 17644873 18360391 19080302 19796297 20498579 21174502 21809972 22392291
60058B2392291N19010M46897L66283K78106J84520Q7929r929j07789k03894k95209
$$ 22392291 22911301 23358198 23724481 24002587 24187107 24275036 24265107 24157318 23953424 23658215
60048B3658215l77881m48945n07303n52474n82959n96955n94681n78581n50989
$$ 23658215 23280334 22831389 22324086 21771612 21188653 20591698 19997017 19418436 18867447
60039A8867447n12863m65433m11634l54685k96082k36119j75942j17802o3474
$$ 18867447 18354584 17889151 17477517 17122832 16826750 16590631 16414689 16296887 16233413
60030A6233413j3512L1708P0987J02692J25698J39528J43794J37920J21886R7213
$$ 16233413 16219901 16251609 16322596 16425288 16550986 16690514 16834308 16972228 17094114 17191327
60020A7191327O6784L3252k192l9183p6900j14171j50538j86152k20480k52101
$$ 17191327 17258111 17291363 17289171 17249988 17173088 17058917 16908379 16722227 16501747 16249646
60010A6249646k80068l04539l25619l42357l53436l58319l57292l50896l39727
$$ 16249646 15969578 15665039 15339420 14997063 14643627 14285308 13928016 13577120 13237393
60001A3237393l24330l04859k81222k53827k23730j91839j58401j23493q7433
$$ 13237393 12913063 12608204 12326982 12073155 11849425 11657586 11499185 11375692 11288259
59992A1288259n0611j3624K2240N5621Q6651J16906J46922J74494J96333K10896
$$ 11288259 11237648 11224024 11246264 11301885 11388536 11505442 11652364 11826858 12023191 12234087
59982A2234087K18618K19786K13427J98464J75213J45411J11135P3757L3783q380
$$ 12234087 12452705 12672491 12885918 13084382 13259595 13405006 13516141 13589898 13623681 13615301
59972A3615301n1461r3504j33096j69742k02549k29276k47685k57680k61163k59631
$$ 13615301 13563840 13470336 13337240 13167498 12964949 12735673 12487988 12230308 11969145 11709514
59962A1709514k52774k39775k21235j99145j75250j50022j23112r4216o3469l1429
$$ 11709514 11456740 11216965 10995730 10796585 10621335 10471313 10348201 10253985 10190516 10159087
59952A0159087J055L3301O5399R8130J31949J66189J99618K31465K61243K87694
$$ 10159087 10160142 10193443 10258842 10356972 10488921 10655110 10854728 11086193 11347436 11635130
59942A1635130L08822L23196L30412L29911L20315L00793K72448K37419J97011
$$ 11635130 11943952 12267148 12597560 12927471 13247786 13548579 13821027 14058446 14255457
59933A4255457J51729J02735N2096J451m8481r6825j41857j81716k15080k40767
$$ 14255457 14407186 14509921 14562017 14563468 14514987 14418162 14276305 14094589 13879509 13638742
59923A3638742k57279k63387k58996k45288k24261j98045j68258j35776j01202
$$ 13638742 13381463 13118076 12859080 12613792 12389531 12191486 12023228 11887452 11786250
59914A1786250o5409k9330O447M1329P4184J03750J29418J51124J68716J82129
$$ 11786250 11720841 11691511 11697958 11739287 11813471 11917221 12046639 12197763 12366479 12548608
59904A2548608J91959J99003K03215K03850K00612J93974J84437J72350J58388
$$ 12548608 12740567 12939570 13142785 13346635 13547247 13741221 13925658 14098008 14256396
59895A4256396J43333J27420J10896R5339Q3275P6059P3045P3342P7639Q7768
$$ 14256396 14399729 14527149 14638045 14733384 14816659 14892718 14965763 15039105 15116744 15204512
59885A5204512J05129J30045J62074K00354K43980K92375L45101M01221M59261
$$ 15204512 15309641 15439686 15601760 15802114 16046094 16338469 16683570 17084791 17544052
59876A7544052N17847N75758O31162O81482P24212P57193P77655P81455P63919
$$ 17544052 18061899 18637657 19268819 19950301 20674513 21431706 22209361 22990816 23754735
59867B3754735P21558O53248N60260M45410L12196J65042J0430j42989k86629
$$ 23754735 24476293 25129541 25689801 26135211 26447407 26612449 26622879 26479890 26193261
59858B6193261m14430n22926o09758o73375p13879p32838p32133p13992o81934
$$ 26193261 25778831 25255905 24646147 23972772 23258893 22526055 21793922 21079930 20397996
59849B0397996o40161n91432n36513m76032m11765l45771k79323k13282j48563
$$ 20397996 19757835 19166403 18629890 18153858 17742093 17396322 17116999 16903717 16755154
59840A6755154q5689k4738L3707Q8197J37411J80881K18201K47971K67952K75930
$$ 16755154 16669465 16644727 16678434 16766631 16904042 17084923 17303124 17551095 17819047 18094977
59830A8094977K70371K50615K16421J67188J02392K3669o4176j55331k45636l31975
$$ 18094977 18365348 18615963 18832384 18999572 19101964 19125633 19061457 18906126 18660490 18328515
59820A8328515m10094m75445n26208n63451n88073n99630n98480n86884n67120
$$ 18328515 17918421 17442976 16916768 16353317 15765244 15165614 14567134 13980250 13413130
59811A3413130n40407n08367m73456m37060l99140l60803l25078k93755k65504
$$ 13413130 12872723 12364356 11890900 11453840 11054700 10693897 10368819 10075064 9809560
59802I809560k38839k14972j95832j80971j68704j58924j52431j48383j44672
$$ 9809560 9570721 9355749 9159917 8978946 8810242 8651318 8498887 8350504 8205832
59793H205832j40197j34712j27221j16751j04323r2065q0653o9580n9574n2576
$$ 8205832 8065635 7930923 7803702 7686951 7582628 7490563 7409910 7340330 7280756 7228180
59783G228180m9304m8909n1210n7054o5995p5465q3116q8429r1425r1391q7981
$$ 7228180 7178876 7129967 7078757 7021703 6955708 6880243 6797127 6708698 6617273 6525882 6437901
59772F437901q2392p6223o9644o1556n1106l8475k4608j0744J950J2879K2331
$$ 6437901 6355509 6279286 6209642 6148086 6096980 6058505 6033897 6023153 6025103 6037982 6060313
59761F060313L1314M0916N1565O2737P3612Q4077R4622J05062J14057J20213J23076
$$ 6060313 6091627 6132543 6184108 6246845 6320457 6404534 6499156 6604218 6718275 6838488 6961564
59750F961564J22772J19530J14026J07146R8722Q7630P4180O1284N1844M5705
$$ 6961564 7084336 7203866 7317892 7425038 7523760 7611390 7685570 7746854 7798698 7844403
59740G844403M0774L6550L5005L8266M6818N9744P5409R2133J09581J29416J53383
$$ 7844403 7885177 7921727 7956732 7994998 8041816 8101560 8176969 8269102 8378683 8508099 8661482
59729H661482J81178K11448K44230K80499L19713L60197M02109M47621M97239
$$ 8661482 8842660 9054108 9298338 9578837 9898550 10258747 10660856 11108477 11605716
59720A1605716N47926N95825O38837O74855O98677P02234O77095O16268N15936
$$ 11605716 12153642 12749467 13388304 14063159 14761836 15464070 16141165 16757433 17273369
59711A7273369L78909K17105M8926j07301k38458l37723m03654m39218m50281
$$ 17273369 17652278 17869383 17918309 17811008 17572550 17234827 16831173 16391955 15941674
59702A5941674m43112m22492l91716l53751l11802k68620k25567j82621j39475
$$ 15941674 15498562 15076070 14684354 14330603 14018801 13750181 13524614 13341993 13202518
59693A3202518r6615n5156j5663K2537O0700R9425J38176J76039K12961K50235
$$ 13202518 13105903 13050747 13035084 13057621 13118321 13217746 13355922 13531961 13744922 13995157
59683A3995157K89530L31318L74542M18179M62813N10115N60926O14555O70184
$$ 13995157 14284687 14616005 14990547 15408726 15871539 16381654 16942580 17557135 18227319
59674A8227319P28115P89139Q53079R18795R85475J053085J121112J187293J248200
$$ 18227319 18955434 19744573 20597652 21516447 22501922 23555007 24676119 25863412 27111612
59665B7111612J300776J342724J371706J385212J381692J361334J325575J276957
$$ 27111612 28412388 29755112 31126818 32512030 33893722 35255056 36580631 37857588
59657C7857588J220187J162292J110350J069314J042766J034290J045534J072931
$$ 37857588 39077775 40240067 41350417 42419731 43462497 44496787 45542321 46615252
59649D6615252J108757J146263J181910J211865J228838J224454J193351J133278
$$ 46615252 47724009 48870272 50052182 51264047 52492885 53717339 54910690 56043968
59641E6043968J042966R22925P77980O16487M46638K75507J11600l4418j53274
$$ 56043968 57086934 58009859 58787839 59404326 59850964 60126471 60238071 60203653 60050379
59632F0050379k40321k94549l15848l04666k63280j95506j04997N300J32169K71797
$$ 60050379 59810058 59515509 59199661 58894995 58631715 58436209 58331212 58336512 58468681 58740478
59622E8740478M20797N76885P38081R01686J064254J221799J369019J498266J600118
$$ 58740478 59161275 59738160 60476241 61377927 62442181 63663980 65032999 66531265 68131383
59613F8131383J665087J684121J647371J543947J364840J107034P75509L82968
$$ 68131383 69796470 71480591 73127962 74671909 76036749 77143783 77919292 78302260
59605G8302260n0858n00560r38547j339639j683770j956786k151720k270169k320695
$$ 78302260 78251402 77750842 76812295 75472656 73788886 71832100 69680380 67410211 65089516
59596F5089516k314457k262505k176680k070729j959032j855123j771873j720809
$$ 65089516 62775059 60512554 58335874 56265145 54306113 52450990 50679117 48958308
59588D8958308j708253j731295j777976j831510j875285j896877j890640j857542
$$ 48958308 47250055 45518760 43740784 41909274 40033989 38137112 36246472 34388930
59580C4388930j802105j729298j643732j550040j452416j353984j257019j163153
$$ 34388930 32586825 30857527 29213795 27663755 26211339 24857355 23600336 22437183
59572B2437183j072946r86351r04151q27902p57874o92533o31088n74929n25117
$$ 22437183 21364237 20377886 19473735 18645833 17887959 17195426 16564338 15989409 15464292
59563A5464292m79866m36460l94750l56748l23357k93511k66404k42705k23372
$$ 15464292 14984426 14547966 14153216 13796468 13473111 13179600 12913196 12670491 12447119
59554A2447119k08619j98410j92843j91673j93964j98241k02892k07049k11367
$$ 12447119 12238500 12040090 11847247 11655574 11461610 11263369 11060477 10853428 10642061
59545A0642061k16866k22510k25273k23484k18639k12828k05933j96829j85667
$$ 10642061 10425195 10202685 9977412 9753928 9535289 9322461 9116528 8919699 8734032
59536H734032j73041j58426j41710j24953j10093r5898p9923o2704m7034l3565
$$ 8734032 8560991 8402565 8260855 8135902 8025809 7929911 7849988 7787284 7740250 7706685
59526G706685k0295o601N412J4403K1949L0121L9078M8042N6622O4141O9492P2917
$$ 7706685 7686390 7679789 7685201 7699604 7721553 7751674 7790752 7838794 7895416 7959557 8029049 8101966
59514H101966P6547Q2162Q9667R8483J09070J22133J37337J53705J70568J87756
$$ 8101966 8178513 8260675 8350342 8448825 8557895 8680028 8817365 8971070 9141638 9329394
59504I329394K05749K25803K48849K74078K99584L24575L49945L76763M05335
$$ 9329394 9535143 9760946 10009795 10283873 10583457 10908032 11257977 11634740 12040075
59495A2040075M35495M66377M96117N23292N48299N71646N91421O04692O11212
$$ 12040075 12475570 12941947 13438064 13961356 14509655 15081301 15672722 16277414 16888626
59486A6888626O13030O10357O00634N82525N58002N29403M97132M61741M25723
$$ 16888626 17501656 18112013 18712647 19295172 19853174 20382577 20879709 21341450 21767173
59477B1767173L90994L56306L19446K80877K43703K11167J85755J69335J61980
$$ 21767173 22158167 22514473 22833919 23114796 23358499 23569666 23755421 23924756 24086736
59468B4086736J61201J63935J68805J75236J81083J82556J75982J58420J27069
$$ 24086736 24247937 24411872 24580677 24755913 24936996 25119552 25295534 25453954 25581023
59459B5581023P9623J5602o3139j53070k49922l49608m48573n42847o27146o96511
$$ 25581023 25660646 25676248 25613109 25460039 25210117 24860509 24411936 23869089 23241943 22545432
59449B2545432p49318p87181q11333q20778q14996p96530p69176p34921o94354
$$ 22545432 21796114 21008933 20197600 19376822 18561826 17765296 16996120 16261199 15566845
59440A5566845o49135o01923n54145n05575m56267m07621l61399l18538k78875
$$ 15566845 14917710 14315787 13761642 13256067 12799800 12392179 12030780 11712242 11433367
59431A1433367k41225k03878j65875j27942r1699n7957k6056N363L7331P0061
$$ 11433367 11192142 10988264 10822389 10694447 10602748 10544791 10518735 10524098 10561429 10631490
59421A0631490J03228J36756J71066K06039K40236K72231L02598L33035L63296
$$ 10631490 10734718 10871474 11042540 11248579 11488815 11761046 12063644 12396679 12759975
59412A2759975L90548M12388M28914M40691M45926M41062M23428L92116L46968
$$ 12759975 13150523 13562911 13991825 14432516 14878442 15319504 15742932 16135048 16482016
59403A6482016K88169K16856J35376M6900m4836j36037k23635l05198l77807m38015
$$ 16482016 16770185 16987041 17122417 17169317 17124481 16988444 16764809 16459611 16081804 15643789
59393A5643789m83755n15740n36164n46459n46991n38481n22835n02500m79475
$$ 15643789 15160034 14644294 14108130 13561671 13014680 12476199 11953364 11450864 10971389
59384A0971389m54770m28642m01311l73447l45684l18077k90648k64232k39811
$$ 10971389 10516619 10087977 9686666 9313219 8967535 8649458 8358810 8094578 7854767
59375G854767k17183j95300j73868j53502j34256j15395r6925p9937o4948n0980
$$ 7854767 7637584 7442284 7268416 7114914 6980658 6865263 6768338 6688401 6623453 6572473
59365F572473l6988k3123j0032K148J3533K4092L4014M3707N3019O1236O8365
$$ 6572473 6535485 6512362 6502330 6504478 6518011 6542103 6576117 6619824 6672843 6734079 6802444
59354F802444P5664Q4547R5200J06021J13892J15963J12673J08792J09856J17583
$$ 6802444 6878108 6962655 7057855 7163876 7277768 7393731 7506404 7615196 7725052 7842635
59344G842635J30041J45652J64905J88360K15357K45009K76217L06457L33098
$$ 7842635 7972676 8118328 8283233 8471593 8686950 8931959 9208176 9514633 9847731
59335I847731L56782L81475M10649M45550M87246N37038N93559O52650P11893
$$ 9847731 10204513 10585988 10996637 11442187 11929433 12466471 13060030 13712680 14424573
59326A4424573P72779Q36656R01154R62569J019017J068631J107025J129522J134376
$$ 14424573 15197352 16034008 16935162 17897731 18916748 19985379 21092404 22221926 23356302
59317B3356302J121318J088898J036482R67768Q89142Q05053P17379O28289N40802
$$ 23356302 24477620 25566518 26603000 27570768 28459910 29264963 29982342 30610631 31151433
59308C1151433M56747L76582L00774K28899J57668Q2511J500q4040j72450k63011
$$ 31151433 31608180 31984762 32285536 32514435 32672103 32754614 32756114 32672074 32499624 32236613
59298C2236613l54030m41722n21576n89871o44136o83660p09746p24467p29660
$$ 32236613 31882583 31440861 30919285 30329414 29685278 29001618 28291872 27567405 26837745
59289B6837745p28155p24976p25250p30983p41196p54555p69968p85067p96327
$$ 26837745 26109590 25384614 24659364 23928381 23187185 22432630 21662662 20877595 20081268
59280B0081268q01193p98931p89475p72972p50459p23446o92565o57815o20009
$$ 20081268 19280075 18481144 17691669 16918697 16168238 15444792 14752227 14094412 13474403
59271A3474403n80917n41961n03803m66840m31039l95535l59772l24909k93023
$$ 13474403 12893486 12351525 11847722 11380882 10949843 10554308 10194536 9869627 9576604
59262I576604k64976k39908k16421j93514j70936j49665j31319j15986j01352
$$ 9576604 9311628 9071720 8855299 8661785 8490849 8341184 8209865 8093879 7992527
59253G992527q5233o8133n2034l7528k3737j0215K975J6429L0715M4910N7805
$$ 7992527 7907294 7839161 7787127 7749599 7725862 7715647 7718622 7735051 7765766 7810676 7868481
59242G868481P0377Q4936J01728J18366J33180J47308J62705J79422J95778K10452
$$ 7868481 7938858 8023794 8125522 8243888 8377068 8524376 8687081 8866503 9062281 9272733
59232I272733K23493K35530K46553K55703K62433K67481K71862K74942K74868
$$ 9272733 9496226 9731756 9978309 10234012 10496445 10763926 11035788 11310730 11585598
59223A1585598K71287K66142K61029K55315K47972K39584K30906K20731K06787
$$ 11585598 11856885 12123027 12384056 12639371 12887343 13126927 13357833 13578564 13785351
59214A3785351J87638J62236J29178Q8474M3056l521m9975r6058j39684j77790
$$ 13785351 13972989 14135225 14264403 14352877 14395933 14392412 14342437 14246379 14106695 13928905
59204A3928905k09198k34294k52461k62454k64867k61682k53387k38982k18977
$$ 13928905 13719707 13485413 13232952 12970498 12705631 12443949 12190562 11951580 11732603
59195A1732603j96036j72132j47074j20200r1774o2204l1519l8L1550O2906R3987
$$ 11732603 11536567 11364435 11217361 11097161 11005387 10943183 10911664 10911626 10943176 11006082 11100069
59184A1100069J24558J54910J86263K19031K51368K81145L08711L35999L63723
$$ 11100069 11224627 11379537 11565800 11784831 12036199 12317344 12626055 12962054 13325777
59175A3325777L91437M19690M49634M80847N11697N41594N70540N96752O17094
$$ 13325777 13717214 14136904 14586538 15067385 15579082 16120676 16691216 17287968 17905062
59166A7905062O29718O33805O26441O02280N56948M89203L99997K91528J67464
$$ 17905062 18534780 19168585 19795026 20397306 20954254 21443457 21843454 22134982 22302446
59157B2302446L2025j11303k58393m02191n34266o48846p43433q15915q64081
$$ 22302446 22334471 22223168 21964775 21562584 21028318 20379472 19636039 18820124 17956043
59148A7956043q88388q92529q80533q55250q19838p78012p32035o82666o31628
$$ 17956043 17067655 16175126 15294593 14439343 13619505 12841493 12109458 11426792 10795164
59139A0795164n81814n34577m89344m46512m08084l74471l43373l13264k85636
$$ 10795164 10213350 9678773 9189429 8742917 8334833 7960362 7616989 7303725 7018089
59130G018089k62348k42772k25185k09108j94705j81366j68475j56420j45608
$$ 7018089 6755741 6512969 6287784 6078676 5883971 5702605 5534130 5377710 5232102
59121E232102j35545j25864j17071j09369j01915r4046q6081p8249p0070o1507
$$ 5232102 5096557 4970693 4853622 4744253 4642338 4548292 4462211 4383962 4313892 4252385
59111D252385n3463m6398l9599l2387k4947j7526r994k616M115J0649J8041K6150
$$ 4252385 4198922 4152524 4112925 4080538 4055591 4038065 4028071 4025455 4029570 4040219 4058260 4084410
59099D084410L3632M0073M6520N3659O0954O8008P5108Q2150Q8495R4270J00193
$$ 4084410 4118042 4158115 4204635 4258294 4319248 4387256 4462364 4544514 4633009 4727279 4827472
59088D827472J06017J10936J15605J21794J29575J36967J42797J48008J53592
$$ 4827472 4933489 5044425 5160030 5281824 5411399 5548366 5691163 5839171 5992763
59079E992763J59278J64792J70488J76004J80133J82691J84717J86394J86643
$$ 5992763 6152041 6316833 6487321 6663325 6843458 7026149 7210866 7397260 7583903
59070G583903J85132J82688J79251J73750J66669J60549J57120J55907J56221
$$ 7583903 7769035 7951723 8130974 8304724 8471393 8631942 8789062 8944969 9101190
59061I101190J58462J62826J69007J77825J90839K07596K25546K43334K61677
$$ 9101190 9259652 9422478 9591485 9769310 9960149 10167745 10393291 10636625 10898302
59052A0898302K80295K96731L09253L18205L23049L20627L07733K83061K45537
$$ 10898302 11178597 11475328 11784581 12102786 12425835 12746462 13054195 13337256 13582793
59043A3582793J93717J28694N5394k0817r6609j68696k32329k84024l23677l52082
$$ 13582793 13776510 13905204 13960598 13939781 13843172 13674476 13442147 13158123 12834446 12482364
59033A2482364l68585l73090l68088l56563l39731l18649k95827k73107k49980
$$ 12482364 12113779 11740689 11372601 11016038 10676307 10357658 10061831 9788724 9538744
59024I538744k26202k03988j85442j69810j55822j44865j39086j37789j38391
$$ 9538744 9312542 9108554 8923112 8753302 8597480 8452615 8313529 8175740 8037349
59015H037349j39981j43549j49509j56995j64904j72026j77092j80004j81876
$$ 8037349 7897368 7753819 7604310 7447315 7282411 7110385 6933293 6753289 6571413
59006F571413j82860j81573j77647j72608j66909j58741j47670j36771j28560
$$ 6571413 6388553 6206980 6029333 5856725 5689816 5531075 5383405 5246634 5118074
58997E118074j21315j12291j02421r4708q9851q6792q5979q8556r3236r7351j00385
$$ 5118074 4996759 4884468 4782047 4687339 4597488 4510696 4424717 4336161 4242925 4145574 4045189
58986D045189j03585j06678j07856j06462j03110r7730r0194q2259p6053p1051
$$ 4045189 3941604 3834926 3727070 3620608 3517498 3419768 3329574 3247315 3171262 3100211
58976C100211o5153n8379n2679m8261m2983l5800k8372k2636j8707j5591j2441
$$ 3100211 3035058 2976679 2924000 2875739 2832756 2796956 2768584 2745948 2727241 2711650 2699209
58965B699209q919n527l615l866n123n847o072o608p057o206l881j018J554L325
$$ 2699209 2690290 2684763 2681148 2677282 2672159 2666312 2660240 2653632 2646575 2640369 2636488 2635470 2637024 2640349
58951B640349L940M016N102P618J0069J1469J2914J5293J7381J8032J8429J9880
$$ 2640349 2644289 2648305 2653407 2661025 2671094 2682563 2695477 2710770 2728151 2746183 2764612 2784492
58939B784492K1359K1729K2570K5740K9655L1376L1202L1801L3501L4106L3142
$$ 2784492 2805851 2827580 2850150 2875890 2905545 2936921 2968123 2999924 3033425 3067531 3100673
58928C100673L2789L4352L6820L9308M2181M5280M7487M8569M9457N0402N0858
$$ 3100673 3133462 3167814 3204634 3243942 3286123 3331403 3378890 3427459 3476916 3527318 3578176
58917C578176N1212N2657N5326N8392O1844O6176P0661P4148P7357Q2076Q8207
$$ 3578176 3629388 3682045 3737371 3795763 3857607 3923783 3994444 4068592 4145949 4228025 4316232
58906D316232R3893R8504J03121J07968J11748J13915J15521J17357J19049J20338
$$ 4316232 4410125 4508629 4611750 4719718 4831466 4945381 5060902 5178259 5297308 5417646
58896E417646J21579J22881J24345J27131J32548J40263J48932J58394J69523
$$ 5417646 5539225 5662106 5786451 5913582 6046130 6186393 6335325 6493719 6663242
58887F663242J82336J96029K10513K26168K42601K59566K78331L00006L23339
$$ 6663242 6845578 7041607 7252120 7478288 7720889 7980455 8258786 8558792 8882131
58878H882131L46585L70714L97892M27433M56749M86305N20039N59992O03663
$$ 8882131 9228716 9599430 9997322 10424755 10881504 11367809 11887848 12447840 13051503
58869A3051503O48011O93442P42360P95782Q52923R12634R74103J037064J101827
$$ 13051503 13699514 14392956 15135316 15931098 16784021 17696655 18670758 19707822 20809649
58860B0809649J167982J232887J292706J345078J389112J422620J440668J437079
$$ 20809649 21977631 23210518 24503224 25848302 27237414 28660034 30100702 31537781
58852C1537781J406101J342874J244024J108363R36471P30636M96714K45006j2799
$$ 31537781 32943882 34286756 35530780 36639143 37575614 38306250 38802964 39047970 39035171
58843C9035171k67151n09735p30978r21858j078086j200011j288861j345806j374139
$$ 39035171 38768020 38258285 37527307 36605449 35527363 34327352 33038491 31692685 30318546
58834C0318546j378807j363282j329638j281799j225426j163966j097767j027956
$$ 30318546 28939739 27576457 26246819 24965020 23739594 22575628 21477861 20449905
58826B0449905r58176q91391q27662p66503p09203o57398o11286n70391n34543
$$ 20449905 19491729 18600338 17772676 17006173 16296970 15639572 15028286 14457895 13923352
58817A3923352n03174m75223m50260m28139m07221l85064l61284l37687l15099
$$ 13923352 13420178 12944955 12494695 12066556 11659335 11274271 10912987 10575300 10260201
58808A0260201k92326k68815k45997k25053k05483j86775j69433j53334j37087
$$ 10260201 9967875 9699060 9453063 9228010 9022527 8835752 8666319 8512985 8375898
58799H375898j20122j03738q8998p5131o0893m6058l0858j5402j50J4481K9382
$$ 8375898 8255776 8152038 8063040 7987909 7927016 7880958 7850100 7834698 7834548 7849029 7878411
58788G878411M5965O3887Q1320R7766J14614J32588J50746J68552J86865K06135
$$ 7878411 7924376 7988263 8069583 8167349 8281963 8414551 8565297 8733849 8920714 9126849
58778I126849K25540K44693K64515K85807L08580L33129L59986L88495M17445
$$ 9126849 9352389 9597082 9861597 10147404 10455984 10789113 11149099 11537594 11955039
58769A1955039M47400M80370N16926N55850N96893O41426O89939P41417P95832
$$ 11955039 12402439 12882809 13399735 13955585 14552478 15193904 15883843 16625260 17421092
58760A7421092Q54603R17629R82322J046643J110704J174216J234482J287938
$$ 17421092 18275695 19193324 20175646 21222289 22332993 23507209 24741691 26029629
58752B6029629J331508J361389J372618J360933J323066J254628J150403J008279
$$ 26029629 27361137 28722526 30095144 31456077 32779143 34033771 35184174 36192453
58744C6192453Q30931O22785L88136J34137j26825l80345o15115q24152j003181
$$ 36192453 37023384 37646169 38034305 38168442 38041617 37661272 37046157 36222005 35218824
58735C5218824j149734j262880j342516j389598j407469j401568j377212j338752
$$ 35218824 34069090 32806210 31463694 30074096 28666627 27265059 25887847 24549095
58727B4549095j290573j236689j179023j118107j055824r95064r36559q78907
$$ 24549095 23258522 22021833 20842810 19724703 18668879 17673815 16737256 15858349
58719A5858349q22300p69139p20191o73406o27980n86277n49879n16677m84188
$$ 15858349 15036049 14266910 13546719 12873313 12245333 11659056 11109177 10592500 10108312
58710A0108312m53126m25319m00302l76488l53808l32822l12771k92739k73350
$$ 10108312 9655186 9229867 8829565 8453077 8099269 7766447 7453676 7160937 6887587
58701F887587k55290k37476k18831k00626j85059j72377j61031j49831j38601
$$ 6887587 6632297 6394821 6175990 5975364 5790305 5617928 5456897 5307066 5168465
58692E168465j27557j17304j08640j01517r5096q9226q4434q0246p5485p0796
$$ 5168465 5040908 4923604 4814964 4713447 4618351 4529125 4444691 4364445 4288960 4218164
58682D218164o8425o8587o8467o6189o3363o2135o1892o0838n8926n7186n5650
$$ 4218164 4149739 4081152 4012685 3946496 3883133 3820998 3759106 3698268 3639342 3582156 3526506
58671C526506n3768n1866n0736n0718n1902n3955n5303n4504n2880n3460n6550
$$ 3526506 3472738 3420872 3370136 3319418 3267516 3213561 3158258 3103754 3050874 2997414 2940864
58660B940864n9014n8945n8070n8054n7517n4887n1443m9115m7395m4846m1793
$$ 2940864 2881850 2822905 2764835 2706781 2649264 2594377 2542934 2493819 2446424 2401578 2359785
58649B359785l9219l6773l3903l1343k9615k7732k5103k2820k1492j9917j7737
$$ 2359785 2320566 2283793 2249890 2218547 2188932 2161200 2136097 2113277 2091785 2071868 2054131
58638B054131j6964j8734k0817k0773j9454j8920j8913j8076j6816j6198j5610
$$ 2054131 2037167 2018433 1997616 1976843 1957389 1938469 1919556 1901480 1884664 1868466 1852856
58627A852856j4017j2154j1055r983q253p422r064j1831j3343j3585j3823j3584
$$ 1852856 1838839 1826685 1815630 1805647 1797394 1789972 1780908 1769077 1755734 1742149 1728326 1714742
58615A714742j1617q778p055o557o026n517n948o586n593k765L50K806M925O929
$$ 1714742 1703125 1694347 1687292 1680735 1674709 1669192 1663244 1656658 1651065 1648300 1648650 1651456 1656381 1663310
58601A663310Q562R701J0287J0249J0292J1443J3148J3661J3298J4992K0040K5756
$$ 1663310 1671872 1681573 1691860 1702109 1712401 1723844 1736992 1750653 1763951 1778943 1798983 1824739
58589A824739K9359L1768L5172L9098M1827M3847M6922N1084N5281N9732O5033
$$ 1824739 1854098 1885866 1921038 1960136 2001963 2045810 2092732 2143816 2199097 2258829 2323862
58578B323862P0273P4683P9801Q7402R6406J04600J12265J21405J32369J44038
$$ 2323862 2394135 2468818 2548619 2636021 2732427 2837027 2949292 3070697 3203066 3347104
58568C347104J56434J70432J85538K00619K16388K34876K56666K80496L04910
$$ 3347104 3503538 3673970 3859508 4060127 4276515 4511391 4768057 5048553 5353463
58559E353463L28687L50622L70697L90239M09021M23244M28275M22065M04096
$$ 5353463 5682150 6032772 6403469 6793708 7202729 7625973 8054248 8476313 8880409
58550H880409L72714L26008K64301J89906J05743J6142p2641j54946k27620k88141
$$ 8880409 9253123 9579131 9843432 10033338 10139081 10155223 10082582 9927636 9700016 9411875
58540I411875l33423l62832l79951l88323l87626l77013l59886l41367l22600
$$ 9411875 9078452 8715620 8335669 7947346 7559720 7182707 6822821 6481454 6158854
58531F158854l01498k78174k55703k35877k17666j99879j82463j65301j48201
$$ 6158854 5857356 5579182 5323479 5087602 4869936 4670057 4487594 4322293 4174092
58522D174092j31916j17225j03710r1197q1112p4248o8773o2842n7614n5034n4309
$$ 4174092 4042176 3924951 3821241 3730044 3648932 3574684 3505911 3443069 3385455 3330421 3276112
58511C276112n3466n2922n4339n7206n9595o1135o2375o2593o1212n9982o0516
$$ 3276112 3222646 3169724 3115385 3058179 2998584 2937449 2875074 2812481 2751269 2691287 2630771
58500B630771o1061n9051n5521n3505n3203n2309n0186m8179m6442m3877m0596
$$ 2630771 2569710 2510659 2455138 2401633 2348430 2296121 2245935 2197756 2151314 2107437 2066841
58489B066841l7557l4435l0587k6970k4456k1889j8707j7282j9169k1288k0093
$$ 2066841 2029284 1994849 1964262 1937292 1912836 1890947 1872240 1854958 1835789 1814501 1794408
58478A794408j7315j6757j7254j4540r059n901o887q394p862p133p875q349o818
$$ 1794408 1777093 1760336 1743082 1728542 1719483 1713582 1706695 1698301 1690439 1683306 1675431 1667082 1660264
58465A660264m530l467l792m825o130o947o836p185r666j3219j5080j4714j4141
$$ 1660264 1655734 1652267 1648475 1643650 1637520 1630573 1623737 1616552 1606886 1593667 1578587 1563873 1549732
58452A549732j4601j5613j6968j8871k0419k0578k0214k0535k0366j7903j4217
$$ 1549732 1535131 1519518 1502550 1483679 1463260 1442682 1422468 1401933 1381567 1363664 1349447
58441A349447j1949j1414j1036j0626j0833j0553q518o472o962q828q727o384
$$ 1349447 1337498 1326084 1315048 1304422 1293589 1283036 1274518 1268046 1261084 1252256 1243529 1237145
58429A237145m431l935l987m825p219r442q980o710n375m789k818j41N63l63m9
$$ 1237145 1232714 1228779 1224792 1219967 1212748 1203306 1194326 1187616 1182241 1177452 1174634 1174493 1175056 1174693 1174644
58414A174644J745K525J703R98N87o89j914j390m78j413k415k96L159L420J187
$$ 1174644 1176389 1178914 1180617 1181615 1182202 1181513 1179599 1178209 1177731 1176318 1173903 1173607 1176766 1180186 1181373
58399A181373J643N744Q889R026R449J2029J3980J3346J2098J1585R975O339K607
$$ 1181373 1183016 1188760 1197649 1206675 1216124 1228153 1242133 1255479 1267577 1279162 1289137 1295476 1298083
58386A298083l63m252r163j2459j3195j3501j4345j4278j3383j3781j5156j4548
$$ 1298083 1297720 1293468 1284305 1271846 1258651 1245150 1230805 1216527 1203144 1189363 1174207 1159659
58374A159659j1787j0280j1163j1549r937q460q245p486n669m863n139l611K26
$$ 1159659 1147872 1137592 1126429 1114880 1104943 1096483 1088238 1080752 1075083 1070220 1065081 1061470 1061696
58361A061696K900K593J849L002N250P724J0951J3786J3543J0737R235J0353J1403
$$ 1061696 1064596 1067189 1069038 1072040 1077290 1085014 1095965 1109751 1123294 1134031 1143266 1153619 1165022
58348A165022J1147J1613J3253J3677J2746J3613J6759J8407J6917J5603J6883
$$ 1165022 1176169 1187782 1201035 1214712 1227458 1241071 1257830 1276237 1293154 1308757 1325640
58337A325640J8609J8596J7994J7835J6641J3855J1378R752O902K330j626m031
$$ 1325640 1344249 1362845 1380839 1398674 1415315 1429170 1440548 1450300 1457202 1459532 1457906 1453875
58325A453875o580r560j1203j1879j3853j6208j5339j1479q952q944p921m416
$$ 1453875 1447295 1437735 1426532 1414653 1400800 1384592 1369253 1357774 1348822 1339878 1331957 1327541
58313A327541j283K13K351N474O752N987O431Q283P865M814L354M721N235L783
$$ 1327541 1326258 1326471 1328822 1334296 1341048 1347035 1353466 1361749 1369614 1374428 1377782 1382503 1387738 1391521
58299A391521M002O838Q224O579N362N775M391P47l95K621N164M637M363O124
$$ 1391521 1395523 1402361 1410585 1417164 1422526 1428301 1432692 1433439 1433044 1435665 1440829 1445466 1449829 1455953
58285A455953O496M112K989M981O439N826O877J0693J2677J1156J0974J4538J7475
$$ 1455953 1462449 1466561 1469550 1474531 1480970 1486796 1493673 1504366 1517043 1528199 1539173 1553711 1571186
58272A571186J7186J7297J9402J9111J5100J3209J6430J9364J7932J5925J6516
$$ 1571186 1588372 1605669 1625071 1644182 1659282 1672491 1688921 1708285 1726217 1742142 1758658
58261A758658J6184J2943J1796J5567J8857J7529J5781J7398J8623J6477J5587
$$ 1758658 1774842 1787785 1799581 1815148 1834005 1851534 1867315 1884713 1903336 1919813 1935400
58250A935400J9461K3267K2601K1460K4167K7281K6926K6327K8880L1406L1320
$$ 1935400 1954861 1978128 2000729 2022189 2046356 2073637 2100563 2126890 2155770 2187176 2218496
58239B218496L2470L6933L9462L7227L6278M0731M4589M2363L8867M0037M2723
$$ 2218496 2250966 2287899 2327361 2364588 2400866 2441597 2486186 2528549 2567416 2607453 2650176
58228B650176M2285M1743M4613M7027M5588M4857M8691N2805N3886N6734O4048
$$ 2650176 2692461 2734204 2778817 2825844 2871432 2916289 2964980 3017785 3071671 3128405 3192453
58217C192453O9128O7571O6088P0387P4982P4771P5802Q3795R2654R5406R6195
$$ 3192453 3261581 3329152 3395240 3465627 3540609 3615380 3691182 3774977 3867631 3963037 4059232
58206D059232J00437J03897J03016J05022J15720J27953J34177J39367J49356
$$ 4059232 4159669 4263566 4366582 4471604 4587324 4715277 4849454 4988821 5138177
58197E138177J58280J60639J63895J75386J88460J95525K02739K17445K33222
$$ 5138177 5296457 5457096 5620991 5796377 5984837 6180362 6383101 6600546 6833768
58188F833768K42308K50567K65152K80064K89255L00673L21254L41980L54394
$$ 6833768 7076076 7326643 7591795 7871859 8161114 8461787 8783041 9125021 9479415
58179I479415L67394L90328M14723M31208M48595M76771N07107N30658N58805
$$ 9479415 9846809 10237137 10651860 11083068 11531663 12008434 12515541 13046199 13605004
58170A3605004O03772O55778P02534P53367Q19405Q88447R46172J003961J077978
$$ 13605004 14208776 14864554 15567088 16320455 17139860 18028307 18974479 19978440 21056418
58161B1056418J159196J233203J310318J405608J508881J606397J711427J839908
$$ 21056418 22215614 23448817 24759135 26164743 27673624 29280021 30991448 32831356
58153C2831356J978563K113214K264677K457975K681349K917141L184939L508683
$$ 32831356 34809919 36923133 39187810 41645785 44327134 47244275 50429214 53937897
58145E3937897L871975M258069M703285N254865N908671O649039P513680Q553167
$$ 53937897 57809872 62067941 66771226 72026091 77934762 84583801 92097481 100650648
58137A00650648R769024J1164901J2799982J4689701J6704693J8684810K0618496
$$ 100650648 110419672 121584573 134384555 149074256 165778949 184463759 205082255
58130B05082255K2635764K4961214K8003865L2141527L6770148L9472970L6890088
$$ 205082255 227718019 252679233 280683098 312824625 349594773 389067743 425957831
58123D25957831K7247019J2188797m121219j7761825k6974915l1965405l3696578
$$ 425957831 453204850 465393647 461272428 443510603 416535688 384570283 350873705
58116C50873705l3156504l1238062k8665706k5869650k3046353k0330440j7829923
$$ 350873705 317717201 286479139 257813433 231943783 208897430 188566990 170737067
58109A70737067j5568339j3518561j1679190j0050851q579868p200227n904464
$$ 170737067 155168728 141650167 129970977 119920126 111340258 104140031 98235567
58102I8235567m721609l663276k738940j979797j402167j002139q37223j042327
$$ 98235567 93513958 89850682 87111742 85131945 83729778 82727639 81890416 80848089
58094H0848089j674047k570452l443748m096252m491438m657787m619713m421895
$$ 80848089 79174042 76603590 73159842 69063590 64572152 59914365 55294652 50872757
58086E0872757m136177l813811l470237l122436k799251k510020k242146j995050
$$ 50872757 46736580 42922769 39452532 36330096 33530845 31020825 28778679 26783629
58078B6783629j783662j607157j447617j301432j181408j086875j001236r20120
$$ 26783629 24999967 23392810 21945193 20643761 19462353 18375478 17374242 16454122
58070A6454122q53969q02130p51180o99691o58872o27830n92779n51664n16073
$$ 16454122 15600153 14798023 14046843 13347152 12688280 12060450 11467671 10916007 10399934
58061A0399934m87791m56204m19956l89470l66593l42508l17113l00686k94801
$$ 10399934 9912143 9455939 9035983 8646513 8279920 7937412 7620299 7319613 7024812
58052G024812k90015k83412k80530k79444k70819k54791k41037k31500k19137
$$ 7024812 6734797 6451385 6170855 5891411 5620592 5365801 5124764 4893264 4674127
58043D674127k03690j92424j85003j73628j58478j47649j41725j33514j22905
$$ 4674127 4470437 4278013 4093010 3919382 3760904 3613255 3471530 3338016 3215111
58034C215111j16744j14084j06785r5093q7574q5173q0156p1628o7212o8068o6592
$$ 3215111 3098367 2984283 2877498 2782405 2694831 2609658 2529502 2457874 2390662 2322594 2256002
58023B256002o0816n7377n8230n7418n3066n0243m9932m7040m1078l7466l6778
$$ 2256002 2195186 2137809 2079579 2022161 1969095 1918852 1868920 1821880 1780802 1743336 1706558
58012A706558l3802k8400k6191k7439k6210k1687j9492k0775k0637j8223j7812
$$ 1706558 1672756 1644356 1618165 1590726 1564516 1542829 1523337 1502562 1481925 1463702 1445890
58001A445890j9030j6597j0804q030r799j1263j1051j2586j5154j4077j0433j0384
$$ 1445890 1426860 1410263 1399459 1391429 1381630 1370367 1359316 1346730 1331576 1317499 1307066 1296682
57989A296682j4133j5569j3439j2469j2912r782l619j226l915n291k558j20j07
$$ 1296682 1282549 1266980 1253541 1241072 1228160 1218378 1214759 1213533 1209618 1204327 1201769 1201649 1201542
57976A201542Q48L476M013K449L324O565O696K858L00J99k404q496j2430j1771
$$ 1201542 1202390 1205866 1209879 1212328 1215652 1222217 1228913 1231771 1232071 1232270 1229866 1221370 1208940 1197169
57962A197169j0863j2044j2247j0749j1578j5499j7850j6767j5653j5544j3428
$$ 1197169 1186306 1174262 1162015 1151266 1139688 1124189 1106339 1089572 1073919 1058375 1044947
57951A044947r872r657j2652j2830q670n733o528o651l822j925k866k954o50L81
$$ 1044947 1035075 1025418 1012766 999936 991266 985533 979005 972354 968532 966607 963741 960787 960137 960518
57937I60518q46n8L755N574L564K679N271O508L337p1k45r7k025k838m63J278
$$ 960518 959672 959614 963369 968943 972507 975186 980457 986965 990302 990231 989986 989889 987864 985026 984563 985841
57921I85841n12k654k226j725l322m238k456j177l029n458o069o890r284j0430
$$ 985841 985329 982675 980449 978724 975402 971164 968708 967531 964502 959044 952975 946085 936801 926371
57907I26371r007q508j0667j1623q954o684q390j0983j0314p826o618n851m058
$$ 926371 917364 908856 898189 886566 877612 870928 862538 851555 841241 833415 826797 820946 816888
57894H16888l332n325p244o464m939m772l860n21K019N76k406k905j322j18R30
$$ 816888 813556 808231 800987 794523 789584 784812 780952 780431 782450 783026 780620 777715 776393 776275 777205
57879G77205K735L543J911j03m75p79k667m286l881l352m420m801k293P29J030
$$ 777205 779940 783483 785394 785291 784816 784037 781370 777084 773203 769851 765431 760630 758337 759066 760096
57864G60096k89k86Q50J238J177J903K774K958L741O202Q794R800R777R438P957
$$ 760096 759807 759521 760371 761609 762786 764689 767463 770421 774162 780364 789158 798958 808735 818173 826130
57849H26130N519M446N552O505N824N068N068L878O93k069k955l743n336n703
$$ 826130 831649 836095 841647 848152 853976 859044 864112 867990 868683 866614 863659 859916 854580 848877
57835H48877m366m426p335j0215j1148j2264j4547j4709j1070p544p582q756p700
$$ 848877 844511 840085 832750 822535 811387 799123 784576 769867 758797 751253 743671 734915 727215
57822G27215n795n335m551j576P22o85l201k786p02n88j700n57K804N474O745
$$ 727215 721420 716085 711534 709958 710680 709995 706794 704008 703306 702718 701018 700461 703265 708739 715484
57807G15484P820Q299P340O550P531Q384O561L292J413R36M77O28J883J708j949
$$ 715484 723304 731603 738943 745493 753024 761408 767969 771261 772674 773610 774087 774715 776598 778306 776357
57792G76357o412p795o809o958q956j0958j2401j3536j3120j0519q167q110q311
$$ 776357 769945 762150 755341 748383 739427 728469 716068 702532 689412 678893 670726 662616 654305
57779F54305o341m195n026p459p952o874p240r000r470q284p294o630n243m265
$$ 654305 647964 643769 638743 631284 623332 616458 609218 600218 590748 582464 575170 568540 563297 559032
57765E59032n499p581p958p536r014j1566j1775r281p095o616o370n431m392l222
$$ 559032 553533 545952 537994 530458 521444 509878 498103 488822 481727 475111 468741 463310 458918 455696
57751D55696j619r45k407m114l312p40P76J012J946L552L944L265L638N430O860
$$ 455696 454077 453132 450725 446611 443299 442559 443335 444347 446293 449845 453789 457054 460692 466122 472982
57736D72982P071O627N651M280L994N448O238M151J277J191L289L903K098L28
$$ 472982 480053 486680 492331 496611 500605 506053 512291 516442 517719 518910 522199 526102 528200 528528
57722E28528p3j17k61j5j39j715l418l122j608j328k208k166j084n23k09J382
$$ 528528 528455 528338 528077 528062 527923 526208 522790 519668 518060 516732 514524 512358 511274 510751 510542 511924
57706E11924L404L615K598L233O056Q789J0318J1467J2078J1020R174Q765R725
$$ 511924 515328 518943 521541 524774 530830 539619 549937 561404 573482 584502 593676 602441 612166
57693F12166R988R316R356J0148J0099R339R579J0775J1323J1336J2195J3233
$$ 612166 622154 631470 640826 650974 661073 670412 679991 690766 702089 713425 725620 738853
57681G38853J2630J1183J1321J2539J2093J0157R895J2064J3947J4381J5394J7716
$$ 738853 751483 762666 773987 786526 798619 808776 818671 830735 844682 859063 874457 892173
57669H92173J8987J8052J7362J9232K2771K6024K8360K9560K9419K9411L1903
$$ 892173 911160 929212 946574 965806 988577 1014601 1042961 1072521 1101940 1131351 1163254
57658A163254L6596M0380M1768M2725M5121M8135N0451N2461N5038N8196O2002
$$ 1163254 1199850 1240230 1281998 1324723 1369844 1417979 1468430 1520891 1575929 1634125 1696127
57647A696127O6888P2413P7645Q3162R0532R9552J08335J16442J25520J36556
$$ 1696127 1763015 1835428 1913073 1996235 2086767 2186319 2294654 2411096 2536616 2673172
57637B673172J48812J61832J76155J91715K07711K24209K41790K59867K77537
$$ 2673172 2821984 2983816 3159971 3351686 3559397 3783606 4025396 4285263 4562800
57628D562800K95462L14144L30979L41919L45635L42891L32370L10714K76513
$$ 4562800 4858262 5172406 5503385 5845304 6190939 6533830 6866200 7176914 7453427
57619G453427K31005J75556J12565M8504q714n6084r5271j25745j43025j45017
$$ 7453427 7684432 7859988 7972553 8021057 8012343 7956259 7860988 7735243 7592218 7447201
57609G447201j36141j24112j16618j21434j43777j80280k19421k50785k71280
$$ 7447201 7311060 7186948 7070330 6948896 6805119 6624839 6405418 6154633 5883353
57600E883353k81413k80388k68160k48472k25966k02477j78702j56800j38303
$$ 5883353 5601940 5321552 5053392 4804920 4578954 4376477 4197775 4040975 3902672
57591C902672j21599j04281q6373o9102n2521l6573k2541j1015j52J1947K4703
$$ 3902672 3781073 3676792 3590419 3521317 3468796 3432223 3409682 3398667 3398515 3410462 3435165
57580C435165L6846M9003O2453P6876R1334J06132J21866J37926J53669J69882
$$ 3435165 3472011 3521014 3583467 3660343 3751677 3857809 3979675 4117601 4271270 4441152
57570D441152J87547K06096K24099K40558K54478K64512K69851K70089K63447
$$ 4441152 4628699 4834795 5058894 5299452 5553930 5818442 6088293 6358382 6621829
57561F621829K46718K17860J77273J26353O7028L319n9217j16857j68737k13858
$$ 6621829 6868547 7086407 7263680 7390033 7457061 7460380 7401163 7284306 7115569 6901711
57551F901711k49652k74686k90324k98289k98791k92545k82287k70466k57228
$$ 6901711 6652059 6377373 6087049 5788760 5489969 5197424 4915137 4644671 4387443
57542D387443k42170k26295k10724j95337j80162j66368j54437j43084j31506
$$ 4387443 4145273 3918978 3708254 3512917 3332755 3166387 3011950 2868866 2737360
57533B737360j21045j13039j06408r8890q9747q0182p2041o6506o2913n8780n2575
$$ 2737360 2616315 2503276 2396868 2297978 2208231 2128049 2056008 1989502 1926589 1867809 1815234
57522A815234m6227m2708m1471l9169l4920l1375k9814k7937k3940j9350j6011
$$ 1815234 1769007 1726299 1684828 1645659 1610739 1579364 1549550 1521613 1497673 1478323 1462312
57511A462312j3379j0748r185r009p975m267R14N599R516J2603J3772J3319J4055
$$ 1462312 1448933 1438185 1429000 1419991 1412016 1407749 1408663 1414262 1423778 1436381 1450153 1463472 1477527
57498A477527J7755K2802K7307L1903L7136M0896M1555M1338M3532M8048N2641
$$ 1477527 1495282 1518084 1545391 1577294 1614430 1655326 1696881 1738219 1781751 1829799 1882440
57487A882440N6869O1881O7719P3767Q0788Q9848J00084J09956J19908J31525
$$ 1882440 1939309 2001190 2068909 2142676 2223464 2313312 2413396 2523352 2643260 2774785
57477B774785J44821J58264J70801J82156J92035K00514K08113K14185K16436
$$ 2774785 2919606 3077870 3248671 3430827 3622862 3823376 4031489 4245674 4462110
57468D462110K13195K04390J89246J65230J31299R0190M5590q83m7893r1810j28838
$$ 4462110 4675305 4879695 5068941 5234171 5365470 5455660 5501250 5500367 5452474 5360664 5231826
57457E231826j58290j81382j97993k07027k08807k05021j97201j86902j76058
$$ 5231826 5073536 4892154 4694161 4487134 4278327 4073306 3876105 3689203 3513145
57448C513145j65487j54326j42295j30668j19698j07499r3547q0693p1358o3970
$$ 3513145 3347658 3193332 3051037 2920369 2800671 2693172 2599625 2518932 2447574 2383604
57438B383604n5862m7337l9930l2772k4155j5107p970k525L313R966J6410K2892
$$ 2383604 2327742 2280405 2240475 2207703 2183548 2168441 2160471 2157946 2161259 2171225 2187635 2210527
57426B210527L0434L8401M5382N1853N9323O7691P5991Q4875R5724J08036J20172
$$ 2210527 2240961 2279362 2324744 2376597 2435920 2503611 2579602 2664477 2760201 2868237 2988409
57415B988409J31845J43551J54598J64137J72933J81533J87833J89104J85109
$$ 2988409 3120254 3263805 3418403 3582540 3755473 3937006 4124839 4313943 4499052
57406D499052J76310J60486J34608R9231N7689J1865l7512q6998j30882j65996
$$ 4499052 4675362 4835848 4970456 5069687 5127376 5139241 5101729 5014731 4883849 4717853
57396D717853j93061k13144k26006k32044k32751k28672k19719k07802j96305
$$ 4717853 4524792 4311648 4085642 3853598 3620847 3392175 3172456 2964654 2768349
57387B768349j86211j75296j61902j47365j34021j23005j14497j08144j02485
$$ 2768349 2582138 2406842 2244940 2097575 1963554 1840549 1726052 1617908 1515423
57378A515423r5650q7298p8731p1085o4671n9703n6123n2964m9407m5982m3312
$$ 1515423 1419773 1332475 1253744 1182659 1117988 1058285 1002162 949198 899791 853809 810497
57367H10497m0503l6596l2753l0846l0509k9772k7992k6044k4231k2211k0511
$$ 810497 769994 733398 700645 669799 639290 609518 581526 555482 531251 509040 488529
57356D88529j9766j9099j7436j5749j5636j6398j6030j4457j3093j1903r803p449
$$ 488529 468763 449664 432228 416479 400843 384445 368415 353958 340865 328962 319159 311710
57344C11710o570o864o555n777o181p306o906n124m769o516p361n168j886m34
$$ 311710 305140 298276 291721 285944 279763 272457 265551 260427 255658 249142 241781 236613 234727 234293
57330B34293q01r16K78K171L639L762K390N88m01q35j907l636m785m762m031k902
$$ 234293 233492 232576 232854 235025 238664 242426 244816 245404 245003 244168 242261 238625 233840 229078 225047 222145
57314B22145j549r38j851l248l485k869k957l778m030l696l851m115l034j220
$$ 222145 220596 219658 217807 214559 211074 208205 205248 201470 197440 193744 189893 185778 182744 181524
57300A81524j173l358n180m747l244k481k258j401K64K136L690M387L800K352
$$ 181524 180351 176993 171813 167066 163822 161341 159083 157682 157946 160082 163772 168159 171959 174311
57286A74311R20k28j056p79J082L242M182M593O050P788P573N675M906O196P130
$$ 174311 175231 175003 173947 173168 174250 177492 181674 186267 192317 200105 207678 213353 218259 224455 231585
57271B31585N998M554N200P579R644J0541J0751J0502R598Q369P692Q104R270
$$ 231585 237583 242137 247337 254916 264560 275101 285852 296354 305952 314321 322013 330117 339387
57258C39387J0201J0237R996J0789J2550J3378J1982R542P947P499P721R061J1873
$$ 339387 349588 359825 369821 380610 393160 406538 418520 428062 436009 443508 451229 460290 472163
57245D72163J4917J6964J8807K1539K4055K4609K3941K4279K6115K8418L1182
$$ 472163 487080 504044 522851 544390 568445 593054 616995 641274 667389 695807 726989
57234G26989L5049L9074M1674M3319M5795M9279N2546N5304N7910N9713O0451
$$ 726989 762038 801112 842786 886105 931900 981179 1033725 1089029 1146939 1206652 1267103
57223A267103O2065O6068P0195P0999O8746O6144O3117N6880M6759L4793K1775
$$ 1267103 1329168 1395236 1465431 1536430 1605176 1671320 1734437 1791317 1838076 1872869 1894644
57212A894644O809r028k2680l3287m2604n0760n5375n5424n2626m8384m2737l6570
$$ 1894644 1901453 1892425 1869745 1836458 1793854 1743094 1687719 1632295 1579669 1531285 1488548 1451978
57200A451978l1438k6756k0701j4041r492p084m123k3K950M139N509P516Q288
$$ 1451978 1420540 1393784 1373083 1359042 1349550 1342466 1338343 1338320 1341270 1345409 1350918 1358434 1366722
57187A366722P815Q726J1718J4389J5711J7630K1033K4266K6881L0618L5357L8376
$$ 1366722 1374537 1383263 1394981 1409370 1425081 1442711 1463744 1488010 1514891 1545509 1580866 1619242
57175A619242L9262M1120M5108M8055M7762M6513M7086M8891N0391N1708N2781
$$ 1619242 1658504 1699624 1744732 1792787 1840549 1887062 1934148 1983039 2033430 2085138 2137919
57164B137919N2358N0966N1433N4405N6804N6608N5746N6264N7257N7504N7659
$$ 2137919 2190277 2241243 2292676 2347081 2403885 2460493 2516239 2572503 2629760 2687264 2744923
57153B744923N7831N6546N3992N2760N3416N3085N0193M6825M4533M2161L9847
$$ 2744923 2802754 2859300 2913292 2966052 3019468 3072553 3122746 3169571 3214104 3256265 3296112
57142C296112M0560M4895M8839M9772N0558N4283N8930O1001O0785O0161N8313
$$ 3296112 3336672 3381567 3430406 3480178 3530736 3585019 3643949 3704950 3765735 3825896 3884209
57131C884209N3525M6968M1192L6790L3312L1314L1061L1258L1176L1771L3255
$$ 3884209 3937734 3984702 4025894 4062684 4095996 4127310 4158371 4189629 4220805 4252576 4285831
57120D285831L4266L4758L6465L9184M0270L9167L8238L7561L3641K5473J7160
$$ 4285831 4320097 4354855 4391320 4430504 4470774 4509941 4548179 4585740 4619381 4644854 4662014
57109D662014J1736P098R80m508o571n999m641k551l43l77k776m371m001m460
$$ 4662014 4673750 4680848 4681828 4677320 4670749 4664750 4660109 4657558 4657215 4656838 4654062 4649691 4645690 4641230
57095D641230o809p795n828m349o069q884j0643j2773j5946j7707j7966k1250
$$ 4641230 4634421 4626626 4620798 4616449 4610380 4601496 4590853 4578080 4562134 4544427 4526461 4505211
57083D505211k9725l9491m7465n5968o6514p5467q0651q6271r6437j09499j23650
$$ 4505211 4475486 4435995 4388530 4332562 4266048 4190581 4109930 4023659 3927222 3817723 3694073
57072C694073j41988j66872j94927k22594k50726k79038l02636l19328l34049
$$ 3694073 3552085 3385213 3190286 2967692 2716966 2437928 2135292 1815964 1481915
57063A481915l51212l69706C70634d9713m64122n17637n77543o47886p31693q24734
$$ 1481915 1130703 760997 370634 -49713 -513835 -1031472 -1609015 -2256901 -2988594 -3813328
57053c813328r24439j036148j163901j304684j458952j636468j844271k079992
$$ -3813328 -4737767 -5773915 -6937816 -8242500 -9701452 -11337920 -13182191 -15262183
57045a5262183k344910k651347l008772l416728l881629m426496n074715n841050
$$ -15262183 -17607093 -20258440 -23267212 -26683940 -30565569 -34992065 -40066780 -45907830
57037d5907830o748632p831909r104114j0536841j2081574j3688495j5301456
$$ -45907830 -52656462 -60488371 -69592485 -80129326 -92210900 -105899395 -121200851
57030a21200851j6880546j8437779j9959237k1223188k1798793k1412942k0350484
$$ -121200851 -138081397 -156519176 -176478413 -197701601 -219500394 -240913336 -261263820
57023b61263820j9324468j8797498j8435405j7290702j4529524j0009622m295529
$$ -261263820 -280588288 -299385786 -317821191 -335111893 -349641417 -359651039 -363946568
57016c63946568J738896P349191J2155436J6108362J9271286K1626261K3075186
$$ -363946568 -362207672 -354858481 -342703045 -326594683 -307323397 -285697136 -262621950
57009b62621950K3582576K3259630K2307292K0924623J9282958J7535524J5804525
$$ -262621950 -239039374 -215779744 -193472452 -172547829 -153264871 -135729347 -119924822
57002a19924822J4163509J2648857J1279065J0054390Q955888P963432P069860
$$ -119924822 -105761313 -93112456 -81833391 -71779001 -62823113 -54859681 -47789821
56995d7789821O271500N557175M915889M344922L841033L392600K988681K627673
$$ -47789821 -41518321 -35961146 -31045257 -26700335 -22859302 -19466702 -16478021 -13850348
56987a3850348K309735K028806J779221J562334J378957J221613J081116R55154
$$ -13850348 -11540613 -9511807 -7732586 -6170252 -4791295 -3569682 -2488566 -1533412
56979a533412f88875E7760O58429N80736N14140M55119M01010L54347L17730K88502
$$ -1533412 -688875 57760 716189 1296925 1811065 2266184 2667194 3021541 3339271 3627773
56969C627773K62440K38716K17714J98156J79825J65190J54964J45624J34104
$$ 3627773 3890213 4128929 4346643 4544799 4724624 4889814 5044778 5190402 5324506
56960E324506J21447J09339R6837Q2898O8476N4114L9197K5280J6065J2044R182
$$ 5324506 5445953 5555292 5652129 5735027 5803503 5857617 5896814 5922094 5938159 5950203 5959385
56949E959385M685J0l560p812j3552j7437j5492p692Q53m60k5809q3142j63118
$$ 5959385 5964070 5964080 5960520 5952708 5939156 5921719 5906227 5898535 5899388 5898928 5873119 5789977 5626859
56936E626859k42811l03506l41528l61493l66227l57293l39339l17809k94669
$$ 5626859 5384048 5080542 4739014 4377521 4011294 3654001 3314662 2996853 2702184
56927B702184k70054k45580k22868k01479j81091j63394j49462j37933j27803
$$ 2702184 2432130 2186550 1963682 1762203 1581112 1417718 1268256 1130323 1002520
56918A002520j20112j14819j09218j01733r4156q7837q0885p1713o2085n3859
$$ 1002520 882408 767589 658371 556638 462482 374645 293760 222047 159962 106103
56908A06103m5659B4733f41j6939j0249m105J247N732J1148D621K5230K8864K9755
$$ 106103 60444 24733 -641 -17580 -27829 -31934 -30687 -24955 -13807 4621 29851 58715 88470
56895H8470K9393K6860K0316J0607P63p210j2946j6276j7152j6265j4385j1792
$$ 88470 117863 144723 165039 175646 176409 169199 156253 139977 122825 106560 92175 80383
56883H0383r172p460o059l066J693N954Q402J0544J3850J7392J9983K2532K6329
$$ 80383 71211 63751 57692 54626 56319 62273 70675 81219 95069 112461 132444 154976 181305
56870A81305L0615L3357L2866K7607J6798K793r392j6824k1159k4848k7275k6749
$$ 181305 211920 245277 278143 305750 322548 325341 315949 299125 277966 253118 225843 199094
56858A99094k4124k1774k0361j9042j7697j6656j5150j2178q356n207l194j955
$$ 199094 174970 153196 132835 113793 96096 79440 64290 52112 43756 38549 35355 33400
56846C3400j634k424l318k805n44K526N394P614R361J1340J3961J6371J7310J7096
$$ 33400 31766 29342 26024 23219 22675 25201 30595 38209 47570 58910 72871 89242 106552 123648
56832A23648J7451J9191K1516K3800K6436K9408L1715L2701L2366L0127K5087
$$ 123648 141099 160290 181806 205606 232042 261450 293165 325866 358232 388359 413446
56821D13446J8000J1030N041p87o318r840j0867j1084j1503j0976q747o006l540
$$ 413446 431446 442476 447517 446730 440412 430572 419705 408621 397118 386142 377395 371389 367849
56808C67849j75M730R413J2297J4684J8843K4867L1243L7174M2421M5705M5082
$$ 367849 367674 372404 381817 394114 408798 427641 452508 483751 520925 563346 609051 654133
56796F54133L9540K9338J5751J313j0796j8744k2794k3766k2081j8689j5085j1442
$$ 654133 693673 723011 738762 740075 729279 710535 687741 663975 641894 623205 608120 596678
56784E96678o365O32P963J4202J9927K6311L3453M0948M8639N5967O2046O6893
$$ 596678 590313 590945 598908 613110 633037 659348 692801 733749 782388 838355 900401 967294
56772I67294P0433O9735N9876L9383J2999j2415l2989m7806n6401n8843n6918
$$ 967294 1037727 1107462 1167338 1206721 1219720 1207305 1174316 1126510 1070109 1011266 954348
56761I54348n2914m7673m1244l4343k7819k1512j4927q202j514N406J2355J8424
$$ 954348 901434 853761 812517 778174 750355 728843 713916 705714 704200 709606 721961 740385
56749G40385K3455K8487L3923L8444M0089L6881K6593Q725j2342k9154l8003m1779
$$ 740385 763840 792327 826250 864694 904783 941664 968257 976982 964640 935486 897483 855704
56737H55704m4549m6108m4189l9432l4687l0858k6609k1594j7015j3023q114j483
$$ 855704 811155 765047 720858 681426 646739 615881 589272 567678 550663 537640 529526 528043
56725E28043N600J1210J4563J6427J8359K1097K3187K1992J6564Q626K70p911
$$ 528043 533643 544853 559416 575843 594202 615299 638486 660478 677042 685668 685938 678027
56713F78027j5706k2117k6483k9412l1353l1546k9641k7030k5247k4065k2369
$$ 678027 662321 640204 613721 584309 552956 521410 491769 464739 439492 415427 393058
56702C93058j9809j6561j2817r580q430r232r481p418m462l035l312l604k869
$$ 393058 373249 356688 343871 334291 325861 316629 307148 299730 295268 292233 288921 285317 282448
56689B82448j363J63O00j025l905n494m504k646k094k714l202l425l794l678k481
$$ 282448 281085 281248 281848 280823 276918 271424 266920 264274 262180 259466 256264 252839 249045 245367 242886
56674B42886j299j558k765l381l173k998k968k541j999k191l041l597l268k140
$$ 242886 241587 240029 237264 233883 230710 227712 224744 222203 220204 218013 214972 211375 208107 205967
56660B05967n44Q42J141L59l30m5Q65J806K729L463L611L651M498N382M151O34
$$ 205967 205423 206265 207406 207765 207435 207390 208255 210061 212790 216253 219864 223515 228013 233395 237546 238180
56644B38180k400k934k220k186k534k311k236l147l843k977j698k002l572m637
$$ 238180 235780 232846 230626 228440 225906 223595 221359 218212 214369 211392 209694 207692 204120 199483
56630A99483m935n401n726m766k938j897j964j791n50J216K622L004J840l26j490
$$ 199483 194548 189147 183421 178655 175717 173820 171856 170065 169515 170731 173353 176357 178197 177871 176381
56615A76381j03K875N103N453M391K625Q76K82J374K989L487K637J344J22r87
$$ 176381 176278 179153 184256 189709 194100 196725 197601 197883 199257 202246 205733 208370 209714 209836 208849
56600B08849j701j818j700j543q85L35J137P01p15k587m611n785m753k047k19
$$ 208849 207148 205330 203630 202087 201202 201537 202674 203375 202660 200073 195462 189677 184924 182877 182658
56585A82658n88j568j415p96j058j853k185k191k169j514l42m04k452m383m058
$$ 182658 182070 180502 179087 178291 177233 175380 173195 171004 168835 167321 166979 166575 164123 159740 155682
56570A55682k375j441j385j161r30j204j049L30J448M40j825k895j990p4K221
$$ 155682 153307 151866 150481 149320 148390 147186 146137 146467 147915 148355 146530 143635 141645 141571 143792
56555A43792M525N791N651N603O635P072N135K309J411K486L280K917K305J738
$$ 143792 148317 154108 159759 165362 171997 179069 184204 186513 187924 190410 193690 196607 198912 200650
56541B00650Q57M10J457L251M116L840L083J551r28k561j528J082K799L206L392
$$ 200650 201507 201917 203374 206625 210741 214581 217664 219215 218287 215726 214198 215280 218079 221285 224677
56526B24677L162J775M29Q39K156K316J724K343L828M087L338M000O527Q665R141
$$ 224677 227839 229614 230043 230882 233038 235354 237078 239421 243249 247336 250674 254674 261201 269866 279007
56511B79007Q962Q836Q303P817Q726J0751J2042J2028J1782J1584J0863J0390
$$ 279007 287969 296805 305108 312925 321651 332402 344444 356472 368254 379838 390701 401091
56499D01091J1608J3683J4261J3155J2266J1853J0332Q033P378Q535Q574O200
$$ 401091 412699 426382 440643 453798 466064 477917 488249 496282 503660 512195 520769 526969
56487E26969L784L045K139p72l964m784l783l696n596q207j0074j0694j0186r253
$$ 526969 530753 533798 535937 535165 531201 526417 522634 518938 513342 505135 495061 484367 474181 464928
56473D64928q978r777j0953j1702j1813j1251r982q514p547p029o386n629n250
$$ 464928 455950 446173 435220 423518 411705 400454 390472 381958 374411 367382 360996 355367 350117
56460C50117n228n232n436n889n670m090k208j557j932k113k016k348k896l106
$$ 350117 344889 339657 334221 328332 322662 318572 316364 314807 312875 310762 308746 306398 303502 300396
56446C00396l549m679n042l258q67m88j757k158j244o95n08J161L992N008L069
$$ 300396 296847 292168 287126 283868 283001 282513 280756 278598 277354 276659 276151 277312 281304 286312 289381
56431B89381O33r9P5k68p98p28j63J004L322N912O590N027L561L786M443L942
$$ 289381 290014 289915 289990 289722 288924 288196 288033 289037 292359 298271 304861 309888 313449 317235 321678 325620
56415C25620K915K797L588M345M575M036K468M76n21J19J713L505N087N574M273
$$ 325620 328535 331332 334920 339265 343840 347876 350344 350820 350299 350418 352131 355636 360723 366297 370570
56400C70570K347J976L328M175L076J173K06L77Q55R88M83m66r82m71L14L68P2
$$ 370570 372917 374893 378221 382396 385472 386645 386851 387228 388083 389071 389554 389088 388106 387635 387949 388317 388389
56383C88389K21J97r60k312k106o53K00J10K83Q46O89j36m66l78r97k093k489
$$ 388389 388610 388807 387847 385535 383429 382776 382976 383086 383369 384215 384904 384768 384302 383924 382927 380834 378345
56366C78345k671m118o165o470m784l217k624j720k00M10m01j256j478j846k320
$$ 378345 375674 371556 365391 358921 354137 350920 348296 346576 346376 346786 346385 345129 343651 341805 339485
56351C39485j841p97r24k210k731j869r28l12Q81K216K064P31K86Q89O51o13j025
$$ 339485 337644 336847 335923 333713 330982 329113 328185 327873 328754 330970 333034 333765 334051 334940 335591 334978 333953
56334C33953l13n3P0J929M422L993Q31l13K636N790N620M002M051M999M764M133
$$ 333953 333640 333587 333657 335586 340008 344001 344832 344519 347155 352945 358565 362567 366618 371617 376381 380514
56318C80514M772N705N169L865L459L725L715L862M556M595L256K069K441L408
$$ 380514 385286 390991 396160 400025 403484 407209 410924 414786 419342 423937 427193 429262 431703 435111
56304D35111L654L720M331M601L781K853K642K431J952K457M143M936L687K237
$$ 435111 438765 442485 446816 451417 455198 458051 460693 463124 465076 467533 471676 476612 480299 482536
56290D82536K420L398L762L918M464M530L750L593M794N718N192M582N226O185
$$ 482536 484956 488354 492116 496034 500498 505028 508778 512371 517165 522883 528075 532657 537883 544068
56276E44068O458O949Q161Q540P399P069R533J3053J4557J3622J1906J0493R861
$$ 544068 550526 557475 565636 574176 581575 588644 598177 611230 625787 639409 651315 661808 671669
56263F71669J0655J2469J3575J3496J3845J5198J5552J3708J1571J1046J1065
$$ 671669 682324 694793 708368 721864 735709 750907 766459 780167 791738 802784 813849
56252H13849R955Q302P247O191M538L550M191N129N072N049O217P489P524P104
$$ 813849 823804 832106 839353 845544 850082 853632 857823 862952 868024 873073 879290 886779 894303 901407
56238I01407P470Q227Q811J0033J2292J4344J5538J7111J9672K1857K3090K4905
$$ 901407 908877 917104 925915 935948 948240 962584 978122 995233 1014905 1036762 1059852 1084757
56226A084757K7856L0032L0715L2376L6694M1540M4610M7146N1306N6409O0682
$$ 1084757 1112613 1142645 1173360 1205736 1242430 1283970 1328580 1375726 1427032 1483441 1544123
56215A544123O4434O8834P3677P8815Q5486R3844J01640J07739J14589J24732
$$ 1544123 1608557 1677391 1751068 1829883 1915369 2009213 2110853 2218592 2333181 2457913
56205B457913J37274J50162J63387J77593J92045K06385K21947K39133K56132
$$ 2457913 2595187 2745349 2908736 3086329 3278374 3484759 3706706 3945839 4201971
56196D201971K72113K88513L05101L18432L26624L31866L35274L33351L23012
$$ 4201971 4474084 4762597 5067698 5386130 5712754 6044620 6379894 6713245 7036257
56187G036257L06319K86298K61497K29083J90449J49510J07974O6205K6280r894
$$ 7036257 7342576 7628874 7890371 8119454 8309903 8459413 8567387 8633592 8659872 8649978
56177H649978m3230p4554j01333j21052j35495j48087j59254j67891j74913j81793
$$ 8649978 8606748 8532194 8430861 8309809 8174314 8026227 7866973 7699082 7524169 7342376
56167G342376j87973j93298k00364k10824k21842k29848k35123k39223k41031
$$ 7342376 7154403 6961105 6760741 6549917 6328075 6098227 5863104 5623881 5382850
56158E382850k39350k36415k34437k31459k24929k16497k08778k00325j88678
$$ 5382850 5143500 4907085 4672648 4441189 4216260 3999763 3790985 3590660 3401982
56149C401982j75801j65273j56233j45233j32350j20544j10671j01622r3826q8020
$$ 3401982 3226181 3060908 2904675 2759442 2627092 2506548 2395877 2294255 2200429 2112409
56139B112409q2166p4132o5840o0484n7247n2985m7482m2772l8984l4988l1513
$$ 2112409 2030243 1956111 1890271 1829787 1772540 1719555 1672073 1629301 1590317 1555329 1523816
56128A523816k9599k7777k4495k1246j9607j7744j3779r772q071o748l209O45
$$ 1523816 1494217 1466440 1441945 1420699 1401092 1383348 1369569 1359797 1351726 1344978 1341769 1342414
56116A342414J795J635L049M885M653L867N094O539N302L454M686P310O869L670
$$ 1342414 1344209 1345844 1348893 1353778 1358431 1362298 1367392 1373931 1379233 1382687 1387373 1394683 1401552 1405222
56102A405222J548R68m56k249k061p84p71n05L023Q193J0975J1696J3721J7066
$$ 1405222 1406770 1407738 1407282 1405033 1402972 1402188 1401417 1400912 1403935 1412128 1423103 1434799 1448520 1465586
56088A465586J9321K1256K5386L0507L3675L6078M0875M7001N1435N5765O3989
$$ 1465586 1484907 1506163 1531549 1562056 1595731 1631809 1672684 1719685 1771120 1826885 1890874
56077A890874P5365Q6016R5887J07343J18435J24551J25489J24052J19421J09161
$$ 1890874 1966239 2052255 2148142 2255485 2373920 2498471 2623960 2748012 2867433 2976594
56067B976594R6414Q7217Q1530P4293O4595N6064M8649L7872K2653O809p301k0131
$$ 2976594 3073008 3160225 3241755 3316048 3380643 3436707 3485356 3523228 3545881 3552690 3545389 3525258
56055C525258l0400l6151m0151m7514n8229o8333p7347q7502r6656r9713r6778
$$ 3525258 3494858 3458707 3418556 3371042 3312813 3244480 3167133 3079631 2982975 2883262 2786484
56044B786484r2633q8553q1897p3275o6589o2079n6597n0411m6571m4107l9212
$$ 2786484 2693851 2605298 2523401 2450126 2383537 2321458 2264861 2214450 2167879 2123772 2084560
56033B084560l2715k8996k8085k6145k2992k1543k0836j7381j2608j0960j1629
$$ 2084560 2051845 2022849 1994764 1968619 1945627 1924084 1903248 1885867 1873259 1862299 1850670
56022A850670j0092o687n226m559m17N554P806O948Q455J2338J3753J3047J5147
$$ 1850670 1840578 1833891 1828665 1824106 1823689 1829243 1837049 1843997 1852452 1864790 1878543 1891590 1906737
56009A906737J9518K0788J9204K0281K4251K6034K5532K7559L1617L2341L0214
$$ 1906737 1926255 1947043 1966247 1986528 2010779 2036813 2062345 2089904 2121521 2153862 2184076
55998B184076L1103L4982L5906L3528L3738L7444L9505L9083M0236M2306M1009
$$ 2184076 2215179 2250161 2286067 2319595 2353333 2390777 2430282 2469365 2509601 2551907 2592916
55987B592916L8752M2022M8701N0384M7232M7749N3497N7434N8009O1256O7683
$$ 2592916 2631668 2673690 2722391 2772775 2820007 2867756 2921253 2978687 3036696 3097952 3165635
55976C165635P0736O9788P1301P5913P7823P7859Q3079R2490R7774R8932J04004
$$ 3165635 3236371 3306159 3377460 3453373 3531196 3609055 3692134 3784624 3882398 3981330 4085334
55965D085334J12630J16137J15161J20059J31887J40437J43576J50517J62777
$$ 4085334 4197964 4314101 4429262 4549321 4681208 4821645 4965221 5115738 5278515
55956E278515J70368J71025J74906J85756J95480K01954K13595K31386K45035
$$ 5278515 5448883 5619908 5794814 5980570 6176050 6378004 6591599 6822985 7068020
55947G068020K52238K63062K80365K94973L05142L20769L43170L61446L74360
$$ 7068020 7320258 7583320 7863685 8158658 8463800 8784569 9127739 9489185 9863545
55938I863545L94349M23839M49594M67054M87933N17183N45663N72392O09989
$$ 9863545 10257894 10681733 11131327 11598381 12086314 12603497 13149160 13721552 14331541
55929A4331541O60623P11060P58495Q15605Q83164R45322R99895J064529J144595
$$ 14331541 14992164 15703224 16461719 17277324 18160488 19105810 20105705 21170234 22314829
55920B2314829J225139J303104J395279J504892J614345J721167J845485J991652
$$ 22314829 23539968 24843072 26238351 27743243 29357588 31078755 32924240 34915892
55912C4915892K141268K295751K484211K716440K972636L252826L587275L983044
$$ 34915892 37057160 39352911 41837122 44553562 47526198 50779024 54366299 58349343
55904E8349343M415283M890991N463751O163987O976937P910430R011614J0290611
$$ 58349343 62764626 67655617 73119368 79283355 86260292 94170722 103182336 113472947
55896A13472947J1711180J3290663J5117080J7229968J9592571K2223977K5222703
$$ 113472947 125184127 138474790 153591870 170821838 190414409 212638386 237861089
55889B37861089K8604107L2274946L6164768L9936523M2189672M0331732L2137995
$$ 237861089 266465196 298740142 334904910 374841433 417031105 457362837 489500832
55882D89500832J7926957R77545j4509879k5899967l2821016l6132958l6817418
$$ 489500832 507427789 508405334 493895455 467995488 435174472 399041514 362224096
55875C62224096l5687332l3463328l0702208k7720865k4710256k1846928j9244492
$$ 362224096 326536764 293073436 262371228 234650363 209940107 188093179 168848687
55868A68848687j6908206j4815711j2980778j1401381j0023095q802502p749031
$$ 168848687 151940481 137124770 124143992 112742611 102719516 93917014 86167983
55861H6167983o868173o119240n463096m900681m432797m028552l663799l348708
$$ 86167983 79299810 73180570 67717474 62816793 58383996 54355444 50691645 47342937
55853D7342937l089120k858553k633901k423646k237520k061948j887814j730694
$$ 47342937 44253817 41395264 38761363 36337717 34100197 32038249 30150435 28419741
55845B8419741j601494j485708j371336j269598j189208j116821j041367r72761
$$ 28419741 26818247 25332539 23961203 22691605 21502397 20385576 19344209 18371448
55837A8371448r18990q68638q12984p62564p25463o90703o48800o08092n75941
$$ 18371448 17452458 16583820 15770836 15008272 14282809 13592106 12943306 12335214 11759273
55828A1759273n43937n06114m72251m49008m26650l98044l72322l56326l40688
$$ 11759273 11215336 10709222 10236971 9787963 9361313 8963269 8590947 8234621 7893933
55819G893933l17893k96619k84557k73818k56975k41575k35075k30539k20523
$$ 7893933 7576040 7279421 6994864 6721046 6464071 6222496 5987421 5756882 5536359
55810E536359k10787k07192k02877j91327j79160j73426j68671j58588j48390
$$ 5536359 5325572 5118380 4915503 4724176 4545016 4371590 4202919 4044331 3895941
55801C895941j43705j38639j26577j12271j02585r5609q8756q6725r1320r4132
$$ 3895941 3752236 3613597 3487020 3374749 3272164 3176555 3087799 3001074 2909754 2815622
55791B815622q9166q2420p9786p6533o8279o0966n9678n8371n1409m4810m5110
$$ 2815622 2726456 2644036 2564250 2487717 2419438 2358472 2298794 2240423 2189014 2144204 2099094
55780B099094m6963m3127l7666l7801m0796m0201l7843l8756m0732l9125l6081
$$ 2099094 2052131 2009004 1971338 1933537 1892741 1852540 1814697 1775941 1735209 1696084 1660003
55769A660003l5575l5119l1169k6971k6690k7500k5280k2326k1947k1664j8992
$$ 1660003 1624428 1589309 1558140 1531169 1504479 1476979 1451699 1429373 1407426 1385762 1366770
55758A366770j7506j9911k1650j8739j5288j5766j6619j3256q820q002q416o087
$$ 1366770 1349264 1329353 1307703 1288964 1273676 1257910 1241291 1228035 1219215 1211213 1202797 1196710
55746A196710l584m752o953o261m978o608q689p947p242j0085j3608j4111j4223
$$ 1196710 1193126 1188374 1181421 1175160 1170182 1163574 1154885 1146938 1139696 1129611 1116003 1101892 1087669
55733A087669j7290k0070j8519j5746j6569j8927j8239j5825j5584j6445j5330
$$ 1087669 1070379 1050309 1031790 1016044 999475 980548 962309 946484 930900 914455 899125
55722H99125j3707j4282j4874j2226q313o719o641o255p741j2817j7657j8418
$$ 899125 885418 871136 856262 844036 835723 829004 822363 816108 808367 795550 777893 759475
55710G59475j7566j8759j9969j7911j4757j3879j3346j0201p028p560r718r584
$$ 759475 741909 723150 703181 685270 670513 656634 643288 633087 626059 618499 608781 599197
55698E99197q449r365j0519q730n925n684o875o983q029j2559j7246j7262j3946
$$ 599197 590748 581383 570864 562134 556209 550525 543650 536667 528638 516079 498833 481571 467625
55685D67625j1940j1847j1763j2480j4763j4918r767k980j75p78q95p10k262l235
$$ 467625 455685 443838 432075 419595 404832 389914 380147 377167 376992 376214 375319 374609 372347 369112
55671C69112k72M065M597J631p03j780l729n640n178l967n032o878o230m505n293
$$ 369112 368840 372905 377502 379133 378430 376650 372921 367281 362103 358136 353104 346226 339996 335491 330198
55656C30198p448p008m154k099q27J829M763N339M828O099P738O589M307M963
$$ 330198 322750 315742 311588 309489 308662 310491 315254 320593 325421 331520 339258 345847 350154 355117
55642C55117P763Q527P017O454O917N644K945J662J601M84o09J257M636N111K428
$$ 355117 362880 371407 378424 384878 391795 397439 400384 402046 403647 404131 403522 404779 409415 414526 416954
55627D16954L84J41o30k259k580j682j746k182k66L519N888O225O710P346O045
$$ 416954 417338 417479 416849 414590 412010 410328 408582 406400 406134 409653 415541 421766 428476 435822 441867
55612D41867L379K233K734K411J143J261K904L844L693L824L747K170Q50K459
$$ 441867 445246 447479 450213 452624 453767 455028 457932 461776 465469 469293 473040 475210 476060 478519
55598D78519N264N096K124L82Q62N25j613k869k136j812l543o101q298j0237j1342
$$ 478519 483783 488879 491003 491385 492247 492772 491159 488290 486154 484342 480799 474698 466400 456163 444821
55583D44821j0857j0297j1844j4511j5569j5059j5060j5297j3875j1586j0901
$$ 444821 433964 423667 411823 397312 381743 366684 351624 336327 322452 310866 299965
55572B99965j1217r798p044o011o938p032n604m729m752l879k339k317l539l511
$$ 299965 288748 278950 271906 265895 258957 251925 246321 241592 236840 232961 230622 228305 224766 221255
55558B21255k269k263l384k913p30J56j230k708l437m730n892m227k33J918M26
$$ 221255 218986 216723 213339 210426 209696 209852 208622 205914 202477 197747 191855 187628 187395 189313 189739
55543A89739j880k510k395k719k718k075j865j945q00J079J163q89k443k091j240
$$ 189739 187859 185349 182954 180235 177517 175442 173577 171632 170832 171911 173074 172185 169742 167651 166411
55528A66411q67k76L40l08j497p73J892L708L414K567K044R93j32O73L223M741
$$ 166411 165544 165268 165608 165300 163803 163030 164922 168630 172044 174611 176655 177648 177516 178189 181412 186153
55512A86153M043K781K007J075N34K242N772Q296Q897R437J0550J0483Q647O594
$$ 186153 190196 192977 194984 196059 196593 198835 204607 212903 221800 231237 241787 252270 260917 267511
55498B67511M652J462k360m090l482l458n137o245n679n570o993p725o334m930
$$ 267511 272163 273625 271265 267175 263693 260235 255098 248853 243174 237604 230611 222886 216552 211622
55484B11622n521o707o203m131j945l46K89k48p72K88K044K082O95R04L530N786
$$ 211622 206101 199394 193191 189060 187115 186769 187058 186810 186038 186326 188370 190452 191147 192051 195581 201367
55468B01367N848N225N271M802K845O16q96k380l889l944k479j773k998m472m686
$$ 201367 207215 212440 217711 222513 225358 225974 225078 222698 218809 214865 212386 210613 207615 203143 198457
55453A98457m305m068l471k769l353n001n568m566m064m979n569m772l938l936
$$ 198457 194152 190084 186613 183844 180491 175490 169922 165356 161292 156313 150744 145972 142034 138098
55439A38098l711l003l319m719n001l521k640l658m588l695k174j314j90J744
$$ 138098 134387 131384 128065 123346 118345 114824 112184 108526 103938 100243 98069 96755 96565 98309
55425I8309K669J307o88j331j033r73j140j553k928m616m446k196n98j377k978
$$ 98309 100978 102285 101597 100266 99233 98260 97120 95567 92639 88023 83577 81381 80783 79406 76428
55410G6428l702m071m413l264l88J551P00j074j244k01L16J8p14k099l454k855
$$ 76428 72726 68655 64242 60978 60590 62141 62841 61767 60523 60322 60638 60656 59942 57843 54389 51534
55394E1534k99J258k7k091k355j339p09k57O00O12j148k814k038N38K473K863
$$ 51534 51235 52493 52466 50375 48020 46681 45972 45715 46315 46927 45779 42965 40927 41465 43938 46801
55378D6801K420J570M54l26m56m68m76J20R38O34n05l09J799L537L239K041J270
$$ 46801 49221 50791 51245 50919 50463 49995 49519 49639 50577 51211 50706 50397 52196 55733 58972 61013 62283
55361F2283L85q80j192j85L44l36l71J081J792L36j120m91P08N79O83L113O065
$$ 62283 62668 61788 60596 60411 60755 60419 60048 61129 62921 63257 62137 61646 62354 62933 63616 66729 72794
55344G2794O068L033k68k402l752m179l480l093m208n044l007J041L567L083J469
$$ 72794 78862 81895 81627 79225 75473 71294 67814 64721 60513 55469 52462 53503 57070 60153 61622
55329F1622Q19J153J306L73j634l417l273j429l42j508l204k881n43J805K818
$$ 61622 62441 63594 64900 65273 63639 60222 56949 55520 55178 53670 50466 47585 47042 48847 51665
55314E1665K478J281J17j50l4q92k324k167j52R70m25k103j564P8K71q91j477
$$ 51665 54143 55424 55541 55391 55357 54465 52141 49974 49822 50792 50367 48264 46700 46778 47049 46158 44681
55297D4681r87k55N43J470J644O97K7O03R31n23k501k824j750j034q76k33P80
$$ 44681 43694 43439 43982 45452 47096 47793 47820 48423 49354 48831 46330 43506 41756 40722 39846 39613 40393
55280D0393J053L33p69j747j806J6K805L703J598r57j378n35m47p36RJ268J729
$$ 40393 41446 41779 41010 39263 37457 37473 40278 43981 45579 44622 43244 42709 42262 41526 41535 42803 44532
55263D4532J747J995J453n45j944p59J385J531j89j584k447m057n696n298l106
$$ 44532 46279 48274 49727 49182 47238 46479 47864 49395 49206 47622 45175 41118 35422 30124 27018
55248B7018j361o55L11J602J723M44p61j088r18j80J381K561J820j74j251q19
$$ 27018 25657 25002 25313 26915 28638 29082 28321 27233 26315 26135 27516 30077 31897 31723 30472 29653
55232B9653j05K25O01J039J186J374J841J599O3j206o40N79M46k44O78K535K324
$$ 29653 29548 29773 30374 31413 32599 33973 35814 37413 37476 36270 35630 36209 36655 36411 37089 39624 41948
55215D1948m28k592j720J022K898K517L56j993k796j762m88k14m1J148K293J899
$$ 41948 41520 38928 37208 38230 41128 43645 44001 42008 39212 37450 36962 36748 36707 37855 40148 42047
55199D2047R75J511K829K378j55k350k700k199k089k239k170j712n24J367K662
$$ 42047 43022 44533 47362 49740 49585 47235 44535 42336 40247 38008 35838 34126 33602 34969 37631
55184C7631K069K43j050j235r54n21j06m29j467j520M00K466K527J376J069J301
$$ 37631 39700 39943 38893 37658 36704 36183 36077 35648 34181 32661 33061 35527 38054 39430 40499 41800
55168D1800N13n90M4J991K798J880Q00M7j167k088q43J954L348K282Q72Q89J677
$$ 41800 42313 41723 41767 43758 46556 48436 49236 49283 48116 46028 45185 47139 50487 52769 53641 54530 56207
55151E6207K065J836Q41r73k402k126j036j037j768j241M64J181M30k8L44J08
$$ 56207 58272 60108 60949 59976 57574 55448 54412 53375 51607 50366 50830 52011 52441 52413 52757 52865
55135E2865q21m30J809L622L412K305J593Q18l33p34O7O49N8n22J85J417J478
$$ 52865 52044 51614 53423 57045 60457 62762 64355 65173 64840 64106 64173 64822 64880 64358 64543 65960 67438
55118F7438j71k672m432l912j101J763K487J601J043R31J22p92j94J137P03j444
$$ 67438 67267 64595 60163 56251 55150 56913 59400 61001 62044 62975 63097 62305 62111 63248 63951 62507
55102F2507k524j626q21r85k41K034L277J719q07k008k296k765k677j295K5j55
$$ 62507 59983 58357 57536 56551 56310 58344 61621 63340 62533 60525 58229 55464 52787 51492 51517 51362
55086E1362j017j140q48j024j222p33j27p6m5M67P41L07N8O74J375J436J492K082
$$ 51362 50345 49205 48357 47333 46111 45378 45251 45175 45130 45597 46338 46645 46703 47377 48752 50188 51680 53762
55068E3762K435J905J158Q29N39J56M15J221J192l1q55l48K10k75p30n5Q23P45
$$ 53762 56197 58102 59260 60089 60628 60784 61199 62420 63612 63581 62726 62378 62588 62313 61583 61528 62351 63096
55050F3096N45J440K664K748J977J576J368K23j686k761j990P9K163L366L784
$$ 63096 63641 65081 67745 70493 72470 74046 75414 75637 73951 71190 69200 69279 71442 74808 78592
55035G8592M299N185N198L195L93q58m31l33j084r09P28J734Q94O3J038K692L215
$$ 78592 82891 88076 93274 96469 96862 96004 95573 95240 94156 93247 93975 95709 96603 96666 97704 100396 103611
55018A03611K947K857K231L08j527j647q86r89j565j067K28O97J94R2Q94J692
$$ 103611 106558 109415 111646 111954 110427 108780 107894 106905 105340 104273 104501 105198 105392 105484 106378 108070
55002A08070J818J372M28q20j553j307r59j513k400k235p38J066K013J454m05
$$ 108070 109888 111260 111688 110868 109315 108008 107049 105536 103136 100901 100163 101229 103242 104696 104291
54987A04291k136k137p67n5o33p48O01J647O85j006j209k05J49n12j209j829k801
$$ 104291 102155 100018 99251 99196 98563 97815 98416 100063 100748 99742 98533 98328 98477 97965 96756 94927 92126
54970I2126l294j991P35L311N009N691M543J309j890k516j011M6j53j32N38L12
$$ 92126 88832 86841 87576 90887 95896 101587 106130 107439 105549 103033 102022 102068 101915 101783 102321 102633
54954A02633j277k120m85K352L881L498K590K235K051J144o40k491l417l226k633
$$ 102633 101356 99236 98751 101103 104984 108482 111072 113307 115358 116502 115862 113371 109954 106728 104095
54939A04095k312k111j494m87K80K82l50r27p62K2M31pj55J362L788M766L427
$$ 104095 101783 99672 98178 97691 97971 98253 97903 96976 96214 96236 96667 96660 96505 97867 101655 106421 109848
54922A09848J419L55k7m63o66l34o2J4R96L254N075M794L126J900J653K053L412
$$ 109848 111267 111622 111595 111132 110466 110132 110070 110084 111080 114334 119409 124203 127329 129229 130882 132935 136347
54905A36347N915Q310R129Q573P727O867O156O773R352J2141J2954J2382J2877
$$ 136347 142262 150572 159701 168274 176001 182868 189024 195797 205149 217290 230244 242626 255503
54892B55503J5105J7406J8704J9616K0543K0626J9098J6007J1350M998k090p989
$$ 255503 270608 288014 306718 326334 346877 367503 386601 402608 413958 418956 416866 408877
54880D08877j1613j3522j4695j5525j6037j6189j5853j5262j5164j5694j5589
$$ 408877 397264 383742 369047 353522 337485 321296 305443 290181 275017 259323 243734
54869B43734j3625j0384p433n269l492k394k619l342k641k7K846M422M965N682
$$ 243734 230109 219725 212292 207023 203531 201137 198518 195176 192535 192508 195354 199776 204741 210423
54855B10423P131Q926J0280J0621J0257J0436J2117J4787J7046J7933J7189J4926
$$ 210423 217554 226480 236760 247381 257638 268074 280191 294978 312024 329957 347146 362072
54843C62072J1940R602Q166N844R31n628j1228j4742j7161j9376k0963k1278k0288
$$ 362072 374012 383614 391780 397624 398555 392927 381699 366957 349796 330420 309457 288179 267891
54830B67891j8157j5177j2242j0266r172q417q189q795r170p698m683k452k668
$$ 267891 249734 234557 222315 212049 202877 194460 186271 177476 168306 160608 155925 153473 150805
54817A50805m659o589o976n070j301K188K950R02j461k030j201n59o74j044j292
$$ 150805 146146 139557 132581 127511 126210 128398 131348 132250 130789 128759 127558 126999 126325 125281 123989
54802A23989j473j619j752k040k459k507j710k63J032J387O77m23j071j189j361
$$ 123989 122516 120897 119145 117105 114646 112139 110429 110166 111198 112585 113262 112839 111768 110579 109218
54787A09218j728j671j027p06j272j748r75M14Q14Q8k58O30J846K166J435J25
$$ 109218 107490 105819 104792 104086 102814 101066 100091 100505 101319 101407 101149 101779 103625 105791 107226 107351
54771A07351j386k521k391p26J455K652K321J287Q65J500K362K404J732J390J790
$$ 107351 105965 103444 101053 100327 101782 104434 106755 108042 108907 110407 112769 115173 116905 118295 120085
54756A20085K317K696L646N474P071P294O479N668N167M953N584P345R297J0547
$$ 120085 122402 125098 128744 134218 141289 148583 155062 160730 165897 170850 176434 183779 193076 203623
54742B03623J1793J4069J6597J7700J7427J7541J8862K0337K0772J9947J7915
$$ 203623 215416 229485 246082 263782 281209 298750 317612 337949 358721 378668 396583
54731C96583J4729J1033P535L720j341o772j0263j1138j1368j2789j4749j5568
$$ 396583 411312 422345 429880 433600 432259 425487 415224 404086 392718 379929 365180 349612
54719C49612j4954j3790j2430j0595q501o850n793m845l915l652m416n353n064
$$ 349612 334658 320868 308438 297843 289342 282492 276699 271854 267939 264287 259871 254518 249454
54706B49454l218r99M01J409L408O662R827J1780J2921J4184J5661J6958J8017
$$ 249454 246236 245237 245638 247047 250455 257117 266944 278724 291645 305829 321490 338448 356465
54693C56465J8811J8980J8543J8210J8232J7696J5800J2851R200M406j234n639
$$ 356465 375276 394256 412799 431009 449241 466937 482737 495588 504788 509194 507960 502321
54681E02321p143p024p924j0351j2541j3418j3752j4409j5194j5636j5656j5289
$$ 502321 495178 488154 480230 469879 457338 443920 430168 415759 400565 384929 369273 353984
54669C53984j4751j4597j4884j4693j3556j2579j2635j2476j0526p747o324o059
$$ 353984 339233 324636 309752 295059 281503 268924 256289 243813 233287 225540 219216 213157
54657B13157m805k374j141k275m087m982n488o063n402k698L08J524J424J881
$$ 213157 208352 205978 204837 202562 198475 193493 188005 181942 176540 173842 174150 175674 177098 178979
54643A78979L062L384K027r0j681k123j250N77K111J861l20k673l080j171J164
$$ 178979 182041 185425 187452 187362 185681 183558 182308 182885 184996 186857 186537 183864 180784 179613 180777
54628A80777J681J29j631j868o62R29K338L376L537K568J237M67J79M8O43K583
$$ 180777 182458 182587 180956 179088 178426 179355 181693 185069 188606 191174 192411 192878 193057 193105 193748 196331
54612A96331M989O265O063N262M479L857L795M400M798M535M859O802Q855Q943
$$ 196331 201320 207585 213648 218910 223389 227246 231041 235441 240239 244774 249633 256435 265290 274233
54598B74233Q061R053J1912J3377J1625Q519O298M854L511K840L070K846J350
$$ 274233 282294 291347 303259 316636 328261 336780 343078 347932 351443 354283 357353 360199 361549
54585C61549j0L17J802L161M373N777O571O065N373O208Q552J0861J2014J2007
$$ 361549 361539 361856 363658 366819 371192 376969 383540 389605 394978 401186 409738 420599 432613 444620
54571D44620J1403J0979J1169J1053Q831M099j242n228p869j0198j2484j4497
$$ 444620 456023 467002 478171 489224 498055 502154 500912 495684 487815 477617 465133 450636
54559D50636j6415j8193j8886j7805j5700j3779j2181j0380q341o368m462k663
$$ 450636 434221 416028 397142 379337 363637 349858 337677 327297 318956 312588 308126 305463
54547C05463j333l98Q98K701L924L716K683J848J296P13K07l41j754m208o316
$$ 305463 304130 303732 304630 307331 311255 314971 317654 319502 320798 321511 321718 321377 319623 315415 309099
54532C09099o773o131n770n864n670n235n399o361p375p809p619p003o247n721
$$ 309099 302326 296195 290425 284561 278891 273656 268257 261896 254521 246712 239093 232090 225843 220122
54518B20122n398m776l739l049l384m413n342n845n896n388m512l869l564k869
$$ 220122 214724 209948 206209 203160 199776 195363 190021 184176 178280 172892 168380 164511 160947 158078
54504A58078j323L91J245R53j80j717k916l007k225j812k299k748k265j295o42
$$ 158078 156755 157146 158391 159344 159164 157447 154531 151524 149299 147487 145188 142440 140175 138880 138238
54489A38238j89L86N32l90j693j863k66K275M356N024M310L186K599K488K249
$$ 138238 138049 138435 138967 138577 136884 135021 134755 137030 141386 146410 150720 153906 156505 158993 161242
54474A61242K062K649L772M321M130M334N381O211N960N220M924N327O588Q722
$$ 161242 163304 165953 169725 174046 178176 182510 187891 194102 200062 205282 210206 215533 222121 230843
54460B30843J0355R343N678K044M20j47j312k995m652o877r738j1270r937p281
$$ 230843 241198 250541 256219 258263 258683 258536 257224 254229 249577 242700 232962 221692 211755 204474
54446B04474n815n485m652l486l655n126n941n205l967l059k226j549j699k360
$$ 204474 198659 193174 188522 185036 181381 176255 170314 165109 161142 158083 155857 154308 152609 150249
54432A50249k183q50L33L11n49j460k073k041r64P40J949K199K114K348K788K964
$$ 150249 148066 147216 147549 147860 147311 145851 143778 141737 140773 141513 143462 145661 147775 150123 152911 155875
54416A55875K522J367k7o15J69J572K463K759L094L513L513L043K520K052J468
$$ 155875 158397 159764 159737 159122 159291 160863 163326 166085 169179 172692 176205 179248 181768 183820 185288
54401A85288Q36K22o03j449j530q98j172l392n981o419m576k643k031k049j742
$$ 185288 186124 186346 185743 184294 182764 181866 180694 177302 171321 164902 160326 157683 155652 153603 151861
54386A51861j326j431k134l108l788l382j696M9L70n03r41j71Q50J021L90k92
$$ 151861 150535 149104 146970 143862 140074 136692 134996 135045 135415 134912 133971 133800 134650 135671 136061 135769
54370A35769m15K36J224J538P01l24k46P30J288J006P75J150J536J403J164J461
$$ 135769 135354 135590 136814 138352 139053 138729 138483 139213 140501 141507 142282 143432 144968 146371 147535 148996
54354A48996K214K826K845K357K062K780M339N381M984M045M076N047N497M717
$$ 148996 151210 154036 156881 159238 161300 164080 168419 173800 178784 182829 186905 191952 197449 202166
54340B02166L570L134L518M251N088O089P394Q929J0166J0494J0188J0295J0980
$$ 202166 205736 208870 212388 216639 221727 227816 235210 244139 254305 264799 274987 285282 296262
54327B96262J0943R318P277O427O310N053K097j170l412m589n194n564o077p036
$$ 296262 307205 316523 323800 330227 336537 341590 343687 342517 339105 334516 329322 323758 317681 310645
54313C10645q163q938r305r326q640p213o048o106o818o847n925m821l908l015
$$ 310645 302482 293544 284239 274913 266273 259060 253012 246906 240088 233241 227316 222495 218587 215572
54299B15572k315k137k260k493l280m516m584k321P87K272K075K174L176L683
$$ 215572 213257 211120 208860 206367 203087 198571 193987 191666 192453 194725 196800 198974 202150 205833
54285B05833L145K907L809M868N220N532O548P634P798P094O261N870O283P500
$$ 205833 208978 211885 215694 220562 225782 231314 237862 245496 253294 260388 266649 272519 278802 286302
54271B86302Q672Q670P380N560L484Q68j942l986m944n117m502l349l299n908
$$ 286302 294974 303644 311024 316584 320068 320936 318994 315008 310064 304947 300445 297096 293797 287889
54257B87889r917j2099j1280r559r026r363r432r168q725p564n683m281l982l746
$$ 287889 277972 265873 254593 245034 236008 226645 217213 208045 199320 191756 186073 181792 177810 174064
54243A74064k730j873k394l774m613m583m274l929l517l370l645l717l027k041
$$ 174064 171334 169461 167067 163293 158680 154097 149823 145894 142377 139007 135362 131645 128618 126577
54229A26577j518j301p15K48Q91O91k04j259j982k300k438k183q04J597L327K959
$$ 126577 125059 123758 123043 123291 124182 124873 124669 123410 121428 119128 116690 114507 113703 115300 118627 121586
54213A21586J464R04J405J339L57j9P87J345P86K92P98J265O25l32n45n40j065
$$ 121586 123050 123954 125359 126698 127055 127036 127823 129168 129954 130246 131044 132309 132934 132602 132057 131517 130452
54196A30452j276j96J226J395O13M73J238J652J059J02o50j317j932k142j872
$$ 130452 129176 128980 130206 131601 132214 132687 133925 135577 136636 136738 136088 134771 132839 130697 128825
54181A28825j382o99K57J133J419J166Q03M01k93j230j935j973j269k14M92M70
$$ 128825 127443 126744 127001 128134 129553 130719 131522 131923 131630 130400 128465 126492 125223 125009 125501 125971
54165A25971J70K76O79P64O22Q43J131M73j011j739q65M74Q79M63J0m62j220j708
$$ 125971 126141 126417 127096 127860 128482 129325 130456 130929 129918 128179 127314 127788 128667 129130 129140 128678 127458 125750
54147A25750j138K41J340J439O93j79m97l58p08k044l260k996j720r23n43N82
$$ 125750 124612 124853 126193 127632 128325 128146 127649 127291 126583 124539 121279 118283 116563 115640 115097 115679
54131A15679J730N74k718m580k859M5R25J60q3R4p60j962j616k41j63j362j237
$$ 115679 117409 117983 115265 110685 107826 107871 108796 108956 108873 108967 108207 106245 104629 104388 104225 102863 101626
54114A01626R82K611J428j172k370j445L27J872K861K926J867M49j13M54J257
$$ 101626 102608 105219 106647 105475 103105 101660 101987 103859 106720 109646 111513 111962 111849 112303 113560
54099A13560J478J320J444J788J446j32k235l545l423k096j12J672K077Q53m17
$$ 113560 115038 116358 117802 119590 121036 120904 118669 115124 111701 109605 109493 111165 113242 114095 113678
54084A13678j06Q93K16k244l828k982j381j019j277o18O22J145J121J523K026
$$ 113678 113572 114465 114681 112437 108609 105627 104246 103227 101950 101332 101954 103099 104220 105743 107769
54069A07769J517J47r42j459j944k358k111j100L93K047K828J300j972l847k342
$$ 107769 109286 109433 108491 107032 105088 102730 100619 99519 99912 101959 104787 106087 104115 100268 97926
54054I7926L77R32n59j252r2J304J769J764J543P94J61O14J255K67j825k450r19
$$ 97926 98303 99235 98676 97424 97332 98636 100405 102169 103712 104506 104667 105281 106536 106803 104978 102528 101609
54037A01609O55Q92Q71J482J703P88j93l74n28j171j238j74N68k10j237n98J443
$$ 101609 102264 103156 104027 105509 107212 108000 107807 107433 106905 105734 104496 104322 104890 104680 103443 102845 104288
54020A04288L092L480L010K102J023K80J5l57j126j725j876k105k307j172J719
$$ 104288 107380 110860 113870 115972 116995 117275 117290 116933 115807 114082 112206 110101 107794 106622 108341
54005A08341M446M912L477K119J757J755J341L82o82o74J523M894O370M541K056
$$ 108341 112787 117699 121176 123295 125052 126807 128148 128530 127848 127174 128697 133591 139961 144502 146558
53990A46558K338M922O384N282L617L277L636L437K911K925L479M161M963N742
$$ 146558 148896 153818 160202 165484 169101 172378 176014 179451 182362 185287 188766 192927 197890 203632
53976B03632N908N408N190N956P270Q548R901J1309J1938J1315J0293R730R131
$$ 203632 209540 214948 220138 226094 233364 241912 251813 263122 275060 286375 296668 306398 315529
53963C15529P792O528O607P444P213N838N404O980Q815Q817P347O096N260L635
$$ 315529 323321 329849 336456 343900 351113 356951 362355 369335 378150 386967 394314 400410 405670 409305
53949D09305J088r85j792k184l054m061m619n000n596n995n820n818o963q695
$$ 409305 410393 409408 407616 405432 402378 398317 393698 388698 383102 377107 371287 365469 358506 349811
53935C49811r181p506m920l612m496o405p251o075l886k455k400k913l202l306
$$ 349811 340630 333124 328204 324592 320096 313691 306440 300365 296479 294024 291624 288711 285509 282203
53921B82203l233k409o95P45O61p00k157l204m069m471l669j887n40n69j361j751
$$ 282203 278970 276561 275866 276611 277272 276572 274415 271211 267142 262671 259002 257115 256575 256006 254645 252894
53905B52894j435r17n59k62R5K92L1n26o74J19J308J696R17K7J80J278K592M022
$$ 252894 251459 250542 249983 249721 249816 250108 250139 249613 248939 249058 250366 252062 252979 253006 253186 254464 257056 261078
53887B61078N733O944O387M192K249K311M328O955R007J0150J0686J1161J1962
$$ 261078 266811 273755 280142 284334 286583 288894 293222 300177 309184 319334 330020 341181 353143
53874C53143J3123J4558J6239J7797J8271J6959J4428J2081J0654R689Q391O458
$$ 353143 366266 380824 397063 414860 433131 450090 464518 476599 487253 496942 505333 511791
53862E11791L961J241r72j839j141O49K911M995O025N455M059L512M542O063O605
$$ 511791 515752 516993 516021 514182 513041 513690 516601 521596 527621 533076 537135 540647 545189 551252 557857
53847E57857O136N923O914Q728J0184J0402R414P881O385M952L329J547m2j280
$$ 557857 563993 569916 576830 585558 595742 606144 615558 623439 629824 634776 638105 639652 639610 638330
53833F38330k496m078n834o994p086o748p316r299j1658j3055j3409j3576j3799
$$ 638330 635834 631756 625922 618928 611842 605094 597778 588479 576821 563766 550357 536781 522982
53820E22982j3625j3293j3757j4984j5502j4337j2250j0338q687p387p446r245
$$ 522982 509357 496064 482307 467323 451821 437484 425234 414896 406209 398822 391376 382131
53808C82131j1118j1189j0010r579j0270j0514r427p913o982o531o163n908n697
$$ 382131 371013 359824 349814 340235 329965 319451 310024 302111 295129 288598 282435 276527 270830
53795B70830n249m792m907n405n369m492l411k647k181k161k907m054m657m449
$$ 270830 265581 260789 255882 250477 245108 240616 237205 234558 232377 230216 227309 223255 218598 214149
53781B14149l987l458k514j356q34j064j165p50n50j066j659j559r37l55O6M20
$$ 214149 210162 206704 204190 202834 202000 200936 199771 199021 198471 197405 195746 194187 193250 192895 192961 193381
53765A93381O08O30P14Q74Q98P96O27j5j441k828k836j338N35K186M023N893O520
$$ 193381 193989 194619 195333 196207 197105 197901 198528 198513 197072 194244 191408 190070 190605 192791 196814 202707 209227
53748B09227N281L427K591K908L347L367L461M314N895P295P614P231P688R617
$$ 209227 214508 217935 220526 223434 226781 230148 233609 237923 243818 251113 258727 265958 273646 283263
53734B83263J1482J1512J0218R436R409Q773P290O339O457O513N951N608N608
$$ 283263 294745 306257 316475 325911 335320 344093 351383 357722 364179 370692 376643 382251 387859
53721C87859M630K372O75P25J038j23k121l365l952m888n997o544o889p591p720
$$ 387859 392489 394861 395536 396261 397299 397176 395055 391690 387738 382850 376853 370309 363420 355829 348109
53706C48109o150l952l417m919o542o870o417o249o533o788o573n775m875m717
$$ 348109 341959 338007 334590 329671 323129 316259 309842 303593 297060 290272 283699 277924 273049 268332
53692B68332n343n587m650l411l103l437l335k902l094l672l203j302N57P68p33
$$ 268332 262989 257402 252752 249341 246238 242801 239466 236564 233470 229798 226595 225293 225850 226618 225885
53677B25885k780m024l614j701M30J330O76o88j689j667o11O01P77j6j65J367
$$ 225885 223105 219081 215467 213766 214196 215526 216202 215514 213825 212158 211547 212148 212925 212909 212744 214111
53661B14111L359L984L445L403M147M114K453N53K63J670L357M225M414M577M710
$$ 214111 217470 221454 224899 228302 232449 236563 239016 239569 239832 241502 244859 249084 253498 258075 262785
53646B62785M028K263O94Q83K337K804J654J246L396N951N185J023k654l011j263
$$ 262785 266813 269076 269770 270653 272990 275794 277448 278694 282090 288041 293226 294249 291595 288584 287321
53631B87321p4j09m51p99j607k635k714j117J511L576L851K549J067L92J00o06
$$ 287321 287247 287138 286687 285888 284281 281646 278932 277815 279326 282902 286753 289302 290369 290761 290861 290255
53615B90255j351j098P7R73J108J357K448L864M742M936M755M316L731L265K958
$$ 290255 288904 287806 287883 288856 289964 291321 293769 297633 302375 307311 312066 316382 320113 323378 326336
53600C26336K532J961J549J311R21M71N95J461K316K409J845J224R30R55R90N91
$$ 326336 328868 330829 332378 333689 334610 335081 335676 337137 339453 341862 343707 344931 345861 346816 347806 348397
53584C48397l19j090j167j076j771k982l345k417j444j556k229k318j713j129
$$ 348397 348078 346988 345821 344745 342974 339992 336647 334230 332786 331230 329001 326683 324970 323841
53570C23841r14j005j552k477k779j426R66K375J778N89R98L107M583L483P50
$$ 323841 322927 321922 320370 317893 315114 313688 314654 317029 318807 319396 320394 323501 328084 331567 332317
53555C32317q38%J812K821L258M282N539N534M231L453M247N392N368M504M055
$$ 332317 331479 331479 333291 336112 339370 343652 349191 354725 358956 362409 366656 372048 377416 381920 385975
53540C85975M242M458M774N684O764O969O268N683N568N112L973L149L556M672
$$ 385975 390217 394675 399449 405133 411897 418866 425134 430817 436385 441497 445470 448619 452175 456847
53526D56847N430N657N668N101L419J389P21J933L613M154L416K279J427J174
$$ 456847 462277 467934 473602 478703 482122 483511 484232 486165 489778 493932 497348 499627 501054 502228
53512E02228J659K431K475J457M13L95J040J463J834K736L493K893J493J357L043
$$ 502228 503887 506318 508793 510250 510663 511058 512098 513561 515395 518131 521624 524517 526010 527367 530410
53497E30410M626M441L147K195J757J441J689K910M245M741N036O281Q021Q794
$$ 530410 535036 539477 542624 544819 546576 548017 549706 552616 556861 561602 566638 572919 580940 589734
53483E89734Q407P943P796P423P006P598R256J0683J1148J1216J1075R789P291
$$ 589734 598141 606084 613880 621303 628309 635907 645163 655846 666994 678210 689285 699074 706365
53470G06365N751P400J1579J5312J6576J5924J4976J4442J4030J3569J3529J4418
$$ 706365 712116 719516 731095 746407 762983 778907 793883 808325 822355 835924 849453 863871
53458H63871J6081J7757J8816J9322J9829K0731K1865K2657K2652K2023K1543
$$ 863871 879952 897709 916525 935847 955676 976407 998272 1020929 1043581 1065604 1087147
53447A087147K1780K2399K2717K2908K3965K6114K8054K8505K7911K7889K9231
$$ 1087147 1108927 1131326 1154043 1176951 1200916 1227030 1255084 1283589 1311500 1339389 1368620
53436A368620L1237L2841L3710L4318L5448L7577M0182M1832M1525L9869L8497
$$ 1368620 1399857 1432698 1466408 1500726 1536174 1573751 1613933 1655765 1697290 1737159 1775656
53425A775656L8381L9133L9679L9236L7884L6604L6505L7481L8058L7045L4991
$$ 1775656 1814037 1853170 1892849 1932085 1969969 2006573 2043078 2080559 2118617 2155662 2190653
53414B190653L3355L2729L2630L2596L2481L1927L0571K8828K7678K7421K7174
$$ 2190653 2224008 2256737 2289367 2321963 2354444 2386371 2416942 2445770 2473448 2500869 2528043
53403B528043K5684K2380J7964J4234J2793J3199J3051J0546O360K201j624n760
$$ 2528043 2553727 2576107 2594071 2608305 2621098 2634297 2647348 2657894 2664254 2666455 2664831 2659071
53391B659071r656j1777j2044j2390j4352j7385k0047k1780k2944k3901k4758
$$ 2659071 2649415 2637638 2625594 2613204 2598852 2581467 2561420 2539640 2516696 2492795 2468037
53380B468037k5433k5735k5724k6047k7278k9008l0208l0509l0386l0149k9594
$$ 2468037 2442604 2416869 2391145 2365098 2337820 2308812 2278604 2248095 2217709 2187560 2157966
53369B157966k8647k7621k6724k5982k5535k5321k4717k3256k1395j9722j7844
$$ 2157966 2129319 2101698 2074974 2048992 2023457 1998136 1973419 1950163 1928768 1909046 1891202
53358A891202j5226j2729j1784j2110j1741r573o551m003k117m61J178L076N713
$$ 1891202 1875976 1863247 1851463 1839353 1827612 1818039 1811488 1807485 1805368 1804907 1806085 1809161 1814874
53345A814874R025J2289J4912J6848J8275J9660K1897K5239K8373K9867L0330
$$ 1814874 1823899 1836188 1851100 1867948 1886223 1905883 1927780 1953019 1981392 2011259 2041589
53334B041589L1584L3880L5807L7135L9547M3871M8536N1889N4409N7307O0372
$$ 2041589 2073173 2107053 2142860 2179995 2219542 2263413 2311949 2363838 2418247 2475554 2535926
53323B535926O2526O3632O4419O5291O6176O6993O7549O7541O7188O7142O7349
$$ 2535926 2598452 2662084 2726503 2791794 2857970 2924963 2992512 3060053 3127241 3194383 3261732
53312C261732O6950O5662O4213O3005O1487N9302N6762N3735M9590M4866M1344
$$ 3261732 3328682 3394344 3458557 3521562 3583049 3642351 3699113 3752848 3802438 3847304 3888648
53301C888648L9391L6838L1820K5254J9113J3507P300N25n665j1076j6767k3282
$$ 3888648 3928039 3964877 3996697 4021951 4041064 4054571 4061871 4062396 4056731 4045655 4028888 4005606
53289D005606k9825l5221l8999m1604m4023m6934m9970n2352n4197n6185n7914
$$ 4005606 3975781 3940560 3901561 3859957 3815934 3769000 3719030 3666678 3612481 3556296 3498382
53278C498382n8164n7132n6491n6596n5659n2932n0576n0604n1875n2202n1911
$$ 3498382 3440218 3383086 3326595 3269999 3214340 3161408 3110832 3060228 3008353 2956151 2904240
53267B904240n2780n4611n5367n4176n1950m9380m6468m3724m1805m0196l8015
$$ 2904240 2851460 2796849 2741482 2687306 2635356 2585976 2539508 2495784 2453979 2413783 2375768
53256B375768l5816l4666l3896l1882k8854k6703k5981k5324k4017k2989k2637
$$ 2375768 2339952 2305286 2271390 2239508 2210654 2183951 2157970 2132646 2108629 2085640 2063003
53245B063003k1843j9931j7941j6967j6602j5778j4127j1888r457p431o106m736
$$ 2063003 2041160 2021229 2003288 1986321 1969719 1953941 1939814 1927926 1918469 1911038 1904932 1900196
53233A900196k329P90L516N917R077J2852J5682J7047J8302K0436K2821K5042
$$ 1900196 1897867 1898657 1902173 1908090 1917167 1930019 1945701 1962748 1981050 2001486 2024307 2049349
53221B049349K8055L2189L5531L6026L4233L2542L2336L3296L4735L6134L6719
$$ 2049349 2077404 2109593 2145124 2181150 2215383 2247925 2280261 2313557 2348292 2384426 2421145
53210B421145L5993L4752L4343L4686L3983L0813K5917K1432J8642J6831J4434
$$ 2421145 2457138 2491890 2526233 2560919 2594902 2625715 2651632 2673064 2691706 2708537 2722971
53199B722971J0989P521M979K863j7l843p578j0362j2352j4206j6491j9587k3454
$$ 2722971 2733960 2741481 2746460 2749323 2749306 2745463 2737885 2727523 2715171 2700965 2684474 2664887 2641433
53186B641433k7337l0269l1937l2580l2223l0771k8671k6699k5242k4537k5171
$$ 2641433 2614096 2583827 2551890 2519310 2487087 2456316 2427645 2400946 2375704 2351167 2325996
53175B325996k7188k8967k8727k7081k6410k7296k7461k5111k1636j9742k0107
$$ 2325996 2298808 2269841 2241114 2214033 2187623 2160327 2132866 2107755 2086119 2066377 2046270
53164B046270k1365k2351k2873k2774k1809k0336j9126j8450j7981j7367j6280
$$ 2046270 2024905 2002554 1979681 1956907 1935098 1914762 1895636 1877186 1859205 1841838 1825558
53153A825558j4360j1818r705q854q952r335r997j0989j1637j1565j1935j4141
$$ 1825558 1811198 1799380 1789675 1780821 1771869 1762534 1752537 1741548 1729911 1718346 1706411 1692270
53141A692270j7428j9441j9351j8910j9787k1235k1426k0106j8757j8563j9419
$$ 1692270 1674842 1655401 1636050 1617140 1597353 1576118 1554692 1534586 1515829 1497266 1477847
53130A477847k0660k1713k1875k0556j8329j7051j8144k0850k2918k2975k1781
$$ 1477847 1457187 1435474 1413599 1393043 1374714 1357663 1339519 1318669 1295751 1272776 1250995
53119A250995k0937k0984k1261k1226k1135k1323k1494k1201k0695k0661k1139
$$ 1250995 1230058 1209074 1187813 1166587 1145452 1124129 1102635 1081434 1060739 1040078 1018939
53108A018939k1245k0243j8563j7412j7405j8056j8554j8674j8711j8908j9274
$$ 1018939 997694 977451 958888 941476 924071 906015 887461 868787 850076 831168 811894
53097H11894j9652j9631j8638j6668j4706j3810j3871j3909j3474j2995j2700
$$ 811894 792242 772611 753973 737305 722599 708789 694918 681009 667535 654540 641840
53086F41840j2202j1407j0897j0859j0582r661q868r008r499r141p810o444n608
$$ 641840 629638 618231 607334 596475 585893 576232 567364 558356 548857 539716 531906 525462 519854
53073E19854n062m617m525m933n513n697n031l524j942j166q99K37K690M994N756
$$ 519854 514792 510175 505650 500717 495204 489507 484476 480952 479010 477844 476945 477182 479872 484866 490622
53058D90622N654O184P222P483O817O257N915M707K417K52j036k045l216l931
$$ 490622 496276 502460 509682 517165 523982 530239 536154 540861 543278 543530 542494 540449 537233 533302
53044E33302l846l803m594n981p524r320j1152j2100j1764j0975j0452r824q767
$$ 533302 529456 525653 521059 515078 507554 498234 487082 474982 463218 452243 441791 431967 423200
53031D23200q048q438r395r908r839r555q933p880p073p055p097o172m649l884
$$ 423200 415152 406714 397319 387411 377572 368017 359084 351204 344131 337076 329979 323807 319158 315274
53017C15274m364n238n597n213m252l095k380k383k527k183j754k046k850l223
$$ 315274 310910 305672 300075 294862 290610 287515 285135 282752 280225 278042 276288 274242 271392 268169
53003B68169l026l140l869m329l789k866k651l184l445k711j377l80p5R1O96J410
$$ 268169 265143 262003 258134 253805 250016 247150 244499 241315 237870 235159 233782 233402 233327 233418 234114 235524
52987B35524J394N18l39n26l99m98n47j15K97k58j759l249m072m177l367j418
$$ 235524 236918 237436 237097 236571 236172 235674 235127 235012 235309 235051 233292 230043 225971 221794 218427 217009
52971B17009Q06J555K13j753k513j899r84l91J16P25J233J503J525J091J08q09
$$ 217009 217815 219370 219583 217830 215317 213418 212434 212043 212159 212884 214117 215620 217145 218236 218344 217535
52955B17535q11O1R03J184J292J709K421L262M039M077K673N57k77R73K618K717
$$ 217535 216724 216785 217688 218872 220164 221873 224294 227556 231595 235672 238345 238902 238625 239598 242216 244933
52939B44933J724J461K241K785K655K687K929K319R21M89J750K936K291N43n00
$$ 244933 246657 248118 250359 253144 255799 258486 261415 263734 264655 265144 266894 269830 272121 272664 272164
52924B72164n05j37P62K678M767N580N067M435M392M945O326Q519J0238J0134
$$ 272164 271659 271522 272284 274962 279729 285309 290376 294811 299203 304148 310474 318993 329231 339365
52910C39365Q875Q403R275J0318J0815J1250J1858J2115J1701J0461P560K643
$$ 339365 348240 356643 365918 376236 387051 398301 410159 422274 433975 444436 451996 454639
52898D54639k155l701j882N0j61j380k062l107n804q720r071o468l317j879k315
$$ 454639 452484 448783 446901 446951 446790 445410 443348 440241 434437 425717 416646 410178 406861 404982 402667
52883D02667l371l759l034k064k353m237o148o368n006l539k977l185l545l492
$$ 402667 399296 395537 392503 390439 388086 383849 377701 371333 366327 362788 359811 356626 353081 349589
52869C49589k795j811j105o53O4R87J427J277J249J614J862J942K427K986K383
$$ 349589 346794 344983 343878 343225 343289 344276 345703 346980 348229 349843 351705 353647 356074 359060 361443
52854C61443P14l9J137K524K177O95j26p4r9k73m0K59M5m0R33K339K862K618K569
$$ 361443 362157 362118 363255 365779 367956 368651 368525 368451 368352 368079 368039 368298 368343 368303 369236 371575 374437 377055 379624
52835C79624K423J127p65j336j03J268J345M85k10j55P05J873K270J386L81P64
$$ 379624 382047 383174 382409 381073 380970 382238 383583 384068 383858 383703 384408 386281 388551 389937 390318 391082
52819C91082K238L234L296L261L280K586J381R84J690K234J906J439J331R82L06
$$ 391082 393320 396554 399850 403111 406391 408977 410358 411342 413032 415266 417172 418611 419942 420924 421230
52804D21230M77K000L541L784L191K834K664K115J469J440K070L152M915P219
$$ 421230 421707 423707 427248 431032 434223 437057 439721 441836 443305 444745 446815 449967 454882 462101
52790D62101Q821Q789Q113Q637J0473J1782J1136R052O969N619M875M415L854
$$ 462101 470922 479711 487824 496461 506934 518716 529852 538904 545873 551492 556367 560782 564636
52777E64636K643O10j367j984j239r07k548n384p181p223p113q121r201q780p503
$$ 564636 567279 567889 566522 564538 563299 562392 559844 554460 547279 540056 532943 524822 515621 506841 499338
52762D99338p507r334j1116j0843q393n230l016k573l322l816l504l513m848o541
$$ 499338 491831 482497 471381 460538 452145 446915 443899 441326 438004 434188 430684 427171 422323 415782
52748D15782o925o146n705n825n264l782k734k770k845k255j892k532l341l191
$$ 415782 408857 402711 397006 391181 385917 382135 379401 376631 373786 371531 369639 367107 363766 360575
52734C60575k238j300q35j276l032n332o249m982k986j907j678j645k062l081
$$ 360575 358337 357037 356202 354926 351894 346562 340313 335331 332345 330438 328760 327115 325053 321972
52720C21972l544k530j110q45j401j474j334k267l776l747j765k30j159l485m620
$$ 321972 318428 315898 314788 313943 312542 311068 309734 307467 303691 299944 298179 297949 296790 293305 288685
52705B88685l692k053j301j888l371m908n451m331k085l19k65j579k934l655m151
$$ 288685 284993 282940 281639 279751 276380 271472 266021 261690 259605 259286 259021 257442 254508 250853 246702
52690B46702m748m929m316l733m187n169n077l385j360l89n77j225j762j798j183
$$ 246702 241954 237025 232709 228976 224789 219620 214543 211158 209798 209409 208832 207607 205845 204047 202864
52675B02864m21k94p33r11p14r86j899k263j249L40J325J572J278R9j795k854
$$ 202864 202443 202149 201416 200505 199791 198805 196906 194643 193394 193734 195059 196631 197909 198008 196213 193359
52659A93359k003m68j23o33j64J364J849J57k108k803j843n71M11J587L201M697
$$ 193359 191356 190888 190765 190132 189968 191332 193181 193338 191230 188427 186584 186013 186424 188011 191212 195909
52643A95909N614O234P064Q025Q562Q416P847P003N644L909K758K795L021J957
$$ 195909 201523 207757 214821 222846 231408 239824 247671 254674 260318 264227 266985 269780 272801 274758
52629B74758j68j684k153l046n131o792o280m323k909k471j954j144j088k319
$$ 274758 274590 272906 270753 267707 262576 255784 249504 245181 242272 239801 237847 236703 235615 233296
52615B33296m063n378n898n677n294n825p406q317o893m185k973m086n513n466
$$ 233296 229233 223855 217957 212280 206986 201161 193755 185438 178545 174360 171387 167301 161788 156322
52601A56322m487l788l189j980o24k10p76j290j053k78M14N96K73p7Q8O79J069
$$ 156322 151835 148047 144858 142878 142254 142044 141268 139978 138925 138647 139061 139657 139930 139853 139941 140620 141689
52584A41689R27M53k98j524k836l114j846o3P20J45q08j035l49N07O64O9l32K67
$$ 141689 142616 143069 142771 141247 138411 135297 133451 133388 134108 134253 133445 132410 132061 132568 133232 133301 132969 133236
52566A33236J368J730J009J01k79m03o69q42o95n61o80p08n17p41j735k598k242
$$ 133236 134604 136334 137343 137444 137165 136762 136093 135251 134556 133995 133315 132607 132090 131349 129614 127016 124774
52549A24774r38P8L11L69Q01J505K275L027L317K625J425J163K502M092L841J324
$$ 124774 123836 123914 124225 124594 125395 126900 129175 132202 135519 138144 139569 140732 143234 147326 151167 152491
52533A52491j711l181k566q10R89K349L110L111K463J728J433J499J374O94l44
$$ 152491 150780 147599 145033 144223 145212 147561 150671 153782 156245 157973 159406 160905 162279 162973 162629
52518A62629j133r85L55K282L549L368K198J167Q85J120J355J240O39p6j1J292
$$ 162629 161496 160511 160866 163148 166697 170065 172263 173430 174315 175435 176790 178030 178669 178593 178582 179874
52502A79874K905L323K284J044O38P89R39J327K299L188K977J757N70n0m67p74
$$ 179874 182779 186102 188386 189430 190068 190857 191796 193123 195422 198610 201587 203344 203914 203864 203397 202623
52486B02623k02J715M026N006L873J449p18j442l92J864M042M928M450L670L388
$$ 202623 202421 204136 208162 213168 217041 218490 217772 216330 215938 217802 221844 226772 231222 234892 238280
52471B38280L194K427J582J710K622K936K155J386J465J708J454J482K454L102
$$ 238280 241474 243901 245483 247193 249815 252751 254906 256292 257757 259465 260919 262401 264855 267957
52457B67957J889j62n85P57J329j96j926j683jJ174J306J184J117R34J139K332
$$ 267957 269846 269684 269099 269856 271185 270989 269063 267380 267379 268553 269859 271043 272160 273094 274233 276565
52441B76565L763L933K643J175M28o9j072k537l834m328l675k177q81o68j170
$$ 276565 280328 284261 286904 288079 288507 288438 287366 284829 280995 276667 272992 270815 269934 269266 268096
52426B68096j172j36J228J874J354N0r44m48J439K774J618j377l378k759r64l96
$$ 268096 266924 266788 268016 269890 271244 271294 270350 269902 271341 274115 275733 274356 270978 268219 267255 266859
52410B66859j225j447K60K737L694K268j07j293o13P56J399J282J411K252L146
$$ 266859 265634 264187 264447 267184 270878 273146 273039 271746 271133 271889 273288 274570 275981 278233 281379
52395B81379L303K752K032J432Q53K06l70m99J85J504K532K474J841J959K965
$$ 281379 284682 287434 289466 290898 291751 291957 291587 291088 291273 292777 295309 297783 299624 301583 304548
52380C04548L225J520q13j290M42K032J626L12L61J927K970K229P51j0j73o12
$$ 304548 307773 309293 308480 307190 307632 309664 311290 311602 311963 313890 316860 319089 319840 319830 319657 319045
52364C19045j124q65o1J58l34l90M13Q21k22j793k147j056R4J84n87j445j893
$$ 319045 317921 317056 316995 317153 316819 316429 316842 317663 317441 315648 313501 312445 312539 312723 312136 310691 308798
52347C08798j849j524j260j034l27J076K532L402L991M822N352M611K883J491
$$ 308798 306949 305425 304165 303131 302804 303880 306412 309814 313805 318627 323979 328590 331473 332964
52333C32964Q73J54r80j428l99J117J610R02k07j436l034m672n499n258m460l418
$$ 332964 333837 333991 333011 331583 331184 332301 333911 334813 334606 333170 330136 325464 319965 314707 310247 306829
52317C06829j947j28J270J522Q11J13L07J290J992J508L32p6Q19J861J873J401
$$ 306829 304882 304754 306024 307546 308357 308470 308777 310067 312059 313567 313899 313823 314642 316503 318376 319777
52301C19777J797L098M046M124M230M963N522N036L984L354L075K335J165O07
$$ 319777 321574 324672 328718 332842 337072 342035 347557 352593 356577 359931 363006 365341 366506 367113
52287C67113J225K407L357M043M814N671O362O758O710N988M920M659N988Q045
$$ 367113 368338 370745 374102 378145 382959 388630 394992 401750 408460 414448 419368 424027 430015 438060
52273D38060R109Q679P880P583P265O330N484N710O521O648O124O255P479Q652
$$ 438060 447169 455848 463728 471311 478576 484906 490390 496100 502621 509269 515393 521648 529127 537779
52259E37779Q916Q951R660J0701J1246J1305J1366J1332J0902J0528J1053J2595
$$ 537779 546695 555646 565306 576007 587253 598558 609924 621256 632158 642686 653739 666334
52247F66334J4538J6336J7709J8484J9102K0730K3821K6948K8150K7275K5927
$$ 666334 680872 697208 714917 733401 752503 773233 797054 824002 852152 879427 905354
52236I05354K5307K5380K6003K7330K8922K9872L0172L0673L1249L0567K8392
$$ 905354 930661 956041 982044 1009374 1038296 1068168 1098340 1129013 1160262 1190829 1219221
52225A219221K6566K6583K7492K7569K7004K7236K8203K8152K6123K3221K1101
$$ 1219221 1245787 1272370 1299862 1327431 1354435 1381671 1409874 1438026 1464149 1487370 1508471
52214A508471K0303K0269K0025J8611J5807J2785J1196J1282J1621J1056J0023
$$ 1508471 1528774 1549043 1569068 1587679 1603486 1616271 1627467 1638749 1650370 1661426 1671449
52203A671449R448R070P876N847M327M410N542O212N757N087N599P657J0305J2192
$$ 1671449 1680897 1689967 1697843 1703690 1708017 1712427 1717969 1724181 1729938 1735025 1740624 1748281 1758586 1770778
52189A770778J2475J1184R239Q226R411J2526J5855J7823J8352J8564J9528K1430
$$ 1770778 1783253 1794437 1803676 1811902 1821313 1833839 1849694 1867517 1885869 1904433 1923961 1945391
52177A945391K3471K4447K3933K3106K3610K5395K6588K5978K4498K3425K2377
$$ 1945391 1968862 1993309 2017242 2040348 2063958 2089353 2115941 2141919 2166417 2189842 2212219
52166B212219K0444J8309J7409J7508J7003J5427J3645J1638Q362M446K600L957
$$ 2212219 2232663 2250972 2268381 2285889 2302892 2318319 2331964 2343602 2351964 2356410 2359010 2362967
52154B362967N856N062J857q53j599j555k177l617n463p385q729q832q135p925
$$ 2362967 2368823 2373885 2375742 2374889 2373290 2371735 2369558 2365941 2360478 2353093 2344364 2335532 2327397 2319472
52140B319472q630r389r550r505r574r119p506n207l265k177j806j838j780j103
$$ 2319472 2310842 2301453 2291903 2282398 2272824 2263705 2256199 2250992 2247727 2245550 2243744 2241906 2240126 2239023
52126B239023n2K27p98k023k101j441j555k511k614j128J62p85l430n546o411
$$ 2239023 2238971 2239198 2238400 2236377 2234276 2232835 2231280 2228769 2226155 2225027 2225189 2224404 2220974 2215428 2209017
52111B209017p414r355j0909j0577q906p606p187o845o273o281p482r304j0708
$$ 2209017 2201603 2192248 2181339 2170762 2161856 2154250 2147063 2140218 2133945 2127664 2120182 2110878 2100170
52098B100170j1092j0399r030p784p232o946o123n050m943o026o876o476n902
$$ 2100170 2089078 2078679 2069649 2061865 2054633 2047687 2041564 2036514 2031571 2025545 2018669 2012193 2006291
52085B006291o815q928j0150r184o784m556l524l990n744p883r158r106q390p727
$$ 2006291 1999476 1990548 1980398 1971214 1964430 1959874 1956350 1952360 1946616 1938733 1929575 1920469 1912079 1904352
52071A904352p070o220n641n943o850p480p472p205o814n853m244k879k639l170
$$ 1904352 1897282 1891062 1885421 1879478 1872628 1865148 1857676 1850471 1843657 1837804 1833560 1830681 1828042 1824872
52057A824872l348k730j819r89m0Q93R83p1j113o41J511M337P083R577J1538J2671
$$ 1824872 1821524 1818794 1816975 1815986 1815946 1816839 1817822 1817751 1816638 1815997 1817508 1821845 1828928 1838505 1850043 1862714
52041A862714J3566J5390J8346K1419K3948K6433K9270L1640L2573L2455L2596
$$ 1862714 1876280 1891670 1910016 1931435 1955383 1981816 2011086 2042726 2075299 2107754 2140350
52030B140350L3592L4913L5885L6422L6761L7029L7089L6569L5189L3192L1173
$$ 2140350 2173942 2208855 2244740 2281162 2317923 2354952 2392041 2428610 2463799 2496991 2528164
52019B528164K9372K7416K4975K2245J9612J7318J5515J4053J2124Q931N091K396
$$ 2528164 2557536 2584952 2609927 2632172 2651784 2669102 2684617 2698670 2710794 2719725 2724816 2727212
52007B727212J669J702Q60j095l507o097q746j0743j1416j1091j0513r874r089
$$ 2727212 2728881 2730583 2731443 2730348 2726841 2720744 2711998 2701255 2689839 2678748 2668235 2658361 2649272
51994B649272q342p452n601k891j154j784l560m353m219m714n681n139k476N68
$$ 2649272 2640930 2633478 2627877 2624986 2623832 2622048 2618488 2614135 2609916 2605202 2599521 2594382 2591906 2592474
51980B592474K549L794M525L821J632r4J93J472J823J076L05l14j521l401n234
$$ 2592474 2595023 2598817 2603342 2607163 2608795 2608701 2608894 2610366 2612189 2613265 2613570 2613256 2611735 2608334 2603100
51965B603100o657p904r083j0084j0964j1706j2003j1906j2156j3214j4486j5317
$$ 2603100 2596443 2588539 2579456 2569372 2558408 2546702 2534699 2522793 2510637 2497423 2482937 2467620
51953B467620j6116j7743k0258k3038k5593k7529k8302k7948k7582k8195k9408
$$ 2467620 2451504 2433761 2413503 2390465 2364872 2337343 2309041 2281093 2253511 2225316 2195908
51942B195908l0258l0732l1579l2995l4562l6026l7166l7341l6462l6039l7768
$$ 2195908 2165650 2134918 2103339 2070344 2035782 1999756 1962590 1925249 1888787 1852748 1814980
51931A814980m1007m3100m2590m0886m0264m1245m2552m2894m2116m1042m0638
$$ 1814980 1773973 1730873 1688283 1647397 1607133 1565888 1523336 1480442 1438326 1397284 1356646
51920A356646m0992m1015l9569l7013l4918l4095l3637l2353l0479k9196k8752
$$ 1356646 1315654 1274639 1235070 1198057 1163139 1129044 1095407 1063054 1032575 1003379 974627
51909I74627k7854k5106k0706j6450j4050j3624j3987j4179j4202j4199j3701
$$ 974627 946773 921667 900961 884511 870461 856837 842850 828671 814469 800270 786569
51898G86569j2316j0693j0040j0745j2069j3019j3017j1910j0131q774q678r353
$$ 786569 774253 763560 753520 742775 730706 717687 704670 692760 682629 673855 665177 655824
51886F55824r407q182o347m893m299m755o303q300r426q959p625o773o867p261
$$ 655824 646417 638235 631888 626995 622696 617941 611638 603338 593912 584953 577328 570555 563688 556427
51872E56427p263o968o933p188o852n063k357n71q18j961j933m18Q21M04r96j966
$$ 556427 549164 542196 535263 528075 521223 516160 513803 513232 512414 510453 508520 508102 508923 509327 508331 506365
51856E06365k247k398k314j359K23J209J035N68P06Q58l66l046n346n429l631
$$ 506365 504118 501720 499406 498047 498270 499479 500514 501082 501788 502646 502280 499234 493888 488459 484828
51841D84828k212k953n270o936o491m693l575m245n775o366n428m136l698l715
$$ 484828 482616 479663 474393 467457 460966 456273 452698 448453 442678 436312 430884 426748 423050 419335
51827D19335l037j884j826l278m392l415j285n25j917l678l976k985j950j327
$$ 419335 416298 414414 412588 409310 404918 401503 400218 399693 397776 394098 390122 387137 385187 383860
51813C83860o36L53J090R88L10J19J120K515K594J004l23N59K710L172Q75j731
$$ 383860 383224 383577 384667 385655 385965 386084 387204 389719 392313 393317 392994 393553 396263 399435 400310 398579
51797C98579j742P25L045L358K084O80P3M54J583K831L379K917K011J644K269
$$ 398579 396837 397562 400607 403965 406049 406729 406802 407256 408839 411670 415049 417966 419977 421621 423890
51782D23890L385M133M355M774N874O855O380M347K280J747K807M343N312N380
$$ 423890 427275 431408 435763 440537 446411 453266 459646 463993 466273 468020 470827 475170 480482 485862
51768D85862M785M096L827L945L781K793J174l94j404j848k152k798l760m378
$$ 485862 490647 494743 498570 502515 506296 509089 510263 509869 508465 506617 504465 501667 497907 493529
51754D93529m132l400k912k667k178j620j710k331k491j920j526j757j809j255
$$ 493529 489397 485997 483085 480418 478240 476620 474910 472579 470088 468168 466642 464885 463076 461821
51740D61821j067j805k066l78K184L128J959P33J132K607L703L851L354K684K290
$$ 461821 460754 458949 456883 456505 458689 461817 463776 464509 465641 468248 471951 475802 479156 481840 484130
51725D84130K259J859L14j738k649j939j008j042j278l02J619K745K169R42N68
$$ 484130 486389 488248 488562 486824 484175 482236 481228 480186 478908 478606 480225 482970 485139 486081 486649
51710D86649J078J027o03l016m368l836k288q70K90J404K054J895J663K171K686
$$ 486649 487727 488754 488151 485135 480767 476931 474643 473773 474063 475467 477521 479416 481079 483250 485936
51695D85936J840J07l81J218L272M066L902L930M363M892N751P011P715O941N164
$$ 485936 487776 487883 487502 488720 491992 496058 499960 503890 508253 513145 518896 525907 533622 540563 545727
51680E45727L546K588K395L464N813P978Q300O893N290M587N072O867R469J1186
$$ 545727 549273 551861 554256 557720 563533 571511 579811 586704 591994 596581 601653 608520 617989 629175
51666F29175J0909J0053J0897J3220J4638J4409J4482J6276J8660K0291K1752
$$ 629175 640084 650137 661034 674254 688892 703301 717783 734059 752719 773010 794762
51655G94762K3786K5097K3941K0734J7236J3797R278L276l175q898j3071j4828
$$ 794762 818548 843645 867586 888320 905556 919353 928631 931907 928732 919834 906763 891935
51643H91935j3966j2146j1777j3357j5112j5538j5091j4813j4524j3274j0990
$$ 891935 877969 865823 854046 840689 825577 810039 794948 780135 765611 752337 741347
51632G41347q845q075q780r783r637q023o086n128n173n316m994m184k792r86
$$ 741347 732502 724427 715647 705864 696227 688204 682118 676990 671817 666501 661507 657323 654531 653545
51618F53545N9q30k944m244m149m248n465o283n249l845m623p071p736m923j023
$$ 653545 653604 652774 649830 645586 641437 637189 631724 625441 620192 616347 611724 604653 596917 591994 590971
51603E90971Q60R30J550L187L696J813p16j461l69Q67J633K760M373N235M835
$$ 590971 591831 592761 594311 597498 601194 603007 602291 600830 600461 601328 602961 605721 610094 615329 620164
51588F20164M567N661P217P608O914O409O169N068L044J428O83n08l143o370q918
$$ 620164 624731 630392 637609 645217 652131 658540 664709 669777 672821 674249 674932 674424 671281 664911 655993
51573F55993j0658j1712j1399r539p849q265j0307j1617j1040r782r540j0547
$$ 655993 645335 633623 622224 612685 604836 596571 586264 574647 563607 553825 544285 533738
51561E33738j1718j1840j0467q374p035p069p494p163o467o430o642n616l209
$$ 533738 522020 510180 499713 491339 484304 477235 469741 462578 456111 449681 443039 437423 434214
51548D34214j056k54j38M2k61j632l306m217m522m923n045l806j209J383K740
$$ 434214 433158 432904 432766 432808 432547 430915 427609 423392 418870 413947 408902 405096 403887 405270 408010
51533D08010K805K240J671J363J164O68k04r91j305j282r53J76K207L965M215
$$ 408010 410815 413055 414726 416089 417253 417921 417717 416726 415421 414139 413186 413362 415569 419534 423749
51518D23749L456L349M285M887M384M141N734Q428R942R376Q135P849Q627R752
$$ 423749 427205 430554 434839 439726 444110 448251 453985 462413 472355 481731 489866 497715 506342 516094
51504E16094J1026J2514J3645J3629J2627J1539J0585R025O529L986K288R80j081
$$ 516094 527120 539634 553279 566908 579535 591074 601659 610684 617213 621199 623487 624467 623386
51491F23386l958o439p616p920q266q799q876q060o685n370m293l121j723o75
$$ 623386 619428 612989 605373 597453 589187 580388 571512 563452 556767 551397 547104 543983 542260 541585
51477E41585o07j069n87J785N311Q335R818R796R025Q799J0393J3475J5563J4541
$$ 541585 540978 539909 539322 541107 546418 554753 564571 574367 583392 592191 602584 616059 631622 646163
51463F46163J1671J0445J2117J3976J2955R360N786L599K109N64r69k491m297
$$ 646163 657834 668279 680396 694372 707327 716687 722473 726072 728181 728745 727776 725285 720988
51450G20988o118p272p824q384q589p257m545k539k680l637l056o88J588K577
$$ 720988 714870 707598 699774 691390 682801 675544 670999 668460 665780 662143 659087 658399 659987 662564
51436F62564L062M046N085N276M945N214O109O249M648J967m31k016l111l926
$$ 662564 665626 669672 674757 680033 684978 690192 696301 702550 707198 709165 708734 706718 703607 699681
51422F99681m445m993o017p096p113n802m410m272n203n930n703m735l350j679
$$ 699681 695236 690243 684226 677130 670017 664215 659805 655533 650330 644400 638697 633962 630612 628933
51408F28933j86L55o4l31N04J950K680K263J705K125L433M655N207N309N298N207
$$ 628933 628747 629102 629038 628707 629211 631161 633841 636104 637809 639934 643367 648022 653229 658538 663836 669043
51392F69043N214N856P192Q258Q157P475P699R252J0959J1751J1874J1919J1562
$$ 669043 674257 680113 687305 695563 703720 711195 718894 728146 739105 750856 762730 774649 786211
51379G86211J0173Q063O249N194M630M317M134L573K067p5j908l116m343o004
$$ 786211 796384 804447 810696 815890 820520 824837 828971 832544 834611 834536 832628 829512 825169 819165
51365H19165p440p680o555m726l012j917j549j614j628j407j160j063p76L43K598
$$ 819165 811725 804045 797490 792764 789752 787835 786286 784672 783044 781637 780477 779414 778638 778981 781579
51350G81579N359P104O376L230l89k250k005j526k898o365j0229j2548j2850j2430
$$ 781579 786938 794042 800418 803648 803259 801009 799004 797478 794580 788215 777986 765438 752588 740158
51336G40158j2993j4813j6346j5927j3715j1554j0975j1738j2356j1607r469p062
$$ 740158 727165 712352 696006 680079 666364 654810 643835 632097 619741 608134 598665 591603
51324E91603n714n827o484o422n429m385m075m371m556m026k521j94K384M512
$$ 591603 585889 580062 573578 567156 561727 557342 553267 548896 544340 540314 537793 537599 539983 544495
51310E44495N742N918N111L896L281L734M447M316L343K300J134j033m221p115
$$ 544495 550237 556155 561266 565162 568443 572177 576624 580940 584283 586583 587717 586684 582463 575348
51296E75348q736r635j0825j2392j3726j4426j4499j4272j4478j5494j6168j4614
$$ 575348 566612 556977 546152 533760 520034 505608 491109 476837 462359 446865 430697 416083
51284D16083j0846p438o447o873o561n569n754p480q752p946n781m068l676m236
$$ 416083 405237 397799 391352 384479 377918 372349 366595 359115 350363 342417 336636 332568 328892 324656
51270C24656m868m643l191j365o03j304k335k465j592l69O36R97L77j005k292
$$ 324656 319788 315145 311954 310589 309986 308682 306347 303882 302290 301921 302557 303554 303931 302926 300634
51255C00634k820k629k003j025J22J044J744K769M257N356N115L698K267J904
$$ 300634 297814 295185 293182 292157 292279 293323 295067 297836 302093 307449 312564 316262 318529 320433
51241C20433K914M783O447O996O457N696N234M688L811L479M884P894J0983J2895
$$ 320433 323347 328130 334577 341573 348030 353726 358960 363648 367459 370938 375822 383716 394699 407594
51227D07594J3711J4081J3961J2693J0284P940O806O380M908J718j661l439m054
$$ 407594 421305 435386 449347 462040 472324 480264 487070 493450 498358 500076 498415 494976 490922
51214D90922n473q224j0643j1488j1780j3035j4806j5345j4175j2552j1524j0782
$$ 490922 485449 477225 466582 455094 443314 430279 415473 400128 385953 373401 361877 351095
51202C51095r572p817o024m745m296m474m584m239m032m759o035o552n802m704
$$ 351095 341523 333706 327682 322937 318641 314167 309583 305344 301312 296553 290518 283966 278164 273460
51188B73460m210m143l832l212k696k342j764p80K86Q74O47j79r26j038n81K3
$$ 273460 269250 265107 261275 258063 255367 253025 251261 250481 250767 251641 252288 252109 251183 250145 249564 249587
51172B49587O68J483K176K143J385Q04J226K570M131N200N166L703J308p35j419
$$ 249587 250255 251738 253914 256057 257442 258246 259472 262042 266173 271373 276539 280242 281550 280815 279396
51157B79396q30L52J572K244J603m41k635l468k872k119k104k422k254j516q64
$$ 279396 278566 278918 280490 282734 284337 283896 281261 277793 274921 272802 270698 268276 266022 264506 263642
51142B63642j010k071l243l085q60K296M109L425J261m99q52R4J743L088K889
$$ 263642 262632 260561 257318 254233 253373 255669 259778 263203 264464 263965 263113 263207 264950 268038 270927
51127B70927Q12j773l112l051k705k291p50J963L761K916O36m86j00l65k519n085
$$ 270927 271739 269966 266854 263803 261098 258807 258057 260020 263781 266697 267333 266847 266747 266382 263863 258778
51111B58778o044n226l524j339Q66J675K49j907k478j386n51q00q92j8O92L4j365
$$ 258778 252734 247508 243984 242645 243511 245186 245435 243528 241050 239664 239113 238313 237421 237403 238095 238129 236764
51094B36764k018j453k12J039J628J084P9J49J594K776K490J870K491L781M020
$$ 236764 234746 233293 233081 234120 235748 236832 236911 237060 238654 241430 243920 245790 248281 252062 256082
51079B56082L097K319J963J072m42j531k008k867m169m501l248j675r80p75m02
$$ 256082 259179 261498 263461 264533 264091 262560 260552 257685 253516 249015 245767 244092 243112 242337 241935
51064B41935l09q92j350r07j78%Q6Q07J481R49l89j101r83j079j478p63J836N053
$$ 241935 241626 240734 239384 238477 238299 238299 238385 239192 240673 241622 241233 240132 239149 238070 236592 235829 237665 242718
51046B42718O981P068O114N072M437M287M339M161L668L234L227L635M253M852
$$ 242718 249699 256767 262881 267953 272390 276677 281016 285177 288845 292079 295306 298941 303194 308046
51032C08046N110M675L487J820%j589k334j739k00R69O44j009k704l204k308r02
$$ 308046 313156 317831 321318 323138 323138 321549 319215 317476 317276 318245 318889 317880 315176 311972 309664 308762
51016C08762j24l95j189j671j436n65O88J948K678K550J897J431J426J489J184
$$ 308762 308638 308243 307054 305383 303947 303382 304070 306018 308696 311246 313143 314574 316000 317489 318673
51001C18673N60j07p64j543k370k939l039k654j728k37J242J369o50l553m666
$$ 318673 319233 319126 318362 316819 314449 311510 308471 305817 304089 303852 305094 306463 305813 302260 297594
50986B97594k768L04J814J372Q43J330J904J594J027J096J326R12M49J201L057
$$ 297594 294826 295130 296944 298316 299159 300489 302393 303987 305014 306110 307436 308348 308797 309998 313055
50971C13055M641N219N245N077M504L807M081N860Q101R079Q022N650L479K629
$$ 313055 317696 322915 328160 333237 337741 341548 345629 351489 359590 368669 376691 382341 385820 388449
50957C88449L055L953M951O354P822P803N382K036J48J21N43R26K278M607N962
$$ 388449 391504 395457 400408 406762 414584 422387 427769 429805 429953 430074 430617 431543 433821 438428 444390
50942D44390N056L353L170M772O598P514P564P212P050P754R309J0707J1384J2309
$$ 444390 449446 452799 455969 460741 467339 474853 482417 489629 496679 504433 513742 524449 535833 548142
50928E48142J4511J7141J8409J8021J7257J6997J7242J8522K1768K6355L0018
$$ 548142 562653 579794 598203 616224 633481 650478 667720 686242 708010 734365 764383
50917G64383L1688L2988L5807L9557M2299M3799M5917N0113N5842O1539O6175
$$ 764383 796071 829059 864866 904423 946722 990521 1036438 1086551 1142393 1203932 1270107
50906A270107O9647P2516P5785Q0297Q5910R1511R5984R8855J00046R9701R8401
$$ 1270107 1339754 1412270 1488055 1568352 1654262 1745773 1841757 1940612 2040658 2140359 2238760
50895B238760R6904R5230R2544Q8472Q3893P9701P5257O9135O1311N3463M6854
$$ 2238760 2335664 2430894 2523438 2611910 2695803 2775504 2850761 2919896 2981207 3034670 3081524
50884C081524M1078L5475L0820K8430K8194K8536K8269K7455K6461K5086K2789
$$ 3081524 3122602 3158077 3188897 3217327 3245521 3274057 3302326 3329781 3356242 3381328 3404117
50873C404117J8991J3010M643m926j3788k1538l0042m1064n3836o5953p6239q5477
$$ 3404117 3423108 3436118 3440761 3435835 3422047 3400509 3370467 3329403 3275567 3209614 3133375 3047898
50861C047898r4447j02535j08772j13166j16106j17075j14988j09838j03283r7266
$$ 3047898 2953451 2850916 2742144 2628978 2512872 2395797 2280809 2170971 2067688 1970422
50851A970422r2311q7405q1360p4062o6479n9796n4612n0694m7134m2929l7874
$$ 1970422 1878111 1790706 1709346 1635284 1568805 1509009 1454397 1403703 1356569 1313640 1275766
50840A275766l2971k9517k7523k5554k2457j8737j5548j2885r818o435m145l579
$$ 1275766 1242795 1213278 1185755 1160201 1137744 1119007 1103459 1090574 1080756 1074321 1070176 1066597
50828A066597l337j862K97J465J614K521M930P204P693P254Q139J0971J4197J6348
$$ 1066597 1063260 1061398 1061695 1063160 1064774 1067295 1072225 1079429 1087122 1094376 1102515 1113486 1127683 1144031
50814A144031J7625J9003K0783K2581K4127K5582K7384K9976L3421L7166M0539
$$ 1144031 1161656 1180659 1201442 1224023 1248150 1273732 1301116 1331092 1364513 1401679 1442218
50803A442218M3420M6035M8440N1014N5142O2051P0691P8364Q4202R0681J00389
$$ 1442218 1485638 1531673 1580113 1631127 1686269 1748320 1819011 1897375 1981577 2072258 2172647
50792B172647J12494J23957J33469J42370J51903J61610J70792J79903J89623
$$ 2172647 2285141 2409098 2542567 2684937 2836840 2998450 3169242 3349145 3538768
50783C538768J99484K08207K14815K18931K20574K19918K16676K09503J96959
$$ 3538768 3738252 3946459 4161274 4380205 4600779 4820697 5037373 5246876 5443835
50774E443835J79520J59929J41084J24044J08356R3576P9889O7804N7858N0329
$$ 5443835 5623355 5783284 5924368 6048412 6156768 6250344 6330233 6398037 6455895 6506224
50764F506224M5105M2244M2588M6876N3908O0573O4206O4054N9844N0188L3666
$$ 6506224 6551329 6593573 6636161 6683037 6736945 6797518 6861724 6925778 6985622 7035810 7069476
50753G069476J0887j5795m4350p3898j03871j33517j62381j90196k16096k38487
$$ 7069476 7080363 7064568 7020218 6946320 6842449 6708932 6546551 6356355 6140259 5901772
50743E901772k55888k67471k72923k72487k67175k58340k46898k33391k18695
$$ 5901772 5645884 5378413 5105490 4833003 4565828 4307488 4060590 3827199 3608504
50734C608504k03988j89789j75601j60790j45591j31032j18054j06848r6779q6993
$$ 3608504 3404516 3214727 3039126 2878336 2732745 2601713 2483659 2376811 2280032 2193039
50724B193039p7259o8213o0616n4523m9346m4551l9922l5339l0752k6449k3027
$$ 2193039 2115780 2047567 1986951 1932428 1883082 1838531 1798609 1763270 1732518 1706069 1683042
50713A683042k0927k0059j9871j9772j9529j9291j8970j7816j5188j1815r550
$$ 1683042 1662115 1642056 1622185 1602413 1582884 1563593 1544623 1526807 1511619 1499804 1490254
50702A490254r294r653q389m985j164J141J766K178L817O774J0017J2669J4848
$$ 1490254 1480960 1471307 1462918 1457933 1456769 1457910 1459676 1461854 1465671 1472445 1482462 1495131 1509979
50689A509979J7155J9687K2090K4498K7598L1707L6396M1237M6134N0764N4620
$$ 1509979 1527134 1546821 1568911 1593409 1621007 1652714 1689110 1730347 1776481 1827245 1881865
50678A881865N8139O2637O8469P4236P8858Q3374Q9403R6592J03228J08917J14944
$$ 1881865 1940004 2002641 2071110 2145346 2224204 2307578 2396981 2493573 2596801 2705718 2820662
50667B820662J21778J27896J31659J33104J33225J32303J29611J24265J15809
$$ 2820662 2942440 3070336 3201995 3335099 3468324 3600627 3730238 3854503 3970312
50658C970312J04385R0655P5484N9644M3990K9566J6969N987l431j0167j2906
$$ 3970312 4074697 4165352 4240836 4300480 4344470 4374036 4391005 4396992 4393561 4383394 4370488
50647D370488j1946q939m891L28O334J1426J4126J4376J2569Q202L79j1011k5413
$$ 4370488 4358542 4349603 4344712 4345040 4351374 4362800 4376926 4391302 4403871 4412073 4412452 4401441 4376028
50634D376028m2492o1990q2950j03616j22141j37169j48088j55159j59147j60460
$$ 4376028 4333536 4271546 4188596 4084980 3962839 3825670 3677582 3522423 3363276 3202816
50624C202816j58797j53821j45989j36490j26643j17381j08993j00983r2515q3187
$$ 3202816 3044019 2890198 2744209 2607719 2481076 2363695 2254702 2153719 2061204 1978017
50614A978017p3454o4318n6716n0919m6074m0584l3616k6157j9986j5695j2374
$$ 1978017 1904563 1840245 1783529 1732610 1686536 1645952 1612336 1586179 1566193 1550498 1538124
50603A538124r115n902k996m20J762L491N388Q380J2397J6246J9094K1193K2846
$$ 1538124 1529009 1523107 1520111 1519691 1521453 1524944 1530332 1538712 1551109 1567355 1586449 1607642 1630488
50590A630488K3920K4932K7337L1658L6386L9958M3010M7314N2986N8312O2165
$$ 1630488 1654408 1679340 1706677 1738335 1774721 1814679 1857689 1905003 1957989 2016301 2078466
50579B078466O5127O8108P1159P4078P7106Q0335Q3100Q4499Q4051Q1631P7345
$$ 2078466 2143593 2211701 2282860 2356938 2434044 2514379 2597479 2681978 2766029 2847660 2925005
50568B925005P1987O6875O2533N7901N1571M3731L6135L0058K5132K0533J6505
$$ 2925005 2996992 3063867 3126400 3184301 3235872 3279603 3315738 3345796 3370928 3391461 3407966
50557C407966J3840J2358J1072R895R878J1429J3392J4731J5910J7382J7804J5521
$$ 3407966 3421806 3434164 3445236 3455131 3465009 3476438 3489830 3504561 3520471 3537853 3555657 3571178
50545C571178J1368Q007O265M078l72o421j2783j9964k9018l9131m8310n6173
$$ 3571178 3582546 3590553 3596818 3600896 3600524 3594103 3581320 3561356 3532338 3493207 3444897 3388724
50533C388724o4256p3452q2539q9612r4040r6562r8127r9126r9269r7954r4778
$$ 3388724 3324468 3251016 3168477 3078865 2984825 2888263 2790136 2691010 2591741 2493787 2399009
50522B399009q9885q3868p7613p2214o8296o5045o0495n3578m5553l8661l3665
$$ 2399009 2309124 2225256 2147643 2075429 2007133 1942088 1881593 1828015 1782462 1743801 1710136
50511A710136k9477k4979k0111j5120r761l886J816O234Q906J0349J1607J3600
$$ 1710136 1680659 1655680 1635569 1620449 1610688 1606802 1608618 1614852 1623758 1634107 1645714 1659314
50499A659314J6582J9851K2224K3265K3988K5923K9325L2772L4926L6251L8170
$$ 1659314 1675896 1695747 1717971 1741236 1765224 1791147 1820472 1853244 1888170 1924421 1962591
50488A962591M0708M2162M1586M0400M0452M1291M0963L9098L7502L7404L7857
$$ 1962591 2003299 2045461 2087047 2127447 2167899 2209190 2250153 2289251 2326753 2364157 2402014
50477B402014L7654L7446L8870M2372M6999N1811N6576O1449O6737P2843P9826
$$ 2402014 2439668 2477114 2515984 2558356 2605355 2657166 2713742 2775191 2841928 2914771 2994597
50466B994597Q7412R5597J04566J13648J21235J26595J31026J36196J41819J45823
$$ 2994597 3082009 3177606 3282172 3395820 3517055 3643650 3774676 3910872 4052691 4198514
50456D198514J46523J43813J38473J31224J22257J11146R7264Q0640O2083M2281
$$ 4198514 4345037 4488850 4627323 4758547 4880804 4991950 5089214 5169854 5231937 5274218
50446E274218K1528P15j8427l4977m9864o4262p7574q8120r5135r8867r9243r5854
$$ 5274218 5295746 5296461 5278034 5243057 5193193 5128931 5051357 4963237 4868102 4769235 4669992 4574138
50434D574138q9011p9609o8209n5411m2751l1791k2321j2873l085N621J1805J5175
$$ 4574138 4485127 4405518 4337309 4281898 4239147 4207356 4185035 4172162 4169077 4174698 4186503 4201678
50422D201678J5678J2639N288o557k2424m0997o0050p7621r3427j08095j21013
$$ 4201678 4217356 4229995 4235283 4228726 4206302 4165305 4105255 4027634 3934207 3826112 3705099
50411C705099j30179j34565j35431j34591j32341j27893j21324j14090j07457
$$ 3705099 3574920 3440355 3304924 3170333 3037992 2910099 2788775 2674685 2567228
50402B567228j00984r3097q3432p4024o7143o2085n5697m6633l7195k9727k3217
$$ 2567228 2466244 2373147 2289715 2215691 2148548 2086463 2030766 1984133 1946938 1917211 1893994
50391A893994j5699q262l492p47L359R681J5254J8189K0502K4465K9086L2285
$$ 1893994 1878295 1870033 1866541 1865794 1869153 1878834 1894088 1912277 1932779 1957244 1986330 2018615
50379B018615L4295L6513L8789M0231M1324M2950M4415M4564M3953M3692M2968
$$ 2018615 2052910 2089423 2128212 2168443 2209767 2252717 2297132 2341696 2385649 2429341 2472309
50368B472309M0122L5629L1731K9149K6459K2711J8638J4927J1381Q137N876M153
$$ 2472309 2512431 2548060 2579791 2608940 2635399 2658110 2676748 2691675 2703056 2711193 2717069 2721222
50356B721222J430k192m011j811L270Q370J2472J6690K1586K6080K9344L2194
$$ 2721222 2722652 2720460 2716449 2714638 2717908 2726278 2738750 2755440 2777026 2803106 2832450 2864644
50344B864644L5683L9297M1759M3065M4245M5031M3297L7869L0676K4695K0293
$$ 2864644 2900327 2939624 2981383 3024448 3068693 3113724 3157021 3194890 3225566 3250261 3270554
50333C270554J5090P180l204j5249k8770m3132n6563o7712p6714q3831q8328q9850
$$ 3270554 3285644 3292824 3289620 3274371 3245601 3202469 3145906 3078194 3001480 2917649 2829321 2739471
50321B739471q9619q8765q6437q1147p3262o4483n5461m5597l4943k4553j5115
$$ 2739471 2649852 2561087 2474650 2393503 2320241 2255758 2200297 2154700 2119757 2095204 2080089
50310B080089o681L52N488R299J2739J5295J5340J2431P587J189p422j7598k6643
$$ 2080089 2073408 2073760 2079248 2088547 2101286 2116581 2131921 2144352 2151939 2153128 2145706 2128108 2101465
50297B101465l2652l6630m0454m3924m5459m4994m4326m4567m4628m2831l9140
$$ 2101465 2068813 2032183 1991729 1947805 1902346 1857352 1813026 1768459 1723831 1681000 1641860
50286A641860l5150l2202l0087k7729k4667k1398j8423j5696j3212j1216r378
$$ 1641860 1606710 1574508 1544421 1516692 1492025 1470627 1452204 1436508 1423296 1412080 1402702
50275A402702o678l037l6J276K424N571J0074J3138J3822J4110J5546J7217J8166
$$ 1402702 1396024 1392987 1392951 1394227 1396651 1402222 1412296 1425434 1439256 1453366 1468912 1486129 1504295
50262A504295J9469K2192K4997K5859K5169K4967K5885K6756K6955K7185K7879
$$ 1504295 1523764 1545956 1570953 1596812 1621981 1646948 1672833 1699589 1726544 1753729 1781608
50251A781608K8337K7742K5996K3452K0815J9022J8159J6769J3534R334O273M810
$$ 1781608 1809945 1837687 1863683 1887135 1907950 1926972 1945131 1961900 1975434 1984768 1991041 1995851
50239A995851L474J517j30j105k806o132r362r999p971n689n231o642q749j0541
$$ 1995851 1999325 2000842 2000712 1999607 1996801 1990669 1981307 1971308 1963337 1957648 1952417 1945775 1937026 1926485
50225A926485j1614j2046j2179j2311j2623j3499j5408j8163k0753k2372k3103
$$ 1926485 1914871 1902825 1890646 1878335 1865712 1852213 1836805 1818642 1797889 1775517 1752414
50214A752414k3202k2331k0383j8557j8441k0041k1603k1477j9565j6909j4582
$$ 1752414 1729212 1706881 1686498 1667941 1649500 1629459 1607856 1586379 1566814 1549905 1535323
50203A535323j3053j1986j0530q263n824m044k645o34K198N038P346R254J0538
$$ 1535323 1522270 1510284 1499754 1491491 1485667 1481623 1478978 1478344 1480542 1485580 1492926 1502180 1512718
50190A512718J0409Q945P533P182P317P035O668O999P766Q033P392N754K702j524
$$ 1512718 1523127 1532072 1539605 1546787 1554104 1561139 1567807 1574806 1582572 1590605 1597997 1603751 1606453 1604929
50176A604929n089o303o027o541q103q592o927m798m182m935o063p688j0121j2113
$$ 1604929 1599840 1593537 1587510 1580969 1572866 1564274 1557347 1552549 1548367 1543432 1537369 1529681 1519560 1507447
50162A507447j1965r821p336n420l822k584k171k058p66K188N480P582Q271Q210
$$ 1507447 1495482 1485661 1478325 1472905 1469083 1466499 1464328 1462270 1461504 1463692 1469172 1476754 1485025 1493235
50148A493235Q008Q120Q834R696R587P973N618L622K128M30j951m714p034q225
$$ 1493235 1501243 1509363 1518197 1527893 1537480 1545453 1551071 1554693 1556821 1557251 1555300 1550586 1543552 1535327
50134A535327q372q446r436j1320j3287j4856j6058j6575j5785j4031j2864j3297
$$ 1535327 1526955 1518509 1509073 1497753 1484466 1469610 1453552 1436977 1421192 1407161 1394297 1381000
50122A381000j4603j5576j6113j6640j6760j5754j4078j2970j2604j1935j0477
$$ 1381000 1366397 1350821 1334708 1318068 1301308 1285554 1271476 1258506 1245902 1233967 1223490
50111A223490q883p547n930m011l100m209o414p942q292q299q636r410j0837j3044
$$ 1223490 1214607 1207060 1201130 1197119 1194019 1189810 1183396 1175454 1167162 1158863 1150227 1140817 1129980 1116936
50097A116936j5204j6151j6093j6535j8220k0083k0749k0013j8383j6195j3939
$$ 1116936 1101732 1085581 1069488 1052953 1034733 1014650 993901 973888 955505 939310 925371
50086I25371j2454j1897j1260r926q890r259j0181r829q144o960p293q015p743
$$ 925371 912917 901020 889760 879834 870944 861685 851504 841675 833531 826571 819278 811263 803520
50073H03520o617n511m561l328j692J27J906L298L930M033M226M445M050L460
$$ 803520 796903 791392 786831 783503 781811 781938 783844 787142 791072 795105 799331 803776 807826 811286
50059H11286M343P286J0399J1538J1141J1429J3232J5160J5791J5315J4817J4971
$$ 811286 815629 822915 833314 844852 855993 867422 880654 895814 911605 926920 941737 956708
50047I56708J5730J6602J7009J6934J7088J7928J8757J8560J7471J6489J6068
$$ 956708 972438 989040 1006049 1022983 1040071 1057999 1076756 1095316 1112787 1129276 1145344
50036A145344J5852J5622J5377J4683J3169J1558J0953J1094J0732R853R810J0871
$$ 1145344 1161196 1176818 1192195 1206878 1220047 1231605 1242558 1253652 1264384 1274237 1284047 1294918
50024A294918J1399J0462R657J0942J3776J5852J5996J4960J3898J3509J4436
$$ 1294918 1306317 1316779 1326436 1337378 1351154 1367006 1383002 1397962 1411860 1425369 1439805
50013A439805J7033K0418K2755K3020K2042K1572K2574K4377K5335K4518K2864
$$ 1439805 1456838 1477256 1500011 1523031 1545073 1566645 1589219 1613596 1638931 1663449 1686313
50002A686313K2196K2946K3677K3317K2826K3719K5676K6981K6901K6228K5537
$$ 1686313 1708509 1731455 1755132 1778449 1801275 1824994 1850670 1877651 1904552 1930780 1956317
49991A956317K4328K2318K0378J9521J9640J9793J9189J7489J4643J0924O778
$$ 1956317 1980645 2002963 2023341 2042862 2062502 2082295 2101484 2118973 2133616 2144540 2151318
49980B151318K460j917n890q917j1215j3665j6473j8694j9624j9957k0780k1988
$$ 2151318 2153778 2151861 2145971 2137054 2125839 2112174 2095701 2077007 2057383 2037426 2016646 1994658
49968A994658k2669k2758k3223k4368k5042k4119k2075k0318j9312j8215j6352
$$ 1994658 1971989 1949231 1926008 1901640 1876598 1852479 1830404 1810086 1790774 1772559 1756207
49957A756207j4213j2667j1658j0297q018n174k577q47j60j54o3N83J205O88j081
$$ 1756207 1741994 1729327 1717669 1707372 1699354 1694180 1691603 1690756 1690596 1690442 1690379 1690962 1692167 1692855 1691774
49942A691774k791l353l466m690p262r800j1383j2892j5751j9944k3989k6513
$$ 1691774 1688983 1685630 1682164 1677474 1670212 1660412 1649029 1636137 1620386 1600442 1576453 1549940
49930A549940k7163k6279k4572k3212k3307k4779k6181k6239k5265k4557k4556
$$ 1549940 1522777 1496498 1471926 1448714 1425407 1400628 1374447 1348208 1322943 1298386 1273830
$$ [...]
##END NTUPLES=NMR SPECTRUM
##END=
